##TITLE=Analysis number 312103
Compound Code cc 42116
Book Reference 437/20
Project Code adrs
Chemist Name wendyb
##JCAMPDX= 6.0         $$ Bruker NMR JCAMP-DX V2.0
##DATA TYPE= NMR SPECTRUM
##DATA CLASS= NTUPLES
##ORIGIN= Bruker BioSpin GmbH
##OWNER= NMR
$$ XWIN-NMR		Version 3.5
$$ Tue Jul 26 09:53:05 2005 GMT Daylight Time (UT+1h)  MAYBRIDGE\NMR@NMR_250MHZ
##.OBSERVE FREQUENCY= 250.131544655141
##.OBSERVE NUCLEUS= ^1H
##.ACQUISITION MODE= SIMULTANEOUS (DQD)
##.ACQUISITION SCHEME= undefined
##.AVERAGES= 16
##.DIGITISER RES= 18
##SPECTROMETER/DATA SYSTEM= dpx250
##.PULSE SEQUENCE= zg30
##.SOLVENT NAME= CDCl3
##.SHIFT REFERENCE= (INTERNAL, CDCl3, 0, 16.522)
##AUDIT TRAIL= $$ (NUMBER, WHEN, WHO, WHERE, WHAT)
$$ ##TITLE= Audit trail, XWIN-NMR		Version 3.5
$$ ##JCAMPDX= 5.01
$$ ##ORIGIN= Bruker BioSpin GmbH
$$ ##OWNER= NMR
$$ C:\u/data/dgb/nmr/ADRS/6550/pdata/1/auditp.txt
$$ ##AUDIT TRAIL=  $$ (NUMBER, WHEN, WHO, WHERE, WHAT)
(   1,<2005-07-26 09:52:37.94 +100>,<MAYBRIDGE\NMR>,<NMR_250MHZ>,
      <created by zg, POWCHK disabled, PULCHK disabled
       configuration hash MD5:
       62 19 C7 07 E1 42 D1 B7 37 6C 3D D0 77 39 F9 E6
       data hash MD5: 64K
       23 CF 7C 8C 15 97 B2 8A 4D C4 C3 33 B9 B1 64 79>)
(   2,<2005-07-26 09:52:53.36 +100>,<MAYBRIDGE\NMR>,<NMR_250MHZ>,
      <Start of raw data processing
       ef LB = 0.3 FT_mod = 6 PKNL = 1 SI = 32K 
       data hash MD5: 32K
       72 4A 36 49 16 36 0A 31 7E 29 31 33 BA 19 41 C9>)
(   3,<2005-07-26 09:52:55.25 +100>,<MAYBRIDGE\NMR>,<NMR_250MHZ>,
      <apk 
       data hash MD5: 32K
       A5 D1 42 8E BA 1C 68 92 AB 3E 58 65 0B 8F EF 39>)
(   4,<2005-07-26 09:52:55.96 +100>,<MAYBRIDGE\NMR>,<NMR_250MHZ>,
      <abs ABSG = 5 
       data hash MD5: 32K
       02 4F 39 59 DA 88 28 36 F6 B4 96 C2 35 B5 23 FA>)
$$ ##END=
$$ 
$$ hash MD5
$$ 22 39 D5 01 0F DF F6 BE 94 8A 00 9A C0 C5 4A 9D
##$RELAX= 
##$RELAX= 
##$RELAX= 
##$RELAX= 
##$RELAX= 
##$RELAX= 
##$RELAX= 
$$ Bruker specific parameters
$$ --------------------------
##$DU= <C:\u>
##$EXPNO= 6550
##$NAME= <ADRS>
##$PROCNO= 1
##$TYPE= <nmr>
##$USER= <dgb>
##$AMP= (0..31)
100 100 100 100 100 100 100 100 100 100 100 100 100 100 100 100 100 100 
100 100 100 100 100 100 100 100 100 100 100 100 100 100 
##$AQSEQ= 0
##$AQ_mod= 3
##$AUNM= <au_zg>
##$AUTOPOS= <10 >
##$BF1= 250.13
##$BF2= 250.13
##$BF3= 250.13
##$BF4= 250.13
##$BF5= 500.13
##$BF6= 500.13
##$BF7= 500.13
##$BF8= 500.13
##$BYTORDA= 1
##$CFDGTYP= 0
##$CFRGTYP= 5
##$CHEMSTR= <none>
##$CNST= (0..31)
1 1 145 1 1 1 1 1 1 1 1 1 1 1 1 1 1 1 1 1 1 1 1 1 1 1 1 1 1 1 1 1 
##$CPDPRG= <>
##$CPDPRG1= <>
##$CPDPRG2= <>
##$CPDPRG3= <>
##$CPDPRG4= <mlev>
##$CPDPRG5= <mlev>
##$CPDPRG6= <mlev>
##$CPDPRG7= <mlev>
##$CPDPRG8= <mlev>
##$CPDPRGB= <>
##$CPDPRGT= <>
##$D= (0..31)
0 1 0 0 0 0 0 0 0 0.06 0 0 0 0 0 0 0.0002 0 0 0 0 0 0 0 0 0 0 0 0 0 0 
0 
##$DATE= 1122367957
##$DBL= (0..7)
120 120 120 120 120 120 120 120 
##$DBP= (0..7)
150 150 150 150 150 150 150 150 
##$DBP07= 0
##$DBPNAM0= <>
##$DBPNAM1= <>
$$ [...]
##$SUBNAM7= <"">
##$SUBNAM8= <"">
##$SUBNAM9= <"">
##$SW= 20.6930455092707
##$SWIBOX= (0..15)
0 0 3 0 0 0 0 0 0 0 0 0 0 0 0 0 
##$SW_h= 5175.983436853
##$TD= 65536
##$TD0= 1
##$TE= 296.16
##$TE2= 300
##$TE3= 300
##$TEG= 300
##$TL= (0..7)
0 120 120 120 120 120 120 120 
##$TP= (0..7)
150 150 150 150 150 150 150 150 
##$TP07= 0
##$TPNAME0= <>
##$TPNAME1= <>
##$TPNAME2= <>
##$TPNAME3= <>
##$TPNAME4= <>
##$TPNAME5= <>
##$TPNAME6= <>
##$TPNAME7= <>
##$TPOAL= (0..7)
0.5 0.5 0.5 0.5 0.5 0.5 0.5 0.5 
##$TPOFFS= (0..7)
0 0 0 0 0 0 0 0 
##$TUNHIN= 0
##$TUNHOUT= 0
##$TUNXOUT= 0
##$USERA1= <user>
##$USERA2= <user>
##$USERA3= <user>
##$USERA4= <user>
##$USERA5= <user>
##$V9= 5
##$VALIST= <valist>
##$VCLIST= <CCCCCCCCCCCCCCC>
##$VD= 0
##$VDLIST= <DDDDDDDDDDDDDDD>
##$VPLIST= <PPPPPPPPPPPPPPP>
##$VTLIST= <TTTTTTTTTTTTTTT>
##$WBST= 1024
##$WBSW= 4
##$XGAIN= (0..3)
0 0 0 0 
##$XL= 0
##$YL= 0
##$YMAX_a= 333062
##$YMIN_a= -497657
##$ZGOPTNS= <>
##$ZL1= 120
##$ZL2= 120
##$ZL3= 120
##$ZL4= 120
##$ABSF1= 16.522
##$ABSF2= -4.171173
##$ABSG= 5
##$ABSL= 3
##$ALPHA= 0
##$AQORDER= 0
##$ASSFAC= 0
##$ASSFACI= 0
##$ASSFACX= 0
##$ASSWID= 0
##$AUNMP= <proc_1d>
##$AZFE= 0.1
##$AZFW= 0.1
##$BCFW= 0
##$BC_mod= 0
##$BYTORDP= 0
##$COROFFS= 0
##$CY= 12.5
##$DATMOD= 1
##$DC= 0
##$DFILT= <>
##$DTYPP= 0
##$F1P= 14.0000005364418
##$F2P= -0.99999901652339
##$FCOR= 0.5
##$FTSIZE= 32768
##$FT_mod= 6
##$GAMMA= 0
##$GB= 0
##$INTBC= 1
##$INTSCL= 1
##$ISEN= 128
##$LB= 0.3
##$LEV0= 0
##$LPBIN= 0
##$MAXI= 10000
##$MC2= 0
##$MEAN= 0
##$ME_mod= 0
##$MI= 0
##$NCOEF= 0
##$NC_proc= -5
##$NLEV= 6
##$NOISF1= 0
##$NOISF2= 0
##$NSP= 0
##$NTH_PI= 0
##$NZP= 0
##$OFFSET= 16.522
##$PC= 1
##$PHC0= -80.8139
##$PHC1= 7.440985
##$PH_mod= 1
##$PKNL= yes
##$PPARMOD= 0
##$PSCAL= 4
##$PSIGN= 0
##$REVERSE= no
##$SF= 250.13
##$SI= 32768
##$SIGF1= 0
##$SIGF2= 0
##$SINO= 400
##$SIOLD= 32768
##$SREGLST= <1H.CDCl3>
##$SSB= 0
##$STSI= 32768
##$STSR= 0
##$SW_p= 5175.98343685301
##$SYMM= 0
##$S_DEV= 0
##$TDeff= 65536
##$TDoff= 0
##$TI= <Analysis number 999999
Compound Code 99
Book Reference 9
Project Code 9>
##$TILT= no
##$TM1= 0
##$TM2= 0
##$TOPLEV= 0
##$USERP1= <user>
##$USERP2= <user>
##$USERP3= <user>
##$USERP4= <user>
##$USERP5= <user>
##$WDW= 1
##$XDIM= 32768
##$YMAX_p= 355057188
##$YMIN_p= -437267
$$ End of Bruker specific parameters
$$ ---------------------------------
##NTUPLES= NMR SPECTRUM
##VAR_NAME=  FREQUENCY,     SPECTRUM/REAL,   SPECTRUM/IMAG
##SYMBOL=    X,             R,               I
##VAR_TYPE=  INDEPENDENT,   DEPENDENT,       DEPENDENT
##VAR_FORM=  AFFN,          ASDF,            ASDF
##VAR_DIM=   32768,         32768,           32768
##UNITS=     HZ,            ARBITRARY UNITS, ARBITRARY UNITS
##FACTOR=    0.157963299565203, 1,           1
##FIRST=     4132.6476996994, 0,             0
##LAST=      -1043.33573715361, 0,           0
##MIN=       -1043.33573715361, -437267,     0
##MAX=       4132.6476996994, 355057188,     0
$$ Real data points
##PAGE= N=1
##DATA TABLE= (X++(R..R)), XYDATA
$$ [...]
16314A10397R3920j41708j12393p4166M7945O862r438J23070J0189n2022j21860
$$ 110397 204317 62609 -49784 -123950 -76005 -69143 -78581 44489 54678 2656 -119204
16303a19204j47439L3951J9915K8847O7787R0860O1011P1372p9675j63802n0812
$$ -119204 -266643 -232692 -212777 -183930 -116143 -25283 35728 107100 27425 -136377 -187189
16292a87189M12O7004L022j6749k0585Q5126R4937r6760k8283L346j58768j4530
$$ -187189 -186777 -119773 -116751 -133500 -154085 -68959 25978 -70782 -99065 -95719 -254487 -269017
16280b69017J22824L0365m0972O404J4746j9057J18630J39841k5185n8693r5687
$$ -269017 -146193 -115828 -156800 -150396 -135650 -154707 -36077 103764 78579 19886 -75801
16269g5801j034R7852j398j39N6418j10416j6752p905K0403j0859m2281k3357
$$ -75801 -76835 21017 19619 19480 75898 -34518 -51270 -59175 -38772 -49631 -91912 -115269
16257a15269o3029N4253M7248J01939j11424j8706M2433M3101O8532J24367P218
$$ -115269 -178298 -124045 -76797 25142 -86282 -104988 -62555 -19454 49078 173445 180663
16246A80663k5279j81662l0011N8748j7819j02999K8013J31057j29344j16266
$$ 180663 155384 -26278 -56289 2459 -15360 -118359 -90346 40711 -88633 -204899
16236b04899l83J8072J14816J05538r1299L7247M1214j46892o8828j15890K0024
$$ -204899 -205282 -187210 -72394 33144 -58155 -20908 20306 -126586 -195414 -311304 -291280
16225b91280R7669J10328m7889r83M0005M4098j23340J17089P7890L7112q7921
$$ -291280 -193611 -83283 -131172 -132155 -92150 -48052 -171392 -54303 23587 60699 -27222
16214b7222n0666r5546J18048L1372M696K413J4920l0269k8930r8484J15899Q8700
$$ -27222 -77888 -173434 -55386 -24014 -19318 -16905 -1985 -32254 -61184 -159668 -43769 44931
16202D4931O0553j12060q6642r8305M6043M468J14872k2026Q990R8780N0346p5329
$$ 44931 105484 -6576 -93218 -191523 -145480 -141012 -26140 -48166 -39176 59604 109950 34621
16190C4621o4533l7874p9964K0297M0982L685r47m2475q1272k683M9468J13620
$$ 34621 -29912 -67786 -147750 -127453 -86471 -82786 -83733 -126208 -207480 -210163 -160695 -47075
16178d7075P8935o5362j05596o3495J9717Q1447J8458p2321n5827J06115J35694
$$ -47075 31860 -33502 -139098 -202593 -182876 -101429 -82971 -155292 -211119 -105004 30690
16167C0690J06973K4348p1253q2403o9367o1147R5619p05L6746j2315K9683J74726
$$ 30690 137663 162011 90758 8355 -61012 -122159 -26540 -27245 9501 -2814 26869 201595
16155B01595J0030j39233n2312m906r3510O4894N4406L442K7969j00929j06258
$$ 201595 211625 72392 20080 15174 -78336 -13442 40964 44406 72375 -28554 -134812
16144a34812K3168N9684P0087m5329j23011q5956j1213K7407N3870J08804l5488
$$ -134812 -111644 -51960 18127 -27202 -150213 -236169 -247382 -219975 -166105 -57301 -92789
16133i2789k4404J3863L4329o5724J5415R7609M9581k9035j9348o4502m6310j1506
$$ -92789 -117193 -103330 -69001 -134725 -119310 -21701 27880 -1155 -20503 -85005 -131315 -142821
16121a42821Q6749O3112K2570J3079n0343K7116K354l3555K3858J8627R358M1861
$$ -142821 -56072 7040 29610 42689 -7654 19462 21816 -11739 12119 30746 40104 81965
16109H1965J6769k2306k4404m3562j11694o825O2933Q3175r6712p6518P0802J74851
$$ 81965 98734 76428 52024 8462 -103232 -110057 -47124 36051 -60661 -137179 -66377 108474
16097A08474R9215K8086p3440p0421N6389M5626J04926k14545k06916K4251q2377
$$ 108474 207689 235775 162335 91914 148303 193929 298855 84310 -122606 -98355 -180732
16086a80732M8729O9832Q4871n5199J4031k5450n8903p0614k572l7306J0208r272
$$ -180732 -132003 -62171 22700 -32499 -18468 -43918 -102821 -173435 -176007 -213313 -203105 -212377
16074b12377p9534J8529J02766N1748j7827n454L367p0370l7577j2976R5332L6988
$$ -212377 -291911 -273382 -170616 -118868 -136695 -142149 -138782 -209152 -246729 -259705 -164373 -127385
16062a27385Q421K5010L3256j23516o113R539M973N7625N3043j0090R7762R7685
$$ -127385 -118964 -93954 -60698 -184214 -190327 -180788 -175815 -118190 -65147 -75237 22525 120210
16050A20210m4380l4928R4277J4858Q672q2043J2241L6688p5444q4950j3678K0397
$$ 120210 75830 40902 135179 150037 158709 76666 88907 125595 50151 -34799 -48477 -28080
16038b8080J1257K7252p5799n2432q0414J9262O9801J03018m1950l3432p214J2442
$$ -28080 -16823 10429 -65370 -117802 -198216 -178954 -109153 -6135 -48085 -81517 -88731 -76289
16026g6289m0731j7790j5645L6785M1913j4032M9085l0092k1760K7053P4966k9788
$$ -76289 -117020 -134810 -150455 -113670 -71757 -85789 -36704 -66796 -88556 -61503 13463 -16325
16014a6325N3672L8714q9944p0257m7899J670J7689Q9672K2681R7621J18820R0181
$$ -16325 37347 76061 -13883 -84140 -132039 -130369 -112680 -23008 -327 97294 216114 306295
16002C06295j23551k09915j5325O847p7178r0746o4627j1147J15147J10075k6112
$$ 306295 182744 -27171 -42496 -35649 -112827 -203573 -268200 -279347 -164200 -54125 -80237
15991h0237J2907M0993j2822J0483M3709P5665N3817L3740n7049j12307n3258
$$ -80237 -67330 -26337 -39159 -28676 15033 90698 144515 178255 121206 8899 -44359
15980d4359P195j05337N3630N3258J4670M668r8915j02260L9333J93622L2512
$$ -44359 -37164 -142501 -88871 -35613 -20943 -16275 -115190 -217450 -178117 15505 48017
15969D8017j22788M2208n9088P2006K427k658l114l0741n7713j53083J28737N3869
$$ 48017 -74771 -32563 -91651 -19645 -17218 -19876 -22990 -53731 -111444 -264527 -135790 -81921
15957h1921o7584P924q910K6891J41585O403n5626p6039l8797j5603M3651J5467
$$ -81921 -149505 -141581 -150491 -123600 17985 24388 -31238 -107277 -146074 -161677 -118026 -102559
15945a02559M3408J8163L075p2601L2002J6940j53048R9272Q4403P9053J6250
$$ -102559 -59151 -40988 -37913 -110514 -78512 -61572 -214620 -115348 -30945 48108 64358
15934F4358k0116l6903j12425p4346M1873O0152r1305k6522J44068O6040r3217
$$ 64358 44242 7339 -105086 -179432 -137559 -77407 -168712 -195234 -51166 14874 -78343
15923g8343K5846k8502k1864k0888r5094J18274J47207j1725M0332l097o618N5264
$$ -78343 -52497 -80999 -102863 -123751 -218845 -100571 46636 34911 75243 72146 65528 120792
15911A20792k763j430o9485o3034O5375P2512l3130o6531j15616m8626m3540o040
$$ 120792 118029 116599 47114 -15920 49455 121967 88837 22306 -93310 -141936 -185476 -191516
15899a91516J64142N3863j03454j30776n0691J8755L1404P5751j7554P5429M6650
$$ -191516 -27374 26489 -76965 -207741 -258432 -239677 -208273 -132522 -150076 -74647 -27997
15888b7997q265P8538K7314p2843q4532j32502j1302L3896P8388R3653J48038
$$ -27997 -36262 42276 69590 -3253 -87785 -220287 -231589 -197693 -119305 -25652 122386
15877A22386R3643p9319j33683O2867P0029l6489J220k8363m7194O2657m147r7484
$$ 122386 216029 136710 3027 65894 135923 99434 100654 72291 25097 87754 83607 -13877
15865a3877j1166l1528J0628p5775k0782R7292K23615o327q1961j02446l1281
$$ -13877 -25043 -56571 -45943 -121718 -142500 -45208 178407 172080 90119 -12327 -43608
15854d3608k6093Q426L3799p7377n2860m650Q9608O4740K8118J9042l0115o2836
$$ -43608 -69701 -61275 -27476 -104853 -157713 -162363 -72755 -8015 20103 39145 9030 -53806
15842e3806p379Q4726O319k6364R5356l6295l7765l7246P296O4973O3980Q746
$$ -53806 -61185 23541 29860 3496 98852 62557 24792 -12454 -5158 59815 123795 132541
15830A32541j45366k11833k0796P1752O8115R7107k1807o7330M9158O101J29479
$$ 132541 -12825 -224658 -245454 -173702 -105587 -8480 -30287 -97617 -48459 -42358 87121
15819H7121J9152j01927n4939K8452l6915k5754o4542o9397p7024J57234J85676
$$ 87121 106273 4346 -50593 -22141 -59056 -84810 -149352 -218749 -295773 -138539 47137
15808D7137M2130n112k9420k8216J4171k1771j6139m4681l0681O5896r018R8721
$$ 47137 89267 84155 54735 26519 40690 18919 2780 -41901 -72582 -6686 -15704 83017
15796H3017O700r5517K8140k2725j22989J329j4183k6868l7930l6430J3979p984
$$ 83017 89717 -5800 22340 -385 -123374 -122045 -136228 -163096 -201026 -237456 -223477 -231461
15784b31461P5978N8327N4662j8287N0590m8130L0034M7043J14334M6454p0704
$$ -231461 -155483 -97156 -42494 -60781 -10191 -58321 -28287 18756 133090 179544 108840
15773A08840q2705M8968O1902j00965O317N1105p4641j26971j3605O8518j1831
$$ 108840 26135 75103 137005 36040 42357 93462 18821 -108150 -121755 -53237 -65068
15762f5068o8310M5663o112P9314N3686Q0839M6400j764l0993l9307r9777l1518
$$ -65068 -133378 -87715 -93827 -14513 39173 120012 166412 164648 133655 94348 -5429 -36947
15750c6947L949J8263k5917N2572k5348O2359L8153j11126j19348r1100n7684
$$ -36947 -32998 -14735 -40652 11920 -13428 48931 87084 -24042 -143390 -234490 -292174
15739b92174M2441J48355Q7040k1224o2124j03870R4898l4821M7233K9478n4687
$$ -292174 -249733 -101378 -14338 -35562 -97686 -201556 -106658 -141479 -94246 -64768 -119455
15728a19455k345J25940K471K2145O1697l1925m2140P1078L2586p2135j48465
$$ -119455 -121800 4140 6611 28756 90453 58528 16388 87466 120052 47917 -100548
15717a00548l4974M7477k4244j1996P2360J1062M2989j5001l9041R6301J17315
$$ -100548 -135522 -88045 -112289 -124285 -51925 -40863 2126 -12875 -51916 44385 161700
15706A61700k427r9973j9335K6179l4528o6543J8006j087m8546Q0277L304m2996
$$ 161700 159273 59300 39965 66144 31616 -34927 -16921 -18008 -66554 13723 17027 -25969
15694b5969l630o2610J283M1198R0992P5106K1304j08185j1494K5417j05554o5029
$$ -25969 -29599 -92209 -90926 -49728 41264 116370 137674 29489 17995 43412 -62142 -127171
15682a27171J23565o1991k9194j1948M2093L3074M9632p0887m9040k3582L2875
$$ -127171 -3606 -65597 -94791 -106739 -64646 -31572 18060 -52827 -101867 -125449 -92574
15671i2574M9215N8721J2590o7290k6764J7853M5160Q2847L399j7488J6552P498
$$ -92574 -43359 15362 27952 -39338 -66102 -48249 -3089 79758 83157 65669 82221 89719
15659H9719o4765k5032P9973N0335P4743J4017j74004j34489J5297J13745P1838
$$ 89719 24954 -78 79895 130230 204973 218990 44986 -89503 -74206 39539 111377
15648A11377k4822p6458l3865L6592K7549k6736p1125j52593K2353O7096M0548
$$ 111377 86555 10097 -23768 12824 40373 13637 -57488 -210081 -187728 -120632 -80084
15637h0084P5185J19654P9052R0447j78299M8254l0456O669k1267j44259K5780
$$ -80084 -4899 114755 193807 284254 105955 154209 123753 130422 109155 -35104 -9324
15626i324l4492O4929N8340M7205k02376p4473O483K2607j8573j5143k4265l9044
$$ -9324 -43816 21113 79453 126658 -75718 -150191 -143708 -121101 -139674 -154817 -179082 -218126
15614b18126j13291K1367J27367J04927J2433M8171R2826l471j25913p3542N2824
$$ -218126 -331417 -310050 -182683 -77756 -65323 -17152 75674 72203 -53710 -127252 -74428
15603g4428K5307J8973N4648O4720N7131o1421m4747q116o5778k3590N2732R4241
$$ -74428 -49121 -30148 24500 89220 146351 84930 40183 32067 -33711 -57301 -4569 89672
15591H9672k3989J6931L9229j01906n2837J13665m3093l0539K4019n1062j79628
$$ 89672 65683 82614 121843 19937 -32900 80765 37672 7133 31152 -19910 -199538
15580a99538L261J00476m4542K4331M8639n5692P3127K8953R650L228R232K1838
$$ -199538 -196277 -95801 -140343 -116012 -67373 -123065 -49938 -20985 -11335 -8107 1125 22963
15568B2963J12375N333o5551l7507l2144K04l5262l0046n4971L2547k2413K4190
$$ 22963 135338 140671 75120 37613 5469 5673 -29589 -59635 -114606 -82059 -104472 -80282
15556h0282M3466Q7425N5956J0003k154j03285j07655q4376J10356N6534m4905
$$ -80282 -36816 50609 106565 116568 114414 11129 -96526 -180902 -70546 -14012 -58917
15545e8917Q5996j29494K1520j1896l9314N6366Q1453j9765N735K7031K0237N0393
$$ -58917 27079 -102415 -80895 -92791 -132105 -75739 5714 -14051 -8316 18715 38952 89345
15533H9345l3657J15090K4973J4516j34191n6093K5278k1339n2993J40238O6077
$$ 89345 55688 170778 195751 210267 76076 19983 45261 23922 -29071 111167 177244
15522A77244m3804j02578m5463q0890j06556J05731P2726k5435r9641j7187L8462
$$ 177244 133440 30862 -14601 -95491 -202047 -96316 -23590 -49025 -148666 -165853 -127391
15511a27391j1117n7703j1808K33819N3263j12864j34747o499n9871m7259K7247
$$ -127391 -138508 -196211 -208019 25800 79063 -33801 -168548 -175047 -234918 -282177 -254930
15500b54930J30999K9456J06708p5257j09834R6786O8160o1750r2424O5067N6929
$$ -254930 -123931 -94475 12233 -63024 -172858 -76072 -7912 -69662 -162086 -97019 -40090
15489d0090j2206p6807Q668L2522K6587n0813l1427M8885N9529j770N4065j4523
$$ -40090 -52296 -129103 -120435 -87913 -61326 -112139 -143566 -94681 -35152 -36922 17143 2620
15477B620K0933K8408K0488K7733j00454p1619J19627Q6689J21073M5125j3781
$$ 2620 23553 51961 72449 100182 -272 -71891 47736 134425 255498 300623 286842
15466B86842j38209k02438n0481J45345R233K5604r4537k8971J43305J32982l0849
$$ 286842 148633 -53805 -104286 41059 50292 75896 -18641 -47612 95693 228675 197826
15455A97826j17011j44240l8695q4939Q1930K9353J08686M4948n4770p5368r9019
$$ 197826 80815 -63425 -102120 -187059 -105129 -75776 32910 77858 23088 -52280 -151299
15444a51299K0113M7026J4146J15532q0290j52065k9456O0004N0433Q001m118
$$ -151299 -131186 -84160 -70014 45518 -34772 -186837 -216293 -156289 -105856 -97855 -101973
15433a01973J21900q063k5875J25509r9526j38182O7738J06129j2956l6112J5902
$$ -101973 19927 11864 -14011 111498 11972 -126210 -58472 47657 34701 -1411 14491
15422A4491N1019j31142k7816M723k2356k8015j46938k7986O8352L9604J15079
$$ 14491 65510 -65632 -93448 -88725 -111081 -139096 -286034 -314020 -245668 -206064 -90985
15411i0985M2777n3772k8581k0926m4158r3246n6007R4925r862L7695K4609O3200
$$ -90985 -48208 -101980 -130561 -151487 -195645 -288891 -344898 -249973 -259835 -222140 -197531 -134331
15399a34331N3832J18938O837p4778k7919O6026N4657k6143j18686o3904n2990
$$ -134331 -80499 38439 45276 -29502 -57421 8605 63262 37119 -81567 -145471 -198461
15388a98461M7603K21455L487j7897J3815q8751m5434j175k6968J2398J08119
$$ -198461 -150858 70597 74084 56187 70002 -18749 -64183 -65358 -92326 -79928 28191
15377B8191k8759M1956m6351J01164O2632J9010k3199o5960j70771p2760J13410
$$ 28191 -568 41388 -4963 96201 158833 177843 154644 88684 -82087 -154847 -41437
15366d1437L3633j48211O2153J19503L7189j40003j59882k9871J36913M5334M4772
$$ -41437 -7804 -156015 -93862 25641 62830 -77173 -237055 -266926 -130013 -84679 -39907
15355c9907K4097m9709m5367Q440J7760R6965r4400j7857o3995J38784J0762p3477
$$ -39907 -15810 -65519 -110886 -102446 -84686 12279 -82121 -99978 -163973 -25189 -14427 -87904
15343h7904m0739R5211J6413K1441O4114j08443m9252J0021K7726M3968j3642
$$ -87904 -128643 -33432 -17019 4422 68536 -39907 -89159 -79138 -51412 -7444 -21086
15332b1086m3918L5905N3185j52837O9785J18062K2207J7415n8166m0543j25892
$$ -21086 -65004 -29099 24086 -128751 -58966 59096 81303 98718 40552 9 -125883
15321a25883L3276P553j3600o0233K8371O3240M5423J83201R732n6739M9293J41242
$$ -125883 -92607 -85054 -98654 -158887 -130516 -67276 -21853 161348 171080 114341 163634 304876
15309C04876O620k01908n2134n2004n0527J09162O4162N7550p2147O122P483O792
$$ 304876 311496 109588 57454 5450 -45077 64085 128247 185797 113650 119772 127255 134047
15297A34047j25135k03890Q200Q9082R3756j2749Q966O9653p4590M3659J17911
$$ 134047 8912 -194978 -186778 -97696 -3940 -16689 -7723 61930 -12660 30999 148910
15286A48910K9537l7588L3271J30229k076l1351o0533j19777p1500j8377R9382
$$ 148910 178447 140859 174130 304359 302283 270932 210399 90622 19122 745 100127
15275A00127j13396j31586N3821j1750J9915P5070N7920m9977m7366l4967K0000
$$ 100127 -13269 -144855 -91034 -102784 -82869 -7799 50121 144 -47222 -82189 -62189
15264f2189L199K8213O002N3765K9298p4073q6869R5821M3678J8510o4238l8246
$$ -62189 -58990 -30777 -24775 28990 58288 -15785 -102654 -6833 36845 55355 -8883 -47129
15252d7129p5643L8692R5217J2300k1942L4029K0864r7010m1558P8390n0979L68
$$ -47129 -122772 -84080 11137 23437 1495 35524 56388 -40622 -82180 -3790 -54769 -54401
15240e4401P0978L8844p8752j03078n7201L0039l2999j0338N4101O2615k7808
$$ -54401 16577 55421 -23331 -126409 -183610 -153571 -186570 -196908 -142807 -80192 -108000
15229a08000J34024L8458J1901K0774J15013J5740m3271l6836M8445q525j3741
$$ -108000 26024 64482 76383 97157 212170 227910 184639 147803 196248 187723 173982
15218A73982r9550j61400j20031J00138J62065M6769K8248k3730L9426l8466M3678
$$ 173982 74432 -86968 -206999 -106861 55204 101973 130221 106491 145917 107451 151129
15207A51129l2352j4376p0800m8973j23266l2017k2486N7311Q7780L305k4709
$$ 151129 118777 104401 33601 -15372 -138638 -170655 -193141 -135830 -48050 -44745 -69454
15196f9454o9824J7435L5474J24514Q7897L4207p9272q3203o3863K9740Q1971
$$ -69454 -139278 -121843 -86369 38145 126042 160249 80977 -2226 -66089 -36349 45622
15185D5622P144l1122k9033k8001l5637P47j8564m100o1309M1473J85655q302
$$ 45622 52766 21644 -7389 -35390 -71027 -70280 -88844 -92944 -154253 -112780 72875 64573
15173F4573q2920m5028L3193M0937O8858M333p610o8582j7533l4982k10267L6208
$$ 64573 -18347 -63375 -30182 10755 79613 83946 76336 7754 -9779 -44761 -255028 -218820
15161b18820K10298L2392j01827N674J7963O6195M9785M2115p4044k2023m9753
$$ -218820 -8522 23870 -77957 -72283 -54320 11875 61660 103775 29731 7708 -42045
15150d2045j9972J08539J5403q6498O1926M3256L9874L5957o219j25265n0123
$$ -42045 -62017 46522 61925 -24573 37353 80609 120483 156440 150221 24956 -25167
15139b5167K7289r4068p7853R0182J6687p967N6374J74711n0529n3556p8717r4275
$$ -25167 2122 -91946 -169799 -79617 -62930 -70897 -14523 160188 109659 56103 -22614 -116889
15127a16889O5273P0526l6294j23351k0528L0736Q9262J50095R7632o6201j44537
$$ -116889 -51616 18910 -17384 -140735 -161263 -130527 -41265 108830 206462 140261 -4276
15116d276N5306r720r7353j31317k504J08048k5027J77646J08376j31631n4208
$$ -4276 51030 41310 -56043 -187360 -189864 -81816 -106843 70803 179179 47548 -6660
15105f660p2076j33301j01035p2274L4245J36487N4883J76385J40251o4448j03159
$$ -6660 -78736 -212037 -313072 -385346 -351101 -214614 -159731 16654 156905 92457 -10702
15094a0702l9509R045K8865q2332J9389M3943j05214m3790N1984O6657n797K9043
$$ -10702 -50211 -41166 -12301 -94633 -75244 -31301 -136515 -180305 -128321 -61664 -67461 -38418
15082c8418K3562r3928j22876n2764L8923J5651M7169J9655J19561j03097j07000
$$ -38418 -14856 -108784 -231660 -284424 -245501 -229850 -182681 -163026 -43465 -146562 -253562
15071b53562J43374J08793L5593q6426N9521L415j747r8596J7534q0203r0799
$$ -253562 -110188 -1395 34198 -52228 7293 10708 8961 -89635 -72101 -152304 -243103
15060b43103J25896J06707K5245m9280j686k9556j4723K3192j3807r2105K3694
$$ -243103 -117207 -10500 14745 -34535 -36221 -65777 -80500 -57308 -71115 -163220 -139526
15049a39526P258J12196J07041j02492K8221O5608o4241q0130l1998n7914O0955
$$ -139526 -132268 -20072 86969 -15523 12698 78306 14065 -66065 -98063 -155977 -95022
15038i5022J62672J7374k9753p8064l2223K0446J8316J20011J4193Q7003j02219
$$ -95022 67650 85024 55271 -22793 -55016 -34570 -16254 103757 117950 204953 102734
15027A02734j18910K8541j2469q9784k503N4594J2900j51999j8268L3234N9839
$$ 102734 -16176 12365 -104 -89888 -92391 -37797 -24897 -176896 -195164 -161930 -102091
15016a02091L817K8614P271L7647o785k5378P0324J0766L1941l3089o2297N1127
$$ -102091 -98274 -69660 -62389 -24742 -31527 -56905 13419 24185 56126 23037 -39260 11867
15004A1867K1670L1395o1020r93p0411p7369M2838O6460M8976l4258j19534Q0457
$$ 11867 33537 64932 3912 2919 -67492 -144861 -102023 -35563 13413 -20845 -140379 -59922
14992e9922O5018l0560k0322j7190P3701p382L604j8591k4546m8148O6824L1416
$$ -59922 5096 -25464 -45786 -62976 10725 3343 6947 -11644 -36190 -84338 -17514 13902
14980A3902m7784j0915o4043p5420J0604L1879J47945j1415o9271p0639L9374
$$ 13902 -33882 -44797 -108840 -184260 -173656 -141777 6168 -5247 -74518 -145157 -105783
14969a05783N6859m9093Q7164O7290J4638K6929j1226J9249j2118k8458l124j61079
$$ -105783 -48924 -98017 -10853 56437 71075 98004 86778 106027 93909 65451 62327 -98752
14957i8752j06887Q9779Q0963K9436j12648r3091M2967o1N1886P9962N6219N927
$$ -98752 -205639 -115860 -34897 -5461 -118109 -211200 -168233 -168294 -116408 -36446 19773 25700
14945B5700M6138N6852m8529j28061j9996m7409L6812R0562K6988p4142q4135
$$ 25700 71838 128690 80161 -47900 -67896 -115305 -78493 12069 39057 -35085 -119220
14934a19220j4900J26811L4083l5747j31611J08896J46311O23j5253M0299l7882
$$ -119220 -134120 -7309 26774 -8973 -140584 -31688 114623 115246 99993 140292 102410
14923A02410l2613l3178p7153J14411J73073M0939j17666o1245J10803q0028j7060
$$ 102410 69797 36619 -40534 73877 246950 287889 170223 108978 219781 139753 122693
14912A22693j11467j7659J18067L3627j2526n9748j4291m2012k878R1922J72162
$$ 122693 11226 -6433 111634 145261 132735 72987 58696 16684 13806 105728 277890
14901B77890J7449j63552p1866l9064o6368J5276M346l6122j38574l1555J17l9941
$$ 277890 295339 131787 59921 20857 -45511 -30235 -25889 -62011 -200585 -232140 -232023 -271964
14889b71964O3637Q8256l5131l9912K2698M777p0057m6023k4425q993M9002J71173
$$ -271964 -208327 -120071 -155202 -195114 -172416 -167639 -237696 -283719 -308144 -317137 -268135 -96962
14877i6962J27527j8284p683M0520q4391j0548j1941r8315N9461P7178J08083
$$ -96962 30565 12281 4598 45118 -39273 -49821 -61762 -160077 -100616 -23438 84645
14866H4645K3384o7860L8937J6805j49419m5497K482r2464k8934O8086J19429
$$ 84645 108029 40169 79106 95911 -53508 -99005 -96523 -188987 -217921 -149835 -30406
14855c0406P1354j40360O656R8920k4711j73684j33588J8461J08053J11640L4912
$$ -30406 40948 -99412 -92756 6164 -18547 -192231 -325819 -307358 -199305 -87665 -52753
14844e2753M3047K1647L8566l0609j52543J604J00928M0453P4699o6568o5623
$$ -52753 -9706 11941 50507 19898 -132645 -131041 -30113 10340 85039 18471 -47152
14833d7152O8280j04917m8012Q9378J44295J0981l0812L01K7330m7395P2149m3101
$$ -47152 21128 -83789 -131801 -42423 101872 112853 82041 82342 109672 62277 134426 91325
14821I1325n3669q1684L8336Q8454k7289m3407M3865K0563q2606j92374m525M5882
$$ 91325 37656 -44028 -5692 82762 55473 12066 55931 76494 -6112 -198486 -203011 -157129
14809a57129O2255O9242m1498j4538k5919J42384P9958p4482l4918r2644K9988
$$ -157129 -94874 -25632 -67130 -81668 -107587 34797 114755 40273 5355 -87289 -57301
14798e7301L9369j18475n8559J40636O1945l2424k5479O1496l8802n5190o0219
$$ -57301 -17932 -136407 -194966 -54330 7615 -24809 -50288 11208 -27594 -82784 -143003
14787a43003J2123J358L9025Q8196j10488o1922P1456M9685q5858j6663L9469
$$ -143003 -130880 -129522 -90497 -2301 -112789 -174711 -103255 -53570 -139428 -156091 -116622
14776a16622K2496R7574O5425j14664J1369P256L0900O0302L0078J15979r106
$$ -116622 -94126 3448 68873 -45791 -34422 -27166 3734 64036 94114 210093 200987
14765B00987m9879j32371o1193j2416Q8704L3368M159m54K649O2224j67483j00136
$$ 200987 151108 18737 -42456 -54872 33832 67200 71359 70905 73554 135778 -31705 -131841
14753a31841J01060J92730n3835q5919K6763N63N8607J9584m7r8182O031J5020
$$ -131841 -30781 161949 108114 22195 48958 49521 108128 127712 127665 29483 35514 50534
14741E0534m463j7669j5301q2574o7416O3690J4820M4054o9431R5312K9971M460
$$ 50534 46071 28402 13101 -69473 -136889 -73199 -58379 -14325 -83756 11556 41527 45987
14729D5987n2782j07547k8617O0225O4046j1316M3473M0884M5503j8469l8119
$$ 45987 -6795 -114342 -142959 -82734 -18688 -30004 13469 54353 99856 81387 43268
14718D3268n3976j11094R5731Q1393O3083q2539J0871L5809k9532q9595m3284
$$ 43268 -10708 -121802 -26071 55322 118405 35866 46737 82546 53014 -36581 -79865
14707g9865K611J6839N2215Q3472q7651k0283M7686J4838Q922M2513j7261m4798
$$ -79865 -77254 -60415 -8200 75272 -12379 -32662 15024 29862 38784 81297 64036 19238
14695A9238p3416Q554M6033K4857R292p0709j17959L2672J65831O8353j6074j3867
$$ 19238 -54178 -45624 409 25266 34558 -36151 -154110 -121438 44393 112746 96672 82805
14683H2805r0217m5247j25523o7593j323J39305Q897p733P9021O237k1830J6520
$$ 82805 -7412 -52659 -178182 -245775 -247098 -107793 -98896 -106629 -27608 -21371 -43201 -26681
14671b6681P3969M1168k01408j01280O8917M5737J74930P003q30n605p205L6789
$$ -26681 47288 88456 -112952 -214232 -145315 -99578 75352 82355 81525 75920 68715 105504
14659A05504J7719O6879k9852k7870K6428L1183L7509q2798J7647N0015r0209
$$ 105504 123223 190102 160250 132380 158808 189991 227500 144702 162349 212364 122155
14648A22155j00999o1170o5196L8681O6676M059j36725j4370l6149J8090Q608
$$ 122155 21156 -40014 -105210 -66529 147 4206 -132519 -146889 -183038 -164948 -156340
14637a56340O0090J06106j08841l0568L5124n9652O0565L9793J08095o6276o245
$$ -156340 -96250 9856 -98985 -129553 -94429 -154081 -93516 -53723 54372 -11904 -18149
14626a8149M7603P4470P5846n815P3088k7599l9605n0118P7275k7789q5276k8291
$$ -18149 29454 103924 179770 173955 247043 219444 179839 129721 206996 179207 93931 65640
14614F5640L769N9531k8841j13831p7052o7938M9094O0152m8913l192K0639p4817
$$ 65640 69409 128940 100099 -13732 -90784 -158722 -109628 -49476 -98389 -101581 -80942 -155759
14602a55759Q706L4861j9865K7241J5060L7601p6453L8234q7416j6604J52801
$$ -155759 -147053 -112192 -132057 -104816 -89756 -52155 -128608 -90374 -177790 -194394 -41593
14591d1593Q7704o5674M6659L4018n1291m0229o1498P2993Q9259J32539O5510
$$ -41593 46111 -19563 27096 61114 9823 -30406 -91904 -18911 70348 202887 268397
14580B68397l8281p655p9465q4354l9836n7561n8577J543P984N4787J45941k8379
$$ 268397 230116 222461 142996 58642 18806 -38755 -97332 -95789 -87805 -33018 112923 84544
14568H4544p5549K6297J619l9247p4923j16180J21497J08070N7448q3862j11946
$$ 84544 8995 35292 36911 -2336 -77259 -193439 -71942 36128 93576 9714 -102232
14557a02232J13608O3657O5801M3135N085l0752j00764k54139k7827J39812Q5181
$$ -102232 11376 75033 140834 183969 189054 158302 57538 -196601 -224428 -84616 565
14546E65o0507N3750n5960m5784J29736J31533o3092l997K6369m1250Q2557r1431
$$ 565 -59942 -6192 -62152 -107936 21800 153333 90241 86244 112613 71363 153920 62489
14534F2489j36922l0556J4538m3284J04821l216P9153Q3242M1611N1192p3217
$$ 62489 -74433 -104989 -90451 -133735 -28914 -32130 47023 130265 171876 223068 149851
14523A49851o3228K101Q188r9079j45795L5175J40135q951j36045P6233n6496
$$ 149851 86623 88724 96912 -2167 -147962 -112787 27348 18397 -117648 -41415 -97911
14512i7911L8343K8198o199K981N3749J3532k0930J10886J26766m5214j60471
$$ -97911 -59568 -31370 -37569 -34588 19161 32693 11763 122649 249415 204201 43730
14501D3730q5558q3079j2826J49074K5739O1533J9035k5495n388K6932n4727J27821
$$ 43730 -41828 -124907 -137733 11341 37080 98613 117648 92153 86765 113697 58970 186791
14489A86791K8522n3708k2235k9760r2147p1857p0793Q8676L1945m7073O8340
$$ 186791 215313 161605 139370 109610 17463 -54394 -125187 -36511 -4566 -51639 16701
14478A6701L1115m834p4484m3119k374k9383R9029J2542O2853m4241k7728Q6312
$$ 16701 47816 42982 -31502 -74621 -76995 -106378 -7349 5193 68046 23805 -3923 82389
14466H2389j06604j9617m1590o900O8586K8914p8179L8429Q924l0359P5287M7351
$$ 82389 -24215 -43832 -85422 -92322 -23736 5178 -73001 -34572 -25648 -56007 19280 66631
14454F6631J6641J1034l3975p0787j5469Q6827j22448L6522k3448O1632N1184
$$ 66631 83272 94306 60331 -10456 -25925 60902 -61546 -25024 -48472 13160 64344
14443F4344k618O138p478m7818J4549J62994K9198k2563o6421l731n6718l4019
$$ 64344 61726 67864 60386 12568 27117 190111 219309 196746 130325 126594 69876 35857
14431C5857k5444l0993o5111K6776k3515p0586n435k5757k1983P1738J30092J34563
$$ 35857 10413 -20580 -85691 -58915 -82430 -153016 -158451 -184208 -206191 -134453 -4361 130202
14419A30202N0231p4797j9294L3793o4543L4505o8780j4189Q2322M4835k3574
$$ 130202 180433 105636 86342 120135 55592 90097 21317 7128 89450 134285 110711
14408A10711o325o8605m0206P764p3150n2146P5251J3706J5436O7466q577r5640
$$ 110711 104386 35781 -4425 3339 -69811 -121957 -46706 -33000 -17564 49902 41325 -54315
14396e4315q0172p3562q09J42754m2989n6855N0915K4298k307J6742N2780M5935
$$ -54315 -134487 -208049 -208858 -66104 -109093 -165948 -115033 -90735 -93042 -76300 -23520 22415
14384B2415L4913j32974j8408Q7556J1946q0862j36522m497J06205K8569k6197
$$ 22415 57328 -75646 -94054 -6498 5448 -75414 -211936 -216433 -110228 -81659 -107856
14373a07856k1688R4678j611j31036o5175J423R5784K06610R446k0093J7569J7294
$$ -107856 -129544 -34866 -36477 -167513 -232688 -231265 -135481 71129 80575 60482 78051 95345
14361I5345j42950l1950P3418r215n2282n5901m5052O4445k6072J56838J18676
$$ 95345 -47605 -79555 -6137 -15352 -67634 -123535 -168587 -104142 -130214 26624 145300
14350A45300j11475j00334N7642o235o5015m3956j6231J790O0901J30573P5523
$$ 145300 33825 -66509 -8867 -15102 -80117 -124073 -140304 -138514 -77613 52960 128483
14339A28483o3461r0855q09P3460N8720j38712q4299J03999J02446j28332p7154
$$ 128483 65022 -25833 -26642 46818 105538 -33174 -117473 -13474 88972 -39360 -116514
14328a16514k2970O1330L1772k7040J6045m0951M6443L8763l1556j7507J1779
$$ -116514 -139484 -78154 -46382 -73422 -57377 -98328 -51885 -13122 -44678 -62185 -50406
14317e0406K7271l1015o5434O635l8395N8296J64312K5643j14388l956O5747Q532
$$ -50406 -23135 -54150 -119584 -112949 -151344 -93048 71264 96907 -17481 -21437 44310 52842
14305E2842r40l7451r285Q8860J53864K5503k06085l5220l915j04725k0552P4748
$$ 52842 51902 14451 5166 94026 247890 273393 67308 32088 28173 -76552 -97104 -22356
14293b2356N9743L7000Q6435n4486q9690q9945R491j0525M2729M044P0101J02876
$$ -22356 37387 74387 160822 106336 16646 -73299 -63808 -74333 -31604 -27560 42541 145417
14281A45417J6057j08482o8944L2491o3475P6069O7415p792l9152Q9055L4423
$$ 145417 161474 52992 -15952 16539 -46936 29133 96548 88756 49604 138659 173082
14270A73082L7747j02228j50851q9319M9174J76626k4968j52345l7560k495j9485
$$ 173082 210829 108601 -42250 -131569 -82395 94231 69263 -83082 -120642 -123137 -142622
14259a42622Q0585O3650J5074J9378k2076l4762K4498k813l1050J9392R953M9576
$$ -142622 -62037 1613 16687 36065 13989 -20773 3725 912 -30138 -10746 -793 48783
14247D8783p048J5927o8507j7691l1481j18245m679N9165K7668J14253k0864j01064
$$ 48783 41735 57662 -10845 -28536 -60017 -178262 -182941 -123776 -96108 18145 -2719 -103783
14235a03783P8011P2550j14407R2462N5285j44224j20145J32747P1785j3488J2044
$$ -103783 -25772 46778 -67629 24833 80118 -64106 -184251 -51504 20281 6793 18837
14224A8837n1151k998m9606R0664K6463k1006Q5224l9354O299j805M7279N9176
$$ 18837 -32314 -35312 -84918 5746 32209 11203 96427 57073 63372 61567 108846 168022
14212A68022o0371P777n358k1585r997k5715J07107n6854j22175j98433L0952
$$ 168022 107651 115428 110070 88485 78488 52773 159880 103026 -19149 -217582 -186630
14201a86630P7132k3090J4478Q7852M0858o373j4475M916p0983O1636K3653n0172
$$ -186630 -109498 -132588 -118110 -30258 10600 4227 -10248 -5332 -76315 -14679 8974 -41198
14189d1198l8718J61534Q1534l7304p0258j34319l9533k3519l7963l0417O4863
$$ -41198 -79916 81618 163152 125848 55590 -78729 -118262 -141781 -179744 -210161 -145298
14178a45298J26270P600l7720q5573J69967J21500j12640P687n4215k6026P9865
$$ -145298 -19028 -11428 -49148 -134721 35246 156746 44106 51793 -2422 -28448 51417
14167E1417O7433l4205o4940o4038k8544k8585K5089L3942Q8579K9013p1979J8022
$$ 51417 118850 84645 19705 -44333 -72877 -101462 -76373 -42431 46148 75161 3182 21204
14155B1204R393j5694N4526J8383n236P5783J4169o6108N5266O4415j5900L4037
$$ 21204 30597 14903 69429 87812 82576 158359 172528 106420 161686 226101 210201 244238
14143B44238j83577j12140k4558J08302K5582j6942q5443O1667m6385r3569p1827
$$ 244238 60661 -51479 -76037 32265 57847 40905 -44538 17129 -29256 -122825 -194652
14132a94652j0113J33533J95346K3547l4120M463j14253m3461J5586N9955M5045
$$ -194652 -204765 -71232 124114 147661 113541 118004 3751 -39710 -24124 35831 80876
14121H0876m9759Q3728N7556p1024j13260j28206M1121P4271J4482O6387K4868
$$ 80876 31117 114845 172401 101377 -11883 -140089 -98968 -24697 -10215 56172 81040
14110H1040K2842m7005p7109j47240J0650R1035M8223m6651J4267p7325m0942
$$ 81040 103882 56877 -20232 -167472 -156822 -65787 -17564 -64215 -49948 -127273 -168215
14099a68215K9979O0952M5057m6292K474K9732K8935J8043k1156J76542K1048
$$ -168215 -138236 -77284 -32227 -78519 -76045 -46313 -17378 665 -20491 156051 177099
14088A77099Q9205p2705q1170p0016k083p9810N0125Q0478n7522j6922J10791
$$ 177099 266304 193599 112429 42413 40330 -39480 10645 91123 33601 16679 127470
14077A27470k6551p8039N880J52932L2810L0761k6911j143k3127j88337o1484
$$ 127470 100919 22880 28760 181692 214502 245263 218352 217209 194082 5745 -55739
14066e5739J35659J20778K2193Q857N3281q2231j09581j1354O5868l3867K1481
$$ -55739 79920 200698 222891 231748 285029 202798 93217 81863 147731 113864 135345
14055A35345K524q348o617m8416M542N1210k5173n2553Q6580J10060l6369j19623
$$ 135345 137869 129521 122904 74488 79030 130240 105067 52514 139094 249154 212785 93162
14043I3162l491M1181l8499k1998k0932J8214P985l7915j6355k5245J8209j2696
$$ 93162 89671 130852 92353 70355 49423 67637 75622 37707 21352 -3893 14316 1620
14031A620r5060K6169R3817M4735K6174r7573Q4692Q0253J507P028n5016j48217
$$ 1620 -93440 -67271 26546 71281 97455 -118 84574 164827 166334 173362 118346 -29871
14019b9871j21186P4409K7227k7891O5663K2491m52m027o553l0457L9537J02967
$$ -29871 -151057 -76648 -49421 -77312 -11649 10842 10390 6363 -190 -30647 8890 111857
14007A11857j1645j03861j13799K7501k9433p9027M583M5996P3430K0127o492
$$ 111857 100212 -3649 -117448 -89947 -119380 -198407 -193824 -147828 -74398 -54271 -60763
13996f0763L1201N6712J7394P76r5850n7799R5623n1565m7837k6751L4585N0206
$$ -60763 -29562 27150 44544 45320 -50530 -108329 -12706 -64271 -112108 -138859 -104274 -54068
13984e4068L1209P0770j009J2389n620q7016r5388L661J46420o341o9461P5919
$$ -54068 -22859 47911 46902 59291 53671 -33345 -128733 -125072 21348 15007 -54454 21465
13972B1465j10382m9183o2123K1781J35167O3974o010K9383O940J36006L6462
$$ 21465 -88917 -138100 -200223 -178442 -43275 20699 14689 44072 51012 187018 223480
13961B23480J14179m956l8762j99822j98253k1572R5033j4032J04158N2217l0962
$$ 223480 337659 332703 293941 94119 -104134 -125706 -30673 -44705 59453 111670 80708
13950H0708m8894q3989K2879q386n9889J9208O2530O5100k9059p0147m5609L840
$$ 80708 31814 -52175 -29296 -37682 -97571 -78363 -15833 49267 20208 -49939 -95548 -91708
13938i1708M5025K8588R1572R0802j0230N5086n2991j63918k6627R3885k40J10739
$$ -91708 -46683 -18095 73477 164279 154049 209135 156144 -7774 -34401 59484 59244 169983
13926A69983O1539J2266O5029p4234j08524r9559j32581P464L6834J0319L3193
$$ 169983 231522 243788 308817 234583 126059 26500 -106081 -98617 -61783 -51464 -18271
13915a8271Q3593N739M3489J15140j7954o7260r5732O9233j7816r431k8881Q799
$$ -18271 65322 71061 114550 229690 211736 144476 48744 117977 100161 90730 61849 70648
13903G0648m3558L8439J7452P1072L9036j25667J2366M5064k1481p7593q4012
$$ 70648 27090 65529 82981 154053 193089 67422 79788 124852 103371 25778 -58234
13892e8234j11863r5767J22026J30844M2987M428N1302R7078M6358J9245J6074
$$ -58234 -170097 -265864 -143838 -12994 29993 34421 85723 182801 229159 248404 264478
13881B64478p746o2016m5013L99p6582j70664l9771R8788J16601J25107N1808
$$ 264478 256732 194716 149703 150102 73520 -97144 -136915 -38127 78474 203581 255389
13870B55389j95145p3557P0317K2416K9086J6058k5687j8670N8956J02439L99
$$ 255389 60244 -13313 57004 79420 108506 124564 98877 80207 139163 241602 242001
13859B42001n1163N2084o7196j44278l7556m8497N325R9739J2983n3220j24512
$$ 242001 190838 242922 175726 31448 -6108 -54605 -49280 50459 63442 10222 -114290
13848a14290k0662N4489J07502O1792M6958J6068R8265l0939p3659K7648J8462
$$ -114290 -134952 -80463 27039 88831 135789 151857 250122 219183 145524 173172 191634
13837A91634K5110L5129l7623k13266o6937K0838r772Q192q921n2174r7267O4685
$$ 191634 216744 251873 214250 984 -65953 -45115 -54887 -46695 -55616 -107790 -205057 -140372
13825a40372J57702l9820n9423J5508P9294P2953K1076M1964n3427j58496R848
$$ -140372 17330 -22490 -81913 -66405 12889 85842 106918 148882 95455 -63041 -53193
13814e3193L6719J10991m0682L7755n1931o3073P9531P6927o5278n9480p0739
$$ -53193 -16474 94517 53835 91590 39659 -23414 56117 133044 67766 8286 -62453
13803f2453M3640k2123P2891o2943L4621N7934o0463n4547O2151R9418k8841k2367
$$ -62453 -18813 -40936 31955 -30988 3633 61567 1104 -53443 8708 108126 79285 56918
13791E6918R3925o709Q136K2151p464q6631n1909j16576K7638J82183J01217j1424
$$ 56918 150843 144134 152270 174421 166957 80326 28417 -88159 -60521 121662 222879 211455
13779B11455R195l9398J3490K4634K0612q3282p1832O548N6672J22582M6771m190
$$ 211455 220650 181252 194742 219376 239988 156706 84874 91422 148094 270676 317447 313257
13767C13257q647r8417o4914N8904J15999n913j7084L1184j27571M1545J84439
$$ 313257 304610 206193 141279 200183 316182 310269 293185 324369 196798 238343 422782
13756D22782L4293j25573q8387N5614n0793j7255l6261J16427R7677j9366k52890
$$ 422782 457075 331502 243115 298729 247936 230681 194420 310847 408524 389158 136268
13745A36268n8772j09404r0917R5233R4041j6517J7253R8399j63111j04060N7703
$$ 136268 77496 -31908 -122825 -27592 66449 49932 67185 165584 2473 -101587 -43884
13734d3884R1890P4655N8561K0800K3859j31720m7178J7073o8294k0405J52634
$$ -43884 48006 122661 181222 202022 225881 94161 46983 64056 -4238 -24643 127991
13723A27991P7826J30256j5357q7917J21911K0619j7123K5684Q930p5627P2672
$$ 127991 205817 336073 320716 232799 354710 375329 358206 383890 392820 317193 389865
13712C89865M4350O6971J456j6463m3974J03044J08817J46375j11495j11663q4593
$$ 389865 434215 501186 502642 486179 442205 545249 654066 800441 688946 577283 492690
13701D92690j150K9989J09122J15295Q8266l0998Q126J7465L5984o446j0997o1499
$$ 492690 491540 521529 630651 745946 834212 803214 811340 828805 864789 858343 847346 785847
13689G85847j2128R4223J1053O8759M9650n088o9318o8757p3281k9679O2557J08684
$$ 785847 773719 867942 878995 947754 997404 992316 922998 854241 780960 751281 813838 922522
13677I22522o4767r5076p5136M984k2809P4299J40282K3282j1103o2565o1413
$$ 922522 857755 762679 687543 692527 669718 744017 884299 907581 896478 833913 772500
13666G72500R5033M2507J63764K72543R2175J34093N8077k679p1656n0806K3190
$$ 772500 867533 910040 1073804 1346347 1438522 1572615 1630692 1628013 1556357 1505551 1528741
13655A528741r2817r7309j8286o9718j90148j85337l3766O3256N3783K9619p6815
$$ 1528741 1435924 1338615 1320329 1250611 1060463 875126 841360 904616 958399 988018 911203
13644I11203k00129j37673j3677J34809j4627K0926q2873n5817J1921J03195j5358
$$ 911203 711074 573401 559724 694533 679906 700832 617959 562142 574063 677258 661900
13633F61900M9687O2985J767M9816K2860J68754J16547J80834K01565K01088J13758
$$ 661900 711587 774572 776339 826155 849015 1017769 1134316 1315150 1516715 1717803 1831561
13622A831561k20000l70489k08325j17039j00869j49575n5142j25895j45821m1842
$$ 1831561 1611561 1241072 1032747 915708 814839 665264 610122 484227 338406 296564
13612B96564m8509K2477o4617n7817p3899R5004L8757K2300J6478r5558L726J78329
$$ 296564 248055 270532 205915 148098 74199 169203 207960 230260 246738 151180 154906 333235
13600C33235R6938j5694J8453j7935j11857k7246l6390Q7483J24525J29006J36622
$$ 333235 430173 414479 432932 414997 303140 275894 239504 326987 451512 580518 717140
13589G17140J92690O857n1403m3897p607o7961k25160k19610j0216l0420j30976
$$ 717140 909830 916687 865284 821387 813780 745819 520659 301049 290833 260413 129437
13578A29437q547M2933K6192K2322j18006l9559N6739Q1384l5478M0860p0697
$$ 129437 120890 163823 190015 212337 94331 54772 111511 192895 157417 198277 127580
13567A27580J1531K2440K5842n0264Q689R4918J8226o2600J377n8749N8220L8932
$$ 127580 139111 161551 187393 137129 145818 240736 258962 196362 197739 138990 197210 236142
13555B36142o6120K8143N8423L8955j62353q7915M8052l7086m4607N5030K5554
$$ 236142 170022 198165 256588 295543 133190 45275 93327 56241 11634 66664 92218
13544I2218J1536M4031O120k5980k1160k7739J48752J50029L1023p0170j13394
$$ 92218 103754 147785 153905 127925 106765 79026 227778 377807 408830 338660 225266
13533B25266k6205k23462j4111P3420N5431L9967l7438J5017K1724j07414j12566
$$ 225266 199061 -24401 -38512 34908 90339 130306 92868 107885 129609 22195 -90371
13522i0371R1591L5123K3245j9968j721o9567Q7959O8367K816q6269l8181P6191
$$ -90371 1220 36343 59588 39620 37899 -31668 56291 124658 127474 41205 3024 79215
13510G9215Q1271L7418m939K2245p1382J9200j8419k9711j51454N6759J39686
$$ 79215 160486 197904 192965 215210 143828 163028 144609 114898 -36556 20203 159889
13499A59889j8860l9880R2337J6367j2606O06k5814J871r2995L1992j8088n1748
$$ 159889 141029 101149 193486 209853 197247 197853 172039 173910 80915 112907 94819 43071
13487D3071O790P4715K7379M5273J28132N7079M6158K4257k7353j71279o2253
$$ 43071 49861 124576 151955 197228 325360 382439 428597 452854 425501 254222 191969
13476A91969m0373k8414J4088P1825L8520m0109j6985J12899K4509o8862K3996
$$ 191969 151596 123182 137270 209095 247615 207506 190521 303420 327929 259067 283063
13465B83063K866P1928j8168M660M385M1117m786n4436J1988K8628q6264p6108
$$ 283063 285929 357857 339689 344349 348734 389851 385065 330629 342617 371245 284981 208873
13453B08873o0679J25053M904k6898L7358k4456j41827j15025o6181J24642J35065
$$ 208873 148194 273247 278151 251253 288611 264155 122328 7303 -58878 65764 200829
13442B00829O5965m332r8315Q5293j04499J0783L5088k7139n2478o1431l8815
$$ 200829 266794 262462 164147 249440 144941 155724 190812 163673 111195 49764 10949
13431A0949L504J23690J29452J5154L8740L8271o956j06196j0578J04462M0607
$$ 10949 14453 138143 267595 282749 321489 359760 352804 246608 236030 340492 381099
13420C81099j2115R31j5879m8708j11700q4949N4978O401J2934P2902J09689n8472
$$ 381099 368984 369915 354036 305328 193628 108679 163657 170058 182992 255894 365583 307111
13408C07111j33662j67339J09881R2959M926L8429P1718N8641L9048m879j29896
$$ 307111 173449 6110 115991 208950 213876 252305 324023 382664 421712 416833 286937
13397B86937o1217k2712n5380K9064n1690N3797J97823L0649o2898N421K5538
$$ 286937 225720 203008 147628 176692 125002 178799 376622 407271 344373 349794 375332
13386C75332K4285q1482j2091l8137o317K1369k1433o6640o0812R0609J50347
$$ 375332 399617 318135 306044 267907 261590 282959 261526 194886 134074 224683 375030
13375C75030O5337M8376O9295q7328N561J6756O2890M2211K1063J05783O5069
$$ 375030 440367 488743 558038 470710 476271 493027 555917 598128 619191 724974 790043
13364G90043J0149J3476J55414O7863J529O4366J3623M8393l8139J7163K8226
$$ 790043 800192 813668 969082 1036945 1038474 1102840 1116463 1164856 1126717 1143880 1172106
13353A172106m664O132J09782K79j10312l0068K8730R0389l6407q1129m8429k4232
$$ 1172106 1167442 1173574 1283356 1283635 1173323 1143255 1171985 1262374 1225967 1144838 1096409 1072177
13341A072177j6473l2289j702J00717l0667J1711j5510O6788Q191j76182j75739
$$ 1072177 1055704 1023415 1021713 1122430 1091763 1103474 1087964 1154752 1162943 986761 811022
13330H11022j71736K3655N8561O3713J16549L9808J97481J42896K3387J1607J02621
$$ 811022 639286 662941 721502 785215 901764 941572 1139053 1281949 1305336 1316943 1419564
13319A419564r3319j30829K621K1199j36673j62533L4038P4823O4210R8468k2191
$$ 1419564 1326245 1195416 1198037 1219236 1082563 920030 954068 1028891 1093101 1191569 1169378
13308A169378N439L2626N8446o3304l2766J7286l2228O5774N4918P1641Q9000
$$ 1169378 1174817 1207443 1265889 1202585 1169819 1187105 1154877 1220651 1275569 1347210 1436210
13297A436210k72894k76765r3977j33261j01848k0098J29372P4220J26733J24443
$$ 1436210 1163316 886551 792574 659313 557465 537367 666739 740959 867692 992135
13287I92135k296K3976j2975m8587r2388m2874n3101M6529M938J5486O5754o8280
$$ 992135 989839 1013815 1000840 952253 859865 816991 763890 810419 815357 830843 896597 828317
13275H28317k9582r451J04941J24110q5993m4593K04152O9614j0648Q846N9822
$$ 828317 798735 789284 894225 1018335 932342 887749 1091901 1161515 1150867 1159713 1219535
13264A219535l297N2124k3226O576J0863m2299M0019R7133P5784O8015J80286
$$ 1219535 1216238 1268362 1245136 1251712 1262575 1220276 1260295 1357428 1433212 1501227 1681513
13253A681513O1489m8063j9941J68888J10574l1595M6629O487O1133J9821N8205
$$ 1681513 1743002 1694939 1674998 1843886 1954460 1922865 1969494 1975981 2037114 2056935 2115140
13242B115140J70861l1931J8784J23719K03101M5932J62129K52055K23429K58829
$$ 2115140 2286001 2254070 2272854 2396573 2599674 2645606 2807735 3059790 3283219 3542048
13232C542048K81716M51187M55243L66120K97416M12170O51606P83595R82748
$$ 3542048 3823764 4274951 4730194 5096314 5393730 5805900 6457506 7241101 8223849
13223H223849J047912J043488J329197J921296K481639L058900L882522M949590
$$ 8223849 9271761 10315249 11644446 13565742 16047381 19106281 22988803 27938393
13215B7938393O252953Q555407J2323116J7552453K3915323K8314623K6275069
$$ 27938393 34191346 42746753 55069869 72622322 96537645 124852268 151127337
13208A51127337J6621715K499719j2156739k2718827k6713501k4509478j9225112
$$ 151127337 167749052 170248771 158092032 135373205 108659704 84150226 64925114
13201F4925114j3845281r380884o538092m441567k866821j935271j500895j204418
$$ 64925114 51079833 41698949 35160857 30719290 27852469 25917198 24416303 23211885
13193B3211885r93035r05801q16540j79524L79125P61975J286341J967975K650623
$$ 23211885 22218850 21313049 20496509 20316985 20696110 21458085 22744426 24712401 27363024
13184B7363024L498622M374772N677833P420636R626995J2541739J7406790K5453012
$$ 27363024 30861646 35236418 40914251 48334887 57961882 70503621 87910411 113363423
13176A13363423L6863901M9975196N8487590N4064215L4165155M067163k6976249
$$ 113363423 150227324 200202520 258690110 312754325 346919480 350986643 324010394
13169C24010394m9576530n8020272n3153185m1520615k9661187k0419445j4205749
$$ 324010394 274433864 216413592 163260407 121739792 92078605 71659160 57453411
13162E7453411r940035p308826n685435m384999l519307k646382j889405j422403
$$ 57453411 47513376 40204550 34519115 30134116 26614809 23968427 22079022 20656619
13154B0656619q97085k41057K88036Q20420J319156J563958J768238K037244K395476
$$ 20656619 19759534 19518477 19806513 20626933 21946089 23510047 25278285 27315529 29711005
13145B9711005L197880M417350O158301Q951296J3009928J8644742K5103224K9316107
$$ 29711005 32908885 37326235 43484536 52435832 65445760 84090502 109193726 138509833
13137A38509833K6482300J5751817K69704j5247579k6253213k9990921k6855788
$$ 138509833 164992133 180743950 181013654 165766075 139512862 109521941 82666153
13130H2666153k0713948j4936803j0425497p452741n408783m068698l028758k612224
$$ 82666153 61952205 47015402 36589905 29137164 23728381 19659683 16630925 14018701
13122A4018701j946041j588072j465000j127399q27689p58334n70078m22583m73718
$$ 14018701 12072660 10484588 9019588 7892189 7064500 6306166 5736088 5313505 4839787
13113D839787l73078k89801l34735k78845j09058k43537j79673m2742j82023j31724
$$ 4839787 4466709 4176908 3842173 3563328 3454270 3210733 3031060 2988318 2806295 2674571
13103B674571j19097q7211j60836j74990j78667j44129j99323p7791j2576k1124
$$ 2674571 2555474 2468263 2307427 2132437 1953770 1809641 1610318 1532527 1519951 1498827
13093A498827n2200k0732L9115J896m5804j22497k7873q598j01532j5813P323
$$ 1498827 1446627 1425895 1465010 1466906 1421102 1298605 1270732 1262134 1160602 1144789 1152112
13082A152112J18956M9576m9876p2652M1609p9698p8356L6201K4587q7588J035
$$ 1152112 1271068 1320644 1270768 1198116 1239725 1160027 1081671 1117872 1142459 1054871 1055906
13071A055906J9793k08151j92920j7129k1199L6414Q8592R6410R5393J7134n8194
$$ 1055906 1075699 867548 674628 657499 636300 672714 761306 857716 953109 970243 912049
13060I12049J9127l9669r113P8357l6706J8927k9287k8488Q3789J66617P9135
$$ 912049 931176 891507 882394 960751 924045 942972 913685 885197 968986 1135603 1214738
13049A214738J32881J40047O4477q5107j37833j23199j37635o2974J7875o7482
$$ 1214738 1347619 1487666 1552143 1467036 1329203 1206004 1068369 1005395 1023270 955788
13039I55788j50611M2113Q8613R5641M292k9869K2693n7623q9482l3839M5063
$$ 955788 805177 847290 935903 1031544 1035836 1005967 1028660 971037 881555 847716 892779
13028H92779P2308J39771L25709R6072j29709q7249M6490p2754j02884J05109
$$ 892779 965087 1104858 1430567 1526639 1396930 1309681 1356171 1283417 1180533 1285642
13018A285642J97175J86542Q5311Q8210l5500j29648m2246j544n7397L048j36318
$$ 1285642 1482817 1669359 1754670 1842880 1807380 1677732 1635486 1633942 1576545 1579593 1443275
13007A443275k39582l1689N7500L7434M2367k225m1027P9536j4804J3972L5278
$$ 1443275 1203693 1172004 1229504 1266938 1309305 1307080 1266053 1345589 1330785 1344757 1380035
12996A380035K28647J65088K52047K38669Q2261J9914j06562j12778m5475k30774
$$ 1380035 1608682 1773770 2025817 2264486 2346747 2366661 2260099 2147321 2101846 1871072
12986A871072k51482j06887l2410J9623J00295Q5310L6850J08514J63566L5624
$$ 1871072 1619590 1512703 1480293 1499916 1600211 1685521 1722371 1830885 1994451 2030075
12976B030075K3049J0168L7009J9889p301L1485O6416P2856M3883J6607p042J7673
$$ 2030075 2053124 2063292 2100301 2120190 2112889 2144374 2210790 2283646 2327529 2344136 2337094 2354767
12964B354767J5085j5505j00674l7886Q5224q8542j48791j08897p217o436M4109
$$ 2354767 2369852 2354347 2253673 2215787 2301011 2212469 2063678 1954781 1947564 1941128 1985237
12953A985237n6680j22833O9382P7408J32143O5487j09892j39044j538m4083j04474
$$ 1985237 1928557 1805724 1875106 1952514 2084657 2150144 2040252 1901208 1899670 1855587 1751113
12942A751113m3950O7355q817r020R1713J10618K15069K36674J58220J19903k317
$$ 1751113 1707163 1774518 1765701 1756681 1848394 1959012 2174081 2410755 2568975 2688878 2686561
12931B686561l92275k39626j59941j81195k69991j56527j9588J2879m9810j60657
$$ 2686561 2294286 2054660 1894719 1713524 1443533 1287006 1267418 1280297 1230487 1069830
12921A069830l6157n9528M2142O0088l5322r0321j19850J4191J90663n0016j81764
$$ 1069830 1033673 974145 1016287 1076375 1041053 950732 830882 845073 1035736 985720 803956
12910H03956k0641J3791j0858j23538n0220j3783L2747m7129j26387R7198K6471
$$ 803956 783315 797106 786248 662710 612490 598707 631454 584325 457938 555136 581607
12899E81607j45341n4520P656J17586L0991l7291m6299K2801k1889j14896p1671
$$ 581607 436266 381746 389402 506988 537979 500688 454389 477190 455301 340405 268734
12888B68734R7573J29821m3188r8625O549q7510j35425K3889J03095J00538J10406
$$ 268734 366307 496128 452940 354315 360864 273354 137929 161818 264913 365451 475857
12877D75857M5762j96341m6273L284q212n8854J5261O2091K433n692J52000R3330
$$ 475857 521619 325278 279005 282289 274077 215223 230484 292575 295008 289316 441316 534646
12865E34646k1091o7715j28881J26591M6903L5305k790M5670p8072j20814P2398
$$ 534646 513555 445840 316959 443550 490453 525758 522968 568638 490566 369752 442150
12854D42150J25477J46201K6118n6574O3419R7203J761j03043o2683n770j00310
$$ 442150 567627 713828 739946 683372 746791 843994 845755 742712 680029 674259 573949
12843E73949N6089M8937q6258j20446q7435m7670J70873P8020m3542q2984o802
$$ 573949 630038 678975 592717 472271 384836 337166 508039 586059 542517 459533 452731
12832D52731O5568R1314N3034r706r8595J066J18659l5026j01581j38615k1782
$$ 452731 518299 609613 662647 652941 554346 555412 674071 639045 537464 398849 377067
12821C77067N5998l4653j00418j41319K653J91208K5868R033Q0590j01774M2917
$$ 377067 433065 398412 297994 156675 159328 350536 376404 385437 466027 364253 407170
12810D07170M8103k5592l6534o03L9966l8417m9496o1967L1732J46767P1026P3193
$$ 407170 455273 429681 393147 392544 432510 394093 344597 282630 314362 461129 532155 605348
12798F05348k2731K3753n8089j0985M6169j16174q5692K8393k4434q2465p2680
$$ 605348 582617 606370 548281 537296 583465 467291 381599 409992 385558 303093 230413
12787B30413n899m863K5747Q9852Q5198Q6523N0967L1697r0959j67697J5047J0393
$$ 230413 224514 219651 245398 335250 420448 506971 557938 589635 498676 330979 346026 356419
12775C56419N4358J66794M7216P8910O4k2676j9532l5413l5760n7792p1950J7205
$$ 356419 410777 577571 624787 703697 703761 681085 661553 626140 590380 532588 460638 477843
12763D77843j586R9987J6m3877M1197O8557Q9622q6125j05038J3466J1042J31937
$$ 477843 476257 576244 576260 532383 573580 642137 731759 645634 540596 554062 565104 697041
12751F97041J62389J66432P2172P0526M6877p8668q4374j44297k84140k34836
$$ 697041 859430 1025862 1098034 1168560 1215437 1136769 1052395 908098 623958 389122
12741C89122J7825J64228j6241o3248J1388Q4223P4301q0478j28167q9314J40660
$$ 389122 406947 571175 554934 491686 503074 587297 661598 581120 452953 363639 504299
12730E04299J25484N0993j58106j66677k4936J03393M921k3621Q8926L7874P2797
$$ 504299 629783 680776 522670 355993 331057 434450 439371 415750 504676 542550 615347
12719F15347P8140J58623J21721J10259J99450K51889K02920K6104N2386j51477
$$ 615347 693487 852110 973831 1084090 1283540 1535429 1738349 1764453 1816839 1665362
12709A665362k22891k25920k15824k53168j66676j98954j35321n6607L2962L3
$$ 1665362 1442471 1216551 1000727 747559 580883 381929 246608 190001 222963 222996
12699B22996l7639k7773N3441L2899J96312J54435J21134L3698p6902m2775N032
$$ 222996 185357 157584 211025 243924 440236 594671 715805 749503 672601 629826 634858
12688F34858J3960n105J65298R5612M3948k495q4509L6647R225K17961L50702
$$ 634858 648818 643713 809011 904623 948571 946076 861567 898214 907439 1125400 1476102
12677A476102O1236N999J1482J3514j11089p5919j50952o6691J55263J07450j73305
$$ 1476102 1537338 1543337 1554819 1568333 1457244 1381325 1230373 1163682 1318945 1426395 1253090
12666A253090j59545P6293J76936P8218M6099q995j0101m277l0656J21016M6626
$$ 1253090 1093545 1169838 1346774 1424992 1471091 1462096 1451995 1447718 1417062 1538078 1584704
12655A584704j3975J681K244J65194O1609p0146j13801N2056j5224q0397j6852
$$ 1584704 1570729 1572410 1574654 1739848 1801457 1731311 1617510 1669566 1654342 1573945 1557093
12644A557093o8739j17307M5544R8653p3836O7598P9799J06688Q5379n8580Q4477
$$ 1557093 1488354 1371047 1416591 1515244 1441408 1509006 1588805 1695493 1780872 1722292 1806769
12633A806769N6010K3891J37780R4873J49851L2732j18515j5513J77602P848l432
$$ 1806769 1862779 1886670 2024450 2119323 2269174 2301906 2183391 2167878 2345480 2353328 2349896
12622B349896K62970N8605m6727K3880J56849r2723o3863k4503K1390k1819R502
$$ 2349896 2612866 2671471 2624744 2648624 2805473 2712750 2648887 2624384 2645774 2623955 2633457
12611B633457J29847J56409Q9332J2685r7433n1615M1619l1070M1689R1622R5351
$$ 2633457 2763304 2919713 3009045 3021730 2924297 2872682 2914301 2883231 2924920 3016542 3111893
12600C111893l1932J9608J09048M7735N3187J938J18374K24371R5615J19168J92352
$$ 3111893 3079961 3099569 3208617 3256352 3309539 3311477 3429851 3654222 3749837 3869005 4061357
12589D061357J31018N8312J23849J06119J50228K20434J48257J11033J47322K07045
$$ 4061357 4192375 4250687 4374536 4480655 4630883 4851317 4999574 5110607 5257929 5464974
12579E464974J79054K37484K24833J57591J35050J97487M26187M59591N05547
$$ 5464974 5644028 5881512 6106345 6263936 6398986 6596473 7022660 7482251 7987798
12570G987798O22414O43975O12739P58196J039200R69844J041837J324682J557848
$$ 7987798 8610212 9254187 9866926 10625122 11664322 12634166 13676003 15000685 16558533
12561A6558533J762153J958928K303298K438850K909584L449308M091257N206776
$$ 16558533 18320686 20279614 22582912 25021762 27931346 31380654 35471911 40678687
12553D0678687O566517Q529016J1300002J5047747J9947652K6740248L4981840
$$ 40678687 47245204 55774220 67074222 82121969 102069621 128809869 163791709
12546A63791709M2286624M4477345L7156135K0870848L92058j9594452l3617515
$$ 163791709 206078333 250555678 287711813 308582661 308974719 289380267 255762752
12539B55762752l8719512l5948884k9208971k1489791j4571288q823468l979040
$$ 255762752 217043240 181094356 151885385 130395594 115824306 107000838 103021798
12532A03021798m0480L297491O228638R073392J1397273J3038770J3768423J3725389
$$ 103021798 102981318 106278809 112507447 121580839 132978112 146016882 159785305 173510694
12524A73510694J3371988J2682876J2117463J2150706J2804855J3617602J4407441
$$ 173510694 186882682 199565558 211683021 223833727 236638582 250256184 264663625
12517B64663625J4421319J3276083J0463305O335283J140853m264574r124390
$$ 264663625 279084944 292361027 302824332 309159615 310300468 306035894 296911504
12510B96911504j2560801j4318115j4779388j4088429j2754331j1304333j0143106
$$ 296911504 284350703 270032588 255253200 241164771 228410440 217106107 206963001
12503B06963001r738231j0019415j0652236j1283207j1729886j1685404j0894350
$$ 206963001 197224770 187205355 176553119 165269912 153540026 141854622 130960272
12496A30960272r182269o916666m144582q41660K782505P193031J2847408J9561466
$$ 130960272 121778003 114861337 110716755 109875095 112657600 119850631 132698039 152259505
12488A52259505K7252211L4865147L9391657L7016823K5157649O007512j4942717
$$ 152259505 179511716 214376863 253768520 290785343 315942992 321950504 307007787
12481C07007787l2740864m2847492m4099327l9168949l1675531k4177776j8255466
$$ 307007787 274266923 231419431 187320104 148151155 116475624 92297848 74042382
12474G4042382j3547963j0213699p849852o101308m804345l769866l171744k679897
$$ 74042382 60494419 50280720 42430868 36329560 31525215 27755349 24583605 21903708
12466B1903708k340699k079324j768578j584317j333643j109064j047520q41565
$$ 21903708 19563009 17483685 15715107 14130790 12797147 11688083 10640563 9798998
12458I798998o09513m74976n02793l50905k29847m43328m30663l08507j21377
$$ 9798998 9189485 8714509 8211716 7860811 7630964 7187636 6756973 6448466 6327089
12449F327089j17056k09260k27259k49323l46273l30286k95604k47021j74351
$$ 6327089 6210033 6000773 5773514 5524191 5177918 4847632 4552028 4305007 4130656
12440D130656j31534j01190p3788j40761m0402o7549K3880J9312n227Q7760J64855
$$ 4130656 3999122 3897932 3824144 3683383 3642981 3575432 3599312 3618624 3613397 3701157 3866012
12429C866012J26750p1614q2850K9919O0155m3054j50417j21608k11262j98257
$$ 3866012 3992762 3921148 3838298 3868217 3928372 3885318 3734901 3613293 3402031 3203774
12419C203774j33934j68633n4152j20175k3535k1252J22191J10450P5018M6893
$$ 3203774 3069840 2901207 2847055 2726880 2703345 2682093 2804284 2914734 2989752 3036645
12409C036645o2502N4450k2170n3139l3241L8806M5502Q4798R4052P9166j8619
$$ 3036645 2974143 3028593 3006423 2953284 2920043 2958849 3004351 3089149 3183201 3262367 3243748
12398C243748j6757J1465l1836n9855O6864O3280j44954r9730R1704J10045J16634
$$ 3243748 3226991 3238456 3206620 3146765 3213629 3276909 3131955 3032225 3123929 3233974 3350608
12387C350608L3156r395j3421j20955j1320l215n1557L7940p7071j72418n0510
$$ 3350608 3383764 3374369 3360948 3239993 3228673 3225458 3173901 3211841 3134770 2962352 2911842
12376B911842L2431l640Q070K018J6740J33468M4244J33354Q6013K2573n6191
$$ 2911842 2944273 2940633 2948703 2950721 2967461 3100929 3145173 3278527 3364540 3387113 3330922
12365C330922j69140j62920k68059j98620j43844j26103M2428L1804j36349j75684
$$ 3330922 3161782 2998862 2730803 2532183 2388339 2262236 2304664 2336468 2200119 2024435
12355B024435q5771p5209j22078l1598J40970O253p4046j14964k1064O755j08575
$$ 2024435 1938664 1863455 1741377 1709779 1850749 1857002 1782956 1667992 1646928 1653683 1545108
12344A545108j49736o0963q6199R5447j2521k5545j02792l28138j67269j38127
$$ 1545108 1395372 1334409 1248210 1343657 1331136 1305591 1202799 874661 707392 569265
12334E69265M1212Q4441R5988Q31J6061J40305M3830P4329n6866j8158K8758m7031
$$ 569265 610477 694918 790906 791737 807798 948103 991933 1066262 1009396 991238 1019996 972965
12322I72965j02502q8042m7812j3991n6909m3225J46443J04398l7803J10945p4968
$$ 972965 870463 782421 734609 720618 663709 620484 766927 871325 833522 944467 869499
12311H69499m6059q7683j64195j09328o649P598q034l7115M3762r4556m2079R4473
$$ 869499 823440 735757 571562 462234 455585 463183 455149 418034 461796 367240 325161 419634
12299D19634P492M3149k8944l9151n6367M7312k8987j7857O7220k0416L8122L7032
$$ 419634 427126 470275 441331 402180 345813 393125 364138 346281 413501 393085 431207 468239
12287D68239P983p5652j00718L6032L0867J07506J11201p6791j66032j10237J21884
$$ 468239 476222 400570 299852 335884 366751 474257 585458 508667 342635 232398 354282
12276C54282M9384L0712j25948K7721p1103L3866l3502l8896O9186J43344j0500
$$ 354282 403666 434378 308430 336151 265048 298914 265412 226516 295702 439046 428546
12265D28546j40602j26229J10610O36l6379l265o9128j18708l664M5150M1766
$$ 428546 287944 161715 272325 272961 236582 233317 164189 45481 41817 86967 128733
12254A28733K948P6048Q1892k0499j2838k9506K8083K2520J8890K4412m7395p457
$$ 128733 131681 207729 289621 269122 256284 226778 254861 277381 296271 320683 273288 265831
12242B65831q5616J6222p4115j123J11575j2057K4907K1935p0795J0455J7608
$$ 265831 180215 196437 122322 121199 232774 220717 245624 267559 196764 207219 224827
12231B24827r137M4419K0190K3942J0106n8650l7151N8988l4733l7066k126M5575
$$ 224827 215690 260109 280299 304241 314347 255697 218546 277534 242801 205735 203609 249184
12219B49184n0490o7079Q7546p6999j31061J3342L4681K0786J18241R3983n8390
$$ 249184 198694 131615 219161 142162 11101 24443 59124 79910 198151 292134 233744
12208B33744j08613J16078K1122o8542p7892Q7539j29383j23296m8857q726N1337
$$ 233744 125131 241209 262331 193789 115897 203436 74053 -49243 -98100 -106826 -55489
12197e5489K4830k9533r285r9668M1013L5991n9349P1892P6108L5802j9886J43145
$$ -55489 -30659 -60192 -69477 -169145 -128132 -92141 -151490 -79598 -3490 32312 12426 155571
12185A55571J42687l8868j27137m4266R3519j46156q6270p4510N4942M3771P2645
$$ 155571 298258 259390 132253 87987 181506 35350 -50920 -125430 -70488 -26717 45928
12174D5928k1223k7143o0672P7336M9431m2589l9828L6535L7014J16608j23697
$$ 45928 24705 -2438 -63110 14226 63657 21068 -18760 17775 54789 171397 47700
12163D7700j15013J00272J54493j7923j43130j5015N2695M3449n9534O3913R7878
$$ 47700 -67313 32959 187452 169529 26399 11384 64079 107528 47994 111907 209785
12152B09785Q582K4491o1812L2714m002Q4666n2607j30842r9948n0590k8558L3075
$$ 209785 218367 242858 181046 213760 209758 294424 241817 110975 11027 -39563 -68121 -35046
12140c5046j6616J0653n3402j3232L0578J823M0904N9140m044N4259J15520O5655
$$ -35046 -51662 -41009 -94411 -107643 -77065 -75242 -34338 24802 20758 75017 190537 256192
12128B56192j4323k3443K291Q5142j2498j3997k9412N5504m6625J4932j6023j48110
$$ 256192 241869 218426 220717 305859 293361 279364 249952 305456 258831 273763 257740 109630
12116A09630m7010O4215O2999q960m3268L5847P8920l6734k9081k8721o355m2776
$$ 109630 62620 126835 189834 180874 137606 173453 252373 215639 186558 157837 151482 108706
12104A08706j2611M1449O0023J283K2609P894M2533J9111R365O1915j4024M3220
$$ 108706 96095 137544 197567 198850 221459 229353 271886 290997 300362 362277 348253 391473
12092C91473R1295J70401L56875K48717J42635J77725P7012m2212j81076j60943
$$ 391473 482768 653169 1010044 1258761 1401396 1579121 1656133 1613921 1432845 1271902
12082A271902j92579j68040r7426q8278r8945j64240R6928P9619K1933q9761M0655
$$ 1271902 1079323 911283 813857 725579 626634 462394 559322 638941 660874 571113 611768
12071F11768J61408J61054N0160L4605J43261J22781K4501L2098J7620J04855
$$ 611768 773176 934230 984390 1018995 1162256 1285037 1309538 1341636 1359256 1464111
12061A464111O3957K155O388J05014j8348k00784j03280J6378j08426j04844J5590
$$ 1464111 1528068 1530223 1536611 1641625 1623277 1422493 1319213 1335591 1227165 1122321 1137911
12050A137911m3074q5166n1193m344j2991n7090n1794r5847k1563J7438n353l6544
$$ 1137911 1094837 1009671 958478 954134 941143 884053 832259 736412 714849 732287 726934 690390
12038F90390l8069P4557J59709J07817k1653P0580J3444J24506Q7268J20454K55766
$$ 690390 652321 726878 886587 994404 972751 1043331 1056775 1181281 1268549 1389003 1644769
12027A644769J22387j31722j50185j97770j31677k65492k79219j83120O345J52921
$$ 1644769 1767156 1635434 1485249 1287479 1155802 890310 611091 427971 434316 587237
12017E87237r4612j44826J18222J0162p7987j00148p7911r0064o4409L4557j3556
$$ 587237 492625 347799 466021 476183 398196 298048 220137 130073 65664 100221 86665
12006H6665q0671Q4484K7468m4312l342n3498L2842m8990k5111J40775j8323j33036
$$ 86665 5994 90478 117946 73634 70292 16794 49636 646 -24465 116310 97987 -35049
11994c5049J17646J36016j8750l0421j47123q3604J4788K7149L2599k1037Q3754
$$ -35049 82597 218613 199863 169442 22319 -61285 -46497 -19348 13251 -7786 75968
11983G5968N4197l769j20799L1392J74836L7100q9818j32141l5880Q6035P1185
$$ 75968 130165 126396 5597 36989 211825 248925 159107 26966 -8914 77121 148306
11972A48306r5132j14760k3066K2760L2652p9433m0358J38568M4530J1021J8798
$$ 148306 53174 -61586 -84652 -61892 -29240 -108673 -149031 -10463 34067 45088 63886
11961F3886r676j8266j6048o3098M0869K8578j82607m2100r947O9736J01804l413
$$ 63886 54210 35944 19896 -43202 -2333 26245 -156362 -198462 -208409 -138673 -36869 -40282
11949d0282M8481O8297l8472J100R2604k2478n2796r892j6238M4027O0138q5118
$$ -40282 8199 76496 38024 39124 131728 109250 56454 46562 30324 74351 134489 49371
11937D9371k2886M3178L822J3560K8721O5983r3633p9350K2787m1008r7925p6852
$$ 49371 26485 69663 73485 87045 115766 181749 88116 8766 31553 -9455 -107380 -184232
11925a84232J08301J14355M097p0067J6795J09189M2753p0128r6859L6145J5097
$$ -184232 -75931 38424 42521 -27546 -10751 98438 141191 71063 -25796 10349 25446
11914B5446J3499P9842N1275J1162n2310O5969n8169m4384k2202M0534O821k3689
$$ 25446 38945 118787 170062 181224 128914 194883 136714 92330 70128 110662 117483 93794
11902I3794j9395L9658o618m5258o445q104j3220N601K8806J7202p5152j9775
$$ 93794 74399 114057 107439 62181 55736 47632 34412 40013 68819 86021 10869 -8906
11890h906N2124k4652O9941Q5662k4474o9345J4005l5337l7641k4416q3208J8699
$$ -8906 43218 18566 88507 174169 149695 80350 94355 59018 21377 -3039 -86247 -67548
11878f7548R9765j4801j2496K5761m164Q7190J19990O7547j16545j9568m7769
$$ -67548 32217 17416 4920 30681 26517 113707 233697 301244 184699 165131 117362
11867A17362O7032o537j8506p2719M1579m7064m7341k9636k8161M9766M7413N262
$$ 117362 184394 177857 159351 86632 128211 81147 33806 4170 -23991 25775 73188 78450
11855G8450o3357j28986j07642o0486J8914Q4958P6299O8445P2059j2260m1989
$$ 78450 15093 -113893 -221535 -282021 -263107 -178149 -101850 -33405 38654 26394 -15595
11844a5595o0337m678J13776J4855j9478J31362J73465K9435p5990l3878J6643
$$ -15595 -75932 -80610 33166 48021 28543 159905 333370 362805 286815 252937 269580
11833B69580k8278r8789q6544P3591j1635n4894O366M6059l6742J21575n1710
$$ 269580 241302 142513 55969 129560 117925 63031 69397 115456 78714 200289 148579
11822A48579N3861p1075o8677N3100m0512k9923p7996K1149J32301P6363j15359
$$ 148579 202440 131365 62688 115788 75276 45353 -32643 -11494 120807 197170 81811
11811H1811j22269j3008q6438Q2354J27136O1051j3538m6713M315k2823K6605
$$ 81811 -40458 -53466 -139904 -57550 69586 130637 117099 70386 74701 51878 78483
11800G8483q4371p9084m7574j34K63898J30688m3519m3017p5656n4882m5825j08480
$$ 78483 -5888 -84972 -132546 -132680 131218 261906 218387 175370 99714 44832 -993 -109473
11788a09473q1113l4315J83729Q008J9232K678j3525j7967J13998j9481J18135
$$ -109473 -190586 -224901 -41172 -33164 -13932 -11254 -24779 -42746 71252 51771 169906
11777A69906P8559M6804o113j94040j31074k3318M5434k5932N2396O6810l6830
$$ 169906 248465 295269 289156 95116 -35958 -59276 -13842 -39774 12622 79432 42602
11766D2602L5073P8542l3106r3163K5032o480l7808m5512J014O3020l6686n0261
$$ 42602 77675 156217 123111 29948 54980 48500 10692 -34820 -33806 29214 -7472 -57733
11754e7733n2483K6119j3035n5392J7755P9121Q3305n9039j9659p765L4569L8465
$$ -57733 -110216 -84097 -97132 -152524 -134769 -55648 27657 -31382 -51041 -58806 -24237 14228
11742A4228J48826k1499j64676p4026J21555L642J546r8200k5021P1967N6506
$$ 14228 163054 141555 -23121 -97147 24408 28050 29596 -68604 -93625 -21658 34848
11731C4848j8068R884N828R942l9451k670o7594J23973J01533n4338r3673N009
$$ 34848 16780 26664 32492 42434 2983 313 -67281 56692 158225 103887 10214 15223
11719A5223M8149n14J7335k5222j3877j3454K2675L7140o4097q5721o2766L9342
$$ 15223 63372 62858 80193 54971 41094 27640 50315 87455 23358 -62363 -125129 -85787
11707h5787K7818k064L0692m2230N0081J9366J1171K5784P5030Q3306m8482j12434
$$ -85787 -57969 -60033 -29341 -71571 -21490 -2124 9047 34831 109861 193167 144685 32251
11695C2251l4774P3076Q912P0537l459j8433m0456k062r3892O5061N0156P9432
$$ 32251 -2523 70553 79465 150002 146543 128110 87654 85592 -8300 56761 106917 186349
11683A86349n8547p6763j8543j7068m612M6555P8007J37024J2103r696J4073n8347
$$ 186349 127802 51039 32496 15428 10816 57371 135378 272402 284505 274809 288882 230535
11671B30535r7302l6731O0700M035j2094l6279J1255K8925O6245j16412n5854
$$ 230535 133233 96502 157202 161237 149143 112864 124119 153044 219289 102877 47023
11660D7023N0011o1706q1486l2103P0252m3361n5574n3913l8359N8847L8829R1871
$$ 47023 97034 35328 -46158 -78261 -8009 -51370 -106944 -160857 -199216 -140369 -101540 -9669
11648i669r11j5301N285O6179P6105J1429P843j2668p2823j4341j42493M0679
$$ -9669 -10580 -25881 -20596 45583 121688 133117 140960 128292 55469 41128 -101365 -60686
11636f0686K1635R6343n3602o4862P667m0457M9548o530M5885N8246l7908o2783
$$ -60686 -39051 57292 3690 -61172 -53505 -93962 -44414 -50944 -5059 53187 15279 -47504
11624d7504j19038N6522M1158K9859L3306Q6344N7422O89j27366l9912P2240R9145
$$ -47504 -166542 -110020 -68862 -39003 -5697 80647 138069 138758 11392 -28520 43720 142865
11612A42865k3298q7057o8615k0688N7320J4039J2473Q3146k4792k3939R0198
$$ 142865 119567 32510 -36105 -56793 527 14566 27039 110185 85393 61454 151652
11601A51652j3237n3627j38803L8557J66990L6868j01022o4671p3457k876O5964
$$ 151652 138415 84788 -54015 -15458 151532 188400 87378 22707 -50750 -53626 12338
11590A2338J9249j2435J1162j60928n5244J1025Q0918k6642M2278m594N809K5708
$$ 12338 31587 19152 30314 -130614 -185858 -174833 -93915 -120557 -78279 -82873 -77064 -51356
11578e1356l5595l505Q5544R4275Q8983J7093L984l3037o8956k6850K2021k0977
$$ -51356 -86951 -90456 -4912 89363 178346 195439 199423 166386 97430 70580 92601 71624
11566G1624j1402P1155k3358n2494o4457K5301R1007o787o9057L7205R2151p6802
$$ 71624 60222 131377 108019 55525 -8932 16369 107376 100589 31532 68737 160888 84086
11554H4086k6343J2444J8907P8096j5971m2874M0706K0592k860l043M9700m7904
$$ 84086 57743 70187 89094 167190 151219 108345 149051 169643 166783 163740 213440 165536
11542A65536N9134O478q2205j07068Q164Q6558M7802O1898j8259M6373J14996
$$ 165536 224670 231148 148943 41875 50039 136597 184399 246297 228038 274411 389407
11531C89407P1183n1202M7795R2799Q8920Q0122R9216R9984Q8508n480o018n8354
$$ 389407 460590 409388 457183 549982 638902 719024 818240 918224 1006732 1001252 995234 936880
11519I36880k25776m6244r9717j01535o2293p8630k18265M6441K04704l2621q5990
$$ 936880 711104 664860 565143 463608 401315 322685 104420 150861 355565 322944 236954
11508B36954p1372r7080N3055J1032j4923N1589M1165P8148J8908M3250R1592
$$ 236954 165582 68502 121557 132589 117666 169255 210420 288568 307476 350726 442318
11497D42318P2862n1656O1866J63006K04133J62677L0700J58397J28186J90573
$$ 442318 515180 463524 525390 688396 892529 1055206 1085906 1244303 1372489 1563062
11487A563062K45660J85020P3032j28981l12872l77149l13057j94020j84279j14471
$$ 1563062 1808722 1993742 2066774 1937793 1624921 1247772 934715 740695 556416 441945
11477D41945p4649q7309o5557L065J3876N2429j6439j58301J06476o490k7650
$$ 441945 367296 279987 214430 217495 231371 283800 267361 109060 215536 209046 181396
11466A81396J6393J1397Mn1711N7815M865p0508k4433J30970J8052Q4894J77325
$$ 181396 197789 209186 209190 157479 215294 220159 149651 125218 256188 274240 359134 536459
11454E36459J19895P6014J05184P0503M0658N2261K7467j79345k71562k30093
$$ 536459 656354 732368 837552 908055 948713 1000974 1028441 849096 577534 347441
11444C47441q8241O9335q8949j15282N4247J03579k3377p5031r557K6291l0243
$$ 347441 259200 328535 239586 124304 178551 282130 258753 183722 174165 200456 170213
11433A70213j23152J7588Q9687L9665J8478L462q5490j50330Q0810k7030N6122
$$ 170213 47061 64649 154336 194001 212479 215941 130451 -19879 60931 33901 90023
11422I0023j02508o0721P8743P3418L2960P9278K2061j02396r9077K0394m461
$$ 90023 -12485 -73206 5537 78955 111915 191193 213254 110858 11781 32175 27714
11411B7714P9479J05266k4998p9042K5124M3919P4694j59394n2349N2067J3510
$$ 27714 107193 212459 187461 108419 133543 177462 252156 92762 40413 92480 105990
11400A05990m5775L8497L6942K3377J1995p0278o1812l341M1499J6845O9414J48886
$$ 105990 60215 98712 135654 159031 171026 100748 38936 35595 77094 93939 163353 312239
11388C12239O9894l1875q8391m4216n0912r2463N30J24299N0396J8101n1044J8596
$$ 312239 382133 350258 261867 217651 166739 74276 74806 199105 249501 267602 216558 235154
11376B35154l3179n8343k5726J6318P5973K5844o1357k5433m8953k4225R1101
$$ 235154 201975 143632 117906 134224 210197 236041 174684 149251 100298 76073 167174
11365A67174R8242l6390k3016Q7838Q6789k0719j30994O0093l3111l3703J2587
$$ 167174 265416 229026 206010 293848 380637 359918 228924 289017 255906 222203 234790
11354B34790O5920P4713o0520q3968o8573O535R4661N8692q7466O3796M3907k9873
$$ 234790 300710 375423 314903 230935 162362 168897 263558 322250 234784 298580 342487 312614
11342C12614k22939q4799J7098k95j13625M4880Q0679J25081J42680j33227J3111
$$ 312614 89675 4876 21974 21679 -91946 -47066 33613 158694 301374 168147 181258
11331A81258l244K2749P3011K7718K3663l7144O4135O9483k7288j8522p3119l5658
$$ 181258 178014 200763 273774 301492 325155 288011 352146 421629 394341 375819 302700 267042
11319B67042r378m8072m3801l6019Q1208j7634J8238k5368o8870P74Q0263k897
$$ 267042 257664 209592 165791 129772 210980 193346 211584 186216 117346 118120 198383 195486
11307A95486K341j1238k5870j33331k6375R1320L1132P6966L93m6422r1763r587
$$ 195486 197827 186589 160719 27388 1013 92333 123465 200431 200824 154402 62639 53052
11295E3052L4963N5508P5146Q478Q0068J59712l6583k9908j00031Q982p5921K7705
$$ 53052 88015 143523 218669 227147 307215 466927 430344 400436 300405 309387 233466 261171
11283B61171J23396M3069l7110q5336l3712k8594j3548N3850m587L2746r8817
$$ 261171 384567 427636 390526 305190 271478 242884 229336 283186 278599 311345 212528
11272B12528q1496K695m4223j00667j6778K1555n6997r297J9562P917l9890K1999
$$ 212528 131032 133727 89504 -11163 -27941 -6386 -63383 -72680 -53118 -45201 -85091 -63092
11260f3092L1867K958P6019M4943J98115K1775j43316K375j4145p70J34997N3381
$$ -63092 -31225 -28267 47752 92695 290810 312585 169269 171644 157499 156729 291726 345107
11248C45107n1246L4122N6358R9170n9997m5767M3280r2110j1779n871m4028L650
$$ 345107 293861 327983 384341 483511 423514 377747 421027 328917 317138 311267 267239 270889
11236B70889m5474l5417J13459L3430j0910J21358q2020j28176j21658j08200
$$ 270889 225415 189998 303457 336887 325977 447335 365315 237139 115481 7281
11226G281j01654J9210Q0239J53104J6761J11426J53113J92850J12411k2942j75020
$$ 7281 -94373 -75163 5076 158180 174941 286367 439480 632330 744741 721799 546779
11215E46779j8299p1687L144l3487O2543n7845q8477k883O3858P3505J64890J50355
$$ 546779 528480 456793 459937 426450 488993 431148 342671 339788 403646 477151 642041 792396
11203G92396J58862k4864M708m7736m6725P3834J43228K9516j05195o9074J5170
$$ 792396 951258 926394 931102 883366 836641 910475 1053703 1083219 978024 908950 924120
11192I24120P105q7180k41923l8333J15488j3157q1935M1850R9935P0251M5296
$$ 924120 931225 844045 602122 563789 679277 666120 584185 626035 725970 796221 841517
11181H41517j7902Q6408k1006J8055L8685L9740J34859K9301J65571J05620L2701
$$ 841517 823615 910023 889017 907072 945757 985497 1120356 1149657 1315228 1420848 1453549
11170A453549J31150N5210J03931J06457O9064P1926R6393M0758m6781N3848M0783
$$ 1453549 1584699 1639909 1743840 1850297 1919361 1991287 2087680 2128438 2081657 2135505 2176288
11159B176288K9116M0746p1952n5222r2366m6232J60495L2672J2315J04622j7458
$$ 2176288 2205404 2246150 2174198 2118976 2026610 1980378 2140873 2173545 2185860 2290482 2273024
11148B273024L8627P9382J63231Q9042L627Q9863J25125O8207J68857J98730J01778
$$ 2273024 2311651 2391033 2554264 2643306 2646933 2736796 2861921 2930128 3098985 3297715 3399493
11137C399493J16106K00412K34727K93271K92219K76102M19938M12598M70638
$$ 3399493 3515599 3716011 3950738 4244009 4536228 4812330 5232268 5644866 6115504
11128F115504N32216O33634O06389M66134O07072P21576P71212R96667J320085
$$ 6115504 6647720 7281354 7887743 8353877 8960949 9682525 10453737 11450404 12770489
11119A2770489J269153J388349J650959K033112K664423L531795M591991O145316
$$ 12770489 14039642 15427991 17078950 19112062 21776485 25308280 29900271 36045587
11111C6045587Q636732J2538197J8416046K5839377L1727466L0497094J9460814
$$ 36045587 44682319 57220516 75636562 101475939 133203405 163700499 183161313
11104A83161313K949272j3485785k6362108l0743055k7128887k0390230j4243181
$$ 183161313 186110585 172624800 146262692 115519637 88390750 68000520 53757339
11097E3757339r477987o213665m056137k444603j675885j320690j127972j114842
$$ 53757339 44279352 38065687 34009550 31564947 29889062 28568372 27440400 26325558
11089B6325558j011209o01984j10432M73463J013654J471352J806874K183500
$$ 26325558 25314349 24712365 24601933 25075396 26089050 27560402 29367276 31550776
11081C1550776K702842L422670M461542O061861Q246102J1635881J6690630K4725280
$$ 31550776 34253618 37676288 42137830 48199691 56445793 68081674 84772304 109497584
11073A09497584L7121596N2105520O2236230N7371254L4938903J786101l0637109
$$ 109497584 146619180 198724700 260960930 318332184 353271087 355057188 324420079
11066C24420079n3736503o1188789n3548822m0142866k7942514j9144994j3105759
$$ 324420079 270683576 209494787 155945965 115803099 87860585 68715591 55609832
11059E5609832r054603o402752m564594l348718k473541k049999j813378j542568
$$ 55609832 46555229 40152477 35587883 32239165 29765624 27715625 25902247 24359679
11051B4359679j256173n94767J16068O13272P89785Q89111Q85332J082025J591847
$$ 24359679 23103506 22508739 22624807 23238079 24027864 24916975 25802307 26884332 28476179
11042B8476179K419247L505328N361916P947289J1461983J6977670K3701277K8822763
$$ 28476179 30895426 34400754 39762670 47709959 59171942 76149612 99850889 128673652
11034A28673652K6793023J5638103Q6483j5081399k6341528k9633126k5708800
$$ 128673652 155466675 171104778 171191261 156109862 129768334 100135208 74426408
11027G4426408j9226034j3411135r356907o442201m379898l160627k414085j923404
$$ 74426408 55200374 41789239 32432332 25990131 21610233 18449606 16035521 14112117
11019A4112117j531816j277051j268392r99488r65157j032026q85407p01752n31219
$$ 14112117 12580301 11303250 10034858 9035370 8070213 7038187 6152780 5451028 4919809
11010D919809l87117m17047k94513k92642k75953j91314r8377k38016j13839q7679
$$ 4919809 4532692 4115645 3821132 3528490 3252537 3061223 2962846 2724830 2610991 2523312
11000B523312j10382j90400o7929J284l0978j64546k23518j84674N9180O7081
$$ 2523312 2412930 2222530 2154601 2155885 2124907 1960361 1736843 1552169 1611349 1678430
10990A678430N1496N0574J11281q5740j86580j66098m8187N4716J49275j33466
$$ 1678430 1729926 1780500 1891781 1806041 1619461 1453363 1405176 1459892 1609167 1475701
10980A475701j49910R6593p994K4642k05043n7156L6275K85o7083r0387l3252
$$ 1475701 1325791 1422384 1414390 1439032 1233989 1176833 1213108 1213393 1146310 1055923 1022671
10969A022671M7994O5148M7105N8006O7251j40048N1571K0376k2448n5729m8116
$$ 1022671 1070665 1135813 1182918 1240924 1308175 1168127 1219698 1240074 1217626 1161897 1113781
10958A113781l1579l8144o6363j3229k2948q7388K6152J23240J84742K6913N4005
$$ 1113781 1082202 1044058 977695 964466 941518 854130 880282 1003522 1188264 1215177 1269182
10947A269182P5278j07489j34137Q559R9016P6742o9655m0406j10426j9521M0803
$$ 1269182 1344460 1236971 1102834 1111393 1210409 1287151 1217496 1177090 1066664 1047143 1087946
10936A087946Q737N9182K6854m1019j53550M583N3341j63442j44752N3761K6995
$$ 1087946 1096683 1155865 1182719 1141700 988150 992733 1046074 882632 737880 791641 818636
10925H18636l3231k2661o2302m3476L4201J3012k9533L5540l3227P0876K07391
$$ 818636 785405 762744 700442 656966 691167 704179 674646 710186 676959 747835 955226
10914I55226J33206J58633J22520m746J4970k9634j36150l8229p5531J1268k0509
$$ 955226 1088432 1247065 1369585 1364839 1379809 1350175 1214025 1175796 1100265 1111533 1091024
10903A091024o8629p0742N1568L2196r6086j11108j05299J9412j4806m7943q1013
$$ 1091024 1022395 951653 1003221 1035417 939331 828223 722924 742336 727530 679587 598574
10892E98574L8771J30557J0728j07339j22927n8003Q7353M3571j9245K1491l0482
$$ 598574 637345 767902 778630 671291 548364 490361 577714 621285 602040 623531 593049
10881E93049Q4443L3538O4546k4795O7839L2669J4622J7108J130o7611o8841k2327
$$ 593049 677492 711030 775576 750781 818620 851289 865911 883019 884149 816538 747697 725370
10869G25370j45033k7113L1821l8522m0085o4447n160P5980R3025R5337J28929
$$ 725370 580337 553224 585045 546523 506438 441991 436831 512811 605836 701173 830102
10858H30102L4128R468N0881J0752R3858q4986r969l3303N77k6130l0078n1956
$$ 830102 864230 873698 924579 935331 1029189 944203 934234 900931 901508 875378 845300 793344
10846G93344m5041O8805r4291K9742J35634k6414M4367J38086N656K5409R1244
$$ 793344 748303 817108 722817 752559 888193 861779 906146 1044232 1049888 1075297 1166541
10835A166541M6259l5147L9691J90148J11310J60827O8828p0006J26503N8987
$$ 1166541 1212800 1177653 1217344 1407492 1518802 1679629 1748457 1678451 1804954 1863941
10825A863941P0904j8027k0065K5617J71809J8637o6670j44815p7883M2925J02502
$$ 1863941 1934845 1916818 1896753 1922370 2094179 2112816 2046146 1901331 1823448 1866373 1968875
10814A968875j24326k8771j9135r7352o2986M7227O1372N4065n4114r52p8144
$$ 1968875 1844549 1815778 1796643 1699291 1636305 1683532 1744904 1798969 1744855 1743903 1665759
10803A665759l0552J21586K3317P6561Q049J11146O4441N4198m931j581p0933
$$ 1665759 1635207 1756793 1780110 1856671 1864720 1975866 2040307 2094505 2089574 2087993 2017060
10792B017060P6805J62129J61167m3273k4632J648J04905J6293K0316k8277M0971
$$ 2017060 2093865 2255994 2417161 2373888 2349256 2350904 2455809 2472102 2492418 2464141 2505112
10781B505112k6020m6532J19009J23242l032O8678J18961N7902k969J6762L0312
$$ 2505112 2479092 2432560 2551569 2674811 2671779 2740457 2859418 2917320 2914351 2931113 2961425
10770B961425J18338R5515P4307l5221P804R5969N9860Q0325J41843K8829J6749
$$ 2961425 3079763 3175278 3249585 3214364 3222168 3318137 3377997 3458322 3600165 3628994 3645743
10759C645743J22470R8065k2864J41410J57557K15386O4878K1273K45558L00448
$$ 3645743 3768213 3866278 3843414 3984824 4142381 4357767 4422645 4443918 4689476 4989924
10749D989924K93964L42453K96088J41298K17990K99499L46795K65619J62315
$$ 4989924 5283888 5626341 5922429 6063727 6281717 6581216 6928011 7193630 7355945
10740G355945K18541M59115N34481N49600N53285O40409P09673Q34333R02304
$$ 7355945 7574486 8033601 8568082 9117682 9670967 10311376 11021049 11855382 12757686
10731A2757686J086720J095013J294917J454748J630196J803409K143589K603366
$$ 12757686 13844406 14939419 16234336 17689084 19319280 21122689 23266278 25869644
10723B5869644K873679L312397L937221M805496N650508P035828Q670211J0708079
$$ 25869644 28743323 32055720 35992941 40798437 46448945 53484773 62154984 72863063
10715G2863063J3274010J6704779K1009321K5695063K9716829L1728767K9570741
$$ 72863063 86137073 102841852 123851173 149546236 179263065 210991832 240562573
10708B40562573K2395423J0765227k557748j4508244k2574986k5753608k5044563
$$ 240562573 262957996 273723223 271165475 256657231 234082245 208328637 183284074
10701A83284074k1554034j6816714j1976692p229172k793307J366895N085323
$$ 183284074 161730040 144913326 132936634 125707462 122914155 124281050 129366373
10694A29366373Q508021J1028515J2208417J1923336R651813O367096L042141
$$ 129366373 137874394 148902909 161111326 173034662 182686475 189053571 192095712
10687A92095712P42915J14146J674653N265952R924424J4922373J8885873K0525067
$$ 192095712 192838627 192952773 194627426 199893378 209817802 224740175 243626048 264151115
10679B64151115J8727481J3679834N352553m120338j2660838j8247629k0180358
$$ 264151115 282878596 296558430 301910983 297790645 285129807 266882178 246701820
10672B46701820j9035225j5329252j0495881o079293k827550j824756k839933
$$ 246701820 227666595 212337343 201841462 195762169 192934619 191109863 188269930
10665A88269930n197908q243768j0788452j2007129j1710997j0036418p272856
$$ 188269930 183072022 174828254 164039802 152032673 140321676 130285258 123012402
10658A23012402m056484o60280L151600P025624J1011795J4972691J8624428K1113391
$$ 123012402 118955918 118295638 121447238 128472862 139484657 154457348 173081776 194195167
10650A94195167K1401361J8234672J0890653P88903j0263575j9483580k5181885
$$ 194195167 215596528 233831200 244721853 245510756 235247181 215763601 190581716
10643A90581716k7105781k5849753k2754405j8904612j5435949j2229544r891277
$$ 190581716 163475935 137626182 114871777 95967165 80531216 68301672 58410395
10636E8410395p890786o518469n349250m372437l644909l151650k687460k402437
$$ 58410395 50519609 44001140 38651890 34279453 30634544 27482894 24795434 22392997
10628B2392997k000400j545878j323073j177338j163218q20581p80282p55163
$$ 22392997 20392597 18846719 17523646 16346308 15183090 14362509 13582227 12827064
10620A2827064n37373m81790m26240n61201m94643l36346l26149l31047k74139
$$ 12827064 12289691 11807901 11381661 10820460 10325817 9989471 9663322 9332275 9058136
10611I058136k30027k14802l38231j34383k18356k84039j85115j91420k53526
$$ 9058136 8828109 8613307 8275076 8140693 7922337 7638298 7453183 7261763 7008237
10602G008237j82186o2574r9405j37691l0718J25103K89179L30807M11468K74310
$$ 7008237 6826051 6763477 6664072 6526381 6495663 6620766 6909945 7240752 7652220 7926530
10592G926530J11087k58603n20371n06860l91260l52836l16917j88904j28590
$$ 7926530 8037617 7779014 7258643 6751783 6360523 6007687 5690770 5501866 5373276
10583E373276j10461j02822l8665l8875n6240k01381k60255j40433k04847j78436
$$ 5373276 5262815 5159993 5121328 5082453 5026213 4824832 4564577 4424144 4219297 4040861
10573D040861L2058Q2656O1367q2839L3429j10443m9116K0767K2112j63685O6336
$$ 4040861 4072919 4155575 4216942 4134103 4167532 4057089 4007973 4028740 4050852 3887167 3953503
10562C953503p7149n9534j55656r3168R865k1009N8357k5061m6722J9377j04675
$$ 3953503 3876354 3816820 3661164 3567996 3577861 3556852 3615209 3590148 3543426 3562803 3458128
10551C458128O335M8868o4378j60973q6125j60406k6024k6169j53661j40221j6792
$$ 3458128 3464463 3513331 3448953 3287980 3201855 3041449 3015425 2989256 2835595 2695374 2678582
10540B678582K5206P1469k8480l107K8626O6142L1092j6578n8571j42718j81608
$$ 2678582 2703788 2775257 2746777 2743670 2772296 2838438 2869530 2852952 2794381 2651663 2470055
10529B470055q5314n0449p1278J7460p2902j3663P874p0510k3127j41496K282
$$ 2470055 2384741 2334292 2263014 2280474 2207572 2193909 2201783 2131273 2108146 1966650 1968932
10518A968932K9064p9865q9440n9069l593l9821j07530N9956J26761j19443j71675
$$ 1968932 1997996 1918131 1828691 1769622 1766029 1726208 1618678 1678634 1805395 1685952 1514277
10507A514277l0794l5906l6266J08641J02724j78189k12535j60595l6907K8704
$$ 1514277 1483483 1447577 1411311 1519952 1622676 1444487 1231952 1071357 1034450 1063154
10497A063154r7985m8541J4344Q2300R9462M9723k5715q1538N5881P5415L6951
$$ 1063154 965169 916628 930972 1013272 1112734 1162457 1136742 1055204 1111085 1186500 1223451
10486A223451O6493l3616o7718j16111o4650r4447L5437n638l6362K7782P505
$$ 1223451 1289944 1256328 1188610 1072499 1007849 913402 948839 943201 906839 934621 942126
10475I42126K5311K2780j838l352n5682j27591j3079n087q2272m4216O2650J00586
$$ 942126 967437 990217 988379 985027 929345 801754 788675 783588 701316 657100 719750 820336
10463H20336J3361K6687n7531j764J10192R9130L0105n1780n6989j0914l6034
$$ 820336 833697 860384 802853 801089 911281 1010411 1040516 988736 931747 920833 884799
10452H84799l2290o8547M675m30K2577J15663N3577p0097N7067l3562j66891j6947
$$ 884799 852509 783962 788637 788207 810784 926447 980024 909927 966994 933432 766541 749594
10440G49594l2666m8247K0855l2002k0343O2494P7675o4124m4012Q88o6762j44464
$$ 749594 716928 668681 689536 657534 637191 699685 777360 713236 669224 670112 603350 458886
10428D58886K7430J24039M8898j26298m0950J3812j5577R5518J8635q975n81m0095
$$ 458886 486316 610355 659253 532955 492005 505817 490240 585758 604393 595418 594837 554742
10416E54742J4200P858n7259o8408Q509l7097R5860P3005j7301q4914m6988j14615
$$ 554742 568942 576800 519541 451133 459642 422545 518405 591410 574109 489195 442207 327592
10404C27592J08847k2151j5075N2486J9557r724n3940l909o3930m7873K6800N8645
$$ 327592 436439 414288 399213 451699 471256 461532 407592 403683 339753 291880 318680 377325
10392C77325P35k8562J0584L0893n8453J29407j4381n6072j25923k5213L3826
$$ 377325 378060 349498 360082 390975 332522 461929 447548 391476 265553 240340 274166
10381B74166P9825J2238O9454P2612q7475j22033l8467P3548O9658n1090J8159
$$ 274166 353991 366229 435683 508295 420820 298787 260320 333868 403526 352436 370595
10370C70595L0566r2187J05176q3025l3481j8663j2698o1155O7147K2498K4613
$$ 370595 401161 308974 414150 331125 297644 278981 266283 205128 272275 294773 319386
10359C19386Q8211J31349j1033l2474p1530l3865N4417j1420Q0980m3107K689
$$ 319386 407597 538946 527913 495439 423909 390044 444461 433041 514021 470914 473603
10348D73603j0988m5151O9039J04963j4467o8613n4057m5358j04877J2344l3402
$$ 473603 462615 417464 486503 591466 576999 508386 454329 408971 304094 316438 283036
10337B83036M8887P094Q9120l9682l4284L7454J72115O4782j55182o314l7773
$$ 283036 331923 339017 428137 388455 354171 391625 563740 628522 473340 467026 429253
10326D29253j30873m9505l182O8100j4406K4645L9728m3400l0248k2319J07045
$$ 429253 298380 248875 245693 313793 299387 324032 363760 320360 290112 267793 374838
10315C74838P2057K8453m5185K330o3372k694o8384r196N8359Q1506J532L2670
$$ 374838 446895 475348 430163 432493 369121 366427 298043 288847 347206 428712 430244 462914
10303D62914J9114l2891K2408k5215N4445N617j2141R9614O3478N2252K2399K9264
$$ 462914 482028 449137 471545 446330 500775 506392 494251 593865 657343 709595 731994 761258
10291G61258J41505J17719J13511J13052l0727P9363J58675P6492N740O1872P7480
$$ 761258 902763 1020482 1133993 1247045 1216318 1295681 1454356 1530848 1536588 1598460 1675940
10280A675940k3330j23405q9023j03131j07696j54541r7510k6063R4919m6987
$$ 1675940 1652610 1529205 1440182 1337051 1229355 1074814 977304 951241 1046160 999173
10270I99173J4809J36274J18198k4999M636Q5847M9542m2995R245r147m7922k8695
$$ 999173 1013982 1150256 1268454 1243455 1248091 1333938 1383480 1340485 1349730 1340583 1292661 1263966
10258A263966K0988J25700J07905J79951J10040J15582K724R6846k7655j31544
$$ 1263966 1284954 1410654 1518559 1698510 1808550 1924132 1926856 2023702 1996047 1864503
10248A864503q1995j24746j45064j39448K782N4551r5667r477J35002j7422j18150
$$ 1864503 1782508 1657762 1512698 1373250 1376032 1430583 1334916 1325439 1460441 1443019 1324869
10237A324869q4704j59853j59521n9869J50453O6165L141J72982O2675O7512N0009
$$ 1324869 1240165 1080312 920791 860922 1011375 1077540 1080681 1253663 1316338 1383850 1433859
10226A433859J99730J16843R7221N3680j6784r6498k23341j45850j54423j40509
$$ 1433859 1633589 1750432 1847653 1901333 1884549 1788051 1564710 1418860 1264437 1123928
10216A123928k4579k18664p0023r2157l2409p0587P9407J1149K3384p744J1727
$$ 1123928 1099349 880685 810662 718505 686096 615509 694916 706065 729449 721705 733432
10205G33432j5638j15701M9691N5801p7019l5938p9361j1443J76044M4198j43990
$$ 733432 717794 602093 651784 707585 630566 594628 515267 503824 679868 724066 580076
10194E80076n2702L1028J6967p2029L5776J29622k4893J5625m4538L0420J38282
$$ 580076 527374 558402 575369 503340 539116 668738 643845 659470 614932 645352 783634
10183G83634J81775l8705M5449m8735n8461q1153J7082j07336O8716k1926K4290
$$ 783634 965409 926704 972153 923418 864957 783804 800886 693550 762266 740340 764630
10172G64630J20924o8815p5786j8560L4942Q7695p313k0165Q0555J5879p6979
$$ 764630 885554 816739 740953 722393 757335 845030 837717 817552 898107 913986 837007
10161H37007l8103q4743O2137J22224K0073o2142R632K149m8961J16701k6793
$$ 837007 798904 714161 776298 898522 918595 856453 866085 868234 819273 935974 909181
10150I09181J3391L419j10885R383J22773m4934p5080Q721Q798M7423q0364q07
$$ 909181 922572 925991 815106 824489 947262 902328 827248 835969 844767 892190 811826 811019
10138H11019J21315P9228R2337P3833j20704o8955k5241L7597J24433K6825N4427
$$ 811019 932334 1011562 1103899 1177732 1057028 988073 962832 1000429 1124862 1151687 1206114
10127A206114P3139N112j3637n9676l3284k2772J04583o7159J2365r717M9467
$$ 1206114 1279253 1284365 1270728 1211052 1177768 1154996 1259579 1192420 1204785 1195068 1244535
10116A244535O2407N3971K3048r714n493n1680o2917p853O3726N1433K7666J03825
$$ 1244535 1306942 1360913 1383961 1374247 1368754 1317074 1254157 1246304 1310030 1361463 1389129 1492954
10104A492954k1248M3561M5730J6067L2032n6373o243M6026j19925M0925j2042
$$ 1492954 1471706 1515267 1560997 1577064 1609096 1552723 1546480 1592506 1472581 1513506 1501464
10093A501464J26371O7969J02120Q0404R7895o0863M4170n8236m7594L2657M1358
$$ 1501464 1627835 1695804 1797924 1878328 1976223 1915360 1959530 1901294 1853700 1886357 1927715
10082A927715k0130M3309J58722J39792m6416L4519O2146J15915M6167P5514L4889
$$ 1927715 1907585 1950894 2109616 2249408 2202992 2237511 2299657 2415572 2461739 2537253 2572142
10071B572142R0891j2550J7801j8773j285n8464N5906J33643J09086n476j29597
$$ 2572142 2663033 2650483 2668284 2649511 2648226 2589762 2645668 2779311 2888397 2882921 2753324
10060B753324J20886p791O4096N6730K04553J44077K4717J19785P6791Q3541n062
$$ 2753324 2874210 2866419 2930515 2987245 3191798 3335875 3360592 3480377 3557168 3640709 3635647
10049C635647l7363J26497K98823L63895O86428J081081Q91396K23841r3112m42330
$$ 3635647 3598284 3724781 4023604 4387499 5073927 6155008 7046404 7270245 7177133 6734803
10039F734803r41799o61659l95283j32285j74053j01214j8199n7030N7637k9093
$$ 6734803 5793004 5131345 4736062 4603777 4429724 4328510 4310311 4253281 4310918 4281825
10029D281825k1256n5797K4194M1615R3420R347j3850J57857k9226k0539j3296
$$ 4281825 4260569 4204772 4228966 4270581 4364001 4373348 4359498 4517355 4488129 4467590 4454294
10018D454294O0996N4856L3080j1980k584l2226l1909Q4864J9437N715j39958
$$ 4454294 4515290 4570146 4603226 4591246 4588662 4556436 4524527 4609391 4628828 4634543 4494585
10007D494585j3002O1640L1445L3650N3004L5272j4920j03171n5580m4608O115
$$ 4494585 4481583 4543223 4574668 4608318 4661322 4696594 4681674 4578503 4522923 4478315 4484430
9996D484430q5568J0072k936j23958q0367R526M6300n3440o0011J9181j50746
$$ 4484430 4398862 4408934 4405998 4282040 4201673 4211199 4257499 4204059 4144048 4163229 4012483
9985D012483q5090j10600l6939m9524o5546P2258n2117K7704J62367o3631n1769
$$ 4012483 3927393 3816793 3779854 3730330 3664784 3737042 3684925 3712629 3874996 3811365 3759596
9974C759596q8460j26635o7063L1949o3025k2437o7530o1136j48717j37392M5712
$$ 3759596 3671136 3544501 3477438 3509387 3446362 3423925 3356395 3295259 3146542 3009150 3054862
9963C054862N4351L2255r0617o3211N610l5114J5567j52729j13969L5554j2494
$$ 3054862 3109213 3141468 3050851 2987640 2993250 2958136 2973703 2820974 2707005 2742559 2730065
9952B730065j37219j39054j33782L8533J3567k311o269L2092j03224q6967L2799
$$ 2730065 2592846 2453792 2320010 2358543 2372110 2369799 2363530 2395622 2292398 2205431 2238230
9941B238230J0464o3670L1951J809m5721j41953j48423q7382j05333J09705L7741
$$ 2238230 2248694 2185024 2216975 2218784 2173063 2031110 1882687 1795305 1689972 1799677 1837418
9930A837418P564l8775j29780O3072J91711Q4614j80602p9997p7715r9549Q283
$$ 1837418 1844982 1806207 1676427 1739499 1931210 2015824 1835222 1755225 1677510 1577961 1586244
9919A586244M1242m953J11960o0439j38802K892L143q0595p8082o5699j30852
$$ 1586244 1627486 1622533 1734493 1674054 1535252 1538144 1541287 1460692 1382610 1316911 1186059
9908A186059J373O6912l0176n5373j07113m111P9697k881R640r0352o0573J2529
$$ 1186059 1187432 1254344 1224168 1168795 1061682 1057571 1137268 1134387 1144027 1053675 993102 1005631
9896A005631m9928k3454j4126l5520R6312J08828J1651l5757Q1656N2832j29968
$$ 1005631 955703 932249 918123 882603 978915 1087743 1099394 1063637 1145293 1198125 1068157
9885A068157j75337j50620J7149J02995J36742K6855q0427k9405N6474J00570
$$ 1068157 892820 742200 759349 862344 999086 1025941 945514 916109 972583 1073153
9875A073153k9128r1950o8487n2936j2177P9307r14k05307k3358L0805J06379
$$ 1073153 1044025 952075 883588 830652 818475 897782 896868 691561 668203 699008 805387
9864H05387L2987j33197m1879R2759N8500N599l1839P482n7267q57j7634m7828
$$ 805387 838374 705177 663298 756057 814557 820156 788317 795799 738532 737675 720041 672213
9852F72213n0473R9725R2932P0971k2384j56087j38452n4073m1028M0892q6542
$$ 672213 621740 721465 814397 885368 862984 706897 568445 514372 473344 514236 427694
9841D27694n5285l8967L2712O5787L1092j0671M6869J55470O819j01077r826k6916
$$ 427694 372409 333442 366154 431941 463033 452362 499231 654701 661520 560443 550617 523701
9829E23701p1680K2530M9852K8163N5665k0417L2180j71227q0381N3719K16488
$$ 523701 452021 474551 524403 552566 608231 587814 619994 448767 368386 422105 638593
9818F38593K00856r4637q2908N463J41240q8127l9193p7489q2326o8112j7855
$$ 638593 839449 744812 661904 667367 808607 720480 681287 603798 521472 453360 435505
9807D35505o2637J22227L854p459m6026j5780N5975J3274N9626P6903Q0979P6128
$$ 435505 372868 495095 498949 491490 445464 429684 485659 498933 558559 635462 716441 792569
9795G92569P6581J19640J24414J11349P4453J49986N61509R27420J614993K186364
$$ 792569 869150 988790 1113204 1224553 1299006 1448992 2010501 2937921 4552914 6739278
9785F739278J790878N62816l18446j547577k255602j662280j042546n81883l71313
$$ 6739278 8530156 9092972 8774526 7226949 4971347 3309067 2266521 1684638 1313325
9776A313325k56623k46100k70231j4024O2338j738j9302r4280K8910Q4842l2781
$$ 1313325 1056702 810602 540371 526347 588685 586947 567645 473365 502275 587117 554336
9765E54336j37411j32130J0266j8767L3149R7725J32136J35911M5569j51073j56433
$$ 554336 416925 284795 295061 276294 309443 407168 539304 675215 720784 569711 413278
9754D13278m8059j8948J25648J34827l1283M3898j07182q6745n8709o1782j6707
$$ 413278 365219 346271 471919 606746 575463 619361 512179 425434 366725 304943 288236
9743B88236R5850r9714j1277J22835L3899M0097l6131j10530M7074m0314R794
$$ 288236 384086 284372 273095 395930 429829 469926 433795 323265 370339 330025 339819
9732C39819p1751m8273J9531Q0350Q255m0769K8645R1111N1829m7343j08943l8437
$$ 339819 268068 219795 239326 319676 327931 287162 315807 406918 458747 411404 302461 264024
9720B64024K4522P2275l3437j75280N362R3488L8618j01986j259k9811L2081J46801
$$ 264024 288546 360821 327384 152104 157466 250954 289572 187586 186327 156516 188597 335398
9708C35398J6002o6903n131J50315L1230r2720o2377j2985J50209N1257Q8185
$$ 335398 351400 284497 279366 429681 460911 368191 305814 292829 443038 494295 582480
9697E82480o4849p0880j46690o9062p5700m1642O4418P0316L9007m6056j3085
$$ 582480 517631 446751 300061 230999 155299 113657 178075 248391 287398 241342 228257
9686B28257J19325n0345j4299m2142L3787j5328l8430k8671n1772k9927p269L6719
$$ 228257 347582 297237 282938 240796 274583 259255 220825 192154 140382 110455 103186 139905
9674A39905j3825k9442K7301J1027J8249o9915L5933K5903j28030O7379J50486
$$ 139905 126080 96638 123939 134966 153215 83300 119233 145136 17106 84485 234971
9663B34971M6077j49553k10669r8224J50855R5934R2293K8207r5221n8576L7855
$$ 234971 281048 131495 -79174 -177398 -26543 69391 161684 189891 94670 36094 73949
9652G3949k5746L3813J22353k8250p3480j03916Q5422J42081n743j15L4623n5936
$$ 73949 48203 82016 204369 176119 102639 -1277 84145 226226 220483 220368 254991 199055
9640A99055k7098o8932o2535j04845j28857L9613J72584J3233L651p9917q61J24893
$$ 199055 171957 103025 40490 -64355 -193212 -153599 18985 32218 35869 -44048 -44909 79984
9628G9984J42483Q461p8935q4803K3424N796m3485K6839L3367j1577J9269J03913
$$ 79984 222467 230928 151993 67190 90614 96410 52925 79764 113131 101554 120823 224736
9616B24736j04821n8100P5879Q7948j7525j17965N512J04072N4832O0222p2518
$$ 224736 119915 61815 137694 225642 208117 90152 95664 199736 254568 314790 242272
9605B42272j89574o4887M350P9478P2927q69K7516j524K0788K4639m137j1543
$$ 242272 52698 -12189 -7839 71639 144566 143697 171213 169689 190477 215116 210979 199436
9593A99436l699j8700j3713O031l5273k8905j5257o255P9690J29306O8602O6130
$$ 199436 195737 177037 163324 169355 134082 105177 89920 83665 163355 292661 361263 427393
9581D27393Q192j20362r6099n5341J6606n7359l4309P3088O130p4563j30988l6513
$$ 427393 435585 315223 219124 163783 180389 123030 88721 161809 167939 93376 -37612 -74125
9569g4125N062O6311J4324M6997j8053P3498K1546m9531j28257L6846P7664m6919
$$ -74125 -69063 -2752 11572 58569 40516 114014 135560 86029 -42228 -5382 72282 25363
9557B5363m9675N1985J9737m7476l1427O6178N6363N0759J36168n7936j27159
$$ 25363 -24312 27673 47410 -66 -31493 34685 91048 141807 277975 220039 92880
9546I2880j30961o3247j8980L5252N1608L3935R4651l5427N0641j2008n1457n1954
$$ 92880 -38081 -101328 -120308 -85056 -33448 487 95138 59711 110352 98344 46887 -5067
9534e067k2882R2874N2468J8468K3645l8973M9109n394l3900n2797m4879p6580
$$ -5067 -27949 64925 117393 135861 159506 120533 169642 164248 130348 77551 32672 -43908
9522d3908k2718j00188J36848R8108L9930N9189Q9244N4012n2996j50081N801
$$ -43908 -66626 -166814 -29966 68142 108072 167261 256505 310517 257521 107440 113241
9511A13241R3603J236j09558m7345o47m4969j12494j13858K6833J49854N6540
$$ 113241 206844 208080 98522 51177 50530 5561 -106933 -220791 -193958 -44104 12436
9500A2436k1343k9325m905Q4063k5573r568k7559M5669k3519l4412O5643P8905
$$ 12436 -8907 -38232 -43137 40926 15353 5785 -21774 23895 376 -34036 31607 110512
9488A10512M9043m5182r3455L2114n1535p5664l2542O7918K7271n7910k3482N8424
$$ 110512 159555 114373 20918 53032 1497 -74167 -106709 -38791 -11520 -69430 -92912 -34488
9476c4488R6828r171Q4885j53090m0061L6373l0763N606K12301O2137q1970l306
$$ -34488 62340 53169 138054 -15036 -55097 -18724 -49487 -43881 168420 230557 148587 145281
9464A45281L2506j32974k0345m01m0736k6067P7484K2326O9819M0279j2187j31165
$$ 145281 177787 44813 24468 24067 -16669 -42736 34748 57074 126893 167172 154985 23820
9452B3820l2043o856p7193J6675J2848o3209O9463o6748J86020Q3911M0669n6189
$$ 23820 -8223 -15079 -92272 -75597 -62749 -125958 -56495 -123243 62777 146688 187357 131168
9440A31168q9891N1498R9215r3174j3066J9087r4349o749K1432O1045m6729K1274
$$ 131168 41277 92775 191990 98816 85750 104837 10488 3739 25171 86216 39487 60761
9428F0761K001l1809O4967P1632O146q4333K362j8631j5109L5768R0766J6481
$$ 60761 62762 30953 95920 167552 173698 89365 91727 73096 57987 93755 184521 201002
9416B01002j5700M8710j15771j82330L3434K4818L8356L0740j01584n1932R9519
$$ 201002 185302 234012 118241 -64089 -30655 -5837 32519 63259 -38325 -90257 9262
9405I262J04965J5027M3660j0839p032p8864J17537R7759j05445j01417o6566
$$ 9262 114227 129254 172914 162075 155043 76179 193716 291475 186030 84613 18047
9394A8047J0236L6284O0510O327k2393L7099P6492k1977j30686q6116Q1746J10346
$$ 18047 28283 64567 125077 131404 109011 146110 222602 200625 69939 -16177 65569 175915
9382A75915m2136L0393L3819k6560j18515j5326K2403J31956R9655l9031j28417
$$ 175915 133779 164172 197991 171431 52916 37590 59993 191949 291604 252573 124156
9371A24156j66157O431R2256K2944O358N855j7585k6728p8956n4852K012P6423
$$ 124156 -42001 -35570 56686 79630 85988 91843 74258 47530 -31426 -86278 -84266 -7843
9359g843J36014m437M937P7199O493R288L656o3408l0185j049K9931p1467l0556
$$ -7843 128171 123734 128671 205870 212363 221651 225307 161899 131714 130665 160596 89129 58573
9346E8573l7853L6216R6533L6985l2637n095p6441k8454k6918L1961k262R2556
$$ 58573 20720 56936 153469 190454 157817 152722 76281 47827 20909 52870 50608 143164
9334A43164Q3566J5188j38533j68750K3277P7629L5241N55L4352K7987n5891j46671
$$ 143164 226730 241918 103385 -65365 -42088 35541 70782 71337 105689 133676 77785 -68886
9322f8886j4724P1148J02755R5770J1765m3327j14485R668J79158k4607j23995
$$ -68886 -83610 -12462 90293 186063 197828 154501 40016 49684 228842 204235 80240
9311H0240m4041m8788r8705K6266m638P3260J09303j360r6430o6762Q5810K4197
$$ 80240 36199 -12589 -111294 -85028 -89666 -16406 92897 91537 -4893 -71655 14155 38352
9299C8352l130k1902R2593O0164P4634k8740k3625Q5287j1106j05781o8882k266
$$ 38352 35222 13320 105913 166077 240711 211971 188346 273633 262527 156746 87864 85598
9287H5598n7539n527Q176q0993k3683R159P2789N3148O5494K3468j4988O229n3689
$$ 85598 28059 22532 30708 -50285 -73968 -64809 7980 61128 126622 150090 135102 141331 87642
9274H7642q4034K3411J12340N3556r1599o264Q7284N5207o0339O7645k739j49840
$$ 87642 3608 27019 139359 192915 101316 95052 182336 237543 177204 244849 242110 92270
9262I2270j31211o67N5503K7930k3475L3322j7450K2408n3115q3550R0490J11034
$$ 92270 -38941 -39608 15895 43825 20350 53672 36222 58630 5515 -78035 12455 123489
9250A23489o2536K8918L5612j1153k4797l5305j2965J24716K4430j46365j24751
$$ 123489 60953 89871 125483 114330 89533 54228 41263 165979 190409 44044 -80707
9239h0707Q5583N0854J38926J11836q1368j47558n9027K1194j06416j04537n6644
$$ -80707 4876 55730 194656 306492 225124 77566 18539 39733 -66683 -171220 -227864
9228b27864m3838J15804J39491Q3667O9715j1214M1284O8881n3874m313q718r3878
$$ -227864 -271702 -155898 -16407 67260 136975 125761 167045 235926 182052 177739 169021 75143
9216G5143j16119o2721M1848M3279N5522M9567n7330j03276P8758L8963J59548
$$ 75143 -40976 -103697 -61849 -18570 36952 86519 29189 -74087 4671 43634 203182
9205B03182Q8528M9173j30241p5088K2633m7592n9452j09908k1136l448m1642
$$ 203182 291710 340883 210642 135554 158187 110595 51143 -58765 -79901 -83349 -124991
9194a24991j1788P2921n2201p4582P8167M3834J4778m9168q1785n2584j25832
$$ -124991 -136779 -63858 -116059 -190641 -112474 -68640 -53862 -103030 -184815 -237399 -363231
9183c63231Q9898K04209K8763J0270P690K0972P4863J13230K6514q3569M1710
$$ -363231 -273333 -69124 -40361 -30091 -22401 -1429 73434 186664 213178 129609 171319
9172A71319J7564j69454o6835M7565J17588J9335j05255l7588O8896P233j9996
$$ 171319 188883 19429 -47406 159 117747 137082 31827 -5761 63135 70368 50372
9161E0372O22Q87q0515L7985l1732M8425O9133j399p6077k6002R1668K9395j04890
$$ 50372 50994 51881 -28634 9351 -22381 26044 95177 93778 17701 -8301 83367 112762 7872
9148G872n1903n7360N3090m772m8220r052K9930L4530P6763J1993n8712j1733
$$ 7872 -44031 -101391 -48301 -53073 -101293 -110345 -80415 -45885 30878 42871 -15841 -27574
9136b7574o555r2012O3053l1284J3538k2044j6669J5532R9284l5727k3231J2074
$$ -27574 -34129 -126141 -63088 -94372 -80834 -102878 -119547 -104015 -4731 -40458 -63689 -51615
9124e1615j8806J0476K9350N0313j7026m240r0252J0859P3063M6263j25910m945
$$ -51615 -70421 -59945 -30595 19718 2692 -1548 -91800 -80941 -7878 38385 -87525 -92470
9112i2470M9626q9224J02302M3740p218O225N6553j12922l7193J39353J29031
$$ -92470 -42844 -132068 -29766 13974 6756 12981 69534 -43388 -80581 58772 187803
9101A87803r2324K6381l7982j75015l2110M9955J0119r4164J1754J16930M767
$$ 187803 95479 121860 83878 -91137 -123247 -73292 -63173 -157337 -145583 -28653 -23886
9090b3886M8491K4301p5961j09936q9271Q4022J12967P9973k8352j41778M870
$$ -23886 24605 48906 -27055 -136991 -226262 -142240 -29273 50700 22348 -119430 -114560
9079a14560j4335j07640J2861J04437k6673Q5763K0499n7190J34740J48454j18391
$$ -114560 -128895 -236535 -223674 -119237 -145910 -60147 -39648 -96838 37902 186356 67965
9068F7965j51595M6863q684l2407P2498j8582j1660J12716O4531l3013K2795L2610
$$ 67965 -83630 -36767 -45451 -77858 -5360 -23942 -35602 77114 141645 108632 131427 164037
9056A64037l3124l1898n0333L9206n2364j2580N3322L2545m4902M8617q837J6648
$$ 164037 130913 99015 48682 87888 35524 22944 76266 108811 63909 112526 103689 120337
9044A20337l8962O0615L1337O1072J19125j31752p2268P6911n97j60598j8893
$$ 120337 81375 141990 173327 234399 353524 221772 149504 226415 225818 65220 46327
9033D6327K5849k4776n9772m8710J8005n8924J9159P9828K4277o6472o3934p494
$$ 46327 72176 47400 -12372 -61082 -43077 -102001 -82842 -3014 21263 -45209 -109143 -116637
9021a16637o6716l6890P3124L466m2927k2489l0896N9346k8705K7606J10943k7278
$$ -116637 -183353 -220243 -147119 -143653 -186580 -209069 -239965 -180619 -209324 -181718 -70775 -98053
9009i8053K8072P481o1183m6904n2779K6708N4247N0611j6936O0588R7772O3294
$$ -98053 -69981 -62500 -123683 -170587 -223366 -196658 -142411 -91800 -108736 -48148 49624 112918
8997A12918m7350j24706n1870N8275Q8618j256r5041n5050R8709k7714L3027P182
$$ 112918 65568 -59138 -111008 -52733 35885 34629 -60412 -115462 -16753 -44467 -11440 -4258
8985d258j17685R1699Q1888q5306j8202J10901O0098o1735L343P4143q0333N0478
$$ -4258 -121943 -30244 51644 -33662 -51864 59037 119135 57400 60743 134886 54553 105031
8973A05031N4251J9796m0224p9875N0737L85r1375r7720R600M6155Q8202o7905
$$ 105031 159282 179078 138854 58979 109716 110101 18726 -78994 -69394 -23239 64963 -2942
8961b942K5332P3534R7515j06961j6884L6223j2997K4428q2188j15464J9121N6580
$$ -2942 22390 95924 193439 86478 69594 105817 92820 117248 35060 -80404 -61283 -4703
8949d703M6462R3883L3272N4709Q751j5278K8329j22525q6973J27064O4894j69104
$$ -4703 41759 135642 168914 223623 232374 217096 245425 122900 35927 162991 227885 58781
8937E8781p4647m210r9389p2548j4843J62126K9173K4022K2312M1071P6407m2979
$$ 58781 -15866 -20076 -119465 -192013 -206856 -44730 -15557 8465 30777 71848 148255 105276
8925A05276j0231k511m3711M752p4229j3092q190J68400o8854j56480j03266K9996
$$ 105276 95045 92534 48823 53575 -20654 -33746 -41936 126464 57610 -98870 -202136 -172140
8913a72140j967j411n8550J5880O0626O3222P6119Q445K4744P795N880l0708k246
$$ -172140 -174107 -175518 -234068 -218188 -157562 -94340 -18221 -9776 14968 22763 28643 -2065 -4311
8900d311K2003P842j23492k4550J10232k8842j0920R1562O973J2901n8834k2879
$$ -4311 17692 25534 -97958 -122508 -12276 -41118 -52038 39524 46497 59398 564 -22315
8888b2315q153l9943l8421j7716J20101j2588m9n7282m9645k7167K6320k5607
$$ -22315 -30468 -70411 -108832 -126548 -6447 -19035 -19084 -76366 -126011 -153178 -126858 -152465
8876a52465J06446K3884j81189j8175J02919K06627M9727Q4194P0405m734m2873
$$ -152465 -46019 -22135 -203324 -221499 -118580 88047 137774 221968 292373 287639 244766
8865B44766K8858k6065l4874k439l08l7504j5381o4094n7617j02308J7851K2157
$$ 244766 273624 247559 212685 210246 209938 172434 157053 92959 35342 -66966 -49115 -26958
8853b6958q9916n389J34599N0177m3887q0645r0569p9685l092m7744M6097J27662
$$ -26958 -116874 -122263 12336 62513 18626 -62019 -152588 -232273 -235365 -283109 -237012 -109350
8841a09350K50704M9847k7105K1385j03701j61210r6085k8142j1232M691J52062
$$ -109350 141354 191201 164096 185481 81780 -79430 -175515 -203657 -214889 -210198 -58136
8830e8136J06079L7388M4429k5482r3051j01870j37343j8844J12229J07317Q2342
$$ -58136 47943 85331 129760 104278 11227 -90643 -227986 -246830 -134601 -27284 55058
8819E5058k285P5807L4704j0435l8616o7398j00792K6355N1584N6616O4674j188
$$ 55058 52773 128580 163284 152849 114233 46835 -53957 -27602 23982 80598 145272 144084
8807A44084R5766M7294o3625k12110j20402l3846L3152k7781N7171Q9522P6968
$$ 144084 239850 287144 223519 11409 -108993 -142839 -109687 -137468 -80297 9225 86193
8796H6193N77p6565j53499j7924O4538l2194j42M0277K7147P6894j239J9299O4530
$$ 86193 86770 10205 -143294 -161218 -96680 -128874 -129016 -88739 -61592 15302 14063 33362 97892
8783I7892j17j25253o3442M9821l8726J1521J38093O2748j69165n664J0100N078
$$ 97892 97775 -27478 -90920 -41099 -79825 -68304 69789 132537 -36628 -42292 -32192 -27114
8771b7114J20921J9311m7009q5102p1386r5417P2489L6123J2290o9382j23347
$$ -27114 93807 113118 66109 -18993 -90379 -185796 -113307 -77184 -64894 -134276 -257623
8760b57623m2521J2339J7936K7941l5322R6591Q1065N7297L0229p2171l0703M4632
$$ -257623 -300144 -287805 -269869 -241928 -277250 -180659 -99594 -42297 -12068 -84239 -114942 -70310
8748g0310j4009P9452O3727j1517L811q4771o0365N2435P7920j64617l9731L6545
$$ -70310 -84319 -4867 58860 47343 51154 -33617 -93982 -41547 36373 -128244 -167975 -131430
8736a31430N8526J82103L4697j39546M8587m7484p8619R3260j5767L5976O865
$$ -131430 -72904 109199 143896 4350 52937 5453 -73166 20094 4327 40303 47168
8725D7168P3745N7618J9071r3065o8983m7914k0627P4250P9242M7240j9548J1778
$$ 47168 120913 178531 197602 104537 35554 -12360 -32987 41263 120505 167745 148197 159975
8713A59975j17984j18010J2942N4790n087O2644K1743p9591j9305M561q46R2322
$$ 159975 41991 -76019 -63077 -8287 -13374 49270 71013 -8578 -27883 -23322 -24168 68154
8701F8154J6940n1101q6476o145J25501Q3136j30972j30941M464O4559J1568k113
$$ 68154 85094 33993 -52483 -58628 66873 150009 19037 -111904 -107440 -42881 -31313 -33426
8689c3426O2044J03944P5948k2523k3967o8983r2623j0773R1320j60589j46056
$$ -33426 28618 132562 208510 185987 162020 93037 414 -10359 80961 -79628 -225684
8678b25684Q3359r839M2253M3701L6085o7466m1369J04739P4698m6474n7555q7287
$$ -225684 -142325 -152164 -109911 -66210 -30125 -97591 -138960 -34221 40477 -5997 -63552 -150839
8666a50839J07435J11490m5159j16437q1289J7658J00384J60274K7065n3963n0194
$$ -150839 -43404 68086 22927 -93510 -174799 -157141 -56757 103517 130582 76619 26425
8655B6425P167J7822L6219j7710j13421N6741N5637m6006m6719o3282L4108j1222
$$ 26425 33592 51414 87633 69923 -43498 13243 68880 22874 -23845 -87127 -53019 -64241
8643f4241J0383O1693O0129k6447M0176J08310p9730k5567P1872k9841j31109
$$ -64241 -53858 7835 67964 41517 81693 190003 110273 84706 156578 126737 -4372
8632d372l7253J30N027L9257M8651j7873L5655L5403l5100k5484J8992M6462m4496
$$ -4372 -41625 -41495 -36468 2789 51440 33567 69222 104625 69525 44041 63033 109495 64999
8619F4999j1259K5962J34324r298q9808j5323p168N5137N4640m8913p6660r5478
$$ 64999 53740 79702 214026 204728 114920 99597 92429 147566 202206 153293 76633 -18845
8607a8845p768J25616K073q9278J4531L3357n8392j2870J1231J13088l3588N2827
$$ -18845 -26613 99003 101076 11798 26329 59686 1294 -11576 -345 112743 79155 131982
8595A31982o6490n0875J8318J06801K753j36249k9264Q6470L203M8249R0475n9136
$$ 131982 65492 14617 32935 139736 142489 6240 -23024 63446 66649 114898 205373 146237
8583A46237n5082O6156k2263P6802l8283r949q353q0662p7622q4898r8379P9173
$$ 146237 91155 157311 135048 211850 173567 163618 155265 74603 -3019 -87917 -186296 -107123
8571a07123N7880l2999Q5864J66827N4409q4549M6187o7555j18514j9877L6230
$$ -107123 -49243 -82242 3622 170449 224858 140309 186496 118941 427 -19450 16780
8560A6780K358M5551O5223q405p9737l8185M4670K9119q0826r1796N881P4264
$$ 16780 19138 64689 129912 121507 41770 3585 48255 77374 -3452 -95248 -89367 -15103
8548a5103N2467k9468p2830R5765M8917Q3115K3960j3831j93321j11477P0862
$$ -15103 37364 7896 -64934 30831 79748 162863 186823 172992 -20329 -131806 -60944
8537f0944n374K6175P7478M678r9834j902O7901k7009P6430K37J15079J13313
$$ -60944 -66318 -40143 37335 42013 -57821 -59723 8178 -18831 57599 57836 172915 286228
8525B86228n3701p4587r4221j3870j7765r6287n5452P3261J0397l3789L5625N7271
$$ 286228 232527 157940 63719 49849 32084 -64203 -119655 -46394 -35997 -69786 -34161 23110
8513B3110L7954J6550j66912j42475J31319P5064j6040J59470K3979j81101M5724
$$ 23110 61064 77614 -89298 -231773 -100454 -25390 -41430 118040 142019 -39082 6642
8502F642O7052N9253Q289r2870j1058l3955J0692L9751m1604q4632K1163N345
$$ 6642 73694 132947 141236 48366 37308 3353 14045 53796 12192 -72440 -51277 -45932
8490d5932R328q2847j41163J24278J43654N1002K8662L565q3287L5791J14367
$$ -45932 -36604 -119451 -260614 -136336 7318 58320 86982 90547 7260 43051 157418
8479A57418Q1591r9040L4700o8226q3159p3710p7669O3169J1970j0111N3929L784
$$ 157418 239009 139969 174669 106443 23284 -50426 -128095 -64926 -52956 -63067 -9138 -5354
8467e354L3517R1317N3065j39375k4621J14510L2648N5145n0265p4558R889L7023
$$ -5354 28163 119480 172545 33170 8549 123059 155707 210852 160587 86029 95918 132941
8455A32941p090j17963J30371J11376p1600j11588q7728j26956N6206N8799k3716
$$ 132941 125851 7888 138259 249635 178035 66447 -21281 -148237 -92031 -33232 -56948
8444e6948M8124j0151o6533k3140j1789j4420K2940L0887K383n7771O0579K5992
$$ -56948 -8824 -18975 -85508 -108648 -120437 -134857 -111917 -81030 -78647 -136418 -75839 -49847
8432d9847O3886L847j61530M302L4105k1037J007Q2387K10050J83j51499q7762
$$ -49847 14039 17886 -143644 -139342 -105237 -126274 -125267 -42880 167170 167353 15854 -71908
8420g1908m9448J4423M5745J23724O2616N0808J56710O3002p3656j01808q9573
$$ -71908 -121356 -106933 -61188 62536 125152 175960 332670 395672 322016 220208 130635
8409A30635m1109N6521j16074p0897l8395j9437J17412o4589k1298J2986K5572
$$ 130635 89526 146047 29973 -40924 -79319 -98756 18656 -45933 -67231 -54245 -28673
8398b8673J21140P3111q5409j3547P3498o4738r7091M445N83j2678P633O1493
$$ -28673 92467 165578 80169 66622 140120 75382 -21709 -17264 -16681 -29359 -21726 39767
8386C9767j4260o2201K7562n0481L138P0952J22125j26326r7919J32837p52j08977
$$ 39767 25507 -36694 -9132 -59613 -56475 14477 136602 10276 -87643 45194 44442 -64535
8374f4535j31234j2237n4086N9116L3719P3060l0042L0648R2661O0970k9405M3301
$$ -64535 -195769 -208006 -262092 -202976 -169257 -96197 -126239 -95591 -2930 58040 28635 71936
8362G1936L0439p483j76553k9848P5552m1515j7399K1286O3162O9445p4602r6526
$$ 71936 102375 94892 -81661 -111509 -35957 -77472 -94871 -73585 -10423 59022 -15580 -112106
8350a12106j2628P6818o6272k8180J38684L8200r1139J4823J04446M0880m9760
$$ -112106 -124734 -47916 -114188 -142368 -3684 34516 -56623 -41800 62646 103526 53766
8339E3766n0180K6508O2912P0814M4132j05313j13924o6353n4715j3637R8673
$$ 53766 3586 30094 93006 163820 207952 102639 -11285 -77638 -132353 -145990 -47317
8328d7317J29198k8135j02029n654n30j0346L7042j2620l9038M1233J08723k1237
$$ -47317 81881 53746 -48283 -53937 -54467 -64813 -27771 -40391 -79429 -38196 70527 49290
8316D9290j68224p9791N3563J4363J69664J18216k9686j96077j33324P6661K03211
$$ 49290 -118934 -198725 -145162 -130799 38865 157081 127395 -68682 -202006 -125345 77866
8305G7866j7643j02114n6311k0776m4978j3739j8513J03340K60379M4982j55337
$$ 77866 60223 -41891 -98202 -118978 -163956 -177695 -196208 -92868 167511 212493 57156
8294E7156j37178n6295L7104l0434J07455Q0529J10067n5438j35445r3570M6627
$$ 57156 -80022 -136317 -99213 -129647 -22192 58337 168404 112966 -22479 -116049 -69422
8283f9422p2665J4295J60987L5062R179M1021j6180j28482j76829j05146L381
$$ -69422 -142087 -127792 33195 68257 77436 118457 102277 -26205 -203034 -308180 -304799
8272c04799J16127J41687P5024L912k0436l4304j4778o3790k6561O9059R9848
$$ -304799 -188672 -46985 28039 31951 11515 -22789 -37567 -101357 -127918 -58859 40989
8261D0989P7479m829n7939N868r7461Q697N9083n2997j68284j44276P5621J12042
$$ 40989 118468 113639 55700 61568 -35893 -27196 31887 -21110 -189394 -333670 -258049 -146007
8249a46007J7758q3437m1355J66553J43136N0458K4827l1194n5514l335J35602
$$ -146007 -128249 -211686 -253041 -86488 56648 107106 131933 100739 45225 41890 177492
8238A77492R9486n5771o0860l7324j7075l046m408n6090K0542j2257n8242J35660
$$ 177492 276978 221207 160347 123023 105948 102902 98494 42404 62946 50689 -7553 128107
8226A28107J0144l3595j08947N1226R180j58470q936q40j5223J56313J83230n9006
$$ 128107 138251 104656 -4291 46935 56115 -102355 -111291 -112131 -127354 28959 212189 153183
8214A53183j11124q142J433k6374K0979L5879j36724j00527Q415R9689K7597L8506
$$ 153183 42059 33917 35350 8976 29955 65834 -70890 -171417 -163002 -63313 -35716 2790
8202B790k6689m2956R544J51678N9588q2826j3815j78031l3840J08974J16128
$$ 2790 -23899 -66855 -57311 94367 153955 71129 57314 -120717 -154557 -45583 70545
8191G0545k0799M685j623l3899L952k6808l5990k8043K3627Q9069r7308n4126
$$ 70545 49746 54431 52808 18909 22861 -3947 -39937 -67980 -44353 44716 -52592 -106718
8179a06718Q687J6617l2444R5121J19086J6819o7918J01906K8529M0775N5956
$$ -106718 -98031 -81414 -113858 -18737 100349 117168 49250 151156 179685 220460 276416
8168B76416j62044k39719o6282Q4704P9269P9049l9004q6469J76047j92r672m723
$$ 276416 114372 -125347 -191629 -106925 -27656 51393 12389 -74080 101967 101775 92103 87380
8156H7380J7142r4275j52970j8381K6365r951O11K0145M3007L0113q078N467L4962
$$ 87380 104522 10247 -142723 -161104 -134739 -144690 -144079 -123934 -80927 -50814 -58892 -53425 -18463
8143a8463Q0085j06404p9572P9570L5716m156M2214Q5790m4822n112M776k2513
$$ -18463 61622 -44782 -124354 -44784 -9068 -13224 28990 114780 69958 64846 69622 47109
8131D7109j10081j8660k5268l7471Q4113J39396M3331k1081p1745k6916N690J02967
$$ 47109 -62972 -81632 -106900 -144371 -60258 79138 122469 101388 29643 2727 8417 111384
8119A11384l4693p7346j0421j6857L7755l5048N5730J29270j8455r2055r6794
$$ 111384 76691 -655 -11076 -27933 9822 -25226 30504 159774 141319 49264 -47530
8108d7530k8748N0615Q1724N5216m6162j68390l6335M3166J9741P7039K5629Q5820
$$ -47530 -76278 -25663 56061 111277 65115 -103275 -139610 -96444 -76703 336 25965 111785
8096A11785J31938j21766j46870q4240K4073R8659M6776L0283J7593L4544j2120
$$ 111785 243723 121957 -24913 -109153 -85080 13579 60355 90638 108231 142775 130655
8085A30655j48254j98595O0155N316l1760J31861K10390p2082j27746Q7906P35
$$ 130655 -17599 -216194 -156039 -150723 -182483 -50622 159768 87686 -40060 47846 48581
8074D8581r8107J4999N1413J00341J6969p448n8865n0514q083M9051m2242r3784
$$ 48581 -49526 -34527 16886 117227 134196 126748 67883 17369 9286 58337 16095 -77689
8062g7689m6440J18472k7615k9923J10774L6279j1923N6397M0187j07508q6227
$$ -77689 -124129 -5657 -33272 -63195 47579 83858 71935 128332 168519 61011 -25216
8051b5216N252m0073n4360P722R3027P2526p320O2853p804q4889M0556j4317m53
$$ -25216 -19964 -60037 -114397 -106675 -13648 58878 51558 114411 106607 21718 62274 47957 47504
8038D7504p2215n2577L8562J3786N1906j1056m9609O33K2710K2228k1519O6583
$$ 47504 -24711 -77288 -38726 -24940 26966 15910 -33699 -33066 -10356 11872 -9647 56936
8026E6936l15r8623k1805j07802J44391J65368r352K6085m9782o6043P1006J7073
$$ 56936 56621 -42002 -63807 -171609 -27218 138150 128798 154883 105101 39058 110064 127137
8014A27137K625Q8673N6108M3532r2757j44717k1364P7493N8159q0670j86560
$$ 127137 129762 218435 274543 318075 225318 80601 59237 136730 194889 114219 -72341
8003g2341K0892J35210Q0304N8291o3575l1590m9068N094J5808J6296K9664p3636
$$ -72341 -51449 83761 164065 222356 158781 127191 78123 83217 99025 115321 144985 71349
7991G1349j10672r832P0941N2038M3032l5377j30923K2376R3825R6052M2116j14081
$$ 71349 -39323 -49155 21786 73824 116856 81479 -49444 -27068 66757 162809 204925 90844
7979I0844n1163j22614l7992j3853P5507J26429O0907q6950r4603l2331j3029
$$ 90844 39681 -82933 -120925 -134778 -59271 67158 128065 41115 -53488 -85819 -98848
7968i8848L9722O0302O471L929m3414q7568n0221J26129n332l3234J4223k5383
$$ -98848 -59126 1176 7647 11576 -31838 -119406 -169627 -43498 -48830 -82064 -67841 -93224
7956i3224m2455R8651Q5327j03555k6253j9183L6992L5862R0047M2716N939K254
$$ -93224 -135679 -37028 48299 -55256 -81509 -100692 -63700 -27838 62209 104925 110864 113118
7944A13118n5080m1779J45929M3768q0106j7444O9548l3721k6884m3085O3319
$$ 113118 58038 16259 162188 205956 125850 108406 177954 144233 117349 74264 137583
7933A37583l5564J1275M6519K8194o9668r5998r2297j1225m3164L8641O6676K2541
$$ 137583 102019 113294 159813 188007 118339 22341 -69956 -81181 -124345 -85704 -19028 3513
7921C513Q8128o4537j70896r1635J07568l463m2246j0878p370L9396J60981L2000
$$ 3513 91641 27104 -143792 -235427 -127859 -131322 -173568 -184446 -191816 -152420 8561 40561
7909D0561J3649N3779N3713q2715K1649k2183p7044m9046k1557L8010J97063R3111
$$ 40561 54210 107989 161702 78987 100636 78453 1409 -47637 -69194 -31184 165879 258990
7897B58990p4854j88303L0036J2041M2735J5059M0268m3511q9031J0420L0657
$$ 258990 184136 -4167 25869 37910 80645 95704 135972 92461 3430 13850 44507
7886D4507l1104j2192K6088p4025j10423L448J68755J44728J16467n6407j32965
$$ 44507 13403 1211 27299 -46726 -157149 -153701 15054 159782 276249 219842 86877
7875H6877m6344k7484O1165j4501P6586l3867M0646j7279k5531j1734j57313p4600
$$ 86877 40533 13049 74214 59713 136299 102432 143078 125799 100268 88534 -68779 -143379
7863a43379J82481J06349r4779J3814l4995L6414N1322P141r4414j16010O7297
$$ -143379 39102 145451 50672 64486 29491 65905 117227 124368 29954 -86056 -18759
7852a8759O2375J72508R9217l7781j04889q2944p3071R8186M2131o2717o3754
$$ -18759 43616 216124 315341 277560 172671 89727 16656 114842 156973 94256 30502
7841C0502J17707K9931J9609m3586j6972k6471M3278l1739q1348l7727j3953j02630
$$ 30502 148209 178140 197749 154163 137191 110720 153998 122259 40911 3184 -10769 -113399
7829a13399J1288M8381N7139l4486N27J9901k3091j9007J23893p2490o6017l3194
$$ -113399 -102111 -53730 3409 -31077 -30550 -10649 -33740 -52747 71146 -1344 -67361 -100555
7817a00555n1845R8306J07225K6845p0525j50971J613r558k5444p217m4504N5525
$$ -100555 -152400 -54094 53131 79976 9451 -141520 -139907 -149465 -174909 -182126 -226630 -171105
7805a71105N9869R4843L4477N7550k5133R8599M5695m1224m1304p613J6481l0440
$$ -171105 -111236 -16393 18084 75634 50501 149100 194795 153571 112267 104654 121135 90695
7793I0695j05128l465k755M459k7851M1091p6597N1852J5403m9M7509o3240j00977
$$ 90695 -14433 -17898 -20653 -16194 -44045 -2954 -79551 -27699 -12296 -12345 35164 -28076 -129053
7780a29053j42049J26855J54972R5749k9953r3126K1302J7427P4997o4526n1009
$$ -129053 -271102 -144247 10725 106474 76521 -16605 4697 22124 97121 32595 -18414
7769a8414j8467k8967N4781N482k4601r763k9612L4078J00578p2594m4870j1238
$$ -18414 -36881 -65848 -11067 -5585 -30186 -39949 -69561 -35483 65095 -7499 -52369 -63607
7757f3607L284p9508j4480M0159J0067K0988j11545k938R1553M8347j22601j12771
$$ -63607 -60323 -139831 -154311 -114152 -104085 -83097 -194642 -197580 -106027 -57680 -180281 -293052
7745b93052J56809K2668k2695J07226J16797O6197j08562r3819j5550M4833j9769
$$ -293052 -136243 -113575 -136270 -29044 87753 153950 45388 -48431 -63981 -19148 -38917
7734c8917n7355n8989p555J70417J82404n78j73392o1313O0135l3663j7837r5227
$$ -38917 -96272 -155261 -162816 7601 190005 189427 16035 -45278 14857 -18806 -36643 -131870
7722a31870Q3887Q1982J2582l4357J18048j6069j18398l1543P03r384p8272O9592
$$ -131870 -47983 33999 46581 12224 130272 114203 -4195 -35738 -35035 -44419 -122691 -53099
7710e3099p4601k9139L5100O4653K7147M5115j19514O2426N8547K0300J5065p8940
$$ -53099 -127700 -156839 -121739 -57086 -29939 15176 -104338 -41912 16635 36935 52000 -26940
7698b6940q4890k6193Q5704K0762j0665L9215m1779R849L8717N9956O1029l9280
$$ -26940 -111830 -138023 -52319 -31557 -42222 -3007 -44786 -34937 3780 63736 124765 85485
7686H5485o9725P1952k8834j20132j09603j8239P2820J50837M6529k1075r0050
$$ 85485 15760 87712 58878 -61254 -170857 -189096 -116276 34561 81090 60015 -30035
7675c0035j36537o0907m0331J52932K10848M3567j65201k1982k0211R9632M5338
$$ -30035 -166572 -227479 -267810 -114878 95970 139537 -25664 -47646 -67857 31775 77113
7664G7113m7922j6008J2372J51280k3249j93138k16506j5285J30323P7992l1082
$$ 77113 29191 13183 25555 176835 153586 -39552 -256058 -271343 -141020 -63028 -94110
7653i4110J18164O6463N2247k8176Q073O8740L2990j09064j59119j28928p2559
$$ -94110 24054 90517 142764 114588 122661 191401 224391 115327 -43792 -172720 -245279
7642b45279o535Q6088J79358j5887p5228O2413j7898p1727L0121N495R3828K3146
$$ -245279 -251814 -165726 13632 -2255 -77483 -15070 -32968 -104695 -74574 -69079 24749 47895
7630D7895m6154N553P2485N3872r4638r4566j25493p0431J2958k5271J16921J08971
$$ 47895 1741 7294 79779 133651 39013 -55553 -181046 -251477 -238519 -263790 -146869 -37898
7618c7898q786J2509K2036k7170O595N2705J2016J25008J10029j34547q2299j70622
$$ -37898 -46684 -34175 -12139 -39309 -32714 19991 32007 157015 267044 132497 50198 -120424
7606a20424L6531J6869J60484M3757j68129J9919j1342O0816L4069O8414m3549
$$ -120424 -83893 -67024 93460 137217 -30912 -10993 -22335 38481 72550 140964 97415
7595I7415j11164J4767K5478n4113p4621N6978J19663N3935k4180n5095o579P8595
$$ 97415 -13749 1018 26496 -27617 -102238 -45260 74403 128338 104158 49063 42484 121079
7583A21079R1569p1118r8850j12921l6664j0759M8116Q244M1481P7903K8148m6888
$$ 121079 212648 141530 42680 -70241 -106905 -117664 -69548 -61304 -19823 58080 86228 39340
7571C9340o7290j0371k6585O955P9909M5264P7475L1307n7418q3041k8611j01632
$$ 39340 -27950 -38321 -64906 -57951 21958 67222 144697 176004 118586 35545 6934 -94698
7559i4698M6879m8524n6390J12349j2877k3686J4110M7365l7901m0940P60J5211
$$ -94698 -47819 -96343 -152733 -40384 -53261 -76947 -62837 -15472 -53373 -94313 -93553 -78342
7547g8342J02202P5742l5668k7195o2247J6260k6643j45320J8435Q2647j27573
$$ -78342 23860 99602 63934 36739 -25508 -9248 -35891 -181211 -162776 -80129 -207702
7536b07702j1394l2691P8198K3134K2795J9052m1883j4836J46888P0113k3153
$$ -207702 -219096 -251787 -173589 -150455 -127660 -108608 -150491 -165327 -18439 51674 28521
7525B8521j33061O4570J11919l6925q0092n8705r033K32P5885R3968j4902n7500
$$ 28521 -104540 -39970 71949 35024 -45068 -103773 -112806 -112574 -36689 57279 42377 -15123
7513a5123P9997J46623q519j07041K0647l0665p4740L883K5712j2386o3162p2306
$$ -15123 64874 211497 202978 95937 116584 85919 11179 15062 40774 28388 -34774 -107080
7501a07080P1796Q3470M5097j4269l7824q1980j9692J6803M6030j1733M9396N0583
$$ -107080 -35284 48186 93283 79014 41190 -40790 -60482 -43679 2351 -9382 40014 90597
7489I0597m4111k0877Q2727q3870j60468j4500K19013j4464n743j841Q2437m6388
$$ 90597 46486 25609 108336 24466 -136002 -150502 68511 54047 48304 46463 128900 82512
7477H2512l4988O092p5200r9404m9215J01875N8437p7434P613J52491J12908o3818
$$ 82512 47524 53616 -21584 -120988 -170203 -68328 -9891 -87325 -79712 72779 185687 121869
7465A21869j19021j3835R6999p4388p5594j0711P5031N3709J6406n9299j7719
$$ 121869 2848 -10987 86012 11624 -63970 -74681 350 54059 70465 11166 -6553
7454f553M4901R4964q3711o6285n1849J7987Q0551p55m2226N4166K3850N9537
$$ -6553 38348 133312 49601 -16684 -68533 -50546 30005 29250 -12976 41190 65040 124577
7442A24577L2700p8374q9574O4664J67240N8004j65560j43915p5809J42596l1256
$$ 124577 157277 78903 -10671 53993 221233 279237 113677 -30238 -106047 36549 5293
7431E293p2647N3996K2298n9518n2083k7016O8975N8671r8975l1769O5326J36173
$$ 5293 -67354 -13358 8940 -50578 -102661 -129677 -60702 -2031 -101006 -132775 -67449 68724
7419F8724O8397k4836r9171o9495o918O303K056K7602o3765k4753j04184N189
$$ 68724 137121 112285 13114 -56381 -63299 -56996 -54940 -27338 -91103 -115856 -220040 -214851
7407b14851L8924P0075J31901L3059n5479L8043O4960p5196l8230m282j05576
$$ -214851 -175927 -105852 26049 59108 3629 41672 106632 31436 -6794 -11076 -116652
7396a16652J7803M6943J16965J031m9392m8065r7275K0672J0084k8989K659j02471
$$ -116652 -98849 -51906 65059 66090 16698 -31367 -128642 -107970 -97886 -126875 -124216 -226687
7384b26687O6126P7207j2311P3646Q4204k1122q9671m6696p0472l6793J83069
$$ -226687 -160561 -83354 -95665 -22019 62185 41063 -48608 -95304 -165776 -202569 -19500
7373a9500J3669j21166m5833O9163M0172n1724N9609N8251N5716p1365j38015
$$ -19500 -5831 -126997 -172830 -103667 -63495 -115219 -55610 2641 58357 -13008 -151023
7362a51023L96n7012L4643J28547n8220j14221L0166l8140L7386K5775L4581J8732
$$ -151023 -150627 -207639 -172996 -44449 -102669 -216890 -186724 -224864 -187478 -161703 -127122 -108390
7350a08390J3850k2267J05764q452L6781k7808n9585K5161M298K7969N5395L8357
$$ -108390 -94540 -116807 -11043 -19495 17286 -10522 -70107 -44946 -40648 -12679 42716 81073
7338H1073l5251j40117P9289M4746o388L4567P1805j3388j22834n5863n5632J34150
$$ 81073 45822 -94295 -15006 29740 23352 57919 129724 116336 -6498 -62361 -117993 16157
7326A6157l3053k10701j5897R8101Q0776O2884k6359j04285k0890J06855j7225
$$ 16157 -16896 -227597 -243494 -145393 -64617 -1733 -28092 -132377 -153267 -46412 -63637
7315f3637j87606o7121J48401J70640J36976k9662j25489L2652J51587Q1501p8077
$$ -63637 -251243 -318364 -169963 677 137653 107991 -17498 15154 166741 248242 170165
7304A70165j27183p6181k3468P7669Q2148m3495j08158k10451J29344J31171L7837
$$ 170165 42982 -33199 -56667 21002 103150 59655 -48503 -258954 -129610 1561 39398
7293C9398M2652J1700l8775j8877Q4444l7879j26656j6178k8245k2719O0958L3035
$$ 39398 82050 93750 54975 36098 120542 82663 -43993 -60171 -88416 -111135 -50177 -17142
7281a7142j6451P7646N4226l8083K6193m3421r3980n6154R9358N3370P0820N832
$$ -17142 -33593 44053 98279 60196 86389 42968 -51012 -107166 -7808 45562 116382 122214
7269A22214O1836j30829j32910j8587J6601P7182J13700N8271q1161q8115O5420
$$ 122214 184050 53221 -79689 -98276 -81675 -4493 109207 167478 86317 -1798 63622
7258F3622k0404l0316M3852O208l827k709n2254n3686l5991P8341p597l6214j0032
$$ 63622 43218 12902 56754 62962 59135 56426 4172 -49514 -85505 -7164 -14761 -50975 -61007
7245f1007m5159J37244N3053n7317j76720o0252J69584J06029p5426k780m6684
$$ -61007 -106166 31078 84131 26814 -149906 -210158 -40574 65455 -9971 -12751 -59435
7234e9435m6189K9677Q7018Q6257L3012q3702q7623j0998p0877r9427n3061J04428
$$ -59435 -105624 -75947 11071 97328 130340 46638 -40985 -51983 -122860 -222287 -275348 -170920
7222a70920P2997p14J10754K51713J7350k33930J0563J0022j7206N8502N8751
$$ -170920 -97923 -98637 12117 263830 281180 47250 57813 67835 50629 109131 167882
7211A67882p2743J12024n5317r9349l1328p1908M0827j2047m7682k12888K4032
$$ 167882 95139 207163 151846 52497 21169 -50739 -9912 -21959 -69641 -282529 -258497
7200b58497J08074O7707R7853Q6264j8282O6K8652J39416J1646r9776n0849j26395
$$ -258497 -150423 -82716 15137 101401 83119 83185 111837 251253 262899 163123 112274 -14121
7188a4121L8839M6992j6643j3347K9504J15984r8969j20135M5131O8072o9074
$$ -14121 24718 71710 55067 41720 71224 187208 88239 -31896 13235 81307 12233
7177A2233o4985q3287J16076K1963r2547M3837J47652n0132j42153j6440l2103
$$ 12233 -52752 -136039 -19963 2000 -90547 -46710 100942 50810 -91343 -107783 -139886
7166a39886k6175L1090N3487J4413r77J9475l0135m795Q1373N7120r4792O3057
$$ -139886 -166061 -134971 -81484 -67071 -68048 -48573 -78708 -83503 -2130 54990 -39802 23255
7154B3255M2698N0570J36706M2815j06098m8435q7595j47030J09R1296K9600n0020
$$ 23255 65953 116523 253229 296044 189946 141511 53916 -93114 -93005 -1709 27891 -22129
7142b2129o2805p6930O3729k7305O6913J39597J46404R2034m5172j00990k13819
$$ -22129 -84934 -161864 -98135 -125440 -58527 81070 227474 319508 274336 173346 -40473
7131d0473p7354l8607k6430R939L2247Q16m4895N1883J05087J07067M5543J0132
$$ -40473 -117827 -156434 -182864 -172925 -140678 -139862 -184757 -132874 -27787 79280 124823 134955
7119A34955q7221o0936o2125J8364o7194Q163j3496j26818J0663J38779M5126
$$ 134955 47734 -13202 -75327 -56963 -124157 -115994 -129490 -256308 -245645 -106866 -61740
7108f1740m476n6812K4129o257J4773j29857L7234N0077l2113p0957O8119p5274
$$ -61740 -66216 -123028 -98899 -105156 -90383 -220240 -183006 -132929 -165042 -235999 -167880 -243154
7096b43154M1289J61392M6683m5264J8680r108l009J00629P778j05282m7949K5236
$$ -243154 -201865 -40473 6210 -39054 -20374 -29482 -32491 68138 75916 -29366 -77315 -52079
7084e2079N3129K7773l2989O429n2047L8773O7754O017o080K896k9148o7226l5295
$$ -52079 1050 28823 -4166 2263 -49784 -11011 56743 62760 56680 59576 30428 -36798 -72093
7071g2093L4730O7294O7339p2893r6217M5971j3123j8956N7294K5763n8353j6494
$$ -72093 -37363 29931 97270 24377 -71840 -25869 -38992 -57948 -654 25109 -33244 -49738
7059d9738m2498l6442k5382m9747J28199Q4808o6079M0953J96340J17879m0992
$$ -49738 -92236 -128678 -154060 -203807 -75608 9200 -56879 -15926 180414 298293 257301
7048B57301j61227j28918j6098J9084K0725l4864O0608K297o5398K8797o2649
$$ 257301 96074 -32844 -48942 -29858 -9133 -43997 16611 18908 -46490 -17693 -80342
7037h0342O6907O2201q7766k5833J32571K1539j0179n5665r2535o3495J36943
$$ -80342 -13435 48766 -39000 -64833 67738 89277 79098 23433 -69102 -132597 4346
7026D346Q0542K1011m4462J3147q877j84080o1170J56008m2342r430R305o9921
$$ 4346 84888 105899 61437 74584 65707 -118373 -179543 -23535 -65877 -75307 -66002 -135923
7014a35923j17O0906N6046L2461Q6786k3076p2004K8865J7372r0423p5249r3177
$$ -135923 -136040 -75134 -19088 13373 100159 77083 5079 33944 51316 -39107 -114356 -207533
7002b07533L9073L4225J40468m3489j17502K965J1894m0914l0345j380J1754J59541
$$ -207533 -168460 -134235 6233 -37256 -154758 -151793 -139899 -180813 -211158 -212538 -200784 -41243
6990d1243Q4620k091J16711k7345j97968q1411J2682K8990R4871l0125r0540P3842
$$ -41243 43377 41286 157997 130652 -67316 -148727 -136045 -107055 -12184 -42309 -132849 -59007
6978e9007L6646N1585j28529o7231j4005K0324j3831n5401j1615J55677R499L2108
$$ -59007 -22361 29224 -99305 -166536 -180541 -160217 -174048 -229449 -241064 -85387 -75888 -43780
6966d3780L2881L368n2837J7734J274K01p9661L4042K1155o0246p3408O4638J21633
$$ -43780 -10899 -7531 -60368 -42634 -41360 -41159 -120820 -86778 -65623 -125869 -199277 -134639 -13006
6953a3006J25430N6384n1435n7706j11636r5291m7760O5250Q4710j645L0771N2289
$$ -13006 112424 168808 117373 59667 -51969 -147260 -195020 -129770 -45060 -46705 -15934 36355
6941C6355n161o3975m2556m4810p03R586J89299n5729k170R0257o7722p5008J53266
$$ 36355 31194 -32781 -75337 -120147 -120850 -111264 78035 22306 20136 110393 42671 -32337 120929
6928A20929M7172o8917m3080J1026M0912q9232n2431m2614J0057O1981o7607n8646
$$ 120929 168101 99184 56104 67130 108042 18810 -33621 -76235 -66178 -4197 -71804 -130450
6916a30450N6187J03474K3540l2713p4904r93J4655m1546n4690p490K5318p224
$$ -130450 -74263 29211 52751 20038 -54866 -55859 -41204 -82750 -137440 -144930 -119612 -126836
6904a26836L2371q949j4467j17502J04286Q3882l9602P6947O8913q3761J6149
$$ -126836 -94465 -103414 -117881 -235383 -131097 -47215 -86817 -9870 59043 -24718 -8569
6893h569p4768j1779J11638m0345q4246l6368n933P2659J08017R7709Q6740l2671
$$ -8569 -83337 -95116 16522 -23823 -108069 -144437 -150370 -77711 30306 128015 214755 182084
6881A82084j37420o3155J0085m5897Q7447J7650k151P3136O3097N6105m2733j02688
$$ 182084 44664 -18491 -8406 -54303 33144 50794 48643 121779 184876 240981 198248 95560
6869I5560l620q707J2756r1672r058k5403m2036J18843L4837o1860P349K3586
$$ 95560 91940 83233 95989 4317 -4741 -30144 -72180 46663 81500 19640 26989 50575
6857E0575J07325O1553p3074j12762j9046P7085j1876j27257r2356M3188Q2701
$$ 50575 157900 219453 146379 33617 14571 91656 79780 -47477 -139833 -96645 -13944
6846a3944J1315N3208M2323j6616m3838n6141R2421M1354l426p1654K192j7245
$$ -13944 -2629 50579 92902 76286 32448 -23693 68728 110082 106656 35002 37194 19949
6834A9949L6229M2795q319N502j0590j11061n6509P8899k2749p7297j4252K1332
$$ 19949 56178 98973 90654 96156 85566 -25495 -82004 -3105 -25854 -103151 -117403 -96071
6822i6071N0100l107j25803j0162L277M3380R907P0133M2281n2428lj4568L5070
$$ -96071 -45971 -49078 -174881 -185043 -181766 -138386 -128479 -58346 -16065 -68493 -68496 -83064 -47994
6809d7994L5062M9519j9418m8310k5893J4240N681j01010q8545J03016l3669N6592
$$ -47994 -12932 36587 17169 -31141 -57034 -42794 -37113 -138123 -226668 -123652 -157321 -100729
6797a00729Q4730m9781q2598J5639j2709J59994J3686j10197J9279N0379k4338
$$ -100729 -15999 -65780 -148378 -132739 -145448 14546 28232 -81965 -62686 -12307 -36645
6786c6645q8515N0282O3267Q1181J25738j27834k04499J48168J32772l4568M7312
$$ -36645 -125160 -74878 -11611 69570 195308 67474 -137025 11143 143915 109347 156659
6775A56659j0315p3423m5862P8089k2265M8371m8012o604o1558p0171N1735P1789
$$ 156659 146344 72921 27059 105148 82883 131254 83242 76638 15080 -55091 -3356 68433
6763F8433M413k4033L668l189j6240n4662p8860K2233m1771j33815L6317O0618
$$ 68433 72846 48813 52481 49292 33052 -21610 -100470 -78237 -120008 -253823 -217506 -156888
6751a56888n6946R8314J25489J00202j749p6513r981M4402l1459q0001L3985J13126
$$ -156888 -213834 -115520 9969 110171 108422 31909 21928 66330 34871 -45130 -11145 101981
6739A01981l4438M8464O1266k5731m9358r038R3805p727j4204m6260r292k6592
$$ 101981 67543 116007 177273 151542 102184 93146 186951 179224 165020 118760 109468 82876
6727H2876m429j33257J05029L3055o3147l8532L179O3403K8409j660N6187J15393
$$ 82876 78447 -54810 50219 83274 20127 -18405 -15226 48177 76586 74926 131113 246506
6715B46506Q5410R5007N7902Q3523j1386r5838m4164r7536p7326j11119n6841
$$ 246506 331916 426923 484825 568348 556962 461124 416960 319424 242098 130979 74138
6704G4138j9775O5443k2869n094P9482n441k7218j4835L3125q716K6076l3937
$$ 74138 54363 119806 96937 91843 171325 165884 138666 123831 156956 148240 174316 140379
6692A40379n4653K7505N9458K0877n6712q0234k3070o4684N9354K9893k3201L7988
$$ 140379 85726 113231 172689 193566 136854 56620 33550 -31134 28220 58113 34912 72900
6680G2900M0629J5768r2322j52768J25301K9148j0997o908N7194l1029M2646j9187
$$ 72900 113529 129297 36975 -115793 9508 38656 27659 20751 77945 46916 89562 70375
6668G0375m7491l9815k2156j213J2560N5307J2320j93075o5422k5758Q7815Q5770
$$ 70375 22884 -16931 -39087 -40300 -27740 27567 39887 -153188 -218610 -244368 -156553 -70783
6656g0783J1946J54693J2557n1640R7306L374q7137m4898q5219m6916m931K8770
$$ -70783 -58837 95856 108413 56773 154079 157453 70316 25418 -59801 -106717 -111648 -82878
6644h2878J2484P3944O5681j08790N1218P1426p8985k888L4249K7919m3150P7362
$$ -82878 -70394 3550 69231 -39559 11659 83085 4100 1212 35461 63380 20230 97592
6632I7592O3064m376m4098j9034L034n9520m3156l435J09093P023L7099q6722
$$ 97592 160656 156280 112182 93148 96182 36662 -6494 -9929 99164 106187 143286 56564
6620E6564j02964Qp512k8603j09709O1600J43353Q5329J18727j6093j40899j37036
$$ 56564 -46400 -46392 -53904 -82507 -192216 -130616 12737 98066 216793 200700 59801 -77235
6608g7235j06346l1598J3310J36517R8856n4269r538N4344P8981J10716j25787
$$ -77235 -183581 -215179 -201869 -65352 33504 -20765 -30303 24041 103022 213738 87951
6597H7951r3647o6263M604m9763P623k1436R6195N2261M2720k7949j6898o6258
$$ 87951 -5696 -71959 -67355 -117118 -109495 -130931 -34736 17525 60245 32296 15398 -50860
6585e0860j10013q1110k9910J28595R5781M6924N1691o608M3782p477o9091q517
$$ -50860 -160873 -241983 -271893 -143298 -47517 -593 51098 44490 88272 80795 11704 3187
6573C187J8495K3447m7385M2120O9968j02125M1964J16722R4299l8307n1462j75497
$$ 3187 21682 45129 -2256 39864 109832 7707 49671 166393 260692 222385 170923 -4574
6561d574j01617L3302R1410r9508k1304R6232K3607l1587o8445r0844n3189O2001
$$ -4574 -106191 -72889 18521 -80987 -102291 -6059 17548 -14039 -82484 -173328 -226517 -164516
6549a64516o6174L5555P956O4429o0021j30307n6537l824Q4734K08691L9415J3724
$$ -164516 -230690 -195135 -187179 -122750 -182771 -313078 -369615 -373439 -288705 -80014 -40599 -26875
6537b6875J7841r9353m812P0393l4657P4591O3688o1483p9566l7652l270L5556
$$ -26875 -9034 -108387 -113199 -42806 -77463 -2872 60816 -667 -80233 -117885 -121155 -85599
6525h5599j6476l901m8989J09779O9991K8516r9984n5477L1931o9244k645N3458
$$ -85599 -102075 -105976 -154965 -45186 24805 53321 -46663 -102140 -70209 -139453 -142098 -88640
6513h8640K4219L112L6905J22009M4176P2977k6598J9229k0719n6443q0477n6135
$$ -88640 -64421 -61309 -24404 97605 141781 214758 188160 207389 186670 130227 49750 -6385
6501f385L5361p5863O3454N4339n3186j44686m738J14780J3528J56033J28448
$$ -6385 28976 -46887 16567 70906 17720 -126966 -131704 -16924 -3396 152637 281085
6490B81085q0454k23094j35081k1011J54742N7574J43569M4724r4712o1633r4731
$$ 281085 200631 -22463 -157544 -178555 -23813 33761 177330 222054 127342 65709 -29022
6479b9022O2257R0671j52076j58435O161J3049P2550N7866J18831k6528k14655
$$ -29022 33235 123906 -28170 -186605 -180444 -167395 -94845 -36979 81852 55324 -159331
6468a59331j15297m7313K92965J14106j17684J31039K5130m7962j12639m1026
$$ -159331 -274628 -321941 -28976 85130 -32554 98485 123615 75653 -36986 -78012
6458g8012M7548O2600N2840q7035p897P9155j27491p2793K8623J63032O7030p5121
$$ -78012 -30464 32136 84976 -2059 -9956 69199 -58292 -131085 -102462 60570 127600 52479
6446E2479j37277o2947J51479j7337K3660Q6464r0865k8289R9256K4058J0324
$$ 52479 -84798 -147745 3734 -13603 10057 96521 5656 -22633 76623 100681 111005
6435A11005o5503J7563r731P235P35j1657o8658m696o0749l2978R7317J31345
$$ 111005 45502 63065 53334 60569 61304 49647 -19011 -23707 -84456 -117434 -20117 111228
6423A11228o1905j61403p6606N812P7109m8002j14832M3407J85337K6096L1159
$$ 111228 49323 -112080 -188686 -182874 -105765 -153767 -268599 -225192 -39855 -13759 17400
6412A7400M6089p287K6456M1174J0531J22664M6098m0230J1264K893J26947o3398
$$ 17400 63489 56202 82658 123832 134363 257027 303125 262895 274159 277052 403999 340601
6400C40601j37548m5593n1499n3499q4334k5790J12513L7529n260j5718L0987
$$ 340601 203053 157460 105961 52462 -31872 -57662 54851 92380 87120 71402 102389
6389A02389K6896K9554j04180p5969n6975m4508K4691K5181O5207N0817j6763
$$ 102389 129285 158839 54659 -21310 -78285 -122793 -98102 -72921 -7714 43103 26340
6378B6340j07528J6755O5778J3700K9358j0400L7187p25l9728j7719J61348P8155
$$ 26340 -81188 -64433 1345 15045 44403 34003 71190 70465 30737 13018 174366 252521
6366B52521k05127r2031k0176L552n4307l1116k831J34075j1580l6385R932l3587
$$ 252521 47394 -44637 -64813 -61261 -115568 -146684 -149515 -15440 -27020 -63405 -53473 -87060
6354h7060J8434J0083R1200J19604O6193j61840q5342K6830O1243o3111k3213
$$ -87060 -68626 -58543 32657 152261 218454 56614 -28728 -1898 59345 -3766 -26979
6343b6979k1228J5186K8131o9478j28688J6683M2286r0662J60838n2878n0702
$$ -26979 -48207 -33021 -4890 -74368 -203056 -186373 -144087 -234749 -73911 -126789 -177491
6332a77491J08526p8493j4805R6449p7128j52446N5544Q2784O1904Q8597j06431
$$ -177491 -68965 -147458 -162263 -65814 -142942 -295388 -239844 -157060 -95156 -6559 -112990
6321a12990j06355J11756R67m4953J25603J84115q7997j47805K3888K1332K1018
$$ -112990 -219345 -107589 -106622 -151575 -25972 158143 70146 -77659 -53771 -32439 -11421
6310a1421M8612N3501M756n2121m3404L4771K8484O4508n1735k1891p4308n4449
$$ -11421 37191 90692 95448 43327 -77 34694 63178 127686 75951 54060 -20248 -74697
6298g4697J7722J4253L562J2501k4397j8357k0618L324O4325r5187k107J5792
$$ -74697 -56975 -42722 -39160 -26659 -51056 -69413 -90031 -86707 -22382 -117569 -119676 -103884
6286a03884k7398k4399L1414k2097M7770j6889l307R1972q018l2910j0675K6306
$$ -103884 -131282 -155681 -124267 -146364 -98594 -115483 -118790 -26818 -34836 -67746 -78421 -52115
6274e2115J09423K09357K7705r7909n904q2657j06974p4968P5345K7636r338r763
$$ -52115 57308 266665 294370 196461 190557 107900 926 -74042 1303 28939 19601 9838
6262I838j11294p3968K2530J510m0604M7035M8671k0334p281L7117M4845J43441
$$ 9838 -101456 -175424 -152894 -151384 -191988 -144953 -96282 -116616 -123897 -86780 -41935 101506
6250A01506j6697m1760L0407N8499r3491k574k2848m0239r994P5180p579L9028
$$ 101506 84809 43049 73456 131955 38464 35890 13042 -27197 -37191 37989 30410 69438
6238F9438J53235m4024p6391m0052n3582n2069J03218N0602K1614j8616m7131
$$ 69438 222673 178649 102258 62206 8624 -43445 59773 110375 131989 113373 66242
6227F6242k1752p2401L1457P7829j07020j40849n3505L473j2091J64146J22986
$$ 66242 44490 -27911 3546 81375 -25645 -166494 -219999 -216526 -228617 -64471 58515
6216E8515N9937Q796j05487k2996N221j9375n0531j15815K3498P1829Q9322k1523
$$ 58515 118452 127248 21761 -1235 3986 -15389 -65920 -181735 -158237 -86408 2914 -18609
6204a8609r5855O8848M0856P4965K7433J13673o0593j13161P4080M675r5147j02864
$$ -18609 -114464 -45616 -4760 70205 97638 211311 150718 37557 111637 116312 21165 -81699
6192h1699J1468P9937o077q4377Q8509p292L5065K3797R3257p4034o0611K2864
$$ -81699 -70231 9706 3629 -80748 7761 469 35534 59331 152588 78554 17943 40807
6180D0807q7828K966J14803P351j16068j68902j18407Q1088K20734k9187q3865
$$ 40807 -47021 -44055 70748 78099 -37969 -206871 -325278 -244190 -23456 -52643 -136508
6169a36508M5398J5782M2455K1274M2633n9295J3841q344M8085O6027m915L2554
$$ -136508 -91110 -75328 -32873 -11599 31034 -28261 -14420 -22764 25321 91348 86433 118987
6157A18987P5900r9044n9138P1265j7452n68l1271k6071p067q5247j5820K6249
$$ 118987 194887 95843 36705 107970 90518 89950 58679 32608 25541 -59706 -75526 -49277
6145d9277M7386O138M7494j55563l3401P3214k6651o9792j31513L5345R6116K3658
$$ -49277 -1891 4247 51741 -103822 -137223 -64009 -90660 -160452 -291965 -256620 -160504 -136846
6133a36846O3376j2148j5080M8823k9029J3177L7995n9905Q5356L3575l0k9705
$$ -136846 -73470 -85618 -100698 -51875 -80904 -67727 -29732 -89637 -4281 29294 29264 -441
6121d41m5249j7598J139r5254K9040M2197l7833k7090p376M5839O8680N0911M0312
$$ -441 -45690 -63288 -62149 -157403 -128363 -86166 -123999 -151089 -158465 -112626 -43946 6965 47277
6108D7277j8143n4000J6400l1177J2912m594M3517j8449M8564Q2851k5976J5695
$$ 47277 29134 -24866 -8466 -39643 -26731 -31325 12192 -6257 42307 125158 99182 114877
6096A14877J8089o2669O830k9555l6954Q4670j9870j02024p7536j1339L6292Q4416
$$ 114877 132966 70297 77127 47572 10618 95288 75418 -26606 -104142 -115481 -79189 5227
6084E227P9457K9196p4587q3290l6361N4402M4783l04n969j8630N4400K4515J22433
$$ 5227 84684 113880 39293 -43997 -80358 -25956 18827 18523 12554 -6076 48324 72839 195272
6071A95272K8597j07111k3907J2177n255k5509j47736r2439P048j31861J04929
$$ 195272 223869 116758 92851 105028 99773 74264 -73472 -165911 -158863 -290724 -185795
6060a85795J26274m0549m2381K9333J66155j132k12602K9971J20952J17861p764
$$ -185795 -59521 -100070 -142451 -113118 53037 51905 -160697 -130726 -9774 108087 100323
6049A00323j7040J3875j38051m7682m3470N259K2881Q5086Q2925R4908N8960q0177
$$ 100323 83283 97158 -40893 -88575 -132045 -126786 -103905 -18819 64106 159014 217974 137797
6037A37797m5029m3900p2972n443R040P1933m0746k4815p5356M189Q5149q897
$$ 137797 92768 48868 -24104 -29547 -20507 51426 10680 -14135 -89491 -85302 -153 -9050
6025i050N5455m114m0582o3367N0320n6201n7560J22309N7067M4060O2994K717
$$ -9050 46405 42291 1709 -61658 -11338 -67539 -125099 -2790 54277 98337 161331 164048
6013A64048j2941j8091j29231O4504r257r7887q3929R8476M3516k6386o8505n3080
$$ 164048 151107 133016 3785 68289 59032 -38855 -122784 -24308 19208 -7178 -75683 -128763
6001a28763o833k8760J9537l9138q1495q0181N7702j110j0317J48566O4537J4596
$$ -128763 -135596 -164356 -144819 -183957 -265452 -345633 -287931 -289041 -299358 -150792 -86255 -71659
5989g1659K3450P5552L403M9512m0121j13969j6679n2750m8748R8368O8492N5863
$$ -71659 -48209 27343 30746 80258 40137 -73832 -90511 -143261 -192009 -93641 -25149 30714
5977C0714j5046m6050N1630l397j29906j9697O5567J63241o0720o9966O2324n3457
$$ 30714 15668 -30382 21248 17851 -112055 -131752 -66185 97056 36336 -33630 28694 -24763
5965b4763R0608M920j1032j52251J1278j13464o0901l195R0228O3480Q9119M3550
$$ -24763 65845 70765 59733 -92518 -81240 -194704 -255605 -258800 -168572 -105092 -15973 27577
5953B7577j35223L8669N5397Q2516k8202k4938M5147M7508j48062j63244M5326
$$ 27577 -107646 -68977 -13580 68936 40734 15796 60943 108451 -39611 -202855 -157529
5942a57529L9693J14387L7691L6836O9762o326j34954j0596O8510M031O4732K9419
$$ -157529 -117836 -3449 34242 71078 140840 134514 -440 -11036 57474 61505 126237 155656
5930A55656q4465q6138j17052J24M1422Q429J09936Q0099j06816q1650J35165
$$ 155656 71191 -14947 -131999 -131875 -90453 -82024 27912 108011 1195 -80455 54710
5919E4710M5924o1031m4500q5224p0472P252Q9582J15741R142j10026j9937n116
$$ 54710 100634 39603 -4897 -90121 -160593 -153341 -63759 51982 61124 -48902 -68839 -73955
5907g3955J603J36953K3826j9978p6683M742l977k07365k0858R2651Q2400j9738
$$ -73955 -72352 64601 88427 68449 -8234 -3492 -7469 -214834 -235692 -143041 -60641 -80379
5895h0379L3158K6958q819j05968M6714R5603O7592k9350J174R568o4392n4079
$$ -80379 -47221 -20263 -29082 -135050 -88336 7267 74859 45509 46683 56251 -8141 -62220
5883f2220n2718k5948M3768J9781j3730n5314O5446m7627q7913J67730L0418o1726
$$ -62220 -114938 -140886 -97118 -77337 -91067 -146381 -80935 -128562 -216475 -48745 -18327 -80053
5871h0053K191J22831M9789o5089q1244J00720R3754M6133K2994j01593j20907
$$ -80053 -77862 44969 94758 29669 -51575 49145 142899 189032 212026 110433 -10474
5860a0474m3873p6649N86J24791k6837j01232j21014M9445P9275p3422q2206J25121
$$ -10474 -54347 -130996 -130410 -5619 -32456 -133688 -254702 -205257 -125982 -199404 -281610 -156489
5848a56489J31154Q6281O2386j9127j45816l70K0756M628n3913L9889K8849o0257
$$ -156489 -25335 60946 123332 104205 -41611 -41981 -21225 -16597 -70510 -30621 -1772 -62029
5836f2029Q600j50287Q4144K8975n2684P8356N7296J3517K5261M4568q5904M8969
$$ -62029 -53429 -203716 -119572 -90597 -143281 -64925 -7629 5888 31149 75717 -10187 38782
5824C8782M283J8432q2699p3752n9319q0899m9399J81387Q6625l0084R5017k6138
$$ 38782 43065 61497 -21202 -94954 -154273 -235172 -284571 -103184 -16559 -46643 48374 22236
5812B2236k5092K558j35193r9504L2078L5433J2220m5106M752Q715Q4421J45348
$$ 22236 -2856 -298 -135491 -234995 -202917 -167484 -155264 -200370 -195618 -186903 -102482 42866
5800D2866l8702m8933J2278J6347P4840o0608K864o4953j24063k4693O1314Q5534
$$ 42866 4164 -44769 -32491 -16144 58696 -1912 952 -64001 -188064 -212757 -151443 -65909
5788f5909K06909J80463j07008j77075p1187N1458M6477P8425J894j10362j37028
$$ -65909 141000 321463 214455 37380 -33807 17651 64128 142553 144447 34085 -102943
5777a02943M818p5109L7077R0197r670n1000J5529J46249K3220j61219n0377M3023
$$ -102943 -98125 -173234 -136157 -45960 -55630 -106630 -91101 55148 78368 -82851 -133228 -90205
5765i0205J02817q1945m6879J40148K3772p3387q6587O4574L4764R5618K4807
$$ -90205 12612 -69333 -116212 23936 47708 -25679 -112266 -47692 -12928 82690 107497
5754A07497m1632p9010l8167j2285N4824K4470l9988K1109J61633k5874j26755
$$ 107497 65865 -13145 -51312 -63597 -8773 15697 -24291 -3182 158451 132577 5822
5743E822l0586j3048j9528K591Q6501p0654j78146Q3312P2256J119k448O1547
$$ 5822 -24764 -37812 -57340 -54749 31752 -38902 -217048 -133736 -61480 -60361 -62809 -1262
5731a262m8476q0035o396K4168R5404J8287l3043k3595J25458j6452j40149k5007
$$ -1262 -49738 -129773 -136169 -112001 -16597 1690 -31353 -54948 70510 54058 -86091 -111098
5719a11098L1671r254Q4940K7048p6174j5193J2978m9551k7519k6261q734J7203
$$ -111098 -79427 -88681 -3741 23307 -52867 -68060 -55082 -104633 -132152 -158413 -167147 -149944
5707a49944N722K00846M1940n2490k0059N5811N1842l5272m8019m2342n3600Q3392
$$ -149944 -144222 56624 98564 46074 26015 81826 133668 98396 50377 8035 -45565 37827
5695C7827Q3518M3937j07288l7430j3368K2593l217j6773m7556K6823j73287q6217
$$ 37827 121345 165282 57994 20564 7196 29789 26572 9799 -37757 -10934 -184221 -270438
5683b70438L7887N6408J02888K3479P4841l9483r8914M2796K7901o1483j05107
$$ -270438 -232551 -176143 -73255 -49776 25065 -14418 -113332 -70536 -42635 -104118 -209225
5672b09225Q8369L507j42851R036N9139R1487P0543O1140Q570j5169J6352n844
$$ -209225 -120856 -117349 -260200 -251164 -192025 -100538 -29995 31145 39715 24546 40898 35054
5660C5054m5958n8631q8510l6096p2888R5216J13793J8525p523p600K0790M0169
$$ 35054 -10904 -69535 -158045 -194141 -267029 -171813 -58020 -39495 -47018 -54618 -33828 6341
5648F341O6767L799m4085j62947K0266O2115k8727o4435m6141K9784N4742K7734
$$ 6341 73108 76907 32822 -130125 -109859 -47744 -76471 -140906 -187047 -157263 -102521 -74787
$$ [...]
##END NTUPLES=NMR SPECTRUM
##END=
