##TITLE=Analysis number 307436
Compound Code cc 42125
Book Reference 345/190
Project Code adrs
Chemist Name wendyb
##JCAMPDX= 6.0         $$ Bruker NMR JCAMP-DX V2.0
##DATA TYPE= NMR SPECTRUM
##DATA CLASS= NTUPLES
##ORIGIN= Bruker BioSpin GmbH
##OWNER= NMR
$$ XWIN-NMR		Version 3.5
$$ Tue May  3 11:01:12 2005 GMT Daylight Time (UT+1h)  MAYBRIDGE\NMR@NMR_250MHZ
##.OBSERVE FREQUENCY= 250.131544655141
##.OBSERVE NUCLEUS= ^1H
##.ACQUISITION MODE= SIMULTANEOUS (DQD)
##.ACQUISITION SCHEME= undefined
##.AVERAGES= 16
##.DIGITISER RES= 18
##SPECTROMETER/DATA SYSTEM= dpx250
##.PULSE SEQUENCE= zg30
##.SOLVENT NAME= CDCl3
##.SHIFT REFERENCE= (INTERNAL, CDCl3, 0, 16.522)
##AUDIT TRAIL= $$ (NUMBER, WHEN, WHO, WHERE, WHAT)
$$ ##TITLE= Audit trail, XWIN-NMR		Version 3.5
$$ ##JCAMPDX= 5.01
$$ ##ORIGIN= Bruker BioSpin GmbH
$$ ##OWNER= NMR
$$ C:\u/data/dgb/nmr/ADRS/2650/pdata/1/auditp.txt
$$ ##AUDIT TRAIL=  $$ (NUMBER, WHEN, WHO, WHERE, WHAT)
(   1,<2005-05-03 11:00:53.90 +100>,<MAYBRIDGE\NMR>,<NMR_250MHZ>,
      <created by zg, POWCHK disabled, PULCHK disabled
       configuration hash MD5:
       62 19 C7 07 E1 42 D1 B7 37 6C 3D D0 77 39 F9 E6
       data hash MD5: 64K
       AA 4F F4 FC F9 BD 87 05 53 C4 9A 4F FA D1 A6 EA>)
(   2,<2005-05-03 11:01:05.38 +100>,<MAYBRIDGE\NMR>,<NMR_250MHZ>,
      <Start of raw data processing
       ef LB = 0.3 FT_mod = 6 PKNL = 1 SI = 32K 
       data hash MD5: 32K
       3A CF BC B7 46 33 F2 98 85 D9 28 A7 C8 94 CE C2>)
(   3,<2005-05-03 11:01:07.15 +100>,<MAYBRIDGE\NMR>,<NMR_250MHZ>,
      <apk 
       data hash MD5: 32K
       8D 47 BA 68 5A 36 04 EA 24 AB 8A 0B 12 AC F0 3B>)
(   4,<2005-05-03 11:01:07.88 +100>,<MAYBRIDGE\NMR>,<NMR_250MHZ>,
      <abs ABSG = 5 
       data hash MD5: 32K
       34 6E 74 D9 80 84 97 57 7C ED 52 C8 AB 4F 73 34>)
$$ ##END=
$$ 
$$ hash MD5
$$ D9 92 67 2F 29 2C 2C E6 07 39 0C A2 42 D6 0D 7D
##$RELAX= 
##$RELAX= 
##$RELAX= 
##$RELAX= 
##$RELAX= 
##$RELAX= 
##$RELAX= 
$$ Bruker specific parameters
$$ --------------------------
##$DU= <C:\u>
##$EXPNO= 2650
##$NAME= <ADRS>
##$PROCNO= 1
##$TYPE= <nmr>
##$USER= <dgb>
##$AMP= (0..31)
100 100 100 100 100 100 100 100 100 100 100 100 100 100 100 100 100 100 
100 100 100 100 100 100 100 100 100 100 100 100 100 100 
##$AQSEQ= 0
##$AQ_mod= 3
##$AUNM= <au_zg>
##$AUTOPOS= <12 >
##$BF1= 250.13
##$BF2= 250.13
##$BF3= 250.13
##$BF4= 250.13
##$BF5= 500.13
##$BF6= 500.13
##$BF7= 500.13
##$BF8= 500.13
##$BYTORDA= 1
##$CFDGTYP= 0
##$CFRGTYP= 5
##$CHEMSTR= <none>
##$CNST= (0..31)
1 1 145 1 1 1 1 1 1 1 1 1 1 1 1 1 1 1 1 1 1 1 1 1 1 1 1 1 1 1 1 1 
##$CPDPRG= <>
##$CPDPRG1= <>
##$CPDPRG2= <>
##$CPDPRG3= <>
##$CPDPRG4= <mlev>
##$CPDPRG5= <mlev>
##$CPDPRG6= <mlev>
##$CPDPRG7= <mlev>
##$CPDPRG8= <mlev>
##$CPDPRGB= <>
##$CPDPRGT= <>
##$D= (0..31)
0 1 0 0 0 0 0 0 0 0.06 0 0 0 0 0 0 0.0002 0 0 0 0 0 0 0 0 0 0 0 0 0 0 
0 
##$DATE= 1115114453
##$DBL= (0..7)
120 120 120 120 120 120 120 120 
##$DBP= (0..7)
150 150 150 150 150 150 150 150 
##$DBP07= 0
##$DBPNAM0= <>
##$DBPNAM1= <>
$$ [...]
##$SUBNAM7= <"">
##$SUBNAM8= <"">
##$SUBNAM9= <"">
##$SW= 20.6930455092707
##$SWIBOX= (0..15)
0 0 3 0 0 0 0 0 0 0 0 0 0 0 0 0 
##$SW_h= 5175.983436853
##$TD= 65536
##$TD0= 1
##$TE= 295.16
##$TE2= 300
##$TE3= 300
##$TEG= 300
##$TL= (0..7)
0 120 120 120 120 120 120 120 
##$TP= (0..7)
150 150 150 150 150 150 150 150 
##$TP07= 0
##$TPNAME0= <>
##$TPNAME1= <>
##$TPNAME2= <>
##$TPNAME3= <>
##$TPNAME4= <>
##$TPNAME5= <>
##$TPNAME6= <>
##$TPNAME7= <>
##$TPOAL= (0..7)
0.5 0.5 0.5 0.5 0.5 0.5 0.5 0.5 
##$TPOFFS= (0..7)
0 0 0 0 0 0 0 0 
##$TUNHIN= 0
##$TUNHOUT= 0
##$TUNXOUT= 0
##$USERA1= <user>
##$USERA2= <user>
##$USERA3= <user>
##$USERA4= <user>
##$USERA5= <user>
##$V9= 5
##$VALIST= <valist>
##$VCLIST= <CCCCCCCCCCCCCCC>
##$VD= 0
##$VDLIST= <DDDDDDDDDDDDDDD>
##$VPLIST= <PPPPPPPPPPPPPPP>
##$VTLIST= <TTTTTTTTTTTTTTT>
##$WBST= 1024
##$WBSW= 4
##$XGAIN= (0..3)
0 0 0 0 
##$XL= 0
##$YL= 0
##$YMAX_a= 332544
##$YMIN_a= -478194
##$ZGOPTNS= <>
##$ZL1= 120
##$ZL2= 120
##$ZL3= 120
##$ZL4= 120
##$ABSF1= 16.522
##$ABSF2= -4.171173
##$ABSG= 5
##$ABSL= 3
##$ALPHA= 0
##$AQORDER= 0
##$ASSFAC= 0
##$ASSFACI= 0
##$ASSFACX= 0
##$ASSWID= 0
##$AUNMP= <proc_1d>
##$AZFE= 0.1
##$AZFW= 0.1
##$BCFW= 0
##$BC_mod= 0
##$BYTORDP= 0
##$COROFFS= 0
##$CY= 12.5
##$DATMOD= 1
##$DC= 0
##$DFILT= <>
##$DTYPP= 0
##$F1P= 14.0000005364418
##$F2P= -0.99999901652339
##$FCOR= 0.5
##$FTSIZE= 32768
##$FT_mod= 6
##$GAMMA= 0
##$GB= 0
##$INTBC= 1
##$INTSCL= 1
##$ISEN= 128
##$LB= 0.3
##$LEV0= 0
##$LPBIN= 0
##$MAXI= 10000
##$MC2= 0
##$MEAN= 0
##$ME_mod= 0
##$MI= 0
##$NCOEF= 0
##$NC_proc= -5
##$NLEV= 6
##$NOISF1= 0
##$NOISF2= 0
##$NSP= 0
##$NTH_PI= 0
##$NZP= 0
##$OFFSET= 16.522
##$PC= 1
##$PHC0= -74.9676
##$PHC1= 6.003843
##$PH_mod= 1
##$PKNL= yes
##$PPARMOD= 0
##$PSCAL= 4
##$PSIGN= 0
##$REVERSE= no
##$SF= 250.13
##$SI= 32768
##$SIGF1= 0
##$SIGF2= 0
##$SINO= 400
##$SIOLD= 32768
##$SREGLST= <1H.CDCl3>
##$SSB= 0
##$STSI= 32768
##$STSR= 0
##$SW_p= 5175.98343685301
##$SYMM= 0
##$S_DEV= 0
##$TDeff= 65536
##$TDoff= 0
##$TI= <Analysis number 999999
Compound Code 99
Book Reference 9
Project Code 9>
##$TILT= no
##$TM1= 0
##$TM2= 0
##$TOPLEV= 0
##$USERP1= <user>
##$USERP2= <user>
##$USERP3= <user>
##$USERP4= <user>
##$USERP5= <user>
##$WDW= 1
##$XDIM= 32768
##$YMAX_p= 332417780
##$YMIN_p= -486914
$$ End of Bruker specific parameters
$$ ---------------------------------
##NTUPLES= NMR SPECTRUM
##VAR_NAME=  FREQUENCY,     SPECTRUM/REAL,   SPECTRUM/IMAG
##SYMBOL=    X,             R,               I
##VAR_TYPE=  INDEPENDENT,   DEPENDENT,       DEPENDENT
##VAR_FORM=  AFFN,          ASDF,            ASDF
##VAR_DIM=   32768,         32768,           32768
##UNITS=     HZ,            ARBITRARY UNITS, ARBITRARY UNITS
##FACTOR=    0.157963299565203, 1,           1
##FIRST=     4132.6476996994, 0,             0
##LAST=      -1043.33573715361, 0,           0
##MIN=       -1043.33573715361, -486914,     0
##MAX=       4132.6476996994, 332417780,     0
$$ Real data points
##PAGE= N=1
##DATA TABLE= (X++(R..R)), XYDATA
$$ [...]
16384h26J34674L6379L3980N9924p8628r5107j19550k2810K4192m2006J55332
16373H5554L6437l4394p9860k8622K9118j33624o0636J197R5263J08208j6389
16362B252m7944o4465O264M7212o9988Q9993j5413m4785M7679J0712j37672o2563
16350b38718N320P8179r580l9018k958K5785P6529o5744J589K7222M5113n9311
16338a55592m2296J37514J5151j06700N5306o7591j11336j8735n3168N8422R3765
16327a95260R8433k2783k9130j0257k0283l1682M7890M3648l4660J36266o473
16316b4291p7118P074R7931J378j48972n5910K8480J12295k8329j9415J25503
16305A8626K8504p0766r7178l0664j6397J36599J2245P2147j087q8197k1982j4757
$$ y = [-826, 133848, 170227, 204207, 264131, 185503, 90396, -29154, -51964, -27772, -69778, 85554, 121991, 87597, 7737, -20885, 8233, -125391, -186027, -184830, -89567, 18641, 2252, -45692, -110157, -103893, -56681, -126669, -36676, -52089, -96874, -49195, -38483, -176155, -238718, -233398, -155219, -164799, -203817, -206775, -180990, -104461, -170205, -168616, -141394, -96281, -155592, -197888, -60374, -45223, -151923, -96617, -164208, -275544, -294279, -347447, -289025, -195260, -96827, -119610, -148740, -158997, -179280, -210962, -163072, -119424, -154084, -17818, -24291, -101409, -94335, 3596, 4974, -143998, -199908, -171428, -59133, -87462, -106877, 18626, 47130, -23636, -120814, -151478, -167875, -31276, -19031, 53116, 52029, -36168, -58150, -72907]
16293g2907R6224P2643r2144l6947l3798J1363l1902j12152J1338L2567J3763
16282a41952j1431Q7763K9901J07072L5656n6161o0292J9082j03187j3344L2370
16271g4523j0223N6174M9566k6383j1826k2093K3172P7363P7554j0186R098R181
16259A46874q0431m6004J5116m5765j64518n2049J36929Q0035J7413m072p8564
16248g5036j824N990m0142j964K6714m8850N4713j0197m1170r369J6560O7176
16236e7399L8482k7667R354P0432O333M863O5961L9833j7719q6115q2371K4202
16224a1811J9967n7367K9544N3484k1726j9310m5411L983J5133m6154k6773q2170
16212a88611n8230R1397K8260N0571O9100J6m8012j5074J2994K3442k5495n6156
$$ y = [-72907, 23317, 95960, 3816, -33131, -66929, -55566, -87468, -199620, -188282, -155715, -141952, -153383, -65620, -35719, 71353, 107009, 50848, -9444, 9638, -93549, -106893, -74523, -84746, -28572, 20994, -5389, -17215, -39308, -16136, 61227, 138781, 128595, 137693, 146874, 66443, 20439, 35555, -10210, -174728, -226777, -89848, -9813, 7600, 3528, -75036, -76860, -70870, -111012, -112976, -86262, -135112, -80399, -90596, -131766, -141135, -124575, -57399, -18917, -46584, -37230, 33202, 39535, 44398, 110359, 150192, 132473, 46358, -36013, -11811, 8156, -49211, -19667, 33817, 12091, -7219, -52630, -48647, -33514, -79668, -106441, -188611, -246841, -155444, -127184, -76613, -7513, -7497, -55509, -70583, -57589, -34147, -59642, -115798]
16200a15798o8564m8190q4931j0404O5588J64090L8759j12021l8268O0072J60121
16189A0454r5741R266q229l2730N667j9267J6733O49K332l117N0835O2182J20156
16176A19190k9304j49210R401P7098Q1403P9521k6612q1633p3487l6762r9942
16165a30337n4729J12718O6879M1979J3433P5878l1058j38206q1448P030N8627
16154e9234O8150p1027R2146J33113j09239r7687J7869j98697k4477O8031N9789
16143a21263K6354P9128l8747M735P4957P3199n9486l8012K5083O33K1649J9788
16131F8018j4382L7641j01510p4200l179O1931l9930m6893Q6709l3296M371L7110
16119a7610P0579k0418l2953j2423J06769L6417k2301k8591J8934o005K0347q0268
$$ y = [-115798, -184362, -232552, -317483, -327887, -262299, -98209, -59450, -171471, -209739, -149667, 10454, -85287, -76021, -84250, -116980, -111313, -130580, -113847, -113198, -110866, -113983, -63148, -966, 119190, 89886, -59324, -49923, 27175, 108578, 188099, 161487, 79854, 6367, -30395, -130337, -185066, -72348, -5469, 36510, 49943, 125821, 94763, -43443, -124891, -117861, -59234, 8916, -62111, 30035, 163148, 53909, -43778, -25909, -224606, -249083, -181052, -121263, -94909, -15781, -54528, -49793, 25164, 98363, 38877, 865, 25948, 26581, 48230, 68018, 53636, 91277, -10233, -84433, -87612, -25681, -65611, -112504, -25795, -59091, -54720, -17610, 52969, 32551, -402, -12825, 93944, 130361, 108060, 79469, 98403, 92398, 112745, 32477]
16107C2477p5676M9398O5426k6923J4116q7747j41536k2012J00859P55m6204J53639
16095A6572M340j9721M8435n5954N3579k0400j10689j2479J11063P9898k0734
16084G3910N2536M6455k0673p2714j21177p3212O5414J02232o8263n1103l2493
16073i9088m7752J30775Q3895N0315r3296k1061j8831R0478L9640j01507k8859
16062a5291l0813J8704o0251K1008K1502n842J7924R628p8071L7972Q7156l0175
16050f549r0851O9463j4955M6461O8539K0420N014p4660p5989n6181J6122J18403
16038B5237J05787k9560k457J9332p1871o3521O1917P6300j0917J0893k5981j32746
16026c7587p2988L0777L8618Q0675J00355j29909r3415Q4366L0885p1753K2046
$$ y = [32477, -43199, 6199, 71625, 44702, 58818, -28929, -170465, -192477, -91618, -90863, -137067, 16572, 20912, 1191, 49626, -6328, 47251, 26851, -83838, -96317, 14746, 94644, 73910, 126446, 172901, 152228, 79514, -41663, -114875, -49461, 52771, -15492, -66595, -99088, -146840, -16065, 67830, 118145, 24849, 3788, -15043, 75435, 115075, 13568, -15291, -46104, -27400, -87651, -66643, -45141, -50983, -33059, -23431, -101502, -63530, 23626, -6549, -97400, -27937, -42892, 3569, 72108, 92528, 97542, 22882, -53107, -109288, -93166, 25237, 131024, 101464, 99007, 118339, 46468, -17053, 44864, 121164, 110247, 121140, 95159, -37587, -110575, -79798, -41180, 39495, 139850, 9941, -83474, 892, 31777, -39976, -17930]
16015a7930O6699r7006n3406p7463O4638J66423Q3973k7697n4888j1975n9624
16004a8256j16632M8088M0202o6584N3207P9316j06478q7058J54157N8166k3834
15993A4294K7445k6495l623J1133p052K9135m0658J3914j858J6606N978l6472
15981B347M8147R8376K1491r3912j40467j12011Q5452r74K3724O456q0182m0726
15969a82279P8479Q5614P5687o643J612O4436J3396O042o6750r6149l917p10r391
15956d0573J21338J81284q6023p8520K3074r0373j5267P810o0839m1820J1965
15945f7944P42K5914K646P7332M6823j08765q7578l4674K4457J87257P9783l0640
15933A15353n5641k6608j7448p9028q0751M6271J23491n2026n8002J15619M0130
$$ y = [-17930, 48769, -48237, -101643, -179106, -114468, 51955, 135928, 108231, 53343, 41368, -18256, -134888, -86800, -46598, -113182, -59975, 19341, -87137, -174195, -20038, 38128, 14294, 41739, 15244, 11621, 22754, 15702, 44837, 4179, 18093, 16235, 32841, 38819, 2347, 50494, 148870, 170361, 76449, -64018, -176029, -90577, -91551, -67827, -61371, -141553, -182279, -103800, -18186, 57501, 50858, 52470, 116906, 130302, 136344, 69594, -26555, -30472, -31182, -40573, 80765, 262049, 176026, 97506, 120580, 30207, 14940, 22750, -38089, -79909, -67944, -67202, -41288, -38642, 38690, 85513, -23252, -110830, -145504, -121047, 66210, 145993, 115353, 59712, 33104, 15656, -63372, -144123, -97852, 25639, -26387, -84389, 31230, 71360]
15922G1360j19480l0190N5646j2534M9281j8842m6570p593O575o781l103K2698
15910c9533p1172p8602J3981M0239N8750L0103r7409j04853P8325R9003M6404
15899b4764Q5798k611l5389Q0573P6823j02050j24252o6456R0448J02487k513
15888G8094l6700m7827n5840M062j40400p7171L4312J18492Q0988o5810m0565
15877a48365J12561L1012L5683j4272L0070J7420k7764K4293k06N661N8036l4272
15865H9857k1733m4270o5967J2405J3102l6359K504N4739J5526J5449l9783k4268
15853b8798O4128J8306q555p8769J3481o5995l7594K7261n4412J07717K0023k521
15841b5728L3223N7088n7923K1245K316n4347m7010l6445K1978n1849K531k1767
$$ y = [71360, -48120, -78310, -22664, -35198, 14083, -4759, -51329, -58922, -52347, -59128, -62231, -39533, -110705, -189307, -175326, -135087, -76337, -46234, -143643, -248496, -170171, -71168, -24764, 61034, 58423, 23034, 103607, 180430, 78380, -45872, -112328, -21880, 80607, 78094, 41394, -6433, -62273, -58211, -198611, -275782, -241470, -122978, -41990, -107800, -148365, -35804, -4792, 30891, 16619, 46689, 64109, 36345, 60638, 60432, 66093, 124129, 89857, 68124, 23854, -42113, -29708, -16606, -52965, -50461, 4278, 19804, 35253, -4530, -28798, 35330, 53636, 45081, -33688, -20207, -86202, -123796, -96535, -150947, -43230, -23207, -25728, 7495, 64583, 6660, 27905, 30221, -24126, -71136, -107581, -85603, -137452, -134921, -156688]
15829a56688j7316N0766j9844n8576J06308J71359Q1161N383O138l1047l3259
15818A04385j04780r5585J3234K161n9185P8626O1878K703p3047n3834n4190L9510
15806a38124M335k827Q1100J9907m2008J21629M8858l7059J369k8768n2953J07405
15794H2864M3035k7908j7382p2951O729R271J6974m5460q7443j1524P198j4504
15782a11101Q7550L2942k2237K6246J1746L3821J5564j34408j9478O4005n7645
15771g2995q4455L9771J15441q5547L0873N9227L4303J4356n0521p6283m1861
15760a17691P3850J08567R7488n6750j28168j4141J37809k4543O4056l079n0391
15749H7007Q8059k0869j9163q6656j50578J1206Q8147M026k2896L6248q7164l3756
$$ y = [-156688, -174004, -123238, -143082, -201658, -95350, 76009, 157170, 162553, 168691, 137644, 104385, -395, -95980, -82746, -80585, -139770, -61144, 734, 3437, -69610, -123444, -177634, -138124, -133789, -136616, -55516, -35609, -77617, 44012, 92870, 55811, 57180, 28412, -24541, 82864, 125899, 97991, 80609, 7658, 14387, 23658, 40632, -4828, -92271, -103795, -96597, -111101, -23551, 9391, -12846, 13400, 25146, 58967, 74531, -59877, -79355, -15350, -72995, -157450, -117679, -2238, -87785, -56912, 2315, 36618, 50974, 453, -75830, -117691, -43841, 64726, 162214, 105464, -22704, -36845, 100964, 76421, 140477, 137398, 87007, 175066, 154197, 135034, 48378, -102200, -90994, -2847, 1179, -21717, 14531, -72633, -106389]
15737a06389R5328K6321j12276j6803J3410L3877j3815l4227l3206K4094o085
15726a29771P6518l1997J8598K2051k0736k2020j3904J6327L5949M2266n3090
15715e9809M8779J7765n85n3727J0744o2305l0260o2023j5672J27888Q6449q1496
15703g4252l548L8359M8390k8322p2379J4682P4320J4711m3365J02712O0277j41232
15691i647K1241K4000k3512R5755N3935P7270J6548M5454p6909j86120l2423j993
15679C599J0537p799P3947O0317J4044o5533j07053q0793k4687J26211J16260
15668A19050L8916j4089j33813M682M9623k857k4014K6692l5765k4164l8274o8370
15656a02383l9231R2417P5201K5198J21937M11l6126n8492K085p4364k2871K7551
$$ y = [-106389, -11061, 15260, -97016, -113819, -100409, -66532, -80347, -114574, -147780, -123686, -129771, -53253, -85250, -66652, -44601, -65337, -87357, -101261, -84934, -48985, -6719, -59809, -11030, 6735, 6150, -47577, -36833, -99138, -129398, -191421, -207093, -79205, 7244, -74252, -77800, -39441, 8949, -19373, -91752, -77070, -2750, 11961, -31404, 71308, 131585, -9647, 11594, 35594, 12082, 107837, 161772, 239042, 255590, 301044, 224135, 38015, 5592, 3599, 14136, 6337, 80284, 140601, 154645, 89112, -17941, -98734, -123421, 2790, 119050, 157966, 143877, 10064, 14746, 64369, 61512, 37498, 64190, 28425, 4261, -34013, -102383, -141614, -49197, 26004, 51202, 173139, 173550, 137424, 78932, 81017, 6653, -16218, 11333]
15644A1333J1858m2613k4272J8759K6217M8717J01066J5690j01742m4446Q5336
15633A05903k2205o5931n7262j9667J4328K8575K3012k1930M9983O9457M520j14897
15621f114j43516J5842K1232N4927j7650M4465Q6563L8714R3960r4114l6342R1746
15609A49713K1548q3462q833n463l2975q2489J10272p3960J9270k200R44j1187
15597A178o3961L2812J18562N167j62200P4937L725p0952o2559N7513J16045q4722
15585c4455q9315M4256Q5809J44596n4204o2339r8202J0184m3800r7944l3980
15574b29394Q4177P8565J14114O449P9596Q9421r5154k01413q2133o076k8920
15563a90768R9181n985l4830L1926P0946n1750N7713P0090M880l3207K3782K6327
$$ y = [11333, 23191, -19422, -43694, -24935, 1282, 49999, 151065, 166755, 65013, 20567, 105903, 83698, 17767, -39495, -59162, -44834, -16259, 6753, -15177, 34806, 104263, 108783, -6114, -149630, -133788, -112556, -57629, -75279, -30814, 55749, 94463, 188423, 94309, 57967, 149713, 171261, 87799, 78966, 73503, 40528, -41961, 68311, -5649, 13621, 11421, 12365, 1178, -62783, -29971, 88591, 93758, -68442, 6495, 10220, -60732, -123291, -65778, 50267, -34455, -123770, -79514, 6295, 150891, 96687, 34348, -63854, -53670, -97470, -195414, -229394, -145217, -66652, 47462, 53911, 133507, 222928, 127774, -73639, -155772, -161848, -190768, -91587, -97572, -132402, -100476, -29530, -81280, -23567, 46523, 51403, 18196, 41978, 68305]
15551F8305n602N3458k8267j0340K2426p9873k6305p076J25662L3217p0013m1328
15539C4264j33741q719J41113J9688q9465J6121k3613q0276j3987Q1685J5773
15528d1157Q7185K7223o7165M2606j6589o3433j11618K2609O9974K0985Q8069
15517E8689m4057N5500k945p4948J7246N5511J1049n3586l3683M4174N3070J7898
15505A03918N1681n133P4172M4020n568l4312n6504k4024q2413o6908J7648L126
15493A9703o8485m6286j7128m9480P4399Q4327p3280k19O1579j908j05563N3971
15481f8370K1968J28657O3796L1171q610m5927j1194o2862J2779L0640l3913q4943
15469b6808l425M3722J10962K6173K1704m3035p1124l9101q840P4270l918p7498
$$ y = [68305, 62703, 116161, 87894, 77554, 99980, 20107, -6198, -13274, 112388, 145605, 75592, 34264, -99477, -108196, 32917, 52605, -36860, -20739, -44352, -124628, -138615, -56930, -41157, 46028, 73251, 6086, 48692, 32103, -31330, -142948, -120339, -50365, -29380, 58689, 14632, 70132, 67187, -7761, 9485, 64996, 76045, 22459, -11224, 32950, 86020, 103918, 155599, 150466, 224638, 268658, 263090, 228778, 172274, 148250, 65837, -1071, 16577, 19703, -48782, -95068, -112196, -161676, -87277, -2950, -76230, -76449, -14870, -16778, -122341, -68370, -46402, 82255, 146051, 177222, 168612, 122685, 111491, 48629, 61408, 92048, 58135, -26808, -30233, 13489, 124451, 150624, 172328, 129293, 58169, 19068, 10228, 84498, 80580, 3082]
15457C082J1278k4908q4613J52092k4783M710j6624l2518l5454K8612N4597j9072
15445A6399L3060q21m6718L5542O8178j51931j3680P6345J29962r6176k7107k427
15433B0626j1098j3897k3496J0200J03840P1825q3535K1790P0203l7978m2821
15422H5659k3350n5149l9767J6142k3483l4988Q449Q9754O119K8324n5326j67635
15410a65251K5448n354k0516O04J5397L9974l4269M4218L0723N4026L3620r998
15398H622P2036k1898n8209L0039J95398J1339j72016p6086m9417m3669k9194
15387a33055J5434K5082m5730l1689M4288O178N9930j3327l9055p5490L8585M2451
15375a06398j2134J16311J3889K1858n1723N5684N4836j02523k6954R8130J26950
$$ y = [3082, 14360, -10548, -95161, 56931, 32148, 36858, 20234, -12284, -47738, -19126, 35471, 16399, 49459, 48638, 1920, 37462, 105640, -46291, -59971, 16374, 146336, 50160, 23053, 20626, 9528, -4369, -27865, -17665, 86175, 158000, 74465, 96255, 166458, 128480, 85659, 62309, 7160, -32607, -16465, -39948, -74936, -66487, 23267, 29386, 57710, 2384, -165251, -139803, -145157, -165673, -165069, -149672, -109698, -143967, -99749, -69026, -15000, 18620, 8622, 80658, 58760, 551, 30590, 225988, 237327, 65311, -10775, -60192, -103861, -133055, -117621, -92539, -138269, -169958, -125670, -119492, -59562, -72889, -111944, -187434, -148849, -106398, -118532, -2221, 11668, 33526, -18197, 37487, 92323, -10200, -37154, 60976, 187926]
15364A87926p4450j20233p053M5764K0232J0401l8004m1258o8175N8777Q5856
15353E9783K0799l7312m8981m4275q7788L8016l6700J09888r188J2992k1950o6982
15341a11698p0315O6048P9651P1849J28904J1533l5560n8292m5704k8514p3416
15330f5514K2728K3121J8259m9177m854P0821J47206N1839m8960k06533j7959
15319e9023J2693j0328k2272O2327L4433r345N2548O079j2590j11610M5478M3327
15307C1717p9226K1858j3775o1612j7542M3089L4996R5764P6831K9719K9300M4270
15295B35389l1293j8399q2161j1454O1317P030m5580m793M4766n2072o0571M1351
15283H3530J0511J25k3699j1479K4755l2936j50476l63P1949P9366J2891M7788
$$ y = [187926, 113476, -6757, -13810, 31954, 52186, 62587, 24583, -16675, -84850, -26073, 59783, 80582, 43270, -5711, -49986, -137774, -99758, -136458, -26570, -35758, -22766, -44716, -111698, -182013, -115965, -36314, 35535, 164439, 175972, 140412, 82120, 36416, 7902, -65514, -42786, -19665, -1406, -50583, -55437, 15384, 162590, 214429, 165469, -41064, -59023, -46330, -56658, -78930, -16603, 17830, 8485, 61033, 67112, 54522, -57088, -11610, 31717, -47509, -25651, -39426, -101038, -118580, -75491, -40495, 55269, 132100, 161819, 191119, 235389, 204096, 185697, 103536, 92082, 153399, 160429, 114849, 110056, 154822, 102750, 42179, 83530, 94041, 94166, 70467, 58988, 83743, 50807, -99669, -100032, -28083, 51283, 64174, 111962]
15271A11962L411p2503O5623Q175m4991n6796j860O9726q15m5063j1689N0471
15259G5651M4223m7906m2511J4929L5266J3036k3812j3778o9909j2063N8928K9391
15247F1445l0252K6585m172P9666O9949p0808j49778K0507j7198j05689p2630
15236a92375P7087K3304k876o8513J12921P2337Q0794m319M0314n9674j36864
15225e7864m8655K4533P5680l1211R586j8854Q3507J01880J245n0566p3506J1877
15213B7652J05858J15512l9757j58070J4860k2806k9747j1253m4184k9120r412
15202h0467J2675l9830n3321J91881J00913o3131M4238p6916j48626m3051J27898
15191b7737j6397m1345n6434J6570J2902K9199N4040N2021k5997K0058r202J6466
$$ y = [111962, 115373, 42870, 108493, 116668, 71677, 14881, 13021, 82747, 81932, 36869, 25180, 75651, 119874, 71968, 29457, 44386, 79652, 92688, 68876, 55098, -14811, -26874, 32054, 61445, 31193, 57778, 53606, 133272, 203221, 132413, -17365, 3142, -14056, -119745, -192375, -115288, -91984, -94860, -163373, -50452, 21885, 102679, 98360, 138674, 79000, -57864, -106519, -81986, -6306, -37517, -27931, -46785, 36722, 138602, 139847, 89281, 15775, 27652, 133510, 249022, 209265, 51195, 66055, 43249, 13502, 2249, -41935, -71055, -80467, -67792, -107622, -160943, 30938, 131851, 68720, 112958, 36042, -112584, -155635, -27737, -44134, -85479, -141913, -125343, -112441, -83242, -29202, 22819, -3178, 16880, 7678, 24144]
15179B4144k580r8817l339q420J7936O7115J53660J1942N0805m5133j22294q1693
15167c6674q5404L0856r99K3275q5724J13974M4177n022K2180o796l3861m1523
15155f1541k6117J77854J34892k9526m6098q9713k7177j0215l2635J43351P6488
15144B09563m320M1356j06991O2601m4432q9872n6563J33036J8163j28932L282
15133C6891j00138L7233J1421n935M1987J20532L8373n9446p5415j24410q7648
15122a66555k7370k9151J7242Q1212J54608O1893l8525k3296n8492j13366j9724
15111a61524N9421J31833M5461Q8729N6499n6801j86878K4834J8422K713P6392
15100I9101J13011n0451Q2494j2707q4218L3521r503p4154J503o906o0080k8015
$$ y = [24144, 21564, -77253, -80592, -89012, -71076, -3961, 149699, 161641, 212446, 167313, 45019, -36674, -122078, -91222, -92221, -68946, -154670, -40696, 3481, -1541, 20639, 13843, -20018, -61541, -87658, 90196, 225088, 195562, 149464, 59751, 32574, 22359, -10276, 133075, 209563, 205243, 246599, 139608, 202209, 157777, 67905, 11342, 144378, 162541, 33609, 36891, -63247, -26014, -14593, -20528, 21459, 141991, 180364, 120918, 45503, -78907, -166555, -193925, -223076, -205834, -124622, 29986, 91879, 53354, 30058, -28434, -141800, -161524, -102103, 29730, 75191, 163920, 220419, 163618, -23260, 1574, 19996, 22709, 99101, 212112, 161661, 244155, 231448, 147230, 180751, 171248, 97094, 98597, 91691, 31611, 3596]
15088C596k8803m0960K8664M7157P2960J16093J63007l945q1535j20643o7786
15077H7805k7552O0464Q4465n389j72366j11571l7173l4986J0774J5037j6032
15066a46524M6080R3216M6954r60k6403J0867l8037q8279J1590J18012j9423Q3655
15054I0748J07945n0412j6916O6900k6099q9605R3548o551r4871o6779O0615R1800
15042A60323o2088K580k7774j7923l963p629P1198m7991r0517O3275L5854K2648
15030I7993K6912j1339O8853J04413o2785k0456k8510j7392j30656j07343k9509
15019a09819N6046N8794k5181J3381J9993K1502L9976O3435m3635n3499j2824
15008B8169o6178q964j4626N8877N3576M4000J6316j1090L9966j7243j11568j8493
$$ y = [3596, -25207, -66167, -37503, 9654, 82614, 198707, 361714, 357769, 276234, 155591, 87805, 60253, 120717, 205182, 199793, 27427, -84144, -121317, -156303, -145529, -130492, -146524, -100444, -7228, 39726, 38766, 12363, 23230, -14807, -103086, -91496, 26516, 7093, 90748, 198693, 148281, 131365, 198265, 172166, 82561, 176109, 169558, 74687, 7908, 68523, 160323, 98235, 100815, 73041, 55118, 51155, 43526, 114724, 66733, -23784, 39491, 75345, 97993, 124905, 113566, 182419, 286832, 224047, 203591, 175081, 157689, 27033, -80310, -109819, -53773, 5021, -20160, -6779, 13214, 34716, 74692, 138127, 94492, 40993, 28169, -38009, -46973, -61599, -2722, 50854, 94854, 111170, 100080, 140046, 122803, 11235, -7258]
14996g258O905Q0467O4989q1394o8175k015J31830J3697q9552n2171o240n517
14984a4434N9853j04632k7930L2006K8321K9566L2608O9375l639n1194l9762l3834
14972b3696K2778J06117N7960K623q0617j20890K7405l717m3710K1209M2088l7176
14960b9626N765o5610j1592J08014K9044O6482q748k2230K2280N0441m4336k8278
14948G1606P9568K1344l1025P056L6116r019o76p3875q7420N7259J20732l7401
14936A54265r2607r3547p667P8662l8046J0275J4934O343l3948L9619J10041l7078
14924A11246n8915J2109l4173r4343m9986j006L0416L5751Q3964Q8204m294r3594
14912B5379j06227J9589L7875l8110R241j9335M4107p4089j51813L7765J11492
$$ y = [-7258, -353, 80114, 145103, 63709, -4466, -6481, 125349, 139046, 49494, -2677, -8917, -14434, 45419, -59213, -87143, -55137, -26816, 2750, 35358, 104733, 101094, 49900, 10138, -23696, -918, 105199, 163159, 165782, 85165, -35725, -8320, -12037, -55747, -34538, 7550, -29626, -23861, -89471, -101063, 6951, 35995, 102477, 93729, 71499, 93779, 144220, 99884, 71606, 151174, 172518, 141493, 148549, 184665, 175646, 174970, 101095, 13675, 70934, 191666, 154265, 61658, -31889, -39556, 39106, 1060, 11335, 26269, 32612, -1336, 38283, 148324, 111246, 52331, 64440, 30267, -64076, -114062, -115068, -84652, -48901, 35063, 123267, 118973, 25379, -80848, -61259, -23384, -61494, -52253, -71588, -27481, -101570, -253383, -215618, -104126]
14901a04126j9085R7594O6228J07220J10167M6432j58790j20374K0643o7415L5379
14890A3873L6158q1974j3693k2747n8261m0437J66092K31528k145j06850K915
14879A24459o53k9792o6241j12080o7593N9060M8358L9852o2853q9949N9206L0077
14867f8149j8509O2413P9771j23594Q3811K352k5161K4610j7771r6346P4141m2410
14855f4842M8678J3359l8391O4925N7360Q932l6814o1519o3826K1629k0469K3917
14843d7061Q3579j906L7342O0534R7329k8427k1631p7592m3807m1581l996m6772
14831c3989j078P5891q7112l6169P5365J30026N7701j8793L765n7775o9174L3614
14819G2272O9868q3912j90371K0352K3804Q5502R447o5148j3599m4258o813J75306
$$ y = [-104126, -123211, -25617, 40611, 147831, 257998, 304430, 145640, 25266, 45909, -21506, 13873, 50031, -31943, -45636, -68383, -126644, -167081, -989, 230539, 228394, 121544, 124459, 123806, 94014, 27773, -84307, -151900, -92840, -44482, -4630, -67483, -157432, -98226, -68149, -86658, -24245, 55526, -68068, 15743, 18095, -7066, 17544, -227, -96573, -22432, -64842, -16164, -2805, -41196, 23729, 81089, 90021, 53207, -8312, -72138, -50509, -70978, -47061, 36518, 34612, 71954, 132488, 229817, 201390, 179759, 102167, 58360, 16779, 12783, -33989, -35067, 40824, -46288, -82457, -7092, 122934, 180635, 161842, 165607, 107832, 38658, 72272, 142140, 58228, -132143, -111791, -87987, -2485, 6962, -58186, -71785, -116043, -122856, 52450]
14807E2450J05661N3190L9446R7874k1051J5438k2876m6962o2686r5100j8806
14796I6578J2790k122M7638K1481p9831n4218Q1870N230j697n6094q8633P5914
14784E8906J5166k7425N0768J05091K0886r0697p7062k7656M9530l2178l2176
14773A3153m3213L2258N8615K1335L6775k6555j72907m8683K1897M4739J35628
14762G3042P2667j68811j3055P926O1984r393l4296R9670M9912r6007N7325J17637
14750B18601l0119o0135o8876r1318n7360M0349Q5594J5792m1976m6345k074N5900
14738A8033L589l9342k1304P9897P901J2204J16904M7323n223j10476n6691K1406
14726G4221K140n3776n5197l8729L7875M7545J0966L0439j882k3940J13066J7653
$$ y = [52450, 158111, 211301, 250747, 348621, 327570, 343008, 320132, 273170, 210484, 115384, 96578, 109368, 107246, 154884, 176365, 96534, 42316, 124186, 129416, 127719, 71625, -17008, 58906, 74072, 46647, 97415, 202506, 223392, 132695, 55633, 27977, 77507, 45329, 13153, -30060, 2198, 60813, 82148, 118923, 92368, -80539, -129222, -107325, -62586, 73042, 145709, -23102, -36157, -28231, 33753, 24360, -9936, 89734, 139646, 43639, 100964, 218601, 188482, 128347, 59471, -31847, -89207, -48858, 36736, 52528, 10552, -35793, -37867, 18033, 21622, -17720, -39024, 40873, 48774, 60978, 177882, 225205, 219982, 109506, 52815, 74221, 76361, 22585, -32612, -71341, -33466, 14079, 25045, 55484, 53602, 29662, 142728, 160381]
14714A60381q318l4964p6836J1487m5530J505J019O6140O1227o5838j01506M821
14702b6412N0155K9324o8041L0350L5737j21370J6470M6323J08512J1142l2104
14691H0086k2762j2458j9951p781k1198N8598m8685J4799n1986j125J07427J1227
14679H6191J0450M4378p4581l8055j5249J03407N094q7538n3796K6124P4997k2325
14667E9097q6764k5575J16724J6698M4568K2645o2853j3516r1151j6983O0796
14656B3686Q2631M4050n3285j16092n0611M2054L4698m2316j15933O1133J87241
14645I7256m694j32037k4278M9529K5027J3314n861P8740N7451l4783l929j33184
14633a7449o3504L8787K6985K2560k4402J06916J30211O4182m7159n6268j06901
$$ y = [160381, 152063, 117099, 40263, 51750, 6220, 7725, 8744, 74884, 136111, 70273, -31233, -26412, 23743, 53067, -14974, 15376, 51113, -70257, -53787, -7464, 101048, 112190, 80086, 57324, 44866, 24915, 17134, -4064, 54534, 5849, 20648, -31338, -32463, 74964, 86191, 96641, 141019, 66438, 28383, 13134, 116541, 121635, 34097, -19699, 6425, 81422, 59097, -27667, -53242, 63482, 80180, 124748, 147393, 84540, 71024, -20127, -37110, 23686, 106317, 150367, 97082, -19010, -69621, -27567, 7131, -35185, -151118, -89985, 97256, 92562, -39475, -63753, -14224, 10803, 24117, 18256, 96996, 154447, 119664, 115735, -17449, -80953, -42166, -15181, 7379, -17023, 89893, 220104, 284286, 237127, 180859, 73958]
14622G3958J7446J5562j29272N129L2535J406n9059Q3697L7q3609k5640K4437
14610d3373k3216O6189m2528o2963J9774K4893J44420R9896M6264M9673j30474
14599A48555k5332p733j473N858j7278k9881j06003k1973J23836n6363l1087K1319
14587B445j22360m8316J03223O4145J4125J07706j32083l812J72301k617m9080
14576A05677o0782k6046P9384L7995q7975n1979K3724N3838J4444M7393l9142
14565I6531K391N1921N707j9519m3541k1524m3339K8135L9211J9182P1151J5435
14553B01741k5269r9753O6866p478k0454P3203M4298o690r5349j02208m3450j09521
14541a24064o3514N7985N8658J6941N137R2140M6821m2703n7960j33558N5741
$$ y = [73958, 91404, 106966, -22306, -17177, 15358, 16764, -42295, 41402, 41439, -42170, -67810, -43373, -66589, -400, -42928, -105891, -86117, -61224, 83196, 183092, 229356, 279029, 148555, 123223, 115490, 114017, 119875, 102597, 72716, -33287, -55260, 68576, 12213, -18874, 2445, -119915, -168231, -65008, -863, 13262, 120968, -11115, -14927, 157374, 154757, 105677, 44895, 18849, 98233, 136228, 48253, -3726, 19998, 73836, 88280, 135673, 96531, 98922, 150843, 156550, 137031, 93490, 71966, 28627, 56762, 95973, 115155, 186306, 201741, 176472, 76719, 143585, 136107, 115653, 188856, 233154, 226464, 131115, 28907, -14543, -124064, -187578, -129593, -70935, -53994, -48857, 43283, 90104, 47401, -10559, -144117, -88376]
14530h8376R6809k0272J699j783J26764N9804p5711n4845m0401M7157J9357J40180
14518B10382O5821n6851m9521k3060k5N3825m177P6800l8469q5708K4845K7758
14506B01620n0047p9665L4970J1422p9050P4660o6873p6758k1214J5022R2627
14495E6714L2685n546N2316j4046l4918l6018l4969J13569j27512J8878Q2749
14484A03902n3043j0632j1237n8223P5991k2746m0361M9925L6703K8600O6267
14473A65146l2609j35412r1846J33455J20544O1459j4909m2819k8750j42169L4799
14462B6889L504O591J3425J1291N767M783K4209M6189M5927j706J9179j17475
14450H8573m4324M3784J0837n9810O7998j198k3979k2561j4506L0956J23951r2320
$$ y = [-88376, 8433, -11839, -10140, -11923, 114841, 174645, 98934, 44089, 3688, 50845, 70202, 210382, 276203, 219352, 169831, 146771, 146746, 200571, 196394, 273194, 234725, 149017, 173862, 201620, 151573, 71908, 106878, 118300, 39250, 113910, 47037, -29721, -50935, -35913, 56714, 89399, 83853, 136169, 122123, 87205, 51187, 16218, 129787, 2275, 21153, 103902, 50859, 40227, 28990, -29233, 46758, 24012, -16349, 33576, 70279, 98879, 165146, 132537, -2875, -94721, 38734, 159278, 220737, 205828, 163009, 134259, -7910, 26889, 30393, 36984, 50409, 61700, 67467, 72250, 96459, 142648, 188575, 186869, 206048, 88573, 44249, 88033, 98870, 39060, 107058, 105860, 81881, 59320, 44814, 75770, 199721, 107401]
14438A07401o0725N2358J0408o6941l5606J1652k4431k7992O3692K9129n0242
14427H703o182O3742k5878N9239J04882k2874j17483l3802o6915p669R6603M4994
14415I7360O8485L8113n8117l077p4275r9130o2240l7305o8579J27553P4590J22352
14403A25730O1808j52548j06973P538L5433j2518Q5284O5712J09674m4700j99485
14392b5045r2693L3768k9661L4767K8909J28612m2152j60111J03213O4752J0287
14381E4646L2862P7830n589J4930q4812k4982J84957j2439j25081k8521k7389
14370E6412m4187N7473O5691P718n3754M322M975j3177Q103l8424K6424P7729
14358A59305N782j02726p9666k5879J30650P5146q0544k2524p1570l5991J02211
$$ y = [107401, 46676, 99034, 109442, 42501, 6895, 18547, -5884, -33876, 29816, 58945, 8703, 2521, 66263, 40385, 99624, 204506, 181632, 64149, 30347, -36568, -44237, 52366, 97360, 165845, 203958, 145841, 142764, 68489, -30641, -92881, -130186, -198765, -71212, 3378, 125730, 187538, 34990, -71983, -64445, -29012, -41530, 43754, 109466, 219140, 174440, -25045, -117738, -83970, -113631, -78864, -49955, 78657, 36505, -123606, -20393, 44359, 54646, 87508, 165338, 159749, 174679, 89867, 64885, 249842, 237403, 112322, 83801, 56412, 12225, 69698, 135389, 143107, 89353, 93675, 98650, 85473, 93576, 55152, 81576, 159305, 165087, 62361, -17305, -43184, 87466, 162612, 82068, 59544, -12026, -48017, 54194]
14347E4194L5672N990n4349M9928J55134m02P0977n6019j14045j35729n8334l4855
14335h1838M4066K2243K3905K5852L3795O9210Q3259k4673p2898l4515J7952R8957
14323B05315K3344j63807N7230J03738q0822j41904n570P2823R9957M1665j0536
14312B01433m1791o3432m5878l2245J13990K9020k3627j4231O4664R2836N880
14301B86619n5690K9406n0609j00992k9836J07054m8780q5323Q1889M8858j20481
14290F2115p4784m0583k021J6815Q8068N1093j6944J6116r076J24803M8751j03287
14278A61066r1046j22103q6258j5825J07947k839Q3353K25118J6701j89207q1346
14267E561O1958O9992K7942n3634n8376K0512P6456k2071n3725k4659L1383P687
$$ y = [54194, 89866, 95856, 41507, 91435, 246569, 246167, 317144, 261125, 147080, 11351, -46983, -81838, -37772, -15529, 8376, 34228, 68023, 137233, 220492, 195819, 122921, 88406, 106358, 205315, 228659, 64852, 122082, 225820, 144998, 3094, -2476, 70347, 170304, 211969, 201433, 159642, 96210, 50332, 18087, 132077, 161097, 137470, 123239, 187903, 280739, 286619, 230929, 260335, 209726, 108734, 78898, 185952, 137172, 51849, 133738, 182596, 62115, -12669, -53252, -55273, -38458, 49610, 100703, 83759, 99875, 90799, 215602, 264353, 161066, 70020, -52083, -138341, -154166, -46219, -49058, 34295, 259413, 276114, 86907, 5561, 67519, 137511, 165453, 111819, 53443, 73955, 150411, 128340, 74615, 49956, 81339, 89026]
14255H9026p5073k6370R749K2385k678l5646K4705j8502L2325L3538O0913k6647
14243H7725J6872M5232n7979o4910P2592o422q7791L7188P9139j0513Q3618l0956
14231A63795n0283l5050r5631l5353P0890P6121P3599J3722K6164R327q7191l1265
14219I8845J8043J9058l6525m0951J2572O535K8016k2073J9660k9711P9707P1911
14207B25087j8431o2523j15504J8531p3010J9749j779P8482K942o8128j4225L2963
14195B4154N9712k5032j08574p5389J1103J31175N6798J31911J08942m7034j8865
14184B48901j0397j9452J1221l3818J811j779q2612k0290K3630O4366o6952r3933
14172B0696O816J24623J30691L418m8756Q440P4710j48608q4578Q284M4063l9010
$$ y = [89026, 13953, -12417, -2668, 19717, 17039, -18607, 6098, -12404, 19921, 53459, 114372, 87725, 104597, 149829, 91850, 26940, 99532, 93110, 5319, 42507, 121646, 111133, 194751, 163795, 113512, 78462, -17169, -52522, 18368, 94489, 168088, 181810, 207974, 217301, 130110, 98845, 116888, 135946, 99421, 58470, 71042, 77577, 105593, 83520, 103180, 73469, 153176, 225087, 206656, 144133, 28629, 47160, -25850, -6101, -7880, 70602, 73544, 5416, -8809, 24154, 83866, 58834, -49740, -125129, -114026, 17149, 73947, 205858, 314800, 267766, 248901, 238504, 219052, 230273, 196455, 198266, 196487, 113875, 93585, 117215, 181581, 114629, 20696, 27512, 152135, 282826, 286244, 237488, 245928, 320638, 172030, 87452, 95736, 139799, 100789]
14160A00789K8919N7154j4928m3920p927j41998K4688L2752L1603L4828L7917
14149A39877M5181J15731p3355L038m0933l2915k9666j23604j11784L0729J06074
14138B8373L5461n8167L7691l0970Q4268P7725N1927l3213k4112k5951R3359O2271
14126B98662j65505r9932k1761N3081J6244l4470P7920K3800N3232L194q6385
14115A18080o8179R9187J41735j0977l7661p7055r952j00625j39201K9678L4584
14104b0386K2268L0067O270Q1842r692m2038l5923L0441J8235r6535K1785j6717
14092a0383l5670N1114O2765J7519N3460J5320J37150k0168j23161p0831P4793
14081A51908J05198j02266K3007O1617r7470n6589M306M7739L8111L013M0658
$$ y = [100789, 129708, 186862, 171934, 128014, 120087, -21911, 2777, 35529, 67132, 101960, 139877, 185058, 300789, 227434, 230472, 189539, 156624, 126958, 3354, -108430, -77701, 28373, 63834, 5667, 43358, 12388, 96656, 174381, 226308, 193095, 168983, 143032, 236391, 298662, 133157, 33225, 11464, 64545, 80789, 46319, 124239, 148039, 201271, 204465, 118080, 49901, 149088, 290823, 279846, 242185, 165130, 155178, 54553, -84648, -54970, -20386, 1882, 31949, 38219, 120061, 110369, 68331, 32408, 62849, 81084, -15451, 6334, -10383, -46053, 5061, 67826, 85345, 138805, 154125, 291275, 271107, 147946, 77115, 151908, 257106, 154840, 177847, 239464, 141994, 85405, 89711, 137450, 175561, 178574, 219232]
14070B19232j0290m6805o2607N268K3600k980j836M3353j2621P5172J09690L9194
14058C78370k8013L9372n5583n3340j41091j26463O5083M1005m2649o3024N0537
14047F4204J07477J14622P3374n1693N5187K1202q5627J5986N263j5407J25396
14036D29984O649k51374q2021J15943O4014q4786K19M4307O3637J4811l8733J3941
14024B96591k0139K4544m0479L3864J26983J4929r1569o9081Q8478M8497j39293
14013B73325k8655l1645J02109l8961J814J6807P3078N168N044o5266j54576n2665
14001A05577K7149j9217Q5352L3782M3147j7498o6910J7279K4483Q063M7637o4017
13989B24827J26l282o7981K4880n349L3703J5336J10871K5179q4858k6235J3084
$$ y = [219232, 208942, 162137, 99530, 104798, 128398, 125418, 123582, 166935, 154314, 229486, 339176, 378370, 350357, 389729, 334146, 280806, 139715, 13252, 78335, 119340, 76691, 13667, 64204, 171681, 286303, 359677, 307984, 363171, 384373, 298746, 314732, 319995, 304588, 429984, 436633, 185259, 103238, 219181, 283195, 198409, 198628, 242935, 306572, 321383, 282650, 296591, 276452, 300996, 260517, 294381, 421364, 436293, 344724, 275643, 364121, 412618, 273325, 244670, 213025, 315134, 276173, 277987, 294794, 367872, 373040, 378084, 312818, 158242, 105577, 132726, 113509, 198861, 232643, 275790, 258292, 191382, 208661, 233144, 241207, 288844, 224827, 224953, 221671, 153690, 178570, 173221, 206924, 222260, 333131, 358310, 273452, 247217, 260301]
13977B60301R0545J23485k9140n0931Q7311j3026K6700K371j00949j05240N038
13966B96465M5957j3621L6509N1157p1993m6291K7759P7073j5865r7125n917n5051
13954B29057l9977M2128M0096l4922K3800J20774L4775n4566M6418M1944p482
13943D42045Q0964K8732r7163J55m4380k4312M040l1353N5372j9206l4092J1707
13931C72509L9991n489k8966R5911N4064m8565m6631p9956J26496k7583K6179
13920D77960M548J9344j1776O8440n654j5051J7421k3069j31221N9008O0489q777
13908E11662l3328q5250O0682m0658r7351k1166M6694P509l7463J4438J30483
13897D56252Q3664M7343p2073Q8573n7702j18380l9634O11J2090K57j2856P9695
$$ y = [260301, 350846, 474331, 445191, 394260, 481571, 468545, 495245, 497616, 396667, 291427, 296465, 342422, 328801, 365310, 416467, 344474, 298183, 325942, 403015, 387150, 290025, 284108, 229057, 189080, 231208, 271304, 236382, 260182, 380956, 415731, 361165, 407583, 449527, 442045, 523009, 551741, 454578, 454733, 410353, 386041, 390081, 358728, 414100, 394894, 360802, 372509, 412500, 407011, 378045, 473956, 528020, 479455, 432824, 352868, 479364, 451781, 477960, 482508, 501852, 490076, 558516, 552862, 537811, 555232, 532163, 400942, 459950, 520439, 511662, 478334, 393084, 453766, 413108, 315757, 294591, 341285, 348794, 311331, 325769, 456252, 539916, 587259, 515186, 603759, 546057, 427677, 388043, 388654, 400744, 401001, 388145, 467840]
13885D67840L4037J1320r0105o3014j2336O8866Q068j65211o2976J03011J7529
13874C17029L9400n2148l4487n7352L5857J64624K4882n5385m4347L4050k0205
13863C51918n8859j30178o5269O0282l6516m4601M7029P208J6785k926M3904N4043
13851B42820l9975n5491N5378M6329O1973l0712j42437l2544K2579L9399O3564
13840B30883M1025k9296P01J8643L45L2178P2111k0411q8358o9354J6241j18096
13828H6612p8640Q2252k7557L6803q341L7846l6869M3908M1270Q6838K9894n6662
13816B37354l2268L256j7564K6537l7203p1158n076J03882J028q836j1343r2845
13804I5764Q0940P5829l9113j5051L2832l6078N7857Q3407O3863P2059q9672n5642
$$ y = [467840, 501877, 513197, 423092, 360078, 347742, 416608, 424676, 259465, 196489, 299500, 317029, 356429, 304281, 269794, 212442, 248299, 412923, 437805, 382420, 338073, 372123, 351918, 293059, 162881, 97612, 157894, 121378, 76777, 123806, 131014, 147799, 144873, 188777, 242820, 202845, 147354, 202732, 249061, 311034, 280322, 137885, 105341, 127920, 167319, 230883, 271908, 242612, 243313, 261956, 262301, 294479, 366590, 346179, 257821, 188467, 204708, 86612, 7972, 90224, 62667, 99470, 91129, 128975, 92106, 136014, 177284, 264122, 294016, 237354, 205086, 208342, 190778, 217315, 180112, 108954, 103878, 207760, 208788, 199952, 188609, 95764, 176704, 252533, 213420, 198369, 231201, 195123, 252980, 336387, 400250, 472309, 382637, 326995]
13792C26995L2694Q431q80o2182K3434N2737l762p7687j24071k9224J33423L6797
13780C16705j9430l64l9548l264L230Q2102K6575j22909p3021L8142O505R053
13768B23776l9844m5059j3265N5465O1375R140j2511Q4813l685p7210L865L5933
13756B82793r798k7521L8358j62118J6152P0401J0710J8132j1712P9629Q7107
13745C92133J94150J3761o1932R6756K30016J59311O6935l452o2678k11975j21534
13734F91491q6687o748J9995J8638j9765j2586m9567L7728J4722K1512p8559l9758
13722E10416r3854j4558J3983O1619L2080n8441o9159N7853J13648M2513m9033
13711E47067N2421M2701J66429J87838J94079K06415K76904J62081O5264j10997
$$ y = [326995, 359689, 368120, 367240, 305058, 328492, 381229, 377467, 299780, 175709, 146485, 279908, 316705, 297275, 296911, 257363, 254099, 257329, 339431, 366006, 243097, 170076, 208218, 214723, 223776, 183932, 138873, 125608, 181073, 242448, 251588, 239077, 323890, 320205, 242995, 246860, 282793, 272995, 245474, 283832, 121714, 137866, 208267, 218977, 237109, 225397, 305026, 392133, 586283, 600044, 538112, 634868, 864884, 1024195, 1091130, 1087678, 1025000, 813025, 691491, 604804, 598056, 618051, 636689, 616924, 604338, 554771, 592499, 607221, 628733, 550174, 510416, 416562, 402004, 415987, 477606, 509686, 451245, 382086, 439939, 553587, 596100, 547067, 599488, 642189, 808618, 996456, 1190535, 1396950, 1673854, 1835935, 1901199, 1790202]
13701A790202j81961k03339j26490k68015k38683j33023K1446L9737l0309n1959
13691F17606p9504p2694j4056n656O9854R7664M864r8498q5137m2756O0025R2604
13679E44316l8400n9019J7359j9389J0759Q7847P1679m5270O5475R8289J07146
13668H40792R2878J9740p3942j37323n6817O2299r6470p3723j00656L4701O1247
13657E72726k9207j41795q4697P0748M6628N1882N5264m0861j12512n2804m6445
13646B88927l2880O9281L7025Q2343j10933l9460k6789o5963m9556k0278J33430
13635B65147J15949N1720j14504m2448p42k8125o1454j53372j6047K8745M8735
13624I3604M3919J43375P2224l0520n0735l278K1986o579L6364N4638L0687L7939
$$ y = [1790202, 1608241, 1404902, 1278412, 1010397, 771714, 638691, 660137, 699874, 669565, 617606, 538102, 465408, 451352, 445696, 515550, 613214, 618078, 519580, 434443, 391687, 451712, 544316, 505916, 446897, 464256, 444867, 455626, 543473, 615152, 569882, 635357, 733646, 840792, 933670, 953410, 879468, 742145, 685328, 747627, 651157, 577434, 476778, 511479, 572726, 543519, 401724, 317027, 387775, 434403, 486285, 541549, 500688, 388176, 335372, 288927, 256047, 325328, 362353, 444696, 333763, 294303, 267514, 201551, 151995, 131717, 265147, 381096, 432816, 318312, 275864, 275122, 246997, 185543, 32171, 16124, 44869, 93604, 137523, 280898, 353122, 322602, 271867, 268589, 290575, 283996, 320360, 374998, 405685, 443624]
13612D43624n1033j32428o0617n9933P5197N0500M9814m3635r0965j5655Q8504
13601B53373o6792Q998J1513l7032P944J13529j06322j55510K2806k3963o6456
13590c7912L6951K6264K6133M5797J09498J39269P2526R2411J6338M963m5447
13579D86791l4115m3660O825Q9133P3571q9527m1342N6548K5448J3080j9922n1240
13567D71590K9313L234o4321J2480K3741j66m1671j5617N8285l4217k6163o596
13555D09892K4837J8788J3601M2215P6956n307l8106J12521J62396q957r4796
13544G14040k839O0640J9199R6264L4137l8144j67822N9242J14194q1346j9753
13533G87812o6430L1530R3199j68944n8354P7203K7559J4049M7750q49o1374P5702
$$ y = [443624, 392591, 260163, 199546, 139613, 214810, 265310, 315124, 271489, 180524, 164869, 253373, 186581, 195579, 207092, 170060, 178004, 291533, 185211, 29701, 52507, 28544, -37912, -961, 25303, 51436, 97233, 206731, 346000, 418526, 510937, 527275, 532238, 486791, 452676, 409016, 415841, 504974, 578545, 489018, 447676, 504224, 529672, 542752, 522830, 471590, 500903, 504137, 439816, 452296, 476037, 475871, 434200, 418583, 476868, 442651, 416488, 409892, 434729, 453517, 467118, 509333, 586289, 580982, 542876, 655397, 817793, 808836, 714040, 711201, 771841, 791040, 887304, 921441, 883297, 715475, 774717, 888911, 807565, 787812, 721382, 752912, 846111, 677167, 618813, 696016, 723575, 737624, 785374, 784525, 723151, 798853]
13521G98853n597n5811j0671M445r5514R542q778q91m6792M9267O9514O613O9316
13508G83496J67340J3976j40342j06764o8264J13233j9981k02124M7327J02424
13498F90321J00394J24851J5081m8870m5504n7359p8747k7210k7024r493M4303
13487F80743P4267L6833j11730m6313R4755J11823r7096q512N1435j20463Q61
13476F66603O0903L6501K1781O8646n7401o6523j65429q1583R759J56560P5107
13465G24924O3865q1020q6850K1876K430J08130j0182q476r804J4491j48162k1013
13453E70209o4675J3361j4233O9216j7855j10388k256J57325J00382m2448n0115
13442F08523N5124L8525J7048o3738M351K7523o3825m2155M9515M9099K2685N989
$$ y = [798853, 793256, 737445, 726774, 731219, 635705, 645247, 636469, 635578, 588786, 638053, 707567, 714180, 783496, 950836, 964812, 824470, 717706, 649442, 762675, 742694, 540570, 587897, 690321, 790715, 915566, 930647, 881777, 836273, 778914, 700167, 672957, 645933, 636440, 680743, 755010, 791843, 680113, 633800, 728555, 840378, 743282, 734770, 786205, 665742, 666603, 727506, 764007, 785788, 854434, 797033, 730510, 565081, 483498, 493257, 649817, 724924, 788789, 707769, 620919, 642795, 645225, 753355, 743173, 734697, 724893, 739384, 591222, 570209, 505534, 518895, 504662, 573878, 556023, 445635, 443379, 600704, 701086, 658638, 608523, 663647, 702172, 719220, 655482, 659833, 687356, 623531, 581376, 630891, 679990, 702675, 708664]
13430G08664o541j552L2037L749r150j00207j0062N7709J78451m6055M7390P6573
13418I31006j4041J428M5424N2706l0650r2301o2115j14186O5799O9262m1356
13407H10976q4093j18691l3499J27333J49760O7389l6355j729J1081K2575K2139
13396I36886j9223l7764J2584j25861r6129L0846Q0579Q446l9358K10522J19214
13385A080742r621j461l5154m135k628Q8591l7914l6793m0133M5492J24305Q2997
13373A254288p7679j27403l4356N896N0896j5912j4239R7624r209o4406Q0988
13362A146488P3460J8148N5835O076M6158O3431j1572q9551J392O0190N7750M4288
13350A472093M730m9201m2486J30082J96944N1267p8935O8573m204J7186Q4893
$$ y = [708664, 702123, 700571, 732608, 736357, 727207, 627000, 616938, 674647, 853098, 807043, 854433, 931006, 916965, 918393, 963817, 1016523, 985873, 893572, 831457, 717271, 783070, 852332, 810976, 726883, 608192, 574693, 702026, 851786, 919175, 882820, 881091, 892172, 914747, 936886, 917663, 879899, 892483, 766622, 670493, 701339, 781918, 790364, 751006, 961528, 1080742, 1071121, 1069660, 1034506, 1030371, 1027743, 1116334, 1078420, 1041627, 1001494, 1046986, 1171291, 1254288, 1176609, 1049206, 1014850, 1020746, 1071642, 1055730, 1041491, 1139115, 1129906, 1065500, 1146488, 1219948, 1238096, 1293931, 1300007, 1346165, 1409596, 1398024, 1308473, 1309865, 1370055, 1427805, 1472093, 1476823, 1427622, 1385136, 1515218, 1712162, 1763429, 1684494, 1753067, 1748863, 1766049, 1850942]
13339A850942P8184M2399l044k5156K7440o7621O257J05755N3797P7490L1122
13328B177565L4612L6693Q9379R8385J06080l2010o908L7936J09328Q6350J50466
13317B887876J70847K18813K52851O7019J25593N5769J77906K21989L25684L67165
13307D871512L41350M53860M81888O01830N93955P38648J074016J323830J543976
13298A2024865J978624K606233L330816M539610N893913Q333367J1917010J6912237
13290F7536675K2782161K7099469K5577390J4686419k880101j8446916k4956014
13283A11399083k2890358j7555648j2288436q321732n566638l833618k488753
13276C8453900j590597j031341o07813o58773q24668j042168j076974q65309m29582
$$ y = [1850942, 1929126, 1971525, 1968481, 1943325, 1970765, 1903144, 1909401, 2015156, 2068953, 2146443, 2177565, 2212177, 2248870, 2338249, 2436634, 2542714, 2510704, 2503796, 2541732, 2651060, 2737410, 2887876, 3058723, 3277536, 3530387, 3597406, 3722999, 3778768, 3956674, 4178663, 4504347, 4871512, 5212862, 5666722, 6148610, 6750440, 7344395, 8083043, 9157059, 10480889, 12024865, 14003489, 16609722, 19940538, 24480148, 30374061, 38707428, 50624438, 67536675, 90318836, 117418305, 142995695, 157682114, 154802013, 136355097, 111399083, 88508725, 70953077, 58664641, 50342909, 44776271, 40942653, 38453900, 36863303, 35831962, 35224149, 34565376, 33740708, 32698540, 31621566, 30756257, 30326675]
13267C0326675j21445K57926O66482J361463K233697L291388M502127O069215
13259D8587528Q368896J1980576J7281152K5005657L5967508M8301961N6221196
13252B51714474N0328287K5216725j1164541m1685764n4058165m9540636l7349480
13245A33460900k5697017j7410291j1818829q377413o082665m455858l169678
13238E6449149k282188j796534j597965j875389k096114k371162k133688j682178
13230D0613931j154231o06165n5940K8792O1778O59853J673202L250547N416967
13221D9888734Q338969J2533390J7996973K4131529K7616619K3763256R528706
13214A73798176r832119k4403501k8586512k4580956j8029481j2531040q816076
$$ y = [30326675, 30205230, 30463156, 31129638, 32491101, 34724798, 38016186, 42518313, 48587528, 56956424, 68937000, 86218152, 111223809, 147191317, 195493278, 251714474, 302042761, 327259486, 316094945, 274409181, 220351016, 170810380, 133460900, 107763883, 90353592, 78534763, 70157350, 64074685, 59618827, 56449149, 54166961, 52370427, 50772462, 48897073, 46800959, 44429797, 42296109, 40613931, 39459700, 38853535, 38797595, 38826387, 38888165, 39548018, 41221220, 44471767, 49888734, 58227703, 70761093, 88758066, 112889595, 140506214, 164269470, 173798176, 163966057, 139562556, 110976044, 86395088, 68365607, 55834567, 47018491]
13207D7018491o128258m477583l248501k516848j835405j365396j183108j222841
13199B5040551j500460j474411j482356j551947j448601j511604j476666j265710
13191A3328796j128622r64125j044056q78659q94290p70196o55536o23645n09960
13182E859707m99896m68262m73955m95752l80593k62343k58769l09027k73270
13173B437840k19747k23086j17433k10747j18510K8158p9263j37633k8211j1217
13163A320151q7799K3291O9588k0438N5911J46747L052n4532K1444J53766K07369
13152A838550J47134O3926J95173J08153j14508j79746k65877j69081j66792j58572
13142A298360k22041j31314N382K7313L5854J48434J0802k6246p3536L7190M084
$$ y = [47018491, 40890233, 36412650, 33164149, 30647301, 28811896, 27446500, 26263392, 25040551, 23540091, 22065680, 20583324, 19031377, 17582776, 16071172, 14594506, 13328796, 12200174, 11236049, 10191993, 9313334, 8419044, 7648848, 6993312, 6369667, 5859707, 5359811, 4891549, 4417594, 3921842, 3541249, 3278906, 3020137, 2711110, 2437840, 2218093, 1995007, 1877574, 1666827, 1548317, 1576475, 1497212, 1359579, 1331368, 1320151, 1232352, 1255643, 1325231, 1304793, 1360704, 1507451, 1510503, 1455971, 1477415, 1631181, 1838550, 1985684, 2049610, 2244783, 2352936, 2238428, 2058682, 1792805, 1623724, 1456932, 1298360, 1076319, 945005, 950387, 977700, 1013554, 1161988, 1172790, 1146544, 1073008, 1110198, 1114282]
13131A114282o7428k1954j558p5767K856R6720J21441P4515k0404J9297n3458
13120A188542r2808k7589K7834n1394q6084j1941N6089J18020O1359J09219M2290
13109A333537J72665J96987J67321J52686O5826R7074j10622k41590k19395j77502
13099A436987j62874n1615p6890j57768o2949M1255j7631k7223R3477J4376K6694
13088A055839k7252N0459K3642o2263k1252O9325q4839j14080p9353Q6777J19625
13077A016628O301j0263L5362k6183k0367j9739k4069L5252l3426P6346J35388
13066A171230j975n1706k497R7838n405j5187L7758o0087r6575O2407k3814q3104
13054A028883r0561o1040j2878K1053L9927m3560J00796O8007N52K2279m6329
$$ y = [1114282, 1046854, 1024900, 1023342, 947575, 950431, 1047151, 1168592, 1243107, 1222703, 1242000, 1188542, 1095734, 1068145, 1095979, 1044585, 958501, 946560, 1002649, 1120669, 1182028, 1291247, 1333537, 1506202, 1703189, 1870510, 2023196, 2089022, 2186096, 2075474, 1833884, 1614489, 1436987, 1274113, 1222498, 1145608, 987840, 924891, 966146, 948515, 921292, 1014769, 1029145, 1055839, 1028587, 1079046, 1102688, 1040425, 1019173, 1088498, 1003659, 889579, 810226, 897003, 1016628, 1022929, 1012666, 1048028, 1021845, 1001478, 981739, 957670, 992922, 959496, 1035842, 1171230, 1169255, 1117549, 1115052, 1212890, 1207485, 1192298, 1230056, 1169969, 1073394, 1135801, 1111987, 1028883, 938322, 877282, 864404, 885457, 925384, 881824, 982620, 1050627, 1051179, 1073458, 1027129]
13043A027129p351M8389j04484n3561P7629k4085p1866K696L1639K8521O7722
13032A022378j1121K4550j37568m2211M1150m7244k8256M4691M535N6654r7027
13021H30531j44994K1569P7639M8082o8912k0249O529J08370j7952j05516J17624
13010H52721Q8657N5556J61695J81880K79145J49045R3288L937P729J0678r9358
12999A784973j30029j58265p8447N459q2242j66965k2549j08659O4876O4474k1561
12988A151065K0751j9975N2567J25315M7331J22568L9807L7674Q3594O0887J678
12977A723262P6760J61239N1806k0038N425L5698k7757p1077J2249j17500j14675
12966A715392m7082j5409K9748q5629n7791q6274q8744k7328M5894j68457J5964
$$ y = [1027129, 1019778, 1068167, 963683, 910122, 987751, 963666, 891800, 894496, 926135, 954656, 1022378, 1011257, 1035807, 898239, 856028, 897178, 849934, 821678, 866369, 870904, 927558, 830531, 685537, 707106, 784745, 832827, 763915, 743666, 750195, 858565, 840613, 735097, 852721, 941378, 996934, 1158629, 1340509, 1619654, 1768699, 1861987, 1865924, 1873653, 1884331, 1784973, 1654944, 1496679, 1418232, 1423691, 1341449, 1174484, 1151935, 1043276, 1108152, 1172626, 1151065, 1171816, 1151841, 1204408, 1329723, 1377054, 1499622, 1539429, 1577103, 1660697, 1721584, 1723262, 1800022, 1961261, 2013067, 1993029, 1998454, 2034152, 2006395, 1935318, 1947567, 1830067, 1715392, 1668310, 1652901, 1682649, 1597020, 1539229, 1452955, 1364211, 1336883, 1382777, 1214320, 1230284]
12955A230284o718p8221J42720p4491J7967J15004J41335L8207J53381K26323
12945A905791J71990J92364O5762j35937l51956l29021j36964m7233p5400q9928
12935A169468j32612l5123l9022j08935o6185p4251M8432Q040j3782j6004K7282
12924G67308j859o6907j26487O9882N0015p2063p4603o3181Q2754k833M4777J89062
12912G95865K48863K799p1265j01185m1453n317K6604q2470k24141q6116J51933
12901F14117Q9131r1203j52906r4738j3123n2587j53596k7024K7150Q088j2193
12890A41116j8217N8133N4725R0679J04279K36192M2996n8010l7245k5016o753
12879E82879L4087M3562r2846j757M9772j5861n3312J0494K798L0022r7801k6212
$$ y = [1230284, 1223566, 1145345, 1288065, 1213574, 1231541, 1346545, 1487880, 1526087, 1679468, 1905791, 2077781, 2270145, 2335907, 2199970, 1848014, 1518993, 1382029, 1334796, 1259396, 1169468, 1036856, 1001733, 962711, 853776, 787591, 713340, 761772, 769812, 756030, 740026, 767308, 765449, 698542, 572055, 641937, 691952, 619889, 545286, 482105, 564859, 562026, 606803, 795865, 1044728, 1047527, 976262, 875077, 833624, 828307, 854911, 772441, 548300, 462184, 614117, 703248, 612045, 459139, 364401, 351278, 298691, 145095, 118071, 145221, 153309, 141116, 122899, 181032, 235757, 326436, 430715, 666907, 709903, 651893, 614648, 589632, 582879, 616966, 660528, 567682, 565925, 615697, 599836, 546524, 557018, 559816, 589838, 492037, 465825]
12867D65825l2440J9037j3746p0066r437L1378N3735R6848J60059j2755p5304
12856F13134M0645N1550O8572q4139P4070j8907j821N8401L3602n3056j15633
12845F66418K9129L9560O5855m2800n3859P3194n0742n1476Q1522J0134J39058
12834I05993P0519J7412p250Q7451J00289K73136J74959K33067M600j2896j05615
12823A741665k35772j41207K2140R2121J2241K4696q4203j12807q1872L9809L1852
12812A308663J10064R8368q0179q1081P3422o742n3121r2829k143L8247L2964
12801A345633J10730l0736n2307J0050N1652J75687K27212L26791K38257J40624
12791B543593J18241m5040m8792j44895k28070j05565j75465j29006j29904j08590
$$ y = [465825, 433385, 452422, 438676, 368610, 359173, 390551, 444286, 541134, 701193, 688438, 613134, 653779, 705329, 773901, 689762, 763832, 744925, 743104, 801505, 835107, 782051, 666418, 695547, 735107, 800962, 758162, 704303, 777497, 726755, 675279, 756801, 766935, 905993, 976512, 993924, 986674, 1074125, 1174414, 1447550, 1622509, 1855576, 1860176, 1847280, 1741665, 1505893, 1364686, 1386826, 1478947, 1491188, 1515884, 1431681, 1318874, 1237002, 1276811, 1308663, 1418727, 1517095, 1436916, 1355835, 1429257, 1422515, 1369394, 1276565, 1274422, 1312669, 1345633, 1456363, 1425627, 1373320, 1383370, 1435022, 1610709, 1837921, 2164712, 2402969, 2543593, 2661834, 2616794, 2568002, 2423107, 2195037, 2089472, 1914007, 1785001, 1655097, 1546507]
12781A546507j19858p6705l118J7170R5775R1253l2678p4931n4127O4027O0969
12770A514284j1115o4985n95r0697l2545J48333J02226O8610m4073k6526o9510
12759A493407Q7928J64731J20732J69715K18378P3028k25564r1256K0188l7172
12749A994115q1544q4406l4216j4746K7446p4859p037l4736L93l0279p3610q360
12737A578161J8717O2624k0206q9954m4801p3462o6219O9806J29503J22163L8204
12726A724536j3779N3201k6545l9548l363l6166p2394j4825J73967q60o1391J49133
12714A831966N1736o7511l8135M8198O1696l721l4691l9734j36686o0073Q8846
12703A701891Q0077N1591o52q6884q2613j9526M7157N968J4479m7621M7065N7202
$$ y = [1546507, 1426649, 1349944, 1346826, 1363996, 1459771, 1551024, 1518346, 1443415, 1389288, 1453315, 1514284, 1503169, 1438184, 1437589, 1346892, 1314347, 1462680, 1564906, 1633516, 1589443, 1562917, 1493407, 1581335, 1746066, 1866798, 2036513, 2254891, 2327919, 2102355, 2011099, 2031287, 1994115, 1912571, 1828165, 1793949, 1779203, 1806649, 1731790, 1724753, 1690017, 1690410, 1660131, 1586521, 1578161, 1596878, 1659502, 1639296, 1549342, 1504541, 1431079, 1364860, 1434666, 1564169, 1686332, 1724536, 1710757, 1763958, 1737413, 1697865, 1694502, 1658336, 1585942, 1571117, 1745084, 1744224, 1682833, 1831966, 1883702, 1816191, 1778056, 1826254, 1887950, 1884229, 1849538, 1809804, 1673118, 1613045, 1701891, 1781968, 1833559, 1832907, 1746023, 1663410, 1643884, 1691041, 1697009, 1711488, 1663867, 1710932, 1768134]
12691A768134l4327M9168N5067l5825M7782Q0168Q5942q6912M3923P8068m390
12680B046798j15996o6261J9562P7549O3908J92144J16208o0978j2336J0737M7243
12669B318578P175k0340J4231o5352j2328q389k173m1911k8786k3340N0169p405
12657B180129L4143N8034N6824L611j18806k410J04438j0945j6289J0964L3269
12646B332962N1654j09515P5036L0559K226L3821J19260o0673p4642J00543P956
12635B509187j19426j48706P6896R3041J49373J08539K6867q659q20J4145P5649
12624B776086L2007J03396K9314m4612O8345J07796R6058l4260J1814N5474J68845
12613C370263J44505Q4254O0459O5096K412p7833J6491K916j0464J7185j484Q5516
$$ y = [1768134, 1733807, 1782975, 1838042, 1802217, 1849999, 1930167, 2016109, 1929197, 1973120, 2051188, 2046798, 1930802, 1864541, 1884103, 1961652, 2025560, 2217704, 2333912, 2272934, 2260598, 2271335, 2318578, 2325753, 2305413, 2319644, 2254292, 2241964, 2233575, 2231402, 2189491, 2160705, 2137365, 2187534, 2180129, 2214272, 2272306, 2329130, 2332741, 2213935, 2211525, 2315963, 2305018, 2288729, 2299693, 2332962, 2384616, 2275101, 2350137, 2380696, 2382922, 2416743, 2536003, 2475330, 2400688, 2501231, 2509187, 2389761, 2241055, 2317951, 2410992, 2560365, 2668904, 2695771, 2687112, 2686292, 2700437, 2776086, 2808093, 2911489, 2940803, 2896191, 2964536, 3072332, 3168390, 3134130, 3145944, 3201418, 3370263, 3514768, 3599022, 3659481, 3724577, 3726989, 3649156, 3665647, 3668563, 3658099, 3675284, 3673800, 3759316]
12601C759316N7486J30005J44932J88794M6386O3458J80540J4215J18745K94334
12591D998211K66515J60248J89412K64535K69919K35744K59463K13774J82725
12582G040546K55664K66054M60925M43322M28042N83595O92488Q29625R20163
12573A1920424J034696J230959J384435J532669J807713K133330K527947K946774
12565B6518947L599433M834696O278038Q356735J1157957J5177299K0663061K7330388
12557A23916554L4680149M0612485M0921878L1117980J0974380j2379526k8639989
12550B41203911l4048786l1254972k4989876j8126958j2151017p409559l541285
12543A09681458j71585K807361N376198P900526R844885J1090057J1695388J1558176
$$ y = [3759316, 3816802, 3946807, 4091739, 4280533, 4326919, 4390377, 4570917, 4585132, 4703877, 4998211, 5264726, 5424974, 5614386, 5878921, 6148840, 6384584, 6644047, 6857821, 7040546, 7296210, 7562264, 8023189, 8466511, 8894553, 9478148, 10170636, 11000261, 11920424, 12955120, 14186079, 15570514, 17103183, 18910896, 21044226, 23572173, 26518947, 30118380, 34953076, 41231114, 49587849, 60745806, 75923105, 96586166, 123916554, 158596703, 199209188, 240131066, 271249046, 282223426, 269843900, 241203911, 207155125, 175900153, 150910277, 132783319, 120632302, 113222743, 109681458, 109509873, 112317234, 117693432, 125593958, 135438843, 146528900, 158224288, 169782464]
12535A69782464J0976373J0193091R706040R582144J0265322J1367034J2426083
12528B44298551J3176279J2945209J1611836Q474582M092412q15592n373319q838538
12520B79571420j1030375j1619450j1126444j0105092q862815p663137p148689
12513B12015418p387286q064136r134896r987969j0564054j0214308r275334p796985
12505A39590450n709543l266470l23695L119668P444502J2903140J9465416K6471964
12497A99695432L2676330L5334612L0491194J5839106n852124k6845798l8908970
12490B42429782m0344034l5237625k7998052k1442881j6196021j2090563r273097
12483G9847509p187935n451270m263929l400034l195865l394665l543174l678427
$$ y = [169782464, 180758837, 190951928, 200657968, 210240112, 220505434, 231872468, 244298551, 257474830, 270420039, 282031875, 290506457, 294598869, 293783277, 288409958, 279571420, 268541045, 256921595, 245795151, 235690059, 226827244, 219164107, 212015418, 204628132, 196563996, 187429100, 177441131, 166877077, 156662769, 147387435, 139590450, 133880907, 130614437, 130290742, 133410410, 140854912, 153758052, 173223468, 199695432, 232371762, 267706374, 298197568, 314036674, 308184550, 281338752, 242429782, 202085748, 166848123, 138850071, 117407190, 101211169, 89120606, 79847509, 72659574, 67208304, 62944375, 59544341, 56348476, 52953811, 49410637, 45732210]
12475D5732210l620643l405474l262050l135058k844854k487918k231584k057456
12467B2687173j923359j673516j523780j459875j420644j236098j149122r66814
12459A1333965q83794q41931q23135p21473p56796o73985m47796m85753l89005
12450E310297j81190j38499k24728k17222j80371k06068k35912k60334j10647
12441C555326l1441k1850j20539j77411j81815N2993j7810l3713O7881j10173
12431B981448j24541j145J29222K1009K3112L2914q652p2308q8462m6188o7142
12420B779267J0826j77629j89411j78470m2348j13629o0833P1046r478k7329k3672
12409B038340r0932k1670L4039M7271J37813M5191n7981n2079j0555Q0006j1511
$$ y = [45732210, 42111567, 38706093, 35444043, 32308985, 29464131, 26976213, 24744629, 22687173, 20763814, 19090298, 17566518, 16106643, 14685999, 13449901, 12300779, 11333965, 10450171, 9608240, 8785105, 8063632, 7306836, 6632851, 6185055, 5699302, 5310297, 5129107, 4990608, 4765880, 4548658, 4368287, 4162219, 3926307, 3665973, 3555326, 3523885, 3502035, 3381496, 3204085, 3022270, 3075263, 3057453, 3023740, 3091621, 2981448, 2856907, 2855762, 2984984, 3005993, 3029105, 3062019, 3053367, 2981059, 2892597, 2846409, 2779267, 2790093, 2612464, 2423053, 2244583, 2202235, 2088606, 2027773, 2098819, 2089341, 2062012, 2038340, 1947408, 1925738, 1959777, 2007048, 2144861, 2190052, 2132071, 2079992, 2069437, 2149443, 2137932]
12398B137932J134m3906j25138q9267K9943o3108o0478Q1953N2157j6584m8490
12387A856148N866R0049K2576M0075j22463j37206j02613J2251Q61p8312j04662
12376A482570j11902r2611q122l595j6400J2378q945N056P7205m8253j9711O4515
12364A332185j10467j02241r0712J8451o1663j13676n2017m7264O4226O007L9199
12353H82028k6393j32631j57712m383l3127q3558M1815J36561O5777j74034j44565
12342C69778K8248j13952k1275Q9812K5614N4796M2409m7917L0039O1082o3918
12331D54716j00550n1015N8329k9088p2396j18031l0339k5615L6108P76J3227
12320A36122R7255N1310j33027r1102J10428J84525L4523m9604q6859l7349l5670
$$ y = [2137932, 2139066, 2095160, 1970022, 1880755, 1910698, 1847590, 1787112, 1869065, 1921222, 1904638, 1856148, 1862014, 1952063, 1974639, 2014714, 1892251, 1755045, 1652432, 1664683, 1665544, 1587232, 1482570, 1370668, 1278057, 1269935, 1266340, 1249940, 1262318, 1253373, 1258429, 1335634, 1287381, 1267670, 1332185, 1221718, 1119477, 1028765, 1047216, 985553, 871877, 819860, 772596, 836822, 842829, 882028, 855635, 723004, 565292, 560909, 527782, 444224, 486039, 622600, 688377, 514343, 369778, 398026, 284074, 262799, 352611, 378225, 433021, 475430, 427513, 457552, 518634, 454716, 354166, 303151, 361480, 332392, 259996, 141965, 111626, 86011, 122119, 122895, 136122, 233377, 284687, 151660, 60558, 170986, 355511, 390034, 340430, 253571, 216222, 180552]
12309A80552n4756k1419J23689K0347n5087P827k0987K0188L9165J513k0810k4326
12297A95896M7230Q8033p5452k8171k6306k9998n9545L567m2669k408Q2698M3950
12285A96825J9255k8404M9162k7973n7231j04395m3500O779l4501P7210J38583
12274A91810J9824P5287L6529P9833m5497j41619l0580J1182J067M1427l0230
12263B09033J936r3745k7552L9330L9924K0823P2265M9843m4746N8r7985q6281
12251H2903p9701L9655K8871J8073J00607J7369o8486l8467l1772L193R1434o0455
12239A03224m5990J8725O5354J6402k0877o0982J8013j03560j72970M416j4461
12228a92706K128J33023L6430j845O8776j5580r7671k2119j6263J23893Q0964
$$ y = [180552, 125796, 104377, 228066, 248413, 193326, 201153, 180166, 200354, 239519, 241032, 220222, 195896, 243126, 331159, 255707, 227536, 201230, 171232, 111687, 115254, 72585, 70177, 152875, 196825, 216080, 187676, 236838, 208865, 151634, 47239, 3739, 10518, -23983, 53227, 191810, 211634, 286921, 323450, 403283, 357786, 216167, 185587, 196769, 197836, 239263, 209033, 210969, 117224, 89672, 129002, 168926, 189749, 262014, 311857, 267111, 267169, 169184, 82903, 3202, 42857, 71728, 89801, 190408, 207777, 139291, 100824, 69052, 72245, 163679, 103224, 57234, 75959, 141313, 157715, 136838, 75856, 93869, -9691, -182661, -178245, -192706, -190578, -57555, -21125, -22970, 45806, 30226, -67445, -89564, -105827, 18066, 99030]
12217I9030P7786J32272Q2088K9912Q8022R3469j10972n2287r9198l5897k2043
12206B82182k8995q7524m0482J8662M9250j1425q5859K8971J93144J60667o728
12195D71863r6691j29247L2849J3414L9047l2517K1790P6340l5130l611J29698
12184D87805r395n1112m8609m283Q6275Q746M0893l7450o0885j9641j2396n0572
12172C29376J00375J8968j02793p4354J8485O8524L1332K1468l8230M1806M368
12161D19325N4475m0396k2136R8293K2984N6926Q0463R7444o7520r9604r5258
12150E04996K100K5776J50503j0430j4232l1558j17071j39099Q1866N8604J1o3586
12138D47880m7615J6204j4986j09407M3428n023L8218J1309j1380Q512l4513n1318
$$ y = [99030, 176816, 309088, 391176, 421088, 509110, 602579, 491607, 439320, 340122, 304225, 282182, 253187, 165663, 125181, 143843, 193093, 181668, 95809, 124780, 317924, 478591, 471863, 375172, 245925, 278774, 292188, 331235, 298718, 320508, 396848, 361718, 358107, 487805, 478410, 427298, 378689, 374406, 460681, 469427, 510320, 472870, 411985, 392344, 379948, 329376, 429751, 448719, 345926, 271572, 290057, 358581, 389913, 411381, 373151, 414957, 419325, 473800, 433404, 411268, 509561, 532545, 589471, 669934, 767378, 699858, 600254, 504996, 507096, 532872, 683375, 672945, 658713, 627155, 510084, 370985, 452851, 511455, 511466, 447880, 400265, 416469, 401483, 292076, 335504, 330481, 368699, 380008, 368628, 377140, 342627, 291309]
12126B91309R2475J5212J9859o0234p3003j6565L318M3780l8274o128O9793K825
12114C44367q6452P9361L5920o041O3487r4682n2317N8577K20803P7641k2687
12103F17977J36085Q4412J67299K05524J45866O9881R8417R758j42198j32274
12093A260747o8385j23968j49306o9034p7598m4197P0741l7065R3282K4229M8507
12082I27953N2599n137J51661J92856m8j10764k3565Q8225R2750O1877m9414O1164
12070A440157J05189P3190J01362N8548K6891m0840j27263m4661k8510j38682
12060A425381r1241q9005j68698o4065Q1053k602o1907m4065o7665j0J29383l6144
12048A010415J7390o8161q2276K8536q341P6973J23610J81628J50511J21326O7276
$$ y = [291309, 383784, 398996, 418855, 358621, 285618, 269053, 272371, 316151, 277877, 271749, 341542, 344367, 257915, 337276, 373196, 367155, 430642, 335960, 283643, 342220, 563023, 640664, 617977, 754062, 838474, 1005773, 1211297, 1357163, 1427044, 1525461, 1535219, 1393021, 1260747, 1192362, 1068394, 919088, 850054, 772456, 728259, 799000, 761935, 855217, 879446, 927953, 980552, 975415, 1127076, 1319932, 1319884, 1209120, 1185555, 1273780, 1366530, 1428407, 1378993, 1440157, 1545346, 1618536, 1719898, 1778446, 1805337, 1764497, 1637234, 1592573, 1564063, 1425381, 1334140, 1245135, 1076437, 1012372, 1093425, 1090823, 1028916, 984851, 917186, 917176, 1046559, 1010415, 1027805, 959644, 877368, 905904, 897563, 974536, 1098146, 1279774, 1430285, 1551611, 1618887]
12037A618887M2100p747j98737j42306j66712k18025q3852j34524l0749l1209
12027F47126K6294L3439j83631r1125n7624o135L9301k3978o4339o723m9166p1189
12015A92250J3684M2995k0906N1351M1472M6891l1856n7220L0589N6436j22208
12004B43478r8085j83995j19147P9574K206J80102J19449N7661L0134k0604p3851
11993B16922m1325q1162K2926P0303n5093p5537k0737n25J3823k414j034j6807
11981B9340O8915K5477O0836N1480P6394o58j83816j00748L7642L5428q2440j9380
11969a530Q8667k8262l7339m4732p2102o5129j1736Q4235K6832J27055n8715l4323
11957b7079M2847j4690J12021K4883L9732m3176L095M8926Q3323J5833L3296M6194
$$ y = [1618887, 1660987, 1653240, 1454503, 1312197, 1145485, 927460, 843608, 709084, 678335, 647126, 673420, 706859, 523228, 432103, 374479, 368344, 407645, 383667, 319328, 312605, 263439, 192250, 205934, 248929, 228023, 279374, 320846, 367737, 335881, 278661, 309250, 365686, 243478, 145393, -38602, -157749, -78175, -75969, 104133, 223582, 281243, 311377, 290773, 216922, 175597, 94435, 117361, 187664, 132571, 57034, 36297, 35772, 49595, 47181, 46147, 29340, 98255, 123732, 184568, 236048, 312442, 311784, 127968, 27220, 64862, 100290, 17850, -1530, 87137, 58875, 21536, -23196, -95298, -160427, -172163, -87928, -61096, 65959, 7244, -27079, 15768, 1078, 113099, 137982, 177714, 134538, 137633, 186559, 269882, 285715, 319011, 365205]
11945C65205r7223j03899n3221j2336N1153J64123p718O3432R9049p9110q1890
11934C07565k4268M0778O269p2695n1394N0487n3475p6657j762m186p7841n88
11922D2233N509P0540Q3968l6278J6013K5791P0733l1622j211J55366j3191n5253
11910C32598j06019n4253O2012p6129K396p8949K8041k5562l0774J2108l4739
11899C0730k3981J8852l4574J75828J78624n0272m024o27p8707r7948k1901k896
11887H9104n5623K7289K3166P2801l8080M8160l2933o0433R983J4281Q4555m3502
11875A38768m7784q443P0706J29871L9255r5935m1427L815o0829Q9472Q0014n5866
11863B41617j04525m2914J02678Q147k1111J49815R140K3785L3612m5518l7044
$$ y = [365205, 267982, 164083, 110862, 98526, 149679, 313802, 306084, 369516, 468565, 389455, 307565, 283297, 324075, 330344, 257649, 206255, 256742, 203267, 126610, 124848, 120662, 42821, 42233, 47742, 118282, 202250, 165972, 181985, 207776, 278509, 246887, 245676, 401042, 387851, 332598, 226579, 172326, 234338, 158209, 160605, 81656, 109697, 84135, 53361, 65469, 30730, 6749, 25601, -8973, 166855, 345479, 295207, 291183, 290556, 211849, 113901, 92000, 89104, 33481, 60770, 83936, 156737, 118657, 166817, 133884, 73451, 83434, 97715, 182270, 138768, 90984, 82541, 153247, 283118, 322373, 226438, 185011, 188826, 127997, 217469, 297483, 241617, 137092, 94178, 196856, 205003, 183892, 333707, 342847, 366632, 400244, 354726, 317682]
11852C17682j5980N3955k4515k3816O594L7736k8955j7550k3260K2794l354j6900
11840B84431k9631k8753K4306K4483O5960l6880j41350L0029o7295j41796k2807
11829c9303r895j80O6602R6905O6485m0825l0800o9621j1392M3357J61858N0314
11817B83505k7771l47n4751l438J63924L918j8052j28321m0162J5141j5792r0015
11805H7839o237N9245J03632R4975j14378r7360L8930K7374J21358L5341j36100
11794B14619j20379k0339O3111k2298J87091J80242m8670n3696O8723j12582k7220
11783C08602p1104R8583L7779n5454M3850j9717o8950j07200j2084J6085N6901
11772B27291J1299j16004q5937J34166N6584j0554J0018N5234l6591m9664M5469
$$ y = [317682, 301702, 355657, 331142, 307326, 313920, 351656, 322701, 305151, 281891, 304685, 301331, 284431, 254800, 226047, 250353, 274836, 340796, 303916, 162566, 192595, 125300, -16496, -39303, -49198, -49378, 17224, 114129, 180614, 139789, 108989, 39368, 27976, 71333, 233191, 283505, 255734, 255387, 200636, 197198, 361122, 365040, 346988, 218667, 178505, 193646, 177854, 87839, 81602, 140847, 244479, 339454, 225076, 127716, 166646, 194020, 315378, 350719, 214619, 94240, 73901, 137012, 114714, 301805, 482047, 433377, 379681, 448404, 335822, 308602, 237498, 336081, 373860, 318406, 362256, 342539, 273589, 166389, 154305, 170390, 227291, 238590, 122586, 36649, 170815, 227399, 216845, 226863, 282097, 245506, 195842, 241311]
11761B41311N9527R5769m6661m1978k5518j0905N0880n1036n6257K8565P1334
11750C15031N167k5670M847j0015l4911l7453J07802O0889m3322M7524O9947L2576
11738D92412l3827r2734O1570o394o1771q1374l9688l9356n8606j6471N373O2698
11726A91832O6162M4660l6683l0909j2163Q6089R64K0209M4319k3402p3514k3305
11714B54259j5090N3473J392O646p6859M3330M3692L7197R6456j7963j2748K0310
11702D34095j7268j2476l5269J8842j12531j69031M3175J0626L8976M4200K1809
11691B65148k9329k4412Q66P2546M8504o156l9096K0708J3558j3969p1458o3001
11679A73909J10119N2181M3543N1676n2260j6734L9747n6217r052L2749L453k0396
$$ y = [241311, 300838, 396607, 349946, 307968, 282450, 271545, 322425, 271389, 215132, 243697, 315031, 320198, 294528, 299375, 289360, 254449, 216996, 324798, 385687, 342365, 389889, 459836, 492412, 458585, 365851, 427421, 421027, 359256, 277882, 238194, 198838, 140232, 123761, 129134, 191832, 257994, 302654, 265971, 235062, 222899, 308988, 309952, 330161, 374480, 351078, 277564, 254259, 239169, 292642, 294034, 300680, 223821, 267151, 310843, 348040, 444496, 426533, 413785, 434095, 416827, 404351, 369082, 387924, 275393, 106362, 149537, 160163, 199139, 243339, 265148, 235819, 211407, 212273, 284819, 333323, 327167, 288071, 308779, 322337, 308368, 236910, 173909, 284028, 336209, 379752, 431428, 379168, 362434, 402181, 345964, 336912, 369661, 373114, 352718]
11667C52718q4220P9620O9838j04878j88702N695J20507M2963J31349M4788l8613
11656D31065K593k4589n3244J9473R6473j0615q4345o0207J8942J2693L791k6846
11644C25184n3516k1086J28307j8310l1328N9436O5993J8429m5817r6006n4081
11633B77205K4072O0537N3826p6132L7360M6750L5925M7077k8287L3164K9255
11622E40752j6067l9664m4741Q026M4859k2463k4604q185K5618K8787m7508n3522
11610C91288J18414J17107k0946q7987p4643k1323M7447m9302j716K6274J8N548
11598D50179l1464K4591N1626j2956R7938p9892j41161n9013O2311N2784j5433
11587C99510l1526l8031j5175j2811O4411j202Q861j10123m5691J4037N2898J23537
$$ y = [352718, 268498, 348118, 417956, 313078, 124376, 130071, 250578, 293541, 424890, 469678, 431065, 433658, 409069, 355825, 375298, 471771, 461156, 376811, 316604, 335546, 348239, 352030, 325184, 271668, 250582, 378889, 360579, 329251, 388687, 454680, 473109, 427292, 331286, 277205, 301277, 361814, 415640, 339508, 376868, 423618, 459543, 506620, 478333, 511497, 540752, 524685, 485021, 440280, 448306, 493165, 470702, 446098, 437913, 463531, 492318, 444810, 391288, 509702, 626809, 605863, 517876, 443233, 421910, 469357, 420055, 418339, 444613, 444631, 450179, 418715, 443306, 494932, 481976, 579914, 500022, 358861, 299848, 362159, 414943, 399510, 367984, 329953, 314778, 301967, 366378, 365176, 374037, 263914, 218223, 232260, 285158, 408695]
11575D08695J8775J01690J10284k3400m5424j61458J3440M0895M6221R939L5984
11564E55641j3579K8601J55298M0882O2649O9630J31913J24974R7179j8317j40453
11553A094418j15493j30272M149j1244L3049J3221K5617p8880r1217j20788q460
11542F14100k2519K9823J09444K9320p1614k0369K4027j2183Q4107L5476M237
11531H03849O8778k789o0781K4381M4184J66541R0136J50979L04038L41757J74667
11520B105740P4286k38818l09166r0290j77546j55230p5973j66272j02720m6014
11510H17997J4997N6756p0387K7053l6740l9405M5518K2726j09341j14596k0159
11499E94419Q7473R8862q361K8405N0295j13975j0246O0457m8010n7661Q9866
$$ y = [408695, 427470, 529160, 639444, 616044, 570620, 409162, 422602, 463497, 509718, 519657, 555641, 542062, 570663, 725961, 766843, 829492, 899122, 1031035, 1156009, 1253188, 1234871, 1094418, 978925, 848653, 852802, 841558, 874607, 887828, 913445, 834565, 743348, 622560, 614100, 591581, 621404, 730848, 760168, 688554, 668185, 692212, 680029, 764136, 799612, 803849, 872627, 869838, 809057, 833438, 877622, 1044163, 1134299, 1285278, 1589316, 1931073, 2105740, 2180026, 1941208, 1632042, 1541752, 1364206, 1208976, 1133003, 966731, 864011, 817997, 832994, 889750, 819363, 846416, 809676, 770271, 815789, 838515, 729174, 614578, 594419, 681892, 780754, 772393, 800798, 851093, 737118, 726872, 787329, 739319, 681658, 771524]
11488G71524J40516J66763K1794M8924Q2810k7646j48152j81284k26962j71935
11478D76352n4203R7683O8569j8622M7907P5645l7464j06860j02597M1773L3943
11467E22126M9752m7535j2522m2479M4405N552j1703j1392J33135r214j1057Q079
11455F17147j5975O5336p7221p1252j36482L9878J19711J4367j33815q2783r1073
11444B47838j10744r1962J37039L0229R1464J38322J08821R4060J6142N054K1027
11433F87290N0454K7711o8641j8435k6295k9091J29134O343j42543k694j4400
11422E98833K9361j6146m3944j8095K7331J23658j007l0531l6593l7237n2935
11411E42695P0039r8701n2476q4651p6354K4919J38425J68343J51758r7586k9229
$$ y = [771524, 912040, 1078803, 1100597, 1149521, 1232331, 1204685, 1056533, 875249, 648287, 476352, 422149, 519832, 588401, 569779, 617686, 693331, 655867, 549007, 446410, 488183, 522126, 571878, 524343, 511821, 469342, 513747, 519299, 507596, 496204, 629339, 620125, 609068, 617147, 601172, 666508, 589287, 518035, 381553, 421431, 541142, 555509, 421694, 338911, 247838, 137094, 45132, 182171, 212400, 303864, 442186, 551007, 645067, 661209, 666263, 687290, 737744, 765455, 696814, 678379, 652084, 622993, 752127, 758470, 615927, 613233, 598833, 628194, 612048, 568104, 550009, 577340, 700998, 699991, 669460, 632867, 595630, 542695, 612734, 514033, 461557, 376906, 300552, 325471, 463896, 632239, 783997, 686411, 657182]
11400F57182J5094j6383J9507J921P7929P5223P8588R0449n3708j10254j0050
11389H25498l0267M4791J08264o6328n3102J5154k1567l1225j01481j10668p558
11378E71511J30421J95914K8059k0829M5938N1822r4381j6105j32857k3103P1830
11367H08220Q6915J6609q9635o9722J7141N7015J32201j0121p7843K7391P1698
11356I69869J7163P5948j3773j08656p439L6344L9286M0829l0502m5537K3929
11345I97461N6713p956J2018K7134j8491l6395p2266J6044J7854p4413l5953J3730
11333H95480O826P5922J14966P0832O519k5575j4491R2716L9114q4447o1796l6727
11321A079339n0783Q520J48608K1346j0389k7952m7165j1898R3424j7103N5665
$$ y = [657182, 672276, 655893, 675400, 677321, 755250, 830473, 909061, 999510, 945802, 835548, 825498, 795231, 840022, 948286, 881958, 828856, 844010, 822443, 791218, 689737, 579069, 571511, 701932, 897846, 925905, 905076, 951014, 1002836, 908455, 892350, 759493, 736390, 808220, 895135, 911744, 822109, 752387, 769528, 826543, 958744, 948623, 870780, 898171, 969869, 987032, 1062980, 1049207, 940551, 933112, 969456, 1008742, 1049571, 1019069, 973532, 997461, 1054174, 1046218, 1058236, 1085370, 1066879, 1030484, 958218, 974262, 992116, 917703, 881750, 895480, 902306, 978228, 1093194, 1164026, 1170545, 1144970, 1130479, 1223195, 1262309, 1177862, 1116066, 1079339, 1028556, 1037076, 1185684, 1207030, 1196641, 1168689, 1121524, 1109626, 1203050, 1185947, 1241612]
11310A241612O9170j5889p0120p4280K8840l8424N0439O744K5634N8153N5732
11299A337611p5655l365L8245M8609Q3590J33578p772N92o2940J2914J27302q0033
11287A552676O3147J01172j09506k4460p193l792n8089o4905R962K7378N2211
11276A538601J8751R030k3827q1440n5564j9701M3828O615Q3794O9143j6750K1177
11264A593657m1869Q8277J33832J8775q9764k7467n111m4574L8581R0611L0335
11253A785283l085j3051j0010p0898o7775o337J5674l6077l6023q7173K1375J26303
11241A618206L638O212R3752J3675P7538R6496m343o2846o4824l318M1821J1172
11229A827179J05132J2153j55916j2476P9405P467L9550M1172j9645n1209q1545
$$ y = [1241612, 1310782, 1294893, 1224773, 1150493, 1179333, 1140909, 1191348, 1198092, 1223726, 1281879, 1337611, 1261956, 1258591, 1296836, 1345445, 1429035, 1562613, 1554841, 1555433, 1492493, 1505407, 1632709, 1552676, 1615823, 1716995, 1607489, 1583029, 1575836, 1572044, 1513955, 1449050, 1459012, 1486390, 1538601, 1557352, 1566382, 1542555, 1461115, 1405551, 1385850, 1429678, 1436293, 1520087, 1589230, 1572480, 1593657, 1551788, 1640065, 1773897, 1792672, 1702908, 1675441, 1670330, 1625756, 1664337, 1754948, 1785283, 1782198, 1769147, 1759137, 1688239, 1620464, 1614127, 1629801, 1593724, 1557701, 1470528, 1491903, 1618206, 1621844, 1628056, 1721808, 1735483, 1813021, 1909517, 1905174, 1842328, 1777504, 1774186, 1816007, 1827179, 1932311, 1944464, 1788548, 1776072, 1855477, 1862944, 1902494, 1943666, 1924021, 1872812, 1791267]
11218A791267n4709J33462J07660k0356L2862J8373k6105q1169Q4465N6695r2492
11207A949953p7052M6487n2238J7959m4816Q631K18025J08197K3395J0552l2401
11196B176692r9292L240J7662M254J05162J52759M0890m1280M1890P0754R588
11185B482319J11896N8466J17850J35962K7510r2320K2520J58256J2324m9925
11175B984858p912O5121J49466L8191J50780J16631N1983K72561K05051J02351
11165D129081K73732K07825L01299L36129L09885L54082M58442O21265O94994
11156G686734P57380R45242J222451J114850J150279J438724J755612K324816
11148A8396088L030201L950040N407500P585066J0950519J6014441K2498474K9085155
$$ y = [1791267, 1736558, 1870020, 1977680, 1957324, 1990186, 2008559, 1982454, 1901285, 1985750, 2042445, 1949953, 1872901, 1919388, 1867150, 1885109, 1840293, 1848924, 2066949, 2175146, 2198541, 2209093, 2176692, 2077400, 2080640, 2098302, 2102556, 2207718, 2360477, 2401367, 2360087, 2401977, 2472731, 2482319, 2594215, 2652681, 2770531, 2906493, 2934003, 2841683, 2864203, 3022459, 3034783, 2984858, 2976946, 3042067, 3191533, 3229724, 3380504, 3497135, 3549118, 3821679, 4026730, 4129081, 4402813, 4610638, 4911937, 5248066, 5557951, 5912033, 6370475, 6991740, 7686734, 8444114, 9389356, 10611807, 11726657, 12876936, 14315660, 16071272, 18396088, 21426289, 25376329, 30783829, 38368895, 49319414, 65333855, 87832329, 116917484]
11140A16917484L1055933K2677904K811758j8562038k8982997k7150311k0369329
11133G8398404j4254174r508731o187103m063964k587469j343243o22977m41505
11125C9389238m58264n90564p23824r31928q17346m44239o4262L01048O30675
11116C6290534R11819J299994K021344L039670M487257O668881R821075J4726521
11108G9267095K2225393L2997341M6540102N8216611N7500629L5670609l532453
11101C28885327m1206159n8256498n3351255l9460944k6910897j8195387j2316079
11094G9188108q480947n862212l782207k367447j415534r43766r75400j543395
11086E3817200k363794k669555k535286k074718j425877r90501q44868r97637
$$ y = [116917484, 147973417, 170651321, 173463079, 154901041, 125918044, 98767733, 78398404, 64144230, 54635499, 48448396, 44384432, 41796963, 40453720, 39830743, 39389238, 38930974, 38340410, 37616586, 36684658, 35867312, 35423073, 35358811, 35659859, 36290534, 37202353, 38502347, 40523691, 43563361, 48050618, 54719499, 64540574, 79267095, 101492488, 134489829, 181029931, 239246542, 296747171, 332417780, 328885327, 287679168, 229422670, 176071415, 136610471, 109699574, 91504187, 79188108, 70707161, 64844949, 61062742, 58695295, 57279761, 56335995, 55360595, 53817200, 51453406, 48783851, 46248565, 44173847, 42747970, 41757469, 40912601, 39914964]
11078C9914964r20126l13888P71336K011224L965216O545382J0041349J4898901
11070G6914358K1153273K6458613K6112026J5199219m710137k2664018k9018903
11063A09444431k5333700j8366482j2623832q608587o065606m160565k887238
11056C1398421k143271j495497r88460p34442p23677j257392j794797j880813
11048B0380072j739493j626196j552964j385360j170955j127515j078655r61629
11040I737305q13859o63623o95197p49023n68954m53196l94109m85360m22070
11031D491914l85418m21637l79100l45405j59030j37665k51955k43955r1502l5165
11021B041082j39987k60107j68544p8500M7597j382P2835K162M55L7952m1450
$$ y = [39914964, 38994838, 38680950, 39452286, 41463510, 45428726, 51974108, 62015457, 76914358, 98067631, 124526244, 150638270, 165837489, 161127352, 138463334, 109444431, 84110731, 65744249, 53120417, 44511830, 38446224, 34285659, 31398421, 29255150, 27759653, 26771193, 26036751, 25313074, 24055682, 22260885, 20380072, 18640579, 17014383, 15461419, 14076059, 12905104, 11777589, 10698934, 9737305, 8923446, 8259823, 7564626, 6815603, 6246649, 5793453, 5399344, 4913984, 4491914, 4106496, 3684859, 3305759, 2960354, 2801324, 2663659, 2411704, 2167749, 2076247, 2041082, 1901095, 1640988, 1472444, 1393944, 1441541, 1440159, 1512994, 1515156, 1515611, 1553563, 1512113]
11010A512113j7365k2969p5568k9918j9299k2364m700p4121k58O8672K5117L03
10998A339643R1928j209Q15m8429k0502j6592j8948K8901J4005l3176L1036k9856
10986A337616m4961k5134r3137R8941J50004L373Q275o8602J3617J50656K01854
10975A732502J1291p2816j23544K4918O9707l1381l2613l7461m7619N2965K1452
10964A567401p2862m4637n9947M8101l1137j48593M1608J33753N9028N1995O7558
10953A612268O8896q0690j28222q5839r6861p2786k0756K3672K5859J18620K9995
10942A394156n4421J18732J00078Q9640r1690j24100j17417N2876L5012r6520
10932A306346p4705O1735O6950o4274j9671Q2305J53312k7921j4189l5757Q3621
$$ y = [1512113, 1494748, 1471779, 1396211, 1366293, 1346994, 1324630, 1319930, 1245809, 1245551, 1314223, 1339340, 1339643, 1431571, 1430362, 1431177, 1382748, 1362246, 1345654, 1326706, 1355607, 1369612, 1336436, 1367472, 1337616, 1292655, 1267521, 1174384, 1273325, 1423329, 1426702, 1434977, 1366375, 1379992, 1530648, 1732502, 1743793, 1670977, 1547433, 1572351, 1642058, 1610677, 1578064, 1540603, 1492984, 1545949, 1567401, 1494539, 1449902, 1389955, 1438056, 1406919, 1258326, 1299934, 1433687, 1492715, 1544710, 1612268, 1681164, 1600474, 1472252, 1386413, 1289552, 1216766, 1196010, 1219682, 1245541, 1364161, 1394156, 1339735, 1458467, 1558545, 1648185, 1556495, 1432395, 1314978, 1367854, 1402866, 1306346, 1231641, 1293376, 1360326, 1296052, 1276381, 1358686, 1511998, 1484077, 1469888, 1434131, 1517752]
10921A517752K1225o2376j62393J8174l6471j05776o4471K233K3748k0693r864
10910A121088N7148J6573J21841L7862j18304l0200p2747n6727Q326Q8001J53887
10899A326748R8819P752P4757r013k5837q2296o2938J10384R0407l5831p7219
10888A415733L4488N1960j6218J08516N8561l2590r2885n2790k1070j1268l7937
10877A404500n820K9749p0890M1533n9402k0457L2788P3890K3729L6869P6452
10866A562941Q6209k7756J4508q677j7333P171R4081L2760N2918J00730j5024
10855A882528J9607P1930M7799p7089q9012J8414j9348J38818J84011J61704J67471
10844B506833L5969L9115L6744r726j0697N6175j21003n6625l6941O6337j30630
$$ y = [1517752, 1538977, 1476601, 1314208, 1332382, 1295911, 1190135, 1125664, 1127897, 1151645, 1130952, 1121088, 1178236, 1194809, 1316650, 1354512, 1236208, 1206008, 1133261, 1076534, 1084860, 1172861, 1326748, 1425567, 1433319, 1508076, 1499063, 1473226, 1390930, 1327992, 1438376, 1528783, 1492952, 1415733, 1450221, 1502181, 1485963, 1594479, 1653040, 1620450, 1527565, 1474775, 1453705, 1442437, 1404500, 1398680, 1428429, 1357539, 1399072, 1339670, 1319213, 1352001, 1425891, 1449620, 1486489, 1562941, 1649150, 1621394, 1635902, 1627225, 1609892, 1617063, 1711144, 1743904, 1796822, 1897552, 1882528, 1902135, 1974065, 2021864, 1944775, 1855763, 1874177, 1854829, 1993647, 2177658, 2339362, 2506833, 2542802, 2581917, 2618661, 2608935, 2598238, 2654413, 2533410, 2476785, 2439844, 2506181, 2375551]
10833B375551p6533M3236N9913M0537q0911J15127K4367p0566O2275k9165k2011
10822B441820J1873J66798J47249l7252o7865P172L7148N2324m9645J15755L9829
10811B865206L1929J14182N3261j6676k6074j6473l3271O4871R3525J67445M9968
10800C347893J26879M986L8375p4570J03699P7744R3318J16252P3330Q9658R901
10789D007465O8576J38307R5058Q3787P5549J09976L0535O0930J8387N5890L430
10778D747890K028J64703P8817J30023J08812J28948J8354J26726J64411K23982
10768E894694K57310L30238M43063L88394L94779L03626K18080K38279K15588
10759H684051K48560L50258M32155L30196M41201N23779N19941O64737P63816
$$ y = [2375551, 2299018, 2342254, 2402167, 2442704, 2361793, 2476920, 2501287, 2430721, 2492996, 2463831, 2441820, 2453693, 2620491, 2767740, 2730488, 2662623, 2669795, 2706943, 2759267, 2709622, 2825377, 2865206, 2897135, 3011317, 3064578, 3047902, 3021828, 3005355, 2972084, 3036955, 3130480, 3297925, 3347893, 3474772, 3479758, 3518133, 3443563, 3547262, 3625006, 3718324, 3834576, 3907906, 3997564, 4007465, 4076041, 4214348, 4309406, 4393193, 4468742, 4578718, 4609253, 4670183, 4688570, 4744460, 4747890, 4749918, 4914621, 4993438, 5123461, 5232273, 5361221, 5379575, 5506301, 5670712, 5894694, 6152004, 6482242, 6925305, 7313699, 7708478, 8012104, 8230184, 8468463, 8684051, 8932611, 9282869, 9715024, 10045220, 10486421, 11010200, 11530141, 12194878, 12958694]
10750A2958694Q85384R86255J146316J366369J575784J743578J803499J824397
10742B4290276K314083K852480L407516M041642N083213O338078P767486R774543
10734F5869317J2420043J5629304J9665190K4064864K7885162K9522704K7116377
10727B22172961J9286812P084396n928751j5631419k0721689k1197181j8697846
10720A66367283j5103021j1059451o982150l085909M09459L691618O641015R230459
10712A50109303J0863061J1283965J0154591P451112L867556O10471j231253q04042
10704A92304764J578608N509561J0156622J4475902J7886480J8989377J7085457
10697B77986771J1539955L053767n745508j3017672j7028248j7263366j4780683
$$ y = [12958694, 13844078, 14830333, 15976649, 17343018, 18918802, 20662380, 22465879, 24290276, 26604359, 29456839, 32864355, 36905997, 41989210, 48327288, 56094774, 65869317, 78289360, 93918664, 113583854, 137648718, 165533880, 195056584, 222172961, 241459773, 248544169, 242615418, 226983999, 206262310, 185065129, 166367283, 151264262, 140204811, 133222661, 130136752, 130546211, 134237829, 140878844, 150109303, 160972364, 172256329, 182410920, 189862032, 193729588, 194340059, 193108806, 192304764, 193883372, 199392933, 209549555, 224025457, 241911937, 260901314, 277986771, 289526726, 292580493, 286834985, 273817313, 256789065, 239525699, 224745016]
10690B24745016j0817694o449764k641785m40336k28375j880122m640363p632985
10682A90013592r921748j0581735j0078947q494066o369240l850245q89670K291577
10674A42119518N761733R279214J3035971J6229423J8355223J8287354J4649043
10667B37717479P120488l126002j3329465k0766444k3884665k3420153k0704237
10660A39607001j7476608j4459022j1711491r434712p623190o228877n308144
10653F7364957m549003m096925l782736l607575l465112l385824l264452l129701
10645C8083629k741923k562046k494325k233673k132881k106268j918424j732974
10637B0161115j560871j410073j330823j302285j181176j073740r95257r29839
$$ y = [224745016, 213927322, 207477558, 204835773, 204395437, 204167062, 202286940, 197646577, 190013592, 180091844, 169510109, 159431162, 150937096, 144567856, 140717611, 139827941, 142119518, 147881251, 157160465, 170196436, 186425859, 204781082, 223068436, 237717479, 244837967, 241711965, 228382500, 207616056, 183731391, 160311238, 139607001, 122130393, 107671371, 95959880, 86525168, 78901978, 72673101, 67364957, 62815954, 58719029, 54936293, 51328718, 47863606, 44477782, 41213330, 38083629, 35341706, 32779660, 30285335, 28051662, 25918781, 23812513, 21894089, 20161115, 18600244, 17190171, 15859348, 14557063, 13375887, 12302147, 11306890, 10377051]
10629A0377051q44365q04402p11883m54141l69891l76603m64084l50633l16516
10620E684533l15145l90972k09981k23289k68281j85749k16203p7905j59857j84008
10610C453143j29750j98931j33678M5533n0007r7262j73767j57144j18404J08475
10600B548208J4144n8671O6469M6495j97062j18824q1010q6013j55772n7676j03048
10589A817240m7636k506j8410o939M6485P7649l3713o8779m3745p5350m2134j6102
10577A586060l6198O0941m3424n7058O7301N7649l1888j4270L8718q0409J8045
10566A565467J1573K4790m7180q0502K9378o419M4006N0814k2201P3666K5641
10555A669033j6532l4565m7884n4636L5679J05567o474r3636j18479O6859l2625
$$ y = [10377051, 9532686, 8728284, 8016401, 7562260, 7192369, 6815766, 6351682, 6001049, 5684533, 5369388, 4978416, 4768435, 4545146, 4276865, 4091116, 3874913, 3797008, 3637151, 3453143, 3323393, 3124462, 2990784, 3036317, 2986310, 2889048, 2715281, 2558137, 2439733, 2548208, 2562352, 2503681, 2570150, 2616645, 2419583, 2300759, 2219749, 2133736, 1977964, 1920288, 1817240, 1769604, 1767098, 1748688, 1741749, 1788234, 1865883, 1832170, 1763391, 1719646, 1644296, 1602162, 1586060, 1549862, 1610803, 1567379, 1510321, 1577622, 1635271, 1603383, 1589113, 1627831, 1547422, 1565467, 1577040, 1601830, 1554650, 1474148, 1503526, 1497107, 1541113, 1591927, 1569726, 1643392, 1669033, 1652501, 1617936, 1570052, 1515416, 1551095, 1656662, 1650188, 1556552, 1438073, 1504932, 1472307]
10544A472307K243J04995j05152J4064j6716q5405l4312j9477o3315j9739P401
10533A256894q4585r3808l5422j898j08159J5711J9353N8266r7456k22066k9638
10522F77192K8878p317K3378L4094l1283p4571n4147j1304p954K9224N1629n2736
10510F05083r880J4820n8170K5177j5743n5159o2619m1309L0969q4900N527Q6357
10498D40153M10o6324o9344K4624R4756r8966r2317O4458J12217M9288k864k8835
10486D27256N0817K6010j30933l8675K9625J6714l5381j00557O9035o597K252
10475C09566j35557j087Q9221J48308j2842p4321m6074J8150O7316j9947p5600
10464B67133L9214J9820L2004n5723m7610p5126q771J06842k707j10973K2347
$$ y = [1472307, 1474550, 1579545, 1474393, 1488457, 1471741, 1386336, 1352024, 1332547, 1269232, 1249493, 1256894, 1172309, 1078501, 1043079, 1041181, 933022, 948733, 968086, 1026352, 928896, 706830, 677192, 706070, 698753, 722131, 756225, 724942, 650371, 596224, 584920, 576966, 606190, 657819, 605083, 595203, 610023, 551853, 577030, 561287, 506128, 443509, 402200, 433169, 348269, 353796, 440153, 440563, 374239, 304895, 329519, 424275, 325309, 232992, 297450, 409667, 458955, 456091, 427256, 478073, 504083, 373150, 334475, 364100, 380814, 345433, 244876, 313911, 307314, 309566, 174009, 172922, 262143, 410451, 397609, 323288, 277214, 295364, 362680, 342733, 267133, 306347, 326167, 358171, 302448, 254838, 179712, 170941, 277783, 275076, 164103, 186450]
10453A86450O9220K3021q212j48255l3665q0155k7679r043M984N8921O9040R3533
10441A98160m0274j77698N607R2957m3988K3885P3840j379P975j2235l9147J5604
10429A03307k961O9402O5174K2250k3684o5470n6040K8809P3070k055m3802J25531
10417B93531N5441j40355j30678M9690N7779L471j9666j3483k9158n1766L204
10406G8010j420J0611m5286j252K7267P671j02326j21002O6918J34800Q4534J4941
10394A53466l9121q731O4082j1074j39930O4784J78913O8106m5277N3263L2362
10383C70843n033l1883n7607k0509P0324J8010N459K2876Q172j00355j09095K3787
10371A94989j8517k2674N0057l8691j9610j9647R8314J47450r1604r5223O2450
$$ y = [186450, 255670, 278691, 270479, 122224, 88559, 8404, -19275, -28318, -23334, 35587, 104627, 198160, 157886, -19812, -14205, 78752, 34764, 58649, 132489, 131110, 139085, 126850, 87703, 103307, 100346, 169748, 234922, 257172, 233488, 168018, 111978, 140787, 213857, 211802, 168000, 293531, 348972, 208617, 77939, 127629, 185408, 188879, 169213, 155730, 126572, 74806, 78010, 76590, 87201, 41915, 40663, 67930, 75601, -26725, -147727, -80809, 53991, 138525, 153466, 114345, 105614, 169696, 158622, 18692, 83476, 262389, 330495, 285218, 338481, 370843, 365810, 333927, 276320, 255811, 326135, 344145, 349604, 372480, 380652, 280297, 171202, 194989, 176472, 153798, 203855, 165164, 145554, 125907, 224221, 371671, 280067, 184844, 247294]
10360B47294J01981j5706N8321K93L1160q28m6894l6544M4890j1193M5312l4766
10348C83320l9221L0732J64573J12854l8714m3910j57811j26402L545P6836L2838
10337C98640K7538j29320p7103J13583k73l8242M2485Q6908k8013N2537J40568
10326E89308J3128r6127j05764o73J19847J261k2878p3389j08127K2617L499O6734
10314D09436P7137O4101j482M4144Q7970n632J13371J09263J36300J72125K32859
10303A439592L9557l5357J8851J889k4134n4639p9470q5255l0892n4893k07285
10292I27964q5152J64906j6205j1438k7262O8241Q1513r067k3064J37967L9974
10281A248377J40920R956j15757l3884K8293P6544O2297J50075J61354L5623K6642
$$ y = [247294, 349275, 333569, 391890, 392183, 423343, 422515, 375621, 339077, 383967, 372774, 418086, 383320, 344099, 374831, 539404, 652258, 613544, 569634, 411823, 285421, 288966, 365802, 398640, 426178, 296858, 219755, 333338, 333065, 294823, 337308, 424216, 396203, 448740, 589308, 602436, 506309, 400545, 399872, 519719, 520980, 498102, 424713, 316586, 339203, 342702, 409436, 486573, 550674, 549192, 593336, 681306, 675674, 789045, 898308, 1034608, 1206733, 1439592, 1479149, 1443792, 1462643, 1464532, 1440398, 1385759, 1306289, 1221034, 1190142, 1135249, 927964, 842812, 1007718, 991513, 980075, 952813, 1021054, 1102567, 1093500, 1070436, 1208403, 1248377, 1389297, 1399253, 1283496, 1249612, 1277905, 1354449, 1416746, 1566821, 1728175, 1763798, 1790440]
10270A790440m7746j44261r7698j03430p3327m8097j34159O405L6761p5689o1384
10259A047815m652o8615o2042l4048L2806m639j59027j3690R9134N9654M1320
10248I34016K9092L0952J53348J32938O5402K6555K4774o4559m0840n1979j97121
10237A042578k22103n4302k7110N6044n2243m3011p8950p2350j1959m5069p3999
10226D17526m6723O8117Q0797l9577k4438j01014m2370o9576j3189L2908L2938
10215B95399m9457o4974p0006p737o9374J9266k7547K9517L130k1750k8373p3829
10203f5735j15298J09318L1778N9681J9119O1666J602N1886M9119J9838O3896
10192B86870O2601J0656j90724k21166l7245J30340k3318m2784Q320M3353L2705
$$ y = [1790440, 1742694, 1598433, 1500735, 1397305, 1323978, 1275881, 1141722, 1148127, 1184888, 1109199, 1047815, 1043163, 974548, 912506, 878458, 911264, 906625, 747598, 733908, 833042, 892696, 934016, 963108, 994060, 1147408, 1280346, 1345748, 1372303, 1397077, 1332518, 1291678, 1239699, 1042578, 820475, 766173, 739063, 795107, 742864, 699853, 620903, 548553, 536594, 491525, 417526, 370803, 438920, 519717, 480140, 455702, 354688, 312318, 242742, 229553, 262461, 295399, 245942, 180968, 110962, 103225, 33851, 53117, 25570, 55087, 58217, 36467, 8094, -65735, -181033, -71715, -39937, 19744, 38863, 100529, 102131, 154017, 203136, 222974, 286870, 349471, 360127, 169403, -51763, -89008, 41332, 18014, -24770, -16450, 26903, 59608]
10181E9608j1263J7062L4124M2525J2189j0166M7093r810P7480l6121q7290k4862
10169A10569j14050p8586L20M3486J9649L755M2757J01026R644l1334n4185q1461
10157b8410k5206M3209k3189J3198P0368o1475j4409j3111m3787n4479o394J3861
10145a29824O4794Q497l5291J22361J08104n2012j55834o9632J07362R6012o0996
10134C541n0849M2524p2042o254N9738J18470L9139j63810j4441O2814l5512Q596
10122h086p8737R8313J1791L615r8493p6218m0557l0400L6294l400N4564O6029
10110f5285Q9091N7303p0754j5687l9417k519L1219j8736q231O6624J27470K1891
10098A72969P7462k0824j66964j02731O394Q350p2295m0458O2314P7110l4497
$$ y = [59608, 48345, 65407, 99531, 142056, 154245, 144079, 191172, 181362, 258842, 222721, 135431, 110569, -3481, -82067, -81747, -38261, -18612, -14857, 27900, 128926, 138570, 107236, 53051, -28410, -53616, -10407, -33596, -20398, 49970, -11505, -25914, -39025, -82812, -137291, -143685, -129824, -65030, -56533, -91824, 30537, 138641, 86629, -69205, -138837, -31475, 64537, 3541, -47308, -4784, -76826, -83080, -23342, 95128, 134267, -29543, -43984, 18830, -16682, -8086, -86823, 11490, 23281, 26896, -71597, -147815, -188372, -218772, -182478, -185878, -131314, -65285, 23806, 81109, 10355, -5332, -44749, -47268, -16049, -34785, -43016, 23608, 151078, 172969, 250431, 229607, 62643, -40088, -33694, -25344, -97639, -138097, -75783, 1327, -33170]
10087c3170l7607K5211k385l687Q8399J11401j04453j57224m1831K4174P3087
10076e8085l1870k2416j8635o8631J21941J07414M3115L0704J04646m5329P246
10065A70100k7127j45272j31151p3139k8167O9830J40148P7462m3389j7681M1196
10054C2810j02579n5113P3008L7430J8543k7709n0958j8022R4158K03763J35332
10043C40663J2361j90505j53341l803J3909j7189O6293R0159O638q4926l0270
10032D9989k8603m1854L0896j071o0254L0020O641K7225Q5792k6820r085P5043
10020A37919m9575j04806m1209K6435o859j5598k8169O7485j1846M9217P8353
10009A01347p3667L4868N2695k8911l3720J9094k1781l9343m5517m4688n6270
$$ y = [-33170, -70777, -45566, -47951, -51638, 36761, 148162, 43709, -113515, -155346, -131172, -58085, -89955, -112371, -131006, -199637, -77696, 29718, 72833, 103537, 208183, 162854, 170100, 142973, -2299, -133450, -206589, -234756, -164926, -24778, 52684, 9295, -8386, 32810, -69769, -124882, -51874, -14444, 4099, -23610, -74568, -92590, 1568, 205331, 340663, 353024, 162519, 9178, 5375, 19284, 2095, 68388, 158547, 165185, 80259, 49989, 21386, -20468, 10428, 9357, -50897, -20877, -14236, 12989, 98781, 71961, 62876, 137919, 88344, -16462, -57671, -31236, -38095, -53693, -81862, -14377, -26223, 22994, 101347, 27680, 62548, 115243, 86332, 52612, 71706, 49925, 10582, -34935, -79623, -135893]
9998a35893J261r444O9757J55286K755j3132K0620j05374Q4027l356J13786q9758
9986I0535n0119J7741r3743j36052l1866L2320N9900M8422K8626j39549m4885
9975b18670l1894L8006M7201N1286Q8394M3521J08631k5326K1613L1568L9351
9964A93681K4554k8264q3481j44360j34980L438J56200J18758P869k6198l6051
9953E1166o5724m3381q2502J03987R6240K6873p0437m1078o139O0149O0458r6773
9941g161m9785l4771M6397m2060j9096N0243L2505O216o3695j50508P3016J08207
9929e0492J9160k6311N1455K6728J07145O8553k4296k2138K5713Q6866k2524m5714
9917A94145l1895j24394q0678N6659Q5035k505J1989l1005L935J9936p448M8594
$$ y = [-135893, -134632, -144076, -74319, 80967, 83722, 70590, 91210, -14164, 69863, 66507, 180293, 90535, 40416, 58157, -35586, -171638, -203504, -171184, -111284, -62862, -34236, -173785, -218670, -250564, -212558, -165357, -114071, -25677, 17844, 126475, 101149, 122762, 154330, 193681, 218235, 189971, 106490, -37870, -172850, -169412, -13212, 105546, 113415, 87217, 51166, -14558, -57939, -140441, -36454, 59786, 86659, 16222, -24856, -30995, 29154, 89612, -7161, -56946, -91717, -45320, -87380, -106476, -56233, -23728, -17512, -81207, -231715, -158699, -50492, -31332, -57643, -6188, 20540, 127685, 196238, 171942, 149804, 175517, 262383, 239859, 194145, 162250, 37856, -42822, 13837, 98872, 96367, 108356, 77351, 81286, 101222, 93774, 142368]
9905A42368m3182j50958l127J25133K4010M3606l2945o1547k2374j9490l3649
9894c2155j1996J10360Q8858L2466r5154R9776k0577n983L9900k5841q2474k1860
9882G5320o4337j1426l4557O0149J01402o141j26677n6710Q9661K2194J08287
9871A57165M050L1615q7919l7643M455j586J44935R5974m6642m2984k8015n9035
9859A34370m3796j9423O2961n40j3905L1570N8683J42418Q9117J52203L3984O5311
9847F92953K18591M13103P45716J025590J123926R09593O212j013239j204668
9838B917777r65708n76982l16145k51827n8740r7566n8331q552Q456k7658n4514
9827E10210N7750j3251K8861p374m4236m318J1116j5481q3893P5865K32230J41757
$$ y = [142368, 99186, -51772, -54899, 70234, 94244, 137850, 104905, 43358, 20984, 1494, -32155, -44151, 66209, 155067, 187533, 92379, 192155, 171578, 165595, 205495, 179654, 97180, 75320, 10983, -443, -35000, 25149, 126551, 120410, -6267, -62977, 26684, 48878, 157165, 161215, 192830, 104911, 67268, 71723, 70137, 215072, 311046, 264404, 221420, 193405, 134370, 90574, 71151, 134112, 133572, 119667, 151237, 209920, 352338, 441455, 593658, 627642, 692953, 911544, 1324647, 2070363, 3095953, 4219879, 5129472, 5135684, 4122445, 2917777, 1952069, 1375087, 1058942, 807115, 748375, 650809, 592478, 583926, 592382, 564724, 510210, 567960, 554709, 583570, 576196, 531960, 527642, 538758, 523277, 439384, 515249, 747479, 889236]
9815H89236J67320J11391n899j24996j74583j83785j98148m964m5905j38748m4112
9804B46807j52519m2723J4595n0476R383O8836L230K1052J3908L2897J35745K9107
9792C29842P5435J59982K43729K58170L99047N27131K4521m16188l30561l91605
9782H79503k51031j81103p1634Q4289j54882k03135P112P6580Q0584Q501J8549
9771B93333P3127r0181m2255K773O1018n5648p5363q9426K2302k4145J2080M4774
9759A32389l5054j13359Q5335q2418M2202Q7091l8071m6802k2442Q5534N8256
9748A52661l8357q2990o9112N6936j5828q8305j6856J8467M1548J1294M3806p7721
9736f4457K0062n3547r8228q4312q1178j25254P1358J81521J53059r3671j47696
$$ y = [889236, 1056556, 1167947, 1162048, 1037052, 862469, 678684, 480536, 475572, 429667, 290919, 246807, 94288, 51565, 66160, 15684, 25067, 93903, 97133, 118185, 132093, 164990, 300735, 329842, 405277, 565259, 808988, 1067158, 1466205, 1993336, 2017857, 1601669, 1271108, 879503, 628472, 447369, 375735, 460024, 305142, 102007, 109119, 185699, 266283, 274784, 293333, 366460, 276279, 234024, 236797, 297815, 242167, 166804, 77378, 99680, 75535, 87615, 132389, 97335, -16024, 69311, -13107, 29095, 116186, 78115, 31313, 8871, 94405, 152661, 114304, 31314, -37798, 19138, 3310, -84995, -101851, -83384, -41836, -30542, 13264, -64457, -44395, -97942, -196170, -280482, -361660, -486914, -415556, -234035, -80976, -174647, -322343]
9725c22343J7780Q5473N300o2470k4773L522O5814J26415j432N135M3185J8848
9713c9546P907P6479P2286L3208N472r4039r4309k6489k5373p0206J62790J12569
9701A20749R1804k6882j01960k9420p7205L2511O961o793Q7496l6843Q902k4718
9689D4602j3904M2551r3196j40627q3966Q2779J18674J05789O3435l1513m0747
9678E3877n604K68M3611K927j63500n6211K2326L7659R505n1795j4233m9491L854
9665a66807m1436K8440J59580J2934P1067n2848j02245O3024Q2203O7188o4569
9654E6531r5145Q5708K166k9051j72923K716j9209J7208k1431P1769N8335p1532
9642a14858o9670P8866J99550J20211j20477n7099l3701m6988n2076J39129O4235
$$ y = [-322343, -304563, -219090, -213790, -276260, -301033, -297511, -231697, -105282, -106714, -101579, -58394, -39546, -31639, 44840, 117126, 150334, 155806, 61767, -32542, -59031, -84404, -154610, 8180, 120749, 212553, 185671, 83711, 54291, -22914, 9597, 16558, 9765, 97261, 60418, 69320, 44602, 30698, 73249, -19947, -160574, -244540, -161761, -43087, 62702, 126137, 94624, 53877, 48273, 48541, 92152, 95079, -68421, -124632, -102306, -64647, -55142, -106937, -121170, -170661, -166807, -208243, -179803, -20223, -7289, 63778, 10930, -91315, -28291, 53912, 121100, 56531, -38614, 47094, 49260, 20209, -152714, -149998, -169207, -151999, -173430, -101661, -43326, -114858, -184528, -105662, 93888, 214099, 93622, 36523, 2822, -44166, -96242, 42887, 107122]
9631A07122r1685j10112L3748j9154J46027P9623n1864l2018j4200p1842j06485
9620a30840L7455P7281r4635l8253N8413K1218O9057m6195j04578J4809R1560
9609d4708K1178l5426o9546n009k6413M6846Q6049P633K4258N733N7247l52j39902
9596g2412r637K6175P55J2123o9944q0931l6828n9432P1342J38829M6988l7458
9584g0430l61K1146j0300K775n7347O6214j0154M1849P1037M3371N075j07266
9572d391j65144m5445N0621P6477J32205L3953N0132l1484m4107j25052j21704
9561a93939O9670N5205M0063J050Q8513N7647m2523j3958r7099o2809r5467J760
9549a91887K2869j1028J59590J0309M4227N3736k2639r9338R619m4979q3868M4873
$$ y = [107122, 15437, -94675, -60927, -80081, 65946, 145569, 93705, 61687, 47487, -24355, -130840, -93385, -16104, -110739, -148992, -90579, -69361, -304, -46499, -151077, -136268, -44708, -23530, -58956, -128502, -133511, -159924, -113078, -27029, -19396, 4862, 10595, 67842, 67490, -72412, -82049, -55874, -55119, -42996, -112940, -193871, -230699, -290131, -218789, -79960, -32972, -70430, -70791, -49645, -59945, -57170, -114517, -48303, -58457, -16608, 54429, 97800, 102875, -4391, -169535, -214980, -164359, -87882, 44323, 78276, 128408, 96924, 52817, -72235, -193939, -124269, -69064, -29001, -27951, 60562, 118209, 75686, 61728, -35371, -98180, -193647, -191887, -169018, -180046, -20456, -10147, 34080, 87816, 65177, -34161, -24542, -69521, -153389, -108516]
9537a08516P2310J5202j5653r8694L2277J06876q9897l4154O1197n8806k0229
9526a38087O9391L2003O4802j3966Q7123K1647j5840j21739j62993R7909O3363
9515a6387j20227q3596J7499O40j3642k8144K1922K8083L8643M7929P8123l9988
9503f9145L6692K8092o9570o5769L0878J8685M0769L0298K1187q3813l4199L7849
9491g8046q086q3613J1355Q3580M507q6524r2180k4053O6205Q7463N3658k1186
9479h6920l6134J2569M3597M5945n8344L0028l2468o6629R8455j2753q1886J4930
9467a29610J49708J07958j04926m7925n3712K7495N8768q965o284K2623K2858
9456C7988j06222j54639L0001J45063J11892p1133L8050o1348q637n4378J8352
$$ y = [-108516, -36206, -21004, -36657, -135351, -103074, 3802, -86095, -120249, -59052, -117858, -138087, -68696, -36693, 28109, 14143, 101266, 122913, 107073, -14666, -177659, -79750, -16387, -136614, -220210, -202711, -202071, -215713, -243857, -221935, -193852, -155209, -107280, -29157, -69145, -32453, -4361, -73931, -139700, -108822, -90137, -49368, -19070, 2117, -81696, -115895, -78046, -86132, -169745, -158390, -74810, -70303, -156827, -249007, -273060, -206855, -119392, -65734, -86920, -123054, -110485, -66888, -20943, -79287, -49259, -81727, -148356, -49901, -62654, -144540, -129610, 20098, 128056, 23130, -24795, -78507, -51012, 7756, -1209, -7493, 15130, 37988, -68234, -222873, -192872, -47809, 64083, -7050, 31000, -30348, -38985, -93363, -75011]
9445g5011J3080K0079K1040K5187r4072l9715K0613N1386J15414J94031J4159
9434B66191k00553j40224L6448j7701k0339M8783o1298p859L7533N5877n6405
9423e9547r2057n8936J01293J36999L3285j698o3184j7913n3063n5939l6374l8541
9411b05675J5185L3206n4103n6204L377R1191O5588j1669M0635J9654J4311n0523
9399i5027K7746M5131J0805p8947O1774J05918J3109p0124p0846k8415j8850L4270
9387f3456Q2368K8349L246l9930m514j6310L3328K5016o2658m5681q4652m2440
9375a87334p142n578R7183M4775L6183j5579P261K8885L5662M5101O84m3824m5315
9362i038R356M275j5598P0679o5757j12218K8090J19225R6198n8170J2404L6814
$$ y = [-75011, -61931, -41852, -20812, 4375, -89697, -129412, -108799, -57413, 58001, 252032, 266191, 65638, -74586, -38138, -55839, -76178, -27395, -88693, -96552, -59019, -3142, -59547, -151604, -210540, -109247, 27752, 61037, 59339, -3845, -21758, -74821, -130760, -167134, -205675, -190490, -157284, -211387, -267591, -264214, -173023, -107435, -119104, -78469, -58815, -44504, -95027, -67281, -22150, -11345, -90292, -28518, 77400, 90509, 20385, -50461, -78876, -97726, -63456, 18912, 47261, 50507, 10577, 6063, -10247, 23081, 48097, -14561, -60242, -144894, -187334, -194476, -200054, -102871, -58096, -21913, -37492, -30231, -1346, 34316, 79417, 80101, 36277, -9038, 318, 4593, -11005, 59674, -6083, -118301, -90211, 29014, 125212, 67042, 79446, 116260]
9350A16260K5256K8652L8022N6808l8869m3121q0521r1316j7664k6839j1238m74
9338d5044q136K9063J3628o2897l7818L8666r870q5993O7361K2101j1700j841
9326i2480o6749O2239J08401M3398K0967j9880j898m4466j11646L2618l4882m8929
9314a53307l6633N8251k4643j7719N5284L9648l8405K0815M4844L4011K9926J02892
9302A14964k3309o2138o7402o9778K5801J04466J17610k0851P0887j4554r6271
9291G9425J6837N0230p8537p16r540q8644p8360l7644N9973L0579L5388K9624
9279H615p593j24512p71J13498Q9308l4032J3907J3570M9490r7327j14261r5303
9267a85411L3585m5455N8528J33587O806L1091J21270J0302o5207m3893k9606
$$ y = [116260, 141516, 170168, 208190, 264998, 226129, 183008, 102487, 11171, -6493, -33332, -44570, -45044, -53180, -24117, -10489, -73386, -111204, -72538, -82408, -168401, -101040, -78939, -90639, -92480, -159229, -96990, 11411, 54809, 75776, 55896, 53998, 9532, -102114, -69496, -104378, -153307, -189940, -131689, -156332, -174051, -118767, -79119, -117524, -96709, -51865, -17854, 12072, 114964, 91655, 29517, -37885, -107663, -81862, 22604, 140214, 119363, 190250, 175696, 79425, 96262, 146492, 67955, 67239, 57699, -30945, -109305, -146949, -86976, -56397, -21009, 8615, 1022, -123490, -124261, -10763, 78545, 44513, 58420, 71990, 121480, 24153, -90108, -185411, -151826, -197281, -138753, -5166, 1640, 32731, 154001, 164303, 99096, 55203, 25597]
9256B5597m1185r2610q8689J9682P7957O4243l3434L1852Q8644L8059L8522K5484
9244A54122j35800o2537O0155O9775k7120j43231o5485N4552n2526J05172N885
9233c7038o4861J33288J20142m6037j09026r0016J3938L2261J46623P2942J863
9222A74079n5445o5444M7090N6696O9904j00209r3705q8888N0681J74316J31666
9211C00741o2253q3378J1034r5551m6011m2813P6545p120l8036M0767N7925o2644
9199D9206j3134j0095m2995n8144N6425N5639k5835j01019r3757O4033K7556k5914
9187a18034l5897K2313m6189m2872P3330R4457N0873J0781j8619L6599k3540M8331
9175E1533R7602r6420j59866P0464Q5681p7010m442k4368o3359p9939k4583j0385
$$ y = [25597, -15588, -108198, -196887, -177205, -99248, -35005, -68439, -36587, 52057, 90116, 128638, 154122, 18322, -44215, 15940, 85715, 58595, -84636, -150121, -95569, -148095, -42923, -37038, -101899, 31389, 151531, 105494, -3532, -93548, -79610, -47349, 99274, 172216, 174079, 118634, 53190, 100280, 156976, 226880, 126671, 32966, -55922, -5241, 169075, 300741, 238488, 155110, 166144, 70593, 24582, -18231, 58314, 51194, 13158, 53925, 111850, 49206, 36072, 25977, -17018, -75162, -18737, 36902, 11067, -89952, -183709, -119676, -92120, -118034, -153931, -131618, -177807, -220679, -147349, -52892, -2019, 8762, -9857, 26742, 3202, 51533, 149135, 52715, -107151, -36687, 48994, -28016, -32458, -56826, -120185, -200124, -224707, -235092]
9163b35092l6006l8378J23613O9397L4808L4911m7683N9843J53449r529o4023
9152D5310J04363j3298p8707N79j1899J8078J4145k0084O8571r7877M0687l9347
9140C0521k909o8890L2023M234p3079n1789k3717J9584M1320M633l5627k6707
9128a50403R570l9812K0404J15702P8824J9271o028L1150n2367o6521O0396P006
9116B7192L2032J14494J4242k5260q9277r3789m0000N389M1853N7343Q4157j09671
9104A8705l2854N3178L3628m0784j08298j6627R4768j34318k5466L8518J15602
9093c948M3298j7226M7005M0372O1664L9156r0962q1701m3320K8791Q1939J43344
9081B48412M2340j10575j2399j24439k1292M8446o1309j01945L7716m632J31034
$$ y = [-235092, -271098, -309476, -185863, -116466, -81658, -46747, -94430, -34587, 118862, 109333, 45310, 149673, 136375, 57668, 58247, 46348, 64426, 78571, 58487, 127058, 29181, 69868, 30521, 27612, -41278, -9255, -5021, -78100, -129889, -153606, -134022, -92702, -88069, -123696, -150403, -140833, -180645, -160241, -44539, 34285, 53556, 47528, 78678, 26311, -40210, 20186, 27192, 59224, 173718, 187960, 162700, 73423, -20366, -60366, -54977, -13124, 44219, 128376, 18705, -14149, 39029, 72657, 31873, -76425, -93052, 1716, -132602, -158068, -119550, -3948, 39350, 22124, 69129, 109501, 171165, 210321, 119359, 37658, -5662, 23129, 105068, 248412, 290752, 180177, 167778, 43339, 22047, 70493, 9184, -92761, -55045, -59677, 71357]
9070G1357o0989j40139R191J14838K6055J29604r1760j9869q214q2967q1368k7690
9058a61951m2237n7898R9970J33338O6306p3214N8598J28297q1460O7676j02802
9047C4623k6179l3605M9138K3247M7846l9494l7882j7148K6461j5109j2405j2452
9035a2959j3988j9110Q5593J7626O724j12833j48293o631j1002M4850O5429K2524
9023h2070o8408J454O5703q665K7320j823N9400l3451o8862K0265p6821J8505
9011a47453l0348k6433L9468L5901j5687k7115j4912P1595N1240n750J03685K5949
8999F0140q6205r5383j5230J35194J118p5453n629l941J3576J53229Q386o7740
8987B2062J10262j9629l5543j1367l9217O3688m0261O353R276o9395r0574J5708
$$ y = [71357, 10368, -129771, -120580, -5742, 20313, 149917, 58157, 38288, 30074, -52893, -134261, -161951, -204188, -262086, -162116, -28778, 37528, -35686, 22912, 151209, 69749, 137425, 34623, 8444, -25161, 23977, 47224, 95070, 55576, 17694, 546, 27007, 11898, -507, -12959, -26947, -46057, 39536, 57162, 63886, -48947, -197240, -203871, -214873, -170023, -104594, -82070, -150478, -149024, -83321, -91986, -64666, -66489, -7089, -40540, -109402, -89137, -165958, -147453, -177801, -204234, -164766, -128865, -144552, -171667, -186579, -114984, -63744, -69494, 34191, 60140, -26065, -121448, -136678, -1484, -366, -75819, -81448, -85389, -71813, 81416, 89802, 22062, 132324, 112695, 77152, 65785, 26568, 90256, 49995, 56348, 65624, -3771, -94345, -78637]
8975g8637Q1012R8045k6779j6143n583k1698M9970J2033q5230q2676O1703N1381
8963C7398j4626K4006M917P4599m5456j4383m8518j266N0575p3795J0038k1302
8951a7813K7444J2775K1911M4931J5666J5366n9549J8756m743m2388r8506l7958
8939a04108N9812l0996m8171l0503M5719M4437N95o219K2503k0768l0952m4506
8927a43157Q1990J09511j7218p4795O4075O814M0225p8286j74257k9654J4048
8916b00704m7224K4391J0805J0532o0824P5412N9817J13513K8237K2516M47J5468
8904E2386L1061P647q6013K1834k5390n2304R1794m0128n1876o8929R0380K3555
8892e983j1820J00152k1231r5906N5778n8950M0O1351n0235r8042J8868Q900K3004
$$ y = [-78637, 2375, 100420, 73641, 57498, 51915, 30217, 80187, 92220, 6990, -75686, -13983, 37398, 22772, 46778, 51695, 126294, 80838, 66455, 17937, 16671, 67246, -6549, 3489, -17813, 9631, 22406, 44317, 89248, 104914, 120280, 60731, 79487, 74744, 32356, -66150, -104108, -44296, -75292, -123463, -153966, -108247, -63810, -63215, -69434, -46931, -67699, -98651, -143157, -61167, 48344, 31126, -43669, 20406, 27220, 67445, -10841, -185098, -214752, -200704, -247928, -223537, -212732, -202200, -263024, -187612, -127795, -14282, 13955, 36471, 36918, 52386, 83447, 91094, 5081, 26915, 1525, -50779, 41015, 887, -50989, -119918, -29538, -5983, -17803, 82349, 61118, -34788, 20990, -37960, -37920, 23431, -26804, -124846, -105978, -97078, -74074]
8879g4074K8701J4324k7453p1024O1781J06809Q7157J4215r1262j68284r9178
8868b18288J19180K1756L3116o7340Q407N6447m1683n3320L1725J5159p9067n774
8856a79682k4558l5200K8775J24281K4015O8386q8499j25818p8654l4262N1537
8845b69679M4669j0923L23J28937R9186N6119Q9131q4399q3662K482O2955n056
8833C0083o5800L2860L1532m8470N5700J1050J02538j7993j10772j4613M5770
8822E1885J1545j0034j1225k6917o7688L533J6755j9893N2439M6592r261j30133
8810i2402M0945Q708L8835M598k6968j5782k3172N0177J3603o0992l3447O2492
8798c3405O0265j8200n8769N405l0002o4700M4380N4953m094J2878K9466O5351
$$ y = [-74074, -45373, -31049, -58502, -129526, -67745, 39064, 126221, 140436, 49174, -119110, -218288, -99108, -77352, -44236, -111576, -103169, -46722, -88405, -141725, -110000, -94841, -173908, -179682, -204240, -239440, -210665, -86384, -62369, 6017, -82482, -208300, -286954, -321216, -269679, -225010, -235933, -235610, -106673, -7487, 48632, 137763, 53364, -30298, -27816, 35139, 30083, -35717, -2857, 28675, -19795, 35905, 46955, 149493, 131500, 20728, 6115, 51885, 63430, 53396, 42171, 15254, -52434, -48901, -32146, -52039, 400, 46992, 37731, -92402, -51457, -42749, -3914, 684, -26284, -42066, -65238, -15061, -1458, -62450, -95897, -33405, 26860, 8660, -50109, -44704, -74706, -139406, -95026, -40073, -44167, -31289, -1823, 63528]
8786F3528J02053L0547p4155l2953n6894n5643Q346N5661k7083j8988J7010q7117
8774g5688Q9265R2565M5616L8098l2987j0142K4118M704p0533n3546l6482M0522
8762E5510K3255L1417o7806j27728p4279R3133J23633l0765L2296R3182R4M1223
8750A93165j08731m0549l8028Q562j8563r996J4570M5577K348N1598M1982R256
8738A51191n1515K7780K3845q2487j1706K8059r7673m5684J31179L6746n9032
8727E0703P0937n4281L138K2121n4854m7286l8657p759M2474O4771P838M1832
8715A00977o0289q047J4935m7755J1838J5313n5709n2755l6346j2297Q2403Q8108
8703D0376J5508P2752m0226q6084o1293J788j7431J7354Q3796J48016M4142p5275
$$ y = [63528, 165581, 196128, 121973, 89020, 32126, -23517, -15171, 40490, 13407, -5581, 11429, -75688, 13577, 106142, 151758, 189856, 156869, 146727, 170845, 175549, 105016, 51470, 14988, 55510, 78765, 110182, 42376, -85352, -159631, -66498, 57135, 26370, 58666, 151848, 151942, 193165, 84434, 43885, 5857, 14419, -4144, -14140, 430, 46007, 48355, 99953, 141935, 151191, 99676, 127456, 151301, 68814, 57108, 85167, -12506, -58190, 72989, 109735, 50703, 121640, 67359, 70497, 92618, 37764, -9522, -48179, -55938, -13464, 51307, 59145, 100977, 40688, 32641, 47576, -179, 11659, 26972, -28737, -81492, -117838, -130135, -47732, 40376, 55884, 128636, 88410, 2326, -58967, -57179, -74610, -57256, 26540, 174556, 218698, 143423]
8691A43423K3331J2665q4809j11178K1967m274K6889P6348p254k5760n778j9559
8679D6011J4173Q15J816j38697q4527N4023Q2389p7031j9115j9156M5772Q2019
8667a1508q730l1328R2330K3193M6639j15718R095O5757K4321o7044p694P2069
8655I1382m6823j44106k2925L2411M4717J6799O7164P6590N8410K9778J31075
8644C34472K13658K27819K49767K98760J70425k65151l34882j65963j95977j11286
8634D21642r104r7940j6048L4341q6411J0161p4306j42226k5213M9151K9075L3472
8622A26594R9855K2282j181L9085n2078N7755M8417k1304M374k0409r194k0167
8610B74029p4164n6562n2804M9170P3081N0893J25849l188R2489J64858P9705
$$ y = [143423, 166754, 179419, 94610, -16568, 5399, 1125, 28014, 104362, 97108, 71348, 65570, 46011, 60184, 60999, 62815, -75882, -160409, -106386, -23997, -101028, -120143, -139299, -93527, -11508, -20238, -51566, 40764, 63957, 110596, -5122, 3973, 69730, 94051, 27007, 19313, 91382, 44559, -99547, -122472, -90061, -45344, -28545, 38619, 115209, 173619, 203397, 334472, 548130, 775949, 1025716, 1324476, 1494901, 1229750, 894868, 728905, 532928, 421642, 412538, 314598, 298550, 332891, 246480, 256641, 182335, 40109, 14896, 64047, 93122, 126594, 226449, 248731, 247550, 286635, 234557, 292312, 340729, 319425, 323799, 303390, 294196, 274029, 199865, 143303, 90499, 139669, 212750, 263643, 389492, 386304, 478793, 643651, 723356]
8599G23356J89640L29639O38103P48375L43025l17786o52336n27685m35700j65750
8589H72881j03005r1081j9209j9931j658M8930j05272j20398L2233K6019k8369
8578D91140M7896k7983r9493n2913j1120p9322N8640N9130j8705N0535P0350j1650
8566D76505j78782j72552N2715K34k7899o5617O9318P6738L3541o6666j8881Q0124
8554B58778L2023J12885L32350M27672K66101j59958l25629k03789q6709j98366
8544D55358j80824j78689j969J26187J4085r0879K8771j4006j17005J3518M1114
8533I5661L9726L7375L2894N0648m1261J9610J0553k1373o9111k7071k2627j3551
8521I1473J10079M8279P5283M9582n8145j00033o9403j28138j46587o1641m0622
$$ y = [723356, 912996, 1242635, 1880738, 2629113, 2972138, 2654352, 2002016, 1474331, 1038631, 872881, 769876, 678795, 659586, 639655, 637997, 686927, 581655, 461257, 493490, 519509, 491140, 539036, 511053, 411560, 358647, 347527, 268205, 326845, 385975, 367270, 417805, 488155, 476505, 297723, 125171, 177886, 178120, 150221, 84604, 153922, 230660, 264201, 197535, 178654, 258778, 290801, 403686, 736036, 1163708, 1429809, 1269851, 944222, 740433, 653724, 455358, 274534, 95845, 93876, 220063, 234148, 143269, 172040, 158034, 41029, 54547, 95661, 135387, 172762, 205656, 256304, 215043, 234653, 245206, 223833, 154722, 127651, 105024, 91473, 201552, 249831, 325114, 374696, 316551, 216518, 147115, 18977, -127610, -189251, -229873]
8510b29873k4946J29746J42413j3657J7349Q463m5150j45286j14778J10233J62440
8499c046R8976N2472K8610n2667r7269k3919N714K9070O703L2278K9417M4997
8487A51336Q2192j9840j38341p9515L1237N5776l8455p5810O7585J4604K1899
8476G2668k4898q57q075j3643j444q3046p4209J12310P0394l6170M4742r628L899
8463E2043j01363J6555N870j7399n629M4584q4081M8667J45161M5211l7928r5232
8451A6459J05016n3982M3351k6962J03356o729j32024l2461p8348m8922J1135
8440a00111j2561N8202M0866L5935j7696j6207r1570p536j4080P1540K6339k7499
8428e4378N9284O6695k7471N8614J1681j00087k6250N1356K3109m9269J194o244
$$ y = [-229873, -254819, -125073, 17340, 3683, 21032, 29495, -15655, -160941, -275719, -165486, -3046, 95930, 148402, 177012, 124345, 27076, 3157, 8871, 37941, 44644, 76922, 106339, 151336, 233528, 213688, 75347, -4168, 27069, 82845, 44390, -31420, 36165, 50769, 72668, 47770, 46913, 38838, 25195, 23751, -59295, -133504, -21194, 49200, 13030, 57772, 48144, 52043, -49320, -32765, -26895, -44294, -49923, -5339, -89420, -40753, 104408, 149619, 111691, 16459, 121475, 67493, 110844, 83882, 187238, 180509, 48485, 16024, -62324, -111246, -100111, -112672, -54470, -13604, 22331, 4635, -11572, -103142, -110678, -124758, -53218, -26879, -54378, 4906, 71601, 44130, 102744, 114425, 14338, -11912, 39444, 62553, 13284, 14478, 8234]
8416H234P9368j229o2891j5653R4579R1150l8842r7577l5455L5209k2157k1238
8404A3498j7082N5905O4317r8466M3862J69004O5028j3552J9440P8151L2708q9067
8392C23746j03979j11274j5092K690r332j1287m756K1060l569o0709J2120l9316
8380C02p0758M0819J9121j0838J0865N6847m328o3137L1997l0326j08054K0890
8368a06600J23740R9716q2201j12652k7233K2108K054P8778j1234l9579K2399
8357c0704J48484O5702q227l4084r7591m7226j8267j61066J6984J42221j3413
8346c7187O2700J05486r5704l6314j03474l5031N1909J2547K3409o0553m0229
8335a52441J33423P1579R7260L9075q7833j70897q2620O6297J3303J743R1989
$$ y = [8234, 87602, 86373, 23482, 7829, 102408, 193558, 154716, 57139, 21684, 56893, 34736, 13498, -3584, 52321, 116638, 18172, 62034, 231038, 296066, 282514, 301954, 380105, 412813, 323746, 219767, 108493, 93401, 96091, 86759, 75472, 70716, 91776, 88207, 27498, 39618, 302, -70456, -29637, -10516, -21354, -10489, 46358, 42030, -21107, 10890, -19436, -127490, -106600, 17140, 116856, 34655, -77997, -105230, -83122, -81068, -2290, -13524, -53103, -30704, 117780, 183482, 175255, 141171, 43580, -3646, -21913, -182979, -165995, -23774, -37187, 25513, 130999, 35295, -1019, -104493, -139524, -87615, -75068, -51659, -112212, -152441, -19018, 52561, 149821, 188896, 101063, -69834, -152454, -86157, -72854, -71111, 20878]
8324B0878O0089m0431n443j01745j0156O4758l7987o4383l1122O9685J16928n6079
8312a5008l1679O63J2603l923o8006P6653P7179K2339k1340O7814Q8084Q7208
8300B92587o4655n5863J25724r6949k64278m4200N5280p8192K5977N9472Q68k0512
8288f4741M924P186P9540K8558o973N422m1011m3965P1390n6244n2435p6474o3486
8275b08309L3066m6257J78145K09187j8499j25036n0529k4525P3572Q7358k1982
8264H6191J5641K9902K6386q2506j35191o2966K5731P7024P3055O4122K6584J3944
8252A57917n1806j9655J569j42779j76901r839J2091J21387J11845L9210j0636
8241C2403P9396k9631P6818q1349j33844r523q163J7492r641m6568L0700M979
$$ y = [20878, 80967, 40536, 35093, -66652, -76808, -12050, -50037, -114420, -145542, -75857, 41071, -15008, -46687, -46024, -33421, -37344, -105350, -28697, 48482, 70821, 49481, 117295, 205379, 292587, 227932, 172069, 297793, 200844, -63434, -107634, -52354, -130546, -104569, -45097, -44229, -64741, -59817, -52631, 26909, 55467, 48494, 53916, 12905, -31060, 40330, -15914, -68349, -144823, -208309, -175243, -221500, -43355, 165832, 147333, 22297, -28232, -52757, 20815, 108173, 86191, 101832, 131734, 158120, 75614, -59577, -122543, -96812, -19788, 53267, 117389, 143973, 157917, 106111, 86456, 88025, -54754, -231655, -241494, -229403, -108016, 3829, 43039, 32403, 111799, 82168, 158986, 77637, -56207, -65730, -73893, -56401, -66042, -112610, -81910, -76931]
8229g6931J6485P2102K0989j4588P9602l91q2388p1347m2152r0581L0307N2544
8217a06349O640K2535j5502m4060L1366J13166K4226o4635o6414m299J87340O1538
8205A45552r5967Q621m7625J8137j7495j1762j3431P821j7841N7284Q7721Q4340
8193B05355j9384k3996m8367l0737n4586j60308L4147K22685k9505m3249R2281
8182A44336j3324j32329n7146p7985J8170K0675J30740M7873k7712n6432j28446
8171a31580J6499R9330m5143k029N3343k7228o1161J7908j6492k2444j26326n9983
8159c05306P359R9239j4536j8815J8336J1435N4779J82057n584p1390j16810n1426
8147b10662L1531L7011l071J15309R3455J5847Q5767K9562r359j32010m2948m0783
$$ y = [-76931, -60446, 11656, 32645, 18057, 97659, 97268, 14880, -56467, -98619, -189200, -158893, -106349, -99709, -77174, -92676, -136736, -105370, 7796, 32022, -32613, -99027, -103326, 84014, 145552, 49585, 58206, 10581, 28718, 11223, -539, -13970, -6149, -23990, 33294, 121015, 205355, 185971, 161975, 113608, 82871, 28285, -132023, -97876, 124809, 95304, 52055, 144336, 131012, -1317, -58463, -136448, -118278, -97603, 33137, 81010, 53298, -3134, -131580, -115081, -15751, -60894, -62923, -9580, -36808, -97969, -80061, -96553, -118997, -245323, -305306, -297947, -198708, -213244, -232059, -213723, -202288, -147509, 34548, 28964, -42426, -159236, -210662, -179131, -142120, -145191, -29882, 63573, 79420, 165187, 194749, 185390, 53380, 10432, -30351]
8135c0351p1268P8495r0486N0404J8225R7796N6955K4398m5582R458j12296o3384
8123g7636r19O9806j2971j12042n188n4347K279N9305K8906M9752p1863o7995
8111a92913L8087J13901N8840o926o9115r150L8288J7806N2803L6010q6591k2957
8099c1917l420m3686m3747M3086L0959N2527p825k9871l1415l7826n6250J994
8087a57391M2073J4482P1939J19975j6325N1109k3912m8558l0107l4921j61301
8076a72937L3020J04136q1925n0041k0583M4588O9031L182P6159j67743J4088
8065a49025Q1217m7365j01904L248K8298L5175Q9365k440j3915K429J3591J57493
8053I6167N7268j49757L25N3510J7558m4001p1828M581L9413q4958m5478R4333
$$ y = [-30351, -101619, -23124, -113610, -63206, -44981, 52815, 109770, 134168, 88586, 98044, -14252, -77636, -78555, -8749, -21720, -133762, -138950, -193297, -191018, -131713, -102807, -53055, -124918, -192913, -154826, -40925, 17915, 10989, -58126, -67276, -28988, -11182, 41621, 77631, -8960, -31917, -35337, -79023, -122770, -79684, -48725, 3802, -4023, -33894, -65309, -103135, -159385, -157391, -115318, -100836, -28897, 91078, 74753, 125862, 101950, 53392, 23285, -11636, -172937, -139917, -35781, -117706, -167747, -188330, -143742, -74711, -71529, 4630, -163113, -149025, -67808, -115173, -217077, -213829, -185531, -150356, -60991, -63431, -77346, -74917, -61326, 96167, 153435, 3678, 4003, 57513, 75071, 31070, -40758, -36177, 3236, -81722, -127200, -32867]
8041c2867j6550l468O7506k0693k3138o7062J5611m5327l5189N0785J34202M8162
8029G1972J0825P112p9155P929N9251O062m2103n1349p507R6246J38837M4150
8017B62270j01547l9728L3592j23690j33178L7569J78551O0455j46807q0960J2543
8006d0930M5875L3262L1771R1616j2215m7824K6212J8711l0768r0871L9891L421
7994F8151L8175l9652j24006J2417J08075J07650K7280L6176Q5386J7939L06p1303
7982B66594n2031j24559R522P5344l1631J264J6617k9247m1619j80860j884J17740
7970B5250L8088M3609N1333m8158q0867l2299L2453j4205J8638K8895m658j29926
7958g1847K3458r107O8640R9339N636r5250o3024R8953R0994P6290K0388k0234
$$ y = [-32867, -49417, -52885, 14621, -6072, -29210, -96272, -80661, -125988, -161177, -110392, 23810, 71972, 82797, 89909, 10754, 18683, 77934, 83996, 41893, -9456, -16963, 79283, 218120, 262270, 160723, 120995, 154587, 30897, -102281, -64712, 113839, 174294, 27487, -53473, -40930, 4945, 38207, 69978, 161594, 149379, 101555, 127767, 146478, 115710, 24839, 64730, 68151, 106326, 66674, -57332, -44915, 63160, 170810, 198090, 234266, 319652, 337591, 337897, 266594, 214563, 90004, 99526, 174870, 143239, 144503, 161120, 131873, 90254, -90606, -92490, 25250, 63338, 106947, 158280, 110122, 29255, -3044, 29409, 15204, 33842, 62737, 58079, -71847, -48389, -57496, 11144, 110483, 116119, 20869, -42155, 56798, 147792, 224082, 244470, 224236]
7946B24236r3858o9244L5355p8732p5166J28701q0475J6913O0088j8160q7635
7935c7977N3796l5795J1017n1251j9739k0367K0917P1660l9994m9687O7104j4287
7923d4603n7397M7426P2675L3816J77517J539j3872j07247j9135J31898n2003
7912A70614q7826K3421n9051L226N542Q0719P2788k1467l2328j06844n4302J8179
7900A2671j5937j23953J7022P3445N2983p439m2909m1763m4926m295L8733L8995
7888d7373P4428M5368n4736k2596m1972m9452j5535j0532M6721J30937m2171P7020
7876I0107p5336m2020M6753R1361j3343L4089j21344j02585p5265O6220J9611
7865h1752Q2995l625J3001l5890j9938L8703N539J9386M2679j3930l0831r5743
$$ y = [224236, 130378, 61134, 96489, 17757, -57409, 71292, -9183, 7730, 67818, 49658, -37977, 15819, -19976, -8959, -60210, -79949, -100316, -79399, -7739, -47733, -97420, -30316, -44603, -102000, -54574, 18101, 51917, 229434, 230973, 217101, 109854, 90719, 222617, 170614, 82788, 106209, 47158, 50384, 55926, 136645, 209433, 187966, 155638, 48794, -5508, 12671, -3266, -127219, -110197, -36752, 16231, 8792, -34117, -75880, -120806, -125101, -86368, -47373, 27055, 72423, 17687, -4909, -46881, -96333, -111868, -122400, -75679, 55258, 13087, 90107, 14771, -27249, 19504, 110865, 97522, 131611, 10267, -92318, -167583, -101363, -81752, 1243, -2382, 10619, -25271, -45209, -6506, -967, 18419, 61098, 47168, 16337, -79406]
7853g9406L8415M3379K9321K0621K0859r062j12535o1903r981Q8140J5908Q3269
7841F7025l369r878j17876L8740O0529Q4205M174p2287q9489m3352l4526M1452
7829g4652Q1274n0056M919L3290n1277Q798Q6257j8008J2897p1637r5544J0284
7817a23455j3678r8976p242J29315N8503l7471K953j45566Q5047P4734j1244l4004
7805a21084q3992O1244J07114J06501j0518K8819P6832r640m1935q393n5031j03426
7793e3509m2214L6084Q9033O4381o0058j49324M0120O3898R5000R1738J6064j04575
7781H6638j21569o3898M2613J7112j3460K7233l1662k3603j38188K317J4582J35047
7769f6838J5747K7980p517P6947L8818P6966j05978j46020J9062N4256J16089
$$ y = [-79406, -40991, 2388, 31709, 52330, 73189, 64127, -48408, -110311, -120292, -32152, -16244, 67025, 63656, 53778, -64098, -25358, 35171, 119376, 123550, 51263, -38226, -81578, -116104, -74652, 6622, -43434, -38515, -5225, -56502, -47704, 38553, 20545, 33442, -38195, -133739, -123455, -137133, -236109, -243351, -114036, -55533, -93004, -90051, -235617, -150570, -75836, -87080, -121084, -205076, -143832, -36718, 69783, 59265, 88084, 164916, 155276, 113341, 104948, 49917, -53509, -95723, -59639, 29394, 93775, 33717, -115607, -75487, -11589, 83411, 175149, 191213, 86638, -34931, -98829, -56216, -39104, -52564, -25331, -56993, -80596, -218784, -216467, -201885, -66838, -51091, -23111, -30628, 46319, 85137, 162103, 56125, -89895, -70833, -16577, 99512]
7758I9512j3552r0817p5676k1324J41485L7124P7161M1666p8112m2447j0163r298
7746E5559q4571l5106K0278l558k341N767O5556J8183k8357Q9385N0984j43180
7734H599m6796l2866k0267O3959M8122n2650L4119p980J7355q6658k921J17721
7722C9737O9636O965q7882J30107m183j08738j75846L364j3002j5516l0095K8066
7710a57387M141R6138J6624j83213p836L84P965P2880J41915O5778j19015q0182
7698a41808K7013r2994o367J40935N3152j19334m4773O9981O1063J43733O9472
7687A60073j5014j01429n9556L636j1916l1642K6033P075L3623o939j16513K1182
7675i1387J5866J4231Q0517M5751j2136k2201j41525n6851R7898J4749j9932J4351
$$ y = [99512, 85960, -4857, -80533, -101857, 39628, 76752, 153913, 195579, 117467, 75020, 64857, 55559, -29012, -64118, -43840, -47398, -49739, -43972, 21584, 39767, 11410, 100795, 151779, 8599, -38197, -71063, -91330, -27371, 20751, -31899, 2220, -5760, 11595, -75063, -77984, 39737, 109373, 116338, 28456, 158563, 154380, 45642, -130204, -126840, -139842, -155358, -185453, -157387, -153246, -57108, -40484, -223697, -231533, -231149, -223184, -150304, -8389, 57389, -61626, -141808, -114795, -207789, -214156, -73221, -20069, -139403, -184176, -114195, -53132, 90601, 160073, 145059, 43630, -15926, -12290, -24206, -55848, -29815, -22740, 10883, 3944, -112569, -91387, -75521, -61290, 19227, 64978, 52842, 30641, -110884, -167735, -69837, -55088, -75020, -60669]
7663f0669L8544n8339l332J3715m7560J5792L9706J24973n7635j4905J7153p015
7651D28N1048k002q1356m6722O2565K8616K5727N5299r34k7075q7356M2218O2523
7638H2979N2330j41205k4941o203M63K7651j4787r423L1584J6680N3232n3872
7626A4488m809O9344P2035j30050r2161O9533R0873N7500j11981k05983J1770
7615a59441J74790P0854n147J6794p576r1700N3646K1742L6418r3801M2196J704
7603F0479p2696k2782j6992M7614L5910Q4705P2856j5070q5411J7412l9405l8739
7591B7881p4477O5535N7856K7759j1245j3718O6922N6936j352o6910p5324P519
7579F7382l7528k2386P8989o625o135j7931M9939M3642r3155m0287j3876k7251
$$ y = [-60669, -22125, -80464, -83796, -70081, -117641, -101849, -62143, 62830, 5195, -9710, 7443, 428, 51476, 49474, -31882, -78604, -16039, 12577, 38304, 93603, 92669, 65594, -21762, 20456, 82979, 135309, -5896, -30837, -37040, -36577, -8926, -23713, -33136, -1552, 15128, 68360, 14488, 9679, 79023, 151058, 21008, -71153, -1620, 89253, 146753, 34772, -171211, -159441, 15349, 86203, 81056, 97850, 90274, -1426, 52220, 73962, 110380, 16579, 58775, 60479, -12217, -34999, -51991, -4377, 31533, 116238, 189094, 174024, 88613, 106025, 66620, 27881, -46596, 18939, 76795, 104554, 93309, 79591, 146513, 203449, 202097, 135187, 59863, 67382, 29854, 7468, 86457, 79832, 73697, 55766, 105705, 149347, 56192, 15905, 2029, -25222]
7567b5222O9852j2870j7575l8635p1132L712n7002M3032R4378J08686n0962K2082
7555F8344l4323r7331j9881R0065J4936j60266q0666L8813k3063L8847M6301O5124
7543e3100P4400n4625l0262L9680K771P0329O5906N7719q6652j60476j3959Q743
7531g9526j6992L1643P6049L9672m033K65L6231J949l9412K0701q4438L620J83339
7518A69068n7650j28616q3327k565R4215O0947j23608Q108R6391l4787l3318L8764
7506C622n0411K3323j17737j3923J50917K2631j25206K3729Q2479J3836L0273
7495D3533n2927M988L6399k4646Q9846N4314l9123j17385n3976L9300J0798N999
7483b880J19557N4188j25448n5004p4896m3048O0785P2174q0750n7885P6609o6992
$$ y = [-25222, 44630, 31760, 14185, -24450, -95582, -91870, -148872, -105840, -11462, 97224, 46262, 68344, 34021, -63310, -83191, 6874, 21810, -138456, -219122, -180309, -203372, -164525, -118224, -53100, 21300, -33325, -63587, -23907, -21136, 49193, 115099, 172818, 86166, -74310, -88269, -79526, -96518, -64875, 11174, 50846, 46813, 47078, 83309, 85258, 45846, 66547, -17891, -14271, 169068, 111418, -17198, -100525, -103090, -8875, 52072, -71536, -63428, 32963, -1824, -35142, 3622, -46789, -23466, -141203, -155126, -4209, 18422, -106784, -83055, -576, 13260, 43533, -9394, -4406, 31993, 7347, 97193, 151507, 112384, -5001, -58977, -19677, -8879, -2880, 116677, 170865, 45417, -9587, -84483, -127531, -66746, 5428, -75322, -133207, -56598, -123590]
7471a23590J6108J28838n329o7495J01973k7563j03600l3294K8192L5655K6976
7460b3129K6253J0748m8766k4343r5720J09493J44083n5657j48546O4563R1551
7449E0530M1595o7507r6660r7223k2775R9924L5481q7383P3616P8380k956N485
7437A0507q8400m6418P5327O291l5617M2130k9071M8440o6112q4194r5865O7893
7425a95089J4682p9391P4478O3446J20621p2778r3870j5057J18335P8029k9417
7414a6011l4991K9467J73261l0759J7837M7816m8042o677p4162L3109j1887k7104
7402E1857O6742J19054P4683j62075q2421l5597r9o1658K3280L5989K9347o8170
7390i068m3050O8057j6311Q757O5395Q6770o1682j07975m478j149j40715Q2040
$$ y = [-123590, -107482, 21356, 16027, -51468, 50505, 22942, -80658, -113952, -85760, -50105, -23129, 3124, 13872, -34894, -59237, -154957, -45464, 98619, 42962, -105584, -41021, 50530, 92125, 24618, -72042, -169265, -192040, -92116, -56635, -144018, -70402, 7978, 5022, 10507, -77893, -124311, -48984, -42693, -78310, -36180, -65251, -16811, -82923, -167117, -262982, -195089, -180407, -259798, -185320, -121874, -1253, -74031, -167901, -182958, -64623, 13406, -16011, -51002, -21535, 151726, 120967, 138804, 186620, 138578, 131901, 57739, 90848, 78961, 51857, 118599, 237653, 312336, 150261, 67840, 32243, 32144, -29514, -6234, 29755, 59102, -9068, -52118, 15939, -372, 8385, 73780, 160550, 98868, -9107, -13585, -14734, -155449, -73409]
7378g3409J45753j10o2718j0180P8405l6409p595l5293k4305L28N0498Q480j05000
7365g1555j09533N3355P9599M7487K4187j2569p6358p6475P8222N6700K2188o1238
7353d5990j04692k4112P9918j7095j8170R699J9789K2785l9532M4385p3908L3176
7341a13747M6435k5388n3349L097N6851k5905M2312Q812j9658k5748o7931R6626
7329g7593J82269L8598m5396p6555J249P3860j8429j16921J1492M2465J11225
7318A26264n975j07809M549k3389r571n0330K0801J7941k571k5828M1510K4101
7306I693J43096N5378p8221j01594L6541n6975j9347j23871J0646J55192O8036
7295I8574L462k7876j72726k4717O3310p7631o4936p3207J67271L5601p3190j07662
$$ y = [-73409, 72344, 72234, 9516, -664, 77741, 41332, 33737, -1556, -25861, -25533, 24965, 33445, -71555, -181088, -127733, -48134, -647, 23540, 10971, -65387, -141862, -63640, -6940, 15248, -45990, -150682, -174794, -94876, -111971, -130141, -120442, -100653, -77868, -117400, -73015, -146923, -113747, -67312, -92700, -146049, -142952, -86101, -112006, -69694, -60882, -80540, -106288, -174219, -77593, 104676, 143274, 97878, 21323, 22572, 96432, 78003, -38918, -27426, 15039, 126264, 120289, 12480, 17029, -6360, -15931, -66261, -45460, -27519, -30090, -55918, -14408, 9693, 152789, 208167, 129946, 28352, 64893, 7918, -11429, -135300, -124654, 30538, 98574, 102036, 74160, -98566, -123283, -59973, -137604, -202540, -275747, -108476, -72875, -146065, -253727]
7283b53727k3172M0503R6636Q4569j06627j4909O6697J09357O685n3474k1911
7272f9373L6116L5419m3923k7786Q6595o1961j02340R3759J16403J7812j4789
7261F5932p3525k5504N7060q6672q0722j0806P2674j11940o7050L7028N1601J05394
7249f6530O7370n1023j4342q012M7385J89111L7096j13454q6877K1636n5203n5133
7237h7976M7301p9218o6852J10472L3536N9823j8022n1456l1763L2827m4110J2069
7225h3369P9056O8325P3022K1363j07942j24325L1506P4202M8771O6169j5829
7214A30949m3056r0606j8802Q672L5777K673k013n6896m5099j6735N7372Q2436
7202D4672J8714m0503L864K9231M3718J686K6070K977J4442J7231p7548j45784
$$ y = [-253727, -276899, -236396, -139760, -55191, -161818, -176727, -110030, -673, 6012, -47462, -69373, -33257, 2162, -41761, -69547, 17048, -44913, -147253, -53494, 62909, 80721, 65932, -7593, -33097, 23963, -62709, -143431, -154237, -81563, -193503, -260553, -223525, -171924, -66530, 840, -50183, -64525, -72537, -25152, 163959, 201055, 87601, 724, 22360, -32843, -87976, -40675, -119893, -186745, -76273, -42737, 17086, -936, -52392, -84155, -51328, -95438, -83369, -4313, 64012, 137034, 158397, 50455, -73870, -42364, 31838, 80609, 146778, 130949, 87893, -2713, -21515, -12843, 22934, 25607, 23594, -33302, -78401, -95136, -37764, 44672, 63386, 22883, 26747, 55978, 99696, 101382, 127452, 130429, 144871, 162102, 84554, -61230]
7190f1230l537J0082j6543N1949L3076j33162l650Q504m7145Q5360M8268R828
7178a8200k711l916N8316l1799m272L5281n812Q24J4899L0361o430K8570L2144
7165A27255j33038o0435K4127l9613L8714L2926l9179q8079J5659J7895l6672
7154a40440N909n1397R839J19130j6618m6415K7992K815j8123N8615M3527N391
7142B25k7426j1465j567K8515M105m6754o3781r0043M9111Q5743O4642M1942j3344
7129A9903j32093K3924q0702O9641R7182j0306q320r314l4642J0917K8073K6307
7117E70J3611J3522p3933K0097q344J9837N5082J2926k5009J6381p6823j34604
7105a66687j411N3312j9168O5562P8174K2691p6501o443l3654N0749K5666R384
$$ y = [-61230, -64767, -54685, -71228, -19279, 13797, -119365, -123015, -114511, -161656, -76296, -28028, -18200, -20911, -24827, 33489, 1690, -2582, 32699, 26887, 27711, 42610, 72971, 66541, 95111, 127255, -5783, -66218, -42091, -81704, -42990, -10064, -49243, -137322, -121663, -103768, -140440, -134531, -185928, -176089, -56959, -73577, -119992, -92000, -89185, -107308, -48693, -5166, 225, -27201, -38666, -40233, -11718, -7613, -54367, -118148, -208191, -159080, -73337, -8695, 33247, 19903, -112190, -88266, -168968, -99327, -2145, -12451, -20771, -30085, -64727, -53810, -25737, 570, 14181, 27703, -46230, -26133, -34477, -14640, 40442, 53368, 28359, 44740, -32083, -166687, -168098, -114786, -133954, -68392, 9782, 32473, -44028, -50471, -84125, -33376, -7710, 1674]
7093A674M2504j40636j35267R3496J01017K0842n3959j07020l4871P0656J31619
7082i945p220L7179M6320m664j09414l1144N9463J25589J57243j13j68908j20781
7070b6395k2478N7976J9516L6562p4062J4908m0679j35338K1033P3269L0323J11703
7058F6338N8767K6659n1149q525r1253p6472O312K5630J39056K5924k6357l6462
7046E8468m300K8078r2043n9667R841M1123J0856l4371q0450O210J6974J08241
7034H960N0273K4572n0206n1354R5279l7737q3080l4825j8756O9379K8068R3176
7022I3749P5404J4279L4094L4531p3225P113o1149n6590r2041p0487L2002O478
7010e5842J06355Q4096o0973n1353k4959O1836n5076q2665K2914j19160q7060
$$ y = [1674, 44178, -96458, -231725, -138229, -37212, -16370, -70329, -177349, -212220, -141564, -9945, -17165, 20014, 66334, 61670, -47744, -78888, -19425, 106164, 263407, 263294, 94386, -26395, -48873, 9103, 28619, 65181, -8881, 6027, -34652, -169990, -148957, -75688, -45365, 66338, 125105, 151764, 100615, 92090, 837, -75635, -69323, -43693, 95363, 121287, 94930, 58468, 54168, 82246, -9797, -69464, -59623, -18500, -7644, -42015, -122465, -116255, -99281, 8960, 59233, 83805, 33599, -17755, 77524, 39787, -43293, -78118, -96874, -27495, 573, 93749, 169153, 183432, 217526, 252057, 178832, 185945, 124796, 68206, -23835, -94322, -62320, -55842, 50513, 134609, 73636, 22283, -2676, 59160, 4084, -78581, -55667, -174827, -261887]
6999b61887J21918Q1026k1326J6565J3169m6800O1972J32763o1269m1340n120
6988a0329K8203o8511j08745O8103k0208k3961r2599j18120L0958J03042N2922
6977a59245l5276P2842N2302L1075Q3206j4629m8565m4153L1074n2979p5549N3089
6965a06808m1975l6508l0320K5552P0175J43343K2652p9246L6539J18141O037
6954A27582q5547j2742L0865J0769j4427j52211Q431J29214J18827J01676k6961
6943B35476j81465n3297O1873P1523J8050j29874n6573K6713m906m1237n4953
6932a08670Q0507O4766k7644j00040n4445P1876R2760Q7060L429n6879l1636n7415
6920c6331J50005P1807J2047o3572j86523J6074K9781l100J6642J33487l562j55749
$$ y = [-261887, -139969, -58943, -80269, -63704, -50535, -97335, -35363, 97400, 36131, -5209, -10329, 17874, -50637, -159382, -91279, -111487, -135448, -228047, -346167, -315209, -212167, -159245, -194521, -121679, -69377, -38302, 44904, 30275, -18290, -62443, -31369, -84348, -159897, -106808, -148783, -185291, -215611, -190059, -119884, 23459, 46111, -33135, 3404, 121545, 127582, 42035, 29293, 60158, 70927, 56500, -95711, -87280, 41934, 160761, 262437, 235476, 54011, 714, 62587, 134110, 152160, 22286, -34287, -7574, -12480, -53717, -108670, -28163, 36603, 8959, -91081, -145526, -73650, 19110, 106170, 109599, 52720, 21084, -36331, 113674, 185481, 197528, 133956, -52567, -36493, -6712, -9812, 6830, 140317, 136755, -18994]
6908a8994o2474K4263M1301K0762l1400o8988m8196L5491j4042L2808n2166K195
6896a39440k4598O5602J06304L6917j31760m8938K0141J15044J14585j5639j11597
6885a3379K8275k7010K5007M4864n3925P6518p3711K5579l8905l1446J6060m8490
6873g0563k3814N2351J34590J7991p7444l0850m9503k0024p773O9983N4145L2323
6861H1412q6270j10655J4933J3476J0783K516J8814Q6591Q25k8038p0066N4782
6849a0897K7671p0234j1933P118J26440j9361n1385l3058k6626L4225O847m0465
6837f1658P6215J13587J4681j17976n3365J1578k6507q668K4433L9116O8634L2557
6825A12627J21018K0309n1398j09218j66269j37488l2665J01711Q9113N3945p2883
$$ y = [-18994, -81468, -57205, -15904, 4858, -26542, -95530, -143726, -108235, -122277, -89469, -141635, -139440, -164038, -98436, 7868, 44785, -86975, -135913, -115772, -728, 113857, 98218, -13379, 14896, -12114, 12893, 57757, 3832, 80350, 6639, 32218, -6687, -38133, -22073, -70563, -94377, -42026, 92564, 110555, 33111, 2261, -47242, -67266, -75039, -5056, 49089, 81412, -4858, -115513, -100580, -87104, -76321, -73805, -54991, 31600, 32425, 4387, -65679, -10897, 16774, -53460, -65393, -58275, 68165, 48804, -2581, -35639, -62265, -28040, -21193, -61658, 14557, 128144, 142825, 24849, -28516, -16938, -43445, -52113, -27680, 11436, 80070, 112627, 233645, 253954, 202556, 93338, -72931, -210419, -243084, -141373, -52260, 1685, -71198]
6814g1198r7534m411J4635J5663L51J06592J377J0600P8358L634m3573o0930p8002
6801a24438O2723J1852Q488k8177l304J0601K4276K376L9084J66716r6413l6608
6789C7176p0956p321o7512Q0901J47777J9366j02797o1418R0713p524m7195o665
6777D545r0043k0269M4529N3710j0002J7704n5402r1004M090O5326p253n2324
6765a36393j7255Q18P6270J06673K1904m8561J6638L7297l2095j7371n7715l1249
6753h1039O3194J763m8362L4528J3817m4250L1503R0176l1252j01317l5619J9188
6741h7670M1435P8732k3096p8488k525K4645O754K3577R6011J8701P7709R2700
6729B68485l4507j0007K8256L1390p569o0462j07306L585n0382P7601L9388o8977
$$ y = [-71198, -168732, -173143, -158508, -142845, -142494, -35902, -34525, -23925, 54433, 58067, 14494, -46436, -124438, -61715, -49863, -41375, -69552, -72856, -62255, -37979, -35603, 3481, 170197, 73784, 37176, -33780, -41101, -108613, -27712, 120065, 139431, 36634, -24784, 65929, 58405, 11210, 4545, -85498, -105767, -61238, -7528, -17530, 174, -55228, -146232, -142142, -76816, -84069, -136393, -153648, -152830, -76560, 30113, 52017, 3456, 20094, 57391, 25296, 7925, -49790, -81039, -17845, -16082, -64444, -29916, -16099, -60349, -28846, 61330, 30078, -71239, -106858, -87670, -46235, 32497, 9401, -69087, -71612, -46967, -40213, -16636, 79375, 98076, 175785, 268485, 233978, 223971, 252227, 283617, 276048, 215586, 108280, 111865, 61483, 139084, 178472, 109495]
6717A09495L7639Q1712J86149J59375J44620J39587J8387r0087j90942k06064
6707C89871l4550n124p2865p4996K3494j19318l6739M4789J3261q5627j838J05416
6695A45774N9741p6173j13222K5560P1396o6929n7574L2322O2282j3805O5303
6684A34675P4055r0629q7026R5391n4636p4943j4625m1673K9367J22399K1350
6673A13705J8224P626M2073o6938j18089l2396o7833q7375J00896O2780j6381
6662d3708L4930Q9736m6591q3796j26393j04802O5826J37741Q0839Q1183n878
6651G9087q7116n2931N9941j8489K2539P2369q4795q8332K9053M9974j6016N2776
6639A8060m6510k7457L3208K8513l2049j1573O0538M2722n7074M009J2554N7993
$$ y = [109495, 147134, 228846, 414995, 574370, 718990, 858577, 876964, 786877, 595935, 389871, 355321, 350197, 277332, 202336, 225830, 106512, 69773, 114562, 127823, 42196, 40358, 145774, 205515, 129342, 16120, 41680, 113076, 46147, -11427, 20895, 83177, 69372, 134675, 208730, 118101, 31075, 126466, 71830, -3113, -17738, -59411, -30044, 92355, 113705, 131929, 139555, 181628, 114690, -3399, -35795, -103628, -191003, -90107, -27327, -43708, -8778, 80958, 34367, -49429, -175822, -280624, -214798, -77057, 3782, 84965, 79087, -8029, -60960, -1019, -19508, 3031, 75400, -9395, -97727, -68674, -18700, -34716, 18060, -28450, -55907, -22699, 5814, -26235, -37808, 22730, 65452, 8378, 12387, 24941, 82934]
6627H2934M9297J8121M5592k7271o0020j03899j0861M5760J8399p68M8536R4963
6615B00783n3880l6950l0889n4575n617P4407K6302K5590l2404j01179j51092
6604a39504L0845K6290K030j6989m827O6721P6101m8263o632j2063j18729J5651
6592a29369O4623K1753L7677N3881M5710k0043M4768l0690l1626K0097o2859L8207
6580E2129o5262p1315o8890q0649m3274R3763J4585m5288j1675Q0204N6326L6019
6568e3327q4535J5457M14r0041K8163J16564Q3519n9180J4114Q0427R595o3747
6556b577k5995q4238n1596P7874O990J180P4856n6756j9614j7853m9390p9175
6544b26294m513J31370J23187P969q977K4016l8055o9949l6440j8619l7775N5520
$$ y = [82934, 132231, 150352, 195944, 168673, 108653, 4754, -6107, 39653, 58052, 57284, 105820, 200783, 146903, 109953, 79064, 24489, 18872, 93279, 119581, 145171, 112767, 11588, -139504, -108659, -82369, -80339, -97328, -102155, -35434, 40667, -7596, -14228, -26291, -145020, -129369, -64746, -42993, -5316, 48565, 94275, 74232, 119000, 88310, 56684, 76781, 13922, 52129, -13133, -84448, -153338, -233987, -277261, -183498, -168913, -214201, -225876, -145672, -89346, -53327, -137862, -122405, -121991, -212032, -183869, -67305, 16214, -42966, -28852, 51575, 61170, -2577, -28572, -112810, -164406, -86532, -79542, -78362, -3506, -60262, -79876, -97729, -147119, -226294, -230807, -99437, 23750, 31719, 22742, 46758, 8703, -61246, -97686, -116305, -154080, -98560]
6532i8560L8412p0411m877k9153L775J05837M6477o3645J4111P3565l771J29102
6520A40862l3516o9774j03998r6270M3780Q6685R1721J00431m6350p9130R4076
6509A28517Q4488O4944j3414p3575l8420j60079l4420L0852K5620Q073l0011j58704
6497a66129j00244J10658L5192J18954R5179J8655p5023m408O1361K6841j06876
6486A4160j12161L7270m7014M8367R6076P5070k3383p8370l5715O675j7819N2402
6474A5558O4997k5728j24391j17850P0653O7327N7760L5288k5110q034p7922k3813
6462i1265m1753k0815O7328L2772N5110L9852o495O054j06181j5922O8837p2087
6450h4565j3533o4957J9843O5692O1326L7337P9563p0888j4363p4811m1402O4909
$$ y = [-98560, -60148, -130559, -135436, -164589, -160814, -54977, -8500, -72145, -58034, 15531, 11760, 140862, 107346, 37572, -66426, -162696, -118916, -32231, 59490, 159921, 113571, 34441, 128517, 213005, 277949, 264535, 190960, 152540, -7539, -41959, -11107, 14513, 22586, -7425, -166129, -266373, -155715, -120523, -1569, 93610, 112265, 37242, 32834, 94195, 121036, 14160, -98001, -60731, -107745, -59378, 36698, 111768, 88385, 10015, -25700, -19025, -36844, 15558, 80555, 54827, -69564, -187414, -116761, -49434, 8326, 43614, 18504, 10470, -67452, -91265, -133018, -153833, -86505, -53733, 1377, 41229, 34734, 40788, -65393, -81315, -12478, -84565, -98098, -163055, -143212, -77520, -16194, 21143, 100706, 29818, 15455, -59356, -100758, -35849]
6438c5849L0444p3195L5696O692k7310R6569L8248l879j7779n0657p4635m071
6426g9726K0388P615k5540M681l4384M3026N8065N7189L5962J7240n8954Q5497
6414A31059Q3663p6627q8784k3224n8838J7254J33450j3639l6244k2628r9615
6403e4173j7632R8019M7311l4422o7348n7132P1193O9480n4691K0940J2014j16837
6391h3278O330J8908k8298L7256J3319M6850Q4341N0760K4313o612o4878o5363
6379C3648n3666L2743N1246n1162O1133K604j20958j9861K2498j8013J07058Q0130
6367A27400k6439q5434R4108j2839p0989j31426O6723O4621m8966J710j16116
6356a37647J0771R6406J21047m0251R9451j8763j56396R73M1306j04812o8303
$$ y = [-35849, -5405, -78600, -42904, -36212, -63522, 33047, 71295, 67416, 49637, -1020, -75655, -79726, -59338, -51723, -77263, -72582, -106966, -63940, -5875, 51314, 87276, 104516, 45562, 131059, 214722, 138095, 49311, 26087, -32751, -15497, 117953, 104314, 68070, 45442, -54173, -71805, 26214, 73525, 39103, -28245, -85377, -14184, 55296, 605, 21545, 33559, -83278, -76948, -58040, -86338, -49082, -35763, 11087, 95428, 146188, 170501, 163889, 99011, 33648, -20018, 12725, 63971, 12809, 73942, 76546, -44412, -64273, -41775, -59788, 47270, 127400, 100961, 15527, 109635, 96796, 25807, -105619, -38896, 25725, -23241, -21531, -137647, -126876, -30470, 90577, 50326, 149777, 131014, -25382, -24409, 16897, -87915, -156218]
6345a56218k5047j3173K351Q0105J52517J04487O7248r0335j77788M1736k5154
6334c9271Q246J04136j770q0556M3743P2870N1989J8964o3028N5880n6345j09903
6322D955k2334L5710o6210K324q4602Q485M2592R6016O8872k6719r4872j37478
6310a73261o7594l484N4624L0804L5245p791J2549J56244J13712O3496r6992q3839
6298C3713L2430O0510o4869n2684l2182n9662k185K3555J29744J29908o9767n6556
6286G1955l5727k8550m1387o381q493Q5041l8574M9282l7465j72004M6279N8340
6274e7684K3621J00432K3462p9480m3855L2291L398k1032j09992k4171O1940O6014
6262b5056J0557p6263K6359j8032J5570n4318r179J12953q7819J2744P9022P871
$$ y = [-156218, -181265, -194438, -192087, -111982, 40535, 145022, 212270, 121935, -55853, -14117, -39271, -31025, 73111, 71341, -9215, 34528, 107398, 159387, 178351, 115323, 171203, 114858, 4955, -17379, 18331, -47879, -45555, -130157, -121672, -79080, 16936, 85808, 59089, -35783, -173261, -240855, -244339, -189715, -158911, -123666, -131457, -118908, 37336, 151048, 214544, 117552, 33713, 66143, 126653, 61784, 9100, -23082, -82744, -84929, -61374, 68370, 198278, 128511, 71955, 36228, 7678, -33709, -40090, -48583, 36458, -2116, 47166, 9701, -162303, -116024, -57684, -34063, 66369, 89831, 10351, -33504, -1213, 2185, -18847, -128839, -153010, -91070, -25056, -14499, -90762, -64403, -82435, -66865, -121183, -130362, -17409, -105228, -92484, -13462, -5591]
6250e591Q8845K0803l76p3921o1629m5139N0300o3717l679J28672K7095l324p4121
6237a5782o4863M4820L1483k8409N3995M1222o6998m8767p5508J07781J15549
6226I4523M0401J2059m6808J5394K6410n682p6960J9267p1774k0611j5959q256
6214c7996Q3375L6950j25211R364J63997L9403r972j4250k1870k8865p5991P29
6202A9663R0417p1039m7785n7203j1011O5605P9053M0551J268q2521p1179j7241
6190f1422J7213M4135j4968j6916O2261j5648j1387J4325K4361n0555m5352r8698
6178a52651O0327L3079j29253M487P8781J5097N1880O740k0679J10768Q9316p3825
6166G4067n0247M1035q5145o3836l1424o6360K6166P4358P056O0878P2424K0188
$$ y = [-5591, 83254, 104057, 103681, 29760, -31869, -77008, -26708, -90425, -94104, 34568, 61663, 58339, -15782, -80645, -35825, -4342, -32751, 21244, 62466, -4532, -53299, -128807, -21026, 94523, 134924, 146983, 100175, 115569, 141979, 136297, 59337, 78604, 6830, -13781, -29740, -37996, 45379, 82329, -42882, -33518, 130479, 169882, 159910, 145660, 123790, 94925, 18934, 19663, 110080, 39041, -8744, -65947, -76958, -11353, 67700, 108251, 109519, 26998, -44181, -61422, -44209, -74, -15042, -31958, 30303, 14655, 3268, 17593, 41954, -8601, -53953, -152651, -92324, -59245, -188498, -184011, -105230, -90133, -38253, -31513, -52192, 58576, 147892, 74067, 23820, 64855, -20290, -84126, -115550, -181910, -155744, -81386, -74330, -13452, 58972, 79160]
6154G9160n6497m9164k6128m0454J8591J35192P1030n4395l6194m4039p6364O6948
6142a2314Q1599N50r1275l4160m134n0966J846j0686m1995J02096L1938L1713
6130D212q762l7038K0646Q9503N070m4081l6463l984P7401n779l3760k2078k959
6117A928j7594n9882J28102l1755l1155J855K3744k9585n50m4458L9247o871K6116
6104h58n9480Q659J15626J08220n0627j25850j43313n537l280M8221k4130j1077
6092a43426J08304J9289l1502l2702Q5940L0619l4238q4155k4873K7774N7009
6081b1961R5097K2179k886j13881j12223j03081k6641J21536J24717L1711j28135
6070a13568l7101P00k4905K3051n6689n3509l7238J12637K8453L7539R8883o1485
$$ y = [79160, 22663, -26501, -52629, -93083, -74492, 60700, 131730, 77335, 41141, -2898, -79262, -12314, 69285, 69835, -21440, -55600, -59734, -110700, -108854, -119540, -161535, -59439, -27501, 4212, -4550, -41588, -20942, 68561, 73631, 29550, -6913, -10897, 66504, 60725, 26965, 4887, 1928, -15666, -75548, 52554, 20799, -10356, -8501, 15243, -14342, -14892, -59350, -20103, -26974, -858, -60338, -51679, 63947, 172167, 121540, -4310, -147623, -153160, -156440, -108219, -132349, -143426, -35122, -15833, -47335, -80037, 5903, 36522, 2284, -81871, -106744, -78970, -21961, 73136, 95315, 92429, -21452, -133675, -236756, -263397, -141861, -17144, 14567, -113568, -150669, -149969, -174874, -151823, -208512, -262021, -299259, -186622, -158169, -120630, -21747, -83232]
6058h3232J2030k6689r3102J7872J56870K6478p8831O8322J2849j7239j8485q5929
6046a09086k1133R8827N3683l2784j2376J0069J71335l2121j41428n2093P1754
6035D647N0662k3352R4658l2614R497J3570j0878L3681k7257m2579M7762J48924
6023B66721k4400j35787p9775N8864o7210M8171N5290r3458j3596k5606q9606
6012a00392n7368m6964P2916J35946L7577j21330o56J73045m4168l9296O961j3667
6000B604l2288m6507N3389K2957k9305J14889K6288n2761m7313m9358R997Q0999
5988E3591j2915j26020N7493N460M9394k5981k7007j5274r050m8128p7811R8190
5976g8058J82910n2984o238N3784J5667K7676m5559n5240N536L380l1396o6997
$$ y = [-83232, -71202, -97891, -190993, -173121, -16251, 10227, -68604, -282, 12567, -4672, -23157, -109086, -130219, -31392, 22291, -10493, -22869, -12800, 158535, 126414, -15014, -67107, 4647, 55309, 31957, 126615, 94001, 103498, 117068, 106190, 139871, 112614, 70035, 117797, 266721, 242321, 106534, 26759, 85623, 18413, 66584, 121874, 28416, 14820, -10786, -100392, -157760, -204724, -131808, 4138, 41715, -79615, -80271, 92774, 48606, 9310, 16271, 2604, -29684, -76191, -22802, 155, -29150, 85739, 112027, 59266, 11953, -37405, -27408, 53591, 40676, -85344, -27851, -22391, 27003, 1022, -25985, -41259, -50309, -98437, -176248, -78058, 104852, 51868, 45630, 99414, 115081, 142757, 97198, 41958, 47494, 50874, 19478, -47519]
5964d7519J328N5311j4474l5766J1926N6251l4421J9591R9371p5672j48146p6286
5952a88506o3797K9175j4351K9062J19459R6994J01360J8845r0935o8537p9025
5941a10256O5412J25991N0289J73m6177p4761p231O2163r7515o3862r903R8063
5929g614j26235j00092k4570Q7046j0416M2052K8877m1704J21216j4588j2818
5918e8846r3831l5212P2770N9261O1872O4858L7070l7863r9845o5228N9435m4602
5906h0161k7762R7936P0361P253O9981p579r7747r9969P325L5213M5839l1536
5894a0846p1934L4655O8577j3683n4747J02187Q3310m4292o4110n5232M0574J10179
5882A24638p859j15561p5115j401m968O3637N0235r8798j31034j03863K0084J07328
$$ y = [-47519, -46191, 9120, -5354, -41120, -29194, 27057, -7364, 12227, 111598, 35926, -112220, -188506, -252303, -223128, -237479, -208417, -88958, 8036, 109396, 128241, 37306, -31231, -110256, -44844, 81147, 131436, 131609, 85432, 10671, 3440, 65603, -31912, -95774, -105677, -7614, -133849, -233941, -258511, -171465, -181881, -139829, -110952, -152656, -31440, -46028, -58846, -152677, -187889, -115119, -55858, 6014, 70872, 107942, 70079, -29766, -94994, -35559, -80161, -107923, -9987, 60374, 67627, 137608, 130029, 32282, -67687, -60362, -25149, 20690, -10846, -82780, -48125, 20452, 6769, -47978, 54209, 137519, 93227, 29117, -26115, 14459, 124638, 116779, 1218, -73897, -75298, -80266, -16629, 33606, -65192, -196226, -300089, -280005, -172677]
5870a72677J32978P2452o1046L1094K2752j3947o7229n2556o6218J169J14675
5859e8553Q8339N6019N7999p9501j02419j765j28958q2512l780P1411Q9839P8606
5847a5275J110l928j5406l7652k454o1175O7322J39084k4798m5611j5322Q4010
5835F9905K2442r6074r217n5920l6548N2733j9828K687Q9798J6428q0577j02980
5823a47151j7554Q8190P6319K617j9602J10914K6759o4239q0609j0588l3683L5753
5811c2874O2180l387J4105r4535j47998j0084R3111J04660M0486k500j8001n5859
5799e0696J306M473R3644K5388m5386m8040K6645k7404J0741N4782n33p683K0912
5786E8149J10832M7321l3855O8707j05157j81073M2923L96p705m178K1146K5549
$$ y = [-172677, -39699, 32753, -28293, 2801, 25553, 11606, -55623, -108179, -174397, -173228, -58553, 29786, 85805, 143804, 64303, -38116, -39881, -168839, -251351, -255131, -183720, -93881, -15275, -14165, -18093, -33499, -71151, -73605, -134780, -67458, 71626, 46828, 1217, -14105, 69905, 92347, -3727, -12944, -68864, -105412, -52679, -72507, -69820, 19978, 36406, -44171, -147151, -164705, -76515, -196, 2421, -17181, 93733, 120492, 56253, -24356, -34944, -68627, -32874, 29306, 25919, 40024, -54511, -202509, -212593, -119482, -14822, 25664, 23164, 5163, -50696, -49390, -44917, 48727, 74115, 28729, -19311, 7334, -20070, -9329, 45453, 44920, 37237, 58149, 168981, 216302, 182447, 251154, 145997, -35076, 7847, 8243, 538, -3640, 17506, 43055]
5774D3055l7475O6466P7983J13187r3741k13931l3464J36116O195K3889J02995
5763A91275k6434j25521l0464L3484J7806j07662o1059o7730O7294N4561K0473
5752c3977r52m0995K344Q8794j6533p6155o3195L0197J14963j1985L5180O4702
5740I2388k0559j583o2490K0388j7167J9329J414j7708r573q4161J0190O2800
5728f732K4962j08640Q7499K7488J879m0873l5372L0440K7126J0249J0880p960
5716B0946n1233K2926K7756J02240O8548m2426j50946j0831p1942O1280O3264
5705C9582L5448Q5647n3769m9089N241L7574K421j9503m5654l480Q157k2386j25531
5692a05342M6341N0274l3376L3015P2016R345M0545M4713j75950r4928J1694R6164
$$ y = [43055, 5580, 72046, 150029, 263216, 169475, -44456, -77920, 58196, 64391, 88280, 191275, 164841, 39320, 8856, 42340, 60146, -47516, -108575, -176305, -109011, -54450, -33977, -34929, -75924, -73580, 15214, -1319, -77474, -140669, -110472, 4491, -7494, 27686, 92388, 71829, 70246, 7756, 28144, 10977, 30306, 31720, 14012, 4439, -79722, -69532, -6732, 18230, -90410, -2911, 24577, 26456, -14417, -49789, -19349, 7777, 18026, 28906, 20946, -30287, -7361, 20395, 122635, 191183, 148757, -2189, -13020, -84962, -23682, 39582, 75030, 160677, 106908, 57819, 63060, 100634, 103055, 83552, 37898, 34418, 42575, 20189, -105342, -59001, -8727, -42103, -9088, 62928, 72273, 112818, 157531, -18419, -113347, -101653, -5489]
5680e489k2320J2130R9435k9900r5963M0314o1487J084J3987L6901j93J2927R709
5667A1135J59358K8404o1799o7514O3916k7215K120l8726l204J5269L974k4587
5655F1131k5130M5977N2157l6271o4103m5015P404J38780M8460r4363K6969j602
5643A14394r0269K6198J21942L2214n8733p320m8622r8613K4179P6239O669k9294
$$ y = [-5489, -27809, -15679, 83756, 53856, -42107, -1793, -63280, -62196, -48209, -11308, -11501, 1426, 11135, 170493, 198897, 137098, 69584, 133500, 106285, 108405, 69679, 66475, 81744, 85718, 61131, 36001, 81978, 134135, 97864, 33761, -11254, -3850, 134930, 183390, 89027, 115996, 114394, 24125, 50323, 172265, 204479, 145746, 138426, 89804, -8809, 15370, 91609, 98278, 68984]
$$ [...]
##END NTUPLES=NMR SPECTRUM
##END=
