##TITLE=Analysis number 311501
Compound Code cc 42704
Book Reference 439/30/29
Project Code adrs
Chemist Name ronp
##JCAMPDX= 6.0         $$ Bruker NMR JCAMP-DX V2.0
##DATA TYPE= NMR SPECTRUM
##DATA CLASS= NTUPLES
##ORIGIN= Bruker BioSpin GmbH
##OWNER= NMR
$$ XWIN-NMR		Version 3.5
$$ Fri Jul  8 13:58:49 2005 GMT Daylight Time (UT+1h)  MAYBRIDGE\NMR@NMR_250MHZ
##.OBSERVE FREQUENCY= 250.131544655141
##.OBSERVE NUCLEUS= ^1H
##.ACQUISITION MODE= SIMULTANEOUS (DQD)
##.ACQUISITION SCHEME= undefined
##.AVERAGES= 16
##.DIGITISER RES= 18
##SPECTROMETER/DATA SYSTEM= dpx250
##.PULSE SEQUENCE= zg30
##.SOLVENT NAME= CDCl3
##.SHIFT REFERENCE= (INTERNAL, CDCl3, 0, 16.4594)
##AUDIT TRAIL= $$ (NUMBER, WHEN, WHO, WHERE, WHAT)
$$ ##TITLE= Audit trail, XWIN-NMR		Version 3.5
$$ ##JCAMPDX= 5.01
$$ ##ORIGIN= Bruker BioSpin GmbH
$$ ##OWNER= NMR
$$ C:\u/data/dgb/nmr/ADRS/5560/pdata/1/auditp.txt
$$ ##AUDIT TRAIL=  $$ (NUMBER, WHEN, WHO, WHERE, WHAT)
(   1,<2005-07-08 13:58:10.79 +100>,<MAYBRIDGE\NMR>,<NMR_250MHZ>,
      <created by zg, POWCHK disabled, PULCHK disabled
       configuration hash MD5:
       62 19 C7 07 E1 42 D1 B7 37 6C 3D D0 77 39 F9 E6
       data hash MD5: 64K
       3D AE B3 22 A6 42 75 03 6D 70 72 95 56 BF 17 AF>)
(   2,<2005-07-08 13:58:31.02 +100>,<MAYBRIDGE\NMR>,<NMR_250MHZ>,
      <Start of raw data processing
       ef LB = 0.3 FT_mod = 6 PKNL = 1 SI = 32K 
       data hash MD5: 32K
       5E 99 1C 19 D0 46 57 9B 5F 09 CE 4E F0 5E E0 16>)
(   3,<2005-07-08 13:58:35.79 +100>,<MAYBRIDGE\NMR>,<NMR_250MHZ>,
      <apk 
       data hash MD5: 32K
       FF 17 56 F5 6A B6 2D C3 DB 7B 85 3F 79 D4 52 5E>)
(   4,<2005-07-08 13:58:37.47 +100>,<MAYBRIDGE\NMR>,<NMR_250MHZ>,
      <abs ABSG = 5 
       data hash MD5: 32K
       AE 82 B4 79 DC 6C AE A5 75 A8 96 24 6E E9 98 5A>)
$$ ##END=
$$ 
$$ hash MD5
$$ C0 D3 EA 3A E3 8B C1 E5 F7 1A 47 46 1F 22 39 73
##$RELAX= 
##$RELAX= 
##$RELAX= 
##$RELAX= 
##$RELAX= 
##$RELAX= 
##$RELAX= 
$$ Bruker specific parameters
$$ --------------------------
##$DU= <C:\u>
##$EXPNO= 5560
##$NAME= <ADRS>
##$PROCNO= 1
##$TYPE= <nmr>
##$USER= <dgb>
##$AMP= (0..31)
100 100 100 100 100 100 100 100 100 100 100 100 100 100 100 100 100 100 
100 100 100 100 100 100 100 100 100 100 100 100 100 100 
##$AQSEQ= 0
##$AQ_mod= 3
##$AUNM= <au_zg>
##$AUTOPOS= <38 >
##$BF1= 250.13
##$BF2= 250.13
##$BF3= 250.13
##$BF4= 250.13
##$BF5= 500.13
##$BF6= 500.13
##$BF7= 500.13
##$BF8= 500.13
##$BYTORDA= 1
##$CFDGTYP= 0
##$CFRGTYP= 5
##$CHEMSTR= <none>
##$CNST= (0..31)
1 1 145 1 1 1 1 1 1 1 1 1 1 1 1 1 1 1 1 1 1 1 1 1 1 1 1 1 1 1 1 1 
##$CPDPRG= <>
##$CPDPRG1= <>
##$CPDPRG2= <>
##$CPDPRG3= <>
##$CPDPRG4= <mlev>
##$CPDPRG5= <mlev>
##$CPDPRG6= <mlev>
##$CPDPRG7= <mlev>
##$CPDPRG8= <mlev>
##$CPDPRGB= <>
##$CPDPRGT= <>
##$D= (0..31)
0 1 0 0 0 0 0 0 0 0.06 0 0 0 0 0 0 0.0002 0 0 0 0 0 0 0 0 0 0 0 0 0 0 
0 
##$DATE= 1120827488
##$DBL= (0..7)
120 120 120 120 120 120 120 120 
##$DBP= (0..7)
150 150 150 150 150 150 150 150 
##$DBP07= 0
##$DBPNAM0= <>
##$DBPNAM1= <>
$$ [...]
##$SUBNAM7= <"">
##$SUBNAM8= <"">
##$SUBNAM9= <"">
##$SW= 20.6930455092707
##$SWIBOX= (0..15)
0 0 3 0 0 0 0 0 0 0 0 0 0 0 0 0 
##$SW_h= 5175.983436853
##$TD= 65536
##$TD0= 1
##$TE= 295.16
##$TE2= 300
##$TE3= 300
##$TEG= 300
##$TL= (0..7)
0 120 120 120 120 120 120 120 
##$TP= (0..7)
150 150 150 150 150 150 150 150 
##$TP07= 0
##$TPNAME0= <>
##$TPNAME1= <>
##$TPNAME2= <>
##$TPNAME3= <>
##$TPNAME4= <>
##$TPNAME5= <>
##$TPNAME6= <>
##$TPNAME7= <>
##$TPOAL= (0..7)
0.5 0.5 0.5 0.5 0.5 0.5 0.5 0.5 
##$TPOFFS= (0..7)
0 0 0 0 0 0 0 0 
##$TUNHIN= 0
##$TUNHOUT= 0
##$TUNXOUT= 0
##$USERA1= <user>
##$USERA2= <user>
##$USERA3= <user>
##$USERA4= <user>
##$USERA5= <user>
##$V9= 5
##$VALIST= <valist>
##$VCLIST= <CCCCCCCCCCCCCCC>
##$VD= 0
##$VDLIST= <DDDDDDDDDDDDDDD>
##$VPLIST= <PPPPPPPPPPPPPPP>
##$VTLIST= <TTTTTTTTTTTTTTT>
##$WBST= 1024
##$WBSW= 4
##$XGAIN= (0..3)
0 0 0 0 
##$XL= 0
##$YL= 0
##$YMAX_a= 466764
##$YMIN_a= -256355
##$ZGOPTNS= <>
##$ZL1= 120
##$ZL2= 120
##$ZL3= 120
##$ZL4= 120
##$ABSF1= 16.45939
##$ABSF2= -4.233782
##$ABSG= 5
##$ABSL= 3
##$ALPHA= 0
##$AQORDER= 0
##$ASSFAC= 0
##$ASSFACI= 0
##$ASSFACX= 0
##$ASSWID= 0
##$AUNMP= <proc_1d>
##$AZFE= 0.1
##$AZFW= 0.1
##$BCFW= 0
##$BC_mod= 0
##$BYTORDP= 0
##$COROFFS= 0
##$CY= 12.5
##$DATMOD= 1
##$DC= 0
##$DFILT= <>
##$DTYPP= 0
##$F1P= 14.0000005364418
##$F2P= -0.99999901652339
##$FCOR= 0.5
##$FTSIZE= 32768
##$FT_mod= 6
##$GAMMA= 0
##$GB= 0
##$INTBC= 1
##$INTSCL= 1
##$ISEN= 128
##$LB= 0.3
##$LEV0= 0
##$LPBIN= 0
##$MAXI= 10000
##$MC2= 0
##$MEAN= 0
##$ME_mod= 0
##$MI= 0
##$NCOEF= 0
##$NC_proc= -5
##$NLEV= 6
##$NOISF1= 0
##$NOISF2= 0
##$NSP= 0
##$NTH_PI= 0
##$NZP= 0
##$OFFSET= 16.45939
##$PC= 1
##$PHC0= -71.17744
##$PHC1= 3.826797
##$PH_mod= 1
##$PKNL= yes
##$PPARMOD= 0
##$PSCAL= 4
##$PSIGN= 0
##$REVERSE= no
##$SF= 250.130015660143
##$SI= 32768
##$SIGF1= 0
##$SIGF2= 0
##$SINO= 400
##$SIOLD= 32768
##$SREGLST= <1H.CDCl3>
##$SSB= 0
##$STSI= 32768
##$STSR= 0
##$SW_p= 5175.98343685301
##$SYMM= 0
##$S_DEV= 0
##$TDeff= 65536
##$TDoff= 0
##$TI= <Analysis number 999999
Compound Code 99
Book Reference 9
Project Code 9>
##$TILT= no
##$TM1= 0
##$TM2= 0
##$TOPLEV= 0
##$USERP1= <user>
##$USERP2= <user>
##$USERP3= <user>
##$USERP4= <user>
##$USERP5= <user>
##$WDW= 1
##$XDIM= 32768
##$YMAX_p= 531553774
##$YMIN_p= -650190
$$ End of Bruker specific parameters
$$ ---------------------------------
##NTUPLES= NMR SPECTRUM
##VAR_NAME=  FREQUENCY,     SPECTRUM/REAL,   SPECTRUM/IMAG
##SYMBOL=    X,             R,               I
##VAR_TYPE=  INDEPENDENT,   DEPENDENT,       DEPENDENT
##VAR_FORM=  AFFN,          ASDF,            ASDF
##VAR_DIM=   32768,         32768,           32768
##UNITS=     HZ,            ARBITRARY UNITS, ARBITRARY UNITS
##FACTOR=    0.157963299565203, 1,           1
##FIRST=     4116.98763860434, 0,            0
##LAST=      -1058.99579824867, 0,           0
##MIN=       -1058.99579824867, -650190,     0
##MAX=       4116.98763860434, 531553774,    0
$$ Real data points
##PAGE= N=1
##DATA TABLE= (X++(R..R)), XYDATA
$$ [...]
26835A8239r6873P4288J28622q8165o8366P322M809R390J06611r9801n6914M8163
26823a2675K0053J7141k19271p8122L9161N1123N4709J1560O4734k6335n9688
26812a37610j39600J82465K09383q5759r1076P6794j65436j29176J8658J97194
26802f4163N4138P3599L1442J9307j19019j6986K2924j7085n1384L3700j14920
26791a48447O1397M2647K3633O7465J09934M9358O9759j22135j17131J19548r7868
26780E8160k52741j4395J9813N7854J10833R2890M791L3948m8328J30515n3327
26769A40013j19434K2824l0978o2967j7753O3671k9014R4779O0838k314R2126
26758B11791o2818j11445p1472J80691J38300j51177L8754R4282k00431j78200
$$ y = [18239, -78634, -4346, 124276, 36111, -32255, -24933, -20124, -10734, 95877, -3924, -60838, -12675, 7378, 24519, -194752, -272874, -233713, -182590, -127881, -116321, -51587, -77922, -137610, -277210, -94745, 114638, 28879, -62197, 14597, -150839, -280015, -261357, -64163, -10025, 63574, 95016, 114323, -4696, -21682, 1242, -15843, -67227, -33527, -148447, -87050, -44403, -20770, 46695, 156629, 205987, 275746, 153611, 36480, 156028, 58160, -194581, -208976, -189163, -131309, -20476, 72414, 77205, 111153, 62825, 193340, 140013, 20579, 43403, 12425, -50542, -68295, -4624, -33638, 61141, 121979, 119665, 211791, 148973, 37528, -33944, 146747, 285047, 133870, 172624, 266906, 66475, -111725]
26748a11725P0218p87q8380m434k7384R9972Q9807l4567J6189Q8983M7788p0177
26736G5503J36726O4759j82169r896q5452o4559N8211l4803Q9050J86921M0501
26725B74792j08859k00567p3888p4896K3035J86293L489K1394m9976o0047R6341
26714C7111J34454m865m5910n5114j7219N74j24103j24649n9562R3703J31379
26703c4201K3328o9308K9835K37770n060j13131j83465j39951L8218N0290N0358
26692a15317R368m4932R2578M4269J03917j48395k21888o3234J72820J86207J70806
26681A86199O5149k1763j21923j05189r997p4572N5351M4496Q232n2485M5693
26670A9191M3509m7211j1917j7586Q6828P782j09392q2776O8553J58288l2859
$$ y = [-111725, -41507, -42294, -130674, -135108, -162492, -62520, 27287, -7280, 8909, 97892, 145680, 75503, 212229, 276988, 94819, 84923, -529, -65088, -6877, -41680, 47370, 234291, 274792, 165933, -34634, -108522, -183418, -160383, 25910, 29399, 50793, 817, -59230, 37111, 171565, 166700, 120790, 65676, 48457, 49031, -75072, -199721, -259283, -165580, -34201, -10873, -80181, -50346, 187424, 182364, 69233, -114232, -254183, -215965, -165675, -115317, -105949, -150881, -58303, -14034, 89883, -58512, -280400, -343634, -170814, 15393, 186199, 251348, 229585, 107662, 2473, -7524, -82096, -26745, 17751, 25983, -26502, 19191, 62700, 15489, 3572, -14014, 72814, 80596, -28796, -111572, -43019, 115269, 82410]
26659H2410k6227J4905j29281j04430J02160J7631n4573k54J6592j34277J7131
26648a98213O5846J36234M1791P121Q8581M2492j24896J7410k6809r5446q1006
26637a26895J0844J8240l2901O9484R6686M7662j95688j33307L1973P5611L0154
26626a08137p9078M1677R7851J4146l6494Q7202O1745P3467J49829Q3135j46297
26615B39046k6381q4736J3983Q0575m603j12772p664j0481O5063O0099q0733k01112
26603f9716j166j4501n4712k1789k5450P1144R680K6879M6831l4388p881j38489
26591b13558o4019Q1316J30668P7817Q1837o7696j52410M9922R9376P576P8178
26580A09007m5908O0840J09707j23032k47121k34678n4334N6092J22697K2189
$$ y = [82410, 56183, 71088, -58193, -162623, -60463, -42832, -97405, -97659, -81067, -215344, -198213, -132367, 3867, 45658, 52779, 141360, 183852, 58956, 76366, 49557, -45889, -126895, -116051, -97811, -130712, -61228, 35458, 83120, -112568, -245875, -213902, -138291, -108137, -187215, -145538, -47687, -33541, -70035, 17167, 78912, 152379, 302208, 385343, 239046, 212665, 127929, 141912, 222487, 217884, 105112, 97448, 86967, 152030, 212129, 131396, -69716, -70882, -85383, -140095, -161884, -187334, -116190, -106510, -79631, -32800, -67188, -75069, -213558, -277577, -196261, -65593, 12224, 94061, 26365, -126045, -76123, 23253, 30829, 109007, 63099, 123939, 233646, 110614, -136507, -371185, -425519, -369427, -246730, -224541]
26570b24541j5760Q8228J74170M5556L619J05342q8239k28453o3584J99978P2469
26559F8785P8006q5889L8338M3713m3938j09396N9865l2901o8640j1127J39448
26548G6264r0139M9884j8794M3299j93591k7954K40761L5257q0144j7211J57771
26537A75403j40011j76449o0087J67721K35922K189l26936J4483J85525N0909
26527A28669j23358j43670L8241K46196P387q3935Q5383j40160j59004j17297
26517b61548N9847L7006m0722M366o9561P2231K42873N8133j75295m0795J31638
26506A8173O2462O0800J13690j40609K5050J7601q1288o566l9355k7438N5204
26495E7724Q2413k57723O048O3512J54703J53629j70636j81645j2581J04522J67100
$$ y = [-224541, -240301, -152073, 22097, 67653, 71272, 176614, 88375, -140078, -203662, -3684, 68785, 146791, 60902, 99240, 142953, 99015, -10381, 49484, 16583, -52057, -63184, 76264, -13875, 36009, 17215, 60514, -133077, -161031, 79730, 114987, 34843, 17632, 175403, 35392, -141057, -201144, -33423, 202499, 204688, -122248, -107765, 77760, 128669, 5311, -138359, -100118, 146078, 153465, 69530, 154913, 14753, -144251, -261548, -201701, -164695, -205417, -201051, -270612, -198381, 44492, 102625, -72670, -113465, 18173, 80635, 141435, 255125, 114516, 139566, 157167, 75879, 69313, 29958, 2520, 57724, 140137, -117586, -111538, -48026, 106677, 260306, 89670, -91975, -104556, -34, 167066]
26484A67066J9788j47288j21909o6684J89377J74842k65232j52647P3876R8666
26474c0145M5654K7244N371N1101K2256j47267r6431K476J04548j8892q0933l5383
26462a50401N6543K4658l8734O5469J60038L4186j79484L5733q8150k28608M3414
26451b65336O8531J43348K1728P0507j30893K4110J96929P0556Q0962J08391j84078
26440B04755j89371j25018o7562J55115n1110j36665O0149J53125l5087j20114
26430a51783O9840O4481N8828j37335p4463P6649J62720l3699r8748j87119j29589
26419c80218k7068J04248P2522R1422K44493N5461p0994k0112j27623j33467k6906
26408b18242J71010L5615P9420j31491j75592Q242J21152O9619Q1719q037r1492
$$ y = [167066, 186854, 39566, -82343, -149027, 40350, 215192, -50040, -202687, -128811, -30145, 15509, 42753, 48124, 99225, 121481, -25786, -122217, -119741, -15193, -34085, -115018, -150401, -93858, -69200, -107934, -42465, 117573, 151759, -27725, 8008, -80142, -308750, -265336, -196805, -53457, -31729, 38778, -92115, -68005, 128924, 199480, 280442, 388833, 204755, 15384, -109634, -177196, -22081, -73191, -209856, -149707, 3418, -31669, -151783, -81943, -17462, 41366, -95969, -170432, -93783, 68937, 35238, -63510, -250629, -380218, -407286, -303038, -230516, -139094, 105399, 160860, 89866, 69754, -57869, -191336, -218242, -47232, -11617, 67803, -63688, -239280, -231038, -109886, -40267, 41452, 33415, -58077]
26397e8077K19801J09069j3401l8643n3021r5084j20422l9971L4236Q278o6258
26386a13493l1601J92326K5934n8384j15877J1423J06240j74392L5548k2313q1761
26375b26350q9789J83928J17232P3327J26783J76668j21023j54991j4919N3383
26365A24249o5246O4723M8631m1812o188k3702r4361p1564M6196M0428M7947m5874
26353B3427L0884q119j27402k28060J83088J05022j64681L1285j0280L5445O4319
26342f5072o6812R769Q6007M1755j606J1996J33543j16324j43632R8220M763j1277
26330a8670L616J44377k7463m6252O6987k6574j54990q1683N2589Q61m4097J41317
26318A0018q6432L1966L9265N5888j01056o3344N5912R5115M4390K8831j60478
$$ y = [-58077, 161724, 270793, 257392, 218749, 165728, 70644, -49778, -89749, -55513, -47235, -113493, -145094, 47232, 73166, 14782, -101095, -89672, 16568, -157824, -122276, -144589, -226350, -316139, -132211, -14979, 58348, 185131, 361799, 240776, 85785, 70866, 124249, 59003, 123726, 172357, 130545, 124357, 100655, 6294, -65270, -19074, 21354, 69301, 23427, 54311, 46192, -81210, -309270, -126182, -21160, -185841, -154556, -164836, -129391, -65072, -131884, -122115, -36108, 5647, 4041, 16037, 149580, 33256, -110376, -12156, -7393, -18670, -15054, 129323, 101860, 55608, 122595, 96021, -58969, -140652, -88063, -87202, -131299, 10018, -76414, -44448, -5183, 50705, -50351, -113695, -57783, 37332, 81722, 110553, -49925]
26307d9925j50972R1623J4233L7030R353o3226j91900N4087J05834L7206j24918
26296b31575P5620J29727O4448J20618k44776j22738o0973L6866K17688J1745
26286c350O336j15569l6423Q9476N6503R019p1515M812J69685R5875r8176k2330
26274H4343P2650M4038k9301k6517j08467R7299J10475l155k06837j11951j2291
26263h9714M3704M8368J35814M419L4286k3325j37053n7199J10785N7701L070
26252A30856m7195q0217j00941l9718l9919J18961n0035m3207J51576J06701J7974
26241A24836P5491j6352p7899N1827L5396n521j13019J51692q705j77887K471
26230D2330M4103L0789q566J1594j47395L357o3754P1303J1984k4807Q0346K4692
$$ y = [-49925, -200897, -109274, -95041, -58011, -48658, -111884, -303784, -249697, -143863, -106657, -231575, -155955, -26228, 38220, 158838, -85938, -208676, -269649, -232783, -15095, -3350, 2986, -112583, -149006, -59530, -3027, 5992, -65523, -60711, 108974, 204849, 106673, 84343, 156993, 201031, 171730, 145213, 36746, 134045, 244520, 241365, 34528, -77423, -89714, -46010, 2358, 138172, 142591, 176877, 153552, 16499, -40700, 70085, 127786, 130856, 83661, 3444, -97497, -137215, -177134, -58173, -108208, -151415, 161, 106862, 124836, 200327, 183975, 106076, 157903, 193299, 187778, 74759, 226451, 217746, 39859, 42330, 86433, 117222, 108656, 120250, -27145, -23788, -87542, -16239, -4255, -29062, 51284, 75976]
26218G5976K04852l2997k05612j06392p1421K09570N1313n6869j33296n891N57
26207g0210j22404P154K22669L1537J669J9205p2808o9759P3169J19104j1227
26196A28099j0717P3230J02558k04744j95948K5856q6221J01180J96179q2941
26186D6531k8748J6689j60663n5498J02503J37553q6941J41870K3998k43318j32707
26175b38731Q2214p3588n2509l0628J56425R1234K654l946J42334p8204j55572
26164a58317M4930p984m678o2193j55075K52912K64867J48724r594k10190k27395
26153a23993j01333K9634L2884m2279j17732P0453O8696K9599O3470N8116j20652
26142a53137p9416r7606J21371j8386R3791J03446J4751P3P6155N8579r0704j02493
$$ y = [75976, 280828, 247831, 42219, -64173, -135594, 73976, 125289, 68420, -64876, -70767, -70210, -192614, -185460, 37209, 68746, 70415, 89620, 16812, -52947, 20222, 139326, 128099, 117382, 190612, 293170, 88426, -107522, -81666, -167887, -66707, 129472, 46531, 17783, 34472, -126191, -181689, -79186, 58367, -28574, 113296, 137294, -106024, -238731, -156517, -230105, -282614, -313242, -156817, -65583, -62929, -66875, 75459, -2745, -158317, -113387, -121371, -126049, -188242, -343317, -90405, 174462, 323186, 313592, 103402, -123993, -225326, -195692, -162808, -205087, -322819, -252366, -183670, -154071, -90601, -32485, -153137, -232553, -330159, -208788, -227174, -133383, -29937, -15186, -15113, 61042, 119621, 28917, -73576]
26130g3576p2914q377n5568O423R9584q5869J59274J58098J9695n0424j00720
26119d374m5398O7130O0069J10417l7594p6987o0599p924q0582J39409N6126O6170
26107A85863K7175O0282k1492m4244m3026m6936r5604p6176r5822K35516J89130
26096B74666p1609J08741J31844M3182k71866k44011p5340J10968J3604j08912
26086h8733P7792j40613j26487N5445N5267j48236k12014j22611J90943J92495
26076b66752J35946J0847O1256J22747M0925j43204k42429M9757J42400q156j23937
26065b20600l5627q0777M8464J40375r9108p912K29719R5123j38433o53P6025
26054F596K18665N1739r1176m2283j13065R3518P3896j29464k65756k3654J58692
$$ y = [-73576, -146490, -154867, -210435, -204012, -104428, -190297, -31023, 127075, 146770, 96346, -4374, -49772, 17358, 77427, 187844, 150250, 73263, 12664, 4740, -75842, 63567, 119693, 185863, 213038, 273320, 251828, 207584, 164558, 117622, 22018, -54158, -149980, 85536, 274666, 203057, 311798, 443642, 486824, 214958, -29053, -104393, 6575, 20179, -88733, -10941, -151554, -278041, -222596, -167329, -315565, -527579, -650190, -459247, -266752, -130806, -119959, -58703, 64044, 104969, -38235, -280664, -230907, -88507, -96663, -220600, -256227, -337004, -288540, -148165, -247273, -255185, -25466, 69657, -68776, -69429, 6596, 225261, 277000, 185824, 143541, 30476, 123994, 197890, 68426, -197330, -220984, -62292]
26043f2292m2836m8047k9802L9352l7451N0294J30290q8155J43438J99296R208
26032B63295q6169j98211j53440K8227K442j4316M3630J9999N5699o4893m9979
26021a53716q412m3544J2974L9597j9397Q0116r1451r2718R8477J32322R4647
26010D8895M2904j35715p934k4376n9462P0047J93565M1318k5628q9202j32173
25999g7761k0734n9815j34361J11823J25501r5086k6488k5141k5707K48361J06759
25988A27351p1639M948p2533l2968j43341n2920J36749J85026R0304M6243j236
25977B15984Q0184n7108L9558j19828J5143j1374k8427j16396m4662J23939R8998
25966A96011j5428j8256K8905n9374j49534l7715O9645J13370j36654q239o3653
$$ y = [-62292, -105128, -153175, -182977, -143625, -181076, -130782, -492, -88647, 54791, 254087, 263295, 177126, -21085, -174525, -146298, -143856, -158172, -114542, -94543, -38844, -103737, -153716, -162128, -205672, -192698, -153101, -172498, -92382, -183833, -276551, -178074, -45752, 48895, 91799, -43916, -51850, -76226, -135688, -65641, 127924, 169242, 143614, 54412, -77761, -98495, -158310, -292671, -180848, -55347, -150433, -176921, -202062, -227769, 20592, 127351, 55712, 60660, -11873, -44841, -188182, -241102, -104353, 80673, 170977, 217220, 215984, 296168, 239060, 278618, 158790, 173933, 162559, 134132, 17736, -26926, 97013, 196011, 180583, 162327, 191232, 131858, -17676, -55391, 14254, 127624, -9030, -17269, -80922]
25955h0922j12414j39187P5007J09690J9266k7285j97l0495l7976O188J02716
25944a15609J05811n4126j01681L5142Q4072N5147K8322P857q5234j09200k3962
25933a73461N9476p2026l0680J46577J26960q4985L354n6616N595k4612j13911
25922b14329N8942J48798L13253R2444L288o6319o3147k30539j26641J11666q851
25911A8565J18189J81438j04545n0793o6377P9806R3714o1953q6892o5043m8191
25900G918j89940m2264J21461J71489K5607r7217j71749J51457J12616M7040p0333
25889F6085j65396n9548k6757J4741n4129N3520m367P7081J84586q3859r0404
25878h8447j55417j12484O7839N7400j0832K22698J23124q8526j42892L0949j4168
$$ y = [-80922, -193336, -332523, -257516, -147826, -128560, -155845, -156042, -186537, -224513, -218325, -115609, -9798, -63924, -165605, -130463, -46391, 8756, 37078, 44935, -40299, -149499, -173461, -113985, -186011, -216691, -70114, 56846, -28139, -24785, -81401, -75806, -100418, -214329, -155387, -6589, 306664, 399108, 402396, 336077, 272930, 42391, -84250, 27416, 18565, 136754, 318192, 213647, 162854, 96477, 176283, 269997, 208044, 121152, 56109, 7918, -182022, -224286, -102825, 68664, 94271, -2946, -174695, -23238, 89378, 136418, 66085, -99311, -158859, -185616, -170875, -225004, -171484, -175851, -98770, 85816, 1957, -88447, -243864, -356348, -288509, -231109, -241941, -19243, 103881, 15355, -127537, -96588, -110756]
25867a10756N5195l6827Q0496J58504M6208j98860j59741l200K0032p8933M4283
25856a83599J79148K6884n8604j16137k31323j5917J08106O4152J02706Q3554
25846d1030j63416q6424n6336L4228M6485N9176n8891o0822N0059J58305J92405
25835G3739k9180k73788k11514K58822J38309k7156o0120N1535Q8990j08132j55738
25824b54233o8991Q6912P2395L2801J82099O0780m7855J202j0945o2558l4907
25813d3300N0741K3911q106m296l1269L9601P0948p0793M4959p4220j47652N7604
25801i1872O1552n8486O928J50711J11024J21166r4381M6218M2539Q823m4840
25790B59382j68203j07713J5296R0017J36088n06k31451k6346j9236j51965p6680
$$ y = [-110756, -55561, -92388, -11892, 146612, 192820, -6040, -165781, -168981, -148949, -227882, -183599, -4451, 22433, -36171, -152308, -383631, -399548, -291442, -227290, -124584, -41030, -204446, -290870, -347206, -312978, -266493, -207317, -266208, -327030, -276971, -118666, 73739, 44559, -229229, -440743, -181921, -43612, -70768, -130888, -79353, 9637, -98495, -254233, -323224, -236312, -163917, -131116, 50983, 111763, 63908, 65110, 54165, -8393, -43300, 7441, 31352, 23246, 18950, -12319, 27282, 98230, 27437, 72396, -1824, -149476, -91872, -30320, -88806, -81878, 68833, 179857, 301023, 206642, 252860, 295399, 304222, 259382, 91179, -16534, -1238, 88779, 224867, 224361, -7090, -33436, -52672, -204637, -281317]
25779b81317L1831m8330J35675K66685m9630j39444R7287J13696o350o4879k43656
25768a88432j24456J01428K36098J58983m7309l6762p393J17267j26519j55238
25758g2333j4221J23698o0539n2547K0985L3954J86314K0396k33077k34964r9605
25747c81939J71896K37569M3462j05799k13105K0134J20124l7903L4420M5970
25737f5171j1966l4874L2567K474k6311l8183K33910J45253J01786O4954j20121
25726B84318j99521k33440j41072J21548J58804N2793J2022j9086j21474j2554
25716i7662M5719R1387J4927K3656J6208o1605m2934L6069K25343O6402j18637
25705A98873j62623q3393O8723N4549P5106o3232k6165o8133j39521j14701J4577
$$ y = [-281317, -249486, -297816, -162141, 104544, 54914, -84530, 12757, 126453, 120103, 55224, -188432, -312888, -211460, 24638, 183621, 136312, 99550, 92157, 209424, 82905, -72333, -86554, 37144, -23395, -75942, -54957, -21003, 165311, 185707, -47370, -282334, -381939, -210043, 27526, 70988, -34811, -247916, -227782, -107658, -145561, -111141, -65171, -77137, -112011, -79444, -76970, -103281, -141464, 92446, 237699, 339485, 404439, 284318, 84797, -148643, -289715, -168167, -9363, 43430, 55452, 36366, -85108, -97662, -51943, 39444, 54371, 78027, 94235, 32630, -10304, 25765, 251108, 317510, 198873, 36250, -47143, 21580, 76129, 151235, 88003, 61838, -6295, -145816, -260517, -245940]
25694b45940M7810j1066j37599j16896q525P0842K02539K42889J88511m442K5102
25683B53225j59768j93613j4020P8005R260j24875o189P4298j4263k1959P4287
25672d5612j46052j0681P3471J93919K1454J1782q7025L8499j1926p7181n8777
25661i8129M1944k3883J09945J61886J10387p0280j60839l2061j03586m3785J5287
25650i3114j39296J30244j5940J9538M1447m7678m1005M4964k6070n4385p6502
25639b57797R9954J7812O4721l926R5230k7540M1367K8652k5266k5825r1966j8809
25627a03393l0380J11829Q3007J12124j0253K3981j03574j33967L0998p5874L9083
25616e6419o22K47054l1262q7389p3611L9940M6759K0771r9924M8324M3955j03348
$$ y = [-245940, -198130, -209196, -346795, -463691, -472216, -401374, -198835, 44054, 232565, 228123, 253225, 93457, -100156, -114176, -36171, -26911, -151786, -157975, -83677, -97940, -119899, -45612, -191664, -202345, -128874, 65045, 86499, 98281, 11256, 49755, 37829, -39352, -98129, -56185, -80068, 29877, 191763, 302150, 231870, 71031, 38970, -64616, -108401, -93114, -232410, -102166, -118106, -98568, -57121, -104799, -145804, -100840, -126910, -181295, -257797, -157843, -140031, -75310, -79236, 15994, -11546, 29821, 58473, 33207, 7382, -84584, -103393, -133773, -21944, 61063, 173187, 162934, 186915, 83341, -50626, -19628, -95502, -56419, -57041, 190013, 158751, 71362, -2249, 37691, 84450, 105221, 5297, 53621, 97576, -5772]
25604e772P2027m7300j39670N983J19981n3581q7714K932P7783L5008j51844r2911
25592b65078J30178K05804M7635j11622L6888K4321j28573N5292K27803K9881
25582B52529j34504j30856m4547Q1320p7669o7467q5309k9261J17488P6170K03955
25571A61849m4042l1593j353p6854M2407O7172Q910p8792M1313j07224M8301J20432
25559A50526j98186k03734Q2603K90435P2108j53401p1785J36686j44048j4257
25549e3053K40507K03838r9029j83518l44649k0272J83175K0350J46204K04975
25539B98528q7743p9857R4315p837M1647j51196r6883j37781j31692P8430K5808
25528a54261p2274O2585J07053o7248R2396P0033j30658r5356J13102l6938N6412
$$ y = [-5772, 66255, 18955, -120715, -114732, 5249, -48332, -136046, -133114, -55331, -20323, -172167, -265078, -134900, 70904, 118539, 6917, 43805, 68126, -60447, -5155, 222648, 252529, 118025, -12831, -57378, 23942, -53727, -121194, -206503, -235764, -118276, -42106, 161849, 117807, 86214, 84861, 8007, 50414, 117586, 126496, 47704, 89017, -18207, 30094, 150526, -47660, -251394, -168791, 121644, 193752, 40351, -31434, 105252, -38796, -53053, 187454, 391292, 292263, 108745, -235904, -256176, -73001, -52651, 93553, 298528, 210785, 130928, 225243, 217406, 259053, 107857, 10974, -126807, -258499, -180069, -154261, -226535, -163950, -56897, -124145, -31749, 38284, -92374, -187730, -74628, -111566, -55154]
25517e5154J04773P7094J72411q7558r8032K2260j2965r4795j3967q2717l1621
25506a00271Q7126q1558j17420j98968N3032K94432R4253n696j1438P5929p636
25495H1785l9349N0134r5837R3497K13872p3173j65736R177N96Q843P8123m1417
25483A20515j1233l242R7806j49903k75198j6233J09786j68193k2377L0202J18342
25472a69728J06103J46698P5508J28243K4751r2088m9478j14238n8714k8020K9430
25461a533L6054M7735J8810o9468o7630O0321J06107J34339P6332P742k7625K3133
25449C44317k10908P0667l5956m9208o9050q2805O1580J06936n4011k01406m7230
25438a67074O3985O5647P7848J66179k164l13398M0905J9156j02964J01984N0591
$$ y = [-55154, 49619, 126713, 299124, 211566, 113534, 135794, 122829, 28034, 14067, -68650, -100271, -13145, -94703, -212123, -411091, -358059, -63627, 30626, 24930, 13492, 89421, 81785, 42436, 92570, -3267, 90230, 304102, 230929, 65193, 74370, 74966, 83809, 161932, 120515, 109282, 106040, 203846, 53943, -221255, -237488, -127702, -295895, -318272, -288070, -169728, -63625, 83073, 158581, 286824, 311575, 219487, 170009, 55771, -2943, -30963, -1533, 34521, 82256, 101066, 31598, -36032, 24289, 130396, 264735, 341067, 348809, 321184, 344317, 133409, 204076, 168120, 118912, 49862, -32943, 28637, 135573, 81562, -119844, -167074, -103089, -37442, 40406, 206585, 204421, -108977, -68072, -48916, -151880, -49896, 695]
25427F95J02554r678q7013O7160L3742j40558j74521m6055M7220R972J36059m6210
25415a06633m2579r1959n9654J05448J15846J25163p6754M9499J13031J9056j18643
25404C1821l0714m8560O0366J26447j12324J6381K545k19878p237J05319o9126
25393a44960r3245O3377J04924k7450m7116J01621J53343J45405n2336q2168N4001
25382A75396q4298k6833r5701j05234r8383J44561L9752J5646L4195O6066j12767
25371d7600r483J13451K57707K746j81875j40994o0172j23967o078j10644j10784
25360d17693Q2610J02173M4290J70057l0401J49903K142R4287n7900k17615q5580
25349a63727r4769L9876J65142J62432J08720j86519l06067L7795J17924P5154
$$ y = [695, 103249, 93571, 6558, 73718, 107460, -33098, -207619, -253674, -206454, -196482, -60423, -106633, -149212, -241171, -300825, -195377, -79531, 45632, -31122, 18377, 131408, 150464, 31821, 1107, -47453, 12913, 139360, 27036, 43417, 45962, -173916, -181153, -75834, -144960, -238205, -174828, -69904, -97354, -144470, -42849, 110494, 255899, 203563, 121395, 175396, 91098, 64265, -31436, -136670, -235053, -90492, -50740, -35094, -899, 65167, -47600, -57083, 56368, 314075, 316821, 134946, -6048, -66220, -190187, -196265, -306909, -417693, -335083, -232910, -188620, -18563, -48964, 100939, 103081, 197368, 139468, -78147, -163727, -258496, -218620, -53478, 108954, 217674, 31155, -274912, -237117, -119193, -44039]
25339d4039k9902J17923j220k15592K6471k6232P881L6628j57046m9966J02159
25328b32935R5409r2353K20066O5100R4808Q8473M6011k47381j94979L0188J08004
25317a9589M5252R2727L1836j61419m3228l5980p3215R0749J63706K5486j82752
25306f6427j41190K021O8414J16748j25112j8123q4061P9849K07275j7318K1720
25295D3796j8M9078K2401l1033J5083k4825J78664J87r9729j08370J04676K4580
25283A74490j64800m2258l1929o6163k1103K4436l5353l0841N4543J10232J40116
25272A11370j32131j17653j17902P0972J81589J03471Q7690o3460j51965j0405
25262c8424m5310r3192N5123J16659l6645l968J82344P9046m0787k3876j33891
$$ y = [-44039, -73941, 43982, 42762, -172830, -146359, -172591, -164710, -128082, -285128, -335094, -232935, -137526, -229879, -9813, 55287, 150095, 238568, 284579, 37198, -157781, -127593, -19589, 25663, 118390, 150226, -11193, -54421, -90401, -163616, -72867, 90839, 116325, -66427, -207617, -205596, -137182, -20434, -145546, -163669, -247730, -167881, 39394, 22076, 43796, 43778, 92856, 115257, 84224, 99307, 74482, 253146, 253333, 153604, 45234, 149910, 174490, 9690, -32568, -64497, -130660, -151763, -127327, -162680, -193521, -138978, -28746, 111370, -20761, -138414, -256316, -185344, -3755, 99716, 187406, 123946, -28019, -38424, -83734, -176926, -121803, -5144, -41789, -45757, 136587, 215633, 174846, 150970, 17079]
25251A7079j86998j27540K51846N4768M6934J20633n1741k92796O8682K25550
25241A26417m0663O843l0181j39362J35329J81824R4053j61210j27276l9848m5967
25230d0041Q9644J26380q0942K7696o7275r5395k20035N8031P6150k3367j4358
25219a63512J13187J02065K4390q9332j08613k0753j2759n3481J13937J09856
25209A4985O7456l7657j46128j1029l6655q7373K4883R4563P8273L6305q5640
25198h8017l6230R0408M9316p0971K9413P458m9659k0458R664p4329j3739m4218
25186b11362K5427N621j27976P1248J309K0127J26700M0033j112l286J23084K4333
25174I4146r7429j70545R467K1263p4082n2557l7341J05461J39106j8467k828
$$ y = [17079, -169919, -297459, -45613, 9155, 56089, 176722, 124981, -167815, -99133, 126417, 85754, 92597, 62416, -76946, 58383, 240207, 334260, 173050, 45774, 5926, -40041, 49603, 175983, 95041, 122737, 55462, -39933, -259968, -201937, -125787, -149154, -163512, -50325, 51740, 76130, -13202, -121815, -142568, -155327, -208808, -94871, 14985, 82441, 44784, -101344, -112373, -149028, -236401, -211518, -116955, -38682, -2377, -88017, -124247, -33839, 15477, -55494, -26081, -18623, -68282, -88740, -79076, -153405, -167144, -211362, -185935, -180314, -308290, -237042, -235733, -215606, -88906, -48873, -49985, -53271, 69813, 94146, -3283, -173828, -164361, -143098, -217180, -269737, -307078, -201617, -62511, -80978, -83806]
25163h3806J95004J37112K1046n4496q8570j81964l4267Q4918P1039q6854m6612
25152f7450j09046j52818Q0454M3718j01718R3625k8162k05335J41479J33311
25142a71942o5525j17306j41457K092J61200J46084J90137J26300R004L3731l0267
25131A42051j64335j23043J63757l3039o141j20777j12885Q1465k3637P007K85269
25120I5692k3235k13410K9075J34974M8309O8739J6028n7531Q7706n1988k1633
25109A12726r7100j42795P6544J40499j2663r2157m2956j00478M3037Q9559j06927
25098a32711L2064k1779J03856o1418j82526J36298J49120P8690k0662k8776R6940
25087A49096J9375o1090J08377M767q1653P5296n9852j6170P5333j2534j93706
$$ y = [-83806, 111198, 248310, 269356, 214860, 126290, -55674, -89941, -5023, 66016, -20838, -67450, -176496, -329314, -248860, -205142, -306860, -213235, -241397, -446732, -305253, -171942, -237467, -354773, -496230, -494138, -332938, -186854, 3283, 129583, 138587, 172318, 142051, -22284, -145327, 18430, -14609, -20750, -141527, -254412, -172947, -196584, -189577, 95692, 72457, -140953, -111878, 23096, 71405, 140144, 156172, 98641, 186347, 134359, 112726, 15626, -127169, -50625, 89874, 77211, -14946, -57902, -158380, -115343, -25784, -132711, -100647, -122426, -18570, -79988, -262514, -126216, 22904, 101594, 80932, 52156, 149096, 168471, 107381, 215758, 220525, 138872, 214168, 154316, 138146, 213479, 200945, 7239]
25076G239k34475O6728L8677O6704L0816q0490q2352P9059R6409J48657O6963
25065B03935j17678J1773j49359L5460q2552l2891q5737j11678J89553J66482
25055B7308J07406r8268q9102M0134l7587R7788m6113j7204k84j7754l6847O0887
25043i636L1591N4597N4795j09106n6038k2335J68311J9363K7326k9278K8583
25032A58173j34961n7753N2244L1387q46O9136L8699O93j3217n3524q1607k032
25020F392M4904j16016Q8175p6217m8878j04061k2403N8414K8552J8268O1150
25009f1720O1221K5946J0695K2491L3948m6234m0848J34536N3121j96878k32715
24998b36437L3209P7032N8213q37K9j12897R5521J30019j324j50918K7889J3592
$$ y = [7239, -227236, -160508, -121831, -55127, -24311, -104801, -187153, -108094, -11685, 136972, 203935, 86257, 98030, -51329, -15869, -98421, -131312, -217049, -328727, -139174, 27308, 134714, 36446, -52656, -12522, -50109, 47679, 1566, -15638, -15922, -33676, -70523, -9636, 21955, 76552, 131347, 22241, -33797, -56132, 112179, 131542, 158868, 129590, 158173, 23212, -34541, 17703, 49090, 48244, 117380, 156079, 156772, 143555, 90031, 8424, 6392, 51296, -64720, 23455, -52762, -101640, -205701, -228104, -169690, -141138, -122870, -61720, -499, 25447, 36142, 58633, 92581, 46347, 5499, 140035, 193156, -3722, -236437, -203228, -126196, -67983, -68820, -68791, -181688, -86167, 43852, 42528, -108390, -80501, -66909]
24986f6909O6698p2923L9356J0796J3117p4211m7324j5952R5175O0205p0785n9453
24974a22210J9196N7393L3644O3911j47398o4701R5878J16478k4143J8019o608
24963C9459j19410l6828m4037p3664O7374Q6553L1764L8173j6135N2918J90420
24952B16587m4860j53723j47528L9167Q8805p3217j95034j51723R9733p587Q1871
24941b47509L63775J61j14225j9361J09972J4672j50280O3784j7225q614O3338
24930E8488K3025K3595j8629J74770m4271j22956J54433J1809j37126j91431J05337
24919C7044J28955K8873j38952j93065n69N9088l6298j3660J16684j07105o0120
24908a79125J06367r048J06533J17849J75902q985j83048j00062K1464m9170P0854
$$ y = [-66909, -211, -73134, -33778, -22982, -9865, -84076, -131400, -147352, -52177, 8028, -62757, -122210, -103014, -45621, -11977, 51934, -95464, -160165, -64287, 52191, 28048, 46067, 39459, -79951, -116779, -160816, -234480, -167106, -80553, -48789, -10616, -26751, 26167, 216587, 171727, 18004, -129524, -90357, -1552, -74769, -269803, -421526, -321793, -329380, -247509, 116266, 116427, 2202, -17159, 92813, 107485, -42795, 20989, 3764, -4850, 58488, 81513, 105108, 86479, 261249, 216978, 94022, 248455, 260264, 123138, -68293, 37044, 165999, 194872, 55920, -137145, -137714, -78626, -114924, -128584, -11900, -119005, -179125, -72758, -81806, 24727, 142576, 318478, 309493, 126445, 26383, 47847, -1323, 69531]
24897F9531o7585j17512Q5905J40275m1444k979J04243o334k16250j13769J7124
24886a48795J66506K41308j89989j66366K15280J93978O1190j33210j26341K0390
24876A33951M4902J1880j12158p9498P1538K4610J17555O453J19588Q9995j55959
24865B72857q4923q2446K8799k5387L7519L3873j4892j90j25910k6027o2637m6481
24853i5845O9926J57600K3351o8384n2274r407M5100K9969n3429r6499o5014K996
24841a11910Q9013J83500k3437q9312J2352r3067K5954j01315J13603J55243p0567
24830I0057j71816m2821N7094j478J07893j10262j49393j04844m5284j91794j8510
24819e81158K9556K67066K04363j8606p9656J17100R5763q5774j39887Q1129r2
$$ y = [69531, 1946, -115566, -29661, 110614, 69170, 66191, 170434, 164100, -52150, -165919, -148795, 17711, 259019, 69030, -97336, 117944, 311922, 373112, 239902, 113561, 133951, 178853, 190733, 78575, -923, 70615, 95225, 212780, 219233, 338821, 428816, 272857, 187934, 105488, 134287, 108900, 146419, 180292, 165400, 165210, 39300, 13273, -49364, -95845, -25919, 131681, 155032, 86648, 34374, 24967, 70067, 100036, 46607, -49892, -114906, -111910, -22897, 160603, 137166, 47854, 60206, -32861, -6907, -108222, 5381, 160624, 90057, -81759, -124580, -67486, -68964, 38929, -71333, -220726, -325570, -370854, -562648, -581158, -551602, -284536, -80173, -98779, -178435, -61335, 34428, -51346, -191233, -110104, -110196]
24808a10196j18122j05967o4802J38600J8979N125J956J259n1026L8964J78376
24797f6854M8880l013o8498l161r0994j4601n7105N4081R9203l7673R816J3887
24785a16032J82618O9529J32475p1188q8243j69986o5072j20388J11512J30740
24775d035Q6046j32082m7193j05958o8801Q3308J40668R4122o9117j0965Q4748
24764E0741l2227N0395n5035l6331o8638M4049J17519J1413p9362r2563N2236
24753c7803r0911q7926m842M6348J26846J27383Q3255J17842J9859o2632K9671
24742B67090j19887o9300M6425m3829P8169M1258m8512j84025o4703k04426j9929
24731c21669J75762J54933j9989k676k056l950J8577j38138M239P8270r4142K21673
$$ y = [-110196, -228318, -334285, -399087, -260487, -241508, -236383, -234427, -233168, -284194, -245230, -66854, -17974, -20987, -89485, -92646, -183640, -198241, -255346, -201265, -102062, -139735, -129919, -116032, 66586, 136115, 268590, 197402, 109159, -60827, -125899, -246287, -134775, -4035, 82011, -50071, -97264, -203222, -272023, -188715, -48047, 46075, -23042, -34007, 50741, 18514, 68909, 13874, -22457, -91095, -47046, 70473, 81886, 2524, -90039, -37803, -128714, -216640, -221482, -175134, -48288, 79095, 162350, 280192, 300051, 237419, 267090, 147203, 77903, 124328, 80499, 158668, 199926, 151414, -32611, -97314, -301740, -321669, -145907, 9026, -10963, -13639, -15695, -19645, -1068, -139206, -134967, -56697, -150839, 70834]
24719G0834J45220N1087l7770j78536n5993p3254j08620O8462O8254R5430k0263
24708B4851J00996M3221N1933j31855k78997j40652K2916J51517J85111o2225
24698c3184j24743o8516j19514J30721L14558j06273j27064O8505J71826O2560
24688A68876J01254L3018j09154r8910J0650j75426j42926K7858l6359m7133Q2684
24677a85568j6227r075J03537n3710Q1767q909p8436J71401N1080j33977J04962
24666B6845M4591p2592r5236l3241K33718o3831P4556k9003j55613n4499J03160
24655b1145j42110r463l8962k22694J22384J53021M4273Q0826j01071m944J4117
24644a25768J04045K9424j087K3931K18196k7449o2137k21714m5377M1081n3162
$$ y = [70834, 216054, 267141, 229371, 50835, -5158, -78412, -187032, -118570, -50316, 45114, 24851, 125847, 169068, 221001, 89146, -189851, -330503, -307587, -156070, 29041, -33184, -157927, -226443, -345957, -215236, 99322, -6951, -134015, -65510, 106316, 168876, 270130, 303148, 193994, 95084, 105734, -69692, -212618, -184760, -221119, -268252, -185568, -201795, -210870, -107333, -161043, -79276, -88185, -166621, 4780, 55860, -78117, 26845, 71436, -1156, -96392, -129633, 104085, 40254, 114810, 85807, -69806, -124305, -21145, -163255, -172718, -211680, -434374, -311990, -158969, -114696, -33870, -134941, -139885, -125768, -21723, 7701, 6614, 30545, 248741, 221292, 159155, -62559, -107936, -66855, -120017]
24633a20017J52570M2176n4397j152Q6440m6455R3590M5036j65361j40442r9914
24622b07926j9394J61160N6395m3263M7509P5220O3844l9187m2896o4658l211
24611a6407K5648m2567N5100m3992L212m6925J7202J13924J64608m6034l5006
24600A48763J2458K7287P1694L7246n2678k06035j52238O3121p7260j26853L5668
24589b18827q134P5249Q7667K9539j3938J22121l4633K9166l3381K5713k79598
24578b19056k11650r1959P3404K58202q5626j08899P0079O4479M6675J09745J4832
24567g9774O7708P179j7724l7769l7825K5338m2043J2240o1146J00042L3184J67596
24555A37006J084J2038j1344k02007j97449k1278Q2879L5708K0759N3790O8199
$$ y = [-120017, 32553, 74729, 20332, 19180, 105620, 59165, 152755, 197791, 32430, -108012, -207926, -227320, -66160, -9765, -53028, -5519, 69701, 133545, 94358, 51462, -13196, -16407, 9241, -33326, 21774, -22218, -19006, -65931, -48729, 65195, 229803, 183769, 148763, 161221, 188508, 260202, 297448, 244770, 38735, -113503, -50382, -127642, -254495, -218827, -226961, -151712, -64045, -34506, -48444, 73677, 39044, 68210, 34829, 60542, -219056, -430706, -522665, -449261, -191059, -276685, -385584, -315505, -251026, -204351, -94606, -79774, -12066, -4887, -22611, -60380, -98205, -72867, -114910, -102670, -163816, -63774, -30590, 137006, 138090, 150128, 138784, -63223, -260672, -281950, -199071, -163363, -142604, -88814, -20615]
24544b0615J7399L3470R3509j36511j08559j0966Q6339p2180R6086o1226K5226
24533e8028M5543J23802l8543r9473j61465J13327O7188P0420k8437j86014L0946
24522a20734J11178O5530m8212L9703q4279l2152R9127l9501P950R1383j58540
24511f8547J5570n7654n8188M3276o1827j59768K1721J13032l8977J11418P9665
24500f0279J61243J8368k185k4145o1389l9446R0560J9406K5677K2896r166j10887
24488C0653j4200q3419j24236n0802M4189O7578J70686J09419j75789n9132N2875
24477c2178j04391q8637J95098p6818q2481J37339p346o8058J4520M5786K48994
24466A81828J64814k37824l22790K0877k6693r3406l3260P0519j217J2327J00557
$$ y = [-20615, -3216, 30254, 123763, -12748, -121307, -132273, -45934, -118114, -22028, -83254, -58028, -12485, 111317, 72774, -26699, -188164, -74837, -7649, 62771, 34334, -151680, -120734, -9556, 55974, 7762, 47465, -36814, -68966, 30161, -9340, -1390, 89993, -68547, -52977, -110631, -168819, -125543, -187370, -347138, -325417, -212385, -251362, -139944, -60279, 100964, 119332, 117147, 93002, 31613, -7833, 82727, 102133, 127810, 150706, 141540, 30653, 16453, -66966, -191202, -242004, -197815, -130237, 40449, 149868, -25921, -85053, -32178, -136569, -225206, -30108, -106926, -189407, -52068, -59414, -127472, -112952, -67166, 181828, 346642, 108818, -213972, -193095, -219788, -313194, -346454, -275935, -277152, -264825, -164268]
24455a64268K18705J48845j85550J37425Q1881j68470j90448O6246k2258O5788
24445a2104j11799j31561O4309R8534J58522j051j58152m0485j6063l8239R8539
24434h9550J29744R7440j62450j01811q6562q6709m48K01238J51667l45196j32859
24423d25496K0726J04779O8441J93749J40870o4263n9806l9618m7009J0601n4221
24412a51247Q6378j12235j1390K9629p05O3315J29965j00286l7451K16148j81054
24401f8933m4738R5553J30101k9154k00704J82966M6213j3526p2760j85599k97523
24390d58104M9196j7462J33575J20917K10832J03104N5053j90071j85608o9440
24380b48008q299j6123J13669P1868J30494r593r9645l884R869L2339P079M305
$$ y = [-164268, 54437, 203282, 17732, 155157, 237038, 68568, -121880, -55634, -77892, -12104, -123903, -255464, -191155, -92621, 65901, 64850, -93302, -133787, -149850, -188089, -89550, 40194, 137634, -24816, -126627, -213189, -299898, -300346, -99108, 52559, -292637, -425496, -404770, -299991, -231550, -37801, 103069, 38806, -21000, -60618, -107627, -97026, -151247, -64869, -177104, -188494, -158865, -159570, -96255, 33710, -66576, -104027, 112121, -68933, -113671, -18118, 111983, 82829, -117875, 65091, 111304, 97778, 25018, -160581, -458104, -408908, -426370, -292795, -171878, 38954, 142058, 197111, 7040, -178568, -248008, -256307, -272430, -158761, -86893, 43601, 34008, -65637, -69521, -59652, -27313, -20234, -15929]
24368a5929L8438m9622L3129N7261p1838j42550K5580K0891N4408m7761o0876
24357a58869l0629k2347O1275P9459M4992k2192j75868Q0514N3695m4999m2011
24346a76980J88606M7008o7030r3200K22023J6913j40666m3337J60099j11086
24336B350j40557M7416J62578R2507R2745l1280k23377j37616j8788M6516l3164
24325a40670j4136k1007j33498R8635J94446o6387r8033R9004J7153P9279l4468
24314a9682p4023N0706m3921K4679k3577K273J34102o7000K33454P4376r5799
24303A95588q5436k8163p1256L1040j29325j2265k1919j5238j3117J19621m463
24292c4933o2530K6741O4044J8981j14075j72820q66R8604k9065O1534J03721
$$ y = [-15929, 22509, -27113, 6016, 63277, -8561, -151111, -125531, -104640, -50232, -97993, -158869, -189498, -211845, -150570, -71111, -26119, -48311, -224179, -143665, -89970, -134969, -176980, 11626, 58634, -8396, -101596, 120427, 137340, -3326, -46663, 113436, 2350, -138207, -90791, 71787, 164294, 257039, 225759, 2382, -135234, -154022, -107506, -140670, -154806, -175813, -309311, -210676, -16230, -82617, -180650, -81646, -64493, 14786, -19682, -93705, -42999, -86920, -62241, -85818, -83545, 50557, -16443, 217011, 291387, 195588, 110152, 81989, 10733, 41773, -87552, -99817, -121736, -136974, -150091, -30470, -34933, -97463, -70722, -6678, 12303, -101772, -274592, -275458, -176854, -205919, -144385, -40664]
24281d0664N7236k9939J77969K9220j15489l5475o9241J55674p3782j23576J70615
24270A02548m9614o9763l2100J6005O5834J6979O0842j7174J25487K8752j61457
24259H6339j33208O4003P9539J04996j55920N6253J79698j8671k06330j23571
24249f6872N6968Q3449q1645o1095J59284r6092r2594J3492P3605n5507j28458
24238a95465L6107P64m3916R4249q363K7612m4890k6840o2355P0650K618l0828
24226a80657L7516L9036o6739P2490Q204O0336Q9605O8103j07588j15973J02364
24215F697o4527m9734J40492K0791l2689k4362M6393j07525q2573l6496L8104
24204a45429M8605J41791l3772J01415M7054k1845r6801l672p3999n7175J9000
$$ y = [-40664, 16572, -13367, 164602, 193822, 78333, 42858, -26383, 129291, 55509, -68067, 102548, 52934, -16829, -48929, -32924, 32910, 49889, 110731, 93557, 219044, 247796, 86339, -46869, 17134, 96673, 201669, 45749, 102002, 281700, 263029, 56699, -66872, -9904, 73545, -8100, -69195, 90089, -6003, -98597, -85105, -11500, -67007, -195465, -159358, -158594, -202510, -108261, -116624, -89012, -133902, -160742, -223097, -152447, -149829, -180657, -143141, -104105, -170844, -98354, -90150, -29814, 59791, 127894, 20306, -95667, 6697, -57830, -107564, 32928, 53719, 21030, -3332, 43061, -64464, -147037, -183533, -145429, -96824, 44967, 11195, 112610, 159664, 137819, 41018, 37346, -36653, -93828, -74828]
24193g4828J0218O2831M7027n0348N1601q8508J8271j10697m9012J18673O7450
24182B678k11016k16770K9258J33528O2847J22291O5229J19180l069j9397r6509
24171a1750l456l1809n1262M984K35932J17103M6265r7654k55814k4514L4733
24160c7242K0841Q0298J2794J1529N2648o8778K4585K0973j60524Q0015J89369
24149B26508J49976Q7957k51467m11825r6606O3583N6137J21981K17711R7041
24139B60996j21745j51450Q5137J66921O0357o9918j05495o8872m7997k40301
24129b32367j2117J73466R2483j0038R3774J27559p5172j05904J5757J00718j57316
24118A0843k0883K479q9228l5901M1405N3262q2329m0309p7103O8033J82690J53714
$$ y = [-74828, -64610, -1779, 45248, -5100, 46501, -42007, -23736, -134433, -183445, -64772, 2678, -208338, -425108, -395850, -262322, -199475, -77184, -11955, 107225, 104156, 84759, -11750, -15206, -47015, -98277, -93293, 142639, 259742, 306007, 208353, -47461, -71975, -37242, -16401, 63897, 76691, 88220, 140868, 72090, 96675, 117648, -42876, 37139, 226508, 376484, 464441, 212974, -198851, -295457, -231874, -175737, -53756, 163955, 260996, 139251, -12199, 72938, 239859, 300216, 230298, 124803, 55931, 7934, -232367, -244484, -71018, 21465, 11427, 105201, 232760, 157588, 51684, 67441, 168159, 10843, -10040, -7561, -96789, -132690, -91285, -38023, -120352, -160661, -237764, -169731, 12959, 166673]
24106A66673K1778m0312m2476l2087j15337k8923k2539p1357L8911J97907j5961
24095E6277o7296M3861j30868l5556J03294L1570n8395l6181j4328J18607J19012
24084A29997K9069j03382j42297k12786q7845j12542R0940K62028P3048L808K2678
24073d7284J10259m1053j27081N5823J261o3742L2503J47010K896j86731M5568
24062g0571N7684J10438j09115j23717J08474J41564o7732J5933k18840M2778
24052a13104n434l5147R5264M3128P7271J36455r9220N0588l9195o7499j10413
24041f7306N4876j38951N643K7284K8118J31860o4612O5869P6395N6398n9587
24030A15987q7755k2909R6190J15160J03199q4446N5088Q999q8899k0885j10982
$$ y = [166673, 188451, 148139, 105663, 73576, -41761, -70684, -93223, -164580, -125669, 72238, 56277, -11019, 32842, -98026, -133582, -30288, 1282, -57113, -93294, -107622, 10985, 129997, 159066, 55684, -86613, -299399, -387244, -499786, -408846, -146818, -73770, -69962, -47284, 62975, 21922, -105159, -49336, -48075, -111817, -79314, 67696, 70592, -116139, -70571, -12887, 97551, -11564, -135281, -26807, 114757, 47025, 62958, -155882, -113104, -118538, -153685, -58421, -15293, 61978, 198433, 99213, 149801, 110606, 43107, -67306, -12430, -151381, -145738, -118454, -90336, 41524, -23088, 42781, 119176, 175574, 115987, 28232, 5323, 101513, 216673, 319872, 235426, 290514, 299513, 210614, 189729, 78747]
24019G8747j38622P9498J38266M6252Q9123j9533j7692L360j2351j16996r0179
24008C9873k59894J73209k4533k8306r3037p3377J30569J81363Q5016m8860o7683
23997A4340j0260k0637J5811L3590O0944p9826J08995P9879Q6545J07727j96088
23986B01020j68860j3859O0342J11952J13031j05226l5403L5874j18344j53890
23976g3363q8149J83050J90128n7833o6124j5957q5901l5182K5205J34141m6138
23965F3877P3261M3574l8129n8383r6734q5626P895j15490O7493J83270m1520
23954C488m9510J01028O3992k05052j38634R4359J01156o8223q814r5065j79673
23943c80948J44081J40622R9413J50767o6658j77114n0428K6614q4098j3557O2823
$$ y = [78747, -59875, 19623, 157889, 204141, 293264, 273731, 256039, 259399, 247048, 130052, 39873, -220021, -46812, -71345, -99651, -192688, -266065, -135496, 45867, 130883, 82023, 14340, 4080, -16557, -746, 32844, 93788, 13962, 122957, 202836, 289381, 397108, 201020, 32160, 18301, 78643, 190595, 303626, 198400, 162997, 198871, 80527, -73363, -161512, 21538, 211666, 153833, 87709, 71752, -14149, -49331, -24126, 110015, 63877, 137138, 180712, 142583, 84200, -12534, -98160, -90265, -205755, -138262, 45008, 3488, -46022, 55006, 118998, -86054, -224688, -130329, -29173, -97396, -106210, -201275, -380948, -236867, -96245, 3168, 153935, 87277, -89837, -140265, -113651, -197749, -211306, -148483]
23932a48483J41332J22994l1631j42694J4068o795k8529j0239j12991m9689J64918
23921h7739j289r4490r0392n0888J68425J32935J17288O2588K6400k2549J1275
23910A71564k2383j18564j00122K2661M110j7742k126j9600j820o7636j42134
23899b93792L6723r8756L8968M4817J42425K0367r0127K20201N3645n837K3923
23888I2557n9216O5404Q9635j23177m5942j05008j32280q538l8212j01043R026
23877c56794J38820J41332n3226l4503N0161K0529J54178k4304j26331q9472N2240
23866a27370o6499J18010J08788j86040q3592J59720J079o4127m2444N5608Q9929
23855c6938M4756Q3573m9239R170J2008j39550l0533j0126J24132M3124j53282
$$ y = [-148483, -7151, 115843, 84212, -58482, -44414, -51209, -79738, -89977, -202968, -252657, -87739, -89028, -183518, -273910, -324798, -156373, -23438, 93850, 156438, 182838, 160289, 171564, 149181, 30617, -69505, -46844, -42734, -60476, -62602, -82202, -84022, -151658, -293792, -257069, -355825, -316857, -272040, -129615, -109248, -199375, 20826, 74471, 68634, 92557, 33341, 98745, 188380, 65203, 19261, -85747, -218027, -226565, -264777, -365820, -356794, -217974, -76642, -129868, -164371, -114210, -93681, 60497, 36193, -90138, -179610, -127370, -193869, -75859, 32929, -153111, -236703, -76983, -75904, -140031, -182475, -126867, -36938, 7818, 91391, 42152, 51322, 63330, -76220, -106753, -116879, 7253, 50377, -102905]
23844a02905N7746J21032n3190O1709L7727P0567m7532P7976J04663r8796j74804
23833E4193j57373l2565Q0031Q7998j62636j11546K9248P6594J2860n8900J10223
23822g1873L1634j25702J40523J05475L581J8348r5027j28948j35107K36582j4261
23811c4775k13589j37706K2699J0037J5003K19533K32850n274j78441q5977k37
23800a55877N8002N6316J4891l1325n3093K0166K8096j39099n448m1236J39734
23789a08873J67961l4049M860P2381K8685m267L638j79417r5404L0022J50985
23778C6522L9053l7129K9171o6337l6867K0300R1004l0584j80088p3101j89828
23767c97884K18082P0212j8036j72482j22108L4845j3353P8356J22203j17534
$$ y = [-102905, -45159, 75873, 22683, 84392, 122119, 192686, 145154, 223130, 327793, 228997, 54193, -103180, -135745, -55714, 32284, -130352, -241898, -212650, -136056, -123196, -182096, -71873, -40239, -165941, -25418, 80057, 83638, 101986, 6959, -121989, -257096, -20514, -34775, -248364, -386070, -363371, -353334, -338331, -118798, 114052, 108778, -69663, -155640, -155877, -97875, -41559, -26668, -57993, -111086, -90920, -62824, -201923, -207371, -248607, -108873, 59088, 25039, 29899, 102280, 130965, 126698, 130336, -49081, -144485, -114463, 36522, 75575, 38446, 67617, 1280, -35587, -15287, 75717, 45133, -134955, -208056, -397884, -179802, -109590, -127626, -300108, -422216, -387371, -400724, -322368, -200165, -317699]
23757c17699o8880J73092R3164O9968K0431K2948o2434M5139P4768r8545Q1352
23746C3304R5863o9505P839j17375k3566J6598m9179j29546J1033L4015N6404
23735a34115K1115k7556O8671J21002j1571K180Q8204P8986q368j93744K9126
23724C3930J7149k8981M2874j6512r9243j3541Q1168K01313J39202k90325j3378
23713E3656L8699j4425k1764n0402j34321K0111k9003J60J47133J6480l26512
23702c00188j55172J31543K00255r209j65713j29440J06784K8117J67646M452
23692a20925m9956K5345j7839J2359J62212J11995R5654l3472j36754Q674j511
23681E5782J43915p5472r6167j16903N7909J21004j2423k60657n3088J02988k3019
$$ y = [-317699, -386579, -213487, -120323, -50355, -29924, -6976, -69410, -24271, 50497, -48048, 33304, 129167, 59662, 67501, -49874, -73440, -56842, -106021, -235567, -224534, -190519, -134115, -113000, -140556, -71885, 49117, 37546, 39726, 127930, 206916, 198548, 4804, 33930, 51079, 22098, 64972, 48460, -50783, -64324, 16844, 218157, 357359, 67034, 53656, 92355, 77930, 56166, 5764, -128557, -108446, -137449, -137289, 9844, 26324, -300188, -455360, -323817, -123562, -132771, -298484, -427924, -321140, -293023, -125377, -120925, -170881, -145536, -163375, -151016, 11196, 123191, 218845, 185373, 48619, 57293, 55782, 199697, 124225, 28058, -88845, -30936, 90068, 77645, -183012, -236100, -133112, -156131]
23670a56131L6106J26773l6131k9600k2933K610n0002j04297J38670J31647J14
23659C6826n8287M561L1827j39176j90426L283r6185J5041J67806J49460K9345
23648d5925j5277j9416o8188J41967j22767m7463J90162J62425j1312j58361r0574
23637h4729J3275o846l7666q6343J0966J03804L7742K91308J45457q8671j29806
23626A68491j68080N5727O9466M5265J47584j2658p8159l2125l3471j4585r1550
23615E5905k3838n3664O3984K61718M0620j55629p2982m7413j16481L2151k4745
23604d0374j94250j74353n5851K38410K11691o5966l7535j23204j31638r7112
23594d70182O1936J76743K06802O4331P2106q468L4601j51950l9798L8950N1109
$$ y = [-156131, -120025, 6748, -29383, -58983, -81916, -79306, -129308, -233605, -94935, 36712, 36826, -21461, -16900, 14927, -124249, -314675, -311392, -407577, -392536, -224730, -75270, -45925, -61202, -80618, -148806, -6839, -129606, -177069, 13093, 175518, 164206, 5845, -84729, -71454, -78300, -115966, -202309, -191343, -87539, -49797, 241511, 386968, 298297, 168491, 411, 56138, 125604, 170869, 318453, 305795, 227636, 195511, 162040, 147455, 55905, 32067, -21597, 42387, 304105, 344725, 189096, 116114, 68701, -47780, -15629, -40374, -234624, -408977, -464828, -226418, -14727, -80693, -118228, -241432, -373070, -470182, -408246, -231503, -24701, 39630, 111736, 103268, 137869, -14081, -53879, -14929, 36180]
23583C6180J23296P1357j81438K7894K5168O6305O1550n6101N0757j85308P093
23572D6753N8j55036p8106j41790k2038K06349J65735n5989j47773j44761j94982
23561e21580J37121J45075J04743r1261K8896J14579N3793M9704k3614J3493L259
23550A4208j83740j89923J01566J45310q1796Q6165m6997J36424K992o6097q0016
23539a61904M7381J17854R8644O8762J4768p7809n8472P0905O04o6291n075j21503
23527g2136o3714J30193J26063j26789K2197j18070k3102J01288l104p9349J876
23516a04647J38114j20734K8502p4800K1697L8357J67178J26083j91615l26477
23506b98342m9809O8987M1009M0224K8144R3494K9848M9094P5725K7290M7632
$$ y = [36180, 159476, 230833, 49395, 77289, 102457, 168762, 230312, 174211, 224968, 39660, 46753, 46811, -108225, -186331, -328121, -350159, -143810, 21925, -34064, -181837, -326598, -521580, -384459, -239384, -134641, -225902, -197006, -82427, -28634, 21070, -2544, 10949, 14208, -169532, -359455, -257889, -112579, -194375, -108210, -155207, -18783, -15791, -81888, -161904, -114523, 3331, 101975, 170737, 185505, 107696, 49224, 120129, 120733, 54442, 49367, -72136, -135850, -5657, 120406, -6383, 15814, -102256, -125358, -24070, -27174, -106523, -104647, 33467, -87267, -58765, -133565, -111868, -73511, 93667, 219750, 28135, -298342, -348151, -279164, -238155, -197931, -169787, -76293, -46445, 2649, 78374, 105664, 153296]
23495A53296k30982j2286O9140K06759r8044j18249N6420j32748R5375M390n7508
23484f4437L7550p3114j75378L4135J0656N3652R0000J76710J955j23181r0616
23473a22068M7407J05928R6436j29538n9458r6293j25686q4059J4394K17588K5888
23462a09461O2189n1j58241j00693j8343J63682qj43446J84895O9480r2413O82
23450a41728o3615l5054n57L9727J34863N7212O7204n6263m2084Q676n2130J10837
23438B7088O9444o4099q4699n9038M0621M7295r2343N5009k7929j20558r8777
23427c07986J42921J58658j07147k03928k917P4065r398J52416J94110M5382k81813
23416a45637k54627J64910L6445K50904K10344L3777j45311j73822j4949L6980
$$ y = [153296, -77686, -89972, -20832, 185927, 87883, -30366, 26054, -106694, -11319, -6929, -64437, -26887, -100001, -275379, -241244, -230588, -176936, -86936, 89774, 91729, -31452, -122068, -74661, 31267, 127703, -1835, -61293, -157586, -283272, -367331, -352937, -135349, -109461, -47272, -47323, -205564, -306257, -324600, -160918, -160926, -304372, -119477, -49997, -142410, -141728, -205343, -240397, -240954, -201227, -66364, -9152, 58052, 1789, -40295, -31619, -83749, 27088, 96532, 32433, -52266, -111304, -70683, -23388, -115731, -60722, -88651, -209209, -307986, -165065, -6407, -113554, -317482, -320399, -246334, -255732, -103316, 90794, 136176, -145637, -400264, -235354, -198909, 51995, 262339, 296116, 150805, -23017, -37966, -986]
23406i86R5825k1385j0018j33847n0865l191j74686k0758K19119J27662o3185
23395c6315k328M250r1421o6451J5059j36066j40584j46568K25709J18553N2002
23384b04160M6975Q4204Q6274P3021J736p6367j5227p9876o1630J09763J49261
23373A13974o5211r6971J16164k6059r0229m4596N0589O1910O8123q3000q5224
23362h0530q735J05192k8585J2539j0369o2716P5577l6202M75L4942o6824p6533
23350a41769J67785L9308r6399k11722M0734R3708k4984L0057J22776k3745m8477
23339e2728o4115k06733n0159J40955O2731K15984p7419p8830K8075q5440J1906
23328a55773p8264j24015l1760q3302k7817K78648J36152Q852K0494L4680L8567
$$ y = [-986, 94839, 73454, 63436, -70411, -121276, -124467, -299153, -319911, -100792, 26870, -36315, -38643, -34393, -125814, -192265, -177206, -313272, -453856, -600424, -374715, -256162, -204160, -157185, -72981, 13293, 86314, 88050, 11683, -3544, -83420, -145050, -35287, 113974, 48763, -48208, 67956, 41897, -48332, -92928, -42339, 19571, 87694, 4694, -80530, -89265, 15927, -12658, -119, -10488, -73204, 2373, -33829, -33354, 1588, -65236, -141769, 26016, 65324, -31075, -242797, -202063, -108355, -133339, -103282, 19494, -4251, -52728, -116843, -323576, -373735, -232780, -170049, 45935, -31484, -110314, -82239, -167679, -155773, -234037, -358052, -389812, -473114, -500931, -222283, -86131, -77279, -56785, -22105, 16462]
23317A6462m8683k3138J6100J66369o9061j06372L218K3937l26856K3164J69178
23306a55682p7066Q9435M7586n0229J51658k9426J088N4834j22179j45477L1494
23295b03964J06427p5834J3834M8437K3679j25318j35493j39548o937K60558J89565
23284d4594Q0621r3967K5380J5552Q3585o2826k6408j46722L1858J51837J10352
23273A24668M5401L4228k00097m2000J34658P305j50963j93112j6230J47148r917
23262a18911l1822l8052N0200J78093k6712j08476p4670N6765J17811L7194n2823
23251a1403K816l5119j1387o4220j11507J3400r9824n2662J07319O6364J23206
23240g3017Q1962r0164j22430l8403K3103K17306M756r9169j40909M0007O2264
$$ y = [16462, -32221, -55359, -39259, 127110, 58049, -48323, -45105, -21168, -348024, -324860, -155682, -232748, -143313, -95727, -145956, 5702, -23724, -22636, 32198, -89981, -235458, -203964, -97537, -173371, -159537, -111100, -87421, -212739, -348232, -487780, -494717, -234159, -44594, 36027, -57940, -32560, -17008, 66577, 3751, -22657, -169379, -137521, 14316, 124668, 170069, 204297, 4200, -37800, 96858, 104163, -46800, -239912, -256142, -108994, -118911, -150733, -188785, -138585, 39508, 12796, -95680, -170350, -113585, 4226, 41420, -11403, -8587, -43706, -55093, -119313, -230820, -217420, -317244, -369906, -262587, -196223, -73017, 8945, -81219, -203649, -242052, -218949, -1643, 3113, -96056, -236965, -196958, -134694]
23229a34694L7706J32898N8509K277k43288k4091p1259q3782J88545N4959n3065
23218a35285m0200j23527O875M8261J09531M6503N9811J08183O5366l030k7166
23207A15322J97863j48001j42178M104L9126K9947N412M6018o3465j07780j1000
23196c4632O1422k8526J0200k4756M8019o364K595j43076p692R5970Q6379j20707
23184f1168j9641K0037J29201k2993o408P764j07633L8671J41506N212N2140q720
23172A67968j28336j8005J21111m0214q3212n0043l0715L3095n4554j70165k8476
23161b81546R6618o848J67790n0649j41063R2376L5722J07300J9595n5324m7446
23150f3475J55163J10487n1823N2346K0362r6863M1890M5458R586j42687j29062
$$ y = [-134694, -96988, 35910, 94419, 96696, -146592, -170683, -241942, -325724, -137179, -82220, -135285, -175485, -299012, -292137, -243876, -134345, -87842, -28031, 80152, 145518, 142488, 115322, 313185, 165184, 23006, 27110, 66236, 96183, 101595, 147613, 84148, -23632, -34632, 26790, -1736, 8464, -16292, 31727, 25363, 27958, -115118, -122810, -26840, 59539, -61168, -80809, -60772, 68429, 45436, 39028, 46792, -60841, -22170, 119336, 124548, 176688, 167968, 39632, 21627, 142738, 102524, 19312, -30731, -61446, -28351, -82905, -253070, -281546, -184928, -191776, -23986, -74635, -215698, -123322, -87600, 19700, 39295, -16029, -63475, 91688, 202175, 150352, 202698, 223060, 126197, 168087, 213545, 223131, 80444, -48618]
23139d8618n337j0430q5839J0717J13937Q3232Q6753L9744L5233J3483n9763j29379
23127D3733j36776m9754q9823J1432M727k6920k1873J61129K03826j58962r9439
23116a58700M7342m9181J1482j4952o472P6355k2983N1970J25059K12904o819
23105B66005k3555L2797j76714j27032j23053p2076k3737M9365Q3461O8561R6705
23094E0727k9635j9549J17851j6460j83715n6493N4233K8720o7854n6334J46959
23083c1550M2204J09137J24569n824j77281j66237P1722O917j16399J08809J20450
23072H6517j20640p4223l4529n6308J22450n6661N2515J09728j31899j04867J06501
23061a01416o1863O1256N9280O2146P5273O231J40948K2919r2775p2303j15919
$$ y = [-48618, -53955, -64385, -150224, -139507, -25570, 57662, 144415, 184159, 219392, 232875, 173112, 43733, -93043, -142797, -232620, -221188, -216461, -243381, -265254, -104125, 99701, -59261, -158700, -111358, -160539, -149057, -164009, -170481, -94126, -117109, -65139, 59920, 272824, 266005, 242450, 275247, 98533, -28499, -151552, -223628, -247365, -198000, -114539, -45978, 50727, 21092, 1543, 119394, 102934, -80781, -137274, -83041, -54321, -122175, -178509, -31550, 10654, 119791, 244360, 238536, 61255, -104982, -33260, -26343, -142742, -33933, 86517, -34123, -108346, -142875, -199183, -76733, -133394, -80879, 28849, -103050, -207917, -101416, -163279, -102023, -42743, 19403, 94676, 100907, 241855, 264774, 171999, 99696, -16223]
23050a6223j63749L8328P4735P0317O2629k9852k21162L1917J12753n7636k2722
23039a20665P5022M9670l6245N5318j6547K5742J67979l6819q4707m6475m5541
23028a3268j8178M2845Q7424j00792r2053o2658p6002p612J62474l3277n6251
23017a67348j02951J38488J82765N5621J08706J9440k0560q5415p5603o0799q63
23006h519N1853q9449P7773p6232k9121q5513j0759J0107l8350R2524L2251J11941
22994C8506j95056k20391J9623R4231P2847j62480J21322K34173J60062R492j00501
22983G1828Q8008J10252L6436L8743Q2348m9827m1953q7528j68058r7397j53106
22972a70254j24464k240J76053J98431L0301j07879r702J9405O8751J00262n4715
$$ y = [-16223, -179972, -141644, -66909, 3408, 66037, 36185, -184977, -153060, -40307, -97943, -120665, -45643, 4027, -32218, 23100, 6553, 32295, 200274, 163455, 78748, 32273, -13268, -31446, 11399, 98823, -1969, -94022, -156680, -232682, -240294, -77820, -111097, -167348, -270299, -131811, 50954, 106575, 215281, 234721, 214161, 128746, 53143, -7656, -8519, 43334, -46115, 31658, -44574, -73695, -159208, -169967, -159860, -198210, -105686, -73435, 38506, -156550, -376941, -357318, -263087, -190240, -352720, -231398, 2775, 162837, 172329, 71828, 159836, 270088, 306524, 345267, 427615, 377788, 335835, 248307, 80249, -17148, -170254, -294718, -296958, -120905, 77526, 107827, -52, -9754, 9651, 78402, 178664, 123949]
22961A23949j02214k0716P9310O0887l6583R808k7397o8837K2805J9669l2693
22950B7988j06123r3309q4749J72689M7267J00935o0250j4044P7830j79888l7283
22939a48937j08217m8123M0679K15112N152K9363O5953p423J04558J16356n8153
22928B06320j85608P881P6348J54956K0010j11628o7956K1601P4646L1989k53752
22917b5193p740J6667M6614K2791j10234J1818j61727q081O7287J43572m751j99074
22905b08051n6308N4710J40874N6241q6452q3128J55090K10756p953j73842j39334
22894a37397R0081J20737k5585M0169j7459L6390J08050J25751j38067j35039
22884F7631j16996j8399j5817M8874J17511N4850J5146j25795j61028j2888o7934
$$ y = [123949, 21735, 1019, 80329, 141216, 104633, 114441, 87044, 18207, 41012, 60681, 27988, -78135, -171444, -256193, -83504, -36237, 64698, 4448, -9596, 68234, -111654, -148937, -257154, -305277, -264598, -49486, -44334, -14971, 50982, 43559, 148117, 264473, 206320, 20712, 28593, 104941, 259897, 279907, 168279, 100323, 121924, 196570, 228559, -25193, -32933, -16266, 30348, 53139, -57095, -45277, -207004, -215085, -147798, -4226, -8977, -208051, -264359, -209649, -68775, -12534, -98986, -182114, -27024, 183732, 175779, 1937, -137397, -47316, 73421, 47836, 88005, 70546, 106936, 214986, 340737, 202670, 67631, -49365, -67764, -83581, -34707, 82804, 137654, 152800, 27005, -134023, -146911, -214845]
22873b14845N6225P0097j26965m7887O6291l5777N6053R658l754N7792K9396J47116
22861F3400R7891L04K7502K4471j17768p8625j04052j20574L4859n9161n2745
22850b84498j12377o7599K00574J07670J9946K09407P8461j37076j14927J50711
22840E0292N9839p818q0631o3283p5014J71798j24141j97088J3390K5690J9883
22829b07083j50857J11983J43931L0758P8025N3619K0585n1239J34183J32419
22819B96324p7640o0096M8184j43540j38403k50454J49043P6021L1655m2360j00646
22808b11912J05046J45235o774p9115k37236M2631K00573Q242j7128p2222j15673
22797b38333o2737K30736O3341o2357J97745P4486j8483j0075j92931l4806N8062
$$ y = [-214845, -158620, -88523, -215488, -263375, -197084, -232861, -176808, -167150, -170904, -113112, -83716, 63400, 161291, 161595, 189097, 213568, 95800, 17175, -86877, -207451, -172592, -231753, -284498, -396875, -464474, -263900, -156230, -136284, 73123, 151584, 14508, -100419, 50292, 110131, 102313, 21682, -41601, -116615, 55183, -68958, -266046, -252656, -226966, -207083, -357940, -245957, -102026, -71268, 6757, 60376, 80961, 29722, 163905, 296324, 218684, 158588, 206772, 63232, -75171, -325625, -176582, -100561, -68906, -111266, -211912, -106866, 38369, 31595, -47520, -284756, -242125, -41552, -33310, -50438, -122660, -238333, -301070, -70334, -6993, -69350, 128395, 202881, 184398, 174323, -18608, -53414, 4648]
22786D648n8697k46J55318J03310j08076l0186Q6461J73889j89250j29787j97527
22775a90143K4410N0736M7688k6926q4763j00103K35153O5611N2931q9921J35740
22764A20413l0113r9910L0853J62016l4737k23983m338r2689r6440N0556R0354
22753a28018R2363Q5755J36536J8265l4564j18652k3656M8513m6548m127q3862
22742e7995k19994L4365N5215J29226L4444p8010M1595L7610k9611O9295k36616
22731b20476P7530L5389J00050L1470K951j25472o9059K9863j7024J39270K17741
22720B02233J3541q6435o7641O2958M5327o8816j86704j53392K059q8856j0215
22709c35941p4159L91P7414K61660J12410m4284k51445k0754O7921J98422P1003
$$ y = [4648, -54049, -54295, 101023, 204333, 96257, 66071, 152532, 326421, 137171, 7384, -190143, -165733, -114997, -67309, -94235, -178998, -279101, -43948, 21663, 74594, -15327, 120413, 90300, -9610, 21243, 183259, 148522, -75461, -79799, -172488, -268928, -218372, -128018, -35655, 50100, 186636, 204901, 170337, 51685, 28029, 76542, 29994, 25867, -57995, -277989, -243624, -188409, -59183, -24739, -102749, -61154, -23544, -53155, 16140, -220476, -142946, -107557, -7507, 23963, 26914, -98558, -167617, -137754, -154778, -15508, 202233, 215774, 129339, 61698, 124656, 169983, 101167, -85537, -238929, -236870, -325726, -335941, -410100, -409709, -332295, -70635, 41775, -2509, -253954, -274708, -206787, -8365, 62638]
22698F2638p7044p7127j56338O8466J63930j96632J07087J66388K9649k9569p7119
22687a5671j85772n6264J17440R1892j20621j27123K7772P8939Q0540j57096m8411
22676c14375j5864K3357J88005j8136m3093o1391J08247J50774N5985K2792j26800
22665c0499r648Q1944r221l3906j06377Q9497J71076o2783j59447M7454j6624
22654c8534o120p6014m1577j8817l071k425j2650r2835j22797m8135Q6720J86775
22642a89480P1690l6766q9013O880R3156J36249L4334j44521j56107Q0606J9331
22631a73641l9618Q1617o771R5152l5055N0429L6010L1040j0660m2008J9155N2828
22619E8478j8138L4746p4570K2199r8858j40858j58124o4390J59440J57804N7617
$$ y = [62638, -14406, -91533, -247871, -179405, -15475, -212107, -105020, 61368, 91017, 61448, -15671, -201443, -257707, -140267, -48375, -168996, -296119, -268347, -189408, -108868, -265964, -314375, -330239, -306882, -118877, -137013, -180106, -241497, -133250, 17524, 73509, 96301, -30499, -40147, 41797, 32576, -1330, -107707, -18210, 152866, 90083, -69364, -21910, -38534, -44654, -120668, -162245, -181062, -184133, -186558, -199208, -292043, -414840, -462975, -376255, -189480, -117790, -154556, -243569, -236689, -143533, -7284, 27050, -117471, -273578, -192972, -173641, -213259, -131642, -138413, -43261, -78316, -27887, 8123, 39163, 28503, -13505, 5650, 58478, 40340, 75086, 516, 22715, -76143, -217001, -375125, -439515, -280075, -122271, -64654]
22608f4654L6615L5139p3253k5182J14522M3652N537j4042j23938q2617p3696
22597b21917L7278P9524J40508N9940k15797j34988J29481L2698k25763o2802
22587c81838M3585K74113O4116j60421J0426K4889K2045j45727O5008J73014p1467
22576h2257l9966P6555j02252o1832r1734q1779K2041J62929Q454J1731O6075
22565a12035j12434k974K23574l1451j98941O4909p2093l3684P1002k752R4742
22554a12137P2928j21377l356J69977k1759j38111J4608o5418l17M5333j10647
22543b70276m5542R1485K8092O497K15586J09057r3327o9981k3918P779j4423
22532e8971J39161J19797J46183j33689j38069M5622l3689Q101K0220j08550M310
$$ y = [-64654, -28039, 7100, -66153, -91335, 23187, 66839, 72376, 58334, -65604, -148221, -221917, -184639, -105115, 35393, 95333, -120464, -255452, -125971, -93273, -319036, -381838, -338253, -64140, -24, -160445, -150019, -125130, -103085, -248812, -183804, -10790, -82257, -122223, -45668, -147920, -209752, -301486, -383265, -361224, -198295, -189841, -178110, -112035, -224469, -227443, -3869, -35320, -234261, -169352, -241445, -275129, -204127, -206879, -112137, -39209, -160586, -163942, 6035, -15724, -153835, -139227, -204645, -204962, -159629, -270276, -315818, -224333, -196241, -189744, 25842, 134899, 41572, -28409, -52327, -44548, -58971, 80190, 199987, 346170, 212481, 74412, 120034, 86345, 94446, 114666, 6116, 10426]
22521A0426N7575j05335j34801j68079m0274j00087O331Q4780p160J41798O3298
22510a91528j67581m8615J58360K23915K49579J04378p3885k90181o1515J6750
22500h0323n2650R213n1225J67830J6202j26776J78873P8207m3516k51086O2495
22489i2756K08083m0507j83152K5832k7000l7760n8369m3778P2286l5141q0953
22478b93215j44098L6278K01047J92152L3698O6577L4612j00525j54676j4841
22468a42991P2532q3244O424J04852j90033j12004J49056P0448n8657l3583J72894
22457d4306Q4596r0623Q5692K22154k52958J8386K09843k5032k09325n468n2156
22446e9197l673j09649j13525Q5964j4618j1800J07090J67710j9618o996n1401
$$ y = [10426, 68001, -37334, -172135, -340214, -380488, -480575, -474244, -389464, -396624, -254826, -191528, -359109, -407724, -249364, -25449, 224130, 328508, 254623, -35558, -97073, -80323, -132973, -123760, -174985, -7155, 9047, -117729, 61144, 139351, 95835, -155251, -92756, 115327, 74820, -108332, -82500, -109500, -147260, -205629, -249407, -177121, -212262, -293215, -437313, -401035, -199988, -7836, 25862, 92439, 127051, 26526, -128150, -142991, -70459, -153703, -147279, -42427, -232460, -344464, -195408, -124960, -183617, -217200, -44306, 40290, -50333, 35359, 257513, 4555, 22941, 232784, 207752, -1573, -7041, -59197, -62870, -172519, -286044, -200080, -214698, -226498, -119408, 48302, 28684, 21688, -29713]
22435b9713M9751J3548j16723l2654l9598O6693J3108j226M0414m9840o7599Q1846
22423g1993L4396m7894j76109l9267K9630J09485R6158j44182J38483K04930K8410
22412A62047j88933m8182j07728n2468J4906N854O5412j60750l0058J62890K15851
22401C8841M0835Q5057j13802q3610L7501r8357o9933K4872L8722J20605M4818
22390F5549O940J13381K8497l6557k19148r1247p3599R2092J03407n4813k3739
22379h9237p072q1091P6923k10752j16717K7351J65166K39623J63960n4425k6042
22368H7687n562p6481J40581M2641J135m777k7307j86409m959J9183m6638P5533
22356A4627J3435J404M2990J08559j58210j12085j4308n0231r3234p6332L4055
$$ y = [-29713, 20038, 33586, -83137, -115791, -155389, -88696, -75588, -76814, -36400, -86240, -153839, -71993, -37597, -85491, -261600, -300867, -271237, -161752, -65594, -209776, -71293, 133637, 162047, -26886, -75068, -182796, -235264, -220358, -214504, -149092, -309842, -339900, -177010, 38841, 79676, 164733, 50931, -32679, 4822, -93535, -163468, -138596, -99874, 20731, 65549, 72489, 185870, 214367, 177810, -41338, -132585, -206184, -114092, -10685, -65498, -89237, -96309, -177400, -100477, -311229, -427946, -400595, -235429, 4194, 168154, 113729, 87687, 82125, 5644, 146225, 188866, 190001, 185224, 157917, -28492, -33451, -14268, -60906, 14627, 28062, 29466, 72456, 181015, 22805, -89280, -103588, -153819, -247053, -323385, -289330]
22345b89330j17346m9237P1473O5111J12229P9846n8165P179j0797n1489M4725
22334a95801R3222J1889n5404J20593J72672K1563q6427j01223o9207L897J74618
22323I0392j41676n6433Q6190J628k1847O1947P5903J79772M7268j45562p3470
22312A04112J5327l5155j25686j01282j54284N0189J3395P2258J31035L8042j10596
22301a02645N3173P7952l124l3779J4951l6543L0555P4445j65738j45518n7773
22290b94044l0135N2877N6412N9761k3562j02267p5683j9991J37300P0819P040
22279a61473M4398O3868N7024o3868J07674J19161N1451j31905n7308q734o8971
22268d8683J6283r1381N6641M3900J08331j05789j25968J70622j44n3429j31012
$$ y = [-289330, -406676, -455913, -384440, -319329, -207100, -127254, -185419, -178240, -189037, -240526, -195801, -102579, -90690, -146094, -25501, 147171, 168734, 82307, -18916, -88123, -84226, 90392, -51284, -107717, -21527, -19899, -41746, 20201, 96104, 275876, 323144, 177582, 104112, 119439, 84284, -41402, -142684, -296968, -246779, -233384, -161126, -30091, 7951, -102645, -49472, 28480, 25356, -8423, 6528, -30015, 540, 74985, -90753, -236271, -294044, -324179, -271302, -214890, -155129, -178691, -280958, -356641, -376632, -239332, -168513, -161473, -117075, -53207, 3817, -60051, 47623, 166784, 218235, 86330, 29022, 20288, -48683, -32400, -123781, -67140, -23240, 85091, -20698, -146666, 23956, 23812, -29617, -160629]
22257a60629M8508J67283l5932L8426k4216O912j94629k06854J92741P6653N9688
22246c2049R3334K685n9540O88j0541j40678J47893P764J01966M5214j15794k65830
22234b24888k07469l3949K13806Q3164P9023J62058j4137J58371K5283j22275
22224A18987j49363p9499m452L4994K8772J07195P5436j10574P0234K01762M7897
22213C41389k25423o5766L3667j47848n5545M86k5234J13242J6700L4210p1270
22202e1392k4786J35043R9681j48448m2091Q0523r2582k681J86428J20407q6175
22191A73927j08051r1986j27253m1402R9684M7637L2273N978l6213m7053N3042
22180c9417p5727j34102J47318R2316o1227R9842j24892m246J0929R3304J14523
$$ y = [-160629, -112121, 55162, 19230, 57656, 33440, 40352, -154277, -361131, -168390, -91737, -32049, 61285, 63970, 4430, 5118, -5423, -146101, 1792, 9556, 111522, 156736, 40942, -224888, -432357, -466306, -252500, -169336, -90313, 71745, 57608, 215979, 241262, 118987, -30376, -109875, -114327, -79333, -50561, 56634, 132070, 21496, 91730, 293492, 341389, 115966, 50200, 83867, -63981, -119526, -119040, -144274, -31032, -14332, 19878, -51392, -76178, 58865, 158546, 10098, -31993, 48530, -44052, -46733, 139695, 260102, 173927, 65876, -26110, -153363, -194765, -95081, -47444, -15171, -9193, -45406, -92459, -39417, -115144, -249246, -101928, -9612, -70839, 29003, -95889, -100135, -89206, 4098, 118621]
22169A18621J13286N9841j66679j69943L9792J55673n8770j38411j85190P1452
22159a60328L3888L3952j15471P9193J99920L8397j08330n9416M5238j8607j4341
22148d5905m1227j11031l457L7114j3430m1306J48693N2897n4777K7506k09774
22137b54697K8717n7940r6046J02578J81025R6763n4690j59473P6474K9266P2283
22126c5740J19846P985J22698L7942j30601n0249j1542J79188J05605J09422q9591
22115C64963L4750J96394J18071K40367L96317K45302K73384L85981L69569J79000
22105B804098K08781n8170m04518n03893m65271l80869k12763n8287l8044k05342
22095F85722k8886j3369N6555j07605k06903r2899j67976K568j79k92865n6713
$$ y = [118621, 231907, 291748, 125069, -44874, -5082, 150591, 91821, -46590, -231780, -160328, -126440, -92488, -207959, -128766, 71154, 109551, 1221, -58195, -12957, -31564, -45905, -87132, -198163, -201620, -164506, -177936, -219242, -70549, -17652, -72429, -44923, -254697, -225980, -283920, -379966, -277388, -96363, 400, -54290, -213763, -137289, -108023, -35740, 84106, 92091, 214789, 252731, 122130, 71881, 60339, 239527, 345132, 454554, 364963, 399713, 596107, 714178, 954545, 1350862, 1596164, 1869548, 2255529, 2625098, 2804098, 3012879, 2954709, 2550191, 2046298, 1581027, 1200158, 987395, 929108, 891064, 685722, 656836, 643467, 700022, 592417, 385514, 292615, 124639, 127207, 127028, -165837, -222550]
22084b22550O9039J48313K79223M9371j70684l4506j12733O333N4309M9962j5961
22073A00116N0042r2606j51945l5948O2274L85Q2083J03607r5188K9217J4728
22062F6765p6885J25152J79082r0910O9287J8222j73786n099J0116O5330k42j6898
22050A70134q9785p4857k23837p8242M9884L1168J99216J04327j24736q0680P3540
22039d3868J39610r8775o0168K0477N2243k10709j05906M1122K840O0867K03018
22028G51K5631J35543J12873l8064o5005k1856N6132k6700l09546k9692K21689
22017F1756P0446j4825j23376j93193K3412M0494Q2666J19053k26230j80475J3752
22006c26520K19618J05435j17151n1809O982O4188l2543r3865k47546J04720K89272
$$ y = [-222550, -153511, -5198, 274025, 323396, 152712, 118206, 5473, 11806, 66115, 116077, 100116, 150158, 57552, -94393, -130341, -68067, -67682, 14401, 118008, 22820, 52037, 66765, -10120, 115032, 294114, 203204, 272491, 290713, 116927, 111828, 121944, 187274, 187032, 170134, 80349, 5492, -218345, -296587, -246703, -215535, -16319, 88008, -36728, -117408, -43868, 95742, -3033, -63201, -42724, 9519, -201190, -307096, -265974, -263134, -202267, 751, 26382, 161925, 274798, 236734, 171729, 149873, 206005, 179305, -130241, -159933, 61756, 132202, 117377, -5999, -199192, -175780, -135286, -52620, 66433, -159797, -340272, -326520, -106902, -1467, -118618, -170427, -163445, -99257, -131800, -225665, -473211, -368491, -79219]
21995g9219J53993q2421q7860m7146M1239l7012l8273J25235j1351k3554J255
21984h5114n1828J21570m8913j03837K04326J655r1552k38o3763J60989P3533
21973A16828j77078M2517M5789j72124J9306J39884q782p7712Q7961R6273J59640
21962B72502J20895o2554j0311j22752p1114q5442n9529n7075R6309r99k17893
21951a97963k6684J01115K34823J48264j43052l6563q0709K3005n7365m7660J35421
21940E2632L7259R8052j11759k21000L8432J44046P2067m6546O0181N3688j19113
21929E7939q2854P8828J06529J91587J66836O4637j93104k29888r4988o135l6869
21918B2518n7687Q3921j93310q2700L3823L25002q706k13853J28874N1421j89504
$$ y = [-79219, 74774, -7647, -95507, -142653, -101414, -138426, -176699, -51464, -62815, -86369, -85114, -136942, -15372, -64285, -168122, 36204, 37859, -53693, -53931, -117694, 43295, 116828, -60250, -17733, 28056, -144068, -124762, 15122, 6340, -71372, 16589, 112862, 272502, 393397, 330843, 320532, 197780, 126666, 41224, -18305, -75380, 20929, 19930, -197963, -224647, -123532, 111291, 259555, 116503, 79940, -769, 22236, -35129, -82789, 52632, 89891, 187943, 76184, -144816, -106384, 37662, 109729, 63183, 123364, 177052, 57939, -24915, 53913, 160442, 352029, 518865, 583502, 390398, 160510, 65522, 59387, 22518, -35169, 48752, -144558, -227258, -193435, 131567, 122861, -90992, 37882, 89303, -100201]
21907a00201q2917J51048k2467k1260P3256M0599N9548o6877l44311P3764O5668
21896a74150N1494R6052M4211l9903L3578J16683j19093n626J50275O9538k689
21885B20370n3709o9172k8655L0827r7044q2797P0006j0022K3141O394L3920J63521
21873B06780P2686j62919P295r0373n5180k3775m3691n093k07831j46297J20261
21862c28137P5329k2078M6447Q6253M4895M3955K03774P6886M7460m3206j42238
21851H9340o8255r427n3050l9783o3568R9361J23540p9065j38955J18189J431
21840b0242n3180M0091l9092n1316M4694J26858j4276M0822J07096L281K02114
21829C86850J26378k36522j24488o2559J1574L8274k5635J1021l259K6125L2185
$$ y = [-100201, -183118, -32070, -54537, -75797, -2541, 38058, 97606, 30729, -313582, -239818, -174150, -122656, -26604, 17607, -22296, 11282, 127965, 8872, 3246, 153521, 223059, 220370, 166661, 97489, 68834, 99661, 2617, -80180, -10174, -20196, 2945, 9339, 43259, 206780, 279466, 116547, 123842, 33469, -21711, -45486, -89177, -94270, -302101, -448398, -328137, -252808, -274886, -228439, -142186, -97291, -53336, 150438, 227324, 274784, 231578, 89340, 21085, 11658, -41392, -81175, -144743, -45382, 78158, -907, -139862, -21673, -20242, -73422, -33331, -72423, -123739, -79045, 47813, 33537, 74359, 181455, 184736, 386850, 513228, 276706, 152218, 89659, 101233, 139507, 113872, 124893, 121634, 147759, 179944]
21818A79944K06167j133r9173R6281L0580p8988l7344j7328J65255M086K9027
21807D77374N3500p6396q7396K3930Q2777j6586k09403q4189P0894P3617M6085
21796C54207j18231p511l6893L7836Q4823N1042O8723q2079j90941l5750J1082
21785A36308j72958R2821J42360J06462M7973k70668n6381l8455N1731n020o1896
21774b7723K1742K15232J7361l9009k1439M2898p6405J64722J34928n7694j19764
21763B54849j54773j04547L6496J98279J37211J34999l8844o1353o0433q6308
21753B55576r8870J98563Q095j50385n7345j44585J4861R1198l300k1597l007
21742H9204o685J8549K9245p9818k6679J15349n210l858j37321J3656P3885R7069
$$ y = [179944, 386111, 384978, 285805, 382086, 412666, 333678, 296334, 279006, 444261, 448347, 477374, 530874, 454478, 367082, 391012, 473789, 457203, 247800, 163611, 234505, 308122, 354207, 235976, 228465, 191572, 229408, 314231, 365273, 433996, 351917, 160976, 125226, 136308, -36650, 56171, 198531, 304993, 352966, 82298, 25917, -12538, 39193, 34173, -27723, -5981, 209251, 226612, 187603, 166164, 209062, 132657, 297379, 432307, 374613, 254849, 100076, -4471, 32025, 230304, 367515, 502514, 463670, 402317, 341884, 255576, 156706, 355269, 363364, 212979, 155634, 11049, 25910, 117108, 113808, 92211, 89204, 82519, 101068, 130313, 50495, 23816, 139165, 133955, 130097, -7224, 6432, 80317, 177386]
21730A77386N4538l676j97144j5548R6529M9753Q6189j31627p4233r6547J08552
21719E4172J16054Q1717m7083J7608J52239o5757k5329l4099o6468R7010K1596
21708C01660j63724l7873R2462J40231R0685j031o2985n296q5368j91450j64087
21697h6776q7J8179R3384K5976J53259K62056m5319l6911N4463R3440K1856J04544
21685F58064K5589M9553N1898O3581K00641R9270j56045j45583r5438j02060o5314
21674E84156j69146o114j5035m5388j02151J7427J5827Q26J17639M4520M6304
21663D88865m9750R2812l6297J14450L02400J01625p5195R4799K67802L23565
21653A625076M12642M83628M57418N69244K89888L0186p2729k50991m71358n42555
$$ y = [177386, 231924, 228248, 31104, 15556, 112085, 161838, 248027, 116400, 42167, -54380, 54172, 170226, 251943, 204860, 222468, 374707, 308950, 283621, 249522, 183054, 280064, 301660, 137936, 100063, 192525, 332756, 423441, 422410, 359425, 354129, 268761, 77311, -86776, -86863, -68684, 24700, 50676, 203935, 465991, 420672, 383761, 438224, 531664, 553520, 658064, 683653, 733206, 785104, 848685, 1049326, 1148596, 992551, 846968, 751530, 649470, 584156, 415010, 408896, 393861, 348473, 246322, 263749, 279576, 280402, 398041, 442561, 488865, 439115, 531927, 495630, 610080, 912480, 1014105, 938910, 1033709, 1301511, 1625076, 2037718, 2521346, 2978764, 3548008, 3837896, 3868082, 3795353, 3544362, 3073004, 2530449]
21643B530449l17396m26431k73391o1241P5036J0001n5577K6345r9703j8606L7604
21632A427090J1977R2519J38781L9422k7684j6488J00455K001M7588K00479J1987
21621B028127k31444k9366P4113k722J88828J19522Q5450J49320j17714l0812
21611B233302J21451J58696J90697q7856r223J80936J9895j52056n201J34925
21601B785566J37298N4828Q2939J61627N1201n8816p5330J63442K61379J31523
21591C695657R2472R9572M2640J41678K31126K38358J75379K36585O9313J05622
21581E128402K87593M41033N09991M75080L97217L89061M65985N81431N84693
21572I260486N87737P14372Q22080R89117R86893J107373J304128J491631J849721
$$ y = [2530449, 2213053, 1786622, 1513231, 1451990, 1527026, 1537027, 1481450, 1507795, 1408092, 1389486, 1427090, 1439067, 1531586, 1670367, 1709789, 1682105, 1665617, 1766072, 1768073, 1815661, 2016140, 2028127, 1796683, 1767317, 1841430, 1838708, 2027536, 2147058, 2232508, 2381828, 2264114, 2233302, 2354753, 2513449, 2704146, 2616290, 2607067, 2788003, 2807898, 2655842, 2650641, 2785566, 2922864, 2977692, 3060631, 3222258, 3273459, 3214643, 3139313, 3302755, 3564134, 3695657, 3788129, 3887701, 3930341, 4072019, 4303145, 4541503, 4716882, 4953467, 5022780, 5128402, 5415995, 5857028, 6367019, 6842099, 7239316, 7628377, 8094362, 8675793, 9260486, 9848223, 10562595, 11384675, 12373792, 13360685, 14468058, 15772186, 17263817, 19113538]
21563A9113538K325882K762596L410856M020013M936061O060620P268352R013154
21555E8911072J1441522J4407352J8329817K3545577L0664747M0645739N3690449
21548B51636275O7693861P5831279P0437508M8794740J7160111j7718773n2403045
21541D61431956p7765580q2888860o9259109n0659930l5506716k4869336j7808916
21534A02673509j3366790j0351654q119418o390782n062980m058953l319861k870959
21526D9132112k325410j984196j673082j330862j150844r85008o42720n79080
21518C8460910m19999j43413l37109r12513j355217j403303j547081j825531j851277
21509B8665467j463534j450996j490291j236647j350961j279821j268839j211345
$$ y = [19113538, 21439420, 24202016, 27612872, 31632885, 36568946, 42629566, 49897918, 58911072, 70352594, 84759946, 103089763, 126635340, 157300087, 197945826, 251636275, 319330136, 395161415, 465598923, 514393663, 531553774, 513835001, 461431956, 383666376, 300777516, 231518407, 180858477, 145351761, 120482425, 102673509, 89306719, 78955065, 70835647, 64444865, 59381885, 55322932, 52003071, 49132112, 46806702, 44822506, 43149424, 41818562, 40667718, 39682710, 39039990, 38460910, 38040911, 37897498, 37560389, 36647876, 35292659, 33889356, 32342275, 30516744, 28665467, 27201933, 25750937, 24260646, 23023999, 21673038, 20393217, 19124378, 17913033]
21501A7913033j277337j093599p92800o56459n35526o99113o29903n35083l99074
21492A1294139m87032n83976n61736m44393l59698m00884m36734n86110m84180
21483F949396j10429k30934m09425j88488k86506m24626l55076j23413j30592
21474D689907j08573p9756l20931j89057j52797p5333j74306k26132j54930k46042
21464B962050k04119j33834j07768Q0935M5179j45303j21699J07296j59826j97722
21454B125189J4820o979p8349m1732j18384j99500K59361J81325K34292M6650
21444B416693N5532K90684M71156K05749P4466P9097P028N7394k07040n21110
21434B929649m32040k74241j53024j7220j52259l00363j61010M9753M4448K1158
$$ y = [17913033, 16635696, 15542097, 14749297, 14092838, 13557312, 12858199, 12228296, 11693213, 11294139, 10807107, 10223131, 9661395, 9217002, 8857304, 8456420, 8019686, 7433576, 6949396, 6838967, 6608033, 6198608, 6010120, 5723614, 5298988, 4943912, 4820499, 4689907, 4581334, 4501578, 4180647, 3991590, 3838793, 3763460, 3589154, 3363022, 3208092, 2962050, 2757931, 2624097, 2516329, 2597264, 2642443, 2497140, 2375441, 2482737, 2322911, 2125189, 2140009, 2133030, 2054681, 2012949, 1894565, 1695065, 1954426, 2135751, 2370043, 2416693, 2472225, 2762909, 3234065, 3439814, 3514280, 3593377, 3600405, 3657799, 3450759, 2929649, 2497609, 2223368, 2070344, 2053124, 1900865, 1600502, 1439492, 1489245, 1533693, 1554851]
21424A554851P2787L9964J12942p6027m1791J55702q0503r0590L696j52026j40316
21413A358689k9603M3365j30990k6450P3790j07474n2503q8032M20K284o2510
21402I80986l07129j56595o644j0570J17398J4651J28731N4704P7492N3917j86368
21391G60573L0353k6751j1961J47290K56280l2749k34200j57280r3917j22927
21381E14711k8901N24Q862M5031J97187O5700J86958J80556j6095k36119j40997
21370G77417O0352J76984J52286P1736j26326j11010L823m180j79334j69141Q2948
21359G35555N5507j33841p6345j32234J94466P319M3586L3351j1741o4227o2556
21348E88840P4909N2957j89938K6408O5996k4137M86j0757J25130L5065j13005
$$ y = [1554851, 1627638, 1667602, 1780544, 1704517, 1662726, 1818428, 1737925, 1647335, 1651031, 1499005, 1358689, 1329086, 1372451, 1241461, 1215011, 1288801, 1181327, 1128824, 1040792, 1041212, 1043496, 980986, 673857, 517262, 510618, 500048, 617446, 632097, 760828, 815532, 893024, 946941, 760573, 790926, 764175, 752214, 899504, 1155784, 1123035, 888835, 731555, 637638, 514711, 485810, 486334, 495196, 540227, 737414, 803114, 990072, 1170628, 1154533, 918414, 777417, 837769, 1014753, 1167039, 1238775, 1112449, 1001439, 1005262, 1001082, 821748, 652607, 735555, 791062, 657221, 580876, 448642, 643108, 650427, 694013, 727364, 715623, 651396, 588840, 663749, 716706, 526768, 553176, 619172, 595035, 595521, 584764, 709894, 744959, 631954]
21337F31954l8758j1492J1750n7602j04553j72871N8037M7834q1057K10271K79703
21326G73216k49503r3526N2541q6755L3536j15473M8719p2552J88252J01516q2693
21315D97278k18219j60447K4591P3367P4492K3204k9604J15337l5801p3603k7680
21304B62915M0530M4984P7399P7563j54088j05192Q8568N2662j9779m6077J1211
21293C30696J33658J80O1340N7501p6528N4224j21026j53606k6192J49958J51128
21282E61333j60009j53183Q31P2322o8008q39j53526j1828n5837r6225j17922
21271a82891R3835J01931J15273J22263J1166j64192r3582m2605J46881M4832
21261A52911n602j36047j29480J2849J80536K1476p7610J38749R6940k00421j83036
$$ y = [631954, 593196, 581704, 593454, 535852, 431299, 258428, 316465, 364299, 283242, 493513, 773216, 523713, 430187, 482728, 395973, 429509, 314036, 362755, 290203, 478455, 579971, 497278, 279059, 118612, 143203, 216570, 291062, 314266, 284662, 399999, 364198, 290595, 262915, 303445, 348429, 425828, 503391, 349303, 244111, 332679, 385341, 365562, 319485, 330696, 464354, 464534, 525874, 583375, 506847, 561071, 440045, 286439, 260247, 410205, 561333, 401324, 248141, 248972, 321294, 253286, 252447, 98921, 87093, 31256, -64969, -182891, -89056, 12875, 128148, 250411, 261577, 97385, 3803, -38802, 108079, 152911, 147309, 11262, -118218, -105369, 75167, 96643, 19033, 157782, 254722, 54301, -128735]
21250a28735j81873N1225K94665N5921N0855L4078j01445j27456n1745L4694j54221
21239b24037O1942J34672q0827M5876P8232J97599Q9908p8613P6742q9714j5573
21228A96207p8644m2464L3704j02286K7558J97044J25051J0223j64169k10716
21218h492J5903K60468O3028o9673K1848m1620j73001K2847K64156Q0075M1819
21207D77358j56707k27565o2149r6080J12407N8685l1523Q2835N5776j01584P6729
21196A88182r2316J8090k6024J06067j8821j01680Q7902P1813j12214n8526O2616
21185A25089k1691J33121j02123o160l8610p7443j41261j29360j28931K29614
21175a57755J29839J6023m8118p535K3627Q2172L1309j04304m6686R9131Q4577
$$ y = [-128735, -310608, -259383, 35282, 91203, 142058, 176136, 74691, -52765, -104510, -69816, -224037, -162095, -27423, -108250, -62374, 15858, 213457, 303365, 224752, 301494, 211780, 196207, 117563, 75099, 108803, 6517, 34075, 231119, 356170, 366393, 202224, -8492, 7411, 267879, 330907, 261234, 283082, 241462, 68461, 91308, 355464, 435539, 477358, 320651, 93086, 30937, -65143, 47264, 105949, 74426, 157261, 213037, 111453, 188182, 95866, 113956, 87932, 193999, 175178, 73498, 161400, 233213, 120999, 62473, 125089, 103398, 236519, 134396, 128236, 89626, 12183, -129078, -258438, -387369, -157755, -27916, -11893, -60011, -67546, -43919, 38253, 69562, -34742, -81428, 17703, 102280]
21164A02280p5286l6609o3579l4401J13589L6438O2220Q3942k95246j45072J02230
21153a49494J76469N3449r7737n4009P6425O3460J28395q0336j00999j20358m6070
21142a50805J66136j21127j60888P1619J04941J36168o7837j63628j20138j00816
21132d06375M5343R4799n0419N8406M0893Q8065J20245N4177l6178r419p0051
21121g0514Q256p3454O4585L1639J50357N9236j9436J0325Q7682M8862q3859J07866
21109C21545R6647j58323j93268o2493m3847J17725o6294o4474J11198L0336k61597
21098a72845n323J19790J13864J38394K07308j5253n6248m8075k7089J3646j42037
21087A26132R23M5613o8758n383o8914j00440Q4642R7634J06910J21600M3650
$$ y = [102280, 26994, -9615, -73194, -107595, 5994, 42432, 104652, 188594, -106652, -251724, -149494, 26975, 80424, -17313, -71322, 5103, 68563, 196958, 116622, 15623, -104735, -150805, 15331, -105796, -266684, -195065, -90124, 46044, -21793, -185421, -305559, -406375, -361032, -266233, -316652, -258246, -217353, -129288, -9043, 45134, 8956, -463, -70514, -62258, -135712, -71127, -39488, 110869, 170105, 150669, 160994, 248676, 297538, 213679, 321545, 418192, 259869, 66601, 4108, -39739, 77986, 11692, -52782, 58416, 88752, -172845, -178168, -58378, 55486, 193880, 401188, 385935, 329687, 281612, 254523, 268169, 126132, 127055, 172668, 103910, 98527, 29613, -70827, 13815, 111449, 218359, 339959, 383609]
21076C83609q5562Q1250Q8828j38816j10443n7468R394m383k04388j28297K79424
21065A13148L6384j50035j02778K1203j0878m082R1288p1723J28366o364q6403
21054d1874k6991Q9385k5535K5298J2906k466j9033K1275j79969k36378J7047
21043c66335K9237J0851L0216L16857Q0957K4715J22865M1795j37740O7993J21388
21032C42799j74868j52044m4953L2754K7756M7188M365N6255m802K3480k6233
21021A31697J0280j02298j09685Q4809J14031k11337j44839M3040J51984l5689
21011f8007o2829J11402M0216M399K6983R4514j52748j52107j577J2232M6619
21000a00903J647K2860j20113R3027m380k3725J18301R8604j33608q1728Q3414
$$ y = [383609, 298047, 379297, 468125, 329309, 218866, 161398, 170792, 166409, -37979, -166276, 113148, 149532, -503, -103281, -82078, -92956, -97038, -5750, -77473, 50893, 44529, -41874, -68865, 20520, -5015, 20283, 33189, 30723, 11690, 32965, -147004, -383382, -366335, -337098, -326247, -296031, 20826, 101783, 126498, 249363, 291158, 153418, 221411, 342799, 167931, 15887, -29066, 3688, 31444, 78632, 82997, 139252, 134450, 157930, 131697, 141977, 39679, -70006, 14803, 128834, -82503, -227342, -184302, -32318, -68007, -130836, -19434, 20782, 25181, 52164, 146678, -6070, -158177, -159754, -147522, -100903, -99256, -76396, -196509, -103482, -107862, -131587, -13286, 85318, -48290, -130018, -46604]
20989d6604J08184J61417J4231J06996O2180l6343K6446J61059J25250K85248
20979I68064L28593L85377N67924N33023J19682m0474L1642k21028l40591n04381
20969A827831n53992k96333k65441j64258p991K2991n4823k16668p76J14214r0726
20958C14028j93793M6571N7997L2649K2676P871K1420P7107N875k5655o8695j0007
20946B88044K905p3508l6663j30106J44671J01241R9453J78327r7190k88465k11569
20935b2860j77039j2599K64493K79533Q0317p9025j21511j62571r1790j34688
20925a77740l2483Q3449J36080j4852K8851J36471J4148J03223j20911k4691J11117
20914B42662N6830j3037m2544M7510j10526J6598l7962m2718J08728N2529J4599
$$ y = [-46604, 61580, 222997, 237228, 344224, 406404, 370061, 396507, 557566, 682816, 968064, 1296657, 1682034, 2249958, 2782981, 2902663, 2862189, 2893831, 2672803, 2332212, 1827831, 1273839, 977506, 712065, 547807, 539816, 562807, 507984, 291316, 290540, 404754, 314028, 120235, 166806, 224803, 257452, 280128, 287999, 309419, 386526, 392401, 366746, 298051, 288044, 290949, 217441, 180778, 50672, 195343, 296584, 396037, 574364, 477174, 188709, -22860, -199899, -212498, 51995, 331528, 411845, 332820, 211309, 48738, -43052, -177740, -210223, -126774, 9306, -5546, 23305, 159776, 173924, 277147, 156236, 131545, 242662, 299492, 286455, 243911, 291421, 180895, 197493, 159531, 116813, 225541, 278070, 292669]
20903B92669m2567j30593j28642j44613r435J54088n8356j51528P5686J19137
20893b4154p3791o3228m757O4776R77J44919J84035R189m29174n9992J27133j2180
20881a36247K4720M3674J05508P8858J42067p1293j40872n5675p874k4700J22371
20870H0537N2575j09679J18442J32048L7610q3596k56546n963j2074P2089Q712
20859C4155j6450m9858N7748j05273O223K7865M2936j08700o5795K40954O1037
20848A24842N2568p4043j44870M659j30173K6843Q4243r0762k36488Q2394K29787
20837g1000J02605j7782n7845m276M8992Q9946m5654n3248l9214l8600J04882
20826A8806r146p1556q9454M3944P0287R2733J36913j73940K0516O5933r5901
$$ y = [292669, 250102, 119509, -9133, -153746, -163181, -9093, -67449, -218977, -143291, -24154, -97945, -161173, -165930, -101154, -100177, 44742, 228777, 237966, -191208, -251200, -124067, -136247, -111527, -67853, 37655, 116513, 258580, 187287, 46415, -9260, -17134, -41834, 80537, 133112, 23433, 141875, 273923, 311533, 227937, -28609, -34572, -46646, 25443, 34155, 17705, -32153, 25595, -79678, -73455, -45590, -2654, -111354, -177149, 63805, 124842, 177410, 103367, -41503, -36844, -167017, -140174, -55931, -146693, -383181, -300787, -71000, 31605, 13823, -44022, -48298, 694, 90640, 44986, -8262, -47476, -86076, 18806, 9660, -61896, -151350, -107406, -37119, 55614, 192527, 18587, 39103, 105036, 9135]
20815I135l6962Q0631m3151j77711M0054M0864J04051K2125n8472j31140n6498
20804b07074J73460n0618M8627l4392K19726R2867p6803q0291J8083m3667l7927
20793B1991Q7769J59898j22952j19076J2583J78342K37293k01260j83339q7446
20783a6197Q6274J01143P6771j92758k42772l3794K12036K18777j59300j36458
20773h6278j7684K6108O4105j20589n4947R0424q240J27704M5243o0100J062J66772
20761A73580k318r2770M0007L5094m0188K6537R626j38485o1796J1960J0581j08891
20749a37063k0852N4688Q1402O6017k4713L9905J05935j2301Q0595K12063J5750
20738D61426O6844J97723J88465J89505J19756J54067J53839j20485j57847j44380
$$ y = [9135, -27827, 52804, 9653, -168058, -128004, -87140, 16911, 39036, -19436, -150576, -207074, -33614, -84232, -35605, -69997, 149729, 242596, 165793, 85502, 103585, 59918, 21991, 109760, 269658, 146706, 27630, 40213, 218555, 455848, 254588, 71249, -16197, 70077, 171220, 247991, 55233, -187539, -221333, -9297, 209480, 50180, -86278, -103962, -77854, -13749, -134338, -189285, -98861, -107101, 20603, 65846, 5746, 6808, 173580, 171262, 78492, 118499, 153593, 113405, 139942, 149568, 11083, -50713, -38753, -28172, -137063, -157915, -103227, -21825, 44192, 19479, 59384, 165319, 153018, 233613, 445676, 461426, 528270, 725993, 914458, 1103963, 1223719, 1377786, 1531625, 1411140, 1253293, 1108913]
20728A108913j23642k61088j59022J66346l7781n0869m5831M9936K40533J82751
20718A070246J28632J41776K4851J9249K00143j12047r9480J4575j56286j87141
20708A044518j07680K9179j84478j08498j18L6172l8132j41382j7636R5397J13454
20697G20796O2498k1733p0073M3097P4568P7271J06625L9142J55548L5359l759
20686A219339o9893n0541N8460K9411k8522j8776j63415k35541o6654o5844j77104
20675D30920p2590M4173j0518J42016J32448k09272j21071K25622J27620O1494
20665G50842J03476Q3548J23064M779L9229L5651O950j46078j58916J67560Q3240
20654A093345O3821m1344k3093o0492j94275J24644K2508l33321j26886k00032
$$ y = [1108913, 985271, 724183, 565161, 731507, 693726, 642857, 597026, 646962, 887495, 1070246, 1198878, 1340654, 1365505, 1384754, 1584897, 1472850, 1373370, 1387945, 1231659, 1044518, 936838, 966017, 781539, 673041, 672923, 709095, 670963, 529581, 511945, 607342, 720796, 783294, 761561, 691488, 734585, 809153, 886424, 993049, 1032191, 1187739, 1223098, 1219339, 1149446, 1098905, 1157365, 1186776, 1158254, 1139478, 976063, 740522, 673868, 608024, 430920, 358330, 402503, 391985, 534001, 666449, 457177, 336106, 561728, 689348, 750842, 854318, 937866, 1060930, 1065709, 1104938, 1140589, 1147539, 1001461, 842545, 1010105, 1093345, 1157166, 1115822, 1092729, 1032237, 837962, 962606, 985114, 651793, 524907, 324875]
20644C24875l64336m6771J51048J2801O1335J11462L8413o8211j13441Q0262m5801
20633A41636l4242l2109K7120P5232O1085J9549j0589j26068j05812J15504J10983
20622B42289K4215l877p1813j5573J13295J93154j08541j88806n019j68344j02893
20611i1913j79819r8045N0794J58369M7938J45836p9723m8245M7443l8994j54137
20600b40496J24211J51542J13914m6094k10179j52764J63943L0748O5294o9364
20590f9245L2655j04894j42027q4028J06741J35332J3152m8000j20959J39373
20580a41900N9904j20089K4522J44773J393k4033k6192J2595M9786q4166j41350
20569b44757R1334K24910J68405o4895J7676m4415m7647m3816R944j15286l3188
$$ y = [324875, -39461, -86232, 64816, 77617, 138952, 250414, 288827, 220616, 107175, 187437, 141636, 107394, 75285, 102405, 177637, 238722, 258271, 247682, 121614, 15802, 131306, 242289, 266504, 262627, 190814, 175241, 288536, 481690, 373149, 184343, 179324, 10980, -91913, -271732, -369777, -318983, -160614, -112676, 33160, -46563, -94808, -47365, -86359, -240496, -116285, 35257, 149171, 103077, -107102, -259866, -95923, -65175, 119, -69245, -36590, -141484, -283511, -367539, -260798, -125466, -112314, -160314, -281273, -141900, -81996, -202085, -177563, -32790, -31397, -55430, -81622, -69027, -19241, -103407, -244757, -153423, 71487, 239892, 174997, 192673, 148258, 100611, 56795, 66739, -48547, -81735]
20558h1735Q0375J83834j00427r6725J13784j03112M8653J0990K8936J00391M5800
20547B30764M0309j2284K3943l952j15826o7492J64771P2597J3872r8082m8492
20536B00128p8600Q7821O6666J01162k8896k09919j70539M1508j22108n2939J7862
20525a47854R9418J92101q7002q6572m9811O6130P0390j19436j0687J92144J97245
20514C16066p57k46705q8569J18845k8459j60287n6911J37764M2943k3625j33551
20503a23246M4462k8805K6513O3561J04929n2680j65263N8561l5286N7667Q8607
20492C9020N5284p8720r0497r9265j7073O4200q0877k0755J16764R6362M2882
20481B7325R8270j3301n5636n2770M0267q1722j8698p990N7268L0283K4647J84276
$$ y = [-81735, -1360, 182474, 82047, -14678, 99106, -4006, 44647, 55637, 84573, 184964, 230764, 271073, 258789, 282732, 278780, 162954, 95462, 260233, 332830, 346702, 248620, 200128, 121528, 209349, 276015, 377177, 348281, 138362, -32177, 9331, -112777, -165716, -147854, -48436, 143665, 56663, -29909, -79720, -13590, 56800, -62636, -73323, 118821, 316066, 315309, 68604, -19965, 98880, 70421, -89866, -146777, -9013, 33930, 10305, -123246, -78784, -107589, -81076, -17515, 87414, 34734, -130529, -71968, -107254, -49587, 39020, 94304, 15584, -74913, -174178, -191251, -127051, -207928, -228683, -111919, -15557, 27325, 125595, 112294, 56658, 3888, 44155, -37567, -56265, -64255, -6987, 23296, 47943, 232219]
20469B32219O754N8672n1092l0314K6985n7550O8340J1182k52649j31042R2985
20458b5510J16177J26545p1695p2167K92806J33034l9861L3972j14410j07307
20448B71584j13058j35023o1440O5546J60340j2617j94519N7032R2423R4732j1252
20437B13748j6718M9439m3493k2789n528L5687j01384o6731n3661J04216J77842
20426B70628k6105j21428l8216J02811J63261K65818M4366j27735j52200R6663
20416D77863K39262k07940q8935J14321j2860l8636J0986k2896L5763L6975l3725
20405E10178J32043K3186o8807m8971j01113n5288n8357l307k8139J1723n3812
20394B59336P889R1373p0129j41833j7040q7746K14644l210m7920K625M0112Q3477
$$ y = [232219, 238973, 297645, 246553, 216239, 243224, 185674, 254014, 265196, 12547, -118495, -25510, 90667, 217212, 145517, 73350, 366156, 499190, 459329, 493301, 378891, 271584, 158526, 23503, -37937, 27609, 187949, 175332, -19187, 37845, 130268, 225000, 213748, 197030, 246469, 202976, 180187, 174659, 210346, 108962, 42231, -11430, 92786, 270628, 244523, 123095, 84879, 187690, 350951, 616769, 661135, 533400, 381200, 477863, 717125, 509185, 420250, 534571, 521711, 483075, 494061, 471165, 506928, 543903, 510178, 642221, 665407, 596600, 547629, 446516, 391228, 332871, 329564, 301425, 313148, 259336, 267225, 358598, 288469, 146636, 129596, 41850, 256494, 253284, 205364, 207989, 248101, 331578]
20382C31578j26556R035J16032j4441O7775N3028K7309P8136q9185k29541j66872
20371E6298o3976M511L3179J83516O5142k7332m4449k14004l4911M8351J05139
20360A11464J58836J5415p3287j82971J9136K03126o6960m2608M4018K87490J65450
20349F39109l0289J8798q6288k4060Q7824M2805J98437j68280j58285r066n351
20338E05354p6006n4363n4302J87918J20201j96325j0430P358J9078n7189J0791
20327D02085J45515R7510m8110j18521j96627J90395o5816K1863M6693J1869j13728
20316C73128j43167K167K8435K0922J35768R4338m5118j21209m5124N7474J01499
20305D59113o8789j8063P464J71640L6626M3165n6813R7549k7298j50385k8233
$$ y = [331578, 205022, 214057, 330089, 315648, 383423, 436451, 463760, 541896, 452711, 223170, 56298, -7678, -3167, 30012, 213528, 278670, 251338, 206889, -7115, -42026, 6325, 111464, 270300, 285715, 212428, 29457, 48593, 251719, 184759, 142151, 186169, 473659, 639109, 608820, 627618, 541330, 517270, 605094, 647899, 846336, 678056, 519771, 510705, 505354, 429348, 374985, 320683, 508601, 628802, 432477, 422047, 429405, 448483, 391294, 402085, 547600, 645110, 597000, 478479, 281852, 472247, 406431, 428294, 474987, 486856, 373128, 229961, 232128, 260563, 281485, 417253, 511591, 466473, 345264, 300140, 357614, 459113, 390324, 372261, 379725, 551365, 587991, 631156, 574343, 671892, 644594, 494209, 465976]
20294D65976j52824j0386J52192n835M208J03425J25880j93807p1822O0386J22670
20283F00063Q1814j2933m4041j2888J12144o2842K3674J34227N8687K6631q6414
20272H18122j05138j168O2019J97595M0215j12386j35792K2518p8910Q8610m0628
20261G55057r3891O9947N2448J33151K65840k8304j6553N9939N6597L133j02579
20250A154785J6241O0934J06052r3273j81392O5574R5513O7001Q5407l218J75072
20239A548696P8401K670j161k210j07134O6402K36612J25477j66784j24905M5472
20228A701536J23852K96423L4344J5628J26600J41730N1941l4318R4362O3418
20218B615516r0918k6689n0798q1662J54281J87102K27905J08595J08207Q327
$$ y = [465976, 313152, 302766, 454958, 449123, 453331, 556756, 682636, 488829, 417007, 477393, 600063, 681877, 668944, 624903, 612015, 724159, 661317, 684991, 819218, 877905, 904536, 818122, 712984, 711816, 773835, 971430, 1011645, 899259, 763467, 785985, 707075, 795685, 755057, 661166, 731113, 783561, 916712, 1182552, 1154248, 1137695, 1197634, 1254231, 1257364, 1154785, 1171026, 1231960, 1338012, 1244739, 1063347, 1128921, 1224434, 1291435, 1376842, 1373624, 1548696, 1627097, 1629767, 1628606, 1626396, 1519262, 1585664, 1822276, 1947753, 1780969, 1656064, 1701536, 1825388, 2121811, 2156155, 2171783, 2298383, 2440113, 2492054, 2457736, 2552098, 2615516, 2524598, 2497909, 2447111, 2365449, 2519730, 2706832, 2934737, 3043332, 3151539, 3159866]
20208C159866K53264R1353n4009j4862J30984J38563J39885J64743K72333K27208
20198D509328M01308J73134J70720M53102M81236L75352L11882K40175K07486
20189G323723K69193L03939J80264K49412L98969M42115M75721M75858M42871
20180A0562065N02343P78524R80145J150264J337846J561575J951866K298068
20172B1122696K509718K863358L617348M391777N148329O486094Q246827J0584557
20164F4970704J4109514J8283834K2631072K5628714K6510060K4897121K1067721
20157B18098740J4110622O190629j628480r536692j5128858j9154277k0334895
20150A72616789j9743055j6257569r535324k196785M838060J1623191J7467596
$$ y = [3159866, 3413130, 3504483, 3450474, 3435612, 3566596, 3705159, 3845044, 4009787, 4282120, 4509328, 4910636, 5083770, 5254490, 5707592, 6188828, 6564180, 6876062, 7116237, 7323723, 7592916, 7896855, 8077119, 8326531, 8725500, 9167615, 9643336, 10119194, 10562065, 11064408, 11842932, 12823077, 13973341, 15311187, 16872762, 18824628, 21122696, 23632414, 26495772, 30113120, 34504897, 39653226, 46139320, 54386147, 64970704, 79080218, 97364052, 119995124, 145623838, 172133898, 197031019, 218098740, 232209362, 238399991, 236771511, 227234819, 212105961, 192951684, 172616789, 152873734, 136616165, 127080841, 124884056, 129722116, 141345307, 158812903]
20143A58812903K1855449K3590341K2275245J8576186J2015188L946318l870275
20136B57201355j1971302j7921716k2299278k4340202k3837040k1051196j5366029
20129A20414592r124410l984730L10888M233217Q369336J2877940J6196088J7330517
20121A66623438J5537591J1082974M580158k635574o829227p015233l592121K075403
20113A79827409N969643N816061K076854m786344j2942595j8675010k0613728
20106A36672290j9576807j5712915j0974115p030394m266472k373273m72127J508769
20098G7774956L371428N743319Q922774J2634943J6488933J9019827J8910877
20091A62867057J5663980J0097044K635280m448895p363007o369879k162921L196423
$$ y = [158812903, 180668352, 204258693, 226533938, 245110124, 257125312, 261071630, 257201355, 245230053, 227308337, 205009059, 180668857, 156831817, 135780621, 120414592, 111290182, 107305452, 107616340, 111849557, 120218893, 133096833, 149292921, 166623438, 182161029, 193244003, 197824161, 195188587, 188359360, 181344127, 177752006, 179827409, 185797052, 191613113, 193689967, 188903623, 175961028, 157286018, 136672290, 117095483, 101382568, 90408453, 83378059, 79111587, 76738314, 76266187, 77774956, 81146384, 86889703, 95812477, 108447420, 124936353, 143956180, 162867057, 178531037, 188628081, 191263361, 186814466, 179451459, 173081580, 170918659, 174115082]
20083A74115082N825362M175027q44622q763880j6708969k1183056k2468094k0200611
20075I3946239j5549236j1345478q300961o150655m633078l783351l082600k564013
20067C8536867j994326j672551j641182j224738q21966q78446r22667j120268
20059B8260723q97616o77817o99143p66812o27522o24918o96163q33627r07008
20050B1530097j115499r81893r25104j004410r81710p76725p70792p19215q45410
20041A3409339p66840o01958o89467r30042n51347k71365l95801n02364k37868
20032H462287j81553k97323l18313l12251m92210k47710l31448m32483l13148
20023E535848j16812q6760j27400k42485j64982j59281p2981j44633j92216k04374
$$ y = [174115082, 179940444, 184115471, 183270849, 174506969, 157798000, 136614944, 114146850, 93946239, 78397003, 67051525, 58750564, 52599909, 47966831, 44183480, 41100880, 38536867, 36542541, 34869990, 33228808, 32004070, 31182104, 30303658, 29380991, 28260723, 27363107, 26685290, 25986147, 25219335, 24591813, 23966895, 23270732, 22437105, 21530097, 20414598, 19432705, 18507601, 17503191, 16521481, 15744756, 14973964, 14254749, 13409339, 12642499, 12040541, 11351074, 10421032, 9869685, 9598320, 9202519, 8700155, 8462287, 8280734, 7983411, 7665098, 7352847, 6860637, 6612927, 6281479, 5848996, 5535848, 5419036, 5332276, 5204876, 4962391, 4797409, 4638128, 4565147, 4420514, 4228298, 4023924]
20013D023924p2881j84002j87070M7178j07535j19190j90023k08532k01120j49554
20003B651195r8775j77194m9609J6472N0874j27251j36308j7196J6435r5018N8061
19992B091686J63847M7292k07055j20753P7207Q8480o0188j02534O043O0652J8830
19981B063507j8062K7641o2292j58324k3995n5297n6203o342r1207m5654j21309
19970A452463P1387k0710K640P8035J25680o1450J20139K14925j3822M4245l2292
19959A981240q3833j11956j07449o9443j1608r496j4134q4392j40598k0425N414
19948A333320m9888m1409j74751o341J16179l7736J67288K79009k1457j23490
19938A440724j60004j35869J10906J39152p8961j64910r1191m8508N4904J27749
$$ y = [4023924, 3951043, 3767041, 3579971, 3627149, 3519614, 3400424, 3210401, 3001869, 2800749, 2651195, 2552420, 2375226, 2325617, 2342089, 2392963, 2265712, 2129404, 2112208, 2128643, 2033625, 2091686, 2255533, 2302825, 2095770, 1975017, 2052224, 2140704, 2080516, 1977982, 1984025, 2044677, 2063507, 2045445, 2073086, 2010794, 1852470, 1828475, 1773178, 1716975, 1710633, 1619426, 1573772, 1452463, 1523850, 1503140, 1505780, 1583815, 1709495, 1648045, 1768184, 1983109, 1969287, 2013532, 1981240, 1897407, 1785451, 1678002, 1608559, 1596951, 1587455, 1573321, 1488929, 1348331, 1327906, 1333320, 1283432, 1242023, 1067272, 1060931, 1177110, 1139374, 1306662, 1585671, 1564214, 1440724, 1280720, 1144851, 1255757, 1394909, 1315948, 1151038, 1059847, 1011339, 1066243, 1193992]
19928A193992n9677n4755j1938j6972m9822k94053o0011k8377J26130K49174J63154
19917A156845j04094j79092J26953N0007o6226N8407J93294M3149k51831j67516
19907H59896p949j31758J08959O5061R4628Q5157l3552J9186p0118q2808k9115
19896H77587k43634j11002J65072J26946p062J3572Q1513l8343q7290l0033J9558
19885G66884j3338J40569O7879o733j5074j33385l1124l469J32768N1098q2441
19874H73634k1674L1227l19342o3351k9476j18140K7497O7832m0202L1145M8204
19863D87354q5021j41801P5259P7613j02210j54410J29543K11114J10971l5498
19853E72914j21063n9124k2933m2790j68464O7345R5224k9415L6224J32467Q7097
$$ y = [1193992, 1134315, 1079560, 1067622, 1050650, 1000828, 706775, 646764, 618387, 744517, 993691, 1156845, 1052751, 873659, 1000612, 1050619, 984393, 1042800, 1236094, 1279243, 1027412, 859896, 851947, 720189, 829148, 894209, 988837, 1073994, 1040442, 1059628, 989510, 906702, 877587, 633953, 522951, 688023, 814969, 807907, 821479, 902992, 864649, 777359, 747326, 766884, 753546, 894115, 961994, 955261, 940187, 806802, 775678, 772209, 904977, 956075, 873634, 851960, 883187, 563845, 500494, 471018, 352878, 380375, 448207, 408005, 439150, 487354, 402333, 260532, 335791, 413404, 311194, 156784, 286327, 497441, 608412, 572914, 451851, 392727, 369794, 327004, 158540, 225885, 321109, 291694, 327918, 460385, 547482]
19842E47482n9948j27390j50016K7947o4520j49884n2425Q9905J78423J73526
19832D13100j00389j30175J09337J31105m3413J1099Q8441J21147j49698k35154
19822B15400J02887J69566j40112o305l1632n4904P9407L0380j45123l2100N7825
19811B45289m3879L649l4930k21649o7123K71948J44648j06919m5498P7762p054
19800B16244O5854l4253k26592k23470J71832J03146l2868P3138L9422j765P9839
19789B30527Q2553j44745j24368K86M9237J36064J64539j17048j08225P4759k8092
19778B15487j3974J52433L883k03114j40849J25772n0810j40281Q9073P3332M7750
19767A58702J04606J88115k9032j01838R3008K09457l0486l04153j72117J18995
$$ y = [547482, 487534, 360144, 210128, 238075, 173555, 23671, -28754, 61151, 239574, 413100, 312711, 182536, 291873, 422978, 379565, 390664, 479105, 600252, 450554, 215400, 318287, 487853, 347741, 341436, 309804, 254900, 334307, 364687, 219564, 187464, 245289, 201410, 205059, 170129, -51520, -118643, 153305, 297953, 191034, 145536, 223298, 216244, 282098, 247845, 21253, -202217, -30385, 72761, 39893, 113031, 152453, 150688, 230527, 313080, 168335, 43967, 44253, 93490, 229554, 394093, 277045, 168820, 243579, 215487, 201513, 353946, 357829, 154715, 13866, 139638, 88828, -51453, 37620, 110952, 158702, 263308, 451423, 422391, 320553, 413561, 623018, 592532, 288379, 116262, 235257]
19757B35257n780p3122p9626J20566O2136L1416Q1090J48161k39193R457Q7523
19746C77885n4721r2105o286M2004j1271q4914N6232M1105J4825j4359J01874
19735C70269J65650l5870j27002n8447q9384K58J5077Q5236p9376q8621n5698
19724A02092r9086J39249K66378J6773L0986l4306K2692o2855q2606R4306J23040
19713E16663m2351K8940q6863Q1529j29561j76156j59500O1232K38965K9573j51136
19702B11335J35897J5098K6264p6251P6870O9683o3660O9714j11314j68500J20314
19691C05450j3188k21028j98655K99327J36236K0072j02580j34076N1986m994
19681A38550l1484n4804R0847J27970M1902M1578l084j48757k6850L3208J40742
$$ y = [235257, 229477, 156355, 76729, 197295, 259431, 290847, 371937, 520098, 280905, 290362, 377885, 323164, 231059, 224773, 266777, 255506, 170592, 226824, 267929, 282754, 268395, 370269, 535919, 500049, 373047, 314600, 225216, 225474, 240551, 325787, 246411, 157790, 102092, 3006, 142255, 408633, 425406, 456392, 422086, 444778, 381923, 299317, 393623, 516663, 474312, 503252, 416389, 497918, 368357, 192201, 32701, 93933, 332898, 362471, 211335, 347232, 362330, 388594, 312343, 389213, 458896, 395236, 464950, 353636, 185136, 305450, 292262, 71234, -127421, 171906, 308142, 328214, 225634, 91558, 143544, 138550, 107066, 52262, 143109, 271079, 312981, 354559, 351475, 202718, 175868, 209076, 349818]
19670C49818k4848N388N5789j18269j44244K5064J13220R1828J54050p6867j57787
19659B73142q4142R9841Q1711k5628k07124N7412r632J1375O1678J19100J43029
19648E20762J2050j93678r1786p0374j46188k03086O7046J76696J37354J07327
19638C16123J04442j27256k02601j23270J00641N6199m9022O8702m069R552j23477
19627B5964R511J20031J481j68840k4233J83410K09856r906o3742j27383J747
19616A57896k8171K2498O9610N7483Q244l1846K8730q0480p9657k3618n2211J38651
19604A87129J25680J35273R8116r7874l38168k76702m9002l2962J70730K56068
19594A78288N7578j4133J226Q0783J7068j51181q5991J92042L61501l9962j96488
$$ y = [349818, 324970, 330358, 386147, 267878, 123634, 148698, 261918, 353746, 507796, 430929, 273142, 189000, 288841, 370552, 344924, 137800, 195212, 185580, 196955, 258633, 377733, 520762, 532812, 339134, 247348, 176974, 30786, -172300, -105254, 71442, 208796, 316123, 420565, 293309, 90708, -32562, 68079, 124278, 75256, 143958, 139889, 149441, 25964, 35475, 155506, 156987, -11853, -36086, 147324, 357180, 347274, 283532, 156149, 157896, 129725, 152223, 221833, 279316, 287560, 255714, 284444, 203964, 124307, 100689, 48478, 187129, 312809, 448082, 546198, 448324, 110156, -166546, -215548, -248510, -77780, 178288, 235866, 221733, 222959, 303742, 320810, 169629, 83638, 275680, 637181, 597219, 400731]
19583D00731n1492K62014K47055m5168K05189K77350J4843q5322J38754K18288
19573A582242k06532l11370j17207o4059r3645j30197M2879L1976n164N1434M2342
19562H22699J98856L17554J19648p111K36248P2220l4363j14912j52794j01225
19552A356820k05021j7028n3249j1195O9870j6737O2329J53239J12985N2690r4103
19541A410600j00509j63485m3372P3601j75124O967J59863J23673m6318j02024
19531A143872k73424j19506j02208O0534J59376m0031n7048j00224N4644J82597
19521I08582L6023j03066J27614J01848M8951L1285J32079J41024P6802j00399
19511A400743Q0934Q4719o3963J9799m738j84616J6232J53270P1375q4595j38929
$$ y = [400731, 349239, 611253, 858308, 813140, 1018329, 1295679, 1310522, 1225200, 1363954, 1582242, 1375710, 1064340, 947133, 883074, 789429, 659232, 702111, 734087, 728923, 780357, 822699, 1021555, 1339109, 1458757, 1451646, 1687894, 1760114, 1725751, 1610839, 1458045, 1356820, 1151799, 1134771, 1081522, 1070327, 1140197, 1123460, 1185789, 1339028, 1452013, 1504703, 1410600, 1310091, 1146606, 1103234, 1176835, 1001711, 1008678, 1168541, 1292214, 1245896, 1143872, 870448, 750942, 648734, 709268, 868644, 828613, 771565, 671341, 725985, 908582, 944605, 841539, 969153, 1071001, 1119952, 1151237, 1283316, 1424340, 1501142, 1400743, 1481677, 1566396, 1502433, 1522232, 1517494, 1332878, 1349110, 1502380, 1573755, 1489160, 1350231]
19500A350231l17511q0935j13856r6283p9098j14002p8644j2173P1666n7746R0939
19489E62588q3126q855J23380j66655o2403P9136p2007L4835J07711J12084q8340
19478E38348j9380j48377p6080j34814j0143J50673j04401R134L4415j35145j61743
19467e7513o8182J55340J51985N0325j44637O3323L7611j59778j03804Q8913J66940
19456A80523P9250j188j65340n5077O1565J60735K81155J980k00441r0892J417
19445B53687q8211m6366L0985l3203j17981L998P51j00750j60702J09278P6230
19434g2284n6390J56960l2437J4886P483r0083j4016R5720J42834j3598j40350
19423a275j58934O6526K34613l8530q3912L4787j82592k8780l4879M667l4047
$$ y = [1350231, 1032720, 951785, 837929, 741646, 662548, 548546, 469902, 457729, 529395, 471649, 562588, 479462, 470607, 593987, 427332, 364929, 444065, 372058, 406893, 514604, 626688, 538348, 518968, 370591, 294511, 159697, 149554, 300227, 195826, 204960, 239375, 104230, -57513, -125695, 29645, 181630, 231955, 87318, 150641, 188252, 28474, -75330, 13583, 180523, 259773, 258585, 93245, 38168, 99733, 260468, 541623, 543603, 343162, 252270, 253687, 165476, 119110, 150095, 116892, -1089, 2909, 3660, -97090, -257792, -148514, -72284, -128674, 28286, -4151, 10735, 18218, -71865, -85881, 9839, 152673, 139075, -1275, -160209, -93683, 140930, 102400, 18488, 53275, -129317, -158097, -192976, -188309, -222356]
19412b22356L0485J49471P6228l6223L4978J92407J4733j39409P3807j01041K8474
19401A01554K3188q29o7617q2863k09041k1399R6740J34613J50007l8908p5660
19390I785J19754m4213Q4926J00377J5849J48024J9464q9345p6856p5108j64157
19379D8500k27097R1599J43257m991L7356R9578k52323R5461O1500K1090p0983
19368D2947R1479N26j8853o6167j25589O956Q3271J91682o552j98487j72387J19013
19356e2161J95770p55o0144j51194j1044J06036J12333K2633p4298q4235p3986
19345g1045N4835J1138L1181J62721K0369N1730j4626j86886p792o8606k2877
19334c9858j11096p6348J33084J4857K1355L8271m58j02686p2553m131Q9126J53948
$$ y = [-222356, -191871, -42400, 33828, -2395, 32583, 224990, 239723, 100314, 174121, 73080, 101554, 124742, 123913, 56296, -26567, -235608, -257007, -160267, -25654, 124353, 85445, 9785, 129539, 85326, 170252, 270629, 286478, 434502, 453966, 364621, 287765, 212657, 48500, -178597, -86998, 56259, 51268, 88624, 188202, -64121, 31340, 92840, 113930, 42947, 134426, 134952, 116099, 49932, -75657, -68701, 14570, 206252, 199700, 1213, -171174, -52161, 143609, 142854, 82710, -68484, -79528, 26508, 138841, 161474, 87176, 2941, -71045, -16210, -5072, 26109, 188830, 209199, 260929, 246303, 59417, 51625, -16981, -39858, -150954, -227302, -94218, -79361, -58006, -19735, -20193, -122879, -195432, -199563, -110437, 43511]
19322D3511K5315m1100M0097J09976O8931j83066j31075K493J85548p3010j64930
19311a17310J42001J6055J12363m05m0616M0435n6195k1577r4822N3372j12375
19300g9074k1820Q1193m8273R4760j13466K0788N2518J40642K33062J54090j53252
19289C61168k31595j38522L1693K7605p8565j57829j55051J66467P8027J17309
19279B0707J044l1696j93852k4384J59083p3401r8577J00448K06572k7167q5287
19268d6510k5162J19752N0577p2169K3958m4616j28682l381J21909M5890J2972
19257E4538L6580n2899N8147n7897N5439P1116L2052M4824j52283j05792N9386
19246D3211m3721r6232K457J39608J87053P9888n6294j91562R889P0935J5409
$$ y = [43511, 68826, 27726, 67823, 177799, 246730, 63664, -67411, -64918, 120630, 47620, -117310, 24691, 40746, 153109, 152704, 112088, 152523, 96328, 74751, -20071, 33301, -79074, -100894, -19701, -67974, 26786, -86680, -65892, -13374, 127268, 360330, 514420, 361168, 129573, -8949, 22744, 50349, -28216, -186045, -341096, -174629, -96602, 20707, 21751, -9945, -203797, -228181, -69098, -142499, -241076, -140628, 65944, 38777, -46510, -71672, 48080, 98657, 26488, 50446, 5830, -122852, -126233, -4324, 41566, 54538, 91118, 38219, 96366, 38469, 93908, 165024, 197076, 241900, 89617, -16175, 43211, -510, -96742, -94285, 45323, 232376, 312264, 255970, 64408, 74297, 145232, 160641]
19235A60641j37774j10602j02158M736R0078n4424j6685J08015R4047m3823j24244
19224a32193M0312n2766J37858N9067J6751j90529K7608J75536J48969j4741K228
19213B18100o3626r1367K2442L781J5394l4692R76J35544k3201j81451j44969
19202a43069l9883O2846J08591K55588J40717j6074j36755j66457j82275O6562
19192e0209L3179Q5305k8004J6765J2521L1581l9419r1772j84106m4855J50261
19181a08753l8997N7274N6753M0870o2964j75201o0797L5863M6649N5144p628
19170a61787J76577j47714J05808J04342p7653j55179l4717K038M4937P0208J16874
19159D3734R5651J11206J03960j63570l25856l2340J46460M2235p0834j38488
$$ y = [160641, 22867, -87735, -189893, -185157, -95079, -149503, -166188, -58173, 35874, -7949, -132193, -91881, -144647, -6789, 52278, 69029, -121500, -93892, 81644, 230613, 215872, 218100, 154474, 63107, 85549, 89330, 104724, 70032, 71008, 206552, 183351, 1900, -143069, -182952, -120106, -11515, 244073, 384790, 368716, 231961, 65504, -116771, -50209, -17030, 68275, 40271, 57036, 69557, 101138, 61719, -30053, -214159, -259014, -108753, -147750, -90476, -33723, 7147, -55817, -231018, -291815, -255952, -209303, -154159, -161787, 14790, -132924, -27116, 77226, -427, -155606, -190323, -188285, -143348, -73140, 43734, 139385, 250591, 354551, 190981, -134875, -167215, -20755, 21480, -49354, -187842]
19149a87842l7494k1459Q7667J36441O5007q5057q6965M8460R7472J17708m3390
19138I0548n2681j22432K8358M0481M7678Q8704m6013k32184j93654J81825J72536
19127C166J8961k4917m3997q1577J27755J0768P7766K7581j37390J3578k9311
19116c7617j68619J00056J22536J10944J02007j56859j08137k1851n7428J45534
19106C0566m5402J3397k4505m0122j00079m29N1882P4141n2550M2676j1687N4942
19094g170j3015O3543J00590n0794M1787N2567r1728q291p3462J08376L5378N9868
19082B17649J10807L4020O0973l154r0144o0105L4021M4949l1780J11899K50897
19071F80032j9624r7679l6119J2592J787K34k26609k45269M0112J31302R5795
$$ y = [-187842, -225336, -246795, -159128, -22687, 42320, -42737, -129702, -81242, 16230, 133938, 90548, 37867, -84565, -56207, -15726, 31952, 120656, 74643, -157541, -351195, -169370, 3166, 22127, -2790, -46787, -128364, -609, 10159, 87925, 115506, -21884, -8306, -37617, -206236, -106180, 16356, 127300, 229307, 72448, -35689, -57540, -114968, 30566, -14836, -1439, -25944, -66066, -166145, -166574, -114692, -40551, -93101, -50425, -62112, -7170, -20185, 43358, 143948, 93154, 134941, 187508, 95780, 87489, 14027, 122403, 157781, 217649, 328456, 362476, 423449, 420295, 330151, 270046, 304067, 349016, 317236, 429135, 680032, 660408, 562729, 526610, 539202, 540989, 541223, 314614, 69345, 109457, 240759, 336554]
19060C36554k9411k5363J8306q1171K04383K67671j60078r8595R1735Q4856J27664
19049G36551K4063l8997j25071N0211N4378O0168K9915k2381k16409l1507j06225
19038D14696r0182O2435L6515j07019j37697n8257p5953p2995J7667L38738K5
19027C27973P7013l8747J23326P0243n0740j54844j64738j4833P0572J23022L20008
19016F88255N9725j56786J2534r5108J4109J55437J74510l1948j17306j26087
19006E77335K63893Q3445k87062q6533O1392N8672J06391L0700j61534Q0654O5373
18995G92726m6916k4007R8468m397q4328r2838J29263q1916j46869j53156j40623
18984B45407L1674J77336q836r5053r1096n7453m928R1387j41303J14964N8467
$$ y = [336554, 307143, 281780, 300086, 218915, 423298, 690969, 530891, 432296, 524031, 608887, 736551, 760614, 721617, 596546, 646757, 701135, 761303, 791218, 768837, 552428, 520921, 414696, 324514, 386949, 423464, 316445, 178748, 120491, 44538, -28457, -10790, 327948, 327973, 404986, 366239, 489565, 559808, 509068, 354224, 189486, 174653, 245225, 368247, 688255, 747980, 591194, 603728, 508620, 522729, 678166, 852676, 820728, 703422, 577335, 841228, 924673, 637611, 551078, 612470, 671142, 777533, 808233, 646699, 727353, 792726, 745810, 721803, 820271, 815874, 731546, 638708, 767971, 686055, 539186, 386030, 245407, 277081, 454417, 445581, 350528, 259432, 201979, 197051, 288438, 147135, 262099, 320566]
18973C20566j1906P1079M8248L4462j32956n9285o7116q3671r1293k2234O42o9176
18961f2640N806L6931Q7570N6614q8544O2366J02723m5459r0239r1351J26843
18950A00620O4344k34360k37120N4154J71091K01045J18589r9714p8247P266j35799
18939f8131L4755J73273Q3138o9592j11583M6473L2750m1927n8859J73669O6011
18928B59977j8242L0108m6000m3965j42493j72220K9352M5560Q0469k9037K3068
18917A6577J0880P2725n9736M8747j82059M713J02846J27891m7231M2543k5927
18906A11969n4767j41709J2525P4647K1050j29985P3775j6223P0850L9941q4047
18895b1974J20697L3596j01620r0426R6256J181m2707k2900J21198o04J07356
$$ y = [320566, 308660, 379739, 427987, 462449, 329493, 270208, 203092, 119421, 28128, 5894, 6536, -62640, -56834, -19903, 67667, 124281, 35737, 98103, 200826, 155367, 65128, -26223, 100620, 164964, -69396, -306516, -252362, -81271, 119774, 238363, 138649, 60402, 67668, -68131, -33376, 139897, 223035, 153443, 41860, 88333, 121083, 79156, 20297, 193966, 259977, 241735, 271843, 225843, 181878, 39385, -132835, -103483, -57923, 22546, -6491, 16577, 27457, 100182, 40446, 89193, -92866, -88153, 14693, 142584, 95353, 137896, 111969, 57202, -84507, -71982, 2665, 23715, -106270, -32495, -48718, 22132, 62073, -21974, 98723, 132319, 30699, -59727, 36529, 37710, -4997, -27897, 93301, 92697, 200053]
18884B00053o2695k4719Q6112J92l3988j3130P1761J6745k2415M3135k4446n9241
18872A77364k5422j06794O6002k0000j69096j01070J36141J22778K08636o3611
18862B24928k6107J06052N2461L8264k1967q3695o4507k0644j25391r2857J18995
18851A05532J12399J02362K83100N1142k54185p7056J92442R7405L7845o2623
18841E88363o55L7386p1428L0573o3290k58490k8863J20217l0310O1785n0550
18830C34738Q7476O4691j08963j43801k78294J22485K27017M1328J47325j4453
18820D79549k10602j35659P8133J87428L10568K77327J20722n5101M3845Q2933
18810A179143j48092l07330j30903J38541j14338L5762o1263j25113K4434P9609
$$ y = [200053, 137358, 112639, 198751, 198943, 164955, 151825, 223586, 240331, 217916, 261051, 236605, 177364, 151942, 45148, 111150, 91150, -77946, -179016, -42875, 79903, 288539, 224928, 198821, 304873, 357334, 395598, 373631, 289936, 225429, 204785, 79394, -13463, 105532, 217931, 320293, 603393, 654535, 400350, 323294, 515736, 613141, 650986, 588363, 587708, 625094, 553666, 584239, 520949, 262459, 233596, 353813, 323503, 385288, 334738, 422214, 486905, 377942, 234141, -44153, 78332, 305349, 346677, 494002, 479549, 268947, 133288, 211421, 398849, 709417, 986744, 1107466, 1052365, 1096210, 1179143, 1031051, 723721, 592818, 731359, 617021, 652783, 591520, 466407, 490841, 570450]
18800E70450K05864r807j54728M0294K7957Q1951O3461K01511L5332N5774P0224
18789A188283q4095o9628m9939j92493j02194J5218q8711k5314J13318n8294J1830
18778F57981O492j80176q4432n5215Q4542J72595J17992K2460L1927J40675L65110
18767A279951L78543K41626J79602P0496k92050j80913l3729k74961k6460J7317
18757A359422q7784j66382q5027k4947j39050r9676j18352p7519J45072m8585
18747F57172r6915l7100j70474O0933O7414K7570P4186K2072j68618q9408J9305
18736C66137K28651J40811r3091n2666j2344q6630r0792r1528j13248O6727l8117
18725B23910q413N3830M5826n6884l7952r9135j7208J49219n2959m5819L1105
$$ y = [570450, 776314, 766507, 611779, 652073, 680030, 761981, 825442, 1026953, 1062285, 1118059, 1188283, 1104188, 1034560, 984621, 792128, 689934, 705152, 616441, 591127, 704445, 646151, 657981, 664473, 484297, 399865, 344650, 429192, 601787, 719779, 742239, 774166, 914841, 1279951, 1658494, 1900120, 2079722, 2150218, 1858168, 1677255, 1643526, 1368565, 1342105, 1359422, 1271638, 1105256, 1020229, 995282, 856232, 756556, 638204, 560685, 705757, 657172, 560257, 523157, 352683, 413616, 481030, 508600, 582786, 604858, 436240, 346832, 366137, 594788, 735599, 642508, 589842, 577498, 490868, 400076, 308548, 195300, 262027, 223910, 215497, 269327, 315153, 258269, 220317, 121182, 103974, 253193, 200234, 154415, 185520]
18714A85520J26077n4098M2995N2032r5112j84500J84209J85228j67513j57462
18704A17376l8428n4J02022J42694q4201j20824Q2409K29356N096m9968J3053
18693C98531r1936j47805o6249M1453q343o8967Q8634R3160J23259j2081l2442
18682C17214N5947K10336K8814r6274j20741p6976R301J00075M9272J35329j8322
18671E93975j11450J23049J31494J3438k10289j71327L291j8593J06943J81158
18661F41689P0697j12432j23417M3706M1179N3071n0034n0176l9566J53590K06152
18650H34459j0874R0734J12947J1227N5300J40166J86820L40399K76889K42232
18640B280299O5904O6847j27053l23667l92595l47573k21610l6998J03433J37619
$$ y = [185520, 311597, 257499, 300494, 352526, 257414, 72914, 257123, 442351, 274838, 117376, 78948, 78894, 180916, 323610, 239409, 118585, 200994, 430350, 435446, 385478, 398531, 306595, 158790, 92541, 133994, 125651, 56684, 145318, 238478, 361737, 349656, 317214, 373161, 583497, 612311, 516037, 395296, 318320, 327621, 427696, 476968, 612297, 593975, 482525, 605574, 737068, 750506, 540217, 368890, 372181, 353588, 460531, 641689, 712386, 599954, 476537, 520243, 561422, 614493, 564459, 514283, 474717, 628307, 834459, 823585, 914319, 1027266, 1038493, 1093793, 1233959, 1420779, 1761178, 2038067, 2280299, 2346203, 2413050, 2285997, 1962330, 1569735, 1222162, 1000552, 963554, 1066987, 1204606]
18630A204606o3231k1832J75528J12473J22309j8926j07872Q7614O0476P2190
18620A623335L2349L61708N39158J27176l8398k251q9751k79955m21390N6047
18610A908028M4884j51239j14548j02196o9813k5647J42780j1020j1760l696k50562
18599A355211j31971Q6225r3247J00817J61813p4146R0606J16069Q7278K2992
18589A721647K70725j1047J8470R033P6742p6719J19371J79565K15172K04242
18579B727201J28931J10774P0344K27704K95302J59734K13706K29117J27034L87889
18569D677736L95381O27817Q00126O18307P22529Q12859J081891J158280J720077
18560A2615003K273852L046994M274919O045846Q393607J1450450J2564933R844293
$$ y = [1204606, 1141375, 1119543, 1295071, 1407544, 1529853, 1510927, 1403055, 1490669, 1551145, 1623335, 1655684, 2017392, 2556550, 2683726, 2645328, 2643077, 2553326, 2273371, 1851981, 1908028, 1952912, 1801673, 1687125, 1584929, 1515116, 1489469, 1632249, 1621229, 1609469, 1605773, 1355211, 1223240, 1309465, 1216218, 1317035, 1478848, 1404702, 1495308, 1611377, 1698655, 1721647, 1992372, 1981325, 1999795, 2008828, 2085570, 2008851, 2128222, 2307787, 2522959, 2727201, 2856132, 2966906, 3037250, 3264954, 3560256, 3719990, 3933696, 4162813, 4289847, 4677736, 5073117, 5700934, 6501060, 7119367, 7841896, 8654755, 9736646, 10894926, 12615003, 14888855, 17935849, 22210768, 28256614, 36650221, 48100671, 60665604, 70509897]
18552G0509897M930214J308164j927461p704547o589805J22433O316722R086832
18544G6052449P193422K608982p91857m193956j0154881q351370j336661M925703
18536F5951831Q227340P157505L485022O3933k758714q247460q043838j852038
18528F3983581M397740P293454N606006J139328k266003o059056j2973636j3274020
18520D7847394r143596n710699l391381j970147j277665m47405O0027n1805R2527
18511B6007250M67033Q38640J385675J970937K705083L887840N458863P703823
18503E0425144J1310409J6113483J9356419J7287087J0450475L383482q95875
18496A27430624r797417j3634517n306097N193011J2010989J1670955O015190
$$ y = [70509897, 75440111, 76748275, 74820814, 67116267, 60526462, 60648895, 66965617, 76052449, 83245871, 85854853, 85062996, 80869040, 70714159, 62362789, 61026128, 65951831, 74179171, 81336676, 84821698, 84885631, 82126917, 73879457, 65835619, 63983581, 68381321, 75674775, 81280781, 82420109, 80154106, 74095050, 61121414, 47847394, 38703798, 32993099, 29601718, 27631571, 26353906, 25906501, 25966528, 25914723, 26007250, 26474283, 27312923, 28698598, 30669535, 33374618, 37262458, 42721321, 50425144, 61735553, 77849036, 97205455, 114492542, 124943017, 128326499, 127430624, 117633207, 103998690, 98692593, 103885604, 115896593, 127567548, 133582738]
18489A33582738J12905l864599j2316492j4401809n320817N363427J2485412J3127648
18481A28768413P728384J173637k691642j1038327j5850622p959144K464467R417871
18473A12013037R622417M229711k377300p108830j6651545k2431220j7419414
18466E9876856j1253284p223683m910571l147469k191406j883760j555373j357887
18458B6353423j478526j394457j242048j106651p54854n34801m98983o75540p47187
18449A7920376p78126q37520q05994q05932o18548l13457l83805p60638r58725
18440A1657631p43077n69868n36382l75743m03289m27004l10244l12783k08147
18431G771094k51509m43071j25303k38801k81154j82515k71105k77583m87236
$$ y = [133582738, 133695643, 129831044, 117514552, 103112743, 97791926, 103155353, 115640765, 128768413, 136496797, 137670434, 134978792, 123940465, 108089843, 100130699, 102595166, 112013037, 121635454, 125865165, 123487865, 116379035, 99727490, 77296270, 59876856, 48623572, 41399889, 36489318, 33341849, 31150443, 29266683, 27711310, 26353423, 24874897, 23480440, 22238392, 21131741, 20376887, 19842086, 19343103, 18667563, 17920376, 17142250, 16304730, 15498736, 14692804, 14074256, 13760799, 13376994, 12616356, 11657631, 10914554, 10344686, 9808304, 9432561, 9029272, 8602268, 8292024, 7979241, 7771094, 7519585, 7076514, 6951211, 6712410, 6431256, 6248741, 5977636, 5700053, 5212817]
18422E212817l51568j48339j64803k13095k03608k40398j86528j87792r0597L3580
18412C459669j10643k52890j64805m3285R0845j00840j07393N9434r8495j03184
18402B628413M4617K0719R8394J26112k444j86188k33276q1504k8912k24589p5234
18391B086108o7876j65195P1040O0556J32501o8795n2030O9610l7145J14912m4150
18380B099536K2273J86540L01986J94187N5904n7251J10338R4633r0991l6168
18370B880987J17285j19865j34134q6450J71892J60034m2734l3948J97317N3521
18360C163905o4239m2117m506K92494J00811J21973J55757K79797L29046J78997
18350D511918J45193K11832K49534R762K25385K09760K12627L32885J74512J11295
$$ y = [5212817, 4861249, 4712910, 4548107, 4335012, 4131404, 3891006, 3704478, 3516686, 3426089, 3459669, 3349026, 3096136, 2931331, 2888046, 2978891, 2878051, 2770658, 2830092, 2731597, 2628413, 2673030, 2693749, 2792143, 2918255, 2915811, 2729623, 2496347, 2414843, 2385931, 2161342, 2086108, 2018232, 1853037, 1924077, 1984633, 2117134, 2048339, 1996309, 2065919, 2028774, 2143686, 2099536, 2121809, 2308349, 2610335, 2804522, 2860426, 2803175, 2913513, 3008146, 2917155, 2880987, 2998272, 2878407, 2744273, 2657823, 2829715, 2989749, 2947015, 2913067, 3110384, 3163905, 3099666, 3057549, 3053043, 3345537, 3446348, 3568321, 3724078, 4003875, 4332921, 4511918, 4657111, 4868943, 5118477, 5128239, 5353624, 5563384, 5776011, 6108896, 6283408, 6394703]
18340F394703J69792K14272K50497K30622O40330R86584J056917J210389J538249
18331A2692355J906117K459682L245902L997054N145540O901930R291636J3077857
18323E8718073J7948560K2221554K2282333J8028447J3448174J2371380M157239
18316A69175760q028801j2731801j3567914j5311699k3253876k3601742j6451743
18309E6228184j0346908o587117m381314k757399j631786j006630k43919M11194
18301B9684305R42185J827943K694210L816803N204257O901333R828703J3885645
18293G4785384J8936230K1896963J9843229J4854578J1899391R641852j655302
18286A70202325j0810739j3493908j3558623j7842874k4341984k0356256j3167241
$$ y = [6394703, 6564495, 6778767, 7029264, 7259886, 7900216, 8886800, 9943717, 11154106, 12692355, 14598472, 17058154, 20304056, 24301110, 29446650, 36348580, 45640216, 58718073, 76666633, 98888187, 121170520, 139198967, 152647141, 165018521, 169175760, 161146959, 148415158, 134847244, 119535545, 96281669, 72679927, 56228184, 45881276, 39294159, 34912845, 32155446, 30523660, 29517030, 29273111, 29684305, 30626490, 32454433, 35148643, 38965446, 44169703, 51071036, 60899739, 74785384, 93721614, 115618577, 135461806, 150316384, 162215775, 171857627, 170202325, 159391586, 145897678, 132339055, 114496181, 90154197, 69797941, 56630700]
18279E6630700q053140m871313k958567j462995j16637J000125K176237L810959
18271D6155369O009470R123429J2532032J3739817J1981753Q778340P439990M689657
18263A20449857l383856p618395q864605q954861j2933696j6076532j2435736
18256E0182176q108449n384546l597939k544301j844944j282532q36504k92041
18248B6290920N3018M74856R69011J805472K755642L687890N156264P360776J0804669
18239E9358518J3728458J3523885J0529377P599520O758735J561839o009271q799129
18231I8251932r298927j0126998j5219424j5236985j0442445o810540m404272
18224B6712341l099731k315119j881995j617836j172988j009137q73967p31879
$$ y = [56630700, 48577560, 43706247, 40747680, 39284685, 39168048, 40168173, 42344410, 46155369, 52164839, 61288268, 73820300, 87560117, 99541870, 108320210, 115760200, 120449857, 117066001, 109447606, 100583001, 91628140, 78694444, 62617912, 50182176, 42073727, 36689181, 33091242, 30546941, 28701997, 27419465, 26582961, 26290920, 26343938, 26818794, 27787805, 29593277, 32348919, 36036809, 41193073, 48553849, 59358518, 73086976, 86610861, 97140238, 104739758, 111498493, 113060332, 107051061, 98251932, 88953005, 78826007, 63606583, 48369598, 37927153, 31116613, 26712341, 23612610, 21297491, 19415496, 17797660, 16624672, 15615535, 14741568, 14009689]
18216A4009689o10957n86924m86841m11214l07503j56550K2750j64589j12682
18207A1195179m70170l03195k74753m01572k73082m01348m73561n73705m85002
18198G538791q4492j33723l17877k03297k06812l72395k60783m58907l46440l15734
18188D838331j06422J0270k20732l06463j87506k80796k33727j86J03402n6124
18178C560047r1988J39122o7364P7070n8426j17472j59633j68634J13553M0658
18168C266933L1934j02674j01156J30448J25324K8578k17483l4161p8444J48978
18158C198277L6088j05271L4243j4852M1562K71993Q6987Q483j27083j79449J18748
18147C369726J97926K50352J39891L7091P3113J94855J69012K32450j3758N4617
$$ y = [14009689, 13398732, 12811808, 12324967, 11913753, 11606250, 11449700, 11472450, 11307861, 11195179, 10725009, 10421814, 10147061, 9745489, 9472407, 9071059, 8597498, 8023793, 7538791, 7454299, 7320576, 7002699, 6799402, 6592590, 6220195, 5959412, 5500505, 5154065, 4838331, 4731909, 4742179, 4521447, 4214984, 4027478, 3746682, 3512955, 3512769, 3616171, 3560047, 3468059, 3607181, 3539817, 3616887, 3558461, 3440989, 3281356, 3112722, 3226275, 3266933, 3298867, 3196193, 3095037, 3225485, 3350809, 3379387, 3161904, 3127743, 3049299, 3198277, 3234365, 3129094, 3163337, 3148485, 3190047, 3462040, 3549027, 3557510, 3430427, 3250978, 3369726, 3567652, 3818004, 3957895, 3994986, 4068099, 4262954, 4431966, 4664416, 4650658, 4705275]
18137D705275N7949Q4227K23066J86533O4545J57039K27549K02397K61726M59198
18127F629504N09045N72405Q36157R15047R77500J178370J427844J778642K442625
18118A7267139L217065M204017N324859O705568Q473958J1578735J6950648K5846396
18110I9568385L6797952L9512324K8262508Q381935m325617j7109095m6887274
18103A44201118m5546675k7833167j5811177q969594n129001l010888j622271
18096C6278345m52506N56556J533166K648020L717137N131648O483868Q360338
18088F4256572J0909206J4592948K0805124L1398855M6645704N9033107N4121854
18081C01763370L1414865L534659j2043850m3543347p3061402n8330982l6167229
$$ y = [4705275, 4763224, 4847451, 5070517, 5257050, 5321595, 5478634, 5706183, 5908580, 6170306, 6629504, 7138549, 7710954, 8547111, 9462158, 10439658, 11618028, 13045872, 14824514, 17267139, 20484204, 24688221, 30013080, 36718648, 45192606, 56771341, 73721989, 99568385, 136366337, 175878661, 204141169, 212523104, 208197487, 191088392, 144201118, 98654443, 70821276, 55010099, 46040505, 40911504, 37900616, 36278345, 35825839, 36382395, 37915561, 40563581, 44280718, 49412366, 55896234, 64256572, 75165778, 89758726, 110563850, 141962705, 188608409, 247641516, 301763370, 333178235, 336712894, 324669044, 281125697, 208064295, 149733313, 113566084]
18074A13566084k1310272j2510359p414373m008343j932206k38778J420879L207871
18066G0780503N383509P980826J1154445J6425770K4668879L7700321N3375176
18059B27469429N9215266M4969192J6924415n695408k4374223o4126411p0876963
18052A83505297m8044387k9602219j8313387j2622569r105144o743117n416798
18045E3657676m367827l978191l269707k676568k615041k079836j709931j416954
18037C1543621j211058r26159q72922p96126o42012k33833J49070L72684L39120
18028B7722385k91018j013892j102384j198462j377863j440045j205249j397892
18020A8695580j364632r98133r42919q53209q31189q11262q57954o74436n19304
$$ y = [113566084, 92255812, 79745453, 72331080, 68322737, 66390531, 66151753, 67572632, 70780503, 76164012, 84144838, 95299283, 111725053, 136393932, 174094253, 227469429, 286684695, 331653887, 348578302, 342882894, 318508671, 254382260, 183505297, 135460910, 105858691, 87545304, 74922735, 65817591, 59074474, 53657676, 49289849, 45311658, 42041951, 39365383, 36750342, 34670506, 32960575, 31543621, 30332563, 29406404, 28533482, 27737356, 27095344, 26861511, 27010581, 27383265, 27722385, 27431367, 26417475, 25315091, 24116629, 22738766, 21298721, 20093472, 18695580, 17330948, 16332815, 15389896, 14536687, 13705498, 12894236, 12036282, 11361846, 10842542]
18011A0842542n67670n29109n75506l82242l22264k03143k31490k84346l04664
18002G442108k81135l08500l55269m05866k50064j09553q0636m16745j87051k25562
17992D821727k09324j37440k47811k70454k84288j58267l330k5059m1422j95191
17982C249141k6886L3149j63066l21358j08379J45898R8374j63434m3662q874
17972B690903j22468N6539K56680P1064j79133j37511r3482l5736P5442N0344
17962B632642J20198l6424r9554K18J02895K9031j50873j39993n7867l6813j48412
17951B215048j5070L0898J77046J86629n5403k87981k00261j37779j12207p2699
17941A728221q9181p5942K3101J01262M2372j28910q1262K05825J32672L8879
$$ y = [10842542, 10274872, 9745763, 9170257, 8788015, 8465751, 8262608, 8031118, 7746772, 7442108, 7160973, 6852473, 6497204, 6091338, 5841274, 5731721, 5651085, 5234340, 5047289, 4821727, 4612403, 4474963, 4227152, 3956698, 3672410, 3514143, 3510813, 3485754, 3444332, 3249141, 3222255, 3255404, 3092338, 2770980, 2662601, 2808499, 2906873, 2743439, 2699777, 2690903, 2568435, 2624974, 2881654, 2952718, 2773585, 2636074, 2542592, 2506856, 2582298, 2632642, 2752840, 2716416, 2616862, 2617080, 2719975, 2749006, 2598133, 2458140, 2400273, 2363460, 2215048, 2199978, 2230876, 2407922, 2594551, 2539148, 2251167, 2050906, 1913127, 1800920, 1728221, 1639040, 1563098, 1586199, 1687461, 1729833, 1600923, 1519661, 1725486, 1858158, 1897037]
17931A897037o8365j44531j74134o573j40851k39951M0251J00714k39419j095
17921A023083q7741j17728m2594J18826J34847j64456k30606J5813N9712Q2494
17911G91650M7808M3349N1956J29200M1888l8638o226l295R8830m4494j38997
17900I73031o5449p1007p8691j10271p6112J95436L626p0885n3693j09483J31898
17889F68400K01084R7579q1487j18361J1821k3267Q3324K5631M166K35145N2861
17878A156896K7287j7788l8835j58190q5878o6507q5163o5627m746J2295L2185
17867G05929o695J32387O0903K7950n6246j63088j21194j60144j23563M3920J91396
17856E31555J69814j49799q1247P7426P3077O291j05925n1662K18396j6346j72381
$$ y = [1897037, 1828672, 1684141, 1510007, 1503434, 1362583, 1122632, 1162883, 1263597, 1024178, 1023083, 935342, 817614, 775020, 893846, 1028693, 864237, 633631, 649444, 709156, 791650, 839458, 882807, 934763, 1063963, 1105851, 1067213, 1060987, 1057692, 1156522, 1112028, 973031, 907582, 836575, 757884, 647613, 571501, 766937, 770563, 699678, 645985, 536502, 668400, 869484, 967063, 885576, 767215, 779036, 755769, 839093, 864724, 868890, 1104035, 1156896, 1184183, 1166395, 1127560, 969370, 883492, 816985, 731822, 666195, 661449, 673744, 705929, 699234, 831621, 892524, 920474, 864228, 701140, 579946, 419802, 296239, 340159, 531555, 701369, 551570, 470323, 547749, 620826, 627117, 521192, 469530, 687926, 671580, 499199]
17845D99199q3707n401J9527Q2848k11787j02211J4127q3127K4909R4135R3771
17834C42283o291J06836l1319q7470J10919p6247k02016j6026m569o234J05096
17823B34962M8815q5179K0284L0565p4502m725O3683R4879P6587q8511q5264j7077
17811B14517j52443j8708k0919L9486N1501m7309j1909P0694M0717M4327M9937
17800B59891J44982J0744m047K10594K67797J10370N9638J11927O5085N7781j10208
17789A184554k50584j53062j38122j53628j38133q2100r8159o0544q4410N1864
17779G7676K4849J6306J21742J12251N8299L0063J04799q8717q7290J04425R9629
17768E74032J29197J46409J29006P5538n804q5793M8811P3938R9155j09483k23643
$$ y = [499199, 415492, 410091, 429618, 512466, 300679, 198468, 212595, 129468, 154377, 248512, 342283, 335992, 442828, 411509, 324039, 434958, 358711, 156695, 140669, 136100, 129866, 234962, 283777, 198598, 218882, 249447, 174945, 170220, 233903, 328782, 405369, 316858, 231594, 214517, 62074, 43366, 22447, 61933, 113434, 66125, 54216, 124910, 165627, 209954, 259891, 404873, 415617, 411570, 622164, 889961, 1000331, 1059969, 1171896, 1236981, 1294762, 1184554, 933970, 780908, 642786, 489158, 351025, 268925, 170766, 110222, 25812, 77676, 102525, 118831, 240573, 352824, 411123, 441186, 545985, 457268, 369978, 474403, 574032, 703229, 849638, 978644, 1054182, 1048378, 962585, 1011396, 1085334, 1184489, 1075006, 851363]
17757H51363j47854j46644p2774j90755q6205o8605L6051m6221j31034J05752
17747A03074L8067O7093J40084K85684J28472k0369R4387J66727P0282j77801
17737H95700j82342R3825j0880j73862q3092j5979o9201n5554J26749J11953n0491
17726E86826j5379j64873j21176L139r173q5083j02995Q1841K7331K6408P3497
17715C00363L6235n5239N7016J17651L4143O8623R0394k1725O4020o9457m6237
17704E75787L9137Q583j38395n971M5727m6122j83823j21799l6033M728L5499
17693A77318J18692M0756j13550l9012m3855l424N9353q8547n4083j6851J02466
17682A39263J76482k8320j63853p2419O1542O8975Q0160j48782K4357P8255m5731
$$ y = [851363, 703509, 556865, 484091, 293336, 207131, 138526, 174577, 128356, -2678, 103074, 141141, 208234, 348318, 634002, 762474, 742105, 836492, 1003219, 1073501, 895700, 713358, 807183, 796303, 622441, 539349, 523370, 454169, 398615, 525364, 637317, 586826, 571447, 406574, 285398, 288537, 279364, 194281, 91286, 173127, 200458, 226866, 300363, 336598, 281359, 338375, 456026, 490169, 558792, 649186, 627461, 691481, 622024, 575787, 614924, 623507, 485112, 479141, 524868, 478746, 294923, 173124, 137091, 141819, 177318, 296010, 336766, 223216, 184204, 140349, 136925, 196278, 107731, 53648, 36797, 139263, 315745, 287425, 123572, 51153, 112695, 181670, 261830, 113048, 137405, 215660, 169929]
17671A69929k15997j40880J10389J80356q1182n6336J11207o5529j20179k4645
17661a32867M5931J05875Q6884j19292l1146P5590N8730J27383Q092q1978j08130
17650C5072J96827J40095j34857j31686j72987n7Q2737Q5225M1037k3584m6144
17639G1678l3290N8053n8578l8323j31480O8796J73122J36506j1969r4017l3919
17628A06579K9453J5712J24797k4329r7304j23494j31157J54759P2701M7318J01033
17617B76068l9260m9777p0241n0847O7995k6287o3127j15969n205K39540P3666
17606B36556N0735l2985l4328j12609J06403q4919j14848P617L7342j37178l6297
17595a14511J96775J89568j23254o5693Q1950N7190j67696o5282J93519r959J07699
$$ y = [169929, -46068, -186948, -76559, 103797, 22615, -33721, 77486, 11957, -108222, -132867, -86936, 18939, 105823, -13469, -44615, 30975, 89705, 217088, 225180, 143202, 35072, 231899, 371994, 237137, 105451, -67536, -67593, 15144, 100369, 141406, 117822, 71678, 38388, 96441, 37863, -460, -131940, -63144, 109978, 246484, 234515, 140498, 106579, 136032, 151744, 276541, 252212, 154908, 31414, -99743, 55016, 127717, 175035, 276068, 236808, 187031, 116790, 65943, 133938, 107651, 44524, -71445, -76650, 162890, 236556, 287291, 254306, 219978, 107369, 213772, 128853, 14005, 21622, 58964, -78214, -114511, 82264, 271832, 148578, 82885, 164835, 222025, 54329, -10953, 182566, 172607, 280306]
17584B80306K21813R446k66745k18495j54153l5854Q1408M238L6243P0128K09401
17573B37736R6359J9832Q974k9170m5444j16835K0664n2218q9508j58269M8034
17562e9845M0291j10762j8082j66751M3509J68119J05138P747j12808Q6214J37857
17551A20627N3457J52571l2626k55629m7835M9328o6184O9262J31667r2858j60003
17540g8223R2778J48437n8098j69405j41788L672M2947K3029j02K1371r809J16500
17528h691m741J47079O7378K7228J31084Q9850o7085L4987J26480L08643L03329
17517A155541K20878J87837J46763r6187j01720p1173l31328k70415k21708r7370
17507E21118P4648J77361k20906k84600k1305L8894J25068p9020M4308L9035q8572
$$ y = [280306, 502119, 511565, 244820, 26325, -127828, -163682, -82274, -78036, -41793, 28335, 237736, 334095, 353927, 362901, 333731, 288287, 171452, 192116, 139898, 50390, -107879, -59845, -19554, -130316, -148398, -315149, -271640, -103521, 1617, 9364, -103444, -17230, 120627, 174084, 326655, 294029, 38400, -9435, 39893, -26291, 42971, 174638, 81780, -78223, 14555, 162992, 104894, -64511, -206299, -202627, -159680, -136651, -136753, -115382, -125191, -8691, -13432, 133647, 201025, 228253, 359337, 449187, 382102, 417089, 543569, 852212, 1155541, 1376419, 1564256, 1711019, 1614832, 1513112, 1441939, 1110611, 840196, 618488, 521118, 595766, 773127, 552221, 267621, 246316, 285210, 410278, 331258, 375566, 414601, 326029]
17496C26029J3513M02308M82850M85818K80049L035m8746q744k46784k07727l31869
17485A149732j63982j22740l8618j18628j44511j9636k49777k00293K9392Q1011
17475B01950q5168n8323p974M6263M7421J23253M5966p1418K9723R1761p8949
17464B84505q4099P5690m8009j5001L9266R5446N1848k6861l9997N5812j46327
17453B42273j44242k8136J90263J09051l8124j2786J10721R5405P7720N262J28131
17442G35538L23835L44365j15839j79143k42851l41036j52225j01013Q426j37861
17432A42196M5266J54160k09302j97172r5228k4063J29346O0252J546Q8467K15087
17421C10555p4072j67184J9633Q8989O2576j4156j47747j04334J21994n1226j15866
$$ y = [326029, 339542, 741850, 1224700, 1710518, 1990567, 1993602, 1944856, 1936112, 1689328, 1481601, 1149732, 985750, 863010, 824392, 705764, 561253, 541617, 291840, 91547, 120939, 201950, 116782, 58459, 50485, 96748, 144169, 267422, 313388, 241970, 271693, 363454, 284505, 200406, 276096, 228087, 213086, 252352, 347798, 399646, 372785, 332788, 388600, 242273, 98031, 69895, 260158, 369209, 331085, 318299, 429020, 524425, 602145, 607407, 735538, 1059373, 1403738, 1287899, 1108756, 865905, 524869, 372644, 271631, 280057, 142196, 187462, 341622, 132320, -64852, -160080, -184143, -54797, 5455, 7001, 95468, 310555, 236483, 69299, 88932, 177921, 240497, 226341, 78594, -25740, 96254, 45028, -70838]
17410g0838p0374o753O3283K86717R6102k37546r4579J00078j5384j10416J0702
17399d9008j25067L4274J713j3518O5208J06175j38785p4181J2516J15594Q7426
17388B2347m4205J04734r130n1194j02066q2418n5933J51120J54772m6527k4262
17377A7238M9486p8137J6575k11704l3906Q801Q546R2600N7615J30223L8860p5081
17365B1116J08959j7455j53959q465L4441Q3917J12024L0380P25k24495J7564
17354D752R0059m9332j27936j30565k1710O8477N7478j420k1632n3625K71235
17343H5781j613j19058J86141J6646j20730P735J06813p5900j72745o4744M7120
17332a04554Q2809j71324j05703P3474K5985O3324M7990O3686j3988k0547j21401
$$ y = [-70838, -141212, -147965, -84682, 202035, 298137, 60591, -33988, 66090, 50706, -59710, -49008, -174075, -139801, -138088, -151606, -86398, 19777, -119008, -193189, -180673, -65079, 22347, -21858, 82876, 73746, 22552, -79514, -161932, -217865, -66745, 88027, 41500, 17238, 66724, -11413, 5162, -206542, -240448, -231647, -223101, -130501, -72886, 57337, 96197, 21116, 130075, 112620, -41339, -49804, -15363, 68554, 180578, 210958, 211683, -12812, 4752, 94811, 45479, -82457, -213022, -234732, -166255, -108777, -110197, -131829, -185454, 85781, 84168, -34890, 151251, 167897, 47167, 54902, 161715, 85815, -86930, -151674, -104554, -21745, -193069, -298772, -225298, -199313, -135989, -87999, -24313, -38301, -58848, -180249]
17321a80249j81215R3666J81118J43614J37777o917j34916L5798j27943O6277
17311B7010P2835j27572j5540J31979J9484m7214r4807q5338n8862l9340J36043
17300h1322Q7016O7851L9535j1629J7338n8240j75316j13942J18870M4920M7275
17289a7644k2135j24517R2609j24890K6445K30148J29362j59181j25520n1941
17279a47264K564J06346k197K7911J09345R16l6520K5518q3659j02M032N5348
17267F2238n9616j84579J6747K92638J44632J66661M5713k33548k33042n5844
17257c8000m1646J61954K05073M073k26925q8342Q5865R8431n5700q7376J20778
17246A38185O8793Q7586j0117p0311o6802J4147q3771o9532p8474j1127N3535
$$ y = [-180249, -361464, -267798, -86680, 56934, 194711, 187794, 52878, 88676, -39267, 27010, 99845, -27727, -43267, 88712, 108196, 60982, -33825, -119163, -178025, -217365, -81322, 5694, 73545, 113080, 101451, 118789, 60549, -114767, -228709, -109839, -64919, -17644, -39779, -164296, -71687, -196577, -170132, 60016, 189378, 30197, -95323, -147264, -144700, -38354, -40551, -12640, 96705, 97621, 61101, 86619, 2960, 2858, 6890, 62238, 2622, -181957, -165210, 127428, 272060, 438721, 484434, 250886, 17844, -38000, -79646, 82308, 287381, 291454, 64529, -23813, 62052, 160483, 104783, 17407, 138185, 206978, 294564, 284447, 214136, 147334, 161481, 77710, 8178, -70296, -81423, -27888]
17235b7888N0504n1004r3283j08778L192J27290J37177Q8183k38140M2862P9141
17224I256m3473q8635J20818K17482j03195j86330l0251K3592L8666n0688j23956
17213b16714j62722K18678O2763j41930K3794J6007J11123N7452j97629k5243
17203b54421J28995P8583J24769l6011o3997R0756J8448o7625l6120N7651j6677
17192B4351m1369r3140j12793r3916k5119J31469J45833j07349k8537O7734j03545
17181b36381m200Q3622R7771K2454L3229R7885p7961n7831K9746Q6685j26461
17170e1442J23385J34718N5008j24944j50620P7787N241j73050j34166J4940J75966
17159d7177J18528j5044L9593k4179K7342P2447r6698k47315M5697J26612J38134
$$ y = [-27888, 22616, -28388, -121671, -230449, -227257, -99967, 37210, 125393, -112747, -69885, 9256, -34217, -122852, -2034, 215448, 112253, -74077, -104328, -80736, -42070, -92758, -216714, -379436, -160758, -97995, -239925, -216131, -200124, -89001, -31549, -229178, -254421, -125426, -46843, 77926, 41915, -22082, 68674, 87122, 19497, -16623, 41028, 24351, -17018, -110158, -222951, -316867, -341986, -210517, -64684, -172033, -200570, -132836, -236381, -240581, -156959, -59188, -36734, -3505, 94380, 16419, -41412, -11666, 75019, -51442, 71943, 206661, 261669, 136725, -13895, 63892, 69133, -103917, -238083, -223143, -47177, 71351, 56307, 95900, 71721, 99063, 171510, 74812, -172503, -126806, -194, 137940]
17148A37940J67668o574k78777j60281L0953N2298J66779j14477k2145Q57P4814
17137D9055j07690q9953J28531l45J17499J11592j28787o5892N5914O9609k6270
17126A13263O5433J6126K5521j17324k20792M1451r2916M933L2387r1167N6731
17115a66354J55478K24497J26722j89253j51685n4387o2544J53598K9620j31398
17105f5706j2336j15559P4643M0137J6076p2380j19182R2431J56564J56904O6209
17094B17801r7948n1073M5431p136o5871j05667J2781l4078m8033n1766J14207
17083g1352k4770q7256N9213n2332j37821J87410K3195J44130k4022P187M3550
17072F7132j33995O6989N5790j03952p22K9748O9999J5308P4570j83625k07735
$$ y = [137940, 305608, 299034, 20257, -140024, -109071, -56773, 110006, -4471, -26616, -25759, 49055, -58635, -148588, -20057, -20402, 97097, 208689, 79902, 14010, 69924, 139533, 113263, 178696, 194822, 220343, 103019, -117773, -76322, -169238, -164305, -131918, -223085, -166354, -10876, 213621, 340343, 151090, -595, -54982, -117526, 36072, 65692, -65706, -78042, -193601, -118958, -78821, -62745, -135125, -254307, -161876, -5312, 151592, 217801, 119853, 68780, 114211, 107075, 41204, -64463, -51682, -85760, -133793, -185559, -71352, -96122, -183378, -124165, -176497, -314318, -126908, -103713, 40417, 16395, 23582, 67132, -66863, 126, 55916, -48036, -48758, -19010, 50989, 66297, 140867, -42758, -250493]
17061b50493q7277l7899N3987J22079N4093M1482r0839J34617Q2884r6838L0788
17050d3416m0743N2877R4926P4485L4630j14316j33218R3797q3890L3676l958
17039c5150o4747Q9954J31687p0006k4996k3218J723j18690N5294Q1196n1678
17028b8631p325o132O3816j2838j43938r0978p9812Q2312J76719j9269q588K02960
17016A28296L9432j92847o0334N0399K1572J20000q5622L2036k09722j24966J20625
17005a61131K96035J10617j30814r3651r340K8941J9578J22514k6104r2779l7627
16994B6239M9727j09207o2169n3105L2247j42630j1767R4037P1554p9658j80083
16983c64815M6565J56122J0087J98262J59749j37681J24485K34808j19052k2584
$$ y = [-250493, -337770, -375669, -321682, -199603, -145510, -104028, -194867, -60250, 22634, -74204, -43416, -84159, -31282, 63644, 138129, 172759, 58443, -74775, 19022, -64868, -31192, -35150, -99897, -9943, 121744, 51738, 26742, 3524, 5247, -113443, -58149, 23047, -28631, -35956, -42088, 21728, 8890, -135048, -226026, -305838, -223526, -46807, -66076, -74664, 128296, 167728, -25119, -85453, -35054, -13482, 106518, 20896, 52932, -156790, -281756, -161131, 134904, 245521, 114707, 21056, 11716, 40657, 60235, 182749, 156645, 63866, 26239, 75966, -33241, -95410, -148515, -116268, -258898, -270665, -176628, -105074, -184732, -364815, -318250, -162128, -152041, 46221, 205970, 68289, 192774, 427582, 308530, 285946]
16973B85946j10470j55899n750J21189J18371j2988r0492l7204j64831q8906Q0214
16962f0820J01620R6207r1773r3982K3698O2402l6129J24735o3752j7291M6420
16951I1335K9371j595r3868Q2466Q4092k278o4354P164l5954o9638J37038N408
16939A69187P8372M5757j40158j00954l9326Q6402q5679n8673N828K5205p1602
16928h5641j5902J62350J54852m0945k8713j85506r9157L4868m5986K3081k5276
16917a51975l8649J36680J76098L0711N4327j16059r3315L2626J12704j29972
16907A3176K546J5817j27034j60370J2372K5794P9982M523k585M7327P6248k50536
16895b62740l4818Q1598J95073q6439K0350Q8081m2730J0028k4464N0842J33305
$$ y = [285946, 175476, 19577, 13827, 135016, 253387, 240399, 149907, 112703, -52128, -141034, -60820, 40800, 137007, 45234, -48748, -25050, 37352, 1223, 125958, 62206, 44915, 91335, 120706, 119111, 25243, 107709, 191801, 189523, 125169, 132333, 96379, 26741, 163779, 169187, 247559, 293316, 153158, 52204, 12878, 99280, 13601, -45072, -39244, -14039, -85641, -101543, 60807, 215659, 174714, 146001, -39505, -138662, -103794, -149780, -126699, -151975, -190624, -53944, 122154, 152865, 207192, 91133, -2182, 30444, 143148, 13176, 15722, 31539, -95495, -255865, -243493, -217699, -137717, -133194, -135779, -88452, -12204, -262740, -297558, -215960, -20887, -107326, -86976, 1105, -41625, -31597, -56061, -5219, 128086]
16884A28086Q781k40087j50556Q8175J49565P867K9377K105M3156R3137k17902
16873e8296P9388P9215j91325m425O1782R02o516O0305O3733N7556M2009O6n4478
16860A29916l8744J583j2938n7725j58095r0912M7867K64859L5446j17843O3431
16849F6845j14697p0887J16615Q192j4965m5628j67531K5940J81474r7664o4465
16838a76771J661o4148M8454J50051M8999j14434j7861L8067J78995j52347Q4386
16827B5052J10220J542M5876J4244q12j65369k00023k26M8923J5057J57967J7852
16815G0303k793j20369j61567K5388j0337N8783Q4716K6690K8288k6192o3097
16804i0187Q8093N8351o6265q1014N6897K0308j29882P0903J18541J7004N3963
$$ y = [128086, 136867, -103220, -253776, -165601, -16036, -8169, 21208, 23313, 66469, 159606, -58296, 21092, 100307, -91018, -95443, -33661, -32759, -39275, 21030, 84763, 142319, 184328, 184394, 129916, 91172, 92755, 79817, 22092, -136003, -226915, -179048, 85811, 121257, 3414, 66845, -47852, -118739, -2124, 6068, -8897, -54525, -222056, -196116, -14642, -112306, -176771, -175110, -239258, -190804, -40753, 8246, -106188, -124049, -85982, 93013, -59334, 25052, 135272, 136814, 182690, 196934, 196122, 30753, -169270, -169496, -120573, -105516, 52451, 70303, 67510, -52859, -214426, -189038, -199375, -140592, -55876, -29186, -898, -27090, -90187, -2094, 56257, -10008, -91022, -34125, -13817, -143699, -72796, 45745, 62749, 116712]
16793A16712O4378k168j44604J06047q6998N8101j4955n9587J76M4786L8428J47141
16781B67457k10006k05523j8365P0605J45371j9773j10068j92591j07044n9736
16771d39673K62192K20402K03665j4199r3336p9639O4966Q565m4008r3674j7874
16760b2613o9041J7046L5296q0386j94005k2995J23262K85617O2811l225K1612
16749A53379q6207j51142j67989l6845R2519J93197J23040l878o4606j08229p5539
16738a32300J7443J01488K2894j29137K65139O3548p6256j56869J0231M8222l8762
16727d359P2691l7365p9545K8921l4398Q0206l4076q984J23797J3807m4654M1090
16715A17131Q9874J8349q843j63056J05895L1412k61275q0742M6875M1336O4469
$$ y = [116712, 181090, 178922, 34318, 140365, 53367, 111468, 96513, 36926, 37102, 81888, 120316, 267457, 57451, -148072, -166437, -95832, 49539, 29766, -80302, -272893, -379937, -439673, -177481, 42921, 246586, 232387, 139051, 59412, 124378, 132943, 88935, -4739, -22613, -91654, -74608, -39312, -119698, -313703, -336698, -213436, 72181, 134992, 131767, 153379, 67172, -83970, -251959, -288804, -196285, -3088, 119952, 116074, 51468, -56761, -132300, -114857, -13369, 9525, -119612, 145527, 209075, 132819, -24050, -13819, 34403, -4359, 68332, 30967, -48578, -19657, -54055, 26151, -7925, -16909, 106888, 120695, 76041, 117131, 207005, 225354, 216511, 53455, 159350, 190762, -70513, -151255, -104380, -63044, 1425]
16704A425J2629n3196l3583J11929O7067q0456n2641K6949q4247P893J14681J80300
16692B18750M3330p9893r4176j12135j2569k23045L3865K48987L9473j01903m5758
16681h5074q5016K1934J07353Q0767K5313j74606r6979k3265M6947K3203O404
16670a53019l4985K27222O1228j1799j65421j68264j86584O7711J41592O4867
16660a57452J62750K8830m9122j89558j72417K7573J58076j03005J46034J92808
16650D4517J69205r3773k99538j2805n737j2544j5142j3350L7103k9012N5487
16639a75589N4185p6641q1045J52538N050K1055J8647k58989J09031J35603J29568
16628C3413K3499N058M7434j08837k15457o5576J19197r8720m6060P5200M7701
$$ y = [1425, 14054, -39142, -72725, 39204, 106271, 25815, -26826, 123, -84124, -76231, 38450, 218750, 262080, 182187, 88011, -24124, -36693, -259738, -225873, 23114, 62587, -39316, -85074, -170090, -148156, -40803, 39964, 65277, -109329, -206308, -229573, -182626, -159423, -153019, -188004, 39218, 100446, 88647, -76774, -245038, -431622, -363911, -222319, -157452, 5298, 34128, -14994, -204552, -376969, -349396, -191320, -294325, -148291, 44517, 213722, 119949, -179589, -192394, -198131, -210675, -225817, -239167, -202064, -231076, -175589, -121404, -198045, -279090, -126552, -121502, -100447, -81800, -340789, -231758, -96155, 33413, 56912, 61970, 109404, 567, -214890, -280466, -161269, -259989, -306049, -230849, -183148]
16617a83148R070k6268J21354R0513j65181j00807M9155J1882J93917J55228l0178
16606A25537n4181j38111q1372L987l0922J22687J29272j09235k1927O7786m6366
16595c2845j9011p0396K2207j32028j6400M3297J5106r389j39750j04867P2192
16584c71884J88672j9586j5548L1256J60574J8076j39K3313j20933k04634J08501
16573b02332J33940J0167J744M2064K4337M4437K50648j07992j64972j25404p4107
16562a67470N1768P5403l0009k70617q4583J16172K31491K629l7019p5692J15466
16551g2461j2993q7281J15821J40481p0459j61384k6480J0018j00375L9683Q0116
$$ y = [-183148, -174078, -200346, -78992, 11521, -153660, -254467, -205312, -193430, 487, 155715, 125537, 71356, -66755, -148127, -144140, -175062, -52375, 76897, -32338, -54265, 13521, -32845, -51856, -122252, -100045, -232073, -248473, -205176, -190070, -199459, -339209, -444076, -371884, -183212, -202798, -218346, -187090, -26516, -8440, -8579, 14734, -106199, -310833, -202332, -68392, -58225, -56481, -14417, 9920, 54357, 305005, 197013, 32041, -93363, -167470, -115702, -40299, -70308, -340925, -425508, -309336, -77845, -75216, -112235, -187927, -72461, -85454, -172735, -56914, 83567, 13108, -148276, -174756, -164738, -265113, -225430, -145314]
$$ [...]
##END NTUPLES=NMR SPECTRUM
##END=
