##TITLE=Analysis number 307256
Compound Code cc 42923
Book Reference 411/148
Project Code adrs
Chemist Name miguelg
##JCAMPDX= 6.0         $$ Bruker NMR JCAMP-DX V2.0
##DATA TYPE= NMR SPECTRUM
##DATA CLASS= NTUPLES
##ORIGIN= Bruker BioSpin GmbH
##OWNER= NMR
$$ XWIN-NMR		Version 3.5
$$ Tue Apr 26 11:41:13 2005 GMT Daylight Time (UT+1h)  MAYBRIDGE\NMR@NMR_250MHZ
##.OBSERVE FREQUENCY= 250.131544655141
##.OBSERVE NUCLEUS= ^1H
##.ACQUISITION MODE= SIMULTANEOUS (DQD)
##.ACQUISITION SCHEME= undefined
##.AVERAGES= 16
##.DIGITISER RES= 18
##SPECTROMETER/DATA SYSTEM= dpx250
##.PULSE SEQUENCE= zg30
##.SOLVENT NAME= CDCl3
##.SHIFT REFERENCE= (INTERNAL, CDCl3, 0, 16.4529)
##AUDIT TRAIL= $$ (NUMBER, WHEN, WHO, WHERE, WHAT)
$$ ##TITLE= Audit trail, XWIN-NMR		Version 3.5
$$ ##JCAMPDX= 5.01
$$ ##ORIGIN= Bruker BioSpin GmbH
$$ ##OWNER= NMR
$$ C:\u/data/dgb/nmr/ADRS/2250/pdata/1/auditp.txt
$$ ##AUDIT TRAIL=  $$ (NUMBER, WHEN, WHO, WHERE, WHAT)
(   1,<2005-04-26 11:40:40.08 +100>,<MAYBRIDGE\NMR>,<NMR_250MHZ>,
      <created by zg, POWCHK disabled, PULCHK disabled
       configuration hash MD5:
       62 19 C7 07 E1 42 D1 B7 37 6C 3D D0 77 39 F9 E6
       data hash MD5: 64K
       70 66 6F 83 40 9D 82 23 E8 1D E4 A9 1E FD E3 CD>)
(   2,<2005-04-26 11:40:56.83 +100>,<MAYBRIDGE\NMR>,<NMR_250MHZ>,
      <Start of raw data processing
       ef LB = 0.3 FT_mod = 6 PKNL = 1 SI = 32K 
       data hash MD5: 32K
       A7 80 E6 2A 94 35 16 84 09 66 E5 33 4A 21 30 1B>)
(   3,<2005-04-26 11:41:00.21 +100>,<MAYBRIDGE\NMR>,<NMR_250MHZ>,
      <apk 
       data hash MD5: 32K
       F6 3E 2B 8D 0E DD 74 7C B0 ED E8 28 AE FB 22 59>)
(   4,<2005-04-26 11:41:00.90 +100>,<MAYBRIDGE\NMR>,<NMR_250MHZ>,
      <abs ABSG = 5 
       data hash MD5: 32K
       A5 6F E2 6D 81 8B 56 F1 02 E9 1C C3 C9 15 2B 01>)
$$ ##END=
$$ 
$$ hash MD5
$$ D6 D7 A9 B1 ED 5A CA CE E7 3B 07 74 78 0A B0 86
##$RELAX= 
##$RELAX= 
##$RELAX= 
##$RELAX= 
##$RELAX= 
##$RELAX= 
##$RELAX= 
$$ Bruker specific parameters
$$ --------------------------
##$DU= <C:\u>
##$EXPNO= 2250
##$NAME= <ADRS>
##$PROCNO= 1
##$TYPE= <nmr>
##$USER= <dgb>
##$AMP= (0..31)
100 100 100 100 100 100 100 100 100 100 100 100 100 100 100 100 100 100 
100 100 100 100 100 100 100 100 100 100 100 100 100 100 
##$AQSEQ= 0
##$AQ_mod= 3
##$AUNM= <au_zg>
##$AUTOPOS= <20 >
##$BF1= 250.13
##$BF2= 250.13
##$BF3= 250.13
##$BF4= 250.13
##$BF5= 500.13
##$BF6= 500.13
##$BF7= 500.13
##$BF8= 500.13
##$BYTORDA= 1
##$CFDGTYP= 0
##$CFRGTYP= 5
##$CHEMSTR= <none>
##$CNST= (0..31)
1 1 145 1 1 1 1 1 1 1 1 1 1 1 1 1 1 1 1 1 1 1 1 1 1 1 1 1 1 1 1 1 
##$CPDPRG= <>
##$CPDPRG1= <>
##$CPDPRG2= <>
##$CPDPRG3= <>
##$CPDPRG4= <mlev>
##$CPDPRG5= <mlev>
##$CPDPRG6= <mlev>
##$CPDPRG7= <mlev>
##$CPDPRG8= <mlev>
##$CPDPRGB= <>
##$CPDPRGT= <>
##$D= (0..31)
0 1 0 0 0 0 0 0 0 0.06 0 0 0 0 0 0 0.0002 0 0 0 0 0 0 0 0 0 0 0 0 0 0 
0 
##$DATE= 1114512038
##$DBL= (0..7)
120 120 120 120 120 120 120 120 
##$DBP= (0..7)
150 150 150 150 150 150 150 150 
##$DBP07= 0
##$DBPNAM0= <>
##$DBPNAM1= <>
$$ [...]
##$SUBNAM7= <"">
##$SUBNAM8= <"">
##$SUBNAM9= <"">
##$SW= 20.6930455092707
##$SWIBOX= (0..15)
0 0 3 0 0 0 0 0 0 0 0 0 0 0 0 0 
##$SW_h= 5175.983436853
##$TD= 65536
##$TD0= 1
##$TE= 295.16
##$TE2= 300
##$TE3= 300
##$TEG= 300
##$TL= (0..7)
0 120 120 120 120 120 120 120 
##$TP= (0..7)
150 150 150 150 150 150 150 150 
##$TP07= 0
##$TPNAME0= <>
##$TPNAME1= <>
##$TPNAME2= <>
##$TPNAME3= <>
##$TPNAME4= <>
##$TPNAME5= <>
##$TPNAME6= <>
##$TPNAME7= <>
##$TPOAL= (0..7)
0.5 0.5 0.5 0.5 0.5 0.5 0.5 0.5 
##$TPOFFS= (0..7)
0 0 0 0 0 0 0 0 
##$TUNHIN= 0
##$TUNHOUT= 0
##$TUNXOUT= 0
##$USERA1= <user>
##$USERA2= <user>
##$USERA3= <user>
##$USERA4= <user>
##$USERA5= <user>
##$V9= 5
##$VALIST= <valist>
##$VCLIST= <CCCCCCCCCCCCCCC>
##$VD= 0
##$VDLIST= <DDDDDDDDDDDDDDD>
##$VPLIST= <PPPPPPPPPPPPPPP>
##$VTLIST= <TTTTTTTTTTTTTTT>
##$WBST= 1024
##$WBSW= 4
##$XGAIN= (0..3)
0 0 0 0 
##$XL= 0
##$YL= 0
##$YMAX_a= 280469
##$YMIN_a= -294047
##$ZGOPTNS= <>
##$ZL1= 120
##$ZL2= 120
##$ZL3= 120
##$ZL4= 120
##$ABSF1= 16.45287
##$ABSF2= -4.240303
##$ABSG= 5
##$ABSL= 3
##$ALPHA= 0
##$AQORDER= 0
##$ASSFAC= 0
##$ASSFACI= 0
##$ASSFACX= 0
##$ASSWID= 0
##$AUNMP= <proc_1d>
##$AZFE= 0.1
##$AZFW= 0.1
##$BCFW= 0
##$BC_mod= 0
##$BYTORDP= 0
##$COROFFS= 0
##$CY= 12.5
##$DATMOD= 1
##$DC= 0
##$DFILT= <>
##$DTYPP= 0
##$F1P= 14.0000005364418
##$F2P= -0.99999901652339
##$FCOR= 0.5
##$FTSIZE= 32768
##$FT_mod= 6
##$GAMMA= 0
##$GB= 0
##$INTBC= 1
##$INTSCL= 1
##$ISEN= 128
##$LB= 0.3
##$LEV0= 0
##$LPBIN= 0
##$MAXI= 10000
##$MC2= 0
##$MEAN= 0
##$ME_mod= 0
##$MI= 0
##$NCOEF= 0
##$NC_proc= -4
##$NLEV= 6
##$NOISF1= 0
##$NOISF2= 0
##$NSP= 0
##$NTH_PI= 0
##$NZP= 0
##$OFFSET= 16.45287
##$PC= 1
##$PHC0= -72.72659
##$PHC1= 16.18221
##$PH_mod= 1
##$PKNL= yes
##$PPARMOD= 0
##$PSCAL= 4
##$PSIGN= 0
##$REVERSE= no
##$SF= 250.130017290324
##$SI= 32768
##$SIGF1= 0
##$SIGF2= 0
##$SINO= 400
##$SIOLD= 32768
##$SREGLST= <1H.CDCl3>
##$SSB= 0
##$STSI= 32768
##$STSR= 0
##$SW_p= 5175.98343685301
##$SYMM= 0
##$S_DEV= 0
##$TDeff= 65536
##$TDoff= 0
##$TI= <Analysis number 999999
Compound Code 99
Book Reference 9
Project Code 9>
##$TILT= no
##$TM1= 0
##$TM2= 0
##$TOPLEV= 0
##$USERP1= <user>
##$USERP2= <user>
##$USERP3= <user>
##$USERP4= <user>
##$USERP5= <user>
##$WDW= 1
##$XDIM= 32768
##$YMAX_p= 298096671
##$YMIN_p= -582812
$$ End of Bruker specific parameters
$$ ---------------------------------
##NTUPLES= NMR SPECTRUM
##VAR_NAME=  FREQUENCY,     SPECTRUM/REAL,   SPECTRUM/IMAG
##SYMBOL=    X,             R,               I
##VAR_TYPE=  INDEPENDENT,   DEPENDENT,       DEPENDENT
##VAR_FORM=  AFFN,          ASDF,            ASDF
##VAR_DIM=   32768,         32768,           32768
##UNITS=     HZ,            ARBITRARY UNITS, ARBITRARY UNITS
##FACTOR=    0.157963299565203, 1,           1
##FIRST=     4115.35651132023, 0,            0
##LAST=      -1060.62692553278, 0,           0
##MIN=       -1060.62692553278, -582812,     0
##MAX=       4115.35651132023, 298096671,    0
$$ Real data points
##PAGE= N=1
##DATA TABLE= (X++(R..R)), XYDATA
$$ [...]
14282a43271j9952p9629M6174J18732R867q3646P891Q1427Q5173l114p7933p8302
14270a36583n7322L3113M0955n9042K8502o3534q141O7314M3894J2671K9750Q6338
14258A7915j04299o4486J27446j5616k4849J07356R4080p4474q9254l3702L4963
14247b4920j19480N083J51226M4537j8702r8561k4307J6940L0931q7917j5735
14236a40905K6736j3279J37478m2722j43334m7576P8500J2177N428l3274P2529
14225h8242L0982P1425l6197o6888Q603M2641m9949R8370M8503M714L6736j1835
14213H8863p8458l3326m1523j289o5774l3082p4636p0381O6747J12221M6338R0673
14201F373R5139P6658K4022j20615r6634j08577k2121k0226k7270Q3674Q9332
$$ plain form
14282 -143271 -163223 -242852 -196678 -77946 -68079 -151725 -143834 -62407 22766 19652 -58281 -136583
14270 -136583 -193905 -160792 -119837 -178879 -150377 -213911 -222052 -154738 -110844 -98173 -68423 17915
14258 17915 -86384 -150870 -23424 -39040 -63889 43467 137547 63073 -26181 -59883 -24920
14247 -24920 -144400 -139317 11909 56446 37744 -60817 -85124 -68184 -37253 -125170 -140905
14236 -140905 -114169 -127448 10030 -32692 -176026 -223602 -145102 -132925 -127497 -160771 -88242
14225 -88242 -57260 14165 -22032 -88920 -80317 -37676 -87625 10745 59248 63962 100698 88863
14213 88863 10405 -22921 -64444 -65733 -131507 -164589 -239225 -309606 -242859 -130638 -84300 6373
14201 6373 101512 178170 202192 81577 -15057 -123634 -145755 -165981 -193251 -109577 -20245
14190b0245N6834P0413m673k475J84m3941j0138r6743j87312J8370R0772Q1239
14178d7715M3952p1121j2308k6931k720L6402M5313r812J11429K8672P1364l248
14166A63277q3909p8920j5580J6269M545O3133L0912m4107r5348j50094P9457
14155a10365P8624K0758J3819K4546J3862j1009k1168P9833M420L7999j9270k41
14143A11808o714o702P999m3781m0485m5965P2992R3374j29640m8925N1231J4337
14131B9529o5934k0935J09883J79912K6558q865N6403J10674J97949N8421j7415
14120F56180n8154j34256q0035p7554k9928k1639O3592n2367n4835J4604N6655
14109B82263j8590K9822J8731j07248m0602J0438q1575K1881m2504p7287o901
$$ plain form
14190 -20245 36589 107002 102329 99854 100038 56097 45959 -50784 -238096 -219726 -128954 -47715
14178 -47715 -3763 -74884 -87192 -114123 -116843 -80441 -35128 -44940 66489 95161 166525 163277
14166 163277 79368 448 -15132 1137 5682 68815 99727 55620 -39728 -189822 -110365
14155 -110365 -31741 -10983 2836 27382 41244 30235 9067 88900 93320 131319 112049 111808
14143 111808 105094 98392 106391 62610 22125 -23840 49152 142526 12886 -36039 15192 29529
14131 29529 -36405 -57340 52543 232455 259013 250148 306551 417225 615174 673595 656180
14120 656180 598026 463770 383735 306181 276253 254614 318206 265839 211004 225608 282263
14109 282263 263673 293495 312226 204978 164376 174814 93239 115120 72616 -4671 -11572
14098a1572k856j24706K1860Q2010l7041n1578R0309l900p0833N550o128J40838
14086C1953J55362K0387K2379M8705P114m4870k5499R6026J08945J35588N250
14075E61340j70551p6025r1008l6234L6415R7973J3643o1041o8815L3663l1874
14064B07486p3169m7559r0123J5284J2404M3376j06998q4420j2424o888K9315
14053a13716J6878k9571Q5299P4765o4292L5620J8700p5202n743J53089J3822
14042A09649j02509k2734n0767L9605j7927O2854N7239j8700K2073L4703N9814
14031A73300R6298j8291j30432o0590j06680j4206K4408L7778n7220q1185O6730
14020g0090K1191n5049L8097J5467L6469O5377n978m0079o0074p0054J36511N582
$$ plain form
14098 -11572 -14428 -139134 -117274 -35264 -72305 -123883 -33574 -37474 -108307 -102757 -108885 31953
14086 31953 187315 207702 230081 278786 285900 241030 215531 311557 420502 556090 561340
14075 561340 390789 314764 223756 187522 223937 321910 335553 274512 205697 239360 207486
14064 207486 134317 86758 -3365 11919 24323 67699 -39299 -123719 -136143 -143031 -113716
14053 -113716 -96838 -126409 -41110 33655 -30637 4983 23683 -51519 -57262 95827 109649
14042 109649 7140 -15594 -66361 -26756 -44683 18171 75410 56710 78783 113486 173300
14031 173300 269598 251307 120875 60285 -46395 -60601 -36193 1585 -55635 -136820 -70090
14020 -70090 -48899 -103948 -65851 -50384 -13915 51462 45484 5405 -54669 -124723 11788 17370
14008A7370j01194o7296j17088J10888J01239K5205j2902p469O6685J0422o3480
13997c7620r457p3167Q1346K1978p3466j12437K6644j6072K393o4047l2453P8629
13985b07729j5876J37016O8977p6061J0137M2442K7787m0819j9878k9550j24231
13974b27785j11454l6432J50622N3400j3283n56o6688J959J49165P3185k78J12917
13962H4772Q1000j2986m2112l0475q0745j46620j61508m6817O5461J9110K4736
13951b46184J19760Q956N8624R8730J2528l3439M3727N1030q0874p9409k0806
13940f7357N7939j286j10803q6124n6275J02744J11605N889n1638l8485L6864
13929i6927J5667M535k2434j9685n715j10824K3545J19171K5818o0128R0887L6881
$$ plain form
14008 17370 -83824 -151120 -268208 -157320 -56081 -30876 -43778 -51247 15438 25860 -37620
13997 -37620 -47077 -120244 -38898 -16920 -90386 -202823 -176179 -192251 -189858 -253905 -286358 -207729
13985 -207729 -223605 -86589 -17612 -93673 -83536 -41094 -13307 -54126 -74004 -103554 -227785
13974 -227785 -339239 -375671 -225049 -171649 -184932 -185488 -252176 -250217 -101052 -27867 -28145 84772
13962 84772 165772 152786 110674 80199 -546 -147166 -308674 -355491 -290030 -270920 -246184
13951 -246184 -126424 -117468 -58844 39886 52414 18975 62702 113732 32858 -46551 -67357
13940 -67357 -9418 -10704 -121507 -207631 -263906 -161162 -49557 -43668 -95306 -133791 -96927
13929 -96927 -81260 -76725 -99159 -118844 -124559 -235383 -211838 -92667 -66849 -126977 -36090 791
13917G91J15102j2015o4627m9103o1232k6631n1107m3091j4240J19392O0036p1807
13905i8532o1542L5787J00242o7427j00027N6386l3924p9848k131P622P6139L0045
13893a37210m4630K2399R2324m8861k4691L0692n445k1937l8765L7926M2625m2124
13881a37697J30288j3691q8516M3074L6244L4618K6399R5443j30535j16273O2695
13870e7951J2778M0734J17683J4685r9268j3195r871n6396q2929o9184J5142n1369
13858b39141L1003J06747J61061k8803K8012J1976r2185n2175N2501o635k0100
13847d7739m6156j01030l8824P8112K30986J5406n2197j4867m9276J0637N5478
13836D0530o2932o3002n7693P619Q8885m115r4669j6350P3774R5273K3299n7298
$$ plain form
13917 791 115893 103878 39251 -9852 -71084 -97715 -148822 -191913 -206153 -86761 -26725 -98532
13905 -98532 -160074 -124287 -24045 -91472 -191499 -135113 -169037 -248885 -251016 -243394 -167255 -137210
13893 -137210 -181840 -159441 -67117 -115978 -140669 -109977 -115422 -137359 -176124 -138198 -95573 -137697
13881 -137697 -7409 -21100 -109616 -66542 -30298 4320 30719 126162 -4373 -120646 -57951
13870 -57951 -45173 -4439 113244 127929 28661 15466 5595 -50801 -133730 -202914 -187772 -239141
13858 -239141 -208138 -101391 59670 30867 58879 70855 -21330 -73505 -21004 -27639 -47739
13847 -47739 -93895 -194925 -233749 -155637 75349 90755 38558 23691 -25585 -14948 40530
13836 40530 -22402 -85404 -143097 -135478 -46593 -50708 -145377 -161727 -87953 7320 30619 -26679
13824b6679K9694j3290m6949n9980l0227K3009R6819j5298k0007J9994q4283l8533
13812a65730J29558J07128r2372j25508O0982L8306M5538o2763p7398l961P0992
13801g5228L3359j0764o7785r8293q24O0142N2459K9474J03884O3349j23182r641
13789d3050P4695j3401K8153m2825m8925k9546R8017j6939r0303m0063M2636Q7009
13777E458P2787K9844n3135m0421L6251J02314o889J1694M5671m5127K6472l5921
13765A48998p8516J3569p4153J9241j1165m7453p531J6213j2591M7192M816Q6333
13753A04953M8073N6664O7662M2902K7965r474o5007j12544P531J9614n2041q8235
13741D8063N55P5313J26461J38359J59551J12597n3519j0964K2482M2658J8728
$$ plain form
13824 -26679 3015 -10275 -57224 -117204 -147431 -124422 -27603 -42901 -62908 -42914 -127197 -165730
13812 -165730 -36172 70956 -21416 -146924 -85942 -47636 -2098 -64861 -142259 -146220 -75228
13801 -75228 -41869 -52633 -120418 -218711 -219535 -159393 -106934 -77460 26424 89773 -33409 -43050
13789 -43050 31645 18244 46397 3572 -45353 -74899 23118 6179 -84124 -124187 -81551 5458
13777 5458 78245 108089 54954 14533 50784 153098 146209 157903 203574 158447 184919 148998
13765 148998 70482 84051 9898 29139 17974 -29479 -37010 -20797 -33388 13804 18620 104953
13753 104953 153026 209690 277352 320254 348219 338745 273738 161194 168725 188339 136298 48063
13741 48063 48618 123931 250392 388751 548302 660899 607380 596416 618898 661556 680284
13730F80284q856N8899K06107K15629J37077J04437N5988Q4808J84586J51714
13720A870673K50087K50394L07824L79035O29338Q66081R96120J142146J363446
13711H055144J538171K064875K759305L657094N204732O837794P431814N370550
13703D2919479K4310n058641p102016o329933m639540l158521k028255j522353
13695A3104530j105909p03168p12658r87797r92662p55792o44582o64101n42651
13686E995210l55034k75645j61565r4824l7447L8889J02264N556J23462L66457
13676E707323N86335O73708P35172Q33355J317701J611981K181460K759632L424756
13667A9831423L958315M615399N605823P505396J0624653J5186135K0799048K4529246
$$ plain form
13730 680284 671428 730327 936434 1152063 1289140 1393577 1449565 1534373 1718959 1870673
13720 1870673 2120760 2371154 2678978 3058013 3687351 4553432 5549552 6691698 8055144
13711 8055144 9593315 11658190 14417495 18074589 23279321 30117115 37548929 42919479
13703 42919479 42943789 37885148 30783132 24453199 19813659 16655138 14626883 13104530
13695 13104530 11998621 11295453 10582795 9594998 8602336 7846544 7201962 6537861 5995210
13686 5995210 5640176 5364531 5202966 5108142 5070695 5109584 5211848 5217404 5340866 5707323
13676 5707323 6293658 6967366 7702538 8535893 9853594 11465575 13647035 16406667 19831423
13667 19831423 23789738 28405137 34010960 41516356 52141009 67327144 88126192 112655438
13659A12655438K1039971N345853j5104281k4055155k2212816j6250791j0711575
13652E0706644o860982m633441l159263k531007k715176l225404l130953k894740
13644B1555678k403840k012217j635139j388303j192944r83975p97899n43996
13636A0597365n39841m76939l43724j08221L1249K02361L95321N79896P99649
13627A1137116J096779J490340J949506K543879L308413L893087M424962N289766
13619C5133848P035070J0065067J4271595J9767046K4377735K3072636R699039
13612A43422036j1877592k4117825k3918807j7985556j1990263p817026n130635
13605D0584332l342968k567052k695160l143387l287465l116815k645590k194605
$$ plain form
13659 112655438 133695409 139041262 123936981 99881826 77669010 61418219 50706644
13652 50706644 43845662 39212221 36052958 33521951 30806775 27581371 24450418 21555678
13644 21555678 19151838 17139621 15504482 14116179 12923235 11939260 11141361 10597365
13636 10597365 10057524 9580585 9236861 9128640 9159889 9362250 9757571 10337467 11137116
13627 11137116 12233895 13724235 15673741 18217620 21526033 25419120 29844082 35133848
13619 35133848 42168918 52233985 66505580 86272626 110650361 133722997 143422036
13612 143422036 131544444 107426619 83507812 65522256 53531993 45714967 40584332
13605 40584332 37241364 34674312 31979152 28835765 25548300 22431485 19785895 17591290
13597A7591290j871687j532896j244623j097069j017056q67481p97421p16147
13589H446910n78956l81379l50058m14826j04215J5498K66927L06390L95877N60249
13579H162417O87273R48322J156234J436283J636016K264716L113869M487646
13571B3892776O129025P746832P473702L714452k708744p104892p783831o335067
13563B5024253m311679k930907j928072j288149r01178r46440j070928j185733
13555A0461167j010408r86763q85415p03821n10122m27655l63862l17969l16041
13546D939111l09529k77779l04828k80416k75908j29043j03595j81410k25589
13537B851014j06314k2597n3816p8509o131Q1512j9720q9947L3623J20102K12624
$$ plain form
13597 17591290 15719603 14186707 12942084 11845015 10827959 9960478 9163057 8446910
13589 8446910 7867954 7486575 7136517 6721691 6617476 6632974 6899901 7206291 7602168 8162417
13579 8162417 8849690 9798012 10954246 12390529 14026545 16291261 19405130 23892776
13571 23892776 30021801 37768633 45242335 48956787 46248043 39143151 31359320 25024253
13563 25024253 20712574 17781667 15853595 14565446 13664268 12717828 11646900 10461167
13555 10461167 9450759 8463996 7578581 6874760 6364638 5936983 5573121 5255152 4939111
13546 4939111 4629582 4351803 4046975 3766559 3490651 3361608 3258013 3076603 2851014
13537 2851014 2744700 2722103 2668287 2589778 2583647 2665159 2645439 2555492 2589115 2709217 2921841
13526B921841J77180K91383K20646m4353k94372l39501k21793j39156j51344q3815
13516B336716m7495O7708k233o1228p5172j51515j1517m900J07087R571P1916
13505B238938J5155J11052Q3864m2457k03522j17172K6586j4581q1560j4907J14191
13494B115587K0917k2587j6984N8013P6096k8390K7565M6580J26817R3993J24593
13483B622200P7162l7566J72962K47982K84282L7491l24463m69932k67497k05277
13473B137344j61343o8836N2606M7388O328N5464r7941r4114j06876j00988r5888
13462A573144K2459K6770M0346J05645M4730l6040o3718n7159J26796M8967J51268
13451A983208J39084R8443J51538K54852J01548Q0602N1311j26157j61118j68205
$$ plain form
13526 2921841 3099021 3390404 3611050 3566697 3272325 2932824 2711031 2571875 2420531 2336716
13516 2336716 2289221 2356929 2354696 2293468 2218296 2066781 2055264 2050364 2157451 2167022 2238938
13505 2238938 2254093 2365145 2449009 2406552 2203030 2085858 2112444 2097863 2016303 2001396 2115587
13494 2115587 2136504 2113917 2096933 2154946 2231042 2202652 2230217 2276797 2403614 2497607 2622200
13483 2622200 2699362 2661796 2834758 3082740 3367022 3404513 3080050 2610118 2342621 2137344
13473 2137344 1976001 1907165 1959771 2007159 2013487 2068951 1971010 1876896 1770020 1669032 1573144
13462 1573144 1595603 1622373 1662719 1768364 1813094 1777054 1713336 1656177 1782973 1831940 1983208
13451 1983208 2122292 2220735 2372273 2627125 2728673 2809275 2860586 2734429 2573311 2405106
13441B405106M0458K4159q3177j43290j37941m4724P6581J06579p038j45858j85992
13430A904863j34173m9264j26765l9534j11062L741J40438J14935O4789J9836
13420A787804k492m3648j17781j45121p6956l5363J7783N6584m3064k4280N1630
13409A425096P3766J09788J36812J05590J58714K09565J97565J78525J65554n1667
13399B709308j55888k69105m20928k23941N061k796k8715j58120k1422k2957r000
13388A401497l9270j6300q2950l9731r7146j78405P3880K35263O6391n329P545
13377A325445K9786m9433m3159K3556J9323J3414p226M9551j206O3542L1543l1819
13365A423317q3962q0303M7193J989q080k0476j0830O0366J5748P4499L4591K0662
$$ plain form
13441 2405106 2445564 2469723 2386546 2243256 2105315 2060591 2137172 2243751 2236713 2090855 1904863
13430 1904863 1770690 1721426 1594661 1555127 1444065 1447806 1588244 1703179 1767968 1787804
13420 1787804 1785312 1741664 1623883 1478762 1401806 1366443 1384226 1440810 1397746 1373466 1425096
13409 1425096 1498862 1608650 1745462 1851052 2009766 2219331 2416896 2595421 2760975 2709308
13399 2709308 2553420 2284315 1863387 1639446 1644507 1641711 1612996 1454876 1433454 1410497 1401497
13388 1401497 1362227 1345927 1262977 1223246 1126100 947695 1021575 1256838 1323229 1317900 1325445
13377 1325445 1355231 1305798 1262639 1286195 1305518 1318932 1311706 1361257 1360051 1423593 1455136 1423317
13365 1423317 1339355 1259052 1306245 1308234 1300154 1279678 1268848 1329214 1344962 1419461 1454052 1474714
13353A474714o1950k01793j80869o1948n4443j2710l9588P100K5954M6185M0973
13342I81625l1684k6917K38J9287L4851o7146j3167K1799N430m8450o0151R0644
13330I06359j3051K5090Q2017k1862j14373o4002R1913K21817j583m0494o2292
13319A009539k9456m2889p9418o7582M4397K9533k6158j862n0619J7410q1657
13308G21238r050O9479r654o7349j12056q4471M4101k2483M4415j9660l5994M8962
13296E67478P6743M2754J0359m7012k8011l4689m862J1352P3160m155j11730k4964
13284E26423P2261L6566R6822j4681J238O5644m151l5358N3914O8087m9250j06410
13272G11105j20532m4844J16296Q5081P2875N5302j03526o3884q5282m8353o4620
$$ plain form
13353 1474714 1412764 1210971 1030102 968154 913711 901001 861413 868513 894467 940652 981625
13342 981625 949941 923024 923262 942549 977400 910254 897087 918886 924316 875866 815715 906359
13330 906359 893308 918398 1000415 978553 864180 800178 892091 1113908 1112325 1071831 1009539
13319 1009539 980083 937194 857776 790194 834591 864124 837966 836104 785485 802895 721238
13308 721238 712188 781667 772013 704664 592608 508137 552238 529755 574170 554510 518516 567478
13296 567478 644221 686975 697334 650322 622311 587622 582760 594112 667272 663117 551387 526423
13284 526423 598684 635250 732072 717391 718629 784273 780122 744764 798678 866765 817515 711105
13272 711105 590573 545729 662025 747106 819981 875283 771757 707873 622591 574238 509618
13261E09618r1022j15550L5986J40364P6268r0271n7635m6075k2733p8932L9781
13250B99799o03L8998J03709J28525K6447l6615j33076J1923j0699p2111M9856
13239D06153J22190P8992J2460M2173J9016K213j05272k5778p8842m62K421m1403
13227D33861j5697k6936N9010R0892L6307k7633J1829j26361j27106p606O4916
13216C65476l6354r3032j8315J16636M6768N6885k3615J5961M2523n2025n7464
13205C63444k8377K2808M5293N3845L3188k4420J91952L4110j48390q9195r3505
13194C60753L5412P1550m8673O2323J12881Q2339J29715J46424l2432k2941j08569
13183G88782j09680p1192m1551p2027p7959O7380N4928l8623J2218O9827Q829
$$ plain form
13261 509618 418596 303046 339032 479396 555664 465393 407758 361683 338950 260018 299799
13250 299799 299196 338194 441903 570428 596875 560260 427184 439107 428408 356297 406153
13239 406153 528343 607335 619795 661968 680984 683197 577925 552147 473305 472843 475264 433861
13227 433861 418164 391228 450238 541130 577437 549804 561633 435272 308166 300560 365476
13216 365476 329122 236090 217775 334411 381179 438064 414449 430410 472933 420908 363444
13205 363444 335067 357875 403168 457013 490201 465781 657733 691843 543453 454258 360753
13194 360753 396165 467715 419042 481365 594246 676585 806300 952724 920292 897351 788782
13183 788782 679102 607910 566359 494332 416373 483753 538681 500058 512276 582103 590932
13172E90932J2463o1764j49295m9981j8038K4084n5874k9378k9814J2023P8539
13161C23897l4033q8027o3088M7192J29026P4834P125q668n6592k1145n9304n5606
13149A95611N3699K5150O3832R0025J89205R4671P6444J36177J03494o8754j13135
13138H46419j05372j06886p0041r6113o9278J4509k0957Q709J3590o9743l883
13127C40954L651j51572k0846J01941O5646m3174j01310j1422R813m9370K3749
13116A68060K1957m9476J21791R5373M4526o7007l4857n8593J01086M3400n520
13105C80740K2415j12502j74882M6930J87672r903O2652Q8452J9885k2283o2916
13094D26260l4332k6741N2858K3668j28023p4752n3K4598J4607m3175k6084j7578
$$ plain form
13172 590932 603395 541631 392336 342355 324317 348401 292527 263149 233335 245358 323897
13161 323897 289864 201837 138749 185941 314967 389801 396926 388258 331666 310521 251217 195611
13149 195611 249310 274460 338292 428317 617522 712193 788637 924814 1028308 959554 846419
13138 846419 741047 634161 564120 468007 398729 413238 392281 400990 414580 344837 340954
13127 340954 344605 193033 172187 274128 339774 296600 195290 183868 193681 144311 168060
13116 168060 190017 140541 262332 357705 402231 335224 300367 241774 342860 386260 380740
13105 380740 403155 290653 115771 162701 350373 340470 403122 491574 511459 489176 426260
13094 426260 391928 365187 418045 441713 313690 238938 238885 263483 278090 234915 208831 191253
13082A91253l4203l0703O0115J24968M9489r9230j63010k7365P251P8625J60976
13071C18166J9523o8749q0560j18031J0469M687Q1038R4729Q2563p04o8659j8185
13059B56287Q2429J64048J87192j2489L3874J40970J27222l8301n0559j64088
13049G26585k43191n5158R728q0698j64n1940o7162Q1655P4957O5166o3327j07426
13037B89025J4985l3931Q330j26745m2593R7502L3070q929P398k8724o4545K6236
13025A71079N3068j6052M0637o741k169m250q127P995o3277n8206J2034O1561
13013A87552N6930l3345p8835j6143j24951J70598K2537m3114J4377M642J1091
13002A71339n961K5303j1825m8582N556J16222J03173q3769j9847m9713p009j2153
$$ plain form
13082 191253 157050 126347 186462 311430 360919 261689 98679 71314 78565 157190 318166
13071 318166 337689 268940 188380 70349 80818 85505 166543 261272 343835 343131 274472 256287
13059 256287 338716 502764 689956 677467 711341 852311 979533 941232 890673 726585
13049 726585 483394 428236 437964 357266 357102 305162 238000 319655 394612 459778 396451 289025
13037 289025 304010 270079 278409 151664 109071 206573 239643 230714 238112 209388 144843 171079
13025 171079 224147 208095 248732 241991 239822 235572 227445 235440 172163 113957 125991 187552
13013 187552 244482 211137 132302 116159 -8792 161806 184343 141229 155606 160248 171339
13002 171339 165378 190681 178856 130274 135830 252052 355225 271456 251609 201896 194887 182734
12990A82734q66O0827O3493J42573J00880M38m5368N7424K03163K83406L26657
12979A375361L39339J39140j03996j16668k71749k61648j91692k30299m9406l8656
12969E89726L7424O1053k4486j2546j83321q8657M4365n4747L3543m7008j32201
12958B23145l8640K1072M3043J50574L7720l1546q3562k0994j0691j16885K5277
12947A98513j9610p4908l3986q360J1707n3600Q0970m2726J4438N3054Q093k1011
12935A12574k0528l3485K0416Q0413K3629j51467j29296K9941J57787M3084J3106
12924A46174l3935o041m242Q473j11r5446o7373Q5192k8318q9604L6445M0823
12912g963N7825J16219K9900J2468J13991m5721j13978N7345k7235l0552N9058
$$ plain form
12990 182734 181868 242695 306188 448761 549641 550079 504711 562135 765298 1048704 1375361
12979 1375361 1714700 1853840 1749844 1633176 1361427 1099779 908087 677788 628382 589726
12969 589726 627150 688203 663717 651171 467850 379193 423558 368811 402354 355346 223145
12958 223145 184505 205577 248620 399194 436914 405368 321806 300812 290121 173236 198513
12947 198513 178903 103995 70009 61649 73356 19756 100726 58000 72438 125492 133585 112574
12935 112574 92046 58561 78977 159390 183019 31552 -97744 -67803 89984 133068 146174
12924 146174 112239 106198 101956 110429 110318 14872 -52501 32691 4373 -85231 -48786 -7963
12912 -7963 49862 166081 195981 208449 322440 276719 162741 220086 192851 162299 221357
12901B21357O1049k8816j8485J2361k6518o9960l0970L5824J48298J48331J69560
12890F22031R2342J0952k9092k12122j55301q2130r6588R417J18637m0866m4281
12879A92999N7368R5712O4213o4459l9848k4021k42K1276r254J17247J26335J1359
12867E48685J36175K05094K45386K22004K30180O3852j4379j01745k44962k43731
12857A046559k41466o5088j8228p8262m9345o8273O4924P0506K7888Q5994K5036
12846H00245j00166j80253j73926j5087J1502l4270j14314O2482J30815O9264
12836D56292j48346m1458J9490k5119r369o0237O7768J7611j97642j53170q3531
12825a57711j1790J35893J03663K7821l9636Q2020L5778J0449o2346j32270M4132
$$ plain form
12901 221357 282406 253590 235105 247466 220948 150988 120018 155842 304140 452471 622031
12890 622031 714373 725325 696233 484111 328810 246680 150092 159509 278146 237280 192999
12879 192999 250367 346079 410292 345833 305985 281964 281722 302998 293744 410991 537326 548685
12867 548685 684860 889954 1135340 1357344 1587524 1651376 1636997 1535252 1290290 1046559
12857 1046559 805093 740005 721777 643515 594170 525897 590821 661327 689215 775209 800245
12846 800245 700079 519826 345900 330813 342315 308045 193731 256213 387028 456292
12836 456292 307946 266488 285978 260859 251490 191253 259021 276632 78990 -74180 -157711
12825 -157711 -169501 -33608 70055 97876 58240 140260 176038 186487 124141 -8129 36003
12814C6003P5099n1421j35857K8649J61096O9287L725K8097J4938o007n0291L9798
12802B13116L3704j05163m9835L3080J3563j8358j00503R1630Q6448J59510J42408
12791D99600j2297N6641R2657K30925P7707j41058q7122j42017j5272o3632r1437
12780D04695P1046m1390N0566J10868k2067K3899p5648j18639r1389n1184j02683
12769A58074q9232P7944R9342J6077P1605J2203m9245r4031l4614O0496L8329
12758B66948n819k7189q6398j6983J01215J89359J90364r6500r5018j14674m0678
12747B64627q9421M168L3074L9855q348N7123k1903L097l6185l8940r5841m4459
12735F6847k1011j3576J5523n1436j7780Q8034M4882k7283J00344L4342K0946
$$ plain form
12814 36003 111102 59681 -76176 -47527 113569 182856 186581 214678 229616 223609 173318 213116
12802 213116 246820 141657 91822 124902 138465 120107 19604 111234 197682 357192 499600
12791 499600 487303 543944 636601 867526 945233 804175 717053 575036 559764 496132 404695
12780 404695 475741 434351 484917 595785 573718 597617 521969 403330 311941 260757 158074
12769 158074 68842 146786 246128 262205 333810 346013 296768 202737 168123 228619 266948
12758 266948 261129 233940 147542 130559 231774 421133 611497 514997 419979 305305 264627
12747 264627 175206 179374 212448 252303 243955 301078 279175 282272 246087 207147 111306 66847
12735 66847 45836 32260 47783 -3653 -21433 66601 111483 84200 184544 218886 239832
12724B39832k8305j3240p5801o4355M0100o7722j06497n3289J13460K8812K2630
12713C5625p7355M785R3857Q3294p580k6725k7337M7271p443J00512J52163j3006
12701C58061j26265l6762m4985n2538N9938k89l4876j4872o7493j8620K8365p0726
12689b1062J36879J21966m9102j03073k3292l2l8477J5021M4219k0175q3396j03102
12677a23626k7082R6812J24430j2207j7110n8762r984r4555N6027J37174K5371
12666I6488m6937L6089J9810n0195n6215J8005m9231j03976N3711L6788J5209
12655c0454j03722L2825M5213l7771N3112J55776j4599l1238M8695o4342J8527
12644G2022J6895l8033m9295l5442K6134m1745k1166Q0265O0929j991L3376K352
$$ plain form
12724 239832 211527 198287 122486 58131 98231 30509 -75988 -129277 -15817 12995 35625
12713 35625 -41730 -36945 56912 140206 132626 105901 78564 125835 118392 218904 371067 358061
12701 358061 231796 195034 150049 97511 157449 157160 122284 107412 39919 21299 49664 -21062
12689 -21062 115817 237783 188681 85608 62316 62284 23807 38828 83047 62872 -20524 -123626
12677 -123626 -150708 -53896 70534 58327 41217 -17545 -27529 -122084 -66057 71117 96488
12666 96488 49551 85640 105450 55255 -960 17045 -32186 -136162 -82451 -45663 -30454
12655 -30454 -134176 -101351 -56138 -93909 -40797 114979 100380 69142 117837 53495 72022
12644 72022 88917 50884 1589 -33853 -7719 -49464 -70630 9635 70564 68573 101949 104301
12632A04301Q4609r3952r9463K0984J05729k1456Q263l9858o007p7412r643O2856
12620C8951l5347q4829n3237L2378J52976J9047L6856J8o5846j23285K6451J15898
12608F0031j8282l7883M9151J1456m8534N0369N1781o2722L2665k7291k0682K2072
12596F2131L053j1779j04935q1187M9158J35835k392K1321M042j9818j0435O9169
12584A14163m0997j11234L9642K9227M4953J4808j00864j04350M9873Q414R8446
12573D2081Q7129K9059l3206O391Q201n9635j783J7391j61049p0540l14l7538
12561a73813R2376J21876L3574p6133J9208O5729K4306L1409K1238m497o3239
12550I2034j25361j3496P2592k7638q5436J39435N5677r4221N3956m0707k0153
$$ plain form
12632 104301 188910 94958 -4505 16479 122208 100752 109015 69157 63150 -14262 -23905 38951
12620 38951 3604 -81225 -134462 -102084 50892 69939 106795 106813 40967 -82318 -55867 60031
12608 60031 41749 3866 53017 64473 15939 66308 118089 55367 88032 60741 40059 62131
12596 62131 65184 53405 -51530 -132717 -83559 52276 49884 71205 75247 55429 44994 114163
12584 114163 73166 -38068 1574 30801 75754 90562 -10302 -114652 -64779 -56365 42081
12573 42081 129210 158269 125063 131454 139655 80020 78237 95628 -65421 -135961 -136275 -173813
12561 -173813 -81437 40439 74013 -2120 17088 82817 107123 138532 159770 155273 92034
12550 92034 -33327 -46823 25769 -1869 -87305 52130 107807 13586 67542 26835 6682
12539F682P0517P8231O8401n5406J5440k3893j8369O7353N9365r1652j02969m0433
12527C3267N2730M8875m5526P032m1345N3827M3649p9060m3632m5812l2281J00676
12515E2400M0895J7971M3457l7026m8748L9383o035o0239l5099N6490m348L0115
12503H9216j781k6292p4664n2438L1730N9369O4247O7187q5469L718K4665J41521
12491B41009L7722j1155M612j6764L4562o4708m4453j5187m3508N0656l7968L367
12479A38185p913R4124J07533J0414q4738m6125p4687o1420N1477P2733p943p9998
12467A11642N659q1112L3758N6776L0206Q1100l468J6983Q2803l6052j3557q5134
12455A99604m226q3780r8717k3941J01879P1593l0477k2921l8972M7050q3667
$$ plain form
12539 6682 77199 155430 223831 168425 183865 159972 141603 208956 268321 176669 73700 33267
12527 33267 85997 134872 89346 96378 55033 108860 152509 73449 29817 -15995 -48276 52400
12515 52400 93295 111266 154723 117697 68949 108332 102297 42058 6959 63449 59101 89216
12503 89216 87435 61143 -13521 -65959 -34229 25140 89387 156574 71105 74823 99488 241009
12491 241009 278731 267576 272188 255424 289986 225278 180825 165638 122130 172786 134818 138185
12479 138185 130272 224396 331929 342343 257605 211480 136793 75373 126850 199583 191640 111642
12467 111642 117301 36189 69947 126723 156929 238029 234561 251544 334347 298295 284738 199604
12455 199604 195378 111598 12881 -11060 90819 162412 131935 109014 70042 117092 33425
12444C3425M4428P7127k3897q4992l079L4857l3730n5968j8506J684l3202j0549
12432g2402J26484J57426O2065k3654r790L942Q1804j5958r8188k3189l7338m4961
12420A06241m6360R9774O4747M6883p5544Q444J31957r569q477m6556P2457N3856
12408C97853j7329l0879j45768r6777O5435K7770r6342o4384O3961M7336l1881
12397A18995k0176J5332M183P4931l9900j04734L9168J03543M2405n4995m9056
12386A29696j02749L1564O3943l1181n840m1122J1343k7084J3553M4110K0890
12375A07123p3854n6449L5062K4065Q7482M1210j8851j33128p5664J654L2508
12364b8842l8904l7051j2966L3237o2120O4262Q3824k1231r1926N173M9656n298
$$ plain form
12444 33425 77853 154980 131083 46091 43012 77869 44139 -11829 -30335 -28651 -61853 -72402
12432 -72402 54082 211508 273573 249919 240129 244071 325875 309917 211729 188540 151202 106241
12420 106241 59881 159655 224402 271285 195741 204185 336142 326573 318096 271540 343997 397853
12408 397853 380524 349645 203877 107100 172535 200305 103963 39579 103540 150876 118995
12397 118995 98819 114151 118334 193265 153365 48631 87799 191342 233747 178752 129696
12386 129696 26947 58511 122454 91273 85433 44311 55654 28570 42123 86233 107123
12375 107123 33269 -23180 11882 35947 123429 164639 145788 12660 -63004 -61350 -28842
12364 -28842 -67746 -104797 -117763 -84526 -146646 -82384 1440 -19791 -111717 -106544 -56888 -62186
12352f2186N4428R4643P8055k9080P0290K9107j16978r8360o1228L7029R7798
12341I3518R8305j13018o54J32064l861K6715o4450j58132r0540O087Q6446M9481
12329F1961q4602m1527m9085Q8694J1893M2547P4904P923k3831l2299l5615j6775
12317D188O9136O1404j2130o3399m5930j26826J01628K00102q0737k1467j5740
12306G0229j5463P8693Q8386l669j16973o8735L6100k3714K7147k5052J5117L7069
12294I9135L8748k9944o0936J6350K4626m023r9413J3289J02679j6704n375N2521
12282A30953r2317o4466P1071O4215p1378m6099L7382O5402l1234p3221n0274
12271e9966J5045k8256K9151J34609j5609k0451n543J3058K133l1602K8911m3637
$$ plain form
12352 -62186 -7758 86885 164940 135860 206150 235257 118279 19919 -41309 -4280 93518
12341 93518 191823 78805 78151 210215 206354 233069 168619 10487 -80053 -73966 12480 61961
12329 61961 -22641 -64168 -113253 -24559 -12666 29881 104785 112708 88877 56578 20963 4188
12317 4188 73324 134728 122598 59199 13269 -113557 -11929 188173 107436 85969 70229
12306 70229 54766 133459 221845 218176 101203 32468 68568 44854 72001 46949 62066 99135
12294 99135 137883 107939 47003 63353 87979 83956 -15457 -2168 100511 83807 78432 130953
12282 130953 38636 -25830 45241 109456 38078 -8021 29361 94763 63529 -9692 -59966
12271 -59966 -44921 -73177 -44026 90583 74974 54523 48980 62038 64171 32569 61480 17843
12259A7843J4130J20680Q7482p3075P0145l3149n9479p8598j73585k6062J5960
12248a17708K8364m779p603Q1161J20110p0855o6306Q7100J6190K7237q55j14952
12236b2896k2032k5107J8517N0977J6855k2711q6161K4177O2661l3356K2389m1365
12224e8052O520p3280n40N1563j9946l2016J30480K3706l857m9420k0285O0573
12212A5446J4301k4488n0619Q0012J29976j0674o9528o5680K7959J8648M9444
12201A14797P2535M7323N6130o7619p4270n9280k3966J10751m6466R697n8847
12190H0785q2565p753J06381L9016l4966n9109n6400p0235M6732K9445m7905j27123
12178a83697J2051J01036L6535J08222J811k6080k2358j745J7863J4593l372q0317
$$ plain form
12259 17843 31973 152653 240135 167060 237205 204056 144577 65979 -107606 -133668 -117708
12248 -117708 -89344 -94123 -101726 -20565 99545 28690 -37616 49484 65674 92911 92056 -22896
12236 -22896 -44928 -70035 -51518 -541 16314 -6397 -92558 -68381 -5720 -39076 -16687 -58052
12224 -58052 -51532 -124812 -125352 -73789 -93735 -125751 4729 28435 24578 -24842 -45127 15446
12212 15446 29747 5259 -45360 34652 164628 153954 84426 18746 46705 65353 114797
12201 114797 187332 234655 290785 223166 148896 89616 65650 176401 129935 139632 80785
12190 80785 -1780 -9533 96848 135864 100898 41789 -14611 -84846 -38114 -8669 -56574 -183697
12178 -183697 -171646 -70610 -34075 74147 75958 49878 27520 25775 43638 58231 54859 -25458
12166b5458J2720k5304m0567O9637j4495l1406j2632K8403l0004J70734l4231
12155F7397j20325R2027Q9840n493j7620q6794n0959q2167J0742q659J5078Q7921
12143i012J8102J8248J16381p4247q8847J76P116J9758L2509m8827n7071j19985
12131a85699J6881J81629k764r4019p2462P6937k1905Q7326q8596j7867J0014
12120a10525o627m1333k616Q7349O9185j8128J1125p4092k4327j9643l342N0801
12108h2173k7920K3136Q6056j1733M7443k263j17931L4663M3208p9679k4958J24198
12096A2047J10598o7085j9651o7586K554l2324P5427Q4563o9501R678j3178K5083
12084E0625o2814m1051M0000P4817K7833j982L4587j1554p2448o2864N3511N9333
$$ plain form
12166 -25458 -12738 -38042 -78609 -8972 -23467 -54873 -67505 -39102 -69106 101628 67397
12155 67397 -52928 39099 128939 123446 105826 19032 -31927 -114094 -103352 -112011 -96933 -9012
12143 -9012 9090 27338 143719 69472 -19375 -19199 -12083 7675 40184 -8643 -65714 -185699
12131 -185699 -168818 12811 10047 -83972 -156434 -79497 -101402 -14076 -102672 -120539 -110525
12120 -110525 -117152 -158485 -161101 -73752 -4567 -22695 -11570 -85662 -109989 -129632 -132974 -82173
12108 -82173 -110093 -86957 -901 -12634 34809 32546 -85385 -50722 -7514 -87193 -112151 12047
12096 12047 122645 55560 35909 -31677 -29123 -61447 13980 98543 29042 38720 25542 50625
12084 50625 -12189 -53240 -13240 61577 89410 87428 122015 110461 38013 -24851 28660 87993
12072H7993j12260q7533K8748j3297l4641J12994J01171j04977r103L1103L4731
12061C4929k2629o3040K2538J7165l974R7912j3196l7519L0836l7314q0050o5861
12049a20203r4963R9289J45440N9831J02687q6515l3584Q0009J4554k8090j1012
12038A27443J5252m5832n6363r1515m5677L6690O0376J8996J359n3094L0241J1934
12026I810J03956J28634Q3532L5355J23049J04710J50978q6471j84237j22142
12016C47174j27495j06757r9463Q2659j03455r4139J34198J9469p0182j4177O1608
12005B9440P668m9241j9965M54m7669J45640k7148l0033R2419o6613J5625N4796
11993A05373q1946J5813K677j5305l100M8694j036J1193j6563n3400k8724N573
$$ plain form
12072 87993 -24267 -111800 -83052 -96349 -130990 -17996 83175 -21802 -30905 198 34929
12061 34929 12300 -50740 -28202 -11037 -15011 82901 69705 32186 63022 25708 -54342 -120203
12049 -120203 -215166 -115877 29563 89394 192081 105566 71982 151991 166545 138455 127443
12038 127443 142695 96863 40500 -51015 -96692 -60002 374 19370 20729 -32365 -2124 9810
12026 9810 113766 242400 325932 361287 484336 589046 740024 653553 469316 347174
12016 347174 219679 112922 13459 96118 -7337 -101476 32722 52191 -17991 -32168 29440
12005 29440 37108 -12133 -32098 -31644 -79313 66327 39179 9146 101565 34952 50577 105373
11993 105373 23427 39240 41917 26612 23512 72206 71170 82363 65800 12400 -16324 -10751
11981a0751r338p752P8289O2386j6442j03299l5313M1866n2131k6002J991L3821
11969d2675M8003Q2863l5612q1016j2820L2292L6527j1738o3020j20991R3182
11958g5005O8684L274m8956m455M3354o1884J1932M2442L3941l4880n5126n4259
11946a30938j2320R0999J0884j3296n9753k3999L8568l2428P331m2396k237m564
11934a74149O9858R6633M7316p2528J2267O8599J5615k0240o4949J258P123l9289
11922e2486R9567M4292j49614j7592L8858L1989o6083k7633j4758Q0555q5689
11911a18594l1734J22971R6827j1204P4222n591q5767K8301p42l4122j4566O833
11899B6834J08571j02302o0815n8160j9454m4J17519L0859l8363q1714l2418L9916
$$ plain form
11981 -10751 -20089 -27841 50448 112834 96392 -6907 -42220 -354 -52485 -78487 -76496 -42675
11969 -42675 5328 88191 52579 -28437 -41257 -8965 27562 15824 -47196 -168187 -75005
11958 -75005 -6321 -3047 -52003 -56458 -13104 -74988 -63056 -20614 13327 -21553 -76679 -130938
11946 -130938 -143258 -52259 -41375 -54671 -114424 -138423 -99855 -132283 -124952 -167348 -169585 -174149
11934 -174149 -104291 -7658 39658 -32870 -20603 47996 63611 43371 -21578 -20320 -13197 -52486
11922 -52486 47081 91373 -58241 -75833 -36975 -4986 -71069 -98702 -113460 -32905 -118594
11911 -118594 -150328 -27357 69470 58266 132488 126897 41130 69431 68689 34567 20001 26834
11899 26834 135405 33103 -27712 -85872 -105326 -105370 12149 43008 4645 -77069 -109487 -69571
11887f9571M8746K0058J7803k6730Q2005J0542o0385L6172J0128o4220j10929
11876a06381n0795j3841K3153N0054L2340K2719N5811k2632l4955R7552J4449
11865F7474q9469j3551m1346j480l6038J6426j12671K4571K4493Q312L7827J22393
11853F941J5852n830N5578m5444l533J34872n5453o2561l1848K7426R4995K6247
11841A57242q3866q5815r3664R481J45608R6110L6329m0221p5310n4002p6666
11830f4774N555j896M055k7364J35377j2723l6701k4777K3955Q4267N9164o9253
11818G4885l5750k0654o069l2254o466M0830L8478k5534j15658p4538p03K9918
11806a33515M0213J45370J3213p6257J06864K0854K8027p8929j2421q8006M1168
$$ plain form
11887 -69571 -20825 -767 17036 -9694 72311 82853 22468 58640 68768 4548 -106381
11876 -106381 -157176 -171017 -147864 -97810 -65470 -42751 13060 -9572 -44527 53025 67474
11865 67474 -21995 -35546 -76892 -78372 -114410 -97984 -210655 -186084 -161591 -153279 -115452 6941
11853 6941 22793 16963 72541 27097 23564 158436 102983 40422 8574 36000 130995 157242
11841 157242 73376 -12439 -106103 -96622 48986 145096 181425 141204 65894 11892 -64774
11830 -64774 -59219 -61115 -57060 -84424 50953 38230 1529 -23248 707 84974 144138 74885
11818 74885 39135 18481 12412 -19842 -26308 14522 53000 27466 -88192 -162730 -163433 -133515
11806 -133515 -93302 52068 65281 -10976 95888 116742 144769 65840 53419 -34587 6581
11795F581l6997O351N5390M092o1111j7352J05405o001M579n9921j2035k7119
11783c8138K7405k403p9884m1769L022L1339Q5453R6391Q531r1352o2458k2131
11771h5994P5371M4939P9690M3717m5955n888m283q3547n2934j5828p6973M6412
11759h1273J22279n0425P69j6097L1486L4319n8291n4025O6265O3479l0901L1394
11747E8979J1104r4644j8570P1895n8580j06916l1322J6821K1352p8228k9286
11736b37395J5153O9694j9540l3198L5734K5805O5227n3305j3203L2461L5777
11725g6790j6290J4517q7392N9967O5780j8072L8281K7473l0661p7094P1837N7774
11713B9330k0587j4934m7397j3546O0684R5281p213n1288n7587l9738L2646r563
$$ plain form
11795 6581 -30416 -24065 31325 35417 -25694 -43046 62359 56358 60937 1016 -11019 -38138
11783 -38138 -10733 -13136 -93020 -134789 -131767 -100428 -14975 81416 89947 -1405 -63863 -85994
11771 -85994 -10623 34316 114006 157723 111768 105880 101597 18050 -34884 -50712 -127685 -81273
11759 -81273 41006 -9419 -8650 -24747 6739 41058 -17233 -71258 -4993 58486 27585 58979
11747 58979 70083 -24561 -43131 28764 -29816 -136732 -168054 -151233 -129881 -208109 -237395
11736 -237395 -222242 -152548 -172088 -205286 -169552 -143747 -78520 -131825 -145028 -112567 -76790
11725 -76790 -93080 -78563 -165955 -105988 -40208 -58280 -19999 7474 -23187 -100281 -28444 29330
11713 29330 8743 -6191 -53588 -67134 -6450 88831 81618 30330 -27257 -66995 -34349 -43912
11701d3912l9427j32872p1392O2604J19800J746N5497m83O7565K8739o9666k1427
11689d3228o1050p5709J1312O4639o999L1259P2908K3074l4638j20125o0693j4821
11677b14071N8527M0790J7128q6332M9137N8874l0985q2049K6570J83535J12929
11666A34053L7781L8779m8142n4197q4626J4958Q1456m5293q6717n4598k420L5921
11654c3045L8524r3244r3345O0438R4570R6629M7440o0525L3170k4693r831R7861
11642A53949K8118r7633j18047M679P4732J5660L0798p3036n7947q7118J4398
11631a11447J09175j5522p7692O5999J33745O6029r1466p5777j16620q762L408
11620a18930O9443Q7189k0171r2413l6292k5207K4379K4489K0921o0100k0528
$$ plain form
11701 -43912 -83339 -216211 -287603 -224999 -105199 -103453 -47956 -48439 19126 47865 -21801 -43228
11689 -43228 -104278 -179987 -168675 -104036 -111035 -79776 -6868 16206 -18432 -138557 -199250 -214071
11677 -214071 -155544 -114754 -97626 -183958 -134821 -75947 -106932 -188981 -162411 21124 134053
11666 134053 171834 210613 162471 108274 23648 38606 120062 74769 -11948 -66546 -68966 -33045
11654 -33045 5479 -87765 -181110 -120672 -26102 70527 117967 57442 90612 65919 56088 153949
11642 153949 182067 84434 -33613 -28934 45798 61458 92256 19220 -38727 -125845 -111447
11631 -111447 -2272 -17794 -95486 -29487 104258 170287 78821 3044 -113576 -122338 -118930
11620 -118930 -49487 37702 17531 -74882 -111174 -136381 -112002 -87513 -66592 -126692 -147220
11609a47220Q6426J4159P4727J1892L5054N6484k4890l0662j3914p214p7910n7404
11597h0472P511K4058J2508R4004q040J953M651N1970o0322j77317j2751O7273
11585g4974K5994J12015p55j8544n6225l6593o59L8377k4306J9159J00753P1006
11573A55248N2360K6446n9791J6113M4681n5087k2160M878j7164k3794k0562l1010
11561G0158R7483N7658J7645k521q9329j26808l2056L6870J28350P5677m2715
11550A90412j11184j4572L8524j23464Q413p4307M0861R2735j8454J0765p8285
11539c8556j04655L1550K1962L708R6917P0260j05662K4155J63692P1877o7856
11528A67392j38827j1564J32506J7711j60064j33648k4350R3228J15607R2805
$$ plain form
11609 -147220 -60794 -46635 28092 39984 75038 131522 106632 75970 62056 54842 -23068 -80472
11597 -80472 -72961 -48903 -36395 57609 49569 51522 56173 108143 47821 -129496 -142247 -74974
11585 -74974 -48980 63035 62280 43736 -12489 -49082 -49741 -11364 -35670 -16511 84242 155248
11573 155248 207608 234054 174263 190376 235057 179970 157810 162688 145524 121730 101168 70158
11561 70158 167641 225299 242944 240423 151094 24286 -7770 29100 157450 233127 190412
11550 190412 79228 64656 103180 -20284 -11871 -86178 -45317 47418 28964 39729 -38556
11539 -38556 -143211 -111661 -89699 -85991 10926 81186 -24476 -321 163371 235248 167392
11528 167392 28565 17001 149507 167218 7154 -126494 -150844 -57616 57991 150796
11518A50796j4269N4892J3980L092p9451l5709m0869J5346n9851Q2832R0814L2573
11506B14176J1116r813M5150r1343n5689k8518j9618M5377P9181j86838q7060
11495h3879K1776K3374L298j5889J9972M0423N9534Q1372j3011m5378l6964l8413
11483A6215K3020L1832J4730m1391K3964L0950Q6423q9814k9565r4784n4502M199
11471g8723l9607p1652L177j2950P8442k0976K6126l8095K4993m9802Q2132O014
11459i0921k797j0311o5022M6992k627M8698P1359L2492p668n053O4313R0877
11447A70332j7380m5432l7224j31086j00742o6P5784N4859N233L5812K1132m2422
11435a1200M2939K7843m4295l6057J7790M5867k9396P784j8858l1163J357q0105
$$ plain form
11518 150796 136527 191419 205399 208491 129040 93331 52462 67808 7957 90789 181603 214176
11506 214176 225292 215479 260629 169286 113597 85079 65461 110838 190019 3181 -83879
11495 -83879 -62103 -38729 -35431 -51320 -31348 9075 68609 149981 136970 91592 54628 16215
11483 16215 39235 71067 85797 44406 68370 99320 185743 95929 66364 -28420 -82922 -78723
11471 -78723 -118330 -189982 -186805 -199755 -121313 -142289 -116163 -154258 -129265 -179067 -96935 -90921
11459 -90921 -93718 -104029 -169051 -122059 -124686 -75988 -4629 27863 20195 15142 79455 170332
11447 170332 152952 107520 70296 -60790 -161532 -161598 -85814 -30955 -25722 10090 31222 -11200
11435 -11200 31739 59582 15287 -20770 -2980 42887 13491 21275 2417 -28746 -27389 -107494
11423a07494j2831Q2304Q7199L6593k3615j1871q3279K6256l2886k3792K860L4034
11411b6522r5904o0389J13678L4937j42126o8815M687N4162n422m1829j9132P2669
11399a80006Q8819J61912R9340K598p4232k4602k5478r0854J089Q3872J4630j26372
11387f9284m8323P9191J13994l3880j02635l7335r641n7402K0413N1600L5877
11376e7425M6228k9885n1407M7791M8927J6146j6096J4962P0382J6348J4383k1006
11364I9348l7262n0260P858m1577K0687Q4893m2030L0395M7735R2835K4343p512
11352B29453p2448l9203q5883p2306j5372N0269O5100M5831r2214l2631j9111
11341c8515p0746n2797N9390J1597R2494j1645N680J8098j6949n792L793N5740
$$ plain form
11423 -107494 -120325 -38021 49178 85771 62156 50285 -32994 -6738 -39624 -63416 -60556 -26522
11411 -26522 -122426 -182815 -69137 -34200 -176326 -245141 -240454 -186292 -191714 -233543 -252675 -180006
11399 -180006 -91187 70725 170065 172663 98431 73829 48351 -42503 -41414 42458 57088 -69284
11387 -69284 -117607 -38416 75578 41698 -60937 -98272 -107913 -165315 -144902 -93302 -57425
11376 -57425 -11197 -41082 -92489 -44698 4229 20375 4279 19241 89623 105971 120354 99348
11364 99348 62086 11826 19684 -21893 -1206 83687 41657 72052 119787 212622 236965 229453
11352 229453 157005 117802 31919 -40387 -55759 -5490 59610 105441 13227 -19404 -38515
11341 -38515 -109261 -162058 -102668 -91071 1423 -10222 -4542 13556 -3393 -9185 -5392 50348
11329E0348p8296j31439M1630P6186N6653L8807j1500k2470q596q0872K8042J6777
11317b4730K6937m8702R4640R4723P749J9905q7252m4285j8706Q573j1453P8836
11305I6235n2786q474j16229n921M1020k5202J1840R2447J10861n3524J931m4149
11293D8049j28318p49l0967M7564L6769J492K401k1382k8370J54404O2170n0950
11281I2113j0444N6543N6932j13504j16082J5501L9016R0890n0463Q950l5482
11270C3970J1154J3208N9299r3553r0053J5792j03034l5183Q7865O4203q9005
11259a25337K707P9502J21594j7486j02312q1691m37J1605j5592j33363p817J05512
11247a63115Q2791J07274O7496p3673M5318m369p3871j13997J8327k359M8263
$$ plain form
11329 50348 -27948 -159387 -117757 -41571 15082 53889 42389 19919 11323 -69549 -41507 -24730
11317 -24730 2207 -46495 48145 142868 150617 170522 83270 38985 20279 28852 17399 96235
11305 96235 43449 34975 -81254 -87175 -46155 -71357 -59517 32930 143791 90267 92198 48049
11293 48049 -80269 -81018 -111985 -64421 -27652 -26160 -23759 -45141 -73511 80893 143063 92113
11281 92113 81669 138212 195144 81640 -34442 -18941 20075 110965 60502 69452 33970
11270 33970 45124 58332 117631 24078 -65975 -50183 -153217 -188400 -100535 -36332 -125337
11259 -125337 -122630 -43128 78466 60980 -41332 -123023 -123460 -111855 -127447 -260810 -268627 -163115
11247 -163115 -80324 26950 94446 20773 66091 61722 -12149 -126146 -107819 -110178 -61915
11236f1915O2174J1733N720j3769n7270l3749n5524J8942J08583J606O541J0746
11224C818k9125l8474R247J3973n9751k9928J2148O6101J0573j07547q3729N2859
11212a79835N8957J2600L7822K2589J4156N8917L5310N2124q9169j52144j0877
11201a39550Q0973j1563p3368N5246J12628L8515o90Q024Q417m8792M0950J0828
11189H1618k7539k5395K9132J31803P3760q1447r0036k564r6476K0003O0355O1412
11177A34626l2098p7680r7138L4661K8078Q5077J6722j33211p3411Q8697O8225
11166D2548J5037M7213o5958p1719M4552K2861J9951r9870k9437M6085K9390K2057
11154B2710p119j9702O0209K1306j73213j11210O5406J29297m7457m6561r7671
$$ plain form
11236 -61915 259 11992 17712 3943 -53327 -87076 -142600 -123658 -15075 -13469 -6928 3818
11224 3818 -25307 -63781 -54534 -40561 -100312 -130240 -118092 -51991 -41418 -148965 -232694 -179835
11212 -179835 -120878 -108278 -70456 -47867 -33711 25206 60516 112640 23471 -128673 -139550
11201 -139550 -58577 -70140 -143508 -88262 24366 62881 62191 70215 78632 29840 70790 81618
11189 81618 54079 28684 57816 189619 263379 181932 91896 89332 -7144 12859 73214 134626
11177 134626 102528 24848 -72290 -37629 -9551 75526 92248 -40963 -114374 -25677 42548
11166 42548 57585 104798 38840 -32879 11673 34534 54485 -45385 -74822 -28737 653 22710
11154 22710 15591 -4111 56098 77404 -95809 -207019 -141613 -12316 -59773 -106334 -204005
11143b04005O9812N5926N6322Q4723j04574K7879P7526o9249l6678K4650M4212
11132B6544N1947k6721o5540L2113O4239q1309k2814k885Q4581j5687j23922n7035
11120a36489Q9613J26135P2275k6337q372r0994j33953O0500N0064l6264P655
11109b6167O8826K3275N2509K9362P7063J06628J20636R3080n4478j51367p3351
11098B66016j04597j22222M7480J86327Q0065m4713j36923r6712M403p36K6612
11087A05000o3242K2921K4286p0887J04503n0880j39153o6580Q6207Q5494q4555
11076d6886j017J18947J44438k2059p3921q1388m2387p1972J46o4434K1430P8207
11064d0896r63p7375J0952m4985L4337N3957R1385P199Q2481J3894r1206j00890
$$ plain form
11143 -204005 -134193 -78267 -21945 62778 -41796 -13917 63609 -5640 -42318 -17668 26544
11132 26544 78491 51770 -13770 18343 82582 1273 -21541 -24426 60155 44468 -79454 -136489
11120 -136489 -46876 79259 151534 125197 116825 25831 -108122 -47622 2442 -33822 -26167
11109 -26167 42659 65934 118443 147805 224868 331496 452132 545212 490734 339367 266016
11098 266016 161419 39197 86677 273004 353069 308356 171433 74721 79124 78388 105000
11087 105000 41758 64679 88965 18078 122581 71701 -67452 -134032 -47825 37669 -46886
11076 -46886 -47903 71044 215482 193423 119502 38114 -4273 -76245 -76099 -140533 -119103 -40896
11064 -40896 -41859 -119234 -108282 -153267 -118930 -64973 26412 33611 116092 129986 38780 -62110
11052f2110m5941J7110R7666J04643j3747m7919q4980Q231m1978n8839Q489J00510
11040a8865N26j3940m1832m2049O4938n9201L830L9416j7699l611Q4950k6504
11028c0041o616n1856K6947Q6918O0674m9052j4434J2550L5782j6742M3289m5717
11016E1702J1599J496J3546J0633P8681n7267l9412J4164j0164j3021r6649o4051
11004i8743L5921m8338L9150n9015J3167K5106N1315k0314m6752Q048K7722k5180
10992i7913J73131Q2362j10609l2717p4877J0573P0902m5964n4751J7132O5851
10981C120j2060K6665N1334j38291o7482M9353O9550N918j23684J2661J28141
10970E225j74851K1790L7161K6025Q7680M84j6964k0418j05400J25292Q4738k6894
$$ plain form
11052 -62110 -108051 -90941 6725 111368 97621 49702 -35278 -27047 -69025 -127864 -119375 -18865
11040 -18865 -18339 -32279 -74111 -116160 -51222 -110423 -106593 -67177 -84876 -88487 -3537 -30041
11028 -30041 -36657 -88513 -61566 25352 86026 36974 22540 35090 70872 54130 97419 51702
11016 51702 63301 64797 78343 88976 167657 110390 70978 85142 74978 61957 -34692 -98743
11004 -98743 -62822 -111160 -72010 -131025 -117858 -92752 -41437 -61751 -108503 -100455 -72733 -97913
10992 -97913 75218 157580 46971 14254 -60623 -50050 20852 -25112 -79863 -62731 3120
10981 3120 -8940 17725 69059 -69232 -136714 -87361 -17811 -11893 -135577 -122916 5225
10970 5225 -169626 -147836 -110675 -84650 3030 3514 -13450 -33868 -139268 -13976 70762 43868
10958D3868n1119p5958L5181J4284K5555m479M3249L2457k5866p6351o4026M4553
10946e8652J0975l0454k4231Q4080M381k3413m7681q4972O4911k7531l0909Q9342
10934g4154M2498m7126L008l6239m2006O0390J02903O6663K1231K3139n2284l9433
10922B8590j07379K933n171p1956M7612q58L5827m245o371K8443m0787L9916N1429
10909b017L0870L2357j2129r2206k4190J923M4243K4170r6182N8982J4498l3355
10897e3036L2797N5241k4731n7669k31N6764j02422k4644N2275o5588r7861n095
10885b34200J864J60663j3431J2833R935J2055M3426k3490l4075L9496N9252l4967
10873f39k3744J26178l2546r6483r506N750L3437k1913N6489P4639n1959j02969
$$ plain form
10958 43868 -7251 -83209 -48028 -33744 -8189 -12668 30581 63038 37172 -39179 -103205 -58652
10946 -58652 -47677 -78131 -102362 -18282 -13901 -37314 -84995 -169967 -105056 -132587 -163496 -74154
10934 -74154 -31656 -78782 -75774 -112013 -154019 -93629 9274 75937 97168 120307 68023 28590
10922 28590 -78789 -75856 -81027 -152983 -105371 -106229 -70402 -74647 -81018 -52575 -93362 -53446 -2017
10909 -2017 28853 61210 49081 -43125 -67315 -65392 -21149 3021 -93161 -34179 -19681 -53036
10897 -53036 -20239 35002 10271 -47398 -47629 9135 -93287 -117931 -65656 -131244 -229105 -234200
10885 -234200 -232336 -71673 -85104 -72271 -62336 -50281 -6855 -30345 -64420 -24924 34328 -639
10873 -639 -24383 101795 69249 -27234 -36740 -30990 2447 -19466 37023 111662 59703 -43266
10861d3266j8011J17966L3310q0711m1287j8311R0640k7315l7487M0947P8727
10850I5202M4974k38656p6301R7730J5912N6493q799J6043L9197P6225q8589k7251
10838B180M2286m908R523N1837K065j7086L7224k7694j58498j57600J07545K36461
10826A23335j7581p7752J9669l7115j5033L4984P0061L1459k1974n1477n6208
10815B368r1591K2680J46235K9755j29499r1684Q9870k9443n8688N4363m124n4644
10803a14402k0040m2827N8824R8433P310k6518L1289n8146p7745P5763J20456
10792E2397L2885m6748r8568L6171l7216j4440J7574O9836k3230l368o0262r5739
10780a70708l935k8834K3245J03093M7373l2586j2605O5626P3380Q0400o3806
$$ plain form
10861 -43266 -61277 56689 89999 9288 -31999 -50310 40330 13015 -24472 16475 95202
10850 95202 140176 -98480 -174781 -77051 -61139 -4646 -13445 2598 41795 118020 29431 2180
10838 2180 44466 39558 49081 100918 102983 85897 123121 95427 -63071 -220671 -113126 123335
10826 123335 105754 28002 47671 10556 -4477 30507 100568 132027 110053 58576 2368
10815 2368 -89223 -66543 79692 109447 -20052 -111736 -21866 -51309 -109997 -55634 -59758 -114402
10803 -114402 -134442 -177269 -118445 -20012 -12702 -39220 -7931 -66077 -143822 -68059 52397
10792 52397 85282 38534 -60034 -23863 -61079 -75519 -57945 11891 -11339 -14707 -74969 -170708
10780 -170708 -174643 -203477 -180232 -77139 -29766 -62352 -74957 -9331 64049 144449 80643
10769H0643o8188N1673j9353L5257M5882j7303m7509j3211J2089k3639J2457R2040
10757A40838R8424j01768p5237j22699N0220J34862j7166M2431J1223j4050K9489
10746A76567q6433k9931j9209j87022j13671k1127Q3183J5525M2790N6607J04042
10735B1321L0138n3288j11617j03905J37797K8427q136K136L54J2936J2163J9926
10723a1748J1084L8709R5072M2604j07041m2593O4299q7174O5116J8919m7542
10712C9705L7258m420q1073p453n0592k9057qP3062N3607K8696m7093r9729L3034
10699e4063Q5764m6334J09311K7480j10676J03351K8491n7058j40846q4665J0687
10688a28558r0911O5781J34773Q4272Q3812k5465K3025M972n5822q1219n9735
$$ plain form
10769 80643 12455 64128 44775 80032 125914 108611 61102 47891 59980 36341 48798 140838
10757 140838 239262 137494 62257 -60442 -10222 124640 107474 149905 161128 147078 176567
10746 176567 90134 60203 40994 -146028 -259699 -280826 -197643 -182118 -139328 -82721 21321
10735 21321 51459 -1829 -113446 -217351 -79554 -51127 -59263 -57127 -56773 -43837 -31674 -11748
10723 -11748 -664 38045 133117 175721 68680 26087 90386 3212 68328 87247 39705
10712 39705 76963 72543 -8530 -15983 -66575 -95632 -95640 -22578 31029 59725 12632 -87097 -54063
10699 -54063 31701 -14633 94678 122158 11482 114833 143324 86266 -54580 -139245 -128558
10688 -128558 -219469 -153688 -18915 65357 149169 123704 146729 151701 95879 14660 -45075
10677d5075m1994J6011j7696j28393R3138J77695L3285l222n0643M257N7742k0112
10665G4993p8916O614R8591j01259q7960N6212Q1404m0329r2076o3061O9104M4383
10653c2300J0320P982q7403k7182P3373O5394O3946k598K4508k8808o1672l8963
10641c3403n4766r7217j5854j2591J18058K9240Q9766N5031M9109k7698r2807
10630F868L6200L292p7319o6737j5027J45941L9693n5801K564K2088j10999N2814
10618a6423J18595J3414j11964m0579K309m3851K9308k4080K1681m1992o1777
10607a55359M7029N2553L4233J5447n7660j15851n2129J9834N6385O2719M4768
10596d8031M068k915o2884L4619m5929L5967O2089q413J4660Q863l2672K4713
$$ plain form
10677 -45075 -87069 -71058 -88754 -217147 -124009 53686 86971 83749 33106 37363 95105 74993
10665 74993 -3923 2691 101282 23 -87937 -31725 49679 9350 -82726 -145787 -76683 -32300
10653 -32300 -21980 -13998 -101401 -128583 -55210 10184 74130 71532 96040 67232 5560 -33403
10641 -33403 -88169 -185386 -201240 -213831 -95773 -66533 23233 78264 127373 99675 6868
10630 6868 43068 46360 -30959 -97696 -112723 33218 72911 17110 19674 41762 -69237 -16423
10618 -16423 102172 115586 3622 -36957 -34648 -78499 -49191 -73271 -51590 -93582 -155359
10607 -155359 -108330 -55777 -21544 -6097 -63757 -179608 -231737 -211903 -155518 -92799 -48031
10596 -48031 -43963 -46878 -109762 -75143 -121072 -85105 -23016 -31429 -16769 -7906 -40578 -15865
10584a5865j3425P4p441K1171J4760k0844p8675O6420K3849R107n0829m3277l6802
10571a31777N7096J9080J3089O0709O2091k745k7177N5331k1124p911J0132J3078
10559I9872l9934L8195L7829k3024l639J0623k0765J8451o9341k37N5268q9084
10547A4214j58004n0508Q7047O608N1512j0704l434N5508k5435L5007Q6758o318
10535H2251j12175o1593O127R9218O1424q2849q7829R2147l4701p1367J13708
10524D361O8555J18486L1082P5478l2072k17231p5206K9021L7046j7899q5018
10513f3397K6113K3453n5231p1559L3257M701M390m4596J40402J18450j10536
10502E447j35955q585n99l5662J47263P6102N261l9944n3489p0914k3659L8218
$$ plain form
10584 -15865 -29290 -29216 -36657 -15486 -726 -21570 -100245 -33825 -9976 -869 -51698 -94975 -131777
10571 -131777 -74681 -55601 -42512 18197 80288 77543 50366 105697 84573 76662 86794 99872
10559 99872 59938 98133 135962 112938 109299 119922 99157 117608 48267 48030 103298 14214
10547 14214 -143790 -194298 -107251 -100643 -49131 -59835 -63269 -7761 -33196 1811 88569 82251
10535 82251 -29924 -91517 -85390 13828 75252 -7597 -95426 -3279 -37980 -109347 4361
10524 4361 72916 191402 222484 297962 265890 48659 -26547 2474 39520 21621 -63397
10513 -63397 -37284 -13831 -69062 -140621 -107364 -102663 -98273 -142869 -2467 115983 5447
10502 5447 -130508 -139093 -139692 -175354 -28091 48011 53272 13328 -40161 -111075 -134734 -96516
10490i6516k4393L0101J73550Q3576n498j71442q0908l0607m3248K0748l0622
10479a75259n1553R2726J6223p5600M5560J21593l2980K368J6969N3897r7656
10468h3712j12325o0591K1795O6840Q7699Q5653l9089k925P0974n478L0989P4779
10456A34609q4971Q48l4723P4448K4399o993L4033K6795J3394N2928m7934j37589
10444D9244o1793q5553k994r9641O7391N4425m2409r348j1301m4591R8899J55782
10432F8111N2534J694j37000r3401J7720J12348M2130r3956k9548Q2148l9732
10421a6952m7800Q6744k37n0720j6523k0285k1488l3903K6779k3266n4773l3813
10409b06237P843P4660k0654L3365K7696J01443K5942o5747l3073n2182n415L6225
$$ plain form
10490 -96516 -120909 -90808 82742 166318 160820 -10622 -91530 -122137 -165385 -144637 -175259
10479 -175259 -226812 -134086 -117863 -193463 -147903 -26310 -59290 -56922 -39953 13944 -83712
10468 -83712 -196037 -256628 -234833 -167993 -80294 5359 -33730 -36655 34319 28841 59830 134609
10456 134609 49638 50486 15763 90211 114610 107617 141650 168445 181839 234767 186833 49244
10444 49244 -12549 -98102 -101096 -200737 -133346 -78921 -121330 -130678 -141979 -186570 -87671 68111
10432 68111 120645 122339 -14661 -108062 -90342 22006 64136 -29820 -59368 22780 -16952
10421 -16952 -64752 21992 21755 -28965 -45488 -65773 -87261 -121164 -94385 -117651 -172424 -206237
10409 -206237 -198394 -123734 -144388 -111023 -83327 18116 44058 -21689 -54762 -106944 -112359 -76134
10397g6134M4071l4434M8274N907R608K5770j4802P108r1754l011Q0252N36L8836
10384D0227Q6234m42k3030O7476n6633r9835K4099J3255K1279J9529n954L158
10372H9363J03990k9872o4357j6076j3890k11774l5979J06915K8089p0183J8795
10361i4979J6359K8750J07806J4393oR2773l9535l2957M6574j44678n6860Q8087
10349B5727o5598R0294J28009K1266j14279n2315P5924O1711j1748j66206M8610
10338D1395l8581j12246P5393J28490Q4593P3262m5965m6313l1495O3825m9088
10327A43270k4105q9034K1632K6362r6766O1880j537m004M4688O4582o8676m9987
10315B8305N1449K639r2972k1898J5716O6344k1504p4703q8161n4743N8356J4880
$$ plain form
10397 -76134 -32063 -66497 -18223 -12316 -2708 23062 8260 15368 -76386 -79397 855 1391 40227
10384 40227 126461 126019 102989 170465 113832 13997 38096 51351 72630 92159 86205 89363
10372 89363 193353 163481 99124 83048 69158 -142616 -178595 -71680 -43591 -113774 -94979
10361 -94979 -78620 -49870 57936 72329 72323 165096 125561 92604 139178 -5500 -62360 25727
10349 25727 -39871 50423 178432 199698 85419 33104 109028 170739 158991 -7215 41395
10338 41395 2814 -109432 -34039 94451 179044 252306 206341 160028 128533 192358 143270
10327 143270 119165 30131 51763 78125 -18641 43239 41702 37698 82386 146968 78292 28305
10315 28305 79754 82393 -10579 -32477 -16761 49583 28079 -46624 -134785 -189528 -131172 -116292
10303a16292k3488J3027j9325L4515P0342K8007J31436R5151L5040j25903j38945
10292a6435J8080J6089L1656O5383j6893K5899l4299m4957k1944R3379L7063K9495
10280A82516N5976j55432j49286L7559K2323N9267O5725O0309j63451L8811n7652
10269c335n6815l1882P227j7434P4548J39287P9436n7137j47094R0378K1474J873
10257A00526P334M1807j18852o740m6499O2808R7052m2522j46848K4583J13372
10246H6021R768r2640M0650Q0647L9969K4994l1648m2862j24366N1828M9204J6453
10234A08018M6031j9461K3183k5460l573K3664k4912l1049o3294q740J2892m4282
10222f983J4117P2150L8578l4042N192M4444J0546p3794l6975r2716k6735l5190
$$ plain form
10303 -116292 -139780 -126753 -146078 -111563 -41221 -13214 118222 213373 248413 122510 -16435
10292 -16435 1645 17734 49390 114773 97880 123779 89480 44523 22579 115958 153021 182516
10280 182516 238492 83060 -66226 -28667 -6344 52923 118648 178957 15506 54317 -3335
10269 -3335 -60150 -92032 -84805 -102239 -27691 111596 191032 133895 -13199 77179 98653 100526
10257 100526 107860 149667 30815 24075 -22424 40384 137436 94914 -51934 -27351 86021
10246 86021 95789 3149 43799 124446 164415 189409 157761 114899 -9467 42361 91565 108018
10234 108018 154049 134588 157771 132311 128738 152402 127490 96441 33147 24407 37299 -6983
10222 -6983 7134 79284 117862 83820 89012 133456 144002 70208 33233 -59483 -86218 -121408
10210a21408M0977j6570M0631J02059M4908r5611j8223P9893K6909p9396r8445
10199i4276L248Q5931L4441N4310q619l5297j5428N2677R785j5642j8238j601
10187E1291j2622J9763M9795L9377n8779k6379j32680K2674J29528M1268n1517
10176G1719n3909n882O3196L4355L3723L0782K5485M9785r7750r0650r7174K707
10164c3613k9686J6529M9203l5267O2366P3341k017N47P2532O5359m7995j24995
10152F6304l535k0766q6110J30568j3451p2757l0869j7178R463l2985Q5674M8909
10140F3267K3894O4742j6271q6020j08903q2168O0230R4644J7949k9835n7555
10129e6026N0384J16006m3102k5605L8053k8321m5598J4822p7298m4859K7964
$$ plain form
10210 -121408 -80431 -97001 -56370 45689 90597 -5014 -23237 56656 83565 4169 -94276
10199 -94276 -91028 -5097 29344 83654 75035 39738 24310 76987 86772 71130 52892 51291
10187 51291 38669 58432 108227 147604 88825 62446 -70234 -47560 81968 123236 71719
10176 71719 17810 11928 75124 109479 143202 173984 199469 249254 151504 60854 -36320 -33613
10164 -33613 -63299 -46770 2433 -32834 29532 102873 100856 101403 173935 239294 191299 66304
10152 66304 62769 42003 -44107 86461 73010 253 -30616 -47794 -38331 -71316 14358 63267
10140 63267 87161 151903 135632 49612 -59291 -141459 -81229 13415 31364 1529 -56026
10129 -56026 -5642 110364 67262 41657 79710 51389 5791 20613 -56685 -101544 -73580
10118g3580M0269M6843J18813j893j04573N2333N2581J0750K8290p9128r2834
10107b129j6743M2927R1193J34748j0778j22613k3478J33085n5062j17120O3781
10096A17811P4614n0106j08722m7263O8196k0186J32425L2605p7607n9839J6644
10085G8572n673o1605N3563Q5049r6248m1142Q0361J5281k6791M6827l682j963
10073A22549m990n0306m7001o1272n615k1859L6433Q4734L7840O7027j6380R278
10061A50438N6375j25700n3502m752J05070M0467q962k5818j2330n2694R8978
10050A67570N4511j06321J4012p4902k7181K0690o3383p7538P3423Q3240Q6632
10039A50753L2747N042k8781l3680n5271Q8889R5224k3832r3032j28502o418N8104
$$ plain form
10118 -73580 -33311 13532 132345 130452 25879 78212 130793 141543 169833 90705 -2129
10107 -2129 -18872 24055 115248 249996 239218 116605 93127 226212 171150 54030 117811
10096 117811 192425 142319 33597 -13666 54530 34344 166769 199374 121767 61928 78572
10085 78572 72899 11294 64857 149906 53658 12516 92877 108158 81367 128194 124512 122549
10073 122549 117559 67253 20252 -41020 -46635 -68494 -32061 52673 90513 157540 141160 150438
10061 150438 206813 81113 27611 22859 127929 168396 159434 133616 121286 68592 167570
10050 167570 222081 115760 129772 54870 27689 48379 -15004 -92542 -19119 64121 150753
10039 150753 183500 188542 159761 126081 70810 159699 254923 231091 138059 9557 3139 61243
10027F1243M1694N0544Q4234j0192o6114J846q2965j895Q34n0526o9348p7804
10015a18449N4744M0691J00436O4001j8239l1871j103M2490l1799o1422l5461
10004D018M3869J30743P6954o3529p2198J50381p0597j45438j7017N6973O3342
9993A57501J12621M572J6827l2132k5448O0413J15326J70100J45323K8712K18552
9982I72367K41472J24088N1635j83489l01003k05731j21910q5581q2653q3296
9972C25899j08338l098M505R7582L5633l9933M3770m1619p9850O353r329r7335
9960A34240m2894J32557M8618p1133n4732k1029J4790m9966q8113O630M723M0351
9948E4042J411k9790J9273m0172m5666P9419k0124N5626J07539k2058o0592K5837
$$ plain form
10027 61243 102937 153481 237715 227523 161409 163255 80290 78395 79229 28703 -40645 -118449
10015 -118449 -63705 -23014 77422 141423 123184 91313 90210 132700 100901 39479 4018
10004 4018 47887 178630 255584 192055 119857 270238 199641 54203 37186 94159 157501
9993 157501 270122 274694 291521 259389 233941 294354 409680 579780 725103 753815 972367
9982 972367 1213839 1337927 1389562 1206073 905070 699339 577429 491848 409195 325899
9972 325899 217561 214463 218968 316550 352183 312250 356020 314401 234551 240904 231575 134240
9960 134240 91346 223903 272521 201388 146656 125627 140417 90451 2338 8968 13691 54042
9948 54042 55453 25663 44936 4764 -40902 38517 18393 74019 181558 159500 98908 124745
9936A24745J4853p8797l654N591O1226J0527m8273m0315R3489M941j6881N3423
9924A80875L288L100m3915M5309m0950n5527J1195N3482N157N6180o7666p8326
9912G2202m8330L4837p5089l8306P3823O720n0444m543Q8979J00067K8060k3146
9900A64830k7965k0505m8676l9030k0536m7525l0903O1254Q3641L1038J7073j1679
9888A11017J2362q3921K8226k5316n7694k2179K7511N3092J08119M6599j5261
9877A82555K2497q311r8521m8347n346Q1806P2085j1663o9514J4391j53593p1909
9865i3870P9773J10138k922q1202M2702k8809o0176p2111K4431k4977R0342J07913
9853I1232N4210R0287o1667j06204l3644Q4716R0709J11433k0049M6062l9786
$$ plain form
9936 124745 139598 60801 57147 62738 123964 134491 86218 45903 139392 144333 127452 180875
9924 180875 184163 187263 143348 188657 147707 92180 103375 156857 162014 218194 150528 72202
9912 72202 23872 58709 -16380 -54686 19137 25857 -24587 -29130 59849 159916 187976 164830
9900 164830 136865 116360 67684 28654 8118 -39407 -70310 -9056 74585 105623 122696 111017
9888 111017 123379 39458 67684 42368 -15326 -37505 -9994 43098 151217 197816 182555
9877 182555 205052 196741 98220 49873 44527 126333 198418 186755 117241 131632 -21961 -93870
9865 -93870 -14097 96041 93119 11917 54619 25810 -34366 -106477 -82046 -107023 -16681 91232
9853 91232 145442 235729 174062 67858 34214 118930 209639 321072 301023 347085 307299
9842C07299m8228O0356r8573j13060N9030k0581K9109q799n4569M6800O894q9557
9830G6121p8181J10336O6014p0936L5822J82229r1243j26508K7202O0868K8939
9819B20663N498L930M951J0623j07263j9304J8141p958r8446K4418J21164L023
9807A79440K8639K4632p2992j25577K3173l6170M8856K3330M1465N929N7149l6430
9795A61444N8871k6063N473K3908l8688K4981j0281j05147N764M4266L0702k6142
9783A49088k6689J5706q0549l8327N1373J21942O7538q327j57528j06239oJ23006
9771A10988Q6845r0852p9107R2246J18043p3613j21703M962L7272O8625m1576
9760A12130l2070J6529J3380O5300l0767n3559j2379n0042m1852Q0221j8381p2816
$$ plain form
9842 307299 259071 319427 220854 107794 166824 146243 175352 166553 111984 158784 165678 76121
9830 76121 -2060 108276 174290 103354 139176 321405 230162 103654 130856 191724 220663
9819 220663 226161 230091 235042 245665 138402 119098 137239 129281 30835 55253 176417 179440
9807 179440 208079 232711 159719 34142 57315 21145 70001 93331 134796 140725 197874 161444
9795 161444 220315 194252 199725 223633 184945 209926 199645 94498 100262 144528 175230 149088
9783 149088 122399 138105 57556 19229 70602 192544 260082 251755 94227 -12012 -12018 110988
9771 110988 197833 106981 27874 120120 238163 164550 42847 47809 85081 153706 112130
9760 112130 80060 96589 109969 175269 144502 90943 78564 28522 -13330 66891 48510 -24306
9748b4306M9978J27772M2655j1115K1478l8707m7657J7260j8311k5364j27454
9737c3771K4974j5961J12290M7385n8831n2885m9744r915K2667O0810K7555m4925
9725B9649o0598l2716j631Q4415O9404Q4148k4880o7875m2775K060P0518J17061
9713B26780K1316n4101j70226p5084J04054J27613K6167K365Q850k6309j28060
9702F3365K9472J30082p2981O7392P6857J7508j00387j43276l8997Q8216P1329
9691A88580r8149M0885Q6888J1572P9149j2886M3036J08912p3402j60659J0234
9680B24160l5634n0057j2443P6226K2993k2588R9749N9432p5581q3376o4204r8710
9668C9967o7744m1655O2355P0431L3979Q3007K1802P1237n9131J0881m2958l5694
$$ plain form
9748 -24306 25672 153444 196099 184984 206462 167755 120098 137358 119047 93683 -33771
9737 -33771 -8797 -24758 87532 134917 76086 23201 -26543 -36458 -13791 47019 74574 29649
9725 29649 -30949 -63665 -65296 19119 88523 172671 147791 79916 37141 39201 109719 226780
9713 226780 248096 193995 23769 -51315 52739 180352 206519 208884 217734 191425 63365
9702 63365 92837 222919 149938 217330 294187 311695 211308 68032 29035 117251 188580
9691 188580 90431 131316 218204 229776 308925 296039 339075 447987 374585 213926 224160
9680 224160 188526 138469 126026 202252 225245 202657 302406 361838 286257 202881 138677 39967
9668 39967 -27777 -69432 -7077 63354 97333 180340 202142 273379 214248 225129 182171 146477
9656A46477P750n9687p83j4444L4515L1899J6514j8979r4440o1802O4813l0936
9644B0897K0089R1925o2186J9095Q9287r0166j653K2657l971k584J4718j20923
9632b815L1832k619L409L0733K4657L0157j07365j07295K0944N8839O3994P6801
9620A21272J9118N0828N1171l8276l5204L6090l5169L8706L3436o4944p1529p7241
9608B8258Q1366P5688O7270k0788j16956j09883l5011O2862L5744J6285J37445
9597B22280l6481m8834J5565K5249N9183N6185J9880m502j2204n9366j528j7997
9585B17430Q431n23l8987l422K1539o851n4644J5821J8166L6963j5052O1576q5580
9572A74867l1325N9983q9404K2848J9353J537J9391n3470O3728p366n8491M3880
$$ plain form
9656 146477 154227 94540 93757 79313 113828 145727 162241 143262 48822 -12980 51833 20897
9644 20897 40986 132911 70725 89820 179107 88941 87288 109945 105974 103390 118108 -2815
9632 -2815 29017 26398 29807 60540 85197 115354 7989 -99306 -78362 -19523 44471 121272
9620 121272 140390 191218 242389 204113 168909 204999 169830 208536 241972 177028 105499 28258
9608 28258 109624 185312 252582 231794 114838 4955 -30056 32806 68550 84835 222280
9597 222280 185799 136965 152530 177779 236962 293147 313027 308525 296321 236955 235427 217430
9585 217430 225861 225338 186351 182929 204468 197617 142973 158794 176960 213923 198871 260447 174867
9572 174867 143542 203525 114121 136969 156322 157859 177250 123780 187508 180142 121651 165531
9560A65531K2577p7181Q748K8556m8573K3068j4764m898j8900l2455L4959K4044
9548A10712k7767j2313j08220J5270J19598J30373J290j09350q2588L7336P4519
9537A48860j508k1705M5099j0218M3378P0314P0413o5238o3700l3705M5357k7221
9525B00126r4404R6350N8306J8741Q4519N2276j48749j96157J2120J62826M4511
9514B90465m5325r9639j08216P7030L8970p614k006K1055L1178J3103J03045J4560
9502C26606k4892j18659K8597m286j14485L0073J6326k3490l2421m3251M3037
9491H3155L4219L5149N2182L7668m0566K6988J14397p908j81686j11311L855K3146
9479F9288L6018L778j1041l8276j09198p3658R3951J73900k0841m9771m2830j2132
$$ plain form
9560 165531 188108 110927 119675 148231 99658 122726 107962 103064 84164 51709 86668 110712
9548 110712 82945 70632 -37588 -22318 97280 227653 228943 119593 37005 74341 148860
9537 148860 147352 125647 170746 160528 203906 274220 344633 279395 215695 181990 227347 200126
9525 200126 105722 202072 260378 279119 363638 415914 267165 71008 83128 245954 290465
9514 290465 245140 145501 37285 114315 153285 145671 143665 164720 195898 209001 312046 326606
9502 326606 301714 183055 211652 207366 92881 122954 139280 115790 83369 40118 83155
9491 83155 117374 152523 204705 242373 201807 228795 343192 335284 153598 42287 46142 69288
9479 69288 105306 109084 98043 59767 -49431 -123089 -29138 144762 123921 74150 31320 19188
9467A9188N1667l4354K5952O372L2435m6895r684P6773j0065J18419M0036l1937
9455B37907n1286j3060l4848j5573k7884p2229P5201J173m4385L7160R9529L55
9443A92060p7735p622P4953K4264j9869j2958m8596k8730J0160N1525j4441o4250
9431G8761j0563L0533P2553m2969k5382m5080o0070L3492J29604q0770J2256J9482
9419A11847m3741K1964p005K3786K810k3865K2775q3520k5569M8897P5739n4098
9407G0020q213M2817n9263l6266q0657O5448P1727Q0852P7649l7226m8394m4580
9395I3914O1720j6710m9599R520K9573N1617n7346Q678N1173m8230q9047L0731
9383G5994L3572J13706k0138j18878r2728K6428M4256p0221R601J37182r413l3013
$$ plain form
9467 19188 70855 36501 62453 68825 101260 54365 44681 121454 111389 229808 269844 237907
9455 237907 186621 173561 138713 123140 95256 23027 98228 99401 55016 92176 191705 192060
9443 192060 114325 106703 181656 205920 186051 173093 124497 95767 105927 157452 143011 78761
9431 78761 68198 98731 171284 128315 102933 57853 -2217 31275 160879 80109 92365 111847
9419 111847 68106 90070 83065 106851 109661 85796 108571 25051 -518 48379 124118 70020
9407 70020 61807 104624 45361 9095 -71562 -6114 65613 146465 224114 186888 138494 93914
9395 93914 155634 138924 89325 98845 128418 180035 122689 131367 182540 134310 45263 75994
9383 75994 109566 223272 203134 84256 -8472 17956 62212 -8009 1592 138774 129361 96348
9371I6348j2509n442J0749J04845Q1927q6016p5189J02548m2421j15988Q8198
9360A47050n6019q9822J11919N2153m1638O0705j58774n1339N0706k9150K5600
9349B1391M8033Q4910P1042j6610P1510N3989j02273p2815O3086Q9328K3857L5022
9337C70470P2959R3934K07850Q1195J3808j1384q4777q2771n5619r9373N930r3320
9325D18902k2693l3133p5180o9605J31667N6396n4290L1608o3293j34754j30152
9314E5473o6845J55L160J04264M5149l935M0733l11K5700j51929P4327o413k083
9301A17445J3211K6000J9630Q0901L5511J0635M2497O0093Q9164J17372J88442
9290H00901K37109K64315J90252L3278r3353l57378k88232o6070o9654o4021n2807
$$ plain form
9371 96348 83839 78397 89146 193991 275918 189902 114713 217261 174840 58852 147050
9360 147050 91031 1209 113128 165281 123643 184348 25574 -25765 24941 -4209 21391
9349 21391 69424 154334 225376 208766 280276 334265 231992 159177 222263 311591 335448 370470
9337 370470 443429 537363 745213 826408 840216 828832 744055 661284 605665 506292 512222 418902
9325 418902 396209 363076 287896 218291 349958 406354 352064 383672 320379 185625 55473
9314 55473 -11372 -11217 -8057 96207 141356 137421 178154 177843 203543 51614 125941 119528 117445
9301 117445 130656 156656 176286 257187 292698 303333 345830 405923 495087 612459 800901
9290 800901 1038010 1302325 1492577 1525855 1432502 1075124 786892 720822 651168 587147 534340
9279E34340m2371m9067k0796o8781j01670L0522O9795n9833m9344r5293q2873
9268F4629J0240N3708J25180J10140j30707k0373r0486J9158R6955p2930k7066
9257A38448k8625k6895j4454J0042k4572O4742J42892j7934P1932Q9631J42202
9246E47409M931Q6410O6182N8298M7461j00104j49052r4704j6898o3144l8084
9235C48705J5050k6357L7410q0670q8760r2960J6118N4719M8465J3856m6950p2176
9223A26450l092k2921o0974k9557O5617L7500k5829p7101o1027P4080J47831O9684
9211B40661m2822O295p11p0460N132n5103r3878o521Q4381J40947K9643j2957
9199B24607k0942o6222o9588p6429k9599J7871j6933L3429O1736K9334R0533l2185
$$ plain form
9279 534340 491969 442902 422106 353325 251655 282177 351972 292139 242795 147502 64629
9268 64629 74869 128577 253757 363897 233190 212817 122331 141489 238444 165514 138448
9257 138448 109823 82928 68474 78516 53944 118686 261578 243644 315576 405207 547409
9246 547409 552340 638750 704932 763230 810691 710587 561535 466831 449933 386789 348705
9235 348705 363755 337398 374808 294138 205378 112418 128536 183255 231720 245576 198626 126450
9223 126450 123358 100437 39463 9906 75523 113023 87194 10093 -50934 23146 170977 240661
9211 240661 197839 204134 203423 132963 138095 82992 -10886 -17407 66974 207921 237564 224607
9199 224607 203665 137443 67855 -8574 -38173 -20302 -37235 -3806 57930 87264 177797 145612
9187A45612l5874L5621j8605J13148J8579M8058N1087j27939n1089q102L619p3843
9175A00272L2937n9129j3565p4223M0644J5540M1765q5557j2405k4496L5581p4642
9163g7278j18958j3113L6204N2463K2836k7527j0168J5846L1789L812M9676P5823
9151D1405L4253Q8942L5050l680P0599M4568j25554K435o6200j08031O638r652
9139A0773p4956M0940J00040J2743r242o2232k4961R407k7757q1897j2519R8598
9127b1063J0739m4080P330j21132k3140l0116j6828N0098M6673N0617l8389L4637
9115i4654N1989L8024j2373j1461q2697j32987j4306J59140K8185k8310O3691
9104c5759J16753j7343j35836n0866p14N4819L1153m3582m9119J3768q8735r8734
$$ plain form
9187 145612 109738 145359 126754 239902 258481 306539 357626 229687 178598 170496 174115 100272
9175 100272 133209 74080 60515 -13708 26936 42476 84241 -1316 -13721 -38217 -2636 -77278
9163 -77278 -196236 -209349 -173145 -120682 -97846 -125373 -135541 -119695 -87906 -84094 -34418 41405
9151 41405 75658 164600 199650 195970 266569 311137 185583 188018 121818 13787 20425 10773
9139 10773 -64183 -23243 76797 89540 80298 18066 -6895 2512 -25245 -107142 -119661 -21063
9127 -21063 -10324 -54404 -47074 -168206 -191346 -221462 -238290 -188192 -141519 -90902 -129291 -94654
9115 -94654 -42665 -4641 -17014 -28475 -111172 -244159 -258465 -99325 -71140 -99450 -35759
9104 -35759 80994 63651 -72185 -123051 -123765 -68946 -37793 -81375 -130494 -116726 -205461 -304195
9092c04195J48613P5312L802n8723r83N0894m046J2747q4159K0695J06637j12876
9080a46282j01002o8205J8310O9036K1545J7594J2396k5965N489p386N4647k8155
9068a77978p5846Q1580P4572j7841j59635p5563O3875K7582q858L000M8227K7118
9056a89767o5557p6476m8560o109K7530J2193P9995Q3079P6916j6734O4115Q9407
9044C0032k9095m4717j31845n9312n5720m5621m1286j7605M8857J00003R1782
9033a54527K5948j36708j98610j06494M4957P9853R5571R4904m5109j3651l2581
9022c46447m4815n0996o0255q0299K4197O7665Q8142L440J2174J00161O9572O5183
9010a52278K748k1726j5387r595L2737k4325o2936l6712j762k0030J09829L7351
$$ plain form
9092 -304195 -155582 -80270 -76468 -135191 -136174 -85280 -89326 -76579 -160738 -140043 -33406 -146282
9080 -146282 -247284 -315489 -297179 -228143 -206598 -189004 -176608 -202573 -197084 -204470 -149823 -177978
9068 -177978 -253824 -172244 -97672 -115513 -275148 -350711 -286836 -259254 -268112 -265112 -216885 -189767
9056 -189767 -255324 -331800 -380360 -386469 -358939 -346746 -266751 -183672 -106756 -123490 -59375 30032
9044 30032 937 -43780 -175625 -234937 -290657 -336278 -377564 -395169 -346312 -246309 -154527
9033 -154527 -128579 -265287 -463897 -570391 -525434 -445581 -350010 -255106 -300215 -313866 -346447
9022 -346447 -391262 -442258 -502513 -582812 -558615 -490950 -402808 -399368 -387194 -287033 -217461 -152278
9010 -152278 -149530 -171256 -186643 -196238 -163501 -187826 -250762 -287474 -289236 -309266 -199437 -162086
8998a62086K5716n3989p9725p969l172j1174m1057l5886o0558k387N5389J79076
8986a97822N1113q803l6511J0927M7187L4783o141J895P7927K1381L2462N2503
8974H0901j7045n9044q9208M3477m1927l5094J85448K88354P3154P602J85546
8963F22164J51996J9221J268P8328J23201J58873J79870K40073K13022K52674
8953B040690K90101L42652M73963O20657Q92220J173917J270063J446253J758865
8944A0309381K396438K975004L654485M227989N266698P047341R889873J4345949
8936F0113158K0269180K5866295K5896463J3323140q944527k3250287k4507313
8929H8766109j9128553j3012478q667732n716611l838371k852806k659626k954871
$$ plain form
8998 -162086 -136370 -190359 -270084 -278053 -281225 -292399 -333456 -369342 -429900 -432287 -376898 -197822
8986 -197822 -146709 -155512 -192023 -181096 -133909 -99126 -105267 -103372 -25445 -4064 28398 80901
8974 80901 63856 4812 -84396 -40919 -82846 -117940 67508 355862 429016 436618 622164
8963 622164 774160 793381 794649 872977 996178 1155051 1334921 1574994 1788016 2040690
8953 2040690 2330791 2673443 3147406 3768063 4660283 5834200 7104263 8550516 10309381
8944 10309381 12705819 15680823 19335308 23563297 28829995 35877336 45767209 60113158
8936 60113158 80382338 106248633 132145096 145468236 136523709 113273422 88766109
8929 88766109 69637556 56625078 47957346 42240735 38402364 35549558 32889932 29935061
8921B9935061l063596k789943k395855j988208j790169j617465j366580j083146
8913A3840099q54998p76649n81838l92854k18329m456J89741M95624Q21874J288862
8903A3807076J630066K045407K545675L106579M026734N360818O705626P906218
8895D7134199R450607J2513784J7767321K6013484L8313068N2333171N7577417
8888B61103051L6993620j3329361m8468045n3071759m1536018k7893265j8037433
8881I5760790j1756913p874101n714416n296565n904876o130676n766046m978027
8873D2339170m329771l907022l345078l096524k704976k210697j991020j669426
8865A9084656j365385j030210q08871n61432m22323k99743J43802L21921M69639
$$ plain form
8921 29935061 26871465 24081522 21685667 19697459 17907290 16289825 14923245 13840099
8913 13840099 12985101 12208452 11626614 11233760 11015431 11010975 11200716 11696340 12518214 13807076
8903 13807076 15437142 17482549 20028224 23134803 27161537 32522355 39227981 47134199
8895 47134199 56584806 69098590 86865911 112879395 151192463 203525634 261103051
8888 261103051 298096671 284767310 236299265 183227506 141691488 113798223 95760790
8881 95760790 84003877 76129776 70415360 65118795 59213919 53083243 47317197 42339170
8873 42339170 38009399 34102377 30757299 27660775 24955799 22745102 20754082 19084656
8865 19084656 17719271 16689061 15880190 15318758 14896435 14596692 14740494 15062415 15532054
8856A5532054Q31048J209790J664903K277296L102094L775390M562022N834719
8848C8789316P932845J1472964J6706105K2479398K5466481J9258746j25767j9053229
8840A22926859k4698735k1215630j4963204r758435o351617m331119l138406k518196
8832C5951517k696478k634133k445176k454236k431459k237339k093727j971915
8824A6987054j629522j382785j151538r91306r75224r17145o04933m60789n83208
8815H290604n87992m53643l68458j93647k12327k58271j18256m161J79567R8510
8805F371926L3161l7092r3441k01550l50765l81879j68627j20501q8771k2448
8795D940013j23446k7663O1418J37484K56201K15782K70293L76797M88024O10108
$$ plain form
8856 15532054 16363102 17572892 19237795 21515091 24617185 28392575 32954597 38789316
8848 38789316 46722161 58195125 74901230 97380628 122847109 142105855 141980088 122926859
8840 122926859 98228124 77012494 62049290 52290855 45939238 41608119 38469713 35951517
8832 35951517 33255039 30620906 28175730 25721494 23290035 21052696 18958969 16987054
8824 16987054 15357532 13974747 12823209 11831903 10856679 9939534 9334601 8873812 8290604
8815 8290604 7702612 7248969 6880511 6686864 6474537 6216266 6098010 6093849 6273416 6371926
8805 6371926 6405087 6367995 6274554 6073004 5722239 5340360 5171733 5051232 4962461 4940013
8795 4940013 4816567 4788904 4850322 4987806 5244007 5459789 5730082 6106879 6594903 7205011
8785G205011N33427K68048m07791p16293o65911o03040m45575k45511j93984j44057
8775D584324k01314n5731L3259j21866l00141k19110J3840P2744p0942J25270
8765C860333J84047J40558K11620K05137J98387J12855k38585l04794j41681k40467
8755C987410j87913q7019j05838o7300J5089R850m0719N2060J45155J65838K30452
8744D117065K58017J50231L59190N18741O18704O08016K52525j53821m69243o02583
8734E656842o27187m65096l19382k68830j36367j9431r0029q4181j28227j6405
8724C501707k7799q1269n2758O5573J62768K45905J29724L6795k7846r173k29604
8713C714023j93022j46192j21203r1931q2783m6262Q4361n9084R9395O1829j07122
$$ plain form
8785 7205011 7738438 8006486 7598695 6882402 6216491 5613451 5167876 4922365 4728381 4584324
8775 4584324 4383010 4327279 4360538 4238672 3938531 3719421 3733261 3806005 3735063 3860333
8765 3860333 4044380 4184938 4396558 4601695 4800082 4912937 4674352 4369558 4227877 3987410
8755 3987410 3799497 3712478 3606640 3539340 3554429 3564279 3523560 3575620 3720775 3886613 4117065
8744 4117065 4375082 4525313 4884503 5403244 6021948 6629964 6882489 6728668 6259425 5656842
8734 5656842 5029655 4564559 4245177 3976347 3839980 3820549 3730520 3646339 3518112 3501707
8724 3501707 3473908 3392639 3339881 3405454 3568222 3814127 3943851 3980646 3952800 3943627 3714023
8713 3714023 3521001 3374809 3253606 3161675 3078892 3032630 3116991 3057907 3157302 3219131 3112009
8702C112009L4091J41278J99548K16931L23115J96134K81133O85915Q29433P44718
8692F764305M54770j99434p23510q81301o57718m19373k80249q5413j69111k16589
8682C586377o2575j31346o2126N0611N1015r2019j37291j16369L7642o7206j35225
8671B921488p4031r8609j31773n8195q3109j6915L3002M4646l7227P0457Q8583
8660B658317Q0115M7975K3975q3370J9043M9996J56552J79243O5781J44006K40858
8649C582491L97713L41939K26098K7653k20963m56180l24580j66945k27708O5687
8639C245205N1141j82400j29216R502j42994j65620l1836k4755m9855j25009m4469
8628B409694J791O839N2220O678q588M6296J10824J40204l3987m4828K086K1775
$$ plain form
8702 3112009 3146100 3287378 3486926 3703857 4026972 4223106 4504239 5190154 6019587 6764305
8692 6764305 7219075 7019641 6296131 5414830 4757112 4337739 4057490 3972077 3802966 3586377
8682 3586377 3523802 3392456 3330330 3380941 3431956 3339937 3202646 3086277 3123919 3056713 2921488
8671 2921488 2847457 2748848 2617075 2558880 2475771 2458856 2491858 2536504 2499277 2569734 2658317
8660 2658317 2738432 2786407 2810382 2727012 2746055 2796051 2952603 3131846 3197627 3341633 3582491
8649 3582491 3980204 4322143 4548241 4575894 4354931 3898751 3574171 3407226 3179518 3245205
8639 3245205 3296346 3113946 2984730 2994232 2851238 2685618 2653782 2629027 2579172 2454163 2409694
8628 2409694 2411485 2418324 2470544 2477222 2468634 2514930 2625754 2765958 2731971 2687143 2689229 2711004
8616B711004M034Q672r9941L4527K405q6019R9561K50616J62996P4324J88714
8605C350893J67106K51724J28138l4852N1882q6157O8491J26423J38737J70834
8595D333219J91364J53014J95820K27836K96782K83185J90027K75491P7727J09493
8585F333958m8158r6558k25224l13656l80049l64089k86283k57778k44627k00609
8575C916927k43669k48579k11916j53204j16591j96323p2375p4633j08354j07939
8565B383344j91037m948j55532r7892o9585j440O455O423j8280n5062L0559j1570
8553A821435o9047O6836l2494j8985j17961r1088L145o776l2953l2257k8476m2888
8541A418491K4153L1674N7402K4683N6880J3118j9029Q2493O2938Q1872M6841
$$ plain form
8616 2711004 2715038 2723710 2623769 2658296 2660701 2574682 2674243 2924859 3087855 3162179 3350893
8605 3350893 3517999 3769723 3897861 3863009 3914891 3828734 3897225 4023648 4162385 4333219
8595 4333219 4524583 4677597 4873417 5101253 5398035 5681220 5871247 6146738 6224465 6333958
8585 6333958 6285800 6189242 5964018 5650362 5270313 4906224 4619941 4362163 4117536 3916927
8575 3916927 3673258 3424679 3212763 3059559 2942968 2746645 2674270 2599637 2491283 2383344
8565 2383344 2192307 2187359 2031827 1933935 1864350 1862910 1869365 1875788 1857508 1802446 1833005 1821435
8553 1821435 1752388 1819224 1786730 1767745 1649784 1558696 1561841 1555065 1522112 1489855 1461379 1418491
8541 1418491 1442644 1474318 1531720 1556403 1613283 1626401 1607372 1689865 1752803 1834675 1881516
8530A881516Q9863K6370p2786l04r1171k05842r1756m9764j4894l0890j05981
8519A334361o1034k4957k3893j0760J3338j9198K9685k4290J568K0451L7183K0122
8507A292576n8308J9892j14J0286j3710q5274p679n0811N8217J03308k1353n4894
8495A192136O5033K9358J6556n8559R4369J28138P5337K0726J82471R3822J66027
8484B005414J70932J04358R8049j84996k47831k46070j56634j21645q0093L994
8474A345478K4732J6772j34891j13727k0662l5431J03352J6081K3220q9082q0700
8463A055142q057k6147k891n53M368K954l7975m5262L5389k0466l056M2663p1614
8450I24495M1448K6383l620K2923n9890k7125l7778N4533J57235R8951M1332L5101
$$ plain form
8530 1881516 1971379 1997749 1924963 1924659 1833488 1627646 1535890 1486126 1471232 1440342 1334361
8519 1334361 1273327 1248370 1224477 1213717 1227055 1207857 1237542 1213252 1214820 1235271 1272454 1292576
8507 1292576 1234268 1254160 1254046 1264332 1250622 1165348 1157669 1106858 1165075 1268383 1247030 1192136
8495 1192136 1257169 1286527 1303083 1244524 1338893 1467031 1542368 1563094 1745565 1839387 2005414
8484 2005414 2176346 2280704 2378753 2193757 1945926 1699856 1543222 1421577 1341484 1345478
8474 1345478 1370210 1386982 1252091 1138364 1117702 1082271 1185623 1201704 1224924 1135842 1055142
8463 1055142 1047085 1020938 1018047 1017494 1021862 1024816 986841 941579 976968 956502 953446 996109 924495
8450 924495 965943 992326 988706 1011629 951739 924614 886836 941369 1098604 1197555 1238887 1273988
8438A273988O7055J6445L5583p6523j97024n3869k4019j647j00833o2368l6922
8427H39866N6238R6701M2504k4226q0898j68200o5551P1358p3382k027k5568n3392
8415F13423N2335J9477N6759l1444q5225P8138R3733k897q6527j08254J1512J08476
8403G19506M2542L584p9791k0570m2244K459K4181l1504O565n293K5700k2965
8391F22170R618n3185r824p401J2098R2698L4097k5414l9104r1037j44675P5684
8379D75725R4008O4734J0480j2821M2842N8527K2711m7155m2270J135Q633N4617
8367G31166J0768j30429l0412N9584L4619j25334M2667O509M0818P713l6196J3038
8355F24511j4764l5041m0567p0595n1119n9409l1504N693P8039R3086J5017l4514
$$ plain form
8438 1273988 1341043 1357488 1393071 1316548 1119524 1065655 1041636 1039989 939156 876788 839866
8427 839866 896104 992805 1035309 1011083 930185 761985 696434 767792 694410 692383 666815 613423
8415 613423 665758 685235 741994 710550 625325 703463 797196 794299 707772 599518 611030 719506
8403 719506 762048 765632 685841 665271 623027 625486 649667 618163 624728 619435 645135 622170
8391 622170 631788 578603 568779 561378 573476 666174 700271 674857 635753 544716 400041 475725
8379 475725 569733 634467 644947 632126 674968 733495 756206 709051 666781 667916 676549 731166
8367 731166 741934 611505 581093 640677 675296 549962 592629 599138 639956 647669 611473 624511
8355 624511 609747 574706 534139 463544 412425 353016 321512 327205 405244 498330 513347 478833
8343D78833k3316k5124L425K0464M7589k6973J8087M0331k2204m7139q2308P4438
8331D56103Q8278K8157r881m7258p8560Q6776r77p4884o4802K9089J7346K4771
8319D54158k9873l6881M2110M6861J08218j6703r3269M3525r9730j2987J5725
8308D21154N6828J2658K4147J036k7164k4128m6342n4558O6985N9640k131N9967
8296E48092J6279L3521j911r1904q5617J5398j08028m16J3494l4314O361K7011
8284C37966J9599K694p83J3353Q9727K4676q9068m4573N740R6847N6516O9947
8272E82641n7762j18959j20512j7426L8177R8047J4343o4711O4068P345k6677
8261C98574J3145M2281j07940J6012Q32P1290O0255l9014p2985r7732j0784k6395
$$ plain form
8343 478833 455517 430393 433818 454282 501871 474898 492985 533316 511112 463973 381665 456103
8331 456103 544381 572538 562657 515399 436839 523615 522638 447754 382952 412041 429387 454158
8319 454158 424285 387404 429514 476375 584593 567890 474621 518146 418416 405429 421154
8308 421154 477982 490640 514787 515823 488659 464531 418189 363631 430616 490256 488125 548092
8296 548092 564371 597892 595981 504077 418460 433858 325830 325414 338908 304594 310955 337966
8284 337966 357565 360259 359476 372829 462556 487232 398164 353591 359331 456178 512694 582641
8272 582641 524879 405920 285408 267982 306159 404206 418549 353838 417906 425251 398574
8261 398574 411719 454000 346060 362072 362904 434194 494449 455435 382450 284718 273934 247539
8249B47539J4897O3126Q0017L9230K6533M3282q7064l7042l658o2352o0992n322
8237B58194q484J40220J03237J9363j3735Q4205J1315j2690j35357k4465P8929
8226E00732l1175m541m8192r0394l6872K2519l0170n102N1326n3401j2224P6899
8214C39405J7426r2190n3758J923l4273M8180N1560N6865M1080k3908J9058P9368
8202D50736l5424N044k6197o4431L0736R631N2213K7632l9792R7267l5677j01525
8190C70213k9956P4314n3497k8404k4939k3371j15797j815J40426J36224M0202
8179D83600K3190r1081p9169R743P4312M189L6514m1565o3861j14210k7666Q8399
8167C02395J36483m8838n2655P0120J9630m9548m4283l5175K6287m3955O9209
$$ plain form
8249 247539 262436 325562 405579 444809 471342 514624 427560 390518 386860 324508 263516 258194
8237 258194 249710 389930 493167 512530 498795 583000 594315 581625 446268 421803 500732
8226 500732 469557 465016 416824 326430 289558 312077 281907 276805 328131 274730 262506 339405
8214 339405 356831 264641 210883 212806 178533 226713 278273 335138 376218 352310 371368 450736
8202 450736 415312 420356 394159 329728 360464 370095 422308 449940 410148 507415 471738 370213
8190 370213 340257 414571 361074 332670 307731 284360 168563 166748 307174 443398 483600
8179 483600 506790 415709 336540 346283 420595 424784 461298 419733 355872 241662 213996 302395
8167 302395 438878 390040 337385 407505 427135 377587 333304 298129 324416 280461 349670
8156C49670R8263Q518j54692J3466N9601L4123O9931J50421k7440r6695o1914
8145D43252l0832l7058q4376o853L2896l583o3723o170K8461k1791j0859L1669
8133B71033K87N9311J34104q2330q1369k9711M6865k1292L945M9194J4830o1298
8121C03569j7904K3295n6349N6310K0714k3273L722l4450l7815q6092M0796J49657
8109C42180L8484l9278l265p5082r4935o146N8610k0790l615O9748L2083q1374
8097B16620o0957J11169P0001L4488p8187K3445J28364P8917j09847k9127m741
8086C80145N1675l6973q0611o170r484K2300O503L3694J5542o0673p6173L9182
8074B78957R503J8377r9956N3218P1606j1279o5259N0932J10514n04r1424j4832
$$ plain form
8156 349670 447933 456451 301759 315225 374826 408949 478880 629301 601861 505166 443252
8145 443252 412420 375362 290986 284133 317029 313446 249723 243553 272014 250223 239364 271033
8133 271033 271320 330631 464735 382405 301036 271325 318190 296898 300843 350037 364867 303569
8121 303569 285665 308960 252611 308921 329635 306362 310084 275634 237819 151727 192523 342180
8109 342180 380664 341386 338121 263039 168104 161958 220568 199778 196163 265911 297994 216620
8097 216620 155663 266832 336833 371321 293134 316579 444943 523860 414013 384886 380145
8086 380145 431820 394847 314236 308066 298582 320882 327385 361079 376621 315948 239775 278957
8074 278957 288460 306837 206881 260099 331705 320426 255167 306099 416613 416109 324685 309853
8062C09853J7296l2861N4385P2450j8086L5620o475m0450o1013l7483k8028m50
8050B64758j09331m7413J41631J16869Q4064J5156K515M1567R2116k5022o3255
8039E13655n1792K6907N4256o7598q9070K4624P8573p3719R4745L1654P0057J73565
8027G85857N2998n4637m4360q0086o4118J6095j3600n4983q99k8665k5647r852
8015D78103r099R1400K8113J6507K8609l1564k5458L3562J2827p9560j5495k6394
8003E01551L9514R6680J30133P8704J33608N8170k6482l9310J367M6325L92N6385
7991A077037o0416l4531O431L5357q0202j32753r3620P589l8202J8155j2458j58209
7979E34178j3946J18778P523m4845p6477L9194R8283j8999J1576j3885K484m9924
$$ plain form
8062 309853 327149 294288 348673 421123 403037 438657 432182 391732 330719 293236 265208 264758
8050 264758 155427 108014 249645 366514 450578 465734 468249 509816 601932 576910 513655
8039 513655 461863 488770 543026 475428 386358 410982 489555 415836 510581 542235 612292 785857
8027 785857 838855 784218 739858 659772 595654 611749 598149 543166 542267 513602 487955 478103
8015 478103 469004 560404 588517 605024 633633 602069 576611 610173 623000 543440 527945 501551
8003 501551 541065 637745 767878 846582 980190 1038360 1011878 972568 973935 1020260 1020652 1077037
7991 1077037 1016621 982090 988521 1023878 943676 810923 717303 724892 686690 704845 692387 534178
7979 534178 520232 639010 646533 601688 525211 564405 662688 643689 655265 641380 643864 593940
7967E93940j2688J9417R0528M4745K2586Q6762K4483P1625j3336Q4030L8445m5016
7955A005521K4225K36l7247l5753q5568m8897K6655J47137M5210n1673Q1745n3932
7943A017659K8334N1707j10472j08615M7034l7463q0977O07q37j9038J1451N1567
7931H50957r4552m8290l6275r200L3641N9402k9983J2464Q368n9661m5744L2440
7919F73567k3152m8052Q8880J75709m4625r2875l877J5216M0079O0892K8636M9964
7907I20362N9776q7493j16189l220l553N953m691J7024P5562r3528N4700j2529
7895H12174j90737j0404k7862j4202L3548L0104p0788k1322K5766L7368J8742
7884F22387j44759o2267M4193K4174K645l519l7818k9093M7378l975n0077O8892
$$ plain form
7967 593940 581252 600669 691197 735942 758528 845290 869773 941398 928062 1012092 1050537 1005521
7955 1005521 1029746 1029982 992735 956982 871414 822517 849172 996309 1041519 989846 1071591 1017659
7943 1017659 1045993 1097700 987228 878613 925647 888184 807207 807814 806977 787939 799390 850957
7931 850957 756405 708115 671840 662640 696281 755683 725700 738164 746532 686871 641127 673567
7919 673567 650415 602363 691243 866952 822327 729452 725575 740791 780870 841762 870398 920362
7907 920362 980138 892645 776456 773236 769683 775636 770945 787969 863531 770003 824703 812174
7895 812174 621437 611033 583171 568969 602517 632621 561833 540511 566277 603645 622387
7884 622387 477628 415361 459554 483728 486373 482854 445036 415943 463321 459346 409269 478161
7872D78161M7930o2676O944M0254R9514k4799K3950o4455o5991n5009m2275m7501
7860C34047m1841o4488J46280J42648n852L4878O6044l5133q0971k8955q2828
7849C83829o9597J3911n3232J269n9538m4109M3499n1756j6248N0085j3483L5625
7837B20255O3109K6455L4724n829o028l9245n6293k1218m2403J0080j1425q515
7825A63667L9884o5291M033M0614j1816n7808J2063P9357n4940j55319O7567R9946
7813A61957N5815j14094p6125O7064j8085J2906K1479k7973m5884p4868J64902
7802A27094M8927o7987r6756L1418N6936P3519r3358Q7787J01838N5972K9604
7791C54994r387K0469r8006o1993p1818K665m737k3135l7311o9901K3253Q7292
$$ plain form
7872 478161 526091 463415 470359 510613 610127 585328 609278 544823 478832 423823 381548 334047
7860 334047 292206 227718 373998 516646 510794 545672 611716 576583 495612 466657 383829
7849 383829 314232 328143 274911 276180 216642 172533 216032 164276 148028 198113 184630 220255
7837 220255 283364 309819 344543 338714 332686 293441 237148 215930 173527 183607 172182 163667
7825 163667 203551 138260 142293 182907 171091 113283 125346 204703 149763 -5556 62011 161957
7813 161957 217772 103678 27553 94617 76532 89438 110917 82944 37060 -37808 127094
7802 127094 176021 108034 11278 42696 99632 173151 79793 167580 269418 325390 354994
7791 354994 345607 366076 268070 206077 134259 136924 132187 109052 71741 1840 25093 112385
7779A12385J06788K6882k4625m5470k0343m2135l9098N3769r930O0574J09494
7768B88291q6603p400r9593j19090N0642M6545Q7482K4877N9531Q2284L303j75070
7756A55199p723L0917J01105k9645L342L4149q5633j59370k1426J34078J05292
7745B60285O1876l8745j4449M4972j00207o5625j0247P257Q369l439J0389k9830
7733A30606J7858M5309J4037j34336l4977O7202K757O2199k8487Q746r2766o9483
7721a1335J04968Q9243L6863M240n3867o7095M1066J9624l2036k1296n9042N0463
7709A01796J6498K0869n046k9161n3478L028K8302l5070K5142K1925j6804l4438
7697D3563M6791n8303M0512K8270r7538J6332J11212L1721q7459n2906l7765J037
$$ plain form
7779 112385 219173 246055 221430 175960 155617 113482 74384 128153 118223 178797 288291
7768 288291 201688 194288 94695 -24395 26247 72792 160274 185151 244682 326966 330269 155199
7756 155199 147476 178393 279498 249853 253195 287344 201711 42341 20915 154993 260285
7745 260285 322161 283416 268967 313939 213732 148107 137860 145117 153486 150047 160436 130606
7733 130606 148464 193773 207810 73474 38497 105699 108456 170655 142168 150914 58148 -11335
7721 -11335 93633 182876 219739 223979 170112 103017 144083 163707 131671 110375 51333 101796
7709 101796 118294 139163 134117 104956 51478 54506 82808 47738 72880 94805 78001 43563
7697 43563 90354 32051 72563 100833 3295 19627 130839 162560 75101 22195 -15570 -14533
7685a4533O7941j084l1479P2085m6471k5824J32530P0883j2963L0691k6643j20209
7673I4924L2451K0090o1172q5214l2117J09274L0419q793o646r6230q3572N8652
7661b7934N4201O071P4563M2303j0469m7066K7701J8160j26249R262J13342Q1651
7649B15536K5974l3088r898q067Q8959O059j74822j46963K1074M0420J5506l20
7637D0370N5695N6024N2260q6528k4256O8043L1460R8784l4332k4682o538K4297
7625B50597r3578J8130n4336L1118Q5341l9835q6172m4368j1099M7007k4262j14139
7613c5596p0167l5419M8758O4941L4122K8207J04499L0795o9589o5562k9492J6703
7601B2200J38444K4810j37166R375j4533k2265M7122K3333J9575q776r5755m9994
$$ plain form
7685 -14533 53408 52324 20845 92930 46459 20635 153165 224048 211085 241776 215133 94924
7673 94924 127375 147465 86293 1079 -31038 78236 108655 99862 93216 -3014 -86586 -27934
7661 -27934 26267 32338 106901 149204 138735 91669 119370 137530 11281 20543 133885 215536
7649 215536 241510 208422 198524 190457 279416 285475 110653 -36310 -15236 25184 40690 40370
7637 40370 96065 152089 204349 117821 93565 161608 193068 291852 257520 232838 226300 250597
7625 250597 157019 175149 120813 151931 237272 197437 111265 66897 55798 102805 78543 -35596
7613 -35596 -105763 -141182 -92424 -27483 6639 34846 139345 170140 100551 34989 5497 22200
7601 22200 160644 185454 48288 57663 43130 20865 67987 91320 110895 102119 6364 -43630
7589d3630K8364R8352K46R0999J8934k7950K8745l89l8844k7566j08135N0877
7577G0003N085R5233j8410j83946j03151q2236k8969L6855Q5795J24143J33493
7566A33895J519m8376j1530O8951Q515j3661o821k9650k3089p486M0316j2653
7554I9930l2910j19666n4217P0719R5775L4323O642p8752j2810m2145p3926j408
7542a08445M1602j1345M1921J05853p737m5278j03316L6704K9248J08359P890
7531I5456j5987k8606L3190o8574j8334l7558J0858j6862m3857k673J5250j8195
7519i5892L8997o7715k4722O7082Q9631K7692M5818L6239K827p5553J3154O3135
7507A20693N223o0181N961K8668n8572q5268L6673R5907M833J9053j24116j42483
$$ plain form
7589 -43630 -15266 83086 83332 174331 193265 165315 194060 193671 154827 127261 19126 70003
7577 70003 75088 170321 151911 -32035 -135186 -217422 -246391 -209536 -123741 402 133895
7566 133895 135414 87038 75508 144459 152974 139313 132492 102842 79753 72267 112583 99930
7554 99930 67020 -52646 -106863 -36144 59631 93954 100596 21844 9034 -33111 -107037 -108445
7542 -108445 -66843 -78188 -36267 69586 61849 16571 -86745 -50041 -20793 87566 95456
7531 95456 79469 50863 84053 15479 -2855 -40413 -29555 -46417 -90274 -92947 -77697 -95892
7519 -95892 -56895 -124610 -149332 -82250 7381 35073 80891 117130 119957 44404 57558 120693
7507 120693 125916 65735 71696 100364 41792 -43476 -6803 89104 93937 112990 -11126 -153609
7495a53609M4869Q7114Q6758L542k4639N7412k5452l5897o2182j7024J1053L9012
7483A0957P1988J2587q8659q787K9764k8457n9133J8400m5455O600k828N4749
7471b8274L973N467J17617O5032l0000M8832o750n0593O83N6477o6989n9289l1761
7458B4425J6995r3089k6460N4856L2165J6319N0078J7776m4475j20361j284K7921
7446d5134j4907m590r583J22239J29731j2480p1461J4555k3604m5959n2380l4831
7434d8404P6549M4224J4275j421j17088L7710N758J04116J34792M2623M0795M5258
7422C79187p779j70594j772P8652j63564n0242R7499N190K2208n714p3452L1677
7410A41296p0827p0625J18001L45j22338m9275K3988K3919k6570M8547N8212o3333
$$ plain form
7495 -153609 -108740 -21626 65132 68674 44035 101447 75995 40098 -22084 -39108 -28055 10957
7483 10957 82945 95532 6873 -1914 27850 -607 -59740 -41340 -86795 -80195 -83023 -28274
7471 -28274 -24301 -18834 98783 163815 133815 182647 175897 125304 125987 182464 115475 56186 24425
7458 24425 41420 -51669 -78129 -23273 8892 25211 75289 93065 48590 -71771 -73055 -45134
7446 -45134 -60041 -64631 -74214 48025 177756 165276 93815 108370 84766 38807 -13573 -48404
7434 -48404 28145 72369 86644 85223 -31865 5845 11603 115719 250511 293134 333929 379187
7422 379187 371408 200814 199042 277694 114130 63888 161387 166577 188785 183071 109619 141296
7410 141296 70469 -156 117845 118190 -4148 -53423 -29435 -5516 -32086 16461 74673 11340
7398A1340L2143m7269l7275L2824P1919M0482M7715j3917j01808N5403J12310
7387B03867j12304j16075p1092J3184R7076N3705N9517N4386o974N2683n0396
7376A77577q3937O3370l1078l4287K1991M9264j4130P64k9194p6230r0997m8128
7364i5015l6089J2438N4826L9243L875m1J11132m5699M0874R3032K5598m8188
7352A55986o6792j2215M9068J6881k0684l5062N8999N3935m9257N58K3423n6712
7340A18128q3880k165N2021l1259m4583J5151P1573Q6249m6152j11623Q334k6390
7328E404N3045N7431J06325n0085q4685j2053l9393l404o877k2805K6291J13482
7316A42676L902j08227j67032M1102J10375j3918o197K6844M4777K1532p964q7440
$$ plain form
7398 11340 43483 -3786 -41061 -8237 63682 104164 151879 137962 36154 91557 203867
7387 203867 91563 -24512 -95604 -82420 14656 68361 127878 182264 175290 227973 177577
7376 177577 93640 157010 125932 91645 113636 162900 148770 149534 120340 44110 -46887 -95015
7364 -95015 -131104 -118666 -63840 -24597 -20722 -20763 90369 44670 85544 178576 204174 155986
7352 155986 89194 76979 126047 142928 122244 87182 146181 200116 150859 151417 174840 118128
7340 118128 34248 32083 84104 52845 8262 23413 94986 181235 135083 23460 31794 5404
7328 5404 58449 115880 222205 172120 87435 75382 35989 32585 25708 2903 29194 142676
7316 142676 146578 38351 -128681 -87579 22796 8878 2681 29525 74302 95834 87870 430
7304D30J2123l6696M4547J20874k3996p5656k483k0699l0152j1830q2731k5331
7292a31600R9966J13939J42360P5151o9466j06742q0242j01438n3422M1343L9223
7281c0928K4654O8066R7393k8152n38m6334k9364j2175k347K9020Q2906O0731
7269B12932j12473p4053p1573J6159M031n2763K3108L8001L8500k251k324n7958
7257d0664K3873J39852J16960q8131j00146p4909q887J07388J0535K9941J3452
7246A29264J2624j8244r003k6655l412k0843k9732k5642N3889L6306M5544P6983
7234B21079J6577q4441p4228k5522k1216n7654o0239M2979O3390m8885k8193L1161
7222b5192o9379L2019L910l6800n8763n1528n3018K3971P2735R6032k661m1846
$$ plain form
7304 430 12553 -24143 20404 141278 117282 41626 39143 18444 -11708 -23538 -106269 -131600
7292 -131600 -31634 82305 224665 299816 230350 123608 43366 -58072 -111494 -70151 -30928
7281 -30928 -6274 61792 159185 131033 130495 84161 54797 42622 40275 69295 152201 212932
7269 212932 100459 26406 -45167 -29008 -24977 -77740 -54632 -16631 21869 19618 17294 -40664
7257 -40664 -16791 123061 240021 151890 51744 -23165 -32052 75336 85871 115812 129264
7246 129264 141888 123644 114641 87986 84574 63731 33999 8357 62246 98552 144096 221079
7234 221079 237656 153215 78987 53465 32249 -25405 -85644 -42665 20725 -28160 -56353 -25192
7222 -25192 -94571 -62552 -58642 -95442 -154205 -205733 -258751 -234780 -162045 -66013 -68674 -110520
7210a10520L2481j4018q750k4327R966O2185J14955m2903j14732k6491J27304
7199E150J9494O477R626l6446R32j7814p298Q7252m4021o2940J1516P5388k2293
7186B5023l8357k8689L4256m9355j9031m7716m3783j4838J10058M6215L7145J5376
7174B6304m7572k7369j602K8921K5240m0043Q8503L4624m4442m4584k3185Q4575
7162E9370J52461j6248l7774P673q7743p0185l446K0397K1434J15216L4102j6626
7150A78631k9260p740o0157L835J02976j6599r8036p5842K4754l8709M3915J7656
7138D5424o433K8403j2337J19990M4220o7685L3025m3684o2933j9686n7331M0653
7126D1626O1727k4834p8257O4582K620P3235j1928j13170o4880p5079r510O5188
$$ plain form
7210 -110520 -78039 -92057 -100807 -125134 -115168 -52983 61972 19069 -95663 -122154 5150
7199 5150 24644 31121 40747 4301 5233 -12581 -19879 67373 23352 -39588 -28072 47316 25023
7186 25023 -13334 -42023 -7767 -57122 -76153 -123869 -167652 -182490 -72432 -26217 10928 26304
7174 26304 -21268 -48637 -50239 -21318 3922 -36121 52382 87006 42564 -2020 -25205 59370
7162 59370 211831 195583 157809 165482 77739 7554 4108 24505 45939 161155 195257 178631
7150 178631 149371 141631 81474 85309 188285 171686 73650 -2192 22562 -16147 27768 45424
7138 45424 38991 67394 55057 175047 219267 151582 184607 140923 77990 58304 973 41626
7126 41626 103353 78519 262 64844 67464 140699 128771 15601 -49279 -124358 -133868 -68680
7114f8680J6309J06640K7650n2783j18475r1484J5850K8073P0353J42405k9728
7103D6130j33218N5187O8879l544n5580M6555M1294j7609Q020m7137o6794q3320
7091a41137L7152J22944P0462O9702m1765J6728q810r2287l1615K9377L2741j24226
7079f0734P7340J41962N175O5743r8489j12007l3393j4271O4790n9079l9845L6157
7067b6651k1200r044J2094o9283L4630K229M1345P5483O3410j2267J1107l980
7055I7873Q3317L7698m7863l6458j11725p3790l4563j7052r3252J1688R0992O2315
7043c0820k9310M428N4311O420j07207P1493j9872k1196J7510j0062K3884J62436
7031A22015k117p5084L7470l6635m2109j9760m3018k464o949L7562M5370m5547
$$ plain form
7114 -68680 -52371 54269 81919 29136 -89339 -180823 -164973 -136900 -66547 75858 46130
7103 46130 -87088 -31901 36978 33434 -22146 24409 65703 48094 56114 8977 -57817 -141137
7091 -141137 -103985 18959 89421 159123 117358 134086 125276 32989 1374 30751 63492 -60734
7079 -60734 16606 158568 163743 229486 130997 18990 -14403 -28674 36116 -22963 -62808 -26651
7067 -26651 -47851 -56895 -44801 -114084 -79454 -77225 -35880 39603 103013 90746 101853 97873
7055 97873 181190 218888 171025 134567 22842 -50948 -85511 -102563 -195815 -184127 -93135 -30820
7043 -30820 -60130 -55702 -1391 5029 -102178 -30685 -50557 -71753 -54243 -64305 -40421 122015
7031 122015 119898 44814 82284 45649 3540 -16220 -59238 -61702 -68651 -31089 14281 -31266
7019c1266Q29N8495J8242j8486L5903K1337q2042j02945M291J7508L0119R8440
7007E0425Q1659q8904o4778L4863J30647K7710p4564M0433j6590p8172M2391q167
6995G6953m859k1055m8255r8271L4088m738P8707M8757M3011o10P577J9643j29114
6982A834r0540L7436k3803k9778M0500p381l3131m1451k3947K2750J7177Q4430
6970d5904K9212J4150J19485N8438j57906m0216J16778P5238l7096j10554p0370
6959d8745K2456M3624n256P5190n0278n8959m814l2884N279L3344n1725K158K6855
6946d3755L7291k4167m9936K5837Q3569J35164M5066k8663j17619M0863k2849
6935H0801k6038k408p4948n0078j3273J6132J85506L4933J3372K9808r9923j27056
$$ plain form
7019 -31266 -30437 28058 46300 27814 63717 85054 3012 -99933 -95642 -78134 -48015 50425
7007 50425 132084 43180 -21598 13265 143912 171622 97058 137491 120901 42729 85120 76953
6995 76953 72094 51039 2784 -95487 -61399 -66137 12570 61327 104338 103728 111305 130948 1834
6982 1834 -88706 -51270 -75073 -104851 -64351 -71732 -104863 -146314 -170261 -147511 -130334 -45904
6970 -45904 -16692 -2542 116943 175381 17475 -22741 94037 169275 132179 21625 -48745
6959 -48745 -26289 17335 12079 87269 36991 -21968 -26782 -59666 -54387 -21043 -72768 -70610 -43755
6946 -43755 -6464 -30631 -80567 -54730 28839 164003 209069 180406 62787 103650 80801
6935 80801 54763 52355 -22593 -72671 -85944 -69812 115694 150627 163999 193807 93884 -33172
6923c3172J30327N4934n1392M1399K223j600r979m0362J0791K0175r8082o7909
6911d2647P7332P0790P5195l5700j58646M5165N6817l5408p1072J7875P7665m510
6899G2856l4243N2686q082o8443q3364j6607R5903N7214J30454M7443j89711j02915
6887d6809j4834j685M6865N5685J3819J5039L1178q9691l883p078j7963L9690
6875B0333j17473p7524P0714R4232J08750J71300o1887q7515j2431k286j10506
6864d293K6441k826O4662Q7956o7737n3969L1136j9718n7841J0516P8025m3807
6852D8545n0414O1685L5492j8233q6536q7624n3178Q1835Q1060J15466P2425o2918
6840A37605m993p9609n9081N750R6087L1080p489q0226M9369J13612L3031j0506
$$ plain form
6923 -33172 97155 152089 100697 142096 144319 142719 132740 92378 103169 123344 25262 -42647
6911 -42647 34685 105475 180670 144970 -13676 31489 88306 52898 -18174 -299 77366 72856
6899 72856 38613 91299 83217 14774 -68590 -85197 10706 67920 198374 245817 56106 -46809
6887 -46809 -61643 -63328 -16463 39222 53041 68080 99258 9567 5684 -1394 -19357 20333
6875 20333 -97140 -174664 -103950 -9718 99032 270332 208445 120930 108499 106213 -4293
6864 -4293 22148 19322 83984 171940 104203 50234 81370 61652 3811 14327 92352 48545
6852 48545 -1869 59816 95308 77075 -9461 -97085 -150263 -68428 12632 128098 200523 137605
6840 137605 132612 53003 -6078 -328 95759 126839 119350 39124 88493 202105 235136 224630
6828B24630p6269r4604p5256n8136r332P854k0327k7412N7200O9113j3199J0075
6816e663K0207J4232L1338M5626r4353r927P8879R459J7369n7436n428j08065
6804f3762q2057L2257J24144j948q5663o2186j574m3041J0510P4179P9775J735
6792a7631k5953K1232M3651J5342q9338j673l6128L1391N4670O5542n4210l3800
6780b6905L0189P3243K7027k1188j6047J5705m9486q7166k8761J48562K6609p0743
6768B1039l6121M2072J7876l1531q0582o002K9752O1077n060N1693l562o6121
6756e470N701M8843J0689l182n2562l8326Q4349J0565J6166M5432q4702k02578
6744a65075l9081J67673K7230Q3938n0527J3329M7732P023j8286m8495j3419m1000
$$ plain form
6828 224630 148361 53757 -21499 -79635 -88967 -81113 -101440 -128852 -71652 -2539 -15738 -5663
6816 -5663 14544 28776 60114 105740 11387 1460 80339 89798 107167 49731 44303 -63762
6804 -63762 -145819 -113562 10582 8634 -77029 -139215 -140789 -183830 -173320 -99141 -19366 -17631
6792 -17631 -43584 -22352 21299 36641 -52697 -54370 -90498 -59107 -4437 61105 6895 -26905
6780 -26905 3284 76527 103554 82366 66319 82024 32538 -54628 -83389 65173 91782 21039
6768 21039 -15082 26990 44866 13335 -67247 -73249 -43497 17580 12520 64213 60651 -5470
6756 -5470 231 49074 59763 56581 4019 -34307 50042 60607 76773 122205 37503 -165075
6744 -165075 -204156 -36483 -9253 74685 24158 37487 85219 92242 73956 25461 12042 -28958
6732b8958l1045N4272P9371Q3208N8905n2349l1082P7898J05853Q3245N8934J33853
6720E92105J61323J39816K29033L35046K51258K58915k6871k09403k94411l31039
6710A105772l02566k03252n8224L3120m635J8557l8408j08329j00749M7279J10244
6699D98809j43186j16955q7338k0761K6992l0381k205J02033J8046r7216p543
6688A40295l6657N5361j08160j32203j9093J12234L6070O8766L831o5913L9713
6677I4244O0869l4239o1895k313p1623j2486M4260L1441m8411q8979q092J8945
6665g8279P2367Q9176M5496m7184q5061P250K063j5713P1217K7070L7954N4568
6653A80924m4245Q848P0259K6026j51120o7943K4349P0922j7635n8372j69898
$$ plain form
6732 -28958 -60003 -5731 73640 156848 215753 163404 132322 210220 316073 399318 458252 592105
6720 592105 753428 893244 1122277 1457323 1708581 1967496 1940625 1731222 1436811 1105772
6710 1105772 803206 599954 541730 574850 570215 588772 550364 442035 341286 388565 498809
6699 498809 355623 238668 151330 130569 157561 127180 124975 227008 245054 147838 140295
6688 140295 103638 158999 50839 -81364 -100457 11777 47847 116613 120444 54531 94244
6677 94244 155113 120874 58979 56666 -14957 -27443 16817 48258 -153 -89132 -97224 -78279
6665 -78279 -5912 83264 128760 81576 -3485 3765 5828 -9885 61332 88402 126356 180924
6653 180924 136679 145527 215786 241812 90692 22749 47098 118020 100385 42013 -127885
6642a27885j4955N4430m1685j8633N337J6586O3333L8197L9720J18204p6885l8029
6630A7735k6389N5733J9344m9612k8842o8310K6093J25665j6504L6690p122j4710
6618F9771q3060L3073J7441j3104m8379Q5532J8737L8372j0950j0639n7578j21329
6606h2113K5651O1946N1225j5203q2267o4006M4624O309K6070P2535K2803j28593
6594f1019M1268O2321p1491n1726L2815J7066j3541R5056L720J789k7308O290
6582C5240p0797j55659k4268J04602O4820J6483L5139L6200k1777N0706N7066
6571A27755j2317n3940j67020k3184l649L8721J13904Q8113j43o1897r9455O999
6559d6113P9377M3061k0950P184m8871o9813m760J13317J9189j02523j07653o7085
$$ plain form
6642 -127885 -142840 -88410 -130095 -148728 -143391 -126805 -63472 -25275 14445 132649 55764 17735
6630 17735 -8654 47079 66423 16811 -12031 -80341 -54248 71417 54913 91603 84481 69771
6618 69771 -13289 19784 37225 24121 -24258 61274 80011 118383 107433 96794 39216 -82113
6606 -82113 -56462 5484 56709 41506 -40761 -104767 -60143 -53834 -27764 44771 67574 -61019
6594 -61019 -19751 42570 -28921 -80647 -47832 -30766 -44307 50749 54469 56258 28950 35240
6582 35240 -35557 -191216 -215484 -110882 -46062 -29579 5560 41760 19983 70689 127755
6571 127755 115438 61498 -105522 -128706 -132355 -93634 20270 108383 108240 46343 -53112 -46113
6559 -46113 33264 76325 55375 62559 13688 -56125 -60885 52432 71621 -30902 -138555 -205640
6547b05640l960P0811N1245L4107Q3582O9063j06854p5186M7668M8156M3151R887
6535F6030q0270m5237n520j06118o8875j315P7050J0048p003Q9482N1948q8095
6523a07875j7756J30903K1513p3653R6769L9118q7669j15713k7042L4544J4955
6512i1906R5840j3395J3695J05097q7799q6578r7701L837P607J06856L1235j903
6500a5115P7692q443j49240K3142O9766L7423q0353K8033K6942L8187J6052m6665
6488A7421r1706k0229l518P1743Q4257M1002J7469k6052L00K6770K865L0468k7526
6475A23264n603j15364p763L3685p8191n4646J10579J25745O954j68605j13550
6464a43495J6038O0665n812P7424J15610P2147m0914l5442N2809r366k2779n9206
$$ plain form
6547 -205640 -209600 -138789 -87544 -53437 30145 99208 -7646 -82832 -35164 12992 56143 66030
6535 66030 -14240 -59477 -64997 -171115 -239990 -241305 -164255 -154207 -161210 -71728 -19780 -107875
6523 -107875 -125631 5272 26785 -46868 49901 89019 1350 -114363 -141405 -106861 -91906
6512 -91906 3934 -9461 4234 109331 21532 -65046 -162747 -158910 -151303 -44447 -13212 -15115
6500 -15115 62577 54134 -95106 -71964 -2198 35225 -45128 -17095 9847 48034 64086 17421
6488 17421 -74285 -94514 -98032 -26289 57968 98970 116439 90387 90687 117457 120322 150790 123264
6475 123264 117661 2297 -5466 28219 -49972 -104618 5961 131706 138660 -29945 -143495
6464 -143495 -127457 -66792 -72604 4820 120430 192577 151663 116221 169030 159664 136885 77679
6452G7679l9590k5313J0821O2057j0715p2920K9503J1543J7647Q2112R531n2676
6440I9679j08720j29867P5735J39375M1546l2863l7531l8774q312k8691L8348
6429I925J38774l6736j65079n8395l9123j06052j1512J40998J27260P8851m7083
6418C1828p7787O8466L0256j1411r7971j24486l3881P0563O9944r951M8011j2821
6406d9240j9606P3553J20995L2885N158p3667l6521L2095J3026p4224N9743L3720
6394A17917q0920K5642O6062J2877o7239m6084j0796m4061m5809J0517J5637J2881
6382c3376L7001M7669J6085n5109N0693q589j06958p255J13132R2317p5519k9780
6370D0311Q1628P0183k8388N049l4281j15213p3911q5640P8099K1019m311L2534
$$ plain form
6452 77679 38089 12776 23597 85654 74939 2019 31522 43065 60712 142824 152355 99679
6440 99679 -9041 -138908 -63173 76202 117748 84885 47354 8580 268 -28423 9925
6429 9925 148699 111963 -53116 -111511 -150634 -256686 -268198 -127200 60 78911 31828
6418 31828 -45959 22507 52763 41352 -56619 -181105 -214986 -144423 -74479 -84430 -36419 -49240
6406 -49240 -68846 4707 125702 158587 163745 90078 53557 85652 98678 24454 84197 117917
6394 117917 36997 62639 128701 141578 74339 28255 17459 -26602 -72411 -61894 -46257 -33376
6382 -33376 3625 51294 67379 12270 62963 54374 -52584 -59839 53293 145610 70091 40311
6370 40311 121939 192122 163734 168783 134502 19289 -54622 -140262 -62163 -41144 -45455 -12921
6358a2921n6566M510J4567m691J8689k223K0714K7967M472P9574K06l204l733
6345H7361k405j15680K5007Q3317k7857k3776o1653n1653M7755r2121q609M2536
6333i7778N0900R8982K5841K1908n1394p7063n8612n139l9566j2449J56379J02309
6321A14318l4544j12135l283n9691N1920R7365p558n7432L6909M3271k7807p0212
6309b8879l7554R0499J9767J8545N361n2920m7600O1644J9041K2032j7662Q1071
6297A33345J9169p0271K1080m6440j5634j8344m2273k2372k7721k5158K0329k1086
6285i5376j8089J26097J39069l3107K1730n4200r5544l4234j1971L7208K0648
6274B231n0334M8867L930l0203J34236q455j07520j9245Q035r5859J4871J8182
$$ plain form
6358 -12921 -69487 -64977 -50410 -55101 -36412 -38635 -17921 10046 14518 94092 94298 91094 87361
6345 87361 84956 -30724 -5717 77600 49743 25967 -35686 -87339 -39584 -131705 -140314 -97778
6333 -97778 -46878 52104 77945 99853 48459 -28604 -87216 -92355 -131921 -144370 12009 114318
6321 114318 79774 -32361 -35644 -95335 -43415 53950 46392 -11040 25869 69140 41333 -28879
6309 -28879 -66433 24066 43833 62378 67739 14819 -32781 28863 47904 69936 52274 133345
6297 133345 152514 82243 103323 56883 41249 22905 -19368 -41740 -69461 -94619 -74290 -95376
6285 -95376 -113465 12632 151701 118594 140324 86124 -9420 -43654 -55625 -18417 2231
6274 2231 -48103 764 4694 -25509 108727 100272 -7248 -26493 -18458 -114317 -99446 -81264
6262h1264L9144k1680n7443J9963R2343q1365k1430O988R557J514o1308k7439
6250a82420L7628M5406O666m997j6767q1278L6695K3024k1098L5414N0848O680
6238f4199j6866m2681j0732N8457j0774K6858k1765p2280n5111q0378J39153N1653
6226i8665l9289Q0186J8116K5121N6541o7504N3363q841k5901L0605K6539j28585
6214g8314n3859n0099l3864q244J4989P9718J06080q9083j05134Q0290Q6504Q1755
6202C0739p0311j56335p5595J01684Q6362r142n5686K5395J40771J2041J6127
6191D6050j40095j09862m0974J5634O6605J29070j00216l5399R6120L4990p1620
6180a09697p1474k4122M0791J662M9538l971Q737O211l9106q8039P7331m8171
$$ plain form
6262 -81264 -42120 -63800 -121243 -101280 -8937 -90302 -111732 -104744 -95187 -93673 -154981 -182420
6250 -182420 -144792 -99386 -92720 -97717 -114484 -195762 -159067 -136043 -157141 -121727 -70879 -64199
6238 -64199 -81065 -123746 -134478 -76021 -86795 -59937 -81702 -153982 -209093 -289471 -150318 -98665
6226 -98665 -137954 -57768 -39652 -14531 42010 -25494 27869 19028 -6873 23732 50271 -78314
6214 -78314 -132173 -182272 -216136 -224380 -209391 -129673 -23593 -112676 -217810 -137520 -51016 30739
6202 30739 -39572 -195907 -271502 -169818 -83456 -92598 -148284 -122889 17882 29923 46050
6191 46050 -94045 -203907 -244881 -229247 -162642 -33572 -133788 -169187 -73067 -38077 -109697
6180 -109697 -181171 -205293 -164502 -162840 -113302 -117273 -108536 -102325 -141431 -229470 -152139 -200310
6168b00310m3722l4836M9261N7650R7992l7333P0501L4653k3835j5732L956N8370
6156A6615j8284l2976p3655N0328j0639k1049J05629N9353k3526J7547K1501J049
6144I1893q2902n0627k9109m0697j527M760J1959P3444N7941k6936L1560P6007
6132A15766K0192k8843O1899K9360j63058j34679L147M484l108N3487M5518j08666
6120a04501j4544P0281J7913L2125P7455k1104o024p8635o5611J0248O2503q515
6108b8409N611q104n962J023k6779L758N0799j2287n1184k6513J3547N0328K1421
6095a2751K027m1762J161p0729m6340M3509N5899O1289j3987n9632l5696K8489
6083h8523K6363r4164j0495r5556L1217J27647N9569j09208p006K7317p115n39
$$ plain form
6168 -200310 -244032 -278868 -229607 -171957 -73965 -111298 -40797 -6144 -29979 -45711 -41755 16615
6156 16615 -1669 -34645 -108300 -57972 -68611 -89660 15969 75322 51796 69343 90844 91893
6144 91893 8991 -41636 -70745 -111442 -112969 -108209 -96250 -22806 35135 8199 39759 115766
6132 115766 135958 107115 169014 198374 35316 -99363 -96216 -91732 -94840 -41353 4165 -104501
6120 -104501 -119045 -48764 -30851 1274 78729 57625 51601 -27034 -92645 -82397 -19894 -28409
6108 -28409 -22798 -30902 -36864 -35841 -62620 -58862 -8063 -20350 -71534 -98047 -84500 -34172 -12751
6095 -12751 -10724 -52486 -51325 -122054 -168394 -124885 -68986 -7697 -21684 -81316 -117012 -88523
6083 -88523 -62160 -156324 -166819 -262375 -231158 -103511 -43942 -153150 -160156 -132839 -139954 -140493
6071a40493P5707n1925M6231J46361K6795L0603l1085r831n9886l9467M5609k4889
6059A3730k4358O0872M2968j07767n5674J507o8127q138L5780M935J1698R509
6047h3065p1046p868j5501P8136J17621L132R7281J11385n4986q3627k5351K6135
6035I2246m3999n122L6745k9269J07394R7406n1370r7608O7268k2357j36065j065
6023A4204K1211j0585O6914J7147K6866n9725j27620k0348K6384P314O1465O5824
6011H9051J0159p5976J050N666o7526K1826O5119K6980k8207J3254J6140k8312
5999D9224l5167k9560q8550l4524O3717M0405L827l1828k3529j3176N1235R1501
5987D3575N0182K8347j8090n0082r8774o8490j01028k4866j1788L8889o8735O846
$$ plain form
6071 -140493 -64786 -116711 -70480 75881 102676 133279 102194 92363 32477 -6990 38619 13730
6059 13730 -10628 50244 93212 -14555 -70229 -68722 -136849 -144987 -109207 -104272 -92574 -83065
6047 -83065 -154111 -161979 -177480 -99344 18277 21409 118690 230075 175089 91462 66111 92246
6035 92246 48247 43125 79870 50601 157995 255401 204031 106423 173691 151334 15269 14204
6023 14204 35415 24830 91744 108891 135757 76032 -51588 -71936 -45552 -38238 23227 89051
6011 89051 99210 23234 24284 29950 -37576 -15750 49369 76349 48142 61396 77536 49224
5999 49224 14057 -15503 -104053 -138577 -74860 -34455 -30628 -62456 -85985 -99161 -47926 43575
5987 43575 93757 122104 104014 53932 -44842 -113332 -214360 -239226 -251014 -212125 -280860 -274014
5975b74014J32847J00751N9901J4747J5452m544m2538m2464N8751N705j2126O777
5963A9245j6089M9303r478Q914O4769l2386j09820L8463M4232K1323m2697l9027
5951c248P0944j1442r295l9579k5134J4528j7995M2375Q1556K0768j44626l1300
5939e2448M3727J13179n7512o7585j07871l8644K96J75374R593O865M1971j15731
5927d8786j5093J06340j3426j01078o0102O0040m55K5711J1890j04061K4942J06623
5915g455n6123j62576J20343O6146k0291j4523Q4193j8897j3795j35806L1220
5904a27564J36650o6972m6997p637m3890P3023j48680j1972J03431j00525l7520
5893b78653J72555N8134n0469n3567L8490N612J8396O1331j8485j2148k2018k0710
$$ plain form
5975 -274014 -141167 -40416 19485 34232 49684 45140 2602 -39862 18889 24594 12468 19245
5963 19245 3156 52459 42981 51895 116664 84278 -25542 12921 57153 78476 35779 -3248
5951 -3248 67696 56254 46959 7380 -17754 -3226 -21221 21154 102710 123478 -21148 -52448
5939 -52448 -8721 104458 46946 -20639 -128510 -167154 -166858 8516 18109 24974 66945 -48786
5927 -48786 -63879 42461 29035 -72043 -132145 -72105 -72560 -46849 -34959 -139020 -114078 -7455
5915 -7455 -63578 -226154 -105811 -39665 -59956 -74479 9714 -9183 -22978 -158784 -127564
5904 -127564 9086 -57886 -104883 -112520 -156410 -83387 -232067 -244039 -140608 -241133 -278653
5893 -278653 -106098 -47964 -98433 -152000 -113510 -107898 -89502 -28171 -46656 -58804 -80822 -101532
5881a01532j0440o9461O1966O292N342m6013k7200J17957J21987j1974R898J10751
5869A67573n195j39151n2246r1877L3818L3474N2236m7377Q737O8048J6072j5870
5857B8242o8441N0958N8778n9310M9132M3039k6694o3885j11895M7007J31347
5846G8278O1471p3821o0096n9654Q830n202N5281M0552L317N2941L740M587m0475
5833F9749r2617q5720n5102N585N1847R3981M2070J8151j7998l0625M6745q106
5821C7960k7362n6870j569p0848o473J07878l5914J7026L5875l928K848K7402
5809B6025M5208n4622m2729k4122l7788L0105n910q574M495o254r083n3068J1071
5796a25246j8418J1218P7660Q9963l6361K5972J22055J5144q2140p3321K0071
$$ plain form
5881 -101532 -111972 -181433 -119467 -113175 -107833 -153846 -181046 -63089 58898 46924 56822 167573
5869 167573 162378 23227 -29019 -120896 -87078 -53604 -1368 -48745 -40008 28040 44112 28242
5857 28242 -40199 10759 69537 10227 59359 102398 75704 11819 -100076 -53069 78278
5846 78278 139749 65928 5832 -53822 -44992 -50194 5087 45639 48956 101897 105637 110224 69749
5833 69749 -22868 -108588 -163690 -158105 -106258 -12277 29793 47944 29946 -679 46066 37960
5821 37960 10598 -46272 -47841 -118689 -125162 -17284 -53198 -36172 -297 -4225 -1377 26025
5809 26025 71233 16611 -26118 -50240 -88028 -57923 -63833 -72407 -67912 -74166 -83249 -136317 -125246
5796 -125246 -143664 -132446 -54786 35177 -1184 24788 146843 161987 79847 6526 26597
5785B6597n5780n4264m896l2198L3683P3899Q4580j6105L4591K5155N5395j0594
5773A60063r1816j17046j08415j11999O4270P3606J52504M2472j5638L4988l017
5762G9972m8418p0774j1201N3174N8294j9878j4977l4605m5448l9538j5987K6192
5750h3194j96m3561J13422R9592o235p0991j29444j0381O4275P0326P9751k0725
5738F2639j10194J8472P3872j4754l9435o1172k7763L1461R9966O5404J0263k1992
5726H6767l5292J5080l3510m1631m440O1630J3888n7474J7202l1595j08092j04620
5714b22087K0806p0820q5060J10478Q0707J9949K7634J8746J7317l6300J1721
5703a06909N1013P0592j312j14136K5635R0051m001L1540Q355j13544k0964j7192
$$ plain form
5785 26597 -29183 -83447 -88343 -120541 -86858 -12959 71621 55516 90107 115262 170657 160063
5773 160063 68247 -48799 -157214 -269213 -204943 -131337 21167 63639 48001 82989 79972
5762 79972 31554 -39220 -50421 2753 61047 41169 26192 -8413 -53861 -93399 -109386 -83194
5750 -83194 -83390 -126951 -13529 86063 79828 8837 -120607 -130988 -66713 3613 83364 62639
5738 62639 -47555 -29083 44789 30035 -9400 -70572 -98335 -66874 33092 98496 108759 86767
5726 86767 51475 66555 33045 -8586 -13026 48604 62492 5018 22220 -9375 -117467 -222087
5714 -222087 -201281 -272101 -357161 -246683 -165976 -146027 -118393 -99647 -82330 -118630 -106909
5703 -106909 -55896 14696 13384 -100752 -75117 14934 10933 42473 50828 -62716 -83680 -100872
5691a00872K4311O5355K1964p7011n178l7030j6922J11909r197j2674j1311j18141
5679a64797P5599q8494j7924R4673l3023L9348J00175O6737j26398p1448L6043
5668h9509n3803P27M5355J1117R6045j8454j02409j661R3498O3431Q3822n4318
5656G3841o4351N0393j22044l327P6227L0599K33l3345n0761r3915j4782K1913
5644a29319J03329L2965N447R0263K7040N2550p1816j30143k7517n9288p9115
5633a85604l2208O1083Q6879J6088K1749m6811k1895P0770K9791P2332J1600j72098
5621h8324q8961R1822M4703r00l708k5598j9210K5025J4658K7007R5335J36171
5609B08020r9798j8184n4937p0630k8007r657P9337L0768j21897K7316j9673o0311
$$ plain form
5691 -100872 -76561 -11206 10758 -66253 -71431 -108461 -125383 -13474 -22671 -35345 -46656 -164797
5679 -164797 -89198 -177692 -195616 -100943 -133966 -94618 5557 72294 -54104 -125552 -89509
5668 -89509 -143312 -142585 -97230 -86113 9932 -8522 -110931 -112592 -19094 44337 128159 73841
5656 73841 9490 59883 -62161 -65488 10739 41338 41571 8226 -42535 -136450 -151232 -129319
5644 -129319 -25990 6975 12422 102685 129725 182275 110459 -19684 -47201 -106489 -185604
5633 -185604 -217812 -156729 -69850 -53762 -32013 -78824 -100719 -29949 -158 72174 83774 -88324
5621 -88324 -177285 -85463 -40760 -41660 -45368 -70966 -90176 -65151 -50493 -23486 71849 208020
5609 208020 108222 90038 35101 -35529 -63536 -73193 6144 36912 -84985 -57669 -77342 -137653
5597a37653K0847o2774j327L7853j09687M648J03204R9615K1638p7882P6210O7710
5585D2402r55l8056M4328L1336j1318q456p299m9803m933N1556j34297K1446P3753
5572I704L2125o1624n5551m5353R5038K7287O1157M8169K1871j4185k311o586
5560A09741l3367k6535o015l6582n2671P3439M5334L7078N6268L2780k4529j5363
5548A59578j21241q0207k5513m9872j3085o3525L7623J18420J7768m5509O8375
5537B812N4716l610q8393n730o4945L1236J3759l9191P4061P2947k022o4492k3210
5524d2062K191l3737j0020j6490l3066M1092R0316P226r7117P330N1334O8303
5512C5300j9701J7354j03187j04831Q4401P0924m6068p6535m2858Q4942R119M0823
$$ plain form
5597 -137653 -116806 -179580 -180907 -143054 -252741 -248093 -144889 -45274 -23636 -101518 -25308 42402
5585 42402 41447 3391 47719 79055 67737 59281 51982 2179 -2754 48802 -85495 -64049 9704
5572 9704 41829 -19795 -75346 -120699 -25661 1626 62783 110952 132823 118638 116327 109741
5560 109741 76374 49839 43824 7242 -45429 28010 73344 110422 166690 199470 174941 159578
5548 159578 38337 -41870 -67383 -117255 -130340 -193865 -156242 -37822 -20054 -65563 2812
5537 2812 57528 53918 -34475 -40205 -105150 -73914 -60155 -99346 -25285 47662 45640 -18852 -42062
5524 -42062 -39871 -73608 -83628 -100118 -133184 -92092 -1776 5450 -91667 -84337 -33003 35300
5512 35300 15599 32953 -70234 -175065 -90664 -19740 -65808 -142343 -185201 -100259 -91140 -50317
5500e0317M995r600L3413P6032K5883q4477M8677Q4157o9142J7762J20608k306
5488A95685l5383j78419M539j5443m0578O2039m233M2524K2123p0277o52Q4824
5476F6749M3029m5077n462J8496r5388p4735M9336J48687M9958R7762q749q075
5464B36531j16829r2091L1910J43l9235Q810N8863l0525l7793m1762q5536J02232
5452e282L4191m1899j9889J0637J7879L6543k7499l3078J7791R91m6052o3398
5440a19065J5425M8729M0771p2970l2459P4764p6481l3504K8307l820L2728M4458
5428e3117j4735O963M2064L1531o1736o2582n0182O6409J8681L1214j9332n276
5416g0098Q0112K7521J73035n9493o5060j4712l6256J3376k6961j5316J0447r6899
$$ plain form
5500 -50317 -45322 -54922 -21509 54523 80406 -4071 44606 128763 59621 77383 197991 195685
5488 195685 160302 -18117 -13578 -29021 -69599 -7560 -11793 30731 52854 -17423 -18075 66749
5476 66749 109778 64701 59239 77735 -17653 -92388 -43052 105635 155593 253355 244606 236531
5464 236531 119702 27611 59521 59664 20429 29239 88102 57577 19784 -21978 -107514 -5282
5452 -5282 28909 -12990 -32879 -22242 -4363 32180 4681 -28397 -10606 -9615 -55667 -119065
5440 -119065 -103640 -54911 -14140 -87110 -119569 -44805 -121286 -154790 -126483 -130303 -97575 -53117
5428 -53117 -67852 -60889 -18825 12706 -49030 -111612 -161794 -95385 -76704 -45490 -64822 -70098
5416 -70098 10014 37535 210570 151077 86017 71305 35049 48425 21464 6148 16595 -80304
5404h0304l8316J17829m64o593K3886k7045q888q7625K7445Q2536o36m3710o003
5391d7888Q8623n794m1542j4960K1995N29p4027J645L1932l8825J8337r726M0151
5378b9550N4521p9824k2851L0840l6731n3810K5067K0746N0958J7489K2927m0943
5366d1161k2837r438K4333J0937o2414n2858N4007M6592N8898J7978k9940K2840
5354A6937K6925N9512q6416r7879Q9743J47056Q1426p3218k6152k4943j1543M2835
5342A44283m2371l0696q82o9919o511j23170m9062J15615Q700l5881R1610p386
5330e670k6024j03147R472O5695N5898n9434O3433R4098j9437J6282p6995R936
5318B4107o3142l1921Q6284j913j0381m9702n0804p5l859n384J27997m7082q174
$$ plain form
5404 -80304 -118620 -791 -1255 -7848 16038 -11007 -19895 -107520 -80075 2461 1825 -41885 -47888
5391 -47888 40735 34941 -6601 -21561 434 963 -73064 -71419 -39487 -78312 -59975 -69701 -29550
5378 -29550 24971 -54853 -77704 -46864 -83595 -137405 -112338 -91592 -40634 -23145 -218 -41161
5366 -41161 -63998 -73436 -49103 -38166 -100580 -153438 -99431 -52839 6059 24037 -5903 16937
5354 16937 43862 103374 16958 -80921 8822 155878 237304 164086 137934 112991 101448 144283
5342 144283 101912 71216 70334 415 -6096 -129266 -178328 -62713 -54013 -89894 1716 -5670
5330 -5670 -31694 -134841 -125369 -59674 -3776 -63210 223 94321 74884 91166 14171 24107
5318 24107 -39035 -70956 15328 13415 3034 -46668 -97472 -97547 -101406 -106790 21207 -25875 -34049
5305c4049j3353J8016j0574p9353j8309n6962J6310Q7351O1310K6272l7496k1885
5293f2722j21000o5166K0374P4294M9995M8366P9839l2208j0116K750o184l8840
5281f0618J5929J2083n073P8422L6296r2131p269J50653J3369r8263o5456N6813
5269C4755q1757p8828K2731m0608P9918O3939R016K4764j13374j9807k5317J5443
5257a09125m2134N2832P0436K4650m1791K3008n2867m4588n6646m6657L4661J34910
5245e3311J02020J5524J204l9845K7637M5457n7693k0430n6772j43440L2428J47178
5233d3Q1752l4320j9387M3466k8272j05867m4112K6106l458J1809j04114K1548
5221a54892L3805Q1518j03292q5J33222L8288k668j2191j0686L4311o7206o3851
$$ plain form
5305 -34049 -47402 -29386 -39960 -119313 -137622 -194584 -178274 -90923 -29613 -3341 -40837 -62722
5293 -62722 -183722 -248888 -228514 -154220 -104225 -55859 23980 -8228 -18344 -15594 -21778 -60618
5281 -60618 -44689 -32606 -37679 40743 77039 -15092 -22361 128292 141661 43398 -22058 34755
5269 34755 -47002 -125830 -103099 -143707 -63789 150 9166 33930 -79444 -99251 -124568 -109125
5257 -109125 -151259 -98427 -27991 -3341 -45132 -22124 -74991 -119579 -176225 -222882 -188221 -53311
5245 -53311 48709 64233 65437 25592 53229 98686 40993 20563 -36209 -179649 -147221 -43
5233 -43 81709 47389 28002 71468 43196 -62671 -106783 -80677 -84135 -72326 -176440 -154892
5221 -154892 -121087 -39569 -142861 -142946 -9724 28564 25896 13705 3019 37330 -29876 -93727
5209i3727j3977q1440p2035L6367J12004O6870K9731j2471L9804o6900j08936
5198a64710O2758J5894k2104j19055n71O430P8593N301r8946N7563L2307J1240
5186a35300N1841k0600K2750L5556k8995M0172J2725l5243k5405l6629J862m8654
5174a65920m211M2626m460K7008K4633J22679R7140o9151j36314j43971l3046
5163b42987M3539L4488Q946L278N6096J7974J9313J34J0578l767j7563J6172J06486
5150E2687P0933j28283j01584K6224k474J4563k124j02777n3557O6153m6258O2952
5138a43545K2595l484l1381m3993P1652J38219m753J2201N8075N035q6106p2670
5126g8155N368Q1880K8694k5630n2769k3601o8491J00639P7522K8185k3268j6912
$$ plain form
5209 -93727 -107704 -189144 -261179 -224812 -112808 -45938 -16207 -28678 11126 -55774 -164710
5198 -164710 -101952 -86058 -108162 -227217 -227788 -221358 -142765 -137464 -236410 -178847 -146540 -135300
5186 -135300 -83459 -104059 -81309 -45753 -74748 -34576 -21851 -57094 -82499 -119128 -117266 -165920
5174 -165920 -170131 -127505 -131965 -104957 -80324 42355 139495 70344 -65970 -209941 -242987
5163 -242987 -199448 -164960 -156014 -152736 -96640 -78666 -59353 -59219 -48641 -52408 -69971 -53799 52687
5150 52687 123620 -4663 -106247 -80023 -82497 -67934 -70058 -172835 -226392 -160239 -206497 -143545
5138 -143545 -120950 -124434 -155815 -199808 -128156 10063 5310 17511 75586 80621 -5485 -78155
5126 -78155 -72787 9093 37787 12157 -40612 -64213 -132704 -32065 45457 73642 50374 33462
5114C3462P593r3564k2860J2234P457j01166J6609J93587P678J8596j5781L1172
5102I5017J6144m3171j7154J0280r0176m0081N7035J32794o4506l6159M5876N1358
5090A17257o490q6057k7494J34936M8307n9890j26319l4191J04240J03865j34889
5079C3275o8383J09600M1487k3616l1019j00667q629m4140n4770M972R1720q7430
5067a37600j5393J24641P2626L5677n0783l3804o6761j3881k7992k6186J0247
5056a29209N5393j7339M4100j2209p145J5757n045p4420J1720J0879J53471L7710
5044H3663M3158L9663j2875j35235m1224L812o2588l8920N3241J74360J46035
5033B53090j2618N262p035l0983l9747l0367L4103K2491j4766k9964J3199m2699
$$ plain form
5114 33462 41055 -52509 -75369 -63135 -55678 -156844 -140235 53352 61030 79626 63845 95017
5102 95017 111161 67990 50836 61116 -29060 -69141 -12106 120688 56182 20023 65899 117257
5090 117257 110767 24710 -2784 132152 180459 120569 -5750 -39941 64299 168164 33275
5079 33275 -35108 74492 115979 92363 61344 -39323 -47952 -92092 -146862 -141890 -50170 -137600
5067 -137600 -152993 -28352 44274 79951 29168 -4636 -71397 -85278 -113270 -139456 -129209
5056 -129209 -73816 -91155 -47055 -59264 -66409 -50652 -55697 -130117 -118397 -107518 45953 83663
5044 83663 126821 166484 153609 18374 -22850 -19038 -81626 -120546 -67305 107055 253090
5033 253090 240472 245734 238699 207716 167969 137602 171705 194196 179430 149466 162665 119966
5021A19966p2906n4362N2365m2695p5116n7147M9907Q8092p3862j04464J36626
5010c3596j5956l7062k3546q0019n615L5630P4798L366N4225N0618n1992j06629
4998a35778J8346j6265q319N3068l221p117J09181o408m5993P3782R4192K8360
4986A53828L616o5175k0541O5236n2402l1511l7481k0714J4374L7161k278K577
4974D6690m1509L498j0114J4351M688n1303n7057r58P8245L001o2219O6932J09014
4961A03259P8205q3506r4830m9513K830R9151P2451j2696p802K9939m4303o5415
4949B7770k809M717L2665l4182L0879p8263K5367q1457O3939K513K8192P9920
4937I9251J0599j962M4369j4929m3467J5345p194j372n2319j67811o8575K6009
$$ plain form
5021 119966 47060 -7302 45063 2368 -72748 -129895 -79988 8104 -65758 -170222 -33596
5010 -33596 -49552 -86614 -110160 -190179 -195794 -160164 -85366 -82000 -27775 22843 -29149 -135778
4998 -135778 -117432 -133697 -142016 -88948 -92169 -99286 9895 3487 -42506 31276 125468 153828
4986 153828 157444 92269 71728 136964 84562 53051 15570 -5144 9230 46391 44113 46690
4974 46690 5181 8679 -1435 12916 17604 -33699 -90756 -91714 -13469 -10468 -72687 -5755 103259
4961 103259 181464 97958 3128 -46385 -43555 55596 128047 115351 107549 137488 93185 27770
4949 27770 24961 29678 62343 28161 59040 -19223 6144 -75313 -11374 -8861 19331 99251
4937 99251 109850 107888 152257 137328 93861 109206 102012 100640 48321 -119490 -188065 -162056
4925a62056J00736L8508l3303J2101L2692K4327o8961j8938j1788K5426n3302
4914a14558r330K8935j5971m3753q2458M5157J03497J27748j2275j20384Q9734
4903c658N5334p9326L9020O6398n5088l2394J3378L4396N8579j03322o8192k7859
4891a02734q814l9778k6995j1058M0796j4490p3085j8377O5747K8720r608l5402
4879b05078J14453N2657m5679m9393K5361o0104o798N0361p6318K1041P2642N1378
4867e5477O0277o296q2908n7332K0664k3095K7903L4922k4625j4053O9343N5761
4855E084M8626j6193n5668N7446j07993j22534k0007J3518N2685m3233k1105l5479
4843b44853P2714J59953Q0888R869j17129r2287O2661J6694p9945J00141J06490
$$ plain form
4925 -162056 -61320 -22812 -56115 -44014 -11322 13005 -55956 -74894 -86682 -61256 -114558
4914 -114558 -123888 -94953 -110924 -154677 -237135 -191978 -88481 39267 26992 -93392 -3658
4903 -3658 51676 -27650 11370 77768 22680 -9714 3664 38060 96639 -6683 -74875 -102734
4891 -102734 -111548 -151326 -178321 -189379 -148583 -163073 -236158 -254535 -188788 -160068 -169676 -205078
4879 -205078 -90625 -37968 -83647 -133040 -107679 -167783 -174581 -124220 -200538 -179497 -106855 -55477
4867 -55477 4800 -1496 -84404 -141736 -121072 -144167 -116264 -81342 -105967 -120020 -50677 5084
4855 5084 53710 37517 -18151 39295 -68698 -191232 -211239 -197721 -145036 -188269 -209374 -244853
4843 -244853 -172139 -12186 68702 78571 -38558 -130845 -68184 -51490 -131435 -31294 75196
4832G5196k055j18123L9506M9968J1465n249m6516j02263P6137N4195J5255J913
4820D9429j09368j34655o4849m085J19369M3770M7133j10394l7364K134K2601
4809a76279j9089Q8549P8764M6837m0154K0670K802m329K293N4528j8391r9297
4797f3096n3068J4206m6807R8751J87026N7575l3072q9332j87027o9966j5248
4786b00058l2752Q2863P9723O9338k3788o8520K417K3094J05509q707j26448o2776
4774a60105J16274L9685M426m6883p0058K6302k2836P2586O376k87J7661L1883
4762A5024q2058l1324p90P7277p9349q0385p7921L2738N7668M7953Q0320o0818
4750a01665j18330J7980o158K8000J05480Q9509L080j22095l8759j1924P8233
$$ plain form
4832 75196 73141 -44982 -5476 44492 55957 50708 4192 -98071 -21934 32261 47516 49429
4820 49429 -59939 -194594 -259443 -263528 -144159 -100389 -53256 -163650 -201014 -198880 -176279
4809 -176279 -195368 -106819 -28055 18782 -21372 -702 2100 -2229 64 54592 36201 -63096
4797 -63096 -116164 -101958 -148765 -50014 137012 194587 161515 72183 -114844 -184810 -200058
4786 -200058 -232810 -149947 -70224 -886 -24674 -93194 -90777 -67683 37826 29119 -97329 -160105
4774 -160105 -43831 -4146 280 -46603 -116661 -90359 -113195 -40609 -34233 -34520 -16859 15024
4762 15024 -67034 -98358 -99148 -21871 -101220 -181605 -259526 -226788 -169120 -121167 -40847 -101665
4750 -101665 -219995 -202015 -208173 -180173 -74693 14816 17896 -104199 -142958 -154882 -76649
4739g6649K5720Q483J3318p5689l8466J5952k1754k2264L1245k7503J12108K5240
4727c0259l3390K9441J2537N2331R2969m4384k0860q4594j31812J00234K777l0582
4715h5592K9252J8431o1870L9904O1692N6805r2373q624M9160k0654k5679k8496
4703f8044m2916J4523O8074J07213R211o6542K9003N8232O96j35502p0293k668
4691i9013M8677J4415o1688n0031K7276L2576n9886J4052J8099m9447j744M3292
4679a23422R313P264R3672K3308n6640J27655O673p0860o1456J4687P1515m2028
4667c19p3886O4206J08164L3441o6707j41092M1167N376j0149k6123J4972K5342
4655b5608p150r5588m0412M8102l5225L729P843J6327N8723J18036l8355j03806
$$ plain form
4739 -76649 -50929 -42446 -29128 -104817 -143283 -127331 -149085 -171349 -140104 -167607 -55499 -30259
4727 -30259 -63649 -34208 -21671 30660 123629 79245 58385 -26209 -158021 -57787 -55010 -85592
4715 -85592 -56340 -37909 -99779 -59875 1817 58622 -33751 -42375 6785 -13869 -39548 -68044
4703 -68044 -110960 -96437 -28363 78850 88061 21519 50522 108754 109450 -26052 -96345 -99013
4691 -99013 -50336 -35921 -97609 -147640 -120364 -87788 -147674 -133622 -115523 -164970 -166714 -123422
4679 -123422 -114109 -106845 -13173 10135 -46505 81150 87823 16963 -44493 -29806 41709 -319
4667 -319 -74205 -9999 98165 131606 64899 -76193 -35026 -29650 -39799 -65922 -50950 -25608
4655 -25608 -32758 -128346 -168758 -120656 -155881 -152152 -144309 -127982 -69259 48777 10422 -93384
4643i3384L242J947j9875k9736K32m3266o9506P7252Q0278N3884m917j5818R7949
4630C8282m4256j1865N4447K7490K1048o8191l4556r0393J0340L8159M7674j0752
4618b2573k122M7658M9719k8088p1356j9131L7324J1076q4533j4457O9031K6811
4606f41j04384o7692N6186R808n4940J19278Q6211m2086l0027n1223o2877K7383
4594a15004J7375o1577m4768L9305J1431J7929P9590o5859p1211j0661J63549
4583c9901N5589n79o0478o5763k9417M5831k4389l3220N5639M6286K7205L2442
4571I245j5263P2074l6085o6848K4256M0198n4516j19326N6566J60061o1539m2211
4559c3388R4892O0598R571J8296p1054j01438K1121J03873K8018m562O4349r9219
$$ plain form
4643 -93384 -90142 -88195 -108070 -137806 -137574 -180840 -250346 -173094 -92816 -38932 -43849 -59667 38282
4630 38282 -5974 -17839 36608 64098 85146 16955 -17601 -107994 -97654 -59495 -11821 -22573
4618 -22573 -24695 22963 72682 44594 -26762 -45893 -8569 2507 -82026 -96483 -27452 -641
4606 -641 -105025 -172717 -116531 -106723 -161663 -42385 43826 1740 -28287 -79510 -142387 -115004
4594 -115004 -97629 -159206 -203974 -164669 -153238 -135309 -55719 -121578 -192789 -203450 -39901
4583 -39901 15688 15109 -45369 -111132 -140549 -94718 -119107 -152327 -96688 -50402 -23197 9245
4571 9245 -6018 66056 29971 -36877 -12621 27577 -26939 -146265 -89699 70362 8823 -33388
4559 -33388 61504 122102 131673 149969 78915 -22523 -1402 102471 130489 125927 190276 91057
4547I1057q4821p9539j73019Q6289j4747L2686J63091Q4089k1585J1979l7195
4536E8285j05611l1958J31064r225J7977j06116l6525n486O8148P0751j3414o315
4524C1575j52974M89K6842P6994M917L9018O634O3894m6703k4430M7653q7735
4512a3826k1466k6344k6604l0157o4762Q395O2688o5988M3224L2208o30L9742
4500f3520q6134j3986L3785M0625M8678Q6526N4586l8394n430j1352O9059m6100
4488F8343j55299L1239P3697k8412r9075J8706R857p9174J7746k6601J13815K3038
4476c2120J6622R089K7659J9935j6244K5051n2967n4874l5839J2090J2657r0845
4464a59786n1669K8851j3104K2973Q2344Q8564K039o503K7011k5856k5162Q85
$$ plain form
4547 91057 6236 -73303 -246322 -160033 -174780 -142094 20997 105086 83501 95480 58285
4536 58285 -47326 -79284 51780 42555 60532 -45584 -82109 -87595 -19447 51304 37890 31575
4524 31575 -121399 -120910 -94068 -17074 -12157 26861 33495 97389 50686 26256 73909 -13826
4512 -13826 -35292 -61636 -88240 -118397 -183159 -174764 -112076 -178064 -134840 -102632 -103262 -63520
4500 -63520 -149654 -163640 -129855 -89230 -40552 45974 100560 62166 56736 45384 114443 68343
4488 68343 -86956 -55717 17980 -10432 -109507 -90801 -80944 -160118 -142372 -168973 -55158 -32120
4476 -32120 -15498 -6409 21250 41185 24941 49992 -2975 -57849 -93688 -81598 -68941 -159786
4464 -159786 -211455 -182604 -195708 -172735 -90391 -1827 212 -6291 20720 -5136 -30298 -29413
4452b9413m756N8999L883m8934N5769Q3630j6602q2294o7060o1122J30617R2281
4440A14998m0005l8242m5560m0962O2490J8509K6819l8608n4695q017L8211j6242
4428b1304K6703j16179l7383M4330K5897R184P9312Q1805k7679p660J18886P8366
4416B54278Q679k8289l532j02879j071n2057q8685r7814r2063j3916K4124R133
4404a84092N6047P8261K7919p7090O8634O0608k6848j6160P4477k7285M5793l7880
4392D2384m7538l2910M7477K9528q2971Q740l9320p9643K7349Q0343L9198K8748
4380B1385O7177p3258j17046n6947M4163J3512K191M4745m5079l7442l6665M7057
4368a26207N110l9692l0548o8092l5153L8605Q4823O7583O5844j8680m9206j7612
$$ plain form
4452 -29413 -34169 24830 28713 -20221 35548 119178 102576 20282 -46778 -107900 22717 114998
4440 114998 74993 36751 -8809 -49771 12719 31228 58047 19439 -35256 -43273 -5062 -21304
4428 -21304 5399 -110780 -148163 -103833 -77936 -68752 10560 92365 64686 57026 175912 254278
4416 254278 262957 234668 231136 128257 127186 75129 -13556 -111370 -203433 -217349 -193225 -184092
4404 -184092 -128045 -49784 -21865 -98955 -30321 30287 3439 -12721 61756 34471 80264 42384
4392 42384 -5154 -38064 9413 38941 -44030 -35290 -74610 -154253 -126904 -46561 -7363 21385
4380 21385 88562 15304 -101742 -158689 -114526 -101014 -98823 -54078 -99157 -136599 -173264 -126207
4368 -126207 -121097 -160789 -191337 -259429 -294582 -255977 -171154 -103571 -37727 -56407 -105613 -123225
4356a23225p70J4198J841N5788O5159O372K6545p3071m378n1458N1906P6540j19527
4343g4080N8913J7610j9999n4832R77J16091Q581m9254J4436l6397m723n7776
4331h0453n54M9583l885o2381j08385J0126J51324P7984m6131l4293r1508q9360
4319b27933L3438J24227L1745m0431J5158N740j06011J04521Q4412N9408l6391
4308D7883j5297j6279q4268N7916O2924k5259P7098o105m2244j15959p0019O5535
4296f4074Q1992k6156m7350M0809L908r0297r9525j09117J37775J60837J8898
4285G700r0997q647K3773k600K0149N2340j00882K8866j05129k3871k282O0217
4273a41363J04241K9183l3464q1510K541M9659J9013r3547j6934M8764J14433
$$ plain form
4356 -123225 -123995 -109797 -107956 -52168 12991 19363 45908 -27163 -31541 -82999 -31093 45447 -74080
4343 -74080 -15167 2443 -17556 -72388 -71411 44680 53261 4007 18443 -17954 -22677 -80453
4331 -80453 -81007 -31424 -35309 -97690 -206075 -195949 -44625 33359 -12772 -47065 -138573 -227933
4319 -227933 -194495 -70268 -38523 -78954 -63796 -58056 -164067 -59546 24866 84274 47883
4308 47883 32586 16307 -67961 -10045 52879 27620 104718 98613 56369 -59590 -129609 -64074
4296 -64074 17918 -8238 -55588 -14779 -10871 -101168 -200693 -309810 -172035 -11198 7700
4285 7700 -83297 -91944 -68171 -70771 -50622 1718 -99164 -70298 -175427 -199298 -201580 -141363
4273 -141363 -37122 -7939 -41403 -122913 -120372 -70713 -51700 -145247 -162181 -113417 1016
4262A016L2323N9901m2925q6782L7623Q127J5099L9199q1926L0354R0052k3500
4250G8561j77197o0545J3114j1131O2126P2697J50892j7249q5220m3545j0117
4239b7614l112j15746j02012M6441J34478j034J3224k4520l4115m8279M4428K0360
4227i7501o0870m8626O6107L6699r8180m7744N9170J26110q6883r8071P0912R1966
4215h6911L7133j7500l9180k0670L8626O2583J5660L0120K2483l3270l4060p712
4203c2698N888q1130K1088P9044K1347m3735K2140Q322m6620l2278k6061R6966
4191g727P6134l1712k8429r755L1316L2721J2998o1081j49879l3755n8835r1348
4179c19352L6357j7808M5768K42390N3294o490m2392j4245L9487j8502r8804M9952
$$ plain form
4262 1016 33339 93240 50315 -36467 1156 9283 24382 63581 -18345 12009 102061 78561
4250 78561 -98636 -159181 -146067 -157198 -95072 -22375 128517 111268 26048 -17497 -27614
4239 -27614 -30726 -146472 -248484 -202043 -67565 -68599 -55375 -79895 -114010 -162289 -117861 -97501
4227 -97501 -158371 -206997 -140890 -104191 -202371 -250115 -190945 -64835 -151718 -249789 -178877 -86911
4215 -86911 -49778 -67278 -106458 -127128 -88502 -25919 -10259 19861 42344 9074 -24986 -32698
4203 -32698 -26810 -107940 -86852 -7808 13539 -30196 -8056 266 -46354 -78632 -104693 -7727
4191 -7727 68407 36695 8266 -1489 29827 62548 75546 14465 -135414 -169169 -228004 -319352
4179 -319352 -282995 -300803 -255035 -12645 40649 34159 -8233 -22478 17009 -1493 -100297 -50345
4167e0345J6510O4614l4063M40L4136N7753m8307N4596J16214q320m9890o6908
4155H6430J0155M3108m3687m5146m1964k1188K0943k2948m7064l6153J12820K7303
4143D2609N1626j3071j01931j20177n6858M3622L9180o5502O6912R1755m9020
4132g0855M2396K4651Q2314O265p4238J9096q579N049m5774j6143j3995p962J08647
4119E0872k399M8679p422O9934M7462j20882K4202M4571q5023j24173M0n2418
4107a06557J5914M6322K7919N3707n714N1714N2646q3129m9084o2974j3124r233
4095h1593l5761N7368p4183m47J04629m0294m7056J02535L4708k7239m6433j972
4083e5738P2272N4135j14513L5665k6756p0230j1336M1335N8863O8614P2095O2367
$$ plain form
4167 -50345 -33835 30779 -3284 -2844 31292 89045 40738 95334 211548 203228 153338 86430
4155 86430 96585 139693 96006 50860 8896 -12292 8651 -14297 -61361 -97514 15306 42609
4143 42609 94235 81164 -20767 -140944 -197802 -154180 -115000 -180502 -113590 -21835 -70855
4132 -70855 -28459 -3808 78506 84771 10533 29629 21050 26099 -19675 -35818 -49813 -57775 50872
4119 50872 48473 97152 89730 159664 207126 86244 110446 155017 69994 -54179 -54139 -106557
4107 -106557 -90643 -44321 -16402 37305 31591 83305 135951 52822 3738 -59236 -72360 -81593
4095 -81593 -117354 -59986 -134169 -134616 -29987 -70281 -117337 -14802 19906 -7333 -53766 -55738
4083 -55738 16534 70669 -43844 -8179 -34935 -105165 -116501 -75166 -16303 52311 124406 186773
4071A86773o0484l918n8480q9875l3480M7975O3211l7542j22843K4746O6029k9011
4059d6899m1645n8165o5210R6076J06437o7396r5516j34859P4540J15737m6065
4048a62965o4114J32804J0752q6649q61K2097O4437m6953K5617K5579j5245m635
4036a00136J0992J4447L7184O8593K2326o3674J2952J411q9073L6319q531r470
4024f6660O1641J01482l1159R231M949L0434N9030j561j25135r1630j9386J05400
4012C6636J69365k7757j53241j3828J758q470l3241N8665J33343R9079l0568q9325
4000A42416j44744L30P8746L8505o7521o5345M5094k5173n034L0297N0233R119
3988H6923M1603o2540m3145q5858j5939N1418j0706j02397K6564R8896l7285O2204
$$ plain form
4071 186773 126289 122371 63891 -25984 -59464 -11489 51722 14180 -108663 -83917 -17888 -46899
4059 -46899 -88544 -146709 -211919 -115843 -9406 -76802 -172318 -307177 -232637 -116900 -162965
4048 -162965 -227079 -94275 -83523 -170172 -171033 -148936 -84499 -131452 -105835 -80256 -95501 -100136
4036 -100136 -89144 -74697 -37513 31080 53406 -10268 2684 4095 -84978 -48659 -57190 -66660
4024 -66660 -5019 96463 65304 74535 79484 109918 168948 167387 42252 -49378 -68764 36636
4012 36636 206001 178244 25003 11175 12933 4463 -28778 29887 163230 262309 231741 142416
4000 142416 -2328 -1998 76748 115253 47732 -17613 27481 2308 -2726 27571 77804 86923
3988 86923 128526 65986 22841 -63017 -78956 -27538 -38244 -140641 -114077 -15181 -52466 9738
3976I738l2710o0155p648R230n1346j14030n9255J52381J81017o1365j17542L7509
3964a14176j7349n6952q750n4112l5824J59313J03625P9102L0591p1302j14314
3953a00148L8865l3933j15843J544K8402o9412M9328J07524R7850N2798j16303
3942e9328l2936R340J0369r314l9759R5385N2500N7183m877j00506j3531P0283
3930C4809R682K8769M3815p3710n1180n356j1994r7392o2437N3153K5212k7126
3918a33755n34k6613L3660O3725K1175O1566k6220k310p7818J795L6179J25692
3906G6542P6194p9628p1933L0451o3396k2125K3350K442N2222l446M9077o0883
3894H867r2117M487Q6566m3844o789n3311m3799j06637L3393M6997O5615Q3714
$$ plain form
3976 9738 -22972 -83127 -90775 -81545 -132891 -246921 -306176 -153795 27222 -34143 -151685 -114176
3964 -114176 -131525 -188477 -197227 -251339 -287163 -127850 -24225 54877 85468 14166 -100148
3953 -100148 -61283 -95216 -211059 -209515 -181113 -250525 -201197 -93673 4177 56975 -59328
3942 -59328 -92264 -82924 -72555 -81869 -121628 -26243 26257 83440 78563 -21943 -35474 34809
3930 34809 44491 73260 117075 43365 -7815 -13171 -25165 -122557 -184994 -131841 -106629 -133755
3918 -133755 -134289 -160902 -127242 -63517 -42342 19224 -6996 -9306 -87124 -85329 -49150 76542
3906 76542 152736 73108 1175 31626 -31770 -53895 -30545 -28103 24119 20673 69750 8867
3894 8867 -83250 -78763 7803 -36041 -42830 -96141 -139940 -246577 -213184 -166187 -100572 -16858
3882a6858Q5670j5462n9798l2964n9943m4675j8896n0445K5068M2175m0217Q2898
3870a03447K5474o7171Q5095J14249l6752m3482J37542J9948q4271k0872K352
3859B8665L7810k1636j4569M701j5923j525J5078j6004Q8208J4031j20018j6133
3847a7315J1754j07954q764O5638N2451K6180q8883n3111P8158M1310j30065j9352
3835a49953R7261o6662p5898J17993J3991j2442q894J8755L8917M9995j1104o1049
3823d9090J2816N5302j27710n1126Q0244M4669P9397L5260o3987P11L0996O672
3811E4154o3197j5677K2819J00875m316m4667k2115m5918N226q9449N6794O9870
3799B4399K600o898J9098n8747J4096L1727o4496J0526J8m781r2347o218K5344
$$ plain form
3882 -16858 68812 53350 -6448 -39412 -99355 -144030 -162926 -213371 -188303 -146128 -186345 -103447
3870 -103447 -77973 -145144 -60049 54200 17448 -26034 111508 131456 47185 26313 28665
3859 28665 66475 44839 30270 34971 19048 17523 32601 16597 104805 118836 -1182 -17315
3847 -17315 -5561 -113515 -122279 -56641 -4190 21990 -66893 -120004 -41846 -536 -130601 -149953
3835 -149953 -52692 -119354 -195252 -77259 -63268 -75710 -84604 -65849 -26932 23063 11959 -49090
3823 -49090 -36274 19028 -108682 -159808 -79564 -34895 44502 79762 15775 16486 47482 54154
3811 54154 -9043 -24720 -1901 98974 94658 49991 27876 -18042 -12816 -102265 -45471 24399
3799 24399 26999 20101 39199 -19548 -5452 26275 -38221 -27695 -27677 -32458 -124805 -131023 -105679
3786a05679N139j9113J07218p232r2528L4304N9431l8520J2022J6872k4920Q6779
3774C3773J45798p9677p4587l224k0601n473l8151l9439Q915L6817q4181J3995
3762a06035j5935l4268L0909N3800M4220M4296m3185o4180J15120O2048o9953
3751A6837o8960n337Q8120M9113l7469o219K4023K6444j398o2887K7576N3575
3739A03418p8167o8996n4717n1272p5436M3088P4566q4303m6501N4885K10085
3728B6650J6249n5340K641N280K6648n5569n0462M653n4550n3761j8907Q9871
3716a16597P3612M2571L400O1194p1040m6784K7215L6171n801n8812k1184M8554
3704b7501N7165P2984o3344r823J09j13096j19712k2217P5791M8050n1399J2834
$$ plain form
3786 -105679 -100540 -119653 -12435 -19667 -112195 -77891 -18460 -56980 -44958 -28086 -53006 33773
3774 33773 179571 99894 25307 22083 1482 -3991 -42142 -81581 -72666 -35849 -120030 -106035
3762 -106035 -121970 -156238 -125329 -71529 -27309 16987 -26198 -90378 24742 86790 16837
3751 16837 -52123 -57460 30660 79773 42304 36085 60108 86552 85154 22267 49843 103418
3739 103418 25251 -43745 -98462 -149734 -225170 -182082 -107516 -191819 -238320 -183435 26650
3728 26650 42899 -12441 -9800 -4520 22128 -33441 -83903 -79250 -133800 -187561 -206468 -116597
3716 -116597 -42985 -414 2986 64180 -6860 -53644 -26429 9742 3941 -54871 -76055 -27501
3704 -27501 29664 102648 39304 29481 29590 -83506 -203218 -225435 -149644 -101594 -152993 -140159
3692a40159L8640K1556n080L7513M1156N2830L8002m4851N6613M4126J6528J9243
3680A76117r4737j32542m6228R9632O8230j8530j2969Q1482J06287n1211o1906
3669A13625k273K1882j4982n7219k5489L3168J0787l0772J6449j3457m5675O7536
3657G3580L1588N9764j3877r8921L797k5329l7715J14483k4650j07621L8650N8972
3645G2721M1622l3634j14338K6048M1764r011P9468L6189o4584j15250l8974l1386
3633a09365P3046J05079j7786q8602L47l4362P441k8941k5595O1220k3j2244j8515
3620h8300M6760k7199J6099j6626K2846M1607O1200n6755M216N834k8766o4260
3608h3344R494k7102O8802L7829P0006k8408j54074j4996J04820R5256O1207n83
$$ plain form
3692 -140159 -101519 -79963 -85043 -47530 -6374 46456 84458 39607 96220 140346 156874 176117
3680 176117 81380 -51162 -97390 2242 70472 51942 38973 120455 226742 175531 113625
3669 113625 111352 133234 118252 61033 35544 68712 79499 48727 65176 51719 6044 73580
3657 73580 105168 164932 151055 52134 55931 30602 -7113 107370 82720 -24901 13749 72721
3645 72721 114343 80709 -33629 -7581 34183 25172 104640 140829 76245 -39005 -77979 -109365
3633 -109365 -36319 68760 50974 -37628 -37281 -71643 -64202 -93143 -118738 -57518 -57541 -69785 -88300
3620 -88300 -41540 -68739 -52640 -69266 -46420 -4813 56387 -368 3848 9682 -19084 -83344
3608 -83344 -73850 -100952 -32150 5679 75685 47277 -106797 -121793 -16973 78283 139490 138907
3596A38907J3837o4521j02719m8758j9699r007L4247P6515O2398N5412o8706k4007
3584D3899l1052j1814M2364r379m2719p2198J14918p02o0432r1499q7979J8132
3572a88461J09152m802j084O8938m042l6066M5356p3378M9467J22431l4675k0382
3560C2454n5J2503j0639k2050r7435k7694L6146M0294P389L3459k7318M3389P1730
3547I2173Q356j14634j36350n423M1776M0086Q5454l1360k3593L5166m3462o0814
3535a12625l4252r144j4421N8438k0626M8237J02605n2489J8932m7598P75l5211
3523i7379N3237K867m7052J09994L5363K2965K4369L6556r7768n9443l6137q7976
3511a40404M0014L7724L1759K2077K4752O406n2033l363K6925o4000K2097J5093
$$ plain form
3596 138907 152744 88223 -14496 -63254 -82953 -91960 -57713 18802 81200 136612 67906 43899
3584 43899 12847 1033 43397 34018 -8701 -80899 34019 33317 -27115 -118614 -206593 -188461
3572 -188461 -79309 -84111 -85195 -16257 -20299 -56365 -11009 -84387 -34920 87511 52836 32454
3560 32454 32399 44902 34263 12213 -85222 -112916 -76770 -36476 -29087 4372 -22946 20443 92173
3547 92173 100529 -14105 -150455 -155878 -114102 -74016 11438 -19922 -43515 -8349 -51811 -112625
3535 -112625 -146877 -156021 -170442 -112004 -132630 -84393 18212 -34277 -15345 -62943 -62168 -97379
3523 -97379 -44142 -41275 -88327 21667 57030 79995 104364 140920 43152 -16291 -52428 -140404
3511 -140404 -100390 -62666 -30907 -8830 15922 22328 -29705 -33068 -6143 -70143 -48046 -32953
3499c2953N3677N2980l1349m0443M0851k7535N837M9412o1638p2921J0539J03089
3487D9546L9254j40497j6838P9395k9816j6463j2756o3373j2136P2514l3478l054
3475h7702J08527l5782M3248j3151o539o005k0925l29N4340N211o5438j28344
3463a52889J631J17713M0809q0039K7172n483k6206K6884J44117k9529q2984l111
3451b1915L3720O8798L6777l8618k0667n300J0185q3349n8318p7222P6899R6999
3439A7989m8333o456K0293N2261n1382M0303j3736M1064K4658o020j30539o1407
3427a21305N1093m703l7974K6890J10122j1451K5892Q7877k8047k47518j5887
3416a65011P5645m5683n1377Q8423J24428M8945n4661l0996m9320O1883M6957
$$ plain form
3499 -32953 20724 73704 42355 1912 42763 15228 21065 70477 8839 -64082 -53543 49546
3487 49546 88800 -51697 -68535 10860 -18956 -35419 -48175 -111548 -123684 -51170 -84648 -87702
3475 -87702 20825 -14957 28291 15140 8601 2596 -18329 -18658 35682 40893 -24545 -152889
3463 -152889 -151258 -33545 7264 -72775 -45603 -51086 -77292 -50408 93709 64180 -18804 -21915
3451 -21915 11805 80603 117380 78762 58095 52795 62980 -20369 -78687 -155909 -79010 17989
3439 17989 -30344 -36800 -16507 35754 -15628 24675 10939 52003 76661 70641 -59898 -121305
3427 -121305 -70212 -74915 -112889 -85999 24123 12672 38564 126441 98394 -149124 -165011
3416 -165011 -89366 -135049 -186426 -98003 26425 75370 20709 -10287 -59607 2276 49233
3405D9233N8933L9284J5082P1392j007r5296r0511r0043n6003N6522k1841J3494
3393e0761m6253n5462K2838J60088L9425j6319o9847K7076k0502l9508M1378j03967
3381a11814J8215P528k466L8930k6519J2340l2646Q6974O4947p1421m6708k282
3369f4922L1966m652r482m4450Q3794J26722M1563j31923j15990N230m7899L5878
3357i4165J38399N6179R5558o2920K341K177O6607o5463k1656m9886j22861j3856
3345f9546j5853l1429l4696r64J450O5290M8899P9797R6612j43417j60784J06312
3333e8329Q6791o8630j20843j256L9350L7899k4791l2134M0927J952j20112p5347
3321b94523O3841J43524R1932Q8319N781m4323k4658o390j83238J6386K67M937
$$ plain form
3405 49233 108166 147450 162532 233924 232917 137621 47110 -42933 -98936 -42414 -64255 -50761
3393 -50761 -97014 -152476 -129638 30450 69875 53556 -16291 10785 -9717 -49225 -7847 -111814
3381 -111814 -93599 -86071 -88537 -49607 -76126 -63786 -96432 -9458 55489 -15932 -62640 -64922
3369 -64922 -32956 -37608 -47090 -91540 -7746 118976 160539 28616 -87374 -82144 -130043 -94165
3357 -94165 44234 100413 195971 133051 135392 137569 204176 138713 117057 67171 -55690 -69546
3345 -69546 -85399 -116828 -151524 -152488 -151038 -85748 -36849 42948 139560 -3857 -164641 -58329
3333 -58329 28462 -40168 -161011 -162267 -122917 -85018 -109809 -141943 -101016 -99064 -219176 -294523
3321 -294523 -230682 -87158 4774 93093 98874 54551 29893 23503 -159735 -143349 -143082 -138145
3309a38145o3015J0662R2056J0987J11374R909q4198K0881J09748J00169K385
3298A82813j5395j66182l7856N0253L6035j1334j88480O0545L484l461L6223N0166
$$ plain form
3309 -138145 -201160 -190498 -98442 -87455 23919 33828 -50370 -29489 80259 180428 182813
3298 182813 167418 1236 -36620 13633 49668 38334 -150146 -89601 -86117 -89578 -53355 -3189
$$ [...]
##END NTUPLES=NMR SPECTRUM
##END=
