##TITLE=Analysis number 308575
Compound Code cc 43509
Book Reference 422/63
Project Code adrs
Chemist Name robb
##JCAMPDX= 6.0         $$ Bruker NMR JCAMP-DX V2.0
##DATA TYPE= NMR SPECTRUM
##DATA CLASS= NTUPLES
##ORIGIN= Bruker BioSpin GmbH
##OWNER= NMR
$$ XWIN-NMR		Version 3.5
$$ Tue May 24 13:22:00 2005 GMT Daylight Time (UT+1h)  MAYBRIDGE\NMR@NMR_250MHZ
##.OBSERVE FREQUENCY= 250.131544655141
##.OBSERVE NUCLEUS= ^1H
##.ACQUISITION MODE= SIMULTANEOUS (DQD)
##.ACQUISITION SCHEME= undefined
##.AVERAGES= 16
##.DIGITISER RES= 18
##SPECTROMETER/DATA SYSTEM= dpx250
##.PULSE SEQUENCE= zg30
##.SOLVENT NAME= DMSO
##.SHIFT REFERENCE= (INTERNAL, DMSO, 0, 16.522)
##AUDIT TRAIL= $$ (NUMBER, WHEN, WHO, WHERE, WHAT)
$$ ##TITLE= Audit trail, XWIN-NMR		Version 3.5
$$ ##JCAMPDX= 5.01
$$ ##ORIGIN= Bruker BioSpin GmbH
$$ ##OWNER= NMR
$$ C:\u/data/dgb/nmr/ADRS/3460/pdata/1/auditp.txt
$$ ##AUDIT TRAIL=  $$ (NUMBER, WHEN, WHO, WHERE, WHAT)
(   1,<2005-05-24 13:20:10.09 +100>,<MAYBRIDGE\NMR>,<NMR_250MHZ>,
      <created by zg, POWCHK disabled, PULCHK disabled
       configuration hash MD5:
       62 19 C7 07 E1 42 D1 B7 37 6C 3D D0 77 39 F9 E6
       data hash MD5: 64K
       F3 4F 6D 60 A0 B9 94 25 86 DA 43 CC A0 5C E4 3D>)
(   2,<2005-05-24 13:20:21.17 +100>,<MAYBRIDGE\NMR>,<NMR_250MHZ>,
      <Start of raw data processing
       ef LB = 0.3 FT_mod = 6 PKNL = 1 SI = 32K 
       data hash MD5: 32K
       91 38 B3 54 36 7B AA 85 56 85 84 12 29 25 81 BE>)
(   3,<2005-05-24 13:20:22.87 +100>,<MAYBRIDGE\NMR>,<NMR_250MHZ>,
      <apk 
       data hash MD5: 32K
       A6 7D E1 7F 87 4B FA 94 F7 E8 AB C5 44 96 09 E8>)
(   4,<2005-05-24 13:20:23.57 +100>,<MAYBRIDGE\NMR>,<NMR_250MHZ>,
      <abs ABSG = 5 
       data hash MD5: 32K
       83 AE E9 53 2F FA 69 19 BD 65 16 16 DD 70 40 3B>)
$$ ##END=
$$ 
$$ hash MD5
$$ 93 23 AB C5 00 D5 30 65 6D 36 8B 24 10 26 4D 0F
##$RELAX= 
##$RELAX= 
##$RELAX= 
##$RELAX= 
##$RELAX= 
##$RELAX= 
##$RELAX= 
$$ Bruker specific parameters
$$ --------------------------
##$DU= <C:\u>
##$EXPNO= 3460
##$NAME= <ADRS>
##$PROCNO= 1
##$TYPE= <nmr>
##$USER= <dgb>
##$AMP= (0..31)
100 100 100 100 100 100 100 100 100 100 100 100 100 100 100 100 100 100 
100 100 100 100 100 100 100 100 100 100 100 100 100 100 
##$AQSEQ= 0
##$AQ_mod= 3
##$AUNM= <au_zg>
##$AUTOPOS= <32 >
##$BF1= 250.13
##$BF2= 250.13
##$BF3= 250.13
##$BF4= 250.13
##$BF5= 500.13
##$BF6= 500.13
##$BF7= 500.13
##$BF8= 500.13
##$BYTORDA= 1
##$CFDGTYP= 0
##$CFRGTYP= 5
##$CHEMSTR= <none>
##$CNST= (0..31)
1 1 145 1 1 1 1 1 1 1 1 1 1 1 1 1 1 1 1 1 1 1 1 1 1 1 1 1 1 1 1 1 
##$CPDPRG= <>
##$CPDPRG1= <>
##$CPDPRG2= <>
##$CPDPRG3= <>
##$CPDPRG4= <mlev>
##$CPDPRG5= <mlev>
##$CPDPRG6= <mlev>
##$CPDPRG7= <mlev>
##$CPDPRG8= <mlev>
##$CPDPRGB= <>
##$CPDPRGT= <>
##$D= (0..31)
0 1 0 0 0 0 0 0 0 0.06 0 0 0 0 0 0 0.0002 0 0 0 0 0 0 0 0 0 0 0 0 0 0 
0 
##$DATE= 1116937209
##$DBL= (0..7)
120 120 120 120 120 120 120 120 
##$DBP= (0..7)
150 150 150 150 150 150 150 150 
##$DBP07= 0
##$DBPNAM0= <>
##$DBPNAM1= <>
$$ [...]
##$SUBNAM7= <"">
##$SUBNAM8= <"">
##$SUBNAM9= <"">
##$SW= 20.6930455092707
##$SWIBOX= (0..15)
0 0 3 0 0 0 0 0 0 0 0 0 0 0 0 0 
##$SW_h= 5175.983436853
##$TD= 65536
##$TD0= 1
##$TE= 295.16
##$TE2= 300
##$TE3= 300
##$TEG= 300
##$TL= (0..7)
0 120 120 120 120 120 120 120 
##$TP= (0..7)
150 150 150 150 150 150 150 150 
##$TP07= 0
##$TPNAME0= <>
##$TPNAME1= <>
##$TPNAME2= <>
##$TPNAME3= <>
##$TPNAME4= <>
##$TPNAME5= <>
##$TPNAME6= <>
##$TPNAME7= <>
##$TPOAL= (0..7)
0.5 0.5 0.5 0.5 0.5 0.5 0.5 0.5 
##$TPOFFS= (0..7)
0 0 0 0 0 0 0 0 
##$TUNHIN= 0
##$TUNHOUT= 0
##$TUNXOUT= 0
##$USERA1= <user>
##$USERA2= <user>
##$USERA3= <user>
##$USERA4= <user>
##$USERA5= <user>
##$V9= 5
##$VALIST= <valist>
##$VCLIST= <CCCCCCCCCCCCCCC>
##$VD= 0
##$VDLIST= <DDDDDDDDDDDDDDD>
##$VPLIST= <PPPPPPPPPPPPPPP>
##$VTLIST= <TTTTTTTTTTTTTTT>
##$WBST= 1024
##$WBSW= 4
##$XGAIN= (0..3)
0 0 0 0 
##$XL= 0
##$YL= 0
##$YMAX_a= 281269
##$YMIN_a= -372967
##$ZGOPTNS= <>
##$ZL1= 120
##$ZL2= 120
##$ZL3= 120
##$ZL4= 120
##$ABSF1= 16.522
##$ABSF2= -4.171173
##$ABSG= 5
##$ABSL= 3
##$ALPHA= 0
##$AQORDER= 0
##$ASSFAC= 0
##$ASSFACI= 0
##$ASSFACX= 0
##$ASSWID= 0
##$AUNMP= <proc_1d>
##$AZFE= 0.1
##$AZFW= 0.1
##$BCFW= 0
##$BC_mod= 0
##$BYTORDP= 0
##$COROFFS= 0
##$CY= 12.5
##$DATMOD= 1
##$DC= 0
##$DFILT= <>
##$DTYPP= 0
##$F1P= 14.0000005364418
##$F2P= -0.99999901652339
##$FCOR= 0.5
##$FTSIZE= 32768
##$FT_mod= 6
##$GAMMA= 0
##$GB= 0
##$INTBC= 1
##$INTSCL= 1
##$ISEN= 128
##$LB= 0.3
##$LEV0= 0
##$LPBIN= 0
##$MAXI= 10000
##$MC2= 0
##$MEAN= 0
##$ME_mod= 0
##$MI= 0
##$NCOEF= 0
##$NC_proc= -4
##$NLEV= 6
##$NOISF1= 0
##$NOISF2= 0
##$NSP= 0
##$NTH_PI= 0
##$NZP= 0
##$OFFSET= 16.522
##$PC= 1
##$PHC0= -86.47024
##$PHC1= 9.616512
##$PH_mod= 1
##$PKNL= yes
##$PPARMOD= 0
##$PSCAL= 4
##$PSIGN= 0
##$REVERSE= no
##$SF= 250.13
##$SI= 32768
##$SIGF1= 0
##$SIGF2= 0
##$SINO= 400
##$SIOLD= 32768
##$SREGLST= <1H.DMSO>
##$SSB= 0
##$STSI= 32768
##$STSR= 0
##$SW_p= 5175.98343685301
##$SYMM= 0
##$S_DEV= 0
##$TDeff= 65536
##$TDoff= 0
##$TI= <Analysis number 999999
Compound Code 99
Book Reference 9
Project Code 9>
##$TILT= no
##$TM1= 0
##$TM2= 0
##$TOPLEV= 0
##$USERP1= <user>
##$USERP2= <user>
##$USERP3= <user>
##$USERP4= <user>
##$USERP5= <user>
##$WDW= 1
##$XDIM= 32768
##$YMAX_p= 307919343
##$YMIN_p= -224495
$$ End of Bruker specific parameters
$$ ---------------------------------
##NTUPLES= NMR SPECTRUM
##VAR_NAME=  FREQUENCY,     SPECTRUM/REAL,   SPECTRUM/IMAG
##SYMBOL=    X,             R,               I
##VAR_TYPE=  INDEPENDENT,   DEPENDENT,       DEPENDENT
##VAR_FORM=  AFFN,          ASDF,            ASDF
##VAR_DIM=   32768,         32768,           32768
##UNITS=     HZ,            ARBITRARY UNITS, ARBITRARY UNITS
##FACTOR=    0.157963299565203, 1,           1
##FIRST=     4132.6476996994, 0,             0
##LAST=      -1043.33573715361, 0,           0
##MIN=       -1043.33573715361, -224495,     0
##MAX=       4132.6476996994, 307919343,     0
$$ Real data points
##PAGE= N=1
##DATA TABLE= (X++(R..R)), XYDATA
$$ [...]
19116B2524K5083J0234M149J7053K3046k5090K7036K3845n6673n5290j0167K359
19104H109K3831j0594R287J3163J2501O6283M327n2858J7144m3115n9017m1428
19092e2367K4040k344k8582K560K4653K8976L0197k9378j7303K4343M5328K8026
19080G8149m1283N194L5993j27n889M0011r292K3411l4378q8707P760L7685K7110
19067G5637J6548k9925k4119J2260P073k0586q1189N0071O2865M762P070J3409
19055I3876l421k4417k7093o048J4480k643N9256L5573N2951Q864J1993m1128
19043A72243q8804J5294N5374p7232p7693l6718M1332L4387L0145R756j722O182
19031H2544J5629q16o8908k4192o998L9771M1550N5271Q480j5626k2755o414L2538
$$ y = [22524, 47607, 57841, 61990, 79043, 102089, 76999, 104035, 127880, 71207, 15917, 5750, 8109, 31940, 21346, 30633, 43796, 56297, 122580, 126907, 74049, 91193, 48078, -10939, -52367, -28327, -30671, -59253, -56693, -32040, -3064, 27133, -2245, -19548, 4795, 50123, 78149, 36866, 42060, 78053, 77926, 72037, 112048, 102756, 126167, 91789, 3082, 10842, 48527, 75637, 92185, 62260, 38141, 50401, 57474, 36888, -44301, 5770, 68635, 73397, 80467, 93876, 90455, 66038, 38945, 32897, 47377, 44734, 103990, 139563, 192514, 201378, 213371, 172243, 83439, 98733, 154107, 76875, -818, -37536, 3796, 38183, 68328, 78084, 76362, 82544, 98173, 97357, 28449, 4257, -2741, 37030, 78580, 133851, 142331, 126705, 103950, 97536, 130074]
19018A30074r396l2493k7385m2957K0906r086M01K0284L0500m365l3092j638K7018
19005F8771N9228j2039j2717j5632o887k7002M9652P3278M118m480k9627K705
18993A49368L9813K1096K5948j145K2331M7005n3608k4940j3663m5293O0845Q0023
18981C07780L6212m2944k6469m51J4303J6687K874l3483j9155K5587J5235J3934
18969C10110J5193K4710j4802L6474K324k1791k4916k8835j733P1792l8936l266
18957C26324N0849k8658o7188P996M4937L8131K042J7601N5686k5929j2924J0016
18945D18883M369k2413O2856k3026m2064k3504n011J0003M5055q1519j9717P6032
18933C99944n2721l5688O2796J4345r004J3549J6468O4245p5328p5526O8644N3792
$$ y = [130074, 120678, 88185, 60800, 17843, 38749, 29663, 30064, 50348, 80848, 76483, 43391, 41753, 68771, 127999, 115960, 103243, 87611, 80724, 53722, 103374, 176652, 180770, 176290, 146663, 149368, 189181, 210277, 236225, 235080, 257411, 304416, 250808, 225868, 212205, 166912, 227757, 307780, 343992, 301048, 274579, 274128, 288431, 305118, 307992, 274509, 255354, 280941, 296176, 310110, 325303, 350013, 335211, 371685, 374009, 352218, 327302, 298467, 296734, 368526, 329590, 326324, 377173, 348515, 281327, 289323, 334260, 372391, 374433, 392034, 447720, 421791, 408867, 418883, 423252, 400839, 463695, 440669, 398605, 375101, 370090, 380093, 425148, 343629, 323912, 399944, 347223, 311535, 374331, 388676, 379672, 393221, 409689, 473934, 398606, 323080, 391724, 445516]
18921D45516n5003P931r720M5324J7974k8054L5302l8573n997M7138M2032M9417
18909E53287n0038k6218K5043O3672J3723N5158J3606j4185j5532o815K9075N4152
18897F94928o569m6463K9377K466J9675l1465K6161N6006K8079j0917j4969n7094
18885F89215K2490k4222L40o018p9575N81m9336l1535P3132l251o8489m4240n3396
18872D25696l1902o7935l4109l4859p355q242m4414K3126M3013k9946k7245k6008
18860A79820p721K027m0594M42r169Q212k6120L6999k502K6935L4896l4547l8648
18847A30030K423N840K6526j8034K1678L1098N0772L0810n6497j0372J9869N158
18835B39301j8255k717m0134N2038K1562k3911j973K2244J2952P648j8972k3068
$$ y = [445516, 390513, 398444, 388724, 434048, 452022, 423968, 459270, 420697, 414700, 461838, 503870, 553287, 503249, 477031, 502074, 565746, 579469, 634627, 648233, 634048, 618516, 611701, 640776, 694928, 688359, 641896, 671273, 673739, 693414, 661949, 688110, 744116, 772195, 761278, 746309, 689215, 711705, 687483, 687823, 681805, 602230, 602811, 553475, 521940, 595072, 591821, 523332, 479092, 425696, 393794, 325859, 291750, 256891, 249536, 241294, 196880, 220006, 263019, 233073, 205828, 179820, 172099, 174126, 133532, 133974, 124805, 133017, 106897, 143896, 141394, 168329, 203225, 168678, 130030, 132453, 138293, 164819, 146785, 168463, 199561, 250333, 281143, 224646, 214274, 234143, 239301, 221046, 218329, 178195, 230233, 251795, 227884, 225911, 248155, 261107, 268755, 249783, 226715]
18823B26715k7310P9672L7754j5208M310L7453N8697k7848j3567l716k9022J2331
18811C40261R2601k3962j0013R2536m481l7906Q0932P0507J16754O7207L9647
18800H24083K3881M5994J52609J37812N0889m3658O0935J37356J6759J56j8238
18789A388578k4724O575L6370K5405k2040J1238O5871m1737n373L1760m1708q2994
18777A347221m9351r710r0162q8701o3621l3268j06877r2387o9087o3073m3861
18766F37123l3649l2617j903m9638m9930p2801j678j9239l502k1032n9726m2945
18754B48463m9770k5082p025O084L8963L0776Q473L3768P5887l5047m4651k4950
18742B55889k332o293q2600m4132j0291J662K0919L0616O8885N4735j3569N879
$$ y = [226715, 199405, 279077, 316831, 301623, 305933, 343386, 402083, 374235, 360668, 356952, 327930, 340261, 432862, 408900, 398887, 491423, 486942, 449036, 529968, 600475, 717229, 784436, 824083, 847964, 893958, 1046567, 1184379, 1235268, 1191610, 1252545, 1389901, 1406660, 1406816, 1388578, 1363854, 1370429, 1406799, 1432204, 1410164, 1421402, 1487273, 1445536, 1440163, 1471923, 1430215, 1347221, 1297870, 1288160, 1197998, 1109297, 1045676, 1012408, 905531, 813144, 744057, 680984, 637123, 603474, 570857, 568954, 519316, 469386, 396585, 394907, 375668, 372166, 351134, 291408, 248463, 198693, 173611, 166586, 172670, 211633, 242409, 250882, 284650, 360537, 325490, 280839, 255889, 253557, 247264, 164664, 120532, 110241, 111903, 132822, 163438, 232323, 287058, 273489, 279368]
18730B79368K6509L053J2596j0241r4277l265M7802n4768k3279j0418Q0404K6270
18718B79754j3449m4093Q487L1571k904k2696N282J4810L431P5723M1403j103
18706C76216n5175J0079M520m7031q669K5420l2754l3484L648K4706j814L0183
18694B95845j8812j2764l7087O931K8807O1006o167k0172P664K1224K6629J3562
18682C66666J4478j4056k3297l92l417Q772J2954K42J692M3121J19600P6797l6589
18669E66571l0141N5754O8999J0814K2636N2311J0645m4249q4725o4729j1493
18658E52393j4924k424l3014J0868P628L2544l4223L4040L2071O5469J6841L3113
18646G00382j4730J8452j892K6442J5172O3601j9317J9312m40L7874R966J46L3033
$$ y = [279368, 305877, 308930, 321526, 311285, 217008, 213743, 261545, 206777, 183498, 173080, 253484, 279754, 266305, 222212, 230699, 262270, 259366, 236670, 241952, 256762, 260193, 335916, 377319, 376216, 321041, 331120, 335640, 288609, 279940, 305360, 272606, 239122, 242770, 267476, 265662, 295845, 277033, 264269, 227182, 234113, 262920, 323926, 317759, 297587, 305251, 326475, 353104, 366666, 381144, 367088, 343791, 343399, 339982, 348754, 361708, 361950, 363642, 406763, 526363, 603160, 566571, 536430, 592184, 661183, 671997, 694633, 746944, 757589, 713340, 628615, 563886, 552393, 537469, 535045, 502031, 512899, 520527, 553071, 518848, 552888, 584959, 650428, 667269, 700382, 685652, 704104, 702212, 728654, 743826, 807427, 788110, 807422, 806982, 844856, 854822, 854968, 888001]
18633H88001L7923n0325j6361l7096p4982l430J3860j6938j6725O757M1701N134
18621G77519l7115J0618K541L3779P1500j7015K0413l5730J9560k4633R289l5723
18609G95003p1457o8161j4164k3360O6657K8814l6591l7597k1043m8826q527O437
18597E67185J5824m7105k0396j5175J6166K7633L440o407l8553J5724L0761j4465
18585E34632m888K4876M2129l7555k5608j3329k5745o7527J1917M9449Q533l5922
18573D60962k1550P412L1777J8417L2887j1059j3022L6406J3531n8379L7762M2837
18561E77981M0111J0072n6983m5035j2095L7032j2833j3495L4594K0435K3420
18550F03204K9989Q869q981J9409K4354J8157l4426m0806J0479J2632j1002l043
$$ y = [888001, 925924, 875599, 859238, 822142, 747160, 743730, 757590, 740652, 723927, 730684, 772385, 777519, 740404, 751022, 753563, 787342, 858842, 841827, 862240, 826510, 846070, 821437, 830726, 795003, 723546, 655385, 641221, 617861, 684518, 713332, 676741, 639144, 618101, 569275, 560748, 567185, 583009, 535904, 515508, 500333, 516499, 544132, 547572, 541165, 502612, 518336, 549097, 534632, 529744, 554620, 596749, 559194, 533586, 520257, 494512, 426985, 438902, 488351, 496884, 460962, 439412, 446824, 478601, 497018, 529905, 518846, 505824, 542230, 555761, 497382, 535144, 577981, 618092, 628164, 571181, 526146, 514051, 551083, 538250, 524755, 559349, 579784, 603204, 633193, 642062, 633081, 652490, 676844, 695001, 660575, 619769, 630248, 642880, 631878, 628835]
18538F28835L2305L147j8888O4344J9954P742K3888p0680L465O2980k8378P857
18526G36571O56J0827K3113Q4984K3765o2751o841L2236p589j5600K3992M3603
18514H86966J3921l935k6672M6808N8864J6245K4600j579R821k6787l005J187
18502I96434J5108L9191L3819j1016M4106Q3035O262k2091j2874Q6880O2183K3861
18490A344898P0894J124R313M2947J14532R6082J92932K27282J63688J25855K5613
18479B415160q2029p2104o610M1435J19922R9205q794q5677l7953l8968r6747
18468B246840p6728q8011j1066K0288P6885k4786m4224N911O6018O8700N9272
18457B299099M8024J4354Q0711J01200J66226J55589J31030J78422J45669Q545
$$ y = [628835, 661140, 664287, 645399, 709743, 729697, 737439, 761327, 690647, 694112, 757092, 728714, 736571, 737227, 748054, 771167, 856151, 879916, 817165, 810324, 842560, 834971, 819371, 843363, 886966, 900887, 896952, 870280, 917088, 975952, 992197, 1016797, 1015218, 1025039, 998252, 995247, 996434, 1011542, 1050733, 1084552, 1073536, 1117642, 1200677, 1206939, 1184848, 1171974, 1258854, 1321037, 1344898, 1415792, 1416916, 1426229, 1469176, 1583708, 1679790, 1872722, 2100004, 2263692, 2389547, 2415160, 2333131, 2261027, 2254417, 2295852, 2415774, 2514979, 2506185, 2420508, 2382555, 2343587, 2246840, 2170112, 2082101, 2071035, 2091323, 2168208, 2143422, 2099198, 2105109, 2171127, 2239827, 2299099, 2347123, 2361477, 2442188, 2543388, 2709614, 2865203, 2996233, 3174655, 3320324, 3328869]
18447C328869j9792K6097Q0258J02467R0432J08040J14323R5145k5069m6679m1168
18436C812923J6038P4934Q7845J48076J56271J79728K24864J34268Q7659J24686
18426E047292K42398K93537K38942K40121K56205K84752L11720L83771L95845
18417G694583M01829M04134L65219M83894N17677N75763O34464O74174P28695
18408A2480432Q60263Q52394R25159J029311J173975J267315J414595J585164
18400B1588608J740018J851833J860530K011783K056111K128982K163311K119631
18392C7520807J939883J728498J479563J246601J038778O55487L65974J07648
18384D6083239k12099n15138q14804r99916j142833j267282j282816j257674j216257
$$ y = [3328869, 3309077, 3335174, 3415432, 3517899, 3608331, 3716371, 3830694, 3925839, 3900770, 3854091, 3812923, 3828961, 3903895, 3991740, 4139816, 4296087, 4475815, 4700679, 4834947, 4922606, 5047292, 5289690, 5583227, 5822169, 6062290, 6318495, 6603247, 6914967, 7298738, 7694583, 8096412, 8500546, 8865765, 9349659, 9867336, 10443099, 11077563, 11751737, 12480432, 13340695, 14193089, 15118248, 16147559, 17321534, 18588849, 20003444, 21588608, 23328626, 25180459, 27040989, 29052772, 31108883, 33237865, 35401176, 37520807, 39460690, 41189188, 42668751, 43915352, 44954130, 45609617, 45975591, 46083239, 45871140, 45356002, 44541198, 43541282, 42398449, 41131167, 39848351, 38590677, 37374420]
18375C7374420r13977o66116m83025k99384o6033J32021L94147O40221R66341
18366C7078615J179912J333150J450227J462488J482383J502597J458078J262864
18358D8210314R89836O35129L86646R7172k33818n89115j005761j352723j615997
18349D5521683j881325k129552k219588k304412k366755k284396k170011k092192
18341B8073452j984358j800117j687035j564800j403428j307385j229300j098816
18333A5998213r53615q85878p83588o45732n87365n70544n42585m52635m80920
18324A0095351m43112l65095k96628k18862k82581k47116j90022j83710k00170
18315G668055j01138o0074q6878l9656j1893P023l861K5749L8858K408M5534N6391
$$ y = [37374420, 36460443, 35794327, 35311302, 35011918, 34945885, 35077906, 35472053, 36112274, 37078615, 38258527, 39591677, 41041904, 42504392, 43986775, 45489372, 46947450, 48210314, 49200150, 49835279, 50221925, 50319097, 50085279, 49496164, 48490403, 47137680, 45521683, 43640358, 41510806, 39291218, 36986806, 34620051, 32335655, 30165644, 28073452, 26089094, 24288977, 22601942, 21037142, 19633714, 18326329, 17097029, 15998213, 15044598, 14158720, 13375132, 12729400, 12142035, 11571491, 11028906, 10576271, 10095351, 9652239, 9287144, 8990516, 8771654, 8489073, 8241957, 8051935, 7868225, 7668055, 7566917, 7506843, 7419965, 7380309, 7368416, 7375439, 7371578, 7397327, 7436185, 7438593, 7484127, 7540518]
18303G540518P7419J08529J00418K19103K42621K84882K84196L31788M28637N23863
18293A0141974N38748N80813P28359Q03466R82095J194541J380955J590131J940497
18284A9881579K405042K885638L654505M546486N427627O466210P277659P488446
18276F0033192O580805M542777K208120L61890l12518k7037N78175P03848k07270
18267G4461982k008373l887002n119601n387276m635579l453029j960680m33528
18259D7576914J261897K858161M533331N977163O830896O657065N109108K448714
18251H3253249j51361j763163j978810j318061p17175j131362k612448m763599
18243F8817270o615919p526533p528413o883630n921022m829476l922687l253133
$$ y = [7540518, 7617937, 7726466, 7826884, 8045987, 8288608, 8573490, 8857686, 9189474, 9618111, 10141974, 10680722, 11261535, 11989894, 12793360, 13775455, 14969996, 16350951, 17941082, 19881579, 22286621, 25172259, 28826764, 33373250, 38800877, 45267087, 52544746, 60033192, 66613997, 71156774, 73364894, 73726784, 73414266, 73387229, 73965404, 74669252, 74461982, 72453609, 68566607, 63447006, 58059730, 53424151, 49971122, 48010442, 47576914, 48838811, 51696972, 56230303, 62207466, 69038362, 75695427, 80804535, 83253249, 83101888, 81338725, 79359915, 78041854, 77324679, 76193317, 73580869, 68817270, 62201351, 54674818, 47146405, 40262775, 34341753, 29512277, 25589590, 22336457]
18235B2336457k707588k154728j781174j512515j246432j084091r16283p87897
18227A0145749p19625o71532o66160n89293m88639m22434m51703l52216l32739
18218E451408k98050l16137k27464k00209k07888j44301j44052j90471j93512
18209C529324j59123j71053j78770j37536q5462p8958q9006n3186j47576j00599
18199B328055j5265j40216j23786l0087r1251r1448m7951j1870m357M154k9041
18188A746937j3477L0624k9462j30544p9557l9648j3661n5211q0981J5216n2607
18177A297629r7309p887N8013n5428m2886L5846J6184k8005o913J7987j04335
18166A082896m5371K7793j2028n2319l1631j3571K2709j1642O281J5881J0286
$$ y = [22336457, 19628869, 17474141, 15692967, 14180452, 12934020, 11849929, 10933646, 10145749, 9426124, 8754592, 8088432, 7499139, 7010500, 6588066, 6136363, 5784147, 5451408, 5153358, 4837221, 4609757, 4409548, 4201660, 4057359, 3913307, 3722836, 3529324, 3370201, 3199148, 3020378, 2882842, 2797380, 2718422, 2629416, 2576230, 2428654, 2328055, 2312790, 2172574, 2048788, 2018701, 1927450, 1836002, 1788051, 1776181, 1771824, 1775978, 1746937, 1733460, 1764084, 1734622, 1604078, 1524521, 1484873, 1471212, 1416001, 1335020, 1350236, 1297629, 1200320, 1192433, 1250446, 1195018, 1152132, 1187978, 1204162, 1176157, 1169244, 1187231, 1082896, 1037525, 1065318, 1053290, 1000971, 969340, 955769, 978478, 966836, 973117, 988998, 999284]
18155I99284q13j8219o1716j6153j6492J91j0371j18826j7927Q8013L9056l8556
18143H27471m3134j7072k6806k063J7129K4263m8036n7075j1613K115j0522J1418
18131F66075j5195J900J6738P94j5938l7139n6801k8704L9115M5526O997k1475
18119F01893j4019m4915j1278q2468J0550L5224J8321l8226j1747j9927Q584m5986
18107D06006j5375Q492L5131P3164j922J6683j2779K1576J0814m5648l152r348
18095D83642j3009l2014m5390R032j1212M5985L3218l0934J1759l7386k5162O1875
18083D50404K0624k1854r695K5105l5359m8192M5498L8447j8513K2621J7725l1045
18071D55766r710o6o149k3172K1822N4172j8072r3306m4161l9844J5924k3630
$$ y = [999284, 998471, 980252, 918536, 902383, 885891, 886082, 875711, 756885, 738958, 826971, 866027, 827471, 784337, 767265, 740459, 738396, 755525, 779788, 731752, 674677, 663064, 665179, 654657, 666075, 650880, 652780, 669518, 670312, 654374, 617235, 560434, 531730, 570845, 616371, 623368, 601893, 587874, 542959, 531681, 449213, 459763, 494987, 513308, 475082, 463335, 443408, 451992, 406006, 390631, 399123, 434254, 507418, 505496, 522179, 509400, 530976, 541790, 496142, 492990, 483642, 470633, 438619, 393229, 402261, 391049, 437034, 470252, 439318, 451077, 413691, 388529, 450404, 471028, 449174, 439479, 464584, 429225, 381033, 426531, 464978, 446465, 469086, 486811, 455766, 446056, 445990, 439841, 416669, 438491, 492663, 474591, 381285, 337124, 297280, 313204, 289574]
18059B89574l9426J0000M2312O4021J5538j0511J108M2114n3829p234J7944l1307
18047C40304K48K310k3452J1123k3910m4900k0461J5986L1722O329l4570P0572
18035C31301N4143l3290m4559j0622P598O2840O948n4960Q297R4137K7066n9374
18023C89525m5520k1697l2806J0456j0910R388M0197l3882m6518O807Q8379j4769
18011C38650n8929j2863J4860m4622o661R938J7944n4303K8490K8959N564L1862
17999B98889L0272M7654j7771o9039m8097j0722J7274L7610j3391j6554M6212
17988C02337M6894J1679j6556k2935m278p780l5956k3599M3532r531k3282J8902
17976B79427l1756J8870M700m505M315J6286K7882K5825k3406j0901J9974k194
$$ y = [289574, 250148, 260148, 302460, 366481, 382019, 371508, 372616, 414730, 360901, 353667, 371611, 340304, 340552, 342862, 319410, 330533, 306623, 261723, 241262, 257248, 288970, 295299, 260729, 331301, 385444, 352154, 307595, 296973, 304571, 367411, 374359, 319399, 327696, 421833, 448899, 389525, 344005, 322308, 289502, 299958, 289048, 298436, 338633, 304751, 258233, 265040, 353419, 338650, 279721, 266858, 281718, 237096, 230435, 240373, 258317, 204014, 232504, 261463, 267027, 298889, 329161, 376815, 359044, 290005, 241908, 231186, 248460, 286070, 272679, 256125, 302337, 349231, 360910, 344354, 321419, 317141, 309361, 273405, 249806, 293338, 283807, 260525, 279427, 247671, 266541, 271241, 266736, 271051, 287337, 315219, 341044, 317638, 306737, 326711, 324517]
17964C24517o590j6382K6103j3191k3512K3477P0034N6253m0836k1715K7030k1882
17952C83306N6236M7838l6788J8141k6794m0130J459j4529L1246n0875J9429P0279
17940D58818k3349l0016K6020J7466M5902j1047J494J0731M1237l2385l710N7207
17928E58368K6156m0464p1019K0701k9606k3982P0060N4778l355L0176L1640l222
17916F20231j3126J4093R235M2464K5896l1482l8680P281O003M9387l905l5066
17904F52331K8809K2262j1603K7900K8517O3709N3810J3081M0377j4224P8740
17893I83709M024K1481O7892M2678l2501L5991P6506M9423j9171J1633P4189J2781
17881A328635M0734R8993J12399L5174R6483O6503P8417J09737J52017J88597
$$ y = [324517, 317927, 301545, 327648, 314457, 290945, 314422, 384456, 440709, 399873, 378158, 405188, 383306, 439542, 487380, 450592, 468733, 441939, 401809, 403268, 388739, 419985, 369110, 388539, 458818, 435469, 405453, 431473, 448939, 494841, 483794, 485288, 496019, 537256, 504871, 501161, 558368, 584524, 544060, 473041, 493742, 464136, 440154, 510214, 564992, 561637, 591813, 623453, 620231, 607105, 621198, 630433, 672897, 698793, 667311, 628631, 635912, 641915, 691302, 687397, 652331, 681140, 703402, 691799, 719699, 748216, 811925, 865735, 878816, 919193, 904969, 983709, 987733, 1009214, 1077106, 1119784, 1087283, 1123274, 1199780, 1249203, 1230032, 1241665, 1315854, 1328635, 1369369, 1468362, 1580761, 1615935, 1712418, 1778921, 1857338, 1967075, 2119092, 2307689]
17871B307689J26809J60932J70228J14004R7558J23477J56976K14972K06886K90602
17861C970133K77152K76060L22502L55323M26218M81390M70801N88971P07496
17852G876046R36948J067817J400336J805939K258738K900025L764058N034187
17844B7044094O595890Q449291J0111207J0324933P847077K544209l649999p931660
17836F1335042r362537q661302p012897n427789m004477k816236j799803j014785
17828B1235216m20680K01863R89686J727521K503915L620304M982030O622850
17820D1462705Q350835R465432Q909774N856549J019346l283889n073098m251980
17812F2455674j838976J091512L806780N098956L941341K13804m612279q119750
$$ y = [2307689, 2434498, 2595430, 2765658, 2879662, 2977220, 3100697, 3257673, 3472645, 3679531, 3970133, 4247285, 4523345, 4845847, 5201170, 5627388, 6108778, 6579579, 7168550, 7876046, 8812994, 9880811, 11281147, 13087086, 15345824, 18245849, 22009907, 27044094, 33639984, 42089275, 52200482, 62525415, 70372492, 72916701, 69266702, 61335042, 51972505, 43311203, 36298306, 30870517, 26866040, 24049804, 22250001, 21235216, 20814536, 21016399, 22006085, 23733606, 26237521, 29857825, 34839855, 41462705, 49813540, 59278972, 68188746, 74045295, 75064641, 71780752, 66707654, 62455674, 60616698, 61708210, 65514990, 70613946, 74555287, 74769091, 70156812, 62037062]
17804F2037062r249011q583466p122374n557948m195441l151483k272660j553381
17796B0351298q90320l05302L06043R15844J657043K639432L863860N348162O799961
17787D0686021P921975P314719M303193n15823n313556p948276q178140p053812
17779C1216301n710635m450278l436396k650684k063736j648895j346916j088093
17771H820668r31930p76612o23235n64701m18885m03737m02090l83598l38391
17762C977489l12695k11847j95128k00054j01908j30021j10605j0313n4405r3044
17752B557469j38407r3025j10851j74498j02695l9802p7629n0836K2717k4018
17742A768425J3202N3282q952m0245r5276r8875k6421L9875l1738q7549k7276
$$ y = [62037062, 52788051, 44204585, 37082211, 31524263, 27328822, 24177339, 21904679, 20351298, 19460978, 19155676, 19461719, 20377563, 22034606, 24674038, 28537898, 33886060, 40686021, 48607996, 55922715, 60225908, 59710085, 54396529, 46448253, 38270113, 31216301, 25505666, 21055388, 17618992, 14968308, 12904572, 11255677, 9908761, 8820668, 7888738, 7112126, 6488891, 5924190, 5505305, 5101568, 4699478, 4315880, 3977489, 3664794, 3452947, 3257819, 3057765, 2955857, 2825836, 2715231, 2704918, 2650513, 2557469, 2419062, 2326037, 2215186, 2040688, 1937993, 1898191, 1820562, 1769726, 1792443, 1768425, 1781627, 1834909, 1825957, 1785712, 1690436, 1591561, 1565140, 1605015, 1573277, 1485728, 1458452]
17731A458452q1422o4333p7442j09087K271m3462l4886L1190N4283p922k7719
17720A099923l1263p868k5056l1038k0363j6365k8686k0792J6283m7013l8074
17709H49688K7570N852q4150r4514m6395k5532M956k5706j5543l4693O0111P0510
17697F92154J0154l7832j50423o3153N631P5228j5515m1157L835K2246l8711o393
17685D56064m2315r071N4933L9630k0198j4044k1771l5844p2764n6318k13M8383
17673C26472M2421l0261m9823M5083K9440m0510l5877N1610J6714L3280J6652
17662D05201k0099r849K0455R332n404l5561K2217k0108m6940J4455J1799l3963
17650C11535k8465N8724l3725J8328k150n3916K7370P676l6644j9265k1474j5385
$$ y = [1458452, 1377030, 1312697, 1235255, 1126168, 1128439, 1084977, 1050091, 1081281, 1135564, 1127642, 1099923, 1068660, 1060792, 1035736, 1004698, 984335, 967970, 939284, 918492, 934775, 887762, 849688, 877258, 883110, 798960, 704446, 658051, 632519, 637475, 611769, 596226, 561533, 621644, 692154, 702308, 664476, 514053, 450900, 456531, 531759, 516244, 475087, 478922, 501168, 462457, 456064, 413749, 404678, 459611, 499241, 479043, 464999, 443228, 407384, 334620, 278302, 278089, 326472, 368893, 338632, 288809, 333892, 363332, 322822, 286945, 338555, 355269, 388549, 405201, 385102, 375253, 395708, 405040, 399636, 364075, 386292, 366184, 319244, 333699, 345498, 311535, 283070, 341794, 308069, 326397, 324247, 270331, 297701, 305377, 268733, 249468, 227994, 212609]
17638B12609L8381k9532O4499K1928N0203K480n8406n9188l3692K9440o90L7477
17626B75509K3067j1103j775N236k1002m023k1407j7047L127L739l9205j0619
17614A84497k6658N9258K3917J1597k2367l0097l0590k6709p345J7739k525K4840
17602A75557P9561k6637k7587j6005K1985L9153L4169J8708m2251n1476k2355
17591A82822L9696j7091j4773j991N548L3363M957m185k1693o5356o5602o141
17579F9554M2850K2827N995j8025L3630M10K0463P4582O737k0253m4246K3727
17567B18251p350l5959M5208J8275p2210k4528n8599k7496R888N2467N622L9501
17555A63070N4424l0558K651l36l6500l449l8621k1122k6481k569q236J428r436
$$ y = [212609, 250990, 221458, 285957, 307885, 358088, 360568, 302162, 242974, 209282, 238722, 238032, 275509, 298576, 287473, 285698, 290934, 269932, 265909, 244502, 227455, 230582, 234321, 195116, 184497, 157839, 217097, 241014, 252611, 230244, 200147, 169557, 142848, 135503, 153242, 150717, 175557, 255118, 228481, 200894, 184889, 206874, 246027, 280196, 298904, 256653, 205177, 182822, 222518, 205427, 190654, 188663, 194211, 227574, 232531, 228346, 206653, 141297, 75695, 69554, 112404, 135231, 141226, 123201, 156831, 157241, 177704, 252286, 259023, 238770, 194524, 218251, 210901, 174942, 220150, 238425, 166215, 141687, 83088, 55592, 65480, 117947, 123569, 163070, 217494, 186936, 189587, 189251, 152751, 149302, 110681, 89559, 63078, 60509, 52273, 53701, 44265]
17542D4265j3999J9565K4968q841p952O8837r162l6774R039J0151k5272M855j7581
17529F2099o7710J5760p391K9653J12269P6774N265J148N047p425l2121o7387
17517A25981o1284r44L2770K3693k3882j1906k3134n459K2979M1701n479M6804
17505A61840K6708j7842j8397m2569n0937K0539q822J1835K7879k240K4555k8080
17493A04469q108n1632o6359m5022j0301M097P0651N1927l3003k5025O8023M0792
17481A00509k2233R679L8168m9183j8970l185l6336O67M2880N671M9488J7429
17469A34584l3450J0661p171j5113R547M0548n1180p3674p091N4523m125j8066
17457C9993J98o4662k4060M0394P0594M7675k3116k681k99N7336R88p6405J7420
$$ y = [44265, 30266, 49831, 74799, 65958, 58006, 126843, 117681, 80907, 89946, 100097, 74825, 79680, 62099, -5611, 10149, 2758, 32411, 144680, 221454, 226719, 227867, 232914, 225489, 193368, 125981, 64697, 63753, 96523, 120216, 96334, 84428, 61294, 55835, 78814, 120515, 115036, 161840, 188548, 170706, 152309, 109740, 58803, 79342, 70520, 82355, 110234, 107994, 132549, 104469, 96361, 44729, -21630, -66652, -76953, -72856, -2205, 49722, 16719, -8306, 59717, 100509, 78276, 87955, 126123, 76940, 57970, 54785, 18449, 19116, 61996, 67667, 117155, 134584, 101134, 111795, 104624, 89511, 99058, 139606, 88426, 14752, 7661, 62184, 58059, 39993, 40191, -24471, -48531, -8137, 62457, 110132, 87016, 84335, 84036, 141372, 142360, 65955, 83375]
17444H3375J1351J0708k926P789r927j5206k020j1063J9385M5781K7346N003K4182
17431A93778k4948l6724r4561j5355L8967R791M7171j8052M699M7913k1142r8171
17419C3366L7233M7292M0518n069r2488m8177M0558M6539L0876N8655O7289l3903
17407B22689j8740n4414o473N2178L0065K1797P3966P6405O6531J05851J01989
17396F71844J16160P8755J21478J09314L915l7834M767J4888p7290j10283j18844
17385G76870j41746p9132o5443j25475j05567m1880n6947l5248K2028n477j8317
17374A23666j1908o992O2946l1467k9819K0866j5736m4682L466Q94j8004k868
17362E0362r959M760N431k4153k9905L9258L3719K8874Q05J9054l0216L5899L3085
$$ y = [83375, 94726, 105434, 102508, 110297, 100370, 85164, 83144, 72081, 91466, 137247, 164593, 169596, 193778, 168830, 132106, 37545, 22190, 61157, 70948, 118119, 100067, 104766, 152679, 131537, 33366, 70599, 117891, 158409, 153340, 60852, 12675, 53233, 99772, 130648, 189303, 256592, 222689, 203949, 149535, 143062, 195240, 225305, 247102, 321068, 397473, 464004, 569855, 671844, 788004, 866759, 988237, 1097551, 1101466, 1063632, 1068399, 1083287, 1005997, 895714, 776870, 635124, 555992, 490549, 365074, 259507, 217627, 160680, 125432, 147460, 141983, 123666, 111758, 104766, 167712, 136245, 106426, 127292, 111556, 66874, 70340, 71234, 53230, 50362, 40403, 45163, 50594, 26441, -3464, 35794, 69513, 98387, 99192, 118246, 88030, 123929, 157014]
17349A57014J8178K0925m6203m9035j8978k3840Q78l0430j7739K3059m8515m4646
17337e9332L7081O3943j0310m1226l3851J9599M3772K8703J4714O8166K1826J986
17325A55071k7298m0064o4107n3416N2676J2882j6905J5628J7056L0739p537J6037
17313I0762K2504J2316N545P0336L284J9112N5810N3436L4432K2978m963l1873
17301C53679n4356l1244k6585J4198k6655k4708l4501j7465J7257N6614j3001
17290B13233k1759N8064N8435M7476n761K0723M7365P187M8216K4374M1961M0540
17278E80054m2051L074j0071j1105N2069m304k9532m5322q5395p5279m8100l1651
17266B52387j9750K5254K571n9009m1127J6415L8299J6328K9740R5204N3574j8248
$$ y = [157014, 175192, 196117, 149914, 100879, 81901, 58061, 58939, 28509, 10770, 33829, -14686, -59332, -22251, 41692, 31382, -9844, -43695, -24096, 19676, 48379, 63093, 131259, 153085, 155071, 127773, 87709, 23602, -29814, 22862, 35744, 18839, 34467, 51523, 82262, 74725, 90762, 113266, 125582, 131127, 201463, 204747, 223859, 279669, 333105, 367537, 390515, 385552, 353679, 299323, 268079, 241494, 255692, 229037, 204329, 169828, 152363, 169620, 226234, 213233, 191474, 249538, 307973, 355449, 349688, 370411, 417776, 424963, 473179, 497553, 539514, 580054, 538003, 541077, 531006, 519901, 571970, 567666, 538134, 492812, 407417, 332138, 284038, 252387, 232637, 257891, 260462, 201453, 160326, 176741, 215040, 231368, 261108, 356312, 409886, 391638]
17254C91638L44L7351K3k9589l4633k6832l1544K043N756r439K1190o1539K254
17241B67023L262K9071m2241R3K2554k223n6951J930O1533O5811k2003j4687P806
17228C20978K205k9924J3285O0730N5632k710O0338L6012o264M5736N5985J2779
17216F24782k9272k3167l026J3765K1137J422O3388j0132L0331N8234q692k7560
17204G11210n4216j9749L5762k4309m1737M1352K240m065M463L3151l804k9133
17192F51165j3831J9129J1150M7182k9837n9249k6942j3199n6182l8941m6352
17181D44093p6705m648K4186k4471M664j5110j828J8167m9416j3534M8581l1485
17169C22494k4576j5596o2373j0315J6240N1172J40j9829L6580l2320R662j6052
$$ y = [391638, 391982, 429333, 429356, 399767, 365134, 338302, 306758, 308801, 314557, 305118, 326308, 264769, 267023, 270285, 299356, 257115, 257208, 279762, 277539, 220588, 222518, 284051, 349862, 327859, 313172, 320978, 323183, 293259, 306544, 367274, 422906, 420196, 480534, 516546, 510282, 556018, 612003, 624782, 595510, 572343, 569317, 583082, 604219, 605641, 669029, 658897, 689228, 747462, 738770, 711210, 656994, 637245, 673007, 648698, 606961, 648313, 650553, 646488, 650951, 684102, 680298, 651165, 637334, 656463, 667613, 714795, 684958, 625709, 598767, 585568, 529386, 490445, 444093, 367388, 362740, 386926, 362455, 367119, 352009, 350181, 368348, 318932, 305398, 353979, 322494, 297918, 282322, 219949, 209634, 225874, 277046, 277186, 257357, 293937, 261617, 271279, 255227]
17157B55227k9498n8315n9312k5030L0599k199k0988L9312M3094k202Q53j4299
17145A57242j5356R76O826r046k9699l4595k8396K5208k3133N0598L2540K1891
17133A55056l6303K2689L0590m1878j0055k5744K7340M4565L4622o61k8560N709
17121A77370n130M741J5712k6148k0480l4886J6550j0063k0273J3725K4245m6596
17109H8767j8820j8298R665R0918L5553j1962P668M9195p164L4087K6341n423
17097B80527l2626o7749n3985j0141L3756R416L084J7403p1806k9202L3745J3234
17085A25656j2384m2576L1808M2108l4890j0009N3089j4117m5186m7082L5956
17074H2373m51r04P0118R500l0334K2695K216j6065l4610m7803L2548M4439N3572
$$ y = [255227, 225729, 167414, 108102, 83072, 113671, 111472, 90484, 129796, 172890, 170688, 171541, 157242, 141886, 142862, 149688, 140642, 110943, 76348, 47952, 73160, 50027, 100625, 133165, 155056, 118753, 141442, 172032, 130154, 120099, 94355, 121695, 166260, 200882, 200221, 171661, 177370, 172240, 176981, 192693, 166545, 146065, 111179, 127729, 117666, 97393, 111118, 135363, 88767, 69947, 51649, 61314, 152232, 187785, 175823, 183491, 232686, 225522, 259609, 285950, 280527, 247901, 180152, 126167, 116026, 149782, 159198, 162282, 179685, 107879, 78677, 112422, 125656, 113272, 70696, 102504, 144612, 109722, 99713, 152802, 138685, 93499, 46417, 82373, 81922, 81018, 151136, 160636, 130302, 152997, 155213, 139148, 104538, 56735, 89283, 133722, 187294]
17061A87294m0399k1259m097L0075M7576P4936J2303j7699n0897l4353j0184N567
17049A78863K9522K3426Q049J4388M7459K4190j92J5487n5833n1463l2989m9557
17037A51350K297K8621R928q548J6232l9967j6209l7764r692J5349L3736P4475
17025B19808M8030L3306p7870q417P8860L937l0455M964J00106J04797J46793
17014F23859N7345L0963J24050J10463N0282j8187j7942m7267r50m284q2184l9895
17002G86253J0234N9474N3657J00682O5400L4602q9006q3297o3344J7403j5774
16991H76284o442Q8277K0383j8104n8609n3728m2887m9819o384J9265K4135N553
16979G97924Q5239N1943J9572J3003n3798r5832j5170n3843p8145m3497k437l3977
$$ y = [187294, 146895, 125636, 121539, 151614, 199190, 274126, 286429, 268730, 217833, 183480, 173296, 178863, 208385, 231811, 239860, 254248, 301707, 325897, 325705, 341192, 285359, 233896, 200907, 151350, 153647, 182268, 192196, 183648, 199880, 159913, 143704, 105940, 96248, 111597, 145333, 219808, 267838, 301144, 223274, 214857, 293717, 297654, 267199, 272163, 372269, 477066, 623859, 681204, 712167, 836217, 946680, 996962, 978775, 960833, 913566, 912616, 908332, 826148, 786253, 796487, 855961, 909618, 1010300, 1075700, 1110302, 1021296, 937999, 874655, 892058, 876284, 869842, 958119, 978502, 960398, 901789, 848061, 805174, 755355, 748971, 768236, 792371, 797924, 883163, 935106, 954678, 967681, 913883, 818051, 802881, 749038, 670893, 627396, 624959, 590982]
16967E90982J939j0575o0474o2577j03058m2873M5464K6417J2173o433j7573j377
16955C72035j9949o8345Q038k8137k6531O8211P262n477N1971j686j3986J265
16943C44671l350L517K7021N2622n4314n942O7652L7807m5507j3594K7634K8262
16931D66479K7829K5179j5152n4518K8563K6543R62J2031N9132K7023k3376n0832
16919E29863N0680N6586L1992M6552L4942j1685q247O0950J5147L3901K7449Q7291
16907I55421L7384N8581K6015L9055J1536N1103J25997J60993J13206J37301K13452
16896A930044K06277J64648J82130J49211Q4381N2565L8049p5711j24152p7943
16886B529499j16294j30572m3819k021k6941o192L4654O4333Q4064P9399J52846
$$ y = [590982, 592921, 582346, 521872, 459295, 356237, 313364, 358828, 385245, 397418, 390985, 373412, 372035, 352086, 283741, 291779, 263642, 237111, 305322, 312584, 307107, 359078, 357392, 343406, 344671, 341321, 344838, 371859, 424481, 370167, 364225, 431877, 469684, 424177, 410583, 438217, 466479, 494308, 519487, 504335, 449817, 478380, 504923, 505885, 517916, 577048, 604071, 580695, 529863, 580543, 637129, 669121, 715673, 750615, 738930, 730683, 791633, 806780, 840681, 868130, 955421, 992805, 1051386, 1077401, 1116456, 1127992, 1179095, 1305092, 1466085, 1579291, 1716592, 1930044, 2136321, 2300969, 2483099, 2632310, 2716691, 2769256, 2807305, 2731594, 2607442, 2529499, 2413205, 2282633, 2238814, 2236793, 2209852, 2203660, 2238314, 2302647, 2386711, 2466110, 2618956]
16875B618956J68325J29624J81889J90379K64232K78764M00813N07163M91249
16866E231394O11704P12045O83869P96865Q74619Q59762Q84761Q83031J048168
16857A2586218J190900J391676J672353K140984K841520L821243N243097P229845
16849C8117836J0222446J4350556J9686614K5426373K9518573L0859451L0428522
16842A98610371K8047801J9362545K216805j5649407k5313327k8503150l0108969
16835A48662669k9855340k6578985k1253756j6010237j1738743q531107o359041
16828B8335460m784055l567366k707773k062897j614124j255229r93155q05816
16820A0545045p42571p12224o39999o00163n62099n07107n81700n82314n51273
$$ y = [2618956, 2787281, 2916905, 3098794, 3289173, 3553405, 3832169, 4232982, 4740145, 5231394, 5843098, 6555143, 7239012, 8035877, 8910496, 9770258, 10655019, 11538050, 12586218, 13777118, 15168794, 16841147, 18982131, 21823651, 25644894, 30887991, 38117836, 48340282, 62690838, 82377452, 107803825, 137322398, 168181849, 198610371, 226658172, 246020717, 248237522, 232588115, 207274788, 178771638, 148662669, 118807329, 92228344, 70974588, 54964351, 43225608, 34694501, 28335460, 23551405, 19984039, 17276266, 15213369, 13599245, 12344016, 11350861, 10545045, 9802474, 9090250, 8450251, 7850088, 7287989, 6780882, 6199182, 5616868, 5065595]
16811E065595m61885m08874l14621l16086l10304k40442k06513j41221j40880
16802B524769j35753r0082r8248j26469o2735l6345j03411j06919l4216m1621
16792A688970p8003p1148p3263r5116o7071n7336o072J9755K7946n9637o4109
16781A164916k0759m1899q657m4028k1914m593j9724K9723M4009Q396j4625n4315
16769A016530K7224M1672M6501N8466L8402J54982J16752J21240J72760J90734
16759A985263J83264J74465J14157J7319k3517p0242j91037k55919k50767j71847
16749A511139j64799j93893r2221j8710j08508j29951m1694K8806J0236p7383
16739G23022m2909J531k4564m6924j9692M3886l0349j4870J4747n7678k8617o8511
$$ y = [5065595, 4603710, 4194836, 3880215, 3564129, 3253825, 3013383, 2806870, 2665649, 2524769, 2389016, 2298934, 2200686, 2074217, 2011482, 1975137, 1871726, 1764807, 1730591, 1688970, 1610967, 1539819, 1466556, 1371440, 1304369, 1247033, 1240961, 1260716, 1288662, 1229025, 1164916, 1144157, 1102258, 1093601, 1049573, 1027659, 1023066, 1003342, 1033065, 1077074, 1085470, 1070845, 1016530, 1043754, 1085426, 1131927, 1190393, 1228795, 1383777, 1500529, 1621769, 1794529, 1985263, 2168527, 2342992, 2457149, 2474468, 2450951, 2380709, 2189672, 1933753, 1682986, 1511139, 1346340, 1152447, 1060226, 1041516, 933008, 803057, 761363, 790169, 800405, 723022, 680113, 681644, 657080, 610156, 590464, 634350, 604001, 589131, 603878, 546200, 517583, 449072]
16727D49072o2965P182M6812J8271l1507r174O71r120k92l7651j890K4816J459
16714C95684k4364j05437K123K5908J0783K3131m4845l9100k6139K7702L2082
16703B77528j9711J8458k1934l5927L0092l5801N546K4815k9576P227m1446m3483
16691A35788M1130K7044K5425m3641j3192k2686P6664k5198o2923M6778l1089
16680A54100K7285L0791m1521o4303N6919J2261L3364j9574l2288j7587r977K0575
16668A50045j6270l2163L3352l4411l5210K7924N4288J0252R91o8772J3584L3141
16656A36751K5034O786P874J6497N8712M4493o469k0282q0674r0238K0618L8967
16644A58069K7480j0477j6119K3337J1288k4621K4179n394m8582j6355l8439L426
$$ y = [449072, 386107, 393289, 440101, 458372, 426865, 417691, 418362, 409242, 408950, 371299, 369409, 394225, 395684, 371320, 265883, 268006, 293914, 304697, 327828, 282983, 243883, 217744, 245446, 277528, 257817, 276275, 254341, 218414, 248506, 212705, 218251, 243066, 213490, 220717, 179271, 135788, 176918, 203962, 229387, 185746, 172554, 149868, 226532, 201334, 138411, 185189, 154100, 181385, 212176, 170655, 106352, 163271, 175532, 208896, 189322, 157034, 139447, 129470, 150045, 133775, 101612, 134964, 100553, 65343, 93267, 147555, 157807, 158798, 90026, 103610, 136751, 161785, 168571, 176445, 192942, 251654, 296147, 289678, 269396, 188722, 98484, 119102, 158069, 185549, 175072, 158953, 182290, 193578, 168957, 193136, 187742, 139160, 122805, 84366, 87792]
16632H7792J6646R523l1525j9674M5438j0012j2415k4957K7901P4783K6722M2078
16620B32300O067m0745k9816n8329j1493Q399R708j094j2656K6151K1489j1010
16608A38971K5926k9206l144n480K6477P291l7454J6973r597M8995M8523N8614
16596B86889M8826n0240j8485l9818n6426R456J0484m118N0360K0128l2441M137
16584B28752L708l1564l5828n634J2908M687J9392k6376n818k732J8019q437j1372
16571A59705o0925l8609J761L0513Q283j3509m5960J4371K7744j6721J0277P0836
16559A47766J7738k6064m6387J5921l7035m2075k0426j1424M4386J0487P009R132
16547F9028K634N139M6826N5468j6054j5933l7640l4586P927J7244O1549M209
$$ y = [87792, 104438, 113961, 82436, 62762, 108200, 98188, 85773, 60816, 88717, 163500, 190222, 232300, 238367, 197622, 167806, 109477, 97984, 106383, 116091, 114997, 102341, 128492, 149981, 138971, 164897, 135691, 132547, 127067, 153544, 160835, 123381, 140354, 130757, 179752, 228275, 286889, 335715, 285475, 266990, 227172, 170746, 180202, 190686, 186568, 236928, 257056, 224615, 228752, 232460, 200896, 165068, 159434, 172342, 177029, 196421, 170045, 164227, 161495, 179514, 171077, 159705, 98780, 60171, 61932, 92445, 100728, 87219, 41259, 55630, 83374, 66653, 76930, 147766, 165504, 139440, 93053, 108974, 71939, 29864, 9438, -1986, 42400, 52887, 59896, 69028, 71662, 76801, 123627, 179095, 163041, 147108, 109468, 74882, 82809, 100053, 161602, 165811]
16535A65811k941K959k3004k8186m0029J4321l7332O265J2163L0221M9045p67
16523A48526o0547N3921P567m62J120k8334m4733j5929R5685K6193J649j768j7066
16510A65822P8685M7353m4983p8410n7056l1404j9760N181L1554l649o6437m2515
16498a5619n0766j4538L1880k509r245J8504O4580R36j9116r124J4434K7759k1361
16485A5815Q592L2598m507j1020M3124O5452k1905l4883K3245j966M8988l7616
16473A25917l1477m272N4163l3349r860M4951j1677n4088j2590j3373M815O3205
16461A22365N4300P241l2413m387L1633n5213n164j1422J911M2190k7175n2221
16449G1645L8490R183k9110k6781P952J5310N3591l412l6945j7164m556m037m020
$$ y = [165811, 162870, 165829, 142825, 114639, 74610, 88931, 51599, 57864, 70027, 100248, 149293, 148526, 87979, 141900, 149467, 149005, 150125, 121791, 77058, 61129, 156814, 183007, 184656, 182888, 165822, 244507, 291860, 246877, 168467, 111411, 80007, 60247, 65428, 96982, 93333, 26896, -15619, -66385, -80923, -49043, -51552, -60797, -42293, 22287, 23223, 4107, -5017, 9417, 37176, 15815, 24407, 57005, 52498, 41478, 84602, 150054, 128149, 93266, 116511, 114545, 163533, 125917, 94440, 90168, 144331, 110982, 101122, 146073, 134396, 80308, 67718, 54345, 59160, 122365, 176665, 183906, 151493, 147106, 178739, 123526, 118362, 106940, 108851, 151041, 123866, 71645, 110135, 119318, 90208, 63427, 71379, 86689, 140280, 136868, 99923, 82759, 78203, 74166, 70146]
16436G0146l987l838P969k1432Q11k4934l8898L8452P4327L379p2833l7748M9517
16423D0931K7827M0780K6146L1050j9766n681r145l4444m3229l6306M8272P2840
16411A39275O889j7728j5987l3800N3546K8437n7018n0570K6746K6169L1891J6915
16399A54765j9714k2283J4940K6282M4505J8298l112m2462K5905L9592k6966p0401
16387A39349n8011m8142n336J4265O4819l026M1406N0694J1156n5439m714m8783
16375I8238j0461L916K7869O005N5332R906J1228O5779q0343n9907p0351j4111
16363D3100N2505Q676J3944N0316j4781j9280R683N6561l582p918j0806m2068
16351A36350L0934L2135l2254j350J1027R078l423J3664j751m6239k5253L4359
$$ y = [70146, 66159, 62321, 70290, 48858, 49669, 24735, -14163, 24289, 98616, 101995, 29162, -8586, 40931, 68758, 109538, 135684, 166734, 146968, 141287, 132142, 97698, 54469, 18163, 66435, 139275, 146164, 128436, 112449, 78649, 132195, 160632, 103614, 53044, 79790, 105959, 137850, 154765, 135051, 112768, 127708, 153990, 198495, 216793, 213681, 171219, 197124, 236716, 209750, 139349, 81338, 33196, 27860, 42125, 106944, 103918, 145324, 196018, 207174, 151735, 147021, 98238, 87777, 91693, 119562, 125567, 180899, 190805, 202033, 267812, 187469, 127562, 57211, 43100, 95605, 104281, 118225, 168541, 153760, 134480, 144163, 200724, 197142, 189224, 178418, 136350, 167284, 199419, 167165, 165815, 176842, 185920, 182497, 196161, 194410, 148171, 122918, 157277]
16339A57277L5105n3713j0993j2043k4860O1788j3860J5735M7694l8185m9536
16328A14409l1267M1423R5148K2461k0194n073L752l2124l1749k2468O1180K6936
16316B22434j7913p538o1868O026N8541j5744r289N3058O0888o950m1995l7182
16304B02468j5460k4459j1937P5449n3847O246P6695O7140J0791j6981P6266J7374
16292D09745M5428J10637N2012R9813J06293J81255Q7098M2397L1569P9212k2007
16281A223452p0502r2016o8410j32511j48638j40677j07331p4095p0088n5326
16271B63858n3107n7056R049J2079K7149L7674K9219n8220q052k3414k2743P843
16259A64279k509J591k5301l0269j8378Q5607K3754P608J3560k5354r8666j7392
$$ y = [157277, 192382, 138669, 127676, 115633, 90773, 152561, 138701, 154436, 202130, 163945, 114409, 83142, 124565, 219713, 242174, 221980, 216907, 220659, 188535, 156786, 134318, 195498, 222434, 204521, 196983, 135115, 141141, 199682, 183938, 174649, 227707, 288595, 281645, 239650, 202468, 187008, 162549, 150612, 226061, 172214, 178460, 255155, 322295, 333086, 316105, 392371, 409745, 455173, 565810, 617822, 717635, 823928, 1005183, 1092281, 1134678, 1166247, 1245459, 1223452, 1152950, 1060934, 992524, 860013, 711375, 570698, 463367, 389272, 319184, 263858, 210751, 153695, 162744, 174823, 201972, 239646, 268865, 210645, 202593, 179179, 156436, 164279, 161770, 163361, 138060, 107791, 89413, 175020, 198774, 206382, 219942, 194588, 95922, 78530]
16247G8530J849l3575k3208L2083K4404L0899J01353M9229k9648p622k3818P647
16235B08123M221l6500O3670R681k7061k3476n5809O9212J8264j7378Q953m1039
16223A80861k3035L5221J3291O1939J1550Q605m4976k4282K2427K595q729l1340
16211B04127l1914l2081l4990l06K7152O2003K9307k541M0371j4356J3696k8834
16199B31634m5585r488L8223n7937J6443L6560K1269J2989J3058O03o1637M855
16187B00987l550M2816J7401k1020p6239j10087L2532J35913K5196q924j0108
16176B24917k2419j56N515L584K2650r651j7792j2334P599N6014m1709l3241L3341
16163B16318j884o530l0956j6278L3548l9180m1796N511M5158M3387J9287l6925
$$ y = [78530, 80379, 46804, 23596, 55679, 80083, 110982, 212335, 261564, 231916, 224294, 200476, 208123, 212344, 175844, 239514, 249195, 222134, 198658, 142849, 212061, 230325, 212947, 221900, 180861, 157826, 193047, 206338, 268277, 279827, 288432, 243456, 219174, 241601, 244196, 235467, 204127, 172213, 140132, 105142, 104836, 131988, 193991, 223298, 220757, 261128, 246772, 260468, 231634, 186049, 176561, 214784, 156847, 173290, 209850, 231119, 244108, 257166, 257769, 196132, 200987, 197437, 240253, 257654, 236634, 160395, 50308, 82840, 218753, 243949, 235025, 224917, 202498, 202342, 207857, 211441, 234091, 224440, 206648, 194314, 201913, 257927, 216218, 182977, 216318, 214434, 207904, 176948, 160670, 194218, 155038, 113242, 118753, 163911, 207298, 226585, 189660]
16151A89660j1067m5311j5357L5541j2547Q128L3711M7385p906m4522j9133J423
16139A60005l9611q401O7591L0146k0598j720j4084K9484J0762l3692J2778j0369
16127A82291K079J9371L7187m3433m4501j1826K8179O9054k1652j2229O5865l0020
16115B40365m3619Q37J555K1530M7402k9699o3241l5364k7025N3265N5017L1838
16103B52861k8653l3960o586R808M1358J01742p9926m0123J696l8253J472m68
16091A80968k8863j6900N1722K0354O0054m2425m4872M335M7533L254m1009j1633
16079A82518j3451K2212L9087N6454M1279o8068q6304n6607M1860M9096K2766
16068B30842k2063k2652m0211J3816P7201M4501o1915M4797j1243l4399l4046
$$ y = [189660, 178593, 133282, 117925, 153466, 140919, 149047, 182758, 230143, 222237, 177715, 158582, 160005, 120394, 111993, 179584, 209730, 189132, 187412, 173328, 202812, 213574, 179882, 192660, 182291, 184370, 203741, 240928, 197495, 152994, 141168, 169347, 238401, 216749, 204520, 270385, 240365, 196746, 197583, 199138, 220668, 268070, 238371, 175130, 139766, 112741, 166006, 221023, 252861, 224208, 190248, 183662, 193470, 234828, 336570, 256644, 216521, 218217, 179964, 181436, 180968, 152105, 135205, 186927, 207281, 267335, 224910, 180038, 184373, 231906, 235160, 194151, 182518, 169067, 191279, 230366, 286820, 328099, 260031, 173727, 117120, 158980, 208076, 230842, 208779, 186127, 145916, 159732, 236933, 281434, 219519, 264316, 253073, 218674, 184628]
16057A84628M2978j7658N139k8894J7143L6855N4938k8054M9632P908l2666l9850
16045B52099p201M505K1356N7362M2181l5036p3366k9085L3224M4120o7261q0297
16033A62601J9638j3283K3661Q1517j4008k0907J9362p313o3017m7331K4091O2878
16021B27889J661r192K442N3166M5364J1019n2800N510J318O132M7325K2426k1543
16008C40717j6136j5649l0498m1071p77M6625K0285k6191J8411L5840k307k9973
15996B99276j5780l240k9031k0249N8334N6691K0620O901k4415L6428m3242k6493
15984C15800p700K2703P5330M1073j2350l9578k9647L6969K8403Q059q855m8662
15972C81545o1518l675J341K3974j5525n318l1939k7995O6635K6208J1672l595
$$ y = [184628, 227606, 209948, 215087, 186193, 203336, 240191, 295129, 267075, 316707, 324615, 291949, 252099, 244898, 249403, 270759, 328121, 370302, 335266, 261900, 232815, 266039, 310159, 242898, 162601, 182239, 168956, 192617, 274134, 260126, 239219, 258581, 251268, 188251, 140920, 165011, 227889, 229550, 220358, 222800, 275966, 321330, 332349, 279549, 285059, 286377, 292509, 339834, 362260, 340717, 324581, 308932, 278434, 237363, 236586, 283211, 303496, 277305, 295716, 331556, 329249, 299276, 283496, 280256, 251225, 230976, 289310, 346001, 366621, 373522, 349107, 385535, 342293, 315800, 308100, 330803, 406133, 447206, 434856, 395278, 365631, 402600, 431003, 439062, 430207, 381545, 320027, 316352, 317693, 341667, 326142, 320824, 288885, 260890, 327525, 353733, 365405, 361810]
15960C61810P785k0836o0508l219N844k2038l9603j8047J1773n614J0699K1603
15948B49649N3645Q4131Q330o3631l1810K5201M7433k1522j074p628l6204L9327
15936C45847m3596P435K6523j5091k3719n2951n684P9642q857q22l8597k9732
15924B40398L6750K5532J140j446j5715O1125O662j4982n1067q494O4132j660
15912C42375n5719j3422P8985Q213l14o4706m4793K9209j334m8852N4813N6759
15900C41214j7310k0532J4204K7053m0258K1805L4521l8930j1664M4057O4597
15889D18757J7275l40k1685l1730l4123j9578J5679j307M0171K5768k0756j2553
15877C75578q492K1681j0453j7646L2213K4l6857m2221o5863P5454K2284L356
$$ y = [361810, 369595, 348759, 288251, 285032, 290876, 268838, 229235, 211188, 222961, 217347, 228046, 249649, 303294, 387425, 395755, 332124, 300314, 325515, 372948, 351426, 350352, 342724, 306520, 345847, 302251, 309686, 336209, 321118, 297399, 244448, 238764, 318406, 309549, 308727, 270130, 240398, 277148, 302680, 303820, 302374, 286659, 347784, 354446, 339464, 288397, 279903, 344035, 342375, 286656, 273234, 352219, 360432, 360118, 295412, 250619, 279828, 278494, 229642, 284455, 341214, 323904, 303372, 317576, 344629, 304371, 326176, 360697, 321767, 310103, 354160, 418757, 436032, 435692, 414007, 382277, 348154, 328576, 344255, 342948, 383119, 408887, 388131, 375578, 367086, 388767, 378314, 360668, 392881, 392905, 356048, 313827, 247964, 323418, 345702, 349058]
15865C49058J7418P667q008l5936k4076O9569K2192O74q070j6566o51M0034K3882
15852D37187j1981M6017J1708j7563p4446o7604M2221L6305J6096q421m3327L1399
15840C97591r315p236J4335l8398q550L4443j9940O9039O3278j7124m1273o2343
15828C74507m2420j4278m460M2605k274K71r056k7179q165j5706j024q103L7376
15815C22094O9339J0774J7496J2705j3617M1625L7904j5800L572m9085n4468j9059
15803C63480N7037N6j1182M4745p1364n0658J0792N9916k224J3850j5304K4816
15791D23960j1329l8926n1454k398M8471J26607l7821l1004N235j9969O397j1453
15779D06316m136J6517l6268K1031J3710j5765K8708L3456J7927m48p7497K750
$$ y = [349058, 366476, 374143, 366135, 330199, 306123, 375692, 397884, 398558, 390488, 373922, 373271, 413305, 437187, 425206, 471223, 482931, 465368, 390922, 323318, 365539, 401844, 417940, 409519, 366192, 397591, 388276, 381040, 395375, 356977, 348427, 382870, 362930, 431969, 495247, 478123, 436850, 374507, 332087, 317809, 313349, 355954, 353680, 353951, 344895, 317716, 309551, 293845, 292821, 284718, 322094, 391433, 402207, 419703, 432408, 418791, 460416, 498320, 482520, 486092, 437007, 382539, 363480, 420517, 420573, 409391, 454136, 382772, 332114, 342906, 402822, 400598, 414448, 399144, 423960, 412631, 373705, 322251, 319853, 368324, 494931, 457110, 426106, 431341, 411372, 417769, 406316, 402180, 418697, 382429, 403460, 417170, 401405, 430113, 463569, 481496, 481048, 403551, 406301]
15767D06301L1724j4182J9295k9463P555M7234K0959O835J0081l1759M1599o123
15755E10056o6486L3638P3564O3736N4700P5975J35250j0120r2157j14622l2815
15744F30719j7583p5510p9753k4400K3796K2331K957l6054N923L9772M2895J4542
15732E49635k2914r36J7066K8586N3380m7177l8849l5238o289k618n4602j3156
15720D26888L2859N9855J2462k4899j9109Q2418j0150p784k9768k0674n4407J3292
15708D60983L7912N0079m0123k8683M9133M8120j8919m6165K2290j9105o8084
15697D47438j5023O5713Q4214O0014o144o0082j10614l9105N6661M7584m0755
15686D89901m5389J703N9419M351M8627M6090O910j5404O91n4109q816O3221K5461
$$ y = [406301, 438025, 423843, 443138, 413675, 421230, 468464, 489423, 496258, 506339, 474580, 516179, 510056, 443570, 477208, 550772, 614508, 669208, 745183, 880433, 870313, 778156, 663534, 630719, 613136, 537626, 457873, 433473, 457269, 479600, 482557, 446503, 452426, 492198, 535093, 549635, 526721, 525785, 542851, 571437, 624817, 577640, 538791, 503553, 497264, 494646, 440044, 426888, 459747, 519602, 532064, 507165, 488056, 570474, 560324, 552540, 522772, 502098, 447691, 460983, 498895, 548974, 508851, 480168, 529301, 577421, 558502, 512337, 534627, 515522, 447438, 432415, 498128, 582342, 642356, 636212, 576130, 465516, 426411, 483072, 530656, 489901, 444512, 446215, 505634, 509985, 558612, 604702, 611612, 596208, 596899, 542790, 533974, 597195, 622656]
15673F22656l9894K6250l9330l2505L0101j1176J6260K1875L287j5245o195K8574
15661F04658L1879P759m9219J4263j7694K4487J4164P242k6324k1768O0338P124
15649F56909j3181R05k3881O345K0754j7978j6726M9048J6585k4280k4223j0822
15637F19455K387K4862k5634k2857M3343K0374k3466J4190J5405J6439l5469R488
15625F58517m6935k1957K1571P0031K3458P2930R678j8054j4866j6626k5733Q170
15613G20184L1647q791K293j251R877j0329j0808J2516l1446L357q323n4325J3656
15600F68257N5630N2970q795n4966l5507J7194M7067o352Q868n9206J8394K3413
15588G26967J6936j7325L1537Q0664j77j6105K8746j840m6103m4870J5336r977
$$ y = [622656, 582762, 609012, 569682, 537177, 567278, 556102, 572362, 594237, 597524, 582279, 576084, 604658, 636537, 644296, 595077, 609340, 591646, 616133, 630297, 637539, 611215, 589447, 649785, 656909, 643728, 644633, 620752, 627097, 647851, 629873, 613147, 662195, 678780, 654500, 630277, 619455, 621842, 646704, 621070, 598213, 641556, 661930, 638464, 652654, 668059, 684498, 649029, 658517, 611582, 589625, 611196, 681227, 704685, 777615, 787293, 769239, 754373, 737747, 712014, 720184, 751831, 743040, 745333, 744082, 753959, 743630, 732822, 745338, 713892, 717249, 708926, 654601, 668257, 723887, 776857, 768062, 713096, 677589, 694783, 741850, 735498, 744366, 685160, 703554, 726967, 743903, 726578, 758115, 838779, 838602, 822497, 851243, 849403, 803300, 758430, 773766, 763789]
15576G63789j4064l7976L9958J127P16j0004n955o357J2591k5493l2034K9682
15564G15980O6229P823k967j7930L2861L4688L1964j0766l9558k5081j1254J4224
15552G96213J6207J0244K4926j5249j1445L2641j8759o1897j67m2209P249L0214
15540G67968M4897N1723m296k2211J3180m0042j4320k5760J7381K9342K3781j0469
15528H31174j1900N1234J5459j3022R713K8687q207o013l8202l622J9829j1511
15516H63619j5557J3217O4652J738j1247r156J8739l20j778j0263j0309N2848
15504I56183P1714m5032o5234l802k718p847Q514M0621L6146p3946K7041K6793
15492I68433l0040P6091L178l761R357j4364M88L3158K4205L0756j6985n5799
$$ y = [763789, 749725, 711749, 751707, 752834, 753550, 743546, 737591, 731234, 743825, 718332, 686298, 715980, 782209, 790032, 787065, 769135, 801996, 836684, 868648, 857882, 818324, 793243, 781989, 796213, 812420, 822664, 847590, 832341, 820896, 853537, 834778, 772881, 772714, 730505, 737754, 767968, 812865, 864588, 860292, 838081, 851261, 811219, 796899, 771139, 788520, 817862, 841643, 831174, 819274, 870508, 885967, 872945, 882658, 911345, 903138, 897125, 858923, 855301, 875130, 863619, 848062, 861279, 925931, 927669, 916422, 907266, 926005, 925685, 923907, 913644, 903335, 956183, 1027897, 982865, 917631, 913829, 911111, 903264, 911778, 952399, 988545, 914599, 941640, 968433, 938393, 1014484, 1017662, 1013901, 1023258, 1008894, 1009382, 1042540, 1066745, 1097501, 1080516, 1024717]
15480A024717L553L1790R52k9549k9278K072L0616O6556l2911p3618n5593Q96
15468I40203P0459M6307j2941l6269l4803k5720J4454N5751K5956J2876j5460
15457A040813l0903N3784O5483O1673K4883q626m6518l1062J3322l7905L5827
15446A140771P0768J7972m1831n0749L2906N0984K1711m0406p7907M969L0423
15435A159611L9966Q4868l346n7289m2319j1085N075M1907j9480J2125K6759p2628
15423A164164o2547K4749N7561R512R613R362J5090M9572R253O930l542j9490
15411A270227k2655M487K0213j400j1420R935j196P341j8439L8074M1785K7853
15399A364805J0266j6363M4697J0336n1340o4056k7623M9700K9783J0210K5025
$$ y = [1024717, 1028270, 1060060, 1061012, 1031463, 1002185, 1004257, 1034873, 1101429, 1068518, 994900, 939307, 940203, 1010662, 1056969, 1044028, 1007759, 972956, 947236, 961690, 1017441, 1043397, 1056273, 1040813, 1009910, 1063694, 1129177, 1190850, 1215733, 1207107, 1160589, 1129527, 1142849, 1104944, 1140771, 1211539, 1229511, 1187680, 1136931, 1169837, 1220821, 1242532, 1202126, 1124219, 1129188, 1159611, 1199577, 1284445, 1281099, 1223810, 1181491, 1170406, 1175481, 1217388, 1197908, 1210033, 1236792, 1164164, 1101617, 1126366, 1183927, 1193439, 1203052, 1212414, 1227504, 1277076, 1286329, 1293259, 1289717, 1270227, 1247572, 1252059, 1272272, 1270872, 1259452, 1269387, 1268191, 1275532, 1257093, 1295167, 1336952, 1364805, 1375071, 1358708, 1403405, 1413741, 1362401, 1298345, 1270722, 1320422, 1350205, 1360415, 1385440]
15388A385440J3970P820l7454K0127J7811L6912m3240j4401P301N861L3315l0374
15376A403088o201J6042K6341l8654q168O7158Q282R010K096j3248k1741k6614
15364A417391K8416o91l879m613M2080J0018L9307M0763j030m0342l9701L8215
15352A525934N2068k6569J8466m2951J862L6308L5662K5150J5073p505J3882P132
15340A654512M427K94j8151j7311k3330L1147O3985P8704j2551q2193M3473k2818
15328A700188m7146L4878r508J4802r616K5891K7230J611r3992k7864O9142O5689
15316A751305O6350j1088J8016j5129l0963J6747j3705l7033J9443M2907M1702
15305A848552J1085L357J6059m6015l8102j2089R105L1595P080p923M2941P5759
$$ y = [1385440, 1399410, 1407230, 1369776, 1389903, 1407714, 1444626, 1401386, 1386985, 1394286, 1400147, 1433462, 1403088, 1396887, 1412929, 1439270, 1400616, 1392448, 1459606, 1467888, 1476898, 1478994, 1465746, 1444005, 1417391, 1445807, 1445116, 1441237, 1436624, 1478704, 1488722, 1528029, 1568792, 1567762, 1527420, 1487719, 1525934, 1578002, 1551433, 1569899, 1526948, 1528810, 1565118, 1600780, 1625930, 1641003, 1633498, 1647380, 1654512, 1658939, 1659233, 1641082, 1623771, 1600441, 1631588, 1695573, 1774277, 1761726, 1679533, 1723006, 1700188, 1653042, 1687920, 1678412, 1693214, 1683598, 1709489, 1736719, 1738330, 1644338, 1616474, 1685616, 1751305, 1817655, 1806567, 1824583, 1809454, 1778491, 1795238, 1781533, 1744500, 1763943, 1806850, 1848552, 1859637, 1862994, 1879053, 1833038, 1794936, 1782847, 1791952, 1823547, 1830627, 1822704, 1865645, 1941404]
15293A941404L3014n1272L1557q466l2245L415p345O4116N136n7116j6290p044
15281A898864K8811J8172N5970j0264l4187M6844n169l590Q399O9527M9783o990
15269B116170J0897q7M168N18m101N8908o57j8106j2335j8885K5457j2915M2875
15256B191907N1856L8055K0941r464j8587p253k907o699k2525o107O221R145P6171
15243B320754N2809o186n421M2208j4467K1809m5328k4698k868K7295Q3663l7086
15231B412484K3359L3057m9108m542K8834m154M4619j3973j3281l6405J5631O6779
15219B503300K5700j0234m1315M1617Q1510K8610j1506j327K7894j9160J197N915
15207B632201n292P292K3970K1233o850L910p274O4K2350M0565L1971K1150l974
$$ y = [1941404, 1974418, 1923146, 1954703, 1946237, 1913992, 1917407, 1910062, 1974178, 1979314, 1922198, 1905908, 1898864, 1927675, 1945847, 2001817, 1991553, 1957366, 2004210, 1999041, 1995451, 2003850, 2073377, 2123160, 2116170, 2127067, 2126980, 2131148, 2131666, 2127565, 2186473, 2185816, 2167710, 2155375, 2136490, 2161947, 2149032, 2191907, 2243763, 2281818, 2302759, 2293295, 2274708, 2267455, 2264548, 2257849, 2235324, 2229217, 2235438, 2244583, 2320754, 2373563, 2367377, 2361956, 2404164, 2389697, 2411506, 2366178, 2341480, 2338612, 2365907, 2449570, 2412484, 2435843, 2468900, 2419792, 2415250, 2444084, 2439930, 2484549, 2470576, 2457295, 2420890, 2436521, 2503300, 2529000, 2518766, 2477451, 2519068, 2600578, 2629188, 2617682, 2616355, 2644249, 2625089, 2626286, 2632201, 2626909, 2634201, 2658171, 2679404, 2672554, 2676464, 2669190, 2669254, 2691604, 2732169, 2764140, 2785290, 2781316]
15194B781316k6362L6640N6279m6673J0461K5398k6670K2574N0359k8739K8331
15183B882914M8874l5784M205q718L401K4360l0781L189m206j2100j6968q547
15171B849839J186m863L1608J08352K0788m3724K792o472J0191N6206N4908j4194
15159C066617j6468O7299M5578j3690M351r913J4557j620L8227K2449K8468o1353
15147C184502r776L0213O563l2019Q527M7435K8477M9173J2562J4367K8667p2401
15135C296290k3176k507L3607J4538O6816P2132L5300n8208j4131j6650q983O24
15123C395652L1109Q581m4337l4994M1337P3686r847o9770o368L8480M7968Q908
15111C480405l0572L8258K79m8741l3910L7686J05008K9260l5398L7773J9277
$$ y = [2781316, 2754954, 2791594, 2847873, 2801200, 2811661, 2837059, 2810389, 2832963, 2883322, 2854583, 2882914, 2931788, 2896004, 2900209, 2891491, 2894892, 2919252, 2888471, 2891660, 2887454, 2875354, 2858386, 2849839, 2851025, 2846162, 2877770, 2986122, 3006910, 2963186, 2965978, 2959506, 2969697, 3025903, 3080811, 3066617, 3050149, 3117448, 3163026, 3149336, 3153687, 3143774, 3158331, 3156711, 3194938, 3217387, 3245855, 3184502, 3174726, 3204939, 3211502, 3179483, 3188010, 3235445, 3263922, 3313095, 3325657, 3340024, 3368691, 3296290, 3273114, 3270607, 3304214, 3318752, 3385568, 3457700, 3493000, 3434792, 3420661, 3404011, 3395028, 3395652, 3426761, 3435342, 3391005, 3356011, 3397348, 3471034, 3461187, 3391417, 3385049, 3423529, 3471497, 3480405, 3449833, 3488091, 3488370, 3439629, 3405719, 3443405, 3548413, 3577673, 3542275, 3580048, 3599325]
15100C599325k504j2324n3102o744L9489N4448J6549j3770K7032j022K3963K6376
15088C697716j7548p796j4809o084P9221q449k90K1889m119J8546o694n913N0928
15075C796598K5447K6373j4244k9588J1088j1510J4086J81j9832j7827K9636J734
15063C812142L838J8485j1149M053L3729r529r561M7766M2554O8579m811r034
15051C987062L8576p155r465R257K1238P600L139k1682q211k5245j5561K5374
15039D004927L4112n186n5142l2163p034L0200M0582n603l9702q878K0705K7526
15027D004344J2511L4974Q660k4020K478k9574p308K4235L0184J8431K8002J7920
15015D120837J9431K2251j3292m0874j4625n279r0306K3465O2351J9224N0623
$$ y = [3599325, 3596821, 3584497, 3531395, 3524651, 3564140, 3618588, 3635137, 3621367, 3648399, 3647377, 3671340, 3697716, 3680168, 3672372, 3657563, 3651479, 3730700, 3722251, 3721961, 3743850, 3739731, 3758277, 3751583, 3745670, 3796598, 3822045, 3848418, 3834174, 3804586, 3815674, 3804164, 3818250, 3818431, 3798599, 3780772, 3810408, 3812142, 3815980, 3834465, 3823316, 3827369, 3861098, 3851569, 3842008, 3889774, 3932328, 4000907, 3996096, 3987062, 4025638, 4018483, 4009018, 4018275, 4039513, 4047113, 4050252, 4028570, 4020359, 3995114, 3979553, 4004927, 4039039, 4033853, 3978711, 3946548, 3939514, 3969714, 4010296, 4004693, 3964991, 3956113, 3976818, 4004344, 4016855, 4051829, 4060489, 4036469, 4038947, 4009373, 4002065, 4026300, 4056484, 4074915, 4102917, 4120837, 4140268, 4162519, 4149227, 4108353, 4093728, 4088449, 3998143, 4021608, 4083959, 4103183, 4153806]
15004D153806L6123k1138Q473N0894j792l9703j13775m4783L5129K3437N300M4469
14992D136440Q667r322r525k8647J9556r856m4641p0855M4441L3869m6245l4921
14980C988961k327L2365L7113J6903j9105k0703J6K0146M056L3769j682O929J7616
14967D114057O816l0352M4824K8873m0673l7062j6295k5026j460J8796k3522M378
14955D043354J406M5025m6305m7493m2178N594k1411L7334M3108J6535p757q9016
14943C938196q7777J2697N762P253L7377K1677N2884L9803l5191m4862p856K3762
14931C963725k61j9513J2136J7031p6300j0952L7212N2120m4275p2768k8447l1839
14919C797869J7279N037N87Q60j2105j8943N1890k1763l2646l0104k860J2558
$$ y = [4153806, 4189929, 4168791, 4177264, 4228158, 4226366, 4186663, 4072888, 4028105, 4063234, 4086671, 4091971, 4136440, 4145107, 4135785, 4126260, 4097613, 4117169, 4107313, 4062672, 3991817, 4036258, 4070127, 4023882, 3988961, 3986634, 4018999, 4056112, 4073015, 4053910, 4033207, 4033223, 4053369, 4057425, 4091194, 4089512, 4096441, 4114057, 4120873, 4090521, 4135345, 4164218, 4123545, 4086483, 4070188, 4045162, 4043702, 4062498, 4038976, 4043354, 4044760, 4089785, 4043480, 3995987, 3953809, 3959403, 3937992, 3975326, 4018434, 4034969, 4027212, 3938196, 3850419, 3863116, 3868878, 3876131, 3913508, 3935185, 3988069, 4027872, 3992681, 3947819, 3939963, 3963725, 3963464, 3943951, 3956087, 3973118, 3896818, 3885866, 3923078, 3975198, 3930923, 3858155, 3829708, 3797869, 3815148, 3820185, 3820772, 3821632, 3809527, 3790584, 3842474, 3820711, 3788065, 3757961, 3755101, 3767659]
14907C767659m6661o6636J4224K0329m0914m54K9808L3083M704j150r773m9536
14895C654683r4228j6584N9999M3067J196m5985K6295j6631j2861j4374k0449
14884C564128n5267j1272J2257q089j3561n436l9057p368O7419L0205j0239k1865
14872C501855j0576K4088Q125l3686J2561j536n2047m8797J2792L7696j3868n4516
14860C382091k6051k1264M9911Q620p0587m2664m1087k1675o2975j5744O8212
14849C206787l1135j6000M2695J9741N6478J6496n5342K3191m2702l3045o5039
14838C122125M9480L2815k2389o5563o5997j1483M7359M4932l5722j2778K2902
14827C105681j4680m2668p622L3395k6206m3911j9285k619m4354l4429j3985l0028
$$ y = [3767659, 3720998, 3654362, 3668586, 3688915, 3648001, 3647547, 3677355, 3710438, 3715142, 3713992, 3704219, 3654683, 3560455, 3543871, 3603870, 3646937, 3648133, 3602148, 3628443, 3611812, 3598951, 3584577, 3564128, 3508861, 3497589, 3509846, 3501757, 3488196, 3482760, 3443703, 3436335, 3503754, 3533959, 3523720, 3501855, 3491279, 3515367, 3523492, 3489806, 3502367, 3500831, 3448784, 3399987, 3412779, 3450475, 3436607, 3382091, 3356040, 3334776, 3384687, 3393307, 3322720, 3280056, 3238969, 3217294, 3154319, 3138575, 3206787, 3175652, 3159652, 3202347, 3222088, 3278566, 3295062, 3239720, 3262911, 3220209, 3187164, 3122125, 3171605, 3204420, 3182031, 3116468, 3050471, 3038988, 3086347, 3131279, 3095557, 3082779, 3105681, 3091001, 3048333, 3040711, 3074106, 3047900, 3003989, 2984704, 2982085, 2937731, 2903302, 2889317, 2859289]
14815B859289m5107Q113R3909P862l7662K0491L0766J6780l2256k7789J6574l7064
14803B873906n0539l3437m28j9885j2042k7297M7795Q431p0877n6568k5682j3259
14791B620118j8698P2300L9605l3023l3716L5275k0920K227K2307K5546k7134
14780B683887m5371j3525k7298m6152j0228L3878m3725q0407K7680K1261K133
14769B502133j3449m4742J592k3677r510M1940J1999J0741j1871n7149n7844k3348
14757B326815O0099M4461j4264l7391k6969k2451K2727J7056l9576m1141M273
14746B293639R064k3882k8494q6921m1213M9013P5023J4891l4550m5330m0637
14735B140603k8087M6084O7034j2022m6614j0296K8607K8457j7731m9523q656
$$ y = [2859289, 2814182, 2822295, 2916204, 2924066, 2886404, 2906895, 2937661, 2954441, 2922185, 2894396, 2910970, 2873906, 2823367, 2789930, 2789502, 2769617, 2757575, 2730278, 2778073, 2786504, 2715627, 2659059, 2633377, 2620118, 2601420, 2673720, 2713325, 2680302, 2646586, 2681861, 2660941, 2663168, 2685475, 2711021, 2683887, 2638516, 2624991, 2597693, 2551541, 2541313, 2575191, 2531466, 2451059, 2478739, 2500000, 2502133, 2488684, 2443942, 2445534, 2421857, 2412347, 2454287, 2466286, 2477027, 2465156, 2408007, 2350163, 2326815, 2386914, 2431375, 2417111, 2379720, 2352751, 2330300, 2353027, 2370083, 2330507, 2289366, 2293639, 2302703, 2278821, 2250327, 2163406, 2122193, 2171206, 2246229, 2261120, 2226570, 2181240, 2140603, 2112516, 2158600, 2225634, 2213612, 2166998, 2156702, 2185309, 2213766, 2196035, 2146512, 2137856]
14724B137856R88k760m9876n5886l2433L99K3856m1322m6394j281k6185K3346
14712A930308l108L9551M1026J2354N932O568k929J9319q940l7066l845K1610
14700B020780J3856k6850o3357m8191j1484k7616j4909K3912o7476m5245Q1851
14689A835271O7029o8283o0732k6487N2530K3542j3696o0325j0267l5577j3283
14678A689722k081J8961L3981L0565J0103J888p699l781j8674q199l4889o743
14666A703154r339m702N2794J4715o4255m6130l839P874k7050J028j5964Q283
14654A616569K4321L2460j3369n2377m0442j2769L4657N2218m8820n2552K4666
14643A564562L2634K6002K3699k5966n5001j9583m6470o8508k045m780L6257L1849
$$ y = [2137856, 2138844, 2136084, 2086208, 2030322, 1997889, 1998288, 2022144, 1980822, 1934428, 1933147, 1906962, 1930308, 1927200, 1966751, 2007777, 2020131, 2026063, 2032631, 2029702, 2049021, 2040081, 2003015, 1999170, 2020780, 2034636, 2007786, 1944429, 1896238, 1884754, 1857138, 1842229, 1866141, 1798665, 1753420, 1835271, 1902300, 1834017, 1773285, 1746798, 1799328, 1822870, 1809174, 1748849, 1738582, 1703005, 1689722, 1687641, 1706602, 1740583, 1771148, 1781251, 1783139, 1775440, 1771659, 1752985, 1744786, 1709897, 1703154, 1693815, 1689113, 1741907, 1756622, 1692367, 1646237, 1642398, 1650272, 1623222, 1624250, 1608286, 1616569, 1640890, 1673350, 1659981, 1607604, 1567162, 1554393, 1589050, 1641268, 1592448, 1539896, 1564562, 1597196, 1623198, 1646897, 1620931, 1565930, 1546347, 1499877, 1431369, 1429324, 1424544, 1460801, 1492650]
14631A492650k5459l9643L9195N7937j5571n0510q891O472L285q705k2755J0193
14619A438198k206o9380j0634j1659k450K9093k9440l6855j7059k2063J2305k981
14607A274869L9807M8827J8403Q76J3964M4815L741j3095L2055k9594p6763n9885
14595A298020m9101J9856J4546j141j5862J0261Q8J9537M4688k2655n6939l6471
14583A224827k5879J0887M3017l8318k2925m454n7587k1924O25J5496N1345K3636
14571A198746M7779o6955l640L1268M393j5850L2136l3011j045p303m503k0282
14559A161733j7646m799O0950P1214j5845m9179k1508m8730l8530o2342j1844
14548A023474j883k3914L5595R018L6022j1977K4986R397m028l8084M3905K1711
$$ y = [1492650, 1467191, 1427548, 1466743, 1524680, 1509109, 1458599, 1449708, 1456180, 1459465, 1450760, 1428005, 1438198, 1435992, 1366612, 1355978, 1344319, 1341869, 1370962, 1341522, 1304667, 1287608, 1265545, 1277850, 1274869, 1314676, 1363503, 1381906, 1382782, 1396746, 1441561, 1445302, 1432207, 1464262, 1434668, 1357905, 1298020, 1248919, 1268775, 1283321, 1282180, 1266318, 1276579, 1276667, 1296204, 1340892, 1318237, 1261298, 1224827, 1198948, 1209835, 1252852, 1214534, 1191609, 1187155, 1129568, 1107644, 1108269, 1123765, 1175110, 1198746, 1246525, 1179570, 1175930, 1207198, 1211591, 1195741, 1227877, 1194866, 1193821, 1186518, 1182015, 1161733, 1144087, 1139288, 1200238, 1271452, 1255607, 1206428, 1184920, 1136190, 1097660, 1035318, 1023474, 1021591, 997677, 1033272, 1042290, 1078312, 1066335, 1091321, 1100718, 1096690, 1058606, 1102511, 1124222]
14536A124222k0997k3353k7414P677K7648K446j456l1842m2707k6066m742k8867
14524I54549K2525N966k0204P244R58K9401N3588K9660m7754n9163l3417m7131
14512H96222K5729L4265j159P700L8912K5306m874m3792j43916j8589K0673m466
14500H32011R497M1056L4915J5334J6599l4359n8173q174R2658K5120l5247o5015
14488H66222M6242J5345k6566m7849J6761L2911j5561j1228J65l4037n8116N9108
14476H43397M8568K3546j0008l0047l3563l2893j2516M115M3220O9856L7625L2020
14464I83320J746m9129j7402l0174P1509k345j06888l1716l9846j2879J1017Q4081
14452H61294L7538L028m7604j3328o2949m6252j9074o0493J082L1428M9739n7449
$$ y = [1124222, 1103225, 1079872, 1052458, 1060135, 1087783, 1090229, 1088773, 1056931, 1014224, 988158, 983416, 954549, 977074, 983040, 962836, 970080, 971038, 1000439, 1054027, 1083687, 1035933, 976770, 943353, 896222, 921951, 956216, 955057, 962757, 1001669, 1026975, 1022101, 978309, 834393, 815804, 836477, 832011, 841508, 882564, 917479, 932813, 949412, 915053, 856880, 848706, 941364, 966484, 931237, 866222, 912464, 927809, 901243, 853394, 870155, 903066, 887505, 876277, 876442, 842405, 784289, 843397, 891965, 915511, 905503, 875456, 841893, 809000, 796484, 800599, 843819, 913675, 951300, 983320, 985066, 935937, 918535, 888361, 959870, 957525, 850637, 818921, 779075, 766196, 777213, 861294, 898832, 901860, 854256, 840928, 777979, 731727, 712653, 652160, 653242, 684670, 734409, 676960]
14440F76960k4346K2057k0964K5978Q7367K2076l2954l6095m1636L6636o7257
14429F47822M4141L6590K7292M520k6414k3017m0929J2353M2524j3430m0605M2797
14417G13644N1051K919J2944l2076K7377K2694l1203l431m34k9957L8268J6684
14405G88480m8831l0414k7368m0574k3105L5895K783L3563M7418J455l4358l2272
14393F72672n2984L3937M8278j9588j2378o338J3412K7904L2340m5378k6073j914
14381F63890j0846p2125k0058K1434P1131K499n3262p8922M4182N9230r310m3667
14369E74176j9926M0907O9458j5268J5888J2883l4051j829j5214p5437J8686J061
14357E71334R231P1585J6399L066n0825m643l3608M3882L1995m6808p305k8799
$$ y = [676960, 652614, 674671, 653707, 679685, 767052, 789128, 756174, 720079, 678443, 715079, 647822, 691963, 728553, 755845, 760365, 733951, 710934, 670005, 682358, 724882, 711452, 670847, 713644, 764695, 767614, 780558, 748482, 775859, 798553, 767350, 763919, 763485, 733528, 771796, 788480, 739649, 709235, 681867, 641293, 618188, 654083, 656866, 690429, 737847, 739302, 704944, 672672, 619688, 653625, 701903, 682315, 669937, 663599, 677011, 704915, 737255, 691877, 665804, 663890, 653044, 580919, 560861, 582295, 653426, 655925, 602663, 523741, 567923, 627153, 617843, 574176, 554250, 595157, 664615, 649347, 665235, 678118, 644067, 642238, 627024, 551587, 570273, 571334, 580565, 652150, 668549, 671615, 620790, 616147, 582539, 626421, 658416, 611608, 604303, 575504]
14345E75504k0576n7027j2907J0822p1686m1192L5424N4031n302n2521j3869N9298
14333D59999J979K752J00382Q2145k2716m9763l5955l427R868l0310R195L761
14321E27910K5351L7679M2261m4828k3067O810M4792N3582l730q4430K2309K1584
14309F26223L012n5848k7413K6388N4939M7047l3686m9778j03575r3927K5820
14298D19202P3939k7981K3280M0493P528o1494k4784K4794J1670j1450j7080L9516
14286D97633L6205P3384j7064m7705l2184M2520j4074p4232j12190l1746O5650
14275C86197M6369M3352M5928J1909k2356j9297j5183j5602j9049Q454k1866q356
14263D20500M1967R19l1259j6662p532P963M2744K1729O004k3791K5377J6070
$$ y = [575504, 554928, 497901, 484994, 495816, 424130, 382938, 418362, 472393, 467091, 414570, 400701, 459999, 461978, 464730, 565112, 647257, 624541, 574778, 538823, 535396, 545264, 514954, 524149, 527910, 553261, 590940, 633201, 588373, 565306, 572116, 616908, 670490, 666760, 582330, 604639, 626223, 629235, 573387, 545974, 572362, 627301, 674348, 640662, 590884, 487309, 393382, 419202, 493141, 465160, 488440, 528933, 536461, 474967, 450183, 474977, 486647, 475197, 458117, 497633, 533838, 607222, 590158, 542453, 510269, 552789, 538715, 464483, 352293, 320547, 386197, 432566, 475918, 521846, 533755, 511399, 492102, 476919, 461317, 442268, 450722, 428856, 420500, 462467, 463386, 432127, 415465, 407933, 415896, 458640, 480369, 486373, 462582, 487959, 504029]
14251E04029k6682o1443l5167j3359k2862O0906k0027j3274M3668L5410J4435
14240D65634J9373j2564L2465j2057n7798j6226M134J9133k2627J6877j5610k00
14228D20534K6272K6509l3068n0080M8505Q0280n1745p3850j2145O9677J3323
14217D64212k4075J7952o464L3789k302k758J8788j6612j2201k370p550r997J4454
14204D64866O0042J786o098R442P1632k022J3227k4183m5573J6133M0940m088
14192E96104k720l034N1115J2027M5738n29j8060K2210L3362P1041J36763Q9992
14180A034009M5661P7225R2442J68473J15407J55874J44923J15923L4637j3319
14170A971255K6446j3915q5054j07557j07642j28063r1316j22276j61575q0668
$$ y = [504029, 477347, 415904, 380737, 367378, 344516, 405422, 385395, 372121, 415789, 451199, 465634, 485007, 472443, 504908, 492851, 435053, 418827, 422961, 442094, 419467, 436344, 420734, 420534, 446806, 473315, 440247, 390167, 438672, 518952, 467207, 393357, 381212, 450889, 464212, 440137, 458089, 451625, 485414, 483112, 480354, 499142, 482530, 470329, 467959, 460409, 450412, 464866, 524908, 526694, 520596, 530038, 601670, 599648, 612875, 588692, 543119, 559252, 600192, 596104, 593384, 590350, 641465, 653492, 699230, 698701, 680641, 702851, 736213, 807254, 944017, 1034009, 1079670, 1156895, 1249337, 1417810, 1533217, 1689091, 1834014, 1949937, 1984574, 1971255, 1997701, 1983786, 1898732, 1791175, 1683533, 1555470, 1464154, 1341878, 1180303, 1099635]
14160A099635o8219p6938k8464q9151p9516q595M173j2354m0765J9171l2448m4640
14148F41889m0508m6123j2749k3486j2849k3757M8480n2595K7356P7584l0331
14137E52911q1672p483J9036q964l1132m7642m5096j007K4077M9399m061n6531
14125C61835j6765J2656J3544P9700j671l5738K9288J3387l3479k3482M4718K3032
14113D67025l0759o6143o4176K5463R9713O1672l5116N1338Q5800M8216k7072
14102F15961l8736m4080m2114n2487L1500N0957k2371k0347K940j4629l122j9049
14090D44423k2747k6894o5765N8443L7617J8815k7711m8782K9623O2545J8574
14079D78141k9287K2692M2781K0715l0576O7138O3364o8829l6646J3083N0845
$$ y = [1099635, 1031416, 954478, 926014, 836863, 757347, 748752, 752925, 740571, 699806, 718977, 686529, 641889, 601381, 555258, 542509, 519023, 506174, 482417, 530897, 478302, 505658, 583242, 552911, 471239, 463756, 482792, 473828, 442696, 395054, 349958, 348951, 373028, 422427, 418366, 361835, 345070, 357726, 371270, 450970, 449299, 413561, 442849, 456236, 422757, 399275, 443993, 467025, 436266, 370123, 305947, 331410, 431123, 492795, 457679, 509017, 594817, 643033, 615961, 577225, 533145, 491031, 438544, 470044, 521001, 498630, 478283, 481223, 466594, 463472, 444423, 421676, 394782, 329017, 387460, 425077, 443892, 416181, 367399, 397022, 459567, 478141, 448854, 471546, 514327, 535042, 504466, 571604, 634968, 566139, 529493, 542576, 593421]
14068E93421o3504m0177j668p289k9123j8397l0538j3330j9906j7207k9725K6675
14056C49232J0014L1146J6364m8399l5928m1051K386P0450m1221k8444l403j8
14044B81128K0208K8780J0938L5305L147j1323j1884N257L0521j6949p0562J575
14032C06141M0776N6213L2134k7727J3578l9632m1898j2243J874l7729j8278O7260
14020C40469M1033n1591n1717l9444K375K9600P0943O5714r936k4958J6037l9618
14008C48907L0823O4417P356n2155n7025j1307k0162K1356J5224K7708J6161M776
13996C96079L4602K7689j9486r603o298j0791r158M8008K1873L941O256K0281
13984E03393l69K2627j1574K7176q135L1495j3359o7485k1371q653o381l8962
$$ y = [593421, 529917, 489740, 488072, 480783, 451660, 433263, 402725, 389395, 369489, 352282, 322557, 349232, 359246, 390392, 406756, 358357, 322429, 281378, 283764, 354214, 312993, 284549, 281146, 281128, 301336, 330116, 341054, 376359, 379506, 368183, 356299, 361556, 392077, 375128, 304566, 306141, 346917, 403130, 435264, 407537, 421115, 381483, 339585, 327342, 329216, 291487, 273209, 340469, 381502, 329911, 278194, 238750, 241125, 270725, 341668, 407382, 397446, 372488, 388525, 348907, 379730, 444147, 451503, 399348, 342323, 331016, 310854, 332210, 347434, 375142, 391303, 396079, 430681, 458370, 438884, 429281, 422983, 412192, 403034, 451042, 472915, 476856, 483112, 503393, 503024, 525651, 514077, 541253, 533118, 564613, 551254, 483769, 462398, 453745, 447364, 408402]
13972D08402k8284Q086K0584P5210j9398j4570K983m2854l4326N6686j2544j4343
13960D05632n955q665M4920L3992p995j2486m3282J252O3926K6760L6457L1409
13948E65965n184J1616k9593q6546L1395M9649M930n350J9864J5333r641l225
13936E59213N6486M9270k7067M0193J6632n270n5775j3941r535j6001M3874m158
13924F33921m9618j4330m6887o3496l0738K7731N6125j918k8125j1252n2591k5529
13912C93293M1093o056J3079K6468N563N2726l262q372l9587O5811L2712m6940
13900E26528P098j7079O1712L1499p892k8450J6268J1163Q0055L0478K988J8222
13888G32590k0417P482n9437k5852M9442q088k4451j1590L847K9136p012J4033
$$ y = [408402, 380118, 388204, 408788, 483998, 464600, 450030, 453013, 410159, 375833, 432519, 419975, 405632, 399677, 391012, 435932, 469924, 461929, 449443, 406161, 407413, 471339, 498099, 534556, 565965, 560781, 572397, 542804, 456258, 487653, 537302, 542232, 536882, 556746, 572079, 562438, 559213, 615699, 664969, 637902, 678095, 694727, 689457, 633682, 619741, 610206, 594205, 638079, 633921, 584303, 569973, 523086, 459590, 428852, 456583, 512708, 510790, 482665, 471413, 418822, 393293, 434386, 428330, 441409, 467877, 473440, 526166, 522904, 514532, 474945, 540756, 573468, 526528, 533626, 516547, 578259, 609758, 601866, 573416, 589684, 600847, 680902, 711380, 714368, 732590, 712173, 719655, 660218, 634366, 683808, 675720, 651269, 639679, 643526, 672662, 665650, 679683]
13876F79683P8056N2818l1839J02231N8504m0978m3369K1619m0401L7663P0874
13865I44861L8369j1380o072L8450L9735M055J3769j1313k9951L4267J6462M6093
13853A117345k0541l2196k8169j91k727K1820O6273K5809r316l8023k4290k073
13841A073721k2658n4377L5324R9226Q7777M2486k350n3121Q8073N7493l1952
13830A319642n3674j6887J9153L6518O6371L8038J0551P9J6058L8666O0218N6273
13818A591006M8064J8486P845M802P8840J1031K7033j0857P5388J45764P7305
13807B074707O3959P7855L4519R9300J01259O6164n1351l3206R6705J31135P4570
13796B735616P7427J10343K2071J4056J05016J16717J33025J18229J02070Q2753
$$ y = [679683, 757739, 810557, 778718, 880949, 939453, 898475, 855106, 876725, 836324, 873987, 944861, 983230, 971850, 965778, 1004228, 1043963, 1048018, 1061787, 1050474, 1020523, 1054790, 1071252, 1117345, 1096804, 1064608, 1036439, 1036248, 1033521, 1055341, 1121614, 1147423, 1138107, 1100084, 1075794, 1073721, 1051063, 996686, 1032010, 1131236, 1219013, 1261499, 1259149, 1206028, 1294101, 1351594, 1319642, 1265968, 1249081, 1268234, 1304752, 1371123, 1409161, 1419712, 1419791, 1435849, 1474515, 1534733, 1591006, 1639070, 1657556, 1665401, 1670203, 1749043, 1760074, 1787107, 1776250, 1851638, 1997402, 2074707, 2138666, 2216521, 2251040, 2350340, 2451599, 2517763, 2466412, 2433206, 2529911, 2661046, 2735616, 2813043, 2923386, 2945457, 2959513, 3064529, 3181246, 3314271, 3432500, 3534570, 3617323]
13786C617323J27799R8667J30563J12913J25839J84815J97468J64350J31651J93858
13776E085246J78038J60655K41846K32503K94525K49516K58553K77523L41928
13767G320333M01317M01959L70798M45625M81752N19231N89897N80212O80610
13758A1791734P45639P97442Q54004J011763J143140J229403J318990J451617
13750B0343732J614334J820542K090940K340401K650467K971147L446214L984439
13742D1262216M588987N326462O169742P160597Q370422R935450J1845398J4038504
13734A08697778J6571035J9556263K2740330K5479868K7261906K7224962K4755288
13727B72287430J9618966J2286178L726769n172487j3607264k0378743k4777286
$$ y = [3617323, 3745122, 3843789, 3974352, 4087265, 4213104, 4397919, 4595387, 4759737, 4891388, 5085246, 5263284, 5423939, 5665785, 5898288, 6192813, 6442329, 6700882, 6978405, 7320333, 7721650, 8123609, 8494407, 8940032, 9421784, 9941015, 10530912, 11111124, 11791734, 12537373, 13334815, 14188819, 15200582, 16343722, 17573125, 18892115, 20343732, 21958066, 23778608, 25869548, 28209949, 30860416, 33831563, 37277777, 41262216, 45851203, 51177665, 57347407, 64508004, 72878426, 82813876, 94659274, 108697778, 125268813, 144825076, 167565406, 193045274, 220307180, 247532142, 272287430, 291906396, 304192574, 307919343, 302746856, 289139592, 268760849, 243983563]
13720B43983563k6558006k6161609k4254906k1567995j8671628j5932822j3589411
13713I7247186j1624899r908897q422779p191208o167288n280643m589287l993391
13705D0068794l394314k896137k526789k260388k016383j848781j659334j539905
13697B1926763j381113j267178j264586j103732j055809j025506r63345p68839
13689A3096655o59779o97171o44181n90308n00283m92700m73499l84954l77123
13680H276657l74082l38739k73455k88161k84854k23215k39525k70820k61133
13671E722673k83149j68768j44916j91334j54377j55105j28326j35679j09488
13662D251531j25890j26249j00964j21699j06057j19348r3951j08584o0989q5693
$$ y = [243983563, 217425557, 191263948, 167009042, 145441047, 126769419, 110836597, 97247186, 85622287, 75713390, 67290611, 60099403, 53932115, 48651472, 44062185, 40068794, 36674480, 33778343, 31251554, 28991166, 26974783, 25126002, 23466668, 21926763, 20545650, 19278472, 18013886, 16910154, 15854345, 14828839, 13865494, 13096655, 12436876, 11739705, 11095524, 10505216, 10004933, 9512233, 9038734, 8653780, 8276657, 7902575, 7563836, 7290381, 7002220, 6717366, 6494151, 6254626, 5983806, 5722673, 5439524, 5270756, 5125840, 4934506, 4780129, 4625024, 4496698, 4361019, 4251531, 4125641, 3999392, 3898428, 3776729, 3670672, 3551324, 3457373, 3348789, 3287800, 3202107]
13652C202107q0439l1580q7001j47979j16638k5317r1156j00101n4561m3864k6745
13641B396726q850l4595q0638o4631O949j4761k4514q2392j6828o6863o2781J1483
13629A958305m2574m9070p5239m0522J7699n9986j1489J3728q26n7519n0668n6463
13617A545376l8419m11R856N051n2524n8697l2264k9482L4427R079k587O1132
13605A450537j3167j08265K0197M1531k9081j28000o0388q628l7213m6248J5455
13594A096730J6176K888m9265j4414q5546j9568n7493J5579K3852j1991j3536
13583I03412r217L066l4805k2983j4666j7851J2593O62N647l4859l7789m3951
13571G09259m0789o9936k2699P6791L5979n286K0350L4846m6246l0236k3930K3611
$$ y = [3202107, 3121668, 3090088, 3003087, 2855108, 2738470, 2713153, 2621997, 2521896, 2467335, 2423471, 2396726, 2387876, 2353281, 2272643, 2208012, 2214961, 2200200, 2175686, 2093294, 2076466, 2009603, 1946822, 1958305, 1915731, 1866661, 1791422, 1750900, 1768599, 1708613, 1697124, 1710852, 1710026, 1652507, 1601839, 1545376, 1506957, 1506546, 1516402, 1521453, 1468929, 1410232, 1377968, 1348486, 1382913, 1391992, 1389405, 1450537, 1437370, 1329105, 1349302, 1390833, 1361752, 1233752, 1173364, 1164736, 1127523, 1081275, 1096730, 1112906, 1115794, 1066529, 1052115, 966569, 947001, 889508, 905087, 928939, 916948, 903412, 894195, 897261, 862456, 839473, 824807, 806956, 819549, 820211, 825858, 790999, 753210, 709259, 668470, 598534, 575835, 652626, 688605, 683319, 703669, 738515, 692269, 662033, 638103, 661714]
13559F61714l529K850j3835K785l0517J6951K9157j1820k082k586J137k3882l4919
13546E91424J9097L8005k1665N386O568k1786J7143K9922N726l8035k0850K3208
13534F34143L3053k2342p615m8603p0953K4204L9020j8142n3634p036n7943j0647
13522D33505M4258k2206j4688n324k8422J3638o3954j5446M0619K4140l2113j1103
13510C62904K2677K6478L2368k6608j5170K3005j5520k2484m1509k2999J5526
13499C38668R145j4085L7554M1708j7158l3605l891N983K3265K9760o627n3014
13487C57703J1469M7887J8131k4362K3328k1379m1748k8486k9711Q086p2169m1861
13475B06888J9646N4812L1926n8304k2729N7344O5874J2014n6864j8464J3097
$$ y = [661714, 658185, 661035, 647200, 649985, 619468, 636419, 665576, 653756, 651674, 649088, 650225, 626343, 591424, 610521, 648526, 626861, 632247, 638815, 617029, 634172, 664094, 669820, 631785, 610935, 634143, 667196, 644854, 637239, 588636, 517683, 541887, 580907, 562765, 509131, 502095, 444152, 433505, 477763, 455557, 440869, 435545, 407123, 420761, 356807, 341361, 381980, 406120, 374007, 362904, 385581, 412059, 444427, 417819, 402649, 425654, 410134, 387650, 346141, 323142, 338668, 347813, 333728, 371282, 412990, 395832, 362227, 358336, 364319, 387584, 417344, 410717, 357703, 369172, 417059, 435190, 410828, 434156, 412777, 371029, 342543, 312832, 320918, 248749, 206888, 226534, 281346, 313272, 254968, 232239, 289583, 355457, 367471, 310607, 292143, 305240]
13464C05240L0224J3044J9894l0622J0871l6198K4499k2298L9725M2214l0428
13453C66165q3310P1916K0889q6413M91N1620M522l3597J2780o4058k1663J139
13441B40481J1402j1503K5838J4186n6286k1143M6640O0065j9988n1050k1732
13430B16910n160l5630k58l43M9793Q764J9052O1182j1250k3926j5863l1503K5884
13417B57652m3099l4532J7729J6896l5260P45N7193n910L6368M0741k0857L093
13405B90759L8955n263n7246n2945k4729M8553k171m2320j8298p1007k9320k8801
13393D6167J7749M0499o1360K2978L3l3475L7769J5485p3539p6166K1657L4185
13381h018L5025k4215j2565o8539K0345l9866J5871n439K1027M5459J1840L8227
$$ y = [305240, 335464, 348508, 368402, 337780, 348651, 312453, 336952, 314654, 354379, 396593, 366165, 282855, 354771, 375660, 289247, 289738, 341358, 345880, 312283, 325063, 261005, 239342, 240481, 251883, 240380, 266218, 280404, 224118, 202975, 249615, 309680, 289692, 238642, 216910, 211750, 176120, 175862, 175519, 225312, 234076, 253128, 314310, 303060, 279134, 263271, 231768, 257652, 214553, 180021, 197750, 214646, 179386, 180131, 237324, 231414, 267782, 308523, 287666, 290759, 329714, 324451, 267205, 214260, 189531, 238084, 235913, 193593, 175295, 104288, 74968, 46167, 63916, 104415, 43055, 66033, 66066, 32591, 70360, 85845, 12306, -63860, -42203, -8018, 27007, 2792, -9773, -78312, -57967, -97833, -81962, -87401, -66374, -20915, -9075, 29152]
13369B9152j801m2963k2823M2279Q8640K0987M3319r065r097J8342q548J8733
13357A67155K9017K5823K7029q9153j6602k0608R811o995l6337L5006N1376K1504
13345A97026k7805N402m14o2738l0616K0086N813L6478l4317j0075l8625m0879
13333A9336m16k0111m4270O9349P4326J3806O800o630R605O804J177L6576J8970
13320A85322k8131r759K3481N2941m6173j2613R171m1065j6272q487J1191l0068
13308H9538K4495L709p2664K1264J8143o828M7140J07637N8297M6695J9740k0041
13296C37125k4756K4056p355j8194K9515L6138N7900J9839P54P0044L8685j3013
13284E50738L0922O3495J48348J47435J22163J46614J40670J34298J71254J10630
$$ y = [29152, 27351, -15612, -38435, 3844, 92484, 113471, 156790, 147725, 138628, 156970, 148422, 167155, 196172, 221995, 249024, 159871, 143269, 122661, 132472, 125477, 89140, 124146, 175522, 197026, 169221, 174623, 174209, 111471, 80855, 100941, 106754, 143232, 108915, 98840, 60215, 19336, 18920, -1191, -45461, 23888, 98214, 112020, 118820, 112190, 121795, 128599, 129776, 166352, 185322, 157191, 147432, 170913, 223854, 177681, 165068, 174239, 133174, 116902, 108415, 119606, 89538, 114033, 117742, 45078, 66342, 84485, 77657, 124797, 232434, 290731, 337426, 357166, 337125, 312369, 336425, 329070, 310876, 340391, 376529, 434429, 454268, 455022, 525066, 563751, 550738, 581660, 645155, 793503, 940938, 1063101, 1209715, 1350385, 1484683, 1655937, 1766567]
13274A766567M0918O6708l619j04075j68077j07411j24210j79990j89522p4102
13264I23187j41738j65065l6591k6160l5621k4525q4084l2539l0108K0860m457
13253C63159o6758J768J6101o7393n5821J1640N9630k4367m5125o2331J8753J05132
13241B54388J6258l8598Q870l4540l8914l5663Q415p5703l1632P5776O6127j7193
13229A57591l8931n325K3321J877j3230N6732j9099l5339j3862q4945J2382L0054
13217G1226J3368L8122l792L5901m0386n8416K7479L1689q1990l1266L9108M8514
13205H9557R0490J402L953n0731j2229j8188k1322m0843j4621J8684N5565m5547
13193E6170j9723n714O020O6519J020J7160K6543j0960J2087k1588l7154j8818
$$ y = [1766567, 1807485, 1874193, 1870574, 1766499, 1598422, 1491011, 1366801, 1186811, 997289, 923187, 781449, 616384, 579793, 553633, 518012, 493487, 409403, 376864, 346756, 367616, 363159, 296401, 298169, 314270, 246877, 191056, 202696, 262326, 237959, 192834, 130503, 149256, 254388, 270646, 232048, 240918, 206378, 167464, 131801, 140216, 64513, 32881, 108657, 174784, 157591, 118660, 113335, 136656, 138533, 125303, 182035, 162936, 127597, 113735, 28790, 41172, 71226, 84594, 122716, 118924, 154825, 114439, 56023, 83502, 115191, 33201, 1935, 41043, 89557, 180047, 181449, 185402, 134671, 122442, 104254, 82932, 42089, 27468, 46152, 101717, 56170, 36447, 30733, 36753, 103272, 104292, 121452, 147995, 137035, 149122, 127534, 90380, 71562]
13181G1562R985O8298K504l7217r4450k1990l5127J6483M2115k3330P048R1809
13169I7690L9118m3623l1730K9920J2366j4046L4165p2004m5537K5027L896m2309
13157g067J4101K0731K7577N7540J5401L4984l5534n2930j2026l3180j3893L7543
13145E3247Q187O497M8811K0106n695m5077O5418l624n8425M637k7286O4087L2930
13132A63813j1393R152o4165K1881M745q325j283R066J261n800l9287m9184j2058
13119A8423J0956J0261L1278l2826l7768j9959j1879j9809j1416M951L730K7589
13107b6469J5049L8162O7579P555m8006l9656K6631K0315o2771n7731O444O3041
13095A0143N5467O7453l6507J6988O4699K3117q4428o0962m8158j5903K9698r920
$$ y = [71562, 81547, 149845, 152349, 115132, 20682, -1308, -36435, -19952, 22163, -1167, 5881, 97690, 136808, 93185, 61455, 91375, 103741, 89695, 123860, 51856, 6319, 31346, 35242, -7067, 7034, 27765, 55342, 112882, 128283, 163267, 127733, 74803, 62777, 29597, 15704, 53247, 61434, 67931, 116742, 136848, 131153, 86076, 151494, 147870, 89445, 94082, 66796, 130883, 163813, 152420, 161572, 97407, 119288, 124033, 115708, 114425, 123491, 124752, 118952, 79665, 30481, 18423, 29379, 39640, 70918, 38092, 324, -19635, -31514, -51323, -62739, -57788, -54058, -26469, -11420, 26742, 94321, 101876, 53870, 14214, 40845, 61160, -1611, -59342, -52898, 10143, 65610, 133063, 96556, 113544, 178243, 201360, 116932, 55970, 7812, -8091, 21607, 11687]
13083A1687l4723K1799P2941r058m3418L4673K9186o7927o7493L691N7543L7863
13071D6764k512n530J2994J6396L4612k6688k5414L6007L4055k8628l6107K1694
13059G7643O139k2959K1258R5799m2670r6269K5549M2310k4165m6766K6889O3703
13047A26461j1765o1156m7950l7448L0368O3535L2805l4549P435M4541m434o0398
13035D7445k5650J9343m1555k8427N4247N8625L5448j0296l4195j0745R503k5415
13023D8328l696k5304j6449L8828K0776j10132k0289M5496N313J4050N4849K0515
13011G2285j1122M1764L2438J2062n4332j8479k2243j7659N0455M3338n9685m9765
12999A9057L5100l1289k7064N5380o864j9184J4571J8212l7920k0109Q5056j1939
$$ y = [11687, -23036, -1237, 71704, 62646, 19228, 53901, 83087, 15160, -52333, -48642, 8901, 46764, 44252, 38722, 51716, 68112, 102724, 76036, 50622, 86629, 120684, 92056, 55949, 77643, 83782, 60823, 82081, 177880, 135210, 38941, 64490, 106800, 82635, 35869, 62758, 126461, 114696, 53540, 5590, -31858, -1490, 62045, 94850, 60301, 67736, 112277, 107843, 47445, 21795, 41138, -417, -28844, 25403, 84028, 119476, 109180, 74985, 64240, 73743, 48328, 44632, 19328, 2879, 41707, 62483, -47649, -67938, -22442, -17129, -3079, 51770, 72285, 61163, 102927, 135365, 147427, 93095, 74616, 52373, 34714, 85169, 128507, 68822, 19057, 54157, 22868, -4196, 51184, 44320, 25136, 39707, 57919, 19999, -110, 84946, 73007]
12987G3007m1729M1453o672L966M793j6069O3837N708k5756K4512m1787o1383
12975B3880k0334K768o186N063r561K1627N691J616n0174p937N6385J7784J3594
12962E4216J3825J2527P2333j0639r3803n4433M7853K8017J7708j5551m7090k3570
12950A393J7482M7797K1116M52N736J100k0105K2531L6389k0342j07487r703M6558
12937D2917n189q658o295l4421K7186j8773j0454P351l1691k736K0267J1494N150
12924c852j8129l0102K9158K2386M5597N0264L804q0472o2962Q8003J6637k8543
12912C1789R349K6390l944o680p416j2186K301M0987Q9322J1961l996q8636o6341
12899B2900M5678l7729m8696J2031K1167N6413M133K7985j8818l9471l7660K4895
$$ y = [73007, 31278, 72731, 66059, 70025, 74818, 58749, 122586, 128294, 102538, 127050, 85263, 23880, 3546, 6314, 128, 5191, -4370, 17257, 22948, 24564, -25610, -33547, 22838, 40622, 54216, 68041, 80568, 152901, 142262, 48459, -5974, 41879, 69896, 87604, 72053, 24963, 1393, 18875, 66672, 87788, 88240, 93976, 95076, 74971, 97502, 133891, 113549, 6062, -3641, 42917, 37728, 29070, 22775, -11646, 15540, -3233, -13687, -6336, -38027, -40763, -20496, -9002, -3852, -21981, -52083, -22925, -539, 45058, 95322, 99126, 18654, -44308, 43695, 60332, 31789, 41138, 67528, 63584, 56904, 49488, 37302, 39603, 80590, 169912, 181873, 177877, 89241, 22900, 68578, 30849, -17847, -5816, 15351, 71764, 75897, 103882, 85064, 45593, 7933, 32828]
12887C2828j6100k6665J1625j8901k755N7134N9340j3479l7103j6330l6815O8916
12875F1695J5551o4801M3682l8494L627N2767K3955l5422n5300K4232N0719n5919
12863B6292p60Q830P9415j2534l5465J1398l8487m9347o266O645j8910P36K0197
12850h256J611l9975K1644J3210N9157n995l5094m1415j6674m5501N6282O5688
12838B4682L1884o8130L8027P2737J5693n0259k755K5378n442p3598l2221P1220
12826D7216J1173j9301J2575l1014m2229M2476L3564m3679n4651k4211M1898K7194
12814A011J8927L8275o917k1871M17P282J6901K5187K6130l451n2946J207k1678
12801B8474k2575L3410K5736k9990p615O737M3907k0493l1155j4314M8397M6716
$$ y = [32828, 16728, -9937, 1688, -17213, -19968, 37166, 96506, 83027, 45924, 29594, -7221, 61695, 77246, 12445, 56127, 17633, 21260, 74027, 97982, 62560, 7260, 31492, 82211, 26292, 25532, 34362, 113777, 101243, 65778, 77176, 38689, -10658, -16924, -10279, -29189, -28453, -8256, -6645, -46620, -24976, -11766, 47391, 41396, 6302, -35113, -51787, -97288, -41006, 24682, 56566, -11564, 26463, 99200, 114893, 64634, 61879, 87257, 81815, 8217, -24004, 47216, 58389, 39088, 51663, 20649, -21580, 20896, 54460, 10781, -43870, -68081, -26183, 1011, 19938, 58213, 51296, 29425, 29842, 37124, 54025, 79212, 105342, 101891, 48945, 50152, 28474, 5899, 39309, 65045, 35055, 27440, 34177, 78084, 57591, 26436, 12122, 60519, 107235]
12789A07235k27j0090j2245l3335j2771K757J3154l5171k0421j4477m021j4014
12777c3626K5379l0788j6676O7121M4285n3371m7955J8869N4174O3136N5658j6627
12765A29579m0641j0802K7241m3828k8864j5967P4846R5737K4199n8144r3550
12754E9806k7003l6560k551O53N1284M7683K2563k3755j9090j2254L6495j8025
12742G9246m4089M3165o515j468P6326k516n3547l7266k988L9132m1654l0446
12730A7380l2482J5967m1204J0845Q5876M0469n2975m5407k7752L950J5221l7497
12718d7609M1707P7804K0328J8304m9925p1147L907K4499M1769K8799R143k062
12706I5517m4726o965K8908m848p762M109j0684l4381l6352Q097j2562L9805N5718
$$ y = [107235, 107008, 96918, 84673, 51338, 38567, 41324, 54478, 19307, -1114, -15591, -19612, -33626, -8247, -39035, -55711, 11410, 55695, 2324, -45631, -26762, 27412, 90548, 146206, 129579, 88938, 78136, 105377, 61549, 32685, 16718, 91564, 187301, 211500, 153356, 59806, 32803, -3757, -6308, -5655, 45629, 93312, 115875, 92120, 73030, 60776, 97271, 79246, 35157, 78322, 71807, 70339, 146665, 144149, 90602, 53336, 50348, 89480, 47826, 17380, -15102, 865, -40339, -29494, 56382, 96851, 43876, -1531, -29283, -25333, -10112, -47609, -5902, 71902, 92230, 110534, 60609, -10538, -6631, 17868, 59637, 88436, 97579, 95517, 50791, 43826, 72734, 67886, 60124, 64233, 53549, 19168, -17184, -9087, -21649, 18156, 73874]
12693G3874m2221k6000j2728j7398M8492L4606N3779k4292n4492o6952q58K1658
12681a2532O5213J8321k0014k126O76q472P012k4261L1244j929k654J347P220
12668E9045j6460L499R512L836N400m7640m2799K5264K9522L922J4455l2346o1846
12655d6636k3129J6161M3920M2310M5073M940p509k1156r420k8647L0377J6958
12643F3242J3380l7762k3841L102L2105M298j8019k3957r625j341N8337q977o3523
12630a2581j9377l0434M1123j5755K1498k364k8138K4043K2598J4246M2533j6465
12618D0927l2513P299k5247n447J1502L6087L3411j1380K9713j3762l0649l5364
12606D577l2919J5795M7817P660Q242j4054q133k9996J5797N3903j8892n454j0613
$$ y = [73874, 31653, 5653, -7075, -24473, 24019, 58625, 112404, 88112, 33620, -33332, -34190, -12532, 52681, 71002, 50988, 48862, 49538, 41066, 48078, 23817, 55061, 53132, 50478, 51825, 59045, 42585, 46084, 55596, 59432, 64832, 17192, -25607, -343, 29179, 33101, 47556, 15210, -46636, -69765, -53604, -9684, 32626, 77699, 82639, 75130, 53974, 44554, 15907, 46284, 63242, 76622, 38860, 15019, 18121, 50226, 54524, 36505, 12548, 2923, 1582, 59919, 50942, -12581, -31958, -62392, -21269, -37024, -15526, -17890, -46028, -21985, 613, 14859, 57392, 40927, 8414, 15713, -9534, -14981, -3479, 32608, 66019, 54639, 84352, 70590, 39941, 4577, -28342, -12547, 35270, 42930, 51172, 37118, 28985, -1011, 14786, 68689, 49797, 44343, 33730]
12593C3730o2174L9033R6945n924l8737o8840n560M951J6937K1546K1216k0067
12581C3056m9690K511J8491K7145j7J5015o5235p02L1288N9108k0945K2185M101
12568G6311j2984m189n8920J0468M1642o594J7000q985j0581k9905j3931j818
12556b486J5731k0698j2128R095N80O0172L8099m510M5448K844q1881p041k4754
12543A8471k0526J7989N7582M2320j0798J2258n0256l2889L8884K695M115L4445
12531A14290m654L5480j568k3023J3599L0828k8363l9098p4505K0694L4058k8167
12519D9571k1874l236j1784K084L61K8858N6093L9545l8439k0084m737J5852K8281
12506A20491R930K9062m2841q8512k6063M7303L53N0055P1675m2380n5509j1515
$$ y = [33730, -28444, 10589, 107534, 101610, 62873, -5967, -11527, -6576, 10361, 31907, 53123, 33056, -16634, -14123, 4368, 31513, 31496, 46511, -18724, -19426, 11862, 70970, 50025, 72210, 76311, 63327, 59138, 218, 10686, 52328, 45734, 62734, 53749, 43168, 13263, -668, -2486, 13245, -7453, -19581, -10486, -9906, 50266, 88365, 83855, 129303, 132147, 50266, 43225, 18471, -2055, 15934, 73516, 115836, 105038, 117296, 67040, 34151, 73035, 75730, 79845, 114290, 109636, 145116, 143548, 120525, 134124, 164952, 136589, 97491, 22986, 43680, 77738, 49571, 27697, 24461, 12677, 14761, 15122, 43980, 100073, 139618, 101179, 81095, 76358, 92210, 120491, 130421, 159483, 116642, 28130, 2067, 49370, 49723, 99778, 171453, 129073, 73564, 62049]
12494F2049J9815j3870j9288j3680j3093l0788K1335k2283K1758K7307J9168J4649
12482G3079L4931n3332k9153L3316O0013l7829l7961l3541j0554m4840M0175N4302
12470D8606R552R983J3951l185j4892m9172l7310l6845p747N5622O3556J2995
12458F5114j9019L9580J3565K2697k2706k1627j3618N0212L4103J6685k1644l6733
12446A06609p2401p159j9336j0711O5892K6175n451j8510K7035L437m1656k1856
12434C2068K1442r918J1214L877M2417j6956K953J5895J9449q286n6504l9162
12422A8489J5788L4719J9436j2812k3880k9539k8420N6213Pl5214n7256j3087
12410e5556J00922O0912o226p382N939l722k4094J4740J0208q537l1799K2529
$$ y = [62049, 81864, 67994, 48706, 35026, 21933, -8855, 12480, -9803, 11955, 39262, 58430, 73079, 108010, 54678, 25525, 58841, 118854, 81025, 43064, 9523, -1031, -45871, -5696, 48606, 58158, 68141, 82092, 78907, 64015, 14843, -22467, -59312, -67059, -11437, 52119, 65114, 46095, 85675, 99240, 121937, 99231, 77604, 63986, 114198, 148301, 164986, 143342, 106609, 34208, 27049, 7713, -2998, 62894, 89069, 83618, 65108, 92143, 95580, 53924, 32068, 53510, 43592, 54806, 58683, 101100, 84144, 87097, 102992, 122441, 114155, 57651, 18489, 34277, 68996, 88432, 75620, 51740, 22201, -6219, 49994, 50001, 14787, -42469, -55556, 45366, 106278, 100052, 92670, 98609, 94887, 70793, 85533, 95741, 87204, 55405, 77934]
12398G7934m4971k4863M7146M2938O4263k9483J0754k3158J8761q492j4196N4009
12386A70642K6210l5325n7147K4997Q9845m600p508j5844M3965k6830k212M0301
12374B46494L1180O0892N5028Q2417J48440J16026J27235l4790j09571q0650j3844
12363F28857k6467m6419Q585k047m8615J1501k5121M1321N1869L8619K2389l6696
12351F17776k2252l8967j2626J862J9389N906P083J23722J01869K1956j14145
12340G11573N526L0924n2087l0625M2898N3710L4611O8603R7314M7947N2166J48140
12328A210700K49252L53642K21217k3147k61631k54714j78927r0448j02360j30194
12318I93390j09798k3812j2766k6116o9961m6717M5594J25234J6641o3045k3338
$$ y = [77934, 32963, 8100, 55246, 98184, 162447, 132964, 143718, 120560, 139321, 130829, 116633, 170642, 196852, 161527, 104380, 129377, 219222, 214622, 207114, 191270, 235235, 208405, 206193, 246494, 277674, 338566, 393594, 476011, 624451, 740477, 867712, 832922, 723351, 642701, 628857, 602390, 555971, 564556, 562509, 513894, 525395, 500274, 541595, 593464, 632083, 654472, 617776, 595524, 556557, 543931, 545793, 565182, 571088, 578171, 701893, 803762, 825718, 711573, 717099, 748023, 695936, 665311, 708209, 761919, 796530, 865133, 962447, 1010394, 1062560, 1210700, 1459952, 1813594, 2034811, 2011664, 1750033, 1495319, 1316392, 1225944, 1123584, 993390, 883592, 859780, 847014, 820898, 750937, 704220, 749814, 875048, 891689, 828644, 805306]
12307H05306p6051j6433j6075j2670k4951P191J2140J6071O691n5151o5219n1120
12295E29729J9590M2609l157K2743L6178Q2775Q1297O002k8554N0793P3761J55168
12283A068934L124j39815j69821j36677j05454q3625o6817k0184J7318n362K3257
12272C84878n7057k1803K841j1550m8383j0271j1249J0783n729l2167L2916j7685
12260B15524P677K9134l8707q6837J1506M3650K0107j0824M2316L1349K468l7176
12248B30187K188q498k6635l5377L1845L1435M048l1759L124N8946J7183m5290
12236B31397m9637o2776O3831L0924J7572J8364M6624m3363p9674J8459J5411
12225B07132j2863K6394J8844K5529p6337q375J08022Q1254l3008j9770k9177
$$ y = [805306, 729255, 712822, 696747, 684077, 659126, 666317, 678457, 694528, 701219, 646068, 580849, 529729, 549319, 591928, 588771, 611514, 647692, 730467, 811764, 817766, 789212, 840005, 913766, 1068934, 1072058, 932243, 762422, 625745, 520291, 436666, 369849, 349665, 366983, 361621, 384878, 327821, 306018, 308859, 297309, 248926, 238655, 227406, 238189, 232460, 200293, 233209, 215524, 223201, 252335, 213628, 126791, 138297, 181947, 202054, 191230, 233546, 264895, 267363, 230187, 232375, 223877, 197242, 161865, 193710, 225145, 229193, 197434, 200558, 259504, 276687, 231397, 181760, 118984, 182815, 213739, 231311, 249675, 296299, 252936, 173262, 191721, 207132, 194269, 220663, 239507, 265036, 188699, 180324, 288346, 369600, 336592, 316822, 287645]
12214B87645m3313j2093k9504j4548M6498M3733K5116l2974k830N0240K5660k5291
12202C18339m2849l7991k6597n072o3866l1639N3436M5903Q1192L9221m5657K8934
12190C13354K3318j3029k1932L8747J826j1067j1759K2847k4277K7791n0692l5021
12178B60106K6815P638P2016l5884m312j4099n2413P202L2624P0909K2168n3392
12166C39378j3445N766N090n4644O5692P4567K1989k1284l6183l5156J8904J0443
12154C81117K5820k5621l4561O6312q240l5812k635J7349j4181O7583K466M6337
12142D85934L1368m5577r8109k4597O5586L8397L130m3648m8927K5424O9838O4131
12130E22950K91m1884p01O9478L5998n1920l8223k2811j4208L6249P0321M3119
$$ y = [287645, 244332, 232239, 202735, 188187, 234685, 278418, 303534, 270560, 267730, 317970, 343630, 318339, 275490, 237499, 210902, 205830, 141964, 110325, 163761, 209664, 290856, 330077, 284420, 313354, 336672, 323643, 301711, 340458, 342284, 331217, 319458, 342305, 318028, 345819, 295127, 260106, 286921, 294559, 366575, 330691, 326379, 312280, 259867, 267069, 299693, 370602, 392770, 339378, 325933, 331699, 336789, 282145, 347837, 422404, 444393, 423109, 386926, 351770, 370674, 381117, 406937, 381316, 346755, 413067, 404827, 369015, 366380, 383729, 369548, 437131, 439597, 485934, 517302, 471725, 373616, 349019, 414605, 453002, 456132, 412484, 363557, 388981, 458819, 522950, 523241, 481357, 480656, 550134, 586132, 534212, 495989, 473178, 458970, 495219, 565540, 608659]
12118F08659L09p52K2682J4790N052k8166m8369J3585j6117o0270N8509J0735
12106E80647M7514K6175L0005J2738M1029O526j7187J2400J6784J2307l968k8746
12094G36224k9330J8106J5174M698L3620K9395K4945j1387n0338J692M2448K935
12082H18182p796j1176L8008J881k5534O249P860N9967Q782L8461R6175J31472
12070A162531l732q3968k1371L4425k63k0386N4280r907K075N7270O0048J8390
12058A249392O0257L9062K9J6719O8249O612o790l1533l1994J445N3949K4871
12046A450268J9017M189K4415O597Q6702L4419M4163P924M0423L410M4815K2644
12034A788986K3081M2223Q512j6124L4227J09589Q9220n935p935J00685Q1439
$$ y = [608659, 608968, 608216, 630898, 645688, 650740, 622574, 574205, 587790, 571673, 511403, 569912, 580647, 628161, 654336, 684341, 697079, 738108, 744634, 727447, 739847, 756631, 768938, 764970, 736224, 706894, 725000, 740174, 744872, 778492, 807887, 832832, 821445, 771107, 772799, 815247, 818182, 810386, 799210, 837218, 839099, 813565, 819814, 827674, 887641, 896423, 934884, 1031059, 1162531, 1158799, 1074831, 1053460, 1087885, 1087622, 1067236, 1121516, 1111609, 1113684, 1170954, 1231002, 1249392, 1309649, 1348711, 1348740, 1365459, 1433708, 1440320, 1433530, 1401997, 1370003, 1371448, 1425397, 1450268, 1469285, 1473474, 1497889, 1504486, 1591188, 1625607, 1669770, 1677694, 1718117, 1721527, 1766342, 1788986, 1812067, 1854290, 1862802, 1846678, 1880905, 1990494, 2079714, 2073779, 2065844, 2166529, 2247968]
12023B247968K6233N3647O5055L1652k4707L1250K0724O1165J71877L4781O3362
12012B783007O9778Q7763P8295M3762Q5680J07728R0634Q1079O6335N1401R5103
12001C640565J50559J17932Q8339O7500K7081O1059P1111Q8764J00253J82791
11991D595954J24355J21328J16746J65976J54988J50670J53912J48596J88016
11982E920541J46435J32081J12175J41376K23724K33652K25525K57711K63261
11973G656481K10424J78955K12239K04808K62807L16606K50165J99355K27156
11964I718996K30282K57933K91114K73227K73689K62158K82918K20395K36087
11955A2046799K76276K21605J36678K20304L02295L07146J87645J00655J64092
$$ y = [2247968, 2274201, 2327848, 2392903, 2424555, 2399848, 2431098, 2451822, 2512987, 2684864, 2719645, 2783007, 2852785, 2940548, 3018843, 3062605, 3148285, 3256013, 3346647, 3427726, 3494061, 3545462, 3640565, 3791124, 3909056, 3997395, 4064895, 4091976, 4153035, 4224146, 4312910, 4413163, 4595954, 4720309, 4841637, 4958383, 5124359, 5279347, 5430017, 5583929, 5732525, 5920541, 6066976, 6199057, 6311232, 6452608, 6676332, 6909984, 7135509, 7393220, 7656481, 7866905, 8045860, 8258099, 8462907, 8725714, 9042320, 9292485, 9491840, 9718996, 9949278, 10207211, 10498325, 10771552, 11045241, 11307399, 11590317, 11810712, 12046799, 12323075, 12544680, 12681358, 12901662, 13203957, 13511103, 13698748, 13799403, 13963495]
11946A3963495J76756J48275J23392J07814J19357O143m7681m2554j4508p4065
11936A4466424j19403p8531n8934j23524k25556j61064j74760k21317k92634k15373
11926A2795328k21406k40737j98190j73767k26101k68247k80253l47918l44094
11917A0494615k90434k78596l02393k54645k07509j81654k02486k37506k40710
11908H298682k54381k08269k27367k80238k29354j85747k17488j06447j34850
11899F454541j46444j67844j73586j64620j66868j58213j28518j60047j21523
11890E066878j39908j12253j40059j27424j05749j29261j42515p6981q2365j17020
11880C893343j08785p2520p6069j09533j20161q5838n6281r4564q3319o8957r0481
$$ y = [13963495, 14140251, 14288526, 14411918, 14519732, 14639089, 14645232, 14597551, 14554997, 14540489, 14466424, 14347021, 14268490, 14209556, 14086032, 13860476, 13699412, 13524652, 13303335, 13010701, 12795328, 12573922, 12333185, 12134995, 11961228, 11735127, 11466880, 11186627, 10838709, 10494615, 10204181, 9925585, 9623192, 9368547, 9161038, 8979384, 8776898, 8539392, 8298682, 8044301, 7836032, 7608665, 7328427, 7099073, 6913326, 6695838, 6589391, 6454541, 6308097, 6140253, 5966667, 5802047, 5635179, 5476966, 5348448, 5188401, 5066878, 4926970, 4814717, 4674658, 4547234, 4441485, 4312224, 4169709, 4092728, 4010363, 3893343, 3784558, 3712038, 3635969, 3526436, 3406275, 3320437, 3264156, 3169592, 3086273, 3017316, 2926835]
11869B926835o5603q1217m6237o1939n3854m8503n1996n2689m9620o2352o8356
11858B284469J7339l0002m3013j4160p2000q0589j2979m9088j4856l6540l3834
11847A914747j1280j1174q4725o9270k1297n7413l3975m9938P888n7782j1027
11836A514754Q1854n5246n8811l2464M840k2057J36J5526n4699J643l8168l7454
11824A319854j0747n7011o6389M493n002p3488k9697J8084J1128L6306n4045p1969
11812A021517J1542r786m2805m4271k7809K6555l2066M4455l7457l6000L2814
11801I06689j5500p8388l9416K1287N9038J2957l8758k5430j7504l4861j5582
11790G34532j2613j0647o0268L0074N6670k8833L5731r355o2095p2803L3092K3498
$$ y = [2926835, 2861232, 2780015, 2733778, 2671839, 2617985, 2569482, 2517486, 2464797, 2415177, 2352825, 2284469, 2301808, 2271806, 2228793, 2214633, 2142633, 2062044, 2049065, 1999977, 1985121, 1948581, 1914747, 1903467, 1892293, 1807568, 1738298, 1717001, 1659588, 1625613, 1575675, 1583563, 1525781, 1514754, 1596608, 1541362, 1482551, 1450087, 1454927, 1432870, 1433006, 1448532, 1393833, 1395476, 1357308, 1319854, 1309107, 1252096, 1185707, 1190200, 1185198, 1111710, 1082013, 1100097, 1111225, 1147531, 1093486, 1021517, 1033059, 1023273, 980468, 936197, 908388, 934943, 902877, 947332, 909875, 873875, 906689, 891189, 812801, 773385, 794672, 853710, 866667, 827909, 802479, 784975, 750114, 734532, 721919, 711272, 651004, 681078, 737748, 708915, 744646, 735291, 673196, 600393, 633485, 656983]
11778F56983q122n0305l4743j1308M3259k6589K0696j9261j5591l7236p2060J6229
11766D61952L1593J8535p378J8176J7864K9780o86j8019o6437J3991q137l2553
11754D58681O570j1017Q212k7050o6504M4312J6911k0836l2233L6943j2483l4076
11742C67430L3295L3393j2295n3735L0789L3789K6323J13403K9737m7791j01598
11731D52740k5068l99J128j5875o2292k2004J550l2700J2237o4400m8262K4038
11719B20693N9845k0817N0663Q1008l4647K821k3p7403k989J6909m0763m5403
11707B09894j2391k2500M2632N6940N0152j109o0988L168j0385P046K5262m4103
11695B43618j8754J6327P719l41Q221R607P699j6660j1005k5129L0705K4465O0038
$$ y = [656983, 648861, 598556, 563813, 552505, 595764, 569175, 589871, 570610, 555019, 517783, 445723, 461952, 493545, 512080, 504702, 522878, 540742, 570522, 569836, 551817, 485380, 499371, 491234, 458681, 465251, 454234, 462446, 435396, 368892, 413204, 430115, 409279, 377046, 413989, 401506, 367430, 400725, 434118, 421823, 368088, 398877, 432666, 458989, 572392, 602129, 554338, 452740, 427672, 427273, 428401, 412526, 350234, 328230, 329780, 297080, 309317, 244917, 196655, 220693, 280538, 259721, 310384, 391392, 356745, 359566, 359543, 282140, 279151, 296060, 255297, 209894, 197503, 175003, 217635, 274575, 324727, 323618, 262630, 265798, 255413, 262459, 287721, 243618, 224864, 241191, 248910, 248569, 256790, 266397, 274096, 257436, 246431, 221302, 252007, 276472, 336510]
11682C36510m4319o5268j990l620K2673o8927J0057M0753Q8480K0780l8091o7225
11670B29813l6306k5703L4519J8193j7694P497l1780L4619K5495k3825o200L1936
11658B40564p486j1354n189n778m4685m6546J7869K9579L6214J3643k9122l3725
11646A53984k2872n592Q220K6976L4478m3587p9382q392M7067j5678k5124L9329
11634A09427J3018l4985J1807K9952K1354J1258M1899K0924n901p7364K8663n2891
11622A17161r603N5142M5816O226k6693o845k3481k9657n5055k2329L6453R435
11610I6570k3491J9154O7200J056k5448j7797K3024K1231k3498k1824n281J0774
11598A21670k1670J1690N1522k7583n7495P531L0429j6137m8033K552K4322K6479
$$ y = [336510, 292191, 226923, 224933, 221313, 243986, 175059, 185116, 225869, 314349, 335129, 297038, 229813, 193507, 167804, 202323, 220516, 202822, 210319, 178539, 213158, 238653, 214828, 208628, 240564, 233078, 221724, 216535, 210757, 166072, 119526, 137395, 166974, 203188, 216831, 187709, 153984, 131112, 125520, 133740, 160716, 195194, 151607, 72225, 63833, 110900, 95222, 70098, 109427, 122445, 87460, 99267, 129219, 150573, 161831, 203730, 224654, 218753, 141389, 170052, 117161, 107558, 162700, 208516, 214742, 188049, 181204, 157723, 128066, 73011, 50682, 87135, 96570, 73079, 92233, 159433, 160489, 135041, 117244, 140268, 161499, 138001, 116177, 110896, 121670, 100000, 111690, 163212, 135629, 78134, 85665, 116094, 99957, 51924, 54476, 78798, 105277]
11586A05277O4990M5892k6118j9862j6583k9092j0943p5233o1682o861j1427L3643
11574g999k5196p927O1290L2772M911k611J7723K0802j3447L4912o440k6098n760
11561G6932j8112l5032k4127K940J09668L6737l2349R09J9459K306o1055k2120
11549E6156k8118j0083J9510K5999M0623k2530k226J8474R250J111l4830k3286
11537E0050K4786j7515J2542K8940q186k351M7155p691o6685n9381K4105J2299
11525C8068K3450m3826o085K3874O88K398L7077p7214J1126L4065j7946j0590
11513A5085K4842O0250J8676L3577l1017j7278J5737r042m662j1677Q070P1M832
11500A07464k266k2827n9353J0686n080M7668n683n1805k9189p428J6762N4796
$$ y = [105277, 170267, 216159, 190041, 170179, 153596, 124504, 113561, 38328, -23354, -30215, -41642, -7999, -33195, -41122, 20168, 52940, 57851, 55240, 72963, 93765, 80318, 115230, 108790, 82692, 76932, 58820, 23788, -339, 2601, 112269, 149006, 116657, 117566, 137025, 139331, 78276, 56156, 28038, 17955, 37465, 63464, 104087, 81557, 79331, 97805, 107055, 108166, 73336, 50050, 74836, 57321, 69863, 98803, 90617, 88266, 135421, 127730, 61045, 1664, 25769, 38068, 61518, 17692, 11607, 35481, 36169, 38567, 75644, -1570, 9556, 43621, 25675, 15085, 39927, 100177, 118853, 152430, 121413, 104135, 119872, 110830, 106168, 94491, 102561, 102632, 107464, 105198, 82371, 23018, 33704, 28624, 76292, 70609, 18804, -10385, -17813, -1051, 53745]
11488E3745o8171k9217J3469j1147L5674m016J3933M78n460k0386L8444j2185
11476E161q796m4623L715P6926L0373J6802m3203O111K8515j4734l1168o1922
11464c6843l0769k5870M2548N9632j2823Q0953M403N3708k0045j472j7944j0563
11452H4915r505K767L8265k9106o5583j983L3275l1444Q914j4380R261J0058L0101
11439F5555O914L560m6118J1713J9128m313r904j8544K8887J9958o766m0061j8423
11426A1586J4099j7772o7598M2720N1150j1014l6686J5750K5347L1677J1129k4319
11414D6069K3158j5803q832m2701m5715K9614J7960N957K6075J3541n8988N1919
11402D2254N2758q353o3497j7414m286j3339j1550J3636J4306K8600l7799L6020
$$ y = [53745, -14426, -43643, -30174, -41321, -5647, -9663, 4270, 4748, -712, -21098, 17346, 5161, -3635, -48258, -44543, 32383, 62756, 79558, 36355, 42466, 70981, 56247, 25079, -36843, -67612, -93482, -50934, 8698, -4125, 76828, 81231, 134939, 114894, 113422, 95478, 84915, 75410, 78177, 116442, 87336, 21753, 19770, 53045, 21601, 30515, 16135, 25396, 35454, 65555, 72469, 76029, 29911, 41624, 60752, 56439, 46535, 27991, 56878, 76836, 70070, 30009, 11586, 25685, 7913, -59685, -16965, 34185, 23171, -13515, 2235, 27582, 59259, 70388, 46069, 69227, 53424, 44592, 1891, -43824, -14210, 3750, 9707, 35782, 49323, -9665, 42254, 95012, 86659, 23162, 5748, 1462, -11877, -23427, -9791, 4515, 33115, -4684, 31336]
11390C1336K4573K1817p922n9965k1435j4044j2379L7156m342J0136r876j2698
11378a7643k0129N7991O4847K1249m7102k9958q507J4345k2336J3143K9193K0280
11366G5373j6593m6088N2327j7806l7018L7859J3003j6889m4103j4217L1063L6363
11354E3274k5662n4455M9407J2389O1550J898j9478r4221n2421P1201M1150j1170
11342C3462m9139k8182k438N5264J7267J4791n0309k0765O366K9552L0271M3790
11330G9930J4708K2155M36n7020j5734L9886K0701J246o4737p34L1378l5737K8146
11317F4624L5774k1324j7974k0079k7041L1850J4454N637m326n5136q773J1196
11305H882N487m51k9265K8961M444o9045k9376L2271N4352k725p1945l29O4589
$$ y = [31336, 55909, 77726, 69804, 9839, -11596, -25640, -38019, -863, -5205, 4931, -4945, -17643, -37772, 20219, 85066, 106315, 59213, 29255, 20748, 35093, 12757, 25900, 55093, 75373, 58780, 12692, 65019, 47213, 10195, 48054, 61057, 44168, 65, -14152, 16911, 53274, 27612, -26843, 22564, 34953, 96503, 98401, 78923, -15298, -67719, 3482, 44632, 33462, -15677, -43859, -46297, 8967, 26234, 41025, -9284, -30049, -23683, 5869, 36140, 79930, 94638, 116793, 117229, 60209, 44475, 84361, 105062, 106308, 41571, 40837, 72215, 36478, 64624, 100398, 79074, 61100, 41021, 13980, 45830, 60284, 65921, 61595, 6459, -2314, 8882, 14369, 13918, -15347, 13614, 18058, -50987, -80363, -48092, 6260, 3535, -68410, -68739, -4150]
11292d150K8399m5065m1378j5171O8147L7007L3754m0869p7018j9191J1818L7466
11280b6251N1149j2479l828j5288P532J8185l9583p819j702l4216R267L4518K4641
11267D126l542j7902O2268L3936M737l3196l3657l2070J1330J9419l1185J7033
11255A297L8995N143k1553l0056J2342l546l0573p0301O483L4134P4871L7476
11243E4712p790k1015j3011m012k0345k5289q623L2504j2472k4823j7905Q0495
11231A2426J08597j6564l3876J0075k3506l9003k5577N9372M8971J2948m2009
11220G1854J7063q186k9214m5161k765n388j4169p5775j5326K2094N9752M5788
11208B0567O978j1887j7627m7421J7437R3297R453l4712M944J0757N382m1282
$$ y = [-4150, 24249, -20816, -62194, -77365, -9218, 27789, 61543, 20674, -56344, -75535, -63717, -26251, 24898, 12419, 8591, -6697, 835, 19020, -20563, -28382, -30084, -64300, -55033, -20515, 4126, 584, -17318, 44950, 78886, 83623, 50427, 16770, -15300, -3970, 15449, -15736, 1297, 40292, 45435, 23882, -6174, 6168, 2622, -27951, -98252, -91769, -57635, 17236, 54712, 46922, 25907, 12896, 8884, -11461, -36750, -45373, -12869, -25341, -50164, -68069, 12426, 121023, 104459, 70583, 80658, 57152, 18149, -7428, 51944, 100915, 113863, 71854, 88917, 80731, 51517, 6356, 3591, -1797, -15966, -91741, -107067, -84973, -25221, 20567, 27545, 15658, -1969, -49390, -31953, 61344, 70797, 36085, 41029, 51786, 57168, 15886]
11196A5886J4776L0817J5226j7544J5371n1300n2653j5063L4809m185k1707J9506
11184a6061K7069J1K2397L8906k3307l5952J9680M5300k6084p1797k9313M5167
11172c984N7658J2093o3778j9016L2815N3670Q864j4527p735p0901l7092j2088
11160f4021K3576O9392M1188K6039n7380m0117J9302J5623m5657L2833M1330p4177
11148a2069J2953K7536K4559k5997l3374J9424j250K224j4834j6109L0034k073
11136A1024L4590N0412L5640l8756j9901J3515P0140r2813o2704k5674L90N3744
11124B9607L2101l8453J7979O39L7927L004m4505j6327J1285l3579l0488l2036
11112f2846P453O1778P4298m434k693m0294n0173K319K2363l2137k3644k4097
$$ y = [15886, 30662, 61479, 76705, 59161, 74532, 23232, -29421, -44484, -9675, -13860, -35567, -16061, 11008, 11019, 33416, 72322, 49015, 13063, 32743, 78043, 51959, -19838, -49151, -3984, 53674, 65767, 1989, -17027, 15788, 69458, 78322, 63795, 56060, -14841, -51933, -64021, -40445, 28947, 70135, 96174, 38794, -1323, 17979, 33602, -12055, 20778, 62108, -12069, 884, 28420, 52979, 26982, -6392, 13032, 11782, 14006, -828, -16937, 13097, 11024, 45614, 96026, 131666, 92910, 73009, 86524, 156664, 63851, 1147, -24527, -24137, 29607, 61708, 23255, 41234, 41873, 79800, 82804, 38299, 21972, 33257, -322, -30810, -62846, -55393, 6385, 80683, 76249, 73556, 33262, -16911, -14592, 7771, -24366, -48010, -72107]
11100g2107q273M9589n463k4008l3541j3404K6203M2447J2408O1254K6152O031
11088F7288k6332M5342o143o6677j7858j432K4633K1953o2267m09M1268k3991
11076d625j7062k2520j1189M3071k2449j3362K8116K1726o723n9892m8794L1978
11064h1725K3487o933m27Q9686K6472j9941k8799Q204j5628K0627M1228n1583
11052D668l9962K183l513L7926M1732l0738j1210L21N2966R0248l0527K5444Q1253
11039B20791J5422l0793K371k8733j4329M0996Q2303O9814Q2567p5788Q999Q228
11027C81848o680o5335q620N1180k5664k864O6711L9897M4157L0449r5102m0305
11015C69672l7158l7554K0060l978J585n8245O042J1570M814j8089n9541k9104
$$ y = [-72107, -80380, -30791, -36254, -60262, -93803, -107207, -81004, -38557, -26149, 35105, 61257, 67288, 40956, 86298, 80155, 13478, -4380, -5812, 18821, 40774, -21493, -21902, 19366, -4625, -21687, -44207, -55396, -12325, -34774, -48136, -20020, 1706, -5017, -64909, -113703, -81725, -58238, -65171, -65598, 24088, 50560, 30619, 1820, 10024, -5604, 15023, 56251, 4668, -35294, -33111, -36624, 1302, 43034, 12296, 1086, 1407, 54373, 144621, 114094, 139538, 220791, 236213, 205420, 207791, 179058, 164729, 205725, 288028, 357842, 440409, 364621, 373620, 381848, 375168, 309833, 301213, 352393, 326729, 323865, 390576, 430473, 474630, 505079, 409977, 369672, 332514, 294960, 315020, 311042, 312627, 254382, 260424, 271994, 276808, 258719, 199178, 170074]
11003A70074n5945l63l0556m810r321K3057J9578K2330M5786m8596K5766J6250
10991A73250p3531m5973j6689p4213n0110J1108M8919M8401J0285l6117n4891
10980e9561m6934P543n181m197K6444J4976k8740L2758Q2284o3398n6619M9378
10968e1247J5285l2352L7341l7906K663j0324j738Q788M2604L0307J2091K6251
10956D1763K2106m0349K9482R812k9899o0240o3229j1643p292L6117j3794K6821
10944f0345M8267P9094L579L5540j7303p0983o4968k1426R5547J8314p116m1366
10932c166K0836J0352j2005n5637j00316q289P3753J0911l1021L8215O4634R135
10920A7402l9669k8412k9266J5778J0828L4585j8300Q110j4043l4398R156J8094
$$ y = [170074, 114129, 113766, 83210, 78400, 69079, 92136, 111714, 134044, 179830, 131234, 157000, 173250, 99719, 53746, 37057, -37156, -87266, -76158, -27239, 21162, 31447, -4670, -59561, -106495, -98952, -104133, -108330, -81886, -66910, -95650, -62892, 19392, -44006, -100625, -51247, -35962, -68314, -30973, -68879, -66216, -76540, -78278, -69490, -26886, 3421, 15512, 41763, 63869, 23520, 53002, 62814, 32915, -27325, -90554, -102197, -109489, -73372, -87166, -60345, -12078, 67016, 70595, 106135, 88832, 17849, -47119, -68545, 27002, 45316, 38200, -3166, 17670, 28022, 16017, -39620, -139936, -148225, -74472, -63561, -94582, -56367, 8267, 17402, -22267, -50679, -79945, -64167, -53339, -18754, -37054, -28944, -42987, -77385, -68229, -50135]
10908e0135M1429j4368j7254k7526j3999K9592j0573m8588L4845R5419M141K1117
10896D4100K2521k5091j3903k9275P268o307K7309j927o7779q297m3783j6596
10884a11760L2358l1549N4773J5327m2731m6738M8205M7994q154J1796M5871J6163
10872C1555q114l5746l1183n233P476P721m3622L5221R3198M010k5952K4204J5495
10859F9030n412Q849m967k6099l7927k5590o62j7959j3165M0917l5314K028K0442
10846b5829M4625J6751n5333k356P6726N0011J871k8815J3750r522j0644j7659
10834E3576l8074l4859K5993O605o57K1011K1980o730M2505M8235l4525o0570
10822D4490j7296n5144M1404j8929l253L1956l4833K1369q564J5172l140J1274
$$ y = [-50135, -8706, -23074, -40328, -67854, -81853, -52261, -62834, -111422, -76577, 18842, 22983, 44100, 66621, 41530, 27627, -1648, 5620, -687, 26622, 24695, -43084, -51381, -95164, -111760, -79402, -110951, -56178, -40851, -83582, -130320, -82115, -34121, -42275, -30479, 15392, 31555, 23441, -12305, -43488, -48721, -41245, -33524, -77146, -41925, 51273, 55283, 29331, 53535, 69030, 63618, 72467, 67500, 41401, 3474, -22116, -22778, -40737, -53902, -12985, -48299, -46271, -25829, 18796, 35547, -19786, -22142, 54584, 104595, 106466, 77651, 91401, 81879, 71235, 53576, 15502, -19357, 6636, 13241, 12584, 33595, 55575, 48845, 91350, 139585, 105060, 44490, 27194, -27950, 13454, -5475, -8728, 23228, -11605, 9764, 1200, 16372, 13232, 24506]
10810B4506l9570J0616J7892J2010l27l6245L1635Q0542j5727q0616k9533N400
10798a9417M8485P38l0652R221Q29J1968J3018l9549j3294N6873K9789n1433k0151
10785c575L1677J2081q1482m7382J4407M5222n2883m9792j0500O7561L7138k3386
10773f0914K6548P010O8419L2625l454o051l1963m7351m3849P899M5696K4560
10761A9175M3422L9151o2326o8966r622K634J1581k307n779k6295k6351O1320
10749b4363L0578l3037N6512M5865n6254L049L5318l130m0068k5060K0810M5340
10737E5560n659J452N986L690r115J7773m6418k8620r314J9408O4339l1449m2484
10724d851M144k3536j2589J2701K9734O548j0664j4650J4473K5969k9900k6871
$$ y = [24506, -15064, -4448, 13444, 25454, 25127, -11118, 20517, 101059, 85332, 4716, -24817, -19417, 29068, 29806, -846, 8375, 9204, 21172, 34190, -5359, -18653, 38220, 68009, 16576, -3575, 28102, 40183, -41299, -88681, -74274, -29052, -81935, -131727, -142227, -74666, -37528, -60914, -34366, -27356, 41063, 73688, 70234, 64183, 32220, -15131, -58980, -51081, -5385, 19175, 62597, 101748, 39422, -29544, -39166, -36532, -24951, -27258, -33037, -59332, -85683, -24363, 6215, -26822, 29690, 75555, 19301, 22350, 57668, 54538, 14470, -10590, 10220, 55560, 49901, 51353, 57339, 61029, 51914, 69687, 23269, -5351, -14665, 4743, 69082, 37633, -4851, -707, -24243, -36832, -24131, 5603, 12151, 1487, -13163, 1310, 27279, -2621, -29492]
10712b9492j573M1515M1989K7344j2251j6387j9191k8359J8805K1971m811k6707
10700A2853K7299M2966m5529j01459J8667M4516k8734k1420O2668J4913J9619
10689D6359j158L571N0902J5326o225p7502n4093j5819K8231p611N6528K3198
10677F1707L2673j6264K0828n446L6430Q3922j6703p0912j3632l0350O750K6648
10665A15651K5639R5429J9288k4378k2536l3196Q819P423L0966K6348M9298K0391
10653C19142J8728M7154Q0926J6616N6605J25353J4121j6260j0146l9744k4230
10642E88265m5395J9179N9216Q6001L9480Q309J37503J56254J06951J4901Q0343
10631A251007K20222K59291K24611K41734J88364K63770K68189L70524M81852
$$ y = [-29492, -31065, 10450, 52439, 79783, 67532, 51145, 31954, 3595, 22400, 44371, 39560, 12853, 40152, 83118, 37589, -63870, -45203, -687, -29421, -50841, 11827, 26740, 46359, 45201, 48772, 99674, 115000, 108775, 31273, -22820, -38639, -10408, -18019, 38509, 61707, 94380, 78116, 98944, 93498, 129928, 213850, 197147, 126235, 112603, 82253, 89003, 115651, 141290, 236719, 256007, 231629, 209093, 175897, 184716, 192139, 223105, 249453, 298751, 319142, 337870, 385024, 465950, 482566, 539171, 664524, 678645, 662385, 652239, 612495, 588265, 542870, 562049, 621265, 707266, 746746, 755055, 892558, 1048812, 1155763, 1170664, 1251007, 1471229, 1730520, 1955131, 2196865, 2385229, 2648999, 2917188, 3287712, 3769564]
10622C769564N94715P74196J062689J504069K097804K746624L478295M178188
10614B0206144M503497L870515K303510M43143q28910j094333n13169O20703K197333
10605C1708433M037065O207482Q134700Q875005O980112K579105k137732m888231
10597F1495939n110610l547812j104142J713595M820571P842675J0324757J0581107
10589H7016080P005373K16184o617409j0075319r950121p775972m922280k035577
10581E2860959P71763L283555N059684N057736K325695k446776o719680q525759
10573E1667177p941606o225571m178677k385559q25028L51946R79951P77225l97205
10564C1822653k222855l784800m383328m066624l421728k693077k074618j597690
$$ y = [3769564, 4364279, 5138475, 6201164, 7705233, 9803037, 12549661, 16027956, 20206144, 24709641, 28580156, 30883666, 31326809, 30497899, 29403566, 28890397, 29511100, 31708433, 35745498, 41952980, 50087680, 58962685, 65942797, 68521902, 66384170, 61495939, 56385329, 52837517, 51733375, 53446970, 58267541, 66110216, 76434973, 87016080, 94021453, 94237637, 87620228, 77544909, 67594788, 59818816, 54896536, 52860959, 53632722, 56916277, 61975961, 67033697, 69359392, 66912616, 60192936, 51667177, 43725571, 37500000, 33321323, 30935764, 30110736, 30462682, 31442633, 32219858, 31822653, 29599798, 25814998, 21431670, 17365046, 13943318, 11250241, 9175623, 7577933]
10556G577933j264893r73302p06670n64570m62299l43606k80435k08509k28756
10547B544893k35677k09672j36465j37735j51498p8814p1990p4992j39685q9969
10537A218396l9997r5501m2807p579k0658l3970k6891k6616j6071o757o9324r3276
10525G38949q3925j3746j5828R1320J6994o4032j7385P061p018J303j0997p0676
10513E72020k1753l9352l2393j6740k6150P793l1351L616j6672Q092J6442N506
10501D29058o7357q72K9842m100J2132N6187M9775m8177j9299k9361K7864O538
10489D42230k4462n3081r625l341J250J0252M0542l6306j11422O075J4992j7669
10477B59435K2700M0760N1212K2201k1971m4711p3382o721k1078K9310L4118J167
$$ y = [7577933, 6313040, 5339738, 4633068, 4068498, 3606199, 3262593, 2982158, 2773649, 2544893, 2309216, 2099544, 1963079, 1825344, 1673846, 1595032, 1523042, 1448050, 1308365, 1218396, 1178399, 1082898, 1040091, 1032512, 1011854, 977884, 950993, 924377, 908306, 901549, 832225, 738949, 655024, 641278, 625450, 716770, 733764, 669732, 652347, 659408, 652390, 653693, 642696, 572020, 550267, 510915, 478522, 461782, 435632, 443425, 412074, 415690, 399018, 407110, 423552, 429058, 361701, 360829, 390671, 386571, 398703, 454890, 504665, 456488, 437189, 407828, 435692, 442230, 417768, 364687, 355062, 351721, 352971, 363223, 403765, 367459, 256037, 262112, 277104, 259435, 282135, 322895, 374107, 396308, 374337, 329626, 256244, 249523, 228445, 257755, 291873, 293040]
10465B93040l6559j7298j486o662J711J7546n1389l0865m0611j7219K7760K5727
10453A63695l293L7229K8530j76o0693j6647J7626R827L6023J2710m3479l2654
10441A48698r334j7517L7284K2848k2129o1556r779j3557j2795L4575M0481l2293
10429A04926k4604N3055K8649K2774j4188k2812k4178m8317J44j8839m1015n9131
10417d3536M0703O8501N7099p342j8669O3759K3088Q02j5009R362j6821N429Q711
10404A76077k4703K101m8043l6447j1400J3655q599K649N9339O481m3265o2574
10392B5271j3229k9545N7659O3347o7618m5777K4275j2037M1555N2759k8001k0771
10380D7888K4166L6626k20L516J852k4198j0023R723K891l8745k1998j3350j3593
$$ y = [293040, 256481, 239183, 237697, 231035, 232746, 250292, 198903, 168038, 127427, 110208, 137968, 163695, 160402, 197631, 226161, 225985, 165292, 148645, 166271, 176098, 212121, 224831, 181352, 148698, 139364, 121847, 159131, 181979, 159850, 98294, 88515, 74958, 62163, 96738, 137219, 104926, 80322, 133377, 162026, 184800, 170612, 147800, 123622, 75305, 75449, 56610, 15595, -43536, -2833, 65668, 122767, 115425, 96756, 160515, 183603, 184405, 169396, 178758, 161937, 167366, 176077, 151374, 153475, 105432, 68985, 57585, 71240, 62641, 65290, 124629, 131110, 87845, 25271, 12042, -17503, 40156, 103503, 35885, -9892, 14383, 2346, 43901, 96660, 68659, 47888, 72054, 108680, 108460, 111976, 113828, 89630, 79607, 89330, 92221, 53476, 31478, 18128, 4535]
10367D535K4480L1798J456M8906K7834j7677o9693o3033j1474K4294N4127K254
10355E7807P580o659k5501M643P9599K6083l9106j1812N980O916O7505n7141J0543
10342A26437L2447Q386P2161K3341m4777m0163L4083Q539M6615J8734o6230n9930
10330A59643l6121n147k0950k9416J557o1651m2764M2742N2740j1970K1747J5235
10318H5645m0767J2974M5046q837r6829o0074O5039n184R032N0237K2435J22j563
10305G7276L6377j3781l1131n1900k4500J5310j9988r083M3510J05280K0531j1731
10293A36170m2585k2289n8795r95K7558R176m5922K8038L5341q511q5138k5026
10281e2978J07828L7934j4661o426P329N4427O0341j5172q3093p9690l2791P522
$$ y = [4535, 29015, 60813, 62269, 111175, 139009, 121332, 51639, -11394, -22868, 1426, 55553, 57807, 65387, 58728, 33227, 37870, 117469, 143552, 104446, 92634, 98614, 105530, 173035, 115894, 126437, 158884, 167270, 239431, 262772, 217995, 177832, 211915, 220454, 267069, 285803, 219573, 159643, 123522, 118375, 97425, 68009, 69566, 7915, -34849, 7893, 60633, 48663, 70410, 85645, 44878, 57852, 102898, 94061, -2768, -62842, 2197, -2987, 6045, 56282, 78717, 78839, 77276, 113653, 99872, 68741, 16841, -7659, 7651, -12337, -21420, 22090, 127370, 147901, 136170, 93585, 71296, 12501, 11506, 39064, 48240, 2318, 30356, 65697, 57186, -27952, -52978, 54850, 92784, 78123, 71697, 79026, 133453, 193794, 178622, 95529, 15839, -16952, -9430]
10269i430L2949k5198K0057L3400J7099n909p3057n5836M7705j4614J8352J3755
10257g27K8112M767J0226k3362J2748J8757K608L2108m3789J54l5289J6572Q861
10244C1746j9633P306J1760L6654O2620N047p7450p630l76k45l1123o2861k5949
10231g0134L007N8850J8517R034O330k2698l7200j4000L5960L525N9708o087p6905
10218c2093k8007m162l2056j3397j4665K7287L6021O2303O038K980J257J5524
10206B7030J1575l8048j5490M1423o741J7822n3071k9162m019N7029k086n3570
10194d7308j2302K0031L4928L8174l6452j70r43o08L9666M3382n2387j6798L237
10181A2450l7021j8978K9134M9260P8451O7500M2800r817l2078o0613J7013M2596
$$ y = [-9430, 23519, -1679, 18378, 51778, 68877, 62968, -10089, -65925, -18220, -32834, -14482, -727, 27385, 32152, 42378, 19016, 31764, 50521, 53129, 85237, 41448, 41602, 6313, 22885, 31746, 12113, 19419, 31179, 67833, 130453, 135500, 58050, 50420, 50044, 49799, 18676, -44185, -70134, -67127, -8277, 10240, 19274, 25604, 2906, -34294, -48294, -12334, -8809, 50899, 44812, -32093, -60100, -64262, -96318, -109715, -124380, -97093, -61072, 1231, 7269, 10249, 11506, 27030, 38605, 557, -14933, 26490, 19749, 37571, -15500, -44662, -48681, 8348, 6262, -47308, -59610, -39579, -4651, 33523, -2929, -3099, -4042, -4650, 35016, 78398, 26011, 9213, 12450, -24571, -43549, -14415, 34845, 113296, 180796, 223596, 213779, 181701, 121088, 138101, 180697]
10169A80697P8583M4258J8903N7045K2714o765m0441k2149n089n3502k5659n9779
10157A88816K632N5045N3592Q0846N1372M4353N7921O193m4419j13155o5799l1645
10145B85752p8524M9644R9271L5946o7680L7190M063p3642l8250m0898q257L7807
10133B42422o138J1732j1988q0587l8993J0850j8879l4591m0022J3265O596m1788
10121A1879l3978N0430M7308m8858k6517P0931K7227j4270r266J3683j8011k2408
10109D8150n7513m854M4510M1448k5452m32p472m7022J0055J6122L2815K4315
10097G4670L051o807p1838l4971K9162J7617K2500j8843k9895k6906K9725O0336
10085D7801k6359k1512M858k1368n5010O212N7556L3199l3649l1903j8132K0943
$$ y = [180697, 259280, 303538, 322441, 379486, 402200, 395435, 354994, 332845, 327756, 274254, 248595, 188816, 191448, 246493, 300085, 380931, 432303, 476656, 534577, 540770, 496351, 383196, 317397, 285752, 207228, 256872, 356143, 392089, 324409, 361599, 365662, 292020, 253770, 212872, 204615, 242422, 236284, 248016, 236028, 155441, 116448, 127298, 108419, 73828, 33806, 47071, 53667, 11879, -22099, 28331, 75639, 26781, 264, 71195, 98422, 84152, 74886, 88569, 70558, 48150, -9363, -14217, 30293, 71741, 46289, 45857, 38385, -8637, 1418, 17540, 50355, 74670, 77721, 70914, -924, -35895, -6733, 10884, 33384, 14541, -15354, -42260, -12535, 47801, 21442, -70, 4788, -16580, -71590, -65378, -7822, 25377, -8272, -40175, -58307, -37364]
10073c7364Q5713J7992L474M9837o2272m7005K1319M0505j6286K1183K0457N5482
10061A53035N3717n8097j10469o5006J6282N9399Q0271J8301o560j2476n7664
10050G0733O451K4444Q724o9407J0197M110L6514M9105O052l2938k8888j366l7196
10037D6535n3713J6928l1146k2565M394K2941J0575k1109l654J2387J7063K3685
10025B2321k5092k3071P149K5318O9685l725R109M5185r887p0377k4809j1688
10013A0118J3227P3006R346o8109l8445m2821L596P254M1001J4009M9840J2449
10001H4471m3609o2960K6381j742m662K8080K2329J7459l8554k675R410l3025
9989I03K3218R140K9545r520P766l6864K380L3456q274o5006q127K4238O7535
$$ y = [-37364, 48349, 66341, 69815, 119652, 57380, 10375, 31694, 72199, 55913, 77096, 97553, 153035, 206752, 148655, 38186, -26820, -10538, 48861, 129132, 147433, 140873, 128397, 70733, 77184, 101628, 110352, 40945, 51142, 55252, 91766, 140871, 146923, 113985, 85097, 83731, 46535, -7178, 9750, -21396, -43961, -39567, -16626, -6051, -27160, -30814, -18427, -1364, 22321, -2771, -25842, -18693, 6625, 76310, 72585, 81694, 126879, 116992, 46615, 21806, 10118, 23345, 96351, 105697, 37588, -857, -43678, -40082, -32828, 8173, 22182, 72022, 84471, 40862, -22098, 4283, 2541, -2121, 25959, 48288, 65747, 27193, 24518, 33928, 903, 24121, 33261, 62806, 53286, 61052, 24188, 26568, 60024, 51750, -13256, -21383, 2855, 70390]
9976G0390p2700k1974O1903M0647m0363N523k3228o2700k9263P3138L4002l542
9964C1833K1652J8939K223o6259n3887R315P5089k6257n2528K2281L7508J5454
9952C5363l1460K6729O82k9986M807k0588K5632P5402M4050j7534j1528r0535
9940A1034j0637J0215k296Q291K5456J4161J4292M5450k2059j5736Q340N4697
9928A41208n048p8277r376M1489N52J3021j8789j374J0872K2884p8080n6222o922
9915b4062K6778Q713K3095M3495N897j8635j0414l1646L5981M572l3346l2399
9903a971j3438M1815k979k4830K8964m999k9569l5278J782l2225J2515L5110R917
9890a5186N1959M6013j3644p7718K0694K1709k5168j8020L0879M8083m844p291
$$ y = [70390, -2310, -24284, 37619, 78266, 37903, 43426, 20198, -42502, -71765, 1373, 35375, 31833, 53485, 72424, 74647, 8388, -45499, -36184, 38905, 12648, -39880, -17599, 19909, 35363, 3903, 30632, 31314, 1328, 6135, -14453, 11179, 86581, 130631, 113097, 101569, 11034, 397, 10612, 8316, 16607, 42063, 56224, 70516, 115966, 93907, 78171, 86511, 141208, 136160, 57883, 48507, 89996, 90548, 103569, 84780, 83406, 94278, 117162, 39082, -17140, -24062, 2716, 11429, 34524, 78019, 83916, 65281, 54867, 23221, 59202, 63774, 30428, -1971, -15409, 26406, 23427, -1403, 27561, 22562, -7007, -42285, -40503, -72728, -60213, -25103, -15186, 36773, 82786, 69142, -8576, 12118, 33827, 8659, -9361, 21518, 69601, 64757, 57466]
9878E7466p031m3715j7447k4517K4172m5002m4644L6749K3797L6030n600l5368
9866d5110M3253M3925N858m4698K4721n1343K0616P2685L8838n8460m3907J9541
9854B5919o863j8548J2410K2129j9016j2605l6174j9959n706L4758J6150q296
9842a5801k8758K2543P1005M1140m2670j2672O2153M8907k9703j2495K1800j383
9830A24066k4070o129K2941n4514O37N643m2913l3359J437K7856j8784p902j9361
9817b4452R880O0928j0387l9097M9629j9733m1225o5278M1101K6719J5222l5975
9805c2668q560J3633M605n6845k3306J2679R5491K1405j5258k1822N4084j007
9793D2431l8552m9357k409K2067N4161n052L5162k6475j5049O151J680L2566o932
$$ y = [57466, 50435, 6720, -10727, -35244, -11072, -56074, -100718, -63969, -40172, -4142, -9742, -45110, -1857, 42068, 47926, 3228, 27949, -23394, -2778, 69907, 108745, 50285, 6378, 25919, 19056, 508, 12918, 35047, 16031, 3426, -32748, -52707, -58413, -23655, -7505, -15801, -44559, -22016, 48989, 90129, 47459, 34787, 96940, 145847, 116144, 103649, 125449, 124066, 99996, 93867, 116808, 62294, 62931, 68574, 25661, -7698, -6261, 21595, 2811, -5091, -24452, -14572, 46356, 35969, -3128, 46501, 26768, -14457, -79735, -38634, -11915, 3307, -32668, -41228, -27595, -22990, -79835, -103141, -90462, 5029, 26434, 11176, -10646, 43438, 42431, 3879, -45478, -47887, -25820, 28341, 23289, 58451, 31976, 16927, 23078, 24758, 57324, 50392]
9780E0392J9388L4346o8904j04468k611L9962k9489J6612K1103j5963j640J3017
9768b8255n0518k4527Q2964M9634O8421Q793l3059o0189l5956k3426j6986O423
9756e6681j4908m723K6017L018P2339R474l9718n1533K820l520k3282K3887q21
9743e7631O542L7647l5901k0568N1617k2977o895O694O5001N2370m4234q6751
9731e5086Q673M8669l3482o82L3749j8699J3328J9026k5563p679k3570L2435N4230
9718D5349L220k3722j6588J8916K627J5733O3821m2869j01226J0607O0695j7867
9706A8696p1675K8672l8772J4690R876l034L3710M1061J2585l3828m184m4897
9694c7100o4118J60K3926O3816L8811o1735o7749j8084N9357L6390l239N1612
$$ y = [50392, 69780, 104126, 35222, -69246, -71857, -31895, -61384, -44772, -23669, -39632, -41272, -28255, -78773, -103300, -20336, 29298, 97719, 106512, 73453, 13264, -22692, -46118, -63104, -56681, -71589, -76312, -50295, -47277, 25062, 34536, -5182, -56715, -53895, -57415, -80697, -56810, -57631, -51089, -13442, -49343, -69911, -18294, -41271, -48166, -41472, 23529, 75899, 31665, -55086, -46413, 2256, -31226, -31908, 1841, -16858, -3530, 15496, -10067, -17746, -41316, -8881, 45349, 48569, 24847, 8259, 27175, 29802, 45535, 109356, 66487, -34739, -24132, 36563, 18696, -52979, -24307, -63079, -48389, -38513, -41547, -7837, 33224, 45809, 11981, 7797, -37100, -101218, -101058, -77132, -13316, 25495, -36240, -103989, -122073, -62716, -26326, -29565, 22047]
9682B2047M8803r259k9845J783J2537l1473M8478L4690l3056m4846j920J3522
9670C1461J5480L480m7565p109k5048k4389k4023J7602N298J4258k57j4803Q6280
9657C0665L4955m2827l3915k0301p7234j0783R427Q11M4273J363M794M528M0392
9644a3852M7156L5202j3096m8435K9577k3881M9737q888M9298N4160J8340n0677
9632A24641J5613m1039l0092J036j8440j2809k6239n7815J5073N065n8571L2102
9620e1475K9893l3365m0995L8849N3004O5694l8947k5842j0256L6525j2820q8173
9608g7908m7208J1285N1896K6933L6695O5995p511o2884k1269q826n5089K1291
9596f6600N3929k2791J6132M1391K7722O777j9337m3074j1039j3866j1332j8892
$$ y = [22047, 70850, 61591, 31746, 33529, 46066, 14593, 63071, 97761, 64705, 19859, 17939, 31461, 46941, 50421, 2856, -4253, -29301, -53690, -77713, -60111, -54813, -40555, -40812, -55615, 30665, 65620, 22793, -11122, -31423, -108657, -119440, -110013, -109202, -64929, -63566, -58772, -54244, -13852, 33304, 68506, 55410, 6975, 36552, 12671, 62408, 53520, 102818, 156978, 175318, 124641, 140254, 99215, 69123, 70159, 51719, 38910, 12671, -45144, -30071, -25006, -83577, -51475, -21582, -54947, -95942, -57093, -4089, 61605, 22658, -3184, -13440, 23085, 10265, -77908, -125116, -113831, -61935, -35002, 1693, 67688, 60177, -2707, -23976, -32802, -87891, -66600, -12671, -35462, -19330, 22061, 49783, 56560, 37223, -5851, -16890, -30756, -42088, -60980]
9584f0980j4510K9928K3825m07k4202k7486K3082N8678K6562j2142k7014n6709
9572f1375n351l4991J1415L6095L347m0780m2253P522K7481m7209p185R030M3095
9559a01159Q6387J6061l773k9283k3266K1004J5055R422L4544n8413l482Q7047
9547E0144M4504j1575k1565j2765j9024M884N6307m1062j8395k5119o0949k0105
9535g4720L5591L2386M0658Q689k8195n8088k3288q94l9490k830M2145J2442P5560
9522A9966N356o7194N800o3454j6059L9970L1385M0729k1112o664o9746Q633Q9738
9509b652J3791M2358N9173p4048n8110M903l4711J2836j0825L7249j2723J0148
9497a2611m1274J4075J5499J399K8694O857J17225N5116o8311n4609j6036p9415
$$ y = [-60980, -75490, -45562, -21737, -22144, -46346, -73832, -50750, 7928, 34490, 22348, -4666, -61375, -66726, -101717, -90302, -54207, -50860, -91640, -133893, -126371, -98890, -146099, -153284, -144254, -101159, -14772, 1289, -2484, -31767, -55033, -34029, -18974, -9552, 24992, -33421, -36903, 50144, 94648, 83073, 61508, 48743, 29719, 34603, 90910, 49848, 31453, 6334, -54615, -74720, -39129, -6743, 33915, 42604, 14409, -43679, -66967, -67861, -107351, -110181, -68036, -55594, 19966, 25322, -41872, -36072, -99526, -115585, -75615, -44230, -3501, -24613, -31277, -101023, -92390, -2652, 11139, 53497, 112670, 38622, -19488, -14585, -49296, -36460, -47285, -10036, -22759, -12611, -53885, -39810, -24311, -22912, 5782, 12639, 129864, 184980, 116669, 62060, 46024, -33391]
9485c3391j8322r202M0437P826l2662m816m1171j7808J4876R901L5795l7787k3968
9472a10292N1720M5661P2847L240K867j6984j7244K8178J8113L3362J6347K1546
9460A49361J9469J268m4414k7912L272R7873O5269J6174J7484Q3049J72772J36326
9448F89991P0505L8131j58404o4412L5250n1333q9485o5959o5759o4871k1688
9437B51966m872J7128P4722O5519Q6319J15290M2231M7413Q2324r637O10l5061
9425G33952m1205R888N962m5821l4352m0717k8651k3026m3718J0148L7627L4951
9413E75038K0436J56131J91092J89905K46343L93520L92001K35114j36781l77786
9403A885013m10042l35000k19385j71711j07288q610m6426O5178M2963L0947R917
$$ y = [-33391, -51713, -60915, -20478, -12652, -45314, -50130, -91301, -109109, -94233, -84332, -48537, -86324, -110292, -58572, -12911, 59936, 63176, 66043, 49059, 31815, 59993, 78106, 111468, 127815, 149361, 168830, 170098, 125684, 97772, 101044, 198917, 264186, 280360, 297844, 380893, 553665, 689991, 760496, 798627, 640223, 575811, 611061, 559728, 470243, 404284, 338525, 273654, 251966, 247094, 264222, 338944, 404463, 490782, 606072, 648303, 695716, 778040, 768403, 769013, 733952, 692747, 702635, 708597, 662776, 628424, 587707, 559056, 536030, 492312, 502460, 540087, 575038, 595474, 751605, 942697, 1132602, 1378945, 1772465, 2164466, 2399580, 2262799, 1885013, 1474971, 1139971, 920586, 748875, 641587, 632977, 586551, 651729, 694692, 725639, 735556]
9392G35556p1167p4948K7486N2226K8481N3920N1531K5946J083m0937p2960q899
9380G07318l5703j05128j33832q4072o9832M594j5062m4000j1227P0344N7310
9369C40710M0112J5061Q3037J44887J40729J2199r5292j31531j08983n4011l3014
9358C53904m7981n4722m2156l1262J9222k2283k6071l1443l7268k9165l1838J8940
9346C7877M634K7915J8604m5237m9657L7769N2899J8118J216k3697M1850R2461
9334B14752J03509J47864J45524K98616K43312M5894n1538k25727k11239j25667
9324E85300r8782j17916r3521j11714m0861M3330J9965k2359J7755N4794l9550
9313A96441l5026o7185J7396L5803J6914o3821r232M6669n4335o1840L1527J9334
$$ y = [735556, 664389, 589441, 616927, 669153, 697634, 751554, 803085, 829031, 830114, 789177, 716217, 707318, 671615, 566487, 432655, 348583, 278751, 283345, 268283, 224283, 213056, 283400, 340710, 380822, 395883, 478920, 623807, 764536, 776735, 681443, 549912, 440929, 386918, 353904, 305923, 251201, 209045, 177783, 197005, 174722, 148651, 117208, 79940, 50775, 18937, 37877, 42511, 70426, 89030, 43793, -5864, 31905, 84804, 102922, 104138, 80441, 122291, 214752, 318261, 466125, 611649, 910265, 1153577, 1199471, 1147933, 922206, 710967, 585300, 486518, 368602, 275081, 163367, 122506, 165836, 185801, 163442, 181197, 235991, 196441, 161415, 94230, 111626, 147429, 164343, 100522, 91290, 137959, 83624, 21784, 53311, 72645]
9301G2645m3250L153n69j0375J2864j6774M6158J1829N563K0408q24j9321n7895
9288B3612P6762K8189q6632Q405p131k0669j5310Mp453l0571K4625L0260n220
9275A8871L0959M095o105J8821n9318p6119J8722M3875M0457j4286j6057L8624
9263D2539j3155J0202L5286J6168J4122l4138n7935j5565k496L1499k9955J0504
9251G076N743k9705l572O4096P854j18011m1809J3310J6505N9607l4810J0404
9239d3312N8936n455l9976j629L205j2374L568Q0688R778m1698n0058o151M255
9226d0223J8503l196K1086K0112M776n4141k3305K100j970N2001O957J0080M7683
9213F0463l9322n175j5064m5373K1162K3486L8169K0351m9263j46166L2529N7094
$$ y = [72645, 29395, 32548, 31979, 21604, 34468, 17694, 63852, 75681, 81244, 101652, 100828, 81507, 23612, 100374, 128563, 41931, 50336, 43205, 22536, 7226, 7230, -223, -30794, -6169, 24091, 18871, 49830, 53925, 47820, 66641, 7323, -68796, -50074, -6199, 34258, 19972, 3915, 42539, 29384, 39586, 74872, 91040, 105162, 71024, 13089, -2476, -4972, 26527, -3428, 7076, 12819, -16886, -20458, 43638, 51492, -66519, -108328, -95018, -78513, -18906, -53716, -43312, 15624, 10169, -29807, -31436, -28231, -40605, -37037, 43651, 53429, 11731, -38327, -44478, -40223, -21720, -24916, -3830, 16282, 21058, -33083, -56388, -54288, -56258, -4257, 2700, 12780, 60463, 21141, 15966, 902, -44471, -23309, 177, 38346, 58697, 9434, -136732, -104203, -47109]
9201d7109J8037k5374l6523L5611M7038M822j4193j4079R476M9571Q1008R186
9189A17471l6927k9061l9122n4951j7554Q301q399K2877N7315J8199l2736l9189
9177c3776l0892J8399q942O1673J8166m2301K2609K4644o640J3702k8735p600
9165C07P0116L6036q252k3439J334J9836r7831o5907J1206L3682J7589J8844k5690
9152a2169k9445J2087K7640L084J7394r695m2035M6795L4397J8948k1021o0832
9140a4852J3868L5593k3748l559N6347j1707K203k44r7787K3425k0449J0264K813
9127b7833K6725L2933k3573n1485J6444J6648J8427Q346J2235J4130j2298J9077
9115D9776j218k2171k228L1597p804L612m5233j0263j4845l4638K829p117N680
$$ y = [-47109, -29072, -54446, -90969, -55358, -8320, -3498, -17691, -31770, -22294, 27277, 108285, 117471, 80544, 51483, 12361, -42590, -60144, -51843, -60242, -37365, 19950, 38149, 5413, -33776, -64668, -46269, -55211, 6462, 24628, -17673, 4936, 29580, 22940, 36642, 7907, 307, 70423, 106459, 98207, 74768, 76102, 95938, -1893, -67800, -56594, -22912, -5323, 13521, -12169, -41614, -29527, -1887, 1197, 18591, 8896, -33139, 13656, 48053, 67001, 45980, -14852, -984, 34609, 10861, 7302, 63649, 51942, 54145, 53901, -43886, -20461, -40910, -30646, -27833, -1108, 31825, 8252, -43233, -26789, -10141, 8286, 16632, 28867, 42997, 30699, 49776, 48558, 26387, 24159, 55756, 47952, 51564, 6331, -3932, -18777, -53415, -50586, -57703, -52023]
9102e2023P7195M6260J5079J4966l0917l7778j8970L3063K9806l4017n2332J0003
9090C35M5980j2848o3786M6705M4606k5320m1880r202K2447j7197K8897J3486
9078C2223k8656n2243N161N6273L0279k565l2911o0293l0253N3626R330J2613
9066g416L5508R502n3960p3086n3931M8743R4083M9458L4246J7088j634k8651
9054F9950k0630l9144m0227j9372L8294O2965n1225J0880K7805k8828k0414j6947
9042b6893J5731J5255k0769k4931J8482N5167L4456l4141m953K9572j9157l2635
9030E184j3533M3885O6622K766j7562m3499l8098Q076J3101K3319o502J9192k4836
9017C8115k3505K4588p409J9975l750k2445m0267N5632L4415l3749q842q217j2696
$$ y = [-52023, 25172, 71432, 86511, 101477, 70560, 32782, 13812, 46875, 76681, 42664, -9668, 335, 46315, 33467, -30319, 16386, 60992, 35672, -6208, -15410, 7037, -10160, 18737, 32223, 3567, -48676, -43515, 12758, 43037, 40472, 7561, -52732, -82985, -29359, -20029, -7416, 28092, 37594, -16366, -89452, -143383, -94640, -557, 48901, 83147, 100235, 98601, 69950, 49320, 10176, -30051, -49423, -11129, 51836, 611, 11491, 39296, 10468, -9946, -26893, -11162, 4093, -16676, -41607, -23125, 32042, 66498, 32357, 27404, 56976, 37819, 5184, -8349, 35536, 102158, 104924, 87362, 43863, 5765, 13841, 26942, 50261, 43759, 62951, 38115, 14610, 39198, 31789, 51764, 48014, 25569, -14698, 40934, 75349, 41600, 32758, 24541, 11845]
9004A1845p9428K869P3476j042P575P146P683m357m5370j628L3832k2219l1783
8991d1401k5719L458p672M1035N0337J2994p2548k2364M9975M6271J8080N0558
8979A03004j7685j771o4785p7099J4317p01l2171j3957p973J934M3566J7454k8399
8966f4266k6682l8224Q262N7525J1714N6331L2746o209m960L4510o7460n2200
8954e8913M7621O825K0639l3662J1091N105j052j2725J1584K12N2861k6362n8511
8941c5287J1139K1826L9490J9839k624l0576j2259p308q725j9018j9560l3411
8929g6474K5397Q8495N149r480n7318m8997J0989k8488L4085M1161k8849J1498
8917c2832J9598K1781m3479j7944J3621O077l7915M2184N3811m4576n1122K8612
$$ y = [11845, -67583, -64714, 8762, 7720, 15295, 22441, 30124, 25767, -19603, -21231, 12601, -9618, -41401, -67120, -63662, -71334, -30299, 20038, 33032, -39516, -61880, -11905, 34366, 52446, 103004, 85319, 83548, 18763, -58336, -44019, -44720, -76891, -90848, -98821, -96887, -53321, -35867, -64266, -90948, -129172, -120910, -63385, -51671, 4660, 37406, 31197, 26237, 60747, -6713, -58913, -11292, -4467, 16172, -17490, -6399, -1294, -2346, -15071, -3487, -3275, 49586, 23224, -35287, -24148, -2322, 37168, 57007, 54383, 23807, 11548, 4240, -4485, -23503, -43063, -76474, -51077, 37418, 42567, 33087, -24231, -73228, -62239, -90727, -56642, -15481, -44330, -32832, -13234, 8547, -34932, -52876, -39255, -33178, -71093, -28909, 24902, -19674, -70796, -42184]
8905d2184J11169N3107n0508m1824j2150j8743m0744N9656N9527n3341j1800M7560
8893E9725L268n824k7015o8725k6675O0132J480N2585L8147J7567j9037k0009
8881F5619l8111M6449P1640O3464M1988o84M481J0294n3560k9771l1839l4310
8869A15660n576j9872J708J229j8767j2118M0438n2107n0582K598K245N1882m4680
8856A2058n5738K0016O4431k1215L8169K0234K5818p5225o2728m8400J7130N3945
8844a1505J7102j3424N561M5710P6949N9894Q4576M8633r826q07k7825j5065m5703
8831B14270r8801j7242L0423k95o7212l9655J8142p944p724k9178J5548j6931
8819f599n4085k4496J4281R775j647J4463P7038l5967K6846p280m4702K0952K1181
$$ y = [-42184, 68985, 122092, 71584, 29760, 17610, -1133, -41877, 17779, 77306, 23965, 12165, 59725, 62993, 57169, 30154, -38571, -65246, -5114, -3634, 48951, 87098, 104665, 85628, 65619, 27508, 73957, 145597, 209061, 251049, 250365, 254846, 265140, 211580, 181809, 149970, 115660, 110084, 90212, 91920, 93149, 74382, 62264, 102702, 50595, 13, 2611, 4856, 56738, 12058, -43680, -23664, 40767, 19552, 57721, 77955, 103773, 28548, -34180, -82580, -65450, -11505, 5597, -7827, -2266, 43444, 120393, 180287, 264863, 313496, 303670, 302863, 275038, 259973, 214270, 115469, 98227, 128650, 128355, 61143, 21488, 39630, 31686, 23962, -5216, 10332, -6599, -60684, -85180, -70899, -61124, -62771, -48308, 28730, -7237, 19609, 12329, -32373, -11421, 9760]
8806I760k8613J0225L8088L2370J3273o140L7278n5394o2589p197L1305J9287
8794C1653j9327K0946p521q1223j9558j027O3926l886J0910K269J0435q5166n5779
8781a33348L2444J282L4197L8296P480K5099N5913J52K3782r073k6471J7617K9149
8768I6519K779q7161r5231M815M2797J9271K304l80J1763K3403M3190P2792R646
8755A46507q9429l0922K6428O266R982o6934o7499j9550N996K8433L0871J6790
8743c061q507j3974k7021J2620O5845J4806j6091l9550k9042M7254k403K473K2805
8730B6154j1776J9082j4947j1734p035l8087L2741L0399j2993k4245K2585K6086
8718C6230p190p4195j5342K6052K0214l7229K1692j8571N1809L5427j5484j3697
$$ y = [9760, -18853, -8628, 29460, 61830, 75103, 68963, 106241, 50847, -11742, -18939, 12366, 31653, 12326, 33272, 25751, -55472, -75030, -76057, -12131, -16017, -5107, -2838, 7597, -77569, -133348, -100904, -99622, -65425, -27129, -19649, 5450, 61363, 61515, 85297, 76224, 49753, 67370, 96519, 99298, 12137, -83094, -78279, -35482, -16211, -13907, -14287, -2524, 20879, 64069, 136861, 146507, 57078, 26156, 52584, 58850, 68832, 1898, -65601, -85151, -79155, -50722, -19851, -3061, -11568, -25542, -52563, -39943, 25902, 40708, 24617, -14933, -43975, 3279, 876, 3349, 26154, 14378, 33460, 18513, 6779, -256, -38343, -5602, 24797, 11804, -12441, 10144, 36230, 29040, -45155, -60497, -34445, -14231, -51460, -29768, -48339, 3470, 38897, 23413, 9716]
8706I716q856m9773k651Q439P915n510j348m8146J3060J4044P4238N8075j4284
8693E4919p4445k0486r298m394N0847K5556n004M018n2734p643M615K2838k537
8680a3748l6791l3190n8992k7458M7626K9397J6705j3648Q674L2195L6594m329
8668a6965K624j5955n319M235m766J0477j6962p691p814J6774L4960j606N8502
8655E0494K9744M9938k9304k26J8754l947J1056J7511k2200p6072M6588K3220
8643A15556m4756n8119k7095j1258M265n3073L109L9302j267j7238j537p120K2492
8630c6739L5796K3227r568J3480M2455K4558J9525J993r470J4650J731l1238n9132
8617C1268L1538J9027Q469M7280k5798m6047n9374N8778J0102M563K7399N4012
$$ y = [9716, 860, -48913, -51564, -43125, -35210, -40720, -42068, -90214, -77154, -63110, 11128, 69203, 54919, -19526, -40012, -49310, -53704, -2857, 22699, 17695, 21713, -31021, -38664, -34049, -11211, -13748, -50539, -83729, -142721, -170179, -122553, -93156, -76451, -90099, -81425, -49230, -12636, -16965, -14341, -30296, -35615, -31380, -36146, -25669, -42631, -50322, -58136, -41362, -6402, -8008, 50494, 80238, 130176, 100872, 100646, 119400, 115453, 126509, 144020, 121820, 45748, 92336, 115556, 70800, 12681, -14414, -25672, -21407, -74480, -71371, -32069, -33336, -50574, -52111, -59231, -36739, -943, 22284, 12716, 26196, 68651, 93209, 112734, 114727, 105257, 119907, 121638, 90400, 31268, 62806, 81833, 90302, 137582, 111784, 65737, 6363, 65141, 75243, 79806, 107205, 161217]
8605A61217k392r490K5804P3555k1464m0609J1048J1167j359k1258N519l1681
8593A60057r118R93l920N8787M9716k0212l9374o2962l3461Q129k7187L154L6267
8580A20869j2781j5928j6564J2598k363n7121l3973K3049r504K4339M759K8592
8568F5972j4039l582k3231L4402k4157k2435K7004K6818N4118J6866k0311j5583
8556A01842l41j2742k1673j0829l0739J7205L7577L560m0029l3030J5119O857
8544C2777p5945k5636O9275l9874k8979L5590O929P6393J5459o1577M263k8637
8532a9962K4227Q7143M7570o1251n5863j1454o7538k3176R3877O3521j333l3178
8520D2583j6146L5649k6179o414l2581N3723O9467m4510j02410p1778o994P255
$$ y = [161217, 158825, 149335, 175139, 248694, 227230, 186621, 197669, 208836, 207477, 186219, 191738, 160057, 150939, 151932, 148012, 206799, 256515, 236303, 196929, 133967, 100506, 108635, 81448, 84602, 120869, 108088, 92160, 75596, 88194, 85831, 28710, -5263, 17786, 8282, 32621, 37380, 65972, 51933, 48351, 25120, 59522, 35365, 12930, 39934, 66752, 120870, 137736, 117425, 101842, 101501, 88759, 67086, 56257, 25518, 42723, 80300, 83860, 43831, 10801, 25920, 32777, -43168, -68804, 471, -39403, -68382, -32792, -25863, 50530, 65989, 4412, 8675, -19962, 4265, 91408, 138978, 77727, 21864, 10410, -57128, -80304, 13573, 77094, 75761, 42583, 26437, 62086, 35907, 29493, -3088, 50635, 120102, 75592, -26818, -98596, -105590, -98335]
8508i8335O8187M6880k1863R749K7554m8276m2263L4221j4896k6074N4947K5822
8496A5653K3517k8852l2226N7926j7891M35r796P5347M3966p2473o5922J0060
8484b56J015l6548O208K6863P201J3598o3485m3705L8789M1776L0798o432j4236
8471A586O7552N9278q18m2718j11332k5749N6175R1894K8569l3560j9318L1440
8459A02999j2872J0456k9467n05K7600N431M4199L0983p0623o5134k1036J3504
8447C5535J3856M957l3835k2975K8065N3981K7013k4783p4773l8816M5570J1286
8435B5081m0730l7928N785L6491L0773n595j3991Q743O12j1371J7242J4019L0415
8422E9546q333l3945L5157n8924m607N6683O377l168J0152n970n1250n7442M0380
$$ y = [-98335, -30148, 16732, -5131, 4618, 32172, -16104, -58367, -24146, -39042, -65116, -10169, 15653, 39170, 10318, -21908, 36018, 18127, 18562, 8766, 84113, 128079, 55606, -10316, -256, 759, -35789, -29581, -2718, 4483, 18081, -45404, -89109, -50320, -8544, 22254, 15822, 1586, 69138, 128416, 127598, 84880, -26452, -52201, 3974, 95868, 124437, 90877, 71559, 102999, 90127, 100583, 71116, 70611, 98211, 103642, 147841, 178824, 108201, 43067, 22031, 35535, 49391, 54348, 20513, -2462, 25603, 79584, 106597, 81814, 7041, -31775, 13795, 25081, -15649, -53577, -47792, -11301, 19472, 13877, -114, 8629, 9241, -2130, 15112, 29131, 59546, 51213, 17268, 52425, -6499, -11106, 45577, 51954, 48786, 58938, 52968, 1718, -55724, -15344]
8409a5344O1388J1466q682n556q91j6643K0859L4702L4424r388l4246m9936k2988
8396h35n045K7391M0438j9977p228k144m563k5986k0044l5207l71P6437O8674
8383I1540K8867p2030l978J0385k1942Q0398q003r5360n4959k3307J5246J7375
8371c5768M0206J8842J6301K2448J4253m2420j10626N708J10676J1299m9584j3018
8359a1683l4318J7325L2269l5282j6315R776j7339Q454O2098L979J3616N4250
8347H6830J25158m047K8860J2378j1972p1816q3915o0429m4770O811K0931K914
8335F933P066k4323j0113J1688L7429k0931p583p693k3982j6016j4313J8102L4170
8322i566j3806K914k5848K7826R084m6038j6345K3188L3466M7664j8758m7685
$$ y = [-15344, 46044, 57510, 48828, 43272, 42381, 25738, 46597, 81299, 115723, 106335, 72089, 22153, -835, -5880, 21511, 61949, 41972, 34744, 32600, 28037, 2051, -17993, -53200, -53571, 22866, 91540, 120407, 48377, 44399, 54784, 32842, 113240, 105237, 9877, -45082, -68389, -53143, -35768, 4438, 23280, 39581, 62029, 76282, 33862, -76764, -71056, 39620, 50919, 1335, -11683, -46001, -28676, 3593, -31689, -48004, -38228, -55567, -47113, 14985, 18964, 32580, 86830, 211988, 207941, 236801, 249179, 237207, 165391, 81476, 21047, -23723, -16912, 4019, 6933, 13999, -10324, -20437, -8749, 28680, 7749, 166, -7527, -31509, -47525, -61838, -43736, -9566, -23372, -20458, -46306, -18480, -9396, -55434, -71779, -48591, -15125, 32539, 13781, -33904]
8310c3904j5296K106N9982M5370R549p041L2242P9523J25199J34297O9461n1961
8298D49527j21295m6650l7624p2592l2462j9142m6464j6524n5627l9566k9881
8287f8300M8160N9311R498n4073K0902o660m1620j3559M7838M6429J7145o432
8275E8639j6982J5379M119k0261p9614n3411m3604k187N3594Q3069L5487R227
8263D3455O7791N7084k9337o884J5444J7560L2399N8130J1067L675p2768k5688
8251A71928j0923n0645n2360j3258K2729J1260k7354j3026m3141J9727n694N1889
8239F1132q409o7239P556o4584j4371L1744K4450L7535l3092L0777M2588k9507
8227A8580q3447N627N6055P714Q1188N9686L1867l7095k2004k5014k2283l0662
$$ y = [-33904, -49200, -47094, 12888, 58258, 67807, 60766, 93008, 172531, 297730, 432027, 501488, 449527, 328232, 281582, 243958, 171366, 138904, 119762, 73298, 56774, 1147, -38419, -68300, -20140, 39171, 48669, -5404, 15498, 8838, -32782, -46341, 1497, 47926, 65071, 58639, 41657, 57036, 61155, 40894, -38720, -92131, -135735, -137922, -84328, -1259, 34228, 43455, 111246, 168330, 138993, 132109, 147553, 165113, 197512, 255642, 266709, 270384, 197616, 171928, 161005, 110360, 58000, 44742, 67471, 78731, 51377, 38351, -4790, 14937, 9243, 61132, 52723, -14516, -6960, -71544, -85915, -54171, -29721, 7814, -25278, 5499, 48087, 18580, -64867, -59240, -3185, 4529, 85717, 145403, 177270, 140175, 118171, 93157, 70874, 40212]
8215D0212p4020k7973K3064K544k2864j1957K1099k3801l0905K7723Q0078K0206
8203B3406N4n369k6899R108l0200l1579M5661N3736K6162l1524k4781j5805k6124
8190c4154M0640M334J8741o792J9748k5726m7639J1940L963j2068m379K068L2945
8177C621M3297J5338j3128j1757J8606M5943M929m7132J7745N272m388o5074k8354
8164a5082J6584J7986L0957K317K333K1568K7366j5383j1340m7995q5247L562
8152e2374M4784K798J136J9648j9795j368k9645L81l845K7454L4168L3633J3564
8139G0539l9810l6615j3636l3445o0121O8916N4650o5649l0213M3147l41O45J7133
$$ y = [40212, -33808, -61781, -38717, -36173, -59037, -70994, -49895, -73696, -104601, -76878, 3200, 23406, 23460, 18091, -8808, 300, -29900, -61479, -15818, 37918, 64080, 32556, 7775, -8030, -34154, 6486, 10820, 29561, 22769, 42517, 16791, -30848, -18908, -14945, -27013, -31392, -29324, 3621, 46918, 62256, 49128, 37371, 55977, 101920, 106849, 59717, 77462, 82734, 78346, 13272, -15082, 1502, 19488, 50445, 52762, 55095, 76663, 104029, 88646, 77306, 29311, -55936, -52374, -7590, -4792, -3656, 15992, -3803, -5171, -34816, -34435, -38280, -10826, 23342, 56975, 70539, 30729, -5886, -19522, -52967, -113088, -44172, 10478, -55171, -85384, -42237, -42578, -41933, -24800]
$$ [...]
##END NTUPLES=NMR SPECTRUM
##END=
