##TITLE=Analysis number 311867
Compound Code cc 44022
Book Reference 413/176
Project Code adrs
Chemist Name stevem
##JCAMPDX= 6.0         $$ Bruker NMR JCAMP-DX V2.0
##DATA TYPE= NMR SPECTRUM
##DATA CLASS= NTUPLES
##ORIGIN= Bruker BioSpin GmbH
##OWNER= NMR
$$ XWIN-NMR		Version 3.5
$$ Mon Jul 18 15:31:35 2005 GMT Daylight Time (UT+1h)  MAYBRIDGE\NMR@NMR_250MHZ
##.OBSERVE FREQUENCY= 250.131544655141
##.OBSERVE NUCLEUS= ^1H
##.ACQUISITION MODE= SIMULTANEOUS (DQD)
##.ACQUISITION SCHEME= undefined
##.AVERAGES= 16
##.DIGITISER RES= 18
##SPECTROMETER/DATA SYSTEM= dpx250
##.PULSE SEQUENCE= zg30
##.SOLVENT NAME= CDCl3
##.SHIFT REFERENCE= (INTERNAL, CDCl3, 0, 16.522)
##AUDIT TRAIL= $$ (NUMBER, WHEN, WHO, WHERE, WHAT)
$$ ##TITLE= Audit trail, XWIN-NMR		Version 3.5
$$ ##JCAMPDX= 5.01
$$ ##ORIGIN= Bruker BioSpin GmbH
$$ ##OWNER= NMR
$$ C:\u/data/dgb/nmr/ADRS/5970/pdata/1/auditp.txt
$$ ##AUDIT TRAIL=  $$ (NUMBER, WHEN, WHO, WHERE, WHAT)
(   1,<2005-07-18 15:31:16.79 +100>,<MAYBRIDGE\NMR>,<NMR_250MHZ>,
      <created by zg, POWCHK disabled, PULCHK disabled
       configuration hash MD5:
       62 19 C7 07 E1 42 D1 B7 37 6C 3D D0 77 39 F9 E6
       data hash MD5: 64K
       18 1E 7A AF 6B 02 74 8B A5 A8 E7 0E 20 68 8C 46>)
(   2,<2005-07-18 15:31:28.08 +100>,<MAYBRIDGE\NMR>,<NMR_250MHZ>,
      <Start of raw data processing
       ef LB = 0.3 FT_mod = 6 PKNL = 1 SI = 32K 
       data hash MD5: 32K
       3A 53 E2 21 4C 83 4B 05 10 54 CA 2A 20 7C C3 34>)
(   3,<2005-07-18 15:31:29.93 +100>,<MAYBRIDGE\NMR>,<NMR_250MHZ>,
      <apk 
       data hash MD5: 32K
       3F FD 48 A8 F8 1D 79 CC CE 31 FE BD C1 73 AF 66>)
(   4,<2005-07-18 15:31:30.63 +100>,<MAYBRIDGE\NMR>,<NMR_250MHZ>,
      <abs ABSG = 5 
       data hash MD5: 32K
       8A D5 3A E4 A1 C5 9F 32 05 2D B2 50 0F 3B D2 40>)
$$ ##END=
$$ 
$$ hash MD5
$$ EA 80 49 09 DD F1 96 0D ED F8 33 5F FA 1D EE 6A
##$RELAX= 
##$RELAX= 
##$RELAX= 
##$RELAX= 
##$RELAX= 
##$RELAX= 
##$RELAX= 
$$ Bruker specific parameters
$$ --------------------------
##$DU= <C:\u>
##$EXPNO= 5970
##$NAME= <ADRS>
##$PROCNO= 1
##$TYPE= <nmr>
##$USER= <dgb>
##$AMP= (0..31)
100 100 100 100 100 100 100 100 100 100 100 100 100 100 100 100 100 100 
100 100 100 100 100 100 100 100 100 100 100 100 100 100 
##$AQSEQ= 0
##$AQ_mod= 3
##$AUNM= <au_zg>
##$AUTOPOS= <39 >
##$BF1= 250.13
##$BF2= 250.13
##$BF3= 250.13
##$BF4= 250.13
##$BF5= 500.13
##$BF6= 500.13
##$BF7= 500.13
##$BF8= 500.13
##$BYTORDA= 1
##$CFDGTYP= 0
##$CFRGTYP= 5
##$CHEMSTR= <none>
##$CNST= (0..31)
1 1 145 1 1 1 1 1 1 1 1 1 1 1 1 1 1 1 1 1 1 1 1 1 1 1 1 1 1 1 1 1 
##$CPDPRG= <>
##$CPDPRG1= <>
##$CPDPRG2= <>
##$CPDPRG3= <>
##$CPDPRG4= <mlev>
##$CPDPRG5= <mlev>
##$CPDPRG6= <mlev>
##$CPDPRG7= <mlev>
##$CPDPRG8= <mlev>
##$CPDPRGB= <>
##$CPDPRGT= <>
##$D= (0..31)
0 1 0 0 0 0 0 0 0 0.06 0 0 0 0 0 0 0.0002 0 0 0 0 0 0 0 0 0 0 0 0 0 0 
0 
##$DATE= 1121697075
##$DBL= (0..7)
120 120 120 120 120 120 120 120 
##$DBP= (0..7)
150 150 150 150 150 150 150 150 
##$DBP07= 0
##$DBPNAM0= <>
##$DBPNAM1= <>
$$ [...]
##$SUBNAM7= <"">
##$SUBNAM8= <"">
##$SUBNAM9= <"">
##$SW= 20.6930455092707
##$SWIBOX= (0..15)
0 0 3 0 0 0 0 0 0 0 0 0 0 0 0 0 
##$SW_h= 5175.983436853
##$TD= 65536
##$TD0= 1
##$TE= 295.16
##$TE2= 300
##$TE3= 300
##$TEG= 300
##$TL= (0..7)
0 120 120 120 120 120 120 120 
##$TP= (0..7)
150 150 150 150 150 150 150 150 
##$TP07= 0
##$TPNAME0= <>
##$TPNAME1= <>
##$TPNAME2= <>
##$TPNAME3= <>
##$TPNAME4= <>
##$TPNAME5= <>
##$TPNAME6= <>
##$TPNAME7= <>
##$TPOAL= (0..7)
0.5 0.5 0.5 0.5 0.5 0.5 0.5 0.5 
##$TPOFFS= (0..7)
0 0 0 0 0 0 0 0 
##$TUNHIN= 0
##$TUNHOUT= 0
##$TUNXOUT= 0
##$USERA1= <user>
##$USERA2= <user>
##$USERA3= <user>
##$USERA4= <user>
##$USERA5= <user>
##$V9= 5
##$VALIST= <valist>
##$VCLIST= <CCCCCCCCCCCCCCC>
##$VD= 0
##$VDLIST= <DDDDDDDDDDDDDDD>
##$VPLIST= <PPPPPPPPPPPPPPP>
##$VTLIST= <TTTTTTTTTTTTTTT>
##$WBST= 1024
##$WBSW= 4
##$XGAIN= (0..3)
0 0 0 0 
##$XL= 0
##$YL= 0
##$YMAX_a= 431304
##$YMIN_a= -526970
##$ZGOPTNS= <>
##$ZL1= 120
##$ZL2= 120
##$ZL3= 120
##$ZL4= 120
##$ABSF1= 16.522
##$ABSF2= -4.171173
##$ABSG= 5
##$ABSL= 3
##$ALPHA= 0
##$AQORDER= 0
##$ASSFAC= 0
##$ASSFACI= 0
##$ASSFACX= 0
##$ASSWID= 0
##$AUNMP= <proc_1d>
##$AZFE= 0.1
##$AZFW= 0.1
##$BCFW= 0
##$BC_mod= 0
##$BYTORDP= 0
##$COROFFS= 0
##$CY= 12.5
##$DATMOD= 1
##$DC= 0
##$DFILT= <>
##$DTYPP= 0
##$F1P= 14.0000005364418
##$F2P= -0.99999901652339
##$FCOR= 0.5
##$FTSIZE= 32768
##$FT_mod= 6
##$GAMMA= 0
##$GB= 0
##$INTBC= 1
##$INTSCL= 1
##$ISEN= 128
##$LB= 0.3
##$LEV0= 0
##$LPBIN= 0
##$MAXI= 10000
##$MC2= 0
##$MEAN= 0
##$ME_mod= 0
##$MI= 0
##$NCOEF= 0
##$NC_proc= -3
##$NLEV= 6
##$NOISF1= 0
##$NOISF2= 0
##$NSP= 0
##$NTH_PI= 0
##$NZP= 0
##$OFFSET= 16.522
##$PC= 1
##$PHC0= -82.61785
##$PHC1= 12.99256
##$PH_mod= 1
##$PKNL= yes
##$PPARMOD= 0
##$PSCAL= 4
##$PSIGN= 0
##$REVERSE= no
##$SF= 250.13
##$SI= 32768
##$SIGF1= 0
##$SIGF2= 0
##$SINO= 400
##$SIOLD= 32768
##$SREGLST= <1H.CDCl3>
##$SSB= 0
##$STSI= 32768
##$STSR= 0
##$SW_p= 5175.98343685301
##$SYMM= 0
##$S_DEV= 0
##$TDeff= 65536
##$TDoff= 0
##$TI= <Analysis number 999999
Compound Code 99
Book Reference 9
Project Code 9>
##$TILT= no
##$TM1= 0
##$TM2= 0
##$TOPLEV= 0
##$USERP1= <user>
##$USERP2= <user>
##$USERP3= <user>
##$USERP4= <user>
##$USERP5= <user>
##$WDW= 1
##$XDIM= 32768
##$YMAX_p= 476160362
##$YMIN_p= -108513
$$ End of Bruker specific parameters
$$ ---------------------------------
##NTUPLES= NMR SPECTRUM
##VAR_NAME=  FREQUENCY,     SPECTRUM/REAL,   SPECTRUM/IMAG
##SYMBOL=    X,             R,               I
##VAR_TYPE=  INDEPENDENT,   DEPENDENT,       DEPENDENT
##VAR_FORM=  AFFN,          ASDF,            ASDF
##VAR_DIM=   32768,         32768,           32768
##UNITS=     HZ,            ARBITRARY UNITS, ARBITRARY UNITS
##FACTOR=    0.157963299565203, 1,           1
##FIRST=     4132.6476996994, 0,             0
##LAST=      -1043.33573715361, 0,           0
##MIN=       -1043.33573715361, -108513,     0
##MAX=       4132.6476996994, 476160362,     0
$$ Real data points
##PAGE= N=1
##DATA TABLE= (X++(R..R)), XYDATA
$$ [...]
18700A32051k4447K2139J1034L0381j4378O14j646J9415J8622k2159j3247K181
$$ 132051 107604 129743 140777 171158 156780 157394 155748 175163 193785 171626 158379 160560
18688A60560J7067L519j5254j4144J1290Q414k0256M851K048K1732K2558p864
$$ 160560 177627 181146 165892 151748 163038 171452 151196 156047 158095 179827 202385 194521
18676A94521j1649K888j0110j5435K052K3378K8029j3108R306N957j2956j7970
$$ 194521 182872 185760 175650 160215 162267 185645 213674 200566 209872 215829 202873 184903
18664A84903m150M589M570J086L084k1745j0174j1565N124M3199L4735K0204j8006
$$ 184903 180753 185342 189912 190998 194082 172337 162163 150598 155722 198921 233656 253860 235854
18651B35854m0949m0005n256J6390l947L709r490k7973j5356L7334L5344r515
$$ 235854 194905 154900 149644 166034 162087 165796 156306 128333 112977 150311 185655 176140
18639A76140K4348K0065R06j3054k252j7947k9051o048L3769K1014L3139N4720
$$ 176140 200488 220553 221459 208405 206153 188206 159155 153107 186876 207890 241029 295749
18627B95749L0766k2291k997j1072j0803k0347P702J9851J868J4455J9204J0356
$$ 295749 326515 304224 301227 290155 279352 259005 266707 286558 288426 302881 322085 332441
18615C32441j0975L198J9865L341J4409J2358p142j5257P125l6105m9793k412
$$ 332441 321466 324664 344529 347870 362279 374637 367495 352238 359363 323258 273465 271053
18603B71053K2863k4426l0921J8543J4428R255M367n974J7713J7657O425n382
$$ 271053 293916 269490 238569 257112 271540 280795 285162 279188 296901 314558 320983 315601
18591C15601L6257n813J8783K9879n227k9548r34J2275j8630L156R525K347M3820
$$ 315601 351858 346045 364828 394707 389480 359932 358998 371273 352643 355799 365324 367671 411491
18578D11491M1349J06k0555J2298J6843J2684k513l885Q494K6426J8526M415j1179
$$ 411491 452840 452946 432391 444689 461532 474216 471703 467818 476312 502738 521264 525679 514500
18565E14500J2724L6241K8896P158p185j440p435q177n654J8620kP241L5969K0058
$$ 514500 527224 563465 592361 599519 592334 590894 583459 575282 569628 588248 588246 595487 631456 651514
18551F51514J3426J3628R780K7201M2556P0070N5208K8995J8618O2333Q8353P4388
$$ 651514 664940 678568 688348 715549 758105 828175 883383 912378 930996 993329 1081682 1156070
18539A156070P9977Q7580P4611N7606N3099j2948k821M588L0296N7040P8429J12754
$$ 1156070 1236047 1323627 1398238 1455844 1508943 1495995 1493174 1497762 1528058 1585098 1663527 1776281
18527A776281J71940K03037K29836K57863K50569K36913K07141J42051J23141
$$ 1776281 1948221 2151258 2381094 2638957 2889526 3126439 3333580 3475631 3598772
18518C598772R8239M6022P6190J59559K22536L33061M14863N07486O24710P68597
$$ 3598772 3697011 3743033 3819223 3978782 4201318 4534379 4949242 5456728 6081438 6850035
18508F850035Q81995J067104J243425J511677J965187K613887L574248M891316
$$ 6850035 7732030 8799134 10042559 11554236 13519423 16133310 19707558 24598874
18500B4598874O412777Q207243J0509553J2615799J2172524P338787k196731j3186684
$$ 24598874 31011651 39218894 49728447 62344246 74516770 81855557 79658826 66472142
18492F6472142j7207422j2629649o377590k212773M54287K618398M662066O673549
$$ 66472142 49264720 36635071 30257481 28044708 28498995 31117393 35779459 42453008
18484D2453008Q972045J1397384J1773584P932038n98715j2198865j8728412j5902133
$$ 42453008 51425053 62822437 74596021 82528059 81929344 69730479 51002067 35099934
18476C5099934r685954n441992l176937j925740j203686q80301q51234q44614
$$ 35099934 25413980 19971988 16795051 14869311 13665625 12785324 11934090 11089476
18468A1089476q57817p90154o85511n39252m34576l40655k94265k30701j26599
$$ 11089476 10231659 9441505 8755994 8216742 7782166 7441511 7147246 6916545 6789946
18459F789946n2285K4237L5395j06292k77967l86978m20446m60286l94188l45132
$$ 6789946 6737661 6761898 6797293 6691001 6413034 6026056 5605610 5145324 4751136 4406004
18449D406004l38584l66691l30933k88706k51014k13014j62525j27101j04314
$$ 4406004 4067420 3700729 3369796 3081090 2830076 2617062 2454537 2327436 2223122
18440B223122r6826q9737o2581m4159p1255j20120j42969j34706j40048j10832
$$ 2223122 2126296 2036559 1973978 1929819 1858564 1738444 1595475 1460769 1320721 1209889
18430A209889r1348r2053n9630p0588o1624k9242j1862k8168o3265n0368o1772
$$ 1209889 1118541 1026488 966858 896270 834646 805404 793542 765374 702109 651741 589969
18419E89969m0868n0717m8130O78j7529m4889n1436n4003k9131j4698N432r853
$$ 589969 549101 498384 450254 450932 433403 388514 337078 283075 253944 239246 244678 234825
18407B34825p699l0900j3443j3131k1593p243j6994r76J6583j7679k0199K7089
$$ 234825 227126 196226 182783 169652 148059 140816 123822 122846 139429 121750 101551 128640
18395A28640L116j5487k8145j3393L335K1290p6k9829j0345k8041q291J2910J2357
$$ 128640 131756 116269 88124 74731 78066 99356 99280 69451 59106 31065 22774 35684 48041
18382D8041k6298M886k3633j3661L3444K3509J6908M0634L2701J9333k2553j8267
$$ 48041 21743 26629 2996 -10665 22779 46288 63196 103830 136531 155864 133311 115044
18370A15044j0914k3106k760J245J549O803j2796J9696K5551K0422o740p327R458
$$ 115044 104130 81024 78264 79509 81058 87861 75065 94761 120312 140734 133994 126667 136125
18357A36125J9565m051k3315j1737o003n153l7117l1234O360J8199q470O654k287
$$ 136125 155690 151639 128324 116587 110584 105431 68314 37080 43440 61639 53169 59823 57536
18344E7536j5247N6j4108k829o237n401K5115K3672j7090k495o12l259Q426P207
$$ 57536 42289 42345 28237 25408 19171 13770 38885 62557 45467 42972 42360 39101 47527 54734
18330E4734k0499R777J7027o1998j526P356M520o527n206j5483j1823K1739O238
$$ 54734 34235 44012 61039 -959 -2485 4871 9391 2864 -2342 -17825 -29648 -7909 -1671
18317a671J2866K782l302K4115M089J6008J5031k5115j3733k4648p369n906k2362
$$ -1671 11195 13977 10675 34790 38879 54887 69918 44803 31070 6422 -947 -6853 -29215
18304b9215K1234K8389L0130L800J948K6501N036j4530K728R41j8675k1291M436
$$ -29215 -7981 20408 50538 54338 56286 82787 87823 73293 76021 76962 58287 36996 41432
18291D1432N67J4533J1598j6667o702J1342J4081n085N968N786k1569J0321n42
$$ 41432 41999 56532 68130 51463 44761 56103 70184 65099 71067 76853 55284 65605 65063
18278F5063j2244k165J5403K317k8908j5434k361N117j3540J1132J2557K384M4
$$ 65063 52819 50654 66057 68374 39466 24032 21671 26788 13248 24380 36937 39321 39365
18265C9365K767J0318L1291M522k0850l731j4566j1666j6219j8085R907j795k222
$$ 39365 42132 52450 83741 88263 67413 63682 49116 37450 21231 3146 13053 11258 9036
18252I036j1124j916M880k5459l569K1955O701L1152Q791J7803j13k665M909j355
$$ 9036 -2088 -4004 876 -24583 -28152 -6197 504 31656 40447 58250 58137 55472 60381 59026
18238E9026K1044J5284r122M7043K3589l4480k4518k5221R183N775n667r356Q880
$$ 59026 80070 95354 86232 133275 156864 122384 97866 72645 81828 87603 81936 72580 81460
18225H1460N418k0313j801p549k0256j7139J0067J9309l552o560j0860o627q349
$$ 81460 86878 66565 64764 57215 36959 19820 29887 49196 45644 39084 28224 21597 13248
18212A3248J1365K260j1468m113K0929K7437J8231K0888q010l0849l5615K498
$$ 13248 24613 26873 15405 11292 32221 59658 77889 98777 90767 59918 24303 26801
18200B6801K5836M3032K746k714m192p565l8413j3366J3733J5825L7130L5659
$$ 26801 52637 95669 98415 95701 91509 83944 45531 32165 45898 61723 98853 134512
18188A34512Q211k3316N579j244J2167J9633Q105K157k2855q234m585J3890J4557
$$ 134512 142723 119407 124986 123742 135909 155542 163647 165804 142949 134715 130130 144020 158577
18175A58577M1J716K98k8763p747N899K4394L0428O598j0236j6483K4475J2584
$$ 158577 158618 160334 160632 131869 124122 130021 154415 184843 191441 181205 164722 189197 201781
18162B01781j8164k8544Q201K068Q73P816Q293R29K5103J3781O284K5660L4943
$$ 201781 183617 155073 163274 165342 166215 174031 182324 183253 208356 222137 228421 254081 289024
18149B89024K3766J9075J2521M2845J2613J1141j5997J6353L0514M121K0197J1622
$$ 289024 312790 331865 344386 387231 399844 410985 394988 411341 441855 445976 466173 477795
18137D77795L062O9926O8019O5408O3226N6990R2896R3491Q5527J20449J47435
$$ 477795 480857 550783 618802 684210 747436 804426 897322 990813 1076340 1196789 1344224
18126A344224R6190J13665J41988J36505J94642K42403K57227L76734M71558N84419
$$ 1344224 1440414 1554079 1696067 1832572 2027214 2269617 2526844 2903578 3375136 3959555
18116C959555Q05414J085756J480073K015514K719815L555465M538746O032681
$$ 3959555 4764969 5850725 7330798 9346312 12066127 15621592 20160338 26193019
18108B6193019P020581N716786J913533m710622j0983829r404796n292417k822573
$$ 26193019 33213600 38930386 40843919 36133297 25149468 15744672 10452255 7629682
18100G629682j613913j008123o84351n00983l75299k95209k74758k01872j22484
$$ 7629682 6015769 5007646 4323295 3822312 3447013 3151804 2877046 2675174 2552690
18091B552690j09412q7226r3497r6935n8730n867J3258K2093K6615o1090j20668
$$ 2552690 2443278 2356052 2262555 2165620 2106890 2101023 2114281 2136374 2162989 2101899 1981231
18080A981231j19961j12174j03995r8314j36354j27350j13520j05836j05154r2072
$$ 1981231 1861270 1749096 1645101 1546787 1410433 1283083 1169563 1063727 958573 866501
18070H66501o2933o1100l1139n6534k7830l7047l7308m7581l0405k6072R296r646
$$ 866501 803568 742468 711329 654795 626965 589918 552610 505029 474624 448552 457848 448202
18058D48202o0737l4996m781k5136q712j0490j7979l394k5590q785k6536k8780
$$ 448202 387465 352469 347688 322552 313840 303350 285371 281977 256387 247602 221066 192286
18046A92286K2409J0996m5391l4928k5057P672J5296k470l7715j5373j8021k901
$$ 192286 214695 225691 180300 145372 120315 127987 143283 140813 103098 87725 69704 66803
18034F6803R121l882j132j087K27o897n33M995j199k0301m1576j6885j099J424
$$ 66803 75924 72042 70910 69823 70050 63153 62620 67615 66416 46115 4539 -12346 -13445 -12021
18020a2021p560K9978j826q455j9730O004J9147M92p893R157L112J2512l898j1944
$$ -12021 -19581 10397 8571 116 -19614 -13610 5537 6029 -1864 7293 10405 22917 19019 7075
18006G075j5774l5891l823M0419L0356J9574o711o355J6942j273k7643k3050Q090
$$ 7075 -8699 -44590 -48413 -7994 22362 41936 35225 28870 45812 44539 16896 -6154 1936
17993A936L1327K826r865O014K036M0669J7993j7867j6226O173K4203K5458K3867
$$ 1936 33263 36089 26224 32238 34274 74943 92936 75069 58843 65016 89219 114677 138544
17980A38544l7349p411L121N417k720j6237p849j8954q333j5513m794L072r563
$$ 138544 101195 93784 96905 102322 99602 83365 75516 56562 48229 32716 27922 30994 21431
17967B1431J835j2516J510L8567J1335P910M408J4626k655l445Q243L726n0332
$$ 21431 23266 10750 12260 50827 62162 70072 74480 89106 86451 83006 91249 94975 44643
17954D4643l5862j1551J7598M699l3902L055L2322L0634l8555k4986L2141L5864
$$ 44643 8781 -2770 14828 19527 -14375 -11320 21002 51636 13081 -11905 20236 56100
17942E6100K4131M6878K0032l923M4474L9272N8539P7645O3507P4232N4361L9898
$$ 56100 80231 127109 147141 143218 187692 226964 285503 363148 426655 500887 555248 595146
17930E95146k1479k9680p621k2096k9194n0374o9993o0820n0406n0932n0430l7308
$$ 595146 573667 543987 536366 514270 485076 434702 364709 303889 253483 202551 152121 114813
17918A14813J7183j460J270J5924J601l6563j1905J1221M80l1910j437j1371n850
$$ 114813 131996 130536 131806 147730 149331 112768 100863 112084 112564 80654 79217 67846 61996
17905F1996K329P708p183o67J1738j7364j340K9551K4657N736j0584O878q813
$$ 61996 64325 72033 64850 64183 75921 58557 57217 86768 111425 117161 106577 113455 104642
17892A04642l0258j1141O584Q206k3027j3879l990r384q672n743R769O311l1920
$$ 104642 74384 63243 69827 78033 55006 41127 37137 27753 19081 13338 23107 29418 -2502
17879b502k3428n49K8478L2350J3859J9249n817l8101r583Q341L288j0014k796
$$ -2502 -25930 -26479 1999 34349 48208 67457 61640 23539 13956 22297 25585 15571 12775
17866A2775o766j359O183q415M17K1298P59k057J2185J3326Q036J4094K0780L8305
$$ 12775 6009 4650 10833 2418 2835 24133 24892 22835 35020 48346 56382 70476 91256 129561
17852A29561L4610K4479L4158O4466O3862P0386M1892m5674r1381q7733n3852
$$ 129561 164171 188650 222808 287274 351136 421522 463414 417740 326359 238626 184774
17841A84774o3671j4151M1291L1725J1071L2522Q4333R4127M8121J7223l4969
$$ 184774 121103 106952 148243 179968 191039 223561 307894 402021 450142 467365 432396
17830D32396p3291o6075m4975m6016m8402J3193l747l1674J5434m535j2990j5189
$$ 432396 359105 293030 248055 202039 153637 166830 163083 131409 146843 142308 129318 114129
17818A14129q344k846n893j1100k2898l235O377J9161K5999j4487l4916o181j657
$$ 114129 105785 102939 97046 85946 63048 59813 66190 85351 111350 96863 61947 55766 54109
17805E4109Q497l1705n701M413j3741j0534J3019J2789j4051k1426l0858R808
$$ 54109 62606 30901 25200 29613 15872 5338 18357 31146 17095 -4331 -35189 -25381
17793b5381K2757L0324r713L152J7210L2995K0895j9787l6718k7148J6513L7242
$$ -25381 -2624 27700 17987 21139 38349 71344 92239 72452 35734 8586 25099 62341
17781F2341L554n538j3163l2230k8161J6988Q232J6978P432k0872J4921j9465
$$ 62341 65895 60357 47194 14964 -13197 3791 12023 29001 36433 15561 30482 11017
17769A1017k022k4809J8373O152J273K2058N189P06q588p830j220M479J0700p734
$$ 11017 8995 -15814 2559 8711 9984 32042 37231 37937 29349 21519 20299 24778 35478 27744
17755B7744Q22j6392L983J2282j0232o998K3213J8890J3386Q462k0692j3832j6132
$$ 27744 28566 12174 16157 28439 18207 11209 34422 53312 66698 75160 54468 40636 24504
17742B4504J4467K954k820J724K4921l845j7707J6928R173J23k1945k8372j4711
$$ 24504 38971 41925 39105 40829 65750 61905 44198 61126 70299 70422 48477 20105 5394
17729E394m425j0947j3925M300K3966J2259p352r032M3746J1938j1366k7206K6741
$$ 5394 969 -9978 -23903 -19603 4363 16622 9270 238 43984 55922 44556 17350 44091
17716D4091Q791j2192j7674j8939M200J2768l903J9505j0998m0391J3914J2975
$$ 44091 52882 40690 23016 4077 8277 21045 17142 36647 25649 -14742 -828 12147
17704A2147J3831J8140m46N461K486O604k3423L680L5249J2181J2451J0605j2192
$$ 12147 25978 44118 43672 49133 51619 58223 34800 38480 73729 85910 98361 108966 96774
17691I6774m7742k2561J0060k5860K0384J969r592K4841J1509J335l5665k7622
$$ 96774 49032 26471 36531 10671 31055 33024 23432 48273 59782 61117 25452 -2170
17679b170l447K5777K6923L4997L4113l5749k6114K3559k3703j6341J470L2526
$$ -2170 -5617 20160 47083 82080 116193 80444 54330 77889 54186 37845 39315 71841
17667G1841K463Q934k1719j9620r950M228R18K8030J5104l7856J527L421p49q780
$$ 71841 74304 83238 61519 41899 31949 36177 37095 65125 80229 42373 43900 47321 46572 37792
17653C7792j0915K2533L0124r71J068L872j5358R037N602N835l4455q059N840
$$ 37792 26877 49410 79534 78563 79631 83503 68145 77182 82784 88619 54164 46105 51945
17640E1945j4214j60L9019K1587j882k1052M716O498k2913j81N995K0820j4650
$$ 51945 37731 37571 76590 98177 96295 75243 79959 86457 63544 63363 69358 90178 75528
17627G5528j0488K4905Q328j1301q853k969j1933J3993L0243j1236k9364J7533
$$ 75528 65040 89945 98273 86972 78119 75150 63217 77210 107453 96217 66853 84386
17615H4386P817J6318L4999l0434k3424k5519K1679J9649j068R161L690l2129
$$ 84386 92203 108521 143520 113086 89662 64143 85822 105471 104403 113564 117254 85125
17603H5125j5715K4723j3023m006L0548K4206k1023k551k9915k5134k350j0737
$$ 85125 69410 94133 81110 77104 107652 131858 110835 108284 78369 53235 50885 40148
17591D0148P031K6762L2189j7798l5896O945K2736r732k6205o232K8760P628j2349
$$ 40148 47179 73941 106130 88332 52436 59381 82117 72385 46180 39948 68708 76336 63987
17578F3987j5919J5232J0981k1746P5P294R132K870k3056N49K07P527P064j879
$$ 63987 48068 63300 74281 52535 52610 59904 69036 71906 48850 49399 49606 57133 64197 62318
17564F2318k496j3680N207J8504J4286K9353L6072K821p989j7389m63p90J2960
$$ 62318 59822 46142 51349 69853 84139 113492 149564 152385 144396 127007 126544 125754 138714
17551A38714M9609J270k328P091k0356k1365M235p323m273J7315k8574j3795k4594
$$ 138714 188323 189593 187265 194356 174000 152635 156870 149547 145274 162589 134015 120220 95626
17538I5626M065L0526L1581r593j2740J8516l467J0116R084L1145k4537m1916
$$ 95626 99691 130217 161798 152205 139465 157981 154514 164630 173714 204859 180322 138406
17526A38406j372k940l798Q67j3665J9053K0677J8817O281n911j3361k5021p581
$$ 138406 137034 134094 130296 131163 117498 136551 157228 176045 182326 176415 163054 138033 130452
17513A30452j310j189m083l7014l09L4015J6195J5637l255J5110P465k691K284
$$ 130452 129142 127953 123870 86856 86547 120562 136757 152394 149139 164249 171714 169023 171307
17500A71307o287J5482K4583M8730M3679M4317N93K2682K2183j0876J2021K1621
$$ 171307 165020 180502 205085 253815 297494 341811 342404 365086 387269 376393 388414 410035
17488D10035l2089k5369r941l6489j7396k4319J804J4840k0550k4430k661k4525
$$ 410035 377946 352577 342636 306147 288751 264432 266236 281076 260526 236096 233435 208910
17476B08910k3571P375J0988L1256j3577J4483j179K801L7023L2291J3822K9353
$$ 208910 185339 192714 203702 234958 221381 235864 234685 237486 274509 306800 320622 349975
17464C49975j3487p591k4465J2556J8745J0225J1205Q377N696J9153J9303J8412
$$ 349975 336488 328897 304432 316988 335733 345958 357163 365540 371236 390389 409692 428104
17452D28104N248K5370K8462j3036j0414J4411K2748J5662J7289K7689K4838J4003
$$ 428104 433352 458722 487184 474148 463734 478145 500893 516555 533844 561533 586371 600374
17440F00374M0743r146m4666m3511n320N089j6759O127J2136L0621J5465J015
$$ 600374 641117 631971 587305 543794 538474 543563 526804 532931 545067 575688 591153 592168
17428E92168j8546P607j7897J3131L3861K3692L0328J4376j4561j6144R004L1847
$$ 592168 573622 581229 563332 576463 610324 634016 664344 678720 664159 648015 657019 688866
17416F88866N5834L9352J1264J8063J8824K9911J4169N8738O2836N4305M3153
$$ 688866 744700 784052 795316 813379 832203 862114 876283 935021 997857 1052162 1095315
17405A095315O7390J6528N0289Q7656O4244P8107R1396Q7822R5684J16310J47511
$$ 1095315 1162705 1179233 1229522 1317178 1381422 1459529 1550925 1638747 1734431 1850741 1998252
17394A998252J58915J92736K35655K58254K64560L31931L94653M56853M90083
$$ 1998252 2157167 2349903 2585558 2843812 3108372 3440303 3834956 4291809 4781892
17385D781892N35845N25807N19511N32707O10905O86272Q47960R67918J132906
$$ 4781892 5317737 5843544 6363055 6895762 7506667 8192939 9040899 10008817 11141723
17376A1141723J385969J766148K364707L187110M308899N703477P499119R660084
$$ 11141723 12527692 14293840 16658547 19845657 24154556 29858033 37357152 47017236
17368D7017236J1963253J3611604J3251103R854425L982756j431428l437323k178417
$$ 47017236 58980489 72592093 85843196 95697621 99680377 98248949 94811626 92633209
17360I2633209j066305l337880q861328j4149297j5649395j3162112r031561n645001
$$ 92633209 91566904 88229024 79367696 65218399 49569004 36406892 27375331 21730330
17352B1730330l520988k324192j580903j108775q20355n89755m48917m04088l23724
$$ 21730330 18209342 15885150 14304247 13195472 12375117 11785362 11336445 10932357 10608633
17343A0608633k20650j77814k36143k85810l45687l88203l80037m02386m31508
$$ 10608633 10387983 10210169 9974026 9688216 9342529 8954326 8574289 8171903 7740395
17334G740395m68889m95059n10446n28088m77926m01830l38864l38076l26593
$$ 7740395 7271506 6776447 6266001 5737913 5259987 4858157 4519293 4181217 3854624
17325C854624k64275k27052k18679k31561k20265k00082j40465j28196j43353
$$ 3854624 3590349 3363297 3144618 2913057 2692792 2492710 2352245 2224049 2080696
17316B080696j20739j13919j44281r4570p2087o1281n4507o7424r6476r7207p2262
$$ 2080696 1959957 1846038 1701757 1607187 1535100 1473819 1419312 1351888 1255412 1158205 1085943
17305A085943o1542p1136o9462n8279l4576j3648m5381l6385p0957o1951k0204
$$ 1085943 1024401 953265 883803 825524 790948 777300 731919 695534 624577 562626 542422
17294E42422k4191l0897l0554k4202q561q57l1775k8792p5306n1666k4989q75
$$ 542422 518231 487334 456780 432578 424017 423160 391385 362593 287287 235621 210632 209757
17282B09757p074J1106j0740k5546K274o353j3325j091p7344l3805k185j6074
$$ 209757 202683 213789 203049 177503 179777 173424 160099 159008 81664 47859 45674 29600
17270B9600Q579K9770j586l1606j3021L8010J4665n490L320J5476K0137K3286
$$ 29600 38179 67949 66363 34757 21736 59746 74411 68921 72241 87717 107854 131140
17258A31140L1510J4691q426j2690k3333J36K55q316j3278J4114J9226O854k1749
$$ 131140 162650 177341 168915 156225 132892 133028 133283 124967 111689 125803 145029 151883 130134
17245A30134l0724K2177L7201M7761K5888j2783j9085J0706P484j2186k8651n639
$$ 130134 99410 121587 158788 206549 232437 219654 200569 211275 218759 206573 177922 172283
17233A72283q295m5331m1424l0175j4467R911j2743k6978l0473P66M7240K6085
$$ 172283 163988 118657 77233 47058 32591 42502 29759 2781 -27692 -26926 20314 46399
17221D6399j5582R961J6064r297k133r450j3132k0074O844J9651K567K7684j3953
$$ 46399 30817 40778 56842 47545 45412 35962 22830 2756 9600 29251 31818 59502 45549
17208D5549o130m2741l4983M186j695k019J9920M7154J5648J1295l71q052n6986
$$ 45549 39419 -3322 -38305 -34119 -35814 -37833 -17913 29241 44889 56184 55813 47761 -9225
17195i225m022K3159N3659K1917k3563j8686m701l1445n9j932J914j6304k1634
$$ -9225 -13247 9912 63571 85488 61925 43239 38538 7093 7034 5102 7016 -9288 -30922
17182c0922j0538L0816J6790j8859l0064J566K2109O840j8557j9665l966L351
$$ -30922 -41460 -10644 6146 -12713 -42777 -41211 -19102 -12262 -30819 -50484 -54450 -51099
17170e1099m18J8867L8230M3854L461m032j9921k3351J2200K4175K6039K9836
$$ -51099 -51517 -32650 5580 49434 52895 48863 28942 5591 17791 41966 68005 97841
17158I7841j2718P216j8319k3336r436P892k914K6507J7096j2256j9004k2489
$$ 97841 85123 92339 74020 50684 41248 49140 46226 72733 89829 77573 58569 36080
17146C6080r590k4636K0811R460Q41k221J1472k8519j9079o698k3975l86K6389
$$ 36080 26490 1854 22665 32125 32966 30745 42217 13698 -5381 -12079 -36054 -36440 -10051
17133a0051n605j6223K170K2361K7346o117r700k778L833r718j2751k735J0113
$$ -10051 -15656 -31879 -29709 -7348 19998 13881 4181 1403 5236 -4482 -17233 -19968 -9855
17120i855P874k7353j0602K3652L5176K9773j0303k4115k0243n101l233M130j361
$$ -9855 -1981 -29334 -39936 -16284 18892 48665 38362 14247 -5996 -11097 -14330 -10200 -11561
17107a1561K2356L012j3706o798l993J9267R693P685M7476M785n4541j6443J7400
$$ -11561 10795 13807 101 -6697 -10690 8577 18270 25955 73431 78216 23675 7232 24632
17094B4632j9578j9107J2390M699R063L1056k5451k8066R345K5801j413j6184
$$ 24632 5054 -14053 -1663 3036 12099 43155 17704 -10362 -1017 24784 23371 7187
17082G187l570J665J5257j4383k9328j1839P604O5099K4287k8772J2870M5002
$$ 7187 3617 5282 20539 6156 -23172 -35011 -27407 37692 61979 33207 46077 91079
17070I1079J1296n2788o7859j881K2515J5239J2257J9572K2183k3840k4249K7727
$$ 91079 102375 49587 -18272 -20153 2362 17601 29858 49430 71613 47773 23524 51251
17058E1251J4470O606P137p946J2912L7041J8884k1233k8239o149R856J0085K3931
$$ 51251 65721 72327 79464 71518 84430 121471 140355 119122 90883 84734 94590 104675 128606
17045A28606k6873m3717J0582K7556K091k1588j0872K1064J3657K412k9140K519
$$ 128606 101733 58016 68598 96154 98245 76657 65785 86849 100506 102918 73778 76297
17033G6297p857m358Q632K392J0496o151k1457m99j0257j7288K3876k77L9967
$$ 76297 68440 64082 72714 75106 85602 79451 57994 57495 47238 29950 53826 53549 93516
17020I3516J3646J3621j3007k5944L1241N906j1752l479o634Q057k1300l6138
$$ 93516 107162 120783 107776 81832 113073 118979 107227 103748 97114 105171 83871 47733
17008D7733j036M2320L5102K2955Q97p987k7836O678K2947J1974Q763k2605L529
$$ 47733 46697 89017 124119 147074 147971 139984 112148 118826 141773 153747 162510 139905 143434
16995A43434Q811j9963l2141J5323K3824M9934M190j7696k9385k7298r569j2358
$$ 143434 152245 132282 100141 115464 139288 189222 193412 175716 146331 119033 109464 97106
16983I7106K9478p964l5860L1438k6069k1602K7587K0397K2199J5283L864p514
$$ 97106 126584 118620 82760 114198 88129 66527 94114 114511 136710 151993 155857 148343
16971A48343l976l25p993k8628j336K159q680o319L0939K436k6243j3332L0967
$$ 148343 144367 144042 136049 107421 106085 108244 99564 93245 124184 126620 100377 87045 118012
16958A18012J2573N077k704j008J3757o417P116J119o991J62L842K7971K4872
$$ 118012 130585 135662 132958 131950 145707 139290 146406 147525 140534 140696 144538 172509 197381
16945A97381K4595k286L3899q87j9253N020j0571N146O294k849n367k442M595
$$ 197381 221976 219690 253589 252702 233449 238469 227898 233044 239338 236489 231122 228680 233275
16932B33275Q328J3314Q456J7751J0942J8051m526J1523k5716l7801k0460m991
$$ 233275 241603 254917 263373 281124 292066 310117 305591 317114 291398 253597 233137 228146
16920B28146r920j295j9576M664J006K8208L3835j3411k4272J6328Q700J893o53
$$ 228146 218226 216931 197355 202019 203025 231233 265068 251657 227385 243713 252413 254306 253653
16907B53653K0057o751n289L5563L5206j0173j5069K7251K3962J3092K7823Q347
$$ 253653 273710 266959 261670 297233 332439 322266 307197 334448 358410 371502 399325 407672
16895D07672l3771k4660J0240K9236J3036J291j3516p998K9107J0705m772K5714
$$ 407672 373901 349241 359481 388717 401753 403044 389528 381530 410637 421342 416570 442284
16883D42284L6771J0808l1000j3579J3820m350J0060K4389M4881J9448j2171K171
$$ 442284 479055 489863 458863 445284 459104 454754 464814 489203 534084 553532 541361 543532
16871E43532k7243m352L8922K9928M7550K2338q750K1983j6653J4832K8435L9146
$$ 543532 516289 511937 550859 580787 628337 650675 641925 663908 647255 662087 690522 729668
16859G29668O8351N6392L1241L7977P3976Q1590P4676M4264O2648Q4619Q8260
$$ 729668 798019 854411 885652 923629 997605 1079195 1153871 1198135 1260783 1345402 1433662
16848A433662J15290J37207J03114J01578J21873J38913J61156J53730J40662
$$ 1433662 1548952 1686159 1789273 1890851 2012724 2151637 2312793 2466523 2607185
16839B607185J74510K15483K65981K79965L31493L83653L71145L76441M68129
$$ 2607185 2781695 2997178 3263159 3543124 3874617 4258270 4629415 5005856 5473985
16830E473985N44483O78728Q56573J029127J281764J713726K347102L136939M113561
$$ 5473985 6018468 6697196 7553769 8582896 9864660 11578386 13925488 17062427 21175988
16821B1175988N186262O718292Q430894Q545296O626700K223418l354025l669904
$$ 21175988 26362250 33080542 41511436 50056732 56683432 58906850 55552825 51882921
16813E1882921O71283K787996J566748k733176p483333o452252j802440K270774
$$ 51882921 52554204 55342200 56908948 54175772 46692439 40240187 38437747 40708521
16805D0708521N434575O773604N761649K216734l232946n376991j597830J186258
$$ 40708521 46143096 52916700 58678349 60895083 57662137 52285146 50687316 51873574
16797E1873574N28851l436551r068347j0530110p206942m200294k565766j733010
$$ 51873574 52402425 48965874 39897527 29367417 22160475 17960181 15394415 13661405
16789A3661405j260964r00219p08411o52309n93666n38629n08224l64732k61186
$$ 13661405 12400441 11500222 10791811 10139502 9545836 9007207 8498983 8134251 7873065
16780G873065l18676l03165l40951l71396l19302k62324k47660k81264l02394
$$ 7873065 7554389 7251224 6910273 6538877 6219575 5957251 5709591 5428327 5125933
16771E125933l05736k85657k86989k48902k52567k39055k59547k12256j80815
$$ 5125933 4820197 4534540 4247551 3998649 3746082 3507027 3247480 3035224 2854409
16762B854409j72553j88025j87203j89154j87535j58482j16451r7151p1380o1806
$$ 2854409 2681856 2493831 2306628 2117474 1929939 1771457 1655006 1557855 1486475 1424669
16752A424669o9571p3487p6030q1505q9615q6647k5988k5248p8850n5876n4388
$$ 1424669 1355098 1281611 1205581 1124076 1034461 947814 921826 896578 817728 761852 707464
16741G07464m4723m7403n0394j9971k7754j5703k0102m2645l5340m8479O310k8905
$$ 707464 662741 615338 564944 544973 517219 501516 481414 438769 403429 354950 361260 332355
16729C32355l6267l0791J0517k632k0941n5086k4883k8116j519R948j3747l7723
$$ 332355 296088 265297 275814 273182 252241 197155 172272 144156 142637 152585 138838 101115
16717A01115o873L067r775k3319m6766Q594J8422K395k2484P559q625O041J5414
$$ 101115 94242 97309 87534 64215 17449 26043 44465 46860 24376 31935 23310 29351 44765
16704D4765J7994K0415J492o188j6005k1131N600j02J6131J1185l892Q428K8273
$$ 44765 62759 83174 84666 78478 62473 41342 46942 46840 62971 74156 70264 78692 106965
16691A06965P410j1919k1059m5275j5692Q339K1781R400K9128J5604M791j729
$$ 106965 114375 102456 81397 36122 20430 28769 50550 59950 89078 104682 109473 107744
16679A07744p953j2633k9191K1337R352j9492l173j6788K6674L0304m450k9266
$$ 107744 99791 87158 57967 79304 88656 69164 65991 49203 75877 106181 101731 72465
16667G2465j3805o196k9104k950p476J7644J2889M535k9283j3460j1907Q836R136
$$ 72465 58660 52464 23360 20410 12934 30578 43467 48002 18719 5259 -6648 2188 11324
16654A1324r736K2744J1588r303o2936K508L5784j26l4655q933L9236J2281k3530
$$ 11324 1588 24332 35920 26617 -36319 -33811 1973 1847 -32808 -41741 -2505 9776 -13754
16641a3754L362Q966K3934J8107L106p734j1684r723m27J663j6764j7003j6964
$$ -13754 -10392 -1426 22508 40615 43721 35987 24303 14580 14153 15816 -948 -17951 -34915
16628c4915L4005K3624r131j9099j8578p15o059J4675L6377l939l2565j4703j5677
$$ -34915 -910 22714 13583 -5516 -24094 -24809 -30868 -16193 20184 16245 -16320 -31023 -46700
16615d6700r441p214K1601K0421r442k3719J0745R944J6515Q079P658l3210j8731
$$ -46700 -56141 -63355 -41754 -21333 -30775 -54494 -43749 -33805 -17290 -9211 -1553 -34763 -53494
16602e3494M4663L6552J6930l2512k1368j4827J3323J5841K807K5455k5190k3068
$$ -53494 -8831 27721 44651 12139 -9229 -24056 -10733 5108 7915 33370 8180 -14888
16590a4888N612K8040J0594q37J643k4999l7301J1706J6842n658J4424K295p031
$$ -14888 -9276 18764 29358 28521 30164 5165 -32136 -20430 -3588 -9246 5178 7473 442
16577D42j3991j9439J1044k2039l0893m878o788l794J0391m30K8991L2802K0053
$$ 442 -13549 -32988 -21944 -43983 -74876 -79754 -86542 -90336 -79945 -80375 -51384 -18582 1471
16564A471j7683l8487L2388Q691p013l3930q671K1392n544l5926J796J5633J3561
$$ 1471 -16212 -54699 -22311 -13620 -20633 -54563 -63234 -41842 -47386 -83312 -81516 -65883 -52322
16551e2322J131m534J8379j500m830K7411O995k574p589j1475l515N12J3922r609
$$ -52322 -51191 -55725 -37346 -38846 -43676 -16265 -9270 -11844 -19433 -30908 -34423 -33911 -19989 -29598
16537b9598k0648R209j8574j056J7310J3213K5767j1976m3465R364L73O458J2008
$$ -29598 -50246 -41037 -59611 -60667 -43357 -30144 -4377 -16353 -59818 -50454 -50081 -43623 -31615
16524c1615o540R60K8002J1325j987q701k0104j5838j481j5123q910K0316N413
$$ -31615 -38155 -37195 -9193 2132 145 -8556 -28660 -44498 -45979 -61102 -70012 -49696 -44283
16511d4283L8798m806l1171l186k168j3494n376k1497K3646M7798J1190r208q365
$$ -44283 -5485 -10291 -41462 -44648 -46816 -60310 -65686 -87183 -63537 -15739 -4549 -13757 -22122
16498b2122j8897j9928J4429L9633O334j2117j6917J2891j9208m7494K2726J4773
$$ -22122 -41019 -60947 -46518 -6885 -551 -12668 -29585 -16694 -35902 -83396 -60670 -45897
16486d5897L1711k0897l7626l698L3962J4812J0345J3226J414j5748k0568j309
$$ -45897 -14186 -35083 -72709 -76407 -42445 -27633 -17288 -4062 -2648 -18396 -38964 -40273
16474d0273J0231K677j8386K753L5836m128k5200J4281J1794J0714j7008j1087
$$ -40273 -30042 -27365 -45751 -42998 -7162 -11290 -36490 -22209 -10415 299 -16709 -27796
16462b7796l5Q782l090k228K9546j0998P870J6512k2991L452O591l310k6026J2753
$$ -27796 -27831 -19049 -22139 -24367 5179 -5819 2051 18563 -4428 -976 5615 2305 -23721 -10968
16448a0968L3010l7745P72J4746l0236J082L4760J6507J0534l7020l1670K8373
$$ -10968 22042 -15703 -14931 -185 -30421 -29339 5421 21928 32462 -4558 -36228 -7855
16436g855K3605j124j7246k0474K1940m1991J180N8918L1990k2586l4353J4931
$$ -7855 15750 14626 -2620 -23094 -1154 -43145 -41965 16953 48943 26357 -7996 6935
16424F935J501K80J6448j42m4739m1444K0071J5760p571J2186j0124j006J0374
$$ 6935 8436 8716 25164 25022 -19717 -61161 -41090 -25330 -32901 -20715 -30839 -31845 -21471
16411b1471j554l472J3138j8791N3J8888K3089j7269k3625J8258O860m025j408
$$ -21471 -23025 -26497 -13359 -32150 -32097 -13209 9880 -7389 -31014 -12756 -5896 -9921 -11329
16398a1329j2711q238o891J3952p411j5042L4915o66j4513J3092M136J2080j495
$$ -11329 -24040 -32278 -39169 -25217 -32628 -47670 -12755 -13421 -27934 -14842 -10706 1374 -121
16385a21j1462O783P4j613J7285R57j8875j4311j1544j3347p75J9091k044j0154
$$ -121 -11583 -4800 -4726 -6339 10946 11903 -6972 -21283 -32827 -46174 -46949 -27858 -29902 -40056
16371d0056j7884o277K4939J3381j0831J4043J2792j3669o932M548M1056O168
$$ -40056 -57940 -64217 -39278 -25897 -36728 -22685 -9893 -23562 -30494 -25946 15110 21278
16359B1278j6432j2050r128j5950J0479N250N530K9240J600k9083l558j9299J1017
$$ 21278 4846 -7204 -16332 -32282 -21803 -16553 -11023 18217 19817 -9266 -12824 -32123 -21106
16346b1106K3067J1099k6464j1438m269J7525j9055O432K5768J0238p138m28m693
$$ -21106 1961 13060 -13404 -24842 -29111 -11586 -30641 -24209 1559 11797 4659 4231 -462
16333d62l1991M301J6736p488N932l697l7377k2438L0026L756j2077r460l0267
$$ -462 -32453 -28152 -11416 -18904 -12972 -16669 -54046 -76484 -46458 -42702 -54779 -64239 -94506
16320i4506J7117L1224J2486k2256J5750J6355j9652k054K9874o961m642j731
$$ -94506 -77389 -46165 -33679 -55935 -40185 -23830 -43482 -45536 -15662 -22623 -27265 -28996
16308b8996K0816m907j1272m612Q937j9756j9292J6281J6052n880K900j2283O002
$$ -28996 -8180 -13087 -24359 -28971 -20034 -39790 -59082 -42801 -26749 -32629 -29729 -42012 -36010
16295c6010P584J2439K833k3022j468j6745k1734K09M4953j1456l2015J3837J972
$$ -36010 -28426 -15987 -13154 -36176 -37644 -54389 -76123 -75914 -30961 -42417 -74432 -60595 -58623
16282e8623P168L626n422j4702N798j2167k0059K3267l725K0075M0033j4362j7691
$$ -58623 -51455 -47829 -53251 -67953 -62155 -74322 -94381 -71114 -74839 -54764 -14731 -29093 -46784
16269d6784J9450j5957k49M0130J0490j5315N354P109K5879K3408r360k8598M358
$$ -46784 -27334 -43291 -43540 -3410 7080 -8235 -2881 4228 30107 53515 44155 15557 19915
16256A9915J4711K3350J8973J7035K1987L2498J2284L9885O6218R448j3124o737
$$ 19915 34626 57976 76949 93984 115971 148469 160753 200638 266856 276304 263180 256443
16244B56443K8049L5518j5618o6810o3316k52J8195K0592J8753J1034J9375j350
$$ 256443 284492 320010 304392 237582 174266 174014 192209 212801 231554 242588 261963 260613
16232B60613p190k0655O861K3440k0401o4160n4075k2258k7056k2988j5643j5059
$$ 260613 253423 232768 239629 263069 242668 178508 124433 102175 75119 52131 36488 21429
16220B1429L6931J7939k386j8850J679K3648J2106j7145j7875q305K9818R496
$$ 21429 58360 76299 73913 55063 56742 80390 92496 75351 57476 49171 78989 88485
16208H8485k2795j7260N367q962J6715l403k2868k6368p206J6770j5121j0752
$$ 88485 65690 48430 53797 44835 61550 58147 35279 8911 1705 18475 3354 -7398
16196g398j6373k586j7175k0990k0639J9424J4555J5815J1430R128Q022k8280
$$ -7398 -23771 -26357 -43532 -64522 -85161 -65737 -51182 -35367 -23937 -14809 -6787 -35067
16184c5067j6723L2220J9385J5022q744j887j8951j1381k882l0721P273M3345
$$ -35067 -51790 -19570 -185 14837 6093 4206 -14745 -26126 -29008 -59729 -52456 -9111
16172i111J3385j3480r696p01M824n554j5854K0222O705Q554m753k0315j3922
$$ -9111 4274 -9206 -18902 -19603 -14779 -20333 -36187 -15965 -9260 -706 -5459 -25774 -39696
16159c9696j7238k3690K8288M871k2428J8489J5817K240O054j1646J4724J477
$$ -39696 -56934 -80624 -52336 -47465 -69893 -51404 -35587 -33347 -27293 -38939 -24215 -22738
16147b2738j7057n887j1153j1931j0007J7828L1868j30J6688j0027k521J3380
$$ -22738 -39795 -45682 -56835 -68766 -78773 -60945 -29077 -29207 -12519 -22546 -25067 -11687
16135a1687P824r056j0725P815L3372j7896q908J0612P96l8188q733j0782n437
$$ -11687 -3863 -12919 -23644 -15829 17543 -353 -9261 1351 2147 -36041 -44774 -55556 -60993
16122f0993K1164J3315k603r154J2753n311m385L2263J021j0859j8449L807o165
$$ -60993 -39829 -26514 -29117 -38271 -25518 -30829 -35214 -2951 -1930 -12789 -31238 -27431 -33596
16109c3596k303o113m866J8937R450j0752m0391M11J3514K6064K7386j3825k3418
$$ -33596 -35899 -42012 -46878 -27941 -18491 -29243 -69634 -69223 -55709 -29645 -2259 -16084 -39502
16096c9502Q970k144M287J3529J80n824L80J8665J4208j507o680n0524l5724M836
$$ -39502 -30532 -32676 -28389 -14860 -14680 -20504 -20124 -1459 12749 11242 4562 -45962 -81686 -76850
16082g6850K3933L9691n666j8294j3502n911K5633J258O677K9378p759J2930r859
$$ -76850 -52917 -13226 -18892 -37186 -50688 -56599 -30966 -29708 -23031 6347 -1412 11518 1659
16069A659k5112j5748q859j3383k1897J6113J5246j1494j8926J3553J5990j4342
$$ 1659 -23453 -39201 -48060 -61443 -83340 -67227 -51981 -63475 -82401 -68848 -52858 -67200
16057f7200R937K517l2391j1522K2325J7252k663k692j411J676K0361P427n263
$$ -67200 -57263 -54746 -87137 -98659 -76334 -59082 -61745 -64437 -65848 -64172 -43811 -36384 -41647
16044d1647R026P777j5349q911J912L0572J492n840J8836J8628o009k4729l5467
$$ -41647 -32621 -24844 -40193 -49104 -47192 -16620 -15128 -20968 -2132 16496 10487 -14242 -49709
16031d9709m845O876Q012M761K1789Q337k3515j4583M2474j3453o6487k8170J5256
$$ -49709 -54554 -47678 -39666 -34905 -13116 -4779 -28294 -42877 -403 -13856 -80343 -108513 -93257
16018i3257M494j335K4287J3937J6398R211L1420J5283o372j1707j7511l46j3923
$$ -93257 -88763 -90098 -65811 -51874 -35476 -26265 5155 20438 14066 2359 -15152 -15498 -29421
16005b9421L834J7094j1015K479J2279l18n35J2366j2942o723l273k4209J227
$$ -29421 -25587 -8493 -19508 -17029 -4750 -5068 -5603 6763 -6179 -12902 -16175 -40384 -39157
15992c9157j0054j4294R18J0782L696k8525J5984M7248L6935k3402L0460J1302
$$ -39157 -49211 -63505 -62587 -51805 -48109 -76634 -60650 -13402 23533 131 30591 41893
15980D1893m3523k9133j1672N026P983J924L656M861p210k7285J4487P206q850
$$ 41893 -1630 -30763 -42435 -37409 -29426 -27502 -23846 -18985 -26195 -53480 -38993 -31787 -40637
15967d0637M87M6985K7878J7419j7304l0872l3464l7586J1796O533L718M0018
$$ -40637 -40150 6835 34713 52132 34828 3956 -29508 -67094 -55298 -48765 -45047 -5029
15955e029J3724j4944m7507m890L274j4431q446N492J1317k1501P041L838P988
$$ -5029 8695 -6249 -53756 -58646 -55372 -69803 -78249 -72757 -61440 -82941 -75900 -72062 -64074
15942f4074L7661K5915k3919l851n321l388K2735J5688J6735L0685q290m8049
$$ -64074 -26413 -498 -24417 -28268 -33589 -36977 -14242 1446 18181 48866 40576 -7473
15930g473j7160J4618j5697M649K1234o454k6390l1123R923K3995j2669J8552
$$ -7473 -24633 -10015 -25712 -21063 171 -6283 -32673 -63796 -53873 -29878 -42547 -23995
15918b3995J6820l1942j1804L9125L0381m321j6747k1145j745P048K432j4842
$$ -23995 -7175 -39117 -50921 -11796 18585 14264 -2483 -23628 -25373 -18325 -15893 -30735
15906c0735N658K0674n8l4816k8808m161Q050L0221K8559R279L444M256j4068
$$ -30735 -25077 -4403 -4461 -39277 -68085 -72246 -64196 -33975 -5416 3863 7307 11563 -2505
15893b505j2677J816k0024l0417J2621K8171J4449k3892l6669K9967L9317J2916
$$ -2505 -15182 -13366 -33390 -63807 -51186 -23015 -8566 -32458 -69127 -39160 157 13073
15881A3073k8338j8006L1214R707o044p431k9531j8775j7935j56k158J2044L0765
$$ 13073 -15265 -33271 -2057 7650 1606 -5825 -35356 -54131 -72066 -72222 -74380 -62336 -31571
15868c1571K8046J4087j166p901o424J6205j9990j9351p231k0843l413K1415R170
$$ -31571 -3525 10562 9396 1495 -4929 11276 -8714 -28065 -35296 -56139 -59552 -38137 -28967
15855b8967J0154r831J2654J2474j2656p723J192K4807L8035J833j8680j2535
$$ -28967 -18813 -28644 -15990 -3516 -16172 -23895 -22703 2104 40139 41972 23292 10757
15843A0757k5820r437l5539j9277L2766M1867J2798l6173m831o056O384M944J4327
$$ 10757 -15063 -24500 -60039 -79316 -46550 -4683 8115 -28058 -32889 -38945 -32561 -27617 -13290
15830a3290J7234j5389k3592q277J6150J4071P629N046m957J5679j652j418r712
$$ -13290 3944 -11445 -35037 -43314 -27164 -13093 -5464 -418 -5375 10304 8652 7234 -2478
15817b478J3625k6061l1290N790J8127J4190q568J259K1810J4590l0778K34K5877
$$ -2478 11147 -14914 -46204 -40414 -22287 -8097 -16665 -15406 6404 20994 -9784 -9550 16327
15804A6327k1920N73Q70N956P240J2141L0000k3749j6331J0943j6924K279q389
$$ 16327 -5593 -5020 -4150 1806 9046 21187 51187 27438 11107 22050 5126 7405 -984
15791i84K1537O613o386j4396q516q19M833j1084j1031p978k0965m076J6963p671
$$ -984 20553 27166 20780 6384 -2132 -2951 1882 -9202 -20233 -28211 -49176 -53252 -36289 -43960
15777d3960P326J805J328l6783n606K1372P033K8016K4824O044l7309j6436q365
$$ -43960 -36634 -34829 -33501 -70284 -75890 -54518 -47485 -19469 5355 11399 -25910 -42346 -50711
15764e0711K5401J4148l9439k8933L1707n750j5748J7486J6094J4838O609n917
$$ -50711 -25310 -11162 -50601 -79534 -47827 -53577 -69325 -51839 -35745 -20907 -14298 -20215
15752b0215j770k683r385J6917j3490m404k0358j7438R983K7828J4806M054j8617
$$ -20215 -21985 -24668 -34053 -17136 -30626 -35030 -55388 -72826 -62843 -35015 -20209 -16155 -34772
15739c4772K3464p493m274K0153L4554k611k1915M782J094j1533j7427l1577J2368
$$ -34772 -11308 -18801 -23075 -2922 31632 29021 7106 11888 12982 1449 -15978 -47555 -35187
15726c5187o683q601j5390J2464J1078J6545P421K623J6358k8766m1489j2046
$$ -35187 -41870 -50471 -65861 -53397 -42319 -25774 -18353 -15730 628 -28138 -69627 -81673
15714h1673J3115K4048J6088L427J853o682q030r535K2530J4764m128q618k0232
$$ -81673 -68558 -44510 -28422 -24995 -23142 -29824 -37854 -47389 -24859 -10095 -14223 -22841 -43073
15701d3073J7752j6413j2953j725Q969j686k1328j3320L9115K4762n469m207K3627
$$ -43073 -25321 -41734 -54687 -56412 -47443 -49129 -70457 -83777 -44662 -19900 -25369 -29576 -5949
15688e949L658n413k3105j5696Q220j7618L2560L8675l0026j6625k0589J724K8217
$$ -5949 -2291 -7704 -30809 -46505 -38285 -55903 -23343 15332 -14694 -31319 -51908 -50184 -21967
15675b1967O954l0079k5721P496k517k486l581R153m39P524L513o32N292j2889
$$ -21967 -15013 -45092 -70813 -63317 -65834 -68320 -71901 -62748 -63187 -55663 -52150 -52782 -47490 -60379
15661f0379j3522J9857J7223K8210M232j171n864k01m505p708K7047J634P706
$$ -60379 -73901 -54044 -36821 -8611 -4379 -5550 -11414 -11615 -16120 -23828 3219 4853 12559
15648A2559P489j2443l3351J3527q258j6226J2370n176L2153o716o3146l14L3842
$$ 12559 20048 7605 -25746 -12219 -20477 -36703 -24333 -29509 2644 -4072 -67218 -67532 -33690
15635c3690q423L138J8988J307p415j1226o404n588J4716K5207o419l3353j5144
$$ -33690 -42113 -38975 -19987 -18680 -26095 -37321 -43725 -49313 -34597 -9390 -15809 -49162 -64306
15622f4306L1036m604M968n492k829O478R294q687k2023J3943J4922J843L862
$$ -64306 -33270 -37874 -32906 -38398 -41227 -34749 -25455 -34142 -56165 -42222 -27300 -25457 -21595
15609b1595L2498r399k0769K1578j6661l3697Q974L0163q557k3743k7067L0464
$$ -21595 10903 1504 -19265 2313 -14348 -48045 -39071 -8908 -17465 -41208 -68275 -37811
15597c7811K3479r181n748k6008Q333L9851q65J9789j5064j8741J5319L174p645
$$ -37811 -14332 -23513 -29261 -55269 -46936 -7085 -7950 11839 -3225 -21966 -6647 -3473 -11118
15584a1118j7706n412k3785m587P304n785N650K0565J7734J168j4036K076J8625
$$ -11118 -28824 -34236 -58021 -62608 -55304 -61089 -55439 -34874 -17140 -15972 -30008 -27932 -9307
15571i307J6868j4948p48k6841j9406L090j1562j0184J2475J4338J3411J4179
$$ -9307 7561 -7387 -8135 -34976 -54382 -51292 -62854 -73038 -60563 -46225 -32814 -18635
15559a8635p827q01L1442M1402O773n502j5502k4086r088m5256j1761Q449k259
$$ -18635 -26462 -27263 4179 45581 52354 46852 31350 7264 -1824 -47080 -58841 -50392 -52651
15546e2651M735P243P320o100K284j929r670J281K4512J987k1819r422k965k2619
$$ -52651 -47916 -40673 -33353 -39453 -37169 -39098 -48768 -47487 -22975 -20988 -42807 -52229 -55194 -77813
15532g7813K7558J3052j9593L751Q164r037N817m003p589J4656r223J3492M9860
$$ -77813 -50255 -37203 -56796 -53045 -44881 -53918 -48101 -52104 -59693 -45037 -54260 -40768 9092
15519I092l77j6288q267K4717J5506j2715k1418m624Q59J0116O212k1049j5444
$$ 9092 8715 -7573 -15840 8877 24383 11668 -9750 -14374 -13515 -3399 2813 -18236 -33680
15506c3680k1785p638J4038L0179j1361k1423J5485J8600j2051m599J1355M831
$$ -33680 -55465 -63103 -49065 -18886 -30247 -51670 -36185 -17585 -29636 -34235 -22880 -18049
15494a8049p701j0230N815L3481J2168k30j7227l665O08j6771P708o82k0635l3198
$$ -18049 -25750 -35980 -30165 3316 15484 15254 -1973 -5638 -5030 -21801 -14093 -14775 -35410 -68608
15480f8608J0088J8269r309M778J3211J8761j4741J718L8631k3132k2895J6586
$$ -68608 -58520 -40251 -49560 -44782 -31571 -12810 -27551 -25833 12798 -10334 -33229 -16643
15468a6643J4491Q047J745K3996j379p813j312j3552j9466Q544m185o576m1756
$$ -16643 -2152 5895 7640 31636 30257 22444 21132 7580 -11886 -3342 -7527 -14103 -55859
15455e5859o739J4864K5704L456m742R52l784Q435P414L8230J6012n32k2462q883
$$ -55859 -62598 -47734 -22030 -18574 -23316 -22364 -26148 -17713 -10299 27931 43943 43411 20949 12066
15441A2066q051m3009J5501N695q371k903k0895K5686K4440p719j1554J0503l691
$$ 12066 4015 -38994 -23493 -17798 -26169 -29072 -49967 -24281 159 -7560 -19114 -8611 -12302
15428a2302k3635l4233j9586J2851M1762P63K284j7045q299L4362L1293J7940
$$ -12302 -35937 -70170 -89756 -76905 -35143 -34380 -32096 -49141 -57440 -23078 8215 26155
15416B6155j7054q415L03P381p322j4698J991l2006J668L3081J4722p045j0323
$$ 26155 9101 686 989 8370 1048 -13650 -11659 -43665 -41997 -8916 5806 -1239 -11562
15403a1562N298r232J7272n381j7383j562r493j6479M614J7501Q177K0951N031
$$ -11562 -6264 -15496 1776 -3605 -20988 -22550 -32043 -48522 -43908 -26407 -18230 2721 7752
15390G752P528j2695k6246l2818P482K7859M124Q93j9059J9406M1439q827l0143
$$ 7752 15280 2585 -23661 -56479 -48997 -21138 -17014 -16121 -35180 -15774 25665 16838 -13305
15377a3305j9770j815K6004K5976j7404J2097J9555l0209k5981k6426k3879l810
$$ -13305 -33075 -34890 -8886 17090 -314 11783 31338 1129 -24852 -51278 -75157 -78967
15365g8967m055k0535m33L8881J2282J3007L9645L864j8850k4068j1124K5645
$$ -78967 -83022 -103557 -103990 -65109 -52827 -39820 -175 3689 -15161 -39229 -50353 -24708
15353b4708Q839l447J4564Q581j0177K304J9547j3390k447j0029O263k3396p646
$$ -24708 -15869 -19316 -4752 3829 -6348 -4044 15503 2113 -334 -10363 -4100 -27496 -35142
15340c5142r893m110K1359J0849j3074j9427M727J6734p202P561L0050L0983n035
$$ -35142 -45035 -49145 -27786 -16937 -30011 -49438 -44711 -27977 -35179 -27618 2432 33415 28380
15327B8380n888M966J8857j8619m7714j2223l40K3158n325P57l703r595K4547
$$ 28380 22492 27458 46315 27696 -20018 -32241 -32581 -9423 -14748 -13991 -17694 -27289 -2742
15314b742J196K4455o803l659k317J921k2133J2087L627k485k366k2449q210k7383
$$ -2742 -1546 22909 16106 12447 10130 12051 -10082 2005 5632 3147 781 -21668 -29878 -57261
15300e7261K7825K3078k1773k4889K1414K7031k0370k322J8304K584o174o135
$$ -57261 -29436 -6358 -28131 -53020 -31606 -4575 -24945 -27267 -8963 -6379 -12553 -18688
15288a8688J7386K1333r725l1014j0572M08N555l522J3521o009J2411K5242K1757
$$ -18688 -1302 20031 10306 -20708 -31280 -30872 -25317 -28839 -15318 -21327 -8916 16326 38083
15275C8083k0816n1615m4507j1829K2917K6394R153j3390M751J7651K4380r018
$$ 38083 17267 -34348 -78855 -90684 -67767 -41373 -32220 -45610 -40859 -23208 1172 -7846
15263g846j5817J5686j237K133j5849M304p55L9346J541l5746l473J6057J2309
$$ -7846 -23663 -7977 -9214 -7081 -22930 -18626 -19381 19965 21506 -14240 -17713 -1656 10653
15250A0653J530l018m47j3992J053M590j3764k7658j5877K4716L5934k2279j1861
$$ 10653 12183 9165 8718 -5274 -4221 369 -13395 -41053 -56930 -32214 3720 -18559 -30420
15237c0420J3053J9896L185R883j7696p589k3841P285K5132k911K937J339J7979
$$ -30420 -17367 2529 5714 15597 -2099 -9688 -33529 -26244 -1112 -4023 -1086 253 18232
15224A8232O678k6620n970J3608k5009k559J4201q26R132J712p141l2279O812
$$ 18232 24910 -1710 -7680 5928 -19081 -21640 -7439 -8265 867 2579 -4562 -36841 -30029
15211c0029J5396J7176j7058j0062j9771j7433R687J1953K3546M280l14K3318
$$ -30029 -14633 2543 -14515 -24577 -44348 -61781 -52094 -40141 -16595 -12315 -12629 10689
15199A0689J6494N913j9033j0920j1643p319q63l4702k359M9567J3635k6000j0505
$$ 10689 27183 33096 14063 3143 -8500 -15819 -16682 -51384 -53743 -4176 9459 -16541 -27046
15186b7046K533n83M646k537J1744N27M816j4637p024J2115n07q606o983L1670
$$ -27046 -24513 -25096 -20450 -22987 -11243 -10716 -5900 -20537 -27561 -15446 -15953 -24559 -31542 128
15172A28K3110k659l6498l4289q011J7166K479j516k227J543l412j3679J6672
$$ 128 23238 20579 -15919 -50208 -58219 -41053 -38574 -40090 -42317 -40774 -44186 -57865 -41193
15159d1193j985J6199P259J8040j8085J278K9224l4706q357K0293J5122L2905
$$ -41193 -43178 -26979 -19720 -1680 -19765 -18487 10737 -23969 -32326 -12033 3089 35994
15147C5994J1542j636k7413O812o487j8706k0118j2609R674J6006n159O870q058
$$ 35994 47536 45900 18487 25299 18812 106 -20012 -32621 -22947 -6941 -12100 -5230 -13288
15134a3288k623k3734N714M2744J1666l475R608J9746j9442j297J3355k8295k2669
$$ -13288 -15911 -39645 -33931 8813 20479 17004 26612 46358 26916 25619 38974 10679 -11990
15121a1990O654k1627j4589K3629J1065K1412O354J4148L549M110k0540L175Q639
$$ -11990 -5336 -26963 -41552 -17923 -6858 14554 20908 35056 38605 42715 22175 25350 33989
15108C3989j5587J0178l4044j8974K7621K0139J3768j502k6070j1199p222K624
$$ 33989 18402 28580 -5464 -24438 3183 23322 37090 35588 9518 -1681 -8903 -6279
15096f279l844k934k30O798j1895p996M634J9925n298p092k019R433K42M738q872
$$ -6279 -10123 -13057 -13287 -6489 -18384 -26380 -21746 -1821 -7119 -14211 -16230 -6797 -6555 -1817 -10689
15081a0689m7064k9455L281L0199N90j6994N999K0577M593J369p58K4903N99k2999
$$ -10689 -57753 -87208 -83927 -53728 -53138 -70132 -64133 -43556 -38963 -37594 -38352 -13449 -12850 -35849
15067c5849k1448K1753J9550q8L462J2815k618K1647J0664j21o322m549J9227
$$ -35849 -57297 -35544 -15994 -16082 -12620 195 -2423 19224 29888 29767 23445 18896 38123
15054C8123k3960l3350k1870J5175L810l81K191m650Q708K4832j2207r981J8138
$$ 38123 14163 -19187 -41057 -25882 -22072 -22453 -20262 -24912 -16204 8628 -3579 -13560 4578
15041D578l154O382M374k4775j4455R656L3645k139j6641m542L240j2307L340
$$ 4578 1424 7806 12180 -12595 -27050 -17394 16251 14112 -2529 -7071 -3831 -16138 -12798
15028a2798J7402J1703k4952l160K3123K073R630J3211j4656P212j4659j7675
$$ -12798 4604 16307 -8645 -11805 11318 13391 23021 36232 21576 28788 14129 -3546
15016c546J5012m553m183M90k7551l326J2880K4250l021j2864q124J6426Q21N99
$$ -3546 11466 6913 2730 3220 -24331 -27657 -14777 9473 6452 -6412 -14536 1890 2711 3310
15002C310P108j8204J0546N1040K2787m6710l1608P574J7214j3653j3797J5108
$$ 3310 10418 -7786 2760 53800 76587 29877 -1731 5843 23057 9404 -4393 10715
14990A0715Q612p236N70j4320R703M5887j2204l6830j8117K2238r793j7856O529
$$ 10715 19327 12091 12661 -1659 8044 53931 41727 4897 -13220 9018 -775 -18631 -12102
14977a2102J0741J6930p804K281J0435j8989l5734K2034J9649l6582L755J7623
$$ -12102 -1361 15569 7765 10046 20481 1492 -34242 -12208 7441 -29141 -25386 -7763
14965g763K2999j0803K1014J497j0775j8787J7887O744q744k698O098M055o892
$$ -7763 15236 4433 25447 26944 16169 -2618 15269 22013 13269 10571 16669 20724 13832
14952A3832l539n761j4365K0420o276j5082l928R832j717m947N755m365L118j0483
$$ 13832 10293 4532 -9833 10587 4311 -10771 -14699 -4867 -6584 -11531 -5776 -10141 -7023 -17506
14938a7506l470J3527O545J9212L568j5008Q223J829l1200q196J9076R296J2745
$$ -17506 -20976 -7449 -904 18308 21876 6868 15091 16920 -14280 -22476 -3400 5896 18641
14925A8641k359J6266r512l2616k381L751r38J973k335K8137j0934r844k0548
$$ 18641 16282 32548 23036 -9580 -11961 -8210 -9148 -7175 -9510 18627 7693 -2151 -22699
14912b2699j2180K559k3708k4177k922M5215L165K3028L1933k7839j3413R758
$$ -22699 -34879 -32320 -56028 -80205 -83127 -37912 -34747 -11719 20214 -7625 -21038 -11280
14900a1280K5930n985J8168K7503k8550j4405m430q422k1820L4976j555k1044
$$ -11280 14650 8665 26833 54336 25786 11381 6951 -1471 -23291 11685 10130 -10914
14888a0914l3860m3327R124J0042J3818K3977L2131Q942j4858q958O875P665P067
$$ -10914 -44774 -88101 -78977 -68935 -55117 -31140 991 9933 -4925 -13883 -7008 657 7724
14875G724J67k4786j6717K1053J6756j680j1351k3444j5852Q820K5510R881M444
$$ 7724 7891 -16895 -33612 -12559 4197 2517 -8834 -32278 -48130 -39310 -13800 -3919 525
14862E25K704j7843O189L2526P227j3351J2577l160o370k0484o706l280l0128
$$ 525 3229 -14614 -8425 24101 31328 17977 30554 27394 21024 540 -6166 -9446 -39574
14849c9574k0977R784k872j1847j2123R8r31M4131K5232J1476k2613l147j46J1463
$$ -39574 -60551 -50767 -53639 -65486 -77609 -77511 -78442 -34311 -9079 2397 -20216 -23363 -23509 -12046
14835a2046J2331J3778m2249m2375K7120L8976k1839j2818l1418L0148K4274J2409
$$ -12046 285 14063 -28186 -70561 -43441 -4465 -26304 -39122 -70540 -40392 -16118 -3709
14823c709m123J2515P622n571L938M374J7882l548j5126j089k5143q148J7257
$$ -3709 -7832 4683 12305 6734 10672 15046 32928 29380 14254 13165 -11978 -20126 -2869
14810b869K381k1250J9676l3032j8435K0658m124N790K6720r160q95M8o366j1461
$$ -2869 -488 -21738 -2062 -35094 -53529 -32871 -36995 -31205 -4485 -13645 -14540 -14492 -20858 -32319
14796c2319O436K4297N5J421K9813l2968J2529Q289J4651N419p112M089j2651
$$ -32319 -25883 -1586 -1531 -110 29703 -3265 9264 17553 32204 37623 30511 34600 21949
14783B1949l5680p026M3k1573N965J0339L1937R306m712l6194j8263R833L339
$$ 21949 -13731 -20757 -20714 -42287 -36322 -25983 5954 15260 10548 -25646 -43909 -34076 -30737
14770c0737L0262q351o20p607k2071j7220k0248K4725L8503L1615j0929k8422
$$ -30737 -475 -8826 -9446 -17053 -39124 -56344 -76592 -51867 -13364 18251 7322 -21100
14758b1100j073K5537J1372R443J3784Q039k600j1110p587J2108k710m3018l7829
$$ -21100 -22173 3364 14736 24179 37963 46002 43402 32292 24705 36813 34103 -8915 -46744
14745d6744Q765r961O873K3936N2742J3014l4044n9574J2973K8079L845L288J4564
$$ -46744 -37979 -47940 -41067 -17131 35611 48625 14581 -44993 -32020 -3941 -96 3192 17756
14732A7756J2844k856l5391l6570j2112J6053J8813j1958J2790P061p360J7882
$$ 17756 30600 27744 -7647 -44217 -56329 -40276 -21463 -33421 -20631 -13570 -20930 -3048
14720c048L107K466l5958k692K2260n474K1280P422K7812J2265j8685o5548j2326
$$ -3048 59 2525 -33433 -36125 -13865 -19339 1941 9363 37175 49440 30755 -34793 -47119
14707d7119K0075j2940k554K3703O964J2353J5517N203n505L712j1427L540L7513
$$ -47119 -27044 -39984 -42538 -18835 -11871 482 15999 21202 15697 19409 7982 11522 49035
14694D9035k085k8877o456j5447R588J0427k6310l487J1986m190O452J2871K3042
$$ 49035 46950 18073 11617 -3830 5758 16185 -10125 -13612 -1626 -5816 636 13507 36549
14681C6549K490J298j0510J463q761j2847o975J4929N455o478j5676N803j4779
$$ 36549 39039 40337 29827 31290 22529 9682 2707 17636 23091 16613 937 6740 -8039
14668h039j8471k4167L2619J5538M776j5340J3924j5063k4970K0429L4658J5168
$$ -8039 -26510 -50677 -18058 -2520 2256 -13084 840 -14223 -39193 -18764 15894 31062
14656C1062l6604k3858p384L9241L6378j5997k5064j3613K2032J6904n548j2786
$$ 31062 -5542 -29400 -36784 2457 38835 22838 -2226 -15839 6193 23097 17549 4763
14644D763j3725J5529R672K3928J4642j4417j0247J4171j4763J2400P023k5745
$$ 4763 -8962 6567 16239 40167 54809 40392 30145 44316 29553 41953 48976 23231
14632B3231n0311k64K4983O391j5017k529j917L704k605Q245J9490m443k1019
$$ 23231 -27080 -27344 -2361 4030 -10987 -13516 -15433 -11729 -14334 -6089 13401 8958 -12061
14619a2061J3793L6046J8101P891M00k1553l1005l165M539k4498R915J5622n110
$$ -12061 1732 37778 55879 63770 64170 42617 11612 8447 12986 -11512 -1597 14025 8915
14606H915l4440r392j3513k7792K1206L602Q4J1264p899K5L0295K6964r457O424
$$ 8915 -25525 -34917 -48430 -76222 -55016 -51414 -51330 -40066 -47965 -47940 -17645 9319 -138 6286
14592F286K0267Q781M930m095M592l162N024l1372r20R476Q585k3327m1650j6489
$$ 6286 26553 35334 40264 36169 40761 37599 42623 11251 10331 19807 28392 5065 -36585 -53074
14578e3074J5488K1955K4022Q43J4973J957j7152N760l0706K39k461n068k514
$$ -53074 -37586 -15631 8391 9234 24207 26164 9012 14772 -15934 -15695 -18156 -23224 -25738
14565b5738M409p276J0674K615j0723K6117L795j5843k5446j0354q036J6453J0423
$$ -25738 -21329 -28605 -17931 -15316 -26039 78 3873 -11970 -37416 -47770 -55806 -39353 -28930
14552b8930l60l05j3245j5009J7811m382O168j4799K9764J7207j1463l1691j3033
$$ -28930 -29290 -29595 -42840 -57849 -40038 -44420 -38252 -53051 -23287 -6080 -17543 -49234 -62267
14539f2267K3788K6239P354r153j3706K1827J5150j091J3159m059K9547k0061
$$ -62267 -38479 -12240 -4886 -14039 -27745 -5918 9232 8141 21300 17241 46788 26727
14527B6727q5o631J0746M273N706l3394k9791K0861K1511J332j5514j8176j0982
$$ 26727 26642 20011 30757 35030 40736 7342 -22449 -1588 19923 21255 5741 -12435 -23417
14514b3417k5761p552J3801L807J0315J7351J0088j0434Q804N81p912K87O136
$$ -23417 -49178 -56730 -42929 -39122 -28807 -11456 -1368 -11802 -2998 -2417 -10329 -10042 -3906
14501c906J8760K058P33L451J3878q12K440J506k0115m4294Q480l388M770P980
$$ -3906 14854 16912 17645 21096 34974 34162 36602 38108 17993 -26301 -17821 -21209 -16439 -8459
14487h459J7391K3712q291j5774J7503J5039j1624j1439j4418q622m497j7089
$$ -8459 8932 32644 24353 8579 26082 41121 29497 18058 3640 -4982 -9479 -26568
14475b6568j2200L3462K8575J6650l277j1439n132p289k26K4023j4468n078K904
$$ -26568 -38768 -5306 23269 39919 36642 25203 20071 12782 12556 36579 22111 17033 19937
14462A9937m975m197N470P094J279j2452q2m168P364j1533j5191P401J8557J3108
$$ 19937 14962 10765 16235 23329 24608 12156 12074 7906 15270 3737 -11454 -4053 14504 27612
14448B7612J0505j9285k2242L126o808r626J5465J4524L2780l725p080K383j6275
$$ 27612 38117 18832 -3410 -284 -7092 -16718 -1253 13271 46051 42326 35246 37629 21354
14435B1354N077j0591R438P165r976k3298J2112k0749l2204J613q425O502J7722
$$ 21354 26431 15840 25278 32443 22467 -831 11281 -9468 -41672 -40059 -48484 -41982 -24260
14422b4260J1648K8772J6459j1772l4404l161J7996j109M755L0002K2271k7734
$$ -24260 -12612 16160 32619 20847 -13557 -16718 1278 169 4924 34926 57197 29463
14410B9463l3004q983K0063P003l1158M331M640L8537M1172j0435n0357l1888
$$ 29463 -3541 -12524 7539 14542 -16616 -12285 -7645 30892 72064 61629 11272 -20616
14398b0616J1610R414K5628L169j7035j9639j3289q617J698L5144K1153R81j4925
$$ -20616 -9006 408 26036 29205 12170 -7469 -20758 -29375 -27677 7467 28620 29601 14676
14385A4676j9312M256k327q490j7396J2213L5176J7856J0879K1914j1205j2083
$$ 14676 -4636 -380 -2707 -11197 -28593 -16380 18796 36652 47531 69445 58240 46157
14373D6157k5252j9837k7221K755K4515K7634J992j4903k3068m361R216q41J7387
$$ 46157 20905 1068 -26153 -23398 1117 28751 30743 15840 -7228 -11589 -2373 -3214 14173
14360A4173J0253J2572K51k1989k8721M128J2734k8722O127R806J8625K2398J4977
$$ 14173 24426 36998 37249 15260 -13461 -9333 3401 -25321 -19194 -9388 9237 31635 46612
14347D6612k7622p05L008k0704O81L1682m71N253q459n277j6093j078j2441j5501
$$ 46612 18990 18285 21293 589 1270 32952 32481 37734 29275 23998 7905 6827 -5614 -21115
14333b1115K1787J1050j0219J8831K6491l648j51j0594k6834J724R315j5478j7538
$$ -21115 672 11722 1503 20334 46825 43177 43026 32432 5598 7322 16637 1159 -16379
14320a6379K0365J0963Q418R596j1107J7513p323l1628j211K6074j1154r667j4452
$$ -16379 3986 14949 23367 32963 21856 39369 32046 418 -793 25281 14127 4460 -9992
14307i992p693K4437J8457j287P653k3841n146j0337J2092L4555P375k5609j002
$$ -9992 -17685 6752 25209 23922 31575 7734 2588 -7749 4343 38898 46273 20664 19662
14294A9662o663o866K3791m643j5086j9244L093J6382M990p803O442O01o237J2960
$$ 19662 12999 6133 29924 25281 10195 -9049 -5956 10426 15416 7613 14055 14656 8419 21379
14280B1379m341L020J3876P413l2274l9401R732K6516P216J6969p587o628k590
$$ 21379 17038 20058 33934 41347 9073 -30328 -20596 5920 13136 30105 22518 15890 13300
14267A3300P302K352j0373q606j0863P007L5614J6125k281k9037l2608M057n78
$$ 13300 20602 22954 12581 3975 -6888 119 35733 51858 49577 20540 -12068 -8011 -8589
14254h589K6941l760l2098k0074o644J7821k155N594L541N002J5251R012O396
$$ -8589 18352 14592 -17506 -37580 -44224 -26403 -28558 -22964 -19423 -14421 830 9842 16238
14241A6238l823k660K3736L4280r516j1273M192L44K738M929M410k9038p101L153
$$ 16238 12415 9755 33491 67771 58255 46982 51174 51518 54256 59185 63595 34557 27456 30609
14227C0609J7758J6809j4140j2012k0615m495M796O317k9366j685L489m780j4371
$$ 30609 48367 65176 51036 39024 18409 13914 18710 25027 -4339 -6024 -2535 -7315 -21686
14214b1686K3838N454j821M441k698k0968M470Q969J6305J1524j8284k476J4433
$$ -21686 2152 7606 5785 10226 7528 -13440 -8970 -1 16304 27828 9544 7068 21501
14201B1501k3402j9801K0521P650j9600m952O195M842L64q869l422J1030J5624
$$ 21501 -1901 -21702 -1181 6469 -13131 -18083 -11888 -7046 -6682 -15551 -18973 -7943 7681
14188G681o304k0559k5536j1267J7316O0822J2864k4459k6109o212O790k2361
$$ 7681 1377 -19182 -44718 -55985 -38669 22153 35017 10558 -15551 -21763 -14973 -37334
14176c7334J221L0096L0701J9904M986k0869k67k3719m486R084J0821J283J3800
$$ -37334 -36113 -6017 24684 44588 49574 28705 28438 4719 233 9317 20138 21421 35221
14163C5221K0982J220k0225r408l8724K502J452N791J2796K403n993O48J0947
$$ 35221 56203 57423 37198 27790 -10934 -8432 -6980 -1189 11607 14010 8017 8665 19612
14150A9612j0329J3171j3963k0276K318j515O685j0743J2861K3522J1459K0952
$$ 19612 9283 22454 8491 -11785 -9467 -10982 -4297 -15040 -2179 21343 32802 53754
14138E3754k659j8362n7224k2151L969K7607L1627o87J0916l293J0296k5681m24
$$ 53754 51095 32733 -24491 -46642 -42673 -15066 16561 15874 26790 23497 33793 8112 7688
14125G688J607k8835R268K6464J5076k5856n588O893j3400J8036K0607j2140j1864
$$ 7688 9295 -19540 -10272 16192 31268 5412 -176 6717 -6683 11353 31960 19820 7956
14112G956j4224k286J2735N343j3714J7774J8244j754o780j8493k483P859L199
$$ 7956 -6268 -8554 4181 9524 -4190 13584 31828 30074 23294 4801 2318 10177 13376
14099A3376l4254k3967J3055N682m323p668L968J8618L8281K4457j8330k4458
$$ 13376 -20878 -44845 -31790 -26108 -30431 -38099 -34131 -15513 22768 47225 28895 4437
14087D437M22P715j0622k2478k9413K1181J2217j2330R207r593K0232K3989K2765
$$ 4437 4859 12574 1952 -20526 -49939 -28758 -16541 -28871 -19664 -29257 -9025 14964 37729
14074C7729R362k1806J0677J2733K1571j124K86m60j0055k8036j297j5997N738
$$ 37729 47091 25285 35962 48695 70266 69142 69428 68968 58913 30877 29580 13583 19321
14061A9321j5920k2332R014J9565O379J6472K0854o85k7954j9827J1402N091L860
$$ 19321 3401 -18931 -9917 9648 16027 32499 53353 52668 24714 4887 16289 21380 25240
14048B5240m896j9894l7803J6426K3946L5273K9640L688m5441j0359j9447K0271
$$ 25240 20344 450 -37353 -20927 3019 38292 67932 71620 26179 15820 -3627 16644
14036A6644J3679J118k172q242J0310K774J1136K553N243K7688j3822k4931o991
$$ 16644 30323 31441 29269 21027 31337 34111 45247 47800 53043 80731 66909 41978 34987
14023C4987r848k5950Q839J133M479J5704r894l548J6305j783k1948K0307o618
$$ 34987 25139 -811 8028 9161 13640 29344 19450 15902 32207 30424 8476 28783 22165
14010B2165n430K8803J5939J2384K5123n724l6084m1967j4518k265j8670k7981
$$ 22165 16735 45538 61477 73861 98984 93260 57176 15209 691 -1574 -20244 -48225
13998d8225Q570K3343K7350p407j5373p605j3183k0099K6612L3355J2033r530
$$ -48225 -39655 -16312 11038 3631 -11742 -19347 -32530 -52629 -26017 7338 19371 9841
13986I841R685J7997k11j5876j6811K5073j579j4518O298l047N519M348L206J3012
$$ 9841 19526 37523 37312 21436 4625 29698 28119 13601 19899 16852 22371 26719 29925 42937
13972D2937P760r90j0196j0095k3150j0513J6577M2920J611l0641Q397k6416j6901
$$ 42937 50697 49707 39511 29416 6266 -4247 12330 55250 56861 26220 34617 8201 -8700
13959h700J3900O012k1722J082M2200K4830o729p595m582q504l924j6517j4844
$$ -8700 5200 11212 -10510 -9428 32772 57602 50873 43278 38696 30192 26268 9751 -5093
13946e093p946j5776Q310J4112K245K0976Q549K1269J0531M704m2533n4599k8474
$$ -5093 -13039 -28815 -20505 -6393 -4148 16828 25377 46646 57177 61881 19348 -35251 -63725
13933f3725k0761K8167J2385K3245J4295o22L3014m12p739R890L882J130J1626
$$ -63725 -84486 -56319 -43934 -20689 -6394 -7016 25998 25586 17847 27737 31619 32749 44375
13920D4375L123k0514k5431J7813o949o914l563j1121N044j5907L9220L4389k9831
$$ 44375 47498 26984 1553 19366 12417 5503 1940 -9181 -4137 -20044 19176 53565 23734
13907B3734k1196J2197O289L1421j4660k9372R499k7937j2000L512J7998J8645
$$ 23734 2538 14735 21024 52445 37785 8413 17912 -10025 -22025 -18513 -515 18130
13895A8130j4799J336R211M5328j6809k9109k5439J5674L5337p47p360k6493j8508
$$ 18130 3331 4667 13878 59206 42397 13288 -12151 3523 38860 38113 30753 4260 -14248
13882a4248J0352K2199K8721o942l2593k9209K4230K6626Q490K9582j1006o265
$$ -14248 -3896 18303 47024 40082 7489 -21720 2510 29136 37626 67208 56202 49937
13870D9937j1092j5273K959L0514K7585M718k6933m5229j2204k952R003J9855
$$ 49937 38845 23572 26531 57045 84630 89348 62415 17186 4982 2030 11033 30888
13858C0888j0992J492O2j3775J6564Q505J0051l0779J2802j5601J175K4715L938
$$ 30888 19896 21388 21450 7675 24239 32744 42795 12016 24818 9217 10392 35107 39045
13845C9045J1693l4420m6859Q757K621K7166J1578J4439n286J4137j383o501J2740
$$ 39045 50738 16318 -30541 -21784 -19163 8003 19581 34020 28734 42871 41488 34987 47727
13832D7727q666L2321N994j1796K88m133j3792l1225P198J4506L1980k5515m8897
$$ 47727 39061 71382 77376 65580 65868 61735 47943 16718 23916 38422 70402 44887 -4010
13819d010j357K5518J674j6661l8543n896M330O402m553L7013K7524j2182J3732
$$ -4010 -5367 20151 21825 5164 -33379 -39275 -34945 -28543 -33096 3917 31441 19259 32991
13806C2991J430j3073n4778k2651L2769K7125J5173m171j3133q693K0145K6208
$$ 32991 34421 21348 -33430 -56081 -23312 3813 18986 14815 1682 -7011 13134 39342
13794C9342k9440k1396M4751r491k7048j370K4655J2481l6904j7989K7342N1139
$$ 39342 9902 -11494 33257 23766 -3282 -4652 20003 32484 -4420 -22409 4933 56072
13782E6072P134l768k7723l8074k0347O029L4332J6064O767k6361J1208m419O970
$$ 56072 63206 59438 31715 -6359 -26706 -20677 13655 29719 36486 10125 21333 16914 23884
13769B3884k3535p476J8412Q348J1061j0934K9203m98k5632j3873n971L20L0604
$$ 23884 349 -7127 11285 19633 30694 19760 48963 48465 22833 8960 2989 3309 33913
13756C3913J7042K8598l9810m3768l21K3666K4088o336r01J3615J6820N806l2312
$$ 33913 50955 79553 39743 -4025 -4346 19320 43408 37072 36171 49786 66606 72412 40100
13743D0100k2801j5578o399K6929K1273M050k1902j691k154r646k0256J5615J1611
$$ 40100 17299 1721 -4678 22251 43524 47574 25672 23981 21827 12181 -8075 7540 19151
13730A9151j3237j2152P2P761O439p574J7085L065k7954k2348N02L9848K3664
$$ 19151 5914 -6238 -6166 1595 8034 460 17545 20610 -7344 -29692 -29190 10658 34322
13717C4322J1440J2197j9187l608Q209J0422k2067j4565O825q68r673k8109J9629
$$ 34322 45762 57959 38772 35164 43373 53795 31728 17163 23988 23120 13447 -14662 4967
13704D967J1438J2681j3229m749P787J86p668J2630J6418J1315J9527j3989K697
$$ 4967 16405 29086 15857 11108 18895 19081 11413 24043 40461 51776 71303 57314 60011
13691F0011k075P738M2701j4610l7850j6345m443K018m949j7599q380k7988j9299
$$ 60011 57936 65674 108375 93765 55915 39570 35127 37145 32196 14597 6217 -21771 -41070
13678d1070K0655K9949j37o124J2566J3543K9105j5348l4753p774o891o401J1567
$$ -41070 -20415 9534 9397 3273 15839 29382 58487 43139 8386 612 -6279 -12680 -1113
13665a113O648j5504L0653K5024j8765l2712j1706o755J1222k837j3079N1280
$$ -1113 5535 -9969 20684 45708 26943 -5769 -17475 -24230 -13008 -15845 -28924 22356
13653B2356K5709M440K908l2352j8371q22K328j3298O127J1103Q136K7563K0706
$$ 22356 48065 52505 55413 23061 4690 3868 6196 -7102 -975 10128 18264 45827 66533
13640F6533k426J6272j754m6463l7665J4121K7012M59K0335M687p335j7368k6099
$$ 66533 64107 80379 78625 32162 -5503 8618 35630 36089 56424 61111 53776 36408 10309
13627A0309k3123J8667j5779K4391L6788R931O862m0638j2990K3181j7000P279
$$ 10309 -12814 5853 -9926 14465 51253 61184 68046 27408 14418 37599 20599 27878
13615B7878Q087K5672J216j7511j6106P868L4789J058Q404Q110j7619k2710k3003
$$ 27878 35965 61637 62853 45342 29236 37104 71893 72951 81355 89465 71846 49136 26133
13602B6133K3062k4008j5617K964R960K7804j0473j6771k463j7482J0995m858
$$ 26133 49195 25187 9570 12534 22494 50298 39825 23054 20591 3109 14104 9246
13590I246k489p287J8120j608J8592K88M390J4751l8157k0545p036J1765n911
$$ 9246 6757 -530 17590 15982 34574 34862 39252 54003 15846 -4699 -11735 30 -5881
13577e881m845j3002M2216k974l874J5571K299O86L757q87j4755k9865J7797J6967
$$ -5881 -10726 -23728 18488 15514 11640 27211 29510 30196 33953 33066 18311 -11554 6243 23210
13563B3210J411J9316L275M542M723L1593L860r48k6010m29m552j5983L2216r25
$$ 23210 24621 43937 47212 51754 56477 88070 91930 90982 64972 64543 59991 44008 76224 75299
13549G5299O453J5817l7007l5704o140J0797J1820K5655N777k0528j5481k3454
$$ 75299 81752 97569 60562 24858 18718 29515 41335 66990 72767 52239 36758 13304
13537A3304O699K7049J1772O971k241N715j5890k1512k1436k3163K3216J8329
$$ 13304 20003 47052 58824 65795 63554 69269 53379 31867 10431 -12732 10484 28813
13525B8813j0189O137J1134l1516Q260L0085J068q658k4194q696K0749L9272J9831
$$ 28813 18624 24761 35895 4379 12639 42724 43792 35134 10940 2244 22993 62265 82096
13512H2096J4876j453k7270r568R905l787o064k7982J122j083j4465K701k791
$$ 82096 96972 95519 68249 58681 68586 64799 58735 30753 31875 30792 16327 19028 16237
13499A6237j6697K1178k7798j1079K2934L3786J5888m370M407j5702l161q011
$$ 16237 -460 20718 -7080 -18159 4775 38561 54449 50079 54486 38784 35623 27612
13487B7612J7959J8416j9089r014J8805K232L575O693j2244q598n1784j5560J114
$$ 27612 45571 63987 44898 35884 54689 56921 60496 67189 54945 46347 -5437 -20997 -19883
13474a9883J0254K5139K1900L79P108j857k0236r93J9774L2071J1814M667k0644
$$ -19883 -9629 15510 37410 37789 44897 43040 22804 21811 41585 73656 85470 90137 69493
13461F9493l7310J5780m478r557p126L5986M121J451J6310K2889j8329Q582O379
$$ 69493 32183 47963 43485 33928 26802 62788 66909 68360 84670 107559 89230 97812 104191
13448A04191l041J6354j5286k2437j9232k059m098n45K1118K7277L522j3599O51
$$ 104191 101150 117504 102218 79781 60549 58490 54392 53847 74965 102242 105764 92165 92816
13435I2816j4675k5436L629J2380k3189j1196O637M626r241j3712L971L3061l754
$$ 92816 78141 52705 56334 68714 45525 34329 40966 45592 36351 22639 26610 59671 55917
13422E5917m8472K1816O015J1588K6714M417n110j9207L673K0736K0521j1814
$$ 55917 7445 29261 35276 46864 73578 77995 72885 53678 57351 78087 98608 86794
13410H6794j8777J1671l6573k6408M816j3907j3490L9222L1590o162j65K8625
$$ 86794 68017 79688 43115 16707 21523 7616 -5874 33348 64938 58776 58611 87236
13398H7236L550r936r473r117J3716j5469k980K6762j7778k3634N412J4811O941
$$ 87236 90786 80850 71377 62260 75976 60507 57527 84289 66511 42877 48289 63100 70041
13385G0041j0102j6310j7514Q890J8184J376J8463L3739J2138l2204J310j2001
$$ 70041 59939 43629 26115 35005 53189 54565 73028 106767 118905 86701 88011 76010
13373G6010j6138J382M887M008L5943Q81J2652j7038k9967J6010J8409M143K0168
$$ 76010 59872 61254 66141 70149 106092 106973 119625 102587 72620 88630 107039 111182 131350
13360A31350K6530J005j9026J2291L8986L6526m656m228K7179J0877J1079L232
$$ 131350 157880 158885 139859 152150 191136 227662 223006 218778 245957 256834 267913 271145
13348B71145L9724L2409K7242P7469J08122J03521J73514J98129K56254L60216
$$ 271145 310869 343278 370520 447989 556111 659632 833146 1031275 1287529 1647745
13338A647745M11492L09575J17869j94506m86168n59563m02894k35585j23688
$$ 1647745 2059237 2368812 2486681 2292175 1806007 1246444 843550 607965 484277
13329D84277n9496p073k3696m7729n3176l0950J3518J526r718l97j0614Q855J9496
$$ 484277 424781 417708 394012 346283 293107 262157 275675 277201 267483 267086 256472 265327 284823
13316B84823k4557p471j0876j2394j1289l7364j4416J9786m664J2126j623m0093
$$ 284823 260266 252795 241919 229525 218236 180872 166456 186242 181578 193704 192081 151988
13304A51988k1197j4053p121K4021K9442j3121J0608J7155k2800k8613j1548k3638
$$ 151988 130791 116738 109617 133638 163080 149959 160567 177722 154922 126309 114761 91123
13292I1123j0980m547Q538j3063j6594J731K5851l357j3519K4635J5371l3123
$$ 91123 80143 75596 84134 71071 54477 56208 82059 78702 65183 89818 105189 72066
13280G2066p001J9296K874K1154J8346k8450j7944J471r0j4367K22J4267P877
$$ 72066 65065 84361 87235 108389 126735 98285 80341 81812 81722 67355 67577 81844 89721
13267H9721L0713q307j7575O496N742J907J5958L217l1820j2061o9J7366J133
$$ 89721 120434 112127 94552 101048 106790 108697 124655 127872 96052 83991 83922 101288 102421
13254A02421O185j1832M585L0524k4443k0232p765n272P331l905O455k0693r862
$$ 102421 108606 96774 101359 131883 107440 87208 79443 74171 81502 77597 84052 63359 53497
13241E3497J511O904L1491r404J6956Q91k3554J9239J5240l5284J1619K1513l0848
$$ 53497 55008 61912 93403 83999 100955 101846 78292 97531 112771 77487 89106 110619 79771
13228G9771J16K0971K785K155j1936j0534J7974k3358j5837m036k5960j7932k579
$$ 79771 79887 100858 103643 105798 93862 83328 101302 77944 62107 58071 32111 14179 11600
13215A1600R704J5430r333j5455P504K0947J3816K335j6421J3700M6510L7993
$$ 11600 21304 36734 27401 11946 19450 40397 54213 56548 40127 53827 100337 138330
13203A38330K021k0608L628K6838L491k3555j9L8642J2740J35O392K5646J9075
$$ 138330 140351 119743 123371 150209 153700 130145 130126 168768 181508 181643 188035 213681 232756
13190B32756m8681m0502J571K4216J5478j1816n926M716o962m300l897k0776P293
$$ 232756 184075 143573 145144 169360 184838 173022 167096 171812 164850 160550 156653 135877 143170
13177A43170M036j0214J2424P630j4830l480L7630L592r281J6406L572K3788j3845
$$ 143170 147206 136992 149416 157046 142216 138736 176366 179958 170677 187083 190655 214443 200598
13164B00598J3755L2299N632n075K670J5647K5444J3553m369L0081J4752K7636
$$ 200598 214353 246652 252284 247209 249879 265526 290970 304523 300154 330235 344987 372623
13152C72623M3496O5474O6412K2507L7060L6032O6730R8200J16606J25333J90814
$$ 372623 416119 481593 548005 570512 607572 643604 710334 808534 925140 1050473 1241287
13141A241287K72295L88513M06932L20604J37722j70185n35107o08985m20487
$$ 1241287 1513582 1902095 2309027 2629631 2767353 2597168 2062061 1453076 1032589
13132A032589k13494j29404j19153o5352k9818q986J1632K440j9201j7251l0083
$$ 1032589 819095 689691 570538 505186 475368 466382 478014 480454 461253 444002 413919
13121D13919k7712P435j4617j7299p44j4174K3725O0437M4262j4957m5128k0703
$$ 413919 386207 393642 379025 361726 360982 346808 370533 430970 475232 460275 415147 394444
13109C94444l9358l9998k4905k4062l061o399j7769J5781N776L6353l481l5630
$$ 394444 355086 315088 290183 266121 263060 256661 238892 254673 260449 296802 293321 257691
13097B57691m1496j9079j620K5252Q524j3243N514L8806K0980L9341K9944L7079
$$ 257691 216195 197116 195496 220748 229272 216029 221543 260349 281329 320670 350614 387693
13085C87693P5552M1733K0760L3605l6797l9174n8240m3287j1250K7799K9983
$$ 387693 463245 504978 525738 559343 522546 483372 425132 381845 370595 398394 428377
13074D28377r615k0039j2067m917j4689l320j4564j468K1601l930k1854l4107
$$ 428377 418762 398723 386656 381739 367050 363730 349166 347698 369299 365369 343515 309408
13062C09408o359j2548Q13O263O917L0633K3858L0640P1056P5062L4154j8019
$$ 309408 303049 290501 291314 297577 304494 335127 358985 389625 460681 535743 569897 551878
13050E51878p2067o8551o2420n1067j4788k3171o1701l3753L3675M9073L6956
$$ 551878 479811 411260 348840 297773 282985 259814 198113 164360 198035 247108 284064
13039B84064M5133L5429J2571J9192L5528M5342O2245O7221P7625M7242M6195
$$ 284064 329197 364626 377197 396389 431917 477259 539504 606725 684350 731592 777787
13028G77787M0918P1655J33516J29006O2575p0497r4121l8828m5444j06753q2004
$$ 777787 818705 890360 1023876 1152882 1215457 1144960 1050839 1012011 966567 859814 777810
13017G77810j1829o8723r8329m4301k7613m8079l3414L0184J5917p988j8530l4842
$$ 777810 765981 697258 598929 554628 527015 478936 445522 475706 491623 483635 465105 430263
13005D30263m046O791J4586k71J9302K2513L6781J3040m424M4830P7591P4482
$$ 430263 426217 433008 447594 447323 466625 489138 525919 538959 534535 579365 656956 731438
12993G31438L6644L6688O3820N2981J6641k0651K7957M9868n54k888J6764L1764
$$ 731438 768082 804770 868590 921571 938212 917561 945518 995386 994832 991944 1008708 1040472
12981A040472K9160p027J7227K5818L0893R654P952J4772j2204k8681N586K5094
$$ 1040472 1069632 1062605 1079832 1105650 1136543 1146197 1154149 1168921 1156717 1128036 1133622 1158716
12969A158716K6651M9897K2987P774M1206L7751K7046L4362L5653K8112K5993
$$ 1158716 1185367 1235264 1258251 1266025 1307231 1344982 1372028 1406390 1442043 1470155 1496148
12958A496148j2610L48k503K8088R226K5039N1605N4524N1945K399L4200R8890
$$ 1496148 1483538 1483886 1481383 1509471 1518697 1543736 1595341 1649865 1701810 1704209 1738409 1837299
12946A837299J54263J21585J13979J22530J08114Q2600J28777J19487J62116K00667
$$ 1837299 1991562 2113147 2227126 2349656 2457770 2540370 2669147 2788634 2950750 3151417
12936C151417J80166K02825K37109J90566J87947K33245K24173J85210K54209
$$ 3151417 3331583 3534408 3771517 3962083 4150030 4383275 4607448 4792658 5046867
12927E046867L90090M06172M60780N93276O49785P44081Q41056Q96713R59830
$$ 5046867 5436957 5843129 6303909 6897185 7546970 8291051 9132107 10028820 10988650
12918A0988650J049984J208041J315719J420994J513317J680285J976645K436807
$$ 10988650 12038634 13246675 14562394 15983388 17496705 19176990 21153635 23590442
12910B3590442L045529L835653M784548N897913P143595Q742890J1212262J5029177
$$ 23590442 26635971 30471624 35256172 41154085 48297680 57040570 68252832 83282009
12902H3282009K0530137K7822511L6617182M6923810O0295890P3075647P2302737
$$ 83282009 103812146 131634657 168251839 215175649 275471539 348547186 420849923
12895D20849923M6280774p003432p3080195j07065704r0705771n5839704l1643975
$$ 420849923 467130697 460127265 387047070 279981366 189275595 133435891 101791916
12888A01791916j8786021j2313487q939576o821144n323609m250249l628392l184444
$$ 101791916 83005895 70692408 61752832 54931688 49608079 45357830 41729438 38544994
12880C8544994k589630j961733j458640j154091r46255o80013l87931n5203J86182
$$ 38544994 35955364 33993631 32534991 31380900 30434645 29754632 29366701 29311498 29497680
12871B9497680j19302q56587j456462j631100j650665j563151j488837j441489
$$ 29497680 29378378 28521791 27065329 25434229 23783564 22220413 20731576 19290087
12863A9290087j388106j329966j211075j105323j026964r73116q81901p79589
$$ 19290087 17901981 16572015 15360940 14255617 13228653 12255537 11373636 10594047
12855A0594047o62466o01699n30459m84421m30893l80414m13963l84874l47168
$$ 10594047 9931581 9329882 8799423 8315002 7884109 7503695 7089732 6704858 6357690
12846F357690l45273k96251k19910k33510k62932k43719k54272k18556j45941
$$ 6357690 6012417 5716166 5496256 5262746 4999814 4756095 4501823 4283267 4137326
12837D137326j24582j14172j10146j57685k11895k28110k44668k05372j48806
$$ 4137326 4012744 3898572 3788426 3630741 3418846 3190736 2946068 2740696 2591890
12828B591890j11321q9037q9321p2709l2459L3910M1401L4359j8975n1642j24537
$$ 2591890 2480569 2391532 2302211 2229502 2197043 2230953 2272354 2306713 2287738 2236096 2111559
12817B111559j71121j56154o5307m8164j6942j39J9398J8761L2795M6742L8408
$$ 2111559 1940438 1784284 1718977 1670813 1653871 1653732 1673130 1691891 1724686 1771428 1809836
12806A809836r484o2140j55863p8703o3979j64300p6105l9890p0284r7146p2605
$$ 1809836 1800352 1738212 1582349 1503646 1439667 1275367 1199262 1159372 1089088 991942 919337
12795I19337l4030o934J6197O390P16Q300j622j2020l4926k9905k4584j753k63
$$ 919337 885307 878373 894570 900960 901676 909976 908354 896334 861408 831503 806919 805166 804903
12782H04903J6474O0954P5283P5822J16466R3538J07937J29767Q4940N8422K9237
$$ 804903 821377 882331 957614 1033436 1149902 1243440 1351377 1481144 1566084 1624506 1653743
12771A653743N9765L0020M495k4159q4176q9103r2275q0475p0022k8041q459J4388
$$ 1653743 1713508 1743528 1748023 1723864 1639688 1550585 1458310 1377835 1307813 1279772 1271313 1285701
12759A285701N565O669M745O118J1998j2241J1717K3175J4741J0562K4102N9252
$$ 1285701 1291266 1297935 1302680 1308798 1320796 1308555 1320272 1343447 1358188 1368750 1392852 1452104
12747A452104P1394P9482J8859o46k5399j8039k0427l6289o9047l1344N9220P7922
$$ 1452104 1523498 1602980 1621839 1621193 1595794 1577755 1557328 1521039 1451992 1420648 1479868 1557790
12735A557790J30336R4671L7328O8476Q3998L3087J8043P2334J18572J08235P8035
$$ 1557790 1688126 1782797 1820125 1888601 1972599 2005686 2023729 2096063 2214635 2322870 2400905
12724B400905P3901J00103J13897K04244K24590J67024J11362J61408J70956J70413
$$ 2400905 2474806 2574909 2688806 2893050 3117640 3284664 3396026 3557434 3728390 3898803
12714C898803J60166J65341J79459K41484K81788K97220L88371M74058N32910
$$ 3898803 4058969 4224310 4403769 4645253 4927041 5224261 5612632 6086690 6619600
12705F619600O96607Q21869R00608R97229J058115J093154J217815J382718J457426
$$ 6619600 7316207 8138076 9038684 10035913 11094028 12187182 13404997 14787715 16245141
12696A6245141J518690J659066J977210K452360L071669L798797M578300N462975
$$ 16245141 17763831 19422897 21400107 23852467 26924136 30722933 35301233 40764208
12688D0764208O427565P741464J0255455J4376062J9912241K7180124L6383245
$$ 40764208 47191773 54933237 65188692 79564754 99476995 126657119 163040364
12681A63040364M6372195N8765201P4665373P6947845N3942837K426547p1816491
$$ 163040364 209412559 268177760 342843133 419790978 473733815 476160362 404343871
12674D04343871j18871616r4620276n6472265l2345340j9544547j2750894q885470
$$ 404343871 285472255 190851979 134379714 102034374 82489827 69738933 60853463
12667F0853463o523323m898719l822741l064617k607986k445284k209743j772396
$$ 60853463 54330140 49431421 45608680 42544063 39936077 37490793 35281050 33508654
12659C3508654j396183j056715p68872m44553n7195K18918l8196r08177j529142
$$ 33508654 32112471 31055756 30286884 29842331 29785136 30004054 29965858 29057681 27528539
12650B7528539j701564j676447j604149j484243j378656j299430j240451j266541
$$ 27528539 25826975 24150528 22546379 21062136 19683480 18384050 17143599 15877058
12642A5877058j259091j140885j015300r22030q16719o94207o13780n72200n07624
$$ 15877058 14617967 13477082 12461782 11539752 10723033 10028826 9415046 8842846 8335222
12633H335222m39595m07425l82196l87316l80780l60030l16693k58543k08944
$$ 8335222 7895627 7488202 7106006 6718690 6337910 5977880 5661187 5402644 5193700
12624E193700k47665k51617k47540k47035k35277j85821j72582j91752j75293
$$ 5193700 4946035 4694418 4446878 4199843 3964566 3778745 3606163 3414411 3239118
12615C239118j74574j76966j82948j41609j52962j04800r4173o5321r6752q1434
$$ 3239118 3064544 2887578 2704630 2563021 2410059 2305259 2211086 2145765 2049013 1967579
12605A967579j03608p9540m1458n2457n3148n4797r6367j05507m9086p4695q5422
$$ 1967579 1863971 1784431 1742973 1690516 1637368 1582571 1486204 1380697 1331611 1256916 1171494
12594A171494l8180j9024j5425l0398m4595o0496n9064m7217o9604n6909l9581
$$ 1171494 1133314 1114290 1098865 1068467 1023872 963376 904312 857095 787491 730582 691001
12583F91001l691j6729k361l377N101M0599K6683k5789l349r162j128q770q307
$$ 691001 687310 670581 668220 664843 669944 710543 737226 711437 708088 698926 697798 689028 680721
12570F80721j4884o9049l6934j3806J5356j8522k5820K2709O0270L6560L1609
$$ 680721 665837 596788 559854 546048 561404 542882 517062 539771 600041 636601 668210
12559F68210O6234N8581P8906O5535L815Q918K7798J6166q749l1339q5421j32536
$$ 668210 734444 793025 871931 937466 941281 950199 977997 994163 985414 954075 868654 736118
12547G36118j25628n2938n6611p9778m0011Q971K946l6215l4920l486Q397L8194
$$ 736118 610490 557552 500941 421163 381152 390123 393069 356854 321934 318448 326845 365039
12535C65039L745J0617k1741j2856K9811K6724L2533J7351k9772q0992o5176o5368
$$ 365039 368784 379401 357660 344804 374615 401339 433872 451223 421451 340459 275283 209915
12523B09915j9699p177n7234l3929J9194R7185O8183N8465M9451J6981L748l1346
$$ 209915 190216 183039 125805 91876 111070 208255 276438 334903 384354 401335 405083 373737
12511C73737m4533M791P038j1281j7718l9600J2623J0281j50j2746j1012m4105
$$ 373737 329204 333995 341033 329752 312034 272434 285057 295338 295188 282442 271430 227325
12499B27325j6845o708K4465K5816K050j1169k5458n9531l0726l6478n2653p015
$$ 227325 210480 203772 228237 254053 256103 244934 219476 159945 129219 92741 40088 33073
12487C3073M6910N8537N7382M2862L3746K9485J1420k7568j9174J2012k6831P010
$$ 33073 79983 138520 195902 238764 272510 301995 313415 285847 266673 278685 251854 258864
12475B58864M973J1219M4350K2082j6809k8507r45J1471M2809p387J987o065K787
$$ 258864 263837 275056 319406 341488 324679 296172 295227 306698 349507 342120 344107 338042 340829
12462C40829J4265K7339P1957M8912J3660j6231j348J6777N8873J21493J60552
$$ 340829 355094 382433 454390 503302 516962 500731 499383 516160 575033 696526 857078
12451H57078K09193K48901L21996L97063L39840J37508k13485m66730m81246l43753
$$ 857078 1066271 1315172 1637168 2034231 2374071 2511579 2298094 1831364 1350118 1006365
12441A006365k18898j50045j26439q2344q8479p8213Q580j1060k9584k6955j0855
$$ 1006365 787467 637422 510983 428639 340160 261947 270527 259467 229883 202928 192073
12430A92073Q161K6815J1819O067r845P602j5858j3415k3160k4582K9196M7874
$$ 192073 200234 227049 238868 244935 235090 242692 226834 213419 190259 165677 194873 242747
12418B42747K526j7673k4583j888j4841k0422r141k779l7186r30J1874l4171k897
$$ 242747 245273 227600 203017 201129 186288 165866 156725 153946 116760 115830 127704 93533 90636
12405I0636L6289L3475j0862n4541j4559L293J1792J7724J8500J974k6307L625
$$ 90636 126925 160400 149538 94997 80438 83731 95523 113247 131747 133721 107414 111039
12393A11039K811n2015m4450M861J0094J0558q090M063k385K5805M1547J236m3459
$$ 111039 113850 61835 17385 22246 32340 42898 34808 38871 36486 62291 103838 105074 61615
12380F1615p599M979N351O91J0838J3760J3297P724j1871O800J7545M503R82K8920
$$ 61615 54016 58995 64346 65037 75875 89635 102932 110656 98785 105585 123130 127633 128615 157535
12366A57535R563m4536j2137K5350O524R762J1949M4114J0565j9709k2522j1240
$$ 157535 167098 122562 110425 135775 142299 152061 164010 208124 218689 198980 176458 165218
12354A65218K9995J231o7250l8490k1312j5133j478q911J2674M596k9033j9196
$$ 165218 195213 196444 129194 90704 69392 54259 52781 43870 56544 61140 32107 12911
12342A2911J8730M741K6425J3712K4768j3882j4939J670l666j2347J7990j7914
$$ 12911 31641 36382 62807 76519 101287 87405 72466 74136 70470 58123 76113 58199
12330E8199k5514j1859L4854K8627J0896q853j2770l4576j6572k479q702j5997
$$ 58199 32685 20826 55680 84307 95203 86350 73580 39004 22432 19953 11251 -4746
12318d746J3258J434L297L1872Q890k0j704N496J5364J9667m618P283N511m0109
$$ -4746 8512 9946 13243 45115 54005 53985 52281 57777 73141 92808 88190 95473 100984 60875
12304F0875r844K8057R730r751l0403N311K2430m493j8093m81j735k4579J486
$$ 60875 51031 79088 88818 79067 48664 53975 76405 71912 53819 53338 51603 27024 28510
12291B8510p115j8693L3339K053j02k890q192J0904K4819n102k6796l9287L246
$$ 28510 21395 2702 36041 38094 37992 35102 26910 37814 62633 57531 30735 -8552 -5306
12278e306N1709L3019j1143r303J7966q197j8575L0689Q431k9526l1817j9602
$$ -5306 46403 79422 68279 58976 76942 68745 50170 80859 89290 59764 27947 8345
12266H345L893O441K024j2229M492J486q624j9J0889L6062P748k8258l1123J1423
$$ 8345 12238 18679 20703 8474 12966 14452 5828 5809 16698 52760 60508 32250 1127 12550
12252A2550K1558k790r712N061L4731L4480P591j1941j405J189k4631j0708J6437
$$ 12550 34108 31318 21606 26667 61398 95878 103469 91528 90123 91312 66681 55973 72410
12239G2410k703M973n594L1581L7876j2580k0050R224N368p400l502K2820K7046
$$ 72410 69707 74680 69086 100667 138543 125963 105913 115137 120505 113105 109603 132423 159469
12226A59469L4427j7754o756K9556M4507J1539J045K8389M3566O3697R9888J51478
$$ 159469 193896 176142 169386 198942 243449 254988 256033 284422 327988 391685 491573 643051
12214F43051J97405K44546L06535L98579M11126L11546Q9526k59047n81895n33814
$$ 643051 840456 1085002 1391537 1790116 2201242 2512788 2602314 2343267 1761372 1227558
12204A227558l62443k26354j22477q2395n3292k4422k2306k7146j5746j3261j0415
$$ 1227558 865115 638761 516284 433889 380597 356175 333869 306723 290977 277716 267301
12193B67301o346j7653k0360j3578j4823P875j9022j1539K5189o979j9436Q291
$$ 267301 260955 243302 222942 209364 194541 202416 183394 171855 197044 190065 170629 178920
12181A78920K3058R73K841j9480l6469n295l1369j5703R288r126j9816l6186M821
$$ 178920 201978 202951 205792 186312 149843 144548 113179 97476 106764 97638 77822 41636 46457
12168D6457J6649K7605J0064j7157l071J5088j94k2551j3345j7708J1259L5371
$$ 46457 63106 90711 100775 83618 80547 95635 95441 72890 59545 41837 53096 88467
12156H8467j5734m39j315m5434j303J7533K0635J0554j8813R30J9894M371n505
$$ 88467 72733 72294 70979 25545 24242 41775 62410 72964 54151 55081 74975 79346 73841
12143G3841k4147j6212K533J339r026J860j337r317o610P38m435k9730l571M423
$$ 73841 49694 33482 36015 37354 28328 30188 28851 19534 12924 13662 9227 -20503 -24074 -19651
12129a9651m563K4020k1449j5654L0712j1543j2726O503J8188M066O447L1550
$$ -19651 -24214 -194 -21643 -37297 -6585 -18128 -30854 -24351 -6163 -2097 4350 35900
12117C5900r85j5192k2779K794J821o638K1521j9935m7430r021K9153L5254J3073
$$ 35900 34915 19723 -3056 -262 1559 -5079 16442 -3493 -50923 -59944 -30791 4463 17536
12104A7536m237k8686K9690J7274k95k3730j5755L565J2466J885N566J3102k9865
$$ 17536 13299 -15387 14303 31577 31282 7552 -8203 -4638 7828 9713 15279 28381 -1484
12091a484J110J8063J6296q338O240q20J4884J6490o705m387J5575j1011r195
$$ -1484 -374 17689 33985 25647 31887 31067 45951 62441 55736 51349 66924 55913 46718
12078D6718j4491k131j2135J5306L1545l9394l3699k057l021K818L4674J042Q794
$$ 46718 32227 30096 17961 33267 64812 25418 -8281 -10338 -13359 -10541 24133 25175 33969
12065C3969J132l6376j5231j4637J3184M5456J1191J2581j520r460l8179K378
$$ 33969 35101 -1275 -16506 -31143 -17959 27497 38688 51269 49749 40289 2110 4488
12053D488J7244j505j5616J3106J0078j94m420j2976j9851O689L234J172K16l7428
$$ 4488 21732 20227 4611 17717 27795 27601 23181 10205 -9646 -2957 277 1449 1665 -35763
12039c5763P518J8810K839J6339J9540Q640j1550k6557l630j0744j6096j1304
$$ -35763 -28245 -9435 -6596 9743 29283 37923 26373 -184 -3814 -14558 -30654 -41958
12027d1958M2154J1663p335Q536L001J7309K749r628j692J5018q381j0120P907
$$ -41958 196 11859 4524 13060 16061 33370 36119 26491 24799 39817 31436 21316 29223
12014B9223J9054L734j4408k9593J4487K9030k6198k5247j0734n103r157j2491
$$ 29223 48277 52011 37603 8010 22497 51527 25329 82 -10652 -15755 -24912 -37403
12002c7403J0509K0082K839O776r48K623k604q347N465l250P974J3023r609k5289
$$ -37403 -26894 -6812 -3973 2803 1855 4478 1874 -6473 -1008 -4258 3716 16739 7130 -18159
11988a8159m1073L6275l367k6900M57J0211J0960J0946L9795K1109N331l7195
$$ -18159 -59232 -22957 -26324 -53224 -52767 -42556 -31596 -20650 19145 40254 45585 8390
11976H390k7558o233q861K658J5192K504J4956P008R945j687j7688k3688J3394
$$ 8390 -19168 -25401 -34262 -31604 -16412 -13908 1048 8056 18001 16314 -1374 -25062 -11668
11963a1668L3844J2977O147j6096k0692J6335l907o282J3851J8986j4400k0321
$$ -11668 22176 35153 41300 25204 4512 20847 16940 10658 24509 43495 29095 8774
11951H774L2485R267l2672j9850K1487J3545N204j7513k4697K2144P536j6257
$$ 8774 41259 50526 17854 -1996 19491 33036 38240 20727 -3970 18174 25710 9453
11939I453j3393j5966J507K0986J0531j4326J5540j8430L90K364r950P979k745
$$ 9453 -3940 -19906 -18399 2587 13118 -1208 14332 -4098 -3708 -1344 -11294 -3315 -6060
11926f060k2556r836L3486K0852m5079j8707K855k0384R957K1075J8700O655p638
$$ -6060 -28616 -38452 -4966 15886 -29193 -47900 -45045 -65429 -55472 -34397 -15697 -9042 -16680
11913a6680J4028j2213J534L421m129J4330l1530N580J8963k235j6096L256j7631
$$ -16680 -2652 -14865 -13331 -9910 -14039 291 -31239 -25659 -6696 -8931 -25027 -21771 -39402
11900c9402m501J0200K5140k0913j0907M538J0765O358j4870q378j1072l704n389
$$ -39402 -43903 -33703 -8563 -29476 -40383 -35845 -25080 -18722 -33592 -41970 -53042 -56746 -62135
11887f2135J1603M6082K3421K941O466k9890j3683l758m383J5956J2331L264o210
$$ -62135 -50532 -4450 18971 21912 28378 -1512 -15195 -18953 -23336 -7380 4951 8215 2005
11874B005l4576j6429J1541M03K9910K4190J5301p476j8245k326k093k5449L528
$$ 2005 -32571 -49000 -37459 -37056 -7146 17044 32345 24869 6624 4298 2205 -23244 -19716
11861a9716J6141M727K843k798p894l048L0667q501l2810j4135k3942K5462J0675
$$ -19716 -3575 1152 3995 1197 -6697 -9745 20922 12421 -20389 -34524 -58466 -33004 -22329
11848b2329Q425j7053k967J7183J4542J5176o376k8204K9821K9192J7185j5051
$$ -22329 -13904 -30957 -33924 -16741 -2199 12977 6601 -21603 8218 37410 54595 39544
11836C9544l413k6128m1187m666r183p306J8396M5005J4757p59J686N914k6716
$$ 39544 36131 10003 -31184 -35850 -45033 -52339 -33943 11062 25819 25060 26746 32660 5944
11823E944l6223Q916K9732J0294J968j3184k139K0228l743m184m771N240J019
$$ 5944 -30279 -21363 8369 18663 20631 7447 5308 25536 21793 17609 12838 18078 19097
11810A9097J696m3933j2949J2258O229j2690k685j0822J3299P487J0728J4217
$$ 19097 20793 -23140 -36089 -23831 -17602 -30292 -32977 -43799 -30500 -23013 -12285 1932
11798A932M600J4133o215p949K038j591k0986J2706L534j2471L244J0713j5470
$$ 1932 6532 20665 14450 6501 8539 6948 -14038 -1332 2202 -10269 -7025 3688 -11782
11785a1782Q793J324k2802J5783L0658j3679j8666P17R763r542j9516J626J5007
$$ -11782 -2989 -1665 -24467 -8684 21974 8295 -10371 -9654 109 -9433 -28949 -27323 -12316
11772a2316Q224p764j8961M514M243K04O79P7K4447K4588k012j4361k6775L053
$$ -12316 -4092 -11856 -30817 -26303 -22060 -21856 -21177 -21100 3347 27935 25923 11562 -15213 -12160
11758a2160Q77l797r24j2138J163l718J1435J8246l9290K5K8236j626Q293k03
$$ -12160 -11283 -15080 -16004 -28142 -26979 -30697 -19262 -1016 -40306 -40281 -12045 -13671 -5378 -5581
11744e581o992Q145J1067l0342j4111J6423J737j4515J4984J1804k191r751J7111
$$ -5581 -12573 -4428 6639 -23703 -37814 -21391 -19654 -34169 -19185 -7381 -9572 -19323 -2212
11731b212J7096J574K4796K0854K2178k9576m3047q10Q318j4062j1764R793J5740
$$ -2212 14884 16458 41254 62108 84286 54710 11663 10853 19171 5109 -6655 3138 18878
11718A8878l177j8017N511O880k7376L1032M1788l6586k6062k178q924L776j9665
$$ 18878 15701 -2316 3195 10075 -17301 13731 55519 18933 -7129 -9307 -18231 -14455 -34120
11705c4120n658J0516j2176R655K0301k2043o372J4172j7041p17J1049J195j3132
$$ -34120 -39778 -29262 -41438 -31783 -11482 -33525 -39897 -25725 -42766 -43483 -32434 -31239 -44371
11692d4371L517J3360p33K0839J0108J2833l489l6843k0329J8217j267r115P738
$$ -44371 -40854 -27494 -28227 -7388 2720 15553 12064 -24779 -45108 -26891 -28158 -37273 -29535
11679b9535L2566L5660j78N565k2814j2889j0948k614L01j3001n597Q033p529
$$ -29535 3031 38691 38513 44078 21264 8375 -2573 -5187 -4886 -17887 -23484 -15451 -22980
11666b2980k135k1618k5121K1517L2115K1220L8659K3626r444j1329m4696J3049
$$ -22980 -25115 -46733 -71854 -50337 -18222 2998 41657 65283 55839 44510 -186 12863
11654A2863J6812l4992k1436J0189J7818j5292N166J8414n73k5823j5624K5337
$$ 12863 29675 -5317 -26753 -16564 1254 -14038 -8872 9542 8969 -16854 -32478 -7141
11642g141o648m0446k187J6645J8139k0105O64J7284J537k1298J9485L2815l8612
$$ -7141 -13789 -54235 -56422 -39777 -21638 -41743 -41079 -23795 -22258 -43556 -24071 8744 -29868
11629b9868j7527J1203n394R958K669L238n514p600o19j2196m863L0877K1848
$$ -29868 -47395 -36192 -41586 -31628 -28959 -25721 -31235 -38835 -39454 -51650 -56513 -25636 -3788
11616c788K1533N631l1154k4386J2359L9741k929M137k2295q944o485P134j811
$$ -3788 17745 23376 -7778 -32164 -19805 19936 17007 21144 -1151 -10095 -16580 -9446 -11257
11603a1257K8491J6549j9249j9087P383P353J334j7546O51J926m94l795j5919
$$ -11257 17234 33783 14534 -4553 2830 10183 11517 -6029 -5378 -3452 -3946 -7741 -23660
11590b3660k991L4303j410J9514J5211m031k1358l0834J0228k4395j4016k281
$$ -23660 -26651 7652 6242 25756 40967 36936 15578 -15256 -5028 -29423 -43439 -45720
11578d5720j664L7920K3471k6376j3154M6469L453J838M28j1135m405K663l496
$$ -45720 -47384 -9464 14007 -12369 -25523 20946 24399 26237 26665 15530 11125 13788 10292
11565A0292l3272j3787Q373J5759L979J6486J3385m3068k9834O089M1153J9841
$$ 10292 -22980 -36767 -28394 -12635 -8656 7830 21215 -21853 -51687 -45598 -4445 15396
11553A5396p628m863l620m546J4199j2836o270Q594O137l66R972L9374J7247j2182
$$ 15396 7768 2905 -715 -5261 8938 -3898 -10168 -1574 4563 4197 14169 53543 70790 58608
11539E8608l5369k3800j1977L876r298o56K6506k475j4771M288N572j1699k7841
$$ 58608 23239 -561 -12538 -8662 -17960 -18616 7890 5415 -9356 -5068 504 -11195 -39036
11526c9036O676P260Q417N212J1027l076l868k0213K1037J8312l9120J970P756
$$ -39036 -32360 -25100 -16683 -11471 -444 -3520 -7388 -27601 -6564 11748 -27372 -25402 -17646
11513a7646Q501J4600L472q488K4381K0111j3687j9221l4720n199R20m800L216
$$ -17646 -9145 5455 8927 439 24820 44931 31244 12023 -22697 -27896 -26976 -31776 -28560
11500b8560o317P313K1125J6948O42k2006j9681J8858P491k5125J7902n971k0884
$$ -28560 -34877 -27564 -6439 10509 11151 -10855 -30536 -11678 -4187 -29312 -11410 -17381 -38265
11487c8265O220R169J1140J6078j5206j2478Q982M2863J200k1058O93j368j7090
$$ -38265 -32045 -22876 -11736 4342 -10864 -23342 -14360 28503 29703 8645 9338 7970 -9120
11474i120k052r146j1579J6126J5799J9629P121k6696K039q593j4116r149j7003
$$ -9120 -11172 -20318 -31897 -15771 28 19657 26778 82 2121 -6472 -20588 -29737 -46740
11461d6740j9610o676K607J9420L2074J6462J1952o576r200j9379M358L2236J3068
$$ -46740 -66350 -73026 -70419 -50999 -18925 -2463 9489 2913 -6287 -25666 -21308 10928 23996
11448B3996R337j7120m722k1032k7044k498l700O433J0881J006P515K0947J3606
$$ 23996 33333 16213 11491 -9541 -36585 -39083 -42783 -36350 -25469 -24463 -16948 3999 17605
11435A7605R945j4016j6058K781k7141j5158k0424J0113J6590j4328J236L7682
$$ 17605 27550 13534 -2524 257 -26884 -42042 -62466 -52353 -35763 -50091 -48855 -11173
11423a1173J9621j1922j992N092N751k2295J5893J9788K3869j4300l6898K7J5663
$$ -11173 8448 -3474 -5466 -374 5377 -16918 -1025 18763 42632 28332 -8566 -8539 7124
11410G124r422k2594K9276J8685Q34j0654k5680o378K3322o805k5248K4345K741
$$ 7124 -2298 -24892 4384 23069 23903 13249 -12431 -18809 4513 -2292 -27540 -3195 -454
11397d54j5320j2497j7423J2812J480N365K1270J2536R917J0566L743r22p538
$$ -454 -15774 -28271 -45694 -32882 -31402 -26037 -4767 7769 17686 28252 31995 31073 23535
11384B3535j8697k1452k7679k3894j0671L2768m435j0003j3850J0483P977K5206
$$ 23535 4838 -16614 -44293 -68187 -78858 -46090 -50525 -60528 -74378 -63895 -55918 -30712
11372c0712J0615j5789k8507K5586Q687k8475j712k815J6318M5785r162j9533
$$ -30712 -20097 -35886 -64393 -38807 -30120 -58595 -60307 -63122 -46804 -1019 -10181 -29714
11360b9714o972L145Q528K0687L7410J3307m123j7359K9415j8213l196j0612k1846
$$ -29714 -36686 -33541 -25013 -4326 33084 46391 42268 24909 54324 36111 32915 22303 457
11347D57j2815J0299K5507K2317l1158j1694m770j2981Q136J3494j3156j1020
$$ 457 -12358 -2059 23448 45765 14607 2913 -1857 -14838 -6702 6792 -6364 -17384
11335a7384j0033L7895K5778j7394k121P80j3783m1881n106K0993R469q096M424
$$ -17384 -27417 10478 36256 18862 16741 17521 3738 -38143 -43249 -22256 -12787 -20883 -16459
11322a6459N057Q260k8445j0471J1654k0009R492r225m668K3385L726o485j4347
$$ -16459 -11402 -3142 -31587 -42058 -30404 -50413 -40921 -50146 -54814 -31429 -27703 -34188 -48535
11309d8535p499J9813L8216p150J4065j0642P475O288j7677q217M0028J6911j282
$$ -48535 -56034 -36221 1995 -5155 8910 -1732 5743 12031 -5646 -13863 26165 43076 41794
11296D1794p831k2986l3336q526K0588K4916m067o293J6019K2008K7443P936j8260
$$ 41794 33963 10977 -22359 -30885 -10297 14619 10552 4259 20278 42286 69729 77665 59405
11283E9405l1407p678n712Q760k8062p350J0667j8478j067J2651k4609J595J8110
$$ 59405 27998 20320 14608 23368 -4694 -12044 -1377 -19855 -20922 -8271 -32880 -31285 -13175
11270a3175J0445K4300j9178l2012j3546r800k449K2827k65k2563O823L6313J9095
$$ -13175 -2730 21570 2392 -29620 -43166 -52966 -55415 -32588 -32853 -55416 -48593 -12280 6815
11257F815q629j4002m574L0682r401q455K3106L69j7736k7209l0346K811J6921
$$ 6815 -1814 -15816 -20390 10292 891 -7564 15542 15911 -1825 -29034 -59380 -56569 -39648
11244c9648J2238m0703k2382J7497L3033j369J1266J1156J009K020j6358j4157
$$ -39648 -27410 -68113 -90495 -72998 -39965 -41334 -30068 -18912 -17903 -15883 -32241 -46398
11232d6398J1744J3859R218j5663k211L924O646j4024j860K9617j23j4046P769
$$ -46398 -34654 -20795 -11577 -27240 -29451 -25527 -18881 -32905 -34765 -5148 -5271 -19317 -11548
11219a1548J9741k525m4100K695J6006j2984r473K3733j4284M859N088j2745P394
$$ -11548 8193 5668 -38432 -35737 -19731 -32715 -42188 -18455 -32739 -27880 -22792 -35537 -28143
11206b8143K149l1782L4848M628k5252K2641J9561p338J0769l070n223k1246l2057
$$ -28143 -25994 -57776 -22928 -18300 -43552 -20911 -1350 -8688 2081 -989 -6212 -27458 -59515
11193e9515J337K2955J8884J5055J5046o44m384j06J5871q328R468J2389j1964
$$ -59515 -58178 -35223 -16339 -1284 13762 13118 8734 8628 24499 16171 25639 38028 26064
11180B6064K1996O98L066m971k2349L417K2284J8163k0512k5381J2184j17j4636
$$ 26064 48060 48758 51824 46853 24504 27921 50205 68368 47856 22475 34659 34542 19906
11167A9906J718J719J7652r672r716j1912k643n876j5066N474K3501r49k0022
$$ 19906 21624 23343 40995 31323 21607 9695 7052 1176 -13890 -8416 15085 14136 -5886
11154e886j5904o443J8520j7600r971k9904J8042K9042J6208k4194L99J8443J8867
$$ -5886 -21790 -28233 -9713 -27313 -37284 -67188 -49146 -20104 -3896 -28090 -27691 -9248 9619
11141I619O767R206Q31n316j2205j0152J225j2196l6006J4902L3861J634K2486
$$ 9619 16386 25592 26423 21107 8902 -1250 -25 -12221 -48227 -33325 536 2170 24656
11128B4656K2118j6558Q242j1193r415j5327j667j3321j2792k478L1113m838k2775
$$ 24656 46774 30216 38458 27265 17850 2523 856 -12465 -25257 -27735 3378 -1460 -24235
11115b4235j8939J6467J4699n015R073J0155J0543J5466l1436l7792J7578K8368
$$ -24235 -43174 -26707 -12008 -17023 -7950 2205 12748 28214 -3222 -41014 -23436 4932
11103D932k1526L663P310n809K0890N684J3520o8j1164J5107R336j3092j6682
$$ 4932 -16594 -12931 -5621 -11430 9460 15144 28664 28596 17432 32539 41875 28783 12101
11090A2101m56k2616j4153j8535K017K5183K0896O948j3779J796j7707j4189J9066
$$ 12101 11645 -10971 -25124 -43659 -41642 -16459 4437 11385 -2394 -598 -18305 -32494 -13428
11077a3428j0946J2943L1686O196m2098j7615L9401K451j1545o507j1093K0332
$$ -13428 -24374 -11431 20255 26451 -15647 -33262 6139 8590 -2955 -9462 -20555 -223
11065b23j5031j0688J831P562K2988p700P786k4451J9878R923O532J7485r036
$$ -223 -15254 -25942 -24111 -16549 6439 -1261 6525 -17926 1952 11875 18407 35892 26856
11052B6856R881Q834k3925j4461k963k1265r532L4674J91l2927k4419K3701M1840
$$ 26856 36737 45571 21646 7185 4222 -17043 -26575 8099 8290 -24637 -49056 -25355 16485
11039A6485K0474N096P551j945j1393O41k508R966O611l817j4861j7507R92p030
$$ 16485 36959 42055 49606 47661 36268 36909 34401 44367 50978 47161 32300 14793 15785 8755
11025H755k2854j1938J4527N4122j0646m344j259R971q298j0726p213J3968K9152
$$ 8755 -14099 -26037 -11510 42612 31966 27622 26363 36334 28036 17310 10097 24065 53217
11012E3217J5667j3468k2910j5014j1401n980k0198r733O341K6297m786j2843
$$ 53217 68884 55416 32506 17492 6091 111 -20087 -29820 -23479 2818 -1968 -14811
11000a4811J609o62j2311K068J5851K5159K3312p625k5276M150K2006K5818Q036
$$ -14811 -13202 -13864 -26175 -24107 -8256 16903 40215 32590 7314 11464 33470 59288 67324
10987F7324j8188j6158k001j57k5225k5364J7203O760N156j2314j6368l590J3841
$$ 67324 49136 32978 30977 30820 5595 -19769 -2566 4194 9350 -2964 -19332 -22922 -9081
10974i081K6919L861j4616k9290l1290o337j1881R001L6571R998O171J0719j1537
$$ -9081 17838 21699 7083 -22207 -53497 -59834 -71715 -62714 -26143 -16145 -9974 745 -10792
10961a0792J7570J6207J2097j1792j0679j0968j1564J2665P950j0339j1395k5334
$$ -10792 6778 22985 35082 23290 12611 1643 -9921 2744 10694 355 -11040 -36374
10949c6374k4807J5191M574K2384K2908o037j6086k2270L1380K4459l434j4237
$$ -36374 -61181 -45990 -41416 -19032 3876 -2161 -18247 -40517 -9137 15322 11888 -2349
10937b349M0667J5425k9061l2667L971J7392O102k2306j812l241n965L955J288
$$ -2349 38318 53743 24682 -7985 -4014 13378 19480 -2826 -4638 -7879 -13844 -9889 -8601
10924h601l9426j9894J3926M025J8364J8641J5774k2297N5404K0913r187j0474
$$ -8601 -48027 -67921 -53995 -49970 -31606 -12965 2809 -19488 35916 56829 47642 37168
10912C7168m6579m4599O185K0608K9355q09q544k2573k344M5504j7852j1257l635
$$ 37168 -9411 -54010 -47825 -27217 2138 1329 -7215 -29788 -32132 13372 -4480 -15737 -19372
10899a9372J1746J888n152j7633K063j5422m598J6470m786r880j9993J3204L967
$$ -19372 -7626 -5738 -10890 -28523 -26460 -41882 -46480 -30010 -34796 -44676 -64669 -51465 -47498
10886d7498L7139k742k4864J588K3058j4518j4333J656O786K9586P408j0913j6516
$$ -47498 -10359 -13101 -37965 -36377 -13319 -27837 -42170 -40514 -33728 -4142 3266 -7647 -24163
10873b4163M0880J7937r550k2770K116q720p620J3545K9142m37m7092n794K0749
$$ -24163 16717 34654 25104 2334 4450 -4270 -11890 1655 30797 30360 -16732 -22526 -1777
10860a777J3762j1193n661p530Q147J0699K654M868N005r364k9085k7014O626
$$ -1777 11985 792 -4869 -12399 -4252 6447 9101 13969 18974 9610 -19475 -46489 -39863
10847c9863J8745j358J3509K1537q728r189J3069r827J4467N161m2732p078R919
$$ -39863 -21118 -22476 -8967 12570 3842 -5347 7722 -2105 12362 17523 -25209 -32287 -22368
10834b2368L3835M716J5730P646k5113j0443j9605J7182J3094l375j4283j2586
$$ -22368 11467 16183 31913 39559 14446 4003 -15602 1580 14674 11299 -2984 -15570
10822a5570j825J5928o320J5319K4954P819J0067l1379n1196j4597j2553L7284
$$ -15570 -17395 -1467 -7787 7532 32486 40305 50372 18993 -32203 -46800 -59353 -22069
10810b2069M8824R174M972k6306j4158J7491j3107k8727K3963L5104k1467j7072
$$ -22069 26755 35929 40901 14595 437 17928 4821 -23906 57 35161 13694 -3378
10798c378K3991j7200j2744j5300k6833m5441J2616K2235L14o116L1995J0960
$$ -3378 20613 3413 -9331 -24631 -51464 -96905 -84289 -62054 -61740 -67856 -35861 -24901
10786b4901J7688K4051j3847j2133K092j7133J3179n188j136J2236Q622N149Q807
$$ -24901 -7213 16838 2991 -9142 -7050 -24183 -11004 -16192 -17328 -5092 3530 8679 17486
10773A7486o460R006L5361n223l3653K246j547k3141L8704K1229k8539j2746m296
$$ 17486 11026 20032 55393 50170 16517 18763 17216 -5925 32779 54008 25469 12723 8427
10760H427L4041L29l1381k1013O739j1637k2404n096L4501j4563o502m517K5296
$$ 8427 42468 42797 11416 -9597 -2858 -14495 -36899 -41995 -7494 -22057 -28559 -33076 -7780
10747g780L7767P582j7065k2737n00l507O893N679k4431j1467J1907M988j0026
$$ -7780 29987 37569 20504 -2233 -2733 -6240 653 6332 -18099 -29566 -17659 -12671 -22697
10734b2697N335J8638P958J6965o733r148p115k2119q623L695l3Q495Q195j50
$$ -22697 -17362 1276 9234 26199 19466 10318 3203 -18916 -27539 -23844 -23877 -15382 -7187 -7337
10720g337j8933k0230P572P681J4719j2984k4141j2889r72M5945p771m1991r760
$$ -7337 -26270 -46500 -38928 -31247 -16528 -29512 -53653 -66542 -67514 -21569 -29340 -71331 -81091
10707h1091J0330K7941J6813p530j3833J586J1949J6553J2681J8290K3614J0626
$$ -81091 -70761 -42820 -26007 -33537 -47370 -45784 -33835 -17282 -4601 13689 37303 47929
10695D7929k111m2253j4131p829M117j0973k5003J4650L2769p670j7940j5010
$$ 47929 45818 3565 -10566 -18395 -14278 -25251 -50254 -35604 -2835 -10505 -28445 -43455
10683d3455J1571k0120l4356j2849L3862O743J0915K451J3499N850k2938K47j7626
$$ -43455 -31884 -52004 -86360 -99209 -65347 -58604 -47689 -45238 -31739 -25889 -48827 -48580 -66206
10670f6206L1J3780Q991O486K7564J2320j6111l2480J2306j1915j445N08q236
$$ -66206 -66175 -52395 -43404 -36918 -9354 2966 -13145 -45625 -33319 -45234 -46679 -46171 -54407
10657e4407K8730j6576j6279K9938J6177m616j7668q367N287L0982K5878L517
$$ -54407 -25677 -42253 -58532 -28594 -12417 -17033 -34701 -43068 -37781 -6799 19079 22596
10645B2596k4363q071J6318K0670j6565j0684p660K0524q549l0188j2972P441
$$ 22596 -1767 -9838 6480 27150 10585 -99 -7759 12765 4216 -25972 -38944 -31503
10633c1503Q722J6511M756O173k4375N67n175J135k0979J0309n427l833K1346
$$ -31503 -22781 -6270 -1514 4659 -19716 -19149 -24324 -23189 -44168 -33859 -39286 -43119 -21773
10620b1773l796R437m594l018n464J0517L0554J4478j1000r728K2566L1409J4708
$$ -21773 -25569 -16132 -20726 -23744 -29208 -18691 11863 26341 15341 5613 28179 59588 74296
10607G4296K6554r03m7577l6050j6322j1022o620m872K2515Q749j0475n499j7042
$$ 74296 100850 99947 52370 16320 -2 -11024 -17644 -22516 -1 8748 -1727 -7226 -24268
10594b4268p827J3562J6924J5458l0079J7356L7083K128j7349J256j901q517J8771
$$ -24268 -32095 -18533 -1609 13849 -16230 1126 38209 40337 22988 24244 22343 13826 32597
10581C2597k1207k4645p503O534j5318q373J0418K7636K7977N471j4254P249k7483
$$ 32597 11390 -13255 -20758 -14224 -29542 -37915 -27497 139 28116 33587 19333 26582 -901
10568i01J3654K6353l0623j8529J0747J1271J2606j3628p273o935O660K460j6292
$$ -901 12753 39106 8483 -10046 701 11972 24578 10950 3677 -3258 3402 5862 -10430
10555a0430p426J0246n657k6096R643j102J5017j1109k6372j0603K8475L3317
$$ -10430 -17856 -7610 -13267 -39363 -29720 -30822 -15805 -26914 -53286 -63889 -35414 -2097
10543b097L2121P053l7458k3096k0921M536J4906J7454M999J70j1817j3913K1798
$$ -2097 30024 37077 -381 -23477 -44398 -39862 -24956 -7502 -2503 -2333 -14150 -28063 -6265
10530f265J691o185m0087k84K1349r743k7391L5631J4275p131n7J7352J9809J5450
$$ -6265 -4574 -10759 -50846 -51130 -29781 -39524 -66915 -31284 -17009 -24140 -24197 -6845 12964 28414
10516B8414j4826j4126Q498J1047R031J9200q015r550K0996l0611l5153j881M468
$$ 28414 13588 -538 7960 19007 28038 47238 39223 29673 50669 20058 -15095 -16976 -12508
10503a2508J1687K38j2947Q594j8811J1588J4533J0621N850J572R7L345m059j9743
$$ -12508 -821 -583 -13530 -4936 -23747 -12159 2374 12995 18845 20417 20514 23859 19800 57
10489E7k0676k4920J7663K5136K5132j4787k6986j8679P47q552j42L0459K536
$$ 57 -20619 -45539 -27876 -2740 22392 7605 -19381 -38060 -37313 -45865 -46007 -15548 -13012
10476a3012J8198r46J6516J068j6236J0868K5369j2553p164J1314q779l438K897
$$ -13012 5186 4240 20756 21824 5588 16456 41825 29272 22108 33422 24643 21205 24102
10463B4102L978j2496n872m3430n292L390J2524J9203k476l0349M058J0314O715
$$ 24102 28080 15584 9712 -33718 -39010 -35620 -23096 -3893 -6369 -36718 -32660 -22346 -15631
10450a5631J8848M3647q444l6523K4177K0370J6896k117j8762l2853m4605O699
$$ -15631 3217 46864 38420 1897 26074 46444 63340 61223 42461 9608 -34997 -28298
10438b8298J2175j5728r73r135J8841J8517R476J368P426K4767J6010m973J2552
$$ -28298 -16123 -31851 -32824 -41959 -23118 -4601 4875 6243 13669 38436 54446 49473 62025
10425F2025O3368M6322L3269O6056M5625l8834m4185k9390m261K7367J9320K4733
$$ 62025 125393 171715 204984 271040 316665 277831 233646 204256 199995 227362 246682 271415
10413B71415j4128o8057n7674n0008K757O673m4692l544r598M166J3936J829k915
$$ 271415 257287 189230 131556 81548 84305 90978 46286 42742 33144 37310 51246 53075 50160
10400E0160M0488J0663k3230l0741j2438N281P322j5695m375R424J5967k902k2137
$$ 50160 90648 101311 78081 47340 34902 40183 47505 31810 27435 36859 52826 49924 27787
10387B7787r850K6326L149k6545k1480q661J2232r885j8091K2423R446J2910r278
$$ 27787 17937 44263 47412 20867 -613 -9274 2958 -6927 -25018 -2595 6851 19761 10483
10374A0483J2057K7949k9006r313K260j0625k9833J21L226N659K7258J4863K0817
$$ 10483 22540 50489 21483 12170 14430 3805 -26028 -25907 -22681 -17022 10236 25099 45916
10361D5916k1588k8187p816L211K5367n51n063k5437J1721K4833K6718P707j3555
$$ 45916 24328 -3859 -11675 -8464 16903 16352 11289 -14148 -2427 22406 49124 56831 43276
10348D3276l679R72l810r188P438q01P842L626r635N110m561k3874J7432M69n16
$$ 43276 39597 40569 36759 27571 35009 34208 42050 45676 36041 41151 36590 12716 30148 30617 30101
10333C0101j5803j0784m892O670l444j3833k6832j5088K9047l632R260j1698r77
$$ 30101 14298 3514 -1378 5292 1848 -11985 -38817 -53905 -24858 -28490 -19230 -30928 -31905
10320c1905J9318L6319J752L587J0842J0721j2721l4012o778l5751k6457M9957
$$ -31905 -12587 23732 25484 29071 39913 50634 37913 3901 -2877 -38628 -65085 -15128
10308a5128l914j5716l246R770J9692K0846j671k7667N931Q613j6419L3333K892
$$ -15128 -19042 -34758 -38004 -28234 -8542 12304 10633 -17034 -11103 -2490 -18909 14424 17316
10295A7316r899j6985j3670m386J532L8742K8592J924J0208j082k5595j2099J2280
$$ 17316 7417 -9568 -23238 -27624 -26092 12650 41242 43166 53374 52292 26697 14598 26878
10282B6878m838j109r394j0119J2947k2139k2017J7518J0992K657L073Q117Q743
$$ 26878 22040 20931 11537 1418 14365 -7774 -29791 -12273 -1281 1376 4449 12566 21309
10269B1309j3775l1623p584j0289R32j3148L3243L0084N023l359p074l2243k1473
$$ 21309 7534 -24089 -31673 -41962 -41030 -54178 -20935 9149 14172 10813 3739 -28504 -49977
10256d9977K1054J5600J6289Q460K8822k044l5034m726J1666l893j6233k4054
$$ -49977 -28923 -13323 2966 11426 40248 38204 3170 -1556 10110 6217 -10016 -34070
10244c4070m280K1351J0733j3670k8758k7982M328j555M3476L9977k9395k3629
$$ -34070 -38350 -16999 -6266 -19936 -48694 -76676 -72348 -73903 -30427 9550 -19845 -43474
10232d3474R341j6053k8063j5530L7203J1855j5460M469K2362K4860K7228L0881
$$ -43474 -34133 -50186 -78249 -93779 -56576 -44721 -60181 -55712 -33350 -8490 18738 49619
10220D9619o771j4887j900k56l8854r959M589M1847L350j4669O089K2109k4661
$$ 49619 42848 27961 26061 25805 -13049 -23008 -18419 23428 26778 12109 18198 40307 15646
10207A5646j326K1577m543m4551r19J2593L936J3080J6229N4k450l254k0992P630
$$ 15646 14320 35897 31354 -13197 -14116 -1523 2413 15493 31722 31776 29326 26072 5080 12710
10193A2710P17m8137m4599m442K9480N012j5869k774L8231K1377L9611J3728k6658
$$ 12710 13427 -34710 -79309 -83751 -54271 -49259 -65128 -67902 -29671 -8294 31317 45045 18387
10180A8387k5879j645P215m261j0816J725l016j4482k9318k8998J5392K6351L3766
$$ 18387 -7492 -9137 -1922 -6183 -16999 -15274 -18290 -32772 -62090 -91088 -75696 -49345 -15579
10167a5579q007M56p680P782J3661K3769M561k9911j9362J4802j5344j6920L2636
$$ -15579 -23586 -23130 -30810 -23028 -9367 14402 18963 -10948 -30310 -15508 -30852 -47772 -15136
10154a5136K4765R525L407q177k3691R58j3955n482P453n668l411P970L212J0053
$$ -15136 9629 19154 22561 14384 -9307 -8349 -22304 -27786 -20333 -26001 -29412 -21442 -18230 -8177
10140h177J3254K2125m32j5697l0246M932J3320Q257q502k5989n837K5783M8368
$$ -8177 5077 27202 26770 11073 -19173 -14241 -921 7336 -1166 -27155 -32992 -7209 41159
10127D1159j9085l1907j3289K6565J189k1084p578O030K121K975L4366J9459k4193
$$ 41159 22074 -9833 -23122 3443 4632 -16452 -24030 -18000 -15879 -12904 21462 40921 16728
10114A6728J8860N384l1489j4014K058j837j3605P419P025j3577L0171J8750M653
$$ 16728 35588 40972 9483 -4531 -2473 -4310 -17915 -10496 -3471 -17048 13123 31873 36526
10101C6526j6761j0715Q282R116O904j2k4653J0284k5836p58M154L245J0449m224
$$ 36526 19765 9050 17332 26448 33352 33340 8687 18971 -6865 -7623 -3469 -224 10225 6001
10087F001o747k3839k651o226j1237L4208K6602n765l8555l329M785J2621P046
$$ 6001 -746 -24585 -27236 -33462 -44699 -10491 16111 10346 -28209 -31538 -26753 -14132 -7086
10074g086m086J197j818k621j9345k1186K4731J3127r603J6548K6402o040j0124
$$ -7086 -11172 -9975 -11793 -14414 -33759 -54945 -30214 -17087 -26690 -10142 16260 10220 96
10061I6l302p712o817J4797p240j3719N6L666L421J2893l2801J7337K3081J2802
$$ 96 -3206 -10918 -17735 -2938 -10178 -23897 -23841 -20175 -16754 -3861 -36662 -19325 3756 16558
10047A6558K9049N539j1328k0891J584o7l146l8498j4371J0518J7845J3316j0292
$$ 16558 45607 51146 39818 18927 20511 20444 17298 -21200 -35571 -25053 -7208 6108 -4184
10034d184j4954M163J4990M2380K505l3778j2097k2476n529j2356K1709O585J804
$$ -4184 -19138 -14975 15 42395 44900 11122 -975 -23451 -28980 -41336 -19627 -13042 -11238
10021a1238j6213J8137r142l1734L0168M4P945o325J6004J8187Q89j3644J4567
$$ -11238 -27451 -9314 -18456 -50190 -20022 -19978 -12033 -18358 -2354 15833 16722 3078 17645
10008A7645K6061K5633k5130n1996j1582N731J634n576K844L5665O7k3K8231l714
$$ 17645 43706 69339 44209 -7787 -19369 -13638 -12004 -17580 -14736 20929 20996 20973 49204 45490
9994D5490j4474k769k1530l3813K8536k1710k4638J1219J7899J98J80j6427L452
$$ 45490 31016 28247 6717 -27096 1440 -20270 -44908 -33689 -15790 -15592 -15412 -31839 -28387
9981b8387K1049L6679J3075k6369l9364k6908J4227M194J8184J4473J1880K6969
$$ -28387 -7338 29341 42416 16047 -23317 -50225 -35998 -31804 -13620 853 12733 39702
9969C9702N156j8939k0744J1L101J7836j4028k4210J9233K7944J207P599k289
$$ 39702 44858 25919 5175 5186 8287 26123 12095 -12115 7118 35062 36269 43868 41579
9956D1579j2308Q586k511k5933R192n157j289J3807n560j3082N902k7795k0493
$$ 41579 29271 37857 35346 9413 18605 13448 12159 25966 20406 7324 13226 -14569 -35062
9943c5062p63K1149J4923K3395P924j5603j3947k431Q788K8696r026m959j5040
$$ -35062 -35825 -14676 247 23642 31566 15963 2016 -415 8373 37069 28043 23084 8044
9930H044k2652J0326J946L81Q095k9931k1288j6454K6148k1805K492J3682N057
$$ 8044 -14608 -4282 -2336 -1955 6140 -23791 -45079 -61533 -35385 -57190 -54698 -41016 -35959
9917c5959P339l871o497l2195M167L8285K2021R489L499R670j8155r678J5325
$$ -35959 -28620 -32491 -38988 -71183 -67016 -28731 -6710 2779 6278 15948 -2207 -11885 3440
9904C440K5897K43j8680k2221j6572q6r961J3815O117K2864K6296k3603P354R384
$$ 3440 29337 29580 10900 -11321 -27893 -27979 -37940 -24125 -18008 4856 31152 7549 14903 24287
9890B4287K0843l5450o545L6528Q675l7584j8104j606J6901j4128j5860J5289
$$ 24287 45130 9680 3135 39663 48338 10754 -7350 -8956 7945 -6183 -22043 -6754
9878f754J7779J588K0430r111m9895n6178L1768N3308K3624k007j6792Q645L3665
$$ -6754 11025 12613 33043 23932 -25963 -82141 -50373 2935 26559 24552 7760 16405 50070
9865E0070m958l2467K812Q845n667j0161J9j0519J8678p24J7618O450Q590M3412
$$ 50070 45112 12645 15457 24302 18635 8474 8493 -2026 16652 15928 33546 39996 48586 91998
9851I1998j9257K774l016j1882n730p704k0221k5354N329n558j5586J1452J4107
$$ 91998 72741 75515 72499 60617 54887 47183 26962 1608 6937 1379 -14207 -2755 11352
9838A1352p529J7478J1939p569j9532k6781l2380J0334J3636K2213J4928K3157
$$ 11352 3823 21301 33240 25671 6139 -20642 -53022 -42688 -29052 -6839 8089 31246
9826C1246N390q941n280k1091j2382o484R556K047K7122J4837k5204K0652J166
$$ 31246 36636 27695 22415 1324 -11058 -17542 -7986 -5939 21183 36020 10816 31468 32634
9813C2634r567L941j7193n947J8758l681l6846j6126N902R929o113j2224J413
$$ 32634 23067 27008 9815 3868 22626 18945 -17901 -34027 -28125 -18196 -24309 -36533 -35120
9800c5120J6310l825l596j5648k0558k358K3283L1636K0102j5016K638j0109K3615
$$ -35120 -18810 -22635 -26231 -41879 -62437 -64795 -41512 -9876 10226 -4790 -2152 -12261 11354
9787A1354K040R88k5071k4814J3186j8572j0319r068J2493J5595L0995J2933N659
$$ 11354 13394 14382 -10689 -35503 -22317 -40889 -51208 -60276 -47783 -32188 -1193 11740 17399
9774A7399j6271j0316r923K963J3581J7221N222j3234j311N884P787l6725l4553
$$ 17399 1128 -9188 -19111 -16148 -2567 14654 19876 6642 5331 11215 19002 -17723 -52276
9761e2276K0175J9190J886J4447M723k475k4561k053J8664J4066o442j9063R503
$$ -52276 -32101 -12911 -11025 3422 8145 5670 -18891 -20944 -2280 11786 5344 -13719 -4216
9748d216J4023K5577J9102k5331r289P682j194J5602J1719j2909k5915p856n58
$$ -4216 9807 35384 54486 29155 19866 27548 26354 41956 53675 40766 14851 6995 6437
9735F437N150k1990j5359J2762L3409J2220k9231k4431K4816J4072O22J9690J374
$$ 6437 11587 -10403 -25762 -13000 20409 32629 3398 -21033 3783 17855 18477 38167 39541
9722C9541j3077L2861J8595L81k5745j5344j7905j7995k8685K2424j664n154L7592
$$ 39541 26464 59325 77920 78301 52556 37212 19307 1312 -27373 -4949 -6613 -11767 25825
9709B5825J033J4441J1160R043L2893j592j2981j7850K602j185j0159j3912J356
$$ 25825 26858 41299 52459 61502 94395 92803 79822 61972 64574 63389 53230 39318 40674
9696D0674L662j7920j3429J531L983j1798k6r756M473K6569J5773L4129K053P707
$$ 40674 44336 26416 12987 14518 18501 6703 6677 -3079 1394 27963 43736 77865 79918 87625
9682H7625l1328l3062N200K6721J7690M319r902k7307k563j453j90j2362L502
$$ 87625 56297 23235 28435 55156 72846 77165 67263 39956 37393 35940 35750 23388 26890
9669B6890r863l792J4973l259j0851N649K6908P342j7303J1909J8180K3497o74
$$ 26890 17027 13235 28208 24949 14098 19747 46655 53997 36694 48603 66783 90280 89606
9656H9606K074k3814k0393O018L1109j4779j7299J0810r658M636J2459J372O408
$$ 89606 91680 67866 47473 53491 84600 69821 52522 63332 53674 58310 70769 72141 78549
9643G8549J525k0197P394l206l4025j3893p085P885O247K1408k483O369J9206
$$ 78549 80074 59877 67271 64065 30040 16147 9062 16947 23194 44602 42119 48488 67694
9630F7694n797l186r772k3311M352K1876p56p449n799j6901R179J3807J1119j4023
$$ 67694 61897 58711 48939 25628 29980 51856 51100 43651 37852 20951 30130 43937 55056 41033
9616D1033k2599j4650K8817K2009K0524K8351l858k4357j6079k7652l615M515
$$ 41033 18434 3784 32601 54610 75134 103485 99627 75270 59191 31539 27924 32439
9604C2439R103J334J4734j1761k2553L3054O235j3164K759L6917J5434L248k4517
$$ 32439 41542 42876 57610 45849 23296 56350 62585 49421 52180 89097 104531 107779 83262
9591H3262l3172k762Q921o382k3363n109K1962J5143j2327o177L690L3692K9573
$$ 83262 50090 47328 56249 49867 26504 21395 43357 58500 46173 39996 43686 77378 106951
9578A06951q342j1031Q296l884l8393j5702j7683M473J7610J3604Q015l760j6071
$$ 106951 98609 87578 95874 91990 53597 37895 20212 24685 42295 55899 63914 60154 44083
9565D4083j0370q82q752K9965K5842k4484j0920M809O822j1439j69K2523l938
$$ 44083 33713 32831 24079 54044 79886 55402 44482 49291 56113 44674 44505 67028 63090
9552F3090j6247J5011J3906J2843l4718j2182Q90J1690j5150l062o741n561j1832
$$ 63090 46843 61854 75760 88603 53885 41703 42593 54283 39133 36071 29330 23769 11937
9539A1937L735L1627K6310K66P97q802j5993n423J2596K4716K31k9846k5040q031
$$ 11937 15672 47299 73609 73875 74672 65870 49877 44454 57050 81766 81997 52151 27111 19080
9525A9080K836m032Q493l739K826k5905J7999k692J0331K4368J5216j6152j668
$$ 19080 21916 17884 26377 22638 25464 -441 17558 14866 25197 49565 64781 48629 46961
9512D6961J5286Q302R267n979k9127J5945K096J4j9883l286k0377k1932L4538
$$ 46961 62247 70549 79816 73837 44710 60655 62751 62765 42882 39596 19219 -2713 31825
9499C1825K9693L6565p228j1426j4332k7565j7143q304M038j8584R830K1712L2574
$$ 31825 61518 98083 90855 79429 65097 37532 20389 12085 16123 -2461 7369 29081 61655
9486F1655J9181j2736J061K433R475k7739j3332J7189J2916l670o427Q549K4128
$$ 61655 80836 68100 69161 71594 81069 53330 39998 57187 70103 66433 60006 68555 92683
9473I2683J2236m0998j168K4717J40k0447J5194K309j2264m1008l136J5348J9247
$$ 92683 104919 63921 62753 87470 87610 67163 82357 84666 72402 31394 28258 43606 62853
9460F2853j3344o714J0388P699q425J0459J0361J0136J0897L50k5740m717K01
$$ 62853 49509 42795 53183 60882 52457 62916 73277 83413 94310 94660 68920 64203 64404
9447F4404j6762P738K4431k8376j3134N199J4518K3139J8346j201p570K2775J1333
$$ 64404 47642 55380 79811 51435 38301 43500 58018 81157 99503 98302 90732 113507 124840
9434A24840M106O163k9653j3171P960j1247k1803J3703Q739m981j6357L0075P59
$$ 124840 128946 135109 105456 92285 100245 88998 67195 80898 89637 84656 68299 98374 99133
9421I9133J9257m772k1387k5422j5226j4154p891M591K6214K2942R335j7J8449
$$ 99133 118390 113618 92231 66809 51583 37429 29538 34129 60343 83285 92620 92603 111052
9408A11052L276j5398l2138J47K4560K2J81K8276J3550k9292J4692n908j9038
$$ 111052 114328 98930 66792 66939 91499 91521 91702 119978 133528 104236 118928 113020 93982
9395I3982n149M986J9837J8524N37J2036K3928J9307j6056j4450l597k3290k0804
$$ 93982 88833 93819 113656 132180 132717 144753 168681 187988 171932 157482 153885 130595 109791
9382A09791j9331o788K2030K3455j9289r457K97Q172p530J8125L7940j4539N170
$$ 109791 90460 83672 105702 129157 109868 100411 100708 108880 101350 119475 157415 142876 148046
9369A48046K2335J290J008j436L783j4222j5206k7475P4J7317o71p68L354j010
$$ 148046 170381 171671 172679 171243 175026 160804 145598 118123 118197 135514 134843 134075 137429 136419
9355A36419P1834J6270l2414l1695p085J2171J0129J9724K3840Q267k1280m9643
$$ 136419 208253 224523 192109 160414 153329 165500 175629 195353 219193 227460 206180 156537
9343A56537k4451K7494M4732p254j5047K336J0702j1389J2709n909l0048K9795
$$ 156537 132086 159580 204312 197058 182011 184347 195049 183660 196369 190460 160412 190207
9331A90207J7293J0344K1170j7995j4410J7991O535m0084j2849j3232J4005J2623
$$ 190207 207500 217844 239014 221019 206609 224600 231135 191051 178202 164970 178975 191598
9319A91598j5867K851K2779j9338j7080J8035q677j0992L405Q067J2940K1565
$$ 191598 175731 178582 201361 182023 164943 182978 174301 163309 166714 174781 187721 209286
9307B09286L14K653m53J7544k0821o11J5591k4050k0247j1092J6412J8632p686
$$ 209286 209600 212253 211800 229344 208523 207912 223503 199453 179206 168114 184526 203158 195472
9294A95472k4135J090K0263k0999k4812l404K4070L9414j7725k6970j7639K6917
$$ 195472 171337 172427 192690 171691 146879 143475 167545 206959 189234 162264 144625 171542
9282A71542N810o952q843K4980P840R896p470j3825l231q36j4950L3842L1564
$$ 171542 177352 170400 161557 186537 194377 204273 196803 182978 179747 178911 163961 197803 229367
9269B29367K4693l2184m772M318L4052J3246q002j1773j3446N960j4614k4061
$$ 229367 254060 221876 217104 221422 255474 268720 260718 248945 235499 241459 226845 202784
9257B02784J4474j7799Q737j8012j7883K8861J7321R05l6377j6843k9181j2987
$$ 202784 217258 199459 208196 190184 172301 201162 218483 219388 183011 166168 136987 124000
9245A24000j0346k124L5555K4275K7949L11N967J5902M900k0103M4218m998j0299
$$ 124000 113654 111530 147085 171360 199309 199620 205587 221489 226389 206286 250504 245506 235207
9232B35207k229j1126k3137m0028J7965L415K3586J2672j679n7430p57J6527L0276
$$ 235207 232978 221852 198715 158687 176652 180067 203653 216325 214646 157216 156459 172986 203262
9219B03262k82N055J4551O036K014K113L3695K9584j7231k9037j7863j0151O867
$$ 203262 202980 208035 222586 228622 230636 232749 266444 296028 278797 249760 231897 221746 228613
9206B28613J5130N842j8159k0626N804k1321k9149K4743O987q248r057k368J660
$$ 228613 243743 249585 231426 210800 216604 195283 166134 190877 197864 189616 180559 178191 179851
9193A79851j4920j3405L1159L5366j7908k0098L872L5290M3135j2392k5542j3573
$$ 179851 164931 151526 182685 218051 200143 180045 183917 219207 262342 249950 224408 210835
9181B10835j2077M0277M8394j4021j0327L0692Q770n485K5292K6262j9505K6164
$$ 210835 198758 239035 287429 273408 263081 293773 302543 297058 322350 348612 329107 355271
9169C55271J6493P532J8177K2659K2830M0041K972L8408P2213L1351K8189O3391
$$ 355271 371764 379296 397473 420132 442962 483003 485975 524383 596596 627947 656136 719527
9157G19527K7871Q5121R1987P7945O1662J09999J52040K00656K00679K39651L27743
$$ 719527 747398 832519 924506 1002451 1064113 1174112 1326152 1526808 1727487 1967138 2294881
9146B294881M29963O12916Q15569J139245J530140K013555K509124L227165L708823
$$ 2294881 2724844 3337760 4153329 5292574 6822714 8836269 11345393 14572558 18281381
9137A8281381K994558R27512k328444n182379m727720k948951j733500j029147
$$ 18281381 21275939 22203451 19875007 14692628 9964908 7015957 5282457 4253310
9129D253310o65543m75237l77263k68301j99805j57937r6248q0775r6529j32631
$$ 4253310 3587767 3112530 2735267 2466966 2267161 2109224 2012976 1932201 1835672 1703041
9119A703041n8721n5008l8666J5799q985j1206k2669l1073o0618o4978p1802p6381
$$ 1703041 1644320 1589312 1550646 1566445 1557460 1546254 1523585 1492512 1431894 1366916 1295114 1218733
9107A218733o9301p2120m3276k9229r2306p4843n0092k9423l0704l4704l9066
$$ 1218733 1149432 1077312 1034036 1004807 912501 837658 787566 758143 727439 692735 653669
9096F53669m5856l7226J0792k1648k7470k7285k4505k3427k5048j1129J4591O105
$$ 653669 607813 570587 581379 559731 532261 504976 480471 457044 431996 420867 435458 441563
9084D41563j6146k4895Q286j1266j8382Q893L808k9104k6559k529L782j5940m6018
$$ 441563 425417 400522 408808 397542 379160 388053 391861 362757 336198 333669 337451 321511 275493
9071B75493l717M500K7010J1994J6010J6558j2320p13k050J2568l4285j7369j3117
$$ 275493 271776 276276 303286 315280 331290 347848 335528 334815 332765 345333 311048 293679 280562
9058B80562j30K767j8521J0382J6594l4960k3262N847o155j7716J0563J8320J8353
$$ 280562 280432 283199 264678 275060 291654 256694 233432 239279 233124 215408 225971 244291 262644
9045B62644J8776K0160J7982n096m9085m4391j5458K6917L8770j7964k1004o419
$$ 262644 281420 301580 319562 314466 265381 220990 205532 232449 271219 253255 232251 225832
9033B25832l3715J8412k371j6639n2417p19L5821L0321K2309L0292p038l4234
$$ 225832 192117 210529 208158 191519 139102 138383 174204 204525 226834 257126 250088 215854
9021B15854o259K0218J4942L032k0958L931J185k0067L1145q177r901l797K378
$$ 215854 209595 229813 244755 247787 226829 230760 231945 211878 243023 234846 224945 221148 223526
9008B23526L2092L60r934k770K0392J2754m688j8858k4540K8160m905o78m157
$$ 223526 255618 255978 246044 243274 263666 276420 271732 252874 228334 256494 251589 250911 246754
8995B46754l832J4310R902l048M845J1640n254o033j576l5952L4525p844k2155
$$ 246754 242922 257232 267134 264086 268931 280571 275317 269284 267708 231756 266281 258437 236282
8982B36282l1461k8109J3662J2823Q954j3156J8499j50L3782p068j427J1493J4650
$$ 236282 204821 176712 190374 203197 212151 198995 217494 217344 251126 244058 242631 254124 268774
8969B68774L3104j2695j6448j8913L749l133k5757j9869J0379J57O925o441k1270
$$ 268774 301878 289183 272735 253822 257571 254438 228681 208812 219191 219348 226273 219832 198562
8956A98562O710p685q229N6012j8469k9078k180J9973L7598J5722P376k6386j0755
$$ 198562 205272 197587 189358 245370 226901 197823 195643 215616 253214 268936 276312 249926 239171
8943B39171o573K6721j9836k1199j6010j123p592K946K3624J5322J5486M958m8256
$$ 239171 232598 259319 239483 218284 202274 201151 193559 196505 220129 235451 250937 255895 207639
8930B07639j836R897R559j8168m658p302N388p550k4126P733L8470n44j6369J4224
$$ 207639 205803 215700 225259 207091 202433 195131 200519 192969 168843 176576 215046 214502 198133 212357
8916B12357J3696m820q252q630K0415Q845L0822L2291k3600j1270k1015Q068J898
$$ 212357 226053 221233 212981 204351 224766 233611 264433 296724 273124 261854 240839 248907 250805
8903B50805j0127L733M5128K3679j8168k4785n299P21q620P387K8166k0817J41
$$ 250805 240678 244411 289539 313218 295050 270265 264966 265687 257067 264454 292620 271803 271944
8890B71944J714Q380j2270k4769k9301l3301j6844M064L3896J5834k2057K2469
$$ 271944 273658 282038 269768 244999 215698 182397 165553 169617 203513 219347 197290 219759
8878B19759J1712N0395K1401j6140l1662j6352J5863N5496m377p753L4965J3541
$$ 219759 231471 281866 303267 287127 255465 239113 254976 310472 306095 298342 333307 346848
8866C46848J7014K4476J1692M713k0858l2386l0756j0188m099l5673o073L0437
$$ 346848 363862 388338 400030 404743 383885 351499 320743 310555 306456 270783 264710 295147
8854B95147k1572j053o653r681M376J832K1618k4867k7197j2268m071l622K6286
$$ 295147 273575 272522 265869 256188 260564 262396 284014 259147 231950 219682 215611 211989 238275
8841B38275L5338q763K2590J5814k0092k6905k2114L0166J2259j2127j8244q27
$$ 238275 273613 264850 287440 303254 283162 256257 234143 264309 276568 264441 246197 245370
8829B45370j0190n548p725K0048O93L126J6915R167K413K630J8662K3568M5190
$$ 245370 235180 229632 221907 241955 242648 245774 262689 271856 274269 276899 295561 319129 364319
8816C64319r741j0632R734q262O745R315o847j6835J5067q840k4656M151R796
$$ 364319 354578 343946 353680 345418 352163 361478 354631 337796 352863 344023 319367 323518 333314
8803C33314j0679k2985n528j002j7569k665o07M9466R233k6878Q656J4112K0905
$$ 333314 322635 299650 294122 293120 275551 272886 272279 321745 330978 304100 312756 326868 347773
8790C47773j2624k505M678k4179l4501J8914L2201M6362J2050J79J1523J2649
$$ 347773 335149 332644 337322 313143 278642 297556 329757 376119 388169 388348 399871 412520
8778D12520L907k2525j3472p460k0489k6194K3486M189J2683L2077J6952L1149
$$ 412520 416427 393902 380430 372970 352481 326287 349773 353962 366645 398722 415674 446823
8766D46823M0405q170k8729k7708j4369k1129j1558k1631l083K3989J0414r123
$$ 446823 487228 479058 450329 422621 408252 387123 375565 353934 350851 374840 385254 376131
8754C76131K5821M0052N537l2009j1551k250q961R6L183J7374J9372Q520q218
$$ 376131 401952 442004 447541 415532 403981 401731 392770 392866 396049 413423 432795 441315 433097
8741D33097j0032J4830j2468N324j6855K8627M3887K6497K190k510J0101j2748
$$ 433097 423065 437895 425427 430751 413896 442523 486410 512907 515097 512587 522688 509940
8729E09940P01K5844R961P478K2779l52n125J3521J6347J9532J3853p824j7815
$$ 509940 510641 536485 546446 553924 576703 576351 571226 584747 601094 620626 634479 626655 608840
8716F08840j3084q716j2129m147k1622P21J8979l682j6295P762L4189K5533O261
$$ 608840 595756 587040 574911 570764 549142 549863 568842 565160 548865 556627 590816 616349 622610
8703F22610J5287P871j8533L1225J0674n186O360k094K5682K3135j266P28k423
$$ 622610 637897 645768 627235 658460 669134 663948 670308 668214 693896 717031 715765 716493 714070
8690G14070K5681j6912K0472J1459J142J6044j3462J5757J7054L7965K8153k6936
$$ 714070 739751 722839 743311 754770 755912 771956 758494 774251 791305 829270 857423 830487
8678H30487m775L2460k242J961L114K9187J5498J0355j2843K89J3922R889R21
$$ 830487 825712 858172 855930 857891 861005 890192 905690 916045 903202 903491 917413 927302 928223
8665I28223M359K8464K8987K8543m586K6071J3842K1578J981Q075L0292K3555
$$ 928223 932582 961046 990033 1018576 1013990 1040061 1053903 1075481 1077462 1085537 1115829 1139384
8653A139384L8088K4815J6515M343L9596K6342J0654J2602P38K2395J214K6405
$$ 1139384 1177472 1202287 1218802 1223145 1262741 1289083 1299737 1312339 1313077 1335472 1336686 1363091
8641A363091K4582m20J4626K5198K5740K7075N5081M2253Q981O2443Q2101M6632
$$ 1363091 1387673 1387253 1401879 1427077 1452817 1479892 1534973 1577226 1586207 1648650 1730751 1777383
8629A777383Q6337O5843K8340L5620R8520J27574P8820Q8702J29107J19850P8605
$$ 1777383 1863720 1929563 1957903 1993523 2092043 2219617 2298437 2387139 2516246 2636096 2714701
8618B714701J01524J51781J67786J35789J26584J25773J66790J79727J91330K10645
$$ 2714701 2816225 2968006 3135792 3271581 3398165 3523938 3690728 3870455 4061785 4272430
8608D272430K43942K61799K53683K90107K81382L25629L51242L78488L36332L54520
$$ 4272430 4516372 4778171 5031854 5321961 5603343 5928972 6280214 6658702 6995034 7349554
8598G349554L01237K93814K46634J37159j3681k45936l79611n11262n88173n52555
$$ 7349554 7650791 7944605 8191239 8328398 8314717 8068781 7689170 7177908 6589735 6037180
8588F037180n09420m44152l81856k86960k48216k66477j88769j41474j43883j72230
$$ 6037180 5527760 5083608 4701752 4414792 4166576 3900099 3711330 3569856 3425973 3253743
8578C253743j43765q8395p8047p7521r5526p2630o0213r4921q3666r6948r8441
$$ 3253743 3109978 3021583 2943536 2866015 2770489 2697859 2637646 2542725 2459059 2362111 2263670
8567B263670n1148m3017o8496o2582l6168m2870l6013m1999k7465j6161n4217
$$ 2263670 2212522 2169505 2101009 2038427 2002259 1959389 1923376 1881377 1853912 1837751 1783534
8556A783534n0389p2132l3434l7573k6489k7117m8269l8841l4676k4367k0817
$$ 1783534 1733145 1661013 1627579 1590006 1563517 1536400 1488131 1449290 1414614 1390247 1369430
8545A369430k2102k4629j2535m5384l9717k9850m104q789J549j8958k7694m0440
$$ 1369430 1347328 1322699 1310164 1264780 1225063 1195213 1191109 1182320 1183869 1164911 1137217 1096777
8533A096777j4107K123k6705k7203q831j268j6691k538k6914j1520K060j3838
$$ 1096777 1082670 1084793 1058088 1030885 1022054 1020786 1004095 1001557 974643 963123 965183 951345
8521I51345l8133k7086l7483j8155J7175K2476M143L43r155m6965n4985n1027
$$ 951345 913212 886126 848643 830488 847663 870139 874282 874625 865470 818505 763520 712493
8509G12493K0060L8552J556k9310L671k2448k5934r389M795K3866r079q39j1068
$$ 712493 732553 771105 772661 743351 747022 724574 698640 689251 694046 717912 708833 707994 696926
8496F96926k6596j1282k1819j713l98j8675j7220l988L868J7059M665J2205J1269
$$ 696926 670330 659048 637229 635516 635118 616443 599223 595235 599103 616162 620827 633032 644301
8483F44301r586R60K625Q156m467q29J7077m4883k5842p749P039k7089n716J1756
$$ 644301 634715 635675 638300 646456 641989 641160 658237 613354 587512 579763 586802 559713 553997 565753
8469E65753k0609o969j1472m141o221J2094J0559j3734M5606L2020o710j8234
$$ 565753 545144 538175 526703 522562 516341 528435 538994 525260 570866 602886 596176 577942
8457E77942j158n028J4987q685k4020r084K6692J0726j8675m6249k9765k518p436
$$ 577942 576784 571756 586743 578058 554038 544954 571646 582372 563697 517448 487683 485165 477729
8444D77729J8530J1623R219k2335q797J9753k357L4660J8977j0491j3250l2761
$$ 477729 496259 507882 517101 494766 485969 505722 503365 538025 557002 546511 533261 500500
8432E00500P117K6259L4990m861j3391k4591r870m850K1879K1773J0601o419l339
$$ 500500 507617 533876 568866 564005 550614 526023 516153 511303 533182 554955 565556 559137 555798
8419E55798k0595k9879M54j6419j6416J5122R144K3556J5873m2981l3253J6360
$$ 555798 535203 505324 505778 489359 472943 488065 497209 520765 536638 493657 460404 476764
8407D76764R765k2240o881J6045j265k348k7036k1227l497J4343K7743N534j2170
$$ 476764 486529 464289 457408 473453 472188 469840 442804 421577 418080 432423 460166 465700 453530
8394D53530m572K2444O718j200J2581K2214j342m7445l24L1363r952l6369k7966
$$ 453530 448958 471402 478120 476920 489501 511715 510373 462928 462604 493967 484015 447646 419680
8381D19680n720O95L1765J6791j5232J8908J1095l3649J0737O232K1082j1229
$$ 419680 413960 414655 446420 463211 447979 466887 477982 444333 455070 461302 482384 471155
8369D71155j1925k2763k0939j8856J1568K7260l224l755j7320L479K2537r456
$$ 471155 459230 436467 415528 396672 408240 435500 432276 428521 411201 414680 437217 427761
8357D27761j6198k0314p576K6366j8568j6506j5246n884J4126K9386j773Q553
$$ 427761 411563 391249 383673 410039 391471 374965 359719 353835 367961 397347 395574 404127
8345D04127K6102J8154j2172n990o709j2312M505j718p214K4838J4299K0111q811
$$ 404127 430229 448383 436211 430221 423512 411200 415705 413987 406773 431611 445910 466021 457210
8332D57210k2368j9367r07l656p534Q380r385r138K338K9490l909j1195k8327
$$ 457210 434842 415475 414568 410912 403378 411758 402373 393235 395573 425063 421154 409959 381632
8319C81632q678K3914K9581r573q620O106J6273P695l223k633J0566K5011M721
$$ 381632 372954 396868 426449 416876 408256 414362 430635 438330 435107 432474 443040 468051 472772
8306D72772k2331k2249r873k0427k6369j1782J1957K1636n720J4984k4126m440
$$ 472772 450441 428192 418319 397892 371523 359741 371698 393334 387614 402598 378472 374032
8294C74032n044l0970M1837J5200K5375J5955k5888l1307k7909o138Q614J3892
$$ 374032 368988 338018 379855 395055 420430 436385 410497 379190 351281 345143 353757 367649
8282C67649m309J3156P805J5392l6199J380K3196J7226j3484N000k4886q189J7852
$$ 367649 363340 376496 384301 399693 363494 364874 388070 405296 391812 396812 371926 363737 381589
8269C81589j7687l5926j0399N0428j8834l6867q100R046K1326j5383m639j6953
$$ 381589 363902 327976 317577 368005 349171 312304 304204 313250 334576 319193 314554 297601
8257B97601q899J1515J5034J6923J8134j9041j3088J2728j8888k0690K5305j7668
$$ 297601 288702 300217 315251 332174 350308 331267 318179 330907 312019 291329 316634 298966
8245B98966J4371N06l5891j9106J3113K9753J091K7575P971j2283L310k0160j4453
$$ 298966 313337 313843 277952 258846 271959 301712 302803 330378 338349 326066 329376 309216 294763
8232B94763q21l326k406n319O5390L858m1785j8532k1022l1335n800K7901K4944
$$ 294763 293942 290616 288210 282891 348281 352139 310354 291822 270800 239465 233665 261566 286510
8219B86510j130K104j3699j0490K7201J9151j9647j5718J4141j1724j1605j0230
$$ 286510 285380 287484 273785 263295 290496 309647 290000 274282 288423 276699 265094 254864
8207B54864J2023L1580j6188k2783k6809K2080m548j4513K0791K5496J6187l2039
$$ 254864 266887 298467 282279 259496 232687 254767 250219 235706 256497 281993 298180 266141
8195B66141j6325o68p538m5069L728M447k1586j1561J6998J0461L1418L95J2555
$$ 266141 249816 249148 241610 196541 200269 204716 183130 171569 188567 199028 230446 230841 243396
8182B43396K2436j4396k1377k570M319j8342K4831Q221k106l4826o54q619j5281
$$ 243396 265832 251436 230059 227489 231808 213466 238297 246518 244412 209586 208932 200313 185032
8169A85032p496j931K6813K7310K3270K3780K0141l3704m442R759K7084M0989
$$ 185032 177536 175605 202418 229728 252998 276778 296919 263215 258773 268532 295616 336605
8157C36605O819M329k5671p124q207l4756l278M0667j395j5606L982k5669q257
$$ 336605 343424 347753 322082 314958 306751 271995 268717 309384 307989 292383 296365 270696 262439
8144B62439P445Q60K2583r850o452K223J4331P924l5425p860K293J6647R922m215
$$ 262439 269884 270744 293327 283477 277025 279248 293579 301503 266078 258218 260511 277158 287080 282865
8130B82865J3632M983j623j2165K3966J7054O697K462j7464J976K5758K3892l4
$$ 282865 296497 301480 299857 287692 311658 328712 335409 337871 320407 322383 348141 372033 371999
8117C71999j7707k127J0888M457J4327l9685n4542j0930j4571Q564K9800j9533
$$ 371999 354292 352165 363053 367510 381837 342152 287610 276680 262109 270673 300473 280940
8105B80940n796L9900J2509J0699j1427k1371J3939J8348K230K2982j61O312J7036
$$ 280940 275144 315044 327553 338252 326825 305454 319393 337741 339971 362953 362792 369104 386140
8092C86140q819k7270L268l198j7100O428L0464J4920J1622K0672l6492j1157
$$ 386140 377321 350051 353319 350121 333021 339449 369913 384833 396455 417127 380635 369478
8080C69478p638Q523j4483k0604J4010K3229J5335J3444L5274O371J1999j6654
$$ 369478 361840 370363 355880 335276 349286 372515 387850 401294 436568 442939 454938 438284
8068D38284j8791O384R056N671J8898J6316L2411J8780K5920m509l414L3269L1314
$$ 438284 419493 425877 434933 440604 459502 475818 508229 527009 552929 548420 545006 578275 609589
8055F09589N2650N2788j525J9416L2233M4411M0901K1981L0609N7331R2j2443
$$ 609589 662239 715027 713502 732918 765151 809562 850463 872444 903053 960384 960476 948033
8043I48033J7758M4229J9291j2593L728J3737K156J8594n168k2930m815J9342
$$ 948033 965791 1010020 1029311 1016718 1020446 1034183 1036339 1054933 1049765 1026835 1022020 1041362
8031A041362J0149j6471j8811j7251J1784L6205L3296J4897J1715J6270K8159
$$ 1041362 1051511 1035040 1016229 998978 1010762 1046967 1080263 1095160 1106875 1123145 1151304
8020A151304J2643J2462K1886J5697J9102P2049R1358Q4961R3269J13779J19137
$$ 1151304 1163947 1176409 1198295 1213992 1233094 1305143 1396501 1481462 1574731 1688510 1807647
8009A807647J43523J64583J40806J31848J18579O5815J1069K9739k8214m6963
$$ 1807647 1951170 2115753 2256559 2388407 2506986 2572801 2583870 2613609 2585395 2538432
7999B538432n9785p6486o9122n9926r138k3551m4469o6653j24850j52267j18115
$$ 2538432 2478647 2402161 2333039 2273113 2263975 2240424 2195955 2129302 2004452 1852185 1734070
7988A734070p7979q0994p7651k3701k0836p879j0566n707p277l551K2353L7093
$$ 1734070 1656091 1575097 1497446 1473745 1452909 1445030 1434464 1428757 1421480 1417929 1440282 1477375
7976A477375l134L7714M0588L4790K5403P1190J17270J14332R3350R6705P3218
$$ 1477375 1474241 1511955 1552543 1587333 1612736 1683926 1801196 1915528 2008878 2105583 2178801
7965B178801J12124J30897J20879J12673Q0630L1572K878k4763l0859m7513r1346
$$ 2178801 2290925 2421822 2542701 2655374 2736004 2767576 2770454 2745691 2714832 2667319 2575973
7954B575973q8286m7241m0452n0800p8207j23163j58400j19118j25539q6118r9104
$$ 2575973 2487687 2440446 2399994 2349194 2270987 2147824 1989424 1870306 1744767 1658649 1559545
7943A559545r2775p9543m2611n3170l5940j0904k2032K7207K9925j4984k4351
$$ 1559545 1466770 1387227 1344616 1291446 1255506 1244602 1222570 1249777 1279702 1264718 1240367
7932A240367K1433K9420L2675L5237k137q417O3459N4102K1664J8208L537L5851
$$ 1240367 1261800 1291220 1323895 1359132 1356995 1348578 1412037 1466139 1487803 1506011 1509548 1545399
7920A545399N7m3110m3245m2961r079m439k8354l3890o0979o0506m4531k2223
$$ 1545399 1545456 1502346 1459101 1416140 1407061 1402622 1374268 1340378 1279399 1218893 1174362 1152139
7908A152139n1316n3450l8004m6000n2249k6818l1162m3502m7207j6129l2576
$$ 1152139 1100823 1047373 1009369 963369 911120 884302 853140 809638 762431 746302 713726
7897G13726k5682r297O721m484k8540j5435j8101m9727m0670k299L2531M919l8341
$$ 713726 688044 678747 685468 680984 652444 637009 618908 569181 528511 526212 558743 563662 525321
7884E25321l4542j6427J4494j1147j9926j2802J5364L212k0229j2285j2861j6493
$$ 525321 490779 474352 488846 477699 457773 444971 460335 463547 443318 431033 418172 401679
7872D01679j595q375K6373j0039l68R793M000Q031j3633j4530k727J5328l1065
$$ 401679 400084 391709 418082 408043 407675 417468 421468 429499 415866 401336 398609 413937 382872
7859C82872l0314n983J8204k5311k5649r268l729j3273j6083L3135J1303K2334
$$ 382872 352558 346575 364779 339468 313819 304551 300822 287549 271466 304601 315904 338238
7847C38238k0444m976j4280L121j1984k8661k6656p730J676k7770J8317J6717
$$ 338238 317794 312818 298538 301659 289675 261014 234358 226628 228304 200534 218851 235568
7835B35568o260N303K5454K5371j8357k0679j0701k7577N625N721j4498K9711
$$ 235568 229308 234611 260065 285436 267079 246400 235699 208122 213747 219468 204970 234681
7823B34681J036q429J1113o5925j4261J8287r385j507j5320j9663r53L1637J4320
$$ 234681 235717 227288 238401 172476 158215 176502 167117 165610 150290 130627 129674 161311 175631
7810A75631M291j6849m183J6784k2845k3394N8796L4774k1689j7862j972p300
$$ 175631 179922 163073 158890 175674 152829 129435 188231 223005 201316 183454 181482 174182
7798A74182R336J999j724Q564M449j4619j7206J1302P710k4014k0829N893j580
$$ 174182 183518 185517 183793 192357 196806 182187 164981 176283 183993 159979 139150 145043 143463
7785A43463j014j9097L0149J0125J1138j4539j2389k3564j8582J4602K0213J4002
$$ 143463 142449 123352 153501 163626 174764 160225 147836 124272 105690 120292 140505 154507
7773A54507l5337K250J4326J6234j9439k5119J6575l158k558R573K3512l128j8830
$$ 154507 119170 121420 135746 151980 132541 107422 123997 120839 118281 127854 151366 148238 129408
7760A29408j2586Q769n711j6305O936p120J6584J2264l4954p084k1626j6246O66
$$ 129408 116822 125591 119880 103575 110511 103391 119975 132239 97285 90201 68575 52329 52995
7747E2995K0944L8847N500Q255J4069R573J944n2341n3327J9245K2315K6983K1686
$$ 52995 73939 112786 118286 126541 140610 150183 152127 99786 46459 65704 88019 115002 136688
7734A36688j0318k6567l3488j184K8366K6058J1107n859m0828n332J4390K9749
$$ 136688 126370 99803 66315 65131 93497 119555 130662 124803 83975 78643 93033 122782
7722A22782o42N42M069j624l7353j5472P857J9153n467L960K3696l3551L099J6162
$$ 122782 122140 122682 126751 125127 87774 72302 80159 99312 93845 97805 121501 87950 91049 107211
7708A07211k7620m2018M743j80M472L3144K4972J1197k0291l4077L3550K4852
$$ 107211 79591 37573 42316 42136 46608 79752 104724 115921 95630 61553 95103 119955
7696A19955k3601k5775J055n970p912m715J2314K3813j4226j4997j2753J6988
$$ 119955 96354 70579 71634 65664 57752 53037 65351 89164 74938 59941 47188 64176
7684F4176R176M116J590k6107k1430J2451K065J9439O751O034l818Q59n667p621
$$ 64176 73352 77468 79058 52951 31521 43972 46037 65476 72227 78261 74443 75302 69635 62014
7670F2014R443L585N211j4104k3987l0K6767o629l2953l587K458J9522n136k3021
$$ 62014 71457 75042 80253 66149 42162 42132 68899 62270 29317 25730 28188 47710 42574 19553
7656A9553l6367M135K4377L9213J8846k4707o331M3126K2059j9088l3137M476
$$ 19553 -16814 -12679 11698 50911 69757 45050 38719 81845 103904 84816 51679 56155
7644E6155p514k6040M4879q669l2868j1609R918J1596l316j3146M286J0742K7223
$$ 56155 48641 22601 67480 58811 25943 14334 24252 35848 32532 19386 23672 34414 61637
7631F1637M804j9484k7142J2789P431R303q08J042k5k608j0366Q27L3946J9052
$$ 61637 66441 46957 19815 32604 40035 49338 48530 49572 49547 46939 36573 37400 71346 90398
7617I0398j7420P552J1718k3034j2221J1024o083K1243p290j4712j0159R438J4272
$$ 90398 72978 80530 92248 69214 56993 68017 61934 83177 75887 61175 51016 60454 74726
7604G4726m932j147O360j662M019j2830j6951k90K6658l363r840N274R09j4059
$$ 74726 69794 68647 75007 73345 77364 64534 47583 47293 73951 70588 60748 66022 66931 52872
7590E2872j2474J8843L1788j1139r140o949j6306k9123j3720q089k872j1438J5516
$$ 52872 40398 59241 91029 79890 70750 63801 47495 18372 4652 -3437 -6309 -17747 -2231
7577b231K6467J8511J2658k1895j6632J7350j6610J5073k9l0900K5081K3937k2684
$$ -2231 24236 42747 55405 33510 16878 34228 17618 32691 32662 1762 26843 50780 28096
7564B8096j6266m257M773Q664k3876k6235J1090K4964J6382J1866O512J0018o81
$$ 28096 11830 7573 12346 21010 -2866 -29101 -18011 6953 23335 35201 41713 51731 51050
7551E1050r735J083k7524l946J8867j1256j0559J4646J5279r387R806J1925k0178
$$ 51050 41315 42398 14874 10928 29795 18539 7980 22626 37905 28518 38324 50249 30071
7538C0071N732J0072n309k1085q112J6369J5016r975q901j3986L0122L0132l0339
$$ 30071 35803 45875 40566 19481 11369 27738 42754 32779 23878 9892 40014 70146 39807
7525C9807l302L2728K5869j1144j9177k0480j4569j713p925o048k4166k1N444
$$ 39807 36505 69233 95102 83958 64781 44301 29732 28019 20094 14046 -10120 -10141 -4697
7512d697J9146J2456N467n285J831K049q549l7393j7532K738j5793L1282N294
$$ -4697 14449 26905 32372 27087 28918 30967 22418 -14975 -32507 -29769 -45562 -14280 -8986
7499h986O759K6420J5345k2580j2684K8879J6354K4407j8548m4316k5560J2698
$$ -8986 -2227 24193 39538 16958 4274 33153 49507 73914 55366 11050 -14510 -1812
7487a812J1079j0793j2578l084P193M1181K968j6197k3997q990R652n201q772
$$ -1812 9267 -1526 -14104 -17188 -9995 31186 34154 17957 -6040 -15030 -5378 -10579 -19351
7474a9351J4535J3085J5935j4227n908L765M053J1881L6340p494q734j1568o314
$$ -19351 -4816 8269 24204 9977 4069 7834 11887 23768 60108 52614 43880 32312 25998
7461B5998j1014O194j271j1398j5927J4611L2827O624j3447N043J5240R541k1356
$$ 25998 14984 21178 19907 8509 -7418 7193 40020 46644 33197 38240 53480 63021 41665
7448D1665j1668J3946q695j1846K699q811J147J3145J0426j3337k1099j0803k885
$$ 41665 29997 43943 35248 23402 26101 17290 18437 31582 42008 28671 7572 -3231 -6116
7435f116J5506j1962K9088J3417k059k6505k2010J9909O848J9750O33J354m2668
$$ -6116 9390 -2572 26516 39933 37874 11369 -10641 9268 16116 35866 36499 37853 -4815
7422d815j6774K5773n924R04M132j3780K4433K6962j2822j5507j0652k8558N268
$$ -4815 -21589 4184 -1740 -836 3296 -10484 13949 40911 28089 12582 1930 -26628 -21360
7409b1360J4511J2255j3350k6798L645l93J7069K8875k213k2817k81j1326K8957
$$ -21360 -6849 5406 -7944 -34742 -31097 -31490 -14421 14454 12241 -10576 -10857 -22183 6774
7396F774J5212K251K886R23O382l1607r797J539k864K1083J599m291M608N281
$$ 6774 21986 24237 27123 28046 34428 2821 -6976 -5437 -8301 12782 14381 10090 14698 19979
7382A9979j5558Q393J7412J428l0442J80j2098K5734P821J292m464J3491j8529
$$ 19979 4421 12814 30226 31654 1212 1392 -10706 15028 22849 24141 19677 33168 14639
7369A4639j4816N380O83p45j6543J4746j4105o266M495J0710n264q224m965L491
$$ 14639 -177 5203 5886 5141 -11402 3344 -10761 -17027 -12532 -1822 -7086 -15310 -20275 -16784
7355a6784p475J5052K1376R413m078j3578j022l1935k9323O109K1367J7514L0461
$$ -16784 -24259 -9207 12169 21582 17504 3926 2904 -29031 -58354 -52245 -30878 -13364 17097
7342A7097L4386Q284j9224m4816j6052L494k589K8071L0197r226p36J7133n385
$$ 17097 51483 59767 40543 -4273 -20325 -16831 -19420 8651 38848 29622 28886 46019 40634
7329D0634O862k2508l9468o479K7449L2521q928j7985K1593L460k0686l433j7377
$$ 40634 47496 24988 -14480 -20959 6490 39011 30083 12098 33691 37151 16465 13032 -4345
7316d345l2513M346q685M402J8471J9368r206M903M286J7278J9694K160J2613
$$ -4345 -36858 -32512 -41197 -36795 -18324 1044 -8162 -3259 1027 18305 37999 40159 52772
7303E2772k8362k5673N035Q816K4696J430m466K55q717m744j1066O228L446k5858
$$ 52772 24410 -1263 3772 12588 37284 38714 34248 34503 25786 21042 9976 16204 19650 -6208
7289f208l2927K9425J1607O44L181l656j3725j4417K8181M962J2719k908M302
$$ -6208 -39135 -9710 1897 2541 5722 2066 -11659 -26076 2105 7067 19786 16878 21180
7276B1180J3789p120o758k9472q579K3613R361J0932o632L2186l802o3848j4751
$$ 21180 34969 27849 21091 -8381 -16960 6653 16014 26946 20314 52500 48698 -15150 -29901
7263b9901K1891J8533N286j8086j7842L7700j0391k4841J0488K076K4716q482
$$ -29901 -8010 10523 15809 -2277 -20119 17581 7190 -17651 -7163 -5087 19629 11147
7251A1147l7581P849m14j8267L035J7147J2304j986j4564J8605L0173j6536j2311
$$ 11147 -26434 -18585 -18999 -37266 -34231 -17084 -4780 -6766 -21330 -2725 27448 10912 -1399
7238a399n450k7176K1859K5124N618r927J293L31k8647m0199K2022M7967o535
$$ -1399 -6849 -34025 -12166 12958 18576 8649 9942 10273 -18374 -58573 -36551 11416 4881
7225D881j492n364Q630j0693k0699P105L2228K2418O474k4707k7864j2795q994
$$ 4881 3389 -1975 6655 -4038 -24737 -17632 14596 37014 43488 18781 -9083 -21878 -30872
7212c0872J9885Q199j3447K2471Q058N05M062N122R726j1156j0997k545m035J196
$$ -30872 -10987 -2788 -16235 6236 14294 14799 18861 23983 33709 22553 11556 9011 4976 6172
7198F172N834J6882J1499k5550j5503O581J3099j8485J885j1210j0101k0011m627
$$ 6172 12006 28888 40387 14837 -666 5915 19014 529 2414 -8796 -18897 -38908 -43535
7185d3535L9809L1144j3255q880J8096J9598k958k7711k088l5997k2472K434k5963
$$ -43535 -3726 27418 14163 5283 23379 42977 40019 12308 10220 -25777 -48249 -45815 -71778
7172g1778M1256K9672J9483R473K344r538j8326L403L4174j7035k2471l228J0034
$$ -71778 -30522 -850 18633 28106 30450 20912 2586 5989 40163 23128 657 -2571 7463
7159G463L8229j4293j7683k2765n727J4100j439K3681q73j610m0000m3897P352
$$ 7463 45692 31399 13716 -9049 -14776 -676 -2115 21566 20693 19083 -20917 -64814 -57462
7146e7462M1162J2412j3655j2675j9421K6674M7370J0736k8261p358N946n079
$$ -57462 -16300 -3888 -17543 -30218 -49639 -22965 24405 35141 6880 -478 5468 389
7134C89O968R106j6018j1524m782r483J9177k13r782L6402K2344m6834k3998L0437
$$ 389 7357 16463 445 -11079 -15861 -25344 -6167 -6380 -16162 20240 42584 -4250 -28248 2189
7120B189L0035L22q996j0673o956m1098l939R692K2254l158K0515p756l7594J4981
$$ 2189 32224 32546 23550 12877 5921 -35177 -39116 -29424 -7170 -10328 10187 2431 -35163 -20182
7106b0182N2976J0844l0208j8903l675k997K1518j5633R922K53l9950N111J3182
$$ -20182 32794 43638 13430 -5473 -9148 -12145 9373 -6260 3662 3915 -36035 -30924 -17742
7093a7742K8968M884K3609j0226k3386j9128M094j1985o958K0465L546N709Q086
$$ -17742 11226 16110 39719 29493 6107 -13021 -8927 -20912 -27870 -7405 -3859 1850 9936
7080I936K5767M0187J4770l0783j2124J9247k5643m0244l196L3001J1836k2917
$$ 9936 35703 75890 90660 59877 47753 67000 41357 1113 -2083 30918 42754 19837
7068A9837j2527m947K1632J5946J0345J119K3020p030j7732k4872j8581O310N417
$$ 19837 7310 2363 23995 39941 50286 51405 74425 67395 49663 24791 6210 12520 17937
7055A7937J528L703K7520J3869k6570k3231J9077r987J4349J9451l0950k5164
$$ 17937 19465 23168 50688 64557 37987 14756 33833 23846 38195 57646 26696 1532
7043A532n501k2500J0967J5867J3147J3770k5169n111k616k0621n642J6958q60
$$ 1532 -3969 -26469 -15502 365 13512 27282 2113 -2998 -5614 -26235 -31877 -14919 -15779
7030a5779j7726o089J3953q10K800l092J5472P143j1399K3592p349M627R476j1724
$$ -15779 -33505 -39594 -25641 -26451 -23651 -26743 -11271 -4128 -15527 8065 716 5343 14819 3095
7016C095j0482o543J1963j1907R21j363J6228K2524j7762j1779N519P266l485
$$ 3095 -7387 -13930 -1967 -13874 -12953 -14316 1912 24436 6674 -5105 414 7680 4195
$$ [...]
##END NTUPLES=NMR SPECTRUM
##END=
