##TITLE=Analysis number 308260
Compound Code cc 23613
Book Reference 399/161
Project Code adrs
Chemist Name evam
##JCAMPDX= 6.0         $$ Bruker NMR JCAMP-DX V2.0
##DATA TYPE= NMR SPECTRUM
##DATA CLASS= NTUPLES
##ORIGIN= Bruker BioSpin GmbH
##OWNER= NMR
$$ XWIN-NMR		Version 3.5
$$ Tue May 24 08:58:27 2005 GMT Daylight Time (UT+1h)  MAYBRIDGE\NMR@NMR_250MHZ
##.OBSERVE FREQUENCY= 250.131544655141
##.OBSERVE NUCLEUS= ^1H
##.ACQUISITION MODE= SIMULTANEOUS (DQD)
##.ACQUISITION SCHEME= undefined
##.AVERAGES= 16
##.DIGITISER RES= 18
##SPECTROMETER/DATA SYSTEM= dpx250
##.PULSE SEQUENCE= zg30
##.SOLVENT NAME= CDCl3
##.SHIFT REFERENCE= (INTERNAL, CDCl3, 0, 16.522)
##AUDIT TRAIL= $$ (NUMBER, WHEN, WHO, WHERE, WHAT)
$$ ##TITLE= Audit trail, XWIN-NMR		Version 3.5
$$ ##JCAMPDX= 5.01
$$ ##ORIGIN= Bruker BioSpin GmbH
$$ ##OWNER= NMR
$$ C:\u/data/dgb/nmr/ADRS/3350/pdata/1/auditp.txt
$$ ##AUDIT TRAIL=  $$ (NUMBER, WHEN, WHO, WHERE, WHAT)
(   1,<2005-05-24 08:57:34.40 +100>,<MAYBRIDGE\NMR>,<NMR_250MHZ>,
      <created by zg, POWCHK disabled, PULCHK disabled
       configuration hash MD5:
       62 19 C7 07 E1 42 D1 B7 37 6C 3D D0 77 39 F9 E6
       data hash MD5: 64K
       E3 C9 D8 9F 9D E2 76 91 86 0E 58 5F AD AC BD BC>)
(   2,<2005-05-24 08:57:51.34 +100>,<MAYBRIDGE\NMR>,<NMR_250MHZ>,
      <Start of raw data processing
       ef LB = 0.3 FT_mod = 6 PKNL = 1 SI = 32K 
       data hash MD5: 32K
       9F 3A 5E 2E 7C F8 54 AA 44 0E AB D8 EC C2 3A 24>)
(   3,<2005-05-24 08:57:53.29 +100>,<MAYBRIDGE\NMR>,<NMR_250MHZ>,
      <apk 
       data hash MD5: 32K
       80 6F 72 7B 27 39 2B DB 56 4B 6C AB 58 6C 3A 66>)
(   4,<2005-05-24 08:58:18.24 +100>,<MAYBRIDGE\NMR>,<NMR_250MHZ>,
      <abs ABSG = 5 
       data hash MD5: 32K
       BC 1A E6 23 D6 69 1F 5F F3 A6 29 A4 30 3A BD DB>)
$$ ##END=
$$ 
$$ hash MD5
$$ AF C7 6C 5E BF 29 1F 0D E4 4C 45 50 2E E0 F1 EC
##$RELAX= 
##$RELAX= 
##$RELAX= 
##$RELAX= 
##$RELAX= 
##$RELAX= 
##$RELAX= 
$$ Bruker specific parameters
$$ --------------------------
##$DU= <C:\u>
##$EXPNO= 3350
##$NAME= <ADRS>
##$PROCNO= 1
##$TYPE= <nmr>
##$USER= <dgb>
##$AMP= (0..31)
100 100 100 100 100 100 100 100 100 100 100 100 100 100 100 100 100 100 
100 100 100 100 100 100 100 100 100 100 100 100 100 100 
##$AQSEQ= 0
##$AQ_mod= 3
##$AUNM= <au_zg>
##$AUTOPOS= <1 >
##$BF1= 250.13
##$BF2= 250.13
##$BF3= 250.13
##$BF4= 250.13
##$BF5= 500.13
##$BF6= 500.13
##$BF7= 500.13
##$BF8= 500.13
##$BYTORDA= 1
##$CFDGTYP= 0
##$CFRGTYP= 5
##$CHEMSTR= <none>
##$CNST= (0..31)
1 1 145 1 1 1 1 1 1 1 1 1 1 1 1 1 1 1 1 1 1 1 1 1 1 1 1 1 1 1 1 1 
##$CPDPRG= <>
##$CPDPRG1= <>
##$CPDPRG2= <>
##$CPDPRG3= <>
##$CPDPRG4= <mlev>
##$CPDPRG5= <mlev>
##$CPDPRG6= <mlev>
##$CPDPRG7= <mlev>
##$CPDPRG8= <mlev>
##$CPDPRGB= <>
##$CPDPRGT= <>
##$D= (0..31)
0 1 0 0 0 0 0 0 0 0.06 0 0 0 0 0 0 0.0002 0 0 0 0 0 0 0 0 0 0 0 0 0 0 
0 
##$DATE= 1116921453
##$DBL= (0..7)
120 120 120 120 120 120 120 120 
##$DBP= (0..7)
150 150 150 150 150 150 150 150 
##$DBP07= 0
##$DBPNAM0= <>
##$DBPNAM1= <>
$$ [...]
##$SUBNAM7= <"">
##$SUBNAM8= <"">
##$SUBNAM9= <"">
##$SW= 20.6930455092707
##$SWIBOX= (0..15)
0 0 3 0 0 0 0 0 0 0 0 0 0 0 0 0 
##$SW_h= 5175.983436853
##$TD= 65536
##$TD0= 1
##$TE= 295.16
##$TE2= 300
##$TE3= 300
##$TEG= 300
##$TL= (0..7)
0 120 120 120 120 120 120 120 
##$TP= (0..7)
150 150 150 150 150 150 150 150 
##$TP07= 0
##$TPNAME0= <>
##$TPNAME1= <>
##$TPNAME2= <>
##$TPNAME3= <>
##$TPNAME4= <>
##$TPNAME5= <>
##$TPNAME6= <>
##$TPNAME7= <>
##$TPOAL= (0..7)
0.5 0.5 0.5 0.5 0.5 0.5 0.5 0.5 
##$TPOFFS= (0..7)
0 0 0 0 0 0 0 0 
##$TUNHIN= 0
##$TUNHOUT= 0
##$TUNXOUT= 0
##$USERA1= <user>
##$USERA2= <user>
##$USERA3= <user>
##$USERA4= <user>
##$USERA5= <user>
##$V9= 5
##$VALIST= <valist>
##$VCLIST= <CCCCCCCCCCCCCCC>
##$VD= 0
##$VDLIST= <DDDDDDDDDDDDDDD>
##$VPLIST= <PPPPPPPPPPPPPPP>
##$VTLIST= <TTTTTTTTTTTTTTT>
##$WBST= 1024
##$WBSW= 4
##$XGAIN= (0..3)
0 0 0 0 
##$XL= 0
##$YL= 0
##$YMAX_a= 581177
##$YMIN_a= -724244
##$ZGOPTNS= <>
##$ZL1= 120
##$ZL2= 120
##$ZL3= 120
##$ZL4= 120
##$ABSF1= 16.522
##$ABSF2= -4.171173
##$ABSG= 5
##$ABSL= 3
##$ALPHA= 0
##$AQORDER= 0
##$ASSFAC= 0
##$ASSFACI= 0
##$ASSFACX= 0
##$ASSWID= 0
##$AUNMP= <proc_1d>
##$AZFE= 0.1
##$AZFW= 0.1
##$BCFW= 0
##$BC_mod= 0
##$BYTORDP= 0
##$COROFFS= 0
##$CY= 12.5
##$DATMOD= 1
##$DC= 0
##$DFILT= <>
##$DTYPP= 0
##$F1P= 14.0000005364418
##$F2P= -0.99999901652339
##$FCOR= 0.5
##$FTSIZE= 32768
##$FT_mod= 6
##$GAMMA= 0
##$GB= 0
##$INTBC= 1
##$INTSCL= 1
##$ISEN= 128
##$LB= 0.3
##$LEV0= 0
##$LPBIN= 0
##$MAXI= 10000
##$MC2= 0
##$MEAN= 0
##$ME_mod= 0
##$MI= 0
##$NCOEF= 0
##$NC_proc= -2
##$NLEV= 6
##$NOISF1= 0
##$NOISF2= 0
##$NSP= 0
##$NTH_PI= 0
##$NZP= 0
##$OFFSET= 16.522
##$PC= 1
##$PHC0= -75.49124
##$PHC1= 5.621333
##$PH_mod= 1
##$PKNL= yes
##$PPARMOD= 0
##$PSCAL= 4
##$PSIGN= 0
##$REVERSE= no
##$SF= 250.13
##$SI= 32768
##$SIGF1= 0
##$SIGF2= 0
##$SINO= 400
##$SIOLD= 32768
##$SREGLST= <1H.CDCl3>
##$SSB= 0
##$STSI= 32768
##$STSR= 0
##$SW_p= 5175.98343685301
##$SYMM= 0
##$S_DEV= 0
##$TDeff= 65536
##$TDoff= 0
##$TI= <Analysis number 999999
Compound Code 99
Book Reference 9
Project Code 9>
##$TILT= no
##$TM1= 0
##$TM2= 0
##$TOPLEV= 0
##$USERP1= <user>
##$USERP2= <user>
##$USERP3= <user>
##$USERP4= <user>
##$USERP5= <user>
##$WDW= 1
##$XDIM= 32768
##$YMAX_p= 323262588
##$YMIN_p= -34935
$$ End of Bruker specific parameters
$$ ---------------------------------
##NTUPLES= NMR SPECTRUM
##VAR_NAME=  FREQUENCY,     SPECTRUM/REAL,   SPECTRUM/IMAG
##SYMBOL=    X,             R,               I
##VAR_TYPE=  INDEPENDENT,   DEPENDENT,       DEPENDENT
##VAR_FORM=  AFFN,          ASDF,            ASDF
##VAR_DIM=   32768,         32768,           32768
##UNITS=     HZ,            ARBITRARY UNITS, ARBITRARY UNITS
##FACTOR=    0.157963299565203, 1,           1
##FIRST=     4132.6476996994, 0,             0
##LAST=      -1043.33573715361, 0,           0
##MIN=       -1043.33573715361, -34935,      0
##MAX=       4132.6476996994, 323262588,     0
$$ Real data points
##PAGE= N=1
##DATA TABLE= (X++(R..R)), XYDATA
$$ [...]
18756H225k709J0962M984j742k673k199P38M54l24J593n701J892L408L716M309
18741B4933J032o489J230k297Q90O367p22n822o944j0307L050R096k809Q98K990
18726A5096L999k506n402j128K666J357N850j256n243J602l554k698L22j635M484
18711A1954J21L62k110M636M51k421L303K597n070J394O085K050k401k260q965
18696I726K268j0729k228J119N191N888M036N773l480p511p74k099L320j517j433
18681G550J17n90L422K161m869l249O214R860j957J132P681k134m152K483k727
18666B0942J642N228m150o892j256M331P964l28p14J421R32l36l388r692l027
18651A2677M306N450P017k47L133j922L735M872K056m366r969l016L525K159L228
$$ plain form
18756 8225 5516 16478 21462 19720 17047 14848 15586 16040 15716 17309 11608 13500 16908 20624 24933
18741 24933 25965 19476 20706 18409 19299 25666 24944 19122 12178 1871 4921 14017 11208 12106 15096
18726 15096 19095 16589 11187 10059 12725 14082 19932 18676 13433 15035 11481 8783 9105 7470 11954
18711 11954 12075 12437 10327 14963 15414 12993 16296 18893 13823 15217 21302 23352 20951 18691 9726
18696 9726 11994 1265 -963 156 5347 11235 15271 21044 17564 10053 9279 7180 10500 8983 7550
18681 7550 7667 7077 10499 12660 7791 4542 10756 20616 18659 19791 27472 25338 21186 23669 20942
18666 20942 22584 27812 23662 16770 15514 19845 27809 27481 26767 28188 29120 28784 25396 15704 12677
18651 12677 16983 22433 29450 29203 32336 30414 34149 39021 41077 36711 26742 23726 27251 29410 32638
18636C2638r45l051P19L090J525n521r421R44k180N489O738o61p361p084J673
18621A6592R154R071n004r58L637M65l47J802k673m880k491j508K035J192j109
18606B4978L542n268k866k518K349P683J746L478m452j1792j37Q996O882k166
18592C0455p586j1107k256N826J3616K461k787k914j351m035Q39m561K181N586
18578B4367L909M053j071l793Q426R68j98m757L703P840Q263M22m348M139J767
18563E3690O85n09J624o24n939P80O407m343q280j448J662J1121M573k172k481
18548E4746r63q871n693k035j140j11P05k030j580K183R303R000m492O326j82
18533E5166o670J118K914J030n248k031j963N903J026j0065j297K297j802j73
$$ plain form
18636 32638 31693 28642 29361 32451 33976 28455 19034 19978 17798 23287 30025 29364 22003 14919 16592
18621 16592 25746 34817 29813 28855 32492 32957 32610 34412 31739 26859 24368 22860 24895 26087 24978
18606 24978 28520 23252 20386 17868 20217 27900 29646 33124 28672 16880 16743 25739 32621 30455
18592 30455 22869 11762 9506 15332 28948 31409 28622 25708 24357 20322 21161 16600 18781 24367
18578 24367 28276 32329 31258 27465 35891 36859 36661 31904 35607 43447 51710 52132 47784 51923 53690
18563 53690 54375 53866 55490 54866 48927 49707 56114 51771 43491 42043 43705 54826 59399 57227 54746
18548 54746 53783 44912 39219 37184 36044 35933 36638 34608 33028 35211 44514 53514 49022 55348 55166
18533 55166 48496 49614 52528 53558 48310 46279 44316 50219 51245 41180 39883 42180 40378 40205
18519D0205K349K890k527k011l302M866K641j652m57l420R47j172r28L384N076
18504D6889K14L23K989k092l840O251P628j829l030O274K395k392R55N502N680
18489G1917l415M489J812J101O549J0380l48M887Q18l980K631j467N221L640m657
18474I9578k096l413r842p344n267l445k801p813j801M812M395l210n832l600
18460E2321q51J1136L260m349o469J43R235O524q71j0588k516L225M196P01L600
18445F8697k977k674j148J02O03k076K317M931J251l189q54K48L519K141K064
18430G2955O015l219k368m5p83O990L169J224O029Q6L01N43J773q724n58m977
18414G8411K122j527m41N720Q508O66O12L651J875J711N90r63l042j18n736q498
$$ plain form
18519 40205 42554 45444 42917 40906 37604 42470 45111 43459 43002 39582 40529 39357 38429 41813 46889
18504 46889 47103 47426 50415 48323 44483 50734 58362 56533 53503 59777 62172 59780 60735 66237 71917
18489 71917 68502 72991 74803 75904 82453 92833 92485 97372 98190 94210 96841 95374 100595 104235 99578
18474 99578 97482 94069 84227 76883 71616 68171 65370 57557 55756 60568 64963 61753 55921 52321
18460 52321 51470 62606 65866 61517 55048 55191 64426 70950 70079 59491 56975 60200 64396 65097 68697
18445 68697 65720 63046 61898 62000 62603 60527 62844 67775 69026 65837 64983 65231 68750 70891 72955
18430 72955 78970 75751 73383 73338 72555 79545 82714 83938 89967 90053 90354 90897 92670 83946 83388 78411
18414 78411 80533 79006 78565 84285 92793 93459 94071 97722 99597 101308 101898 100935 97893 97775 92039 83541
18398H3541j069J1674j074j472J5172M368m184m181l090M097O240j79k787n797
18384A01259K305R889L735J999M952N66k279P491L725N300J370Q81L489R77L12
18369A45971N677j972L169R254L449K66O572P504M666N889K714k002m130K508
18355A89535J3194J0462r48M303K756M772M675k294j303O861J01K339J5763J7158
18341B67374J3126L859P267P955O296Q532J0496M475P598Q988K278l514m975m32
18327C39323M352J709r018J077j937k922n121O151P862N224K984J2890Q301K038
18313C72913J58P249Q604j465k001Q318Q889Q794J3947J3830O714J2539J9132
18300D77621J0171J0267J7755J8592J4951J5110K2348K2045K4170K5024J9555
$$ plain form
18398 83541 82472 94146 93072 91600 106772 111140 106956 102775 99685 103782 110022 109843 107056 101259
18384 101259 103564 113453 117188 119187 124139 124705 122426 129917 133642 138942 140312 141193 144682 145659 145971
18369 145971 151648 149676 152845 162099 165548 165814 172386 179890 184556 190445 193159 191157 187027 189535
18355 189535 202729 213191 212243 216546 219302 224074 228749 226455 225152 232013 232114 234453 250216 267374
18341 267374 280500 284359 291626 299581 305877 314409 324905 329380 336978 345966 348244 344730 339755 339323
18327 339323 343675 345384 336366 337443 335506 332584 327463 333614 341476 346700 349684 362574 370875 372913
18313 372913 373071 380320 388924 387459 385458 393776 402665 411459 425406 439236 445950 458489 477621
18300 477621 487792 498059 515814 534406 549357 564467 586815 608860 633030 658054 677609
18289F77609J7110J7684J6770K3513K3509K1283L3157L7361L2373K5625K5237
18278I51231M2916M4667M0443M9894O1157O4969O3418P1078Q8335R1687J00853
18267A670648J04484J04784J06897J07748J16770J23868J31170J41623J50337
18258B758329J59951J67584J79176J92345K07185K44062K74655L07999L62424
18249D853710M25512M99227N78136O80515Q18365R76641J187350J461169J826123
18240A3306748K263448K781447L327999L851148M280286M523321M504575M210557
18232D3049529L702972L032369K289143J547333Q25889R3208o77426j479612k312347
18223E0071058l117770l812378m302300m520830m473492m204576l775461l277407
$$ plain form
18289 677609 694719 712403 729173 752686 776195 797478 830635 867996 900369 925994 951231
18278 951231 994147 1038814 1079257 1129151 1190308 1255277 1318695 1389773 1478108 1569795 1670648
18267 1670648 1775132 1879916 1986813 2094561 2211331 2335199 2466369 2607992 2758329
18258 2758329 2918280 3085864 3265040 3457385 3664570 3908632 4183287 4491286 4853710
18249 4853710 5279222 5778449 6356585 7037100 7855465 8832106 10019456 11480625 13306748
18240 13306748 15570196 18351643 21679642 25530790 29811076 34334397 38838972 43049529
18232 43049529 46752501 49784870 52074013 53621346 54447235 54540443 53863017 52383405 50071058
18223 50071058 46953288 43140910 38838610 34317780 29844288 25639712 21864251 18586844
18215A8586844k770633k298421j890991j548679j272413j041903q61724p23043
18207F179037o00489m98282m26486l67888l01203k53861k22266j88317j79165
18198C141080j60876j38556j39448j35869j29887j20428j16952j12485j12998
18189A973581j07887j00290r2351r3300q4728p1670p5860o2328m2249l8277k9842
18178A174799j8346j4879n234N180L888J511o90j0906m704o376q180j3762j8878
18165A083423j5927j8763k0134k4950k3611l8169l8436l9474m1165l9817m7818
18154G35159m0336l8626k9860k9145k8860j8761j0928j3349k1416j3622j1175
18143D79081j5941j0785q003j3444p727r73O1j245O007M444M267P537J4594R225
$$ plain form
18215 18586844 15816211 13517790 11626799 10078120 8805707 7763804 6902080 6179037
18207 6179037 5578548 5080266 4653780 4285892 3984689 3730828 3508562 3320245 3141080
18198 3141080 2980204 2841648 2702200 2566331 2436444 2316016 2199064 2086579 1973581
18189 1973581 1865694 1765404 1673053 1579753 1495025 1423355 1347495 1285167 1242918 1204641 1174799
18178 1174799 1156453 1141574 1136340 1141520 1145408 1146919 1146229 1135323 1130619 1124243 1116063 1102301 1083423
18165 1083423 1067496 1048733 1028599 1003649 980038 941869 903433 863959 822794 782977 735159
18154 735159 694823 656197 626337 597192 568332 549571 538643 525294 503878 490256 479081
18143 479081 463140 452355 444352 430908 423181 422208 422269 421024 427031 431475 435742 443279 457873 467098
18129D67098J0200R969J7536K1483J7947L2713L6668L7578M5554O5661P6928R6345
18117I35680J22642J80270K64167L80566N90925R40349J509845K242119K120694
18108I287257Q31780l32747j450881j523889j511122j399354j007679o69481m69569
18099A754315l38676k38126j80193j39286j07097q7423p7882o1590m9561l4445
18089D40036l1367k7975k1485k8029j8210q476j3709j1013j382k242j6975j5194
18077B43979p768l424l689r489j0916o287o866j1256p753q649m31k73k93L608
18063A70493j590m725n154j623m543r75J937n205q775j594o163p105L011N438
18049A33427L216k258n282j358Q071R465K320L091J0666M779O796J6516Q389Q627
$$ plain form
18129 467098 477298 487267 504803 526286 544233 576946 613614 651192 696746 762407 839335 935680
18117 935680 1058322 1238592 1502759 1883325 2474250 3414599 4924444 7166563 9287257
18108 9287257 10119037 9786290 8335409 6811520 5300398 3901044 2893365 2223884 1754315
18099 1754315 1415639 1177513 997320 858034 750937 663514 585632 524042 474481 440036
18089 440036 408669 380694 359209 331180 312970 304494 290785 279772 278390 276148 259173 243979
18077 243979 236211 232787 229098 219609 208693 202406 195540 184284 176531 167882 167451 167178 166885 170493
18063 170493 168903 164178 159024 157401 152858 151883 153820 148615 139840 138246 132083 124978 127989 133427
18049 133427 136643 134385 129103 127745 135816 145281 147601 150692 161358 166137 172933 189449 197838 206465
18035B06465J1833J9932K2900K2077L0743K5890K8028K2299P168P364O625P570
18023D18894l529j054j4044k5414k3022k5867k4398k8195k3822k6474k5342j9534
18011A78199j5640j2379j5215o759o774o889p891k205Q40l748p14n993j0612o821
17997G7399l258q42O59K03L643j076m075p78k384m298m783o25N578L64J003L911
17981G0641o343k947k148l201l885K056K143o21q580p278J642L870M73k375J481
17966D4928m42j822K052J905J300j276K039M260M842p576q705N42N161P925k614
17951E2519J504m249m085k794L225j478k352O658K656l385p466q456k17P634M143
17936D3857j124J765N808L13k12m697j1736k034R684J779n879p278l751l415J63
$$ plain form
18035 206465 218298 238230 261130 283207 313950 339840 367868 390167 397335 404699 411324 418894
18023 418894 415365 414311 400267 374853 351831 325964 301566 273371 249549 223075 197733 178199
18011 178199 162559 150180 134965 128206 121432 114543 106652 104447 105287 101539 100825 94832 84220 77399
17997 77399 74141 73299 73958 74161 77804 76728 72653 71875 69491 65193 60410 59785 65363 65727 66730 70641
17981 70641 64298 61351 59203 56002 52117 54173 56316 55695 47115 39837 41479 45349 45822 43447 44928
17966 44928 44486 42664 44716 46621 47921 46645 48684 52944 57786 50210 41505 42047 47208 55133 52519
17951 52519 54023 49774 45689 42895 46120 44642 42290 48948 51604 48219 40753 32297 32080 39714 43857
17936 43857 42733 44498 50306 50619 50407 45710 33974 31940 41624 43403 37524 30246 26495 23080 23243
17921B3243Q572N782k403k663l156l091j750L885M029j064k519l807R85l128J306
17906B4221Q59k488k302P513n248j0599O57J0329J898p01k614M074Q334N027l425
17891C5535p043L699N462K987j065l425N14r387J19N304l827o751N820P241M122
17876C9305P141l285j972r92n073K539j357j659L281n380m698N140N378K699l313
17861C7754p405o059P12M678l653Q75j76R053J1121o716n053k774K050J05M358
17846C8870O99m311l981m247K816M052J199j44J430m260N439L84n142N455k743
17831C5516L74k615n335j768Q684M346k988j873n365o69k60K316O24k435n189
17816B3363J903Q130O360n151l436l667M215L991L306k498m412l062K79j017L352
$$ plain form
17921 23243 31815 37597 35194 32531 29375 26284 24534 28419 32448 31384 28865 25058 26043 22915 24221
17906 24221 25080 22592 20290 27803 22555 11956 12613 22942 24840 24139 21525 25599 33933 38960 35535
17891 35535 28492 32191 37653 40640 39575 36150 36664 27277 27396 32700 28873 22122 27942 35183 39305
17876 39305 46446 43161 41189 40197 35124 37663 36306 34647 37928 32548 27850 32990 38368 41067 37754
17861 37754 30349 24290 25002 29680 26027 26902 26726 35779 46900 40184 35131 32357 34407 34512 38870
17846 38870 39569 35258 31277 27030 29846 33898 35097 34953 36383 32123 37562 37946 32804 38259 35516
17831 35516 35890 33275 27940 26172 34856 39202 36214 34341 28976 28307 28047 30363 30987 28552 23363
17816 23363 25266 33396 39756 34605 31169 27502 31717 35708 39014 36516 32104 29042 29321 28304 31656
17801C1656J122M780M471J585m257n778J34p764K06M261J206N119N162J594J260
17786D4757j463j427K539m468j348k255L665j114j58R842N901L167l273q860o098
17771C9407J340M091O807L926L97L434k565o006L433m974p886m274L147k443n739
17756C2095K538L221M140l31o288m932j42j814M433M152k088R10P986n016m622
17741C4242m029N764m74K493l999k870J640K298J066l788j466M340l812n87M528
17726C5346M086k21j706J555M4L698M249m317o471j498K604j48Q903m061m861
17711C7202J798J593r62k75L222L779J4231L804o460M527K25k943L941L038M394
17696G1114N718Q864K460M389J282O632P756L138o53N038K739K316K886l738m317
$$ plain form
17801 31656 32778 37558 42029 43614 39357 33579 33713 25949 26155 30416 31622 36741 41903 43497 44757
17786 44757 43294 41867 44406 39938 38590 36335 40000 38886 38728 48570 54471 57638 54365 45505 39407
17771 39407 40747 44838 51645 55571 55968 59402 56837 50831 54264 49290 41404 37130 40277 37834 32095
17756 32095 34633 37854 41994 41663 35375 30443 30301 28487 32920 37072 34984 35894 43880 38864 34242
17741 34242 30213 35977 35503 37996 33997 31127 32767 35065 36131 32343 30877 35217 31405 30818 35346
17726 35346 39432 39211 37505 39060 39104 42802 47051 42734 36263 34765 37369 37221 46124 42063 37202
17711 37202 39000 40593 39631 39356 42578 46357 60588 64392 57932 62459 62684 59741 63682 66720 71114
17696 71114 76832 85696 88156 92545 93827 100459 108215 111353 110700 115738 118477 120793 123679 119941 115624
17681A15624l972J623M715o166j2696q425n098L199l673j335o854p192k810o316
17667F0624L577P169N36l822l848n943k846m59j453k334k732j312k855p87n2O59
17651D4122J693l157l617N710K773M171K67j348L600Q228j054o610K866K902L346
17636F3892j637l586L139M775k830k098J2606J1330M705P295Q833K020j769M302
17622A10977q951r095Q405M465m621M147L025k914K36l531j194o27k403r11L211
17607A00219L147r827J605R571P070N127J1583k235n553K479L254j288M211P672
17593A37035O726R730J2863J3105K9967L2032K6791L1143M5072M9029N0634M0825
17581D84952L0492L0873K8411J0300N617N35o750j9241k7676j9581j9344k3295
$$ plain form
17681 115624 111652 113275 117990 111824 99128 90703 85605 88804 85131 83796 76942 69750 66940 60624
17667 60624 64201 71370 71906 68084 64236 58293 55447 54988 53535 51201 48469 47157 44302 43515 43463 44122
17651 44122 45815 42658 39041 44751 47524 51695 51962 50614 54214 62442 61388 54778 57644 60546 63892
17636 63892 62255 58669 61808 66583 63753 61655 74261 85591 90296 97591 106424 108444 106675 110977
17622 110977 102026 92931 101336 105801 101180 105327 108352 105438 105674 102143 100949 100322 97919 97008 100219
17607 100219 103366 93539 95144 104715 111785 116912 128495 126260 120707 123186 126440 125152 129363 137035
17593 137035 143761 153491 166354 179459 209426 241458 268249 299392 344464 393493 444127 484952
17581 484952 515444 546317 574728 585028 590645 591180 584430 565189 537513 517932 498588 475293
17569D75293k8515k3154k9333l7261k9316j6700j8011j8730j6237j3441r777j1510
17557B23308j1180q084k019l781n343j634j043l930k034N117N149m074K498J092
17543A94042N716j576J690L80p535J629K755M265J1263L389L983J482L984O955
17529B32422J2811J0717M292N040J0356L087n120L414K683J089L577J465Q502
17516B94335M920R058J1385N805J2790J9339J2434J8544J4946J1253J0908J3199
17504D38916J8584J5306J2538J8233K0906K0426K4450K5909K8043L0542L1119
17493F84972M0658M1775M0860M2651N0641N5802N2627N3209N2746M6332N2452
17482A214725O1395N5425N3321N3266N3999N3920N7383O2530O7347O6337O9702
$$ plain form
17569 475293 446778 423624 394291 357030 327714 311014 293003 274273 258036 244595 234818 223308
17557 223308 212128 204044 202025 198244 192901 191267 190224 186294 184260 189377 194526 190452 192950 194042
17543 194042 199758 198182 199872 200252 192717 194346 197101 201366 212629 216018 220001 221483 225467 232422
17529 232422 245233 255950 260242 265282 275638 278725 273605 277019 279702 280791 284368 285833 294335
17516 294335 299255 308313 319698 325503 338293 357632 370066 388610 403556 414809 425717 438916
17504 438916 457500 472806 485344 503577 524483 544909 569359 595268 623311 653853 684972
17493 684972 725630 767405 808265 850916 901557 957359 1009986 1063195 1115941 1162273 1214725
17482 1214725 1276120 1331545 1384866 1438132 1492131 1546051 1603434 1665964 1733311 1799648 1869350
17471A869350O8397P2158Q5815R7506J00402J01239J10432J31549J53717J78386
17461B968951K02120K40317K79255L22936L93385M78880N80914P17137R04899
17452G088794J162575J517389K001499K630027L330202L912497M205382M298050
17444C0146415M487520M902224N157117M746246L748868K571669J592478R08823
17436E8261360L29639l20726j389895k732589l834138m386443m477052m545265
17428C6904891m654280m608453m350551l917058l380471k810301k251314j755906
17420I176557j371607j084122q67111o92928n63359m67433l86201l17115k66747
17411C159934k21604j87306j63604j30590j09955j01839r5338r6991q6515q2443
$$ plain form
17471 1869350 1937747 2009905 2095720 2193226 2293628 2394867 2505299 2636848 2790565 2968951
17461 2968951 3171071 3411388 3690643 4013579 4406964 4885844 5466758 6183895 7088794
17452 7088794 8251369 9768758 11770257 14400284 17730486 21642983 25848365 30146415
17444 30146415 34633935 39536159 44693276 49439522 53188390 55760059 57352537 58261360
17436 58261360 58590999 58270273 56880378 54147789 50313651 45927208 41450156 36904891
17428 36904891 32250611 27642158 23291607 19374549 15994078 13183777 10932463 9176557
17420 9176557 7804950 6720828 5853717 5160789 4597430 4129997 3743796 3426681 3159934
17411 3159934 2938330 2751024 2587420 2456830 2346875 2245036 2149698 2052707 1966192 1883749
17401A883749q1175p3715p2297o7362o9430o9023o0175n1651m2264m5082l5848
17390A215727m6076m7539m1873l3466k9556m1230m8273n2441m8464m3914l7624
17379G45271m6329n2033m3651l4266l7760l5560k9292j8920j9874j3470q461r121
17367C96534q496o235j2764j8097n942k94n81q377n675j3787r222q399r673j2092
17353B76900k986l051j1401j5125j0635o914m17q92n213q669p503q229k174l245
17339A90446q124M76k497j396K808r98J317n238m281K308j691J44N148n357o278
17324A66787l033J725N42P21q846p945K331J388K153k002P265K662o448K986n489
17309A54797R31K317J335K688p330p549m511o41K177k69l983l835m028M79j46
$$ plain form
17401 1883749 1802574 1728859 1656562 1589200 1519770 1450747 1390572 1338921 1296657 1251575 1215727
17390 1215727 1169651 1122112 1080239 1046773 1017217 975987 927714 875273 826809 782895 745271
17379 745271 698942 646909 603258 568992 531232 495672 466380 447460 427586 414116 405655 396534
17367 396534 388038 381803 369039 350942 345000 344706 344125 335748 330073 316286 307064 298665 288992 276900
17353 276900 273914 270863 259462 244337 233702 226788 226371 225479 220266 211597 204094 195865 193691 190446
17339 190446 182322 182798 180301 178905 181713 180715 182032 176794 172513 174821 173130 173274 178422 173065 166787
17324 166787 163754 165479 166021 166742 157896 149951 152282 153670 155823 153821 161086 163748 157300 160286 154797
17309 154797 155728 158045 159380 162068 154738 147189 142678 142037 144214 143945 139962 136127 132099 132578 132432
17294A32432L613J0315P316O227L844O790J6594J9281K5978L7258N3304N6476
17282C79428N2820O7584O7842P2647O9913O9174N0822J6146j8333l9053m3763
17271G45227n0881o5426p9272q1477p2284o5522n3062m2438l4714l2983k1942
17260A45226j1294l356j2588p315o369m368m607J85R18L062r768m651q19J554
17246H5810M35j885Q36n125l365J481K851O330k483n44j711n380n954O526N668
17231H3490L439M621L029j902r599L199R047K82q97k634k342J824J600k33K902
17216I5826Q58J319l146J823L308N348O926Q986J8875L0735L3715L4548L7265
17203B76386L8056M2683M1319M5149L5367L3067K4955J2697J3249O744k604j2760
$$ plain form
17294 132432 136045 146360 153676 159903 163747 170537 187131 206412 232390 269648 322952 379428
17282 379428 432248 499832 567674 640321 710234 779408 830230 846376 828043 788990 745227
17271 745227 694346 628920 549648 468171 395887 330365 277303 234865 200151 167168 145226
17260 145226 133932 130576 117988 110673 104304 99936 95329 95514 96432 99494 89726 85075 84256 85810
17246 85810 86245 84360 85196 80071 76706 78187 81038 87368 84885 84341 82630 77250 71296 77822 83490
17231 83490 86929 91550 94579 92677 83078 86277 95324 95606 94709 92075 89733 91557 93157 92924 95826
17216 95826 96684 98003 94857 96680 99988 105336 112262 121248 140123 170858 204573 239121 276386
17203 276386 314442 357125 398444 443593 478960 512027 536982 549679 562928 569672 567068 554308
17191E54308j0588j9838k6031l7371l8157l8177l6231m1033m2833l8167l9143
17180A86739l2347k0498k4177j7420j4740j1237n351L249Q64l445n590k141N951
17167E9857l713o842o48o951l244q97J477M565l027l816q3n540k830l416p8Q252
17151C3066J139j660K139p813m037K310J532J561J248k740M38m724R33j050R99
17136B3341m500l034Q994M058l636J893L215m265L467K489m823n661K042l685
17122A9895n907n491j523J142M023j106q029K648M505k116k322q59J64m841m874
17107d691o284n038J751K831K244K915L207R179J607L25j387L144O909K107K380
17092B1199m703k390J083k645m334j32P960l37O582J425q724k907n257p72K380
$$ plain form
17191 554308 543720 523882 497851 460480 422323 384146 347915 306882 264049 225882 186739
17180 186739 154392 133894 109717 92297 77557 66320 60969 64218 65082 61637 56047 53906 59857
17167 59857 56144 49302 48654 41703 38459 37562 39039 43604 40577 36761 36678 31138 28308 24892 24814 33066
17151 33066 34205 32545 34684 26871 22834 25144 26676 28237 29485 26745 27183 22459 23392 22342 23341
17136 23341 18841 15807 24801 28859 25223 27116 30331 26066 29533 32022 27199 21538 23580 19895
17122 19895 13988 8497 6974 8116 12139 11033 3004 5652 10157 8041 5719 4860 5024 183 -4691
17107 -4691 -10975 -16013 -14262 -11431 -9187 -6272 -3065 6114 7721 8046 6659 9803 16712 18819 21199
17092 21199 16496 14106 15189 12544 8210 8078 16038 15701 22283 23708 14984 12077 6820 6048 8428
17077H428P15Q951k828p42L489J169N39J325k991N258N805Pp824r017J482o310
17061G456O85N680K242n594J277J091r07j958r072o32N01J920P005K981j0696
17046A979r182k137O651j587L475L650L174J754M48P4m197J72J978k677j354m89
17030A732J78l540j002q92M402j243p315N949O535K84k589m221q60k286k112M716
17014b264L952n214l477M115m225o553k093K735P872M800J783K037m441o536p982
16999a5491O351O987O629L052J522k903J182K399m676r316l585L101P346J0318
16985A2916r70m61k373L4M600m246l99k815L036p990m292P56K77J155J934K276
16969C438K673M730j583m303l919j898N015L327j758q712m746K981R871k283k040
$$ plain form
17077 8428 9143 18094 15266 14524 18013 19182 19721 21046 18055 23313 29118 29125 21301 12284 13766 7456
17061 7456 8141 13821 16063 10469 11746 12837 11930 9972 900 268 769 2689 9694 12675 1979
17046 1979 -7203 -9340 -2689 -4276 -801 2849 6023 7777 8225 8299 4102 4274 6252 3575 2221 1732
17030 1732 1910 -1630 -2632 -3524 878 -365 -7680 -1731 4804 5088 2499 -1722 -2582 -4868 -6980 -2264
17014 -2264 1688 -3526 -7003 -2888 -7113 -13666 -15759 -13024 -5152 -352 1431 3468 -973 -7509 -15491
16999 -15491 -9140 -2153 4476 7528 9050 6147 7329 9728 5052 -4264 -7849 -4748 2598 12916
16985 12916 11946 11485 9112 9146 13746 9500 9101 6286 9322 1332 -2960 -2204 -1927 -772 1162 3438
16969 3438 6111 10841 9258 4955 1036 -862 4153 7480 5722 -2990 -7736 -4755 5116 2833 793
16954G93M746j267p20j541q057J240K797K074K964J650K693o532r454O817L433
16939A636k402m238M895O563q70K932K750o274j1004o62K324L27j493j438J725
16924e229P23J508o588k026Q90J890K341L319jk216K988J0058r19K308p77o109
16908B160N66l083k598K804L590L496l416J484l743k677k700q32m025K615N265
16893a094j994j080L053Q89j647j099K012L636l919M869K408K925Q24m118k241
16878C424O55K414Q89n45J327m119l994n793o08R707R351o260m029j889L459O920
16862A0909O083n34O592J75L955M952O56J2403R212J5557K6158L0395K3108K0366
16848A69987K7311K7438K9338K7494J9985O601m723N221P278Q471r700k6853j8852
$$ plain form
16954 793 5539 4272 3552 2011 -6046 -4806 -2009 65 3029 4679 7372 840 -8614 -1797 1636
16939 1636 -766 -5004 -109 6454 5584 8516 11266 4992 -6012 -6674 -4350 -4023 -5516 -6954 -5229
16924 -5229 -4506 -2998 -9586 -11612 -10722 -8832 -6491 -3172 -3173 -5389 -2401 7657 6738 9046 8269 2160
16908 2160 2726 -357 -2955 -151 3439 6935 3519 5003 1260 -1417 -4117 -4949 -8974 -6359 -1094
16893 -1094 -3088 -4168 -1115 -226 -1873 -2972 -960 2676 -1243 3626 6034 8959 9783 5665 3424
16878 3424 4079 6493 7382 6837 8164 4045 51 -5742 -6350 3357 12708 6448 2419 530 3989 10909
16862 10909 16992 16458 23050 23225 27180 32132 32788 45191 54403 69960 96118 126513 149621 169987
16848 169987 197298 224736 254074 281568 301553 308154 303431 308652 315930 324401 314701 287848 268996
16835B68996k2676k7710k6095l0888k5327j7329k5752j9412n081k778j2956p570
16823D5422L32r54m548l725n598o365l571m904m889k329M917L42k23P364J181
16808B2452j912l274n096o874j826J81j297m213L583N617P06l143m814J431M564
16793F085j592J443N36q550j8204j549P559J1238K225l786j142k523m364L176
16779i448K808K119o98J378L107J093j843q682l882J621N424N760k599j636M080
16764a398N716k25n371j924l963j621J806O113m165M472L804K714j0158j5289
16750a9489q01J5815N511p366n605p042n239O769Q044N909M101L229N326q21j2387
16735d046p035M022m452K411Q393K60M32L037M63m26K74O84m290j069L00l025
$$ plain form
16835 268996 246320 218610 192515 161627 136300 118971 93219 73807 68726 65948 52992 45422
16823 45422 45754 44800 40252 36527 30929 24564 20993 16089 11200 8871 13788 14130 13907 21271 22452
16808 22452 20540 17266 12170 5296 3470 3651 2354 -1859 1724 7341 8047 4904 90 1521 6085
16793 6085 4493 5936 6472 -2078 -20282 -21831 -14272 -3034 -809 -4595 -5737 -8260 -12624 -9448
16779 -9448 -6640 -4521 -5219 -3841 -734 359 -1484 -10166 -14048 -12427 -7003 -1243 -3842 -5478 -1398
16764 -1398 4318 4093 -1278 -3202 -7165 -8786 -6980 -867 -5032 -560 3244 5958 -4200 -19489
16750 -19489 -20290 -4475 1036 -6330 -11935 -18977 -24216 -17447 -9403 -3494 607 3836 9162 8341 -4046
16735 -4046 -11081 -7059 -11511 -9100 -707 -447 -15 3022 3485 3059 3333 4017 -273 -1342 -1042 -4067
16719d067j856K15j943J573k487L456J049m49K621R059L617o207j3231j0694L29
16704a9015J1111O219j084j873j93j504l975N548l532k718M287L474k056n992
16690a1303K996R731M552o364k880o838M958M00M601J519k613j085K140m073m035
16675h294J21M07M47j037k629K494K385Q776l286n444l326J525L844j936J49m004
16659i808o38p11q82l218k698L872Q592L011N376m390o779o91L504j317j689Q273
16643a93N94j896o080k755R584k691n050J435O198K429O328k014j0291q422j064
16628a3888L153N840k4L702J085J267k315J31k315m691K13J345J094Q207j73l346
16612g15J830m98k312m171k091L380N865L466J528k254p398K624N190j263o211
$$ plain form
16719 -4067 -5923 -5708 -7651 -6078 -8565 -5109 -4060 -4509 -1888 7171 10788 4581 -8650 -19344 -19015
16704 -19015 -7904 -1685 -2769 -4642 -4835 -6339 -10314 -4766 -8298 -11016 -6729 -3255 -5311 -11303
16690 -11303 -8307 1424 5976 -388 -3268 -10106 -5148 -4748 -147 1372 -1241 -2326 -186 -4259 -8294
16675 -8294 -8173 -7766 -7319 -8356 -10985 -8491 -6106 2670 -616 -6060 -9386 -7861 -4017 -5953 -5804 -9808
16659 -9808 -10446 -11157 -12039 -15257 -17955 -14083 -5491 -2480 2896 -1494 -8273 -8964 -5460 -6777 -8466 -193
16643 -193 401 -1495 -7575 -10330 -746 -3437 -8487 -7052 -854 1575 7903 5889 -4402 -12824 -13888
16628 -13888 -10735 -4895 -4919 -1217 -132 1135 -1180 -1049 -3364 -8055 -7842 -6497 -5403 2804 2631 -715
16612 -715 1115 617 -1695 -5866 -7957 -4577 1288 4754 6282 4028 -3370 -746 4444 3181 -3030
16597c030m551j113J666j731n072Q17K809O65k494J662j542j968K032L401p172
16582a5621L809Q359K545J858m539n130j296j913Q59p25M090K139J770o122J83
16567i734J913k354p04P85M42o30k353p21J389K463j433J150m35M324L879R81
16551a038J851o395k528K310l448K683Q955q32q075m951J186k221r600q02J1192
16536a1713L932M027N317n899j0050K645L458J728m817N384k306M551K697O37
16522d09k639m794o41j138J210k930L552P08k62J621K428m96o73p248M146P768
16506B03k117p889l564J519j558J953N35j549J392N491K479J935J821k268m193
16491e810j48J999O931L07o823p013L300K556m835q81p9K227J067j482n097J420
$$ plain form
16597 -3030 -7581 -8694 -7028 -8759 -13831 -13014 -10205 -9540 -12034 -10372 -11914 -13882 -11850 -8449 -15621
16582 -15621 -11812 -3453 -908 950 -3589 -8719 -10015 -11928 -11069 -11794 -7704 -5565 -3795 -9917 -9734
16567 -9734 -7821 -10175 -10879 -10094 -9652 -10282 -12635 -13356 -11967 -9504 -10937 -9787 -10222 -5898 -2019 -1038
16551 -1038 813 -5582 -8110 -5800 -9248 -6565 2390 1558 -6517 -11468 -10282 -12503 -22103 -22905 -11713
16536 -11713 -7781 -3754 1563 -4336 -14386 -11741 -8283 -6555 -11372 -5988 -8294 -3743 -1046 -409
16522 -409 -3048 -7842 -8483 -9621 -8411 -11341 -7789 -7081 -7343 -5722 -3294 -3790 -4463 -11711 -7565 203
16506 203 -1914 -9803 -13367 -11848 -13406 -11453 -10918 -12467 -11075 -5584 -3105 -1170 651 -1617 -5810
16491 -5810 -5958 -3959 2972 3279 -3544 -10557 -7257 -4701 -9536 -10417 -10496 -8269 -7202 -8684 -13781 -12361
16475a2361Q804K665N741K523J222k735m277m459k697n544m673K340O179J151
16461f121m552p45K69L013L370k623l453J386n517k84k296K75K698K815q47l943
16445a6555L433K797N882L325j050l005P56l268m4L446o802q949N33J1807L798
16430c896l106m864N861K590M638R66m203q38k35k060K355q205l802N415K503
16415f881Q18p726k680N382P030k448j123O348l049J824L632m067n476o77J527
16400g566J496l172m168Q215L012J546k16k862k000j770N850O079j636p212l781
16385h185l927n705J424P287O703l512K731j513l173J003J96O745l60m190o935
16370a1411q54M495r60O74J292Q170j533o784K449K012n119K509N448j836M651
$$ plain form
16475 -12361 -3557 -892 4849 7372 8594 5859 1582 -2877 -5574 -11118 -15791 -13451 -7272 -6121
16461 -6121 -10673 -11418 -11149 -8136 -4766 -7389 -10842 -9456 -14973 -15257 -17553 -17278 -14580 -11765 -12612 -16555
16445 -16555 -13122 -10325 -4443 -1118 -2168 -5173 -4417 -7685 -7729 -4283 -11085 -20034 -19501 -7694 -3896
16430 -3896 -7002 -11866 -6005 -3415 1223 2189 -2014 -2852 -3087 -5147 -2792 -10997 -14799 -9384 -6881
16415 -6881 -6063 -13789 -16469 -11087 -4057 -6505 -7628 -1280 -4329 -2505 1127 -2940 -8416 -9093 -7566
16400 -7566 -6070 -9242 -13410 -5195 -2183 -637 -853 -3715 -5715 -7485 -1635 4444 2808 -4404 -8185
16385 -8185 -12112 -17817 -16393 -9106 -2403 -5915 -3184 -4697 -7870 -6867 -6671 74 -286 -4476 -11411
16370 -11411 -12265 -7770 -8730 -8056 -6764 1406 -127 -6911 -4462 -2450 -7569 -5060 388 -1448 3203
16355C203J777N2o909m928M87M401M10K843K288m20m802m105k100K001N578N771
16339E547o99j1439q131M609M899K133k490n446M482k304M895R554r21l707n405
16324d423j595L162l40O399J76o240k784K670P272O95j0327q987O600O253J808
16309C39J426K898o824j2625K395K391M355k708L347J645k804l978O678Q310N906
16294A0751k494l167l482k1K731r79r725j448k081m421l228O505M300k633n255
16279a4647L844j235K120k233L313K258Q34k031r70M349K094J388k495k182L800
16264a793K181m104j0978l959N445k854M765P272Q260nm891j335r750n741J424
16249a6063m19J360O481j527O735P894j495j980m633j0085l704M673O772M595
$$ plain form
16355 3203 4980 5032 -1877 -6805 -6318 -1917 -1507 1336 3624 3204 -1598 -5703 -7803 -5802 -224 5547
16339 5547 4848 -6591 -14722 -10113 -5214 -3081 -5571 -11017 -6535 -8839 -3944 5610 4689 982 -4423
16324 -4423 -6018 -2856 -3196 3203 3379 -2861 -5645 -2975 4297 4992 -5335 -14322 -7722 -1469 339
16309 339 1765 4663 -2161 -14786 -12391 -10000 -5645 -8353 -5006 -3361 -6165 -10143 -3465 4845 10751
16294 10751 8257 5090 1608 1587 4318 3339 -6386 -7834 -9915 -14336 -17564 -11059 -6759 -9392 -14647
16279 -14647 -10803 -12038 -9918 -12151 -8838 -6580 -5746 -7777 -8747 -4398 -2304 -916 -3411 -5593 -1793
16264 -1793 388 -3716 -14694 -18653 -13208 -16062 -11297 -4025 4235 4230 -661 -1996 -11746 -17487 -16063
16249 -16063 -16482 -15122 -8641 -10168 -3433 4461 2966 986 -3647 -13732 -17436 -12763 -5991 -1396
16235a396J440J4q10j666p033l618L069M064m665k876O351o15L17l225k500m13
16219a3562N632l341m641O543R326l924l543r70m515m146L902L561N790K598K641
16204A351p93o559k493K976K853J552m753j547J332m343m03P475p57k440j074
16189g623L271J1500l293p586j62K19N294p32N43P889l703j6482j536m377R4L213
16173a3471k915o23L590P496k384L512j050J019j568K38J331K428j329K462n371
16158f635m561N068K468O915O42j162J160L198l845o145k392L502k213p317m172
16143a5489L318J0321M482j574o671N07N414J581n113j253J61J687K405l141n11
16128c876J103M890J581j745R71j295l967Q38j940L078K282k35J496l750N00O46
$$ plain form
16235 -1396 44 58 -752 -2418 -9451 -13069 -10000 -5936 -10601 -13477 -7126 -7741 -7424 -10649 -13149 -13562
16219 -13562 -7930 -11271 -15912 -9369 -43 -3967 -7510 -8480 -12995 -17141 -13239 -9678 -3888 -1290 1351
16204 1351 558 -6001 -8494 -5518 -2665 -1113 -5866 -7413 -6081 -10424 -10827 -3352 -4109 -6549 -7623
16189 -7623 -4352 7148 3855 -3731 -3893 -3674 1620 888 1431 9320 5617 -10865 -12401 -16778 -16684 -13471
16173 -13471 -16386 -17009 -13419 -5923 -8307 -4795 -5845 -4826 -6394 -6156 -4825 -2397 -3726 -1264 -6635
16158 -6635 -11196 -6128 -3660 3255 3897 2735 3895 7093 3248 -2897 -5289 -1787 -4000 -11317 -15489
16143 -15489 -12171 -1850 2632 1058 -5613 -5106 308 1889 -3224 -4477 -4316 -2629 -224 -3365 -3876
16128 -3876 -2773 2117 3698 1953 2924 1629 -2338 -1500 -3440 -362 1920 1685 3181 -569 -69 577
16112E77n570m951o952q25J104m539K945P030Q386K221K168j070m799q035j77
16097a2487J031M222k313j32L810l535q64L71L428k28l5P274M21m750j550K243
16081c094O48J724P919n118N37l385k565k074l548o514p05J645M132M232l3R30
16065e269l16p969l467M766J809R90r78N04l599M686K796J86o151p468M41L466
16049a5573J09l095m574J348N373M479R73r82k064q22L436k760J881J1347J343
16034D19n885K806l990n640M769m20k078L494j043q498j248k96M008M276j913
16019a1239m76J319Q481q18j393m99k558K25K736Q299J316K587n246m964l323
16004e553j347j591M22J428pJ22M131k419j591r63k358o450J763K333K453k321
$$ plain form
16112 577 -4993 -9944 -16896 -17721 -16617 -21156 -18211 -11181 -2795 -574 1594 524 -4275 -12310 -12487
16097 -12487 -11456 -7234 -9547 -9679 -5869 -9404 -10268 -9897 -6469 -6697 -6732 542 963 -3787 -5337 -3094
16081 -3094 -2446 -722 7197 2079 2616 -769 -3334 -5408 -8956 -15470 -16175 -14530 -10398 -6166 -6199 -5269
16065 -5269 -5585 -13554 -17021 -12255 -10446 -9456 -10434 -9930 -13529 -8843 -6047 -5861 -12012 -19480 -19039 -15573
16049 -15573 -15464 -18559 -23133 -21785 -16412 -11933 -10960 -11942 -14006 -14828 -11392 -14152 -12271 -924 419
16034 419 -5466 -2660 -6650 -12290 -7521 -7941 -10019 -6525 -7568 -16066 -17314 -17610 -13602 -9326 -11239
16019 -11239 -11715 -10396 -1915 -2733 -4126 -4625 -7183 -6958 -4222 4077 5393 7980 2734 -2230 -5553
16004 -5553 -6900 -8491 -8069 -6641 -6648 -6526 -2395 -4814 -6405 -7368 -9726 -16176 -14413 -12080 -9627 -11948
15988a1948r50o99P007J046m417L0n80m270j689J382l17k936Q124R403O773m780
15972A179r875M239O690R99k930l090R71J036l087L692L530q669m807o056o428
15957b2606L169q29K583L838N563K394L246p265k347J42n21P05L945L749j175
15942e409K581M427J89M402k013j0832k947O135M311K63l856o28K915n297O19
15927e140j077k208k130P17j755K493n98K442J010J642j852j453J69N99o132l583
15911a6856n360M283N357Q283j817N66K828m182j754O968k45J679J027p492K872
15896c843o03n268N053N668n198o432J107L706N838n202L391l481k118n275J563
15881a1094N792m670p584p92N017J073M264J506o422n195k422M126P09J329k326
$$ plain form
15988 -11948 -12898 -13597 -6590 -5544 -9961 -9931 -10511 -14781 -16470 -15088 -15405 -18341 -10217 -814 5959 1179
15972 1179 -8696 -4457 2233 3232 302 -2788 -1817 -781 -3868 -176 3354 -5315 -10122 -16178 -22606
15957 -22606 -19437 -20266 -17683 -13845 -8282 -5888 -2642 -9907 -12254 -12112 -12633 -11928 -7983 -4234 -5409
15942 -5409 -2828 1599 1788 6190 4177 -6655 -9602 -3467 844 1107 -2749 -3377 -462 -5759 -5140
15927 -5140 -6217 -8425 -10555 -9838 -11593 -9100 -9698 -7256 -6246 -4604 -6456 -7909 -7740 -7141 -13273 -16856
15911 -16856 -22216 -17933 -12576 -4293 -6110 -5544 -2716 -6898 -8652 -1684 -1929 -250 777 -6715 -3843
15896 -3843 -4446 -9714 -4661 1007 -4191 -10623 -9516 -5810 28 -5174 -1783 -5264 -7382 -12657 -11094
15881 -11094 -5302 -9972 -17556 -18348 -13331 -12258 -7994 -6488 -12910 -18105 -20527 -16401 -15692 -14363 -16689
15866a6689O943N99l444J274O843M940N30M40l953q125o983M801P522J377K858
15851a067K935j1554m803j723j933J1076O037k491o954n508k589l180J2385J4202
15837D833M270p464j0559J814N253j850k872l875k535l949J951O597Q14j354k587
15822a1513L560J221l221K245M869k013m90k47J304N564N969J642n499k253m052
15807b914m052M299K024M307k398n621p807O160p76K944M351l217m290k75O088
15792a177j554J327j943j263l091N141J983K928M432J166n292m749Q95n43k61
15777b001j900k562J730P651Q01m359N47n57p310l085L219J879l441Q831l282
15762c839j0667k616L079N250N92L690J971k008K320o16J587k53l740L434n521
$$ plain form
15866 -16689 -9746 -9147 -12591 -11317 -4474 466 996 1436 -2517 -10642 -17625 -12824 -5302 -3925 -1067
15851 -1067 1868 -9686 -14489 -16212 -18145 -7069 -1032 -3523 -10477 -15985 -18574 -21754 -9369 4833
15837 4833 9103 1639 -8920 -7106 -1853 -3703 -6575 -10450 -12985 -16934 -14983 -8386 -7572 -8926 -11513
15822 -11513 -7953 -6732 -9953 -7708 -2839 -4852 -5342 -5589 -4285 1279 7248 8890 3391 1138 -2914
15807 -2914 -6966 -2667 -643 3664 1266 -4355 -12162 -6002 -6778 -3834 517 -2700 -6990 -7265 -1177
15792 -1177 -2731 -1404 -3347 -4610 -7701 -2560 -577 2351 6783 7949 2657 -2092 -1197 -1740 -2001
15777 -2001 -3901 -6463 -4733 2918 3719 -640 -93 -650 -7960 -11045 -7826 -5947 -9388 -557 -3839
15762 -3839 -14506 -17122 -14043 -8793 -8201 -4511 -2540 -4548 -2228 -2844 -1257 -1510 -5250 -1816 -7337
15747g337n049M92M331K554k405l417M62J451L787K537m221l566J259k19K024
15732g317j942n44J676j851j648m336K956K46L284k149p38Q54O114O096N228L653
15716I582p739p289o732J040N702p06j940J156L07K443j495J062K248p307l690
15701a3358N8K48r22L076j340n590o202M237N010r2L033P200O159J322l114l499
15685c774P318n84n085n681k757n503K272n53J808M048Q279M589L657L78n381
15670C031j0354r146O118L418j787o474m282P957J93l401J423K64k59o34J705
15655a2228p68j339l617O237P334R87L94K425k302L531M679k72o654j1666j92
15640a3451M179Q19l076m1j726k44J595O395M711l286J136L008l114l33j872L55
$$ plain form
15747 -7337 -12386 -11894 -7563 -5009 -7414 -10831 -10369 -8918 -5131 -2594 -6815 -10381 -9122 -9341 -7317
15732 -7317 -9259 -9803 -8127 -9978 -11626 -15962 -13006 -12760 -9476 -11625 -12363 -11509 -5395 701 5929 9582
15716 9582 1843 -5446 -12178 -11138 -5436 -6142 -8082 -6926 -6619 -4176 -5671 -4609 -2361 -9668 -13358
15701 -13358 -13300 -13052 -13974 -10898 -12238 -17828 -24030 -19793 -14783 -14875 -11842 -4642 1517 2839 -275 -3774
15685 -3774 3544 2960 -2125 -7806 -10563 -16066 -13794 -14347 -12539 -8491 -212 4377 8034 8412 3031
15670 3031 -7323 -16469 -10351 -6933 -8720 -15194 -19476 -11519 -11326 -14727 -13304 -13040 -13299 -13933 -12228
15655 -12228 -12996 -14335 -17952 -11715 -4381 -3394 -3000 -575 -2877 654 5333 5061 -1593 -13259 -13451
15640 -13451 -9272 -8453 -11529 -11570 -13296 -13540 -11945 -5550 -839 -4125 -2989 19 -3095 -3428 -5300 -4945
15624d945k235N27K564m200k561Q04k860k198j740L208j03P347L31J940j784m822
15608a0727P18l243j502N212m993K220K443n559l812j482Q56K57R831o47k870
15593a3298k741L137K420P551p256p983M177O489K770L151N203p447n279k492
15579a1598M131k448j948n330j473M048J544J71O222L889j325m784q093M88L655
15564a2851o131M179N958Q695L670m249n605l730l283j908K623P286L688N40L331
15549B213L028J133m385l389l926M062L181l312k957L285l70P82L409J730J846
15534F330J9l236l734j778k219m228n606J722O726M488o812K88k616m305l06L291
15518a1976L920j696L017K319j915q67l441k538j701n707R139O383L333O81n6
$$ plain form
15624 -4945 -7180 -6653 -4089 -8289 -10850 -10046 -12906 -15104 -16844 -13636 -13739 -6392 -6061 -4121 -5905 -10727
15608 -10727 -10009 -13252 -14754 -9542 -14535 -12315 -9872 -15431 -19243 -20725 -19869 -19612 -9781 -10428 -13298
15593 -13298 -16039 -12902 -10482 -2931 -10187 -18170 -13993 -7504 -4734 -1583 3620 -3827 -9106 -11598
15579 -11598 -7467 -9915 -11863 -17193 -18666 -14618 -13074 -12903 -6681 -2792 -4117 -8901 -16994 -16506 -12851
15564 -12851 -18982 -14803 -8845 -150 3520 -729 -6334 -10064 -13347 -15255 -12632 -5346 -1658 -1118 2213
15549 2213 5241 6374 1989 -1400 -5326 -1264 1917 -1395 -4352 -1067 -1437 -655 2754 4484 6330
15534 6330 6349 3113 -621 -2399 -4618 -8846 -14452 -12730 -6004 -1516 -8328 -8040 -10656 -14961 -15267 -11976
15518 -11976 -8056 -9752 -6735 -4416 -6331 -7198 -10639 -13177 -14878 -20585 -11446 -5063 -1730 -1049 -1105
15503a105K635P189l163l927l650M65M117n769o739m327J0604N077k124n849l828
15488a0394M359J610m132K195K308J219J411K875p684k814P457M395M47n041J303
15473d86j568m702r08m47K0k2J954J069j249l991j967l192K026J042K700O737
15457b984p508M872O886m166m560q26K026N345p33m922q361l967Q50Q36P508k975
15441a2679M894m12J299k462k265J407L816L839L025L55n913Q24j714p111J345
15426a1752M153K480o39l15m87J388j510J092l797r49L333K827L173j893j476
15411d372K962M622j159L251q82q021n320K020k590l403l632M075L930j92m484
15396a3195N456m636m74L034N731O173o59O534K598j909j769k891m661o046m378
$$ plain form
15503 -1105 1530 8719 5556 1629 -2021 -1556 2561 -3208 -9947 -14274 -3670 1407 -717 -6566 -10394
15488 -10394 -6035 -4425 -8557 -6362 -4054 -2835 -1424 1451 -6233 -9047 -1590 2805 3252 -1789 -486
15473 -486 -2054 -6756 -7664 -8111 -8091 -8113 -6159 -5090 -6339 -10330 -12297 -15489 -13463 -12421 -9721 -2984
15457 -2984 -10492 -5620 1266 -2900 -7460 -8286 -6260 -915 -1648 -6570 -14931 -18898 -18048 -17212 -9704 -12679
15441 -12679 -7785 -8197 -6898 -9360 -11625 -10218 -6402 -2563 462 817 -5096 -4272 -5986 -13097 -11752
15426 -11752 -7599 -5119 -5758 -6073 -6560 -5172 -6682 -5590 -9387 -10336 -7003 -4176 -1003 -2896 -4372
15411 -4372 -1410 3212 2053 5304 4422 -3599 -8919 -6899 -9489 -12892 -16524 -12449 -8519 -8711 -13195
15396 -13195 -7739 -12375 -12849 -9815 -4084 2089 1430 7964 10562 8653 6884 3993 -668 -6714 -11092
15381a1092j469Q969N803K558l33k853n67o212j229k089J577J004o419k525o54
15366a5531J504K877L493o196J538L022j163J1279L404j791M39J81k145o198o725
15351a2012L861K939J06k682k149N243P69l7j286k97j783k288j888J2214M882
15336E592k411r022m699O777N728k196q904k220k696K038l30o562M417N839l333
15321a1982k212k003l695K140L909l958L951M590m480l550j076l99l491J255P476
15306a3525L056k273q43M500N590o179n629J281M638O118L257n360j2420Q06M800
15291a2183p29J632L85N568n39l109J696j54L925J473K466m920p128K995O19l276
15275a1279j297m18J005l46N290L616j775m176M732k92k100m060m792O885M831
$$ plain form
15381 -11092 -12561 -3592 2211 4769 4436 1583 1016 -5196 -6425 -8514 -6937 -5933 -12352 -14877 -15531
15366 -15531 -14027 -11150 -7657 -13853 -12315 -9293 -10456 823 4227 2436 2875 3056 911 -5287 -12012
15351 -12012 -8151 -5212 -5106 -7788 -9937 -4694 -3925 -3962 -5248 -5545 -7328 -9616 -11504 710 5592
15336 5592 3181 -5841 -10540 -3763 1965 -231 -9135 -11355 -14051 -12013 -12343 -18905 -14488 -8649 -11982
15321 -11982 -14194 -16197 -19892 -17752 -13843 -17801 -13850 -9260 -13740 -17290 -18366 -18765 -22256 -21001 -13525
15306 -13525 -10469 -12742 -13585 -9085 -3495 -9674 -15303 -14022 -9384 -3266 -9 -5369 -17789 -16983 -12183
15291 -12183 -12912 -11280 -10895 -5327 -5866 -8975 -7279 -7433 -3508 -2035 431 -4489 -11617 -8622 -8003 -11279
15275 -11279 -12576 -12994 -11989 -12335 -7045 -3429 -5204 -9380 -4648 -4940 -7040 -11100 -15892 -9007 -4176
15260d176J73P383J755j547k791k634K350p950n763n6M547N845L95k79R397O834
15244A3483p197k125n219p956l104j336O205L911O175k757l955m075J599K57k921
15229i015R03k142J1N34K50J335J072M859J749M006k044m980k275l550k135L81
15213a1041K429M08K320L97n91M048k744n369K828k409K277N644J794l971p398
15198a1378m667R7r38k700Q314J220j474K316p1p213p88P508J0359j364n447j885
15182h111J402J308j992M350J427q164q362l25R00j132M646J840K682K709J794
15167e028M969L561j321m42j276l578k705M4k27L935o627m090q04J782J233n33
15151a1107L876k995K992R449n105n574K413j727j940J374p80j525Q806j757o390
$$ plain form
15260 -4176 -4003 3380 5135 3588 797 -1837 513 -7437 -13200 -13256 -8709 -2864 -2469 -2748 6649 13483
15244 13483 6286 4161 -1058 -9014 -12118 -13454 -7249 -3338 2837 80 -3875 -7950 -6351 -6094 -9015
15229 -9015 -8112 -10254 -10243 -9709 -9459 -8124 -7052 -2193 -444 3562 1518 -3462 -5737 -9287 -11422 -11041
15213 -11041 -8612 -8204 -5884 -5487 -6078 -2030 -4774 -10143 -7315 -9724 -7447 -1803 -9 -3980 -11378
15198 -11378 -16045 -15948 -16886 -19586 -11272 -10052 -11526 -9210 -9281 -16494 -17282 -9774 585 -779 -6226 -8111
15182 -8111 -6709 -5401 -7393 -3043 -1616 -9780 -18142 -18467 -17567 -18699 -14053 -12213 -9531 -6822 -5028
15167 -5028 -59 3502 2181 1739 463 -3115 -5820 -5776 -6003 -2068 -8695 -12785 -13589 -11807 -10574 -11107
15151 -11107 -7231 -10226 -7234 2215 -2890 -8464 -6051 -7778 -9718 -8344 -9124 -10649 -1843 -3600 -9990
15136i990o40J875O883M816j244o576n475l290rJ295k250L348j278M690O596M113
15120B864o043j429N304L839n772L648O141L50n681L248o840k007L910M559J378
15105G469q507l119N558m554o127N587k354K187k689q56k22j636k005J32J533
15090i603L985L421n110k003m865O30O246k773j580o57k77K34J887K580N715p74
15074b944o227o20O719m064n671J470L914K469J081k570J728n769m098O623M362
15059c597J45K069O58P294J07k543l8o229m787j887R802O516r82l731j243P91
15043B345p694O348M112n178m016l462j302m678K674Q171J93K643q81J622j67
15028G30M21L128P55k325n287J911N095K597n231r28K814k518o702m139K597L894
$$ plain form
15136 -9990 -10630 -8755 -1872 2944 1700 -4876 -10351 -13641 -13650 -12355 -14605 -11257 -12535 -7845 -1249 2864
15120 2864 -3179 -4608 696 4535 -1237 2411 8552 8902 3221 6469 -371 -2378 1532 6091 7469
15105 7469 -1038 -4157 1401 -3153 -9280 -3693 -6047 -3860 -6549 -7405 -7627 -9263 -11268 -11136 -9603
15090 -9603 -5618 -2197 -7307 -9310 -14175 -13545 -7299 -10072 -11652 -12309 -12586 -12352 -10465 -7885 -2170 -2944
15074 -2944 -9171 -9791 -3072 -7136 -12807 -11337 -7423 -4954 -3873 -6443 -4715 -10484 -14582 -7959 -3597
15059 -3597 -3452 -1383 -725 6569 6676 4133 4095 -2134 -6921 -8808 994 7510 6528 2797 1554 2345
15043 2345 -5349 999 5111 -67 -4083 -7545 -8847 -13525 -10851 -2680 -2487 156 -725 897 730
15028 730 1151 4279 5034 2709 -2578 -667 4428 7025 1794 866 3680 1162 -5540 -9679 -7082 -3188
15012c188j560k702K353K799o485n466K096M289J027J798N83o548N028M57o456
14997a1975q598R26O696M032O980N231J390l233p213j997l797O27n217j684N893
14982a1939O038P712m247j062K495k131j272k921k12N013M695p99N19l987k22
14967b320k017m082O074N810m581r77r95k926k326L99J328L88K913J1401J262
14952I351j2776O12L209m232J157J0345R484k810m600q126n220n535o24J60K229
14937g376K424L767P112J224K679o117K65j506M621O546j150n203k200j0758j120
14922f792n72P613J125J340K70m393J204P13L63O885K747k890l10n96n793l506
14906b592l935k301n335N047Q858M554L887j245n210K651q06l282l718P169L808
$$ plain form
15012 -3188 -4748 -7450 -5097 -2298 -8783 -14249 -12153 -7864 -6837 -5039 -4456 -11004 -5976 -5519 -11975
14997 -11975 -20573 -19647 -12951 -8919 -1939 3292 4682 1449 -5764 -7761 -11558 -10931 -16148 -17832 -11939
14982 -11939 -5901 1811 -2436 -3498 -1003 -3134 -4406 -7327 -7539 -2526 2169 1370 1889 -2098 -2320
14967 -2320 -4337 -8419 -2345 3465 -1116 -2093 -3088 -6014 -8340 -7941 -6613 -6225 -3312 8089 9351
14952 9351 -3425 -2813 396 -3836 -2679 7666 17150 14340 9740 1614 -3606 -9141 -9765 -9605 -7376
14937 -7376 -4952 -1185 5927 7151 9830 3713 3978 2472 7093 13639 12489 7286 5086 -5672 -6792
14922 -6792 -7364 249 1374 2714 2984 -1409 -205 508 871 7756 10503 7613 7303 6707 914 -2592
14906 -2592 -6527 -8828 -14163 -9116 -258 4296 8183 6938 1728 4379 3573 291 -3427 3742 7550
14891G550k748m04L374P76q845j011J924M163j879l773O042J845K338j128m634
14876C590m54K66k924J679N015L67l948J945l99L204M367j958K073m332l18J633
14860I806m952M3n014q353J51L637J705q891L878Q344J557J19K777m619n862p94
14844f468K548J188O79l77M9L449j246J235r587j665Q140p03l623K10l89k803
14828i363L865P203j203Q80P231l820p429M059M582j010l857m355K959k653K579
14813c32J3227N817q525r704J556J257kl231p616N49M772M498J620n356m648r17
14797g035j591k727K330O209L435n177P47M7l921m520j219j016N433M629K090
14782b286J51P56J667K761l166j094K574n356L459K602k220p569l279N910j0816
$$ plain form
14891 7550 4802 4398 7772 8548 -297 -1308 616 4779 2900 -873 5169 7014 9352 8224 3590
14876 3590 3136 3402 478 2157 7172 7539 3591 5536 5137 8341 12708 10750 12823 8491 8173 9806
14860 9806 4854 4897 -117 -8470 -8319 -4682 -2977 -11868 -7990 354 1911 2030 4807 188 -5674 -6468
14844 -6468 -3920 -2732 -2053 -2430 -2381 1068 -178 1057 -8530 -10195 -2055 -2758 -6381 -6171 -6560 -9363
14828 -9363 -5498 1705 502 1382 8613 4793 -2636 1423 6005 4995 1138 -3217 -258 -2911 -332
14813 -332 12895 18712 10187 483 2039 3296 3294 63 -7553 -7004 -2232 2266 3886 -1470 -6118 -7035
14797 -7035 -8626 -11353 -9023 -2814 621 -4556 -3809 -3762 -7683 -12203 -13422 -14438 -9005 -4376 -2286
14782 -2286 -2135 -1379 288 3049 -117 -1211 1363 -3993 -534 2068 -152 -7721 -11000 -5090 -15906
14767a5906L258R698M360k440k114J136j54O303o388p266N215K103l950n397J0468
14752a074L431l027l647k141P269P495K259O31K507l764p558J40K772j836o037
14737b580M562k235n289K282K317L471m297J715J697M72m592k197N411m155Q33
14722b585Q81J49N272L483p391l627M256k127l817P03k284k301L303K51L536N201
14706B903M231n337l889O713L541k99m508l053l043j541R53N560N4m094M16j0001
14690a1394j842J1017p91K134m352J013O093L63r855l805O546k737k968l64J0258
14675f84K775K636O65l005o67l8k486n531j731M854O798n87m293K399l689K674
14659I0K740j029k6j08M58l470l505J038j793n400J368N652J0425P62n160p046
$$ plain form
14767 -15906 -12648 -2950 1410 -1030 -3144 -2008 -2162 4141 -2247 -9513 -4298 -2195 -6145 -11542 -1074
14752 -1074 2357 -670 -4317 -6458 811 8306 10565 11196 13703 9939 2381 2521 5293 3457 -2580
14737 -2580 1982 -253 -5542 -3260 -943 2528 -1769 -54 1643 2115 -2477 -4674 737 -3418 -2585
14722 -2585 -1704 -1555 3717 7200 -191 -3818 438 -1689 -5506 -4803 -7087 -9388 -6085 -5834 -2298 2903
14706 2903 7134 1797 -2092 4621 8162 7863 3355 302 -2741 -4282 -3329 2231 2285 -1809 -1393 -11394
14690 -11394 -13236 -2219 -3010 -876 -5228 -4215 1878 2241 -7614 -11419 -4873 -7610 -10578 -10942 -684
14675 -684 2091 4727 5392 2387 1720 1682 -804 -6335 -8066 -3212 3586 2999 -1294 1105 -2584 90
14659 90 2830 1801 1775 1667 2125 -1345 -4850 -3812 -5605 -11005 -9637 -3985 6440 7202 2042 -5004
14643e004q280L568Q937J318L276K763n143P55J059l15m806m442k037K049Q915
14628B613k46K386J739j90K331q4k788r617m786J299k110J440l979k230L203Q528
14612b491N160O061m246o991J095R20J1j5L54K201L839J762K724l369o55M798
14596A1158J064j304l983r57j422P279l168n463M369J221j1277k063M203l146
14582c489L90l072k523L514Q606n00l119L261J304L193K944q910l557j280N631
14567B393L026n303J33J583N22J548M5j174l383q02J246L043P71n914K026J856
14551A616j631m213k872K556j180P558L440p82n500m366O418L371O70p174K7N288
14535C226J774j994j158M19r0M598N717k878j399p85n100L11N21q843k931P709
$$ plain form
14643 -5004 -13284 -9716 -779 539 3815 6578 1435 2190 3249 2934 -1872 -6314 -8351 -6302 2613
14628 2613 2367 4753 6492 6302 8633 8549 5761 -3856 -8642 -7343 -9453 -8013 -11992 -14222 -11019 -2491
14612 -2491 2669 8730 4484 -2507 -1412 -492 -481 -496 -142 2059 5898 7660 10384 7015 6360 11158
14596 11158 12222 10918 6935 5978 4556 11835 8667 3204 7573 8794 -2483 -4546 -343 -3489
14582 -3489 -3099 -6171 -8694 -5180 3426 2926 -193 3068 4372 7565 10509 1599 -1958 -3238 2393
14567 2393 5419 116 249 1832 2354 3902 3947 2773 -610 -1412 -166 2877 3648 -2266 -240 1616
14551 1616 -15 -4228 -7100 -4544 -5724 1834 5274 4492 -1008 -5374 1044 4415 5085 -2089 -2062 3226
14535 3226 5000 3006 1848 2267 2177 6775 12492 9614 8215 7430 2330 2641 3162 -5681 -8612 -903
14519i03J781M417k646p763p455o447O358O540R03k216m439M4N851k688l17j423
14503a0403Q14L274L349l241k939L677J903P3mL266K94M712m66j886K677N723
14487A0823l38k548j202J19n355j944l623J049k395k302j083P068l10K181M536
14472D676J361n501p255l276J040N188N382j229j899l465k987J454J96n735O381
14457e669P123K390M15n973j237K532K708K459K010r378n910j101N661J566K202
14442b02R185k527o446m878m775K40M523j239l24k433M782L985n329p1K225q64
14426d148L299L467j863j959K799K380k654m002q064m866L807K353n954K555L497
14411i353K453O42L146M235j149l501K168m209j250k750l384k971K886M705k619
$$ plain form
14519 -903 878 5295 2649 -5114 -12569 -19016 -12658 -6118 -5215 -7431 -11870 -11826 -5975 -8663 -8980 -10403
14503 -10403 -9589 -6315 -2966 -6207 -9146 -5469 -3566 -3493 -3497 -231 63 4775 4309 2423 5100 10823
14487 10823 10485 7937 6735 6854 1499 -445 -4068 -3019 -5414 -7716 -8799 -1731 -2041 140 4676
14472 4676 6037 536 -6719 -9995 -8955 -3767 1615 386 -1513 -4978 -7965 -6511 -6315 -12050 -5669
14457 -5669 1454 3844 4259 -1714 -2951 -419 2289 4748 6758 -2620 -8530 -9631 -3970 -2404 -202
14442 -202 8983 6456 10 -4868 -9643 -9403 -4880 -6119 -6443 -8876 -4094 -109 -5438 -5509 -3284 -4148
14426 -4148 -849 2618 755 -1204 1595 3975 1321 -2681 -10745 -15611 -11804 -9451 -15405 -12850 -9353
14411 -9353 -6900 -6258 -3112 1123 -26 -3527 -1359 -5568 -6818 -9568 -12952 -15923 -13037 -8332 -10951
14396a0951J431J313J333r41L23O067R97k60Q65l929J588J840l390L449P09J47
14380E91q20j530L760J162m591k252J627K829p496j810O113m333Q2L653M872R45
14364B802k81l07L619j458r55M272M284o920r232K8N230K596n618n011Q8L364
14348c499j768r46j444j839N571k702Q35N577M612L643Q470l198j2647r896Q136
14333a095O516j296L770J147o702l372m590q829k902j783R51o12j077O265M221
14318i388M333R125m98n449J588j469J186N65m493m838Q325mn896M532O8R53K02
14301a158J763K320l234m411o845j133J35R265K757p924p505q17n206M883R160
14286g950M516j240k253l169L406m452k682L691J2011O597k578k659l326p34l
$$ plain form
14396 -10951 -9520 -8207 -6874 -7815 -7492 -1425 -428 -688 177 -3752 -2164 -324 -3714 -265 444 591
14380 591 -229 -1759 2001 3163 -1428 -3680 -2053 776 -6720 -8530 -2417 -6750 -6668 -3015 1857 2802
14364 2802 2521 2214 5833 4375 3420 7692 11976 5056 -4176 -4148 1082 3678 -1940 -6951 -6863 -3499
14348 -3499 -5267 -6213 -7657 -9496 -3925 -6627 -5792 -215 4397 8040 16510 13312 665 -9231 -1095
14333 -1095 5421 4125 7895 9042 2340 -1032 -5622 -14451 -17353 -19136 -18185 -18797 -19874 -13609 -9388
14318 -9388 -5055 4070 3572 -1877 -289 -1758 -572 -7 -4500 -9338 -1013 -1017 -6913 -2381 -2313 -1360 -1158
14301 -1158 605 2925 -309 -4720 -11565 -12698 -12563 -3298 -541 -8465 -15970 -16787 -21993 -17110 -7950
14286 -7950 -3434 -4674 -6927 -10096 -6690 -11142 -13824 -10133 1878 8475 5897 3238 -88 -822 -825
14271h25J567l483q19k481K062L459k527l506K471j127j624J052L728J716k886
14256c223r381n971K174J391p50K563k38L962J732j992K50M378m468m285L598
14241a0260O621M695m476p109k59k213l38M637O410K885k517k128n665p61n133
14226a5611l716N008Q304O462M822m49j192L128k785k47l849K542K959J730K31
14211G337o623q021J074J262k732m741l175M183m349P70r22l504N957O368O253
14196h63P577K250p484m191l250L951L27K310N534K09l516j006N806M358J254
14181A3266m452j1594j939O147m95k306j144Q93N353Q722m25J673L551k371j981
14166A2898K020n287l772l270q791k553r63P704P513k802m129m073K243O124J412
$$ plain form
14271 -825 742 -2741 -3560 -6041 -3979 -520 -3047 -6553 -4082 -5209 -6833 -5781 -2053 -337 -3223
14256 -3223 -12604 -18575 -16401 -15010 -15760 -13197 -13435 -9473 -7741 -9733 -9483 -5105 -9573 -13858 -10260
14241 -10260 -3639 1056 -3420 -10529 -10788 -13001 -13339 -8702 -2292 593 -1924 -4052 -9717 -10478 -15611
14226 -15611 -19327 -14319 -6015 447 5269 4820 3628 6756 3971 3724 -125 2417 5376 7106 7337
14211 7337 714 -7307 -6233 -4971 -7703 -12444 -15619 -11436 -15785 -15015 -15937 -19441 -13484 -7116 -863
14196 -863 6714 8964 1480 -2711 -5961 -2010 -1683 627 6161 6370 2854 1848 7654 12012 13266
14181 13266 8814 -2780 -4719 1428 933 -1373 -2517 -1624 3729 12451 12026 13699 17250 14879 12898
14166 12898 14918 9631 5859 2589 -6202 -8755 -9718 -2014 5499 2697 -1432 -5505 -3262 2862 4274
14151D274L448m842j1711l29O049O009K573j604k584J936J496l845r74n24k710
14136c338r34L185M092M02l214J124k547p417L260k089j306k952j945J894K811
14121h974K566L527Q990j162p427N019K608N18P02J011J699m530l636l28J701
14106B284K249m8j478K890K485K153r47m395j670o775m710J582O076J635k476
14091a145n702J873N018k569p064K894P875l42K227N096n215j890J984k91J510
14076D259J665l924j462o42M24k973N027L108j0024l864L844M896l108J192P650
14061F068J527K127Q77l586p777p206P929O620k966L129Q0J158R788j036l345
14046A3387m827k275L51L448l453l099k571J923j060m841L194L387L717k239k900
$$ plain form
14151 4274 7722 2880 -8831 -9160 -3111 2898 5471 3867 1283 3219 4715 870 -104 -628 -3338
14136 -3338 -4272 -1087 3005 3407 193 1317 -1230 -8647 -5387 -7476 -8782 -11734 -13679 -11785 -8974
14121 -8974 -6408 -2881 6109 4947 -2480 2539 5147 5665 6367 7378 9077 4547 911 583 2284
14106 2284 4533 4485 3007 5897 8382 10535 9588 5193 3523 -3252 -7962 -6380 -304 1331 -1145
14091 -1145 -6847 -4974 44 -2525 -9589 -6695 1180 838 3065 8161 2946 1056 3040 2749 4259
14076 4259 5924 2000 538 -104 320 -2653 2374 5482 -4542 -8406 -4562 334 -2774 -1582 6068
14061 6068 7595 9722 10599 7013 -764 -7970 -41 6579 3613 6742 6822 7980 17768 16732 13387
14046 13387 8560 6285 6636 10084 6631 3532 961 2884 1824 -3017 177 3564 7281 5042 2142
14031B142K359P46m063p91Q634O585M838R37m839K163o260k572q92K668L439J838
14015A6932j020m223j368R094j1n062j892K596l415k798O955l800l052K147q349
14000B734n992N528L798M663k567N80r62n55n486n298n369L450N54P018K421J836
13984F353p409k199j922K966J949N12L722J889L072P70l256p42l122j858k09O
13968E22M242L36p01N370J396k149k261R304k009k648l620n874p322n679Q004
13953c089M871M404k110k725j826l771Q152N029M213j934m437o709M857Q584J766
13938A5275K330N48K511O023L946j373k629m090K549P222N46m191J445p421n397
13923A7294k020J635Q794L83R56j12q171K22m325J730j0019r521K412M934K434
$$ plain form
14031 2142 4501 5247 1184 393 9027 15612 20450 21387 16548 18711 12451 9879 8987 11655 15094 16932
14015 16932 15912 11689 10321 19415 19404 14342 12450 15046 11631 8833 15788 11988 8936 11083 2734
14000 2734 -3258 2270 6068 10731 8164 8744 7782 7227 1741 -3557 -8926 -5476 -4922 2096 4517 6353
13984 6353 -1056 -3255 -5177 -2211 -262 250 3972 5861 8933 9703 6447 5705 2583 725 516 522
13968 522 4764 5100 4399 9769 11165 9016 6755 16059 14050 11402 7782 1908 -5414 -11093 -3089
13953 -3089 1782 6186 4076 1351 -475 -4246 3906 8935 13148 11214 6777 68 4925 13509 15275
13938 15275 17605 18153 20664 26687 30633 29260 26631 22541 25090 32312 32858 28667 30112 22691 17294
13923 17294 15274 16909 25703 26086 27042 26930 18759 18981 14656 16386 6367 -3154 -742 4192 6626
13908F626j719J298O624R68M64m14l657j793j53l705o908L4j312N460j9j898k57
13891c61L684Q565L999j3155o826j73J752P553O492J956P52k560j2741k253N331
13876B015P52J179L403O182J541k374k319k119N815k911j108n68m518R06p3j340
13860D463L849J899k520J122M328o258q415K202J161L070L960j7r654n16M934
13845C608N993K428J33m882p16m427P88L537M046p41M88k085M403K805L739r344
13829I773j1104k318J0290M669O097P879O893M575M738J321m040L176K206p550
13815C6605p055j0812p578l018p95K314o532K494N963q247m917M839N601J809
13801A0671o88j78j36M694J895p212l098o95j796L040o453n454R798Q935J803
$$ plain form
13908 6626 4907 6205 12829 13797 14261 13847 10190 8397 8244 4539 -2369 -2335 -3647 1813 1794 -104 -361
13891 -361 3323 11888 15887 2732 -4094 -4267 -2515 5038 11530 13486 14238 11678 -1063 -3316 2015
13876 2015 2767 3946 7349 13531 15072 12698 10379 8260 14075 11164 10056 9488 4970 5876 5803 4463
13860 4463 8312 10211 7691 8813 13141 6883 -1532 670 1831 4901 8861 8844 -810 -1326 3608
13845 3608 9601 12029 12162 7280 6564 2137 2925 6462 10508 9767 10255 8170 12573 15378 19117 9773
13829 9773 -1331 -3649 6641 11310 17407 25286 32179 36754 41492 42813 38773 41949 44155 36605
13815 36605 29550 18738 11160 8142 7347 9661 3129 5623 11586 3339 -1578 3261 8862 10671
13801 10671 9983 9805 9669 14363 16258 9046 5948 5253 3457 6497 44 -5410 4388 13323 15126
13786A5126q805l52L86K41J548J15j982M828L806N354q10n788M45J651l995K654
13770A4422L343q846j0431m36N669L470P62l083K787P543O15L964M261p477r413
13755G150o390n607M448P760P090J70k25p050k251J546O008j230K936K625k254
13740A4726j033j034N67K076k307p338l229P62M738L344k922l164J444R93n95
13725G028N124k579m735L449L055K569R94m017K475n162K014J784R56o78p812
13710D465j0195l065N820O668M254M064m5p310l157P031O524m847k395L825L672
13695A5309L272q12K513j513l972k419j35K583k752K660P725J430l8P82m087l262
13679A7284l650j626k015o302J536J042l179N278J811m694M504J812k286M56K321
$$ plain form
13786 15126 6321 5969 6355 6596 8144 8259 6277 11105 14911 20265 19455 13667 14112 15763 11768 14422
13770 14422 17765 8919 -1512 -1948 3721 7191 7953 4870 7657 15200 15815 19779 24040 16563 7150
13755 7150 760 -4847 -399 7361 14451 14621 14396 7346 5095 6641 12649 11419 14355 16980 14726
13740 14726 13693 12659 13226 15302 12995 5657 2428 3190 7928 11272 8350 5186 6630 7623 7028
13725 7028 12152 9573 4838 8287 11342 13911 14905 10888 13363 8201 10215 11999 12955 12277 4465
13710 4465 -5730 -8795 -2975 3693 7947 12011 11966 4656 1499 8530 15054 10207 7812 11637 15309
13695 15309 18581 17769 20282 18769 14797 12378 12243 14826 12074 14734 22459 23889 23851 24633 20546 17284
13679 17284 13634 12008 9993 3691 5227 6269 3090 8368 10179 5485 9989 11801 9515 9971 12292
13664A2292K903m080O010N355K656K901m085q832l481l16R70M734l746m185j825
13649G271j1M976J57o4N417J27l957m972M958L548o43L12m751q117L014L229j006
13632I488j825j641qj668j743l907L480O773N332J36o88J220j992k154k434l714
13616D655J404M014m757n54P783J140J793l57R80L469M821l576r079m502o3O573
13600A3744M593l256O42l222k589p744p950Q868O622N49L533K292Q90J371M197
13585B2540L964R26l469M94P62L201L933m418j215L067J1879P626J1050L136m952
13570E8524o309q824J784n454n46m862r342p780p916K653K596j363l377K248N030
13555A7062R81M572l520l559l858M261Q85K440N603l800p727o084K466O912M547
$$ plain form
13664 12292 15195 11115 17125 22480 25136 28037 23952 15120 11639 11323 12293 17027 13281 9096 7271
13649 7271 7260 12236 12393 12329 17746 17873 13916 8944 13902 17450 16807 17119 12368 4251 7265 10494 9488
13632 9488 7663 6022 6014 4346 2603 -1304 2176 8949 14281 14417 13729 14949 12957 10803 8369 4655
13616 4655 6059 10073 5316 4762 12545 13685 15478 15121 16101 19570 24391 20815 11736 7234 7171 13744
13600 13744 18337 15081 15723 12501 9912 2168 -5782 3086 9708 10257 13790 16082 16972 18343 22540
13585 22540 26504 27430 23961 24455 25217 28418 32351 27933 26718 29785 41664 49290 60340 63476 58524
13570 58524 52215 43391 45175 39721 39175 34313 24971 17191 9275 11928 14524 13161 9784 12032 17062
13555 17062 18043 22615 19095 15536 11678 15939 16824 19264 24867 21067 13340 7256 9722 16634 21181
13540B1181l587J38K119K827k758O093k898j1005K966J657p708J60O480O512O272
13525B8449K142K352r10q626J24k34J431O47l4m952l20K76K525L474p598m460
13509A4286L057Q068K08l169m35m050L36J339m334k911L586m703O9O200J626P84
13493A9957k530J913M570K378j867j357M276M262p032k963K645J369L280K642
13479C1543m502n352J365m245n560n531j174M417P947M141M08m249L052K582N830
13464C0672k376J587l56j026L18L923j410K537K66m912j708L612m328n459K069
13449B3409N067L982k399O88K613q72K644k94J558N478P037O096m765k841N072
13434E2473M669k070m464K759M152K63K710k624O41L999p206j036L024M679J277
$$ plain form
13540 21181 17594 17732 19851 22678 19920 26013 23115 12110 15076 16733 9025 9185 15665 22177 28449
13525 28449 30591 32943 32033 23407 23531 23297 24728 25375 25341 20389 20069 20345 22870 26344 18746 14286
13509 14286 17343 25411 25619 22450 22015 17965 18301 19640 15306 12395 15981 11278 11347 17547 19173 19957
13493 19957 17427 19340 23910 26288 24421 23064 27340 31602 24570 21607 24252 25621 28901 31543
13479 31543 27041 21689 23054 18809 13249 7718 6544 10961 18908 23049 23457 19208 22260 24842 30672
13464 30672 28296 29883 29527 28501 28819 32742 31332 33869 34135 29223 27515 31127 26799 21340 23409
13449 23409 28476 32458 30059 30747 33360 32488 35132 34838 36396 41874 48911 55007 50242 47401 52473
13434 52473 57142 55072 50608 53367 57519 57782 60492 57868 58509 62508 55302 54266 57290 61969 63246
13419F3246o865n87M455L659n11j5902j1284K202K855K365n828p220n192k12K318
13404B7499M871K384q188m992O99R8J837n99K467O742p221j298O170k393K68P19
13388B9063l716Q96J688p349n565M796k88q21M447R316L74j448j319j996K946
13373C1024L878J154Q11o575m536M126K876j673N211m87m246j619M679N242j590
13358C8275m095n822p256l947J667L632M516m03M91n592J785K666m02j871l187
13343B0457N299L48R89l361N94J770M89l65l916l987O11L518L435J476k946n943
13327A8468j990l174M471O364K593J12K038k809Q80n17l806p011j888J045q98
13312A3878l78K645n004r15Q107J1994M509l367Q09R64M703K24j463r373l841
$$ plain form
13419 63246 56381 55794 60249 63908 63397 47495 36211 38413 41268 43633 37805 30585 25393 25181 27499
13404 27499 32370 34754 26566 21574 22273 22371 24208 23609 26076 32818 25597 24299 30469 28076 28344 29063
13388 29063 25347 26243 27931 20582 15017 19813 19525 18704 23151 32467 32841 31393 30074 28078 31024
13373 31024 34902 36056 36867 30292 25756 29882 32758 31085 36296 35809 31563 29944 34623 39865 38275
13358 38275 34180 28358 21102 17155 18822 22454 26970 26567 27058 21466 23251 25917 25515 23644 20457
13343 20457 25756 26104 27093 23732 24326 26096 26585 26220 22304 18317 18928 22446 25881 27357 24411 18468
13327 18468 16478 13304 17775 24139 26732 26844 28882 26073 26953 26436 22630 15619 13731 14776 13878
13312 13878 13500 16145 11141 10226 18333 30327 34836 31469 32278 33242 37945 38169 36706 27333 23492
13297B3492J412J158k531j539N371l82J917M879L967N34l372j475l08o993L529
13282B9659M051M42r45N62m508o576r41N006l795j0926k739J751K490j504M83
13267A2510J10L582L489o346K327L839k166p559Q880M593N510J247l36o79J21
13252B9122o994m822M288O289l802k360L807N589k610m750m73O218L286n183L210
13237C0815M331k945l138M223N370q94J86o916p296l913o03J405J284N418k963
13222B4364K335N754K006N90j393r07j104K228n10j743J956j674j030l17m71k864
13206B7220M640J761o402n090k335L219P942K965k344r95L152N918k129l454l304
13191C0764j823J732%j853J324O134k875k808N608L934j273n545o443M231L854
$$ plain form
13297 23492 24904 26062 23531 21992 27363 26981 28898 33777 37744 38278 34906 33431 33123 26130 29659
13282 29659 33710 34152 33207 33769 29261 22685 21744 26750 22955 12029 9290 11041 13531 12027 12510
13267 12510 12620 16202 19691 13345 15672 19511 17345 9786 18666 23259 28769 30016 29680 29001 29122
13252 29122 22128 17306 21594 27883 24081 21721 25528 31117 28507 23757 23284 29502 32788 27605 30815
13237 30815 35146 32201 29063 33286 38656 37762 37948 31032 23736 19823 19220 20625 21909 27327 24364
13222 24364 26699 32453 34459 35049 33656 32749 31645 33873 33363 31620 33576 31902 30872 30555 30084 27220
13206 27220 31860 33621 27219 22129 19794 23013 30955 33920 31576 30581 33733 39651 37522 34068 30764
13191 30764 28941 30673 30673 28820 30144 36278 33403 30595 36203 40137 38864 33319 26876 31107 34961
13176C4961k477m275n32J361L248p79P35M136Q09m93K43P96k022J919L477k580
13160C8527l771o86K342Q69o131K663L311J139j44J547K057k323m035n667j0443
13145A9255O45N062M901l167K075Q688M021k091N755M150l395j2989k21N039M112
13130D1840J3078K649m918q723m80j570J342J409j28N143p55N390N5N062N608
13115F5002m592j507k967R06k077m760M436j568M384Q135j636o501k222L890k687
13100E6236J509p03n790k501K902Q600J605J014P88L696k903j449k163J081L078
13085F5000M48k238k47N996O07j1104n600L400L791k61N627J880q91P210j840
13070G1778K624P867Q229m8j511P667Q934Q717J0704J3202R808O619J3443K4967
$$ plain form
13176 34961 32484 28209 27677 29038 32286 31507 32242 36378 37187 36694 36937 37733 35711 37630 41107 38527
13160 38527 34756 34070 36412 37281 31150 33813 37124 38263 38119 39666 41723 39400 35365 29698 19255
13145 19255 19900 24962 29863 26696 28771 37459 41480 39389 45144 49294 45899 32910 32689 37728 41840
13130 41840 54918 57567 52649 43926 43446 41876 43218 44627 44499 49642 48887 54277 54332 59394 65002
13115 65002 60410 58903 55936 56842 54765 50005 54441 52873 57257 65392 63756 57255 55033 58923 56236
13100 56236 57745 57042 51252 48751 51653 60253 61858 62872 63660 67356 64453 63004 60841 61922 65000
13085 65000 65448 63210 62963 68959 69566 58462 52862 56262 60053 59792 65419 67299 66408 73618 71778
13070 71778 74402 82269 90498 90450 88939 96606 105540 114257 124961 138163 147971 154590 168033 193000
13056A93000K2318L0575M9596N8955Q5986J15492J25511J21359Q5605M7384L0075
13045I65856K9459n07n6268r6706j26502j17116j06500r3696p2099m8894m1603
13034B35424l6538k7768j6429p058o523j1951j1946o855k57l105p219m971j204
13021I3600n014p95K072k980l678K570L673j286k966L972K211n881r52M096J233
13006H9875L259K206p527r103N88O355n188j2139n322P866L319o849j695L351
12992F8996Q252N05k194j539l253j182J869J91M560L102q3l690r87M14j082l682
12976G0197n802k842P42NK692M243P83L428Q871J654j297m302r84K492M054j635
12960H2299M142P348M984O445L04Q451J5501J3817J1244j696j829L873m776m823
$$ plain form
13056 193000 215318 245893 295489 354444 440430 555922 681433 802792 888397 935781 965856
13045 965856 995315 994808 938540 841834 715332 598216 491716 398020 325921 277027 235424
13034 235424 198886 171118 154689 147631 141108 129157 117211 110356 110099 106994 99775 94804 93600
13021 93600 88586 87791 89863 86883 83205 85775 89448 88162 85196 89168 91379 85498 84546 88642 89875
13006 89875 93134 95340 87813 78710 79298 85653 80465 68326 63004 70870 74189 67340 65645 68996
12992 68996 77248 77753 75559 74020 70767 69585 71454 71645 76205 79307 79224 75534 74547 74961 73879 70197
12976 70197 64395 61553 62295 62300 64992 69235 70018 73446 82317 83971 82674 78372 77388 79880 83934 82299
12960 82299 86441 93789 98773 105218 105522 113973 129474 143291 154535 152839 151010 154883 150107 145284
12946A45284m255j1859r984k019r174j020k388p73O811L885J143L858o133q741
12932A04635p725L014L059L391m562K502L78L940k236J611M060N426J1092M927
12918A33512m660j937J233j466k733J819J262O725J8213K3683J5431J8516J1211
12905B20809J6709J2424J279j7630k1849j9806j6949j6484l371Q135K204P375
12893A72846J961J533R993J0026Q676m443q455j1683j6377q044n157q49J772m055
12879A47744Q766K2069L6379L6772J8685P529J1787J5466J5257J114j4782k4901
12867B81885k5993k5666j1220q023k421P356J2362J4001J2749N399o539p440j3684
12854B32766j8617j1604j7791j3742j0617q293j295n093M474O558N21n171n350
$$ plain form
12946 145284 141029 129170 119186 117167 107993 106973 104585 103812 110623 114508 115651 119509 113376 104635
12932 104635 96910 99924 102983 106374 101812 104314 104692 108632 106396 108007 112067 117493 128585 133512
12918 133512 128852 126915 128148 126682 123949 125768 127030 133755 151968 175651 191082 209598 220809
12905 220809 237518 249942 251221 233591 211742 191936 174987 158503 155132 163267 165471 172846
12893 172846 174807 176340 186333 196359 205035 200592 192137 180454 164077 156033 150876 150027 151799 147744
12879 147744 156510 178579 214958 251730 270415 277944 289731 305197 320454 321568 306786 281885
12867 281885 255892 230226 219006 210983 208562 215918 228280 242281 255030 260429 253890 246450 232766
12854 232766 214149 202545 184754 171012 160395 152102 150807 145714 150188 156746 157267 152096 146746
12841A46746Op76K589Q39m377m947k660j774r84L673N81k335N413P893O858N578
12825A62323O223J777Q037r98j652Q083N405Q664J0443R874M81OM716j460p94
12810B21128N41M142L929O35q114n126N15K979P029r21k558P832K538j586L268
12795B36231M599K417P78K466J497q986l483k083M347J173K852Q6L464L004M920
12780B53282q50M493J9992L833J3251J7126J6824K3714L6129L8865M7441O5460
12768E39560R7465J42202J97661K72816K90075K40484J73621M8658q0187j93713
12758A728642k54584k39474k07596j60637j22290r1981p5750n6588k2704r690
12748D87348j0824k0117k0372k245Q332N30m044j1219o059k165j2195P342J0940
$$ plain form
12841 146746 146752 145976 148565 149404 145027 140080 137420 135646 134662 138335 138916 136581 141994 149887 156745 162323
12825 162323 168546 170323 178360 177362 175710 183793 189198 197862 208305 218179 218660 218666 223382 221922 221128
12810 221128 221669 225811 229740 230375 222261 217135 217650 220629 227658 226737 224179 232011 234549 232963 236231
12795 236231 240830 243247 244025 246491 247988 239002 235519 233436 237783 238956 241808 241894 245358 248362 253282
12780 253282 252432 256925 276917 280750 294001 311127 327951 351665 387794 426659 474100 539560
12768 539560 637025 779227 976888 1249704 1539779 1780263 1953884 2002542 1922355 1728642
12758 1728642 1474058 1234584 1026988 866351 744061 652080 576330 519742 497038 487348
12748 487348 476524 456407 436035 433790 442122 442652 438608 427389 421330 419165 406970 414312 425252
12735D25252K146k612m616M771l106p569j156L466N027K124J2644P362N347N318
12721D54398J3786J1326R551O188J4065K1763J4963J7324J0900J3363K0780J9988
12709F28395J8837P373J1248J0578K514q675o066K253m58N264K54P944J3888J6774
12695G10123J0384K1365K5310K1689L1199L5348L1984L8667L9616L7076L6038
12684A038799K9036K9301K6203L3887K7267K5662K1282K6397L1507L7290M0774
12673A367405L7213M4384N1179N0686N5668N8579O1517P3130P6576P7567Q5039
12662B038943R3987R7061J00601J05996J08267J17910J29046J42980J70136J76571
12652C281498J95908K30460K48543K71012L02470L47939L90278M58161N26633
$$ plain form
12735 425252 427398 424786 420170 424941 421835 414266 413110 416576 421603 423727 436371 443733 449080 454398
12721 454398 468184 479510 489061 495249 509314 531077 546040 563364 574264 587627 608407 628395
12709 628395 647232 654605 665853 676431 678945 670270 664204 666457 665999 671263 671517 679461 693349 710123
12695 710123 720507 741872 767182 788871 820070 855418 887402 926069 965685 1002761 1038799
12684 1038799 1067835 1097136 1123339 1157226 1184493 1210155 1231437 1257834 1289341 1326631 1367405
12673 1367405 1404618 1449002 1500181 1550867 1606535 1665114 1726631 1799761 1876337 1953904 2038943
12662 2038943 2132930 2229991 2330592 2436588 2544855 2662765 2791811 2934791 3104927 3281498
12652 3281498 3477406 3707866 3956409 4227421 4529891 4877830 5268108 5726269 6252902
12643F252902N97732P07941Q27846R48045J070489J204929J367126J565484J785124
12634A6327618K080410K569548L313032M358126N886899Q204930J1740627J6746212
12626G1227402K2537085K5476068K1256630J3289005O768384M848709M155858
12619A69559141k115436j0866946j8182562k1561136k1217341j9519107j6314826
12612E9781787j2450137r228689o865279n123973l876064l042284k474556k061522
12604A4659283j704462j421495j217099j084521r64101q37953p12228o10292n27536
12595E579596m43962l70658l22790k82221k50884k26268k10813j96170j83805
12586C092025j70391j52119j48109j36771j14903r1119o6435k7973J8374L0692
$$ plain form
12643 6252902 6850634 7558575 8386421 9334466 10404955 11609884 12977010 14542494 16327618
12634 16327618 18408028 20977576 24290608 28648734 34535633 42740563 54481190 71227402
12626 71227402 93764487 119240555 140497185 153786190 160554574 165403283 169559141
12619 169559141 167443705 156576759 138394197 116833061 95615720 76096613 59781787
12612 59781787 47331650 38102961 31237682 26113709 22237645 19195361 16720805 14659283
12604 14659283 12954821 11533326 10316227 9231706 8267605 7429652 6717424 6107132 5579596
12595 5579596 5135634 4764976 4442186 4159965 3909081 3682813 3472000 3275830 3092025
12586 3092025 2921634 2769515 2621406 2484635 2369732 2278613 2212178 2184205 2202579 2233271
12576B233271K7667K4526Q360K579J9320O6582J34744J85582J70551J05945K9185
12565C008312j9050j9285n7218j42814k15920k69303k77367k49845k02938j59440
12555A395132j18756r0771o9038n3006l9111k7844k2444k4019j8368j3927j0815
12544I07033k0779k1680k3006k7352l3545l0094k0480j8918k0759k6468j7970
12533F45982q014j2591k078P719J6451K2847L1552M0134M7256M2010M2170L2668
12521I06106J5301J3444o049k4485l0218l7016l6709l2045k1804j1295m6J4000
12509G49184K3058L6476M6668O7178J08348J63677K13135K38776K07980J49720
12499B004200J05545P0307L9015j9290j11530j79895k13937k29749k19082j85900
$$ plain form
12576 2233271 2260938 2285464 2293824 2296403 2315723 2382305 2517049 2702631 2873182 2979127 3008312
12565 3008312 2989262 2969977 2912759 2769945 2554025 2284722 2007355 1757510 1554572 1395132
12555 1395132 1276376 1185605 1116567 1063561 1024450 996606 974162 950143 931775 917848 907033
12544 907033 886254 864574 841568 814216 780671 750577 730097 711179 690420 663952 645982
12533 645982 637968 625377 623299 631018 647469 670316 701868 742002 789258 831268 873438 906106
12521 906106 921407 934851 928802 904317 874099 837083 800374 768329 746525 735230 735184 749184
12509 749184 772242 808718 855386 922564 1030912 1194589 1407724 1646500 1854480 2004200
12499 2004200 2109745 2180052 2219067 2199777 2088247 1908352 1694415 1464666 1245584 1059684
12489A059684j49062j09622p9708n4995l8533l1495k1485k3694k7144k4994k6248
12478D72704j9214j6301L459P335Q057J7656J5233J4922J2317j200m278L576J680
12465E15946K446j473q9Q52q407l773J150P885N904J4272M570j5126k3725r711
12451D90721J744L838J3885L2709J7162j97K504L542j1411O846K9166K4243J7727
12438F32479O357L195q801k0038r252j1257k439K540l302K366N157K858R44M942
12424F05749J4995R591R058J5286K3932J9651J9977J9664J8285K0588K2835J7213
12412H16824J4787R998N528r51n919o240j0618m416K204K953O195J5352K4031
12399H69728L3705K9196M1627L7850L2602M7276N7124O1932O5561O0654N2775
$$ plain form
12489 1059684 910622 801000 721292 666297 627764 596269 574784 551090 523946 498952 472704
12478 472704 453490 437189 440648 447983 456040 473696 488929 503851 516168 514968 510690 514266 515946
12465 515946 518392 516919 516830 517682 509275 505502 506652 514537 520441 534713 539283 524157 500432 490721
12451 490721 492465 496303 510188 542897 560059 559862 562366 565908 554497 561343 590509 614752 632479
12438 632479 638836 642031 633230 613192 603940 592683 590244 592784 589482 591848 597005 599863 600807 605749
12424 605749 620744 630335 639393 654679 678611 698262 718239 737903 756188 776776 799611 816824
12412 816824 831611 841609 847137 846186 840267 834027 823409 818993 821197 824150 830345 845697 869728
12399 869728 903433 932629 974256 1012106 1044708 1091984 1149108 1211040 1276601 1337255 1390030
12388A390030M3629L9198L8319L1150L5997M2477L9762M1953M3910L7492M5411
12377A829328M9921N0758N3527N7697O6542P2689P8485O7594O7623O9302Q9854
12366B553320J05277J07145J19124J25543J30425J28888J29017J30285J45403
12357C674427J63483J84375K14532K48728K93025L39535L76470M15083M78218
12348F387876N31609N93177O65320P36833Q35006R72427J134689J335487J556461
12339A4748885J823787K169054K555291K992503L612398M523897N794690P647621
12331D5868126J0581328J5276102K2659461L3843031M8101132N4537457M5119714
12324B75986351L3161115J4115122r192588k9089467m5278856m6160110m0858959
$$ plain form
12388 1390030 1433659 1472857 1511176 1542326 1578323 1620800 1660562 1702515 1746425 1783917 1829328
12377 1829328 1879249 1930007 1983534 2041231 2107773 2180462 2258947 2326541 2394164 2463466 2553320
12366 2553320 2658597 2765742 2884866 3010409 3140834 3269722 3398739 3529024 3674427
12357 3674427 3837910 4022285 4236817 4485545 4778570 5118105 5494575 5909658 6387876
12348 6387876 6919485 7512662 8177982 8914815 9749821 10722248 11856937 13192424 14748885
12339 14748885 16572672 18741726 21297017 24289520 27901918 32425815 38220505 45868126
12331 45868126 56449454 71725556 94385017 128228048 176329180 230866637 275986351
12324 275986351 309147466 323262588 314070000 284980533 239701677 193541567 152682608
12317A52682608l5411673k7213052j9440910j4034906j0415812p880896o104775
12310C2180584m854675l958169l241678k617344k138293j734169j388994j094530
12302A1152732q54428o00712l48898j41262k3004p662j05114k57752m55201o40910
12292G717789p39938p47911o80162n89651m99424m10795l39470k83135k28305
12283C198998k04367j75104j51141j20308j06498r4729r5047q3856p7875p5804
12273B014269p0957o2501o5172p3668p1324p0301p1979p0556o3784o1220n2182
12262A280625m5118m4108l9698l0373k6827j8543l887j000l064O30n842J912N044
12249A069751l99k460P206J1146J8940K4794K0851O973N369J2954L0121N3574
$$ plain form
12317 152682608 117270935 90057883 70616973 56582067 46166255 38285359 32180584
12310 32180584 27325909 23367740 20126062 17508718 15370425 13636256 12247262 11152732
12302 11152732 10298304 9697592 9348694 9207432 9184428 9176766 9071652 8813900 8358699 7717789
12292 7717789 6977851 6229940 5549778 4960127 4460703 4049908 3710438 3427303 3198998
12283 3198998 2994631 2819527 2668386 2548078 2441580 2346851 2251804 2167948 2090073 2014269
12273 2014269 1943312 1880811 1815639 1741971 1670647 1600346 1528367 1457811 1394027 1332807 1280625
12262 1280625 1235507 1191399 1151701 1121328 1094501 1075958 1072071 1071071 1068007 1068637 1062795 1064707 1069751
12249 1069751 1069352 1066892 1074098 1085244 1104184 1128978 1149829 1156802 1162171 1175125 1205246 1258820
12237A258820Q6523J43174K40285L86583O09305Q58182P55166K81490j99091n72390
12227C848047o13850o05168n37451l86687k68545j92326j42938j08698p5849n8682
12217H57853n1210n1352l4456k2878k6079k7988k5884k4492j9837j2221j8203
12206E43253q549Q17N646Q65K1530M1170O3449O0383O3887P7761P4730Q2231J16900
12193A144073J02509P0789M0693J2624J0626r652n1237r7720j11791j10998j04193
12182H95723r2991p6257o8437m9624l7772l5571l1231k2974k0534j7019j5628
12171D27685j3844j4780j1282j1616j5314j1615j3199j6307r073o321r869j1916
12159B82549o979j2715j2820j1637q478q351j5039j3792j4548m956j311n095o045
$$ plain form
12237 1258820 1345343 1488517 1728802 2115385 2724690 3582872 4338038 4619528 4420437 3848047
12227 3848047 3234197 2629029 2091578 1704891 1436346 1244020 1101082 992384 916535 857853
12217 857853 806643 755291 720835 697957 671878 643890 618006 593514 573677 561456 543253
12206 543253 534704 535521 541167 542032 563562 604732 668181 728564 792451 870212 944942 1027173 1144073
12193 1144073 1246582 1317371 1358064 1370688 1381314 1371662 1320425 1222705 1110914 999916 895723
12182 895723 802732 726475 658038 608414 570642 535071 503840 480866 460332 443313 427685
12171 427685 413841 399061 387779 376163 360849 349234 336035 319728 310655 304334 294465 282549
12159 282549 275570 262855 250035 238398 229920 221569 206530 192738 178190 173234 171923 166828 160783
12146A60783q87R205N951K712n997J305L470P606Q410O700k102o317L363J1714
12132B05916J299n179l207k373j0692p058l013N517K328N281J4412P179K431l921
12118B08920m596l76o311J426P800n537J437M499m597m822p408p640o607j1689
12104A64499n334l146q151m633m720k655n866J04k232r462l008K336j693k151
12090A13888n709m098R425P743J266J921j485q958j0419n171j122p150K794n187
12076H7738k284p200q012o113n144M239Q529R557P658K318M329L372k209k489
12062I4289J22P40k494m593o19J518p943l950m392k03l743j839L968O527j293
12047G6095q77n925n760q440K803Q507k918K148j801K487J689o451m455j889l196
$$ plain form
12146 160783 159896 169101 175052 177764 171767 173072 176542 184148 192558 199258 197156 190839 194202 205916
12132 205916 207215 202036 198829 196456 185764 178706 175693 181210 183538 188819 203231 210410 212841 208920
12118 208920 204324 203948 197637 199063 206863 201326 202763 207262 202665 197843 190435 182795 176188 164499
12104 164499 159165 156019 147868 143235 138515 135860 129994 130098 127866 118404 115396 117732 116039 113888
12090 113888 108179 104081 113506 121249 122515 124436 122951 113993 103574 98403 97281 90131 92925 87738
12076 87738 85454 78254 70242 64129 58985 63224 71753 81310 88968 91286 95615 98987 96778 94289
12062 94289 94411 95151 92657 88064 87445 88963 81020 77070 72678 72475 68732 66893 70861 77388 76095
12047 76095 75218 69293 63533 55093 57896 66403 63485 65633 63832 66319 68008 61557 57102 55213 52017
12032E2017J932L348N443j510j96K324N344n427n322l812J178m5q009P80n385
12017D2660l488p525J72P771R11J009J812m07j2533p254K156L550L420J228m636
12002B8846q23O99j1058j2773j4700j7369p757K860J6649O826J2076R729J2455
11989B5660L820N437N270j537n199K268K850K414l065j972K625M617J602j397
11975D3393k15J992J722o106L13R798K087o920o694J647o39j245n104o183J026
11960B8872J1104N587L910J920M323m708j711j405k555P028N001J008M772k013
11946F1133m071m790o820m093j927j932j720l75J258j893P432M89N035M917L072
11931E5715K297m981j531l312j716P041j01k691j683n905K981P529L009n061m288
$$ plain form
12032 52017 53949 57297 62740 61230 61034 63358 68702 63275 57953 54141 55319 55274 47265 48045 42660
12017 42660 39172 31647 31819 39590 40501 41510 43322 42915 30382 23128 25284 28834 32254 33482 28846
12002 28846 28023 28722 17664 4891 -9809 -27178 -34935 -32075 -15426 -8600 3476 13205 25660
11989 25660 29480 34917 40187 38650 33451 35719 38569 40983 37918 35946 38571 43188 44790 43393
11975 43393 43178 45170 46892 40786 41099 50897 52984 46064 39370 41017 40378 39133 34029 27846 28872
11960 28872 39976 45563 49473 51393 55716 51008 49297 47892 45337 52365 57366 58374 63146 61133
11946 61133 57062 52272 45452 41359 39432 37500 35780 35405 36663 34770 42202 42691 47726 52643 55715
11931 55715 58012 53031 51500 48188 46472 53513 53412 50721 49038 43133 46114 53643 56652 51591 47303
11916D7303j555O168j205M10N35j791m192m699O475J569p607M339O349j185K17
11901E1131M615N605J308J2592O208J148L057R949J2833J0644J2056J4984J8739
11888A64869K9948L7019M8482P6720J12068J67589K38550K83187K59036K00216
11878A617684J05667l1611j43380k41074k54914k11999j89239j48785j09648p7585
11868C15116n0677l9486k9985k1597k0810k0614j6523j1923j6964j9145k298O442
11856G1536K725k979j225n80m560M605r415q79l320r550k779n836J676K567J431
11841D3417j111J394l084n302p449k879k508m140L315O503k76n975r394j975J582
11826A2118K446J545K770j537Q398K465o013Q85M37L637J204k983m175l375m53
$$ plain form
11916 47303 45748 51916 50711 51121 51656 49865 45673 40974 47449 49018 41411 45750 52099 50914 51131
11901 51131 55746 61351 62659 75251 81459 82607 85664 95613 108446 119090 131146 146130 164869
11888 164869 194817 231836 280318 357038 469106 636695 875245 1158432 1417468 1617684
11878 1617684 1723351 1691740 1548360 1307286 1052372 840373 651134 502349 392701 315116
11868 315116 264439 224953 194968 173371 152561 131947 115424 103501 86537 67392 65094 71536
11856 71536 74261 71282 70057 69477 64917 69522 60107 59228 55908 46358 43579 37743 39419 41986 43417
11841 43417 42306 43700 40616 35314 27865 24986 22478 18338 21653 28156 27880 21905 12511 10536 12118
11826 12118 14564 16109 18879 17342 25740 28205 22192 23077 23514 27151 28355 25372 21197 17822 17369
11811A7369J754J995J189Q238m929p005R13N299n79r02n204p627l876o6M990J035
11795A2594m939M17O775k289L35P134l463K151R89m876K100L615L395L442K371
11780B9751K467L007j828l415l733n258Q76q36j896o691l739M303J326K329m7
11765A6616o08l311n750q22q35k535K068N115J938M543O56O79o894k108j829M689
11749A1612K008p354k842O834R53m329l184J606N126Q63k20J586n555l158O092
11734A0038m14o09j587m110o484k087K19k995k781J912P793O60O427M163L282
11719A3427M457J248m658q061k239N993n044m279O812J494L335K977o000k124
11705G338K181L907J219m67J918j90r88M386K298n795m002o770k204N267N112
$$ plain form
11811 17369 19123 21118 22307 30545 25616 18611 19524 24823 24244 23342 18138 10511 6635 6569 11559 12594
11795 12594 7655 8072 14847 12558 12893 20027 16564 18715 19704 14828 16928 20543 23938 27380 29751
11780 29751 32218 35225 33397 29982 26249 20991 21867 21031 19135 12444 8705 13008 14334 16663 16616
11765 16616 16008 12697 6947 6125 5290 2755 4823 9938 11876 16419 17075 17754 10860 8752 6923 11612
11749 11612 13620 6266 3424 10258 11211 6882 3698 5304 10430 11293 11073 12659 7104 3946 10038
11734 10038 9624 9015 7428 3318 -3166 -5253 -5034 -8029 -10810 -8898 -1105 -445 5982 10145 13427
11719 13427 17884 19132 14474 6413 4174 10167 5123 844 7656 9150 12485 15462 9462 7338
11705 7338 9519 13426 14645 14178 16096 15906 14918 19304 21602 15807 11805 5035 2831 8098 13210
11690A3210k360m028m480o82M571R21n912k301N214L521n83P729N836j686m287
11675A4683o618j154j403n316k071M93P257M243o357j1391l764M091O116P30J333
11660H72K05M111l252l776m151J27L773N860K678o013j883k559k764j417J14K845
11644e230R476L342k705q149Q46j969l210l234J150k254J846K170L661L31L08
11629c621J579n30K203K179k756l242N166Q184K804j710k360P248j875k022n95
11614A0652j897m531l417k00j449P87l65J896R222m533o145K723j451j307l123
11599c138j021L785J386k224J318m107m368K984P27j792L759N47P927K051J848
11584I682J960k564p167m778K524J748l817j159L097n476P549J059k169J433j855
$$ plain form
11690 13210 10850 6822 2342 1660 6231 7152 1240 -1061 4153 7674 7091 14820 20656 18970 14683
11675 14683 8065 6911 5508 192 -1879 -1386 5871 10114 3757 -7634 -11398 -7307 -1191 -461 872
11660 872 1077 5188 1936 -1840 -5991 -5864 -2091 3769 6447 434 -1449 -4008 -6772 -8189 -8075 -5230
11644 -5230 4246 7588 4883 -3266 -2420 -4389 -7599 -10833 -9683 -11937 -10091 -7921 -4260 -3929 -3621
11629 -3621 -2042 -2572 -369 1810 -946 -4188 978 9162 11966 10256 7896 15144 13269 11247 10652
11614 10652 8755 4224 807 607 -842 -55 -420 1476 10698 6165 20 2743 1292 -15 -3138
11599 -3138 -4159 -374 1012 -1212 106 -4001 -8369 -5385 -4658 -6450 -2691 -2144 5783 7834 9682
11584 9682 11642 9078 1911 -2867 -343 1405 -2412 -3571 -474 -5950 1599 2658 489 1922 67
11569F7L040o135o134j530K677K921M160l430p36O994M441j146J238p55j981M126
11553G817N85p945o856M534Q12k003L526N814M390P359L210l731q905k662j652
11538D293J818l892J501K961P00k041J175n288l922J1291M481k415n944k277J569
11523D010L274j356m973m933J00M468m270n696K445J702Q617L647J080K277l538
11508F854j486K059j215l556m200l357k356J842P372L817k18k389j1040r787L435
11493a4225L577J842m031N308R66L939P44K90L974k187n415L98k924l533L255
11478h022K58k294l969j018J229L740j295P253K177o448m20J226k771J606O320
11463b428M370k487l756l576j965j868K444M621k055M586R35K757J687N20L517
$$ plain form
11569 67 3107 -3028 -9162 -10692 -8015 -5094 -934 -4364 -5100 1894 6335 5189 6427 5672 3691 7817
11553 7817 8402 457 -6399 -1865 -1053 -3056 470 6284 10674 18033 21243 17512 8607 5945 4293
11538 4293 6111 2219 3720 6681 7381 5340 6515 1227 -2695 8596 13077 10662 4718 2441 4010
11523 4010 7284 5928 955 -3978 -3878 590 -3680 -9376 -6931 -5229 3388 7035 8115 10392 6854
11508 6854 5368 7427 6212 2656 -1544 -4901 -7257 -5415 1957 5774 5556 3167 -7873 -17660 -14225
11493 -14225 -10648 -8806 -12837 -7529 -6563 -2624 -1880 -1590 2384 197 -5218 -4820 -7744 -11277 -8022
11478 -8022 -7764 -10058 -14027 -15045 -13816 -10076 -11371 -4118 -1941 -8389 -8809 -7583 -10354 -8748 -2428
11463 -2428 1942 -545 -4301 -7877 -9842 -11710 -9266 -4645 -6700 -2114 -1179 1578 3265 3785 7302
11448G302j55j639n374o665N492N95j689m487Q60M560L403K421j692O664J687
11433A1283l985j025K475j734J063J904n547l657n401J072J243K626l687L929
11419E59L108l393m169p43P599o92j017Q92p61N01P092k23j400l086P931O05j832
11402A0971L694K619m91o55j895l238m671L89o192k625M227M195P129p951p667
11387b161l944O492L146k400J2557n50l766J416O590M166j656p932p63m707l89
11372F099l762o460L533r10o216J599o18R50j431N750N291j036j986m426k764
11357f387K073L555l536N173k160n325L438P1m918L317N173k438o760K62M279
11342d183O001O700L666o072J952l612l723r045l084O528L438J784m045p913L333
$$ plain form
11448 7302 7147 5508 134 -6531 -1039 -444 -2133 -6620 -5760 -1200 2203 4624 2932 9596 11283
11433 11283 7298 6273 8748 7014 8077 9981 4434 777 -4624 -3552 -2309 317 -3370 559
11419 559 3667 274 -3895 -4638 2961 2269 1252 2144 1383 1884 8976 8753 7353 4267 12198 12803 10971
11402 10971 14665 17284 16793 16138 14243 11005 6334 6723 531 -2094 2133 6328 13457 5506 -2161
11387 -2161 -6105 387 3533 1133 13690 13140 9374 10790 17380 21546 19890 11958 11195 6488 6099
11372 6099 2337 -4123 -590 -1500 -7716 -6117 -6735 -5785 -7216 -1466 3825 2789 803 -3623 -6387
11357 -6387 -4314 -759 -4295 878 -1282 -6607 -3169 -3098 -8016 -4699 474 -1964 -8724 -8462 -4183
11342 -4183 1818 8518 12184 6112 8064 4452 729 -8316 -11400 -4872 -1434 350 -3695 -11608 -8275
11327h275N478N119N164N98k188k520L390N093j080l802j41L52K67j993l308O883
11311I037Q130J847j816o419l883L565n416j214j74K986K524k992M394j013n260
11296D296K247M728l783K488q53m129K047Q115K709l864r227m169j021J993M426
11281F003j563k309P49j136L563P32n306k139l197r41L013O655k320n393K732
11266h57L950j10m948K305j05L738l30n811p727O381M144J750k890J327k091M386
11250C112J052o077k230K521K277q79j893r74N569N876M240o745l873p34m047
11235b805m709k74P24l98J974M699k700p21K708p77n03M855l842j153N712L822
11219F612k803j253k038r60k470j470O534Q637n448J587j68j784n706j989R38
$$ plain form
11327 -8275 -2797 2322 7486 8084 5896 3376 6766 11859 10779 6977 6836 7188 7455 5462 2154 9037
11311 9037 17167 19014 17198 10779 6896 10461 5045 3831 3657 6643 9167 6175 10569 9556 4296
11296 4296 6543 11271 7488 9976 9123 4994 7041 15156 17865 14001 4774 605 -416 1577 6003
11281 6003 4440 2131 2880 1744 5307 6039 733 -1406 -4603 -5544 -2531 4124 1804 -3589 -857
11266 -857 3093 2983 -1965 340 235 3973 3643 -2168 -9895 -3514 630 2380 -510 817 -1274 3112
11250 3112 4164 -1913 -4143 -1622 655 -224 -2117 -3091 2478 8354 12594 5849 1976 1242 -2805
11235 -2805 -7514 -7788 -7064 -7462 -5488 -789 -3489 -4210 -1502 -2279 -2782 2073 -1769 -2922 2790 6612
11219 6612 3809 2556 518 -442 -2912 -4382 2152 10789 5341 6928 6760 4976 -730 -2719 -1781
11204a781K6M444L955m073j062r22j453m576n718J296J794J256O185p62k197p48
11188d336m126J66K976K604l651R31L539l790K69P285J072j919j789J027M426
11173D684K287M532j044k489j813J647k599p634j727L786J843L255k535l323K995
11158A865r140L272Q143K503j659n17K118M013r32k460K259l276l023L011j710
11143D467k466J738R95K114j422l689n86L037M639j68r49j0187m056P43K276n494
11127i008R13K473M112J0756j702k83K931j991p31l20o209m052l756k537K000
11112g404K819M592k119J044j758l638k730J473l71L362O096Q713k841m180r533
11097f475M22J266k028N975J078m630j126R31K84m54N613j287L715R907R787m977
$$ plain form
11204 -1781 -1755 2689 6644 2571 1509 587 -866 -5442 -11160 -9864 -8070 -6814 -629 -1391 -3588 -4336
11188 -4336 -8462 -8296 -5320 -2716 -6367 -5436 -1897 -5687 -5418 1867 2939 1020 -769 258 4684
11173 4684 6971 11503 10459 7970 6157 7804 5205 -2429 -4156 -370 1473 4728 2193 -1130 1865
11158 1865 -7275 -4003 4140 6643 4984 4467 6585 10598 9666 7206 9465 6189 3166 6177 4467
11143 4467 2001 3739 4734 6848 5426 1737 1151 4188 8827 8659 7710 -2477 -6533 -5790 -3514 -9008
11127 -9008 -8095 -5622 -1510 9246 7544 7261 10192 8201 7470 7150 941 -3111 -6867 -9404 -7404
11112 -7404 -4585 7 -2112 -1068 -2826 -6464 -9194 -7721 -8092 -4730 1366 10079 7238 3058 -6475
11097 -6475 -6053 -4787 -6815 -840 238 -4392 -5518 -4587 -4303 -4757 856 -431 3284 13191 22978 18001
11081A8001n876k813L750J591k329n515j660N997m870n333K76L785l808m05L636
11066D427L917L68M729j990k813J027L337R3L320m076o120p424K924O280K066
11051A0065l254k779K187J279J857L700J113j723P111O045m498n764M279O288
11037B5906N099N00l700m615K514l397o989o513L694l564K058M726R95M29J890
11022A9033n738j0932j76M961M780J1391Q703k822m828m438l868J721J24l895
11008A4016M920J702p67K815K921M667O52K473n616p532N435K001j720j093p681
10993A7193n355j459k053N1L735K301l257m775m061k780Q2L136L038M73K509n34
10977H244k460j217N388J312l759K554j097m64J711l97M500L883O63J355L699
$$ plain form
11081 18001 12125 9312 13062 14653 12324 6809 5149 11146 6276 943 1219 5004 1196 791 4427
11066 4427 8344 8712 13441 11451 8638 9665 13002 13095 16415 12339 6219 -1205 1719 7999 10065
11051 10065 6811 4032 6219 7498 9355 13055 14168 12445 19556 25601 21103 15339 19618 25906
11037 25906 31005 31505 27805 23190 25704 22307 15318 8805 12499 8935 10993 15719 16714 17143 19033
11022 19033 13295 2363 2187 7148 11928 23319 32022 29200 24372 19934 16066 17787 17911 14016
11008 14016 18936 20638 19871 22686 25607 30274 30926 33399 27783 20251 25686 27687 25967 24874 17193
10993 17193 11838 10379 8326 8377 12112 14413 11156 6381 2320 -460 -378 2758 5796 6269 8778 8244
10977 8244 5784 4567 9955 11267 7508 10062 8965 8501 10212 9815 14315 18198 18861 20216 23915
10962B3915K854L097j1344l112K000M129R15J639K370l71k259j4212j19M542K084
10947A6128m106L017J0106P55m290m798j697l332n855K89N567l626m868J98L795
10932G283M519M651M928Q009q107n366j112M101j003m328k362m602O929K284K443
10917A8267J895l31m278j743K80l885l841n411M025O574m797n430N76K612O486
10902A0999M679K069R12o758r232K906j493M26K477j902l202k105j52O740K773
10887I137o294J274k39o285p55J627O807L10n2m321J205l740j099J0267k899j981
10871B962o81n085o94K206L991j042q4k839l793M122M634M456j292n080J440J621
10855D842K856n168n834l185Q024M850k985L14M587L637L316m701m75P897L043
$$ plain form
10962 23915 26769 29866 18522 15410 17410 21539 22454 24093 26463 26092 23833 9621 9502 14044 16128
10947 16128 12022 15039 25145 25900 21610 16812 15115 11783 5928 6217 11784 8158 3290 3488 7283
10932 7283 11802 16453 21381 29390 21283 15917 14805 18906 17903 13575 11213 6611 13540 15824 18267
10917 18267 20162 19831 15553 13810 14090 10205 6364 953 4978 11552 6755 1325 1901 4513 10999
10902 10999 15678 17747 18659 11901 2669 5575 4082 4508 6985 5083 1881 -224 -376 6364 9137
10887 9137 2843 4117 3878 -2407 -3162 -1535 5272 5582 5530 1209 2414 -1326 -2425 7842 4943 2962
10871 2962 2281 -2804 -3498 -1292 2699 1657 1573 -1266 -5059 -937 3697 8153 6861 1781 3221 4842
10855 4842 7698 2530 -3304 -6489 1535 6385 3400 3714 8301 11938 15254 10553 10078 17975 21018
10840B1018k44M883j199q917p093o067J661k134l182o455M472P119J495n663j
10825c07N044O830O136p312l656R13k274j299J567m1O366Q179K64n376N69j147
10809A4456m806n79l81j836k313J146O007r81J015j937K655K288n381l794n46
10794E013j516O496k551p836L304K940J734j939j932j0166L787R447J302M5n715
10779B413l133M822r743J827M695P92M262l042L903O891K275M79j1008j370j232
10764B831o857K775O134J043L866L862J241r16j4283n511M364R88P812J674L209
10749A2232Mm575n054n440Q8M261P35k047L960J787j453J166p45K419J140k290
10733F188O91R48M221R279M325o396k858n794m848M132O881O616r89p340k252
$$ plain form
10840 21018 20774 25657 24458 15541 8448 2381 4042 1908 -1274 -7729 -3257 3862 5357 -306 -307
10825 -307 4737 11567 17703 10391 6735 7648 5374 4075 5642 5601 11967 20146 20410 15034 15603 14456
10809 14456 9650 9071 8690 6854 4541 5687 11694 10713 11728 9791 12446 14734 9353 5559 5013
10794 5013 3497 9993 7442 -394 2910 5850 7584 5645 3713 -6453 -2666 6781 8083 8128 2413
10779 2413 -720 4102 -5641 -3814 881 1673 5935 2893 6796 13687 15962 16441 5433 4063 2831
10764 2831 -4026 -1251 4883 5926 9792 13654 14895 13979 -304 -5815 -1451 -463 7349 9023 12232
10749 12232 12236 7661 2607 -2833 -2745 1516 2251 204 4164 5951 4498 5664 4919 7338 8478 6188
10733 6188 6879 7827 12048 21327 25652 19256 16398 10604 5756 9888 16769 23385 22396 15056 12804
10718A2804m089n29k040O222l087n984k404q38J886o0j623J080J127Q460j614
10703I311m496O597m93m139m627J196Q539o38K374k457j616J77m282n732l643
10688c929R746J926k586L213j751j943J211j577m789j148J468k566m283Q18P58
10673e432l513p45j58O866Q721j090l900j4J081n080N39J1399L781q501m415L768
10657C307j387N967P517K869p95m250j353m79n922n669R05M130R4p75n52J328
10641D935J807m805m298j73J975N780k288p634J668R923J664L372M591p465m697
10626D355K185o897o357L576R074L575J146M41n603K599O726n195o764J242K503
10611F606L06l132N035J644j268J906J10K753q98J580M262J1628J9467J1725K673
$$ plain form
10718 12804 8715 8186 6146 12368 9281 3297 893 55 1941 1881 258 1338 2465 10925 9311
10703 9311 4815 11412 10919 6780 2153 3349 11888 11250 13624 11167 9551 9728 5446 -286 -3929
10688 -3929 5817 7743 5157 8370 6619 4676 5887 4310 -479 -1627 -159 -2725 -7008 -6190 -5432
10673 -5432 -8945 -9690 -9848 -2982 5739 4649 749 735 1816 -3264 -2725 8674 12455 3954 -461 3307
10657 3307 1920 7887 15404 18273 17478 13228 11875 11396 5474 -195 710 4840 4934 4159 3607 4935
10641 4935 6742 1937 -2361 -2534 -559 5221 2933 -4701 -3033 6890 8554 11926 16517 9052 4355
10626 4355 6540 -357 -6714 -3138 5936 9511 10657 11098 5495 8094 14820 9625 2861 4103 6606
10611 6606 6912 3780 8815 10459 9191 11097 11207 13960 13062 14642 18904 30532 49999 61724 64397
10596F4397o327j9988j5927J050N507j699n134K398l73p310o249K815J888k639
10582A2409n799p281K84K004K899N022P085l815n856m9L96K985n245J732J0429
10567A7200O55k826n11J0N881J901N489l227l655o699p12m273o869k255L442N009
10551H560O753l432M03K170J41P66m964l533k149k534p191L631J005K947L828
10536F401j45O116M413m381p94j34o422J063K66L721M671J141K914M917l261n589
10520A4897M576K961N04k648o598L09o49l187k461J163o079j826R28L691K901
10505H482M23N71k517L09p69M549M62k269J136J031k554l215J581N362j397p658
10489C527j379j032J955M055L693k229m724k550m069K997J1748L239k542J046
$$ plain form
10596 64397 58070 38082 22155 23205 28712 27013 21879 24277 23904 16594 10345 13160 15048 12409
10582 12409 6610 -671 -387 1617 4516 9538 16623 12808 6952 6903 7299 10284 5039 6771 17200
10567 17200 17855 15029 14518 14528 20409 22310 27799 24572 20917 14218 13506 9233 2364 109 3551 8560
10551 8560 15313 11881 12284 14454 14595 15361 10397 6864 4715 2181 -5010 -1379 -374 2573 6401
10536 6401 6256 12372 16785 12404 11610 11476 5054 6117 6383 10104 14775 15916 18830 23747 20486 14897
10520 14897 19473 22434 22938 20290 13692 14001 13352 10165 7704 8867 2788 962 1890 5581 8482
10505 8482 8905 9476 6959 7268 6499 11048 11510 9241 10377 11408 8854 5639 7220 12582 11185 3527
10489 3527 2148 1116 3071 7126 10819 8590 3866 1316 -2753 244 11992 15231 12689 13735
10475A3735m961l255m61k715L672L031Q965k920m404J489j2N550J393J73l245
10460A6035j1226q91L779k920J981K437N109J327L911k121l437l358n629O255
10446A1252R69j011L222k683l629l172M116L808k889M915K868k873q235N111R90
10431A2759o237Q559L801O75r91m06l684K783O183M751k02p967p495j41k630j83
10415I575J4042M950p742n30K715R99k372l352k088j974L241R10l68K646n65p68
10399A9319N10N380L494j801J925O343P026J80O206P368N405K701o90M287J646
10384F9299J101L480J447K383J0940J0816L529K505m970q65m459p907k945N918
10370I0272J197m196O36j2479n593j3044j0516k256m957J171j076p758J905m082
$$ plain form
10475 13735 8774 5519 5058 2343 6015 9046 18011 15091 10687 12176 12164 17714 19107 19280 16035
10460 16035 4809 3918 7697 4777 6758 9195 14304 15631 19542 17421 13984 10626 4997 11252
10446 11252 12221 11210 14432 11749 8120 4948 9064 12872 9983 14898 17766 14893 6658 11769 12759
10431 12759 6522 15081 18882 19557 18566 18160 14476 17259 23442 28193 27991 20024 12529 12388 9758 9575
10415 9575 23617 28567 20825 20295 23010 24009 21637 18285 16197 14223 17464 18374 18006 20652 20087 19319
10399 19319 19829 25209 28703 26902 28827 35170 42196 42376 48582 55950 61355 64056 63366 67653 69299
10384 69299 70400 73880 75327 77710 88650 99466 102995 105500 100530 99665 95206 87299 84354 90272
10370 90272 91469 87273 87909 75430 69837 56793 46277 44021 39064 40235 39159 31401 33306 29224
10356B9224l624L395l034o106K620j444k470J752O09K276M390M463p037l181k555
10341A9278p636K826JM047J412J611M322k416R3k386q682j035J466K227L749o173
10325A2704m732N403L610P507m662n044M892O256l007m244o95L534j023p969m086
10310H444P30k207P65O424k01n107L120O285p79k305k62r74M204Q19J932M753
10294B5641L060O074m537p584k758J07r03o59L845M950l834l765n21l201Q094
10279B4009K103p09k129R995O011K969p382m73p617p773m492K734R134j306J213
10264B6287O20k667l666k477j009K742M129R05L75m298Qj034n31q86k582Q312
10248B4228N14j186M756l609j567k550K198K178o733n70J813M5M61n097k460o3
$$ plain form
10356 29224 25600 28995 25961 19855 22475 21031 18561 20313 20922 23198 27588 32051 25014 21833 19278
10341 19278 11642 14468 14469 18516 19928 21539 25861 23445 23538 21152 12470 11435 12901 15128 18877 12704
10325 12704 7972 13375 16985 24492 19830 14786 19678 25934 22927 18683 17988 21522 20499 12530 8444
10310 8444 9174 6967 7732 14156 13955 8848 11968 18253 17474 15169 14907 13933 18137 18956 20888 25641
10294 25641 28701 34775 30238 22654 19896 20003 19100 18441 22286 27236 23402 19637 19116 15915 24009
10279 24009 26112 25403 23274 33269 39280 42249 34867 34394 26777 19004 14512 17246 26380 25074 26287
10264 26287 26907 24240 20574 18097 17088 19830 23959 24864 25239 20941 20949 19915 19384 18498 15916 24228
10248 24228 24742 23556 28312 24703 23136 20586 22784 24962 18229 17659 19472 19517 19978 14881 12421 12358
10232A2358J381N685P382L832o258o962L863q04M810R716P421l636p808m52J707
10217C2235q075j561n64N353M189m025r098m917M78N638k733l45J35K531L318
10202B2559J731J000q199l267k229L533n54K779N232K566o55R92K658j514j052
10187B5580k63k035J56L881L62N692K968j0804j024r90p014N06Q044P95m515l124
10171A8215kl623L020j595j288q05o30p13k617O08n366n83P991N253N397m899
10155A8363m316L435Q731n094k85P562o92L720L69j165j945J676P51O33l885L114
10139C0972o76K905k27J2895Q182N425M767R590J3819K6501M1262M9408N0378
10126B55201M2115L1913L2141K5217L658q154q479k1568l9571n0845n0581l9480
$$ plain form
10232 12358 13739 19424 26806 30638 24380 17418 21281 20477 25287 35003 42424 38788 30980 30528 32235
10217 32235 24160 22599 22035 27388 31577 27552 18454 13537 14015 19653 16920 16575 16710 19241 22559
10202 22559 24290 25290 17091 13824 11595 15128 14574 17353 22585 25151 24496 25488 28146 26632 25580
10187 25580 25317 23282 23438 27319 27681 33373 36341 25537 24513 23523 16509 17015 25059 25854 21339 18215
10171 18215 18213 14590 17610 16015 14727 13922 13292 12579 9962 10570 5204 4621 12612 17865 23262 18363
10155 18363 14047 17482 26213 21119 20834 28396 27704 31424 31793 30628 28683 30359 31110 31743 27858 30972
10139 30972 30296 33201 32974 45869 54051 59476 64243 73833 87652 114153 155415 204823 255201
10126 255201 297316 329229 361370 386587 390245 382091 373612 352044 312473 261628 211047 171567
10114A71567l7626k2014k0445j7814j4972m154j871j512l752j633m938j891M27
10101C9372M569K122m604p279l642J238L22m448n847K38J406L902P528j746j2423
10086B0708k490M182L346J013m59K256m211n703l886J450K134J132K367k953J458
10071B0344N163j693r150M060O959O391R161J801R122J2991N054L857Q492j140
10057H1412m944n294L408J340K659J0037J3960p753m534q240j2758r125j2828
10044D7340r170j0495o021Q77m370n880K435M052Q059J789N949J534q156J504
10030B9447J815P04k244q70Q551m058J415N478R89j992m688M418K74k55n889q896
10014B4199L946r21K99j426n703N67L594L801M49l253O55L550M811m614M003J2137
$$ plain form
10114 171567 133941 111927 91482 73668 58696 54542 52671 51159 47407 45774 40836 38945 39372
10101 39372 43941 46063 41459 34180 30538 31776 32098 27650 21803 22041 23447 27349 34877 33131 20708
10086 20708 18218 22400 25746 26759 26300 28556 24345 18642 14756 16206 18340 19472 21839 18886 20344
10071 20344 25507 23814 14664 18724 25683 32074 41235 43036 52158 65149 70203 74060 82552 81412
10057 81412 76468 71174 74582 75922 78581 88618 102578 94825 90291 82051 69293 60168 47340
10044 47340 38170 27675 21654 22531 18161 12281 14716 18768 26827 28616 34565 36099 27943 29447
10030 29447 31262 31966 29722 28852 37403 33345 34760 40238 41227 39235 34547 38965 39239 38984 33095 24199
10014 24199 28145 27224 27523 26097 20394 20961 24555 28356 28805 25552 26207 29757 34568 29954 33957 46094
9998D6094J1433L900J747k525K069O470O456N330k080j7059m661m971m164M285
9984E2324K915j0913p057j530K046N18L944k003k268m145K470L818Q68L740k250
9969D2477P419J0350J2378J3290J8014K5302L6317M0449J9228N760j6869k7915
9957A86200k4837k3120k8598k0449j7775p567r607j3018n988l954l770o556P789
9944B8750L857k447j036l231m123K186L245P37K085L20k201n776j649O41L663
9929B5021L88j55K504m229k164k02n54q26K470r96l543M548J636n477M95j070
9913A7846M310P08L878K627l434j709pj178n877M531O533L771j190n023O11N72
9897B6969K833K994O63j560k807J560n208p25J244M905p769K136J634j656K528
$$ plain form
9998 46094 57527 61427 63174 60649 62718 69188 75644 80974 78894 61835 57174 52203 48039 52324
9984 52324 55239 44326 37269 35739 37785 38303 42247 40244 37976 33831 36301 40119 40987 44727 42477
9969 42477 49896 60246 72624 85914 103928 129230 165547 205996 225224 230984 214115 186200
9957 186200 161363 138243 109645 89196 71421 63854 54247 41229 35241 31287 27517 20961 28750
9944 28750 32607 30160 29124 25893 21770 23956 27201 27938 30023 30343 28142 22366 20717 21358 25021
9929 25021 25409 25254 27758 23529 21365 21163 20609 19783 22253 21257 17714 22262 23898 18421 18916 17846
9913 17846 22156 22864 26742 29369 25935 24226 24219 23041 17164 21695 28228 31999 30809 25786 26397 26969
9897 26969 29802 32796 33459 31899 29092 30652 25444 24719 25963 30868 23099 25235 26869 25213 27741
9882B7741K453k393l750q8j441m708O38L454N354K819J23k479Q47K11NL824J1124
9865D3734O35q348p647k155L585l149j629m762p806l28L819M640K321J964P28
9850B5602m248N015N847J388K699m070k61J589o069L01k009J611Q7j3977n838
9835G667K515N732j355J930O176L961L425n908k62M494J832O632Q2n78n994J60
9819C0509p61j655l529l630M106N67n342m44L806K339n251j347l526J678N165
9804B2685R268M156R74r664K3M390o725m394j14j495p701M089R928M574P102k26
9788C6870K203K081L214o371o145m334L103Q084J980k722n553l766L901J0568
9774D3113M026P349Q043p72O000N983Q124L351N842J716K272P806Q345J6862J4263
$$ plain form
9882 27741 30194 27801 24051 23963 22522 17814 18452 21906 27260 30079 30202 27723 28570 28781 28786 32610 43734
9865 43734 44369 36021 28374 26219 29804 26655 25026 20264 12458 12130 15949 20589 22910 24874 25602
9850 25602 21354 26369 32216 33604 36303 32233 31972 33561 27492 27793 25784 27395 27482 13505 7667
9835 7667 10182 15914 14559 16489 22665 26626 30051 24143 23881 28375 30207 36839 36921 36343 30349 30509
9819 30509 29748 28093 24564 20934 25040 25607 20265 19821 23627 25966 20715 19368 15842 17520 22685
9804 22685 31953 36109 37083 27419 27442 31832 25107 20713 20599 19104 11403 15492 25420 29994 37096 36870
9788 36870 39073 41154 44368 37997 31852 27518 30621 38705 40685 37963 32410 28644 32545 43113
9774 43113 47139 54488 62531 61759 67759 73742 81866 85217 91059 92775 95047 102853 111198 128060 142323
9759A42323L825q080j5271j0302p783l125R735Q57N76N58q562k1771j0573n666
9745F6741m412n950p182k047M487K148l687n977l429K867p266j274J896M697L483
9730D5095J598L791N123q083k148j903j307n433M592N10Q873J494q174r817l563
9715C0648L179k751M587J822k944n712l525L879P539j282n057k472O811N666m32
9700C9956J63j601k195L653L511j697m912O64K74l87N82M879P510J831n770N003
9684E1464O751m604j1187L723N125J929l875o8p85R81l26m894n260N181K393J44
9668D6692j750L219m973m696p14P65r359k809k803p4K409L57K279L134l19l788
9652B7570k178o42J632J819j595o38r57K787P115P434O22j871P477J266p078K315
$$ plain form
9759 142323 146148 138068 122797 112495 104712 101587 111322 112179 112755 113313 104751 82980 72407 66741
9745 66741 62329 56379 49197 47150 51637 53785 50098 44121 40692 43559 36293 35019 36915 41612 45095
9730 45095 46693 50484 55607 47524 45376 43473 42166 36733 41325 41835 50708 52202 44028 34211 30648
9715 30648 33827 31076 35663 37485 34541 28829 25304 29183 36722 35440 30383 27911 34722 40388 39956
9700 39956 40119 38518 36323 39976 43487 41790 36878 37542 37816 37429 38011 42890 50400 52231 46461 51464
9684 51464 58215 53611 42424 46147 51272 53201 49326 49258 48473 49454 49128 44234 38974 44155 46548 46692
9668 46692 44942 48161 43188 38492 37778 38543 29184 26375 23572 23498 25907 26264 28543 31677 31358 27570
9652 27570 25392 24750 26382 28201 26606 25968 25011 27798 34913 42347 42969 41098 48575 49841 42763 45078
9636D5078K271K320K607Q21K294K031n134J39K766N568J665q07M833J406K46R849
9620G7953J5132J1253O652J0264J1990J0808Q156K746o898m107r106q116j0276
9607A16451j1763j4683q888m836k658l265q359o457n220n177j381P4p48J0053
9593E3143l58k970O48o779J282M695j209k355M78k491R78L46J761j959L11K191
9577D7712N750M82l631L753J300n873q868N218M713j251o553k699M225q47k181
9562D1250J981J749q292p032M634M881J624K746m244J571O210k215n3j237m309
9547C9264j023L027K653j950M709k753l330n067M339J107L992K209k03N75O099
9532E3648n221k571K328O940N070n737m623j636J621n905j2585j233q17P981R765
$$ plain form
9636 45078 47349 49669 52276 53097 55391 57422 52288 52427 55193 60761 62426 61619 66452 67858 68104 77953
9620 77953 93085 104338 110990 121254 133244 144052 152208 154954 148056 143949 134843 126727 116451
9607 116451 104688 90005 81117 76281 73623 70358 61999 55542 50322 45145 43764 43838 43090 53143
9593 53143 52785 49815 50463 43684 44966 49661 48452 46097 46575 44084 45062 45408 47169 45210 45521 47712
9577 47712 53462 53944 50313 54066 55366 49493 40625 45843 50556 49305 42752 40053 44278 43431 41250
9562 41250 43231 44980 36688 29656 34290 39171 40795 43541 39297 40868 47078 44863 44810 43573 39264
9547 39264 38241 41268 43921 41971 46680 43927 40597 35530 39869 40976 44968 47177 46974 47549 53648
9532 53648 48427 45856 48184 55124 60194 54457 49834 48198 49819 43914 31329 30096 29279 37260 47025
9517D7025J952p11K053K624l556p28J945k201j471N679J150K939J014m536k243
9502E0935l475j104N864J0726j447p139q342Q21O447Q43n202l719K979K741J00
9487E1028l072N606Q33M94n311j373q390k661N441P52O158L290L64L846N721l56
9471F2370l55J200n443L202J653L394m25l796o130k402k549L522N328j814l584
9456E4171N629O65J670N249P92J88n201K530J505M632m872r016J033P82m229k780
9440E2748N748L842P75O608l283k140J485Q42j957o940j35o30j393L686L602K241
9424F5099J634k241k703N279N013K119l755k385Q0m731j792j864K247J781q871
9409E4910K586M022K38q83l214M969L888M319J187k165k727J479N180k529n158
$$ plain form
9517 47025 48977 48266 50319 52943 49387 48659 50604 48403 46932 52611 53761 56700 57714 53178 50935
9502 50935 47460 46356 52220 62946 61499 54360 46018 46839 53286 54129 48927 45208 48187 50928 51028
9487 51028 47956 53562 54395 54889 49578 48205 39815 37154 42595 43347 49505 52795 53159 57005 62726 62370
9471 62370 62015 63215 57772 60974 62627 66021 65596 61800 55670 53268 50719 54241 59569 57755 54171
9456 54171 59800 60465 62135 67384 68176 68364 63163 65693 67198 71830 66958 57942 58975 59757 55528 52748
9440 52748 58496 62338 63113 69721 66438 64298 65783 66625 64668 57728 57593 56963 55570 59256 62858 65099
9424 65099 66733 64492 61789 67068 72081 74200 70445 68060 68140 63409 61617 59753 62000 63781 54910
9409 54910 57496 61518 61756 60873 57659 62628 66516 70835 72022 69857 67130 68609 73789 71260 66102
9394F6102k657k43K573P086J671k042n17L785M654n782o599q176k510k586K690
9379E7449L33j097M8N482M427K13m540j666R493J0425r02m801n891n272N279N78
9363F9558J18M771m272J435J651K448n86k130O81j590o19R593l83r472k103J029
9347G0129L126L882k894k052M280O546R334l77r513o330j705N691P609M051j716
9332I0061k055O002K383k928j163O57j178k614m135Q98k630J38j994l181J14M652
9316H3027n703K766L548j362k773J77L479n844o371O96m768n017J3958J0179Q28
9301H6820P04K287L354q42j572q13p136l377j350P588J012k535K96k739l010J979
9285H0666O138M217R06L940M701J289j0497l609m732p297p68K597O530K419J897
$$ plain form
9394 66102 63445 63202 65775 72861 74532 72490 71973 75758 80412 74630 68031 59855 57345 54759 57449
9379 57449 57782 56685 56733 62215 66642 66855 62315 60649 70142 80567 79665 74864 68973 63701 68980 69558
9363 69558 69676 74447 70175 71610 73261 75709 75123 72993 73674 72084 71465 81058 80675 71203 69100 70129
9347 70129 73255 77137 74243 72191 76471 83017 92351 91974 82461 76131 74426 80117 87726 91777 90061
9332 90061 88006 94008 96391 93463 92300 92957 91779 89165 85030 85928 83298 83436 81442 78261 78375 83027
9316 83027 77324 80090 83638 82276 79503 79680 83159 77315 70944 71640 66872 61855 75813 85992 86820
9301 86820 87524 89811 93165 92323 90751 89938 82802 79425 78075 85663 86675 84140 84436 81697 78687 80666
9285 80666 86804 91021 91927 95867 100568 101857 91360 87751 83019 75722 74954 77551 84081 86500 88397
9270H8397l18K062m593K026K379k233m402K997R399R60L053J979J189k059m239
9255I6597l758M761M535Q219k458p375j311n362l021n447R08L439M730P274N042
9240A06773J522O38O092J501q56j30M698N280k549p290k840M50n571n913J552
9225A03357N222M429j344q72l570L061J7240J2027l216M16M586P258j270k806
9211A44518J044O70o37r475k652p236M97O551K789N622Q217L412o897m185q38
9196A41400K826N831R675J622n758k165Q709O25n489J26N163K201k159r74J138
9181A62771P854J0482Q620J1753M007o47q831m917n431k051p243n367l24n792
9167A64884o10L781r33q97l707p63m491k892Q630Q001j552K102K785n778l695
$$ plain form
9270 88397 88079 90141 85548 87574 89953 87720 83318 86315 95714 96674 99727 101706 102895 100836 96597
9255 96597 92839 97600 102135 110354 107896 100521 99210 93848 90827 85380 86288 89727 94457 101731 106773
9240 106773 108295 108933 115025 116526 115670 115540 120238 125518 122969 115679 112839 113289 107718 101805 103357
9225 103357 108579 113008 111664 110792 107222 110283 127523 139550 136334 136750 141336 148594 147324 144518
9211 144518 145562 146232 145595 136120 133468 126232 126729 133280 136069 141691 149908 153320 146423 142238 141400
9196 141400 144226 150057 159732 161354 155596 153431 162140 162765 157276 157402 162565 164766 162607 161633 162771
9181 162771 170625 181107 189727 201480 205487 204840 196009 191092 185661 183610 176367 171000 170676 164884
9167 164884 164274 168055 167122 166225 162518 161755 157264 154372 163002 171003 169451 171553 174338 168560 164865
9152A64865o090o922J17N696M55m076m495J06K404M560J670M191J2144N555M916
9137A85096l892p905j043l413q282o012m444p29K195L333k910j347j685M527L659
9122A57148O495J195o247l247j848N57O73j665P350P065l602j392m277K242m902
9107A55545J952L721M546J810k842n085N524L094j315j23K928k44L459r69k175
9092A69826K50l03O093O09K306j606k810L383J377j601k217j543N83Q811N431
9077A88589n905n857J253L468K671L51K74N803O224j290j226n588k70p76J92n34
9061A87379J186N312J104o589k030N172M181P016N289j452l632J19L404o38L544
9046B09365k107M248J3037O888j626q553k279L334m34L38j439p35O695m417m059
$$ plain form
9152 164865 158775 151853 151970 157666 158121 154045 149550 149656 152060 156620 158290 162481 174625 180180 185096
9137 185096 181204 173299 172256 168843 160561 154549 150105 149376 151571 154904 151994 150647 148962 153489 157148
9122 157148 163643 164838 158591 155344 153496 154053 154726 153061 160411 167476 163874 162482 158205 160447 155545
9107 155545 157497 161218 165764 167574 164732 159647 165171 168265 166950 166827 169755 169511 172970 172001 169826
9092 169826 170076 169773 175866 176475 178781 177175 174365 177748 179125 177524 175307 173764 174347 183158 188589
9077 188589 182684 176827 178080 181548 184219 184570 184844 190647 196871 195581 194355 188767 188497 187721 187913 187379
9061 187379 188565 193877 194981 188392 186362 191534 195715 202731 208020 206568 202936 203055 206459 205821 209365
9046 209365 207258 211506 224543 231431 229805 221252 218973 222307 221873 222211 220772 220037 226732 222315 218256
9031B18256P783M013n981K551J801N191J387J891O29K217Q39k759o305J796P146
9016B40455K426R03K490k153l395L797m523L229M160l05K519M627k989M27Q004
9001B59672K766l494K553N80N180M594P524Q69j014p390P036p86m825k501p5J402
8985B72091p14J083m62J1279Q180J918j691J753O7m3m20o210R63N309L043n654
8969B90492j971j695J112P252Q790K731J15l216L847L003L778L149J897L593J030
8954C23907J330J878r19L346P47L358L91J468m339j904K886R547M358N10k601
8939C43963o05P474R804K347J03k768K873M353Q557L727n772o228L507N957O029
8924C83321L025O83m737j018M386n09N468O893K793m965r46J0545N120k798l414
$$ plain form
9031 218256 226039 230052 224071 226622 228423 233614 235001 236892 237521 239738 240577 237818 231513 233309 240455
9016 240455 242881 243784 246274 244121 240726 244523 240000 243229 247389 247084 249603 254230 251241 251668 259672
9001 259672 262438 258944 261497 262077 267257 271851 279375 280244 279230 271840 278876 278090 273265 270764 270689 272091
8985 272091 271377 272460 271998 283277 291457 293375 291684 293437 293504 293461 293041 286831 287794 293103 296146 290492
8969 290492 288521 286826 287938 295190 303980 306711 306826 303610 307457 310460 314238 317387 319284 322877 323907
8954 323907 325237 327115 326196 329542 330289 333647 334038 335506 331167 329263 332149 341696 346054 346564 343963
8939 343963 343358 350832 360636 362983 363086 360318 363191 367544 376101 379828 374056 367828 371335 377292 383321
8924 383321 386346 387029 382292 381274 385660 385151 390619 397512 400305 395340 394394 404939 410059 407261 403847
8909D03847O981N860J10J371J780J24J872K745q01N407R85J45P843L589M208M
8893D46070N015M330O65P947J0425J0716O64k712J305O959L975J049N032J880
8879E03320M21N341M92l216k38N121Q113Q626N138O7Q008P966O421Q627J2494
8864E76701J9425L1576J8618K1872L2697K3935R167q157j1377j4966j1348j6745
8852F71398j2392l576J131j255L31m316k105M151L808R146L507J800o13P005R467
8837F87487Q542J1941J794j194K954K200K0791J9487J2195P884O547Q183J1106
8824G99917N800K774M282J1204K2496K4895J8336L1110M8406N6537P5353O5198
8812A166308L7629P277j7833j6514k6507j3856r88K1117J5428K1592M4700N2625
$$ plain form
8909 403847 410828 416688 416798 418169 419949 420073 421945 424690 423889 429296 430281 430426 438269 441858 446066 446070
8893 446070 451085 455415 456080 464027 474452 485168 485832 483120 484425 491384 495359 496408 501440 503320
8879 503320 503741 509082 509574 506358 506120 511241 519354 527980 533118 533185 541193 549159 555580 564207 576701
8864 576701 596126 627702 646320 668192 700889 724824 733991 725834 714457 699491 688143 671398
8852 671398 659006 655430 656561 655306 655637 651321 649216 653367 657175 666321 669828 671628 671015 678020 687487
8837 687487 696029 707970 709764 708570 711524 713724 734515 754002 766197 774081 780628 788811 799917
8824 799917 805717 808491 812773 823977 846473 871368 889704 920814 969220 1025757 1101110 1166308
8812 1166308 1203937 1211214 1193381 1176867 1150360 1136504 1135516 1156633 1172061 1193653 1238353 1290978
8800A290978O8272R4363J36513J99343K89539M16876N48990N44605L04783q590
8790C885672k80531l98988m19956m05444l21970k28225j55283j12141q1933o3303
8780A417898m4876k6769k6423k1652q969q225q648m362R85P063R221J2601L0854
8767A328698L5418K2495N294j1806j3046p561m324p764k759M758P451M365O696
8754A367915R146J5658J7066N942o48J0854J8098J8831J9208R303P433O535J2548
8741A517889K1194K4063K2566K1314J4564K1112K0387J2763J4183K0038J9733
8730A729806K4136J8171J6549K0447K5673K2046K2802K3376K1151K7710L2536
8719A984403K9253K6753K2630K4548J8253L3678L5977L4322L5568L0489K4274
$$ plain form
8800 1290978 1359250 1453613 1590126 1789469 2079008 2495884 3044874 3589479 3894262 3885672
8790 3885672 3605141 3206153 2786197 2380753 2058783 1830558 1675275 1563134 1481201 1417898
8780 1417898 1373022 1346253 1319830 1298178 1289209 1280984 1272336 1267974 1268959 1276022 1285243 1297844 1328698
8767 1328698 1364116 1386611 1391905 1380099 1367053 1359492 1355168 1347404 1344645 1349403 1356854 1361219 1367915
8754 1367915 1377061 1392719 1409785 1415727 1415079 1425933 1444031 1462862 1482070 1491373 1498806 1505341 1517889
8741 1517889 1539083 1563146 1585712 1607026 1621590 1642702 1663089 1675852 1690035 1710073 1729806
8730 1729806 1753942 1772113 1788662 1809109 1834782 1856828 1879630 1903006 1924157 1951867 1984403
8719 1984403 2013656 2040409 2063039 2087587 2105840 2139518 2175495 2209817 2245385 2275874 2300148
8708B300148K2838L0292L7545L3387L6532L4958L7343L7691M0187L8421M2112
8697B691454L9111K7069L6620M8104M8797M8162N0240M4096M4600M9282N1846
8686C179381N0589N0139N8479N9282N0448N2448N3983N9156O0707O5904P3838
8675C814354P0681O4167O8586P1675Q0290P6443P9605P5856Q4328R1935Q3154
8664D661074Q1557R5377R1861J02950R9703Q9079R5889J01979J10945J10848J14229
8653E755491J18674J25972J21416J29043J36019J34066J39116J46915J49519J48390
8643G104621J54480J53477J66804J71913J72531J70036J75877J88930J93845J97195
8633H849709K08355K18405K19604K20970K26078K27440K36182K49150K48697K57967
$$ plain form
8708 2300148 2322986 2353278 2390823 2424210 2460742 2495700 2533043 2570734 2610921 2649342 2691454
8697 2691454 2730565 2757634 2794254 2842358 2891155 2939317 2989557 3033653 3078253 3127535 3179381
8686 3179381 3229970 3280109 3338588 3397870 3448318 3500766 3554749 3613905 3674612 3740516 3814354
8675 3814354 3885035 3949202 4017788 4089463 4169753 4246196 4325801 4401657 4485985 4577920 4661074
8664 4661074 4742631 4838008 4929869 5032819 5132522 5221601 5317490 5419469 5530414 5641262 5755491
8653 5755491 5874165 6000137 6121553 6250596 6386615 6520681 6659797 6806712 6956231 7104621
8643 7104621 7259101 7412578 7579382 7751295 7923826 8093862 8269739 8458669 8652514 8849709
8633 8849709 9058064 9276469 9496073 9717043 9943121 10170561 10406743 10655893 10904590 11162557
8623A1162557K65058K71687K72911K84400K85109K90938K97498L07386L09683
8614A3747227L18548L26731L26824L21459L25461L34960L35226L37892L41348
8605A6715676L37946L45906L31857L28496L35158L27110L15061L07363K97402
8596A9641975K94400K80739K72386K50299K36055K12162J98991J82773J63957
8587B1733737J44231J14577Q1105O4681N1664K8204K267k5259n5453q0933j04075
8576B1954746j26252j49486j68146j95807k14538k22801k38259k50334k77123
8567B0112000k83948k93553l07211l12865l20105l31373l38480l40459l42068
8558A7241938l42315l43776l40109l40605l37911l27697l31937l31503l29816
$$ plain form
8623 11162557 11427615 11699302 11972213 12256613 12541722 12832660 13130158 13437544 13747227
8614 13747227 14065775 14392506 14719330 15040789 15366250 15701210 16036436 16374328 16715676
8605 16715676 17053622 17399528 17731385 18059881 18395039 18722149 19037210 19344573 19641975
8596 19641975 19936375 20217114 20489500 20739799 20975854 21188016 21387007 21569780 21733737
8587 21733737 21877968 21992545 22073650 22138331 22189995 22218199 22220466 22195207 22139754 22058821 21954746
8576 21954746 21828494 21679008 21510862 21315055 21100517 20877716 20639457 20389123 20112000
8567 20112000 19828052 19534499 19227288 18914423 18594318 18262945 17924465 17584006 17241938
8558 17241938 16899623 16555847 16215738 15875133 15537222 15209525 14877588 14546085 14216269
8549A4216269l22595l13800l06634l08838k98014k95599k86020k85810k76672
8540A1522287k64296k64837k61342k49098k41241k37275k37361k25166k10175
8531I331496k01908k11836k02137j93186j90552j77164j79680j72582j60114j66420
8521G475917j58109j48594j46508j42745j40809j33390j26463j23645j21229j19677
8511F114748j18183j17271j22591j27423j26345j15639j16140j12408j14419j19112
8501D925217j00714r5776r8174r5297r4562q8943p7201p2184p3664p4534p5115
8490C979053p2509p8635p3243o1595o1019o7029n9879n8492n8834n1440n2624
8479C283754n8060n2293n9416n0672m6724m5940m6568m7255n5177m5640l4091
$$ plain form
8549 14216269 13893674 13579874 13273240 12964402 12666388 12370789 12084769 11798959 11522287
8540 11522287 11257991 10993154 10731812 10482714 10241473 10004198 9766837 9541671 9331496
8531 9331496 9129588 8917752 8715615 8522429 8331877 8154713 7975033 7802451 7642337 7475917
8521 7475917 7317808 7169214 7022706 6879961 6739152 6605762 6479299 6355654 6234425 6114748
8511 6114748 5996565 5879294 5756703 5629280 5502935 5387296 5271156 5158748 5044329 4925217
8501 4925217 4824503 4728727 4630553 4535256 4440694 4351751 4274550 4202366 4128702 4054168 3979053
8490 3979053 3906544 3827909 3754666 3693071 3632052 3565023 3505144 3446652 3387818 3336378 3283754
8479 3283754 3225694 3173401 3113985 3063313 3016589 2970649 2924081 2876826 2821649 2776009 2741918
8468B741918l9583m7410m4254l9264l3928l9335l8951l1454l9243l3393k4065
8457B331038k9505l6205m0712l5846k5801l1165l5061k6843k3436k3544l2932
8446A989988l1913k7362k1041j8248k8225k5821k1039k0076k4498k2412k2633
8435A726720j4103j4839j9616k3965k4163k7125j5899k2144k7093k3881j1800
8424A502092j3808j4325j1166j7155j0732p116r823j2240j1543j1132k1942k0526
8412A340584k0755j9350k2339j3315j1135r907j7326j4822j4691q345o98j66j7567
8399A170168k3721j4051j4860j2168p205r958j4491r208j2820j6376j0762p984
8387A016564o561j7355j9317j1760j177j2750k0686j0252o228o063l146j0109
$$ plain form
8468 2741918 2702335 2654925 2610671 2571407 2537479 2498144 2459193 2427739 2388496 2355103 2331038
8457 2331038 2301533 2265328 2224616 2188770 2162969 2131804 2096743 2069900 2046464 2022920 1989988
8446 1989988 1958075 1930713 1909672 1891424 1863199 1837378 1816339 1796263 1771765 1749353 1726720
8435 1726720 1712617 1697778 1678162 1654197 1630034 1602909 1587010 1564866 1537773 1513892 1502092
8424 1502092 1488284 1473959 1462793 1445638 1434906 1427790 1417967 1405727 1394184 1383052 1361110 1340584
8412 1340584 1319829 1300479 1278140 1264825 1253690 1243783 1226457 1211635 1196944 1188599 1187901 1187735 1170168
8399 1170168 1146447 1132396 1117536 1105368 1098163 1088205 1073714 1064506 1051686 1035310 1024548 1016564
8387 1016564 1010003 992648 973331 961571 960394 947644 926958 916706 910478 904415 901269 891160
8375H91160j1609n940j901m457r645j1975n029o218o547q575p269p292j4766r875
8361G80062p120o058o009p553m959j505o739j0501j4661m051l516q221K022l918
8347F97273p473p444p662r877j1254l124l3J354k858k818p53l565n200p487j0784
8332F18295l219o471p169p243o194n087l409J683o634r882p277k307o403q939
8318E39744k781J969q672k214l62n551m118j2026L04k601q315m590n372o895m52
8303D78068J256q47j1215n535p11o816n018J066j712k084n011q190j2186K869
8289D23934N608m16n700p551r93k210K867M01q588r425j960m196n951j517j4K76
8273C84565J78o167l667j73K182p007p620O955R410l009j0488j984p454K45k762
$$ plain form
8375 891160 879551 873611 871710 867253 857608 845633 840604 834386 827839 819264 811995 804703 789937 780062
8361 780062 772942 766884 760875 753322 748363 746858 740119 729618 714957 710906 707390 699169 701191 697273
8347 697273 689800 682356 674694 664817 653563 650439 650406 651760 648902 646084 645331 641766 636566 629079 618295
8332 618295 615076 608605 601436 594193 587999 582912 579503 581186 574552 564670 557393 555086 548683 539744
8318 539744 536963 538932 530260 528046 527684 522133 518015 505989 506293 503692 495377 490787 485415 478520 478068
8303 478068 479324 478477 467262 461727 461016 454200 449182 450248 448536 446452 441441 433251 421065 423934
8289 423934 429542 429126 423426 415875 414882 412672 415539 415940 407352 397927 395967 391771 385820 384303 384289 384565
8273 384565 384743 378576 374909 374736 376918 369911 362291 369246 378656 375647 365159 363175 355721 355966 353204
8258C53204j0948j1800q24L156K274k56J337L039j00o599k716J642l110m515m968
8243C18816l410j380M849j975p084j460o35R84j73k860n901j2245q128L306J520
8228B84224J945l4M804J898Q89j8521l224M865J025K735L771j127o469p314o078
8213B63389M987K137j960k076m412m329M93N052o45n437O07k842n767k072J101
8198B48226R361J565k483k779l387J891k990o366k303n3L732k065o780o396o171
8183B23002o628O808m96J216l515J442O55O024J082r553n549L980J870K126j645
8168B20819m267K710L221p750m359K84l928j815j758m053p75K329m222j99k677
8153A93560m087j82N944M207p829p252L777m457j821R16J444k568MJ0825R377
$$ plain form
8258 353204 342256 330456 329632 332788 335062 334806 336143 339182 339082 332483 329767 331409 328299 323784 318816
8243 318816 315406 314026 318875 316900 309816 308356 307721 308705 308532 305672 299771 287526 279398 282704 284224
8228 284224 286169 286135 290939 292837 293726 275205 271981 276846 277871 280606 284377 283250 276781 269467 263389
8213 263389 268376 270513 268553 266477 262065 257736 258229 263281 262636 257199 257806 254964 249197 247125 248226
8198 248226 257587 259152 256669 253890 250503 252394 249404 243038 240735 240682 244414 242349 235569 229173 223002
8183 223002 216374 223182 222686 223902 220387 221829 222484 228508 229590 220037 214488 218468 220338 222464 220819
8168 220819 216552 219262 222483 214733 210374 210658 206730 204915 203157 199104 198329 200658 196436 196237 193560
8153 193560 189473 189291 195235 199442 191613 184361 188138 183681 181860 182776 184220 181652 181656 192481 201858
8138B01858j166m549q546o27Q205k972j0759j211j563l824L560J065j289j106
8124A77076n28o994m233L397k045l652N212O090K1k41p518p376m453J806j174
8109A55388m891P03K096N853M83o011n125j351j774J426L040q99O0j035k023J623
8093A47563k574r39m41P942O993m999q643m340M842O951m55j4181n017M720K259
8078A39681K877l597K27k69L806O710m892J80K709l247l379m232j246r93J916
8063A36251j296l306J268N520M303N910O469q25o712k13k956k588J614o838j1231
8048A25370K301L621L301J838o583j0152K614P853n914q22q08r692j96M616j784
8033A15563L967R380m017m222q00p508q464M079k042K008J236K429l91K666O320
$$ plain form
8138 201858 200692 196143 187597 186970 195175 192203 181444 180233 178670 174846 178406 179471 178182 177076
8124 177076 176548 169554 165321 168718 166673 163021 168233 174323 174344 174103 166585 159209 154756 156562 155388
8109 155388 150497 151200 153296 159149 159632 153621 148496 147145 145371 146797 149837 148938 148998 147963 145940 147563
8093 147563 144989 144050 143609 151551 158544 153545 144902 140562 145404 152355 151900 137719 132702 137422 139681
8078 139681 142558 138961 139188 138919 142725 149435 144543 144723 147432 144185 140806 136574 135328 134335 136251
8063 136251 134955 131649 132917 138437 142740 148650 155119 154294 147582 147369 144413 141825 143439 136601 125370
8048 125370 127671 131292 134593 136431 129848 119696 122310 130163 124249 123427 122619 112927 112731 117347 115563
8033 115563 119530 128910 124893 120671 119871 112363 103899 107978 105936 107944 109180 111609 111218 113884 120204
8018A20204m07J743r019J407l989o498J520K08L659J071P051p628j0292o2P081
8003A06049L871m133k766l441k89K285m717o7K92j184n39o96n71J541J63l387
7987I2411j232O49M003n64k059j162j60P30O96M098m10q760p044k061Q861J1146
7971I9142L966j757l793l291k815m635m727M353O932N368M56l34j718m041p166
7956H5940k190J0169K23j0487r11N911L432M222N914o620p175k250R215M426j234
7941I8585o013o466n369J176P095N569m494m576L168k178J20M063j292j660p93
7926H6935m459l518J972R604K830j176J640j860j832J271N101L203m090j663n109
7911H8849J857N829m63l267m378m299l918r02J347J120j450p97O319L114n818
$$ plain form
8018 120204 119797 121540 112521 113928 109939 103441 104961 105169 108828 109899 116950 109322 99030 98968 106049
8003 106049 109920 105787 103021 99580 99291 101576 96859 96792 97084 95900 95361 94665 94094 95635 95798 92411
7987 92411 91179 91828 95831 95267 93208 92046 91886 92616 93312 97410 97000 88240 81196 79135 87996 99142
7971 99142 103108 101351 97558 94267 91452 86817 82090 86443 93375 98743 99199 98865 97147 93106 85940
7956 85940 83750 93919 94142 83655 82744 88655 92087 96309 102223 95603 88428 86178 95393 99819 98585
7941 98585 92572 86106 80737 81913 89008 94577 90083 85507 88675 86497 86617 90680 89388 87728 86935
7926 86935 82476 78958 80930 90534 93364 92188 93828 91968 90136 91407 96508 99711 95621 93958 88849
7911 88849 90706 96535 96072 92805 88427 84128 80210 79308 80655 81775 80325 79528 85847 88961 83143
7896H3143n990L69J112k138j164j208L675j141k347O553Q8J942n057j0612L480
7881G0705L660L175m937n256M517M959J0q379K260N308k530o449N010P07p168
7866F5592r12N642P526o272r626N83M244O83p99k612j046k766J435J159l789l157
7850E5885J205N922j475j294N253K258n965o054m040J644P224k578L060R262q244
7835F2063j0638o139K982r18M073J905M367M325J434K235k049q608j369l095l770
7820D6798J920j911k667k306n008j292P180P192M57m12K932M556J3303j600k374
7805F6768n508j001m075k695N25j798j236o476k220j754N734J1352L891o678k266
7790E2563l308j545k551n042J153n060L595R043K152j150j308J051O605j725p195
$$ plain form
7896 83143 77153 77522 78634 76496 75332 74124 77799 76658 74311 80864 80952 82894 77837 67225 70705
7881 70705 74365 77540 72603 67347 71864 76823 76833 68454 70714 76022 73492 67043 72053 72760 65592
7866 65592 64680 70322 77848 71576 61950 62533 66777 67460 66661 64049 63003 60237 61672 62831 59042 55885
7850 55885 57090 63012 61537 60243 65496 67754 61789 55735 51695 53339 60563 57985 61045 70307 62063
7835 62063 51425 45286 48268 47350 51423 53328 57695 62020 63454 65689 63640 55032 53663 50568 46798
7820 46798 48718 46807 44140 41834 36826 35534 42714 49906 50363 49951 52883 57439 70742 69142 66768
7805 66768 61260 60259 56184 53489 54014 52216 50980 44504 42284 40530 46264 57616 61507 54829 52563
7790 52563 49255 47710 45159 40117 41270 36210 39805 48848 51000 49850 48542 49593 56198 54473 47278
7775D7278k546j192o366n120j246R3L05L991N099p11r019j126Q632M884r05M238
7759D6289L099m86m024j336M7k594m151Q91J787k978K608R702J067m048l865M058
7743D6066k110l14P44J914n267k488N499K88N722J195m073N64N831J931q422m433
7727D2647k807m326J337k795n668k676P370O994Q56k993j026L48m668j419R630
7712D0804J599j525l249L8Q76p56L687M404m389l090o94k870K21N890Q00q432
7696C3314m44m290j818O134r83J062K421j024p240n913Q411M880O25k728o486
7681B5921n52O61J798P77L720n602L999J796M602P815q176k062P95m027J484L7
7665C2986l797J924M050M880l93J70n399r51J788j327l315o522j183l577J072
$$ plain form
7775 47278 44732 43540 37174 32054 30808 30901 31206 35197 40296 39585 30566 29440 38072 42956 42051 46289
7759 46289 49388 48902 44878 43542 43589 40995 36844 37735 39522 36544 39152 48854 49921 45873 42008 46066
7743 46066 43956 43642 44386 46300 41033 38545 44044 44332 50054 51249 47176 47740 53571 55502 47080 42647
7727 42647 39840 35514 36851 34056 28388 25712 33082 40076 40932 37939 36913 37261 32593 31174 40804
7712 40804 42403 40878 37629 37667 38543 37787 41474 45878 41489 38399 37705 34835 35056 40946 41746 33314
7696 33314 32870 28580 26762 32896 31913 32975 35396 34372 27132 21219 29630 34510 35135 32407 25921
7681 25921 25369 26030 27828 28605 32325 26723 30722 32518 37120 44935 36759 34697 35492 31465 32949 32986
7665 32986 29189 31113 35163 40043 39650 39820 34421 33470 35258 33931 30616 24094 22911 19334 20406
7650B0406m15o415M058J663K322M163n428j160j932J787J319P42L137P68k872
7635B2143J173J307M278L969j860n437J158j97M047K020m70l456J893l099j594
7620B5875l364L360k163R27O16k402J051k629n736M179M446o02l860l836k335
7605A3527l89l526J0101O329j459j926m317m41Q392O63l805l312p869j163L600
7590A4405j058N57M218K058P1p31o183J547P011k05j980r6n67j446j216l040j137
7573A2208j42J410L928l412n321l21N805m675K688N617k869o4j78M536J702K754
7557B3666k036l55J760M139p04k779j243m502k54J746o47n294k268L868l455J57
7541A1799K747k450L119L696N529n23m850l45L70J165M216o331k039r76j104k598
$$ plain form
7650 20406 19991 13576 17634 19297 21619 25782 20354 19194 17262 19049 20368 21110 24247 25015 22143
7635 22143 23316 24623 28901 32870 31010 25573 26731 26534 30581 32601 32131 28675 30568 27469 25875
7620 25875 22511 25871 23708 24635 25251 22849 23900 21271 15535 19714 24160 23558 19698 15862 13527
7605 13527 13138 9612 19713 26042 24583 22657 18340 17899 26291 26954 23149 19837 11968 10805 14405
7590 14405 13347 13904 18122 20180 20251 19520 13337 14884 21895 21690 19710 19614 19047 17601 16385 13345 12208
7573 12208 12066 13476 17404 13992 8671 8350 14155 9480 12168 17785 14916 14852 14674 19210 20912 23666
7557 23666 21630 21275 23035 27174 26470 23691 22448 17946 17692 19438 18791 13497 11229 15097 11642 11799
7541 11799 14546 12096 15215 18911 24440 23917 19067 18722 19092 20257 24473 18142 16103 15127 14023 11425
7525A1425k619J526K815J549l492K589O944k308K601m574o7l303l54O41R97P114
7509B1484L768N466k630j0096m884Q047O203M084m523p16l630K56J84k285m352
7494A6376Q12O596J21n136k569m670l954j780Q756K609l11m021n340M705N455
7479A7649l322m271K260L037L93P258n30J938J442o258m484p797l884K833L142
7464I406p57J138L736J544m107j852l29K345P154K200l949l34L890N351o578l766
7448A5092N808R581n120l410p09L041q6l936n714k437p97K255Q027Q05j331k309
7432A8760l054K893M84q499n337K797M457N074j407N018q61k255p570r49K972
7417A2523M169j987j312k914l51K122n717j947l57Q386R479m462m350l519L68
$$ plain form
7525 11425 8806 10332 13147 14696 11204 13793 20737 18429 21030 16456 16389 13086 12732 13373 14370 21484
7509 21484 25252 30718 28088 17992 13108 21155 27358 31442 26919 26203 22573 22829 23013 20728 16376
7494 16376 17188 23784 23905 18769 16200 11530 7576 5796 14552 17161 16850 12829 7489 12194 17649
7479 17649 14327 10056 12316 15353 15746 23004 22474 24412 25854 19596 15112 7315 3431 6264 9406
7464 9406 8649 9787 13523 15067 10960 9108 8779 11124 18278 20478 16529 16195 20085 25436 18858 15092
7448 15092 20900 30481 25361 21951 21242 24283 24197 20261 14547 12110 11313 13568 21595 22400 21069 18760
7432 18760 15706 18599 19083 10584 5247 8044 12501 17575 16168 21186 20325 18070 10500 9551 12523
7417 12523 16692 14705 13393 10479 10128 12250 6533 4586 4229 12615 22094 17632 13282 9763 10131
7402A0131Q52P32p67M230O593m820m852k854o142M582J1851J517o429p645j755
7387E224P87j940K597L793k610m097J957P957k527q6L84o53L432N183P13m238
7371A5876m917N89k267N71Q6K798L734J898K12n764r261j286K005L459P557N976
7355B1266K291O64m609l239l324Q33k718m65J56M224j810k049L681J956n200j0989
7339F68n894L876L216J36J223l55j204m895l104N677R516r99K90R79L301j960
7323A0471l77K905l927K322k840M37n38O46m443l565L904K703j430o826l382M66
7307c474R204N8r61j636p79j996L742M338L16j287R059L562m444l278m340K747
7291A0831K889j573m244j139J852K68k769J880L958Q527n151p893n972J088K711
$$ plain form
7402 10131 10983 11715 10948 15178 21771 16951 12099 9245 3103 7685 19536 21053 14624 6979 5224
7387 5224 6011 4071 6668 10461 7851 3754 5711 13668 11141 11055 11439 10786 14218 19401 20114 15876
7371 15876 10959 11548 9281 9852 9938 12736 16470 18368 18580 12816 3555 2269 4274 7733 15290 21266
7355 21266 23557 24221 19612 16373 13049 13882 11164 10699 10855 15079 13269 11220 14901 16857 11657 668
7339 668 -5226 -1350 1866 2002 3225 2870 1666 -3229 -6333 -656 8860 7861 8151 9130 12431 10471
7323 10471 10094 12999 9072 11394 8554 8991 8453 9099 4656 1091 4995 7698 6268 -558 -3940 -3474
7307 -3474 5730 5788 4827 3191 2412 416 4158 8496 8812 7525 16584 20146 15702 12424 8084 10831
7291 10831 13720 12147 7903 6764 8616 8884 6115 7995 11953 20480 15329 7436 1464 2552 5263
7276E263k437l439J214p473n73P421j429J98M817M75L088j96j600q83R55L374
7260H775l554N1n419j955O663J471M760L652p605l264Q08j417K42j077m53K106
7244C784N725K972q52n659M266P17L031K251n719l232P42M295J88l239k099L386
7228A0557Q88k515k40j141l16m380j260O013O17n618K229O690J585Q251K709m426
7212A9643J220L11Q837j297k720j194J496J229l427o182n995k337k403l066p324
7197c209k069J0082L51J944k240q753M189Q161K026p167j732m67Q196P34m244
7182E802N98N336K892p661m266o91l362K317M797o263m195J636J180P53P43K435
7166B051k475j143O988M039J765K732n343J740j413j119J235j960l222j158q66
$$ plain form
7276 5263 2826 -613 601 -6872 -7445 -24 -1453 -1255 3562 4037 7125 6929 5329 4446 5401 8775
7260 8775 5221 5272 -147 -2102 4561 6032 10792 14444 6839 3575 4383 2966 3208 2131 1678 3784
7244 3784 9509 12481 11629 5970 10236 10953 13984 16235 10516 7284 8026 12321 12509 9270 7171 10557
7228 10557 11445 8930 8690 7549 7233 2853 1593 7606 8223 2605 4834 11524 13109 21360 24069 19643
7212 19643 20863 21174 30011 28714 25994 24800 26296 27525 24098 17916 11921 9584 7181 4115 -3209
7197 -3209 -5278 4804 5155 7099 4859 -3894 295 8456 10482 3315 1583 1116 9312 10046 5802
7182 5802 6400 11736 14628 6967 2701 2010 -1352 965 5762 -501 -4696 -3060 -1880 -1127 -384 2051
7166 2051 -424 -1567 5421 9460 11225 13957 8614 10354 8941 7822 9057 7097 3875 2717 1851
7151A851L670j416l678k341m695j569L331P994j344p416o144M927N182l670N0
7136e268J049L866M695L609P85k366k54m024o843l186O727O083P713J1j705j039
7120I853j390J037J735j184n259n735l801J172K60K582m335L911Q820J118r719
7105i35K547J782O34k779k466k47j011P037N680n281p216p419L686K002jL209
7089g78L361K826k913l801L638j018j624r56k536j627J1690M929m147n539k984
7074a479J272k733l06J403j441J681k684p621L627L986L333J842k215n732r770
7059a6837m342O473R523M030Q126K343m224n368j705J275L6m411m801j742O401
7044e223m482l832J860M878N623Q99l719o46L582L601j846R34l002l413k04Q46
$$ plain form
7151 1851 5521 4105 427 -1914 -6609 -8178 -4847 3147 1803 -5613 -11757 -6830 -1648 -5318 -5268
7136 -5268 -4219 -353 4342 7951 8736 6370 6116 2092 -4751 -7937 -1210 4873 12586 12597 10892 9853
7120 9853 8463 9500 11235 10051 4792 -943 -4744 -3572 -3312 -730 -5065 -1154 7666 8784 -935
7105 -935 1612 3394 4028 1249 -1217 -1464 -2475 4562 10242 4961 -2255 -9674 -5988 -3986 -3987 -778
7089 -778 2583 5409 2496 -1305 2333 1315 -309 -1265 -3801 -5428 6262 11191 7044 1505 -1479
7074 -1479 -207 -2940 -3246 -1843 -3284 -1603 -4287 -11908 -8281 -4295 -962 880 -1335 -7067 -16837
7059 -16837 -21179 -14706 -5183 -1153 6973 9316 5092 -276 -1981 -706 -670 -5081 -9882 -11624 -5223
7044 -5223 -9705 -13537 -11677 -6799 -1176 -277 -3996 -4642 -1060 2541 695 1629 -1373 -4786 -4990 -4144
7028d144M572j728p69M02J18k377J926P148N664J934l316l715k043J493j176o107
7012b118l313J021M461j34m78m608K057N659M966p155k450L261j870m579L94q04
6996e690o505K482Q194N22M72J337J0026Q346k527p367o084l257L190K670K800
6981H609l760j380J046k948J583m413j518l857L74j411J498R500k35p11m565l701
6965e889J31R41N378j065j920K10K669J671M144K360K831M238j342l010J563J751
6949A4661l313o986l316k200j0461K657O093J75Q16j321O77K784J470k148m10
6934h22m466L590k079k145K35N324K453k959m802l285O132N451k986K130L395
6919E166q488n674L331k986r719k250N743P378j203K456L052K639m439l032M025
$$ plain form
7028 -4144 428 -1300 -2069 -1667 -1549 -3926 -2000 5148 10812 12746 9430 5715 3672 5165 3989 -2118
7012 -2118 -5431 -4410 51 -83 -561 -5169 -3112 2547 7513 358 -2092 1169 -701 -5280 -4886 -5690
6996 -5690 -12195 -9713 -1519 -997 -525 812 10838 19184 16657 9290 3206 -51 3139 5809 8609
6981 8609 4849 3469 4515 1567 3150 -1263 -2781 -6638 -6264 -7675 -6177 3323 3088 2377 -2188 -5889
6965 -5889 -5758 -4817 561 -504 -2424 -2214 455 2126 6270 8630 11461 15699 14357 11347 12910 14661
6949 14661 11348 4362 1046 -1154 -11615 -8958 -2865 -2690 -1874 -3195 -2518 266 1736 -412 -822
6934 -822 -5288 -1698 -3777 -5922 -5687 -363 2090 -869 -5671 -8956 -2824 2627 -359 1771 5166
6919 5166 -3322 -8996 -5665 -8651 -18370 -20620 -14877 -7499 -8702 -6246 -3194 -555 -4994 -8026 -4001
6904d001M737N611n21k198l504R80N505j919m468l27n097k980L147j775j744M051
6888d503j097L146O689Q210p163o216M826J48j086Q311M28n501m571m111o02m944
6872h036Q53O211k425J49M256K304K263J623j715l447o486m961L327K677L186
6857b21j619n245j020K599N757l236o30L808N407k150l650j997q728r97O469n89
6841f042k88P721P589K466o812k090o862K821K32J465K330l427j05l0j584l308
6825e924M370L113k230m708k178M439J111L452K516l558o914k648r5M337N589
6810F72K492O33l280n186j381K461J243q314M494J1387j925j671j492L007J453
6795D593o399p96O000L157k019Q48j556n598j857Q454L035o789L043K447n209
$$ plain form
6904 -4001 736 6347 5826 3628 124 1104 6609 4690 222 -105 -5202 -8182 -5035 -6810 -8554 -4503
6888 -4503 -5600 -2454 4235 12445 5282 -934 3892 4040 2954 11265 11693 6192 1621 -2490 -3092 -8036
6872 -8036 -7183 -972 -3397 -3248 1008 3312 5575 7198 5483 2036 -4450 -9411 -6084 -3407 -221
6857 -221 -1840 -7085 -8105 -5506 251 -2985 -3615 193 5600 3450 -200 -2197 -10925 -11922 -5453 -6042
6841 -6042 -6330 1391 8980 11446 4634 2544 -4318 -1497 -1265 200 2530 -897 -1002 -1032 -2616 -5924
6825 -5924 -1554 1559 -671 -5379 -7557 -3118 -2007 1445 3961 403 -6511 -9159 -9254 -4917 672
6810 672 3164 3797 517 -4669 -6050 -3589 -2346 -10660 -6166 5221 3296 1625 133 3140 4593
6795 4593 -1806 -2602 3398 6555 4536 5384 3828 -1770 -3627 4827 7862 1073 4116 6563 1354
6780A354k443k600J735l371N407Q01n300l513Q12K43k617k946K58Q423L451M307
6764D001M117j609N056L828o105r619l129Q265J5324J2905O335M268p108n629
6750C0900q226n179p162k993J728j988l149j034l187j226N082N351J600n412L28
6735E433n493l395k213O593J063K449J1798j978m353j286J44R201J052k058k35
6720A6722m991n346k004k155j422q37j540k716N048M441K851k626k268K454M23
6705F034q162k541P807m094l358K929o76l06r98j151K914m39j214k051J957L442
6689I3M383O694n614o976k489k120L243j886m382k266R438O044l406l024m900
6674g168k986N446J865N678J079o316j193K277M656k078k809L153R18m040j798
$$ plain form
6780 1354 -1089 -3689 -1954 -5325 82 883 -4417 -7930 -7118 -6875 -9492 -12438 -12180 -3757 -306 4001
6764 4001 8118 6509 11565 15393 9288 -331 -3460 4805 20129 33034 39369 43637 36529 30900
6750 30900 22674 17495 10333 7340 9068 7080 3931 2897 -290 -1516 3566 8917 10517 5105 5433
6735 5433 -60 -3455 -5668 925 1988 4437 16235 14257 9904 8618 8762 17963 19015 16957 16722
6720 16722 11731 6385 4381 2226 804 -33 -1573 -4289 759 5200 8051 5425 3157 5611 6034
6705 6034 -2128 -4669 3138 -956 -4314 -1385 -2061 -2367 -3365 -4516 -1602 -2041 -3255 -5306 -3349 93
6689 93 4476 11170 5556 -1420 -3909 -6029 -2786 -4672 -9054 -11320 -1882 4162 756 -2268 -7168
6674 -7168 -10154 -4708 -2843 2835 3914 -2402 -3595 -1318 3338 1260 -1549 1604 2522 -1518 -3316
6659c316n248l457J195l753m14J200K207o74J836R24L612l75m100m92J2808Q70
6643B823o313p500K763j055K896L216j856M56R85k364q424M044M708N810L708
6628C897K912M959p180j2552o418m048l883M53L732L555M711j910J176N480K853
6613b263J124M098j948n485j983P677j31j911j836j812K158j318o82J510J196
6598a606J394k038l586m004k748N303M718q22m751k305K864J305n14K683K753
6583a354q846l963n736q08M242O490j795M749M328L410j511k04m577N58j582L250
6567c349R325J449l881M403N16p052m204l300k111L28J948k732L680P376J057
6552C453k128M558K313n117p084j863L702M19j577r97m142J228J749o90l045L214
$$ plain form
6659 -3316 -8564 -12021 -10826 -14579 -14993 -13793 -11586 -12260 -10424 -9500 -5888 -6263 -10363 -10855 1953 2823
6643 2823 -3490 -10990 -8227 -9282 -6386 -3170 -5026 -4570 -3585 -5949 -14373 -10329 -5621 189 3897
6628 3897 6809 11768 4588 -7964 -14382 -18430 -22313 -21860 -18128 -14573 -9862 -11772 -10596 -5116 -2263
6613 -2263 -1139 2959 1011 -4474 -6457 1220 1089 -822 -2658 -4470 -2312 -3630 -4312 -2802 -1606
6598 -1606 -212 -2250 -5836 -9840 -12588 -7285 -2567 -3389 -8140 -10445 -7581 -6276 -6790 -4107 -1354
6583 -1354 -10200 -14163 -19899 -20707 -16465 -9975 -11770 -7021 -2693 717 -794 -998 -5575 -5017 -6599 -3349
6567 -3349 5976 7425 3544 7947 8463 1411 -2793 -6093 -8204 -7876 -5928 -8660 -4980 2396 3453
6552 3453 1325 5883 8196 3079 -4005 -5868 -2166 -1747 -3324 -4321 -8463 -7235 -5486 -6176 -9221 -6007
6536f007K180L974L262l530k275M03J353L841L531l685o854m781M238K628K94
6521a428K664j714l559k648L544N91n652L039q80l530l429M508k228o822N587
6506a1957J188m769k500Q915O796M488m891m345n925l491N225L164J081k140K325
6491f836N208M324L846m171m904k84N545p71m961m982k566O949m770k175K193
6476h355K580M360j460M020j699j1000n0K976j338M746J323l078Q40O482K715
6461C062o104k313O880o26m018n64j636j53N795Q73l687r91L214j133p500r15
6445i816Q412o081m574M180O878L727M96l87N91K774K529L414o63n142j950J247
6429E635J080J933o812L04K626p799J556J0198O807j402q722n805k612M643O943
$$ plain form
6536 -6007 -3827 147 3409 -121 -2396 -1993 -640 3201 6732 3047 -3807 -8588 -4350 -1722 -1428
6521 -1428 1236 -478 -4037 -6685 -3141 -2550 -8202 -5163 -6043 -9573 -13002 -8494 -10722 -17544 -11957
6506 -11957 -10769 -15538 -18038 -9123 -2327 2161 -2730 -7075 -13000 -16491 -11266 -8102 -7021 -9161 -6836
6491 -6836 -1628 2696 6542 2371 -2533 -2817 2728 1957 -3004 -7986 -10552 -3603 -8373 -10548 -8355
6476 -8355 -5775 -1415 -2875 1145 -554 -11554 -11604 -8628 -9966 -5220 -3897 -6975 -6135 347 3062
6461 3062 -3042 -5355 1525 899 -3119 -3683 -5319 -5472 323 1196 -2491 -3482 -268 -1401 -8901 -9816
6445 -9816 -1404 -7485 -12059 -7879 -1001 2726 3222 2835 3426 6200 8729 12143 11480 6338 4388 5635
6429 5635 6715 8648 1836 2140 4766 -3033 -1477 8721 15528 14126 5404 -401 -3013 1630 8573
6414H573L19r268r899j170J555J100K125M614l819l856M97Q4K466o50K066m218
6398i481k298O763M451K372N246M79l400o788k65q271m504L220J169l078O026
6383h359M484N42k08r9L039J617J572L690J292K968n152m501J653o57o43j100
6367A38J149J161m426O10L665p225j0330k293N806P288O398L855j152j984N554
6352H214O96o089j615K672j642r146l561j022M311L860j152m720l348M185K176
6337f181R96n195p50J1172j891k576M141j062k559k257Q87j939n30k874J800K294
6321f524p085j597M417K340Q267Q86j0165j912m55N054O290K856J507J162L514
6306H555n973j630n628j960Q321Q694j813m250o64k499M078k058J445m182l716
$$ plain form
6414 8573 8892 -376 -10275 -11445 -9890 -8790 -6665 -2051 -5870 -9726 -9229 -9145 -6679 -7329 -5263 -9481
6398 -9481 -11779 -5016 -565 1807 7053 7532 4132 -2656 -2921 -11192 -15696 -12476 -11307 -14385 -8359
6383 -8359 -3875 -3333 -3541 -3640 -601 1016 2588 6278 7570 10538 5386 885 2538 1881 1238 138
6367 138 1287 2448 -1978 -1368 2297 -4928 -15258 -17551 -11745 -4457 1941 5796 4644 2660 8214
6352 8214 8910 2821 1206 3878 2236 -6910 -10471 -11493 -7182 -3322 -4474 -9194 -12542 -8357 -6181
6337 -6181 -5185 -10380 -11130 42 -1849 -4425 -284 -1346 -3905 -6162 -5275 -7214 -7744 -10618 -8818 -6524
6321 -6524 -13609 -15206 -10789 -8449 -182 704 -9461 -11373 -11828 -6774 -484 2372 3879 5041 8555
6306 8555 2582 952 -4676 -6636 1685 10379 8566 4316 3652 1153 5231 3173 4618 436 -3280
6291c280l112K249l61j324l474l696J31O135P923K062o336n121n07ll399m066
6275a6179M711O319N035k367l674J968l355p790k638J477N10P132q94j901N472
6260f174N100o90r93l594k390M980L937n658o56O68R216K199p235m636j355q519
6244a5800k569N111L402P120j352K347L39n464j007N521K627m201r65l137k675
6229a0703J347n809o613K397N459N50q545K61J2179O090M24Q64J549N20J6L522
6213C508j634N239L874k429j05p115L666J852r43Q32k887j845L07l596j530p41
6197c547m440m087L122R40k61l777l285L722J365K323K376O333M152m431k309
6182a804k490M30P235j38o281n326O072O97l176p324m944J1216P139n925J726
$$ plain form
6291 -3280 -6392 -4143 -4504 -5828 -9302 -12998 -12867 -6732 1191 3253 -3083 -8204 -8711 -8714 -12113 -16179
6275 -16179 -11468 -5149 -114 -2481 -6155 -4187 -7542 -15332 -17970 -16493 -15983 -8851 -9745 -11646 -6174
6260 -6174 -1074 -1764 -2757 -6351 -8741 -3761 176 -5482 -6138 -5470 3746 5945 -1290 -5926 -7281 -15800
6244 -15800 -18369 -13258 -9856 -2736 -4088 -1741 -1402 -6866 -7873 -2352 275 -3926 -4891 -8028 -10703
6229 -10703 -9356 -15165 -21778 -19381 -13922 -13372 -21917 -21656 -9477 -3387 -2963 -2099 -550 -30 -14 3508
6213 3508 1874 7113 10987 8558 8453 1338 5004 6856 5913 6745 3858 2013 2320 -1276 -2806 -3547
6197 -3547 -7987 -12074 -8952 -8012 -8273 -12050 -15335 -11613 -10248 -7925 -5549 784 4936 505 -1804
6182 -1804 -4294 -3864 3371 3233 -3048 -8374 -2302 -1605 -4781 -12105 -17049 -5833 1306 -4619 -2893
6167b893M964k514k572M142n923K843J3383Q20j135n007m125J247J116p760m928
6152h342K030J912M403M138j249j553L258K394Q30l140L405J105j878J779q416
6137F76q121q669K826O477J477m246n75k724o32P07M108J400l638R46P569M263
6121A844l097n103M10N242Q257Q80l500n839O60J764m326l822j796J00O482O226
6105D382q785j2707K147J454q40N812N84j792k22N341L117J95M659m957K385m85
6089B88n976m701m603Q816M842P20m836K040J092l212L99N003m809M006J0839
6074I908l856r465k762K706k247j637j216K124K417J382k070K382K827j238p041
6059g786m933l227O6K871M946O284M827o739p998o209L182M893M990k933k867
$$ plain form
6167 -2893 2071 -443 -3015 1127 -4796 -1953 11430 12250 11115 6108 1983 3230 4346 -3414 -8342
6152 -8342 -6312 -4400 3 4141 2892 1339 4597 6991 7821 4681 8086 9191 7313 9092 676
6137 676 -7445 -16114 -13288 -6811 -5334 -9580 -10155 -12879 -13511 -12804 -8696 -7296 -10934 -9988 -2419 1844
6121 1844 -1253 -6356 -5946 -704 7553 8433 4933 -906 -246 1518 -2808 -6630 -8426 -8326 -1844 4382
6105 4382 -4403 -17110 -14963 -13509 -14349 -8537 -7953 -9745 -9967 -4626 -1509 -1314 3345 -1612 773 288
6089 288 -5688 -10389 -14992 -6176 -1334 -614 -5450 -3410 -2318 -5530 -5131 -128 -4937 -931 9908
6074 9908 6052 -3413 -6175 -3469 -5716 -7353 -8569 -6445 -4028 -2646 -4716 -2334 493 -745 -7786
6059 -7786 -12719 -15946 -15880 -13009 -8063 -1779 3048 -3691 -11689 -17898 -14716 -9823 -4833 -7766 -10633
6044a0633L484O272j997J447J838m272j54l91n069R81j59L519N674m22n125m55
6028e462J445J074j080l71O012L146L33j0279k760n47k346l253L51k199k057M873
6012a3120M756o16J202L744K735j429j81Q37r345k325N716Q226L427K672l888
5997B411n704Q71j099k47l619K870L767m605K841M133l172J489n05p08K677K867
5981D267P380k932o339J961l711m609k268N52l880q317l425J0320P89l729N024
5966h917M320k456o22O340J793r299Q21L744l758j685Q40N79l063N148J406k303
5950g112M831l192p540l438L428O9K03M060P929N767j35j1317k975j240j364K527
5934i499N667L750L088n565l098j69O130J30l696m424L919K853M470j04k329o039
$$ plain form
6044 -10633 -7149 -877 -2874 -1427 411 -3861 -4015 -4406 -9475 -8494 -8653 -5134 540 118 -5007 -5462
6028 -5462 -4017 -2943 -4023 -4394 1618 4764 5097 -5182 -7942 -8489 -10835 -14088 -13737 -15936 -17993 -13120
6012 -13120 -8364 -8980 -7778 -4034 -1299 -2728 -2909 -2072 -11417 -13742 -8026 200 3627 6299 2411
5997 2411 -3293 -2422 -3521 -3768 -7387 -4517 -750 -5355 -2514 1619 -1553 -64 -569 -1277 1400 4267
5981 4267 11647 8715 2376 4337 626 -3983 -6251 -5699 -9579 -17896 -21321 -11001 -10212 -13941 -8917
5966 -8917 -4597 -7053 -7675 -1335 458 -8841 -8020 -4276 -8034 -9719 -8879 -8300 -11363 -6215 -4809 -7112
5950 -7112 -2281 -5473 -13013 -16451 -13023 -12954 -12751 -8691 -762 5005 4870 -6447 -9422 -10662 -12026 -9499
5934 -9499 -3832 -82 3006 -2559 -5657 -5826 304 434 -3262 -7686 -3767 -914 3556 3452 1123 -4916
5918d916n991R767N653O419n077p262p164o103m071L599Q450K777N602L031j070
5903C644q054r849M38M44N689J66K790O61O91J022J95r437J24K207P006O366J019
5886E122m200l018k58N743J998j826p020j1002j19J3058J4029l328p493j759J453
5871A380o006l094N749K289J031j159l800n070k567P124Q645Nl917l471Q8k032
5855d805j912p089l0Q968O079j560j571l160o359K128N355m373j514K24m842L657
5839a0804O424N278N086K842K13r242k489J675j818m706K952K606K88L205P422
5824H932p621k565J475k64l735J433n66l676Q59K023k591N005J775j40M902J363
5808F609L236j056p210n170j538l990k195O949J0179m93p520k860K266L612P353
$$ plain form
5918 -4916 -10907 -1140 4513 10932 5855 -1407 -8571 -14674 -18745 -15146 -6696 -3919 1683 4714 3644
5903 3644 -4410 -14259 -13821 -13377 -7688 -7522 -4732 -4071 -3380 -2358 -2163 -11600 -11476 -9269 -2263 4103 5122
5886 5122 922 -2096 -2354 3389 5387 3561 -3459 -14461 -14580 -1522 12507 9179 1686 -73 1380
5871 1380 -4626 -7720 -1971 318 1349 190 -3610 -8680 -11247 -4123 4522 4527 610 -2861 -2773 -4805
5855 -4805 -6717 -13806 -13836 -4868 1211 -349 -1920 -5080 -11439 -9311 -3956 -8329 -9843 -9619 -14461 -10804
5839 -10804 -4380 898 5984 8826 9039 -203 -2692 -1017 -2835 -7541 -4589 -1983 -1695 1510 8932
5824 8932 1311 -1254 221 -43 -3778 -2345 -2911 -6587 -5728 -3705 -6296 -1291 484 344 5246 6609
5808 6609 9845 8789 1579 -3591 -5129 -9119 -11314 -4365 5814 5321 -2199 -5059 -2793 819 8172
5793H172o167m024m02K435m532n106N411M165K869L18j811j012l313l930o484
5778a3411J904N878L006O97p30j823p45l604j965J242M632j346k652N200n395
5763i112r60P087P548M835J972r570l778L579j94j1241p105Q914N260K534m051
5748d282N993R75m591r332k441M732k67L922p05l642m85k809J467L877Q79L695
5732c014L829K184k94M27j13m424L812K791q137N304K886l423k731m301j839K687
5716d356J649k029O91N393k68j663J28K176M97m658k54M730l117o353R74N046
5700a414K927p029K99O481n701o258K973N838K160J39l600n725j352n734J485
$$ plain form
5793 8172 2005 -2019 -2421 14 -4518 -9624 -4213 -48 2821 3139 1328 316 -2997 -6927 -13411
5778 -13411 -11507 -5629 -2623 -1926 -2656 -4479 -5224 -8828 -10793 -9551 -4919 -6265 -8917 -3717 -9112
5763 -9112 -10072 -2985 4563 9398 11370 1800 -1978 1601 1407 -9834 -16939 -8025 -2765 -231 -4282
5748 -4282 1711 2686 -1905 -11237 -13678 -8946 -9213 -5291 -5996 -9638 -10123 -12932 -11465 -7588 -6709 -3014
5732 -3014 815 2999 2705 3132 3019 -1405 2407 5198 -2939 2365 5251 1828 -903 -5204 -7043 -4356
5716 -4356 -2707 -4736 -4045 1348 1080 -583 -455 1721 2218 -2440 -2694 2036 -1081 -7434 -6460 -1414
5700 -1414 1513 -5516 -5217 1264 -4437 -10695 -7722 -1884 276 415 -3185 -8910 -10262 -15996 -14511
$$ [...]
##END NTUPLES=NMR SPECTRUM
##END=
