##TITLE=Analysis number 312903
Compound Code cc 23627
Book Reference 451/15
Project Code adrs
Chemist Name evam
##JCAMPDX= 6.0         $$ Bruker NMR JCAMP-DX V2.0
##DATA TYPE= NMR SPECTRUM
##DATA CLASS= NTUPLES
##ORIGIN= Bruker BioSpin GmbH
##OWNER= NMR
$$ XWIN-NMR		Version 3.5
$$ Thu Aug 18 08:43:08 2005 GMT Daylight Time (UT+1h)  MAYBRIDGE\NMR@NMR_250MHZ
##.OBSERVE FREQUENCY= 250.131544655141
##.OBSERVE NUCLEUS= ^1H
##.ACQUISITION MODE= SIMULTANEOUS (DQD)
##.ACQUISITION SCHEME= undefined
##.AVERAGES= 16
##.DIGITISER RES= 18
##SPECTROMETER/DATA SYSTEM= dpx250
##.PULSE SEQUENCE= zg30
##.SOLVENT NAME= DMSO
##.SHIFT REFERENCE= (INTERNAL, DMSO, 0, 16.522)
##AUDIT TRAIL= $$ (NUMBER, WHEN, WHO, WHERE, WHAT)
$$ ##TITLE= Audit trail, XWIN-NMR		Version 3.5
$$ ##JCAMPDX= 5.01
$$ ##ORIGIN= Bruker BioSpin GmbH
$$ ##OWNER= NMR
$$ C:\u/data/dgb/nmr/ADRS/8110/pdata/1/auditp.txt
$$ ##AUDIT TRAIL=  $$ (NUMBER, WHEN, WHO, WHERE, WHAT)
(   1,<2005-08-18 08:42:14.84 +100>,<MAYBRIDGE\NMR>,<NMR_250MHZ>,
      <created by zg, POWCHK disabled, PULCHK disabled
       configuration hash MD5:
       62 19 C7 07 E1 42 D1 B7 37 6C 3D D0 77 39 F9 E6
       data hash MD5: 64K
       40 1B E5 53 07 73 B2 D3 62 04 F5 08 BA 86 2A 7A>)
(   2,<2005-08-18 08:42:37.98 +100>,<MAYBRIDGE\NMR>,<NMR_250MHZ>,
      <Start of raw data processing
       ef LB = 0.3 FT_mod = 6 PKNL = 1 SI = 32K 
       data hash MD5: 32K
       02 13 A7 EC FF DA DD 93 ED A3 02 2E 68 4B 46 80>)
(   3,<2005-08-18 08:42:43.18 +100>,<MAYBRIDGE\NMR>,<NMR_250MHZ>,
      <apk 
       data hash MD5: 32K
       E8 77 C3 52 90 CE 0D D9 CE 32 E4 32 BC 87 A6 41>)
(   4,<2005-08-18 08:42:46.59 +100>,<MAYBRIDGE\NMR>,<NMR_250MHZ>,
      <abs ABSG = 5 
       data hash MD5: 32K
       F9 22 3C F5 B8 55 79 D0 07 05 C4 A7 16 C5 82 37>)
$$ ##END=
$$ 
$$ hash MD5
$$ BF F3 3A A3 D2 6C 6B 68 4E FD 37 EA 9D E6 64 D9
##$RELAX= 
##$RELAX= 
##$RELAX= 
##$RELAX= 
##$RELAX= 
##$RELAX= 
##$RELAX= 
$$ Bruker specific parameters
$$ --------------------------
##$DU= <C:\u>
##$EXPNO= 8110
##$NAME= <ADRS>
##$PROCNO= 1
##$TYPE= <nmr>
##$USER= <dgb>
##$AMP= (0..31)
100 100 100 100 100 100 100 100 100 100 100 100 100 100 100 100 100 100 
100 100 100 100 100 100 100 100 100 100 100 100 100 100 
##$AQSEQ= 0
##$AQ_mod= 3
##$AUNM= <au_zg>
##$AUTOPOS= <1 >
##$BF1= 250.13
##$BF2= 250.13
##$BF3= 250.13
##$BF4= 250.13
##$BF5= 500.13
##$BF6= 500.13
##$BF7= 500.13
##$BF8= 500.13
##$BYTORDA= 1
##$CFDGTYP= 0
##$CFRGTYP= 5
##$CHEMSTR= <none>
##$CNST= (0..31)
1 1 145 1 1 1 1 1 1 1 1 1 1 1 1 1 1 1 1 1 1 1 1 1 1 1 1 1 1 1 1 1 
##$CPDPRG= <>
##$CPDPRG1= <>
##$CPDPRG2= <>
##$CPDPRG3= <>
##$CPDPRG4= <mlev>
##$CPDPRG5= <mlev>
##$CPDPRG6= <mlev>
##$CPDPRG7= <mlev>
##$CPDPRG8= <mlev>
##$CPDPRGB= <>
##$CPDPRGT= <>
##$D= (0..31)
0 1 0 0 0 0 0 0 0 0.06 0 0 0 0 0 0 0.0002 0 0 0 0 0 0 0 0 0 0 0 0 0 0 
0 
##$DATE= 1124350933
##$DBL= (0..7)
120 120 120 120 120 120 120 120 
##$DBP= (0..7)
150 150 150 150 150 150 150 150 
##$DBP07= 0
##$DBPNAM0= <>
##$DBPNAM1= <>
$$ [...]
##$SUBNAM7= <"">
##$SUBNAM8= <"">
##$SUBNAM9= <"">
##$SW= 20.6930455092707
##$SWIBOX= (0..15)
0 0 3 0 0 0 0 0 0 0 0 0 0 0 0 0 
##$SW_h= 5175.983436853
##$TD= 65536
##$TD0= 1
##$TE= 295.16
##$TE2= 300
##$TE3= 300
##$TEG= 300
##$TL= (0..7)
0 120 120 120 120 120 120 120 
##$TP= (0..7)
150 150 150 150 150 150 150 150 
##$TP07= 0
##$TPNAME0= <>
##$TPNAME1= <>
##$TPNAME2= <>
##$TPNAME3= <>
##$TPNAME4= <>
##$TPNAME5= <>
##$TPNAME6= <>
##$TPNAME7= <>
##$TPOAL= (0..7)
0.5 0.5 0.5 0.5 0.5 0.5 0.5 0.5 
##$TPOFFS= (0..7)
0 0 0 0 0 0 0 0 
##$TUNHIN= 0
##$TUNHOUT= 0
##$TUNXOUT= 0
##$USERA1= <user>
##$USERA2= <user>
##$USERA3= <user>
##$USERA4= <user>
##$USERA5= <user>
##$V9= 5
##$VALIST= <valist>
##$VCLIST= <CCCCCCCCCCCCCCC>
##$VD= 0
##$VDLIST= <DDDDDDDDDDDDDDD>
##$VPLIST= <PPPPPPPPPPPPPPP>
##$VTLIST= <TTTTTTTTTTTTTTT>
##$WBST= 1024
##$WBSW= 4
##$XGAIN= (0..3)
0 0 0 0 
##$XL= 0
##$YL= 0
##$YMAX_a= 335251
##$YMIN_a= -502498
##$ZGOPTNS= <>
##$ZL1= 120
##$ZL2= 120
##$ZL3= 120
##$ZL4= 120
##$ABSF1= 16.522
##$ABSF2= -4.171173
##$ABSG= 5
##$ABSL= 3
##$ALPHA= 0
##$AQORDER= 0
##$ASSFAC= 0
##$ASSFACI= 0
##$ASSFACX= 0
##$ASSWID= 0
##$AUNMP= <proc_1d>
##$AZFE= 0.1
##$AZFW= 0.1
##$BCFW= 0
##$BC_mod= 0
##$BYTORDP= 0
##$COROFFS= 0
##$CY= 12.5
##$DATMOD= 1
##$DC= 0
##$DFILT= <>
##$DTYPP= 0
##$F1P= 14.0000005364418
##$F2P= -0.99999901652339
##$FCOR= 0.5
##$FTSIZE= 32768
##$FT_mod= 6
##$GAMMA= 0
##$GB= 0
##$INTBC= 1
##$INTSCL= 1
##$ISEN= 128
##$LB= 0.3
##$LEV0= 0
##$LPBIN= 0
##$MAXI= 10000
##$MC2= 0
##$MEAN= 0
##$ME_mod= 0
##$MI= 0
##$NCOEF= 0
##$NC_proc= -3
##$NLEV= 6
##$NOISF1= 0
##$NOISF2= 0
##$NSP= 0
##$NTH_PI= 0
##$NZP= 0
##$OFFSET= 16.522
##$PC= 1
##$PHC0= -90.49306
##$PHC1= 6.072482
##$PH_mod= 1
##$PKNL= yes
##$PPARMOD= 0
##$PSCAL= 4
##$PSIGN= 0
##$REVERSE= no
##$SF= 250.13
##$SI= 32768
##$SIGF1= 0
##$SIGF2= 0
##$SINO= 400
##$SIOLD= 32768
##$SREGLST= <1H.DMSO>
##$SSB= 0
##$STSI= 32768
##$STSR= 0
##$SW_p= 5175.98343685301
##$SYMM= 0
##$S_DEV= 0
##$TDeff= 65536
##$TDoff= 0
##$TI= <Analysis number 999999
Compound Code 99
Book Reference 9
Project Code 9>
##$TILT= no
##$TM1= 0
##$TM2= 0
##$TOPLEV= 0
##$USERP1= <user>
##$USERP2= <user>
##$USERP3= <user>
##$USERP4= <user>
##$USERP5= <user>
##$WDW= 1
##$XDIM= 32768
##$YMAX_p= 478915160
##$YMIN_p= -215945
$$ End of Bruker specific parameters
$$ ---------------------------------
##NTUPLES= NMR SPECTRUM
##VAR_NAME=  FREQUENCY,     SPECTRUM/REAL,   SPECTRUM/IMAG
##SYMBOL=    X,             R,               I
##VAR_TYPE=  INDEPENDENT,   DEPENDENT,       DEPENDENT
##VAR_FORM=  AFFN,          ASDF,            ASDF
##VAR_DIM=   32768,         32768,           32768
##UNITS=     HZ,            ARBITRARY UNITS, ARBITRARY UNITS
##FACTOR=    0.157963299565203, 1,           1
##FIRST=     4132.6476996994, 0,             0
##LAST=      -1043.33573715361, 0,           0
##MIN=       -1043.33573715361, -215945,     0
##MAX=       4132.6476996994, 478915160,     0
$$ Real data points
##PAGE= N=1
##DATA TABLE= (X++(R..R)), XYDATA
$$ [...]
18578B20450k0415M574L2162o92j5122p231J198O195J8544Q081k487J3778j059
18565B57976R553K1740P338p347K3344M0258K4775K816K6578K0983K2828k3928
18553D26914N365Q300K0496L1393K1535K2602N2360O0235R8980J01704J35176
18542I85060J44759Q0305l1820j1621J9363N9408J33311J32819M0922r796k0351
18531A522359M2499K1462L1219M8483Q2440Q5876R9485J45215R7639Q7622L2801
18520B297100J6893J6640O9956R8676R1089J06257J45806K19550K44993L09130
18510C616090L85739M53051N83000O88581Q22735J018397J252576J580236K041139
18501A2441544K750504L827721N489230Q023424J1937584J7276128K1885841J9363310
$$ y = [220450, 200035, 204609, 236771, 236079, 220957, 213726, 214924, 221119, 239663, 247744, 245257, 259035, 257976, 267529, 289269, 296607, 289260, 312604, 352862, 377637, 380453, 407031, 428014, 450842, 426914, 432279, 440579, 461075, 492468, 514003, 536605, 588965, 649200, 748180, 849884, 985060, 1129819, 1210124, 1178304, 1166683, 1186046, 1245454, 1378765, 1511584, 1552506, 1542710, 1522359, 1564858, 1586320, 1617539, 1666022, 1748462, 1834338, 1933823, 2079038, 2176677, 2264299, 2297100, 2313993, 2330633, 2400589, 2499265, 2590354, 2696611, 2842417, 3061967, 3306960, 3616090, 4001829, 4454880, 5037880, 5726461, 6549196, 7567593, 8820169, 10400405, 12441544, 15192048, 19019769, 24508999, 32532423, 44470007, 61746135, 83631976, 102995286]
18493A02995286O248909p006352j0386957m910892M036450J0484551P126558o289145
18485A02298408j7675331k0116050j6779073j2245296q526781n950803m200400
18478A6804674l060538k287613j832144j423920j123242q97121p23980n92899
18470D863217m78725m22605l82918k94591k51467j89278j45222j03630q9662n1715
18460B453404o4972p9026m0658o4351r0879n4971m8952q8496j10745p0473j01682
18449A638199j02685j11193o8572j0455K6399O4028J8221l9108q0731r5166n0059
18438A188878k460J3470q322j03897j11564j09280j26169q2637m2632m2232m0713
18427E32442n0763l2203j9675m5320j6492k6117j0661J5901j2133j4840j5402
$$ y = [102995286, 109244195, 102237843, 91850886, 86939994, 90976444, 101460995, 108587553, 102298408, 84623077, 64507027, 47727954, 35482658, 26955877, 21005074, 16804674, 13744136, 11456523, 9624379, 8200459, 7077217, 6180096, 5456116, 4863217, 4384492, 3961887, 3578969, 3284378, 3032911, 2843633, 2698411, 2594781, 2505119, 2453404, 2388432, 2309406, 2268748, 2204397, 2113518, 2058547, 2009595, 1921099, 1810354, 1739881, 1638199, 1535514, 1424321, 1355749, 1345294, 1371693, 1435721, 1453942, 1414834, 1334103, 1238937, 1188878, 1186418, 1199888, 1191566, 1087669, 976105, 866825, 740656, 658019, 615387, 573155, 532442, 481679, 449476, 429801, 384481, 367989, 341872, 331211, 347112, 334979, 320139, 304737]
18416C04737o782J1541J9416l495J2161j5798p578o841p312J1480K132l0148n21
18403B82992J6923k2517l7058l1295j4323M082J042n965K899o419J392p942r447
18390A74364k6937K8744J0452k4209j5343J6969J2381r819j9720j6906p023j451
18378A21502J1735J2042m119N910N832o204l4397J9474L5990K5426N713K9666
18366B28570K7059k4605k9356j6662j6006L170M2836l517k2074k9436J9395O598
18354A85972k6467M324j8986j9406j7350k2323j5798j6541J7302J4382J9862N147
18342A10118j5821j730o30n445L430k282k4892j7501j6285J4095K2401K2589j1138
18329G6909J2334J9706j554j5792k6001j3154N747j3175j2645M619J6855L9820
$$ y = [304737, 297955, 309496, 328912, 325417, 337578, 321780, 314202, 307361, 300049, 311529, 313661, 283513, 282992, 299915, 277398, 240340, 209045, 194722, 198804, 199846, 193881, 196780, 190361, 191753, 183811, 174364, 147427, 176171, 186623, 162414, 147071, 164040, 176421, 166602, 146882, 129976, 122953, 121502, 133237, 145279, 141160, 147070, 152902, 146698, 112301, 131775, 167765, 193191, 198904, 228570, 255629, 231024, 201668, 185006, 169000, 172170, 215006, 211489, 189415, 159979, 179374, 185972, 159505, 163829, 144843, 125437, 108087, 85764, 69966, 53425, 70727, 85109, 104971, 110118, 94297, 92567, 91937, 86492, 89922, 87640, 62748, 45247, 28962, 43057, 65458, 88047, 76909, 89243, 108949, 107395, 91603, 65602, 52448, 58195, 45020, 32375, 36994, 53849, 93669]
18317I3669j0741k6356k2723K8340R560j4181m512m076r40p100J0855J9507o311
18304F4991R841j3757j9886j8867K7672K9905l7117j8551o592j2194k3846j5424
18292c3825R733L6811L2317J0139N284j1532k326r652l3902P709J8315R653J0163
18279D8887K4717m949j9049M812M2675L059P736j06r851j7611m707R681j6884
18266F8410j5560k2600j2079k032M765k2423k8139l1724J6563M3767J3100j3757
18254a709j9141k4221k3677P739M0274K9041J1321K4719K1794j7285l8899j4884
18242d928o814j1923m309n552J9399L5040J7244j3859K1013K5102J1698j8179
18230F3932N371K7138q514k9268J3940k8976k58k345k244J6015J0209l6348N896
$$ y = [93669, 82928, 56572, 33849, 62189, 71749, 57568, 53056, 48980, 48040, 40940, 51795, 71302, 64991, 74832, 61075, 41189, 22322, 49994, 79899, 42782, 24231, 17639, 5445, -18401, -33825, -24092, 12719, 45036, 55175, 60459, 48927, 46601, 36949, 3047, 10756, 29071, 38724, 48887, 73604, 68655, 49606, 54418, 97093, 100152, 107888, 107782, 97931, 80320, 75613, 85294, 68410, 52850, 30250, 18171, 16139, 20904, -1519, -29658, -61382, -44819, -1052, 12048, -1709, -20850, -45071, -68748, -61009, -20735, 8306, 19627, 44346, 66140, 48855, 9956, -4928, -11742, -23665, -27974, -33526, -14127, 20913, 38157, 24298, 45311, 70413, 82111, 63932, 69303, 96441, 87927, 58659, 72599, 43623, 43365, 41020, 38776, 54791, 65000, 28652, 34548]
18217C4548l1287K5499M5616J6552J5514J5576K6336K6277K3870O3451M1744M7337
18205C51033L4481L0358M9212J3529j5008J5577J8327k1854m3781n9506Q022k7438
18193C52952l5820n4809n5218m6352k4033J1527j3363k0977r049l4468k3998m0508
18181E884j8707P082J4017L3300K8180n523l3415l9647p062N435J4045Q343K2074
18168C4006o020k2426l0432k5287K1302L4982l4378k2362L851K7331Q950k4820
18156c5303K381L3916J0728P188r097N854O07q96p94Q702M544p354j6110J0365
18142A4731R750K2301j1554j7167K1910J5930r753j272J900l7105j4362l84Q786
18129C711N394p775n3125l5639J6708L2543L8624j218N575K906K559j7639J6198
$$ y = [34548, 3261, 28760, 74376, 90928, 106442, 122018, 148354, 174631, 198501, 261952, 303696, 351033, 385514, 415872, 465084, 478613, 463605, 479182, 497509, 475655, 431874, 372368, 380390, 352952, 317132, 262323, 207105, 160753, 136720, 148247, 134884, 113907, 104858, 70390, 46392, 5884, -12823, -5741, 8276, 41576, 69756, 64233, 30818, -8829, -15891, -10456, 3589, 11932, 34006, 27986, 5560, -24872, -50159, -28857, 6125, -28253, -50615, -46764, -19433, -10483, -35303, -32922, 994, 11722, 18910, 9813, 15667, 16274, 15378, 14584, 23286, 27830, 20476, 4366, 14731, 24481, 46782, 35228, 18061, 39971, 55901, 46148, 44876, 46776, 9671, -4691, -5075, 3711, 9105, 1330, -51795, -87434, -70726, -38183, 441, -777, 4798, 7704, 10263, -7376, 8822]
18116H822J5732J8791j3680l2832j5612K1503L1830K3362k6538l9835p929R16
18104a5470J5448K2265O932O011M924k3552L597L972m3338j1216K3518J7253J282
18091A1626J237j3152l998j197K5244r526K884j445j3351J5586j1247M937K6310
18078C3908K1051j6747j9210J3917j1074K936J1048q288j3881k1925J1046J1303
18066A4084k358J8087j4953J3280k765j9885l09J9176Q471j9778j9307m2032o555
18053e4844J1922K6324K2986M749j5787K644j0161O913N630n942J9871j4907j7390
18040a7992J4129R965k852J1227J8517k5056j445j2953j630L0289P207P951k467
18027C4890o086j2775j8969m1053J638l035o36J4996O874J4930M469K2752m58
$$ y = [8822, 24554, 43345, 29665, -3167, -18779, 2724, 34554, 57916, 31378, -8457, -16386, -15470, -22, 22243, 29175, 35186, 40110, 16558, 20155, 24127, -19211, -30427, -6909, 10344, 11626, 12863, -289, -4287, -5484, 19760, 10234, 13118, 11673, -1678, 13908, 2661, 7598, 33908, 54959, 38212, 19002, 32919, 21845, 24781, 35829, 27541, 13660, -8265, 2781, 14084, 11726, 29813, 14860, 28140, 25375, 5490, 5181, 24357, 32828, 13050, -6257, -48289, -54844, -42922, -16598, 6388, 11137, -4650, -2006, -12167, -5254, 376, -5566, 14305, -602, -17992, -3863, 6102, 3250, 14477, 32994, 7938, 6493, -6460, -8090, 22199, 29406, 37357, 34890, 28804, 16029, -2940, -43993, -42355, -45390, -46026, -31030, -24156, -9226, -4757, 17995, 17537]
18014A7537p17O057j9184k5757j5226j185J5033K1198J3636r209r976j0081l161
18001b1035q725J2068P46k4362J087M3454j156p093o862J0852J1645k749j6463
17988h593k5054j0967M4941r188j8599N760L060j6381K8188L2492j2441o80j7102
17975d564p435k9418m663M2111M8443o712k1518j2417n4180J4622L2025k708n89
17962g003L226j675l38n015J6201J4005o4j6079J0787l136k4933j7337J0461J695
17948a9205q888O579J4142K3760j7239k3268J1020K5260J1108J9752J3300J4764
17936G1085k7573q440k1324R012J0236j3335M262m132n186j3730j6024Q577j4701
17923b1273m728J46K1913J4161P933N862l7199k3016O271J1359J6174J1222R538
$$ y = [17537, 16820, 22877, 3693, -22064, -37290, -38475, -23442, -2244, 11392, 2183, -7793, -17874, -21035, -29760, -17692, -16946, -41308, -40221, 3233, 2077, -5016, -11878, -1026, 10619, 7870, -8593, -33647, -44614, 327, -8861, -27460, -21700, -18640, -35021, -6833, 25659, 13218, 12538, -4564, -11999, -41417, -46080, -3969, 44474, 37762, 16244, 3827, -50353, -35731, -3706, -6414, -7003, -3777, -5452, -5790, -10805, 5396, 19401, 19337, 3258, 14045, 10909, -14024, -31361, -20900, -19205, -28093, -21514, -7372, 16388, -851, -24119, -13099, 12161, 23269, 43021, 56321, 71085, 43512, 35072, 13748, 22760, 32996, 19661, 23923, 19791, 14605, 875, -15149, -6572, -21273, -26001, -25855, -3942, 10219, 18152, 24014, -13185, -36201, -29930, -18571, -2397, 8825, 18363]
17910A8363J3254J9965K5811j035J2655l951k5923k5905m8785Q163L7756J6650
17898D7018L479K5215M3267O6571N7513K5030N2701P8587J00333K8573k2148l7298
17886D68841k4832J4441N8972M752m6577m4522q7349o6923l3127n1202n9654k6768
17874A06052k2840j8615N149r93k1034q945R862k9570k689p99L50j507O883j7065
17860D239J3866j0513j4857k610L282J0896J1173k4044o080k4999j562J4397R509
17847a7303o141j2748N707j4180k8081K3244J3181J5255l581K8977j1729l9705
17835d7104J3072J4907j787J2130K0508j3332l555K3908M749J2146J0141r865
17823C5918k236k5686O240P513k1074k3441J1218K8509J336j8861M749m65k3348
$$ y = [18363, 31617, 51582, 77393, 76358, 89013, 85062, 59139, 33234, -15551, -7388, 30368, 47018, 50497, 75712, 118979, 185550, 243063, 268093, 320794, 399381, 499714, 528287, 506139, 468841, 444009, 458450, 517422, 522174, 475597, 431075, 343726, 276803, 243676, 192474, 132820, 106052, 83212, 64597, 69746, 68753, 47719, 38774, 48636, 19066, 16377, 15578, 15928, 14421, 21304, 4239, 18105, 7592, -7265, -9875, -6593, 4303, 15476, -8568, -14648, -39647, -41209, -26812, -17303, -23444, -36192, -30485, -44665, -72746, -49502, -36321, -21066, -24647, 4330, -7399, -47104, -34032, -19125, -20912, -8782, 11726, -1606, -5161, 18747, 23496, 35642, 45783, 35918, 33682, 7996, 14236, 21749, 675, -22766, -11548, 16961, 18297, -564, 4185, 3720, -19628]
17810a9628n792J3345q395M124l138J4423M0332j0381k8380j1157N703K5375j918
17797A4513P188k3364k2197M2505J2037q319K0773l082l7874O600K028K585N589
17784A8982j9842j8697k50K1226J1601l7338Q156K5266L397P178r491o029k7230
17771b3071R455Q124m523M0966N366j487K221K0395J2925j5854j7544n818l374
17758B7781j4784k136K0412R761m213j0118n217J8828j0331l8976M4081O116l0864
17745A0340k5443N910k7342n600K1734j767k6769j4586M5117R912J0734j5666
17733a3426k4968R173J0823P007o323M308J2261j9100j4286j7579R25K5653J8780
17720f752o230L166J2381J0933J2061J2885k1973k8114J3058Q273J4911K1159
$$ y = [-19628, -25420, -12075, -20470, -16346, -19484, -5061, 35271, 24890, -3490, -14647, -8944, 16431, 14513, 21701, -1663, -23860, 18645, 30682, 22363, 43136, 40054, 2180, 8780, 10808, 13393, 18982, -860, -19557, -19807, 1419, 13020, -24318, -16162, 9104, 12501, 19679, 10188, 4159, -23071, -13616, -5492, -10015, 30951, 36317, 34830, 37051, 57446, 70371, 54517, 36973, 31155, 27781, 12997, 10861, 31273, 41034, 36821, 26703, 21486, 40314, 29983, -8993, 35088, 41204, 10340, -15103, -9193, -36535, -42135, -20401, -22168, -48937, -63523, -18406, -8494, 2240, -13426, -38394, -29221, -18398, -11391, -17714, -13406, -1145, -20245, -34531, -52110, -51185, -25532, -6752, -12982, -9816, 2565, 13498, 25559, 38444, 16471, -11643, 1415, 9688, 24599, 45758]
17708D5758k4252m2229p453R685m013l3179J5106L8848p31k6645K509O381j0352
17695c0567L746m922J0191J0356J3167L429J4713m006k6786j0634N97m172J3373
17682a1515p107J4891K3180P076L915j1999j1362K451J6849J232k7456k7778Q031
17669a9592R385M2879K0829j0810K033k0351j8274l632l965k927j273k9018R361
17656b5355l576m252J9037r836J6484K6205q706j3109q672l370k648j0506j8449
17643d6753J4756k2396j3476K6000l838P862R746P235K0984k7334L226r060j5557
17630d8605l559M1340R862j5812k384m4320o665K065R583J7365J3558O737J1310
17617i525L153L516j744j3432m386J3905K8740L3415m48l2340j9261j4298j3691
$$ y = [45758, 21506, -20723, -28176, -18491, -22504, -55683, -40577, -1729, -2460, -29105, -26596, -20215, -30567, -26821, -31743, -21552, -11196, 1971, 5400, 20113, 16107, -10679, -21313, -20716, -24888, -11515, -18622, -3731, 19449, 26525, 30440, 18441, 7079, 9530, 26379, 27611, 155, -27623, -19592, -10207, 32672, 53501, 42691, 44724, 24373, 6099, 2467, -1498, -4425, -5698, -34716, -25355, -28931, -33183, -14146, -23982, -7498, 18707, 10001, -3108, -11780, -15150, -17798, -28304, -46753, -31997, -54393, -67869, -41869, -45707, -37845, -28099, -20864, 120, -27214, -23988, -33048, -48605, -52164, -10824, -962, -16774, -19158, -63478, -70143, -68078, -58495, -41130, -27572, -20835, -9525, -6372, -2856, -4600, -18032, -22418, -8513, 20227, 53642, 53194, 20854, 1593, -12705, -26396]
17604b6396K5647N706L242j1740k216m426k6485j3009O036L8891J5095J4586J3223
17591C8154j3962l9910J944j3720j5725K3617L3457j567M748j9515j6581p281
17579b6341J9772N315J3536j0193L792q876l3442K010Q132J544m196k948l515
17566c5410J4574M496n697k4040P017J9594j6030J043p162K8689o529k0157j13
17553c9725M521j7575r552J1869O818K1967K2796j1134r05K0645J6982l1788m4572
17540d9653j1991M1831k9742M037M7967n005l9979l3326q956P30N5985J8696J6595
17527G189l7077k1190K8240M200P249j7513j2800L9620M7082l314j5507j4889
17515A1290m383n152O459l433j7054j0192J2136j1012j8604P237L4390P165m68
$$ y = [-26396, -749, 4957, 8199, -3541, -5757, -10183, -36668, -49677, -43641, -4750, 10345, 24931, 38154, 24192, -15718, -13774, -27494, -43219, -19602, 13855, 12288, 17036, -2479, -19060, -26341, -6569, -1254, 12282, 2089, 5881, -2995, -36437, -34427, -26295, -24751, -28947, -31895, -35410, -20836, -16340, -22037, -46077, -39060, -19466, -35496, -34453, -41615, -12926, -19455, -39612, -39725, -35204, -52779, -62331, -50462, -43644, -21677, 1119, -10015, -10920, 9725, 26707, -5081, -49653, -61644, -19813, -49555, -45518, 2449, -2556, -42535, -75861, -84817, -84087, -28102, -9406, 7189, -29888, -51078, -22838, -18638, -11389, -28902, -41702, -2082, 45000, 41686, 26179, 11290, 6907, 1755, 8214, 4781, -12273, -22465, -10329, -21341, -39945, -32708, 1682, 8847, 8379]
17502H379j6895p546R068O460k2596J190r080R441J9435o345J3671K8447l891
17489B9738k5388j6016P437k9105Q750L4528M7197N8k2332j2290O099q333j6180
17476D163j018k621K2064L2302p335j170r955o099j6235r855k2107K3443J4153
17463A9730j4992l6864q649o351M0188L0549l505l3765l3849O006O685j3587J6144
17450c2260j2288j8419M806J224N31K1902J5007n922J1400r806l135K2820j3176
17437a7316M2485K3132n0392j0519k1640j7761j125L471r64k3636L1134K8532
17425a4599J8090J3496j1385l1073r892N630M3930J8747L068j6121q70j893k9666
17412a2538J005J1242L6977k7258j7608O943j306J2431j9607j4757n355L7687
$$ y = [8379, -8516, -16062, -6994, -534, -23130, -21940, -31020, -21579, -2144, -8489, 5182, 33629, 29738, 4350, -11666, -4229, -33334, -24584, 9944, 57141, 57199, 34867, 22577, 28676, 20343, 4163, 3145, 524, 22588, 54890, 47555, 46385, 36430, 30331, 14096, 4241, -17866, 5577, 19730, 4738, -32126, -40775, -47126, -6938, 23611, 20106, -13659, -47508, -41502, -34817, -48404, -32260, -44548, -62967, -58161, -56937, -56406, -34504, -19497, -25419, -14019, -23825, -26960, -4140, -17316, 25169, 48301, -2091, -12610, -34250, -52011, -53136, -49665, -50629, -74265, -43131, -14599, 3491, 16987, 5602, -25471, -35363, -29733, 14197, 32944, 36012, 19891, 19021, 17128, -12538, -11533, -291, 36686, 9428, -8180, -1237, -2543, 9888, -9719, -24476, -29831, 7856]
17400G856J7068j3330j4178L6523j7499o377K7592O521j6964N535k3774l3161
17388b4188K8661L5075j0373j8003k585O938k2683R503l499J9665k8534p134j6166
17375c3323k0471K050L1608R116j6061m747K7853J1470l6363J1455J0746k1039
17363b7706j2822q227K6768L1043N925J1289k371m2269j1772p999J2847j637k9386
17350e6317N309L0698L8679K566m237j1277k1879k0256J5501K918k1012j2353
17338e1660p885K9027K7949k257m661L5209O852k5504j1733L185k7085P281k0695
17325d1977J0854Q551K1918n325k6832q316k8889K947K2228J5304L8863K8685
17313C8011L3236o81k4249l0859j6464j0522P03J4627J5441m2601N03L8469J1817
$$ y = [7856, 24924, 11594, -2584, 33939, 16440, 10063, 37655, 44176, 27212, 32747, 8973, -24188, 4473, 39548, 29175, 11172, 8587, 15525, -7158, 2345, -1154, 18511, -10023, -17157, -33323, -53794, -51744, -20136, -11020, -27081, -31828, -3975, 7495, -28868, -17413, -6667, -27706, -40528, -48755, -21987, 9056, 14981, 26270, 23899, -18370, -30142, -38141, -25294, -26931, -56317, -51008, -20310, 18369, 20935, 16698, 5421, -16458, -36714, -21213, -18295, -39307, -51660, -59545, -30518, -2569, -4826, -9487, 25722, 32574, 7070, -4663, -1478, -28563, -21282, -41977, -31123, -22572, -654, -5979, -32811, -41127, -70016, -67069, -44841, -29537, 9326, 38011, 71247, 70566, 46317, 15458, -1006, -11528, -10825, 3802, 19243, -23358, -22855, 15614, 27431]
17300B7431j1629J3637j789m450l7847m4389q289M40J5102L4304J2944j2086J5480
17287a141L292r186j8263P283k804p621J5420J02p734P256o316l299l985P34N876
17272b0386j3695Q583P505j9504k441J9260l024K3071j4940p980k622M744P189
17259a4240J7275Q565j0858k1091k4077o29l248J4437L7026n955K3695L0902j5110
17246C6692l1829j2704L355M049m934m498o849N503J2122k025j8839J5170j289
17233f076j7931Q390O025j5596k5278N64J527Q69J6125K1876m402j0183Q978j2977
17219b8089j4711K255J210n942m467K40P713K0854O352J0763K1491q208J9121
17206B8582L884k7261k9795k4794j0738J0534L1558J7518J7106j0320p991K823
$$ y = [27431, 15802, 29439, 27650, 23200, -14647, -59036, -67325, -66885, -51783, -17479, -4535, -16621, -1141, 2151, -7035, -25298, -18015, -20819, -28440, -13020, -12918, -20652, -13396, -19712, -23011, -26996, -26262, -20386, -34081, -25498, -17993, -37497, -39938, -20678, -23702, -631, -15571, -23551, -26173, -21429, -14240, 3035, 11600, 742, -20349, -44426, -45055, -48303, -33866, 3160, -2795, 20900, 51802, 36692, 4863, -7841, -4486, -437, -5371, -9869, -16718, -11215, 907, -1118, -19957, -4787, -6076, -24007, -15617, -9592, -25188, -50466, -49902, -48375, -47506, -31381, -9505, -13907, -24090, -15112, -28089, -42800, -40545, -39335, -45277, -49744, -49504, -41791, -20937, -14585, -3822, 17669, 9461, 28582, 32466, 5205, -24590, -49384, -60122, -49588, -18030, -512, 16594, 6274, -1717, 1106]
17194A106m363j2096M3461K9650J4582q347k2158k7005l9146k1752J3638J5907
17182a6523j5050m07m953Q067M110n434J266J7378J5683n263L758m65J0699o480
17168F386j3859O01k234p336M0468L0341l1160p645p451l6453o312L1639j5240
17155a8255j9875O094J1358K5122M0814j0921j1309p71j0736J3269J7796q467
17143C4119k2612l8924l4747O863K5816K3372j8162j3764P861J0302m13J1029
17131i260K2923R723k2843J8815K795j9805n058m515j4574j2997P429J536q605
17118c4436K3714M1212o399n1354k353L6533K3853k610m369J1073j582l5797j3663
17105a6178M674j1493j1342k475K4071K9151m136L9748J9781q873K982j0429k103
$$ y = [1106, -3257, -15353, 28108, 57758, 72340, 63993, 41835, 14830, -24316, -46068, -32430, -16523, -31573, -31980, -36933, -28866, -24756, -30190, -28924, -11546, 4137, -1126, 2632, 2167, 12866, 6386, -7473, -6872, -9106, -16442, 24026, 54367, 23207, 15562, 8111, -28342, -34654, -3015, -18255, -38130, -32036, -20678, 4444, 45258, 34337, 23028, 22257, 11521, 24790, 42586, 34119, 11507, -27417, -62164, -55301, -29485, -6113, -24275, -38039, -30178, -19876, -20289, -9260, 13663, 23386, 543, 19358, 22153, 2348, -2710, -7225, -21799, -34796, -27367, -25831, -34436, -10722, 30490, 24091, -27263, -29616, 6917, 30770, 28160, 23791, 34864, 33282, -2515, -16178, -11504, -22997, -34339, -36814, -12743, 16408, 12272, 52020, 71801, 62928, 65910, 55481, 53378]
17092E3378k7198j0349n223k7164j2609j0040K1947L2563L079j721M902r985m3831
17079c2251J6320L3006Q890j7479j2637k630j3772j0115J2621M2459j9576j8867
17067a4031j717R857J2007l6922n94K0418l258P361J5018m9252P802K8004M580
17054g27L885R836K9424r580k4934j2018j5872j8818q560J0541L2286k1762k8904
17041e5203J194N3585J8195n2919j6245J3506L4670J0452k8939j5386N483P896
17029b3711K9107q400j5566K7298j131j5890J5540j0406j8441q652j5245o584
17017e2081R347K6508J0930k8950l6452j1877J6448O737O553N50J5198J0046J5081
17004a1962j023P939k2269k138L184K5397j850k8707k5646P914j1939J979K5015
$$ y = [53378, 26180, 15831, 10608, -16556, -29165, -39205, -17258, 15305, 18384, 16663, 21565, 11580, -32251, -15931, 17075, 25965, 8486, -4151, -6781, -20553, -30668, -18047, 24412, 4836, -14031, -15748, -5891, 6116, -30806, -31400, -10982, -14240, -6879, 8139, -41113, -33311, -5307, -727, 3158, 12994, 42418, 32838, 7904, -4114, -19986, -38804, -47364, -36823, -4537, -26299, -55203, -54009, -424, 17771, -35148, -51393, -37887, -3217, 7235, -21704, -37090, -31607, -23711, 5396, -3004, -18570, 8728, 7597, -8293, 7247, -3159, -21600, -30252, -45497, -52081, -42734, -16226, -5296, -34246, -70698, -82575, -66127, -59390, -52837, -52287, -37089, -27043, -11962, -12985, -5046, -27315, -29453, -26269, -872, -2722, -31429, -57075, -49161, -61100, -59121, -34106]
16991c4106K5491M091l6650O3J9342K8282k648o523j2015N543R347Q495L92l6351
16977b7247j6670r907o983K6178K5132q878j7041N796J7663p72K1803k7110k8868
16964d6904L0025L1087p784K478l1625j3885J0692M976k280j3310n022K2307p074
16951b6319l677J4491K0676j7002j2304L2011n139k4307n497r455j5184J5717
16939c5989R223j4402l633K1002O533j5967k0431J6775J3554r094L711J6282J4444
16926B008M92N978l3006j1739J3067K359j8378o978J0818M0416K2499k4653o485
16913c602J8679p017j4408J3823R363k503J55j4971K5449p39p705m558P428j1067
16899H327o988N63J0269R861k1040L2417n536l7688k6053J2103P748J8798k041
$$ y = [-34106, -8615, -4524, -41174, -41111, -21769, 6513, 3865, -2658, -14673, -9130, 217, 8712, 9104, -27247, -43917, -53824, -60807, -34629, -9497, -18375, -35416, -29620, -11957, -12729, 9074, -18036, -46904, -16879, 14208, 6424, 8902, -22723, -36608, -25916, -20940, -23220, -36530, -41552, -19245, -26319, -29996, -15505, 5171, -11831, -24135, 7876, 2737, -21570, -27067, -36522, -51706, -35989, -26766, -41168, -44801, -23799, -17266, -33233, -53664, -36889, -23335, -32429, -28718, -12436, 2008, 2500, 8478, -24528, -36267, -23200, -20841, -39219, -46197, -35379, 5037, 27536, 2883, -3602, 15077, 8060, -6348, 7475, 16838, 14335, 14490, -481, 24968, 24229, 16524, 11966, 19394, 8327, 1339, 1902, 12171, 22032, 992, 33409, 27873, -9815, -35868, -23765, -16017, 2781, 740]
16886G40j7066j4094M227l979R560j6110n018M6151K0984J4126o278l462J7278
16873D7059O15j1371k4429r711p728p971q477Q095N143J3728R727l352j2715J0521
16859I134J1679n488K4781n74q980p537j7554Q403K0582J4150k3649p311j47j6411
16845A078p895J4149l3705l345k4964J452L3958J0156m633j8750J5292k060k691
16832b1958l489j2879P848K4750J2131q125k8753o065k122l0237j0451J1311J8335
16819d9704J7869K4003J2754n508r759j4886l2546p778J9995K8558j534J6129
16807b407K382m436J8436k788P871L626o206m396K3530J0121j6410K921o069j5695
16793A0480k0830j978j5995M380J4110L5957K233j9969o09J1274r549l528j6114
$$ y = [740, -16326, -30420, -26193, -30172, -20612, -36722, -41740, 4411, 25395, 39521, 33243, 29781, 47059, 47674, 36303, 11874, 2163, -5565, -13536, -22013, -13918, -8775, 4953, 14680, 11328, -1387, 9134, 20813, 15325, 40106, 39532, 30552, 23015, 5461, 13864, 34446, 48596, 24947, 17636, 17489, 1078, -6817, 7332, -26373, -29718, -54682, -53230, -19272, -9116, -13749, -32499, -17207, -19267, -21958, -25447, -38326, -30478, -5728, 6403, -1722, -30475, -36540, -38662, -68899, -79350, -68039, -49704, -31835, -7832, 4922, -586, -10345, -25231, -57777, -65555, -45560, -17002, -18536, -2407, -25, -4461, 13975, 11187, 19058, 22684, 16478, 12082, 35612, 45733, 29323, 32244, 26175, 10480, -10350, -12328, -28323, -23943, -9833, 26124, 28357, 8388, 7779, 19053, 9504, 5976, -10138]
16780a0138J1581P029J5922l0795j9515K1318J1896l0115j6521K859O051j7969
16768d8397J6127J1847J7287J5548M609j0185k7982n807k753j6140l1772K077
16756g5541K1447L0068J4877N59L3715J304j5085k6844l2039l651P226L690J4090
16743b6184J7458m769K593l1660m7542p316K5306K7676J5157J301J483q793J5036
16730b0254J2874k789p15R444j2133K646j4994Q493n498N875J4553K4673N304
16717B7479j5823l3365j069J8267k1562J8412K5399n805k341q508N117l402p061
16704d262l5010L1675j104n276j7153J3311K861J9125P83j2113O578l01n874K4957
16690A8197J1440k1040n566J3666j4603j8099k8078p706J9135K1021K2056r71
$$ y = [-10138, 1443, 8472, 24394, -6401, -25916, -4598, 7298, -22817, -39338, -36479, -30428, -48397, -32270, -20423, -3136, 12412, 17021, 6836, -21146, -26953, -29706, -45846, -77618, -75541, -54094, -24026, -9149, -8590, 25125, 26429, 11344, -15500, -47539, -51190, -43964, -40274, -26184, -8726, -13495, -10902, -42562, -90104, -97420, -72114, -44438, -29281, -27980, -26497, -35290, -20254, -7380, -10169, -10884, -1440, -13573, -10927, -25921, -17428, -22926, -17051, -2498, 22175, 27479, 11656, -21709, -22778, -4511, -26073, -7661, 17738, 11933, 9592, 1084, 6201, 2799, -4262, -39272, -7597, -8701, -13977, -31130, -17819, -14958, 4167, 4950, -7163, -585, -886, -6760, 18197, 29637, 8597, 3031, 16697, 2094, -16005, -44083, -51789, -32654, -11633, 10423, 9452]
16678I452J230n614l671n789J3592K464Q012L766j654j3154p984j3034j9656K481
16664b9559J7760J052L56j1695k5583J7854K7931J3085j5964N919R329k6998k9772
16651d6285N915n028r957j0855J7669K3517L0960n459m710q755k3067l225m217
16638d3497K7124J5547j6451k6758j2150K752p877O704L4271K0064K746j0284
16626g809l888j266k1599p738k0027k6757M714L1479K8001N058j2073j0990Q95
16613d2000K3129Q253K1920K1527l547M412k6960k1243m584K2763L03l1943N708
16600b2262J4476j979J9570K521K251k1947o371p882k209K6823L3012k824R365
16587D2544N688J0554l169j264k7289N109k6881j9321N740k384j0374j834j0973
$$ y = [9452, 10682, 5068, 1397, -4392, 9200, 11664, 19676, 23442, 21788, 8634, 650, -12384, -32040, -29559, -11799, -10747, -10391, -22086, -47669, -29815, -1884, 11201, -4763, 1156, 10485, -16513, -46285, -40370, -45398, -55355, -66210, -48541, -25024, 5936, 477, -4233, -12988, -36055, -39280, -43497, -16373, -826, -17277, -44035, -56185, -53433, -61310, -54606, -20335, -271, 2475, -7809, -11697, -12963, -34562, -42300, -62327, -89084, -84370, -52891, -24890, -19832, -31905, -42895, -42000, -18871, -10618, 11302, 32829, 29282, 33694, 6734, -14509, -19093, 3670, 3973, -27970, -22262, -7786, -9765, 9805, 12326, 14577, -7370, -13741, -21623, -23832, 2991, 36003, 33179, 42544, 48232, 58786, 55617, 54353, 27064, 32173, 5292, -14029, -8289, -10673, -21047, -22881, -33854]
16574c3854J5094K7441m0121j8902J0708l755K0208Q010p75K3018l850j2499N053
16561d224J3263M529J9532m829l0755O583K984J2889j495m1074K630r018m911
16548c3896k511K4237L692j5014j9513j0791J1689Q787J0861J00K1807J7865R257
16535B6570k7004j6399O12J0552J5696J7677j5620q238r292L179m548p562j5688
16522c0065J4043L1755O971p361l3118k9537j8367k216K6084L679M216Q087Q811
16509a7018l144J2344J4740j0982J5049o313j2288l900q815K813M230J2606j7209
16496a7887m791K2913m227Q002L3179j1122m5633j2791J2447K7172j7582n588
16484a5908j3124K2713j1351K1571J61j0472l097k4604j8979l606K535m907J045
$$ y = [-33854, -18760, 8681, -31440, -50342, -39634, -43389, -23181, -15171, -15946, 7072, 3222, -9277, -4224, 9039, 13568, 33100, 28271, -2484, 4099, 7083, 19972, 18477, -22597, -19967, -28985, -33896, -36407, -12170, -8478, -23492, -43005, -53796, -42107, -33320, -22459, -22359, -552, 17313, 26570, -434, -16833, -16221, -5669, 10027, 27704, 12084, 3846, -5446, -2267, -6815, -14377, -30065, -16022, 15733, 22704, 15343, -17775, -47312, -65679, -67895, -41811, -38132, -33916, -25829, -17018, -20162, -7818, 6922, -4060, 10989, 4676, -7612, -11512, -20327, -17514, -13284, -678, -17887, -22678, 235, -3992, 4010, 37189, 26067, -19566, -32357, -19910, 7262, -10320, -15908, -29032, -6319, -17670, 3901, 4062, -6410, -9507, -34111, -53090, -56696, -54161, -59068, -58023]
16471e8023K8535Q784Q591K5616J8966n094j9061J3831j7965m358L2212J9959
16459E1993J6817j943j6701j8011l5878L786K051l597j2046J0693J2813j1945
16447a968j2839r045K087p474M371J526J0191K4373k2910q402L378n489o495L1474
16433B778P225j4913l1605J4041L8025Q673R857p913o975k4533P425L65J814j1311
16419g047J4191j1145m221M531J5998M0j6104l6733n036J6085l643K4927J6608
16406H451n820O980j0026J0497r070J4583J2975q832R82r62J3252J8630r099L0271
16392G2812j4142m7782j8226K4710n428j1713L502k582n005J6575j5623l1316
16380c4218J1504j3499l867J8899J8396j8307o185J9744j0341L543R599L1202
$$ y = [-58023, -29488, -20704, -12113, 13503, 32469, 27375, 8314, 22145, 4180, -178, 32034, 51993, 68810, 66867, 50166, 32155, -3723, 63, 2114, -1483, -13529, -2836, 9977, -1968, -14807, -23852, -21765, -29239, -24868, -23342, -13151, 11222, -11688, -20090, -16712, -22201, -28696, 2778, 10003, -4910, -36515, -22474, 15551, 24224, 34081, 26168, 19193, -5340, 2085, 2450, 4264, -7047, 7144, -4001, -8222, -3691, 12307, 12347, -3757, -40490, -45526, -29441, -33084, -8157, 8451, 2631, 9611, -415, 10082, 1012, 15595, 28570, 19738, 20720, 19758, 33010, 51640, 42541, 72812, 58670, 10888, -7338, 17372, 11944, 231, 3733, 1151, -3854, 12721, -2902, -34218, -22714, -36213, -40080, -21181, -2785, -21092, -27277, -7533, -17874, -14331, -4732, 26470]
16368B6470j3986k0448m0648J5237K685k182j405J44R286k0035p021J2692L3636
16355e575J7081J1934m711j4978j83K174m7j7766k305O400k1847j5443K3289Q114
16341a3863j7681j1246J3327L471J2846O162j120k2610j592L977J2562O817j2360
16328b1310K1103L3847J192j9871k8583m865k272k0985o177l926n217Q288M4257
16315d519J9893r488j3172j4065N344J4843K62K5742k5320k4710L0381O038k5828
16302a4599o374k88L634M5952J23k8466q839K0678R221o716n1300l0052L0343
16289c6683L1591M922l516k6370m033j3561j0418j7029K7514J7440K5199M4292
16277C9348R42J3459J2497l8151k8513K5987j3831k5005k0893P326J8801Q54o257
$$ y = [26470, 12484, -7964, -48612, -33375, -30690, -32872, -34277, -34133, -24847, -44882, -51903, -39211, -5575, 11506, 23440, 18729, 3751, 3568, 5742, 5695, -12071, -14376, -7976, -29823, -45266, -21977, -13863, -31544, -42790, -29463, -25992, -13146, -6984, -8104, -30714, -32306, -28329, -15767, -8950, -21310, -207, 33640, 34832, 14961, -13622, -18487, -20759, -41744, -47921, -51847, -57064, -48776, -4519, 15374, 5886, -7286, -21351, -16007, -1164, -902, 24840, -480, -25190, 5191, 11229, -14599, -20973, -21261, -17627, 28325, 28448, -18, -8857, 11821, 21042, 14326, -36974, -67026, -36683, -5092, -170, -3686, -30056, -34089, -47650, -58068, -75097, -47583, -30143, -4944, 39348, 40290, 53749, 66246, 28095, -418, 25569, 11738, -13267, -34160, -26834, -8033, -7179, -13436]
16264a3436p297J1443J9527j701m9183m0789K3166M645m516M4818J3623j5648
16252a5348j1663k3298l611m5K2807j375j838J2867Q079K1993K4948j2243j9890
16239A383j2595K6446n539l0833R359R487j725M1649K0333k7724k7911m9833K634
16226d4869M3119N459N517J1432m033K3707R580p831m359J1101K7290j1308l5083
16213B9722l2309o722r728M324L0540k3192j0110P663k067L406k1951J484j5600
16200d4540k355O827J3864K2942N403j9729m425q881O154K1698J3117J363p176
16187D262j4093j678p069L3779J8488J5423k0588k9465N714k996P399N049n357
16174H868O204j1228Q299J7971j2126J1641j0788k589m847k4837l876P878L714
$$ y = [-13436, -20733, -9290, 10237, 8536, -40647, -81436, -58270, -53625, -58141, -13323, 300, -15348, -27011, -50309, -53920, -53965, -31158, -32533, -34371, -21504, -13425, 8568, 33516, 21273, 1383, -11212, 15234, 9695, -21138, -11779, -2292, -4017, 37632, 57965, 30241, 2330, -47503, -44869, -1750, 3709, 9226, 20658, 16625, 40332, 49912, 42081, 37722, 48823, 76113, 64805, 29722, -2587, -9309, -19037, -14713, 15827, -7365, -17475, -9812, -11879, -8473, -30424, -28940, -44540, -46895, -40068, -26204, -3262, 2141, -17588, -22013, -30894, -24740, -3042, 10075, 11438, 4262, -9831, -11509, -18578, 15201, 33689, 49112, 28524, -941, 4773, 1777, 9176, 14225, 8868, 15072, 3844, 12143, 30114, 17988, 29629, 18841, 16252, 11405, -13432, -17308, -9430, -5716]
16161e716J2922M416m157N23J893j6087j5750r11N984K557l178j5559k0192K7960
16147b5295K9559j0156K540J1807l3604p462L952J5549J4764J1929l391q41j0688
16134a337k1982J6453J2046J2213J862k493j4404k2957l3607O121K6580K0102
16122a403O274M571j4703m376k156q300j7655K2230J6344j804l3454m466q29J0366
16108b9361J1315J1234j9926k9159K1126L5858J2723o537p811M498Q863J1362
16096B4185k6066j925K274m81j9736n4n260K3049K4223O424j9892p008k8706j3343
16082d2316J6010L8596K3074k6851k1585Q894j6943j2378n035j1554K2333K473
16070b5282l9074J0049L6371j7701k972J5654K246q592M681J4058L230j7621n194
$$ y = [-5716, 7206, 11622, 7465, 7988, 9881, -6206, -21956, -22867, -16883, -14326, -17504, -33063, -53255, -25295, 4264, -5892, -3352, 8455, -25149, -32611, -28659, -13110, 1654, 13583, 10192, 9351, -1337, -23319, -6866, 5180, 17393, 19255, 16762, 2358, -20599, -54206, -48085, -21505, -1403, 4871, 9442, -5261, -9637, -11793, -20093, -37748, -15518, 826, -978, -34432, -38898, -39727, -29361, -18046, -6812, -26738, -55897, -34771, 1087, 13810, 7273, -538, 3960, 12823, 24185, -1881, -3806, -1532, -2013, -21749, -21803, -27063, -4014, 20209, 26633, 6741, -267, -28973, -42316, -26306, 12290, 35364, 8513, -13072, -4178, -21121, -33499, -38534, -50088, -27755, -25282, -64356, -54307, -17936, -35637, -38609, -22955, -20709, -29301, -24620, -10562, -7332, -24953, -30147]
16057c0147J7461j0807n872J6601n183k0923M754J1969J6919J7155J6188j8437
16045I678J3626j066j1303k1784q987P298K5932J2873k2114j6957j8984j0808
16033d2596K403N210O98j6927K7452O410n0M646j2441K3062l2759M036L1128K1883
16019B2155q250J7642l30l5922j3762k526J6579J2164l1844k5255J1266J8196
16007a9887L98O874n274k1816k464J7544O796K168P818J6858O015j7492m2376
15994d4838l917J2006J8231P072R240J565J755j860N453j2546J6885L852J1829
15981B4727j2320j036J0590j1049k7665k8314K556Q287L4293J9945J1458k7579
15969C893l3350K634m092l194M958J7043K8629J134l1429k3429r598J6777L842
$$ y = [-30147, -12686, -23493, -29365, -12764, -17947, -38870, -34116, -22147, -5228, 11927, 28115, 9678, 23304, 22238, 10935, -10849, -19836, -12538, 13394, 26267, 4153, -12804, -31788, -42596, -40193, -34983, -34285, -51212, -23760, -17350, -17400, -12754, -25195, -2133, -34892, -30856, 272, 22155, 13905, 31547, 31217, -4705, -18467, -20993, -4414, 7750, -24094, -49349, -38083, -19887, -19489, -12615, -17889, -39705, -42169, -24625, -17829, -15661, -7843, 9015, 15030, -2462, -44838, -48755, -36749, -18518, -11446, -2206, -641, 1114, -746, 4707, -7839, 9046, 12898, 24727, 12407, 11371, 21961, 10912, -16753, -45067, -42511, -34224, 69, 20014, 31472, 3893, -29457, -26823, -30915, -34109, -29151, -12108, 16521, 17655, -13774, -37203, -46801, -30024, -26182]
15956b6182j3350k3104R5J8614l356J1568K6859r131k8921L446J1526K324N702
15943b3910l425k3423k859J3760L2735K3198k542k0416o488k863Q448n861p336
15930b0982k0644J5141j3701j6054L3185K2184J6362p744j7150l4037j4554N138
15918e2856M866J2437K210J9768L110l1461L244J3708N070q280j1588R639K740
15905b7393n192j1303p217L79P679m440L696J7277L7582K0640j7351l4215k0218
15892d0076l045p559J9058n311J9750K1112L1824j3868k0948J3108J6369K277
15880C2691K264J948K603j0029k1517j3141p33P88n081k2032j3456k2218J6831
15867e1082K4257Q533k7594j9011P796K6634J3865L5569P209j0725O583j6588
$$ y = [-26182, -39532, -62636, -62541, -43927, -47283, -35715, -8856, -17987, -46908, -43462, -31936, -29612, -23910, -27335, -50758, -53617, -39857, -7122, 16076, 13534, -6882, -13370, -16233, -7785, -13646, -20982, -41626, -26485, -40186, -56240, -23055, -871, 15491, 7747, -9403, -43440, -57994, -52856, -47990, -35553, -33343, -13575, -10465, -41926, -38682, -24974, -19904, -28184, -39772, -30133, -27393, -32585, -43888, -51105, -50726, -43047, -47487, -43791, -26514, 11068, 31708, 14357, -19858, -40076, -43121, -50680, -31622, -36933, -17183, 3929, 35753, 21885, 937, 14045, 30414, 32691, 34955, 36903, 39506, 29477, 7960, -5181, -5914, -5126, -10207, -32239, -45695, -67913, -51082, -26825, -18292, -45886, -64897, -57101, -30467, -16602, 18967, 26176, 15451, 22034, 5446]
15855E446j7921j825J7945O573j6043j4215k0527k5803j0808L5742J5985K1809
15843c642j3092j4594J8288J3350p962J2837J8780j9605l5892J9254K8231J1523
15831B7476k7416K157J8347k1515J0815O062O032j044K4947J8027j4189m5903
15819C796k7537j9477l499L620k52K855M2382J9524k432k4324l522M205l5758
15806d0419J854o567O182M443L187j1537J0181K3148k758K7450Q347l08R959q879
15792B4283J0026O264o034k1590m1704j5526M3434L5729J5556l6202j6882k334
15780d980r334R362N216k0432k2830K1559L2342P124k0838J6398L3394K0652j9605
15767D8028m8458K3734m118p532Q545j506k1098l4660j5919J2253L8064J8760
$$ y = [5446, -12475, -14300, 3645, 10218, -5825, -20040, -40567, -66370, -77178, -41436, -25451, -3642, -16734, -31328, -13040, 310, -7652, 5185, 23965, 4360, -31532, -12278, 15953, 27476, 60, 2217, 20564, -951, 9864, 15926, 21958, 20914, 45861, 63888, 49699, 3796, -23741, -43218, -46717, -43097, -43349, -40494, 1888, 21412, 18980, -5344, -8866, -4661, -40419, -38565, -45132, -38950, -34507, -31320, -42857, -32676, -9528, -12286, 15164, 23511, 23203, 33162, 24283, 34309, 40573, 34539, 12949, -28755, -44281, -847, 34882, 50438, 14236, -2646, -4980, -14314, -4952, 264, -20168, -42998, -21439, 10903, 18027, -2811, 13587, 46981, 67633, 48028, -430, 23304, 19186, 11654, 20199, 18693, -2405, -37065, -52984, -40731, -2667, 16093]
15755A6093o510j0306p970J4031J0937L669l2163R685L3377j5217k7585o267N743
15742a2483j1449N625N018l797m991j2752J4244j2090o415J4333j3175L7214J4717
15729A3999P652n747j4405n796j4721Q399m811j8235j5982P00J5040J2789P62
15716b0356J1582p231J3008l951J177K7237k1448L696n268L947q877K7126K0865
15703D1507l2037j2456Q290o789K1915J5110j7274l1804q010K526O076P948k5434
15690c0432k2048J8132K5099k4946j3191R568j393Q548q889l4020K6173L7640
15678i759j1262m544J7936J6541M647r591r978K721Q974k5761M521J9550M299
15665H294j097k5821k4317J7016J1887l125J3602K4507l4657r532k1970J226L1716
$$ y = [16093, 9583, -723, -8693, 5338, 16275, 19944, -12219, -2534, 30843, 15626, -11959, -18226, -12483, -23932, -18307, -13289, -17086, -22077, -34829, -20585, -32675, -39090, -24757, -37932, -718, 13999, 21651, 15904, 1499, -4297, -19018, -10619, -15430, -33665, -49647, -48947, -33907, -21118, -20356, -8774, -16005, -2997, -6948, -5771, 21466, 18, 3714, -1554, 2393, -6484, 20642, 41507, 9470, -2986, 5304, -1485, 20430, 35540, 18266, -13538, -21548, -19022, -12946, -4998, -30432, -52480, -34348, -9249, -34195, -47386, -37818, -39211, -30663, -39552, -73572, -47399, -9759, -21021, -25565, -7629, 8912, 13559, 3968, -6010, -3289, 5685, -20076, -15555, 3995, 8294, 7197, -18624, -42941, -25925, -14038, -17163, -3561, 20946, -13711, -23243, -45213, -43987, -12271]
15652a2271K0159l403k1346J2588m57J4629j9848O314J6362j7862n808k981m015
15639a7939n880j6527O900j1237J9694M8134J0949J0016j1948p380j4817j8278
15627h313j6188j7741J3908n38l397L477j4753p60P418Q618J9031K2858M4319
15614E7939r376o249k7615j3758J7687l4937J7306R215M820N721J2685j7797m5571
15601b9930k3480J3422K7661K3764n28L760L861j7746o730n265J1727J050M337
15588E903N970l71J0215k8622o917K3537K0795j5624p791k220k0550l7947N483
15575d8139N7477L4718J3439j6119l5545j2949k8247j9036J3795n724J9252M5581
15563A8503j020r380k1880k7407K032K6786K5848Q090k4719j9825j6402j9618
$$ y = [-12271, 7888, 4485, -16861, -4273, -4730, 9899, -9949, -3635, 12727, -5135, -10943, -13924, -17939, -23819, -40346, -33446, -44683, -24989, 23145, 34094, 44110, 32162, 24782, 9965, -8313, -24501, -42242, -28334, -28872, -32269, -28792, -43545, -44305, -36887, -28269, -9238, 13620, 57939, 48563, 42314, 14699, 941, 18628, -16309, 997, 10212, 15032, 20753, 33438, 15641, -29930, -53410, -39988, -12327, 11437, 10909, 14669, 18530, 784, -5946, -11211, 516, 1566, 5903, 11873, 11502, 21717, -6905, -13822, 9715, 30510, 14886, 7095, 4875, -15675, -53622, -48139, 9338, 44056, 57495, 41376, 5831, -7118, -35365, -54401, -40606, -46330, -27078, 18503, 17483, 8103, -13777, -41184, -39152, -12366, 13482, 21572, -3147, -22972, -39374, -58992]
15551e8992o523L1428K3098K0024O171J7291k464l0469L5864m326p681M068p489
15538B0000j6723q221j4267K1583K6762k4702M854J247J9401r986p409j6368j3525
15525a7354o128j2487k2954Q205M4409M6813Q394k3794k2748o748k2304j384j5097
15512d3177k7839J500K2309J7081M443Q371J8221J2101j4724n855J6632k7427
15500a8364J6013N283n500J3862j8304q018L059J3183N178K5269j9471k60j1308
15487F22j8028L513j0353M410r512J981K453J5333n34j5253j8098o026J810k566
15473e0248K5992M2397k374J718K3278l847j5449l3491K479j5327J31J2601Q897
15460c243r392m2925P665K5117N724r370L0138L143m0018O415J7302k8038l807
$$ y = [-58992, -65515, -34087, -10989, 9035, 15206, 32497, 30033, -436, 35428, 31102, 23421, 27489, 20000, 3277, -4944, -19211, 2372, 29134, 4432, 9286, 10533, 29934, 19948, 12539, -3829, -17354, -23482, -35969, -58923, -50718, -6309, 40504, 48898, 25104, 2356, -4392, -26696, -28080, -43177, -71016, -69516, -47207, -30126, -25683, -17312, 909, 13010, -1714, -7569, 9063, -18364, -2351, 2932, -2568, 11294, -7010, -15028, -11969, 1214, 6392, 31661, 12190, 11930, 622, -17406, -13893, -24246, -19836, -29348, -27367, -24914, -9581, -10115, -25368, -43466, -49492, -47682, -50248, -24256, 18141, 15767, 17485, 40763, 36916, 21467, -12024, -9545, -24872, -24741, -12140, -3243, -12635, -55560, -47895, -22778, -17054, -26424, 3714, 6857, -33161, -26746, -9444, -37482, -41289]
15447d1289K9674J639l0800j4325J2542K3088J9400r794K4778J6019j1821J1077
15435C0188J2227j3660k8738K96j3390m4945o567O566J9159J9434j1641l376j4797
15422d9244K8968r676j4417J5304N45J4953K731L1528J6037K2662q129j0985r986
15409C0291m98j3270j8782j2600j2760n725J7395K9506Q604j716l3532l2860l085
15396d9032M939J881L3430K8122M164j0053J9950j4000j9306k1551j2269o333
15384d0058j778K9573K6707m382k1567m362k1969p435L8046J9737N004j9895n532
15371g911j3076q310k0632l658L3448J3700J8377j2198j9203J6573L1742n278
15359B3574p884p536M072L065j0714j5627K422j5705J9631J6547j1934n240L999
$$ y = [-41289, -11615, -9976, -40776, -55101, -42559, -19471, -71, -9865, 14913, 30932, 19111, 30188, 42415, 28755, 17, 313, -13077, -58022, -64589, -58023, -38864, -19430, -31071, -34447, -49244, -20276, -29952, -44369, -29065, -28520, -13567, -10836, 20692, 36729, 59391, 51262, 40277, 30291, 29793, 16523, -2259, -14859, -27619, -33344, -15949, 13557, 22161, 20445, -13087, -45947, -49032, -44093, -42212, -8782, 19340, 23504, 13451, 33401, 19401, 95, -21456, -33725, -40058, -41836, -12263, 14444, 10062, -11505, -15867, -37836, -45271, -7225, 12512, 17516, -2379, -7911, -20987, -29297, -49929, -53587, -20139, -6439, 11938, -260, -19463, -2890, 28852, 23574, 15690, 8154, 12226, 15291, 4577, -11050, -8628, -24333, -4702, 11845, -89, -5329, -1330]
15346a330K806J0913J0602r584m376j368q93J3570k1957k3397K0600N495N021
15333F102m061k2865j6699K210p242J3330M9142p176j9281n311N797K0625J4345
15320B8916k297o781J6039r543j1394k5295k5897P133K0513K5641J565l1162o510
15307a9072p756J503R988J3936l612k2970k228k1772J5986J5674K5384K221K5601
15294C2883J304k1074k0551o097J280k532K0530J9587o469m7428j4059K1301J0655
15281a0670J1395J2840M217k7006k9929K1167K1764j0936j3208K9992L9861j2162
15269C7325q1j1243k1197j8148J8561K0441j0576k5631N713j5686j5541K0236
15257a5827J7081k2773L876P106l670j154L104r794R511m911j9827j3473L0398
$$ y = [-1330, 1476, 12389, 22991, 13407, 9031, 7663, 6770, 20340, -1617, -25014, -4414, 1081, 6102, 2041, -20824, -37523, -35313, -42555, -29225, 19917, 12741, -6540, -11851, -6054, 14571, 28916, 26619, 19838, 35877, 26334, 14940, -10355, -36252, -29119, -8606, 17035, 18600, -12562, -19072, -26828, -25325, -15337, -1401, -5013, -27983, -30211, -51983, -35997, -20323, 5061, 7282, 32883, 34187, 13113, -7438, -13535, -12255, -14787, 5743, 25330, 18861, -28567, -42626, -21325, -10670, 725, 13565, 17782, -9224, -39153, -17986, 3778, -7158, -20366, 9626, 49487, 37325, 37244, 26001, 4804, -13344, 5217, 25658, 15082, -10549, -4836, -20522, -36063, -15827, 1254, -21519, -17643, -10537, -14207, -15361, -12257, -22051, -12540, -17451, -37278, -50751, -20353]
15244b0353L1768J6391j6411j1081q503o719L205n499R004j8269j9224J4918L5782
15231E009o076o345P595k4411L277L5630L217l3273J8627n392j3193O576l93M7591
15217C8439J2735J1039o292k4227m5858M993J2315n475j3956o818K7167K5064
15205B9126j4146k1004j8025o321L302K8198K4941R789M349j8558j3482k1956
15193a3787k9704J7045K4346j0952j3550k569J7486P354l303j6838m838K2922
15181f388J3170j3765p527q431k206K26N81P847R209L4508k3238O296L518l2124
15167a8324l2336K1819K4720J1472n006J0399k2249N502K0762K0358j2977j1779
15155A2361k6847j2111k4678p549K9835K7334J3988j9586l350l6292M486L3979
$$ y = [-20353, 11415, 27806, 11395, 314, -8189, -14908, -11703, -17202, -8198, -26467, -45691, -30773, 5009, -1067, -7412, 183, -24228, -20951, 14679, 17896, -15377, 3250, -2142, -15335, -8759, -9152, 38439, 51174, 62213, 55921, 31694, -14164, -9171, 3144, -2331, -16287, -23105, 4062, 29126, 14980, -6024, -24049, -30370, -27068, 1130, 26071, 35860, 40209, 21651, 8169, -13787, -43491, -26446, -2100, -13052, -26602, -29171, -11685, -4331, -7634, -24472, -29310, -6388, 6782, -6983, -14510, -22941, -25147, -24921, -24340, -16493, -7284, 27224, 3986, 10282, 13800, -18324, -50660, -28841, -4121, 7351, 2345, 12744, -9505, -4003, 16759, 37117, 24140, 12361, -14486, -26597, -51275, -58824, -28989, -1655, 12333, -7253, -10603, -46895, -42409, -8430]
15143h430P2j0757j095K730J7440k1858K400K239K350K3917J0241k4490m729j036
15129a1006J4811o792L765K6006n916k0239J075J3501K646k3787m757J8524K1593
15116B9424k0748o921K5293K1403M189j7030j7774k9987L945j2731o12M746J9233
15103B430J3495N741k1641K6462K8262r472k8324l9108l335M1387k234j5123l189
15090d649N833q956o753L9390K6744Q176m683o853o38l0112m2032J9088K251j027
15076d221M113N464j3401P106P146Mk2851L20K2639N521J6506r941l641K774j8363
15061h25j1448M962R702L901j0350k233j3477k0270M577M445l2037n787m10J2518
15047e6732L4867K4450k8703j9098R533K3565Q632R285o507j2228k000P690K4617
$$ y = [-8430, -8358, -19115, -20210, -17480, -40, -21898, -19498, -17259, -14909, 9008, 19249, -5241, -9970, -11006, 3805, -2987, 778, 26784, 20868, 629, 1704, 15205, 17851, -5936, -10693, 7831, 29424, 8676, 1755, 27048, 48451, 52640, 35610, 17836, -12151, -8206, -20937, -21549, -16803, 2430, 15925, 21666, 25, 26487, 54749, 45277, 16953, -22155, -25490, 15897, 13663, -1460, -4649, 1184, -7772, -14525, 24865, 51609, 59785, 55102, 48249, 47611, 17499, -24533, -5445, -3194, -4221, -108, 5356, -8045, -939, 6207, 6211, -16640, -16320, 6319, 11840, 28346, 18405, 14764, 17538, -825, -12273, -7311, 2391, 6292, -4058, -6291, -19768, -40038, -35461, -31016, -63053, -68840, -69250, -56732, -21865, 2585, -26118, -45216, -35683, -12118, -3486, 5799, -708, -12936, -14936, -7246, 17371]
15034A7371J2120n67l0549r206k2932J2455J4867j2223j8514j644J6877K4934
15022B989o808p661j8360p204L967l751J6422j0787j2347N430o438Q369K3635
15009a2544K7625l885P183q412j3414P625J897J2206J3279j251j0890k37J1426
14996C0608j3258r657n0234j9410P762K787K1685Q911q520k6655n012k630J2539
14983e1084L1603J3678j2339j3834k192k0608J0276N231J9963L2717l612k728
14971G071p433P37M86k6139L16O745J0938j5422J0802j4355j2594j0580J8469
14958c0959L8569P616j7133k4495L064J013K2706J9420j4754k9946p45L7386k1954
14945a0212M066J169O900j406j4340Q124k6908l47r625r161k754L472j286k450
$$ y = [17371, 29491, 28924, -1625, -10831, -33763, -21308, -6441, -18664, -37178, -38822, -21945, 2989, -3819, -11480, -29840, -37044, -33077, -36828, -20406, -31193, -43540, -38110, -44548, -36179, -12544, 15081, 11196, 18379, 9967, -3447, 4178, 6075, 18281, 31560, 30309, 19419, 19182, 30608, 17350, 7693, -42541, -61951, -54189, -51402, -29717, -20806, -29326, -55981, -60993, -63623, -51084, -19481, -5803, -18142, -31976, -34168, -54776, -44500, -39269, -19306, 13411, 9799, 7071, -362, 375, 861, -25278, -24962, -18217, -7279, -22701, -11899, -26254, -38848, -49428, -30959, 7610, 15226, -1907, -26402, -23338, -22325, 381, 19801, 5047, -24899, -25644, 11742, -10212, -6146, -4977, 1923, 517, -13823, -5699, -32607, -32954, -42579, -51740, -54494, -51022, -52308, -54758]
14931e4758j3848Q278J9667M0357K0030k786j4805Q067R700J8935R244J550J5736
14918F5367l0574j3297P702j6399p805k7793R159J1159P480J7395M907j0867p558
14905H876R712q28j6589j2664Q681r092J9363r147k7519R012J7368J0796n4684
14892d6715K1783J8924J351J5424J1020Q098L4398p092j8178k931q667k7290l3327
14879c3202l6731j3682J2588M087K1650J7538J7716K0149P694j7518m6537j2108
14867e8356J7802J9926J3842O408N571k8047Q096J6005J00P744L0808J7338k7437
14854B9800o5963m9359K1836N3783j734J8643l211j7387m679K8786m155p684l4602
14841c5926L193K4184K4568J0400R284k1825K5996p808j5577k754k7378j3042
$$ y = [-54758, -68606, -60328, -40661, -304, 19726, 16940, 2135, 10202, 19902, 38837, 48081, 49631, 65367, 34793, 21496, 29198, 12799, 4994, -22799, -13640, -2481, 4999, 22394, 27301, 16434, 8876, 18588, 17760, 1171, -11493, -2812, -11904, 7459, -1688, -29207, -20195, -2827, 7969, -46715, -24932, -6008, -4657, 10767, 21787, 29885, 64283, 57191, 39013, 36082, 27415, 125, -33202, -69933, -83615, -71027, -66940, -45290, -27752, -10036, 10113, 17807, 289, -46248, -58356, -40554, -20628, -6786, -378, 5193, -22854, -14758, 1247, 1347, 9091, 39899, 57237, 29800, -36163, -85522, -63686, -9903, -11637, 7006, 3795, -13592, -18271, 10515, 6360, -1324, -35926, -32733, -8549, 16019, 26419, 35703, 13878, 39874, 32066, 16489, 13735, -13643, -26685]
14829b6685J6069K8913L704j4741j8831j392K8072J1883m645r397R039L066k3488
14816A567k2675j2229m5167r93K6379K0815J0465L0843J604J6836K0498k359k6204
14803A9380n064j4411k3904r988J0657j7338j4112Q856L8989O433j3420j1972
14791b5894q756J5474P266J5551j7376n214j3472k1270J6949O194J1194J0281
14779i073Q662j6383j759j756R226K3483J8171k7306j7724L1970N935k4564j3648
14766a4766J0336Q967k5600l355l727m319j6061k0793L5494M7155q472j1512n888
14753a2541l05m842K2312J2236k6261J6115j5115L214Q246m77K7482j0660k5158
14740e754k7925N39P635P920J8359K9745q227J3380J3272m023m899n185l186J652
$$ y = [-26685, -10616, 18297, 22001, 7260, -11571, -12963, 15109, 26992, 22347, 12950, 21989, 25055, 1567, -21108, -33337, -78504, -79497, -53118, -32303, -21838, 9005, 10609, 27445, 47943, 45584, 19380, 14316, -95, -23999, -33987, -23330, -40668, -54780, -45924, -6935, -502, -13922, -25894, -34650, -19176, -11910, 3641, -13735, -18949, -32421, -53691, -36742, -30548, -19354, -9073, -411, -16794, -18553, -20309, -11083, 12400, 30571, 3265, -14459, 17511, 23446, -1118, -14766, -4430, 4537, -21063, -24418, -28145, -32464, -48525, -69318, -33824, 13331, 4859, -6653, -12541, -12846, -17688, 4624, 16860, -9401, 6714, -8401, -5187, 3059, 2582, 30064, 19404, -5754, -33679, -33140, -25505, -17585, 774, 30519, 22292, 35672, 48944, 44921, 40022, 34837, 31651, 33303]
14726C3303l453J6236M290k0079l4746k8536J6123L0215N222K4647k1343j1358
14714A0521P667k297k5760j0817N182q509R843K3628j3586q577P357k841J1971
14701C782K4149K3515m951j3518j3769k4326L0929J1208k3700p682K846L866j9169
14688f820j0540L3454N584j0321J7917k498J4013j3512j9339j2964j8297r892
14676c3215m166L0705K5863L1914k0885j2431j0379O013r479J145O387K6533P103
14663D5108m598P747J5631q837q456P641j0640j2982j7749j2562Q324J2115j6164
14650D578m682k9440j7371K1677J6437j5681J062K4128m027J1978k6328l575J8179
14637c065J3391K1354P600n908k3190j0542j2285M259L0220K5170j9916n746j9963
$$ y = [33303, 29850, 46086, 50376, 30297, -4449, -32985, -16862, 13353, 18575, 43222, 21879, 10521, 18188, 15891, -9869, -20686, -15504, -24013, -14170, 9458, -4128, -12705, -5348, -8189, 3782, 27931, 51446, 46495, 32977, 19208, -5118, 25811, 37019, 13319, 5637, 8483, 12349, -6820, -17360, 16094, 21678, 11357, 29274, 26776, 40789, 27277, 7938, -5026, -23323, -33215, -37381, -6676, 19187, 51101, 30216, 17785, 7406, 13419, 3940, 5085, 11472, 38005, 45108, 40510, 48257, 63888, 55051, 46595, 54236, 43596, 30614, 12865, 303, 8627, 20742, 4578, -104, -29544, -46915, -25238, -8801, -24482, -23420, 708, -3319, 8659, -17669, -21244, -3065, 10326, 31680, 39280, 33372, 10182, -360, -12645, -8386, 21834, 47004, 27088, 21342, 1379]
14624A379l5101j3060L680K8977K5669J8618M50J769K6368j207p102j6942k3479
14611A0019k0959j6435K9706m322K6340P85n677M3904j4668J875N065l3995k3186
14598a548k3061K584J8737N5242J0238k7835k5261K4585m894j2511j0854r420
14586c998k8244m706K0184j793P877K9645K1046k5800k999p263m443J0223R159
14573A8888R12K026k997j983j2819j1153N165J6495j0194l218N298J5651k4449
14560b378J5274J1442K2345j5913l9706l4079K4062J7175j691J8586q920n628
14548E69N788o197n974k410J2123Q731N015k2208M326O345N88J8309Q957j8920
14534A5042n980j980n326l027r168M702O843j6434R080Q942J8318j810o715j4169
$$ y = [1379, -33722, -46782, -43102, -14125, 11544, 30162, 30612, 32381, 58749, 57542, 50440, 33498, 10019, -10940, -27375, 2331, -1991, 24349, 25134, 19457, 63361, 48693, 50568, 55633, 21638, -1548, -24609, -22025, -3288, 51954, 62192, 34357, 9096, 33681, 28787, 16276, 5422, -3998, -32242, -36948, -16764, -18557, -10680, 18965, 40011, 14211, 11212, 3949, -494, 9729, 18888, 19800, 21826, 18829, 16846, 4027, -7126, -1961, 14534, 4340, 1122, 6420, 22071, -2378, 12896, 24338, 46683, 30770, -8936, -43015, -18953, -1778, -3469, 15117, 6197, 569, 6357, 160, -5814, -8224, 3899, 12630, 17645, -4563, -237, 6108, 6696, 25005, 33962, 15042, 9062, 7082, 1756, -1271, -10439, -5737, 1106, -15328, -6248, 2694, 21012, 19202, 12487, -1682]
14520a682n054K2104q876k1859K871J0705L295r582Q810k900j65j938J2362K5024
14506C3115O560j0149r028J1001r717r273K37M61J6704m7630j2301J666M5248
14493A6894r585j2420P369R196k047j3289k0422r394J663J3110J4312O575P345
14480I307j0730j1596R533P743P44J3448k0194l2221K1007J1812j1209j2461J7825
14467f992m647o001j2799j5677K5834m40J6124N842J2014n156j5411O323K223
14454A237K0321K8268j3803j1287M444j9245k9197o386J554n976L6082K3486P240
14441C6738L82k480J0593k2568l6065n373O938P997J7110P316q927j1653q685
14428h677q368j4910J1335M6734K2911j5279O976k9304j7307J765K0314N940k6107
$$ y = [-1682, -6736, 15368, 6492, -15367, -12496, -1791, 1504, -8078, 732, -2168, -2333, -4271, 8091, 33115, 39675, 29526, 20498, 31499, 21782, 12509, 12746, 13207, 29911, -17719, -30020, -28354, 16894, 7309, -5111, 2258, 11454, 9407, -3882, -24304, -33698, -32035, -18925, -4613, 1962, 9307, -1423, -13019, -3486, 4257, 5001, 18449, -1745, -33966, -12959, -1147, -12356, -24817, -6992, -11639, -17640, -30439, -46116, -20282, -20722, -4598, 1244, 13258, 8102, -7309, -986, 1237, 21558, 49826, 36023, 24736, 29180, 9935, -19262, -25648, -24094, -30070, 6012, 29498, 36738, 37120, 34640, 45233, 22665, -13400, -18773, -11835, -3838, 13272, 20588, 11661, 8, -8677, -17045, -31955, -20620, 26114, 49025, 33746, 40722, 11418, -5889, -4124, 16190, 22130, -3977]
14415c977J186J7945J9897N968k5512j1703j1349J5533K2801p372k022J2562k8172
14402E785j0135M494K5868J4720K641j3775l32M436j3937j8692k6172k1794k4536
14389g1429K2078J4891L393K1641J7383O38J3896J9099k2718j3216n11r643K6216
14376B1718L2785J8690l579k0453K268k0634J3715J3850j8606J7064J5140J1270
14364H3228m4267m4151j9253k1802N655J3234n701r157J4565M0695K8898K0757
14352F2701q857k0396L386J0505m669R286j3302J8579J8648m612k6283k7536r416
14339H034J8603J751k4208J99J6306j4374k752K5611Q14K632j3640r678J570j6722
14325e854j6197L986K5204J531l0771p11N083J2388j407K8009L545j0050J2552
$$ y = [-3977, -2791, 15154, 35051, 41019, 15507, 3804, -7545, 7988, 30789, 23417, 21395, 33957, 5785, -4350, 144, 26012, 40732, 43373, 29598, 29266, 33702, 19765, 1073, -25099, -46893, -71429, -49351, -34460, -31067, -9426, 7957, 8595, 22491, 41590, 18872, 5656, 5145, -4498, 21718, 54503, 73193, 69614, 49161, 51429, 30795, 44510, 58360, 39754, 56818, 71958, 83228, 38961, -5190, -24443, -46245, -40590, -27356, -33057, -42214, -27649, 13046, 41944, 62701, 53844, 33448, 36834, 47339, 42670, 51956, 38654, 57233, 75881, 71269, 44986, 17450, 8034, 26637, 28388, 4180, 4379, 20685, 6311, 3559, 29170, 29984, 32616, 18976, 9298, 10868, -5854, -22051, -18065, 7139, 8670, -22101, -22812, -17729, -5341, -6748, 21261, 24806, 14756, 27308]
14312B7308J1643J9k3161Q459J6422j5439K9927J8746k523k2201k3806j2441M459
14299A7412J5765Q236k1930J1863J2034j4204P564p767k3823N905M524j7038l0952
14286c2411K7888J1180j348J2187n313k0448j7956l952J7009K3190L5680j8970
14274B6736l6725n637j027K3546P946J5289J168J17j237l707J8093l333k4683
14261A6546j4837Q151J5067n024J500o613l0599L205P431o199K1716J5385K8067
14248E3796k4386j7800j1169l0653j0393q217m388J4226K0471J5824L291J7241
14236A7843r334k0052j0191J1749J4624p186J6559M453M433J3173j1203K2428
14224D7296L7628K7502l9426j4864N071j3358j8619j5908m063l0136j9310j1368
$$ y = [27308, 38951, 38970, 15809, 24268, 40690, 25251, 55178, 73924, 71401, 49200, 25394, 12953, 17412, 33177, 41413, 19483, 31346, 43380, 29176, 36740, 28973, 5150, 11055, 15579, -1459, -32411, -4523, 6657, 5309, 17496, 12183, -8265, -26221, -30173, -13164, 10026, 45706, 26736, -9989, -15626, -16653, 6893, 14839, 30128, 31296, 31413, 30176, 26469, 44562, 41229, 16546, 1709, 9860, 24927, 19903, 21403, 14790, -15809, -12604, -5173, -11372, 10344, 25729, 53796, 29410, 11610, 441, -30212, -40605, -48822, -53210, -38984, -18513, -2689, 602, 17843, 8509, -11543, -21734, -9985, 4639, -2547, 14012, 18465, 22898, 36071, 24868, 47296, 84924, 112426, 73000, 58136, 63207, 49849, 31230, 15322, 11259, -18877, -38187, -49555]
14212d9555P880Q815l055J5114L5985J1963j3227O20M252j2347j3320r917R057
14199g735L1254Q033j7387j7633r886L4556K0422J9583j7217n930Q567k1713l6674
14186a1760j1186K4546J0457j098j1076L283j6426j536m2054J561L0160K9261
14174D132K4388K7224k4086j3819M349J6540J1162m490l88j5353J096K4229Q356
14161F3340o746j3844R513n722m113K9513j8909j2956L950l797J5626K0025j17
14148G5763l8882j8426L2199J4813J7961K7788j2128k6997Q99J8047j1672n791
14136G3574l4287l0683J9638J3010o676K2843K6623q117k7012j2846j646l3410
14124A011J591Q960J1208j4653K7881L650m221j6105J2392K7630Q462n291k5927
$$ y = [-49555, -41675, -32860, -35915, -20801, 15184, 27147, 13920, 14540, 18792, 6445, -6875, -16792, -7735, 23519, 31552, 14165, -3468, -13354, 21202, 41624, 61207, 43990, 38060, 46627, 24914, -11760, -22946, 1600, 12057, 10959, -117, 3166, -13260, -14796, -56850, -55289, -25129, 4132, 28520, 55744, 31658, 17839, 22188, 38728, 49890, 45400, 45012, 29659, 30755, 54984, 63340, 56594, 42750, 52263, 46541, 42428, 71941, 53032, 40076, 44026, 40229, 55855, 75880, 75763, 36881, 18455, 50654, 65467, 83428, 111216, 99088, 72091, 72990, 91037, 79365, 73574, 39287, 8604, 28242, 41252, 34576, 57419, 84042, 75925, 48913, 36067, 34421, 1011, 2602, 11562, 22770, 8117, 35998, 39648, 35427, 19322, 31714, 59344, 67806, 62515, 36588]
14111C6588j3277J498j3964j3795P203L303J4114K4159K177L2956P258J2944j0396
14098I0768m0497k1355J1515K7650K763L193l791j5461J1981K2782M055j3947
14086G9656o709j6014N031J738R05j969P967O297j4698n61k0530k4003L5250L0003
14072H2363K5668M248m4292j8366l0519J4407J6949J1832L882l1550j9466k2418
14060g262K1213N87Q016J3630k275J2712P935J1948j7227R161K1559n071j684
14047G3242j9639m7209M455J5687O225L3046L0856N822l1530j1348J857O145L681
14034G1290R448R885k5046k4419k5511j03R783j2262O734K4431K1092J8883J6075
14021A00280j733K2169M970k6600m983p893M546J2185l3493l1540k0168o60K117
$$ y = [36588, 23311, 24809, 10845, -2950, 4253, 7556, 21670, 45829, 48006, 80962, 88220, 101164, 90768, 50271, 28916, 40431, 68081, 70844, 74037, 70246, 54785, 66766, 89548, 93603, 79656, 72947, 56933, 61964, 63702, 64607, 62638, 70605, 76902, 62204, 61643, 41113, 17110, 52360, 82363, 108031, 112279, 67987, 49621, 19102, 33509, 50458, 62290, 66172, 34622, 15156, -7262, 13951, 14538, 22554, 36184, 33909, 46621, 54556, 66504, 49277, 58438, 79997, 74926, 73242, 53603, 6394, 10849, 26536, 32761, 65807, 96663, 102485, 70955, 59607, 61464, 67609, 71290, 80738, 90623, 65577, 41158, 15647, 15544, 25327, 13065, 19799, 44230, 65322, 84205, 100280, 98547, 120716, 125686, 99086, 94103, 86210, 90756, 102941, 69448, 37908, 17740, 17080, 19197]
14008A9197J7135l866J492O707l510N556J9015K5653R598k2517r57j6003j9656
13995C7844k464L219R736Q943r085J8810J7888p766L642j4208r177n124m744n297
13981D2217K33J7467L493k6390R928K9184n131l0631o170J0397N0299j5306k2147
13968E7443J4554J1083r16N275l23N6q182l729K0745L034k685p977p828r636M354
13953G5268K6962O81l2179j6639J1650Q105N785M994p31j5566l167r174k1339
13940C4650Q918K3352k970M697J3520K7665m729j3925K2946l2885n0693p196J0159
13927C3509K2649Q600r227q196L1635J3892j434j5113K265K1126K0834K378J0817
13914A33735j982m1633k3403K2169J3911L4867J7050K543j3299p256J2387k5847
$$ y = [19197, 36332, 32466, 33958, 40665, 37155, 42711, 61726, 87379, 96977, 74460, 73503, 57500, 37844, 35380, 38599, 48335, 57278, 48193, 67003, 84891, 77125, 80767, 66559, 57382, 52258, 47514, 42217, 42450, 59917, 63410, 37020, 46948, 76132, 71001, 40370, 34200, 44597, 94896, 79590, 57443, 71997, 83080, 82164, 87439, 87116, 87172, 78990, 75261, 96006, 99040, 96355, 88378, 80550, 70914, 75268, 102230, 102911, 70732, 54093, 65743, 73848, 79633, 84627, 83896, 68330, 65163, 55989, 34650, 43568, 66920, 63950, 68647, 82167, 109832, 105103, 91178, 114124, 81239, 30546, 23350, 33509, 56158, 64758, 55531, 47335, 78970, 92862, 91428, 76315, 78580, 99706, 120540, 122918, 133735, 131753, 90120, 66717, 88886, 102797, 137664, 154714, 157257, 143958, 136702, 149089, 123242]
13902A23242n109N982N472K9698J0534m8j8311j6931R248K738n427j5885P068
13889A32271Q86O23m138J0962j6640m3897K934L5957J0150j1723P915J4242j334
13876A38208k8526j4965J1774J0565K0293p90l061J2411j5113l2858K1862R862
13864A29662J1733J9079R053q932K457J4676p393j5298n839j2492l658J5629j3148
13851A35529j6550J8613P35K2121J6596j1718J1879j2528j1862l6353k632O748
13839A20578P686J7808K5474Q950J112k9760r70j5363j439K3687J3974M984J2783
13826A89504N03m8544j1206N869K3454L3178K1830k0116n173L7477J4732K3534
13814B65042Q70j2365k7943J2370K5748R767j8544j9312J054J1475J5373j446
$$ y = [123242, 118133, 124115, 129587, 159285, 169819, 169771, 151460, 134529, 143777, 146515, 141088, 125203, 132271, 133157, 133780, 129642, 140604, 123964, 80067, 83001, 118958, 129108, 117385, 125300, 139542, 138208, 109682, 94717, 106491, 117056, 137349, 136559, 133498, 145909, 130796, 97938, 119800, 129662, 141395, 160474, 169527, 160595, 163052, 177728, 170335, 155037, 149198, 136706, 133048, 148677, 135529, 118979, 137592, 138327, 160448, 177044, 165326, 177205, 164677, 152815, 116462, 113830, 120578, 128264, 146072, 171546, 180496, 181608, 151848, 150878, 135515, 134076, 157763, 171737, 176721, 189504, 190007, 141463, 130257, 136126, 159580, 192758, 214588, 194472, 189299, 226776, 241508, 265042, 265912, 253547, 225604, 237974, 263722, 273489, 254945, 235633, 236687, 248162, 263535, 262089]
13802B62089j9364n270j2660R983L0478L4261k3809j8181j7080L012K2975R009
13790B75443K1395M4043R774k5756j4765n610k9882J8560J9039R160j2547k1982
13778B86872l196J2413j0162r149L2215J2766j044o474J1369K3651n35N536k5089
13765C29173R444K671l617j6372K7823K6145P80O425j4114l917Q247R581K0774
13752D03043O282r565k0187k4532l0168N417L3470J307P10R389J6911j0502j6872
13739C64703J9020p66L029m628O551M663n574J6593r397j4029J7369l592J8235
13726D12177K1035r290l1298j2268J3906J3752P840j5441M49K2257k866l4449
13714C85804N781J0703n00k4862l771J5493k479K205j6157m998K6299M5343J4347
$$ y = [262089, 242725, 237455, 224795, 234778, 265256, 299517, 275708, 257527, 240447, 243459, 266434, 275443, 296838, 340881, 350655, 324899, 310134, 304524, 274642, 293202, 312241, 321401, 308854, 286872, 283676, 296089, 285927, 276778, 308993, 321759, 320715, 314241, 325610, 349261, 348726, 354262, 329173, 338617, 341288, 337671, 321299, 349122, 375267, 376047, 382472, 368358, 364441, 372688, 382269, 403043, 409325, 399760, 379573, 355041, 324873, 330290, 363760, 365067, 365777, 375166, 392077, 381575, 364703, 383723, 382957, 385986, 381358, 387909, 392572, 386998, 403591, 394194, 380165, 397534, 393942, 412177, 433212, 423922, 392624, 380356, 394262, 408014, 415854, 400413, 400862, 423119, 420253, 385804, 391585, 402288, 401788, 376926, 373155, 388648, 386169, 388374, 372217, 367219, 393518, 438861, 453208]
13701D53208j5963j1885J9857J9562J3368j3099j4401J1104K853J4437J7753L7425
13689E34219O20j9839N476K514L8628J4943K1209K0035K4809O231j4911J5241
13677F49175J2889n73K2152J9582K3777o790J6018J5101O92O726Q905J9459J897
13664G89010k9598L667K0096J5337J4083K0476L9176M82J5931N317Q221J1882
13652I14080j646J8458L9603Q956o960j6959J3476r826J4340J0663J6347mR620
13639A010148N7835L4923K6783L1536L9943L9145J5347K4032K1874L0529M4346
13628A376441J2584K658N4549M8177L4235K8970M1202M1707K0232K8776N9519
13617A749050O3468J8480P7613R6915P0532P1080O5331Q6303R1536N2034P7254
$$ y = [453208, 437245, 425360, 445217, 464779, 478147, 465048, 450647, 461751, 464604, 479041, 496794, 534219, 534839, 515000, 520476, 522990, 561618, 576561, 597770, 617805, 642614, 648845, 633934, 649175, 662064, 661491, 683643, 703225, 727002, 720212, 736230, 751331, 752023, 758749, 767654, 787113, 789010, 759412, 763079, 783175, 798512, 812595, 833071, 872247, 872729, 888660, 893977, 902198, 914080, 912434, 930892, 970495, 979451, 972491, 955532, 969008, 959182, 973522, 984185, 1000532, 1000528, 1010148, 1067983, 1102906, 1129689, 1161225, 1201168, 1240313, 1255660, 1279692, 1301566, 1332095, 1376441, 1389025, 1391683, 1446232, 1494409, 1528644, 1557614, 1598816, 1640523, 1660755, 1689531, 1749050, 1812518, 1830998, 1908611, 2005526, 2076058, 2147138, 2212469, 2298772, 2390308, 2442342, 2519596]
13606B519596J00971J02806Q4051J13856J17797J32379J30127J11018J50732J38505
13596C701838J62734J45709J65082J86382K12797K33132K25791K51747K76054
13587E561266K77582L34493L79874L88556L82600M28468M71094N31509N77577
13578I333019O26258O61459P49248Q24049R24703J013966J104764J249601J376673
13569A7863740J511529J686920J855658K023565K214079K462512K688851K903579
13561C5210433L094671L292187L424098L505452L583636L547790L428424L214895
13553F2301586K959273K577363K175532J786365J368787R88557O47859L06242
13545G5111564M7062j02598k38413l45271m08457m83466n27412o14588p27408
$$ y = [2519596, 2620567, 2723373, 2807424, 2921280, 3039077, 3171456, 3301583, 3412601, 3563333, 3701838, 3864572, 4010281, 4175363, 4361745, 4574542, 4807674, 5033465, 5285212, 5561266, 5838848, 6173341, 6553215, 6941771, 7324371, 7752839, 8223933, 8755442, 9333019, 9959277, 10620736, 11369984, 12194033, 13118736, 14132702, 15237466, 16487067, 17863740, 19375269, 21062189, 22917847, 24941412, 27155491, 29618003, 32306854, 35210433, 38305104, 41597291, 45021389, 48526841, 52110477, 55658267, 59086691, 62301586, 65260859, 67838222, 70013754, 71800119, 73168906, 74157463, 74805322, 75111564, 75158626, 75056028, 74817615, 74472344, 74063887, 73580421, 73053009, 72438421, 71711013]
13536G1711013q66624j044880j295144j552635j801929k071583k349770k605355
13528E8123093k845392l018115l123917l155085l139208l067920k934900k802396
13520C4036160k647731k467400k265784k065879j919770j750590j616499j479445
13512A7823062j337120j224301j095450r88912q69298q20416p77776o87489n95298
13503I427002n75260n29168n06485m83571l99537l60259l44320l05003l19659
13494E603740k90424k44827k22681k27891k10742j79568j83439j60233j41924
13485C742011j55813j48784j27720j37120j10273j13689j05526p4357o8831r1731
13475B608167j14116j17804n9690n0009p6863q2674o7329l9061m6150l8181o2612
$$ y = [71711013, 70844389, 69799509, 68504365, 66951730, 65149801, 63078218, 60728448, 58123093, 55277701, 52259586, 49135669, 45980584, 42841376, 39773456, 36838556, 34036160, 31388429, 28921029, 26655245, 24589366, 22669596, 20919006, 19302507, 17823062, 16485942, 15261641, 14166191, 13177279, 12307981, 11487565, 10709789, 10022300, 9427002, 8851742, 8322574, 7816089, 7332518, 6932981, 6572722, 6228402, 5923399, 5603740, 5313316, 5068489, 4845808, 4617917, 4407175, 4227607, 4044168, 3883935, 3742011, 3586198, 3437414, 3309694, 3172574, 3062301, 2948612, 2843086, 2768729, 2699898, 2608167, 2494051, 2376247, 2316557, 2266548, 2189685, 2107011, 2039682, 2000621, 1954471, 1916290, 1853678]
13464A853678m1981o4785m5689k2389m2352o1028l0247n0367n5558l1906j9377
13453A387999k2423j9973j8160k1383k9676k9531k1216k7735m1552l3887M846
13442A127309k9025n2250j3518p031j8189p713j6783j2202k2532j5447k7496L695
13430I08818O460q546k3598j3490j2985p254L049P170k7970j9985p94l8046j7177
13417G55652l756m0457l95J2113l720k8061l0990J957j1178k2749q506k6348N970
13404E99532o947J8509J1966j9906k5341j2769j4229j9216j0703P806p351K280
13392E23631j7953l3164R036J5918m459o891k0825j6589J6784J216k7324n455
13380D33925J0168R673j2627m8939J1279K247n418P98N475l5049J2966M5895K92
$$ y = [1853678, 1811697, 1746912, 1701223, 1678834, 1636482, 1575454, 1545207, 1494840, 1439282, 1407376, 1387999, 1365576, 1345603, 1327443, 1306060, 1276384, 1246853, 1225637, 1197902, 1156350, 1122463, 1127309, 1098284, 1046034, 1032516, 1025485, 1007296, 999583, 982800, 970598, 948066, 932619, 905123, 908818, 915278, 906732, 883134, 869644, 856659, 849405, 852454, 859624, 831654, 811669, 810875, 772829, 755652, 751896, 711439, 711044, 723157, 719437, 691376, 660386, 662343, 651165, 628416, 619910, 593562, 599532, 592585, 611094, 623060, 603154, 577813, 565044, 550815, 531599, 520896, 528702, 521351, 523631, 505678, 472514, 481550, 497468, 493009, 486118, 465293, 448704, 465488, 466704, 439380, 433925, 444093, 453766, 441139, 392200, 403479, 405726, 400308, 401106, 406581, 371532, 384498, 430393, 430685]
13367D30685k6283r466j1058k0390n1730k4212M2886M0243K2775k1392m7497l1333
13355B93228j2391l491J334Q545j2943q217K3160O465o279r95J2293K7353j4224
13342C13838l7712L363j2326K1674K2685J4753L529M026q842k1924J5608k0134
13330B98538l6648Q493J0710J3613k9091k237R155K3578R190K0380l1686k5026
13318B68969P312L7632L5428l0349m2209j4597k0289m5548m359K3983Q327L527
13306B27827o23P263N970j874p00q211l2297j1605J3351q963l535j0030k0912
13293A55661J9666M621M369m189k1168k3133J6919J6131O701k9426k4393J7103
13281A38862J545Q666M303j853K1840j6208m0986J6118O649Q672N37p22j6927
$$ y = [430685, 404402, 394936, 383878, 363488, 311758, 287546, 330432, 370675, 393450, 372058, 324561, 293228, 280837, 277346, 278680, 287225, 274282, 266065, 289225, 295690, 289411, 288416, 300709, 328062, 313838, 276126, 279489, 267163, 288837, 311522, 326275, 329804, 333830, 324988, 303064, 318672, 298538, 261890, 270383, 281093, 294706, 265615, 263378, 272533, 296111, 305301, 325681, 293995, 268969, 276281, 313913, 349341, 318992, 276783, 262186, 241897, 196349, 191990, 215973, 224300, 227827, 227204, 234467, 240437, 238563, 237863, 229652, 197355, 185750, 199101, 190138, 186603, 176573, 155661, 175327, 179948, 184317, 180128, 158960, 135827, 152746, 168877, 175578, 146152, 121759, 138862, 140407, 149073, 153376, 151523, 173363, 157155, 116169, 132287, 138936, 147608, 148145, 147423, 130496]
13268A30496j0899j4244n40R886K9930J8865J0079o424j073r934k0424l6006k6584
13255G3128R304O029l695p387Q965K5766r83J402M841J3166J0356R352L27q831
13241A41740j2359l3127j443k1019Q206J7002M848M302J3308R832q68l4757j6998
13228G8667K3509L2338J831J7647M009m327L0449K7759j3488n201l6389l7357
13216A19447P542M3034J030l3697K935j3899k5033j7080n29J9198k932J0138R859
13203A20013j9551q748J1928Q264l7314q75P948J4651J9247R247j4846j6241j1225
13190H2498o121N721J6724K620r493j4132m226J9747k4146k1253K4290L9581J0981
13177A22791j3539o027k195K3278J4481j327k7026j3912r891k2486k306K135j483
$$ y = [130496, 119597, 105353, 104813, 114699, 144629, 163494, 173573, 167149, 166076, 156142, 135718, 99712, 73128, 82432, 88461, 84766, 77379, 86344, 112110, 111127, 112529, 117370, 130536, 140892, 150244, 150571, 141740, 129381, 96254, 94811, 73792, 81998, 99000, 103848, 108150, 121458, 131290, 130422, 95665, 78667, 102176, 134514, 136345, 153992, 158001, 153674, 184123, 211882, 198394, 193193, 156804, 119447, 126989, 170023, 171053, 137356, 140291, 126392, 101359, 84279, 83750, 102948, 100016, 110154, 120013, 100462, 91714, 103642, 111906, 74592, 73717, 81665, 96316, 115563, 124810, 109964, 93723, 82498, 76377, 82098, 98822, 101442, 91949, 77817, 73591, 93338, 69192, 47939, 72229, 111810, 122791, 109252, 103225, 101030, 124308, 138789, 137462, 110436, 96524, 86633, 64147, 61841, 63976, 62493]
13164F2493q917K0272K7464j3306N724K1413J12p186K3891j1035k0985o79K2111
13151A21372k6770l363M4705N75k6743j1377M238o935j1269J1298K9465J7450
13139A42646k849k9152K4341J8292j620J9199K3952J524J1395l936k1184n121
13127A77487j1142j7660j8824J1186P834P146K322L5591J8113J1715K550j379
13115B24939r007N622J8826j0552j9502m5618k1479J6631M1698K9797K8785K2758
13103B82898K9060O8110P4574J20657J74641K44030L62553M57623L87674J85644
13093B387464P3495k1757k31431l81340m35909l83311k46835j78229j45808j00137
13083C36202m5906j9540k1780k7652l3732j9192j4587j8854J834J594j7116j5716
$$ y = [62493, 53576, 73848, 101312, 88006, 93730, 115143, 115255, 108069, 131960, 120925, 99940, 99261, 121372, 94602, 91239, 135944, 136519, 109776, 98399, 102637, 95702, 84433, 95731, 125196, 142646, 139797, 110645, 134986, 153278, 151658, 170857, 194809, 196333, 207728, 203792, 182608, 177487, 166345, 148685, 129861, 141047, 148881, 156027, 158349, 193940, 212053, 223768, 226318, 224939, 215932, 221554, 240380, 229828, 210326, 164708, 143229, 159860, 201558, 231355, 260140, 282898, 311958, 380068, 454642, 575299, 749940, 993970, 1356523, 1814146, 2201820, 2387464, 2460959, 2439202, 2207771, 1826431, 1390522, 1007211, 760376, 582147, 436339, 336202, 290296, 270756, 248976, 221324, 187592, 168400, 153813, 134959, 136793, 138387, 121271, 105555]
13071A05555J9325l9660k9055j7805J0957J5480J4865P424j8871m535Q000j0876
13059F0804R690J3403K0987J7521M059K872j3709r029k1294j5975k093L3753L443
13046A04432q642k4382l6850n346J8487q330R101j2361k8287n748M1791j4665
13034B9200j6237L0498K9692l600K300m826J2110j5459j0136k138M047o89m252
13021E0510j3106o052K4640K6975K4878j3416j0315k6019j131J1387P790k1919
13009E4222N025K0029K6902R766j1755j8224J9870K762p016J2628j4870n566J5439
12996A09212N420N309m944l6596m968L415k231K1501N868k8391J0689J8087l865
12983I8506j396M386J3223K4155L83k1490j7981l3568M180K7917J6023N40j7524
$$ y = [105555, 124880, 85220, 56165, 38360, 49317, 64797, 79662, 87086, 68215, 63680, 71680, 60804, 70494, 83897, 104884, 122405, 126464, 129336, 115627, 106598, 85304, 69329, 67236, 100989, 104432, 95790, 71408, 34558, 29212, 47699, 39369, 48470, 36109, 7822, 2074, 43865, 29200, 12963, 43461, 73153, 69553, 71853, 67027, 79137, 63678, 53542, 51404, 55451, 54762, 50510, 37404, 31352, 55992, 82967, 107845, 94429, 84114, 58095, 56964, 68351, 76141, 54222, 59247, 79276, 106178, 115944, 104189, 85965, 105835, 108597, 101581, 114209, 99339, 93773, 109212, 114632, 119941, 114997, 78401, 73433, 76848, 74617, 96118, 101986, 73595, 84284, 102371, 98506, 97110, 101496, 114719, 138874, 139257, 117767, 99786, 66218, 70398, 98315, 114338, 114878, 97354]
12970I7354k7187p972l501J2195J5389M217L2107j0528J5240K878k173l9270j3131
12957G5618M025j9228K676K3463j8744M37J4798J7461L1134J8823k9133j3845
12945A07485J0788j0641p900M781k7804J0706q49l7590J2869M174J9737p498M006
12932H2264N995N976j2129q407J1924L4898J5506R601j5582k479k4412j4742k3025
12919F5388J080J1112L1780l985J451J0089J4066R683M042P464K2397M4258K1987
12906B40812L3504O5835O7717K9204m524l584n31k0101m8363m7346l3159k1185
12894B58279m8018n6119P020j8797l631k101J5534m705J2680n556K4718l2822
12882A46482J771j4869l2409L951K0484M1248K0768k8096l3942j3650J0933O444
$$ y = [97354, 70167, 62195, 58694, 70889, 86278, 90495, 122602, 112074, 127314, 130192, 128019, 88749, 75618, 79643, 60415, 63091, 86554, 67810, 68247, 83045, 100506, 131640, 150463, 121330, 107485, 118273, 107632, 99732, 104513, 76709, 87415, 86566, 48976, 61845, 66019, 85756, 78258, 82264, 88259, 94235, 82106, 73699, 85623, 120521, 136027, 145628, 130046, 127567, 103155, 88413, 65388, 66468, 77580, 109360, 105375, 106826, 116915, 130981, 140664, 144706, 152170, 174567, 218825, 240812, 274316, 340151, 407868, 437072, 432548, 428964, 428433, 408332, 359969, 312623, 279464, 258279, 210261, 154142, 161162, 142365, 138734, 136633, 152167, 147462, 160142, 154586, 179304, 146482, 148253, 133384, 100975, 104926, 125410, 166658, 187426, 159330, 125388, 111738, 122671, 129115]
12870A29115L7718J425r820J62j1448J5795J4459J0390j6854n468N1301J9732
12858B36507J9070j8326m2084l4315J6417P361N470q099J5266j919R829J4896
12846B20073L6466M7126K1073j6004j6433k051j684n1043l9927m39m484Q868k886
12833A98655q199l2988l8004k9716k4617m82K0283K7393J8474J9300j56j1882
12821A38061l2949j9592K7954O11J2971K0530n011J4736J7476L5565j0331j9580
12809A80441j1301j473L497L416K3182M385k5782l3176k7460j989N173p85J6039
12796A34167P526J825J4519O96K555K8250J7534J1461R071L203J8241L394J1503
12783B63945L0515M5060R9016J17867J28397Q6616L8834L9214N5976O256o2707
$$ y = [129115, 166833, 168258, 158438, 158600, 147152, 162947, 177406, 187796, 170942, 165474, 216775, 236507, 255577, 237251, 195167, 160852, 177269, 184630, 190100, 182001, 197267, 195348, 205177, 220073, 256539, 303665, 324738, 308734, 292301, 290250, 288566, 237523, 197596, 197157, 192673, 201541, 198655, 190456, 157468, 119464, 89748, 65131, 64649, 84932, 112325, 130799, 150099, 149943, 138061, 105112, 85520, 113474, 114085, 127056, 147586, 142575, 157311, 174787, 210352, 200021, 180441, 169140, 167667, 171164, 174580, 197762, 202147, 176365, 143189, 115729, 113740, 118913, 118128, 134167, 141693, 143518, 158037, 158733, 161288, 189538, 207072, 218533, 227604, 230807, 249048, 252442, 263945, 294460, 339520, 438536, 556403, 684800, 771416, 810250, 849464, 905440, 911696, 848989]
12772H48989k8407l5412m5026p1720r4258n5498m5866m1702j0869l4342l1131
12761C54758j0432J7462J7691j7444r30J7079m379q29j387M833n338k3799k628
12748C44657M825K6816K7245L986k2412M524K2385k813J2174L55K3467L1789n962
12735D71036j4410k5365O461K5349J4334L8074M3836J5413L0137K8078M7384K8612
12723G08939K1621L0544M7017J9895J1157L1694L2896J6513L2445L6490L8956
12712A028167L0455L5396N0621N685r074J893N4743J7837K0229M6910O7200P8513
12700A428575P8153N9808R0557M9136R1147J09558Q5614R3708J09450J19603J35227
12689B450536J72488J55156K00759J99684J80917J53668J86042J88584J92121
$$ y = [848989, 820582, 785170, 740144, 668424, 574166, 518668, 472802, 431100, 420231, 385889, 354758, 344326, 361788, 379479, 362035, 361105, 378184, 373805, 372976, 371589, 376422, 371084, 347285, 344657, 349482, 376298, 403543, 407529, 385117, 389641, 412026, 409213, 421387, 421742, 445209, 476998, 471036, 456626, 431261, 437722, 463071, 477405, 515479, 559315, 574728, 604865, 632943, 680327, 708939, 730560, 761104, 808121, 828016, 839173, 870867, 903763, 920276, 952721, 989211, 1028167, 1058622, 1094018, 1144639, 1150324, 1141250, 1143143, 1197886, 1215723, 1235952, 1282862, 1350062, 1428575, 1506728, 1566536, 1657093, 1706229, 1797376, 1906934, 1992548, 2086256, 2195706, 2315309, 2450536, 2623024, 2778180, 2978939, 3178623, 3359540, 3513208, 3699250, 3887834, 4079955]
12680D079955K23168K43938K73350L54883L45469M18770N43407O08953O69317
12671G761210P99423R33449J066364J297548J589233J925753K379349K874353
12663B0626682L345615L895533M709248O034280Q045829J1025193J5403472K2371750
12655I5457602L4197196N3519596Q0370605R9246342P6318968K9878192R926659
12648D78915160p139285n3818731q8670845q6979214o6719486m6084166l1066991
12641I8436442k1476719j5469821j1441468q559080o516492n063673m096195l457104
12633B2355890k909041k395769j945530j619666j323862j111564r65822q63872
12625I220764p55904o59854n80004n47359m78037m09338l90712l68308l62552
$$ y = [4079955, 4303123, 4547061, 4820411, 5175294, 5520763, 5939533, 6482940, 7091893, 7761210, 8560633, 9494082, 10560446, 11857994, 13447227, 15372980, 17752329, 20626682, 23972297, 27867830, 32577078, 38611358, 46657187, 57682380, 73085852, 95457602, 129654798, 183174394, 263544999, 362791341, 439110309, 468988501, 478915160, 471775875, 417957144, 329286299, 242307085, 175587599, 129503433, 98436442, 76959723, 61489902, 50048434, 41489354, 34972862, 29909189, 25812994, 22355890, 19446849, 17051080, 15105550, 13485884, 12162022, 11050458, 10084636, 9220764, 8464860, 7805006, 7225002, 6677643, 6199606, 5790268, 5399556, 5031248, 4668696]
12616D668696l18824k60794k32609j87335j84705j62231j23969j24615j09418
12607B964196j27413j13456r2188r9368j06263j03499r8912p1929j14278q9881
12597A947009l0596m1749o9372p0014r1259n9318m8023n9417o1409n2443o0681
12586A302728l8859k9720o8599l3810k2970m2278l2488j4987k0120n5761N75k835
12574I40876j3097l541J5612l770K2206l131k0115l3194k1142o123m5686l1812
12562G97083j5008r048N115k3891l4954k8574l6574N574j320k2476L778k4820
12550F14885k9545L0826r080l2506j8577M376o452N286M524r820J8911Q645K4152
12537F05625K7312j1597l7565k2286j3997m3799j7540P660J9365L7245P3058Q6447
$$ y = [4668696, 4349872, 4089078, 3856469, 3669134, 3484429, 3322198, 3198229, 3073614, 2964196, 2836783, 2723327, 2631139, 2531771, 2425508, 2322009, 2223097, 2151168, 2036890, 1947009, 1916413, 1874664, 1805292, 1735278, 1644019, 1584701, 1536678, 1477261, 1415852, 1363409, 1302728, 1263869, 1234149, 1165550, 1131740, 1108770, 1066492, 1034004, 1019017, 998897, 943136, 943711, 940876, 927779, 924238, 939850, 936080, 958286, 955155, 935040, 901846, 880704, 874581, 828895, 797083, 782075, 773027, 778142, 754251, 719297, 690723, 654149, 659723, 658403, 635927, 639705, 614885, 585340, 616166, 607086, 574580, 556003, 560379, 553927, 559213, 563737, 553917, 572828, 581473, 605625, 632937, 621340, 583775, 561489, 547492, 503693, 486153, 493813, 513178, 550423, 623481, 709928]
12525G09928P1749P4907L4449j2900k1248r9344j00592n7383n9245l8050l1117
12514D71154q138j6970r013O357R136R187p921l0951m1646q854L5277m32j6837
12501C90349j8950j4299k2265j0060O481K3931k34m1780k9989j8852j9758k1826
12489B22748o119J0411q30r54J5683k5396k2247K4067K4786j9823P336Q209J5772
12476B53643J5536J8186j0066k69J2876L726k0200N793j0021m2434n8050m5861
12464A22859j1004J3187N050J4501q255m2204j7903l2698j4520K1849N17N9633
12452A11012K8931K7023j362J7480l137J2975o483l1702j8090j0926j7918L1O885
12439A14719o636J034L2295j144j6286l3466K6681J6575j818k0672p193q34O122
$$ y = [709928, 781677, 856584, 891033, 878133, 856885, 757541, 656949, 599566, 540321, 502271, 471154, 463016, 446046, 437033, 443390, 452526, 461713, 453792, 422841, 381195, 372341, 407618, 407186, 390349, 371399, 357100, 334835, 324775, 331256, 355187, 354953, 313173, 283184, 264332, 244574, 222748, 216629, 227040, 226210, 225256, 240939, 215543, 193296, 217363, 242149, 222326, 229662, 237871, 253643, 269179, 287365, 277299, 277030, 289906, 293632, 273432, 279225, 269204, 226770, 168720, 122859, 111855, 125042, 130092, 144593, 136338, 94134, 76231, 43533, 29013, 50862, 51379, 111012, 139943, 166966, 165604, 183084, 179947, 192922, 186439, 154737, 136647, 125721, 107803, 107834, 114719, 108083, 109117, 141412, 140268, 123982, 90516, 117197, 133772, 131954, 111282, 104089, 103255, 109377]
12426A09377q431j1371j5665Q440J8812p92j0802j2055j5857m4378o373N4409
12414F5314K7942O903J0017K694j9763J5543n3M980m77N688J7579j5779j4898
12401A05690J8458L4292L1488L540k1723j3611k4517j7747j2323j7068j4043J7131
12389H9567K125L692J290j096M850q454N054J3338r118j5984j0207j9940l2587
12376B2530o613J8147L2295K0141J549n864J8749N844J5052Q650K3284j1740k3860
12363A18164j0695J6306k4927l321j5027j9925K1917m248n809o68j5818J2857
12351F8806L0654o550j2803L030j0223k617k103k095q759J1898j2552j2586P52
12338D4852k7340j8579K0888K4016K6035k6542n726K2957K7038J5996j1511j1100
$$ y = [109377, 100946, 89575, 73910, 82350, 101162, 100370, 89568, 77513, 61656, 17278, 10905, 65314, 93256, 100159, 110176, 112870, 93107, 108650, 108597, 113577, 113100, 118788, 136367, 120588, 105690, 124148, 158440, 189928, 193468, 171745, 158134, 133617, 115870, 103547, 86479, 72436, 89567, 91692, 95384, 96674, 95578, 100428, 91974, 97028, 110366, 101248, 85264, 75057, 55117, 22530, 15917, 34064, 66359, 86500, 88049, 82185, 100934, 106778, 121830, 130480, 153764, 142024, 118164, 107469, 123775, 98848, 95527, 80500, 60575, 82492, 78244, 72435, 71767, 55949, 68806, 99460, 92910, 80107, 83137, 72914, 70297, 68194, 66099, 57340, 69238, 56686, 44100, 44852, 17512, -1067, 19821, 43837, 69872, 43330, 37604, 60561, 87599, 103595, 92084, 80984]
12326H0984j86r822J7468j576m483o679j2685J9050R876j4564K087n612r653O826
12312G1031q75O418j4161J416J2883K790l0360o706K5320K7459P199N42N878r00
12298A07934j4459k6347j9043l90K8102k991k4642J9849K1538j4651J792o781
12286F9911k5465K985j0106L4464M334J5510j8389O932l362J5376M63j9812k4980
12273D7861J6100J3752p383Q229L265J8467o309j4697j6140l370r027j0016p539
12260C3193K0722J6949m124p942l2357l692K2802J4763K324j3172l924k896o141
12247C6505j5P421J5692l34q460J6702K2053J0230p098m1286l014J775J0022n767
12233E4426m779J9998Q521o616J3319j2071J1485J3408p204J5739K0324K2094
$$ y = [80984, 80798, 70976, 88444, 86868, 82385, 75706, 63021, 82071, 91947, 77383, 79470, 73858, 64205, 71031, 70156, 76574, 62413, 63829, 76712, 79502, 49142, 42436, 67756, 95215, 102414, 102956, 108834, 107934, 93475, 67128, 48085, 47695, 75797, 72806, 48164, 68013, 89551, 74900, 76692, 69911, 44446, 47431, 37325, 71789, 76123, 91633, 73244, 80176, 76814, 92190, 92653, 72841, 47861, 63961, 77713, 70330, 78559, 81824, 100291, 93982, 79285, 63145, 59775, 50748, 40732, 33193, 53915, 70864, 66740, 58798, 26441, 22749, 45551, 60314, 62638, 49466, 45542, 42646, 36505, 36490, 43911, 59603, 59269, 50809, 67511, 89564, 99794, 92696, 51410, 48396, 50171, 60193, 54426, 49647, 69645, 78166, 71550, 84869, 72798, 84283, 97691, 90487, 106226, 126550, 148644]
12221A48644n969M48j1873j4587J4544K8948K1336R498J9626J1879K3080p499
12209B38075J24N0227P8372O7216J00683J90628K57421L65801M49560L91381J94467
12198B383955N3349l7074k54199m20331m20214l35668k65136j47887j08793p8739
12188C69263k1565k1811m6876n4218m1984j9318k5098k9233o1909L228J9537R730
12176G9746J085m6J5173K160k3913l3531k8181R069J6538J486J9894m717L6749
12163I1512J505J8184J1703K0875r336j2281M90k4226j9637J6643J9486J2201
12151A27119J2010p620l1045j3740j9318l122k681J7777j2344j3749R07P209K102
12138F3505J7992K1354M328J5607J5735k2036l0479j52J0069j0415J4755J4171
$$ y = [148644, 142675, 143123, 131250, 116663, 131207, 160155, 181491, 190989, 210615, 222494, 245574, 238075, 238199, 288426, 366798, 434014, 534697, 725325, 982746, 1348547, 1798107, 2189488, 2383955, 2437304, 2400230, 2146031, 1725700, 1305486, 969818, 704682, 556795, 448002, 369263, 347698, 325887, 279011, 224793, 182809, 163491, 138393, 109160, 47251, 50479, 70016, 79746, 80831, 80785, 95958, 98118, 74205, 40674, 12493, 21562, 38100, 39586, 59480, 54763, 91512, 93017, 111201, 122904, 143779, 134443, 122162, 122652, 98426, 78789, 95432, 114918, 127119, 139129, 131509, 100464, 86724, 67406, 64284, 61603, 79380, 67036, 53287, 54194, 61403, 63505, 81497, 102851, 107179, 122786, 138521, 116485, 86006, 85854, 95923, 85508, 100263, 114434]
12126A14434q561N079L4563J3330K4544j4847m7270p484j2502k07P887J8501K0369
12113A47836J4699K9183l5592o8390j0868K524j8869L48J7706j0030j2536j5732
12101D0279K935M2896k2474n3045k3708j708K3522J242Q342M0140K6841j1706
12089G3556k816M782R993j1244k898K7585K8714K0788Q735J1181K823j7369k3471
12076A30359q337J290j1562J743N760k1876J491O2839M3929l102j7901k1001j449
12063A62183p423J7349L6214L9146O4656L3542k3650l0492K3250M676j5611j2043
12051B91797m1861j9237N166j2198l7801j0650k593l8023M485J3441K1307k172
12039A71661j356J8729m255J9767L8758M086m8531l5164J3442J432k9090r71K2355
$$ y = [114434, 105873, 110952, 145515, 158845, 183389, 168542, 121272, 113788, 101286, 101079, 108966, 127467, 147836, 162535, 191718, 156126, 87736, 76868, 79392, 60523, 60871, 78577, 68547, 56011, 40279, 43214, 86110, 63636, 10591, -13117, -14825, 8697, 9939, 18281, 58421, 85262, 73556, 70740, 75522, 85515, 74271, 71373, 98958, 127672, 148460, 157195, 168376, 171199, 153830, 130359, 122022, 123312, 111750, 113493, 119253, 97377, 98868, 161707, 205636, 202534, 184633, 163632, 162183, 154760, 172109, 208323, 247469, 312125, 345667, 322017, 291525, 314775, 319451, 303840, 291797, 249936, 230699, 235865, 223667, 185866, 175216, 172623, 134600, 139085, 152526, 173833, 171661, 170305, 189034, 184779, 204546, 243304, 247390, 198859, 163695, 177137, 178569, 149479, 148508, 170863]
12026A70863k91R546L8667k614L765k7910m1742K8734O518l398L9634L3503l5561
12013B19714o225K2395O249j9463k0496j245L0511L3640K3517J8637J3557N015
12001C25806L2173J5369j2289k0192n421J9219L1667p321K2939K607L7295M4752
11989D86604n979R839L6599j2470m475K8116K6511L6599N5873L4646j0381R364
11977F90846J5490J3327J4047K3679M3934P6155N9822L9484M4218O4181N5235
11966A140418N3355Q4223J04442N3228O7156J26677J26497R4650J15391J21412
11956B087449J60941J85968K10897K45930L04147L36367L89325M22616N02001
11947D845641O35478P36057Q35968J038218J316852J646258K031380K645598L552964
$$ y = [170863, 170572, 180118, 218785, 216171, 219936, 192026, 150284, 179018, 185536, 182138, 221772, 255275, 219714, 213489, 235884, 242133, 222670, 202174, 200929, 231440, 265080, 288597, 307234, 320791, 325806, 357979, 373348, 361059, 340867, 335446, 354665, 386332, 379011, 401950, 404557, 441852, 486604, 480625, 490464, 527063, 514593, 510118, 538234, 564745, 601344, 657217, 691863, 681482, 690846, 706336, 719663, 733710, 757389, 801323, 877478, 937300, 976784, 1021002, 1085183, 1140418, 1193773, 1277996, 1382438, 1435666, 1502822, 1629499, 1755996, 1850646, 1966037, 2087449, 2248390, 2434358, 2645255, 2891185, 3195332, 3531699, 3921024, 4343640, 4845641, 5481119, 6217176, 7053144, 8091362, 9408214, 11054472, 13085852, 15731450, 19284414]
11938A9284414M860707O785527R691932J3870661J9746925K7386647L4889594
11931A36516407L4385651J5686141j3620406l2993917l5843006k8816460k0360429
11924E4953981j3869804r549086o748224m886659l653070k765972k118244j662161
11916I700761j327523j069348q52052o81467n73201n11416m41955l54587l22474
11907C566738l05469k34219k03747k32618j82672j54120j53516j69893j60979
11898A769505j03693l7518n5130o2575m6006o1646j14591q1128n0376l2307l4317
11887A090218k7873n2089n0317l7594o3337k6187l4954n4164k7509j7356l3772
11876F65066n135j8384m5496k8169k0497k6250l0789k2984R623Q719q298k2602
$$ y = [19284414, 24145121, 30930648, 40622580, 54493241, 74240166, 101626813, 136516407, 170902058, 186588199, 172967793, 139973876, 104130870, 75314410, 54953981, 41084177, 31535091, 24786867, 19900208, 16247138, 13481166, 11362922, 9700761, 8373238, 7303890, 6451838, 5770371, 5197170, 4685754, 4243799, 3889212, 3566738, 3261269, 3027050, 2823303, 2590685, 2408013, 2253893, 2100377, 1930484, 1769505, 1665812, 1628294, 1573164, 1510589, 1464583, 1402937, 1288346, 1207218, 1156842, 1124535, 1090218, 1062345, 1010256, 959939, 922345, 859008, 832821, 797867, 743703, 716194, 698838, 665066, 659931, 641547, 596051, 567882, 547385, 521135, 490346, 467362, 476985, 485704, 477406, 454804]
11864D54804l2743k0948m3113n3757o423L8895J7216l2652N252L1266O099l5491
11852C28405k3531k277Q222J8355K2919o554l2899l567n342q087j4342N759j4732
11839B72329j160k5378l1811o023K9479p822q176L183K0966N303j3570q326J2048
11826B41042j7758j3044j4536j746K667K4487r852j5620l969n139q848J2208J2278
11813B02170q12j9988L827K9467L9755j9158P188L5096k7379J4007K0360l0634
11801B53899l3873l2448R52J1814k0602n700o198M406Q735k8296l8218l548K0017
11788A30940l089M3148J6341k1346k5169n520L6864Q084l3691m5386p236J3998
11776A07938J4238K981K833j2686j3632J814j9235m695K467q908j0719r134K4693
$$ y = [454804, 422061, 401113, 358000, 304243, 297820, 336715, 353931, 321279, 326531, 357797, 363896, 328405, 304874, 302597, 310819, 329174, 352093, 345539, 312640, 309073, 303731, 295644, 281302, 287061, 272329, 271169, 245791, 213980, 207957, 237436, 229614, 221438, 224621, 245587, 250890, 237320, 228994, 241042, 223284, 210240, 195704, 193958, 196625, 221112, 211260, 195640, 191671, 186532, 177684, 189892, 202170, 201358, 181370, 185197, 214664, 254419, 235261, 242449, 277545, 250166, 264173, 284533, 253899, 220026, 187578, 188530, 200344, 179742, 174042, 167844, 172250, 180985, 152689, 114471, 110923, 130940, 127851, 170999, 187340, 165994, 140825, 135305, 172169, 180253, 146562, 101176, 93940, 107938, 122176, 125157, 127990, 115304, 101672, 103486, 84251, 79556, 82023, 73115, 62396, 53262, 77955]
11763G7955L1648J5151J310j6607k4440j316k4478k7759K7503K8267q827j6715
11751F1692J0848j7400J906O941l3291j9108R484L2356L5434l827k1685r682k3245
11738C0423r133l0495m076L9868L6702p98j0984k6746l8121J7247L2867N365j8833
11725B3286k5894j1277j3512O269J300J2727J2013j6172K9997Q661j2632j63J2891
11712B7494J2072M357l792K415j3208j6727K134K5245K0831M656J1861R85N154
11699H3477r398j5793M787L0011K0671j2086l4764j4844j1163R444J7821J802
11687F9965K132j6261j0396J1936L2743K914m3317k6555k171N8J5318j9023o441
11674A0902Q040J1087J2068k759o452l332j5911r279P062M913M0444K2618k264
$$ y = [77955, 109603, 124754, 126064, 109457, 85017, 83701, 59223, 31464, 58967, 87234, 78407, 61692, 72540, 55140, 57046, 63987, 30696, 11588, 21072, 53428, 88862, 85035, 63350, 53668, 30423, 21290, -9205, -13281, 26587, 63289, 62491, 51507, 24761, -13360, 3887, 36754, 42119, 23286, -2608, -13885, -27397, -21128, -19828, -7101, 4912, -11260, 18737, 27398, 14766, 14603, 27494, 39566, 43923, 40131, 42546, 29338, 12611, 14745, 39990, 60821, 65477, 77338, 78323, 83477, 74079, 58286, 63073, 93084, 113755, 101669, 66905, 52061, 40898, 50342, 68163, 69965, 72097, 55836, 45440, 57376, 90119, 93033, 49716, 23161, 20990, 21048, 36366, 17343, 10902, 18942, 30029, 42097, 39338, 32886, 29554, 13643, 4364, 11426, 16339, 56783, 79401, 77137]
11661G7137l2498j751L2806K3389l8010k0376J2658J2175k2487j1233j5964j4652
11649A194k65K5429J1432K9187K4991l8209j3141p480j4154j0736l117P359J1199
11636B3689J8116l2185L5705K3026j8166j6K0385R204J5910k5516K3015M557J4242
11623A11966j850j6974l2937N579n920j2633p922M536K5914J7996J1069k6955
11611G1869p937M335j7312j4153O435J332r527k9934m4J6347r504m268J5750L62
11597B3751L15j4039o847j8162K3213K6798J2956J0962j8255o320j0363J9287
11585D3296J179L018j6586J3528J6511k2797n5280j6782K9695M122k1761J3999
11573g858R632J4594J0412K1721J6362j536o516J149j0474j1377r956M680j675
$$ y = [77137, 44639, 42888, 75694, 99083, 61073, 40697, 53355, 65530, 43043, 31810, 15846, 1194, 929, 26358, 37790, 66977, 91968, 53759, 40618, 33138, 18984, 8248, 5131, 12490, 23689, 41805, 9620, 45325, 68351, 50185, 50169, 70554, 79758, 95668, 70152, 93167, 97724, 111966, 110116, 93142, 60205, 65784, 59864, 47231, 39309, 43845, 69759, 87755, 98824, 71869, 63932, 68267, 50955, 36802, 43237, 44569, 35042, 5108, 5064, 21411, 11907, 7639, 23389, 23751, 24066, 10027, 3180, -14982, 8231, 35029, 47985, 58947, 40692, 34372, 24009, 43296, 44475, 47493, 30907, 44435, 60946, 38149, -17131, -33913, -4218, -96, -21857, -7858, 1774, 16368, 26780, 48501, 64863, 63327, 56811, 57960, 47486, 36109, 26153, 30833, 29158]
11560B9158k070j4734K5084L2755J72m0343j0621K6499K2983l6848k6998J8716
11548B3753L069j387k6843m938K3516O869o759j6399O499K9572J1837M429k5832
11535B7386m1213M634K6304J8291l480j378J8056P005m868l1950j1357J7583K1473
11522D6486K3253p601Q051n872o875j2052j3831k0867m544K193j4919M180P476
11509E078M0182M71j6302j0872j9455o094q395l819K8858M600K8047L3756J3498
11496H9553j4353k4148l969r317j0697j2332r374r64J2115R963j9130P512M239
11483A9098l7441O351Q676J6479P383L750l924j8991J9261K0291J0112J1745n659
11470E7131k8742j4097K364N721k9317r494J5697j8197k1516R0L430M823K043
$$ y = [29158, 27088, 12354, 37438, 70193, 70365, 30022, 19401, 45900, 68883, 32035, 5037, 23753, 26822, 25435, -1408, -6346, 17170, 24039, 17280, 881, 7380, 36952, 48789, 53218, 27386, -13827, -9193, 17111, 35402, 31922, 30544, 48600, 55605, 50737, 18787, 7430, 25013, 46486, 69739, 62138, 70189, 64317, 57442, 45390, 31559, 10692, 6148, 8341, -6578, -2398, 5078, 45260, 45731, 29429, 18557, -898, -6992, -15387, -19206, 9652, 14252, 42299, 76055, 89553, 75200, 51052, 47083, 37766, 27069, 14737, 5363, 4399, 16514, 26477, 7347, 14859, 19098, -18343, -11992, -3316, 13163, 20546, 24296, 20372, 1381, 20642, 40933, 51045, 62790, 57131, 28389, 14292, 16656, 22377, -6940, -16434, -737, -18934, -40450, -40360, -36930, -32107, -30064]
11457c0064n526J0408J0237l4757J4300K3486N541O78j018j2258O363J9861P863
11444A5114p343q463J1265J519O451J5098L114j320r017j3823p905q63m46m011
11430f30n168O391j3085k255N484j8372R079n321K0420J3613k0959J080K8334
11417A8611J1351K1746R605j0661K237k0604m2305J1732R146k138j1708L7128
11405C4140K406K108K9599p260K376k710j8499k8426M758K6151m641l1103r440
11392e41J6827q46J2095k7474k7098r183J5010N471j6723j2182K6542N633j0149
11379b2618J2805r682J343p517j1376P836K8301J2052q020m519j964P50N826J062
11365D279J4665O108l7261l9563p38n072k867K4476j850J0131k490j892L281J2497
$$ y = [-30064, -35590, -25182, -14945, -49702, -35402, -11916, -6375, -5697, -6715, -18973, -12610, 7251, 15114, 7771, -692, 10573, 12092, 18543, 33641, 36755, 35435, 26418, 12595, 4690, 3827, 3381, -630, -5798, 593, -12492, -14747, -9263, -27635, -18556, -23877, -3457, 10156, -10803, -9723, 18611, 29962, 51708, 61313, 50652, 52889, 32285, -10020, 1712, 10858, 8720, -2988, 34140, 36546, 38654, 68253, 60993, 63369, 60659, 42160, 13734, 18492, 44643, 40002, 8899, -541, 16286, 15440, 27535, 61, -27037, -36220, -21210, -15739, -32462, -44644, -18102, -12469, -22618, -9813, -19495, -18152, -25669, -37045, -29209, -908, 11144, 3124, -1395, -3359, -2609, 3217, 4279, 18944, 25052, -12209, -51772, -52510, -57582, -60449, -35973, -37823, -27692, -30182, -32074, -28793, -16296]
11351a6296J3251J4914J1647K1040j8589j6670K348k5649J0048L717j1475l813
11339a5527L314n07J5210Q129P86p543R228R182K4324j3402k807K7206J3152l5752
11325C4993j3495J2880K6924j9919j7138o799m5L123o659j0345j0454J5239m000
11312D305k308M736J9323L1218K0950k707j0137l783j8314j0075o974j04j3259
11299A2871M085J326l0968k2518j3538L3932K867N803O610J1627J7626j8097J4167
11286B5793N780L696l4300L957P872J6859J6112m363j6879l029N287k667J2469
11273C6587q068m0624k8051R409K9838J8244K2869k672J1376J825j5484m366m202
11260B6681j6338K0751p707n775K7171L04R924K584k0798R778J4912j1057m501
$$ y = [-16296, -3045, 11869, 23516, 44556, 25967, 9297, 11645, -14004, -3956, -239, -11714, -15527, -12213, -12720, 2490, 10619, 11405, 3862, 13090, 22272, 46596, 33194, 30387, 57593, 70745, 34993, 21498, 34378, 61302, 41383, 24245, 17446, 17401, 20524, 13865, 3520, -6934, 8305, 4305, 1997, 6733, 26056, 57274, 78224, 75517, 65380, 61597, 43283, 33208, 26234, 26130, 12871, 16956, 18282, -12686, -35204, -48742, -14810, -11943, -6140, 470, 12097, 29723, 11626, 25793, 31573, 35269, 969, 4926, 12798, 29657, 45769, 41406, 24527, 21498, 26785, 24118, 36587, 28519, -12105, -40156, -30747, -909, 17335, 40204, 37532, 48908, 50733, 35249, 30883, 26681, 10343, 31094, 23387, 17612, 44783, 45087, 55011, 57595, 36797, 46575, 61487, 50430, 45929]
11247D5929k4302N90k741m4506k3234O033K8571L1185J6244K662l1156R697K5360
11234D0332N213k3154J2037J8536K5488j3894m398J3768j7396k0625P565m427
11222C9045J4190k5483l7826L3136Q588l251N965o211K3831j0328k2641l859J6788
11209C1944k210l670K2675J9394Q662k6841l5391J1890K673L611n423J0695N250
11196D3259k8774j2027J1163K2475r876k1021L23J6707r34j1506j6385k3920J7445
11183a3071M436j9324k0954K778J5548M266L101J4561J3778J3687j4284k183m303
11170a964J1080J6955k0571j7426n572l613J2513j0330j3031N46K2769N908n387
11157h123O036j4277l095J0016J5172O225J1000J704q896L9099R558r894n107
$$ y = [45929, 21627, 22217, 19476, -25030, -48264, -42231, -13660, 17525, 33769, 36431, 5275, 14972, 40332, 45545, 22391, 34428, 52964, 78452, 64558, 60160, 73928, 56532, 35907, 43472, 39045, 53235, 27752, -10074, 23062, 31650, 28399, 34364, 28153, 51984, 41656, 19015, 15156, 31944, 29734, 26064, 48739, 68133, 76795, 49954, 14563, 26453, 29126, 32737, 27314, 38009, 43259, 14485, 2458, 13621, 36096, 26220, 5199, 5522, 22229, 21295, 9789, -6596, -30516, -13071, -8635, -27959, -48913, -46135, -30587, -26321, -23220, -8659, 5119, 18806, 4522, 2339, -1964, 9116, 26071, 5500, -11926, -17498, -21111, -8598, -18928, -31959, -31413, -8644, -2736, -8123, -2087, -16364, -19459, -9443, 5729, 11954, 22954, 24658, 15762, 54861, 64419, 54525, 49418]
11144D9418l028J4214m114k8052k2455n506R274J2528j3307l809l413k0685O854
11131a2081M8249k8655j1459K8185L693k7765J383P405P187j3752j8137J9890
11119D143R625m952q391r18K2101j1457k0383L775K3284o7j3320L043l045j2571
11105i133o993n399r344K3060Q641R20J2632J9790J1400j545o306J509j180P853
11091D5905l62k5728N592K4305j0356m288l983j8711N447p469j0263K2898o896
11078A6091P083j3147l801R588k1597r004J3260J3099M7439J3199l81r642k2541
11065C9646j6066J170j7142J0385J8035P372l2946j3561K2785K9776K3171j5427
11053E7198m0213n088R679j1918n387O346J849J111l42J2867K6573L4054p472
$$ y = [49418, 46390, 60604, 56490, 28438, 5983, 477, 9751, 22279, 8972, 5163, 1750, -18935, -12081, 36168, 7513, -3946, 24239, 27932, 167, 1550, 8955, 16142, 2390, -15747, 4143, 13768, 8816, 425, -493, 21608, 10151, -10232, -6457, 16827, 16760, 3440, 6483, 3438, -9133, -16126, -21525, -30869, -7809, 832, 1752, 14384, 34174, 45574, 44029, 37723, 39232, 38052, 45905, 45543, 19815, 25407, 49712, 39356, 35068, 31085, 12374, 17821, 10352, 89, 22987, 16091, 23174, 10027, 6226, 15814, -5783, -14787, -1527, 11572, 59011, 72210, 71829, 62187, 39646, 23580, 24750, 7608, 17993, 36028, 43400, 10454, -3107, 19678, 49454, 72625, 57198, 16985, 11897, 21576, 9658, 4271, 10617, 12466, 13577, 13235, 26102, 52675, 86729, 79257]
11040G9257m172J4908K93k62j5260L048L5346L2143M6508K163q803q954k6484
11027A49731q488K7180k535j7675J8029J3147M4207J8473r632n562O922j8298
11015B15499n1191l3810J625L8335K1366k0793j3482j949k4985Q941l536m4876
11003I1144j9530j867q985J0685k1454O728J1291J718K118m901j7425J0110O470
10990F6102j5666k1143j6534J0057L2173m915j3678j4571j6705k46K7978j5684
10978A7168n117L713J6589J3848q63P33k3952j8074K6575K0745r601k3291m41
10965A8032o825p484K1910K6799j6536k6026j612q110r851M295J3185K7371j5627
10952A9521j2613P439o829k3381l2404K5851L5071J2215J0628N276J007M648J2041
$$ y = [79257, 75085, 89993, 90286, 90024, 74764, 77812, 113158, 145301, 191809, 193972, 185169, 176215, 149731, 141243, 168423, 165888, 148213, 166242, 179389, 223596, 242069, 232437, 226875, 233797, 215499, 164308, 130498, 132123, 170458, 191824, 171031, 157549, 155600, 130615, 139556, 136020, 91144, 71614, 69747, 60762, 71447, 49993, 56721, 68012, 69730, 71848, 66947, 49522, 59632, 66102, 50436, 29293, 12759, 22816, 54989, 50074, 36396, 21825, 5120, 4874, 32852, 17168, 12051, 15764, 32353, 46201, 45338, 46071, 22119, 4045, 30620, 51365, 41764, 18473, 18032, 11207, 3723, 25633, 52432, 35896, 9870, 8258, 148, -9703, -5408, 7777, 35148, 19521, 6908, 14347, 7518, -15863, -48267, -22416, 12655, 24870, 35498, 40774, 41781, 46429, 58470]
10939E8470j997j0612j5903l3348l4683L3828K1920o910K019l550k6147J2234
10927d679K7316J1463k2092j7273L135Q192M754K1208k2k1118O070n822j9811
10914h679M302K3512q608j2843K7638Q432k1758O989p67q967K3513J5837j4643
10901C3958m157k2101J3157J0676N665j2483k3515k4209l143K9469L0856P403
10889D1576l857r974j1895j3338j4327N716l933l5496n956M0845J0517l2822K4757
10876h187J7796Q480k4628l8052J7201K1392l5628L956K0776J1989J7534J1416
10864B4045K288Q317m680K3427j5788n7481q341K0590J9686j7695J9779q329j4226
10851h408J5641J9837r05m338J4013j3371j6129L375K8685N666k0j1707j8965
$$ y = [58470, 56473, 45861, 29958, -3390, -38073, -4245, 17675, 10765, 12784, 9234, -16913, -4679, 22637, 34100, 12008, -5265, -2130, 6062, 10816, 32024, 32002, 10884, 16954, 11132, -8679, -4377, 19135, 10527, -2316, 25322, 33754, 11996, 18985, 18218, 9251, 32764, 48601, 33958, 29801, 7700, 20857, 31533, 37198, 24715, 1200, -23009, -26152, 3317, 34173, 41576, 37719, 27745, 15850, 2512, -11815, -6099, -10032, -45528, -51484, -10639, -122, -32944, -8187, 9609, 18089, -6539, -44591, -27390, -5998, -41626, -37670, -16894, -4905, 12629, 24045, 26333, 34650, 29970, 53397, 37609, -19872, -28213, -7623, 12063, -5632, 14147, 5818, -8408, 7233, 27070, 26165, 21827, 35840, 22469, 6340, 9715, 38400, 44066, 44046, 32339, 13374]
10838A3374K6898K8887O733j2400j6414j1300J625K0380P02j9213j7100r47m694
10825A6531K0086k053K0408j0157j6574K6143M000P277k2305n676L774J2071J3273
10812F6798J5192L8934n034k8256l5987j3716K8715Q769j3654j181O952J1280
10800G8812j3976O334m0772k7573j202J1664L0356J9069j5147j9041O028o613
10788B7939k2200k5008l1110N2436M2409j9318p3l3136k6314J5284L5770K388
10776A9067J3177M984q650k6935J3280K9350J6195j7067j0606J2569r719r731
10764B5914j4804r118L710q198L0592p611r145j6804n778R476K515J8720l1368
10751a1899p861K2711J5840Q388O680j0961r082O998R683l640K7283K0468p62
$$ y = [13374, 40272, 69159, 75892, 63492, 47078, 35778, 37403, 57783, 58485, 39272, 22172, 21225, 16531, 36617, 34564, 54972, 44815, 28241, 54384, 58384, 65661, 43356, 37680, 41454, 53525, 66798, 81990, 120924, 115890, 87634, 51647, 37931, 66646, 75415, 61761, 60580, 67532, 78812, 64836, 71170, 30398, 2825, 1623, 13287, 43643, 62712, 47565, 28524, 34552, 27939, 5739, -19269, -50379, 2057, 44466, 25148, 25075, -8061, -34375, -19091, 16679, 19067, 32244, 37228, 28578, 1643, 14923, 44273, 60468, 43401, 32795, 45364, 35645, 25914, 11110, 1992, 5702, -2496, 28096, 20485, 11340, -5464, -11242, -1766, 749, 19469, -11899, -19760, 2951, 18791, 27179, 33859, 22898, 13816, 20814, 30497, 26857, 54140, 74608, 73846]
10738G3846j1348k8730l4140K52L0272K2750j0349j207j0547K1678L5101L1114
10726A18692K0244o786l2498J9324q069j7136n1892J7637K4181L530j5325r730
10714F2172K210l3510K601p967K0956J3346N9616K9051L714k7255l8732j6338
10702F9864r13j5230p665J1296l73j9642k0986P006L1502k301Q544N493j3395
10689E3200k125J6920j8790L785j8267p30j017J0054K7055O515J7457R428q773
10676I4712j0996O341J4420K6827m450j2485j2927k5955m682J6503L2809L1070
10664A51187L2146j4055j4763l1887K7652K3107N2253J7852k6388j1706l3435
10653A71963J2080p765K4972L0660J3700K739j5035O93L9564K1993M873m052J9317
$$ y = [73846, 62498, 33768, -372, -120, 30152, 52902, 42553, 41346, 30799, 52477, 87578, 118692, 138936, 132150, 99652, 118976, 110907, 93771, 41879, 59516, 83697, 87227, 71902, 62172, 64382, 30872, 33473, 25506, 46462, 59808, 119424, 148475, 152189, 124934, 86202, 69864, 68951, 53721, 46056, 57352, 56979, 37337, 16351, 23357, 54859, 52558, 61102, 66595, 53200, 51075, 67995, 49205, 52990, 34723, 33993, 32976, 43030, 70085, 76600, 94057, 103485, 94712, 83716, 90057, 104477, 131304, 126854, 114369, 101442, 75487, 70805, 87308, 120117, 151187, 183333, 169278, 154515, 122628, 150280, 173387, 225640, 243492, 217104, 205398, 171963, 184043, 176278, 201250, 231910, 245610, 248349, 233314, 234007, 273571, 295564, 300437, 296385, 315702]
10640C15702J2881k576M2167M8377J7248R901O2164L0232O3000R7680J10881P7940
10628H85597Q7590Q3848P1726J19379J76958K25788K63567L23338M36293O38124
10618C312208Q69123J168192J544773J932441K099461J747514R11760O15n61821
10609A3024266o32077l01863K41206R33663J806359K869354L868685M222261L200285
10600B9232139Q38026j459097k567110k433679j599939m78693Q05668K235296
10592B4572611L744369M970981N185979L234519m27264l638486m940358m604003
10584B8098348l457441k099003p66300N34264J776368K635179K596703J055668
10576C0373786j439340l380062l989151l589860k696836j774354r07613k08610
$$ y = [315702, 328583, 326007, 368174, 416551, 433799, 443700, 505864, 536096, 599096, 696776, 807657, 885597, 973187, 1057035, 1128761, 1248140, 1425098, 1650886, 1914453, 2237791, 2674084, 3312208, 4181331, 5349523, 6894296, 8826737, 10926198, 12673712, 13585472, 13586087, 13024266, 12392189, 12090326, 12331532, 13265195, 15071554, 17940908, 21809593, 26031854, 29232139, 30070165, 28611068, 26043958, 23610279, 22010340, 21531647, 22337315, 24572611, 28316980, 33287961, 38473940, 41708459, 41281195, 37642709, 32702351, 28098348, 24640907, 22541904, 21775604, 22309868, 24086236, 26721415, 29318118, 30373786, 28934446, 25554384, 21565233, 17975373, 15278537, 13504183, 12596570, 12387960]
10568A2387960L65673O52190M91585j41529j074079j785002k018447j850902j497159
10559E530290j087262q75599o37798m93684l81152k80783k19536j84573j53804
10550A216099j31496j01242p1519o2088l8574l3914n5960p3593m2297l5536l0112
10539E39768m1937j7784k0317o1436n5502r367o143o010K108K465j4907j6876
10527B94062r783n0680k5137r022L23L000L0231R361J405l5992j0484J739q981
10514A90042l3526p652K4771p545k2490o620K0322j0490j0809K7815J4101M223
10502A82142j1502j8503L094p72l661L119j7347N058j1015J4790k304L1584J3705
10489A88388k8266p171j6151l5190P527j1198p334o070j3492K2768L8445l700
$$ y = [12387960, 12753633, 13405823, 13897408, 13755879, 12681800, 10896798, 8878351, 7027449, 5530290, 4443028, 3567429, 2929631, 2435947, 2054795, 1774012, 1554476, 1369903, 1216099, 1084603, 983361, 911842, 849754, 811180, 777266, 721306, 647713, 605416, 569880, 539768, 497831, 480047, 459730, 398294, 342792, 333425, 327282, 321272, 323380, 325845, 310938, 294062, 284279, 233599, 208462, 199440, 199763, 202763, 232994, 242355, 243760, 207768, 197284, 199023, 190042, 156516, 148864, 173635, 166090, 143600, 136980, 157302, 146812, 136003, 163818, 177919, 182142, 170640, 152137, 155231, 154459, 150798, 153917, 136570, 141628, 130613, 145403, 143099, 174683, 188388, 160122, 152951, 136800, 101610, 109137, 97939, 90605, 84535, 71043, 93811, 132256, 128556]
10477A28556k2414P449l1811k3004j1254J898m011j944r298K5339K6288K0369
10465A06163l935P061J4539J241L831k0365j6692J5639o378J412J8688P857l1432
10452I7629l0723m70J8444J69p589k2802J840M5100L279j5550q518j036J1947
10439I1720k0594j4697j825J2132K6602j2477l418j9705j3809J3461L0818L320
10427I1528j5948k1301m8672k1937K6733K7013p10n535r044j0615K3283P9J7219
10414E2093J8767m240j0143N02j4304K589l8094m306K4361j095J3430o237k0073
10401A3250j2697o276j4383l1512j960L1047O056J3983K0192l735N613k8341L715
10388e048K4933J9262j0335k7586q835K7215j1281m665J0724J6816n556j1977
$$ y = [128556, 106142, 113591, 81780, 58776, 47522, 49420, 45409, 43465, 34167, 59506, 85794, 106163, 102228, 109289, 123828, 125069, 128900, 108535, 91843, 107482, 101104, 102516, 121204, 129061, 97629, 66906, 66436, 84880, 85049, 77460, 54658, 56498, 101598, 104877, 89327, 80809, 79773, 91720, 71126, 56429, 54604, 66736, 93338, 80861, 77443, 57738, 43929, 57390, 88208, 91528, 75580, 54279, 5607, -16330, 10403, 37416, 36706, 31171, 22127, 11512, 34795, 34874, 52093, 70860, 66620, 56477, 56979, 42675, 45264, 7170, 2864, 27225, 26130, 39560, 33323, 13250, 553, -5723, -20106, -51618, -53578, -22531, -16475, -2492, 17700, 13965, 19578, -8763, -5048, 19885, 39147, 28812, 1226, -7609, 19606, 8325, 3660, 14384, 31200, 25644, 13667]
10376A3667k6809j1672K1478K8336J2684k1778m046m249k793P230J750N326j0001
10363I123o469L4411J9138j5968l0695j7461j1779q409N220J9604o889k2451L604
10350b9021P687J3605J1445o642k208m719j9926k643j1550J6484M991R387j01
10337a3211o883j2487J3953J8595m689l1565n454J4725J3223O955J5769K146k3620
10324a2543K0243K8103j9193j1774O53j4456m363M340k408Q523K013j8823j279
10311b0964j9660j048L6073J5223j1294j6409P033J2603q620j7138J1560O967
10299e674Q79N039o585k76K047K4036p337N799L0592k270n632k3507j1975k5400
10285b0264N844R220k66j1922j5J1153L9322p940k9885j3606J2790p431L0682
$$ y = [13667, -13142, -24814, -3336, 25000, 37684, 15906, 11860, 7611, 4818, 12048, 13798, 19124, 9123, 2654, 37065, 56203, 40235, 9540, -7921, -19700, -28109, -22889, -3285, -10174, -32625, -29021, -21334, -7729, 3716, -2926, -5134, -9853, -29779, -32422, -43972, -27488, -22497, -13110, -13211, -20094, -32581, -18628, -33, -4722, -36287, -41741, -27016, -13793, -6838, 8931, 11077, -12543, 7700, 35803, 16610, 4836, 5489, -8967, -13330, -8990, -11398, -2875, -862, -19685, -20964, -40624, -41672, -5599, 9624, -1670, -18079, -11046, 1557, -7063, -24201, -12641, -5674, -4795, 244, -6341, -6617, -4570, 19466, 12129, 17928, 48520, 46250, 40618, 17111, 5136, -20264, -14420, -5200, -5466, -17388, -17403, -6250, 33072, 25132, -4753, -18359, -5569, -13000, 17682]
10272A7682K4410k4970j6850j0787q413R472J1253J6337M611R904J5059j9991
10260B7717j2068J2893J4269J3824J0969o219K7328J9761J1591l1399l0116p111
10248E1439o15J5337L22k9351o474o76l5641K3787j934l1438J9533r395M227J4609
10234A3730J4919j9400Q821l523p38M846J7528p649k2722j9429K594K3977O366
10221A9320j0530p764j1742q028k666J4204K7649K0626l895j0041o013K075M017
10208B7212L0144n890k8910J6965J1210l2023j1232J7049j2318o203p984J4692
10196A2712j250J9096J6581k5324k298J0967m895k1130o83m90J0858k8759J6193
10183A578J3214J9171K0269N763l472J0475j1690r013j883J2250J1016L544o860
$$ y = [17682, 42092, 17122, 272, -10515, -18928, -9456, 1797, 18134, 22745, 32649, 47708, 27717, 15649, 28542, 42811, 56635, 67604, 61385, 88713, 108474, 120065, 88666, 58550, 51439, 50824, 66161, 66483, 37132, 30658, 29982, -5659, 18128, 16194, -15244, 4289, -5106, -879, 13730, 28649, 9249, 18070, 14547, 13809, 18655, 36183, 28534, 5812, -13617, -11023, 12954, 19320, 8790, 1026, -10716, -18744, -21410, -7206, 20443, 41069, 37174, 27133, 21120, 23195, 27212, 57356, 51466, 22556, 39521, 50731, 18708, 7476, 24525, 12207, 6004, -1980, 12712, 11462, 30558, 47139, 21815, 19517, 30484, 25589, 4459, 3776, 3286, 14144, -14615, 1578, 14792, 33963, 54232, 59995, 56523, 66998, 55308, 46295, 44412, 56662, 67678, 71222, 64362]
10170F4362O992k5233L784L0931L0721L8932O482M953k8576k0565j4196P571M9666
10157A55824K6678k0489j2355J8891N9376R143k9094k0459l9397k5655j4588j1178
10145I6697J0313K1009K1776n815k249K0817J6382p357k8136m0995j0898q041
10133H3503l3366k4531Q378k2442n485J3138P185j032m0141j804N2211J1428l8805
10120H237r406J7271o239j7313M96R523j4694j5966l9951K311J561o504J1260
10107e9414K167J269K323L1067L2615q467k7368K5180J4254k7247j6504K5347
10095d778L5768m742k401J0363j6718j9272j6524l190k1820j3452K5708K0403
10083a0655J1672j1476l3987j352J0495K9973J3292J610j2297K3541k2j0458j1918
$$ y = [64362, 71354, 46121, 49905, 80836, 111557, 150489, 156971, 161924, 133348, 112783, 98587, 106158, 155824, 182502, 162013, 149658, 168549, 227925, 237068, 207974, 187515, 148118, 122463, 107875, 96697, 107010, 128019, 149795, 143980, 141731, 162548, 178930, 171573, 143437, 102442, 91544, 83503, 50137, 25606, 33984, 11542, 6057, 19195, 26380, 25348, -14793, -16597, 35614, 47042, 8237, -1169, 16102, 9863, -7450, -6954, 2569, -12125, -28091, -68042, -65731, -64170, -70674, -59414, -57247, -55978, -53655, -22588, 10027, 1560, -25808, -628, 13626, -13621, -30125, -4778, 30990, 26248, 23847, 34210, 17492, -1780, -18304, -21494, -43314, -56766, -31058, -10655, 1017, -10459, -44446, -45798, -35303, -5330, 7962, 9572, -2725, 20816, 20794, 10336, -1582]
10070a582o371k0690K1933M2338o326k1846j8115P335Q373O533J0860q07j5249
10057F386j0696Q951K1518R655M482p579P15j7943J1727r059l1445r304K5506
10044B914N4006M0859r260k2307l3932j7481P704k234m574J733j8986N560J182
10031E184o258j0632Q540k114j167N697j7542l405J2737M346j3284j6418J053
10018c3263P225p923r969O484L1569K0990k8459l5623R244L7914K9934L291m759
10005B6655k4148K61r78j959r238J7115K2157q859k5656k5730j903J4480J6606
9992a197J2059k166k035o588j5540j3733r060K1332K8084R231L782m836J8288
9979C7621j187k0329N571J0317J3795j2152p209k0980j0874l3255J5331N652M6284
$$ y = [-1582, -7953, -28643, -6710, 35628, 29302, 7456, -10659, -3324, 5049, 11582, 22442, 21635, 6386, -4310, 4641, 26159, 35814, 40296, 32717, 33432, 15489, 27216, 18157, -13288, -22592, 2914, 56920, 97779, 88519, 66212, 32280, 14799, 22503, 20269, 15695, 17428, -1558, 4002, 5184, -1074, -11706, -3166, -5280, -6447, -750, -18292, -21697, -8960, -4614, -17898, -34316, -33263, -26038, -33961, -43930, -37446, -5877, 15113, -13346, -48969, -39725, -1811, 28123, 31414, 26655, 2507, 2768, 1790, -169, -9407, 7708, 29865, 21006, -4650, -30380, -32283, -17803, -1197, 10862, 8696, 6661, 73, -15467, -29200, -38260, -16928, 11156, 20387, 24169, 19333, 37621, 36434, 16105, 21676, 31993, 45788, 33636, 26427, 5447, -5427, -38682, -23351, -17699, 28585]
9966B8585Q084J7303Q213l8145k5228L3305J6307k9814k7844j5525J0369J4290
9954a00L0066M821q061m077K2826j1698m9853k5356K3039J0944j7639J600J3581
9941i907K8522J0377l4322k3826L810K3877J0700l2701L052M00K4612L6251J6838
9928E7683l9770k2756j0324J5660J1211r301R68j8721j4358J7943j0210J5860
9916f115K3753J4513n05q214j7189k5971l197K3623J462J6012R759P338o889j8927
9902I453m03J5873j4789k169l973l7620M89K5301L5065K8434j611j1715l2588
9889I747o534J4485Q251m541j0925K5494q027l2917P406j5486K5009K4954q036
9876B8880k0537k3613R795M0704R472k2255J2418k0769k0240l7049L194K9454
$$ y = [28585, 36669, 53972, 62185, 24040, -1188, 32117, 48424, 18610, -9234, -24759, -14390, -100, 29966, 34787, 26726, 22649, 45475, 33777, -16076, -41432, -18393, -7449, -25088, -23488, -9907, 18615, 28992, -5330, -29156, -25346, -1469, 9231, -23470, -20418, -20018, 4594, 40845, 57683, 17913, -4843, -15167, 493, 11704, 2403, 3371, -15350, -29708, -11765, -21975, -6115, 17638, 32151, 31646, 23432, 6243, -19728, -22925, 698, 2160, 18172, 27931, 35269, 28380, 9453, 9050, 24923, 10134, 7965, 3992, -33628, -33139, -7838, 27227, 55661, 54050, 42335, 9747, 3213, 17698, 25949, 21408, 10483, 35977, 27950, -4967, 2439, -13047, 11962, 36916, 28880, 8343, -15270, -5475, 35229, 44701, 22446, 34864, 14095, -6145, -43194, -40000, -10546]
9864a0546J4861K6023M725j2103O80l359j2125l0688O474J8535k388J599K5667
9851B7355l9681n5765K993J03J7381Q686M6994L4034k2713l5208j0000J5569R193
9838a059J6648J1756N119J0247o321n387Q649J3897j5487j4748k2099J5573m439
9825A2349R785n839q366n757j1349k2080K7125J6822o837P900K54l9530n705K7267
9811c961J2841j4784L705O762L25J5435N333K8251J9576J1996j8769j3410O721
9798F0021k9537j8994N492J1220m827J8609k419l0018k0343J1768Q432J4273k5804
9785b127j4752J5848j1165j2908J8287K2435j0603J332J1293j9503J1802J425
9773A1364J3735N244N181l0284n8396j3244J196K5167K8575L2003J854P573m262
$$ y = [-10546, 4315, 30338, 35063, 22960, 23640, 20281, 8156, -22532, -16058, 2477, 89, 1688, 27355, -12326, -68091, -65098, -64995, -47614, -38928, 8066, 42100, 19387, -15821, -25821, -10252, -1059, 15589, 27345, 32464, 42711, 36390, 31003, 39652, 53549, 38062, 23314, 1215, 16788, 12349, 22134, 16295, 7929, 2172, -9177, -31257, -4132, 12690, 5853, 13753, 14007, -25523, -31228, -3961, 8880, -5904, -2199, 4563, 4888, 20323, 25656, 53907, 73483, 85479, 66710, 53300, 60021, 30484, 11490, 16982, 28202, 23375, 41984, 39565, 9547, -10796, 972, 9404, 23677, -2127, -16879, -1031, -12196, -25104, -6817, 15618, 5015, 6347, 17640, -1863, 9939, 11364, 25099, 30343, 35524, 5240, -53156, -66400, -65204, -40037, -11462, 20541, 22395, 29968, 25706]
9760B5706J0871q089j0521j057l211J274R728j277p252l794Q485j7210k3041J0744
9746h644J0397j4906j0351L3712N596j4844k3826L056p972M971K7435J4507K192
9733B1323j3140j3059j0711O912K0558j573K682Q40k1570L084K4687K3989N387
9720D9409J575k4223M160r096j4395l338J2191l0804l9528N984J8988R364Q291
9707a1422K9818M592j0650O220n869J4620l0757J067L239O76Q884j148J1361L0373
9693E1004N987l1663l8146k187j6135l389Q44p554n098P499L6442K4230N722j0041
9679A7515j0041N950j0848k591L428K0848K5802K7190l4447l5024q57l3127j1236
9666c7438N903J2838n30Q26l182j8296r940K1956J4735P525J7992K753k241K3187
$$ y = [25706, 36577, 28488, 17967, 16910, 13699, 14973, 24701, 23424, 16172, 12378, 20863, 3653, -19388, -8644, 1753, -13153, -23504, 10208, 15804, 960, -22866, -19810, -27782, -22811, 4624, 19131, 21323, 8183, -4876, -15587, -8675, 11883, 10310, 12992, 13832, -7738, -4654, 20033, 44022, 49409, 50984, 26761, 30921, 21825, 7430, 4092, 16283, -14521, -54049, -48065, -29077, -19713, -11422, 18396, 22988, 12338, 18558, 12689, 27309, -3448, -2381, 858, 1534, 10418, 9270, 20631, 51004, 56991, 25328, -12818, -15005, -31140, -34529, -33685, -41239, -46337, -38838, -2396, 21834, 27556, 17515, 7474, 13424, 2576, -15, 3413, 24261, 50063, 77253, 42806, 7782, 6925, -26202, -37438, -31535, -18697, -19227, -18401, -21583, -39879, -49819, -27863, -13128, -5603, 12389, 15142, 12901, 36088]
9652C6088J8786k5386j5553j7949Q390L235m291K888o428j6454j0920J7686O997
9639b911N495J1689m23k4580K5399K4508j3484N77r489j9459k3692K0376L0308
9626B4314K957m7663l3986j0113n399J3216Q712J8932M1329K3179j989j611N009
9613C6887j1591l291N312j3557l0944n580o663k4306j6710J3460K3718J175k887
9600c4977K0868J1251K3440Q3k648o247o782Q710n373m2393j2456J8878J4542
9587a3104J1753M855j8863p503J5935O790N227J1889q565j0885j6163j7004K9959
9574e679l296K9012p933l1070J1631o476O0721J2950k01Q249j726K1595l8926
9561D8851j4767L1283M0487o04n1660o133n866l0441k3225l839j8374N759M641
$$ y = [36088, 54874, 29488, 13935, -4014, 4376, 7611, 3320, 6208, -220, -16674, -27594, -9908, -2911, 2584, 14273, 13850, -10730, 14669, 39177, 25693, 26270, 16781, -2678, -26370, -5994, 24314, 27271, -20392, -54378, -64491, -69890, -56674, -47962, -29030, 12299, 35478, 33489, 31878, 36887, 25296, 22005, 27317, 13760, -17184, -22764, -29427, -53733, -70443, -56983, -33265, -32090, -34977, -14109, -2858, 20582, 20665, 18017, 11770, 4988, 13698, 8325, -34068, -46524, -27646, -13104, -1351, 3504, -15359, -22862, -6927, -137, 5090, 16979, 8414, -2471, -18634, -35638, -5679, -8975, 20037, 12104, -18966, -7335, -13811, 46910, 59860, 59659, 67908, 66182, 87777, 48851, 34084, 65367, 105854, 105250, 53590, 47457, 41591, 11150, -12075, -15914, -34288, -28529, -23888]
9548b3888j0531K9593J4421R858p099J058N048k7392k1175K0824M2605j4786m9255
9535c0719P104q36O876j4191j1122P844J0122O260m37R052J5300q412j8014j4522
9521c5695r438k564J9785L7273J9958K5729K218m535J9402N513k8458k6221K469
9508B5436M658m204n399K3240J8098q239j4762R452N751j0010r609l4384l2337
9495c2309k7637J7399M2082L9184J0177o14N115j1215l3883o759J1886p590j0575
9482d739J8340L7214r012l3951o563j4503Q979k050k169j4595j6547Q615l017
9469c3998j4883K1613R270j829l461K7664K2026R94k6332j9907k2105j6046p243
9456f4237J7190L7065k925k1059r932J9835M182j5945J1627P434P011K2374o934
$$ y = [-23888, -34419, -4826, 9595, 19453, 12354, 13412, 18460, -8932, -30107, -9283, 33322, 18536, -30719, -23615, -24451, -17575, -31766, -42888, -35044, -24922, -18662, -19099, -10047, 5253, -3159, -21173, -35695, -45133, -47697, -27912, 9361, 29319, 55048, 57266, 52731, 72133, 77646, 49188, 22967, 25436, 30094, 25890, 20491, 43731, 61829, 53590, 38828, 48280, 54031, 44021, 34412, 28, -32309, -59946, -42547, -465, 38719, 48896, 48282, 53397, 42182, 8299, 1540, 13426, 5836, -4739, 13601, 50815, 41803, 7852, 1289, -13214, -4235, -6285, -8454, -23049, -39596, -30981, -33998, -48881, -27268, -17998, -19827, -23288, 4376, 26402, 27396, 1064, -18843, -40948, -56994, -64237, -47047, -9982, -12907, -33966, -43898, -24063, -19881, -35826, -24199, -16765, -9754, 12620, 5686]
9443E686q217K2990J5334j0930l1319j8115p080P882j7387j0238Q171K6390J2269
9430d564R127k1566j967P019J3444j7376j0893J0822j4718j6639Q854L3446M1281
9417C6270n187j7878n709k4517Q328K4419N337R609J829j3492k2544K2886q777
9404A0574k0876K2348L0417j1207q32o532j6720J9423j4987m4515J9481L5189
9392B1763j254j5672R822n870j0284Q349K2213j5593j751j7413j9239K0116J0889
9379F076O422L6449J6249j2207j0538j2734R030j4505k5412o033j3182P600P209
9366e576N047p095J6871j0200O946k84Q292N56n829K385j0537l3844P979L4135
9352H846K6763J6229j2105j6331M68o736O274n1m332j2619Q69O59r141o687J0090
$$ y = [5686, -2531, 20459, 35793, 24863, -6456, -24571, -31651, -23769, -41156, -51394, -43223, -16833, -4564, 4563, -17003, -18970, -11951, 1493, -15883, -26776, -15954, -30672, -47311, -38457, -5011, 36270, 31083, 13205, 7496, -17021, -8693, 15726, 21063, 30672, 32501, 19009, -3535, 19351, 10574, -10302, 12046, 42463, 31256, 30424, 23892, 7172, 26595, 11608, -32907, -13426, 21763, 20509, 4837, 14659, 8789, -1495, 6854, 29067, 13474, 11723, -5690, -24929, -4813, 6076, 12498, 48947, 65196, 52989, 42451, 29717, 38747, 24242, -1170, -7203, -20385, -12785, -5576, -529, -7624, 9247, -953, 5993, 5709, 14001, 14557, 8728, 11113, 576, -33268, -25289, 8846, 35609, 51838, 39733, 23402, 23870, 17134, 23408, 23357, 19025, 6406, 7275, 7934, -1207, -7894, 2196]
9337B196J259N528k2496j2846K5892N651j2592q491M285p662j1845K5085L4499
9324B8463N550l3215l6537J2706M95J0101n274k5504Q468N03J3510L7989J3382
9311C0637k7486j4886P372J8782o359J5417o226J0243j3068j5429p890k970M889
9298f974K3723J4732p227r259k1563k0781j0481K0180J1718K3475K0810j1417
9286B6936l1029M929J2366P117k1061j1792M7136R824p672k8314n784L406r176
9273c114J8105k400n790j7177L8741M423p758M155j7552J4951K4504J2013l512
9260E9589k4266k0430k3304Q656k342M27J1564K057K7136j1885k0072j1196q852
9247a2918p505o840J9082M1033l570k8987k7381M483n74r765j3718J1012R456
$$ y = [2196, 3455, 8983, -13513, -26359, -467, 5184, -7408, -15899, -11614, -19276, -31121, -6036, 28463, 34013, 798, -35739, -23033, -22538, -12437, -17711, -43215, -34747, -34244, -20734, 17255, 30637, 3151, -11735, -4363, 14419, 8060, 23477, 17251, 27494, 14426, -1003, -8893, -11863, -6974, 16749, 31481, 24254, 14995, -6568, -27349, -37830, -17650, -5932, 17543, 38353, 26936, -4093, 836, 13202, 20319, -742, -12534, 34602, 44426, 36754, 8440, 2656, 6062, -3114, 14991, 12591, 6801, -10376, 28365, 32788, 25030, 29185, 11633, 26584, 51088, 63101, 59589, 35323, 14893, -8411, 245, -2097, -1670, 9894, 11951, 39087, 27202, 7130, -4066, -12918, -20423, -27263, -8181, 32852, 29282, 295, -27086, -22603, -23177, -32942, -46660, -35648, -26192]
9234b6192j667N53j6425j5356n798j7158K5018L2725K4703j2036J4104R449k0309
9221h389P506J8062K0719m798j6253L884j0311j802j5734J4969L3830j1784n822
9208B4077j3561k9063K0417J0927J5366J6264j7374j0064j7898j5505J3700P957
9196E243r648j0591K9816K1757k789k4346j7696r199J4376J9020q365K3200j2597
9183A8181l667K8005Q206J724m7041p780J2470J0331K5569n895j2999p475J2609
9170C2238k684j1975k0083r311J6020L3735m006k7776q919K6315J2838J9307M222
9157E9921k7299j6554j5762N801J765k0552k4422n253K6236K5438j8535j4331
9145b3547J5429N236k3362L3077K4130r809J8681J3394j3005q049L384j2050k0175
$$ y = [-26192, -27859, -27306, -43731, -59087, -64885, -82043, -57025, -24300, 403, -11633, 2471, 11920, -8389, -883, 17179, 37898, 33100, 16847, 20731, 10420, 8618, -7116, 7853, 41683, 29899, 24077, 10516, -18547, 1870, 12797, 28163, 44427, 27053, 16989, -909, -16414, -2714, 5243, -4405, -14996, 14820, 36577, 33788, 9442, -8254, -17453, -3077, 15943, 7578, 30778, 18181, 14514, 42519, 50725, 52449, 5408, -2372, 10098, 20429, 45998, 40103, 27104, 19629, 32238, 29554, 17579, -2504, -11815, 4205, 37940, 33934, 6158, -2761, 23554, 36392, 55699, 59921, 32622, 16068, 306, 6107, 7872, -12680, -37102, -42355, -16119, 9319, -9216, -23547, -8118, -2882, -26244, 6833, 30963, 21154, 39835, 53229, 40224, 32175, 35559, 23509, 3334]
9132C334J433q716R96K9892J3347R811N66l4101r643n744J3004L246n090J9085
9118C1420k288o714j5280j2128m928k7538J3508N360k629O768k1258j820L7259
9105b68J6191k982j023k2968j7000K535J7059k496Q244R777j3290O556K3765p094
9091A7006L075J8530q64l2461q681p010l1308K4214M1956Q887n211m6319j4448
9078c2634M0373K0695O042j9777j3753K8132p954O777k498p762P149j930l8493
9065a5633j8665q726J7784K2793K3645J4716k9765j0170k6599P562J5L353j6317
9052c6007J14O875K943j3102j3171n983J8042J4966Q175K5639L0034J1643j0982
9039C9186k0412j8988K217J5991n165j64k3087j351J0172N183K8979n266m1604
$$ y = [3334, 4767, -3949, -2953, 26939, 40286, 50097, 50663, 16562, 6919, 1175, 14179, 17425, 12335, 31420, 29132, 22418, 7138, -4990, -9918, -37456, -23948, -18588, -21217, -14449, -35707, -37527, -268, 15923, 12941, 11918, -11050, -28050, -25515, -8456, -10952, -2708, 7069, -6221, 335, 24100, 17006, 20081, 38611, 37747, 5286, -3395, -10405, -41713, -17499, 24457, 33344, 28133, -18186, -32634, 7739, 28434, 34476, 14699, 946, 29078, 21124, 27901, 25403, 17641, 24790, 22860, -15633, -34298, -43024, -25240, -2447, 21198, 35914, 6149, -4021, -30620, -23058, -23043, -19690, -36007, -35893, -29018, -26075, -39177, -52348, -58331, -40289, -25323, -17148, 8491, 38525, 50168, 39186, 18774, -214, 2003, 17994, 12829, 12665, -10422, -11773, -1601, 3582, 32561, 27295, -14309]
9026a4309R379o749j975K4219j363J8541k6242j9030J1909L1452p770k3726J3188
9013G524o610k4337K4686M648k3669J054J8923p841k0498j0943K7571J4588J1252
9000A6348P100k48j7440j3201J5193q165j0312j3099j1342r501Q356k1214K7586
8987b9939K4013R899L880j1767R493N489q476M945Q413l543m926j2179k187R661
8973B776j1340k8272r977L1279K0870j9483j9320k878K42o15o117K3345L9824
8960B0334J0945j7274r235l684j4839J4205K7748K4611k8750R135p603L934K0388
8947D9915j7527l0527L680L7534j490l3544q504L35M01J2704j2894M880J7410
8934B2373J1790J8114R82j6100l8151J2699J4688J137m712j2578l8209k7842k175
$$ y = [-14309, -4930, -11679, -13654, 10565, 9202, 27743, 1501, -17529, -5620, 25832, 18062, -5664, 7524, 914, -23423, 1263, 5911, -17758, -16704, 2219, -5622, -26120, -37063, -9492, 5096, 16348, 23448, 23200, 5760, -7441, 7752, -413, -10725, -23824, -35166, -44667, -36311, -57525, -29939, -5926, 3973, 7853, -3914, 5579, 11068, 2592, 7537, 15950, 12407, 7481, -4698, -6885, 2776, -8564, -36836, -46813, -15534, 5336, -14147, -33467, -36345, -36103, -36718, -42835, -19490, 20334, 31279, 14005, 4770, 1086, -13753, 452, 28200, 52811, 24061, 33196, 25593, 29527, 49915, 32388, 1861, 5541, 43075, 41585, 8041, -463, -128, 273, 12977, 83, 4963, 22373, 34163, 52277, 53259, 37159, -992, 11707, 26395, 27532, 22820, 10242, -27967, -55809, -57984]
8921e7984R09O615K9717L2169L883m376o561j3565J404r109K318o395l911P353
8907a7533J9326P450k705k7055l0492n250J9945J8457j2771j3119J4393K4412
8895d942J9215J1233n143M859J7956q749k9408j5284r821q364K1807K9308J2983
8882C5650q467k0037k3863j2964p509j641M514K824k3341J0892K2770R675L614
8869g883J2644j951J178k948L4955O551r2j6660l1046O476K2923j0811J054J5515
8855B9905m208j2254k151j4142P784j1680k7074K545l060K22Q770K5320N942J698
8841G617r981k2165j0137K7020K0592j6320j6928J8828j2718k5004J5402M4496
8829B0702j354k6850K631K1176k2362j2452l084j4117n843k5372K0687K5835M673
$$ y = [-57984, -57075, -50460, -20743, 11426, 15309, 10933, 4372, -9193, -7789, -16898, -14580, -20975, -24886, -17533, 1793, 9243, 6538, -20517, -51009, -56259, -36314, -17857, -30628, -43747, -29354, -4942, 14273, 25506, 20363, 25222, 43178, 34429, 5021, -10263, -20084, -28448, -6641, 22667, 35650, 27183, 7146, -16717, -29681, -37190, -38831, -34317, -31493, -54834, -43942, -21172, -11497, -7883, 4761, 2810, 3988, 1040, 35995, 42546, 42454, 25794, -5252, 1224, 24147, 13336, 14390, 29905, 25697, 13443, 11292, -2850, 4934, -6746, -33820, -31275, -34335, -34113, -25343, -23, 5919, 7617, -2364, -24529, -34666, -7646, 12946, -3374, -20302, -1474, -14192, -39196, -23794, 20702, 19348, -7502, -4871, 16305, -6057, -18509, -21593, -35710, -41553, -66925, -46238, -20403, -15730]
8816a5730L624l196J0324k128K0993J5795J0427j2077j680P794K4517j3586m6956
8803a879j4164m560r735O81N414K0060N596m774K0265K5271l67o620k5537l0151
8789b0500r015K4707M044J5442J230j3083j9018j6035k1899J4181L4465r110j193
8776a5784j7006J8672P833M599J8059J2189M80N494l827n937M377j5559L580N355
8762B2525l5665n820Q128l086L852p262J1074N983m570k354M598K3766j1052k8344
8748a8227J3452r036J4043p562K4660O739n67l4901o762J1888K2777J7212l8726
8735e010m2425K4457j179J301P191J0234j3566O083k551q183J5537k243r969p816
8721b8139K2560k132Q739j4572j0257K4736L8492l531j1198q225n86j5129q700
$$ y = [-15730, -12106, -15302, -4978, -7106, 13887, 29682, 40109, 28032, 26352, 34146, 58663, 45077, -1879, -16043, -20603, -30338, -29657, -24243, -4183, 1413, -3361, 16904, 42175, 41808, 35188, 9651, -20500, -29515, -4808, -764, 14678, 15908, 2825, -16193, -32228, -54127, -39946, -5481, -14591, -15784, -32790, -14118, -6285, -1686, 16373, 28562, 29042, 34536, 30709, 24772, 29149, 13590, 17170, 22525, -13140, -18960, -10832, -13918, -10066, -17328, -6254, -271, -4841, -7195, -2597, 21169, 10117, -18227, -4775, -13811, 232, -7330, 17330, 24069, 23502, -11399, -18161, -6273, 16504, 33716, -5010, -47435, -22978, -24157, -22856, -15665, -5431, -18997, -12914, -15465, -23648, -8111, -10354, -20323, -28139, -5579, -7711, 1028, -13544, -23801, 935, 39427, 35896, 24698, 16473, 15887, 758, -7942]
8708g942K2749Q99J3928J3767j3982k1982n67k898l0512M59j17J5351Q375j1055
8694a3527L929K7535J4809n866o645k6098M190k616O56J129j0951j4126m237R025
8680b2793K1187J1712p25p684k3672q344J4476m91o069j533K4679q297j4219M350
8666a7423j1626q243J3959L021N547R175J3892J446l11J0609O874K1677k3092
8653B5505n274P580l5065r700J8568n060Q805j3515n499J3705K8406k1830R538
8640A6164J1868N048K4442p207k6001k31n372m1192j2076K490K8814J8143L886
8627A8776k704m792P227j9186j0565q840K060J2135n683j4258p545M235K9894
8614G54K5292P940k5232j0977j0191p823J2500p122l3935K8402J7047K0479p70
$$ y = [-7942, 14807, 15706, 29634, 43401, 29419, 7437, 6870, 3972, -26540, -26081, -26198, -10847, -2472, -13527, -9598, 17937, 32746, 26880, 20235, -5863, -1673, -4289, -3633, -2504, -13455, -27581, -31818, -22793, -1606, 10106, 9381, 1697, -21975, -30319, -15843, -16334, -22403, -23936, 743, -7554, -21773, -17423, -29049, -37292, -23333, -20312, -14765, -5590, 8302, 9748, 9437, 20046, 26920, 48597, 25505, 20231, 27811, -7254, -16954, 1614, -3446, 5359, -8156, -13655, 50, 28456, 6626, 16164, 28032, 33080, 57522, 50315, 24314, 24083, 18711, -22481, -34557, -32067, -3253, 14890, 18776, 16072, 11280, 18507, -679, -11244, -20084, -18024, -5889, -11572, -25830, -33375, -29140, 754, 26046, 33986, 8754, -2223, -12414, -20237, -7737, -14859, -48794, -20392, -3345, 17134, 16364]
8601A6364K4690M6646l1500m2460K705J1115N368K103J3460M432k0789L252L402
8588C8788n863J6859m707j2444J0336M622J6650R691J7375l4512k1815J011K3980
8575E9971m151q942J4262p573l3772J198O158o4434M54J3024N354P437P226j910
8561e698R781P153J9221J0232N185o300K1864n475o448o741q334j539Q236j6798
8547B4339l6259j1389K757p168p635O995L0799R798j6720J9001M142k3677J9994
8534A4977l505l076q828j1235J3591j4503k6985j5002J9372P815K313j1165J5049
8521b1182l161j1881J471k0565J3860J2984K1000p012r889J0222L4590L509j7197
8508F749j5480k7738J0118J9322j1818p237l2210l076N062J8804J0297r314N074
$$ y = [16364, 41054, 87700, 56200, 13740, 16445, 27560, 32928, 35031, 48491, 52923, 32134, 35386, 38788, 32925, 49784, 45077, 32633, 42969, 47591, 64241, 73932, 91307, 56795, 34980, 35991, 59971, 55820, 46878, 61140, 53567, 19795, 20993, 27151, -37283, -36829, -23805, -18451, -11014, -3788, -5698, 4083, 11236, 30457, 40689, 45874, 39574, 61438, 55963, 49515, 42774, 34440, 32901, 41137, 24339, -11920, -23309, -20552, -27720, -35355, -28360, 2439, 12237, -4483, 14518, 18660, -5017, 14977, 11472, 8396, -432, -11667, 1924, -12579, -39564, -54566, -35194, -27379, -25066, -36231, -21182, -24343, -36224, -34753, -55318, -41458, -28474, -7474, -14486, -24375, -14153, 20437, 23946, 6749, -8731, -36469, -26351, -7029, -18847, -26084, -58294, -61370, -56308, -37504, -27207, -36521, -31447]
8495c1447J7025o914k3111J4196r509Q0J9392P960M02p41N341J4752j560J8294
8481B4160j0996k9084J955r710J0277m810m971P192r290Q694L3350L1373q928
8468C9212l9121j4380k2844R470J5080k2715K4229J6211J5400L77o104j1529J5114
8455A8400j7235J544L1906M535J911J98l1395J199L3783Q955k4069L576j8447
8442A4861j143K0626J409m218n909J328R348j156k1683O383l789j6278j4860J3738
8428a343L4321j3394K103L89k0204k4872j141K8355K6764p276k7290k8421l3716
8415f5725N823L7880K7055N772j2782l200k625j7923j6892k4603p29R473J9188
8402c9288j1333n468n672J4299L8120K8761L756j7814k4650N54K4288L801J2570
$$ y = [-31447, -14422, -21336, -44447, -30251, -39760, -39680, -20288, -12328, -11926, -12667, -7326, 7426, 5866, 24160, 13164, -15920, -13965, -23675, -13398, -18208, -23179, -15987, -25277, -16583, 16767, 48140, 39212, 91, -14289, -37133, -27663, -12583, -35298, -11069, 5142, 20542, 20919, 14815, 3286, 18400, 1165, 2709, 34615, 39150, 41061, 41259, 9864, 11063, 44846, 53801, 29732, 33308, 14861, 13718, 34344, 35753, 31535, 25626, 26954, 36302, 35146, 13463, 19846, 16057, -221, -15081, -1343, 32978, 19584, 21687, 22076, 1872, -23000, -24141, 4214, 30978, 23702, -3588, -32009, -65725, -59902, -22022, 5033, 10805, -1977, -5177, -7802, -25725, -42617, -67220, -67949, -58476, -39288, -50621, -56089, -61761, -47462, -9342, 19419, 23175, 5361, -19289, -18735, 5553, 9354, 21924]
8389B1924n729K7880k865k4555K1184m123q044O152k3074l8150P964J8426L3245
8376C0235r334N03J6143P372j5601k4177j2322j0643r496J2701L2109K7652n017
8363D0125l3374L505j0183J7096j3504K49J3264j9435L679l557o403k0561l879
8350c2978J6531O073k679j6608j8159J3746M3543M8066J1178M8681P7964K6110
8338B21468n1630o4529l6658n3133l0211M640J3468K9246K113q992K4975l1419
8326A9338m0671k1132J3227J0451R213k738J2855p036K172L766J356j2285J395
8313a0089j4781k648R690J754J0125j742m350J3414J255q817J9298K6066J2612
8300E1787J1992M7573P4897R5891J33612P8362n1639j47115j20626m7292l1623
$$ y = [21924, 16195, 44075, 41210, 16655, 37839, 33716, 25672, 31824, 8750, -29400, -21436, -3010, 30235, 20901, 21404, 37547, 44919, 29318, 5141, -7181, -17824, -27320, -14619, 17490, 45142, 40125, 6751, 10256, 73, 17169, 3665, 3914, 17178, -2257, 1422, -2135, -8538, -29099, -32978, -16447, -10374, -13053, -29661, -47820, -34074, 9469, 57535, 68713, 117394, 195358, 221468, 169838, 105309, 68651, 15518, -14693, -10053, 3415, 32661, 34774, 25782, 50757, 19338, -21333, -42465, -29238, -18787, -9574, -12312, 543, -6493, -4321, -555, 801, -11484, -10089, -24870, -27518, -17828, -16074, -5949, -7691, -12041, 1373, 2628, -6189, 13109, 39175, 51787, 63779, 111352, 186249, 282140, 415752, 494114, 442475, 295360, 174734, 127442, 95819]
8289I5819k4449j3659j5153k8359m473q176p218j4668K981J1031Q674J6872k5204
8276e982j6852N801J2802K6795J2276L141j4400P992L77q178j5895J941o837k4054
8262b1073J4053L8145J7512j2674j5922j9050K7042J3818R250M4198Q0091M7598
8250B22988k4605o1751o3447m2442j0010O413J9117J5482p381m5739l420R059
8238A4264j5894J3820J0773K1j8071l679k790j565L213j2604j5185J5361N451
8225f885j6609l001p80j5783K0944K8515R68r945j2574K4810k58k8959K1902K5300
8211B7645k7511o043k0787P47N358L923n787K5155J5529k1759n412o161k562o114
8197b3779Q725J7617n910l1417M081J0050M69L1452K9995o953n379k7717k9897
$$ y = [95819, 71370, 57711, 42558, 14199, 9726, 1550, -5668, -20336, -17355, -6324, 2350, 19222, -5982, -22834, -17033, -4231, 22564, 34840, 37981, 23581, 31573, 31950, 23772, 7877, 9818, 2981, -21073, -7020, 31125, 48637, 35963, 20041, 991, 28033, 41851, 51101, 95299, 175390, 222988, 198383, 136632, 73185, 30743, 20733, 27146, 46263, 61745, 54364, 8625, 5205, 14264, -1630, 12190, 22963, 22984, 4913, 1234, -1556, -3121, 92, -12512, -27697, -12336, -6885, -23494, -26495, -27275, -43058, -22114, 6401, 7369, -2576, -15150, 9660, 9402, -19557, 2345, 27645, 134, -5909, -26696, -25949, -20591, -16668, -22455, 2700, 18229, -3530, -8942, -15103, -17665, -23779, -15054, 2563, -3347, -34764, -30683, -20633, -20164, 11288, 41283, 34330, 28951, 1234, -28663]
8184b8663j7654M061K3906J5159j1437r42m823j660Q894r040K158N901M174k0575
8170c0541k6637J7112K4963o041J8902Q435r619J6319L2146J133j3772j6694j7063
8157a357k6714p246M123q402n153K7289L6948N2217k950l4948k0870l0327j2298
8144b9688j4368j8576L6012P190Q141J8166k236j4876M904K6661Q218L0000l010
8131E6538l5005l7985O645J5971p806r86J0894J804j9598R26K8599L183l013M471
8117B4638j4537m2136p98M6915M837j5539j7841j1310J2830J0496n543N567K3668
8104B1247o001j9980j3943l853K092M459j4981m849k036J2303R525J6062K3035
8091B3080j1102l4375O020L8837K354j4681M8501K3185k8152k1562j7005m875
$$ y = [-28663, -46317, -42256, -18350, -3191, -14628, -15570, -20393, -22053, -13159, -22199, -20041, -14140, -9966, -30541, -57178, -40066, -15103, -21144, -2242, 6193, -3426, 12893, 45039, 46172, 32400, 15706, -1357, -28071, -35317, -31194, -39596, -44749, -17460, 19488, 71705, 68755, 33807, 12937, -17390, -29688, -44056, -62632, -26620, -19430, -11289, 6877, 4641, -10235, -5331, 21330, 29548, 59548, 56538, 21533, -16452, -9807, 6164, -1642, -2628, 8266, 10070, -9528, -8602, 19997, 23180, 20167, 24638, 10101, -32035, -32833, 14082, 18919, 3380, -14461, -25771, -12941, -2445, -7988, -2421, 21247, 15246, -4734, -18677, -22530, -20438, -15979, -30960, -35809, -37845, -25542, -16017, 45, 23080, 11978, -22397, -16377, 22460, 24814, 10133, 58634, 81819, 53667, 32105, 15100, 10225]
8079A0225l2104l1371j2751K3965M0983K4690r10k4700m2729K574J0544n863R918
8066b7529L1566Q969J5583j4519K3706j6316Q305K916n034k3319k554J0814J1937
8053B4525q775m158l953j052j6366k5266J6750K1158k198j2112J7254l257j9168
8040a6618L386l6215K3399J3716J78j709J763k045L940K7321j1118j1689n831
8027a1522k7387k3583K2257K1120N978L18J1443N207k1075P49J8253K1792j9557
8014C993J6518N990j0152j3119L800k6817j4912k593R194k0046R478K6360J4808
8001B502K573k9402j2310J0619M930K7260J905J2209M846l2075k0961J5050J5462
7988B608J4550P430L0318r488k0200j9333n978R875J3908K2013o02O546j0637
$$ y = [10225, -21879, -53250, -66001, -42036, -1053, 23637, 22727, -1973, -44702, -42128, -31584, -37447, -27529, 4037, 13006, 28589, 14070, 37776, 21460, 29765, 32681, 27647, 4328, 1774, 12588, 24525, 15750, 11592, 7639, 6587, -9779, -35045, -18295, 2863, 665, -11447, 5807, 2550, -16618, -13232, -49447, -26048, -12332, -12154, -13863, -12100, -14145, -10205, 17116, 5998, -5691, -11522, -38909, -62492, -40235, -19115, -13137, -12819, -1376, 3831, -17244, -16495, 1758, 23550, 3993, 20511, 26501, 16349, 3230, 7030, -19787, -34699, -37292, -28098, -48144, -38666, -12306, 2502, 5075, -24327, -36637, -26018, -21088, 6172, 8077, 20286, 25132, -6943, -27904, -12854, 2608, 17158, 24588, 54906, 45418, 25218, 5885, -93, 9782, 23690, 45703, 45101, 51647, 41010]
7975D1010j2545j4402j6195p674J3773K790R914K3471k1191j3767j4936q162n323
7962b3237J6545j6084J732o556r445J4252j1640m765L8437N480R434J7841Q387
7949D0381j5665J382k0258K621K030j8705n2930l926L1935J9468O975M897k9153
7936c0948j2547p008J4511J7565R412L5530k5085j1094K9064k642j820l357J82
7923A1763L6362J0301j1659j4831n275j4635o956P858m5773k1009j5334K8247
7911d0941L3352l5591O260j5123O9K1005J9153K0684J8819K2095O474L511l2237
7898B7530l3683j1682K0478q954l556p324J120J7271K5524J7712K0101j288J321
7885F4570p828n302k0160k6924p079J1881m262p417m438k955N866k5148j7454
$$ y = [41010, 28465, 14063, -2132, -9806, 3967, 6757, 16671, 40142, 18951, 5184, -9752, -17914, -23237, -6692, -22776, -21044, -27600, -37045, -22793, -34433, -39198, -761, 4719, 14153, 31994, 40381, 24716, 26098, 5840, 8461, 10491, -8214, -61144, -65070, -33135, -13667, -6692, -1795, -30948, -43495, -50503, -35992, -18427, -9015, 26515, 1430, -9664, 19400, 16758, 14938, 11581, 11763, 48125, 58426, 46767, 31936, 26661, 12026, 5070, 12928, -32845, -53854, -69188, -40941, -7589, -43180, -36920, -52043, -51974, -30969, -11816, 8868, 27687, 49782, 56256, 59767, 27530, -6153, -17835, 2643, -6311, -9867, -17191, -16071, 1200, 26724, 44436, 64537, 63249, 64570, 56742, 51440, 31280, 4356, -2723, 9158, 4896, -2521, -6959, -9914, -4048, -29196, -46650]
7872d6650p015J9344J8070L653Q18j8875j4249L7332N350j332m233K4691l637
7859A3267l8030j5703K9660J1224k52J888K2451l13l1081k8793n630K4547M6565
7846B9800N793Q858p35k1917l1251m163j89J7445q414L41J458R998m084q371j6070
7831b1501N333O286K291r457J7025K1031n809m038q09L875l5887O482O621k6369
7817c4926j5297r917J0935J671K6601J7566J9521n730J286J6931j4740j3029j2512
7804a1640Q524L5198j738k1828k0850j6883r583J608J348m097J8841M6724J9628
7791D5252j1145Q547k2214j0740j908q559j3642Q482L442j5530Q571k205m75J5605
7777C481j2646P944r649j1257j010K7781j8888j1428L217K2333l628O027j3637
$$ y = [-46650, -53665, -34321, -16251, -12598, -11780, -30655, -44904, -7572, -2222, -3554, -7787, 16904, 13267, -24763, -40466, -10806, 418, 166, 2054, 24505, 24192, -6889, -35682, -41312, -16765, 29800, 35593, 44451, 43716, 21799, -9452, -13615, -13804, 3641, -4773, -4432, -2974, 7024, 2940, -5431, -21501, -16168, -9882, -7591, -17048, -23, 21008, 15199, 11161, 10352, 14227, -21660, -15178, -8557, -34926, -50223, -60140, -49205, -47534, -20933, -3367, 16154, 10424, 11710, 28641, 13901, 872, -11640, -3116, 32082, 30344, 8516, -12334, -29217, -38800, -37192, -35844, -39941, -21100, 25624, 45252, 34107, 42654, 20440, 9700, 7792, -767, -14409, -5927, -2485, -18015, -9444, -11649, -12124, 3481, -9165, -1221, -10870, -22127, -23137, 4644, -14244, -25672, -22455, -122, -3750, 2277, -11360]
7764a1360j9770J3550J3489l030L918j7116k4580K0107m498j180L4294j1431p882
7751a5489n180M200M544k1103R807M6822J1041l9621k5472j98Q997J6270J2818
7738G436m225k9870j2537K6566K1687M536J1650M326r087m299O914k284r900J9746
7724C0659k3296m9261L24N467l401L5735L8444J5730q610j9067J2218j2962j3267
7711H713j9786Q868n908N392J4060k204k1800r02k2455j4289j154L0520L3386
7698A2441n599k4867k0077j831q36K6139J1353k38R551m505j7916L6607n099p085
7684H038n069l916j4350P471k1344p493j2857j107m861R197K0520J278O192M638
7670a3663j0359O993R271J2458l305P334p524j8476J6036m709P851L5367J7266
$$ y = [-11360, -31130, -17580, -4091, -7121, -3203, -20319, -44899, -24792, -29290, -30470, 3824, -7607, -15489, -20669, -16469, -11925, -33028, -23221, 23601, 34642, -4979, -30451, -30649, -21652, -5382, 7436, 3211, -26659, -39196, -12630, 9057, 13593, 25243, 29569, 20482, 16183, 23097, 20813, 10913, 30659, 7363, -41898, -41574, -36107, -39508, -3773, 34671, 50401, 41791, 22724, 34942, 21980, 8713, -11073, -2205, -8113, -2721, 11339, 9135, -12665, -13567, -36022, -50311, -51465, -20945, 12441, 6842, -18025, -38102, -39933, -40769, -14630, -3277, -3515, 6036, 1531, -16385, 20222, 15123, 8038, 2969, -947, -15297, -7826, -29170, -36663, -49520, -50627, -55488, -46291, -25771, -24493, -18301, -13663, -24022, -17029, -7758, 4700, 1395, 8729, 1205, -17271, -1235, -5944, 1907, 37274, 54540]
7657E4540L157K711k1143n2569l2569K5345L3409j0658Q894J2007K796j2412N57
7644A4065J273l038j4679J949n704K5792p024j39j8399k3239p848J8201L3507
7631A4717Q230k629j2538l8678o902L8701J6124j0437n995j4499n102K8486m092
7618E386Q244j10j8640j9330R002l0170j1619O677k919R918J5754L3159L607K321
7604A1280N012L508k2024j3480Q809J8843M277j4815J270J9386L71k5860j35j990
7590e548l104j885j8396K904J3628j9136j9458M5979L4L322q555k8149J74J2727
7576b5463K0881r462J9975m740j382m208J8237L1606j3413k7658j0703K492J7026
7563A3188J9239q751k7636J024Q718L256K315k148p236p393j66J997l061j0103
$$ y = [54540, 57697, 60408, 39265, -13304, -45873, -20528, 12881, 2223, 11117, 23124, 25920, 13508, 14065, 15338, 12300, -2379, -430, -6134, 19658, 12634, 12495, -5904, -29143, -36991, -18790, 14717, 22947, 20318, 7780, -30898, -37800, 901, 17025, 6588, 593, -13906, -19008, 9478, 5386, 13630, 13520, -5120, -24450, -15448, -45618, -57237, -50560, -53479, -43561, -27807, 5352, 8959, 11280, 16292, 19800, -2224, -15704, -6895, 11948, 16225, 1410, 2680, 22066, 22437, -3423, -3558, -5548, -8652, -10537, -28933, -26029, -12401, -31537, -50995, -5016, -4982, -1660, -10215, -38364, -38190, -25463, -4582, -14044, 5931, 1191, -191, -4399, 13838, 45444, 32031, 4373, -6330, -3838, 13188, 32427, 23676, -3960, -2936, 5782, 9038, 11353, 9205, 1969, -5424, -5590, -3593, -6654, -16757]
7549a6757r275R706N922j2681J8830J7941l165j4452p480p66J9066j0718J7073
7536A3244M957m770k4115k961o977K6514J0584k9103R684L1714j5526l4472j3779
7523c5006K3958K3081l8196p163M7401J1952M692R374j6565m655k916l496j9939
7510g478N268Q405L751N323j6975k5115o038J6055j1137J0491R305L361R669Q245
7496A3130N268p328O251j9306j7626L103J7822o323J5390M334J3472J674j5916
7483A3945n413j0956J9216O885N391j724J231j7112k7650K958Q63Q516o428k5552
7469c5830Q096J0067j1278r991K2224k072k690J7779o076J7073j2609j1995O557
7456a0745L7693K202L259j8827j6467J46l4423l09p519K968K3869J3059K223K5993
$$ y = [-16757, -26032, -16326, -10404, -23085, -4255, 13686, 10521, -3931, -11411, -12177, 6889, -3829, 13244, 18201, 13431, -10684, -13645, -20622, 5892, 16476, -12627, -2943, 28771, 13245, -21227, -35006, -11048, 12033, -26163, -33326, 14075, 26027, 30719, 40093, 23528, 18873, 15957, 12461, -7478, -2210, 6195, 9946, 15269, -1706, -26821, -32859, -16804, -27941, -17450, -8145, -4784, 4885, 13130, 18398, 11070, 17321, -1985, -19611, -16508, 1314, -5009, 10381, 14715, 28187, 29861, 13945, 8532, -2424, 16792, 23677, 29068, 27344, 28575, 11463, -16187, -13229, -12366, -3850, -10278, -35830, -27734, -17667, -28945, -38936, -16712, -18784, -21474, -3695, -9771, 7302, -5307, -17302, -10745, 26948, 29150, 32409, 13582, -2885, -2739, -37162, -37471, -44990, -42022, -18153, -5094, -2871, 23122]
7442B3122r769k4713o097r792o560L398r911J4493L7271K3778j0207k3609j2910
7429a1506k0532j7098P42j970P255J2427L4562J021q755r680J8148j9377M825
7416i938k976j662j2286L989K244j0483J7057j4455j4568K5529K6176J9703J748
7403C0078k5279l0857K0774R867L8349J3485k7706J3188R94r739J3162k2194j551
7390B2571J012j5641k2501R145L659l1353j2727K1072J8419N564M55k047q264
7377a0636j2169J043K9240J5967J0079k7525j2351J6346K0958J917r158J321p059
7364A7973j2137p184Q37o384l333J2470j2725j2713j3299j1834O903k570L7524
7351f472K1299q288l1435n375K3883K5263N28O388J077k1868j0810k9363K708
$$ y = [23122, 13353, -11360, -17457, -27249, -33809, -30411, -40322, -25829, 11442, 35220, 25013, 1404, -11506, -32038, -49136, -48394, -50364, -43109, -30682, 3880, 4901, -3854, -13534, 4614, -14763, -9938, -12914, -14576, -26862, -22873, -20629, -31112, -14055, -28510, -43078, -17549, 8627, 28330, 30078, 4799, -26058, -5284, 4583, 42932, 56417, 28711, 41899, 42893, 33154, 46316, 24122, 22571, 23583, 7942, -14559, -5414, -1755, -33108, -45835, -24763, -6344, -780, -325, -2372, -10636, -22805, -21762, 7478, 23445, 33524, 5999, -6352, 9994, 30952, 32869, 23711, 25032, 17973, 5836, -1348, -511, -6895, -10228, 2242, -10483, -23196, -36495, -48329, -41426, -43996, -6472, 14827, 6539, -24896, -30271, -6388, 18875, 19403, 25791, 26868, 5000, -5810, -35173, -32465]
7338c2465M0843K6490j4057P550j5976j8345K7517K158j2219J0469N6R375m106
7325B7290k5098j6543o739J32N705j337r202k1873J8602L4527J3915k7382n09
7312h512J9662K4667m6197k4376o641l467K8878J3403j5907m266p926j3424J1816
7299c2290J1016j0162j1175K9504K6339O894j0127p412r290r878n619j3634j6289
7286e2123K0281M5016K7601J0998j0323n468l128q961j5791p377j3604q519O683
7273a4715K265j5588Q435Q652M1771O167O039L908j40m0553n240j1323r940m630
7259b4892R917J5489K9710K3497J1452j6611q521L150k0417k1514m722J9429R43
7246A6910k0376q943J6032J0950j7400J2479K037n4j413K1517j2401l3574l1202
$$ y = [-32465, 8378, 34868, 20811, 28361, 12385, -5960, 21557, 23715, 11496, 21965, 22021, 31396, 27290, 2192, -14351, -21090, -20958, -15253, -16590, -25792, -47665, -29063, 5464, 19379, -8003, -8512, 11150, 35817, -10380, -34756, -41397, -44864, -15986, -2583, -18490, -22756, -30682, -44106, -32290, -21274, -31436, -42611, -13107, 13232, 20126, 9999, 2587, -6703, -16581, -22200, -35834, -52123, -31842, 13174, 40775, 51773, 41450, 35982, 32854, 23893, 8102, 725, -12879, -21398, -14715, -12450, -28038, -19603, -10951, 30820, 36987, 43026, 46934, 46794, 6241, 1001, -10322, -20262, -24892, -14975, 514, 30224, 53721, 65173, 48562, 40041, 43191, 22774, 1260, -3462, 15967, 16910, -3466, -12409, 3623, 14573, -2827, 9652, 11689, 11635, 10222, 31739, 19338, -14236, -45438]
7233d5438J5720K0060q909K6076J0501k6119j0290o938j0860J3980M048K414l0560
7220d6315l47L4258P855j9927j2649J1398K8251M890R146J5977j3464j3282j2401
7207f610m7496J4472m505L1862L4092J5263j1849q839m110Q859m515q943j2727
7194e046j3185l0412K847M1684k222j5957l9167k3245L1796L043j0223j0242J5770
7181e4559J1481K0388M989j4528Q39p508j0461L540o542J5866L3472K4154o867
7168A4264m688q051j2343n360O98j6460J2830k146j5905k369k159r591L0579Q887
7154a1814L188L13L246P29J0025r134k8573J457J2366j501J1442j117J2288Q599
7140A1514n083q94K9731n340J1139j8965k0382j0921P335L0066N344k9253k9012
$$ y = [-45438, -29718, -9658, -18567, 7509, 18010, -8109, -18399, -25337, -36197, -22217, -18169, -15755, -46315, -46662, -12404, -4549, -24476, -37125, -25727, 2524, 7414, 16560, 32537, 19073, 5791, -6610, -54106, -39634, -44139, -12277, 21815, 37078, 25229, 16390, 12280, 21139, 16624, 7681, -5046, -18231, -48643, -45796, -4112, -6334, -22291, -61458, -84703, -52907, -49864, -60087, -70329, -54559, -43078, -22690, -17701, -32229, -31390, -38898, -49359, -45819, -52361, -36495, -3023, 21131, 14264, 9576, 1525, -10818, -16178, -15480, -31940, -19110, -21256, -37161, -39530, -41689, -51280, -20701, -11814, -8626, -8313, -5067, -4338, 5687, -3447, -32020, -30563, -18197, -19698, -8256, -9373, 2915, 11514, 6431, 5537, 35268, 29928, 41067, 22102, 1720, -9201, -1866, 28200, 33544, 4291, -24721]
7127b4721R650J5277J4006M997n573N591j792l851Q342j4208j5753J2578L2552
7114C7095j6972k3793K7076J2639j4653j0216j3582k3583J0637P34l575J2638
7102e555N569Q98q264r711J169J954l1103r98K1320K4317k523R463M609j3415
7088b270j644J1479J0792L267j7692j2052l128J7265K1585p108r515M826l8776
7075b2971J6860J8586j1369Q161n204J8401J2373o255k667m239o44l774l3554
7062a6296k5108K310K2671R365J8308L289J6387K7075R077k9223k9879J2657L4575
7049E5208l3141l0516O537k413j089l177k4006N547J0402J4368J6398O308j4674
7036E752K730n879k925J562J2782j3323k5009J4733K7955L1897l212k9667j7891
$$ y = [-24721, -15071, 206, 14212, 19209, 13636, 19227, 17435, 13584, 21926, 7718, -8035, 4543, 37095, 20123, -3670, 23406, 36045, 21392, 11176, -2406, -25989, -15352, -14618, -18193, -5555, 14, 912, -7352, -17063, -15894, -13940, -45043, -46041, -24721, -404, -2927, 6536, 11145, -2270, -3914, 7565, 18357, 21624, 3932, -8120, -11248, 6017, 27602, 20494, 10979, 15805, -22971, -6111, 12475, 1106, 9267, 4063, 22464, 34837, 28582, 25915, 21676, 21032, 17258, -16296, -41404, -39094, -16423, -7058, 11250, 14539, 30926, 58001, 67078, 37855, 7976, 20633, 55208, 22067, -8449, -1912, -4325, -5414, -8591, -32597, -27050, -16648, -2280, 14118, 20426, 5752, 8482, 2603, -322, 1240, 14022, 699, -24310, -9577, 18378, 50275, 47063, 17396, -495]
7023d95l326K5522R040j0929l6505p257J5995K4952k2904r544Q968L3809j172
7010B6154j9608k7939j2711Q972J6372K8507j4618j1821k3366k3054n023n514
6998f3649R77M1789R198J4894K0180l8382l784K0026J4657j021K381j0440J3776
6985B0602M456n04j8499j6960K2572q769j3389R089K7127P778j0811k4o817r255
6971F596J9017R841j8379k7139N779J1416J411j735J6459l825J7033O381N0j2048
6957C0857k0569m1451N233M546J2185K6021J7201m636k4705l6521j3521K9875
6945a5485j838j4203J3780J3151J5149l045j1236j4179q956J6917M2738J3179
6933D5972K427J2068j0889l8679l4561j8543k3906p62K2050K0767J0960j5131
$$ y = [-495, -3821, 21701, 30741, 19812, -16693, -23950, -7955, 16997, -5907, -15451, -6483, 27326, 26154, 6546, -21393, -34104, -25132, -8760, 19747, 5129, -6692, -30058, -53112, -58135, -63649, -62672, -20883, -11685, 3209, 23389, -14993, -18777, 1249, 15906, 14885, 17266, 6826, 20602, 25058, 24554, 6055, -10905, 11667, 2898, -10491, -1402, 25725, 33503, 22692, 22668, 15851, 6596, 25613, 35454, 17075, -10064, -4285, 7131, 8542, 6807, 23266, 19441, 36474, 42855, 42905, 30857, 10288, -31163, -25930, -21384, -9199, 16822, 34023, 29387, 4682, -31839, -45360, -15485, -17323, -31526, -17746, -4595, 10554, 7509, -3727, -17906, -26862, -9945, 32793, 45972, 48399, 60467, 49578, 10899, -23662, -42205, -66111, -66873, -44823, -24056, -13096, -28227]
6921b8227J2127Q980L9329q246l5210O043r016L414q016j019M86n388q059J7641
6907a5161J420p252m580o387k193j4493N612J9719O452j6566r662J2049L2078
6894A036j5527j7226O256r684k410K7154K5467n473j7456k8642R453J3056k5777
6881c9773M250j3061K3347K9628J300l0843O821K6485n20j4154K280L480j1147
6868a1907N868P947k657l8389j0904M6918L9838P82k9540k4155M962K8961j0001
6855G723k3717j4121K5813J3269Q91q617K1972j2972l32J0625N778k217J7369
6842D1464k1207j3510j1252m798R660J7284m053K87M105m578l2599O358J6253
6829C414N550M637J2188N214j0257O714j5138k2116k9429j2213O966J3188J6079
$$ y = [-28227, -16100, -7120, 32209, 23963, -11247, -5204, -14220, -10806, -18822, -19841, -19355, -24743, -32802, -15161, -13741, -20993, -25573, -31960, -34153, -48646, -43034, -23315, -16863, -33429, -43091, -31042, 1036, -14491, -31717, -25461, -35145, -37555, -10401, 15066, 9593, -7863, -36505, -27052, -13996, -39773, -35523, -48584, -25237, 4391, 5691, -25152, -18331, 8154, 7634, -6520, -4240, -760, -11907, -6039, 1908, -749, -39138, -50042, -3124, 36714, 37496, 7956, -16199, -11237, 17724, 7723, -15994, -30115, -4302, 8967, 9858, 1241, 23213, 10241, 9909, 20534, 26312, 24095, 41464, 20257, 6747, -4505, -9303, 357, 17641, 13588, 13875, 17980, 13402, -19197, -12839, 3414, 8964, 13601, 25789, 31003, 20746, 27460, 12322, -9794, -39223, -51436, -44470, -31282, -15203]
6816a5203J5998j1905J184O257O427O53j470M571Q45K306J951J1917j2501p158
6802C872q625p986L935j5181J5758r09r389M372l758J792j2299p371M1747k587
6788C371J9030M899j2505k3750J5507Q208j1138j7198j5060o610J7943K0344O518
6775I559j3444l467J9684n257n154J6495K4669j7001l5942L641l780j6996J4354
6762a2639K0939k9830N441L0182p142j4653o324j862J240p03j018R220P417p398
6748g130n295r648j3855J2421J3545k3017K9192R214L2722j9105j0395R281j898
6735A6032l976j7048j2779q615K2625o504k876N688O685m578j4604J2035j3735
6722b1650j448K4727M884J9673M25q055q512j6559r91P08m797j5513Q104J1741
$$ y = [-15203, 795, -11110, -9926, -3669, 2758, 3411, 1941, 6512, 7357, 9663, 11614, 23531, 11030, 3872, -4753, -12739, -8804, -23985, -8227, -9136, -18525, -14153, -17911, -16119, -28418, -35789, 5958, 3371, 22401, 27300, 14795, -8955, 6552, 14760, 3622, -13576, -28636, -35246, -17303, 3041, 9559, -3885, -7352, 12332, 7075, 1921, 18416, 43085, 26084, -9858, -6217, -9997, -26993, -12639, 8300, -21530, -16089, 14093, 6951, -7702, -14026, -15888, -14648, -15351, -16369, -7149, 268, -7130, -12425, -22073, -35928, -23507, -9962, -32979, -3787, 5427, 38149, 19044, 8649, 17930, 16032, 12056, -4992, -17771, -26386, -3761, -10265, -13141, -7453, -768, -5346, -19950, -7915, -21650, -23098, 1629, 6513, 26186, 26611, 18556, 10044, -6515, -7506, -6798, -11595, -27108, -19004, -7263]
6708g263N360J6990R208K351k2839J8699K5668P652j8925m138q280m8495J6983
6695g029Q476r353j0886J4150o830J6334R294k3229k052O971L255J3847Q382K6059
6681D7389J6524k8336l6928J1210J7744n633m748O67j9474j6210j3134j0148K4129
6668a6948M642j613o587n659K4380j596j1662P486K1431k2380j3897n520P581
6655b0342M581l1541l0904J1899J9636L0035K7146L45J6898j1985k271j2584J751
6642B664n710m847l865j230m2l762k388j7484K2501k219k0361j5749m890L6682
6628b0700K9203j8388j4591M456l0600J7369K4012k5940J0198J0143n426J0846
6616i418K885R461p378m335R668J3101P914j6740k9051j8851L326J3839P366L219
$$ y = [-7263, -1903, 15087, 24295, 26646, 3807, 22506, 48174, 55826, 36901, 32763, 24483, -24012, -7029, 1447, -7906, -18792, -4642, -11472, 4862, 14156, -9073, -11125, -4154, -899, 12948, 21330, 47389, 63913, 35577, -1351, 9859, 27603, 21970, 17222, 17889, -1585, -17795, -30929, -41077, -16948, -12306, -13919, -20506, -26165, -1785, -3381, -15043, -7557, 13874, -8506, -22403, -27923, -20342, -15761, -47302, -78206, -66307, -46671, -16636, 10510, 10855, 27753, 15768, 13497, 913, 2664, -3046, -7893, -11758, -12988, -13030, -16792, -19180, -36664, -14163, -16382, -36743, -52492, -57382, -20700, 8503, -9885, -24476, -20020, -50620, -33251, -9239, -35179, -24981, -14838, -20264, -9418, -6533, 2928, -4450, -8785, 883, 13984, 21898, 5158, -23893, -42744, -39418, -25579, -18213, -14994]
6602a4994Q082J5947k992j7863k8959K408q560j7225Q319O425n650J7761J3835
$$ y = [-14994, -6912, 9035, 6043, -11820, -40779, -38371, -46931, -64156, -55837, -49412, -55062, -37301, -23466]
$$ [...]
##END NTUPLES=NMR SPECTRUM
##END=
