##TITLE=Analysis number 307232
Compound Code cc 23641
Book Reference 411/168/2
Project Code adrs
Chemist Name miguelg
##JCAMPDX= 6.0         $$ Bruker NMR JCAMP-DX V2.0
##DATA TYPE= NMR SPECTRUM
##DATA CLASS= NTUPLES
##ORIGIN= Bruker BioSpin GmbH
##OWNER= NMR
$$ XWIN-NMR		Version 3.5
$$ Mon Apr 25 15:41:45 2005 GMT Daylight Time (UT+1h)  MAYBRIDGE\NMR@NMR_250MHZ
##.OBSERVE FREQUENCY= 250.131544655141
##.OBSERVE NUCLEUS= ^1H
##.ACQUISITION MODE= SIMULTANEOUS (DQD)
##.ACQUISITION SCHEME= undefined
##.AVERAGES= 16
##.DIGITISER RES= 18
##SPECTROMETER/DATA SYSTEM= dpx250
##.PULSE SEQUENCE= zg30
##.SOLVENT NAME= CDCl3
##.SHIFT REFERENCE= (INTERNAL, CDCl3, 0, 16.522)
##AUDIT TRAIL= $$ (NUMBER, WHEN, WHO, WHERE, WHAT)
$$ ##TITLE= Audit trail, XWIN-NMR		Version 3.5
$$ ##JCAMPDX= 5.01
$$ ##ORIGIN= Bruker BioSpin GmbH
$$ ##OWNER= NMR
$$ C:\u/data/dgb/nmr/ADRS/2200/pdata/1/auditp.txt
$$ ##AUDIT TRAIL=  $$ (NUMBER, WHEN, WHO, WHERE, WHAT)
(   1,<2005-04-25 15:41:10.26 +100>,<MAYBRIDGE\NMR>,<NMR_250MHZ>,
      <created by zg, POWCHK disabled, PULCHK disabled
       configuration hash MD5:
       62 19 C7 07 E1 42 D1 B7 37 6C 3D D0 77 39 F9 E6
       data hash MD5: 64K
       81 72 08 0F 1F E8 54 C8 36 84 48 85 8E 3A 2F 52>)
(   2,<2005-04-25 15:41:26.07 +100>,<MAYBRIDGE\NMR>,<NMR_250MHZ>,
      <Start of raw data processing
       ef LB = 0.3 FT_mod = 6 PKNL = 1 SI = 32K 
       data hash MD5: 32K
       AE 26 94 67 CC 25 8E 94 AB 43 F3 B0 0B 61 7C 43>)
(   3,<2005-04-25 15:41:29.68 +100>,<MAYBRIDGE\NMR>,<NMR_250MHZ>,
      <apk 
       data hash MD5: 32K
       6A 0C 21 6B 3B A6 77 07 F4 D7 D0 D8 B6 2B 90 7D>)
(   4,<2005-04-25 15:41:31.04 +100>,<MAYBRIDGE\NMR>,<NMR_250MHZ>,
      <abs ABSG = 5 
       data hash MD5: 32K
       82 8A 8E B4 45 40 B3 4D 01 86 18 D4 AB 5E DB 24>)
$$ ##END=
$$ 
$$ hash MD5
$$ 5F DD D9 3A 27 2A 5A 2F 0F B4 0B 0D AE 64 85 09
##$RELAX= 
##$RELAX= 
##$RELAX= 
##$RELAX= 
##$RELAX= 
##$RELAX= 
##$RELAX= 
$$ Bruker specific parameters
$$ --------------------------
##$DU= <C:\u>
##$EXPNO= 2200
##$NAME= <ADRS>
##$PROCNO= 1
##$TYPE= <nmr>
##$USER= <dgb>
##$AMP= (0..31)
100 100 100 100 100 100 100 100 100 100 100 100 100 100 100 100 100 100 
100 100 100 100 100 100 100 100 100 100 100 100 100 100 
##$AQSEQ= 0
##$AQ_mod= 3
##$AUNM= <au_zg>
##$AUTOPOS= <42 >
##$BF1= 250.13
##$BF2= 250.13
##$BF3= 250.13
##$BF4= 250.13
##$BF5= 500.13
##$BF6= 500.13
##$BF7= 500.13
##$BF8= 500.13
##$BYTORDA= 1
##$CFDGTYP= 0
##$CFRGTYP= 5
##$CHEMSTR= <none>
##$CNST= (0..31)
1 1 145 1 1 1 1 1 1 1 1 1 1 1 1 1 1 1 1 1 1 1 1 1 1 1 1 1 1 1 1 1 
##$CPDPRG= <>
##$CPDPRG1= <>
##$CPDPRG2= <>
##$CPDPRG3= <>
##$CPDPRG4= <mlev>
##$CPDPRG5= <mlev>
##$CPDPRG6= <mlev>
##$CPDPRG7= <mlev>
##$CPDPRG8= <mlev>
##$CPDPRGB= <>
##$CPDPRGT= <>
##$D= (0..31)
0 1 0 0 0 0 0 0 0 0.06 0 0 0 0 0 0 0.0002 0 0 0 0 0 0 0 0 0 0 0 0 0 0 
0 
##$DATE= 1114440068
##$DBL= (0..7)
120 120 120 120 120 120 120 120 
##$DBP= (0..7)
150 150 150 150 150 150 150 150 
##$DBP07= 0
##$DBPNAM0= <>
##$DBPNAM1= <>
$$ [...]
##$SUBNAM7= <"">
##$SUBNAM8= <"">
##$SUBNAM9= <"">
##$SW= 20.6930455092707
##$SWIBOX= (0..15)
0 0 3 0 0 0 0 0 0 0 0 0 0 0 0 0 
##$SW_h= 5175.983436853
##$TD= 65536
##$TD0= 1
##$TE= 296.16
##$TE2= 300
##$TE3= 300
##$TEG= 300
##$TL= (0..7)
0 120 120 120 120 120 120 120 
##$TP= (0..7)
150 150 150 150 150 150 150 150 
##$TP07= 0
##$TPNAME0= <>
##$TPNAME1= <>
##$TPNAME2= <>
##$TPNAME3= <>
##$TPNAME4= <>
##$TPNAME5= <>
##$TPNAME6= <>
##$TPNAME7= <>
##$TPOAL= (0..7)
0.5 0.5 0.5 0.5 0.5 0.5 0.5 0.5 
##$TPOFFS= (0..7)
0 0 0 0 0 0 0 0 
##$TUNHIN= 0
##$TUNHOUT= 0
##$TUNXOUT= 0
##$USERA1= <user>
##$USERA2= <user>
##$USERA3= <user>
##$USERA4= <user>
##$USERA5= <user>
##$V9= 5
##$VALIST= <valist>
##$VCLIST= <CCCCCCCCCCCCCCC>
##$VD= 0
##$VDLIST= <DDDDDDDDDDDDDDD>
##$VPLIST= <PPPPPPPPPPPPPPP>
##$VTLIST= <TTTTTTTTTTTTTTT>
##$WBST= 1024
##$WBSW= 4
##$XGAIN= (0..3)
0 0 0 0 
##$XL= 0
##$YL= 0
##$YMAX_a= 562333
##$YMIN_a= -501924
##$ZGOPTNS= <>
##$ZL1= 120
##$ZL2= 120
##$ZL3= 120
##$ZL4= 120
##$ABSF1= 16.522
##$ABSF2= -4.171173
##$ABSG= 5
##$ABSL= 3
##$ALPHA= 0
##$AQORDER= 0
##$ASSFAC= 0
##$ASSFACI= 0
##$ASSFACX= 0
##$ASSWID= 0
##$AUNMP= <proc_1d>
##$AZFE= 0.1
##$AZFW= 0.1
##$BCFW= 0
##$BC_mod= 0
##$BYTORDP= 0
##$COROFFS= 0
##$CY= 12.5
##$DATMOD= 1
##$DC= 0
##$DFILT= <>
##$DTYPP= 0
##$F1P= 14.0000005364418
##$F2P= -0.99999901652339
##$FCOR= 0.5
##$FTSIZE= 32768
##$FT_mod= 6
##$GAMMA= 0
##$GB= 0
##$INTBC= 1
##$INTSCL= 1
##$ISEN= 128
##$LB= 0.3
##$LEV0= 0
##$LPBIN= 0
##$MAXI= 10000
##$MC2= 0
##$MEAN= 0
##$ME_mod= 0
##$MI= 0
##$NCOEF= 0
##$NC_proc= -4
##$NLEV= 6
##$NOISF1= 0
##$NOISF2= 0
##$NSP= 0
##$NTH_PI= 0
##$NZP= 0
##$OFFSET= 16.522
##$PC= 1
##$PHC0= 131.7257
##$PHC1= 6.857598
##$PH_mod= 1
##$PKNL= yes
##$PPARMOD= 0
##$PSCAL= 4
##$PSIGN= 0
##$REVERSE= no
##$SF= 250.13
##$SI= 32768
##$SIGF1= 0
##$SIGF2= 0
##$SINO= 400
##$SIOLD= 32768
##$SREGLST= <1H.CDCl3>
##$SSB= 0
##$STSI= 32768
##$STSR= 0
##$SW_p= 5175.98343685301
##$SYMM= 0
##$S_DEV= 0
##$TDeff= 65536
##$TDoff= 0
##$TI= <Analysis number 999999
Compound Code 99
Book Reference 9
Project Code 9>
##$TILT= no
##$TM1= 0
##$TM2= 0
##$TOPLEV= 0
##$USERP1= <user>
##$USERP2= <user>
##$USERP3= <user>
##$USERP4= <user>
##$USERP5= <user>
##$WDW= 1
##$XDIM= 32768
##$YMAX_p= 404730900
##$YMIN_p= -40543
$$ End of Bruker specific parameters
$$ ---------------------------------
##NTUPLES= NMR SPECTRUM
##VAR_NAME=  FREQUENCY,     SPECTRUM/REAL,   SPECTRUM/IMAG
##SYMBOL=    X,             R,               I
##VAR_TYPE=  INDEPENDENT,   DEPENDENT,       DEPENDENT
##VAR_FORM=  AFFN,          ASDF,            ASDF
##VAR_DIM=   32768,         32768,           32768
##UNITS=     HZ,            ARBITRARY UNITS, ARBITRARY UNITS
##FACTOR=    0.157963299565203, 1,           1
##FIRST=     4132.6476996994, 0,             0
##LAST=      -1043.33573715361, 0,           0
##MIN=       -1043.33573715361, -40543,      0
##MAX=       4132.6476996994, 404730900,     0
$$ Real data points
##PAGE= N=1
##DATA TABLE= (X++(R..R)), XYDATA
$$ [...]
18168 59331 65090 66682 62194 55711 53468 57373 68674 75625 76896 75635 73389 65039 47625 43701
18154 43701 45965 56705 64796 66188 72278 69367 64154 59500 61187 70208 73329 77058 89521 96447
18140 96447 92783 89574 94701 101517 113432 119804 133976 138327 153606 165008 174255 201462 226289
18127 226289 248659 268385 294042 332523 381299 437984 518734 624205 754249 954762 1232924
18116 1232924 1664464 2329517 3390221 5150382 8010734 11733082 14195457 13929638 12375902
18107 12375902 9672209 6846623 4847406 3666892 3015740 2647956 2390853 2118653 1820640
18098 1820640 1542836 1318980 1126624 957486 821214 704474 622873 540344 472291 423946
18088 423946 392999 352117 302961 273609 252003 231583 213263 193723 171102 155250 143926
18077 143926 132968 126029 122933 114406 97302 83443 79678 75278 73594 72530 70137 78282 82530
18064 82530 85284 78830 73022 71192 56919 58119 64219 63492 59381 57311 53033 48888 48684 49513 42291
18049 42291 29159 24304 25434 19656 20617 25277 19791 25693 41023 45719 35245 27343 17023 19119
18035 19119 24908 25238 32932 30272 13766 13336 22961 29052 30607 41349 47683 49424 48763 50650 45326
18020 45326 35387 39168 47154 54057 48464 48415 40607 48967 51065 41785 42115 50137 56379 58108 64038
18005 64038 67643 72732 78418 81535 82060 85611 93944 91569 91281 95915 97308 97603 111401 113898 116445
17990 116445 118409 135810 166411 199724 230580 254376 268280 282778 296300 297954 294099 284854
17978 284854 270593 255807 229365 218335 207933 182983 158732 155249 145910 136530 129025 126254
17966 126254 119500 116804 121934 122895 117901 115981 107746 104413 102789 100660 89809 85352 87587 81379
17952 81379 73632 71048 77765 72645 65472 67792 67588 62995 60515 58379 59438 59965 58093 52830 55581
17937 55581 49882 40196 36633 36356 35768 38122 44371 44567 43824 47209 42324 40167 50666 56516 66438
17922 66438 66193 56450 45380 47159 53886 47974 48652 49649 54516 51682 65414 64979 61804 66280 57014
17907 57014 52506 55968 57427 64176 66891 63810 64407 62648 57493 61225 69168 74918 70462 61841 63020
17892 63020 56793 63226 62785 55012 54728 48496 46661 53155 68538 72270 63342 56868 53198 50326 46461
17877 46461 45339 47961 62494 65905 62772 55296 58308 56908 51856 55340 65287 76009 73530 75393
17863 75393 74859 76577 86311 91170 89512 83775 86352 91101 86447 79095 74491 76980 80544 76861 84268
17848 84268 87941 83422 82314 85935 92117 95002 98691 105487 108136 114770 122634 138768 148920 144912
17834 144912 135329 136383 137027 126223 119825 119083 131260 131184 112646 103901 101325 100075 103149 106579
17820 106579 105598 102660 105623 106445 108894 124030 135114 127730 134170 131221 131336 138383 143407 152342
17806 152342 157353 158223 155006 148178 143868 152213 147851 145142 147836 154503 162086 160760 173234 172261
17792 172261 172488 186883 199359 202789 204877 202531 206021 212802 221796 234280 251121 271155 297887
17779 297887 306370 307612 319157 333098 345252 359439 384190 413871 447454 497465 561821 609322
17767 609322 635010 643404 645008 645187 654412 663604 666994 667996 662989 642452 636690 643063 668034 709793
17753 709793 779996 846806 914936 987131 1050167 1103158 1150061 1214674 1292973 1383109 1482932
17742 1482932 1584848 1675837 1746492 1789069 1820531 1865659 1929206 1997746 2061193 2094835 2117786
17731 2117786 2161574 2241981 2384744 2594937 2887301 3275817 3821626 4607886 5661380 6913173
17721 6913173 8116328 9048186 9750585 10451774 11436424 12888895 14776574 17132994 20354079
17712 20354079 25119685 32092744 40933259 49207755 54026224 55371730 55075781 55272835
17704 55272835 57006831 58270707 56379874 51259730 44118932 36688105 30592018 26234516
17696 26234516 23110710 20717641 18754702 17092258 15700307 14434154 13081961 11588734
17688 11588734 10023617 8525975 7220819 6154100 5327692 4687007 4171914 3741656 3364826
17679 3364826 3047186 2788659 2579856 2403428 2239525 2078977 1924851 1774402 1647467
17670 1647467 1540004 1422718 1301136 1180197 1067451 964451 886931 816651 755840 712232
17660 712232 675326 637130 596320 568882 546986 523707 501746 480579 470620 468004 468651 474985
17648 474985 486885 516287 547842 562285 562900 548083 530805 524652 520015 483321 445120 410465
17636 410465 367760 323901 284724 256720 228180 212148 220570 216641 199661 192443 185407 175837
17624 175837 178047 172981 158782 144657 128860 123485 123567 118349 117274 121919 121668 123365 122171 119037
17610 119037 118544 119524 123448 121843 117771 112259 112787 109645 108461 115192 119896 120037 117087 125441 133218
17595 133218 144726 158012 184712 193990 181955 176632 166180 172100 178974 192851 205683 205257 194322
17582 194322 180449 169225 170260 163065 150032 147703 150948 145068 128400 112519 118682 116756 105442
17569 105442 112813 114759 108255 103934 98371 97267 100019 104329 91878 85810 87436 85859 85525 72505
17555 72505 64301 67709 70887 54977 45114 43701 38618 41031 46746 55282 51730 40380 38753 44868
17541 44868 52598 45215 42206 40972 49874 58524 54025 62092 69828 71620 61704 56947 63355 58376
17527 58376 54060 45482 37803 36503 29411 26622 33145 34192 40456 42217 43209 39274 30006 24934 13659
17512 13659 3671 8955 14899 26752 35934 45163 50235 46885 37034 28503 29619 24431 27664 28887
17498 28887 34933 37950 34900 40395 49474 44678 46468 47482 57007 68500 77168 106273 141603 183348
17484 183348 226411 280422 333282 379876 415223 431655 436622 452867 483318 547227 619615 662768
17472 662768 682139 668589 625331 582710 548176 522795 517153 520605 525649 506179 473816 429702
17460 429702 376925 335358 300722 274622 257712 248893 232067 205371 196463 177671 148546 132491
17448 132491 117223 116097 126809 137926 153621 154421 146750 130257 117791 108784 91688 75442
17436 75442 67426 57375 58363 59176 48466 36978 33940 34969 32948 34685 35067 31618 15702 12180
17422 12180 18417 15846 11291 -1863 -260 4519 7035 3651 2324 3069 10839 15678 2919 -4117
17408 -4117 -3528 8078 10007 -434 619 9942 3783 3712 4682 -803 -3939 -310 -3299 -5432 8047
17393 8047 12785 18972 11564 9249 8785 14722 18778 22064 17976 16015 19277 22101 28521 28764 39687
17378 39687 43586 30539 31456 33145 25275 22363 24533 15842 9916 14377 17802 22587 10228 8365
17364 8365 8699 7308 4541 5833 59 -1739 5719 12518 6929 11173 18498 27415 19044 16567 33826
17349 33826 30689 22680 13901 9366 10901 12324 13437 6294 -1206 -6406 931 8393 3389 -9586
17335 -9586 -4323 4555 10460 9502 9769 14545 12152 9055 10719 26970 31536 25624 4551 -3235 3616
17320 3616 11174 13087 24327 19096 11763 16475 24659 32976 38888 43183 53851 49250 42560 42494 47169
17305 47169 51824 58013 63596 71421 81156 80325 65080 52265 52416 66252 71919 74475 63405 49320
17291 49320 45441 37567 26964 25743 30809 33363 27793 27722 29770 27419 14026 10011 21675 27597
17277 27597 35836 45560 45673 37601 27523 16608 620 -1646 4022 6952 7075 10159 15532 11470
17263 11470 8311 11211 14072 11910 3042 580 -1968 7205 10465 8770 4954 3970 -1447 -2839 -7078
17248 -7078 -7258 -9023 -4861 47 -7703 -11756 -15525 -25218 -18861 -9891 -11330 -5100 -2915 -16683 -17780
17233 -17780 -24655 -21136 -17029 -10360 -4243 -5158 -12836 -18629 -23909 -19411 -18078 -18675 1211 -1358 -15615
17218 -15615 -24279 -24497 -23505 -14067 -3223 6167 7647 7790 1886 3859 -6114 -8134 -9888 -10433 -13130
17203 -13130 -13276 -1975 -1062 -4583 -10978 -20077 -21924 -23506 -25300 -30494 -24921 -14281 -8983 -7778
17189 -7778 -4881 11407 9995 7353 8653 4270 1026 -3240 -10132 -14660 -9730 -643 8754 1799
17175 1799 -7214 -974 3543 -451 -10174 -6591 -1627 -5952 -3554 6258 -4125 -19899 -26698 -24186
17161 -24186 -28139 -23769 -17919 -16862 -15732 -11187 969 7703 5818 -2483 -2220 -2773 707 5131 6472
17146 6472 4653 -2340 -5783 -7164 -12990 -6556 -1198 -2022 2477 6821 16221 17444 11806 11689 13632
17131 13632 10154 9543 16438 26189 30893 38356 53954 50594 54115 65563 78684 96127 123285
17118 123285 154507 191036 215977 242713 254561 258035 259414 265936 280171 283733 266744 232350
17106 232350 200769 164553 130424 106650 99419 98078 86737 78164 74560 68580 62421 53422 40880
17093 40880 21158 24329 16670 9924 5524 1502 9024 11450 8966 13095 11183 8499 2535 3688
17079 3688 16301 14194 6303 -5453 -18021 -17712 -14330 -16309 -11187 -4279 -6205 -15222 -13268 -17279
17065 -17279 -8701 7429 6347 7703 1567 3955 5768 -5785 -15190 -18586 -14950 -5369 -6303 -8476
17051 -8476 5252 6183 1941 4375 -5601 -13588 -9628 -5440 -4384 -5819 -2754 4870 7674 3838 3797
17036 3797 -1667 -4698 -14989 -20995 -19509 -15367 -10342 -1100 221 -2178 -12977 -12753 -13683 -21724 -18881
17021 -18881 -21444 -25494 -23687 -19850 -17341 -6410 -4458 -5494 325 1577 755 -1603 -2408 -12503
17007 -12503 -14468 -8012 -8791 -14784 -18987 -20071 -17882 -6051 -849 -6183 -4600 -12592 -13015 -6193 -8104
16992 -8104 -8768 -5042 -4845 -3503 -4781 -2950 -2189 -4905 -7001 -11733 -19228 -12828 -11425 -5422 -510
16977 -510 -17101 -30859 -23015 -16429 -28874 -28119 -14388 3692 15094 4937 -7163 -9503 -3514
16964 -3514 2200 4669 1663 110 -853 -5735 -10913 -14528 -16002 -19549 -18994 -20562 -23614 -16198 -20209
16949 -20209 -20165 -18098 -23366 -28501 -24027 -23598 -26942 -19180 -14243 -6597 -3793 -7416 -1033 4407 3767
16934 3767 -5715 -221 9338 10283 9730 280 -8299 -14869 -6227 -1927 3419 3366 1333 1958 -572 -11033
16918 -11033 -8759 -8846 -442 514 -5967 -4988 735 -6711 -19432 -18858 -16416 -14808 -16178 -17544 -12835
16903 -12835 -6243 -11920 -14527 -16033 -7037 -336 713 -986 1941 -465 -8361 -11734 -11115 -12204 -18811
16888 -18811 -18481 -16262 -18767 -19316 -23908 -20359 -16670 -13987 -10854 -4712 513 -1045 -15071 -19636 -13748
16873 -13748 -10553 -2840 -4675 -8791 -5427 -3646 4055 5042 11655 13696 9792 748 -8074 -6973 -1508
16858 -1508 2831 8253 6023 6226 143 -13546 -18510 -17866 -5511 1594 1751 6763 2839 -7590 -19191
16843 -19191 -20900 -14489 -7687 -11163 -15172 -27222 -25275 -25032 -25691 -31655 -35024 -33106 -24055 -18865 -15733
16828 -15733 -13214 -20147 -27780 -24349 -14565 -9640 -3612 -6912 -5804 -892 -216 -17237 -20705 -14436
16814 -14436 -15492 -12105 -1232 -3043 -4597 -2250 -5747 -3422 480 -2517 -855 -2985 -1116 -528
16800 -528 -15125 -4943 14635 25506 10916 267 -5077 -14371 -26158 -27085 -22516 -7833 2774
16787 2774 9480 15751 19255 25839 21311 14205 4736 3198 -5086 -14153 -11651 -11444 -19587 -19500 -12293
16772 -12293 -10492 -18467 -16039 -16297 -33855 -37249 -31388 -18712 -7497 -10780 -12120 -19094 -20087 -26470
16758 -26470 -10431 1459 -6970 -14787 -11489 -9629 -8483 -7615 2544 8813 6140 -5713 -10925 -14124
16744 -14124 -18635 -12685 -11237 -6815 -10893 -16218 -6700 226 -5094 -18200 -18046 -17217 -14569 -12813 -3419
16729 -3419 -1292 -581 3140 -4529 -11665 -5373 -3751 -7765 -6954 -4930 -5674 -6219 -8464 -6679 -12215 -16086
16713 -16086 -9659 -6898 -12536 -17802 -27993 -31083 -27507 -20329 -4935 -797 -3039 -18626 -26168 -25601
16699 -25601 -22874 -19925 -14629 -23013 -25204 -22099 -21182 -16328 -12564 -22561 -21374 -26898 -26655 -18839 -17036
16684 -17036 -19956 -19033 -19984 -14894 -12228 -3864 1472 486 -6357 -14696 -9623 1326 -763 -13522 -17366
16669 -17366 -17322 -14804 -16249 -14216 -16900 -11757 -4045 -7562 -9254 -12469 -11083 -7558 -9700 -6677 6943
16654 6943 12686 13190 6112 2547 -4835 -6014 -530 1534 -2282 -6352 -4848 4358 831 450 -8199
16639 -8199 -12996 -9187 -10042 -9727 -9011 -13510 -10729 -12125 -1653 2998 1263 -4295 -5497 -4489 -4374
16624 -4374 -14482 -28604 -32871 -33094 -24865 -18674 -28001 -27051 -22724 -14510 -11473 -17741 -16583 -18921 -18160
16609 -18160 -11559 -11780 -6762 4377 4949 4791 3060 7624 4544 4468 794 -12562 -23477 -16803 -12584
16594 -12584 -14616 -12510 -11613 -16084 -13044 -14839 -16712 -26264 -23562 -18936 -17688 -12104 -7122 -9214 -15750
16579 -15750 -20526 -14803 -5870 -4616 -19662 -34080 -31506 -19488 -6825 -6467 -5400 -6343 -2706 -2866
16565 -2866 -1477 -419 -274 5908 -5388 -9175 -4362 -17163 -24884 -18234 -12742 -17250 -16470 -12357 -6296
16550 -6296 -12965 -15159 -7139 -4484 -15629 -11001 -3857 -8662 -15033 -14993 -14854 -13118 -8068 -3473 1003
16535 1003 8490 -3627 -14832 -6474 4792 -881 -9768 -13273 -13350 -13914 -8058 4619 2420 -6669
16521 -6669 -6072 -5963 -10507 -16393 -21857 -14324 -8489 -6425 -7469 -15695 -20695 -22017 -17266 -20108 -31067
16506 -31067 -36411 -27761 -14707 -8937 -4127 -4573 -9160 -5786 1614 4744 -1919 1521 4778 4232 -4985
16491 -4985 -11486 -10521 -7254 -6669 -9889 -12798 -11623 -11476 -14864 -11230 -10689 -11451 -20470 -18459 4304 13741
16475 13741 10104 5378 13100 8726 1718 10780 15075 8909 0 -2499 -1582 -263 1068 5110 4159
16460 4159 -6801 -14646 -21120 -23666 -27199 -25000 -33766 -32159 -25077 -14848 -10921 -12367 -13768 -8816
16446 -8816 -4529 -4142 -10395 -13691 -14517 -1110 6098 4966 -2228 -8948 -9368 -23786 -28521 -19088 -25894
16431 -25894 -27823 -21794 -13455 -14338 -11206 -16452 -18391 -14150 -15119 -16386 -14320 -2093 4293 -2516 -5618
16416 -5618 -12000 -14960 -15612 -14926 -14994 -10969 -2721 -1907 -15216 -21727 -18552 -17098 -6925 -7784 -17065 -17449
16400 -17449 -16638 -13941 -20596 -21390 -22405 -19173 -7389 2525 -7162 -13117 -16731 -16049 -13628 -10256 -15866
16385 -15866 -29142 -31664 -26106 -22261 -20384 -16141 -5071 -4579 -5533 -8548 -10137 -200 4447 -4569
16371 -4569 -18386 -19062 -22464 -19175 -17674 -20194 -22448 -31122 -34103 -26325 -27520 -22901 -11157 -13867
16357 -13867 -22496 -17180 -8288 -4633 -6026 5190 4952 -3192 -2925 4563 3120 739 -3022 -3428 1492
16342 1492 2762 -5361 -12739 -12874 -6311 -1340 -3940 -868 1683 4595 -2554 -17442 -7415 3670
16328 3670 3958 5883 -10230 -15826 -12187 -17443 -18472 -9031 5762 6359 4458 2331 3714 -3073 -8510
16313 -8510 2253 5331 2985 -5504 -9049 -10948 -16613 -16760 -7659 2399 913 -11428 -21498 -17345
16299 -17345 -7305 2017 3532 4926 -1043 -5178 1608 4895 -703 -2702 -4403 158 689 -4207
16285 -4207 -8563 -18244 -23981 -31625 -31512 -28512 -12291 -6786 -5750 -6607 -9530 -14272 -23175 -16447 -13057
16270 -13057 -12502 -14392 -10632 -12371 -19757 -13764 -5742 -2286 -2649 2446 1480 -5230 -5832 -530 589
16255 589 -3092 -6019 -9071 -11302 -4731 -7445 -8581 -12545 -12324 1174 -506 -11376 -10206 -10305 -16828
16240 -16828 -7828 192 4594 6106 8454 -1387 -3416 -4396 -1799 370 -6216 -17432 -13797 -9422
16226 -9422 -10033 -135 5217 3420 1522 1823 -105 -2669 -9407 -12272 -9501 -8555 -14800 -14940 -17041 -14679
16210 -14679 -2022 10214 1207 -880 -4596 -5498 -14774 -20620 -22683 -12991 -8423 1501 6236 771
16196 771 -4289 -3286 -10568 -17521 -7986 -4962 -2247 -7930 -11309 -12753 -14852 -6532 -249 -5198 -8888
16181 -8888 -8153 -15821 -18288 -13619 -14257 -13307 -14837 -19758 -23105 -22875 -22042 -13352 -13063 -17853 -16475 -16388 -17170
16164 -17170 -23603 -25333 -25544 -16306 -13133 -2455 1316 1532 -3091 2077 -9848 -26341 -28592 -16176
16150 -16176 -5854 -4623 3045 1785 -6789 -23579 -23654 -20791 -12259 -13767 -4147 -1590 -9557 -15916
16136 -15916 -7419 -1444 -1324 -663 -1500 -6170 1446 -2235 -1551 -14014 -16301 -16499 -17107 -9045 -17314 -17934
16120 -17934 -11651 -8874 -13470 -10876 -6375 -13384 -17993 -14355 -17786 -10467 -8980 -10527 -5757 -6098 -8640
16105 -8640 -26524 -32335 -35997 -26777 -14748 -9463 -13986 -11691 -13255 -6284 -6528 -17072 -28294 -21885
16091 -21885 -17786 -14694 -8782 -9129 -13630 -6175 -7233 -6610 -6138 -1975 6778 4824 2957 5072 -9434
16076 -9434 -14204 -13722 -10478 -11246 -5661 -3795 -6815 -6585 -4457 -2928 -12052 -3381 13641 4865 -8659
16061 -8659 -15983 -21344 -16980 -9023 -11819 -7297 -3511 -9147 -9941 -731 -2532 -5250 -8459 -9923 -9490
16046 -9490 -7419 -10312 -6191 776 -4752 -12708 -13996 -10823 -11616 -11947 -12568 -9239 -5826 -9359 -14301
16031 -14301 -11192 -13480 -17849 -17252 -18467 -21696 -19709 -20735 -21126 -18866 -20397 -25864 -30577 -26227 -16456
16016 -16456 -15691 -17589 -17806 -15263 -3810 523 2238 -2037 -5238 -14340 -15099 -12865 -8900 -3716 -2089
16001 -2089 3159 3733 -3130 -9868 -2002 617 -8732 -7092 1287 8968 15616 4846 -1776 2654 14106
15986 14106 9945 1339 -5620 -6271 -6626 -13694 -11682 -10896 -9604 -12996 -11324 -18681 -26459 -20917 -8431
15971 -8431 -2465 -849 -2140 -1702 -3594 -7894 -10035 648 8805 -5471 -15528 -18469 -11722 -6428
15957 -6428 -6381 -9572 -10389 -7085 -10047 -16918 -13027 -17562 -26774 -28556 -21423 -13450 -5127 -1583 -15900
15942 -15900 -14204 -10932 -2456 4296 5067 -360 4945 9057 8458 8887 7260 -1096 5920 19650 15750
15927 15750 7511 6628 5956 -1364 -456 -3540 -16598 -23352 -19720 -8248 -3675 -4145 -831 -557 3439
15912 3439 -445 -3332 -4201 -12533 -16184 -11541 -12681 -10354 -22592 -20840 -11450 -9804 -8020 -2667 -8454
15897 -8454 -15087 -19597 -14105 -10149 -8921 -9493 -3157 1987 -4847 -6482 -7643 241 2601 -10017 -18754
15882 -18754 -19941 -15666 -15866 -7456 7849 14344 7164 -2807 -1153 6083 -2554 -1937 -3843 -6146 -11041
15867 -11041 -18733 -22544 -26067 -30362 -26495 -17142 -14707 -20215 -17876 -19474 -15810 -22855 -26285 -15302
15853 -15302 -18897 -22724 -14119 -7985 -16786 -25002 -20076 -12394 -12250 -6248 -12004 -17487 -11662 -10553 -2880
15838 -2880 733 7967 8513 443 -12787 -16337 -19448 -22236 -16087 -24078 -21677 -12649 -16274 -20265 -14954
15823 -14954 -8866 -4996 -18988 -17070 -16981 -21125 -8650 -11484 -15979 -21402 -23661 -24433 -20529 -19014 -10884
15808 -10884 -11959 -16376 -9108 -7567 -12524 -11767 -19448 -21997 -20736 -18498 -13712 -18544 -19069 -11202 -14003
15793 -14003 -17813 -10412 -5845 -6838 -2267 -2151 -11603 -10436 -7839 -7767 -10320 -22351 -17862 -22609 -18438
15778 -18438 -15483 -15466 -14110 -3049 1132 6570 14807 11629 5529 11271 13401 -3641 -16837 -10945
15764 -10945 88 5056 989 -1176 -2784 -14251 -14206 -11338 -16351 -10788 -5146 -6638 -15012 -10526
15750 -10526 -9445 -3828 -3942 -2043 1141 4247 -958 1090 512 -9093 -18691 -18685 -12126 -7093 -11055 -17558
15734 -17558 -23377 -17925 -5068 -2752 -1419 -6758 -8010 -3675 -7497 -10578 -19806 -24917 -19243 -10907
15720 -10907 -11146 -10471 -8448 -1044 6048 3547 1917 -2047 -5052 -9027 -6129 -11234 -9180 -10149 -6760
15705 -6760 -3484 -1444 -325 -1104 -4480 -6286 -7473 336 -1166 -2545 324 3097 10704 7227 2184
15690 2184 -2275 -3221 -11590 -16379 -7029 -8641 -6179 -6600 -10473 -13191 -5832 -5966 -5527 -13635 -17340 -12624
15674 -12624 -4212 -4806 -10856 -12084 -13480 -16693 -19243 -19874 -15426 -13817 -7372 -6110 -3794 -10471 -20882
15659 -20882 -18711 -10829 -4482 2032 6527 6300 1625 276 -4992 -11991 -2677 5807 11561 16489 11662
15644 11662 9254 -929 -13027 -24543 -16115 -10184 -10656 -13224 -5834 -8658 -17200 -22263 -17486 -11943
15630 -11943 4765 9017 1382 -12968 -19940 -7839 -300 792 3988 2660 -6124 -8934 -23256
15617 -23256 -34287 -30773 -17353 -7754 -6799 -11707 -19098 -16016 -11932 685 -470 948 -7776 -12575
15603 -12575 -10226 -7249 -3116 -8633 -9146 -7865 293 -1254 -3513 4848 1298 -10508 -16281 -10355
15589 -10355 -12864 -11218 -4950 -17020 -20087 -25309 -22964 -24419 -21457 -13459 -8543 -4859 669 -8575
15575 -8575 -17188 -16139 -12466 -8748 -7028 -4762 -2877 -8771 -11026 -10820 -10045 -5349 -17299 -22194 -13924
15560 -13924 -18163 -31680 -27123 -15415 -15948 -11312 -3852 -3277 -5693 -2902 -5298 -15321 -15417 -18292 -22548
15545 -22548 -21176 -17087 -9262 -9319 -12003 -11766 -13486 -9524 -7787 -10495 -17370 -18108 -18636 -11121 -6451 -7267
15529 -7267 -5825 962 5755 3269 -11682 -15777 -11828 -15071 -12085 -10787 -9463 -12880 -9764 -9209 -11767
15514 -11767 -11858 -19008 -23262 -24866 -20838 -15752 -15444 -17356 -8409 7280 -265 -5932 -10347 -3617 1386
15499 1386 -7070 -19869 -23618 -25023 -17816 -13723 -17841 -14423 -14886 -14976 -12523 -15962 -15629 -18017 -15325
15484 -15325 -4395 -10953 -20161 -19593 -9009 -13845 -14560 -14014 -21905 -13977 -10264 -9098 -6723 -8942 -10901
15469 -10901 -20222 -22569 -25310 -22966 -18923 -10805 -5760 -13558 -13365 -12429 -10932 -6218 -4628 3972 4609
15454 4609 1541 -5394 -7729 -10022 -15549 -17117 -14063 -14753 -10017 -3475 -6229 -15047 -11448 -9493 -15772
15439 -15772 -17228 -13283 -8352 -2571 -13050 -13497 -5664 -7914 -8715 -9810 -11903 -17499 -17301 -10003 -13068
15424 -13068 -3511 1735 157 5233 2202 -7391 -5364 2388 3993 4236 3801 8028 7648 8991 10696
15409 10696 6824 1087 -3288 -8778 -10564 -7402 2664 -2045 -1344 -2565 -7189 -11160 -8452 -3906
15395 -3906 -3086 -2116 -6566 -4364 -9403 -18051 -15340 -10804 -5774 -8709 -2200 9275 4828 -4755 -9652
15380 -9652 -4520 -1060 -4784 -10402 -4910 -9514 -15305 -14506 -10634 -9715 -12427 -16694 -15071 -13822 -10225
15365 -10225 -13634 -13270 -12698 -13398 -11624 -2331 -4207 -9977 -11946 -18472 -28014 -27354 -19660 -14873 -6431
15350 -6431 -10424 -6401 -5888 -17943 -26778 -33762 -32047 -25508 -18577 -8565 -1252 -1625 -1312 -2476 -10646
15335 -10646 -18334 -17950 -9303 -2726 -3433 -3859 -4353 -8188 -11311 -8813 -7572 -9783 -13399 -9816 -12577
15320 -12577 -15772 -13898 -17090 -15238 -14019 -10303 -2405 -2043 257 -3157 -10737 -14118 -10410 -12516 -14400
15305 -14400 -18634 -19833 -27709 -37140 -25957 -13997 -10065 -12768 -16908 -23257 -28659 -26480 -15432 -19655
15291 -19655 -18125 -20593 -18050 -15880 -12463 -11663 -19567 -19706 -9987 -8665 -14855 -20971 -26358 -25944 -19262
15276 -19262 -7115 -5842 -7855 -17744 -20115 -20906 -16767 -4207 1358 -6504 -9048 -2588 4969 3296
15262 3296 -13719 -26888 -22958 -22334 -21376 -19605 -14040 -6267 -4277 -4780 -8372 -8566 -10882 -11142 -12431
15247 -12431 -7985 3707 4425 40 -5100 -4816 -12527 -13472 -10536 -10441 -1124 7832 18936 20353 6874
15232 6874 -52 3202 -38 -10750 -18035 -14543 -10293 -4386 -7764 -2938 2397 1778 -5514 -9906 -10071
15217 -10071 -11323 -14082 -12143 -15355 -18497 -15957 -15495 -20379 -16887 -16462 -15470 -12561 -6905 -7906 -11726
15202 -11726 -9786 195 4140 3860 4230 -972 -2234 -37 7607 15598 17171 4221 -11568 -17644
15188 -17644 -13386 -7581 1428 -535 -7812 -15423 -12586 -10412 -7507 -8518 -6330 -14910 -15944 -8472
15174 -8472 -9724 -15585 -17434 -13423 4776 25703 17931 7906 2594 2125 -4707 2907 16869 11013
15160 11013 4925 -6482 -16946 -18591 -7669 4084 2706 5613 2561 -964 -4361 -13576 -7001
15147 -7001 -14159 -11502 -3874 -928 4005 -4975 -11672 -15346 -8748 -10881 -11084 -11824 -4089 -2061 -3760
15132 -3760 -4445 -7494 4165 2991 1831 -1818 -4058 -2724 -7958 -5900 -12605 -7443 -5241 -5768 -2110
15117 -2110 -516 244 806 -3367 3140 5035 -6364 -3146 -3722 -6683 -10686 -11132 -8651 -10506 -10208 1887
15101 1887 -1275 -6338 -921 -7258 -7846 -10691 -9460 -5680 -10261 -17482 -12128 -10183 -13050 -13486 -3740
15086 -3740 805 5253 5120 6497 3098 -5154 -12900 -14515 -15131 -15017 -12834 -7052 -7955 -11040 -7903 -14837
15070 -14837 -8194 -9577 -1876 -1705 -5280 -4658 -56 -724 -6790 -10285 -19075 -15995 -18046 -11884 424
15055 424 3778 3129 4720 -175 -663 6196 15037 10126 -2123 -9289 -8743 -12366 -10610 -10216 -7424 -3545
15039 -3545 -9610 -7801 -2087 -9673 -5316 -4570 -6554 -2339 3750 -1023 -7268 -3760 -1644 -721 -2103
15024 -2103 -1320 1527 5226 -2276 -11273 -9319 -20717 -19537 -10582 -3794 -530 -3661 -3808 -6150 -7998
15009 -7998 -8849 -2595 -4889 -12734 -18546 -18586 -21602 -12851 -3370 -6188 -12374 -19127 -18502 -13646 -14789 -18827
14993 -18827 -16289 -1843 -406 -4993 -13605 -13224 -12532 -16970 -14327 -8744 -10036 -13262 -16371 -10810 -1945
14978 -1945 -2269 -10798 -12514 -10744 -5789 -4394 -6920 -5092 716 -3556 -4822 -11536 -16867 -23068 -20117
14963 -20117 -20304 -21214 -14186 -5080 -4770 -7829 -16545 -15047 -7419 -1171 6394 3849 -4953 -7935 -10429
14948 -10429 -12633 -13922 -9198 -3534 3282 3756 -7821 -15783 -13335 1557 5916 4092 -1610 -11173
14934 -11173 -24837 -24598 -18885 -19692 -21449 -10081 1274 4780 -380 2000 506 -8205 -17822 -13533
14920 -13533 -16274 -16610 -187 3937 984 -3987 -11149 -18110 -14765 -4682 -13467 -9762 1068 -101
14906 -101 -4231 11488 13190 4670 7246 9137 -333 -12402 -6658 -315 3671 6004 2202 -4183
14892 -4183 -8607 -7219 -7473 -15081 -12438 -18596 -18768 -5858 -4135 -18208 -26780 -19330 -17727 -21387 -13009
14877 -13009 -8603 -10682 -3828 2236 2795 6593 -1617 3744 7109 5075 -811 -14256 -14943 -18198 -26256
14862 -26256 -25635 -21228 -24040 -21170 -14838 -11132 -6005 -8123 -9403 -9476 -19491 -19978 -14023 -9946 -5927
14847 -5927 -5282 -9765 -6837 -7244 -18165 -23972 -15713 -9586 -5719 -4382 -11907 -12580 -12253 -16377 -19023
14832 -19023 -24943 -24194 -13428 -8112 -6474 -9635 -13156 -14694 -12487 -9365 -8148 -10203 -15717 -15007 -19345
14817 -19345 -18389 -9985 -2905 -4088 -5141 -9275 -6295 -7369 -9004 -15356 -14014 -7967 -3824 -53 3717
14802 3717 8742 7304 7672 12347 6450 3272 11097 16025 13806 3875 2843 3786 983 -3916 -5992
14787 -5992 -8600 -2394 3078 -1588 -11579 -17811 -15427 -8517 -14585 -22900 -17867 -19399 -17877 -13617 -14734
14772 -14734 -12136 -6105 -11446 -5709 -6960 -5990 -15038 -17860 -11332 -14363 -6905 1720 792 -3937 -1925
14757 -1925 -4270 -11749 -12452 -2782 -4917 -6966 -7797 -2765 -3471 -10497 -18629 -13502 -11256 -3918 10400
14742 10400 15231 5206 5858 6809 -72 -4080 -21628 -34373 -29118 -29103 -21932 -19247 -17357 -19626 -19387
14727 -19387 -17278 -10781 -883 2008 -2179 -12617 -17305 -11269 2045 3272 747 -3909 3941 7494
14713 7494 4774 24 -5405 -8703 -6894 -8277 -4919 2910 7410 4091 -3987 -4617 2869 557 -2394
14698 -2394 1566 8686 2032 1740 -7368 -10650 -8690 -1750 4902 3715 8344 16328 20586 27078 24437
14683 24437 21817 13217 2102 1728 642 3445 6172 11064 8358 10535 15426 13172 9221 6821
14669 6821 4668 6617 6800 1571 16051 20685 15660 9207 1806 -7596 -13023 -12111 -11880 -16435 -15618
14654 -15618 -11829 -8711 -8231 -632 6984 5808 11143 10202 5429 10491 16477 20660 9409 1491 2766
14639 2766 5856 10649 26363 26479 13245 5789 3932 -2715 1547 11592 9844 14013 16957 10393
14625 10393 11316 14863 4941 4324 4504 -202 -2728 -7940 -8607 -4147 -4489 -4911 -6669 -9784 -6482 -6393
14609 -6393 -7787 -7508 -5030 -5108 -11217 -1173 9301 4558 4458 2469 -4451 -11332 -11086 -4787 -4289 -6037
14593 -6037 -5170 -4950 -3353 -6446 -592 765 -5369 -2175 196 -9858 -9971 -1316 5643 -472 -7321
14578 -7321 1609 -508 -7344 -3451 -99 -1744 -742 1661 17882 21327 12223 -1085 -8871 -3329
14564 -3329 -1714 -6844 -9071 -19509 -22172 -12838 -11699 -8928 -5547 -5512 794 272 -433 621 -1625
14549 -1625 -5119 -3079 -7444 -9699 -12789 -15323 -16488 -12292 -3929 -14184 -21969 -9859 -11934 -8952
14535 -8952 750 -1099 -2752 -5069 -10124 -13699 -11137 -2564 1345 2051 4409 684 -4655 -3733 -2399
14520 -2399 -3047 -9763 -7496 -3151 -6106 -11354 -5493 -4085 -2359 -1385 2691 5185 816 -8028 -11724
14505 -11724 -15521 -20978 -20197 -12193 -7711 -9384 -8771 -4446 -2522 -3731 -8919 -9124 -8506 -7304 -852
14490 -852 -4546 -8080 -5175 -8738 -14730 -14778 -12096 -5759 -597 8218 19333 10999 7890 7774 3436
14475 3436 8046 1490 9004 10680 3332 -1401 -7409 -10541 -11061 -22019 -23266 -20901 -18168 -16612 -5536
14460 -5536 -4137 -13101 -13228 -15042 -9007 -8086 -12609 -9596 -4415 -9529 -5759 -13640 -12501 -11809 -14660
14445 -14660 -13436 -16381 -17144 -18621 -12926 -11477 -15509 -19758 -21149 -18914 -5370 7028 3626 -9134
14431 -9134 -16315 -20056 -25662 -21681 -21626 -25348 -19040 -12862 -11531 -8814 -10640 -15718 -18561 -20912 -10232
14416 -10232 -11586 -9173 -8124 -10781 -16037 -6555 10950 11318 5616 -594 3753 3445 5474 7060 -3835
14401 -3835 -16482 -10156 -4151 -8050 -458 -1757 -3219 -786 3492 -348 -5938 -5876 -9268 -4849 -2918
14386 -2918 -4739 416 4370 -3714 -7893 -9660 -1140 710 1132 2832 5596 6750 6168 7163 311
14371 311 -9820 -7298 -5753 7370 10829 733 -4249 -2783 960 5366 2796 -6371 -4195 -1093
14357 -1093 -2874 -7340 -2267 -1956 7296 3356 -3662 1232 -742 3027 2458 -5038 -5153 6598 8540
14342 8540 5642 3499 -10136 -11442 -871 -4518 -10900 -6834 -1179 -4481 -12520 -12388 -9070 -3666
14328 -3666 1471 6523 3010 -6115 -13278 -13687 -20113 -22586 -15851 -19146 -19144 -21325 -8873 -9990 -17453
14313 -17453 -18086 -10409 -11249 -2771 4253 5277 6911 1113 -4292 -7030 -10942 -5641 -2600 5012 -2422
14298 -2422 -4349 7883 6943 -9515 -19861 -9761 -2921 1442 2547 5565 8343 -98 -7195 -16264
14284 -16264 -28274 -28260 -20465 -12143 -15114 -10865 -6859 3490 516 -13818 -16360 -15183 -18289 -20503
14270 -20503 -16567 -18137 -7148 -4446 -12143 -12534 -5483 1950 -5614 -10601 -13482 -11884 -2999 10918
14256 10918 11360 6558 6716 6351 5915 1319 -5523 -6927 -5243 -1423 1780 -3240 -12488 -15399 -11240
14241 -11240 -2193 -542 -733 -7977 -8041 -344 5634 16452 17687 6559 4758 4210 4620 -1217 -5191
14226 -5191 6753 19376 16333 1045 -3293 -3653 -4228 -2800 -162 1634 -1106 6428 7250 8925 6492
14211 6492 1418 1745 -1467 8271 1728 -10129 -23234 -29787 -29021 -31547 -28644 -20782 -16570 -7870 -9728
14196 -9728 -19717 -28720 -17345 -9360 -6737 -2425 -306 -8594 -16292 -21523 -28862 -17644 -16826 -14677
14182 -14677 -15924 -16530 -10787 -7274 388 2805 1072 2604 -14019 -16072 -18143 -11422 5087 2989
14168 2989 -6889 -7887 -3896 -3455 -11171 -16383 -14091 -12938 -6327 2339 -2156 -4955 -10341 -20420 -7408
14153 -7408 3865 -12683 -13955 -2202 -841 3194 6719 4862 6512 7704 7026 8909 11661 15059
14139 15059 6224 1061 5508 12545 6637 -930 5239 5047 5897 7150 14400 15324 4511 -6493 -10891
14124 -10891 -8350 2720 2782 2627 -4487 -8996 -13631 -14538 -10170 3074 9560 -254 -5464 -3404 -139
14109 -139 -4830 -7771 7245 17958 11573 11692 6079 2075 5811 11439 13578 21637 31594 30800 23517
14094 23517 14473 5372 -965 2865 8262 10429 6613 1104 3063 7352 5479 -1203 -7148 -1674
14080 -1674 4629 856 1533 -2202 2900 9026 16658 12567 -7805 -4369 -6785 -13094 -12844 -3689 -3451
14065 -3451 -9704 -24682 -24468 -21400 -15792 -11437 -2683 4643 6919 10224 7131 6988 -1462 -3319 -9495
14050 -9495 -13140 -3846 -2883 -3337 4796 4606 1976 1710 -2196 -10885 -7246 -71 -11659 -12519 -6707 2928
14034 2928 -1492 -9815 -16216 -11825 -12720 -11528 -3434 1009 397 -3881 -6471 -4924 4725 -1901 -222
14019 -222 2133 6410 44 -8601 -6430 568 1503 -5951 -1786 -5218 -11137 -17109 -11954 -6481 -4339
14004 -4339 -1689 -2140 493 4103 2208 -6505 -8979 -11266 -22491 -20129 -11740 -19133 -20570 -19522 -20477
13989 -20477 -16780 -18130 -13795 -12740 -15592 -20175 -13447 -14056 -8501 -659 8264 4414 6917 1545 -5194
13974 -5194 -6865 -7339 -3883 -986 -5569 -2292 -5920 -11325 -11213 -16406 -24353 -31359 -37144 -35949 -30783
13959 -30783 -20907 -22705 -20023 -15089 -21896 -23507 -19292 -16252 -9662 -670 6131 4290 2041 10611
13945 10611 5385 -2769 -2765 -6439 -9090 -431 -4147 -18150 -15869 -12181 -10243 -9489 -12889 -14291 -9148
13930 -9148 -5124 -7640 -6589 2226 686 3502 2180 9877 13084 6640 3592 -5602 -6375 -1591 -1857
13915 -1857 -4872 3570 2761 -9740 -6428 -9563 -14241 -14790 -21503 -21022 -16899 -4455 1540 210 -7243
13900 -7243 -11419 -12370 -11361 -22550 -33546 -32036 -21500 -14873 -16629 -8228 -9322 -5936 -6974 -14347
13886 -14347 -9183 -10482 -8644 -18296 -15645 -9887 -14961 -18305 -9533 -2780 -8943 -10153 -15787 -25893
13872 -25893 -35540 -35658 -25359 -11243 -1894 11766 18798 4379 -9955 -11493 -18797 -15580 -4134
13859 -4134 3682 4217 -373 -5892 -4513 -4050 -6307 -3306 4953 10930 6640 -3094 1870 2859 -8402
13844 -8402 -20439 -26213 -16589 -17142 -16122 -5213 -9532 -8535 -14928 -22018 -16905 -16781 -13915 -9984 -6925
13829 -6925 -10980 -14394 -13117 -9630 -5308 -8839 -9945 -11240 -9274 -10202 -11404 -14051 -13725 -8925 -13960
13814 -13960 -12411 -9043 -5195 -610 -3056 205 613 -4812 -4068 -6957 -5300 -2186 -1551 1919 5581
13799 5581 3914 2432 2499 -8813 -14761 -5877 -9494 -7703 -9102 -5021 3062 9715 2841 6893 7851
13784 7851 2880 -2648 -3772 -2229 585 -2392 -9814 -12579 -20817 -22945 -27292 -25632 -16226 -681
13770 -681 11958 15917 14073 7728 5807 4758 -6108 -12663 -2044 9274 7225 1139 -8590 -1742
13756 -1742 8785 12285 1746 -6672 -11493 -8686 -10809 -15042 -16829 -21574 -12010 -9196 -3159 -2695
13742 -2695 -1427 2694 12829 19703 3770 -7662 -6098 3021 4746 -2871 -5367 -7961 -3126 -5087
13728 -5087 -5595 -9561 -14334 -13196 -18899 -18182 -17578 -7385 -5292 3070 13738 8547 11826 13098 1806
13713 1806 -496 1141 -780 -6132 -9597 -18786 -22683 -12979 -4691 -6017 -12949 -6779 -816 5491 1236
13698 1236 -3346 -4906 -12713 -13725 -16846 -15264 -7046 5886 9718 9063 4904 5122 2157 -4251 -4769
13683 -4769 -9439 -13613 -7962 -8001 -9006 -7718 -7839 -11781 -10274 -8207 -10507 -15662 -13721 -10554 -11327 -14522
13667 -14522 -17215 -22144 -19708 -18623 -24354 -24411 -17113 -10517 -4274 -4978 -2708 -826 -7522 -12783 -16453
13652 -16453 -16609 -15508 -6844 -1649 -4943 -7249 -10344 -11179 -10388 -14611 -24036 -20386 -16364 -13116 -14508
13637 -14508 -12975 -14222 -6709 -7226 -3380 417 -5649 -14449 -16127 -14651 -10347 -12157 -15473 -12269 -12820
13622 -12820 -13850 -13013 -8706 -5207 -436 4537 -4243 -73 8711 12325 19142 13802 6764 -895 -2681
13607 -2681 -2888 -6739 -6823 6227 7899 793 -5072 1875 11135 19954 13923 17622 21243 16043 12873
13592 12873 15631 19641 17236 11592 4851 -274 -11112 -8497 -1083 2040 6602 -564 -236 2462
13578 2462 6894 8064 12153 11976 12569 15265 7102 4531 -5804 -13548 -12443 -9443 -5043 4781 -225
13563 -225 -14891 -18713 -23180 -10511 -1502 564 3240 6122 4862 -10092 -10638 2033 -188 -10928
13549 -10928 -11028 -242 -8834 -16711 -16187 -16832 -15141 -10233 -8644 -13200 -18471 -15615 -3808 -1908 -2247
13534 -2247 -18649 -19660 -8088 6505 -1640 -16105 -25251 -26327 -16324 -20519 -19576 -11693 -2367 7204
13520 7204 8394 -5530 -11000 -11446 -5430 3565 2284 -1111 3129 10129 14125 9952 -2503 -13939
13506 -13939 -10552 -10372 -13769 -11517 -10016 -6043 -2229 -11598 -16286 -21021 -13907 -17714 -17648 -10155 -5361
13491 -5361 -4609 -5548 -8250 -6157 -2104 8697 1386 -551 2910 4486 -2566 -15392 -19385 -21259 -20358
13476 -20358 -14628 -8304 -914 -5431 -5562 -18572 -21240 -9388 -3196 -14103 -13295 -9069 1938 4559
13462 4559 6636 9548 3014 11783 7701 -3460 -7014 700 16037 17105 18773 5610 -12044 -18912
13448 -18912 -18469 -11728 -5750 -1397 4602 3390 4135 3704 10847 4759 9977 16771 16367 14950 5108
13433 5108 -5201 -8079 -3833 504 3842 11500 13771 13311 11488 6566 7531 12501 16177 19782 19446
13418 19446 7601 5621 -1935 -10601 -11791 -18748 -23825 -20435 -7733 11255 22923 18409 13100
13405 13100 12658 11728 6397 3242 5851 8741 11489 10048 367 -945 142 -4157 -13325 -12598 -4216
13390 -4216 -6859 -11986 -18158 -13380 -13572 -6625 -6867 -6136 -3885 -2102 -5446 -159 12253 12727 -9
13375 -9 -10715 -2585 3444 3571 1489 -3109 -9583 -6108 -7491 -18997 -26888 -18570 -1577 -5436 -10648
13360 -10648 -6741 -7527 -4145 825 -10557 -9262 -1515 3762 14330 13812 12011 15358 12363 -2449
13346 -2449 -11477 -10188 -4992 1651 9624 5954 -1839 -6774 -7997 -9496 -5116 6299 24733 21691
13332 21691 19506 15812 6667 293 -9767 -15436 -6321 918 6801 63 -6342 -2072 12204 21640
13318 21640 14629 13799 11879 10534 7718 20 -4324 5836 17423 23891 32436 20863 9388 7634
13304 7634 8654 16508 8087 1071 -10511 -16189 -5298 3122 14837 14963 11488 11390 -755 -4627
13290 -4627 -244 3524 1703 -1370 -86 6864 4044 4578 3242 7475 14281 18465 24748 20876 13009
13275 13009 8216 458 -4684 -10027 -277 18104 20474 15506 -1211 -2337 -702 -2386 -6582 -7151
13261 -7151 -8900 -4041 -4500 -12516 -17809 -22072 -12805 193 5972 8530 19402 28003 30219 27008
13247 27008 12787 6611 6867 7254 21555 23841 8996 7998 3469 2271 -4490 6590 15076 25463
13233 25463 26750 29237 30037 25169 17042 4492 -2663 -3496 -6490 -7489 -321 6257 9455 13025 13020 -1448
13217 -1448 -2333 -3782 -10654 -10800 -9804 -5993 -1397 1361 12488 4873 1826 2221 -4883 2535 3802
13202 3802 1130 3533 2446 -2627 -595 2381 3456 6186 16722 19698 14782 14820 4237 8250 6321
13187 6321 -7671 4031 17397 23925 24049 29180 27688 22670 19399 17382 9340 7287 2585 -1550
13173 -1550 8093 12009 17189 19321 16459 16927 10807 4967 5276 9886 4234 14575 21913 11662 4106
13158 4106 17185 30986 27956 25538 24942 29800 30817 31245 33023 25982 18580 25162 24565 24822 22106
13143 22106 10919 16925 11811 2017 4725 14760 17674 9670 9674 14251 5980 10506 16198 17622 16578
13128 16578 17443 21367 18569 11612 11207 14781 17743 12016 18577 27000 30154 24576 22298 9365 4532
13113 4532 7467 19038 27945 25383 15199 12219 5142 -1723 -2384 9823 30155 25374 26083 31216
13099 31216 27405 21325 20025 19026 18676 28061 22362 15669 12482 13491 8363 8936 14964 14302 15212 19805
13083 19805 25962 28481 26752 12323 9029 12808 21336 15934 14114 19774 25872 21966 14895 2715
13069 2715 -5530 -1527 -3745 3556 9905 23333 26473 19009 16608 12719 14104 22440 23208 33358
13055 33358 33042 27580 24952 24905 24437 18340 19764 18557 22794 29037 30134 29568 24386 17374 13312 16224
13039 16224 14601 6117 3468 563 576 -378 2206 704 9587 21325 15932 14662 18683 25425 34380
13024 34380 26369 12362 11521 13121 7876 4310 9322 21317 24919 24702 20089 16156 18569 22919
13010 22919 25940 27020 38154 41472 35008 24436 19781 27309 21207 16631 19108 31462 42965
12997 42965 51782 52912 49604 47329 36750 22602 21780 27535 28824 30498 19767 22714 31581 28598
12983 28598 21851 19967 10733 11329 26297 39139 39354 27901 21748 5541 4185 15897 29696
12970 29696 28986 26078 31048 35534 38065 38422 37243 42062 34551 36572 47212 47039 46217 41291 45809
12955 45809 48706 43518 37350 26462 23743 33888 34614 33766 29615 40500 47058 47650 43014 45057
12941 45057 51302 42677 44314 54955 59821 51107 42856 50296 54357 67510 74794 73144 82294 85532
12927 85532 81951 77153 81198 78308 71008 65181 61674 55042 50113 61058 57506 53521 59827 66144
12913 66144 63578 63679 67805 65562 71936 89935 101869 117739 138743 142905 124019 97149 91790
12900 91790 101815 101969 88021 77209 79375 74633 70140 62416 66108 69780 68314 59684 57130 60550
12886 60550 59366 56025 52527 48835 41083 43383 48874 51140 50278 53505 50341 54037 46437 45407 59428
12871 59428 56294 52216 52681 62932 66375 65833 75408 82659 81168 78977 77428 74655 73132 63106
12857 63106 57122 52393 49950 46773 40799 50190 53252 46192 41915 40927 39546 39323 49557 51014 57911
12842 57911 64085 69893 72560 79503 86665 77341 75363 100586 124171 153300 183876 224345 283869
12829 283869 347534 425622 547596 703492 904338 1108562 1261370 1353205 1370088 1282690
12819 1282690 1123795 937799 768472 638746 535664 446921 382474 327337 285275 253148
12809 253148 230822 205237 174865 153655 152628 143739 124418 105826 99636 98608 96442 90975 89857
12796 89857 75062 70516 77365 77628 72136 60740 46629 36814 36278 33669 34326 40739 43877 46880
12782 46880 50107 37600 31991 31269 29812 38597 44109 55669 59342 63512 55301 45352 44254 50304
12768 50304 66105 81949 85359 85314 88797 88994 77914 72540 62486 48389 38196 30667 23378 16305
12754 16305 23823 26833 29903 45082 55800 52278 47636 46036 50517 44489 38192 39471 43163 40140
12740 40140 26750 25793 29360 31062 28677 34753 41868 35475 24583 24724 25134 41924 44747 41727
12726 41727 44396 38205 33689 28943 18541 8501 2246 -6841 -14665 -27923 -28044 -32229 -32549 -19248
12712 -19248 7129 31219 35259 42476 53915 54313 50217 39802 39004 34038 28310 25379 40531 59189
12698 59189 71567 78615 82514 73807 76052 71215 62481 54727 70967 79870 78695 76743 70990 73386
12684 73386 66343 51531 51902 66235 76230 85945 96746 91141 84325 75133 61423 61740 66003 49121
12670 49121 45834 46923 49314 46575 46025 51544 71485 80951 83565 87039 82906 88841 94156 95930
12656 95930 93753 97772 99861 93690 84409 87688 105299 129511 144645 157080 169447 185454 202611
12643 202611 211042 222767 229167 230485 220664 208192 204594 193966 186717 179749 174172 167964 153908
12630 153908 137498 130134 125330 121107 118367 119152 129815 131927 129128 118970 122406 127861 129627 134899
12616 134899 120282 121763 119858 113865 104455 98264 105525 103011 105409 110090 125036 129988 128753 122618
12602 122618 118638 112642 111945 109082 118502 124340 132902 135635 142802 148462 145972 151818 158687 166477
12588 166477 170268 171057 182550 192905 200902 213916 217516 238251 253477 270414 282277 281402 285270
12575 285270 289830 303875 331529 350189 378867 409728 426438 422186 389932 357517 311212 261969
12563 261969 231780 207732 198377 193834 191353 183569 172716 167415 169686 175526 181678 170351 157980
12550 157980 150818 152399 157252 159746 163323 171854 173522 164219 164221 163099 163132 169637 179161 180523 174701
12535 174701 171478 174071 168934 172417 175845 173861 178675 179188 176691 181832 189374 195534 212076 231529
12521 231529 255242 282204 306310 329817 352445 372643 379821 400484 426903 409615 359805 307488
12509 307488 269356 226515 189080 176779 181447 188693 194243 210804 238586 259310 281462 299573
12497 299573 315344 317503 323200 337831 352324 366088 380764 398069 395523 391769 395912 384537
12485 384537 367822 351822 351694 340728 332646 333688 327868 320691 324508 335905 344094 365972 384807
12472 384807 395082 401103 416003 428713 439355 451757 468722 481765 490107 509809 541051 574397
12460 574397 609679 631561 653307 674558 693475 711962 739035 760010 771459 771489 777663 789285
12448 789285 801791 814949 836397 860612 892634 914952 942841 982813 1040781 1122117 1226140
12437 1226140 1328308 1423572 1531573 1657909 1800303 1975639 2213236 2544113 3026142 3684557
12427 3684557 4389742 5005787 5424997 5567579 5411201 5021073 4577630 4191855 3925586
12418 3925586 3812441 3824133 3924599 4115478 4384678 4710373 5069370 5442469 5811837 6188242
12408 6188242 6591475 7058770 7636180 8357667 9266532 10414268 11861512 13723636 16128104
12399 16128104 19205511 23147170 28413542 35659533 45556348 58547572 74800359 95988054
12391 95988054 124665499 161544384 201417748 232912419 253090891 259089044 244162905
12384 244162905 215898721 182714283 149874500 122957714 102636444 87158464 74763771
12377 74763771 64453191 55684044 48031180 41356370 35621557 30712841 26505415 22911943
12369 22911943 19860785 17301282 15147483 13325105 11765861 10445352 9306630 8324094
12361 8324094 7458606 6692233 6008821 5404463 4871958 4394432 3975109 3598859 3261051
12352 3261051 2971673 2741006 2531200 2332109 2148560 1997432 1871054 1760963 1673351 1594886
12342 1594886 1521403 1446093 1367945 1291499 1228719 1153942 1082625 1020515 971498 933388 904920
12331 904920 890437 865645 834678 795234 759471 723956 683755 650870 617635 587746 557195
12320 557195 531825 502554 482832 471207 469157 471142 465947 458840 449447 439059 437492 437672 442205
12307 442205 433692 415837 402132 381370 358630 346115 342795 325879 317139 320621 323493 315126 307708
12294 307708 295196 293021 283480 271185 266841 263763 256712 257288 261336 255000 251137 250295 247719 256507
12280 256507 274757 276766 275239 276716 279535 272024 260585 264204 277961 277555 271777 268801 284493
12267 284493 314164 350009 381143 408475 429580 465226 480217 466891 434576 408078 387717
12256 387717 361416 333350 314861 299827 281588 271620 271515 285348 285859 272633 264633 260668 253488
12243 253488 245161 235692 226988 222934 217455 204079 193566 177090 163661 148107 130528 127009 125582
12230 125582 128931 135876 139368 140287 137225 134398 126493 111958 108605 109497 109381 111684 113425 108092 113292
12215 113292 124057 128286 135420 131654 118542 103648 96654 96367 106165 108367 99005 104678 106018 94972
12201 94972 99850 109384 104740 84645 75724 64150 56166 64827 71902 73235 83041 91858 97392 95229
12187 95229 93161 85161 83258 97779 103140 94123 94201 112028 119797 125886 134441 128788 119556 112258
12173 112258 109824 109064 101654 94089 82660 73408 74605 72031 64506 60040 46287 37065 36002 26170
12159 26170 20029 13293 16015 23459 28121 34432 42773 44416 37654 32537 39900 45789 30195 28605
12145 28605 32862 34644 26440 21645 28265 39451 38344 37475 44237 52243 52000 47398 44457 48431 45555
12130 45555 43153 46150 39793 31244 28015 24529 25325 32763 43624 61665 68272 56416 53216 65190
12116 65190 73396 74245 60138 45121 49792 55831 53322 47616 39391 34224 25057 16780 22368 22517
12102 22517 26967 25557 20966 20797 17716 9992 3995 8269 -4414 -6645 -6064 7873 14377 11704
12088 11704 7683 2794 3729 1033 -10368 -6848 3749 9651 27570 37713 33779 38256 46994 56511
12074 56511 52650 54179 60598 51405 46710 52560 55240 58647 65563 62092 68430 81483 99268 116750
12060 116750 136998 147616 143923 136005 123239 108602 92282 84706 77603 59972 48741 40429
12048 40429 38897 38925 42412 26939 12366 12677 17405 24930 30777 26918 13393 11648 4222 -1507
12034 -1507 -4433 -7283 -6569 -14019 -8698 -3569 -4464 229 3430 9349 6642 -7436 -21857 -26758 -25327
12019 -25327 -18896 -2247 17130 36180 39962 41255 44114 47714 38050 31698 33943 32323 27361 20216
12005 20216 16586 13507 9175 25300 35455 32385 36571 34019 42012 39562 28210 34738 43960 45906
11991 45906 40349 23459 18349 19030 16785 13603 26697 26617 17018 18918 25708 25014 24739 27491 32855
11976 32855 26763 20380 5267 1823 1036 6849 7447 11501 23930 27561 37769 51079 56520 55853
11962 55853 55778 63251 74217 88890 109445 127920 146069 168409 208245 258932 337929 429876
11950 429876 546957 701566 884952 1090472 1247339 1339372 1370754 1294610 1142616 964916
11940 964916 779361 650399 559847 485726 419554 356390 300765 255231 215052 183189 168576
11929 168576 148106 125578 108875 97906 91077 80828 73536 69176 54575 44332 47076 43544
11917 43544 37879 26541 17794 6233 -1190 1201 8212 9702 9607 15098 2232 -2644 -1067 5686
11903 5686 4085 2896 -11762 -23012 -24506 -21557 -21738 -18216 -26144 -11582 -5083 1701 8248 8815
11889 8815 -2690 -6363 -254 -8958 -4934 -8240 -16527 -15804 -9727 -1797 -3942 -5448 -8331 -654 2410
11874 2410 11992 11209 5427 -10286 -3221 17802 17977 9373 7357 -2323 3161 11314 12496 9006 1527
11859 1527 872 -1541 299 2268 2776 -1732 -2255 3523 2668 -13333 -16961 -11320 1159 3589 -3831
11844 -3831 -2237 3139 -729 -5588 -6935 3066 9925 16517 27201 19912 9019 78 -6429 -3663
11830 -3663 3353 -520 134 1185 1427 -2733 -17913 -16512 -11538 -15098 -16574 -12148 -13630 -20529 -12921
11815 -12921 -5968 -3952 -7539 -1461 -9675 -14779 -10922 -4571 -3377 -6834 -6081 -1359 2532 2470 53
11800 53 -5021 -6373 -12935 -13567 -8191 -1873 895 -13795 -18156 -18923 -21047 -15079 -10344 -15906 -24077
11785 -24077 -19466 -5669 -8079 -11459 -11202 -9199 -8304 -7499 -5162 -5048 -4058 3918 3306 -4721 -20725
11770 -20725 -19885 -10315 -6873 -10488 -6658 -2564 1939 878 3566 11920 2124 -4903 -10000 -14230 -14436
11755 -14436 -17966 -25078 -30318 -15555 -12468 -13996 -8231 -7945 -5435 -5282 -11288 -22272 -20047 -4091
11741 -4091 -6648 -15964 -18398 -19171 -12809 -71 8626 6843 13656 18820 26428 35500 30492 23253 8803
11726 8803 1537 -8147 -13301 -272 5571 6555 3266 13025 24849 32394 38188 35028 24388 19570
11712 19570 18300 16338 16386 10358 5254 -4399 -9323 -14651 -16349 -6326 -2726 -2751 4425 2098 -2070
11697 -2070 77 -1767 -3075 4767 13146 5581 83 -10338 -20498 -19007 -11387 -5634 -463 -367 -3519
11682 -3519 -4236 1827 4190 8291 3252 -2437 -4388 -6870 -9643 2920 9219 2728 2992 9360 4473
11667 4473 -2169 -8768 -7944 -3936 4017 7825 5419 1225 -9470 -19807 -13966 -13965 -19276 -15578 -7475
11652 -7475 -7239 -7778 -13683 -13084 -4598 -14602 -12051 -2498 -230 -6244 -8625 -11036 -13529 -2104 2687
11637 2687 -2015 618 7159 11570 21281 34269 40143 40098 37699 31350 19666 21198 13536 -8092
11623 -8092 3718 17160 19672 13717 7583 -2647 -8968 -6969 -19244 -19274 950 9949 9747 13137
11609 13137 8808 6370 3017 -2215 -9250 1416 2695 -5502 -6333 -3641 -3772 -3781 -3141 -4430 -4758 -7068
11593 -7068 -3672 -2159 7416 12164 16237 9590 3201 -5216 -12851 -6696 1400 2140 -1778 -5763 -1934
11578 -1934 -4718 1120 7166 6926 -5643 -12601 -11237 -3283 -3380 -8040 -4361 -7545 -18331 -13379 -4886
11563 -4886 776 -4535 -8261 -14595 -16823 -21194 -14757 -8950 -1351 1377 1667 10616 8415 5246 -2429
11548 -2429 -15704 -16967 -15932 -13020 -1815 2519 -438 -5609 -1248 -12191 -18379 -15122 -12975 -9346
11534 -9346 -7540 -14693 -15396 -7530 -13271 -16194 -8577 -1024 -5078 5993 4579 -2446 -5232 -4072 -10816
11519 -10816 -6190 1754 -6212 -10795 -3356 3893 8702 10951 5506 4355 12072 13266 17660 4776
11505 4776 418 -3991 -7134 -2623 3312 7889 12550 24117 17683 6578 5188 11256 3074 -11194
11491 -11194 -6472 -1413 -1461 -3313 -7716 -13021 -18135 -19089 -10786 -11950 -3821 -2013 -4951 -5746 -8567
11476 -8567 -18748 -17038 -19783 -16680 -12723 -8772 -7279 -9244 -3696 856 4348 5700 7090 -2588
11462 -2588 -15432 -13617 -5567 663 5499 9168 -2131 -9241 -4146 -5946 -11780 -1367 10379 2761
11448 2761 -1765 -13556 -19704 -19975 -7565 -7244 -8238 -3038 13740 26377 30377 23208 4011 1385
11434 1385 2091 -3029 -9473 -6448 -11007 -10379 -1615 3332 4840 12062 9872 6919 9859 14334 9052
11419 9052 8134 4196 2405 510 -3103 -7863 -7124 -14864 -18886 -20599 -25122 -20891 -10281 -3764 -2283
11404 -2283 -3107 -7047 -13107 -14928 -6354 -4760 -3074 -3303 -14199 -17724 -14812 -21822 -27284 -24814 -18405
11389 -18405 -17110 -14744 -20462 -38214 -40543 -31101 -25639 -11335 -4931 -7269 -11460 -13267 -7730 -8667
11375 -8667 -3995 10720 11805 6337 11741 11743 1894 -419 -2200 -8045 -6243 -16465 -18297 -5741 1983
11360 1983 7639 10479 8008 3665 -1438 5423 10733 3444 -10207 -14880 -20468 -23297 -20535 -17809
11346 -17809 -7402 -208 -41 -345 -4038 -5275 -4515 -1051 -5940 -8456 -2472 -5966 -6044 -736 -4897
11331 -4897 -9864 -8304 -3779 564 4120 10738 8799 9289 13495 17230 19711 17346 19115 13395 -1887
11316 -1887 -3722 5222 2622 3008 12436 16046 16988 17902 20232 17335 2673 5251 12406 9830 21759
11301 21759 27407 26375 33640 41715 32429 20713 9444 -4855 -2914 12533 11667 5179 1565 -5105
11287 -5105 -5956 -3488 -5256 -12442 -12101 -1856 -1333 -2050 -2356 -8275 -10808 -9607 -3229 1307 -5051 713
11271 713 -2707 -11204 -9473 -3672 235 232 13849 28269 28563 16897 10498 10865 12242 8761 5006
11256 5006 6631 616 -9285 -1800 1889 2119 -2528 -2932 -2299 545 5290 4478 7216 8012 3255 -263
11240 -263 6362 10510 10767 20457 17134 9417 7961 4160 3347 3868 7941 18444 14439 17705 28369
11225 28369 23069 12532 5213 2945 -5889 -5814 -2570 -4605 -4019 7937 11064 1025 3879 15320
11211 15320 15353 10817 9773 9955 -174 4803 7378 715 3589 8699 6222 2140 3371 6991 5935
11196 5935 7977 5144 4389 17140 22222 12618 8860 9527 8235 -1976 2775 5626 4009 12040 19884
11181 19884 15734 6898 -3339 -20733 -22182 -5301 -23 6933 14368 12464 11244 10326 6592 173
11167 173 5079 12359 3813 -1090 1587 3554 5041 8721 12389 14929 23649 28891 21500 25527 27807
11152 27807 20390 7343 11578 23051 17565 3068 1963 6963 7483 3501 10941 15419 16269 9383
11138 9383 12967 19170 19596 15754 25066 23416 20243 18980 14820 11240 7482 2619 948 5925 12444
11123 12444 7415 1395 7309 13515 17639 16358 13598 15413 18549 16629 12821 12890 16767 13300 17252
11108 17252 21958 17660 20987 21003 19464 12202 11162 3406 -6886 2132 16623 8295 -2033 -4141
11094 -4141 2995 11943 14377 17310 18535 21231 9466 8772 14974 9109 3861 6547 17678 24592
11080 24592 24091 19470 21551 18212 18908 25023 28054 21100 11086 12669 14312 20553 24915 18100 15877
11065 15877 19365 13741 12958 19826 26354 34787 37036 34790 32075 28506 24153 27647 27422 28132 22119
11050 22119 21286 23343 26029 20413 25387 19914 22968 22337 16507 27732 43404 39362 26916 22090
11036 22090 15777 10326 10125 9197 16923 16435 25386 28713 28696 36964 39967 35080 31963 34333 28621 21218
11020 21218 22851 21062 14203 14679 18320 26612 36885 38678 31698 34180 34281 26455 20075 15273 11895
11005 11895 13425 12863 3640 7690 15806 17974 13728 12745 9580 8428 6493 1979 5318 17362 26445
10990 26445 24605 21942 20443 23420 35344 41501 41792 40636 25353 18399 20410 25883 31215 29051
10976 29051 35337 43282 37328 36655 47711 50018 37648 29569 29850 22876 21579 19558 20731 24324
10962 24324 23862 29672 42162 41100 35304 36170 38065 35997 31415 27827 33741 29565 23393 20840 20810
10947 20810 31870 30624 25322 26120 21195 18377 19461 17787 18359 19627 24257 18158 17751 19168 20103
10932 20103 19823 24451 32294 29804 41239 44528 43189 47478 47565 35122 34081 38507 46092 38287 29773
10917 29773 16653 8493 25366 35983 37618 47438 45350 41918 44022 40811 43912 50065 49435 54786
10903 54786 55351 56635 56748 52727 62047 57243 52122 56963 60954 61764 64939 62546 60523 63702 63803
10888 63803 65710 65681 67847 67146 68084 68181 70913 76771 79961 78801 79774 83720 80991 84699 87077 86460
10872 86460 77279 85290 91514 90217 94031 89642 87556 84252 89612 91827 94902 99115 104459 101356
10858 101356 105393 109345 112354 126869 130193 134301 146890 153238 142289 139394 143037 152930 157644
10845 157644 167520 177227 181198 182599 176677 183412 191738 205302 219534 225482 236121 243024 245082
10832 245082 250493 262344 271659 271897 288562 305348 322216 338576 349722 367086 382169 409337
10820 409337 434796 458226 480007 495126 521059 551014 590406 622908 657480 696511 730040
10809 730040 775904 817600 864737 914374 968798 1036387 1098755 1164471 1219018 1287165 1355858
10798 1355858 1425410 1485528 1549007 1612200 1679639 1726466 1760354 1799763 1829665 1853247 1864055
10787 1864055 1867742 1861271 1846654 1820911 1787935 1750851 1713449 1660951 1601729 1541922 1477477 1414752
10775 1414752 1354304 1287192 1220132 1161400 1102140 1043608 982811 941419 895993 842358 792417
10764 792417 749537 713282 683281 648102 610616 585433 565570 536791 506610 482781 451079
10753 451079 430776 424163 404935 390621 382380 367193 339853 314070 300327 284865 268854 257131
10741 257131 257000 262547 254153 242702 240114 227035 211410 202843 205212 214597 209204 200389 191098 187233
10727 187233 183900 166572 166671 165589 153570 155837 149779 146321 139990 130405 130373 132987 135938 135166 123626
10712 123626 117522 120792 113454 105678 94422 80980 77096 78578 77350 76265 74418 74392 79399 78908
10698 78908 77479 80848 79362 76455 74840 66027 61280 58072 61683 56975 52897 66188 72875 85266
10684 85266 96395 75105 57773 53450 58933 60191 60786 47950 43004 43491 43104 44430 50481 48398
10670 48398 40955 44059 48545 50968 41975 38566 45829 49338 46628 48326 44540 40230 46670 50886
10656 50886 46461 40732 32789 42632 50574 40890 38562 33730 26322 36917 42731 39231 42343 48240
10642 48240 33982 33368 44472 50650 38582 36616 37377 38482 44856 43418 42657 49192 51717 46049
10628 46049 39496 37534 33471 32098 34200 36917 42870 38440 32622 30817 28669 26788 22230 17714
10614 17714 23508 34715 34577 32751 35624 35141 32999 23636 22908 28811 21277 15642 15061 21297 36320
10599 36320 37417 35031 28702 29284 39667 44536 43869 33637 33192 45866 44814 40024 38478 28397
10585 28397 28758 25818 25114 25298 17619 20020 20520 22452 17666 17828 21358 21655 7141 13936 17770 16352
10569 16352 27083 31148 26688 27255 39307 42586 41170 44967 47441 43556 39311 39954 36509 30562
10555 30562 30468 27934 31431 41123 34879 35594 34388 31666 33030 42430 50454 54836 46457 37342 32048
10540 32048 32900 29628 19113 20627 19939 29709 38747 43897 43164 39954 27798 32561 32896 26521 20715
10525 20715 21922 21562 21787 28263 32301 34045 33353 31417 32645 35654 35758 29566 23983 19460 26585
10510 26585 29530 33122 38836 38777 47927 48901 38925 23548 20884 18880 20360 29227 26771 20531 11213
10495 11213 4788 22670 29015 23193 19479 18499 24973 24937 31139 39707 36385 35708 33323 25461 15263
10480 15263 29572 34550 26398 21308 22592 20766 25052 21804 26007 27751 29360 31944 22916 25346
10466 25346 31126 35780 30858 28951 26823 21098 23337 16832 14562 10731 21168 27994 26674 29324
10452 29324 32289 33950 37277 32840 36492 31813 20707 16161 24089 32374 31534 33915 31060 22261
10438 22261 22938 37036 37547 35109 34093 35917 33199 31431 32571 28275 17704 13321 17236 24154
10424 24154 19120 16230 23985 26877 29839 32210 31638 34180 25637 16699 23192 32468 30999 33128 38720
10409 38720 43690 46073 36956 33506 29878 24465 20753 17065 14191 9440 5195 2332 13291 23696
10395 23696 24272 18231 15202 13538 13598 20033 24309 27603 27349 35191 29057 20593 22441 30820 24892
10380 24892 24367 32209 31656 38702 33785 31762 42254 40365 35161 27338 21208 20123 21259 21808 27340
10365 27340 20588 18004 19345 32922 37982 27044 17618 17819 24573 32805 32629 31642 25834 23166 15338
10350 15338 14182 23687 21799 25610 24987 23732 28769 43551 50690 51704 35954 26298 21886 27234
10336 27234 31741 38787 38236 37451 36971 33957 32226 38632 47473 47922 42835 44646 49640 57053 58396
10321 58396 53399 48996 47101 44265 48733 43969 40768 49901 52441 47703 38377 38958 42940 40448 43677
10306 43677 45946 38995 38424 39265 40902 39617 39579 29721 30983 33953 34927 31099 28779 22720 23767 33263
10290 33263 38641 36499 39026 32923 26419 29722 37993 44600 48865 55859 54547 44990 37193 29560
10276 29560 25640 33820 38559 41825 43384 39947 34850 31557 33207 33082 36335 40396 38563 39734 41621
10261 41621 38501 27017 28319 30053 31010 31934 24741 29705 41746 39176 49458 56451 58725 51695
10247 51695 48091 41164 34369 43162 51403 50366 47683 55913 61582 68650 83510 97586 100257 83096
10233 83096 66342 59822 51030 45838 49737 62044 67774 59556 56210 60345 58234 64300 61927 59132
10219 59132 48654 40312 42155 48572 50127 54624 52201 51825 50409 47721 52673 54265 49843 49796 53083
10204 53083 60234 59325 58595 63484 71492 74378 67757 64888 75857 71657 75569 79658 81561 74841 71528
10189 71528 72337 66564 72046 78936 81220 77769 66200 58317 60495 74446 77897 72168 70791 72485
10175 72485 74301 65391 55112 54745 56463 51931 58413 62128 50634 50038 52978 43459 44301 48160 43194
10160 43194 36188 29324 37237 50003 61172 65077 61651 65173 77134 79874 79837 72078 78086 85556
10146 85556 77152 72883 73502 62152 62871 64608 78254 91001 93428 93173 90585 99070 98511 98288 110546
10131 110546 122500 124974 130473 124419 111054 108575 97494 94679 89008 86678 86251 77943 73402 72257
10117 72257 66733 67833 72102 63752 60487 58599 66820 56200 47608 53562 62356 65499 76933 70070
10103 70070 71200 74525 68799 68763 66552 64122 71706 88755 85991 78534 78616 85071 90405 92484 84005
10088 84005 85340 85645 85540 80642 81260 77852 71080 62468 62788 62562 56759 53389 49787 43628 49463 58553
10072 58553 58139 52294 53994 57399 53577 59789 62488 56041 60327 63078 49312 47489 51992 51735 54221
10057 54221 52068 54793 59553 62710 56906 48737 47009 41512 38283 44171 49559 49049 42127 41002 42542
10042 42542 40613 41874 43679 44136 39901 42145 49975 50278 57132 67240 63475 62993 65817 65608 67584
10027 67584 73278 70328 61886 59876 56683 41881 44237 55536 54375 49230 49646 51465 61048 81860
10013 81860 109747 144659 185127 190046 178275 146470 116358 90722 85146 91003 87874 78535 72848
10000 72848 72809 60068 51778 58872 58805 49231 39862 42857 50707 50237 54197 53847 58644 51402 44389 49866
9984 49866 46056 37020 32421 31538 36054 42379 40289 42224 39830 28822 19109 25199 41441 47671
9970 47671 48048 40736 45347 62477 58352 49747 45881 41443 32768 38532 42280 49927 48926 52166 53988
9955 53988 51421 42303 49182 58578 63228 61735 48610 44953 46849 42240 41808 36856 33154 40341 48806
9940 48806 51816 42479 41917 44997 50945 60278 60231 56565 59133 51067 56311 60304 55660 49650 45313
9925 45313 53501 58666 48576 49208 56219 52358 47354 51462 57739 65540 70054 65359 57670 64928 68606
9910 68606 73248 74076 68267 59402 60954 66006 64672 62563 51759 43206 34615 37964 42836 40953 45015
9895 45015 50492 52777 53448 58399 59628 59300 58350 60988 68382 71879 68363 63574 64118 66342 64783 66933
9879 66933 76727 83020 73605 67721 68321 61596 57756 61511 66030 67998 73705 79046 85901 83819 73990
9864 73990 76427 76452 71170 66565 71374 74463 68732 62200 70240 78205 67647 58120 63973 70229 67573
9849 67573 71776 81275 75549 82685 91003 81949 68601 66555 70393 79480 84906 78846 73084 73796 86513
9834 86513 92477 93258 94535 99562 97593 96739 92959 92607 98976 100173 110936 111936 107665 104951 114547
9819 114547 119551 121290 124182 135530 146379 143489 134887 134661 138128 145630 146306 150865 155216 155193 147586
9804 147586 149074 149677 150647 158404 155165 152091 159925 161469 167396 175968 203199 231295 253332 297284
9790 297284 368475 451174 506738 521269 490425 432889 360128 294777 255701 222344 196185 179843
9778 179843 177913 179221 160661 153328 146724 144659 138007 127324 118586 120735 121946 112817 101069 93277
9764 93277 99033 101663 101698 99713 94806 95796 96746 91306 83453 94929 94225 92673 85046 83813 86637 92780
9748 92780 92189 93976 97607 92599 92953 99503 104019 96081 85683 86028 91167 95236 94361 95016 95968 93434
9732 93434 82686 79005 81892 85945 95404 90667 89050 87225 75660 72423 80357 90316 88539 88687
9718 88687 98095 102555 95540 88500 88545 91752 102463 105934 114659 108838 104714 97796 100357 100527 101227
9703 101227 88914 86404 92559 95093 98868 91852 97337 97947 99882 110521 115224 109735 105534 108080
9689 108080 112298 109061 101365 95393 96747 102993 103951 101715 105799 106430 106929 103694 105246 105536 93789
9674 93789 99781 109791 117190 122003 119861 107520 112861 105593 104605 99917 101431 103990 101826 101494 109646
9659 109646 108106 116126 121357 114210 117781 122111 135022 149306 147162 138891 134356 128597 123509 114800
9645 114800 109655 108117 114834 119284 120336 122168 126737 124746 117760 112791 113359 113521 116143 120856 133731
9630 133731 135759 127836 114941 117641 115725 129445 138677 128259 119385 128779 131058 135339 140114 146402
9616 146402 147687 138309 144452 148277 143379 146541 141918 149756 151140 148901 146517 145444 151941 157875
9602 157875 160076 162315 156838 153848 155192 145982 148966 157011 156641 144610 137593 133782 144683 149988
9588 149988 148606 148847 148320 138563 141412 136495 130512 127612 129447 134055 141344 137993 136845 141871 145631
9573 145631 156048 153595 148752 153448 155505 151445 149540 151956 156993 150421 151660 155730 156231 159555
9559 159555 152735 154040 167483 167567 171114 172566 163190 171538 168390 154918 159692 161945 166453 165318
9545 165318 163889 164946 160054 149214 150648 154117 155182 161544 173592 167738 149007 134000 132912
9532 132912 135986 134996 141204 139793 137210 143759 149625 157086 147171 140680 149936 156237 149263 151230 154423
9517 154423 160979 168559 167191 177737 179585 178899 171777 167392 169776 175885 185819 190916 184787 188921
9503 188921 194996 196043 200787 194704 200185 216162 228851 231371 247887 261439 268264 270393 273616
9490 273616 284691 287126 284157 282480 279849 270336 254553 244725 230632 222065 228804 226385 228576 223955
9476 223955 217628 205476 199151 194477 191928 194908 197471 204471 214725 218487 225849 239899 236541 244579
9462 244579 257006 254097 253576 265640 278500 298310 317347 333802 352748 372475 395388 410632
9450 410632 420812 427837 434922 444909 449908 450872 464996 467191 461622 462102 452101 436588 437536 442369
9436 442369 447323 447232 437004 431096 429591 422780 405307 399496 384784 371972 368300 375071 381382 384306
9422 384306 375321 376697 378069 381391 378987 380891 377415 382705 397018 396801 401263 428964 462766 479638
9408 479638 495454 503745 491604 487494 486467 494070 484463 496114 518862 559613 598468 627392 662543
9395 662543 692481 698321 699874 705301 709307 698223 679817 671522 657205 646808 637293 613343 584204
9382 584204 553013 517476 502620 495593 492791 496238 505312 521222 521601 516067 510566 499733 498513
9369 498513 489457 483068 483366 474986 466692 461711 467225 470375 485232 498346 500733 500763 498414 503957 506126
9354 506126 514511 515166 524110 546482 570222 589865 619893 652981 685789 694824 692667 689552 683704
9341 683704 676771 659111 632420 602326 574342 565709 559033 548808 553117 563217 579135 610653
9329 610653 619834 612866 609608 606951 582528 545340 523501 517848 506365 503333 502598 499426 501866 504411
9315 504411 515405 526462 535776 536562 528374 538100 547146 557954 572235 579902 579980 580519 591977 610839
9301 610839 620729 639719 660800 684494 713683 733375 744530 765316 784456 796624 806887 807120
9289 807120 799210 790308 786947 780144 773062 769448 763827 771736 780730 775492 784088 801360 822493 845604
9275 845604 868718 909054 943232 986054 1052543 1146742 1260900 1389345 1529362 1649697 1733954
9264 1733954 1799503 1878209 1980289 2114150 2251611 2357743 2382879 2337427 2266862 2205230 2168633
9253 2168633 2157932 2131123 2097392 2042540 1981183 1904891 1847774 1816334 1793122 1763480 1741020
9242 1741020 1724141 1717040 1722307 1718658 1724942 1728916 1748252 1773103 1798505 1842655 1919082 2013322
9230 2013322 2139649 2308183 2519091 2748248 3011539 3282960 3531090 3753432 3951046 4133979
9220 4133979 4317970 4533996 4782054 5017504 5169415 5218085 5164480 5055773 4959377 4936519
9210 4936519 4991375 5063894 5112410 5092138 5009141 4899191 4799164 4714593 4646420 4590020 4535699
9199 4535699 4488008 4469655 4460579 4445051 4377344 4272551 4139099 3992761 3879808 3814480 3804220
9188 3804220 3837323 3899298 3976977 4059550 4124839 4169180 4183728 4201786 4240492 4331213 4466823
9177 4466823 4642606 4822013 5002706 5221526 5501862 5863015 6263259 6608166 6843111 7013925
9167 7013925 7180598 7415291 7718379 8024961 8254013 8349894 8319334 8201283 8055320 7897534
9157 7897534 7698162 7452965 7183212 6906697 6632147 6384100 6182202 6026867 5892533 5779996
9147 5779996 5678846 5567169 5441259 5305023 5201663 5151850 5132254 5109215 5059172 4968764
9137 4968764 4869809 4792243 4769638 4785141 4776306 4726745 4644833 4559717 4479231 4459293 4514541 4653528
9125 4653528 4854651 5095846 5373045 5716030 6109823 6514546 6857008 7134101 7367322 7571619
9115 7571619 7801450 8065075 8327170 8543281 8728828 8938852 9247441 9745871 10553181 11732652
9105 11732652 13227224 14697487 15581784 15657809 15096243 14197734 13367414 12952421 13102808
9096 13102808 13779936 14771359 15645850 15958010 15464717 14243901 12633122 10975022 9514194
9087 9514194 8380373 7555395 6955575 6528701 6198865 5934814 5728530 5573038 5463618
9078 5463618 5407524 5424389 5517630 5699799 5983966 6381689 6903000 7541184 8277556 9120076
9068 9120076 10134266 11446960 13266035 15773469 19107000 23272643 28120006 33294021
9060 33294021 37940275 40877614 41600595 40682478 39066602 37578124 36557713 35891237 35208936
9051 35208936 34064505 32275421 30075229 27909209 26259152 25467431 25613936 26468163 27579426
9042 27579426 28555170 29170626 29299234 28836242 27633355 25821011 23767916 21881532 20565306
9033 20565306 20088459 20477262 21412838 22343950 22820663 22599619 21767619 20714211 19924465
9024 19924465 19818474 20659671 22405485 24595687 26500190 27868961 28826118 29646101 30688463
9015 30688463 32327476 34763424 37998897 41581173 44882251 47794958 50727725 54175601
9007 54175601 58069080 61509235 63754354 65003680 65896604 66841624 67550272 67287803 65612889
8998 65612889 62361898 58009694 53346865 48989804 45305954 42275267 39613811 37059683
8990 37059683 34552351 32260968 30501337 29616752 29750807 30674068 31690273 32187305 32163252
8981 32163252 31797718 31303323 30855987 30521085 30328774 30249346 29905454 29142638 28419180 28270937
8971 28270937 29212724 31246457 33495280 34755390 34488197 33015603 31183028 29972036
8963 29972036 30122036 32028978 35937841 41983815 50013583 59081639 67138135 72164068
8955 72164068 73309351 70760373 65854681 60089060 54240452 48625075 43388409 38621450
8947 38621450 34477682 31124374 28656647 27102973 26508788 27015129 28810267 31955122
8939 31955122 36121535 40301630 43198384 44041940 42615216 39038774 34242632 29260278
8931 29260278 24742018 21101329 18401257 16436269 14954719 13761563 12742594 11858724
8923 11858724 11107674 10503795 10073138 9789837 9657678 9671741 9852777 10273049 11011807 12179758
8913 12179758 13921718 16406463 19726250 23678714 27442517 29843269 30409694 29564270
8905 29564270 28146148 27139219 27235021 28474456 30177541 31217669 30804908 28940303 26068404
8896 26068404 22815268 19752236 17121309 14975348 13254611 11864431 10729818 9825007
8888 9825007 9100706 8516478 8027108 7595809 7216215 6884569 6585633 6323272 6081946 5904121
8878 5904121 5785678 5712119 5715003 5769354 5806683 5788796 5701630 5589406 5481560 5396166 5347433
8867 5347433 5345195 5372884 5392434 5402174 5389414 5359790 5322625 5288655 5284469 5345529 5454754 5616671
8855 5616671 5838606 6081101 6314850 6515545 6676782 6817229 6964620 7136715 7300794 7384801
8845 7384801 7351344 7198420 6965950 6709682 6467706 6253041 6071235 5921908 5810833 5735437
8835 5735437 5714345 5766240 5874894 6038719 6220272 6365624 6414697 6346904 6203728 6055124
8825 6055124 5963282 5938778 5953725 6007674 6079509 6180536 6339488 6568054 6851020 7169313
8815 7169313 7474059 7727420 7938442 8153745 8456975 8889684 9467249 10174128 10975242 11896132
8805 11896132 13000795 14396669 16182306 18420248 21010919 23468121 24945610 24869029
8797 24869029 23412308 21142890 18734965 16712233 15266201 14273970 13608867 13177009 12864120
8788 12864120 12643096 12493112 12388881 12303545 12242006 12212534 12212615 12232393 12267239 12347303 12484617
8777 12484617 12679414 12920211 13203835 13567758 14004917 14467307 14914485 15263207 15504359
8768 15504359 15722241 16062346 16660627 17679551 19232930 21408843 24317591 28038808 32647649
8759 32647649 38169843 44456471 51206614 57857048 63332669 66636608 67743206 66954064
8751 66954064 64093366 59385922 53781908 48040767 42899359 38863460 35823668 33418873
8743 33418873 31357903 29464140 27650769 25899124 24288456 22842472 21585391 20537378
8735 20537378 19726767 19155823 18822470 18721503 18869449 19275651 19862267 20564823 21392100
8726 21392100 22356070 23516687 24958953 26641468 28437569 30242412 32198673 34674577
8718 34674577 38004084 42352127 47669509 53834509 60752860 68249510 75958376 83130154
8710 83130154 88794595 92249523 93568255 93329018 92391904 91220330 89358484 86394176
8702 86394176 82295529 77029991 70884597 64360161 57942898 52013071 46781341 42345237
8694 42345237 38689066 35675666 33133090 30937442 29025747 27374793 26013590 24973651
8686 24973651 24280476 23915416 23852324 24072264 24580970 25270647 26076366 27066945 28349045
8677 28349045 29967049 31813590 33725929 35694536 37957296 40824615 44458739 48892296
8669 48892296 54020084 59605256 65245925 70528100 75006012 78327016 80751877 83000505
8661 83000505 85442632 87872327 89733285 90427091 89207250 85332370 78797115 70529700
8653 70529700 61823792 53855406 47335993 42329081 38478981 35369568 32651708 30148901
8645 30148901 27822738 25662178 23704164 21972595 20480376 19218638 18201423 17429454
8637 17429454 16927476 16671971 16627572 16775083 17109914 17564445 18063474 18567502 19100160 19784670
8627 19784670 20715086 21959910 23523196 25416082 27700919 30490281 33909183 37850558
8619 37850558 41987681 45993944 49539788 52413088 54527035 55630027 55348311 53228816
8611 53228816 49268503 44110658 38547250 33359037 29051290 25722111 23228788 21279598
8603 21279598 19597676 18023219 16503024 15069113 13755038 12580065 11547418 10636410
8595 10636410 9830412 9132003 8531763 8022496 7600094 7262420 7002571 6830666 6744610 6739282
8585 6739282 6802141 6908509 7048266 7222115 7415928 7637251 7939801 8377872 9028046 9971430
8575 9971430 11281222 12999770 15090130 17347552 19280595 20285885 20019710 18625553
8567 18625553 16552262 14344811 12408187 10883281 9765888 8948623 8313015 7782366 7286309
8558 7286309 6824164 6394700 5960512 5538403 5152488 4808391 4534709 4310548 4122999 3980755
8548 3980755 3879219 3803365 3761423 3759424 3803672 3890574 4014617 4209078 4476568 4825772 5260093
8537 5260093 5788501 6358731 6896905 7349242 7734638 8108966 8477091 8851773 9194193 9453656
8527 9453656 9579179 9580331 9511953 9388434 9192739 8897459 8518018 8078787 7627872 7213411
8517 7213411 6834416 6486434 6171423 5867395 5584525 5352206 5178361 5035868 4917652 4813299
8507 4813299 4727422 4644656 4591858 4577354 4626117 4732912 4861849 4985441 5087657 5178153 5279810
8496 5279810 5406281 5581158 5792112 6018528 6225535 6415744 6604389 6806544 7058763 7382764
8486 7382764 7741855 8092045 8403798 8643747 8826489 8954671 9081606 9212386 9331796 9434782
8476 9434782 9462493 9376255 9179890 8914602 8635780 8363763 8105230 7823480 7510545 7170048
8466 7170048 6827034 6497766 6188232 5923625 5705903 5524353 5369203 5195660 4964127 4670100
8456 4670100 4340754 4016136 3722101 3474766 3285858 3133794 3000003 2883805 2797629 2725400
8446 2725400 2685446 2682871 2722652 2796688 2904445 3066725 3308286 3625800 4002157 4409973
8436 4409973 4790219 5093805 5309074 5498223 5712401 5996734 6345843 6710553 7016461 7171860
8426 7171860 7113984 6894266 6589157 6276951 6029948 5843390 5662439 5434922 5139512 4803326
8416 4803326 4471394 4158715 3873188 3623980 3417837 3253131 3116616 3009443 2920041 2852544
8406 2852544 2810299 2764361 2727749 2714665 2719259 2740296 2789811 2853859 2935300 3028158 3120323 3241372
8394 3241372 3374099 3538830 3720247 3922698 4137765 4372703 4647627 4982579 5406783 5910337
8384 5910337 6461768 7026476 7574783 8120677 8708835 9381831 10202587 11225548 12540894
8375 12540894 14267121 16608921 19875877 24488674 31033517 40253141 52839741 68824481
8367 68824481 86783898 103849465 116819219 123074703 121176117 111721302 97451043 81689394
8359 81689394 67144608 55382360 46620751 40249500 35493518 31763175 28649224 25944020
8351 25944020 23600435 21585741 19882291 18482104 17409257 16637442 16132306 15851359 15767487
8342 15767487 15960526 16520817 17575648 19289063 21891877 25578891 30245990 35023211
8334 35023211 38695870 40636105 40943978 40177356 39016138 38194387 38270640 39471242 41622042
8325 41622042 44074011 46123838 47571931 48605313 49539723 50777763 52817480 56143280
8317 56143280 61236086 68293290 76638686 84665808 90908011 94827911 96312024 95254989
8309 95254989 92005873 87480675 82714332 78742029 76264994 75140840 74230894 72345262
8301 72345262 69068152 64527497 59180482 53574321 48158256 43145540 38662799 34852818
8293 34852818 31568483 28577626 25759105 23117429 20700508 18601739 16859563 15417292
8285 15417292 14232058 13260495 12466075 11821843 11302104 10919130 10665981 10536737 10524220
8276 10524220 10645598 10937817 11468329 12322337 13639215 15607477 18480724 22639051 28576873
8267 28576873 36757669 47213518 59039574 70478358 79775825 85814162 87789290 85093880
8259 85093880 78061043 68166174 57294843 47133791 38762806 32387709 27652673 24088237
8251 24088237 21269330 18919420 16873199 15083348 13507112 12107176 10853351 9720404
8243 9720404 8715641 7844441 7095998 6445537 5904862 5439611 5032725 4669678 4343455
8234 4343455 4033295 3751729 3516877 3330700 3176359 3057313 2972678 2908101 2857667 2806821
8224 2806821 2745963 2704128 2698723 2709105 2729700 2769618 2814004 2845834 2857133 2843494 2816605 2804098
8212 2804098 2825633 2894087 3053738 3321169 3744599 4351781 5152571 6097490 7041066 7810209
8202 7810209 8276224 8432553 8408556 8401468 8556091 8882216 9228309 9359165 9136529 8543429
8192 8543429 7676437 6696192 5802426 5063075 4496212 4080701 3777752 3549012 3361684 3214308
8182 3214308 3097997 2990443 2895101 2838223 2817414 2828878 2876688 2966109 3108676 3298910 3525718
8171 3525718 3781008 4005239 4167366 4261584 4344523 4496267 4742722 5081704 5457761 5747526
8161 5747526 5873963 5848209 5734137 5650692 5676502 5858698 6180199 6596063 7057554 7515702
8151 7515702 7889948 8161296 8323317 8393386 8432756 8526253 8697150 8927659 9151363 9309228
8141 9309228 9341424 9234757 8976087 8581362 8127871 7675638 7274903 6970160 6763760 6593135
8131 6593135 6362037 6017912 5591442 5133067 4724808 4400397 4147405 3935773 3735513 3542865
8121 3542865 3366000 3223914 3148448 3116271 3106486 3110424 3134597 3162279 3189699 3223087 3247438
8110 3247438 3257604 3248486 3268094 3361374 3532515 3813542 4247899 4819538 5509372 6235017
8100 6235017 6902215 7391295 7637724 7700103 7690936 7742979 7899362 8132905 8317690 8297939
8090 8297939 7990855 7428778 6713625 5992417 5360750 4875925 4525665 4274515 4095183 3965942
8080 3965942 3875609 3799406 3741526 3717786 3716186 3732743 3785745 3884905 4042940 4229505 4455558
8069 4455558 4708354 4958475 5168012 5324606 5466635 5622940 5822377 6084812 6408770 6794120
8059 6794120 7238496 7754996 8362428 9054462 9840550 10703986 11627215 12627515 13757810
8050 13757810 15081248 16723055 18870054 21746616 25635817 30951032 38341184 48715927
8042 48715927 63186895 82636527 106971058 134656015 163290264 189508042 208192992
8035 208192992 215420892 210880153 195692466 172901995 147513412 123408202 102878175
8028 102878175 86811259 74677321 65337198 57847130 51624093 46341009 41824123 37970690
8020 37970690 34673387 31838437 29417306 27382909 25717689 24421710 23459165 22834189
8012 22834189 22540352 22570819 22909783 23503574 24276907 25202958 26320896 27673788 29348602
8003 29348602 31530036 34440180 38422272 43962715 51788398 62948378 78961205 102063522
7995 102063522 135249519 181172022 239111744 302972984 361078330 397556698 404730900
7988 404730900 383113085 339416695 286585579 235555872 192861255 160515355 136923902
7981 136923902 119236400 105076233 93132884 82805919 73856228 66141085 59478276
7974 59478276 53676396 48559643 44024616 40027152 36550780 33560603 31028848 28898297
7966 28898297 27130504 25676948 24516139 23630943 22993404 22584088 22403059 22477381 22835611
7957 22835611 23550535 24769509 26700845 29640029 34021036 40461987 49716201 62498460
7949 62498460 78913980 97930951 117889681 136970999 151978703 158986837 157471919
7942 157471919 149702619 137065137 121025560 103971823 87612766 73118598 61409816
7935 61409816 52434798 45509127 40028763 35546255 31723702 28368023 25412846 22845945
7927 22845945 20619891 18652403 16871725 15234624 13742915 12410061 11251312 10253381
7919 10253381 9388085 8630589 7960222 7375309 6842255 6375921 5974544 5639514 5344533
7910 5344533 5085760 4862975 4671211 4485786 4312854 4180340 4095016 4049769 4063026 4134338
7900 4134338 4204096 4223183 4144536 3964513 3716604 3453340 3203538 3000977 2833526 2700291
7890 2700291 2589122 2496739 2410587 2334445 2270843 2213727 2153488 2105880 2085595 2068993 2042477
7879 2042477 2015337 1973341 1927595 1880817 1825332 1774540 1738142 1725623 1729088 1762693 1819498 1876342
7867 1876342 1933313 1973500 1999896 2014413 2015196 2004468 2000859 2022613 2062616 2122627 2183632 2211240
7855 2211240 2213723 2198056 2177180 2189928 2223253 2279296 2324340 2329089 2277466 2181736 2059961 1930611
7843 1930611 1828273 1757094 1715402 1670561 1621039 1563202 1496101 1428087 1350341 1268235 1188565
7832 1188565 1125074 1065005 1014766 966050 923673 886001 861667 851762 842240 826159 817720 814003
7820 814003 814246 810016 800105 783709 763199 737464 703953 676729 645126 609175 592751 591877 594168
7807 594168 604920 628295 665674 723404 798291 891998 1011768 1163929 1316739 1437290 1481778
7796 1481778 1437233 1323949 1179574 1027325 905688 802811 716921 653820 606378 574190
7786 574190 539232 513567 487240 467872 436608 411866 400322 388116 376144 357825 340601 336165
7774 336165 337202 331994 309910 304059 303317 299296 294953 292113 292238 283228 265240 252161 250377 246467
7760 246467 244047 253190 252207 255647 276263 271024 269423 265524 268922 279557 292929 306630 317345
7747 317345 329076 331019 321476 317175 320996 324279 321593 322134 318938 317329 310505 296387 286841 274933
7733 274933 264732 256371 241666 235379 230826 234849 236773 249654 256106 265424 271322 282773 279269
7720 279269 276609 270187 267800 264512 264912 265610 258070 262512 275220 291295 314731 335214 347542 348464
7706 348464 345552 338795 321446 299163 283445 272084 266880 263333 262406 268046 270529 280137 296700
7693 296700 296523 292696 296002 291083 291114 283007 273599 259971 247482 249046 241096 236228 228590 220257 224361
7678 224361 227959 228015 229894 232557 235629 239076 230212 221332 218786 219314 216602 226975 243600 274145
7664 274145 312126 354569 394008 406387 386554 356359 333406 302857 277162 258331 244434 249991
7652 249991 265127 276972 290510 316833 342365 374317 418750 476895 560155 683280 842544
7641 842544 1015148 1176388 1301190 1353997 1313135 1205818 1045733 871267 727441 611247
7631 611247 536562 475676 438658 401047 369108 342609 313258 291783 273352 266959 263491 269187
7619 269187 290795 297912 300714 302531 289346 286128 276211 274957 261219 245770 240890 235140 245364
7606 245364 269796 301559 326850 359624 397967 444224 509115 606418 754074 975209 1270714
7595 1270714 1638124 2017041 2295855 2377390 2262750 2017074 1695093 1379159 1133160 951522
7585 951522 811459 710697 642679 578705 517935 461664 415377 379310 352030 332092 302786
7574 302786 282462 266642 250103 235470 227271 222258 216573 209008 197627 188379 190289 187687 190644
7561 190644 190889 196299 202994 216765 239667 260438 284376 314194 367646 451900 569534 700376
7549 700376 845526 968986 1032249 1032348 971992 854202 714466 590076 495335 424901 366370
7538 366370 323789 287793 258390 240148 222116 205692 191898 174429 163065 159872 156914 155224
7526 155224 145665 129857 117509 104705 99191 102180 100077 86907 80677 71072 62121 62382 45508
7513 45508 41198 33380 26784 34261 38603 41165 36710 32730 30942 27602 32989 32744 36394 34045 34030
7498 34030 42780 43077 41775 50815 46209 40054 37015 32633 22982 26838 35748 42462 51521 61294 62312
7483 62312 55580 49260 50580 60287 53649 48687 38956 25482 20396 17574 27183 34637 37466 37706 37780
7468 37780 36294 33301 30316 30505 21062 21424 27888 28309 24814 30003 37471 33841 29827 32658 34038
7453 34038 28647 18042 10459 8889 8379 14955 14783 9462 11361 18015 23882 23432 25769 29067 26697
7438 26697 21109 12687 10749 10843 9464 7986 19989 21161 16664 17705 20151 21929 17373 14318 22262
7423 22262 21630 19817 19465 22909 21485 19489 28030 39174 42403 34952 24319 22206 24926 23009 27432
7408 27432 27307 31974 24493 22445 24792 26436 19316 12608 24604 26242 25634 24299 26994 20591 15833
7393 15833 18833 23637 23605 27600 37066 31689 28395 29485 21021 24333 25746 18259 9753 2595 4166
7378 4166 2309 -2609 3015 -747 -1118 591 8123 21389 17645 14940 20395 36373 39296 29825 27972
7363 27972 20601 19772 23223 24681 15560 21870 36538 34973 31872 31988 36502 38033 36680 24502 7349
7348 7349 11176 17166 20150 19474 16937 20855 23979 22516 21476 15165 15888 31785 45500 36986 23361
7333 23361 11733 7260 -2202 -1814 6826 11292 21906 22765 30286 34807 42965 42356 46695 57596 60199
7318 60199 59455 55375 44480 35752 42671 46531 45588 43596 30465 27428 32701 24248 19447 31483
7304 31483 43161 41392 36774 37699 45521 47239 47872 51006 44184 29601 20999 21741 27738 26040 19973
7289 19973 17252 13651 15315 18008 32823 47621 60999 60410 51661 50532 48794 45480 50211 43283
7275 43283 46842 54141 62269 63572 67515 64891 66531 65393 65802 56448 43867 45112 49946 48958 40961
7260 40961 37178 25934 31110 26121 21529 17264 19090 16522 15092 13772 8406 3246 5460 433
7246 433 -181 5493 14127 14305 14034 18985 23038 19819 18033 16019 9300 15010 23921 12132 5662 18340
7230 18340 28606 33665 40859 39700 29189 24344 29115 30435 27072 32155 27979 27596 31743 31207 26910
7215 26910 21511 20258 20649 17863 22783 16891 13040 14106 16585 10540 11583 18078 11860 5801 8450
7200 8450 11831 18768 8128 -2274 -1355 385 278 387 -1976 -5410 3377 8857 8718 10358 6116
7185 6116 6364 14917 20765 16859 10242 4737 5974 -688 -8204 -1507 -2291 -9006 -9564 -9642 -11198 -13170
7169 -13170 -11749 -8353 -10043 -11495 550 -5658 -3794 6346 4763 183 -1498 11459 18245 18042
7155 18042 12882 14353 22224 28031 17878 12924 8694 5434 2445 -3625 -4819 -4760 -1669 5026 10163
7140 10163 12387 10166 8860 11242 11081 10228 5638 2531 4274 3690 -546 -11777 -19987 -12600 884
7125 884 9319 7690 -951 489 -4733 -16819 -17986 -13334 -10681 4217 8991 750 4981 6278 249
7110 249 4833 3445 -8508 -11869 -7000 -6626 -5502 1979 7348 5407 6581 4258 846 5416 4919
7095 4919 611 4493 10993 18019 15634 8123 4526 5375 2877 4009 -12883 -11247 2048 -1670 -8118
7080 -8118 -8957 -7522 -12244 -19895 -4218 6432 12412 15049 21162 26551 24789 21211 17272 24075 20032
7065 20032 17408 8463 4398 14315 22712 25182 25557 20605 18110 10638 5673 3679 3663 1603 -2908
7050 -2908 -9863 -9515 -4120 13483 14270 5227 -889 -290 7433 10243 11816 -1243 -3225 1152 -5119
7035 -5119 -16687 -11873 -4514 -4924 -12297 -14446 -1760 13262 8118 3784 -941 4309 9878 5379
7021 5379 -9483 -16783 -18581 -20501 -19460 -14822 -13192 -9824 -3021 -2373 4046 8170 14037 8462 -1097
7006 -1097 -7316 -13421 -22659 -21004 -19969 -11311 -3266 3481 7204 2856 1361 18213 19558 2672
6992 2672 -13185 -12791 -4708 -11159 -1728 6524 9284 11310 3179 -604 3341 14618 22506 19795 15995
6977 15995 13256 7305 4845 4129 2526 6741 4228 -5183 -5689 -9215 -16917 -15463 -1823 4062 2564
6962 2564 -7515 -7403 -1230 -2116 -7201 -5557 -5600 -6226 -8709 -15143 -14860 -7882 -19570 -21572 -20336 -12211
6946 -12211 -9850 -6675 -2941 4928 -792 -11277 -11674 -1590 6815 -1223 -1760 -7386 -19477 -13810
6932 -13810 -5445 -3500 -7569 -12582 -17735 -16191 -11081 -4805 -11296 -20292 -24000 -19296 -4192 -7766
6918 -7766 -11279 -15232 -6889 5087 3898 -2194 -2291 -3315 5031 1160 570 -6309 -15972 -16002 -22002 -22984
6902 -22984 -31474 -26026 -23961 -24557 -23446 -18277 -7914 -3265 160 -5570 -15829 -16300 -8643 -10820 -7845
6887 -7845 -332 -4714 -10527 -14941 -7266 -4190 -10819 -12516 -10544 -2332 945 298 -1910 -1700 1929
6872 1929 2158 -5325 -8293 -7552 -2726 -1336 -5567 -7168 -8000 -16238 -7327 1064 -2775 -1107 5124 6637
6856 6637 -694 -12401 -15615 -17813 -9847 -6169 -9791 -7796 -3937 -61 -6063 3786 2992 8265 2
6841 2 -2999 -3570 -13000 -600 -727 -2001 -1474 3742 6686 3301 347 -408 -2058 -4636 -7845 -6542
6825 -6542 2680 4057 1667 2298 -2210 3598 6743 138 2396 9375 14291 12969 4273 9004 2219
6810 2219 994 1142 4177 10018 11278 5584 7110 12637 11313 12307 5338 1318 4986 8086 727
6795 727 -6039 -12046 -242 2372 -103 -5163 -1690 -4618 -1701 19853 24203 16387 15299 12956 6962
6780 6962 854 -6572 -8498 -5330 4975 9901 12354 15520 15184 11865 17354 11940 -1911 -4758 -901
6765 -901 749 -6307 -905 9633 11660 1233 -2571 -5165 216 5907 4103 -3352 -7815 -15912 -12562
6750 -12562 -5603 -9419 -20389 -16016 -15188 -13913 -2954 11850 10455 1093 -2183 2491 3496 13605
6736 13605 13553 3786 336 807 3088 -8354 -10819 -14213 -11762 -8006 -12820 -14836 -8243 155 -3627
6721 -3627 -10544 -4331 2842 4353 12149 16460 8974 11883 20834 10583 2386 -5163 -7347 -2802 4632
6706 4632 8866 20118 29014 27577 26127 26308 17178 13141 19248 35540 45522 51959 64443 68325
6692 68325 79311 73292 53062 45365 34839 23839 16036 11339 6746 9412 3013 8755 4920 -64
6678 -64 4096 3897 7479 12823 7972 7479 13880 14540 17407 17527 17141 11936 6763 8411 6948 -8953
6662 -8953 -13438 -6993 -8416 -9812 -6406 -4433 2817 1084 -6569 -9153 -10237 -11170 -13030 -15665 -19304
6647 -19304 -16268 -4643 3174 -1126 -2552 -6447 -3293 -1320 883 -14321 -29666 -30963 -14065 -8430
6633 -8430 -5933 -1554 -1003 -1404 -6910 -1564 11696 14533 13876 8925 2756 394 -7318 -11449 -8635
6618 -8635 1856 -892 -2808 641 -1301 484 8334 4706 4031 7686 10661 10727 6289 11040 9047
6603 9047 14065 11622 1741 -2615 -6388 185 7175 10174 9468 10815 13451 18439 22923 3207 -3540
6588 -3540 6113 7587 22257 35420 29159 23506 11273 5782 12414 17564 14996 13718 2853 -3441
6574 -3441 -6026 -2196 -366 408 816 -2586 11667 21452 20884 11729 -3564 -2165 -1312 -4149 7136
6559 7136 15173 13876 3595 1381 5221 8221 10395 11102 13376 12994 2757 3173 3164 2104 -2123 -2097
6543 -2097 4556 3564 7768 18784 26715 21107 24655 35695 39563 43758 56378 53194 37668 25045
6529 25045 14245 16534 20540 23645 20756 19426 20904 20052 18773 14797 19659 17840 12983 11820 9502
6514 9502 2112 3308 11223 16030 8886 10377 18937 10267 3350 8267 6910 9420 2494 8456 7392
6499 7392 -607 1331 1425 14389 10827 2529 690 397 1662 8972 18363 17063 11503 8687 15087
6484 15087 17034 8879 10543 14668 8605 6602 7749 9478 7319 8882 11427 8146 8039 13820 12755
6469 12755 -591 -6038 -10375 -4155 -4635 1485 2468 8645 9658 5486 9942 13908 18592 22930 8888
6454 8888 7411 11625 12786 14185 8460 5997 14604 8494 -2778 -4191 4547 7422 9172 2336 1152
6439 1152 7961 6485 7243 2301 7969 13330 19246 10748 5213 3228 5930 -553 -6033 -3606 92
6424 92 9199 14718 9451 -8848 -23446 -22055 -11289 -12438 -16839 -14664 -13405 -25094 -16350 -8532
6410 -8532 -4408 -1735 6056 8072 9595 12605 10885 11606 10934 10653 7148 14536 9819 15378 18812 12404
6394 12404 6075 1112 -2650 -8175 -12996 -12422 -505 4613 10033 9066 3091 3351 7911 6432 14955
6379 14955 17015 10702 9534 13178 18076 19824 9137 13 609 7504 10314 8656 -749 -7727 -3376
6364 -3376 9099 17832 12916 -743 100 2338 -932 -2728 4958 -607 -7398 -5263 -3161 -5725 -23717
6349 -23717 -12587 -4351 -682 5809 9442 -277 -13849 -20229 -21781 -8737 1350 6510 15583 9699
6335 9699 -2006 -15087 -13308 -10747 -485 7822 10151 9512 1097 -729 -7174 -7198 -5885 -2916 -5959
6320 -5959 -3769 -1030 -8080 -2357 7064 9761 27367 31412 4255 -1103 -5062 -1667 -8343 -5361
6306 -5361 -3077 -6359 -2665 498 813 -6702 -5782 -9117 -3470 6218 4728 -2607 -8987 -1641 5983
6291 5983 6519 2515 1598 -784 -781 5195 8447 9779 8032 2700 2021 6977 10897 13882 24730 18502
6275 18502 8887 1863 5524 1246 -4375 -2751 -16145 -18731 -21599 -15121 -3548 2198 2793 15773
6261 15773 14677 12683 9024 980 3578 5419 1800 1316 1491 5765 8243 8961 -3598 -1981 5882
6246 5882 11438 16909 11939 2773 4051 12819 15136 5576 7539 6208 7834 15164 6686 1672 5119
6231 5119 5371 9215 12228 12152 13497 16303 12550 1205 -10747 -9056 3586 -5470 -17807 -13610 -9085
6216 -9085 -1885 -13769 -11006 -3271 -5260 -7352 -5631 -6673 -11688 -10310 -3892 1373 5377 6975 3837
6201 3837 2903 -1368 -5161 -12003 -18220 -26154 -21451 -14086 -16905 -24264 -16265 -13567 -12958 -17208 -14048
6186 -14048 -9147 -15203 -13566 -4229 -4696 -11121 -19882 -15669 -8204 3059 1737 -3358 2913 5468 4372
6171 4372 12317 8454 -6608 -7723 -9093 -3707 -5057 -4839 -801 -1013 539 6620 4242 6698 5365
6156 5365 10606 12038 8443 4452 4197 10375 4028 4526 9265 5546 2827 969 -220 8878 8344 -1309
6140 -1309 -1517 -5938 -3674 -4411 -13820 -9029 -7314 -6359 -596 1266 1704 -2201 -1453 -2867 -8301 -8274 -973
6123 -973 6491 -4874 -6252 -12491 -17740 -16020 -18358 -24587 -16454 -10855 -8828 -4569 -4944 -4383 1817
6108 1817 1255 1372 -2721 -6306 -7193 1923 4841 -5476 -11421 -15579 -17078 -10795 -2477 -602 -4675
6093 -4675 -12391 -28950 -23651 -17781 -16054 -8666 2936 -666 -2021 -6270 -5660 1594 6771 -407 -6104
6078 -6104 -6628 -5145 3807 -2887 -11232 -13537 -4931 12027 22191 22638 11288 2069 -6046 -12734 -18622
6063 -18622 -16313 -11843 3091 -70 -5493 -7120 -6885 -7531 -13417 -7113 -3882 -8167 -8279 -6513 -12171
6048 -12171 -19004 -7098 -3441 -10268 -22455 -28916 -24766 -19648 -23131 -20735 -9283 -12102 -16800 -7803
6034 -7803 -4562 7264 8609 -6925 -10633 -3892 408 -5066 -5613 -7165 -9839 -10855 -7207 -4069 1627
6019 1627 3726 -6298 -3376 2226 10301 16276 5269 -4600 -8601 -3148 -381 -2035 -4619 2247
6005 2247 -1646 985 1953 -1667 -5792 -10226 -2147 6302 1189 -9302 -14771 -11638 -5037 -562 -2472
5990 -2472 -5249 -1733 1216 2548 914 9143 5210 5664 -9858 -15307 -11032 -15225 -15062 -11571 -12804
5975 -12804 -11106 -3275 -2557 -956 2191 10826 2635 -4075 -5281 -3079 610 8771 12260 -8064 -9136
5960 -9136 -4606 -6633 -7412 -4401 -9288 -8800 -7256 -9842 -9073 -7188 -6630 -7074 -9370 -18668 -15409 -13072
5944 -13072 -16656 -15321 -16728 -13433 -15670 -9079 -1466 -5370 -1887 3188 -2198 -6952 -1785 -206 -212
5929 -212 511 6626 13559 13302 9089 2469 7829 10999 10999 10655 6217 7145 11098 5144 -2443 3785 915
5912 915 -6638 -4786 2050 4767 8709 13109 13581 8932 10407 11049 378 -6403 -8569 -3146 10161
5897 10161 8040 -8587 -15991 -9878 -9576 -9967 -604 9505 18963 19968 10853 6259 -900 2096 7291
5882 7291 1852 -10110 -6198 -10848 -3793 8417 6126 6433 -5545 -9678 -10578 7153 12925 15804
5868 15804 11526 1101 199 2401 2146 288 -3993 -3863 -815 3209 5427 -1894 -937 107 2532
5853 2532 849 5866 4991 3970 1486 1013 -6781 -16734 -11266 -10536 -5006 -6428 -2039 4344 11137 3943
5837 3943 -1944 -1257 1695 -134 -2340 650 -8791 -22369 -17962 -9525 -13645 -21948 -25942 -23569 -15002
5822 -15002 -10454 -11504 -13999 -5617 -1836 1805 7544 5664 4209 -11274 -7846 797 -4603 -7556
5808 -7556 -2855 -12284 -5347 -1700 -10778 -15876 -13602 -14104 -15651 -12535 -9298 -13780 -12482 -14730 -9619
5793 -9619 -2123 -2883 -8155 -8604 -1268 6924 12554 13074 14128 18636 18530 16770 8919 -2320 -4446 2054
5777 2054 7381 7225 -3630 -10413 -5627 -10778 -15834 -12585 -6000 -2888 -3134 -1896 -13024 -15381 -5610
5762 -5610 -11876 -19275 -9229 -2149 -10471 -12058 -10862 -12507 -17491 -29489 -30258 -26837 -13535 -2603
5748 -2603 1566 4914 8299 7526 -839 -1646 5401 4804 6283 5876 7867 -916 -14210 -15199 -14501 -15573
5732 -15573 -5042 -106 185 -1910 -1881 4772 4900 326 -1779 4885 5847 11241 11402 5878 6899 3196
5716 3196 -229 -6674 -2418 2818 4344 -2135 -9398 -12078 -13483 -18362 -8342 -6448 -15569 -22401 -26742
5701 -26742 -28772 -24112 -14571 -8265 -2374 10481 3509 1692 -5894 -6401 -3294 2576 6895 5482 2940
5686 2940 -2417 -14258 -10319 -2308 -8602 -6249 -5808 -7470 -4099 -7391 -11843 -13628 -9105 -4647 -5728
5671 -5728 -6350 -1446 1725 2528 -4655 -15708 -4799 -120 -6129 -2415 -81 -6969 -15071 -16638 -12832
5656 -12832 472 13482 5947 -2157 -3598 -2822 -3537 -2450 -3369 -12509 -15359 -15138 -11218 -16136 -17522
5641 -17522 -12467 -11045 -10555 -8584 -4194 7173 -1660 -14323 -17256 -8364 -9025 -9084 -12085 -13107 -8683
5626 -8683 -2921 -5692 -14764 -9853 -3073 -664 -4936 -6785 -10412 -7130 -9530 -9786 -8297 7821 9952
5611 9952 1558 -3778 -2444 -372 5133 -2067 1496 -4718 -15866 -17250 -11228 -14720 -20424 -17513 -20758
5596 -20758 -19976 -14091 -6551 -7492 -9837 -9296 -5566 -5831 -10332 -8849 -10665 -6941 997 3780 4029 8499
5580 8499 14174 14904 18692 7512 -3902 -11313 -10111 -5387 -4716 924 6416 13390 10159 6960 985
5565 985 -5587 -4268 -7177 -6276 -637 -1058 2211 -362 -1584 -839 -10557 -20693 -17228 -6443 -1299
5550 -1299 -9834 -18294 -13392 -7028 -7223 -6847 -28 -5083 -14721 -13309 -4866 4930 7413 8859 7100
5535 7100 2370 6978 1518 3085 11390 9863 5414 -1564 -13020 -13649 -7732 1484 6392 4399 -3029
5520 -3029 -4121 -14747 -17483 -11971 -7401 -8179 6711 11022 198 -9772 -10355 -6223 -5447 -12168 -21687
5505 -21687 -11683 -6520 -3742 927 4966 3188 1870 2 -5457 -2937 2150 -8866 -12444 -9332
5491 -9332 -10504 -7024 -5002 1860 10343 10460 9146 -3864 -3842 -722 592 -5184 -2181 3897 -696
5476 -696 -7195 -9291 -10542 -8056 -4190 1965 11975 7166 -53 -1639 -4851 -4411 -4327 -11967 -10153 -4704
5460 -4704 -5487 -4740 -11523 -16390 -8970 -9876 -10923 -1330 1022 -6361 -17208 -11077 -5640 3979 3911 -2379
5444 -2379 -8550 -5869 137 639 -871 -12949 -7755 -6214 -2103 469 7782 4547 -5822 -4202 -12097
5429 -12097 -22924 -16877 -16087 -15570 -22200 -15970 -6204 -11343 -14924 -16616 -13407 -14355 -10389 -3220 -4570
5414 -4570 -5984 -5847 555 3212 -6171 -8748 -9447 -5606 -4126 4442 3888 -3046 -1717 6129 18634
5399 18634 11915 3322 5382 -3604 -7880 -5928 697 2253 1491 -5056 -5431 -2687 -1804 -1312 -6311 -8089
5383 -8089 -9985 -5259 4347 -3099 -2642 5101 1413 -9002 -12995 -14774 -16510 -17878 -18134 -19434 -19798
5368 -19798 -12000 -7022 -6537 -4966 -10851 -13367 2102 14574 12508 7814 3805 -3924 -6615 -14793
5354 -14793 -8209 2356 1852 -10442 -25055 -29094 -24882 -10431 -9834 -10051 -13850 -14477 -5291 -4636 -1143
5339 -1143 6963 5335 -2244 -15694 -19965 -18249 -14020 -12844 -10936 -11470 -11350 -9223 -7092 -9079 -5164
5324 -5164 -4744 -7543 -12011 -10931 -11343 -995 -3172 -14104 -18744 -13135 -5079 -8448 -7650 -4109 -8161
5309 -8161 -13070 -8772 4807 3448 -9964 -14551 -9077 -989 2179 4476 -1454 1446 7979 10483
5295 10483 -2906 -17467 -12952 -9753 -3666 -312 -12758 -23953 -20363 -15426 -14889 -7271 -4801 -5713
5281 -5713 -5388 -12185 -9286 -2563 884 2913 2984 -6602 -10177 -10391 -3610 -7516 -13159 -6699 1797 4470
5265 4470 5875 9499 4721 -10244 -19828 -15953 -2980 1041 2038 -2298 -2992 -9726 -15282 -9055 1610
5250 1610 4603 -3093 -8494 -5532 4282 8402 -4888 -16091 -8740 2126 1001 -4518 -3824 -8598
5236 -8598 -10098 -17079 -19262 -9411 -7683 1216 1214 -5027 -2910 2125 -6014 -2973 -97 -1415 -4496 -5023
5220 -5023 -8066 -13698 -11536 8255 11584 6279 1067 2149 3146 5844 9423 11423 13704 12627 6502
5205 6502 5008 609 3822 8309 6653 2488 -2539 -1839 -11419 -3571 3296 8346 5299 -3754 -1815
5190 -1815 1872 4555 7169 13619 14496 15713 12595 8467 6058 -6105 -11528 -1136 1531 -6513 -6046
5175 -6046 -8418 -8821 -2817 -948 3780 12938 11664 7291 -1160 3521 10928 10858 10787 3684 5402 1917
5159 1917 8522 574 -5496 2668 5534 5758 6433 930 4868 7491 5524 -2759 -5593 -659 -2226
5144 -2226 -15680 -13449 -4379 -5555 -7292 -5716 -17086 -13838 -5431 4015 3930 1826 2948 3627 1230
5129 1230 -2586 -7138 -6092 -11450 -16749 -13645 -776 -696 -2816 -7813 -3537 3589 68 -5535 -4995
5114 -4995 -3661 -14459 -11146 -6125 1220 -8499 -4558 -6672 -13633 -13189 -6939 -7937 3124 3987 -362
5099 -362 6535 5701 -4557 -10674 -7663 -445 2130 7514 2015 -2434 -11021 -3609 3171 -2410 -5795
5084 -5795 507 763 5586 6567 -7123 -14762 -8143 -9401 -4723 -11488 -10284 -11697 -7418 7490 8797
5069 8797 -754 -44 4792 4107 -4590 -12064 -8713 986 7123 9288 14036 18619 15073 8638 417
5054 417 1467 11068 5748 6597 4854 5555 9135 2202 -205 2454 9048 11502 19791 16986 4090
5039 4090 -14237 -14423 -14159 -18092 -22469 -18402 -19597 -14856 -11942 -9630 841 -6486 -14937 -3798 2200
5024 2200 -2863 -10725 -8932 -5916 -12486 -18147 -14731 -5339 -3987 -5756 -16219 -10724 -10523 -7324 -4096
5009 -4096 1465 -9087 -6336 -5322 -1862 -46 -10157 -18595 -24510 -29936 -27676 -18766 -11313 -3499
4995 -3499 -8633 -15939 -18723 -10177 -13570 -8287 -5859 -3012 -3842 -4370 -8397 -17322 -20604 -15549 -19341
4980 -19341 -19430 -12743 -7259 -8989 -13549 -9108 -9215 -11160 -8458 -10155 -1276 2398 -5306 -5513 -10969 -20774
4964 -20774 -9142 6108 6893 -9027 -9228 -3239 3823 7109 -1470 -5066 -13873 -19132 -13794 -13269 -13947
4949 -13947 -3891 -3709 -10383 -3905 4581 -72 -5174 -12088 -8331 -8264 -2065 -1111 4847 12292 9600
4934 9600 9253 2702 -7517 -2839 2558 -423 -12479 -20762 -14861 -7939 -989 9844 1421 -711
4920 -711 -8 -6513 -9470 -11839 -4091 5997 -1731 645 -2312 5026 5872 1333 -1934 -2543 -5551 5822
4904 5822 7873 -227 -608 2421 -3850 -3057 -3188 -7579 -2712 4543 -5419 -12510 -14595 -11699 -10698 -8616
4888 -8616 -1817 -4843 -8126 -4334 451 -10048 -12474 -10171 -10537 -707 3128 3441 -4399 -7240 -9598
4873 -9598 -15150 -10274 -4437 -4093 -1200 -388 3214 3280 -4799 -8008 -13277 -12925 5796 10638 11325 6330
4857 6330 -5215 411 -1742 -7297 1986 594 -11111 -7810 -4626 -3231 7299 15317 10701 3050
4843 3050 -820 -438 -3412 977 1779 -1720 -2463 -8985 -12535 -14196 -15936 -8695 -6006 -9384 -14772 -15599
4827 -15599 -7243 690 -6539 -8240 647 -2486 -4671 3882 9015 11491 7013 4636 1346 -334 5499
4812 5499 9503 10519 8173 6387 6172 -1333 8181 11454 19275 15752 6416 -582 -2047 -12596 -7036
4797 -7036 -887 -3539 6897 -4186 -10281 -10247 -6029 377 7517 -3397 -9788 -6635 -5430 -9422 -8692
4782 -8692 1492 11982 13018 3899 4101 5701 2880 3391 9545 14618 8000 2435 1201 2113 -2130
4767 -2130 2220 9634 3449 -5023 -4009 -247 5318 -1522 -3818 -13367 -6742 -3671 4340 8735 5397
4752 5397 8576 12283 9220 8437 2665 6554 3187 -4807 -1955 -3445 -15514 -10477 -11670 -17286 -12561
4737 -12561 -7238 -4014 2920 2926 -4131 -13470 -16579 -16939 -9251 -7169 -12724 -15081 -9250 -12410 -16025 -19371
4721 -19371 -15900 -11083 -8623 -4626 -8968 -13626 -11975 -8671 -12377 -13327 -6021 -7107 -9514 -10253 -6627
4706 -6627 -2793 4562 -4678 -16759 -18301 -125 10994 12579 2451 4857 5149 -462 -6283 -838
4692 -838 -10726 -20019 -12260 -6323 -878 6005 3009 1717 3821 4173 -8862 -14816 -19916 -20378 -18271
4677 -18271 -14346 -5912 -6719 -3308 -1966 -2951 -12864 -21154 -15620 2400 12676 7946 9014 9810 2070
4662 2070 -192 6408 11113 14474 19922 21197 18758 16931 11213 -1387 -6529 -14320 -22971 -16708 -11232
4647 -11232 -9071 -13387 -7713 15109 30719 22297 8269 1226 -7093 -9021 4096 11468 7104 3748
4633 3748 5389 6898 3668 -1468 -4957 -6967 -6521 -9559 -14399 -22976 -9515 -741 -9797 -17073 -19294
4618 -19294 -11445 -9051 -4874 1930 143 913 8102 4780 2688 -698 1998 7338 8102 7361 10888
4603 10888 8178 772 3355 9034 13776 5133 2449 8493 -1206 -12119 -9543 1538 -7511 -18107
4589 -18107 -10259 -6405 -8480 -8426 3056 4983 244 -6287 -3283 3189 512 4942 11048 13764 16130
4574 16130 11434 6198 431 -3894 -1248 -4147 -1663 -9176 -9400 -4968 -11493 -4010 2643 2544 -4860
4559 -4860 -10026 -6243 -855 -11 -9095 -18959 -23331 -25027 -15386 -12596 -11087 3124 4446 2963 3915
4544 3915 10451 18506 10174 9137 11226 773 -3477 389 -3241 -454 1598 2329 -5282 -258 5149
4529 5149 -6411 -7062 1287 -7814 -9954 436 10155 8759 5017 -12125 -23457 -23706 -17785 -3440
4515 -3440 4366 -8419 -13185 -9863 -7810 -9389 -7713 -9563 -1576 13556 13352 7432 8475 2605 990
4500 990 17261 14394 2 1520 856 -11236 -15001 -15683 -21189 -17335 -18345 -10098 -2478 -2831 4943
4485 4943 5346 -7729 -4350 -3914 -9542 -10883 -3383 3536 -1811 -2135 1276 7056 217 -33 -8149 -8245
4469 -8245 4728 20109 18954 5070 -1856 -1820 -4293 -12401 -12646 -1256 1910 5556 6568 -100 -4209
4454 -4209 -2521 -2488 -2610 -537 -1479 -1521 -3658 -4323 -7930 -582 1451 -1940 -11466 -18264 -11725 -2289 -5536
4437 -5536 -7696 -6179 3446 12350 15832 9091 9125 9984 2713 -6728 -6386 643 12842 10650 10769 11904
4421 11904 -1391 -9377 -14616 -11106 -4055 -5269 -6603 -3675 -6019 -13956 -12816 -11660 -13233 -18531
4407 -18531 -15302 -13617 -12724 -14154 -8308 -2819 -972 6493 8241 10938 7587 -2749 -10791 -16795 -13168
4392 -13168 -11004 -6394 -2777 -4150 -7327 -11732 -9324 -968 6241 11630 5376 -3698 -3500 -12925 -6589
4377 -6589 5799 4471 8331 12622 7748 -4806 -8385 -2239 8468 4618 -3028 -16418 -13990 -11037
4363 -11037 -11653 -9041 3547 4915 2786 641 10908 11663 4482 5021 1416 -604 6227 19163 14346
4348 14346 8604 14027 22902 20404 18210 16500 7293 7157 17146 12076 5592 5403 5325 4173 15047
4333 15047 9738 -6613 2900 16803 11819 1070 -835 -761 -6493 -12176 -9549 -4696 -6643 -4730
4319 -4730 -213 3867 723 9602 5556 7147 -226 -8385 -10341 -5579 -2704 1520 15541 15024 11183
4304 11183 -194 -3310 -11959 -17594 -18579 -23004 -24379 -17656 -15077 -7866 -3151 3584 6305 -10932
4290 -10932 -18380 -10356 -11778 -14950 -22314 -29848 -27456 -25579 -19932 -10360 4464 9648 -250 -9934
4276 -9934 -13025 -15675 -12427 6276 7913 -1342 -4057 -4816 -10579 -24887 -23992 -11641 -6652 -10708 -11329
4261 -11329 -4638 1401 5413 11072 7663 -7889 -22615 -21807 -12328 -6825 8753 12534 12169 4563
4247 4563 -12403 -22001 -23083 -28997 -18770 -8098 3312 4627 -4177 13 3769 4806 -5938 -21727
4233 -21727 -31202 -18739 -7069 -4588 -2728 8689 14568 3031 3430 12445 11715 7331 11473 15456
4219 15456 9752 9985 8889 7264 1766 2114 8321 6899 1634 180 -7381 -84 -950 -4915 -1303
4204 -1303 -3888 -5505 -916 1032 2565 -703 -2475 -3823 634 -10064 -8762 -4153 -5327 1400 -1507
4189 -1507 1813 97 -4919 -3716 -12391 -13098 -10624 -15089 -19458 -9287 -1013 745 -1510 -5205 -2003
4174 -2003 3623 -1782 -11744 -14656 -18592 -11214 -13428 -23931 -24879 -15610 1979 7367 2492 -2542 -5067
4159 -5067 -11026 -9705 -8059 -7640 -4900 -5940 -6368 -6267 1802 6314 14898 18490 11233 3469 -3101 -216
4143 -216 -2577 -1886 256 -673 -5025 -12205 -8694 6027 13444 6988 7719 6839 872 1650 -1771 -10979
4127 -10979 -11655 -25379 -29416 -32620 -21335 -7749 -12692 -7987 5071 10015 3653 -7906 -10529 -12538
4113 -12538 -7912 -4198 4437 6782 12331 20974 16945 1344 -4147 -1677 6982 10576 7426 3891
4099 3891 1497 6351 8457 6345 -2373 2187 7051 8093 4489 -1668 -3541 -11156 -16945 -23825 -21997
4084 -21997 -13948 -17488 -23220 -28469 -21790 -16087 -12349 5185 5488 -1094 -474 8863 15032 10580 2721
4069 2721 -2682 -3246 -8048 -10972 -6876 -12909 -16910 -11447 -5093 -6013 -13947 -10554 -4675 -1220 -3754
4054 -3754 -6637 -4458 -3357 -9325 -13718 -11221 -6065 -5580 -986 908 2742 -2635 -5182 -9642 -11258
4039 -11258 -6898 -8156 -20350 -20880 -19745 -17469 -11867 -23411 -33991 -34784 -29634 -16545 -16662 -21515
4025 -21515 -16159 2115 7771 8932 11610 4706 2307 2613 3806 2600 -5209 -2911 14773 12540
4011 12540 3398 -4742 -8173 -15397 -16416 -10354 -6905 -5381 -4384 -2974 3721 -5777 -11061 -13648 -24384
3996 -24384 -22378 -12008 -9563 -11378 -15735 -8409 -2779 -363 -5219 -17785 -23167 -32853 -33673 -23722
3982 -23722 -14632 -8183 -2422 2074 5383 -72 -14779 -17263 -9985 -6500 661 16527 28001 32394
3968 32394 31680 37500 36412 29360 11964 1535 -7149 -15645 -13668 -12315 -2843 -1148 -3792 -17380
3954 -17380 -23999 -21540 -31301 -37843 -26362 -22195 -29141 -30465 -15205 -16971 -15052 -9836 -5927 -2316
3940 -2316 2572 -172 3183 2610 4750 4872 -5274 -9828 -4978 1733 -5665 -6485 -15660 -11807 -6806
3925 -6806 -10880 -5699 -5847 -9399 -9494 -6090 54 11541 19243 23438 19122 10631 4122 6191 3331
3910 3331 1174 9744 13921 13506 9585 4570 1815 5475 12869 5273 -3063 991 4109 1025 1716
3895 1716 -2942 -738 5856 352 6983 280 -11660 -19282 -11738 -14691 -16774 -19175 -13993 -8949 -7714
3880 -7714 733 4626 4746 5350 801 -622 -1881 -15371 -19437 -12741 1299 -1996 2758 9517 15088
3865 15088 21546 16159 -1750 6212 17805 15000 6555 -14053 -22199 -18442 -14295 -16512 -11986 -1848
3851 -1848 -3060 -1206 8211 2812 -12473 -18192 -14533 -7089 -6609 -10724 -22053 -25946 -24998 -26215 -28902
3836 -28902 -19590 -6825 1529 5329 -6044 -11531 -7534 2623 342 -5234 -12913 -15483 -11814 -14430
3822 -14430 -22483 -25773 -25252 -28031 -29610 -30829 -23318 -12359 -5405 -4439 -11845 -9814 -5599 3611 3603 -910
3806 -910 3320 5534 5132 7752 2426 4730 11064 13562 14053 1253 2889 5218 1741 2875 -1769
3791 -1769 -7343 3886 15954 9898 3494 -2817 4535 -148 -676 731 -3714 -3662 -26 -5126 -8465
3776 -8465 -3056 4626 7081 11510 11471 12712 10439 12588 14109 11615 13231 16551 13110 4724 -5879
3761 -5879 -6913 -4826 -59 -244 -680 -7759 -14047 -1818 -5946 -8960 4998 8549 2994 6454 8454
3746 8454 4041 -4830 -11233 -13562 -8326 -2650 -6886 -6206 -3893 -4988 -3167 -4603 -5362 -2140 -4019
3731 -4019 -9809 -10366 -15605 -13067 -7508 -2182 -1300 -7510 179 7033 -3891 -17296 -18991 -15506 -16874
3716 -16874 -13788 -10959 -10872 -3895 -1907 4530 13418 3473 -10707 -10746 3403 10152 9569 11334 13563
3701 13563 12252 -692 -6393 -11845 -16029 -11517 -670 2755 3716 1388 -4115 -12935 -19312 -18013
3687 -18013 -17313 -17542 -5984 -7610 -14201 -5714 -6122 -9999 -1560 3760 3413 -1648 1669 3307 -1380
3672 -1380 -527 -1794 -3942 -218 -6761 -8305 -5954 789 12713 11933 8558 4080 5896 -2782 -2941
3657 -2941 918 -1124 -2944 -11791 -13516 2391 15977 9096 -4525 -11402 -8355 -16249 -25478 -14486
3643 -14486 2474 11893 19892 19031 25896 17522 12508 12789 8778 -2270 -10452 -14405 -19997 -20652 -19799
3628 -19799 -7143 140 -5559 -13572 -10194 327 1174 -6487 -14810 -14899 -6790 914 3395 9799 8531
3613 8531 -1108 -10056 -10649 -21122 -19675 -10861 3111 13727 7001 -6447 -17226 -24200 -33259 -30562
3599 -30562 -9211 17550 39024 44630 45141 51282 55958 60480 64007 69947 54653 20417 -14647
3586 -14647 -28063 -24345 -18990 -1504 22048 30482 34348 24226 2896 -7143 -1066 5161 3244
3573 3244 4752 5151 7637 3878 9217 8296 8807 14540 10898 -4561 -17566 -21750 -15483 323 2093
3558 2093 -2870 -3103 -717 -5554 -13324 -8406 -414 -1276 7545 8117 17058 16583 4038 -660 -1124 242
3542 242 -4024 -2674 -11404 -18437 -12100 -14969 -14789 -17563 -18018 -15818 -12286 -8607 -6480 -2297 -6980 -10528
3526 -10528 -10848 -4637 694 -1305 -3917 -14005 -18058 -14322 -5101 -4547 -4002 -5267 3526 16991 13622
3511 13622 1361 3145 6367 2004 -7209 -14924 -13534 -9417 -7509 -4455 7455 3517 -3023 3884
3497 3884 336 -10867 -13890 -11816 -8365 -9541 -19053 -12017 -761 2808 -7347 -9645 -5875 -6818
3483 -6818 -11064 -14157 -8939 -5145 -4873 -16053 -19227 -9923 -4593 -5389 2348 6381 8346 10211 8382
3468 8382 11649 8810 -1357 3217 12445 13445 13774 4166 814 2969 1374 1064 -3031 -4488 -694
3453 -694 -3712 -3065 -5561 -3838 -9058 -1662 4699 3594 -5115 -13730 3241 7647 7149 -1819 -5322
3438 -5322 -3383 -2274 -8753 -5389 2031 5461 4805 6386 -960 -1057 -954 -5772 -7231 -6153 -7797 -529
3422 -529 7044 8327 6062 6849 9514 2837 -2982 2046 -1125 2419 923 3008 -1728 -10613 -13598
3407 -13598 -3324 -1377 4649 1154 -12777 -17243 -6649 2789 330 -4034 -9008 -7166 -14403 -23330
3393 -23330 -19704 -14731 -8512 -3381 -5842 -6026 1451 3517 11383 15029 9156 1847 -1829 532 2299
3378 2299 -904 -4420 -9641 -13233 -9353 -10808 -16657 -9432 -8091 -10784 -10152 -5221 -3628 -6180 4376
3363 4376 2100 -2677 3055 16209 17144 15541 15588 15898 14762 3350 -1127 -8196 -19100 -23964 -29886
3348 -29886 -32395 -29402 -14309 -8173 -12266 -17322 -12977 -7240 -9285 -11913 -3636 5374 10942 12761
3334 12761 9833 18613 21214 14651 7946 -2507 -5224 -6681 -9479 1057 6393 9541 5779 -5548
3320 -5548 -10544 -4334 3558 12323 15949 12881 12154 12574 15230 9738 744 3771 9334 11976 11126 12230
3304 12230 3918 2260 7799 6620 -5503 -9151 -7699 -8096 -3068 -110 7704 11614 9095 -117 -7791
3289 -7791 -2781 -6157 -19039 -19165 -13955 -4395 10419 8819 9917 1521 -21957 -28955 -15643 -12977
3275 -12977 -20327 -16370 -7560 1958 -265 5993 8261 -3032 -8234 -16547 -16885 -15005 -11578 -8905 -5006
3260 -5006 -1739 -8424 -5525 -424 -73 6115 8802 7099 8710 2304 -8760 -10886 -5316 -5031 -13
3245 -13 3484 5184 -263 -6437 -10273 -10809 -650 -6044 -11170 -5314 -3316 -4915 -13985 -21605 -10417
3230 -10417 7307 11388 10910 3184 4587 6939 13434 8013 -7388 -21033 -23897 -25977 -24670 -16342
3216 -16342 -4137 -282 -6340 -2659 3397 13209 9580 10204 7244 4105 -1127 -10388 -7102 207 2671
3201 2671 936 7623 5038 8748 8588 3751 2123 -914 -4794 -8974 -15261 -13479 -5647 -2020 -1389
3186 -1389 949 -5032 -10579 -16457 -25466 -27311 -18079 -2091 -3550 -11007 -9090 -3327 -11148 -10377 -1400
3171 -1400 -10082 -4308 -347 -2722 8732 5359 661 -1468 -5646 2555 10730 19523 24809 29539 27248
3156 27248 25536 11356 1750 1110 2273 6118 9842 11387 3258 790 1467 482 1036 6931 -1202
3141 -1202 -758 8379 588 4200 9029 15613 12347 10393 3621 4926 4229 -9927 -10436 -10219 -4465 -5536
3125 -5536 -9312 -13045 -14918 -19980 -17369 -6422 -2416 -4779 -4708 -760 -101 -5642 -2684 1024 -1580
3110 -1580 -192 -3179 -5704 -5481 -11565 -16067 -12505 -12583 -18815 -18147 -19411 -15513 -3388 -6664 -10150 -5709
3094 -5709 -9505 -8923 -5932 -10226 -12687 -7538 -8248 -11656 -8412 -17729 -20267 -17683 -13322 -7584 -11560
3079 -11560 -14253 -5323 2970 4343 4254 -3355 -2566 426 1178 -5798 -6572 -12346 -13459 -11364 -8523 -6418
3063 -6418 -14557 -19733 -19999 -11357 -6703 505 427 6277 4710 6271 14759 24342 26230 10796 9977 8084
3047 8084 -3521 -5986 -3522 -782 -8424 -1230 9200 4428 1910 -2937 -9076 -13113 -15733 -19821
3033 -19821 -22950 -15177 -1769 4084 4102 -6767 -8230 -3338 -9096 -11437 -11401 -13664 -16565 -5515 -1791
3018 -1791 1691 6511 -1873 -4149 -1157 -1338 -13074 -10542 -2211 1162 6323 11746 9416 3241 -10768
3003 -10768 -17237 -21337 -17649 -10154 -11716 -3357 10380 24666 24693 24340 16828 16223 12020 7815 12743
2988 12743 10117 197 -1032 1555 4565 21950 32188 37601 29593 22162 18082 11533 11456 5419 9832
2973 9832 12355 7639 2513 -5809 -1638 3487 -3129 -12863 -18230 -12273 -11282 -6455 -3434 -1893 -5028
2958 -5028 71 5427 7833 3122 8227 3586 829 -3014 -8439 -2929 7743 12113 11773 13016 1698
2943 1698 1520 1132 5202 5911 14999 14459 12304 15696 13976 13787 10608 8956 11467 4578 2643 1784
2927 1784 -1137 2349 5158 2324 3865 3558 -234 -2523 -317 -5179 3201 8733 9735 8881 -2128
2912 -2128 -7678 -10135 -93 2363 9282 8114 -1375 -10957 -10023 -7170 439 -950 -5713 -1632 -5703
2897 -5703 -5421 -3682 4535 5696 1786 -780 1505 7508 -777 5428 6230 670 1990 5545 5217 3010
2881 3010 5868 -2580 -12716 -7396 -368 -4406 -6610 -5729 -1206 -228 -761 4253 3741 -746 2450 3073
2865 3073 3702 2835 10396 6475 -5533 -5280 3005 -3519 -8473 -9758 -23481 -26528 -25485 -13432 -5201
2850 -5201 1170 3508 116 -6054 -8574 -5952 -4803 4233 -14 -8010 -15161 -14677 -9690 -17891 -9979
2835 -9979 -12274 -16049 -22116 -20082 -12465 -4969 77 9399 16070 16090 18144 12117 13061 4042 5377 16779
2819 16779 17908 14922 8021 -4220 -12963 -2031 -5722 -12954 -5497 -4878 23 4171 597 -2190
2805 -2190 231 6182 1653 -6345 -4034 1583 -5390 -3018 3224 3606 4464 563 559 6793 681 6033
2789 6033 21588 21712 16569 6742 702 -1727 -1304 -3913 -13048 -10716 -7266 924 11257 16682 13732
2774 13732 -5 -18760 -23517 -11158 -8174 2373 4751 86 -6797 -2859 4166 5502 -3267 -13726
2760 -13726 -12536 -8374 -8416 -4982 3064 12255 17212 17639 8848 11755 8602 -4218 -7459 -2653 -438
2745 -438 1603 100 4279 -478 -1781 1763 -4190 -11685 -6866 -3152 -4258 -4852 -710 -3464 4584
2730 4584 2188 1811 -3560 -6576 -6920 -3306 1167 9031 7503 896 -338 -4523 -2367 -6833 -12526
2715 -12526 -10701 -15293 -10911 -7347 -4952 -5626 -15446 -18973 -10377 605 5423 5505 8495 11552 9537
2700 9537 4785 2275 7472 7061 4964 4643 102 -792 -7860 -20255 -8888 184 -5152 -11416 -19936
2685 -19936 -22533 -21763 -11875 -13035 -12547 -9691 -6513 -3032 -6994 -12229 -7750 -5106 -1866 1718 9596
2670 9596 13118 15306 13413 15219 18538 17914 13577 8404 10143 7376 1333 -11998 -8430 14136 17834
2655 17834 12009 7111 6406 2685 -2105 -11419 409 12588 13322 13369 1380 -7545 -1023 4356 7120
2640 7120 6049 9184 9521 -729 -622 4260 14500 17261 3011 -5327 -5492 -12877 -6155 -3790 2644
2625 2644 7776 6641 -5969 -19212 -17416 -8099 -14766 -20255 -17243 -11615 -10938 -8870 -12229 -11351 1267
2610 1267 2610 4869 2547 264 3978 13010 10456 9652 12666 11484 9027 -2279 -11030 -3341 2882
2595 2882 2168 1774 2945 3978 7926 7496 15818 11856 -442 -5983 -1423 2795 4476 8228 7704 3999
2579 3999 8315 205 -305 4449 6730 6645 6963 -2472 -533 3458 3417 -2701 -5203 241 6732 3674
2563 3674 6705 10351 6914 3571 5364 3113 -4329 -8466 -1777 976 7306 9404 2447 4542 -5963
2548 -5963 -6511 512 1520 1441 -3324 -144 -18 3560 119 -9379 -13930 -5732 -1624 1718 3282 -10639
2532 -10639 -15085 -5897 -6785 -4173 3369 1734 4757 13157 15227 10257 8042 7280 -23 -5227 -3155
2517 -3155 2421 2058 -2844 252 2052 5484 -4502 -7401 -6389 -1985 4497 6692 10730 14323 21477
2502 21477 26624 20573 13509 14900 4253 1145 -5080 -10497 917 2838 1518 -3433 -8727 -10807
2488 -10807 -6710 7861 8094 2534 3590 -1561 -3093 -14401 -11933 -5159 978 683 9553 6929 -1054
2473 -1054 3039 3971 -4201 -4021 11472 18193 12599 4560 7879 8723 3547 3608 -4969 -12568 -12226 -17394
2457 -17394 -9737 -7892 -8370 -15696 -22436 -16786 -6171 5350 10433 8876 2708 -8538 -13477 -13377
2443 -13377 -14058 -10976 -1515 -41 -5793 -7042 -6316 526 9310 13166 6894 -1357 -7413 2744 4221
2428 4221 -575 -11361 -15252 -9726 -7587 -158 88 -3962 -6817 -7851 1008 6392 4166 794 -7005
2413 -7005 -6463 -15589 -18844 -24659 -17152 -2668 3953 -6413 -11115 -5533 1045 -1778 -1895 -3894 -3977
2398 -3977 -9077 -10720 -3283 -3600 -2192 -4253 -4201 -2994 -5964 -5477 6008 7300 11708 8975 193 3681
2382 3681 5161 530 3878 4057 -819 -12550 -20046 -14083 -4657 443 -2343 -1889 1907 -1611 57
2367 57 -3896 -9302 -12214 -13832 -16075 -9959 44 3755 1488 1902 -613 -6168 -2848 -4278 -3294 -2861
2351 -2861 -630 -776 -4462 -7126 -10901 -10509 -1139 13095 12695 24 -2465 4275 13285 7983 -9900
2336 -9900 -8588 3248 696 -1369 -9799 -5724 1482 4756 7758 7430 -520 7189 14658 8052 -2277
2321 -2277 -5210 -10869 -5068 -2036 -7742 -9223 -12167 -7481 4846 4233 -1835 4319 12763 15420 4654
2306 4654 -2214 817 10896 1588 -4341 1254 -2828 6643 16957 14229 14117 11578 212 -6250
2292 -6250 -8829 -12915 -5971 1869 5818 1904 9663 11820 8513 -94 -4998 -6511 -3512 -4890 -2767
2277 -2767 7294 5232 58 382 7330 14898 17247 14179 11951 7820 5093 -1013 -1060 3351 4577
2262 4577 2887 -1572 1110 -7029 -4499 2791 5644 10004 2316 -170 2328 9600 9553 14501 11972
2247 11972 7873 11154 6452 -3199 -11670 -21109 -22755 -12736 -2774 -2345 3814 9247 5726 3568 8442
2232 8442 3799 -193 6910 4442 -987 8459 6369 628 481 2736 1629 438 7229 5405 -447
2217 -447 4895 8010 17692 17290 11027 9302 10075 4756 4481 9324 18556 23241 16802 6258 -5147
2202 -5147 -3963 -307 -246 1343 -2838 -3311 -3683 -1717 -1251 1972 1304 -163 5735 4107 2384 2075 2232
2185 2232 6824 5261 7959 7951 97 -6997 -14969 -23208 -16698 -3125 6225 2706 -2484 5330 8956
2170 8956 1441 -2663 -2006 -9236 -7351 -13978 -20274 -18355 -15013 -5642 1426 5315 2520 2739 8253
2155 8253 12148 4865 -11144 -14607 -10108 -701 3061 3465 9160 13955 17984 21450 13754 4041 3607
2140 3607 523 16635 24475 13327 9271 9866 12009 7058 6192 4398 5950 5845 -127 -2960 9436
2125 9436 17239 7930 5010 7398 2849 -2476 4812 1882 533 -1829 1920 2816 299 1543 -7632
2110 -7632 -2138 5053 -521 -9201 -12730 -10478 -4517 -6076 -3800 -166 2993 6932 5475 3190 -4925
2095 -4925 1852 1817 3826 6715 -7876 -8243 -4275 -2177 -8914 -8758 -7676 -11340 -8458 684 -1203 331
2079 331 304 7808 9174 10261 17260 6196 -3501 -1924 -7488 -6894 -8054 -13898 -13722 -3921 8729 9039
2063 9039 6985 11449 7307 -6223 -286 17536 20159 11042 2373 -1736 -6158 -16068 -17017 -10176 -10912
2048 -10912 -8103 831 4199 10218 6494 2492 13590 14032 -4917 1013 1681 -5637 -4219 889 -123
2033 -123 348 932 -4755 -4571 287 -3461 -8452 1152 11869 17570 14005 8002 4400 7153 1997 6383
2017 6383 3208 4775 -545 -8150 -13442 -16763 -14023 -8336 -6230 -10393 -18435 -19183 -13465 -7512 -4189
2002 -4189 5565 4006 4451 13319 11636 10228 8363 576 -860 5978 9189 9201 5665 4148 2190 -4261
1986 -4261 823 6447 1714 -908 7587 12319 8906 -1217 -19274 -13520 -6666 66 -1161 -9470
1972 -9470 -16529 -20035 -15727 -11065 -5979 -2325 3428 3582 2659 -1638 -450 -6909 -5850 -3149 -8468
1957 -8468 -14050 -8496 9968 13037 10504 15057 8692 3954 349 4862 1838 6286 4723 3101 4620
1942 4620 5464 6690 11425 11721 2612 6599 6466 -770 2239 4219 7908 1777 5557 4780 9875 11118
1926 11118 17032 13467 1751 995 -1948 -9434 -8884 -5502 -8140 -5054 5430 10665 9925 4720 5676
1911 5676 13503 14075 16278 12770 9819 3624 -5077 -853 3856 2620 15585 27976 30927 19212
1897 19212 15395 20241 20541 23551 9073 361 -1085 -1730 2185 9483 11567 4805 -2593 5787 10546
1882 10546 7403 1157 -636 5460 1593 -760 6381 5372 897 -1674 -2004 5068 377 -3869 3247
1867 3247 7705 -2941 1399 8841 16078 14129 6233 1083 -2057 3798 6608 10743 18177 21111 9731
1852 9731 879 -2374 -3452 -4628 -2722 -11121 -10231 -14508 -22236 -22550 -13556 -2429 -624 5807 5952
1837 5952 2978 -5975 -7499 -9549 -12739 -10550 -2217 3957 3427 -1344 1900 1137 3759 2349 -2935
1822 -2935 -6801 -11370 -3261 301 -5815 -10778 -12954 -160 1912 2643 5730 522 -2855 -6766 -16506
1807 -16506 -15618 -10287 -3719 2246 6111 7271 8601 11384 497 -14479 -19319 -16600 -12055 -8053
1793 -8053 -12486 -10840 -4976 821 9225 16372 13875 16114 10187 7290 9301 5570 -6846 -20004
1779 -20004 -21207 -21413 -19090 -27424 -16455 -10541 -7802 -619 4472 2382 -3384 -8757 -9282 -12722 -4382
1764 -4382 -3176 -5088 -9349 -18239 -17458 -18344 -11069 -9118 84 4508 10747 13908 11913 -3393 -9271
1749 -9271 -8063 -10799 -8462 -1194 5712 906 3532 -1753 -3625 -1252 -2063 -7743 -8131 -5965 -7176
1734 -7176 -4794 -6594 -7685 -4287 -5308 2606 2663 -2946 -7962 -2778 9006 14481 5517 9950 12430
1719 12430 14079 13432 11092 11199 -2769 -13859 -10647 -10383 1765 1546 -2011 -736 -1435 -4505 -7908
1704 -7908 -4766 -1882 -14130 -23204 -22978 -8632 6410 10187 13666 12226 -4072 -18784 -22887 -19660
1690 -19660 -7912 326 -2042 -711 5351 -176 -7691 -13731 -14359 -10337 -2479 -1212 -8914 -19477
1676 -19477 -20962 -19554 -18736 -12550 -2689 -1271 -979 8955 14669 9097 1186 -522 -8659 -19400 -20551
1661 -20551 -10191 -4404 -6303 -10065 -8378 -12414 -15090 -8323 -7534 -6951 -11275 -8028 -3032 -6760 -9266
1646 -9266 -9396 -6657 -3143 -4581 -3474 7467 11319 5390 -303 -7604 -1717 9857 7303 2206 5671
1631 5671 5357 7688 16929 1951 -1752 -7082 -11771 -4136 -4422 -4935 -2961 2420 2593 -4892 -3281 -3956
1615 -3956 3551 9049 3886 -54 1082 6546 13079 14086 11920 13537 17614 14299 207 1939 12403
1600 12403 18999 18175 18001 12885 10854 9789 11146 8924 11135 10572 740 -5815 -5989 -943 5952 11727
1584 11727 5640 1307 2643 3715 6152 9038 -1666 -11202 -11253 -9628 -8790 -1791 -2701 -5035 -8256
1569 -8256 -1867 12839 11753 -1464 -12796 -11420 3017 9548 3439 -95 1534 832 4600 2601
1555 2601 -1737 -3026 -2353 -2290 -2022 -1243 2196 11893 17510 16706 6995 3013 5680 3029 -3510 2186
1539 2186 10935 7602 7744 4218 2810 -1234 1709 14399 16420 10296 2370 -1878 535 3319 3421
1524 3421 4755 3990 1844 -4631 -4886 -4510 -4470 -8711 -7723 -1616 6499 5232 -464 -13887 -7943 -1834
1508 -1834 2998 7012 10502 15797 10218 7907 18039 15819 5761 5616 7360 4470 1984 -2795 -6315
1493 -6315 3715 4739 5134 7329 7443 1810 -5223 7777 9186 15110 7313 3698 -1927 4263 8843
1478 8843 5193 -276 657 -4254 -13893 -10857 -11287 -14309 -20319 -12420 -9394 -11863 -14660 -7505 -5592
1463 -5592 -18288 -27972 -20255 -8986 -2249 -4888 -2062 382 8859 7796 6582 10934 20871 21520 5740
1448 5740 -3243 -14533 -14314 -11821 -2102 17 -8264 -4309 479 -1081 -4166 8833 6806 912 -1988
1433 -1988 -2262 292 4709 -1800 2517 2574 2607 -9167 -7375 -3750 -7597 981 -5234 -14768 -3042 -2569
1417 -2569 -6053 -5733 -1104 4139 7015 13245 13419 -3445 -7584 3410 5778 4982 5515 -2631 -19399
1402 -19399 -17255 -10581 -5691 -13159 -14691 -6328 -9323 -13020 -8601 -13034 -10250 -3208 4723 6140 3228
1387 3228 -2258 -2336 5896 13023 15109 24590 20967 11129 5253 6676 -1308 -4890 3616 14088 9438
1372 9438 8920 15973 7783 8800 8069 6495 12865 8698 4701 3254 -1251 -2216 -2826 -7645 -6061 162
1356 162 -355 -4183 -8335 -9318 -3991 -1515 -3005 -9169 -12574 -1869 -1028 -4285 -589 9089 15719 15975
1340 15975 22787 31240 26039 14628 8965 1975 -7606 -9233 -4814 -2289 3680 12108 4122 5524
1326 5524 7143 1088 -4304 584 4393 3409 5811 5434 4301 -476 1923 6839 8804 23450 15104
1311 15104 -577 -4206 495 -5058 -3206 798 4278 7117 15235 16851 8098 -1565 1013 4363
1297 4363 1976 9217 7243 3061 -2904 -4164 -6672 3773 2171 -10998 -13718 -7546 1052 6178
1283 6178 4401 2835 4930 9590 3531 -5154 -3037 -285 -328 -484 -3925 1407 12787 12520 4639 8167
1267 8167 -402 -7046 -7004 668 -2770 -5784 -9017 -10345 -3023 -9299 -18030 -19717 -12310 -8384 -11662
1252 -11662 -6597 -1610 8252 9031 13306 -2885 -11731 -7882 -2781 968 4351 4036 -9165 -5577 -2961
1237 -2961 3642 12604 5029 8085 13441 11496 8868 4726 2870 3843 7795 5032 9915 7081 7804
1222 7804 9522 8927 5227 674 -646 -1217 2403 -5720 -4281 -837 84 7885 8731 9666 15595 10044
1206 10044 10070 16432 10782 9985 -1064 3017 10790 5862 3353 1176 -6345 -3441 -3581 2395 9480
1191 9480 6566 18202 17821 12435 6982 3990 7536 11905 1406 -104 2346 9077 9159 8677 9102 9272
1175 9272 5701 -873 3163 6897 4217 1458 -4678 -674 16212 14012 4755 -254 -10844 -10139 -9048
1160 -9048 -5167 2581 5566 3341 3449 -2598 -6870 3229 15136 14615 11482 4645 1224 -4626 -2846
1145 -2846 3479 6173 4493 -2739 -3457 -5955 -3944 -2908 -6045 4022 1925 -7536 -5367 2598 18688
1130 18688 22558 19468 13444 12894 10067 7125 9503 5062 -4072 -9972 -4394 -5577 -7843 -2804 -5161
1115 -5161 -8466 -5279 2677 10694 1450 4362 7872 15313 22300 17445 10893 9588 3939 -653 5627
1100 5627 10935 8573 3102 -535 -6466 -12372 -6813 -3637 256 8576 5132 -2905 -5981 -9420 -11576
1085 -11576 -4490 653 -3977 -5165 -3292 6183 13892 15678 12781 6740 5477 -1931 2292 9752 3838
1070 3838 -4528 -6872 3345 12534 8913 3595 -3713 297 -1284 1718 5234 5437 4232 -1145 -2049
1055 -2049 -6563 -6331 7478 17896 19898 11191 1664 -2789 -6691 -5437 -4126 6093 13616 11375
1041 11375 -400 -3770 -7146 -10210 -8525 -5901 5551 5110 1343 -8209 -10016 4571 12586 18290
1027 18290 11392 12594 10078 15426 16723 21605 12025 -7486 -8574 -7071 -3306 -2328 1649 -236 -11240
1012 -11240 -9930 8210 13576 9001 2348 -3624 5682 6530 -3021 4034 9058 9145 8312 4794 -1506
997 -1506 -8203 -8260 -6720 -8506 -1169 458 3496 7071 4356 -3960 -2737 -1290 -2286 -4264 4820 3944
981 3944 3986 11904 20354 10551 2331 3721 3634 13198 13557 17576 17803 15498 17376 16978 7351 3722 8238
964 8238 13885 14660 5249 1070 512 1412 8249 7878 3273 8996 20605 20381 19831 15155 13515 11553
948 11553 808 2147 6530 -769 -8207 -7454 3867 4296 -7226 -3861 1770 -71 4264 4864 10017
933 10017 9567 7778 2091 6579 3490 3574 4 -1959 816 3733 3956 8980 10953 8599 7571 6192
917 6192 9169 10654 9972 12358 10114 10001 6928 4006 -2552 -2045 715 -4210 -3517 -1695 -4267 -2716
901 -2716 -1785 7602 4063 293 1351 -80 3822 13488 14319 9662 10805 8749 1229 -4145 1757 -2533
885 -2533 6701 12008 13059 11293 9602 17704 18263 12749 12917 20316 25764 16249 2517 624 2659
870 2659 8837 12260 12988 6653 662 2878 1653 3052 4665 7399 5318 -865 -364 2780 3043 -865
854 -865 592 11188 21232 23417 15233 9789 5293 7626 6502 2638 5832 14908 24391 16992 11975
839 11975 10278 -647 -1936 -2085 -343 -6347 -3072 -1738 -8922 -16553 -19063 -2901 217 -5893 -5540
824 -5540 -1579 2057 -2568 -9175 -13839 -11952 -3020 -1384 -3499 3568 3234 1837 -3297 432 740 -1520
808 -1520 -8800 -7109 -5949 -3582 952 -860 -3189 -6825 -5785 2272 6505 12624 10057 9977 13288 14996
792 14996 12586 1780 -3930 -6631 -257 6023 10787 12119 1421 -1827 -2179 -707 -4674 3354 5231
777 5231 -2930 4472 9795 8900 3415 1586 3180 7006 3209 -1849 -6316 -6631 -6056 -1076 1981 2506
761 2506 16154 18200 6966 -6358 -8137 -13100 -9508 -8620 -5687 3343 7637 -4415 -7812 -2750
747 -2750 -7508 -15921 -15841 -13504 -5829 -1628 -10 1508 584 8543 15124 5250 -4698 -6107 815 1270
731 1270 5272 16545 27162 14683 4584 7617 11016 9320 -302 -5210 -5780 4913 20152 10091
717 10091 15440 19988 14523 16020 1048 2072 4994 7398 6695 12429 17163 15310 17645 25999 26301
702 26301 16126 6178 2049 3893 7430 2024 1632 6859 4247 -2352 -2996 -271 5744 -1105 -7382
687 -7382 -10252 -11768 -13501 -10231 -11330 -10873 -3354 3876 11175 18023 23445 18859 19571 23231 17600 15794
671 15794 6925 6862 10448 11166 8188 11681 4952 4268 324 -46 -13069 -6172 -2444 -155 -13257 -21210
655 -21210 -15326 -5406 406 -3502 -7006 -7917 -9504 -6601 -3013 5573 4325 -2404 784 6636 15277
640 15277 12378 8835 7938 16054 15138 9294 5113 -4903 -5915 -4076 -224 -8100 -10588 -2821 9058
625 9058 12413 7114 5942 3104 2004 561 5784 -1177 -4313 -907 -4018 -5474 -2608 -6859 -8407
610 -8407 -14742 -8808 -1657 3816 4175 2265 -983 -4387 5631 9123 -1576 -6867 -4619 -13928 -11401
595 -11401 -8328 -11443 -7807 -2159 7890 4880 26 -196 -13215 -10842 -10819 -9188 -8700 -9738 -8202
580 -8202 -11401 -10803 -3350 -779 -8573 -8689 938 4380 5096 -914 -8315 -9867 708 4575 687 565
564 565 6755 15096 10701 2741 1674 10295 7198 3786 -568 -2993 1465 912 7753 10668 15630 13993
548 13993 8715 10888 5791 2053 5818 908 -5830 579 8566 16907 13407 11225 10302 3722 5179
533 5179 -635 -10860 -11741 -7257 -4791 5279 17681 28193 26323 18756 4664 -5952 -9476 -7242
519 -7242 -948 -663 2180 -1447 -8608 -8494 -2811 -5170 -9312 -11102 -11129 780 8164 5506 3464 5691
503 5691 -694 -7761 -13926 -9387 -6001 1052 5410 10760 5985 2380 -3804 -4223 1470 2296 -2319 -4798
487 -4798 4997 7396 -894 10340 21650 17209 8165 4756 6602 6691 15784 18184 16498 18711 26450
472 26450 29886 27163 20548 11264 8239 13425 16321 13928 16637 17264 12050 10963 8831 10076 6178
457 6178 3124 -3893 -546 1810 762 830 4059 566 -7368 2935 8876 14966 17448 11373 -638
442 -638 -431 -4397 1819 6864 298 4579 9137 6976 468 -11415 -6187 -683 -4907 -5069 -213 3485
426 3485 3379 -2545 -156 1126 -7214 -11104 -1085 -1457 -1407 6158 5629 -481 -5427 -7129 -5039 -4378
410 -4378 -8489 -14688 -7361 2493 2305 -904 -1321 -6187 -5440 -920 4567 6906 13217 9681 16367 15137
394 15137 76 6840 10502 10920 16239 18294 13690 12876 15393 11716 -2329 -14755 -8271 17 4830
379 4830 5515 7347 8181 3163 -1212 1965 1339 -820 -69 -1046 3092 8147 6708 1866 6584 12211
363 12211 5741 10258 6086 2480 5664 -1121 -5561 -2151 -3082 -5783 -4667 -3810 -3610 -3424 5850 6133
347 6133 2481 -2990 -12802 -13932 -6277 -3384 -5320 -11029 -10319 -1163 2223 1814 4387 7635 6346 10654
331 10654 9648 1840 6110 2698 2120 6992 7408 13884 12032 7229 2872 2165 6223 7949 3748 1234
315 1234 -3554 -1050 7049 12992 11528 7538 -1172 1098 12326 10598 4405 6058 4484 3915 1802
300 1802 1262 -5925 -6379 -669 4173 6019 9162 12223 12292 5223 6887 10973 6845 12383 3951 -17
284 -17 10675 12401 10634 14144 13445 7556 3380 6891 10213 11518 10234 3806 -2656 -919 1383 1298
268 1298 7374 9728 14371 21069 17832 5203 -1356 -5868 -5589 -1392 9713 3384 -1099 -840 -3891
253 -3891 -5460 467 -589 3096 1140 1010 789 -1786 1299 7217 10350 11163 6754 10234 7141 5568
237 5568 10439 9784 8245 8635 9336 14174 13777 1448 -7124 -15139 -13458 -3660 -8871 -13753 -8916 -8777
221 -8777 -6314 2109 7438 8168 -6185 722 7748 5705 5625 7557 8791 9524 930 -4061 -5649 -5530
205 -5530 -10231 -9435 -7576 -1261 5039 12384 8590 4611 3329 5235 6769 2708 1204 7955 7247 121
189 121 -2711 -1627 -2519 -5727 -7857 -1684 -950 -2567 5719 10289 6206 8102 5085 3424 -3037 -1149
173 -1149 5045 3928 2946 5016 5366 1025 -3885 -5658 -7843 -10255 -8290 -2353 -5586 -14634 -13465 -11462
157 -11462 -941 374 -3425 1021 7069 3402 496 1424 -273 6061 6823 7259 3407 4741 330
142 330 2933 5813 3828 3258 4902 -220 -2093 3805 8301 13207 14194 14018 14361 13173 10668 9888 8881
125 8881 9235 12722 10161 5807 8394 5070 2763 9630 13808 15587 23144 20320 15919 15264 8288 6836
109 6836 5624 9593 12652 6925 -1078 -2185 3920 1694 1312 5486 8961 5489 6064 1102 -470 3957
93 3957 5556 663 1896 7437 11449 4081 -3051 6226 13037 4845 2278 2952 -541 -3700 -5862 -6950
77 -6950 -3758 1208 6520 8194 3078 1151 1311 -820 573 1959 5965 13584 12578 9742 1844 -3097
61 -3097 -730 -4178 -5913 -8298 -8678 1126 5388 2146 4933 11597 11853 9036 8955 9393 9282 5519 -7446
44 -7446 -9469 -12919 -5245 -3906 -4371 11 5299 6279 3425 7698 11417 15279 19455 21727 18379 18084
28 18084 15516 12088 8476 1279 -2124 -3412 -2847 -1031 3031 6008 7654 9714 9736 10524 12320 6822
12 6822 7355 9217 7073 3107 -1803 -7166 -7651 -11128 -4972 -1622 2308 6089
0 6089
$$ Imaginary data points
##PAGE= N=2
##DATA TABLE= (X++(I..I)), XYDATA
32767 33678 37690 41038 41679 41204 41775 38415 36428 32772 42270 53252 54994 46082 53564 57912 59378
32752 59378 55861 61486 71035 71073 66123 63747 63091 69258 78301 92558 98299 92467 84585 81698 87178
32737 87178 91914 94002 95196 93178 91633 95140 105918 103801 102033 105887 107493 111886 109627 105038
32723 105038 103985 110137 114357 115774 116138 112855 114039 116707 116506 119527 122305 124376 126633 127403 135138
32708 135138 142566 143347 147290 144587 140749 145722 146403 139494 142244 143576 150532 159625 157057 158388 158962
32693 158962 166082 170154 166991 163675 161228 160143 165821 169459 175991 181002 179997 179015 179156 186824 188211
32678 188211 188177 190483 196220 195674 201357 208289 205079 203315 206534 211768 212941 212093 204712 200658 202361
32663 202361 214087 219545 219236 220104 225428 225543 224864 227168 230744 231310 232406 234256 236277 240741 239037
32648 239037 237513 238318 234276 232079 231054 232033 234402 242460 250733 252900 254888 264106 259565 249097
32634 249097 252950 263281 269347 278095 278057 275334 280669 287086 292034 290315 287757 288803 289621 287268 291625
32619 291625 293042 289978 283974 283418 286685 293653 292712 289919 293857 298722 301011 299616 292666 290739 299787
32604 299787 297417 298266 302545 306834 315640 320463 321460 322137 321122 317955 307128 318084 323381 322035
32590 322035 317819 319687 329436 329356 323931 329984 327019 325608 322870 326528 331960 337624 343471 355987
32576 355987 362173 350621 344557 351574 356845 354125 351801 349145 351396 354522 358541 361296 360576 358909
32562 358909 357771 358034 368169 369022 359631 360954 365085 372656 372505 369442 374757 380644 383215 382825 380311
32547 380311 376436 376401 374741 383121 393281 393119 391647 383052 390861 399857 402913 399442 406196 401269 402148
32532 402148 406480 410577 420149 415270 402996 400654 401274 404763 413066 410111 416288 417697 425870 427321
32518 427321 421608 423013 429818 433774 426137 418708 425266 428819 427717 427817 431074 432246 428623 426148
32504 426148 428732 430902 427731 428914 427723 428048 433749 433192 436316 449620 456645 449097 447808 455207
32490 455207 458255 459938 465890 464323 461615 463684 466362 464048 466281 469088 452418 451859 456956 461693
32476 461693 466450 470827 473270 468906 466996 478826 481710 483461 482797 488202 495013 493508 485187 479915
32462 479915 474602 473134 477093 477936 471624 471598 480624 484120 476078 480349 479627 478879 484435 489141 488345 487579
32446 487579 489033 491544 490388 497715 502621 494806 489534 486232 493366 492836 491176 496775 497828 504593
32432 504593 508000 511308 509318 500710 505595 508059 504779 511168 508201 508414 510428 505383 504931 507457 510342
32417 510342 506400 511252 509834 510238 516995 521290 525469 525258 520771 505904 502897 511831 520282 519304 528321
32402 528321 533142 524336 517685 528139 536498 537474 536238 536163 535101 536554 534437 531909 542409 544322
32388 544322 549338 553503 543917 543341 537907 531557 534211 525797 533214 546353 546548 542800 540400 538824
32374 538824 536042 540504 550318 542353 547950 552527 541532 538830 543026 545320 546895 540256 541779 543964
32360 543964 548460 552408 556714 546623 543783 546765 552666 554077 548281 544730 551552 557895 558869 562682
32346 562682 557506 560694 573643 570346 566255 556273 556052 562192 560770 559307 563851 567687 557858 550055
32332 550055 553658 558658 560157 561714 566558 573189 581227 582137 579261 577608 574321 574881 576824 578279 569097
32317 569097 567366 566553 567333 574561 572595 569408 578367 583642 577390 573120 567515 573789 584607 584244 574538
32302 574538 567761 568324 567433 574038 578079 577883 575616 573083 565836 569568 578988 581726 577161 582403 590822
32287 590822 589686 587334 581053 572347 566255 573568 584414 582173 572853 573100 575151 571313 575557 576077
32273 576077 585973 588949 585574 578452 579443 588105 598148 599854 604093 603014 608316 599058 596343 599992
32259 599992 597224 586555 582400 585287 576768 577044 582919 594518 603715 597338 595589 604613 611730 606572
32245 606572 599897 596764 597111 590460 576628 576134 590224 604018 601852 590408 585430 584452 588558 594257
32231 594257 595772 601637 602238 596346 591362 589148 594199 601299 603448 611370 603627 591609 585647 584325
32217 584325 586190 592000 600889 595502 588927 585260 580061 576925 581073 583444 581201 579563 588156 587175
32203 587175 582936 583720 582293 585429 589977 588661 585855 583712 578984 585935 599251 607552 605792 609314
32189 609314 603908 598732 593787 603461 604422 597022 596435 593373 596599 590050 593477 592984 590528 598423 599386
32174 599386 617940 619526 615801 610326 603202 605490 601222 605318 610080 610417 605351 606293 602403 594989
32160 594989 600491 602883 602520 603364 601776 591673 599088 601646 592073 594633 608880 602190 607800 609764
32146 609764 607386 601879 602026 591496 582682 585265 592995 592668 596262 598963 593976 582814 577855 590879
32132 590879 604910 599928 594558 591609 604111 607374 610132 616079 608979 601872 608449 615120 614140 609725
32118 609725 610729 612342 619947 628277 630724 628722 618594 627155 631707 626547 620498 618570 613617 609914
32104 609914 614038 616460 622200 616757 608503 607404 608440 625175 632973 631345 627007 622789 615332 609799
32090 609799 603719 601627 610365 599653 591527 594837 599004 604037 612670 614674 610680 612218 618634 617185
32076 617185 613360 609329 604270 608953 610204 608757 606018 606322 606921 607861 604064 606317 609163 615083 614463
32061 614463 609345 616690 619070 608694 608536 614148 613743 603754 603473 604043 606287 604102 603889 620271 625003
32046 625003 620976 615600 610493 607066 605873 609051 603331 609783 611917 609487 612289 611565 606509 603941
32032 603941 609494 601469 596147 595419 598304 592149 583788 586106 584280 592091 608894 613543 612248 612150 615415
32017 615415 609491 606972 605741 598419 595499 594068 595190 607664 618087 613935 612580 604241 603544 601602
32003 601602 597045 606139 605331 608832 613208 612946 610662 604010 608625 611720 613721 618533 620369 622096 618489
31988 618489 616702 615579 615624 609795 617067 614402 610744 596916 601904 606680 606506 610171 609909 614361 619278
31973 619278 626251 627216 608281 600638 602685 609094 623000 618073 615862 615971 618359 623744 620614 624773
31959 624773 626620 624052 621977 617184 616831 619644 621125 609338 608174 613534 613402 612165 607968 599980
31945 599980 606675 613548 601764 600371 602326 608697 621024 621665 617539 608280 604061 599877 607508 607148
31931 607148 611149 605358 596485 600414 615706 620631 609786 610374 609820 608965 611157 613130 617748 612976
31917 612976 610301 614442 620611 621797 626211 623016 617690 616767 614500 619875 612994 607295 610576 615173
31903 615173 616656 620684 611666 610555 613426 616395 633374 650988 641478 624117 605108 612941 614694
31890 614694 611276 606522 605311 606667 604772 607958 613397 606394 617039 622514 619749 623360 624872 622793
31876 622793 616878 612216 602936 604591 604127 597340 603324 613463 620248 615765 617044 622577 632518 643496
31862 643496 641060 633913 627466 625625 627961 620516 606587 600194 605303 619220 619125 618586 617850 609772 612384
31847 612384 609463 609456 606445 608980 608717 607938 609270 603321 600062 613472 627590 630839 633009 634019 636548
31832 636548 631291 620429 614087 612608 613535 619481 624553 625470 621613 612446 602354 604428 607979 615074
31818 615074 621421 626634 631460 629979 628731 628883 625454 625170 624549 624995 624506 626294 621645 612108 613043 620403
31802 620403 622808 626775 627981 628289 622707 618936 630433 642912 638980 628138 621482 628568 631294 631970
31788 631970 634115 630074 623653 619419 616819 616783 614513 613456 609631 609462 607461 610093 621121 627021 623881
31773 623881 620734 618777 621019 622638 624549 624065 617429 621036 620083 609288 611640 614058 620336 625907
31759 625907 628467 629410 627246 626069 615353 614683 616960 610319 609997 609560 619953 625072 623640 626373 641377
31744 641377 643601 633773 627429 627631 620714 618765 614878 619651 628984 624915 617470 612400 611635 622445
31730 622445 623629 626747 631928 622992 623698 623503 620835 623724 620486 623447 628023 633789 634296 631090 627472
31715 627472 628949 636788 631957 637549 636377 638970 637753 628036 626980 629503 630358 626865 624084 620617
31701 620617 627847 627398 621266 616158 617485 618091 619580 622010 624576 620861 621163 622544 627358 621582 623554
31686 623554 618812 614002 617608 619830 627611 618150 612300 613354 608906 616370 616660 612419 609204 608752 622282
31671 622282 625922 618818 615308 626994 635670 626045 611874 616859 629452 630460 636133 630820 630768 633302
31657 633302 637180 638391 641776 635459 624939 627543 626661 629458 627755 620608 627119 622435 617105 621140
31643 621140 622997 627903 619345 611156 620666 628965 640621 638607 632236 625876 623701 633960 635820 632470
31629 632470 625805 632341 639395 632021 629561 635721 636013 636958 637642 645186 648484 634520 623328 611962
31615 611962 607822 615249 615880 610235 612625 622049 625429 624578 633863 632925 629453 628895 625394 623206 638182
31600 638182 637835 623980 615248 613687 610364 607537 603225 615527 628866 631989 630088 623424 623827 630641
31586 630641 628912 631540 635031 633071 621474 605746 604080 620362 636211 636846 633411 630220 626056
31573 626056 635581 635195 621619 615500 621536 626108 622746 614547 622973 618530 614129 611236 616993 627550
31559 627550 621994 614903 615584 620958 619569 610996 610126 614530 607707 604329 600544 610537 630974 632599
31545 632599 615999 610744 615760 612104 609293 617288 622313 622738 637125 640549 627339 622068 626080 620678
31531 620678 622560 622767 624300 622501 622656 628331 633319 633305 632428 629443 626929 628438 624125 620091 619407 616229
31515 616229 609226 615364 622501 621940 620119 627307 627964 623522 617884 623353 626244 617355 613406 615291 624687
31500 624687 623495 616643 619522 619314 619764 619847 622136 625202 617034 612576 612660 620988 627743 628155 623958 628540
31484 628540 621901 618230 621364 629576 631945 632581 629658 624564 620872 625027 636016 643904 639246 635340
31470 635340 635024 639759 642685 635023 638957 625773 612284 617777 619126 616283 614250 614104 609026 612786
31456 612786 623689 632426 622745 621247 615681 617363 620180 625512 633739 636686 625722 615698 616491 613335
31442 613335 607955 613519 622373 631946 637579 639513 640633 634624 619334 628663 635253 639831 643350 638199
31428 638199 634587 630318 627931 629011 633354 639487 630704 630029 632168 638067 638462 637308 643321 645161 636535
31413 636535 639420 642168 635804 630758 629613 634251 638358 632655 634174 636596 634189 634555 641040 636510
31399 636510 625426 627651 628378 628608 623103 628015 630033 630814 631825 631728 632885 632848 631341 645157 647742
31384 647742 643676 641977 638875 645147 643888 637024 644718 640542 635337 625532 635837 634530 636042 636983
31370 636983 636388 639104 640832 635196 627900 626068 624229 633152 636603 637432 638147 633425 634629 636884 640415
31355 640415 642123 638670 631180 625742 634501 638264 632950 624158 628996 634319 633772 638827 635787 639359
31341 639359 636928 635251 630977 625679 613832 607616 611082 617288 623239 615343 608720 617022 637549 640651
31327 640651 636726 639044 637780 640701 632435 629258 630871 628917 630947 614325 608009 610515 617005 621769
31313 621769 619366 614816 619039 625989 639106 640686 634574 641000 643894 642235 647157 642014 644426 644121
31299 644121 641762 640300 634542 635157 635643 632997 628274 626891 631429 637182 638100 629544 626708 628487 627308
31284 627308 621474 613802 614324 611855 616836 628630 637174 632052 627541 626002 622445 627622 627245 623194
31270 623194 635515 643686 643192 650790 650253 637508 626060 626847 629956 628413 630703 628970 633559 631785
31256 631785 634183 640693 641240 635174 627446 637158 647858 641891 641750 644123 640897 645793 640057 628100
31242 628100 623851 636193 643200 643109 648897 645297 631835 631915 633889 631859 638686 637753 636234 641798 639810
31227 639810 628800 626616 626918 632826 636039 633310 628814 629614 630357 623875 628713 633279 631692 627435 625069
31212 625069 639672 650087 639373 618875 608002 605807 613950 627261 636719 634961 628436 631645 635118
31199 635118 629163 628501 630047 639094 635966 633390 639751 641182 646246 645877 641957 640219 643195 643399 644985
31184 644985 633414 626495 626024 632275 644001 645132 644777 650231 654696 645512 634072 635813 634534 632053
31170 632053 632303 624671 625849 637816 641623 643131 637109 629912 634069 635040 627859 627790 631440 629671 634862
31155 634862 639398 640445 635994 644844 649425 645313 649478 657996 654983 645544 652925 657743 653564 655537
31141 655537 662375 662828 658424 648290 644124 633252 626901 628661 623757 629846 642433 642681 648457 652622
31127 652622 652394 645869 648222 653463 651344 646463 648629 655426 647161 633648 627221 623005 615829 623501
31113 623501 635856 631654 636981 634323 632131 630653 626294 623884 629212 642495 641560 637899 636120 632556
31099 632556 620598 632042 643255 646995 649758 647865 651537 645183 650846 649502 641993 630287 634343
31086 634343 642832 644902 645691 644835 640899 630134 631555 638178 643939 645778 639655 636615 634333 633355 634167
31071 634167 632430 626363 630165 643797 644239 642908 643840 643981 641834 635737 643698 640363 633269 634015 637562
31056 637562 646462 654081 644108 634869 639965 640838 646458 651657 654339 656737 648531 647594 647506 643568 639112
31041 639112 636702 636963 645611 640566 650251 651168 648953 641762 639348 649586 651878 646505 647747 644020
31027 644020 642264 645492 650593 647557 633940 630000 637702 650279 646874 637314 633622 632529 631368 642228
31013 642228 644368 645751 643849 645539 651297 654758 649491 651421 657585 662815 651928 650577 655527 650688
30999 650688 656424 662979 650766 640710 645645 652687 648268 651592 651350 643875 637342 633922 646576 646006
30985 646006 641802 641162 641352 649554 647029 637950 631752 636609 644123 642730 641868 650746 653382 650123 639708
30970 639708 637486 630540 634325 650626 656142 646524 640321 633530 637103 648731 652970 652129 646185 650613
30956 650613 659600 646032 633968 622972 628944 630156 632322 631215 631718 641149 649891 656499 669715
30943 669715 665938 661797 664465 653561 644405 640227 649928 643338 648390 646271 641939 644552 647116 645988
30929 645988 652870 656665 657296 655435 657002 653798 645083 644671 648472 651874 647909 652574 648207 652272 652543
30914 652543 637578 626345 627310 643749 648659 640130 644955 649423 643118 636996 639872 636700 627811 630353
30900 630353 634574 640712 635623 629825 631099 630773 632610 642641 644309 643536 644395 638665 638732 648677 651933
30885 651933 645548 646038 654243 652731 649694 646472 648008 645974 638882 624729 629657 638992 633763 637201
30871 637201 648558 645367 642602 640648 643449 647927 668151 665626 652226 654270 659349 660106 651436 655870
30857 655870 645525 643552 644871 645094 650062 653153 655089 660931 660804 651162 646978 647186 656629 657191 644167
30842 644167 641960 645574 644742 648188 655161 648342 633552 637180 649624 647974 646636 651192 655535 655506
30828 655506 648876 638337 639083 638711 634003 646832 653885 656983 652908 645451 636558 632200 638627 649310
30814 649310 648536 646779 642549 639914 655513 662433 660843 656381 658229 660804 654151 647077 647706 658857
30800 658857 667620 669533 664012 665752 664908 669380 662151 663841 666576 663120 663880 658105 652246 648783 653612
30785 653612 647843 644092 652559 654706 655508 654026 651365 651177 653683 656921 653362 646731 645694 654578 652328
30770 652328 650997 649199 654842 649145 656681 656981 658581 664876 668733 657185 656253 656075 657314 662906 661442
30755 661442 664071 662300 664227 655549 647940 659577 670412 671906 671621 663826 656058 661581 658306 658417
30741 658417 659895 665274 660287 653727 654043 655844 658806 659095 656456 650241 656984 670559 672656 671546
30727 671546 662200 658594 650455 641413 637596 636999 641534 648329 654710 660374 662122 657909 657301 661678 658405
30712 658405 656597 660574 657155 656093 658973 655366 645472 640350 639063 638058 635835 637905 644544 647222
30698 647222 646456 639082 636778 634777 635379 640814 644926 653997 659876 665830 663996 659358 658092 661109 666410
30683 666410 666025 664869 665701 658257 650387 638843 644684 644060 647241 649186 657323 665906 663861 658661 659723
30668 659723 659490 660007 660735 653000 647594 650962 661057 659094 659591 653359 652434 655935 655797 661928 661763 653074
30652 653074 642644 652964 655246 650657 652688 654019 645572 647538 639550 632249 634268 642534 642395 647661
30638 647661 654130 652015 638774 634703 621430 622128 640703 648769 652398 655123 659350 658374 653459 647934
30624 647934 644075 646011 647151 641398 639129 639015 638270 634734 639906 655521 655151 658503 666418 666081 661210
30609 661210 660939 662206 659596 657725 665830 678491 676848 665942 664802 665768 663035 658556 664977 655632
30595 655632 645054 636800 640783 647584 646227 656793 669144 672651 666860 661695 662483 651424 644093
30582 644093 651860 658593 660071 661853 662785 657386 657502 655775 659352 660932 655412 657294 651028 656815 665667
30567 665667 665377 664929 662690 664602 669300 669580 662218 666325 661510 658062 652326 649764 653247 650850 646526
30552 646526 653818 657439 655411 656798 653392 651532 657797 663812 666390 661506 659689 655761 660387 659558
30538 659558 654914 661015 667150 664307 668289 674022 677653 679822 680833 675903 663308 650711 639821
30525 639821 637826 641885 647553 649552 641506 647880 656289 657994 654270 657946 651037 661501 671278 671719
30511 671719 671308 670269 661670 665774 669749 666574 663524 664020 654122 651632 653338 646330 643867 651764 664214
30496 664214 668583 666000 656495 653693 657192 656392 649792 648571 648209 662074 677406 673592 670086 667984
30482 667984 656784 650096 640071 636143 637422 645140 652465 654285 656006 654371 655481 658650 654918 652836
30468 652836 652614 646631 641189 644265 650209 655025 666784 674976 679293 675456 668913 657672 651748 659848
30454 659848 674797 685498 683492 673524 662267 652273 664953 658293 639038 636301 650843 653671 658508
30441 658508 660377 653273 650805 654066 654696 653166 640801 652865 661509 654395 645555 649764 653884 653305
30427 653305 651949 652430 659145 663994 669429 656148 657047 665450 663535 669473 673082 667213 674057 668582
30413 668582 663333 671559 673685 664848 663322 668284 668145 652547 648355 651406 649482 648376 654267 658260
30399 658260 661971 660577 662987 671526 668217 663555 664733 672178 676109 671902 672008 670482 664709 661286
30385 661286 658344 661847 662386 655800 655919 662251 666340 662675 657216 660249 660561 655343 653223 662252 662393
30370 662393 662553 673788 665973 662896 660922 658836 650326 655862 659840 664771 663209 658348 657994 660761
30356 660761 656679 660377 663762 656239 649309 651673 657162 660900 651013 647974 659938 672075 681149 682740
30342 682740 674456 665677 663216 657405 653809 652568 657043 664461 667197 669073 665550 661505 652037 654635
30328 654635 662785 664491 661305 665607 677861 679168 678615 674278 666775 666606 666221 668573 675506 664580
30314 664580 655380 652449 651340 658740 665301 671667 667559 661208 662706 665609 666076 667897 669555 663898
30300 663898 655932 647935 656722 657703 659156 667794 665882 667785 669182 668950 669647 674446 681833 685087 680472
30285 680472 669480 660230 653715 657377 665047 659700 661464 668040 669914 668805 665846 656624 660628 666644
30271 666644 672228 671789 668459 671771 677857 684299 678308 667972 666342 668046 666272 661034 653404 656063
30257 656063 653766 651552 657048 664230 661740 663356 661341 668037 675357 675930 670236 665640 676371 671301
30243 671301 666193 665960 662150 658568 671294 671796 667169 672164 668982 663301 664478 673115 670071 662698
30229 662698 665030 661281 662195 665041 665408 651747 655698 659872 667032 665725 676397 682052 668173 656995
30215 656995 661168 669786 669213 663497 655591 658650 668730 664996 665876 668287 665802 663813 663031 669304 669985
30200 669985 671211 669239 667665 671917 682386 681939 679513 669168 662002 664161 669126 667602 673192 671918
30186 671918 665697 668505 665095 661457 666721 665946 658797 653798 656895 664587 662478 649943 648459 662434
30172 662434 667468 661976 647874 646494 660614 666773 663606 661495 658679 648521 653224 663270 669701
30159 669701 672767 672902 679554 683104 679807 681192 674954 678743 679653 677962 676035 679749 667661 674755
30145 674755 675232 675979 674422 669278 666499 660739 661694 663848 656422 657632 659860 671988 676251 670485 680560
30130 680560 686565 687997 681031 677904 669654 672231 673086 671230 667634 658774 659457 665285 666882 663944 664194
30115 664194 663879 665202 667504 674593 673838 666622 654479 654813 669344 672903 668168 666854 665554 658782
30101 658782 661944 668778 675156 684480 688345 686391 684998 684702 678638 678455 693987 698575 690215 680007
30087 680007 681720 680391 672274 661823 656565 661454 663455 664645 669973 670739 667847 667215 669008 676645
30073 676645 684843 682800 675000 682103 680951 674726 674831 668010 664249 664086 669016 665247 660978 662935 668964
30058 668964 672120 678618 682667 675686 671702 668117 668353 671318 673043 683092 691571 682780 681585 686938
30044 686938 688833 685057 680369 683654 688724 687269 675474 661034 665533 663534 670685 669377 659112
30031 659112 656360 669025 664500 668627 685362 680171 681904 687192 682986 673407 664159 666858 672853 676990
30017 676990 692699 694651 673163 669258 670636 675168 681518 680615 679455 679320 669581 669448 687586 686546
30003 686546 682487 673273 666794 670241 681834 684016 684655 679948 673831 668067 668968 687812 688830 684709
29989 684709 680287 683290 685588 687925 690818 691625 697611 698395 691317 678394 670023 661619 665762 673367
29975 673367 675056 677935 675491 674257 672541 665635 669309 674471 677928 676663 676518 673810 659425 656916
29961 656916 667768 677500 673921 667092 668530 676284 676388 668346 657569 660970 674188 679662 677529 682071
29947 682071 677627 675019 667077 652044 661413 672358 674515 677276 672146 660813 667230 671490 667929
29934 667929 674845 679819 676264 669989 675750 675579 686533 690071 684069 669259 659917 670662 689977
29921 689977 704501 698194 685947 690558 689367 690393 694634 690049 683359 682289 683343 670568 663735
29908 663735 670539 675362 675655 678852 695937 699643 689951 687509 682384 684340 687687 690126 687290 684640
29894 684640 681788 687675 691553 685689 671448 664991 672610 673722 670734 680530 683759 689842 686576 676783
29880 676783 671687 683476 692053 684933 681552 684496 685668 682564 687757 686934 679890 671057 678800 686611
29866 686611 695236 693454 694101 693082 689643 688114 679055 678614 674005 671332 666524 663307 663986 667045 676917
29851 676917 678738 681198 679782 679873 679821 681064 684879 685852 673126 659780 662074 663141 663347 665209 671360
29836 671360 673475 673440 675532 681062 682645 684360 698538 703450 691998 677767 671243 670256 676549 686693
29822 686693 688388 678428 671779 690342 699163 697365 693673 693862 694207 689102 682017 681512 689394 692537 695997
29807 695997 705266 707784 695502 682336 685918 686559 681966 678703 678048 682985 686829 690076 687129 679775
29793 679775 677210 679545 686881 686543 679251 683922 709955 708434 705499 707005 699495 698082 698040 687781
29779 687781 673007 669260 670187 670042 669526 667454 673301 667189 678561 685783 692502 691435 700960 706968
29765 706968 693870 681796 679411 683761 687766 692261 694694 687118 694671 692473 686270 691885 695081 692601
29751 692601 685381 681570 687140 692214 685793 686765 688752 682914 679053 686046 692609 696524 690187 693118
29737 693118 695500 693217 695527 696132 687837 688798 686127 688533 688753 679647 676868 683861 689294 690378 693888
29722 693888 694162 691329 685261 682620 674134 671118 672444 684938 691249 688199 685340 681172 676522 680598
29708 680598 689286 696155 699689 696457 689140 689123 696847 708318 704908 704249 692852 688341 689570 695759
29694 695759 710025 711876 700668 703634 701903 693068 687694 681139 682870 680068 682582 684371 690572 692118
29680 692118 686652 680029 671316 672551 677703 682103 687276 683292 681448 677506 668680 662011 670959 682198
29666 682198 674699 678051 679407 677272 675899 678462 683669 689852 691031 684771 686292 693827 692798 693181
29652 693181 707310 716807 709979 698564 690789 688441 684960 677935 677270 686150 684256 677856 675852 679826
29638 679826 680638 674387 677214 687500 693357 691706 693457 693345 709217 703017 690594 687580 691174 693408
29624 693408 698662 696437 692200 684563 687564 688778 679207 677127 690681 715846 710597 685654 674350
29611 674350 680507 686133 682823 672416 677391 686034 688067 680842 672460 672422 685011 694550 693507 698390
29597 698390 692419 686951 690882 689715 696883 704238 698857 683775 679756 697303 696739 692333 696664 689504
29583 689504 693306 690399 693471 696725 697567 691664 688423 689826 694192 695534 696182 696710 694765 686930 681769
$$ [...]
##END NTUPLES=NMR SPECTRUM
##END=
