##TITLE=Analysis number 312329
Compound Code cc 24323
Book Reference 147/60
Project Code adrs
Chemist Name chrisr
##JCAMPDX= 6.0         $$ Bruker NMR JCAMP-DX V2.0
##DATA TYPE= NMR SPECTRUM
##DATA CLASS= NTUPLES
##ORIGIN= Bruker BioSpin GmbH
##OWNER= NMR
$$ XWIN-NMR		Version 3.5
$$ Mon Aug  1 14:07:50 2005 GMT Daylight Time (UT+1h)  MAYBRIDGE\NMR@NMR_250MHZ
##.OBSERVE FREQUENCY= 250.131544655141
##.OBSERVE NUCLEUS= ^1H
##.ACQUISITION MODE= SIMULTANEOUS (DQD)
##.ACQUISITION SCHEME= undefined
##.AVERAGES= 16
##.DIGITISER RES= 18
##SPECTROMETER/DATA SYSTEM= dpx250
##.PULSE SEQUENCE= zg30
##.SOLVENT NAME= CDCl3
##.SHIFT REFERENCE= (INTERNAL, CDCl3, 0, 16.522)
##AUDIT TRAIL= $$ (NUMBER, WHEN, WHO, WHERE, WHAT)
$$ ##TITLE= Audit trail, XWIN-NMR		Version 3.5
$$ ##JCAMPDX= 5.01
$$ ##ORIGIN= Bruker BioSpin GmbH
$$ ##OWNER= NMR
$$ C:\u/data/dgb/nmr/ADRS/6990/pdata/1/auditp.txt
$$ ##AUDIT TRAIL=  $$ (NUMBER, WHEN, WHO, WHERE, WHAT)
(   1,<2005-08-01 14:07:31.82 +100>,<MAYBRIDGE\NMR>,<NMR_250MHZ>,
      <created by zg, POWCHK disabled, PULCHK disabled
       configuration hash MD5:
       62 19 C7 07 E1 42 D1 B7 37 6C 3D D0 77 39 F9 E6
       data hash MD5: 64K
       69 55 8A FB 5F 9C C2 92 04 C6 73 6A D3 59 35 C9>)
(   2,<2005-08-01 14:07:42.12 +100>,<MAYBRIDGE\NMR>,<NMR_250MHZ>,
      <Start of raw data processing
       ef LB = 0.3 FT_mod = 6 PKNL = 1 SI = 32K 
       data hash MD5: 32K
       BF 3B 89 82 65 5A 61 03 A5 D5 86 14 7F F9 A1 C0>)
(   3,<2005-08-01 14:07:43.85 +100>,<MAYBRIDGE\NMR>,<NMR_250MHZ>,
      <apk 
       data hash MD5: 32K
       15 A1 78 79 B2 CE 9B BF DC 43 AC 8D CC 45 8B A8>)
(   4,<2005-08-01 14:07:44.53 +100>,<MAYBRIDGE\NMR>,<NMR_250MHZ>,
      <abs ABSG = 5 
       data hash MD5: 32K
       06 E7 1E 8C 91 3D F5 D9 2B E8 5F 64 13 67 0D 7B>)
$$ ##END=
$$ 
$$ hash MD5
$$ 82 5F 99 01 5F 18 B7 2A E2 92 5B F2 88 3B 11 30
##$RELAX= 
##$RELAX= 
##$RELAX= 
##$RELAX= 
##$RELAX= 
##$RELAX= 
##$RELAX= 
$$ Bruker specific parameters
$$ --------------------------
##$DU= <C:\u>
##$EXPNO= 6990
##$NAME= <ADRS>
##$PROCNO= 1
##$TYPE= <nmr>
##$USER= <dgb>
##$AMP= (0..31)
100 100 100 100 100 100 100 100 100 100 100 100 100 100 100 100 100 100 
100 100 100 100 100 100 100 100 100 100 100 100 100 100 
##$AQSEQ= 0
##$AQ_mod= 3
##$AUNM= <au_zg>
##$AUTOPOS= <36 >
##$BF1= 250.13
##$BF2= 250.13
##$BF3= 250.13
##$BF4= 250.13
##$BF5= 500.13
##$BF6= 500.13
##$BF7= 500.13
##$BF8= 500.13
##$BYTORDA= 1
##$CFDGTYP= 0
##$CFRGTYP= 5
##$CHEMSTR= <none>
##$CNST= (0..31)
1 1 145 1 1 1 1 1 1 1 1 1 1 1 1 1 1 1 1 1 1 1 1 1 1 1 1 1 1 1 1 1 
##$CPDPRG= <>
##$CPDPRG1= <>
##$CPDPRG2= <>
##$CPDPRG3= <>
##$CPDPRG4= <mlev>
##$CPDPRG5= <mlev>
##$CPDPRG6= <mlev>
##$CPDPRG7= <mlev>
##$CPDPRG8= <mlev>
##$CPDPRGB= <>
##$CPDPRGT= <>
##$D= (0..31)
0 1 0 0 0 0 0 0 0 0.06 0 0 0 0 0 0 0.0002 0 0 0 0 0 0 0 0 0 0 0 0 0 0 
0 
##$DATE= 1122901650
##$DBL= (0..7)
120 120 120 120 120 120 120 120 
##$DBP= (0..7)
150 150 150 150 150 150 150 150 
##$DBP07= 0
##$DBPNAM0= <>
##$DBPNAM1= <>
$$ [...]
##$SUBNAM7= <"">
##$SUBNAM8= <"">
##$SUBNAM9= <"">
##$SW= 20.6930455092707
##$SWIBOX= (0..15)
0 0 3 0 0 0 0 0 0 0 0 0 0 0 0 0 
##$SW_h= 5175.983436853
##$TD= 65536
##$TD0= 1
##$TE= 295.16
##$TE2= 300
##$TE3= 300
##$TEG= 300
##$TL= (0..7)
0 120 120 120 120 120 120 120 
##$TP= (0..7)
150 150 150 150 150 150 150 150 
##$TP07= 0
##$TPNAME0= <>
##$TPNAME1= <>
##$TPNAME2= <>
##$TPNAME3= <>
##$TPNAME4= <>
##$TPNAME5= <>
##$TPNAME6= <>
##$TPNAME7= <>
##$TPOAL= (0..7)
0.5 0.5 0.5 0.5 0.5 0.5 0.5 0.5 
##$TPOFFS= (0..7)
0 0 0 0 0 0 0 0 
##$TUNHIN= 0
##$TUNHOUT= 0
##$TUNXOUT= 0
##$USERA1= <user>
##$USERA2= <user>
##$USERA3= <user>
##$USERA4= <user>
##$USERA5= <user>
##$V9= 5
##$VALIST= <valist>
##$VCLIST= <CCCCCCCCCCCCCCC>
##$VD= 0
##$VDLIST= <DDDDDDDDDDDDDDD>
##$VPLIST= <PPPPPPPPPPPPPPP>
##$VTLIST= <TTTTTTTTTTTTTTT>
##$WBST= 1024
##$WBSW= 4
##$XGAIN= (0..3)
0 0 0 0 
##$XL= 0
##$YL= 0
##$YMAX_a= 407304
##$YMIN_a= -403902
##$ZGOPTNS= <>
##$ZL1= 120
##$ZL2= 120
##$ZL3= 120
##$ZL4= 120
##$ABSF1= 16.522
##$ABSF2= -4.171173
##$ABSG= 5
##$ABSL= 3
##$ALPHA= 0
##$AQORDER= 0
##$ASSFAC= 0
##$ASSFACI= 0
##$ASSFACX= 0
##$ASSWID= 0
##$AUNMP= <proc_1d>
##$AZFE= 0.1
##$AZFW= 0.1
##$BCFW= 0
##$BC_mod= 0
##$BYTORDP= 0
##$COROFFS= 0
##$CY= 12.5
##$DATMOD= 1
##$DC= 0
##$DFILT= <>
##$DTYPP= 0
##$F1P= 14.0000005364418
##$F2P= -0.99999901652339
##$FCOR= 0.5
##$FTSIZE= 32768
##$FT_mod= 6
##$GAMMA= 0
##$GB= 0
##$INTBC= 1
##$INTSCL= 1
##$ISEN= 128
##$LB= 0.3
##$LEV0= 0
##$LPBIN= 0
##$MAXI= 10000
##$MC2= 0
##$MEAN= 0
##$ME_mod= 0
##$MI= 0
##$NCOEF= 0
##$NC_proc= -4
##$NLEV= 6
##$NOISF1= 0
##$NOISF2= 0
##$NSP= 0
##$NTH_PI= 0
##$NZP= 0
##$OFFSET= 16.522
##$PC= 1
##$PHC0= 129.2678
##$PHC1= 6.161195
##$PH_mod= 1
##$PKNL= yes
##$PPARMOD= 0
##$PSCAL= 4
##$PSIGN= 0
##$REVERSE= no
##$SF= 250.13
##$SI= 32768
##$SIGF1= 0
##$SIGF2= 0
##$SINO= 400
##$SIOLD= 32768
##$SREGLST= <1H.CDCl3>
##$SSB= 0
##$STSI= 32768
##$STSR= 0
##$SW_p= 5175.98343685301
##$SYMM= 0
##$S_DEV= 0
##$TDeff= 65536
##$TDoff= 0
##$TI= <Analysis number 999999
Compound Code 99
Book Reference 9
Project Code 9>
##$TILT= no
##$TM1= 0
##$TM2= 0
##$TOPLEV= 0
##$USERP1= <user>
##$USERP2= <user>
##$USERP3= <user>
##$USERP4= <user>
##$USERP5= <user>
##$WDW= 1
##$XDIM= 32768
##$YMAX_p= 329856249
##$YMIN_p= -56923
$$ End of Bruker specific parameters
$$ ---------------------------------
##NTUPLES= NMR SPECTRUM
##VAR_NAME=  FREQUENCY,     SPECTRUM/REAL,   SPECTRUM/IMAG
##SYMBOL=    X,             R,               I
##VAR_TYPE=  INDEPENDENT,   DEPENDENT,       DEPENDENT
##VAR_FORM=  AFFN,          ASDF,            ASDF
##VAR_DIM=   32768,         32768,           32768
##UNITS=     HZ,            ARBITRARY UNITS, ARBITRARY UNITS
##FACTOR=    0.157963299565203, 1,           1
##FIRST=     4132.6476996994, 0,             0
##LAST=      -1043.33573715361, 0,           0
##MIN=       -1043.33573715361, -56923,      0
##MAX=       4132.6476996994, 329856249,     0
$$ Real data points
##PAGE= N=1
##DATA TABLE= (X++(R..R)), XYDATA
$$ [...]
14482G563o548q245M81l117K504J375J882n878N987m860l101J343L96j2560J8672
14467d106J7406k99j0007M999n077j0528j363l034K848Q236J0060n307J006l605
14453A229o38p654o025M431L567Q791K193j5496o14J0641L408P4n763j4445k323
14438a8624R871K1260j1911K13J534K776o659j479m57P533J0854o796j2942o473
14424a1300j2923k944m710O622J4662K3870K733k253k283N223L884j1374j0688
14411a481L315Q470J1384m231r541k313J867k643p187p932m584n146J2362j713
14397i373j7227m517J732N045R175K895n458J2808P276j0471N915m972l564J224
14383i512j749j0665L691J5099m87r799N368J4684j0190r565L286Q061P292M57
$$ y = [7563, 1015, -7230, -6749, -9866, -7362, -5987, -4105, -9983, -3996, -8856, -11957, -10614, -10218, -22778, -4106, 13300, 13001, 2994, 7993, 2916, -7612, -8975, -12009, -9161, -925, 9135, 3828, 4834, 1229, 591, -7063, -13088, -8657, -5090, 3701, 5894, -9602, -10216, 425, 3833, 3907, -1856, -16301, -18624, -8753, 12507, 596, 809, 2343, 5119, -1540, -3019, -3476, 4057, 14911, 8115, -4827, -11300, -24223, -27167, -31877, -25255, -10593, 13277, 16010, 13757, 11474, 16697, 20581, 9207, -1481, 1834, 10304, 21688, 17457, 7916, 5603, 7470, 4827, -2360, -10292, -14876, -20022, -7660, -9373, -26600, -31117, -29385, -24340, -15165, -12270, -17728, -4920, 2356, -8115, -2200, -7172, -10736, -9512, -11261, -21926, -18235, -3136, -3623, -13422, -8054, 6630, -3560, -13125, -9839, -1778, 5514, 5971]
14369E971Q108P437j1155j1639k682m082M222L511p272j659L74j3935K875j131
14355b1057J4596Q312L961j8133j1203R556J7682J360n517l306k0633L87r23L732
14341b1186q16J1630J2087J006p53r828K740J571Q335k423k687q501o093k564
14327a7482J4762R217r193j4498N39N800j117P20K832R062l972J476q813J143
14313i524J3026N894J1673j033j5340j3045m544j564p08J1100Kj728L069L477
14299G55n544j8247N032R559j234l465o41J987J956J180M941O952k198j1028R101
14284h94N656q914N767q0k6723n462Q503K779k055j0575L373J3054M797o784N722
14269a1836N896J8686J49o447n224J264m104l408L968J002p192L16L935o123n374
$$ y = [5971, 14079, 21516, 10361, -1278, -3960, -8042, -3820, -309, -7581, -9240, -8866, -22801, -19926, -21057, -6461, 1851, 5812, -12321, -23524, -13968, 3714, 5074, -443, -3749, -24382, -23995, -24918, -21186, -22002, -10372, 1715, 2721, 1968, -7860, -5120, -3549, 4786, 2363, -324, -8825, -14918, -17482, -2720, 6497, -2696, -17194, -16655, -10855, -11972, -11252, -8420, 642, -3330, -1854, -10667, -9524, 3502, 9396, 21069, 20036, 4696, -8349, -12893, -14457, -15165, -4065, -4063, -5791, -2722, 755, -4789, -23036, -18004, -8445, -9679, -13144, -13785, -11798, -9842, -8662, -3721, 3231, 1033, -9995, -894, 4762, -4152, 1615, 1535, -25188, -30650, -22147, -19368, -21423, -31998, -28625, -15571, -10774, -17558, -11836, -5940, 12746, 12895, 6448, 1224, 2488, -1616, -5024, -1056, -54, -7246, -6930, -2995, -9118, -14492]
14254a4492L061K032J1844J317m206o132J377L545J5774j3977r304O310O877J269
14240E295p653k995J1028P399r563m13R926l022O736r118p625Q946L974J348j5632
14225a369K111J2448j4926o953j527J1834k362n567q598Q245K0111M577k947l274
14211A1803r769N196O021J070O10j5079L589O680j862q441p44M849n549r341J3244
14196B277R116J1023M053L438o890m849J940l8n306k798J0146N241k200r967l364
14181A1822L952Q448K933J645q669k1808j206P992P475O852L778o127J5566J6307
14167D8960j814q214j0589L11m340n254k120k605j0096o885K110O410Q215n231
14153H858k49Q483J0492l598o375l101M047l307k4721l462J1088K656K564M360
$$ y = [-14492, -11431, -9399, 2445, 3762, -444, -6576, -5199, -1654, 14120, 143, -9161, -2851, 4026, 5295, -2358, -5353, 5675, 13074, 3511, 3098, 13024, 10002, 16738, 7620, -5, 8941, 12915, 14263, -1369, 742, 13190, -1736, -8689, -10216, 1618, -744, -6311, -14909, -6664, 13447, 18024, 15077, 11803, 2034, 7230, 13251, 14321, 14931, -148, 3441, 10121, 8259, -182, -926, 3923, -1626, -10967, 2277, 11393, 22416, 26469, 29907, 23017, 18168, 20108, 20070, 14764, 11966, 22112, 27353, 25153, 15186, 11822, 15774, 24222, 27155, 28800, 20131, -1677, -2883, 5109, 12584, 19436, 23214, 17087, 32653, 48960, 47146, 38932, 28343, 28654, 24314, 19060, 16940, 14335, 4239, -2646, -536, 5874, 14089, 8858, 8609, 17092, 27584, 23986, 17611, 14510, 18557, 15250, -9471, -12933, -1845, 811, 3375, 7735]
14139G735k930l016O208j2680r12R108m618L168J442P604n539q836J2369J1204
14125B0307j203o565K910N692O944o085j6472L824k178R103P34m099N340k212
14111A6040R592N679o802q813k72k191k100p348n063N544K500P639n558N371Q316
14096B2534J376N476m876q011P668K387m666K2158J62j3550j937q357L504o072
14082A7796l109J833j3472N932N930M002M658L333j1018m95J0262J2293M935j3689
14068B9191j0313p795K22K949J1811Q017m271P954P816j3174q058P335l116j2318
14054A6250o15k276J0823Q495o541J89k0319j753J8224J2253Q952j2458j1407
14041A9817N048J0809J2624k885r078q736p248l132J2651n224j8140R1r44J3994
$$ y = [7735, 4805, 1789, 7997, -4683, -5595, 3513, -1105, 2063, 3505, 11109, 5570, -3266, 9103, 20307, 19104, 12539, 15449, 21141, 28085, 22000, 5528, 9352, 7174, 16277, 17011, 12912, 18252, 16040, 25632, 31311, 24509, 15696, 15424, 13233, 11133, 3785, -1278, 4266, 6766, 14405, 8847, 14218, 22534, 23910, 29386, 24510, 16499, 24167, 26554, 21888, 44046, 44208, 30658, 28721, 20364, 23868, 17796, 14687, 16520, 3048, 8980, 14910, 18912, 23570, 26903, 15885, 15390, 25652, 37945, 42880, 29191, 18878, 11083, 11305, 14254, 26065, 34082, 29811, 37765, 45581, 32407, 24349, 31684, 28568, 16250, 15635, 13359, 24182, 32677, 26136, 26325, 6006, 4253, 22477, 34730, 43682, 31224, 19817, 24865, 35674, 48298, 45413, 36335, 27599, 20351, 17219, 29870, 24646, 6506, 6597, 5653, 19647]
14027A9647J6914J2054K828l421o756M639Q965J469K2902L9721P3325O9588K4268
14014B86143q752k0013l6746k5239m1096k6129j3029k4232k7123j5730N429j500
14002E1983J19Q926n108n769R1j656o211j1844N499J7407j0763k831K2282Q160
13988G0285J0441J8342q228J75J29J576p184J1545J1418J1006K1344K5505L6931
13975B03285M6363O8632J04928J67890J85342J09303k4098q2279r4609j06577
13965E78180j05169j07027q8003m4566m6358k4771k9672j8575r462q373p457K71
13953H9018q271j2030n753l652J2365p873M836P676q013j1353m866p577j4744
13940B9763R754L28o076R941L0691K3421N227J2500K7947L9867M3372P9912J06655
$$ y = [19647, 36561, 48615, 51443, 48022, 41266, 45905, 54870, 56339, 79241, 118962, 192287, 261875, 286143, 277391, 257378, 220632, 195393, 154297, 128168, 115139, 90907, 63784, 48054, 53483, 51983, 52102, 61028, 55920, 50151, 50242, 48586, 42375, 30531, 36030, 53437, 42674, 39843, 62125, 70285, 80726, 99068, 90840, 91015, 91144, 92720, 85536, 97081, 108499, 119505, 140849, 166354, 203285, 249648, 318280, 423208, 591098, 776440, 885743, 861645, 779366, 684757, 578180, 473011, 365984, 277981, 233415, 187057, 162286, 132614, 114039, 104577, 96204, 88747, 89018, 80747, 68717, 62964, 59312, 71677, 63804, 68640, 76316, 68303, 56950, 52084, 44507, 29763, 39517, 39845, 33769, 43710, 74401, 97822, 103049, 115549, 143496, 183363, 226735, 306647, 413302]
13927D13302J48785J76097J14996P540o7074j04312j19383j14397j06337p9600
13917B69617n6598k6398j6205j8244k9680j7041k3231j8043j7626k587Q505o741
13905D5728j6697j8641r982N753J0499N324N664O612J3558J5093j1083L485P727
13892F3040J572l317O559K424J4754J3011k70J9702L6994L7017L3693N6080M1253
13879C22512J1689k7292l9268m8996l6344k5510k0677k4650j3082r175j1121k0535
13867E7551j2219l709j160l303j6120j693J3129J0488N669J154m466K547P343
13854E5211o129k206M321o39j2231q15p690o769P496J0554R602m698j2799k522
13840C0686O869k614J2996J0135n116q652j1853R347J0751j7724j5963L40o10
$$ y = [413302, 562087, 738184, 853180, 860720, 793646, 689334, 569951, 455554, 349217, 269617, 213019, 186621, 170416, 152172, 122492, 105451, 82220, 64177, 46551, 43964, 52469, 45728, 29031, 10390, 408, 6161, 16660, 21984, 27648, 34260, 47818, 62911, 51828, 55313, 63040, 64612, 61295, 67854, 70278, 85032, 98043, 97773, 117475, 154469, 191486, 225179, 281259, 322512, 334201, 306909, 267641, 218645, 182301, 156791, 136114, 111464, 98382, 89207, 78086, 57551, 45332, 41623, 40463, 37160, 21040, 19347, 32476, 42964, 48633, 49787, 45321, 47868, 55211, 49082, 46876, 51197, 50558, 38327, 37512, 29822, 23053, 30549, 41103, 50705, 46007, 33208, 30686, 37555, 34941, 47937, 58072, 52956, 44304, 32451, 41798, 52549, 34825, 18862, 19202, 18592]
13827A8592L666O703J728Q556O439P449n217j3997k722N14N893R854l724q312
13813C5422j839J1364O04n089M663J4110k701r727L920j132N192Q849K203J668
13799F7507j2041j1295j4596l773Q716L997p64l759K341P934r805j7249j3556
13786C657n394L49J2756O790Q92J5015l695R23K4593J0722J6039o166o335q064
13772F2082O478O170m449J5628J5791J884Q513M885j897N187K667o815J4207R267
13758A39598p229j7389j8593m616l291k845p462M149J3382N29j8984J233O870
13745H5352n314p976q230j0297j4041m22N330M77K829Q787J0321K1155Q222N656
13731A01849L489j895K118J3540K0842J9834J228r074l790J5909K7372j296p913
$$ y = [18592, 22258, 28961, 30689, 39245, 45684, 53133, 47916, 33919, 31197, 31711, 37604, 47458, 43734, 35422, 33583, 44947, 45551, 40462, 45125, 59235, 56534, 46807, 50727, 49595, 54787, 63636, 65839, 67507, 55466, 44171, 29575, 25802, 34518, 38515, 37751, 33992, 36333, 44267, 34462, 17213, 3657, -1737, -1388, 11368, 18158, 19050, 34065, 30370, 31293, 55886, 66608, 82647, 76481, 70146, 62082, 68560, 74730, 70281, 85909, 101700, 103584, 112097, 116982, 115085, 120272, 122939, 116124, 130331, 139598, 132369, 114980, 96387, 91771, 88480, 85635, 78173, 82322, 95704, 96233, 77249, 78482, 85352, 80038, 72062, 63832, 53535, 39494, 39072, 44402, 44879, 47708, 56495, 66816, 87971, 96193, 101849, 105338, 103443, 105561, 119101, 139943, 159777, 161005, 151931, 148141, 164050, 191422, 190126, 182213]
13718A82213J2765R853q555M504J57j1996j8853j2423n305k0211j4987O481Q54
13705A24497q089J2311J0393Q625J584k3055l7127l1382L424p926j6916L054Q853
13692D8246k420m920j243L774J0469J4881J2131K8507J7359J5849J6983J8870
13680A78486m309r503l650j927L899K273q689m373J5080Q751J3530K938J761q424
13666A85843J1496K1494J0215J0234L0643N3787P0749M3084k295j7121k3264n3229
13654C41636p3624o4536l3846k1452j0004Q30r816J9930K2293K7123L0097J5513
13642B44144J2568K3322M8928N7323P5860P1679N0889L429j6280l3200k2912J9335
13630E35085J9851m136k8503k5156l0552m5079l8254j5667r021j2764m013o903
$$ y = [182213, 194978, 204831, 196276, 200780, 200937, 188941, 170088, 157665, 152360, 132149, 117162, 123643, 124497, 116408, 128719, 139112, 147737, 149321, 126266, 89139, 57757, 61181, 53255, 36339, 39393, 48246, 45826, 40906, 39663, 43437, 53906, 68787, 80918, 109425, 126784, 142633, 159616, 178486, 174177, 164674, 161024, 159097, 162996, 165269, 156580, 152207, 167287, 176038, 189568, 192506, 194267, 185843, 197339, 218833, 229048, 239282, 269925, 323712, 394461, 437545, 435250, 418129, 394865, 341636, 268012, 203476, 169630, 148178, 138174, 139004, 129188, 149118, 171411, 198534, 228631, 244144, 256712, 280034, 328962, 386285, 462145, 533824, 584713, 588142, 571862, 538662, 515750, 535085, 554936, 550800, 522297, 497141, 466589, 421510, 383256, 367589, 358568, 345804, 341791, 334888]
13618C34888k7232n624J0836Q853j8111M777O49M467Q157j8282j1374Q866J9096
13605C19966J1643J6146M5130O2542Q6689P2219K4545M95l912j5598k3229M94
13593E97130L1306N1605M8848K6610j5416m8188m2643j1690L821J9708J7290O260
13581F84641J4679L0640L6266K7598L2890L4348N2072N9037O8629P9627J01121
13570A221548J41358J87218K43354K98769L45724M28564N31073O29060P42116
13561D768784R22475J197507J653455K475842L851400O155243R383570J1368657
13553D1776933P925374O67718l774470n698655o740239o733042n995543m801537
13545A6626539l504021k491521j818997j400780j096113q54319o46832m88517
$$ y = [334888, 307656, 302032, 312868, 321721, 303610, 308387, 309036, 313503, 321660, 303378, 292004, 300870, 319966, 331609, 347755, 392885, 455427, 542116, 614335, 638880, 639375, 635463, 619865, 596636, 597130, 628436, 680041, 728889, 755499, 740083, 691895, 649252, 637562, 641383, 661091, 678381, 684641, 699320, 729960, 766226, 793824, 826714, 861062, 913134, 972171, 1040800, 1120427, 1221548, 1362906, 1550124, 1793478, 2092247, 2437971, 2866535, 3397608, 4026668, 4768784, 5691259, 6888766, 8542221, 11018063, 14869463, 21024706, 30408276, 41776933, 49702307, 50370025, 46595555, 40896900, 34156661, 27423619, 21428076, 16626539, 13122518, 10630997, 8812000, 7411220, 6315107, 5460788, 4813956, 4325439]
13537D325439l66651k68572j83499j27348r0951m9531J0433P2141R3548J33741
13527C548750J96656K70187L64589M70268O00005P56332R56243J231596J530944
13518I925570J835988K171804K668804L433879M682871O910858J0774968J7297566
13510E9702308K7183279L6255302K9958901M871303j2206994j7563544k1240770
13503A06959785k1593099j9574194j5844601j1569067q065617n791495m431246
13496B0090466l468473k741464k192758j697713j287502r58994p17241n48793
13488F477528m36666l33449k32635j28753p5060j7975N4288J30608K62516L89183
13478F089585N20689O72141Q90617J169733J491753J807184K143092K599156L331549
$$ y = [4325439, 3958788, 3690216, 3506717, 3379369, 3288418, 3238887, 3249320, 3321461, 3415009, 3548750, 3745406, 4015593, 4380182, 4850450, 5450455, 6206787, 7163030, 8394626, 9925570, 11761558, 13933362, 16602166, 20036045, 24718916, 31629774, 42404742, 59702308, 86885587, 123140889, 153099790, 157971093, 145764099, 128200555, 106959785, 85366686, 65792492, 49947891, 38378824, 30313207, 24521712, 20090466, 16621993, 13880529, 11687771, 9990058, 8702556, 7743562, 7026321, 6477528, 6040862, 5707413, 5474778, 5346025, 5270965, 5252990, 5307278, 5437886, 5700402, 6089585, 6610274, 7282415, 8173032, 9342765, 10834518, 12641702, 14784794, 17383950, 20715499]
13469B0715499M512552O604167J0221396J6324225K5887497L5986716L3103880
13462A53355932Q859052j1297839j7440986k1466551k2280867k0482039j6860509
13455E2386193j2445462q685014o183530m726119l707350k949853k360511j833243
13447I495111j395747j056027p95559o27804n29975m27387l27483k78424k27023
13438C829682j74530j27790p8492k7779L5700P7014J51747K61972L55127M78329
13428D780980N77016O72890Q28675J051573J438822K113723L269689N218361Q241177
13419B8192906J1444834J0845359L926626k758878n546720p024152p445004o942544
13411B4692427n799890m383800l133594k253420j707595j334921j057951q51811
$$ y = [20715499, 25228051, 31832218, 42053614, 58377839, 84265336, 120252052, 153355932, 162214984, 150917145, 133476159, 112009608, 89728741, 69246702, 52386193, 39940731, 31255717, 25072187, 20346068, 16638718, 13688865, 11328354, 9495111, 8099364, 7043337, 6247778, 5619974, 5089999, 4662612, 4335129, 4056705, 3829682, 3655152, 3527362, 3448870, 3421091, 3456791, 3533805, 3685552, 3947524, 4302651, 4780980, 5357996, 6030886, 6859561, 7911134, 9349956, 11463679, 14733368, 19951729, 28192906, 39637740, 50483099, 54409725, 51650847, 46104127, 39079975, 31634971, 24692427, 18892537, 14508737, 11375143, 9121723, 7414128, 6079207, 5021256, 4169445]
13403D169445o64275n09560l85936k97075k14604j99844j75897j46284j23283
13394A452687j11732r9407q2504p0397p4805o4922o1299m0813k5828j4524j8945
13383G87511l343m214j5814m9286m5748l9714n1408l3111o018m941M731J605j5580
13370E24670k7641l8252k5421M42j336j2752n662k0796k6019k5075j1256k640
13358C28262l809O370Q988L917J0860k415j7194o702n149j7627J392J7154q229
13345C15818j8522p028n720Q054K6863K6590K7064K397j1437j1076k7629k6586
13333B98788k1455n889q050n681R702R968j2126k2300m199M25m463n758o991P355
13319B29326R275p247j9449l0040j4449k4344j2963K585M665K902q654n995j1864
$$ y = [4169445, 3505170, 2995610, 2609674, 2312599, 2097995, 1898151, 1722254, 1575970, 1452687, 1340955, 1241548, 1159044, 1088647, 1013842, 948920, 887621, 846808, 820980, 806456, 787511, 784168, 779954, 764140, 714854, 669106, 629392, 577984, 544873, 538855, 533914, 538645, 540250, 524670, 497029, 458777, 433356, 433798, 432462, 419710, 414048, 393252, 367233, 342158, 330902, 328262, 324453, 330823, 339811, 343728, 354588, 352173, 334979, 328277, 323128, 305501, 306893, 324047, 315818, 297296, 290268, 284548, 292602, 319465, 346055, 373119, 375516, 364079, 353003, 325374, 298788, 277333, 271444, 263394, 257713, 267415, 277383, 265257, 242957, 238758, 239183, 234720, 228962, 221971, 229326, 238601, 231354, 211905, 181865, 167416, 143072, 130109, 132694, 137359, 140261, 131607, 125612, 113748]
13306A13748Q961J8132J006R001j3184q757K259L407l81j951O669M90J6651J2274
13292A68325r579k12o967o032n078k770O822N794m160n085j180n191o46l073P867
13277A38835M495P354M58L581o171o138j1670j7387k8666q896K553Q068J568L118
13263I1102l006j056k286n19N272K894l691N769k383m924O301L197j828N210Q016
13248A08068l811k1282j1373J2643K1528p032n742J6509p11l893l275P658N979
13235A15266l69N722K572k384M003O717L56K77k1693k651p52q471j178k858P559
13220A02116m681o357J437M733Q890M670Q134M613j2727J964P376M86o741l994
13206A09919M097J0263O946J6012J2827n558m314N12P249L066M829n24J4013K8088
$$ y = [113748, 122709, 140841, 141847, 150848, 137664, 128907, 131166, 134573, 134192, 132241, 138910, 139400, 156051, 168325, 158746, 158534, 151567, 145535, 140457, 137687, 144509, 150303, 146143, 141058, 139878, 134687, 134041, 130968, 138835, 143330, 150684, 151142, 154723, 148552, 142414, 130744, 113357, 84691, 75795, 78348, 86416, 87984, 91102, 88096, 87040, 84754, 84235, 89507, 92401, 88710, 94479, 92096, 87172, 93473, 96670, 94842, 100052, 108068, 104257, 82975, 71602, 84245, 105773, 98741, 92999, 109508, 108797, 104904, 101629, 109287, 115266, 114897, 120619, 123191, 120807, 124810, 131527, 131883, 132160, 110467, 107816, 107064, 98593, 97415, 94557, 102116, 97435, 91078, 92515, 97248, 106138, 110808, 118942, 123555, 110828, 112792, 120168, 120654, 113913, 109919, 114016, 124279, 131225, 147237, 160064, 154506, 150192, 150704, 157953, 161019, 165848, 165324, 179337, 207425]
13192B07425Q385J6382K7123L5939J7627L5045O1207P5454R1463R9723J07643
13181G83416P7606J5325k1113m4385n8891n0828n5660o3717o2198l2358j5784
13170D71413r873q216J7585L1387K3321K4632M7679K7772K1740K6218Q209J2749
13158F94616J8615L4115M1020M0625N7766M7807L7309J3760l221k1543l9831n0271
13146H70767l5155m8725n4804m0369j0212r607q202j8718k4828r047k4520m5026
13134E41554k3795k1622l2315p695N615J2579K2026L7906O2746J06650J06868
13123H10517P4604M8815n144l3709o9784o8413o9958o8848o1580o4551m7952l5286
13111D08711m7529n0920m7800k3144k4518j5480n782j8977o842R462j571r959
$$ y = [207425, 215810, 232192, 259315, 295254, 312881, 347926, 409133, 484587, 576050, 675773, 783416, 861022, 876347, 855234, 810849, 751958, 701130, 645470, 581753, 519555, 487197, 471413, 461540, 453324, 470909, 502296, 525617, 550249, 597928, 625700, 647440, 673658, 681867, 694616, 713231, 747346, 788366, 828991, 886757, 934564, 971873, 985633, 982412, 960869, 921038, 870767, 835612, 786887, 732083, 691714, 681502, 671895, 663693, 644975, 620147, 611100, 586580, 541554, 517759, 496137, 463822, 456127, 461742, 474321, 496347, 534253, 596999, 703649, 810517, 885121, 933936, 928792, 895083, 825299, 756886, 686928, 618080, 556500, 491949, 443997, 408711, 361182, 310262, 262462, 239318, 214800, 199320, 193538, 174561, 167719, 177181, 175610, 165651]
13099A65651k795J8663N374Q038o934n585j674J3270O121P86j0118k341K0406
13086B08862K3737K0579M0450N2088L0525L134k166k0908r175j6470k4748j1572
13074B94336q610Q315O127J232j9199k0514j2921j6269q845k028j162r899q559
13061B02004j345j5529l194M473P256j1624r738j5475R24J3093J0937J3381R659
13048B04822J7042K5401N786Q868J7130L3013M9032N9681Q5420J46296J81516
13037H34007J27382J2695o3767q5827j03379j06244j14868r2736o4345n5003k8784
13026B59131j2124j7148k1784j3464j1047m272j166j4053j0247J313j2076j8718
13014A24345O328J0303K5525J3302J2721q4Q655J0352J2708J3194r98R272J2612
$$ y = [165651, 162856, 181519, 186893, 194931, 187997, 182412, 180738, 194008, 200129, 200915, 190797, 188456, 208862, 232599, 253178, 293628, 345716, 376241, 379375, 377209, 356301, 347126, 330656, 305908, 294336, 285726, 294041, 300168, 301400, 282201, 261687, 248766, 232497, 223652, 221624, 220462, 210563, 202004, 200659, 185130, 181936, 186409, 193665, 182041, 172303, 156828, 157752, 170845, 181782, 195163, 204822, 221864, 247265, 253051, 261919, 279049, 312062, 361094, 420775, 506195, 652491, 834007, 961389, 974084, 910317, 824490, 721111, 614867, 499999, 407263, 342918, 287915, 259131, 247007, 229859, 208075, 194611, 183564, 179292, 178126, 164073, 153826, 155139, 143063, 124345, 130673, 140976, 166501, 179803, 192524, 192440, 201095, 211447, 224155, 237349, 236351, 245623, 258235]
13001B58235N973L593K2262L7867L5748L9312Q3206J45643J86020J51857N0517
12990A020233l2671r0408j22267j10988q3245o2446o3831n5344k0522k4000m4133
12979C10378l4146k4478k9418l3026j5132K333J8036K17M561K670k511q902Q429
12966A99011M399j051J6934J4618k374J83J0911J0812J6372K5212K633J0072J1931
12953C19663j164M45J8855K9373L9788M8123M8158K1402j9748l5449l6990l6857
12941C95599l7585l9646k4472J410J502m908l010L754L019P678J8207J6855Q961
12928C47364P462M880K791k655o879k4755k1808k3722k4564k1514k1084k0570
12916A94946l350k513j6193p234J1673N693P503M409o817K558K1944J3373O514
$$ y = [258235, 264208, 267801, 290063, 327930, 363678, 402990, 486196, 631839, 817859, 969716, 1020233, 987562, 897154, 774887, 663899, 580654, 518208, 454377, 399033, 378511, 354511, 310378, 276232, 251754, 222336, 189310, 174178, 176511, 194547, 194764, 199325, 201995, 199484, 190582, 199011, 203410, 202359, 219293, 233911, 231537, 231720, 242631, 253443, 269815, 295027, 297660, 307732, 319663, 318499, 318944, 337799, 367172, 406960, 455083, 503241, 524643, 504895, 469446, 432456, 395599, 358014, 318368, 293896, 295306, 296808, 291900, 288890, 292644, 295663, 303341, 321548, 338403, 347364, 354826, 359706, 362497, 359842, 352963, 328208, 306400, 282678, 258114, 236600, 215516, 194946, 191596, 189083, 172890, 165656, 177329, 183022, 190525, 194934, 188117, 190675, 212619, 225992, 232506]
12903B32506Q42j597n7Q188j897N795K1431J7299O097N81q142q802k9516j6261
12889B26467p188j0532j1060n132O192o143n39O10K247P665m233Q529J4672O072
12875B27627Q26J6587J4670J6702K8022J5052Q068N929K5588J6478J5768J5297
12863D06614J6550K2286L2306K4552K0471L7044J6196o00N129J314J2947M481
12851E99290J1824L5205L5667L9101L5647L0833J0319J774m08j6166k6960k9081
12839G27045k6945j5538K002O923K3343q0J1723K0933K3019J9096J4934L560j2319
12826G97696j9223j9620k0784j0633k879j4247m963J688j0119j3758n740J1731
12814F89149O027j3174J916L099J1985P65M352J1865K8394L6909L9833M6101M7790
$$ y = [232506, 233348, 231751, 231694, 239882, 237985, 243780, 265211, 282510, 288607, 289188, 281046, 272244, 242728, 226467, 219279, 208747, 197687, 192555, 198747, 192604, 192065, 192675, 194922, 202587, 198354, 206883, 221555, 227627, 228453, 245040, 259710, 276412, 304434, 319486, 327554, 333483, 359071, 375549, 391317, 406614, 423164, 445450, 477756, 502308, 522779, 559823, 576019, 575419, 580548, 581862, 594809, 599290, 611114, 646319, 681986, 721087, 756734, 787567, 797886, 799660, 799252, 783086, 756126, 727045, 700100, 684562, 686564, 693487, 716830, 716750, 728473, 749406, 772425, 791521, 806455, 810015, 797696, 778473, 758853, 738069, 727436, 724557, 710310, 705347, 707035, 696916, 683158, 677418, 689149, 695176, 682002, 683918, 687017, 699002, 699767, 704119, 715984, 744378, 781287, 821120, 867221, 915011]
12801I15011N0530M2004J0228p003j5178j5923k6537j4766j956J276l617O601
12789I40670L0591J1938L187M678Q123K5310J3360O373K1016K8793M5092N4977
12777A194108M8250O1746P2705P9245P9864O8644O9774P7372P1005Q0025R4307
12766A997045R0186J05149J23221J39188J60219J62928J77460K02490K40796K62414
12756C661096K42810K62332L07469L59769M43208N56773P13300R58914J108379
12747H614050J013110R69613J079141J207029J444541J792922K256065K919274
12739B1295745L848156N133099O854238R098669J1937527J5333738J8885703K1596302
12731A13983177K1052502J5062103N686503k966806r452250j3589258j5278524
$$ y = [915011, 965541, 1007545, 1017773, 1010770, 995592, 979669, 953132, 938366, 936410, 937686, 934069, 940670, 971261, 983199, 986386, 991064, 999187, 1024497, 1037857, 1044230, 1065246, 1094039, 1139131, 1194108, 1242358, 1304104, 1376809, 1456054, 1535918, 1604562, 1674336, 1751708, 1822713, 1902738, 1997045, 2087231, 2192380, 2315601, 2454789, 2615008, 2777936, 2955396, 3157886, 3398682, 3661096, 3903906, 4166238, 4473707, 4833476, 5276684, 5833457, 6546757, 7505671, 8614050, 9627160, 10596773, 11675914, 12882943, 14327484, 16120406, 18376471, 21295745, 25143901, 30277000, 37131238, 46229907, 58167434, 73501172, 92386875, 113983177, 135035679, 150097782, 155784285, 152817479, 143365229, 129775971, 114497447]
12724A14497447j4855628j2854678r964385o800962l695966q05500J774666L854358
12716G1149352N318367O093803O133773N548525M631528L787237L210683L044473
12708A08917741L481356M660393O498360Q520513J0087625J0684672R537136O078278
12700A68466074J190854l434699o844528q968997r785797r361183q007507o244343
12692A17009874m488394k966981j838939j300845j534759k375627l521685m671415
12684I4311229n506694n776497n329220m208185k406671O4823L243560P160842
12676H1553187J1587750J5962159J9275999J9913919J5978428P172948l110297
12669A68334093j1130319j6290256j8851593j9196370j7928202j5644887j2954009
$$ y = [114497447, 99641819, 86787141, 76822756, 70021794, 66325828, 65520328, 67294994, 71149352, 76467719, 82561522, 88695295, 94243820, 98875348, 102662585, 105873268, 108917741, 112399097, 117059490, 123557850, 132078363, 142165988, 152850660, 162387796, 168466074, 169656928, 166222229, 159377701, 150408704, 140622907, 131261724, 123254217, 117009874, 112521480, 109554499, 107715560, 106414715, 104879956, 102504329, 98982644, 94311229, 88804535, 83028038, 77698818, 73490633, 71083962, 71148785, 74392345, 81553187, 93140937, 109103096, 128379095, 148293014, 164271442, 171444390, 168334093, 157203774, 140913518, 122061925, 102865555, 84937353, 69292466, 56338457]
12662E6338457j0374389q177904o396253m996230l905388l055304k425789j975775
12654A5031425j657947j407128j200801j004923q74886p65036o45894n49627m63570
12645F461613l98767l64154l17287k75494k44993k20998j91721j72537j80575
12636D095087j73011j56190j36570j04685p5470o7181m0928j5303r321p488J8900
12625C327840M9488M0651P506q401k0246m7480p2892o2858q2606j09139j03321
12614B918542j01124j09030r9515r5901p1039p1982o3517m4234l2017j9423j0514
12603B200246k761M988J0763K1989M9329Q0102Q4858J01566J17612J16256R1942
12592B876890P2959N1611L1163k5079o4526q4784j26495j33152j28780j25972
$$ y = [56338457, 45964068, 37786164, 31389911, 26393681, 22488293, 19432989, 17007200, 15031425, 13373478, 11966350, 10765549, 9760626, 8885740, 8120704, 7474810, 6925183, 6461613, 6062846, 5698692, 5381405, 5105911, 4860918, 4639920, 4448199, 4275662, 4095087, 3922076, 3765886, 3629316, 3524631, 3449161, 3381980, 3341052, 3325749, 3316428, 3308940, 3327840, 3377328, 3417979, 3425485, 3417084, 3396838, 3349358, 3276466, 3213608, 3131002, 3021863, 2918542, 2817418, 2708388, 2608873, 2512972, 2441933, 2369951, 2306434, 2262200, 2230183, 2210760, 2200246, 2197485, 2202473, 2213236, 2235225, 2284554, 2364656, 2449514, 2551080, 2668692, 2784948, 2876890, 2949849, 3001460, 3032623, 3007544, 2943018, 2858234, 2731739, 2598587, 2469807, 2343835]
12582B343835j14798r4065p1770n5316n8033n0211k6119j2419m761o548P177Q430
12570A865402J810J1120K0367K1239K4824J4737o83L406j1217m257J137K887j3783
12557A936989j2346J3059Q56j0972m6894o8204o4431n4204n4551o2801l4837l2444
12545A509220n2170n6024n0193o1370m0687l1806m3787m9703n1084n1797o5159
12534I55440o9736l5285j1183j6533j2427r252n150j6349l133j6032k7561j7623
12522G15176k1165l7317k8785j4951j5324j8839o050l302j2096j3940j4483j7892
12510E11032j4644j5818k8502k0785k0334K025K5368K4934L1920L3634M5324O1726
12498F35880L8252l961k0177p422k7067k9472m1297l7221j5319l189J512L101
$$ y = [2343835, 2229037, 2134972, 2063202, 2007886, 1949853, 1899642, 1873523, 1861104, 1856343, 1849795, 1856972, 1865402, 1867212, 1878332, 1898699, 1919938, 1944762, 1959499, 1958816, 1962222, 1951005, 1946748, 1947885, 1950772, 1936989, 1924643, 1937702, 1938558, 1927586, 1880692, 1812488, 1748057, 1693853, 1639302, 1576501, 1541664, 1509220, 1457050, 1401026, 1350833, 1289463, 1248776, 1216970, 1173183, 1123480, 1072396, 1020599, 955440, 885704, 850419, 839236, 822703, 810276, 801024, 795874, 779525, 776392, 760360, 732799, 715176, 694011, 656694, 627909, 612958, 597634, 578795, 572745, 569443, 557347, 543407, 528924, 511032, 496388, 480570, 452068, 431283, 410949, 412974, 438342, 463276, 495196, 528830, 574154, 635880, 674132, 670171, 649994, 642572, 615505, 586033, 544736, 507515, 492196, 489007, 490519, 493620]
12486D93620Q259J0731J8501J6719L400J626M0J2609L5814M6660M6859M9332P6856
12473H21026J09020J49072J61394J29615Q3042K2123m8486r4016j09413r0539
12463A132838q8314n7214l1787k4382l3236r231n053l997J8474K1815J6010K1043
12451I56966K0847K0381L0053M4798L5857N2049N6878N0529O4365Q6955R5497
12440A515175Q7787N6063J0201m2585o9517p5496q9572q7102p8362o5448p2928
12429A088216m6688m3533k4951m1383l3971k7482j1244k632j5559j6454j3717
12418H10602K2790L5227N3696O8847R2472J11848J22663R0920M6349M820m0903
12407A419331p8233q0045p6892o5068n8194m3935k3107r392K0252K4716L1214
$$ y = [493620, 501879, 512610, 531111, 547830, 551230, 552856, 552896, 565505, 601319, 647979, 694838, 744170, 821026, 930046, 1079118, 1240512, 1370127, 1453169, 1475292, 1426806, 1332790, 1223377, 1132838, 1044524, 987310, 955523, 931141, 897905, 888674, 883621, 879624, 898098, 919913, 935923, 956966, 977813, 998194, 1028247, 1073045, 1108902, 1160951, 1217829, 1268358, 1332723, 1419678, 1515175, 1602962, 1659025, 1669226, 1626641, 1557124, 1481628, 1392056, 1304954, 1226592, 1161144, 1088216, 1041528, 997995, 973044, 931661, 897690, 870208, 858964, 856332, 840773, 824319, 810602, 833392, 868619, 922315, 991162, 1083634, 1195482, 1318145, 1409065, 1455414, 1460234, 1419331, 1341098, 1261053, 1184161, 1119093, 1060899, 1016964, 993857, 984465, 1004717, 1029433, 1060647]
12396A060647M7212N2441L0278K272J006j0865l4614m0007l7386n3080o3244k1970
12384I32690k8225l1311j6208n231O999P847J3660J7237L3545M1820L0196M2459
12372A045478K7132L3930L3952M1372L8305L2489M2442L6830K4847j223R133k123
12360A362564K971r20j5502l6624m3322l8463m6324m5981l9593m8349n6914m4041
12348I49502l6487l3896k2429k5943k1458r491J7099K3438J7782K5819L3069K5754
12336I42759L1286M1519L9430J7181q527O769j5670m2977o3795p0984p8410p1852
12324G26729o6768n7814n6546n9625m2151l0601k7438j7104j1971j1464k9779
12313C15468j9052j0637k2369j9681j0609j7245j7308j828N935j579j2575j1259
$$ y = [1060647, 1107859, 1160300, 1190578, 1192850, 1193856, 1182991, 1148377, 1108370, 1070984, 1017904, 954660, 932690, 904465, 873154, 856946, 851715, 858714, 866561, 880221, 897458, 931003, 972823, 1003019, 1045478, 1072610, 1106540, 1140492, 1181864, 1220169, 1252658, 1295100, 1331930, 1356777, 1355554, 1364687, 1362564, 1365535, 1364615, 1349113, 1312489, 1269167, 1230704, 1184380, 1138399, 1098806, 1050457, 993543, 949502, 913015, 879119, 856690, 830747, 809289, 799798, 816897, 840335, 858117, 883936, 917005, 942759, 974045, 1015564, 1054994, 1072175, 1063648, 1070417, 1054747, 1011770, 947975, 876991, 798581, 726729, 659961, 602147, 545601, 485976, 443825, 413224, 385786, 368682, 356711, 345247, 315468, 296416, 285779, 263410, 243729, 233120, 215875, 198567, 196739, 202674, 201095, 188520, 177261]
12301A77261l375R146R016j873j4726K212m700j011Q254J281J2047K2444Q092
12288B24068R660J3377L0960J5451N293J7191K4083K0275K5845K6390L5986O1438
12276E10017Q4542P7818R7507Q7836M8607P821l2201o8151n8660o8842m7470n4230
12264E84594n4672l1782n257Q559K2574K0897K2372K8973L9734L1860K9524J8634
12252G16010K7881K4188K2458L8543L0524L3835O1924M8108M1189J5127j1307
12241A048480j9811o3227o7967m8661m9323m0126l4026j6870j1291j3752m624
12230F78802q923j01r643k2956k3758l8111j5273j8004j2206N910J7724L0029
12218E83490M3315N9211J07371R5170Q0283M5935k2525p6087r2382j01943r0960
$$ y = [177261, 173886, 183032, 192048, 190175, 175449, 177661, 172961, 171950, 180204, 181485, 193532, 215976, 224068, 233728, 247105, 278065, 293516, 298809, 316000, 340083, 360358, 386203, 412593, 448579, 510017, 594559, 672377, 769884, 857720, 906327, 914148, 881947, 813796, 755136, 686294, 638824, 584594, 529922, 498140, 492883, 501442, 524016, 544913, 567285, 596258, 635992, 667852, 697376, 716010, 743891, 768079, 790537, 829080, 859604, 893439, 955363, 1003471, 1044660, 1059787, 1048480, 1028669, 965442, 897475, 848814, 799491, 759365, 725339, 708469, 697178, 683426, 678802, 669879, 669778, 660135, 637179, 613421, 575310, 560037, 542033, 529827, 535737, 553461, 583490, 626805, 686016, 793387, 888557, 968840, 1014775, 992250, 916163, 823781, 721838, 630878]
12207F30878r1725r3157q2340n5843l1755l3142l9015l5704l1881p247P761m354
12195A32476j0170r41O269K755k545J3007j0182j8020m073m847r836j416p744
12182H4733O54l708N259m162k145j04K108K559n412P26J847q145k630j4059o971
12167E0550K620Q773J1646K854j878K057J1390M717k729K746M694r133J606Q596
12153I8509j281N636P138l045p371J834o295J889P823M22r780p746n315J407l76
12138H3449O12o71j5791j2155J0929J4393J2853j866q663J217j594n05N485M009
12124I1702l134k4O262J2081k3314j3455L615R081N776O958J2662J6729m30o822
12110A17687J559J2207K0020L651L475J1124P133n71L152k2619j8409n565L668
$$ y = [630878, 539153, 445996, 363656, 307813, 276058, 242916, 203901, 168197, 136316, 129069, 136830, 132476, 122306, 121365, 127634, 130389, 127844, 140851, 130669, 112649, 108576, 103729, 93893, 92477, 84733, 85387, 81679, 86938, 82776, 80631, 80527, 82635, 85194, 79782, 80508, 82355, 74210, 71580, 57521, 50550, 53170, 61943, 73589, 76443, 74565, 76622, 88012, 92729, 90000, 92746, 97440, 88307, 89913, 98509, 97228, 102864, 110002, 106957, 99586, 101420, 95125, 97014, 104837, 105259, 95479, 87733, 82418, 83825, 83449, 84061, 83390, 67599, 55444, 66373, 80766, 93619, 91753, 83090, 84307, 82713, 82208, 87693, 91702, 88568, 88544, 94806, 106887, 83573, 70118, 73733, 82814, 88590, 95548, 108210, 124939, 124509, 117687, 119246, 131453, 151473, 155124, 158599, 169723, 176856, 176285, 179437, 156818, 138409, 132844, 136512]
12097A36512p008M364Q66q705n645j1570J596K1090J0603j373k581Q532M708K996
12083A54385P531J5050n351J3022J8516K4080J0521l267j0471J371M715j1039
12071B19063k6739j4647o144j6431k0162L110M343j0438p474j435m449K406N349
12058A26352k71j677q33J1609R273r87l26q618j237J8066M361p231j8430j7098
12044A12953k1310L075J4402L212m248r428P407J426j1345L526J546m039Q311
12031A05488L340J100m934P123O200K646P395J804j5280j7048l910j463q657M37
12017H4241P731J7060J7190p693j3400P933J9735J6003N523k677N687J0185K0932
12004A88450Q874J4668K8348L1426M5664P6589J18522K01462L25504N21924N58002
$$ y = [136512, 129504, 133868, 134734, 126029, 120384, 108814, 110410, 131500, 142103, 140730, 138149, 146681, 151389, 154385, 161916, 176966, 171615, 184637, 203153, 227233, 237754, 234487, 224016, 225387, 230102, 219063, 192324, 177677, 171533, 155102, 134940, 138050, 142393, 131955, 124481, 123046, 118597, 121003, 126352, 126081, 124404, 123571, 135180, 144453, 143466, 143140, 134522, 133285, 151351, 155712, 148481, 130051, 112953, 91643, 94718, 109120, 112332, 108084, 98656, 106063, 107489, 96144, 99670, 101216, 97177, 105488, 108828, 109928, 104994, 112117, 118317, 120963, 128358, 130162, 114882, 97834, 93924, 92461, 83804, 84241, 91972, 109032, 126222, 118529, 105129, 113062, 132797, 148800, 154323, 151646, 157333, 167518, 188450, 197324, 211992, 240340, 271766, 317430, 394019, 512541, 714003, 1039507, 1561431, 2119433]
11993B119433K07929j20225k15287k79539k93636k78253k31772j72258j07849
11984F28543o1291k7708J01L1224P1510R1439R3182Q0448K0107k3351p6779r6979
11972G30446r2444r7666q6107n9160l5443k7300k1043k2826q362J5166P917J5409
11960C18587K3638K1173J7518J6636J2629K483j7208j5840j5569j4478j0278k4089
11948C15202l833j894j596K3263O351R758K7310M6450O0203Q5050J04905J37090
11936H08259J40946J41103J25544J13430O7870L6742K5478n289m7321o9887r9080
11925A237795j05270r7735p7038o4348m9718k4601j7997n874k911N797J2751O822
11913H17673K9207K5965M47Q62J2074Q048L144j0184q798P863M457R788q26p301
$$ y = [2119433, 2327362, 2207137, 1991850, 1712311, 1418675, 1140422, 908650, 736392, 628543, 567252, 539544, 539645, 570869, 642379, 733818, 827000, 907448, 927555, 904204, 827425, 730446, 638002, 540336, 454229, 395069, 359626, 332326, 311283, 288457, 280095, 295261, 303178, 318587, 342225, 363398, 380916, 397552, 410181, 412664, 395456, 379616, 364047, 349569, 339291, 315202, 311369, 309475, 307879, 331142, 337493, 347251, 374561, 421011, 481214, 566264, 671169, 808259, 949205, 1090308, 1215852, 1329282, 1397152, 1433894, 1459372, 1454083, 1406762, 1336875, 1237795, 1132525, 1034790, 957752, 893404, 843686, 819085, 801088, 795214, 792303, 798100, 810851, 817673, 846880, 872845, 873292, 874154, 886228, 894276, 897420, 887236, 878438, 886301, 890758, 900546, 899720, 892419]
11899H92419J5299K9381K2791K6067K9721L4351O6931Q8601J07053J35618J60981
11888A609213J39173J11692N4912m273k4026k2284j6415J687J8846R304M255k6100
11876A855984n2852o7051q0411r6430r4331q8509p6210n3207k5041m0392j2308
11865A169242l96O442K1283J3099J3260Q717n757k1973P278O131m90J5091L7247
11852A269174L4174L7629L9333L0684K0593m188l7411l8711k8668m4573o3578
11841A214458p0140m9933m4404l5665l0817n3442m7060m5226l8818l9616n2143
11830G07194l0747j9324k277o861N914L001L4461M5642O1665N0943L8771L6141
11818I24523M142k4103l6695p0050q8161p8964o3768n2566k9715j8962k8192k3739
$$ y = [892419, 907718, 937099, 959890, 985957, 1015678, 1050029, 1116960, 1205561, 1312614, 1448232, 1609213, 1748386, 1860078, 1914990, 1910717, 1886691, 1864407, 1847992, 1849679, 1868525, 1877829, 1882084, 1855984, 1803132, 1736081, 1655670, 1559240, 1464909, 1376400, 1300190, 1246983, 1221942, 1181550, 1169242, 1168846, 1175288, 1196571, 1209670, 1222930, 1231647, 1225890, 1203917, 1211195, 1217326, 1216836, 1231927, 1269174, 1303348, 1340977, 1380310, 1410994, 1431587, 1427399, 1389988, 1351277, 1322609, 1278036, 1214458, 1144318, 1094385, 1049981, 1014316, 983499, 930057, 882997, 837771, 798953, 759337, 707194, 676447, 657123, 654846, 647985, 653899, 656900, 691361, 737003, 798668, 849611, 888382, 924523, 928665, 904562, 867867, 797817, 709656, 630692, 566924, 514358, 484643, 465681, 437489, 413750]
11806D13750k1744j4614j7075k5202r328j6534k1257k3534j8656j2909q112p198
11794B17587p353n288Q193j29m079J95m081J0658R181n671k980J917k479k73L074
11779B18472J6769j417p047M264J3984q287k547j553n425j0593K648J0019k08
11766B29079O972K234r501j4257l944l690k114r587k263n335j0928j0467R975
11753A76174L545Q286N112K4o365o680J4231O021K6n941j777o753J693N195l652
11738A89139j876r919k633q382m680K160P235p623r311m952m594N491q892l48
11724A40815K431N04L392J950M027m689p70Q819K550Q035J3147J6986J8343R111
11710B24651j143M078N652J552k623l289k067K246O258j5661j4729j4609K966
$$ y = [413750, 392006, 377392, 360317, 335115, 325787, 309253, 287996, 264462, 245806, 232897, 224785, 217587, 210234, 204946, 213139, 213010, 208931, 209126, 205045, 215703, 224884, 219213, 216233, 218150, 215671, 215398, 218472, 235241, 233824, 226777, 231041, 245025, 236738, 234191, 232638, 227213, 216620, 219268, 229287, 229079, 236051, 238285, 228784, 214527, 210583, 206893, 204779, 195192, 192929, 187594, 176666, 166199, 176174, 179719, 188005, 193117, 193141, 186776, 180096, 194327, 200348, 200374, 194433, 192656, 185903, 187596, 192791, 189139, 187263, 177344, 174711, 166329, 161649, 163809, 171044, 163421, 154110, 149158, 144564, 150055, 141163, 140815, 143246, 143750, 147142, 149092, 153119, 148430, 147660, 156479, 159029, 167064, 180211, 197197, 215540, 224651, 223508, 227586, 233238, 234790, 232167, 228878, 226811, 229057, 235315, 219654, 204925, 190316, 193282]
11697A93282o482m628N546j5282j735O699K7412K1498K73l854l45o910R862Q476
11683B33812O295R488k76J1686R711P614J311p630m209j6483m632J1931j910j3190
11669B43518k3213j0253o462j6951j3166L439J9556K606J313j981L656J0763J870
11656B14695J6362K8407K9420J8565K385K2059K718K543N604o367j4178j5672
11644C06541l6851l2117j1606j9719j7641j2704j9003R311L684P722J0011R224
11632A96852J3481J6716J0349J6091K2959J1528P596J6493M2947L0890L6605M5833
11620D68340M9911N6762L1665Q056k8444n1765m2655n5517n7375l3944k4526k0105
11608C00403j1355n543K215J431j722K2358K3113J8773L0035J8707J3222K0932
$$ y = [193282, 186800, 182172, 187718, 172436, 170701, 177400, 204812, 226310, 226583, 222729, 222384, 215474, 225336, 233812, 240107, 249595, 249319, 261005, 270716, 278330, 279641, 272011, 267802, 251319, 246687, 258618, 256708, 243518, 220305, 210052, 203590, 186639, 173473, 176912, 196468, 199074, 200387, 198406, 202062, 212825, 214695, 231057, 259464, 288884, 307449, 309834, 331893, 334611, 337154, 342758, 336391, 322213, 306541, 269690, 237573, 225967, 206248, 188607, 175903, 156900, 166211, 169895, 177617, 187628, 196852, 210333, 227049, 237398, 253489, 276448, 287976, 295572, 312065, 355012, 385902, 422507, 468340, 518251, 575013, 606678, 614734, 586290, 534525, 491870, 436353, 378978, 345034, 320508, 300403, 289048, 283505, 285720, 287151, 285429, 307787, 330900, 349673, 379708, 398415, 411637, 432569]
11596D32569K1036L435J6605L1159K9838M4303O6807N2533N1848M3964K2178K6034
11584H42309R253m523L994J1083n236q925k230n379m357L1631N5237M7973N4243
11571A025073L9154L6677k336p420L670k9267l6917m0149l1137k5882j4458R616
11559I26624L1948M1867L2392K5567Q730n946j9346j9379m0145n3731n0395m0959
11547H37227l4474j2907m038j9317k0407l1841j3334o33J234j1595L147p960j1565
11534F73537O422q152j095L85J9038M0903M3927M0851L3276K7656L4711M1467
11522I52926L7720J4388r920k7490k6954k5004L28k451N945Q939J2644R380Q853
11509I59304K5447J7921P212J8797J2024K1219M3933N3294O2819O2333N8393Q1951
$$ y = [432569, 453605, 457040, 473645, 504804, 534642, 578945, 645752, 698285, 750133, 794097, 816275, 842309, 851562, 847039, 851033, 862116, 856880, 847955, 845725, 840346, 835989, 867620, 922857, 970830, 1025073, 1064227, 1100904, 1098568, 1091148, 1094818, 1065551, 1028634, 988485, 957348, 931466, 917008, 926624, 958572, 1000439, 1032831, 1058398, 1067128, 1061182, 1041836, 1022457, 982312, 928581, 878186, 837227, 802753, 789846, 785808, 766491, 746084, 714243, 700909, 700276, 701510, 689915, 693062, 685102, 673537, 679959, 671807, 670712, 671097, 690135, 731038, 774965, 815816, 849092, 876748, 911459, 952926, 990646, 1005034, 995114, 967624, 940670, 915666, 915994, 913543, 919488, 928427, 941071, 950451, 959304, 984751, 1002672, 1009884, 1028681, 1040705, 1061924, 1105857, 1159151, 1221970, 1284303, 1342696, 1424647]
11497A424647P4215N7703O9742P1715O8799Q6072R1572Q8010R8938J25293J37516
11486B394222J51817J68665J76238J72460J92981K18407K39135K49671K78658
11477D242254L20211L71402M23827N01628O07751P14845Q81562J061166J250090
11468A0374736J470043J734332K075577K465924L023997L803001M918670O517806
11460C6384086Q666128J1418271J4809993J8558180K1604085K2098476J8238815
11453A51778034J0524493J837357n497328j0981932j4372183j5544892j4710530
11446A03033019j2461215r369202n919752k463609O74885L112399M565450N021150
11438H6193125M886003M452206L569168K235450Q41925p8948k19697O05325K612338
$$ y = [1424647, 1498862, 1556565, 1626307, 1698022, 1766821, 1852893, 1944465, 2032475, 2131413, 2256706, 2394222, 2546039, 2714704, 2890942, 3063402, 3256383, 3474790, 3713925, 3963596, 4242254, 4562465, 4933867, 5357694, 5859322, 6467073, 7181918, 8063480, 9124646, 10374736, 11844779, 13579111, 15654688, 18120612, 21144609, 24947610, 29866280, 36384086, 45050214, 56468485, 71278478, 89836658, 111440743, 133539219, 151778034, 162302527, 164139884, 158642556, 147660624, 133288441, 117743549, 103033019, 90571804, 81202602, 75282850, 72819241, 73494126, 76606525, 81171975, 86193125, 91079128, 95531334, 99100502, 101335952, 102177877, 102098929, 101879232, 102484557, 105096895]
11429A05096895N705163R447643J2968682J5010973J4365619J0588766M590379
11422A77774120j902277p273262j0683744j1856381j1160735r317179p002393
11415A18578149m835458l340476k697425k682233l042051l768304m839704n826282
11407H7546216o278256o061658n204354l684988j509371J199855M338822P747108
11399G8093374J1202824J4238581J6160729J5757795J1781287M499095l717346
11392A48016339j0396549j4663416j6650428j6771125j5536728j3473276j1149323
11385D9375494q920855p043904n541339m372237l491648k824941k285165j883465
11377A3011940j544763j286491j093848r37453p87413o69327n70512n05465m30532
$$ y = [105096895, 110802058, 120249701, 133218383, 148229356, 162594975, 173183741, 177774120, 175871843, 168598581, 157914837, 146058456, 134897721, 125580542, 118578149, 113742691, 110402215, 107704790, 105022557, 101980506, 98212202, 93372498, 87546216, 81267960, 75206302, 70001948, 66316960, 64807589, 66007444, 70346266, 78093374, 89296198, 103534779, 119695508, 135453303, 147234590, 151733685, 148016339, 137619790, 122956374, 106305946, 89534821, 73998093, 60524817, 49375494, 40454639, 33410735, 27869396, 23497159, 20005511, 17180570, 14895405, 13011940, 11467177, 10180686, 9086838, 8149385, 7361972, 6692645, 6122133, 5616668, 5186136]
11368E186136l66938l19950k84159k49460k16928k00513j56339j33692j49923
11359C108234j40884j43373j19575j14012r8969p6078o9295o7300m3742m0817
11349B194189l2241l2145n2439o2692o8691o7302n9260n9348n7581n8475n2950
11338A591065m0338l9683l9571k8877k4835k6222j8380k0091k6121j7635j5659
11327A293653k4579l6685n0007o0268l8973k4773k1073k4309l7586j5459L079
11316I63020M933J19k603q757j301j1491j075K440j8490l4067j8631m914j4253
11303H54930n191J914n513j0673l028j2230j6880p570k0703l2979l2534j7782
11291F91761m165J5540K80l737O963J1187P604J1137L2649M4194M6386K5635R892
$$ y = [5186136, 4819198, 4499248, 4215089, 3965629, 3748701, 3548188, 3391849, 3258157, 3108234, 2967350, 2823977, 2704402, 2590390, 2491421, 2415343, 2346048, 2278748, 2235006, 2194189, 2161948, 2129803, 2077364, 2014672, 1945981, 1878679, 1819419, 1760071, 1702490, 1644015, 1591065, 1550727, 1511044, 1471473, 1442596, 1417761, 1391539, 1373159, 1353068, 1326947, 1309312, 1293653, 1269074, 1232389, 1182382, 1122114, 1083141, 1058368, 1037295, 1012986, 975400, 959941, 963020, 967953, 968072, 965469, 956712, 955411, 943920, 942845, 945285, 926795, 892728, 874097, 869183, 854930, 849739, 851653, 846140, 835467, 832439, 820209, 803329, 795759, 775056, 742077, 709543, 691761, 687596, 703136, 703416, 699679, 706642, 717829, 725433, 736570, 769219, 813413, 859799, 885434, 895326]
11278H95326K1781J9759n581j0990k5545k0276k6479j8510n0661m5837m1113l2644
11266F59230k6970k7637l1831l7275l4112m1348k5899j4435k2395l8168k8230
11255C30930r523L014Q732l469n792o672k115N328Q007J2206J3341N922r718j1051
11241C39140j1964o861j9526p662j2998q360J880L199q680k0834k5544j6190k2041
11228A83559l577j6007q227M382q02J5009J0968N807l854j379J6118J2172K083
11215B16252r774J0563J926M508Q140l872k912J847P764O171M424L176m720j1511
11201B31982j7151j1177l807N745K4394K5909M3409J00608J36916J81897J95374
11190I14099J17405K0033n5166r0943j20148j24975j00648r0482p5356n8672l5838
$$ y = [895326, 917107, 936866, 931285, 920295, 894750, 874474, 847995, 829485, 778824, 732987, 691874, 659230, 632260, 604623, 572792, 535517, 501405, 460057, 434158, 419723, 397328, 359160, 330930, 321407, 324421, 333153, 329684, 323892, 317220, 315105, 320433, 328440, 340646, 353987, 359909, 350191, 339140, 327176, 320315, 300789, 293127, 280129, 271769, 273649, 276848, 268168, 247334, 221790, 205600, 183559, 179982, 163975, 155748, 160130, 159328, 174337, 185305, 191112, 187258, 185879, 201997, 214169, 216252, 206478, 217041, 218967, 223475, 231615, 227743, 224831, 226678, 234442, 240613, 245037, 248213, 243493, 231982, 214831, 203654, 199847, 205592, 229986, 255895, 299304, 399912, 536828, 718725, 914099, 1031504, 1051537, 996371, 905428, 785280, 660305, 559657, 469175, 393819, 335147, 299309]
11179B99309j9650l0152k1214N670O765P771J1014J2751N252l541j3880k441j8762
11166B38892k3372j4726q360l764l562J850q570m085l038J645N131p48N893J9278
11152B02464J3398j321j1523n827Q753n430o080J183M793l65N691p452k287Q741
11138B04738K584N374Q92j0761j4744j5477L514Q998j68j005P14j1490O188J8709
11124A98066j705p665l174N653J2419L938Q712J4329J6523J3758p748k805l654
11111B46647m93L950k37J1033J2063J0054J5612K3375L1907M3664N8060P7418
11099E33053J23414J99219L10518L86154L57942K44394K53367L97321M91794L24845
11089C622021j5156j87910j80728j47014k19915l34768l96750l96660l26526k64300
$$ y = [299309, 279659, 249507, 228293, 233963, 240728, 248499, 259513, 272264, 277516, 273975, 260095, 257654, 238892, 215520, 200794, 192434, 188670, 185108, 186958, 178388, 174303, 171265, 172910, 178041, 177293, 183186, 202464, 215862, 214541, 203018, 197191, 205944, 200514, 194434, 195617, 200410, 200045, 205736, 198284, 195997, 204738, 207322, 212696, 213588, 202827, 188083, 172606, 176120, 185118, 184950, 183945, 184659, 173169, 179357, 198066, 196361, 188696, 185522, 191175, 203594, 207532, 216244, 230573, 247096, 260854, 253106, 250301, 246647, 246154, 250104, 249867, 260900, 272963, 283017, 298629, 322004, 353911, 397575, 455635, 533053, 656467, 855686, 1166204, 1552358, 1910300, 2154694, 2408061, 2805382, 3297176, 3622021, 3606865, 3418955, 3238227, 3091213, 2871298, 2536530, 2139780, 1743120, 1416594, 1152294]
11079A152294k40504k04173j39547j08353p8109n4132m4096l4126l2166j2447
11069B04641j9309j6349j2047n203O609J946o747j0212p440j4355j0721L749J89
11056A14751N916o602r020M728N083O087l395m1j1080k057n159J4019J1174J854
11042A26258R227K5105J2068m333k101q536k545J2130J2326J7660K1362L3370
11030B51991K9635M9632O8595P2769P9607R2051Q5849P8748M5089J7964j0918
11019H61012m7012m6942o1136q0042n3939m3148l3512j8041K55Q729J8316K1915
11007E26455J6548M1003K4482J8401J5619J5940J0904l642P319K6191L6214M9118
10995G84552O0423O1662L6317O57r049k5950k7815m3108k7131m0525n2876k8073
$$ y = [1152294, 911790, 707617, 568070, 459717, 381608, 327476, 283380, 249254, 217088, 204641, 185332, 168983, 156936, 151733, 158342, 160288, 153541, 143329, 135889, 121534, 110813, 114562, 114751, 120667, 114065, 105045, 109773, 114856, 120943, 117548, 117507, 106427, 104370, 99211, 113230, 124404, 126258, 135485, 160590, 172658, 168325, 166224, 157688, 155143, 167273, 179599, 197259, 218621, 251991, 281626, 331258, 399853, 472622, 552229, 644280, 730129, 808877, 853966, 871930, 861012, 814000, 767058, 705922, 625880, 571941, 528793, 495281, 477240, 477495, 486224, 504540, 526455, 543003, 584006, 608488, 626889, 642508, 658448, 669352, 665710, 673029, 699220, 735434, 784552, 844975, 906637, 942954, 943611, 934562, 908612, 880797, 837689, 810558, 770033, 717157, 689084]
10983F89084j6130k1780k4584q473r761k2495l0823l3492l2852k2868j2922r369
10971D43535l245J4181L0010L4959N4061P6218M6697N2511L2346L512j5347n3960
10959G15478o7367p6139p1090q5659o5233n6233n7043m3956j5309j1978j4755
10948A50716k1290k0387j3580r451j604p882K217n953r319k198n457K707q397
10935E0122j1042J1878R820K763j0968o135O527m748j5663M095J47j8205N237
10922B3828J4279L788j5574o148J344O94j2530Q309P736q652m429l563R793J2365
10908C1240J3259j9885o202O108j375j2957k638J5885k823K274p499o691r704
10895a008O11J0029L054O475R407n100j1813q874J8361J3301p907r679R202j084
$$ y = [689084, 672954, 651174, 626590, 618117, 608356, 585861, 555038, 521546, 488694, 465826, 452904, 443535, 440290, 454471, 484481, 519440, 573501, 649719, 696416, 748927, 781273, 784785, 769438, 715478, 648111, 571972, 500882, 415223, 349990, 293757, 236714, 192758, 177449, 165471, 150716, 129426, 109039, 95459, 86008, 84404, 76522, 78739, 72786, 63467, 61269, 55812, 58519, 50122, 39080, 50958, 60778, 63541, 52573, 46438, 52965, 48217, 32554, 36649, 36796, 18591, 23828, 38107, 41895, 26321, 20173, 21517, 22211, 9681, 17990, 25726, 17074, 12645, 9082, 18875, 31240, 44499, 24614, 18412, 24520, 23145, 10188, 7550, 23435, 20612, 22886, 15387, 8696, -1008, -397, 9632, 12686, 19161, 28568, 23468, 11655, 2781, 21142, 34443, 26536, 16857, 26059, 24975]
10881B4975j2857k129R233J1849Q586K232n775j3986O15K0951K044j6679j8673
10868A0386q585P572J3597m6j78J1202J4131p199o643R014n160p812j3741m947
10854A1591K670o370O389J008p636O619R665Q802J2806O867n844j4623j9721p904
10840D319J5160J1791K40j4481m274J3653P787O118O890k154J156n080r335m354
10826B7436L851o685M081L897j152M263L39j046Q861j96j3286L31L175k12q443
10811B5214o115J6856K228o858j1917L04P778J4254P735r29j559j5709p882J8660
10797D2060j379j2705n959J2116j533m526p715j0660J0546n04j084j993q287O121
10783A4498J1586j4677j3803N648N959m564j7554R066J9379l508Q035Q249l684
$$ y = [24975, 12118, 9989, 19222, 31071, 39657, 41889, 36114, 22128, 22743, 43694, 45738, 29059, 10386, 1801, 9373, 22970, 22924, 22746, 33948, 48079, 40880, 34237, 43251, 38091, 30279, 16538, 11591, 14261, 7891, 14280, 15288, 7652, 14271, 23936, 32738, 45544, 52411, 46567, 31944, 12223, 4319, 19479, 31270, 31510, 17029, 12755, 26408, 34195, 40313, 47203, 45049, 46205, 41125, 31790, 27436, 31287, 24602, 28683, 32580, 31428, 35691, 36030, 34984, 43845, 43649, 30363, 30694, 33869, 33657, 25214, 19099, 35955, 38183, 31325, 19408, 19712, 27490, 41744, 49479, 48550, 46991, 31282, 23400, 42060, 40681, 27976, 22017, 34133, 32600, 28074, 20359, 9699, 20245, 19741, 18657, 16664, 8377, 14498, 26084, 11407, -2396, 3252, 9211, 4647, -12907, -3841, 15538, 12030, 20065, 28314, 24630]
10770B4630q91N29l10R030J989p725k254M784K320j4380r70Q836O651j038j3354
10755A7847m934Q450J2990J1689r499q857n067J0760K633k897M493Q58j6559q239
10741A3668N695L897j0655O499J274j8678j206Q455P720P974N774m0l660R211
10727C5928o140K58k176J0307J5760q71j081j4649p146P130J779k809M360J647
10713D2297p892j3386n217M892J118Q27Q467M654J83O52M257L041j736j1356P969
10698C8770J1228q081K938J0142k256j0871l874k242M597R457O680j4073N908
10685D8323P386j1220j6922O640K493J409o606p894N91J5893m521P27Q794J3213
10671E8306O204Q50p170k713j7327j950n394o169K861O265J1925p112p970q453
$$ y = [24630, 23739, 24268, 23958, 32988, 34977, 27252, 24998, 29782, 32102, 17722, 16752, 25588, 32239, 31201, 17847, 12913, 21363, 34353, 46042, 36543, 27686, 22619, 33379, 36012, 33115, 37608, 38466, 21907, 13668, 19363, 23260, 12605, 19104, 20378, 1700, 494, 8949, 16669, 24643, 30417, 30377, 26717, 35928, 29788, 30046, 27870, 38177, 53937, 53066, 51985, 37336, 30190, 37320, 39099, 36290, 40650, 42297, 34405, 21019, 15802, 20694, 21812, 22639, 31106, 35760, 35943, 36595, 40852, 43893, 42157, 30801, 38770, 49998, 41917, 44855, 54997, 52741, 41870, 37996, 35754, 40351, 49808, 56488, 42415, 48323, 55709, 44489, 27567, 34207, 36700, 38109, 31503, 23609, 24200, 40093, 35572, 36299, 45093, 58306, 64510, 65360, 58190, 55477, 38150, 36200, 30806, 24637, 27498, 33763, 45688, 38576, 30606, 22153]
10657B2153J4752J5352J9023q728p067m159k428J790p579M26J2746O114j3446
10644D8949J300M882k879N10O739N334R734K704p992j4490k410j1655q209J1263
10630D3780M864L276l761M34m930q932R00N988J4737J7469L959O560m666j185
10616G8493k481L31N614L237l168K728k353k334Q768k264o170J4333Q204m123
10602I8815p633l80j082r303N649R353N864P092J3967M345N789J6687Q561R429
10588A67153J6697K0833K8785J1390K1086N0811L4507L8116O1034N2599N4912
10577E57923L3420L8966L0674K8942n459k6161j4523k2774k9492j9938j7240k1933
10565E32405j8818j3567j0667Q538J9703K4864J9733M576J9788K2577J5260P434
$$ y = [22153, 36905, 52257, 71280, 62552, 55485, 51326, 48898, 50688, 43109, 43535, 56281, 62395, 48949, 50249, 55131, 52252, 52762, 59501, 64835, 74569, 77273, 69281, 54791, 52381, 40726, 32517, 43780, 48644, 51920, 48159, 48593, 43663, 34731, 35631, 41619, 56356, 73825, 77784, 84344, 79678, 78493, 76012, 76343, 81957, 85194, 82026, 84754, 82401, 80067, 88835, 86571, 80401, 94734, 102938, 98815, 91182, 90802, 89720, 80417, 86066, 95419, 101283, 108375, 122342, 126687, 132476, 149163, 157724, 167153, 183850, 204683, 233468, 244858, 265944, 316755, 351262, 389378, 450412, 503011, 557923, 591343, 630309, 660983, 689925, 684466, 658305, 643782, 621008, 591516, 571578, 554338, 532405, 513587, 500020, 489353, 497891, 517594, 542458, 562191, 566767, 586555, 609132, 624392, 631826]
10553F31826J3119J0392J9293K9174K9739L1286K7264K2468J3128M54M93j1308
10541H17328j2352k4446l3954k7799l4121j7880q198k6869m1057l0857j7447k3027
10529E19321j1680j0901k9051k8457p264N622J6646J9125L0269M2810J7993M552
10517E68985L4000J8200J8762o263k6366l5443l9749m6084n0047n1317m5101k3856
10505C15721j2816k3924k6229k8515j6455j7127k1210j8336k5691j2752j275o693
10493A04698M994l161k456Q247n075p761j706O572m114L927K133j6918j0964k23
10479G8193L508n527p569q293j623j341o087M776k80p993l175K994M092N493l896
10464E3272q942o352J894J920J0708J2241K429J0902n930j1207l138j2780j292
$$ y = [631826, 644945, 655337, 674630, 703804, 733543, 764829, 792093, 814561, 827689, 828143, 828636, 817328, 804976, 780530, 746576, 718777, 684656, 666776, 658578, 631709, 590652, 559795, 542348, 519321, 507641, 496740, 467689, 439232, 431968, 437590, 454236, 473361, 503630, 546440, 564433, 568985, 602985, 621185, 639947, 633684, 607318, 571875, 532126, 486042, 435995, 384678, 339577, 315721, 302905, 278981, 252752, 224237, 207782, 190655, 169445, 151109, 125418, 112666, 111391, 104698, 109692, 106531, 104075, 112322, 107247, 99486, 97780, 104352, 100238, 104165, 106298, 89380, 78416, 78193, 81701, 76174, 68605, 60312, 58689, 57348, 51261, 56037, 55757, 47764, 44589, 47583, 51675, 57168, 53272, 44330, 37978, 39872, 41792, 52500, 64741, 67170, 78072, 72142, 60935, 57797, 45017, 43725]
10451D3725K766n681q771J596J1127J7814R637o007j6107N955J9165M033j7539
10438F1713R155J4806j0927k13K261n471P928j885k828o141J012O985o032K860
10424G3223J555L612P175m67r807j4335O676O368J0628J2517M228N664J2338R815
10410A29190M658k82J8935K5781K3684J4438K9018K7810L1826L3010K5820J6329
10398C80217L0760J3952q749p151p982k2595j7492k8843m1533m3840k8755l3459
10386A84530k5388k4446j4865k0660k982K86l261q27k907K740J0490j0143n579
10373H6988O188J5340Q325l712j40m063N799M408p477n607M08R559J8931J4325
10359A49272J5958K9881M8668N1389M2163M6401P3407O6389O4759N7738N5556
$$ y = [43725, 46491, 40810, 32039, 33635, 44762, 62576, 72213, 66206, 50099, 56054, 75219, 79252, 61713, 70868, 85674, 74747, 74534, 76795, 71324, 79252, 77367, 74539, 68398, 69410, 76395, 70363, 73223, 74778, 78390, 85565, 85098, 75291, 60956, 67632, 74000, 84628, 97145, 101373, 107037, 119375, 129190, 133848, 133566, 152501, 178282, 201966, 216404, 245422, 273232, 305058, 338068, 363888, 380217, 410977, 424929, 416180, 409029, 401047, 378452, 360960, 332117, 290584, 246744, 217989, 184530, 159142, 134696, 119831, 99171, 96189, 96475, 93214, 92387, 89480, 92220, 102710, 92567, 86988, 93176, 108516, 116841, 113129, 112989, 108926, 114725, 119133, 111656, 106049, 106457, 116016, 134947, 149272, 165230, 195111, 243779, 295168, 337331, 383732, 457139, 523528, 588287, 646025, 701581]
10348G01581L6885L4000P271m895j6421k4870j9354l2233m0147m7657o2997n7374
10336D73789n7313n4402o0052m1347k6938l1973k3541k4627p308j1695j4608j3596
10324A06389j6530j6406O412m144O870J572P870l524K604j208p854p771J2423
10311H6703J4677J668J378j550O789K8759K9922L1667L4828L5056M6472M4644
10299C61013M1541L7460L7633L6059K3255J8743J1607o416j9045k9468m3248m4992
10287D24142m4265n2746m2326k8953m8001l3415k2289l4335j4909p099j8022p62
10275G7020n419o747p055N704J690r883k841j885o011n402j7929m119K2621l827
10261C5917Q019L318j742R684p993l135M93M075M367J486O1m751M729P14j3772
$$ y = [701581, 738466, 772466, 779737, 774842, 758421, 733551, 714197, 681964, 641817, 594160, 531163, 473789, 416476, 362074, 302022, 260675, 233737, 201764, 178223, 153596, 146288, 134593, 119985, 106389, 89859, 73453, 79865, 75721, 82591, 84163, 92033, 88509, 91113, 89905, 82051, 74280, 86703, 101380, 103048, 104426, 102876, 109665, 138424, 168346, 200013, 234841, 269897, 316369, 361013, 402554, 440014, 477647, 513706, 536961, 555704, 567311, 560895, 541850, 512382, 469134, 424142, 379877, 327131, 284805, 255852, 207851, 174436, 152147, 117812, 102903, 95804, 77782, 77020, 71601, 64854, 57799, 63503, 65193, 55310, 52469, 50584, 44573, 39171, 21242, 17123, 39744, 35917, 43936, 47254, 45512, 55196, 47203, 44068, 44561, 48636, 53003, 54489, 54550, 49799, 54528, 55242, 41470]
10246D1470j7631l606k033l826m357O499R51r705k725J8106n965m326O641L899
10232B3392j0859l367N232Q224n574l360J717n960J075n271K374K6P298N025k512
10217A7460M748j3691M41J0470j393J097K694R675J1374j6570j1722l401q114
10204C068R293J1564j1022n553K004n633j141k806l765O230J5310O271R228j6425
10190A6623j6062J0620R196P05j2887j1656l283j450M710J3788J0116j889K440
10177B0971K166O371Q914n932j316j39M481j3279r39L050l883p259L348n882l035
10162G637K959m782m05M097N801L312L197P6p066K010l41M456M630J993k271J3140
10146C8443J729o869j1062j50o441j4235l601J0630M078j2227p819k282O367O045
$$ y = [41470, 23839, 20233, 18200, 14374, 10017, 16516, 17467, 7762, 5037, 23143, 17178, 12852, 19493, 23392, 12533, 9166, 14398, 22622, 17048, 13688, 15405, 9445, 10520, 5249, 7623, 7649, 14947, 19972, 17460, 22208, 8517, 8958, 19428, 18035, 19132, 21826, 31501, 42875, 26305, 14583, 11182, 3068, 12361, 23925, 12903, 7350, 9354, 3721, 2580, -226, -3991, 2239, 17549, 23820, 33048, 16623, 561, 11181, 20377, 21082, 8195, -3461, -6744, -8194, -3484, 10304, 20420, 18531, 20971, 23137, 29508, 38422, 32490, 31174, 31035, 35516, 22237, 21298, 24348, 20465, 13206, 16554, 10672, 7637, 10596, 5814, 5409, 9506, 15307, 18619, 21816, 21892, 14826, 16836, 16495, 20951, 25581, 27574, 25303, 38443, 40172, 33303, 22241, 22091, 15650, 1415, -2186, 8444, 12522, 295, -7524, -9806, -3439, 2606]
10132B606j152p747p603J88q578k03O481Q352J0390M177O421j237m217R988J289
10117A9155O471M654L498J1270p898j3459j544j205q197j6842K32J499J435K372
10103A441j105l04M365L441o052p37J832j1898k234K271Q296J0236J475N9r893
10088A193n837l573K6994R517P874J0144m860j7969j830K347o296j7542j0030
10075i868Q369K748K4243J8320j481k513J022J2714N576l777j5207q885J136L763
10061C6160N489m353l640R699n889n923O87j5733n921n574K123L493J99j0633
10047A84P749J1101l953R007O752n484l583j4903n339p306P924J5717j0431j1611
10033d176q445J1908K150j2506q221O677J4235n226r7N732j219p078j347r124
$$ y = [2606, 1454, -6293, -13896, -13708, -22286, -22489, -16008, -7656, 2734, 6911, 13332, 12095, 7878, 17866, 19155, 25626, 30280, 33778, 45048, 37150, 23691, 22147, 20942, 12745, -4097, -3865, -2366, -931, 1441, 336, 32, 4397, 7838, 1786, 1049, 2881, -9017, -11251, -8980, -684, 9552, 11027, 11086, 1193, -4644, -8217, 18777, 28294, 36168, 46312, 41452, 23483, 21653, 24000, 17704, 162, -9868, -1499, 1249, 25492, 43812, 42331, 39818, 40840, 53554, 59130, 55353, 40146, 31261, 32397, 36160, 41649, 37296, 33656, 43355, 37466, 31543, 32230, 16497, 10576, 5002, 7125, 10618, 10817, 184, 7933, 19034, 15081, 24088, 30840, 25356, 21773, 6870, 1531, -5775, 2149, 17866, 7435, -4176, -12621, -713, 1437, -11069, -19290, -12613, 1622, -3604, -3701, 2031, 812, -6266, -7613, -16737]
10019a6737n32Q994L961q4M901J0375M421j6992K955P003r780k991Q424R413J465
10004A4796o570k475J8613j174j5762k698j031m077J028N723K921r858j0629P567
9990c626o26J3264J4694L414p976o057j3980n7k096j829j580M38M256L986p440
9975e215j4566j213J4512R493o58N707R679l895J063m662K198r773l625J4170
9961A3215j981K121J0206l900n889J0803m974j9593K213J5171L78P58J1484o765
9947B3247j0437R024q113j0002m106K758n736R037J4934J0944r966k2344j6941
9934a7701k122P483J8993k771J3019Q321j6393j4291J47j053n64O129N553q079
9920c329j1340L022K461N487K878l489P388R309m397J842k254J5007Q962l091
$$ y = [-16737, -17269, -8275, -4314, -4398, 503, 10878, 15299, -1693, 1262, 8265, -1515, -4506, 3918, 13331, 14796, 8226, 5751, 24364, 23190, 7428, 4730, 3699, -378, 650, 6373, 9294, -564, -11193, -3626, -4252, 9012, 23706, 27120, 19144, 13087, -893, -950, -3046, -4875, -6455, -6017, -1761, 2225, -5215, -19781, -20994, -6482, 3011, 2353, 8060, 17739, 13844, 14907, 10245, 12443, 2670, -955, 13215, 11234, 13355, 23561, 19661, 13772, 24575, 19601, 8, 2221, 17392, 17770, 18528, 30012, 23247, 12810, 21834, 13721, 3719, -387, 2371, -3365, 5672, 20606, 31550, 21584, -760, -17701, -19823, -12340, 6653, 3882, 16901, 25222, 8829, -5462, -5315, -6368, -6932, -803, 4750, -3329, -14669, -11647, -9186, -3699, -821, -4310, 3078, 12387, 7990, 9832, 7578, 22585, 31547, 28456]
9906B8456N028N676J1552J4695j141m95o223k402j5080j82m554M959j885K193
9892D0597q454m311J0563j114n735R105k546j0517J608J0914N358J0405K7970
9879H3843Q728J1074J6768K0145R855J7865J1597J2492J7838j240k4209j7572
9867A67184k0992k3364j0224r097k3223j7654j5298J1353n792L82o672l750Q815
9854E1668l621o577p60p50j5525P489J253J0393P183O660N65r982R560R081J5706
9839H2343M651m806l652J776M113J6734N1972O8016N7438O7962O2448O3451M2804
9826E15250J3252k0421l6769n1390j9759o502j674k183n956k3785l6581m9000
9814B74482l8395l2357l0728k3837m062L488j1924k710l171P38o969O70j1096
$$ y = [28456, 33484, 39160, 50712, 65407, 64266, 63771, 57548, 55146, 40066, 39884, 35330, 40289, 38404, 40597, 32143, 27832, 38395, 37281, 31546, 40651, 38105, 27588, 29196, 40110, 45468, 55873, 83843, 92571, 103645, 120413, 140558, 150413, 168278, 179875, 192367, 210205, 208965, 184756, 167184, 146192, 122828, 112604, 103507, 80284, 62630, 47332, 58685, 52893, 53275, 46603, 42853, 51668, 48047, 41470, 40710, 39960, 24435, 31924, 33177, 43570, 50753, 57413, 57978, 47996, 57556, 66637, 82343, 86994, 82188, 78536, 80312, 84425, 101159, 153131, 221147, 278585, 346547, 408995, 472446, 515250, 528502, 508081, 471312, 419922, 400163, 393661, 391987, 389804, 383848, 360063, 323482, 274482, 236087, 203730, 173002, 149165, 145103, 148591, 136667, 133957, 130786, 131524, 124555, 125225, 114129]
9801A14129o537j977j8904n695N951j473J6327R390j1832M742Q417P644J6100
9788A36282L2761K5234K4558O0812O8898O6163N8716M7592M2079J6892p652k3232
9776E49103j7230j5387m982j2070N550k2326j4906j2671m0422m2691n0533k5444
9764B95991l6578m0495m3748l4257q610o45o409p437m658K973Q39P049o318o667
9750A11030m628r039j0204j0135j0908q033N070J1186J2848M488J6767J8206K7972
9737A54620K1746R188N827K8656M2928N4904M5717L0930J9103J6164j6004m5088
9725C68691m2665l4329r237j3334p280k3240k5354j8920k0885k2434j2318k6151
9713A12544l2240j1239L207Q442R838j3529j5344L081N233n373p18L57p676j2109
$$ y = [114129, 107592, 105615, 86711, 81016, 86967, 85494, 101821, 111211, 99379, 104121, 112538, 120182, 136282, 169043, 194277, 218835, 279647, 348545, 414708, 473424, 521016, 563095, 579987, 572335, 549103, 531873, 516486, 511504, 499434, 504984, 482658, 467752, 455081, 414659, 371968, 321435, 295991, 259413, 218918, 175170, 140913, 132303, 131658, 125249, 117812, 113154, 116127, 116966, 124015, 117697, 111030, 106402, 97363, 87159, 77024, 66116, 58083, 63153, 74339, 87187, 91675, 108442, 126648, 154620, 176366, 185554, 191381, 220037, 262965, 317869, 363586, 394516, 413619, 429783, 413779, 368691, 326026, 291697, 282460, 269126, 261846, 238606, 213252, 194332, 173447, 151013, 138695, 112544, 80304, 69065, 72272, 80714, 90552, 77023, 61679, 64760, 69993, 64620, 63902, 64259, 56583, 44474]
9699D4474k389L154K334k4473p710J0179R912J308q084J884J569J3812K0417R088
9685G5475J2155K5041J6270O945j0179l437N273J0337J4654Q571j2690k8552k4562
9672I5301j9641j5746q997k324N44o637o252P210J5342l969k4666l016O007m734
9658B8422q177N534O298p99n961j824l427n826n220r239m78J1670O631M165o515
9643A5254M074N187J021Q632M394R310k579N750J311j2667j0597N105K333L704
9629D0232K1417J3538j231j4773n681k953m859r658j2662J2872Q489j1385k087
9616C1259R278J2956K779j3356r23R444J4764J690j4552n396K666J941Q297j1212
9602D9635o937m869J8516P407j8626j2558J752m151k649P906J7927n112j6199
$$ y = [44474, 42085, 45239, 47573, 23100, 15390, 25569, 35481, 36789, 28705, 30589, 32158, 45970, 66387, 75475, 87630, 112671, 128941, 135886, 125707, 122270, 127543, 137880, 152534, 161105, 148415, 119863, 95301, 75660, 59914, 50917, 48593, 49137, 42500, 36248, 43458, 58800, 54831, 30165, 27149, 33156, 28422, 20245, 25779, 32077, 31278, 25317, 23493, 20066, 14240, 9020, -219, -697, 10973, 17604, 21769, 15254, 19328, 24515, 25536, 34168, 38562, 47872, 45293, 51043, 52354, 39687, 29090, 34195, 36528, 40232, 61649, 75187, 73956, 59183, 53502, 50549, 45690, 36032, 23370, 36242, 44731, 33346, 31259, 40537, 53493, 56272, 42916, 41993, 51437, 66201, 67891, 53339, 47943, 50609, 52550, 60847, 49635, 42698, 37829, 56345, 63752, 45126, 32568, 34320, 30169, 27520, 35426, 53353, 48241, 32042]
9589C2042N28K5355J5788k908J7824m334n825O116O109m936k384p094j7077m761
9575E4443R777R559o28p151q200J1697J2272j5239O194J3803n051L572J3665n362
9561I3351p842k845J4753J1289p411n964R001P155J5012J03j529K813j0299K947
9547A20534J4312J8899m84j4026L54K2782J3095J5549J9430O886m849M649J5738
9534B32869M136R416P299R710J0594Q503l33Q225P127N545R927J0495J6230P303
9520C47046N179J7561J0513R012o677J9259J7882K431L0782K6892K1197L4754
9508E35831K5989L6426K3596K2850L0932K3061M3485M5905M8614N8291O7325N8819
9496A021124M7056N3959O9550Q3193Q6881J05697J25034J18750J13821J20506
$$ y = [32042, 32570, 57925, 73713, 70805, 88629, 84295, 78470, 84586, 90695, 85759, 83375, 76281, 59204, 54443, 64220, 73779, 73151, 66000, 57800, 69497, 81769, 66530, 72724, 86527, 81476, 85048, 98713, 93351, 85509, 82664, 97417, 108706, 101295, 95331, 104332, 111487, 126499, 126602, 125073, 127886, 117587, 120534, 134846, 153745, 153261, 139235, 139589, 162371, 175466, 191015, 210445, 217331, 212482, 217131, 232869, 237005, 246421, 253720, 263430, 274024, 282527, 282194, 290419, 297546, 303091, 313018, 323513, 339743, 347046, 352225, 369786, 380299, 389311, 382634, 401893, 419775, 422206, 452988, 479880, 501077, 535831, 561820, 598246, 621842, 644692, 675624, 698685, 742170, 788075, 836689, 894980, 962305, 1021124, 1068180, 1122139, 1191689, 1274882, 1361763, 1467460, 1592494, 1711244, 1825065, 1945571]
9486A945571J19698J18237J21968J16107J29344J11918J02720Q3392M9424L6581
9476B934960K2767O31m1661o9159p8996r6618j11472j17325j25789j25544j29203
9465B062591j16208j01244j03744j13621j15995j14161r5419p7932p1235o5497
9455A087535p1342p3461m9947m9314m0664m8318m7360l5882m4694l8170l6583
9444E51800l5540j1309j7921l0572j9848j5817k2165q155L244k3316j5814o793
9432C47794r059j9085k7247j7490k259p817j5281j224J068N096k2104j5955p529
9419B08908j87j216j0000o308q356q415n223j6690m442o708m54n056q222N936
9405A33567Q21l922j186R247K701n415j4743j1276k216Q657K276k311k942p300
$$ y = [1945571, 2065269, 2183506, 2305474, 2421581, 2550925, 2662843, 2765563, 2848955, 2898379, 2934960, 2957727, 2958358, 2916697, 2847538, 2768542, 2671924, 2560452, 2443127, 2317338, 2191794, 2062591, 1946383, 1845139, 1741395, 1627774, 1511779, 1397618, 1302199, 1224267, 1153032, 1087535, 1016193, 942732, 892785, 843471, 802807, 754489, 707129, 671247, 626553, 588383, 551800, 516260, 504951, 487030, 456458, 436610, 420793, 398628, 390473, 393717, 370401, 354587, 347794, 338735, 319650, 292403, 274913, 272654, 264837, 249556, 248332, 249400, 254496, 232392, 216437, 208908, 208721, 207505, 197505, 191197, 182841, 174426, 169203, 152513, 148071, 141363, 140909, 135853, 127631, 133567, 134388, 130466, 129280, 138527, 141228, 135813, 121070, 109794, 107578, 116235, 118511, 116200, 113258, 105958]
9391A05958j4825j0583j944Q750R570m449p478j0611N646J0380Q623P135L559
9378A09731Q301o33m248r2j7088j8523O088M897j3640P624J3050l61K727M50r580
9363H8703j2419j359J4735k829L061q33q186K060o095j679q276K029P997j0612
9349F6297K651j117p093P303K456P553l99r108K110K977j2316r978J2427J5454
9335G9217M67m411q553k070o771j829K569J0383j476k142m695J1551M309o040
9321G0509j2705P697m15j911q873Q77n766M959j840n482Q275J5790l353Q24Q867
9306G7453r132p408l258o712m92J4008M663j2533l319J5213N874o198p157r511
9292E1491p401k234R6r426j1142J2464K7675l250j3706N118L460j1324j1728j4677
$$ y = [105958, 91133, 80550, 78606, 87356, 96926, 92477, 84999, 74388, 80034, 90414, 99037, 106172, 109731, 118032, 117399, 113151, 113059, 95971, 77448, 83536, 88433, 74793, 82417, 95467, 95106, 97833, 98283, 88703, 76284, 74925, 89660, 86831, 89892, 89059, 80873, 82933, 76838, 75159, 66883, 68912, 76909, 66297, 68948, 67831, 60738, 68041, 70497, 78050, 77651, 68543, 70653, 73630, 61314, 51336, 63763, 79217, 79684, 75273, 66720, 64650, 57879, 56050, 58619, 69002, 67526, 65384, 60689, 72240, 76549, 70509, 57804, 65501, 65086, 63175, 54302, 55179, 49413, 54372, 52532, 47050, 55325, 71115, 67762, 68586, 77453, 68321, 60913, 57655, 50943, 50451, 64459, 69122, 56589, 53270, 68483, 74357, 68159, 61002, 51491, 44090, 41856, 41952, 32526, 21384, 33848, 61523, 58273, 44567, 49685, 53145, 41821, 30093, 15416]
9278A5416q463j520J1098J1251R608k809k43J811J2934O485p553k744n8k947o522
9263C5744J654j240M889R198J0350j5036j4013m484P560J9476m6P150k01r88J7819
9248G7832R118K0831J0425L2363K0450L4542N0868Q6336J29250J79580J90355
9237H41950Q2946l1691q8645j13167j19262j03696r6829p8366m7225l1935l1025
9226A83055l0417k4432m839j6558j6242q506n506L079J1553L071j1625q716q398
9213F5519O909o34J1526K6969J2973J271o217m810J2890J6876J6817K7638L9949
9200B27676K9344L2867N8162R6259J42775K41120L73112L88059J56463n5553j38639
9189A551645k19353k38350k14108k04963j65137j14399p1356m7031m9495m9321
$$ y = [15416, 6953, 5433, 16531, 27782, 37390, 34581, 34338, 36149, 49083, 55568, 48015, 45271, 45213, 42266, 35744, 37398, 36158, 41047, 50245, 60595, 45559, 31546, 27062, 34622, 54098, 54052, 61202, 61001, 60013, 77832, 86950, 107781, 118206, 150569, 171019, 205561, 256429, 342765, 472015, 651595, 841950, 924896, 893205, 804560, 691393, 572131, 468435, 371606, 293240, 246015, 214080, 183055, 152638, 128206, 123367, 106809, 90567, 82061, 76555, 79634, 91187, 94258, 82633, 73917, 65519, 72428, 71794, 83320, 110289, 123262, 124533, 118316, 113506, 126396, 143272, 160089, 187727, 227676, 257020, 289887, 348049, 444308, 587083, 828203, 1201315, 1589374, 1745837, 1690284, 1551645, 1332292, 1093942, 879834, 674871, 509734, 395335, 323979, 276948, 227453, 178132]
9179A78132k3492j1104p951m237q107j8432P82j3616r890N885J992M374M270j1848
9165H6758m945J949J7208q866o649n028J0564J3990K2492J3628Q492J3641J7851
9152A81085L7886O4230J21290J76635J86086J11941j1917o8299r1765j12470j25210
9141D69492r9962q9744o1407l2483k3760k6849j5298r452j8268k0442O19J0704
9129H3150R828j288n184j1444l806K125k030J0915K103l530o924n126l761j3180
9115E1848j701l185n310K253O024k89J784p717j496L753M735K888K43O748N582
9100F6160K1599K5050J0684k839K20J3757J2085j0217m090M886l250N591Q510
9087A48146j4575k9717j1810j1354j194Q670l659k2146J729P389M133K122j053
$$ y = [178132, 154640, 143536, 135585, 131348, 123241, 104809, 105591, 91975, 82085, 87970, 89962, 94336, 98606, 86758, 81813, 83762, 100970, 92104, 85455, 80427, 90991, 104981, 127473, 141101, 149593, 163234, 181085, 218971, 283201, 404491, 581126, 767212, 879153, 867236, 798937, 707172, 594702, 469492, 369530, 279786, 218379, 185896, 162136, 135287, 119989, 110537, 92269, 71827, 72446, 83150, 92978, 91690, 86506, 75062, 71256, 73381, 71351, 82266, 84369, 80839, 73915, 68789, 65028, 51848, 50147, 46962, 41652, 43905, 49929, 49640, 51424, 43707, 42211, 45964, 50699, 53587, 53830, 60578, 66160, 87759, 112809, 123493, 120654, 120874, 134631, 146716, 136499, 132409, 137295, 134045, 139636, 148146, 133571, 103854, 92044, 80690, 79496, 88166, 84507, 62361, 64090, 71479, 75612, 77734, 76681]
9074G6681R379J9048j2763j3828P029n721k409J122N328J1357j479j3984k674
9061G7086P198J511K0938L655l037J8359J8689J2205K0386J7267J4824P443K1941
9048B38465J6302j2589p421J6491j2064j2182l629k7810l9898k1437j5939k47
9036A18042J219J557r2N742N912j2639j3102k9018j9459k1512l383J0310J3418
9023E6995J4651J37Q236o046l203L914O592L92p221J3011P500k533M425J2709
9009A09559J2694K4437N943N199J8999J0133J3845m961J4388N957q885j668r646
8996A95994j8424p421m998K063R018J8300J4726K4513J5403Q748k5752n8124o4105
8983A09941m8757l1482o387J6982q22m78J7412J3509J9826L697m051K7050M4414
$$ y = [76681, 86060, 105108, 92345, 78517, 85546, 79825, 77416, 78538, 83866, 95223, 93744, 79760, 77086, 84284, 85795, 106733, 110388, 107351, 125710, 144399, 156604, 176990, 194257, 209081, 216524, 238465, 254767, 242178, 234757, 251248, 239184, 227002, 223373, 195563, 155665, 134228, 118289, 118042, 119261, 120818, 120726, 126468, 132380, 119741, 106639, 77621, 58162, 36650, 33267, 43577, 56995, 71646, 71783, 80019, 73973, 70770, 74684, 81276, 81668, 74447, 87458, 94958, 92425, 96850, 109559, 122253, 146690, 152633, 157832, 176831, 186964, 200809, 195848, 210236, 216193, 207308, 205640, 195994, 177570, 170149, 165151, 167214, 176232, 194532, 209258, 233771, 249174, 257922, 232170, 174046, 109941, 61184, 29702, 23315, 40297, 39475, 38997, 56409, 69918, 89744, 93441, 89390, 116440, 160854]
8970A60854M6166N2575M7966O5063M5079j8402l5566m7559m3925k4365j1460j5037
8958B21389q983j4069R897J839q56j381r380j3475n377m4l592J3803O850K7035
8944B23656J7765L0416L7211K854j9601l8193l0878p773O233M830j3660L90Q909
8931B22159J3201J8344O421L384K5554M7576P6351J06622J17198J24846R5032
8920H56688j8902p7513j14439q4561m6600m1705j8188k1111k9761k6118j3202
8909C64588q171j0337j0360r10Q576j1220j005J3849J6659M7830N4180P2790L2356
8896E68825K0550L512j6929r111O440o84m962r674K0436L9593K7561K053K9890
8883F77500O7791N9581N3242M4983N2114P2755R7334R9558N6682J3515j6966r550
$$ y = [160854, 207020, 259595, 307561, 372624, 417703, 399301, 363735, 316176, 272251, 247886, 236426, 221389, 212406, 198337, 208234, 210073, 209217, 207836, 198456, 184981, 179604, 179560, 175968, 189771, 196621, 223656, 241421, 271837, 309048, 311902, 292301, 254108, 223230, 215457, 221690, 226520, 212860, 213250, 222159, 235360, 253704, 260125, 263509, 289063, 336639, 412990, 519612, 636810, 761656, 856688, 837786, 760273, 645834, 561273, 514673, 472968, 454780, 433669, 403908, 377790, 364588, 356417, 346080, 335720, 334810, 343386, 332166, 331161, 345010, 361669, 409499, 463679, 536469, 568825, 589375, 592887, 575958, 566847, 573287, 572603, 567641, 557967, 578403, 617996, 645557, 647610, 677500, 745291, 804872, 858114, 903097, 955211, 1027966, 1125300, 1224858, 1281540, 1295055, 1278089, 1268539]
8871A268539L0883N5783J03549R1714P3996Q8499Q9592R4581R9895J21304J44011
8860B262346J85947K03823K55313L33136M19057N24247O91552Q46837J024717
8851F746975J122140J197566J341803J621465K100620K842431M041122N941199
8843B6955321R106333J4528490K3651584L5439022L8264133J8039325o245743
8836A59738465j5790185k0702905k2845146k1865809j8796467j4492792j0406246
8829C4838915p351563n300722l881308k861309k089329j481667j065920q38650
8821I968447o58186n42443m87203l97427k59384j12909p790Q6980K09354L38469
8811H137908N39679P83857J068005J446178J808543K011655K169509K476970K964522
$$ y = [1268539, 1299422, 1355205, 1458754, 1550468, 1624464, 1712963, 1802555, 1897136, 1997031, 2118335, 2262346, 2448293, 2652116, 2907429, 3240565, 3659622, 4183869, 4875421, 5722258, 6746975, 7869115, 9066681, 10408484, 12029949, 14130569, 16973000, 21014122, 26955321, 36061654, 50590144, 74241728, 109680750, 147944883, 165984208, 159738465, 143948280, 123245375, 100400229, 78534420, 59737953, 45245161, 34838915, 27487352, 22186630, 18305322, 15444013, 13354684, 11873017, 10807097, 9968447, 9310261, 8767818, 8280615, 7883188, 7623804, 7510895, 7503105, 7590085, 7799439, 8137908, 8677587, 9461444, 10529449, 11975627, 13784170, 15795825, 17965334, 20442304, 23406826]
8802B3406826L823281N219496P335911J0677465J6306988K6147199M3680721O9607554
8794B06205441Q2024745M1626063j2032629l0460074m0476451m5430044m4056859
8787A57400192l8451547k9876615k1443853j5120409j0897923p994416n961525
8780B7653904m447850l184647k366059j942092j576544j373269j249167j056542
8772A0457734q55657o45148n06069m24582k91810j38783K728J20863K85983M73909
8762H479168O69829Q29569R68153J131316J349060J742951K406042L408694M945155
8753B5929937P522882J1916158J9414549L0442986L7913538K5265497o74190j3832013
8745A43899344j8988183k2071023k1801541j9351194j5368351j1199411p911266
$$ y = [23406826, 27230107, 32449603, 39785514, 50462979, 66769967, 92917166, 136597887, 206205441, 288230186, 329856249, 317823620, 287363546, 246887095, 201457051, 157400192, 118948645, 89072030, 67628177, 52507768, 41609845, 33615429, 27653904, 23206054, 20021407, 17655348, 15713256, 14136712, 12763443, 11514276, 10457734, 9602077, 8956929, 8450860, 8026278, 7734468, 7595685, 7598413, 7719276, 8005259, 8479168, 9148997, 9978566, 10946719, 12078035, 13427095, 15170046, 17576088, 20984782, 25929937, 33452819, 45368977, 64783526, 95226512, 133140050, 158405547, 157731357, 143899344, 124911161, 102840138, 81038597, 61687403, 46319052, 35119641, 27208375]
8738B7208375n702830m208936l157022k363700j712463j260727j032608q55259
8730F914830p33576o86292n83247m98386m29047l58284l25152k70002k25029j96218
8720B609597j86217j73060j48347j14221q2289m4702m1553n6856q7305r6689j16481
8709A461877j15152q6091m3662k0955j8438l3989j1446k428k6865n3311o5999
8698I83541o2724l1356l4774k7243l0877l3126l1222j0410j2198p290K834K361
8686G07516P387l499j6741l4750K932r09m055J013m302k9975k3816k508m782m289
8672E89222l468J7724K7161M7560N3536J9383l5729n7847o0753m3184l0596j7406
8660E05603q853j2955j2903j3809J112q207j0910j6730j6880j5367P941j347l1202
$$ y = [27208375, 21505545, 17296609, 14139587, 11775887, 10063424, 8802697, 7770089, 6914830, 6181254, 5494962, 4911715, 4413329, 3984282, 3625998, 3300846, 3030844, 2805815, 2609597, 2423380, 2250320, 2101973, 1987752, 1905463, 1860761, 1819208, 1762352, 1675047, 1578358, 1461877, 1346725, 1260634, 1216972, 1196017, 1177579, 1143590, 1132144, 1129716, 1102851, 1049540, 983541, 920817, 889461, 854687, 827444, 796567, 763441, 732219, 721809, 709611, 702321, 705155, 707516, 714903, 711404, 694663, 659913, 662845, 661936, 657881, 658894, 654592, 624617, 600801, 598293, 593511, 589222, 585754, 603478, 630639, 678199, 731735, 751118, 715389, 657542, 596789, 553605, 523009, 505603, 496750, 483795, 470892, 457083, 458195, 449988, 439078, 422348, 405468, 390101, 398042, 396695, 365493]
8647C65493k6865n168p762j0950n257l463Q866K7533n732k3217j3106o34J9791
8634C19529R411j6550k0978q171J2605R220L04J2421K4892P267Q944J9794R662
8621C88350q875j7053k6586j5132q403M457N534J734j165q64L32n724o184O349
8607C16770J0507J0334J2525K1538N474l7414l2329l7735l6343r5J4687j2429
8595B35490J3375J4747k0478k4820l215J4443P566O762R285J4067J5168K5174
8583C07564K3970J3884j020o756n273k8955j4980j3519j7376k8181k4976q898
8571A95484N7K997o447k0129j4064n990N764J0060O977N747p055P059N867R182
8557A95509o987k1648j6150K454N44q416J843k984j3455k5671j1733M264P870
$$ y = [365493, 338628, 333460, 325698, 314748, 309491, 306028, 314894, 342427, 336695, 313478, 300372, 299738, 319529, 328940, 312390, 291412, 283241, 295846, 305066, 305370, 317791, 342683, 349950, 358894, 378688, 388350, 379475, 362422, 335836, 320704, 312301, 316758, 322292, 324026, 322861, 321997, 322329, 316605, 310421, 316770, 327277, 337611, 350136, 371674, 377148, 339734, 307405, 269670, 233327, 233232, 247919, 235490, 248865, 263612, 243134, 218314, 215099, 229542, 237108, 243870, 253155, 267222, 282390, 307564, 331534, 345418, 344398, 337642, 332369, 303414, 288434, 274915, 257539, 229358, 204382, 195484, 195541, 198538, 192091, 171962, 157898, 151908, 157672, 167732, 174709, 180456, 173401, 180460, 186327, 195509, 188522, 166874, 150724, 153178, 153722, 145306, 147149, 144165, 130710, 105039, 93306, 97570, 105440]
8544A05440p396n142R244P366J3238N285n559r210N815L063J5058R388l220j0648
8530A32722n717l86j2085N220l58k6867m209J0411R798k240j2416p249J0957J9417
8516A16998K712q413k427j7582o104k82l196r353K476L582j03P233O589L557o975
8501H8712j2958j1831J8792M301L158O410n098r319Q815J973j1019j118o052K039
8487G6805N781N674N259q049m512O745N017r80q76j0088L448r67n747N22J0450
8472H8482J0286l212n763R54l479o087j0623j5856j0000J6420L735J727j939j0888
8458E3757n949n933Q723J0086j9q291J2867K383J2682J9270J1798P136K753P19
8444A21982M105J1546K292k890K9027M6795N7155Q4835J43083J90823J91329O3530
$$ y = [105440, 98044, 92902, 102146, 109512, 122750, 128035, 122476, 113266, 119081, 122144, 137202, 146590, 143370, 132722, 127005, 126619, 114534, 119754, 119396, 92529, 88320, 98731, 108529, 106289, 93873, 86624, 97581, 116998, 119710, 111297, 108870, 91288, 85184, 84902, 81706, 72353, 74829, 78411, 78308, 85541, 92130, 95687, 88712, 75754, 63923, 82715, 87016, 90174, 96584, 91486, 82167, 90982, 92955, 81936, 80818, 74766, 76805, 82586, 88260, 93519, 85470, 80958, 87703, 92720, 91740, 90864, 80776, 84224, 83257, 77510, 78032, 88482, 98768, 95556, 89793, 90747, 87268, 81181, 70558, 54702, 44702, 61122, 64857, 66584, 64645, 53757, 47808, 41875, 50598, 60684, 60665, 52374, 65241, 67624, 80306, 99576, 111374, 118510, 121263, 121982, 126087, 137633, 139925, 137035, 166062, 212857, 270012, 354847, 497930, 688753, 880082, 943612]
8432I43612n3334q7494j16065j27465j04855j03651r0857o0728l4026j2141j3132
8421A39864l3800j6394p150N388j5710j2647J2820M675k452l801k911M212J2918
8408H5012J5036L485k20m258j085Q656J1354J5653K1225J8864J5341K4537L2536
8395B46136L5432O9848J01435J46451K50514L83736L87367J48418o7922j75476
8385A525939k31297k48728k24830j90825j41620r5944p7501p0884m6146l0828
8375A67336j1229j7099p421j1265O654q521k2221j4898r030J04N86Q457J3442
8362I4895P169j641o700q983l667k959r088P352J4989J9570J1852P235L1028L8128
8348A99180L4896N8941J21859J77299J95644R6039k2399p2012j04031j18393j09132
$$ y = [943612, 890278, 802784, 686719, 559254, 454399, 350748, 259891, 199163, 165137, 152996, 139864, 106064, 89670, 82520, 87908, 72198, 59551, 72371, 77046, 74594, 70793, 67882, 72094, 85012, 100048, 103533, 103313, 99055, 97970, 106626, 117980, 133633, 154858, 173722, 189063, 213600, 246136, 281568, 351416, 452851, 599302, 849816, 1233552, 1620919, 1769337, 1701415, 1525939, 1294642, 1045914, 821084, 630259, 488639, 392695, 315194, 244310, 198164, 167336, 156107, 139008, 131587, 120322, 126976, 118455, 96234, 81336, 72306, 72410, 72996, 81453, 94895, 102064, 100423, 93723, 84740, 81073, 78114, 69026, 76378, 91367, 110937, 122789, 130024, 161052, 199180, 234076, 293017, 414876, 592175, 787819, 883858, 861459, 789447, 685416, 567023, 457891]
8337D57891j05713q0365n2480l8871l2455k8500k4007j9385l557P839k0100j5674
8325D4623k445K1670K693r418q10l50L377r533n094l606j3619LJ6703n11j2670
8310C1013n926j0673p903n634N150J3298J183n432l290J632q99m082n411r482
8296f456k487J5252J1410P030J2419p215m109p223l018N833K294M258J740L592
8282C3320N406m260L052P81p811L493L643j2866j3262j4283K597J2349Q046o291
8268A3914j4333j0631r552J0039J6695m694L19o307j7618R100J9178n125K780
8255C765P477r214k120j3748J525J3233j520N585K821N174J83r063J791K716J202
8240I807N017n817j0436j779p043j301L7Q400o522o815J2190K501o573Q44O108
$$ y = [457891, 352178, 271813, 219333, 180462, 148007, 119507, 95500, 76115, 72558, 80397, 60297, 44623, 42178, 63848, 66541, 57123, 56313, 55963, 59340, 49807, 44713, 41107, 27488, 27491, 44194, 43683, 31013, 25087, 14414, 6511, 877, 6027, 19325, 20508, 15076, 11786, 13418, 12519, 8437, 3026, -6456, -8943, 6309, 17719, 24749, 37168, 29953, 25844, 18621, 15603, 21436, 23730, 27988, 29728, 33320, 38726, 34466, 37518, 38299, 30488, 33981, 37624, 24758, 11496, -2787, -190, 12159, 20205, 13914, -419, -11050, -20602, -10563, 6132, 1438, 1757, -4550, -22168, -13068, 6110, 985, 3765, 11242, 2028, -92, -13840, -12315, 918, -602, 4983, 7804, 12978, 13161, 4098, 5889, 8605, 9807, 14824, 9007, -1429, -3208, -10251, -11552, -11515, -3115, -9637, -16452, -4262, -1761, -8334, -7490, -1382]
8225a382j792n592r941J0547P254J0183J2746j834j4623j5208P62M976K269J4017
8211A2382R551o446n327j514M434J4241l83j4102K348j5355r041J8428K1687k238
8197B8665j6881p203m96Q656L298n028N24r757L868n902o749l963j0611J2547
8183i032J7815O916J2169o031j0062l321r55J7587J26j6312r965N61M585J1420
8169A5501j102R442J2872n414k1224q237j487p027p28J7688J5650m50o389j468
8155A7627N520P142L978p424q375o84q002M395O286N245l733l388k243r419j5671
8140h746j171o322j0079J786J925m16L449O183K0945M702m033Q208L567m255k204
8125A3539P325j164n132k417j221l642J894N491Q360r290j2873L613K292n078
$$ y = [-1382, -3174, -8766, -18707, -8160, -906, 9277, 22023, 20189, 5566, -9642, -8880, -3904, -1635, 12382, 21933, 15487, 10160, 8646, 13080, 27321, 26938, 12836, 15184, -171, -9212, 9216, 30903, 28665, 11784, 4581, 4085, 12741, 16039, 11011, 11535, 1778, 5646, -256, -7005, -10968, -21579, -9032, 8783, 15699, 27868, 21837, 11775, 8454, 7499, 25086, 25212, 8900, -1065, -504, 4081, 15501, 14399, 23841, 36713, 31299, 10075, 1838, 351, -6676, -7404, 10284, 25934, 25484, 19095, 17627, 23147, 30289, 34267, 26843, 18468, 17784, 9782, 14177, 20463, 25708, 21975, 18587, 16344, 6925, -8746, -9917, -16239, -26318, -24532, -22607, -23023, -19574, -13391, 7554, 12256, 8223, 16431, 19998, 15743, 13539, 20864, 19700, 14568, 12151, 10930, 7288, 9182, 14673, 23033, 13743, 870, 4483, 6775, 1697]
8111A697N581O966m841n87j696q96J396j3702n49J1460K590J3998k670r540r298
8096i1P453J5442r536j5152q428L149J1716L481J939n77o50N6Q104j677l967Q119
8080A9381j1897j9334m795L285R396P846l619J6162o18l715q631N448k924q953
8066b968n511J3398N53m882M842K422M817L986L136l035J005j403o518j770oK275
8050A0341n078J5321q87j1827M908L891j2837m000J2538k66m299m17J4461m110
8036A7739L24K411j0076L618P092J4681k266j4233j125q520Q51n768L556Q6K92
8021H662K0042J4969M672j1749m111L255M803k589q932r830j8418p05n26j020
8007a477O66J0586J9456J3855J0016O209J10j5891j1205J9501J6964j6626j5249
$$ y = [1697, 7278, 14244, 9403, 8816, 7120, 6224, 7620, -6082, -6631, 4829, 7419, 21417, 18747, 9207, -91, 7362, 22804, 13268, -1884, -10312, -7163, 4553, 8034, 9973, 9396, 8746, 8802, 16906, 15229, 11262, 19381, 7484, -11850, -16645, -13360, -3964, 3882, 263, 16425, 15807, 12092, 3461, 8909, 5985, -2968, -8479, 4919, 5472, 590, 5432, 7854, 12671, 16657, 19793, 16758, 17763, 16360, 9842, 8072, 8066, 10341, 5263, 20584, 19697, 7870, 12778, 16669, 3832, -168, 12370, 12104, 7805, 7388, 21849, 17739, 18063, 20474, 10398, 14016, 21108, 35789, 33523, 19290, 18165, 9645, 10496, 4728, 8284, 8370, 8662, 28704, 43673, 48345, 36596, 32485, 35740, 40543, 37954, 29022, 19192, 774, 69, -457, -1477, -811, 9775, 29231, 43086, 53102, 59311, 59421, 43530, 32325, 51826, 68790, 52164, 36915]
7994C6915j6554M85N16J5494J0511q015M683R393M102N353P435L371j442N96j4256
7979E8587k0162k2259l133Q360R485Q840m66p747k94l891Q107L256r096j353R147
7964C7381j5294j569J0497O254P356J3265j7688M087O566n378m982n578k0216
7951A4701k145J1612P320N031J406N909P27l443M476J4157L924p500j6038K730
7937D2867K208J58L930J518L422n677j4133R59P376N20j4307K445K546q631J704
7922B6905j27J7436k854m367r963j7442N12J5729R792M346J6222l014k556K26
7908E0845o183M649L466p894L150j1015l683J226N23Q365o321n206o712j750P824
7893C1284L620R161n80L978j973l817p561k0469p320M946L939O601Q259J2143
$$ y = [36915, 20361, 20846, 21362, 36856, 47367, 39352, 44035, 53428, 57530, 62883, 70318, 73689, 72247, 72843, 58587, 38425, 16166, 13033, 21393, 30878, 39718, 39252, 31505, 31211, 27320, 35427, 38683, 29587, 28234, 37381, 22087, 20518, 31015, 37269, 44625, 57890, 40202, 44289, 50855, 45477, 40495, 34917, 14701, 12556, 24168, 31488, 36519, 37925, 43834, 44561, 41118, 45594, 59751, 63675, 56175, 40137, 42867, 45075, 45233, 49163, 50681, 54103, 48426, 34293, 35252, 42628, 43148, 28841, 31286, 33832, 25201, 26905, 26778, 44214, 41360, 36993, 27030, 9588, 10100, 25829, 35621, 39967, 56189, 53175, 50619, 50845, 44662, 49311, 52777, 44883, 48033, 37018, 33335, 34561, 35084, 43449, 37128, 31922, 25210, 23460, 31284, 34904, 44065, 43485, 47463, 45490, 41673, 34112, 13643, 6323, 11269, 15208, 21809, 30068, 42211]
7879D2211r690j2191j249K496j311j0186L926J3483n290j1060o165j727q469J5915
7865A0693O216j5633j910J5914J2595J5828n072l765j0321n199L512r233r025
7852D600J2604R765J012o790P66J279o528j2032O46J769L951J0207J271J674j3857
7837A0337J325j2618J2533r4n365p040J1445J3933j0787j166m230r487J931L774
7823D491O718O60j711L41n857j895K386j434m409m737p101P659m304j520L230
7808g483N595k006j654n40M907N512m559n387J7867O789j437N25j1239n285K484
7793D089q18N551N848k876r566K569p095L16L799j0306l213N44M443j4117K638
7778a8194O334r27n961M950M704J594Q755N721r388n021L097P969l196J1209J296
$$ y = [42211, 32521, 20330, 19081, 21577, 20266, 10080, 14006, 27489, 22199, 11139, 4974, 3247, -5222, 10693, 16909, 1276, -634, 15280, 27875, 43703, 38631, 34866, 24545, 19346, 22858, 13625, 4600, 17204, 26969, 27981, 21191, 21957, 23236, 16708, 4676, 5322, 7091, 11042, 21249, 22520, 24194, 10337, 11662, -956, 11577, 11483, 6118, -922, 10523, 24456, 13669, 12503, 8273, -1214, 717, 4491, 11209, 11869, 10158, 10499, 4642, 2747, 5133, 3699, -710, -5447, -12548, -4889, -9193, -10713, -7483, -1888, -3894, -5548, -6088, -1181, 4331, -228, -5615, 12252, 19041, 17604, 18129, 6890, 1605, 4089, 3271, 8822, 14670, 11794, 2228, 4797, -2298, -1982, 1817, -8489, -11702, -11158, -6715, -20832, -18194, -11860, -12787, -18748, -13798, -9094, -7500, 1255, 6976, -2412, -7433, -4336, 3633, 437, 11646, 12942]
7763A2942q967j2450n546J0761M785m270j5117k123k899J107m300K909m77l944
7749b7589J3626J2172J63J9529K3024K759n390j4882j8838j6273j4237j483N527
7736b1892J930J5971J9919L183p018j2272k983J0020J103j4452r193K671J0096
7723b917M767N399q446o294J367l906N624n568J342Q823n632r64N379M175j2658
7708i509K266J4921P601N67j3384j2177l946J016J0824J502m412L675R597j4646
7694f105M604J5926j427m529J0058R239j0054J69l745M919n780n586o076m729
7680c116K919m010k17p314n223j0841L494m858L712O719N678j0015o324Q056o017
7665b7357J237J134P897k521j979p53J1212J7441Q866n525q905m510j1174P217
$$ y = [12942, 3975, -8475, -14021, -3260, 1525, -2745, -17862, -19985, -22884, -21777, -26077, -23168, -23645, -27589, -13963, -1791, -1628, 17901, 40925, 43684, 38294, 23412, 4574, -11699, -25936, -27419, -21892, -19962, -3991, 15928, 19111, 12093, -179, -3162, 6858, 7961, -6491, -15684, -13013, -2917, 1850, 7249, -1197, -7491, -6124, -10030, -4406, -9974, -8632, 191, -5441, -6405, -1026, 3149, -9509, -7243, 7678, 15279, 15846, 2462, -9715, -13661, -12645, -1821, -319, -4731, -1056, 8541, -6105, -1501, 14425, 12998, 8469, 18527, 27766, 17712, 17881, 14136, 19055, 13275, 7689, 1613, -3116, -197, -4207, -4424, -11738, -16961, -27802, -24308, -29166, -25454, -18735, -13057, -23072, -29396, -21340, -27357, -26120, -24986, -17089, -19610, -21589, -22342, -11130, 6311, 15177, 9652, 747, -3763, -14937, -7720]
7651g720J2568k076J0081j9515j2364p27l794m617J3459K049R347l634p106P913
7637f136J971p079l012N185j0391l531Q121N801P621M814J3198P817q845k897
7623A2637M456K813p033P76N99J081m69j101k541o533o236R2k533M840N45k494
7607a101l265Q18j3743M90l853q765J2701J0967J4310j2765j4029l874k816m52
7593b5377q451L010Q090R739L933k814l230j0779j639L88O262n528O564J1517
7579h315L493K270o67p480k142O721R519K426n49n963j6078j5132j270J395J0754
7564b1018J2730l192Q301k8P574J1534R117O210K645k1922j6108j1396r278K181
7550b2650J7625k318N372M864O003Q172k590o235m756p331n616k55q092m642O102
$$ y = [-7720, 4848, 2772, 12853, -6662, -19026, -19753, -23547, -28164, -14705, -12656, -3309, -6943, -14049, -6136, -4165, -11244, -14256, -9071, -19462, -22993, -14872, -9071, -1450, 3364, 16562, 24379, 15534, 12637, 17093, 19906, 12873, 13649, 14248, 15329, 14860, 13759, 11218, 4685, -1551, -1459, -3992, 848, 1393, -1101, -4366, -3548, -17291, -16801, -20654, -29419, -16718, -5751, 8559, -4206, -18235, -22109, -24925, -25377, -33828, -30818, -22728, -12989, -9056, -11870, -15100, -25879, -27518, -27130, -20868, -26396, -19832, -8315, -4822, -2552, -3219, -10699, -12841, -6120, 3399, 5825, 5276, -687, -16765, -31897, -33167, -31772, -21018, -8288, -11480, -3179, -3207, 4367, 15901, 25018, 31228, 33873, 11951, -4157, -15553, -24831, -22650, -5025, -7343, -1971, 2893, 8896, 17068, 14478, 8243, 3487, -3844, -9460, -9715, -17807, -22449, -16347]
7535a6347l643l994J8796k653K275J7006K801m247j3838r809r871p681J4027K1750
7521D572J0909k979J1405M708m220M115J0787r124k3646k0007o617L588j277J525
7507a6261k139n450J3336J1063j0763l511J2878J9982P760k772j8891k846K341
7494D727J482m583m032m871R497R42q043J837J1752L49j8516o55O191J3854Q863
7479A8794j7571n055K698n591m123K674P546o833l324j0626r640k37j978j0669
7465d3935N475J2979J2860n826N398Q683J951j0214q388k266j1924N418J8544
7452a1245p759p836J1670Q788n122o978o793n278m478O935J5208Q727J640K960
7438D39k570k872k568P386r017P618L529n532r562j2245R427K139L512j1471R386
$$ y = [-16347, -19990, -23984, -5188, -7841, -5566, 11440, 14241, 9994, -3844, -13653, -23524, -31205, -17178, 4572, 15481, 12502, 23907, 28615, 24395, 28510, 39297, 30173, 6527, -13480, -20097, -16509, -17786, -16261, -18400, -23850, -10514, 549, -10214, -13725, -847, 19135, 26895, 24123, 5232, 2386, 4727, 6209, 1626, -2406, -7277, 2220, 3162, -4881, -3044, 8708, 9057, -9459, -10114, -3923, 9931, 18794, 1223, -3832, -1134, -6725, -10848, -8174, -628, -7461, -10785, -21411, -31051, -31288, -33266, -43935, -38460, -25481, -12621, -18447, -13049, -4366, -2415, -12629, -21017, -23283, -35207, -29789, -11245, -19004, -26840, -15170, -6382, -11504, -18482, -25275, -30553, -35031, -28096, -12888, -4161, -2521, 439, -2131, -5003, -7571, -185, -9202, -1584, 1945, -3587, -13149, -25394, -15967, -13828, -10316, -21787, -12401]
7423a2401O316O062j2680j5888N790J9066J1952j0708k610P152j115J004O805
7410H745j0072j104M035l61J0381K802k667p935o424m973K542m627Q372J6293
7396A5007r167m737O425p459j4329k285o186L056J4287j872o588j0269j163J143
7382b4137Q705J5150N742j3668Q42L249L653j1389p225O351l930M794N836R674
7368C647p194m8j1134l859J5156J0415O78n591n018j1387m19o028M595J765p382
7353b1804J144j793j43Q998k167k671K04j0857j426K0971J4171K329j1695j2027
7339a6766n380p790m246K416J6309J4149o34m026P878j753k1865l691L471J4184
7325g744P546J316k567k738q705J572J3466k153J98R724r518m820p289J0818K516
$$ y = [-12401, -6085, -23, -12703, -28591, -22801, -3735, 8217, -2491, -5101, 2051, 936, 1940, 8745, -1327, -2431, 1604, 1243, 11624, 14426, 11759, 3824, -2600, -7573, -5031, -9658, -1286, 15007, 5840, 1103, 7528, 69, -14260, -16545, -22731, -19675, -5388, -7260, -13848, -24117, -25280, -24137, -15432, -282, 5460, -8208, -7366, -4117, -464, -11853, -19078, -12727, -16657, -11863, -6027, 3647, -3547, -3595, -14729, -18588, -3432, 6983, 7661, 2070, -2948, -14335, -14754, -20782, -16187, -14422, -21804, -20660, -22453, -22596, -13598, -15765, -18436, -18232, -29089, -30515, -9544, 4627, 6956, -4739, -16766, -22146, -29936, -34182, -31766, -15457, -1308, -1942, -5968, 1910, 157, -21708, -25399, -21928, -7744, -198, 1118, -1449, -4187, -12892, -11320, 2146, -7, 191, 9915, 397, -4423, -11712, -894, 1622]
7310A622j3451o226N285K511l944K24J267J0491R665M395k617l631j0540P713
7296B764Q669l965j4080j2369j0541r95M256J1495N901J865Q40m253K287K57j3064
7281b0933p489N574K6426P813J06o220j5837r8J9276J1075j4359j7181J2704M281
7267E138j1699q573P866N561m306j587j4678r436P808J2417n362m420P779P975
7253e517J709n602r455n140J0578M534k685p178J5269R510k10m001l09m414j1769
7238a4680j79K267R534K028q398k505O751J265N970L267k055J418j0695m960K710
7223h262n539J699o324P836J0983k97j2884J2709K874l284n602j5740k626m81
7209b4938J1892R520J8418j4990k0131n646j87j1279K735J2009M608O029M332
$$ y = [1622, -11829, -18055, -12770, -10259, -14203, -13979, -12712, -2221, 7444, 11839, 9222, 5591, -4949, 2764, 11433, 7468, -6612, -18981, -29522, -30517, -26261, -14766, -8865, -7000, -6160, -10413, -8126, -7869, -20933, -28422, -22848, 3578, 11391, 11497, 5277, -10560, -10658, 8618, 19693, 5334, -11847, 857, 5138, -6561, -15134, -7268, -1707, -6013, -7600, -22278, -31714, -23906, -11489, -16851, -21271, -13492, -5517, -3808, -9410, -18865, -24005, -13427, -8893, -11578, -18756, -3487, 6023, 5813, 1812, 1503, -2911, -14680, -14859, -12592, -3058, -1030, -9428, -11933, -5182, -3917, 2053, 5320, 3265, 4683, -6012, -10972, -8262, -13801, -12102, -18426, -10590, 393, 96, -12788, -79, 2795, -489, -6091, -21831, -24457, -24938, -13046, -3526, 14892, -98, -20229, -25875, -26062, -37341, -34606, -22597, -17989, -11960, -7628]
7196g628L610O851N400j7373l862m785q544O571J078J048L161N607J1548j2654
7182i972J120J6439N451m810p135P124N953m191j0547m903p81O509J0377N641
7168A6275M72k284j2938p205J101R30k857Q856J1437n499o167j2749m7O986n176
7153h865j3611N165J4166O90n196J282n067Q400P951m278J460Q111Q84P998J341
7138B0431r827j1333J4660K870k805m35j5483p340J753Q609p898j0172O908N661
7124d401M681o10o560n884r303N136K1926J2611j1298j7289l850p136J1813Q125
7110b039j07L275Q422m480k331q28m530J0145L74j4940K881l622k190M151J7693
7095A1874R758j4239O320r516q792R527N796j1856p286k498J70J1077K685j3970
$$ y = [-7628, -4018, 2833, 8233, -9140, -13002, -17787, -26331, -19760, -18682, -17634, -14473, -8866, 2682, -9972, -8852, 7587, 13038, 8228, 1093, 8217, 14170, 9979, -568, -5471, -6252, 257, 10634, 16275, 16747, 14463, 1525, -5680, -4579, -3649, -6506, 2350, 13787, 8288, 2121, -10628, -10675, -3689, -8865, -22476, -17311, -3145, -2455, -7651, -6369, -11436, -3036, 4915, 637, 2097, 10208, 11092, 19090, 20431, 10604, -729, 13931, 16801, 13996, 13561, -1922, -9262, -7509, 1100, -6798, -16970, -10062, -4401, 280, -330, -6890, -12774, -22077, -16941, 4985, 17596, 6298, -10991, -14841, -21977, -10164, -2039, -2146, 1129, 9551, 5071, 2740, 1912, -2618, 7527, 7901, -7039, -4158, -7780, -9970, -5819, 11874, 21632, 7393, 13713, 4197, -4595, 4932, 10728, -1128, -8414, -10912, -10742, 335, 3020, -10950]
7081a0950J3583j953m633J027K883n877O148k077k895L042M285K858n352m906
7067d817J2676k242o242O650q089K32L751R582J7159n200l373j1805j0733r912
7053a2363q11K973q376M123P514P391L516P222O776k702q726p084o478O16J0994
7038D585Q666p389j3103k46J1227R52k985R777j776l563r149P181k863n31K478
7023C261R033r33j5190j1805J804K0527J0734K51P493j0887j1089j0210j7193
7010b4204o870Q340J4969M641p787K886j396L863l083M212N860p088M789M514
6996C646l092q82P486l539m025l594M175m810j5149J651L992r110J1704J4033
6982B486m543J953k556m368k348p485l068J917m54J3663J3169J899j2632o064
$$ y = [-10950, 2633, 680, -3953, -2926, -43, -5920, 228, -1849, -4744, -1702, 2583, 5441, 89, -4817, 7859, 5617, -625, 6025, -2064, -1832, 1919, 11501, 28660, 23460, 20087, 8282, -2451, -12363, -13174, -10201, -18577, -14454, -6940, 451, 3967, 11189, 17965, 15263, 6537, -547, -7025, -6409, 4585, 13251, 5862, -7241, -7487, 3740, 4692, 1707, 11484, 9708, 6145, -3004, 4177, 1314, 783, 3261, 12294, 11361, -3829, -15634, -13830, 6697, 17431, 17682, 25175, 14288, 3199, -7011, -24204, -31074, -22734, -7765, -3124, -10911, -8025, -9421, -5558, -8641, -4429, 1431, -5657, -868, 3646, 554, -328, 7158, 3619, -406, -4000, 175, -4635, -19784, -18133, -14141, -23251, -11547, 2486, -2057, -104, -2660, -7028, -9376, -16861, -19929, -18012, -18466, -4803, 8366, 10265, -2367, -8431]
6968h431j529k035j532K81m203N032J1121L609m329j4215N471N700j0447j4823
6954c0330o848J5200J8237J4161O061l256J752J1762o925m350p300j122o189j6612
6940a5759q300m915L374N316L245J2323J1207J1606Q570n924k4434P40R049j4819
6926h721j5344N57N554J3777M087r500K521k469j805k787M46P472O001o395K724
6911c882J8738N932K905p92j7935k2397l495N793N222r34M801P546o011n658j2042
6896b2209L125Q720Q964o778m774n045r12O755k611j822K394M626J0417M078J609
6881F537j4956j73P103Q361l947l572J097L295k238q657N467R811J931K680j3186
6866d47k211k440l79M57J915N78J39M44l854K835J4706J318l556j425j767J730
$$ y = [-8431, -9960, -11995, -13527, -13246, -17449, -12417, -1296, 2313, -2016, -16231, -10760, -5060, -15507, -30330, -37178, -21978, -3741, 10420, 16481, 13225, 14977, 26739, 19814, 15464, 8164, 7042, 853, -15759, -24059, -28974, -25600, -20284, -17039, -4716, 6491, 18097, 26667, 20743, -3691, -2951, 6098, -8721, -24065, -23508, -17954, -4177, -90, -9590, -7069, -9538, -11343, -14130, -13684, -6212, -211, -6606, -3882, 14856, 20788, 23693, 22901, 4966, -17431, -20926, -15133, -9911, -10845, -6044, 1502, -4509, -10167, -22209, -19084, -10364, -1400, -8178, -12952, -17997, -18909, -12154, -14765, -16587, -14193, -9567, 850, 4928, 6537, -8419, -8592, -1489, 6872, 2925, -647, 450, 3745, 1507, -7150, -1683, 8128, 10059, 12739, -447, -2658, -5098, -5477, -5020, -3105, -2527, -2388, -1944, -5798, -2963, 11743, 13061, 9505, 8080, 6313, 8043]
6850H043M415K315j1456j2864O190j0746R1l584L73j573J1187R559L740l524L431
6835E597M26R815J5552J255o945L607k1667k8395l081j1311M849K8538j470j94
6821c424n082p355n53J2602K129p019r194j3767J2991K2687k175m614l038N263
6807e49J3131n76N6k575P600p333j3512n986M095l14m105j6325q455j420M548
6792c1720P85N439Q574P668P295l181r271L9J3094R734J0829p192l596j5026r517
6777a6046J767o47J2757J187m498R044L159l734j0532q06K848m736O926M069j0640
6762i882J8904J6330j5667j3209J37l891M701J273J5128l561k0174j2356k47J318
6748b1196N622L433M32J230k428j2693o997J4780n729J7661J4969L278K984j1001
$$ y = [8043, 12458, 14773, 3317, -9547, -3357, -14103, -14012, -17596, -17223, -18796, -7609, 1950, 5690, 2166, 5597, 6023, 15838, 31390, 32645, 25700, 29307, 7640, -20755, -23836, -35147, -30298, -1760, -3230, -3424, -8506, -15861, -16414, -3812, -1683, -8702, -17896, -31663, -18672, 4015, 1840, -2774, -5812, -549, 12582, 12006, 12062, 9487, 17087, 9754, -3758, -9744, -5649, -5963, -10068, -26393, -34848, -36268, -31720, -30935, -25496, -16922, -9254, -1959, -5140, -14411, -14372, -1278, 8456, 19285, 12093, 8497, -6529, -16046, -14279, -14926, -2169, -982, -5480, 3564, 6723, 2989, -7543, -8349, -5501, -10237, -3311, 758, -9882, 9022, 25352, 9685, -3524, -3387, -7278, -2577, -1304, 13824, 10263, -9911, -22267, -22514, -21196, -15574, -12141, -11709, -10479, -12907, -25600, -32597, -17817, -23546, -5885, 9084, 12362, 15346, 4345]
6734D345o03J947m093L607Q771p944m329n779J4404K783l790n178q024j1186l32
6719a5401J1512Q018K391j7984p162O0J3914J6562J3807J0818j20m527O02n335
6705B7155p674q732l496r951j0019r761R993M327j7707j7239j282Q728K908R664
6691b3086J1809R06J059k940j3573J295J166M663J3302q2l677P584N486k3063
6677a9151q362J4700N872n680q903M400p711j2333L493m117R47J1465K1090n940
6663a0230n813J0498J670j558K909J4910O241o446r734m209M376J024j387J012
6649C263m381p433J857l2O874j753j2146l414Q625J938K016N363J2601J4872M234
6634C2484k0373k702j0995p206n960rM528K341n728l66J6406J2341p915R50J446
$$ y = [4345, 3742, 5689, 1596, 5203, 13974, 6030, 1701, -4078, 10326, 13109, 9319, 4141, -3883, -15069, -15401, -3889, 4129, 6520, -11464, -18626, -18566, -4652, 11910, 25717, 36535, 36415, 31888, 32490, 27155, 19481, 10749, 7253, -2698, -12717, -22478, -12485, -8158, -25865, -43104, -44386, -35658, -32750, -23086, -11277, -10371, -9312, -12252, -25825, -24530, -23364, -18701, -5399, -5481, -9158, -1574, 3912, -19151, -27513, -12813, -6941, -12621, -21524, -17124, -24835, -37168, -33675, -37792, -36845, -25380, -4290, -10230, -16043, -5545, -3875, -5433, -2524, 12386, 18627, 12181, 2447, -1762, 2614, 3638, 2251, 3263, -1118, -8551, -6694, -6726, 148, -1605, -13751, -17165, -8540, -6602, -4586, 777, 13378, 28250, 32484, 12111, 9409, -1586, -8792, -14752, -14761, -10233, -7892, -13620, -13986, 2420, 14761, 6846, 7796, 9242]
6619I242j9457l772L000R881j1287J260J5133j666o288m455M297k555N487k472
6605c652j1450M336l421J0728j794K443M23r053M82J3930J4207N899j3520j6502
6591f944n377N657Q488J436j6340r967Q417N805j205J7500J973n961j0404j5488
6577b2410n38J175R725O436p575N238m70J3089P849j1809p087o078p292O856r42
6562a3833l670P785R056j0119o143J393P561K600j4716o491J1915q409l722N850
6548b0943m526J5334N958P223N884J373l143L464l691p887l909N25Q573m729r055
6533i549K274j490N0J006K795R218J4884K271p366p902L70j1075r956Q581Q815
6518B926j1200j4091J34O063M059Q998J204P911l22k439o774p9R134n467L931
$$ y = [9242, -10215, -13987, -10987, -1106, -12393, -11133, 4000, 2334, -3954, -8409, -4112, -6667, -1180, -3652, -15102, -10766, -14187, -3459, -5253, -2810, -2387, -11440, -10958, 2972, 17179, 23078, 9558, -6944, -12321, -6664, 1824, 3260, -13080, -23047, -14630, -8825, -10030, 7470, 9443, 3482, -6922, -22410, -22948, -21773, -12048, -5612, -13187, -7949, -8419, 4670, 12519, 710, -6377, -12455, -19747, -12891, -13833, -17503, -9718, -662, -10781, -16924, -15531, -7970, -5370, -20086, -26577, -14662, -23071, -26793, -20943, -25469, -10135, -4177, 3046, 8930, 10303, 7160, 10624, 6933, -954, -4863, -4338, 4235, -494, -9549, -7275, -8765, -8715, -7709, -4914, 4304, 19188, 21459, 14093, 6191, 6561, -4514, -14470, -5889, 2926, -8274, -22365, -22231, -16168, -12109, -3111, -1907, 6004, 5682, 3243, -3531, -3610, 5524, 57, 3988]
6503C988L078l577n703O668N891q376k72k989j745p906K990P973p829l132P530
6488c411O299n115r4p354L17J791j0375r578J732k441J1701R024m992p984l983
6473b4463J5682j11P787N775L996j7002j4448R297m37K039q600k054L872m595
6459b3262l310L853J5019M117O496j239o562p711K005Q498R382J2430L573o457
6445A6832m550M848j8068j0350M417J3153K033M477q204j2878R71J883J0010j922
6431B652j2178r390J2738J1591P310j751J0168J656j3170j4663L149O601k075
6418B638j0792m375J0564q75j9152m353J1515J1694N837n578m524o829l204J4807
6404b627j894l638m107n721O3J7877J6032Q130L620q108l670l669n968M142O279
$$ y = [3988, 7066, 3489, -2214, 4454, 10345, 1969, 1697, -1292, -3037, -10943, -7953, 20, -7809, -10941, -3411, 2888, -2227, -2321, -9675, -9358, -7567, -17942, -27520, -25788, -28229, -16528, -7504, -12496, -20480, -24463, -8781, -8892, -1105, 4670, 8666, -8336, -22784, -13487, -13924, -11885, -20485, -22539, -18667, -23262, -26572, -22719, -7700, -3583, 2913, 1674, -4888, -12599, -10594, -2096, 7286, 19716, 23289, 16832, 12282, 17130, -938, -11288, -6871, 6282, 8315, 12792, 4588, -8290, -7319, -5436, 4574, 2652, -9526, -18916, -6178, 5413, 12723, 10972, 21140, 22796, 9626, -5037, -1888, 4713, 2638, -8154, -12529, -1965, -2840, -21992, -26345, -14830, -3136, 2701, -2877, -7401, -14230, -17434, -2627, -4521, -8159, -12266, -17987, -17924, -47, 15985, 24115, 27735, 19627, 15957, 12288, 6320, 10462, 16741]
6389A6741j3476j021N201j1054M161R493Q463m075q641m209k014k726j1188n660
6375b0005L720j486o203K331J658J1795o401j666K014l555J427R150Q718r70J9671
6360B0198M526j6241k18O363L425Q98r843P66j5485r243J0751L130n186l94Q347
6345A794N41L012L038Q220p664k911M14m430m638Q681P307m009k758R814P962
6330B4373o163k701P064J0106n923J958K763j0144j0332j2734j2372p283K914
6317a8474j387q37Q156M278j3876L902R762R946N38P764J389p108K117J3569n595
6302A4144l957L555n101k1488k219Q736m545j1355J249P245P546K769k0216o199
6288b9836K093L548M967m536j661M269L962J2405L478j7347j6661M953m624K715
$$ y = [16741, 3265, 2244, 7445, -3609, 552, 10045, 18508, 14433, 5792, 1583, -431, -3157, -14345, -20005, -16285, -17771, -23974, -21643, -19985, -8190, -14591, -16257, -14243, -17798, -16371, -7221, 1497, 527, 20198, 24724, 8483, 8265, 14628, 18053, 18951, 9108, 9874, -5611, -14854, -4103, -973, -6159, -6553, 1794, 2335, 5347, 8385, 16605, 8941, 6030, 6444, 2014, -2624, 6057, 13364, 9355, 6597, 16411, 24373, 18210, 15509, 22573, 32679, 26756, 28714, 31477, 21333, 11001, -1733, -14105, -21388, -18474, -19861, -20698, -12542, -8264, -22140, -18238, -8476, 1470, 2008, 9772, 11161, 4053, 6170, 19739, 14144, 10187, 13742, 8641, -12847, -15066, -6330, -10875, -22230, -20981, -13736, -6190, -3421, -23637, -29836, -27743, -24195, -19228, -23764, -25425, -21156, -17194, -4789, -1311, -18658, -35319, -30366, -34990, -32275]
6274c2275J0971J369K780R508J452o897n302p497K249M99j0366J991J4872M923
6260a1723N95j80N68n056n259J5397m582o71Q081J4174j0837r780R622P383j2170
6245d438j6494p412J598l530m255R306l376J3506L188k77j1897Q70J0969m701
6231a6943R962O88j3277K179O656K298R160Q822m041n633N57J249m729l552j3804
6216b0408k695N681J488K715L273J0207L852k320J472l436j3199o675j5087p35
6202c5867J4114J2436R702p053p688J162J1568O572k935j3352J0913R72o388p140
6188a2984q544l195J0774J035N094J0758k314q734P251R384q585o227n364M354
6174g297N562n407j1171l42J1673K250K490m234m122j444M448J4902K419o794
$$ y = [-32275, -21304, -19935, -17155, -7647, -6195, -13092, -18394, -25891, -23642, -23143, -33509, -31518, -16646, -11723, -11128, -11308, -10740, -15796, -21055, -5658, -10240, -10911, -2830, 11344, 507, -9273, 349, 7732, -4438, -20932, -28344, -26746, -30276, -34531, -25225, -28601, -15095, -11907, -12184, -24081, -23211, -12242, -16943, -6981, -6293, -19570, -17391, -10735, -8437, 723, 9545, 5504, -129, 428, 1677, -3052, -6604, -20408, -23103, -17422, -15934, -13219, -9946, 261, 4113, 1793, 3265, -171, -13370, -20045, -35132, -35867, -21753, -9317, 385, -6668, -14356, -13194, -1626, 4946, 2011, -11341, -428, 544, -5844, -12984, -21528, -24723, -13949, -12914, -7820, 2938, 624, -8110, -859, 8525, -60, -6287, -11651, -7297, -1735, -7142, -18313, -18655, -6982, -4732, -2242, -6476, -10598, -12042, -7594, 7308, 9727, 2933]
6160B933n14j5734j7319R942j1630R973N346j500M554R049R510L700j5j1735L59
6145c081k030m904k373j1298o472j0253O378J1737N29J2907J061J57J982r245
6131a4905O377L136K969p267p812j1743j308J328M406Q527K196l201k857Q123
6117a2031J9113n839m919o207R250q49j3314L215K435N172j1130K802J0141K308
6103A47n261k2698j927J2695J4402P935q282R56J5878O097o772J385r73n613J40
6088H109O637K746j0654j8368j4901K198K791q770R09K1495J0521m078n642j837
6074h844j839k464j24l23j3353q356J0737L019Q194o349n074j421J6078j2602
6060b2721j4690N463J7675O435j540m385L224L978r233L861o448j768J1611j951
$$ y = [2933, 2419, -13315, -30634, -20692, -32322, -22349, -17003, -18503, -13949, -4900, 4610, 8310, 8295, -3440, -3081, -5111, -10015, -12388, -23686, -30158, -40411, -34033, -22296, -21767, -8860, -7799, -7642, -5660, -14905, -8528, -5392, -2423, -9690, -17502, -29245, -30553, -29225, -24819, -16292, -14096, -17297, -20154, -12031, 7082, 1243, -3676, -9883, -633, -1482, -14796, -11581, -9146, -3974, -15104, -12302, -2161, 147, -5114, -27812, -29739, -17044, -2642, 5293, -2989, -2033, 13845, 19942, 13170, 14555, 13582, 7969, 8109, 14746, 17492, 6838, -11530, -26431, -24233, -21442, -30212, -29303, -7808, 2713, -1365, -7007, -8844, -10683, -13147, -13271, -13594, -26947, -35303, -24566, -21547, -13353, -19702, -24776, -26197, -10119, -22721, -37411, -31948, -14273, -7838, -9378, -13763, -10539, -6561, -15794, -11933, -18381, -20149, -8538, -10489]
6046a0489N454J1940N315m749K393J821m08r03k831j872n595p00O524J0114P953
6031B3967P508k796p585n735J858J4614j0161n554j1222j2377q110L603P070n264
6017a0184o071q02Q018L181J0328m861P88J0644j056Q409r457j3273j4881j237
6003b0454J1917J6167M352j3660q074k229j5261R064J1856q734K652J4098o664
5990d970p663k625Q266Q919m997r339N344J6655m413K384j641p839L07K864o929
5975e677r081J492J2992J560k114k3356r396n707O426L174J4280O026n290q94
5961a5565O128m962L864N906j4293o564J1271k9p687j1084o605J1706L498N958
5947a8458o480K795J3804J0212p785P79j0890O30J6095J024L711M031M991j02
$$ y = [-10489, -5035, 6905, 12220, 7471, 9864, 11685, 11277, 10374, 7543, 5671, 76, -624, 5900, 16014, 23967, 31475, 28679, 21094, 15359, 17217, 31831, 21670, 16116, 4894, -7483, -15593, -11990, -4920, -10184, -16255, -17057, -9039, -5858, 4470, -391, 397, 11041, 9985, 18394, 8937, -4336, -19217, -20454, -8537, 7630, 11982, -1678, -9752, -11981, -27242, -18178, -6322, -15056, -12404, 1694, -4970, -12633, -15258, -6992, 1927, -3070, -12409, -7065, 9590, 5177, 7561, 5920, -1919, -1612, 1252, -5677, -14758, -13266, -274, 1286, -828, -24184, -33580, -39287, -32861, -29687, -15407, -9381, -14671, -15565, -9437, -14399, -10535, -4629, -18922, -25486, -14215, -14244, -21931, -33015, -39620, -27914, -24416, -18458, -24938, -22143, -8339, 1873, -5912, -5133, -16023, -15393, 702, 1726, 5437, 9468, 14459, 14357]
5933A4357j7783j0836m756r979q78R836J1098N116r698O591L300j2113M106P210
5919d429l168p526L465M305L75P656j8787P724K028K685Q715p713j1408N421k881
5904a3538J509q97N103J1868K246j5192p731N513J4596j263j149r319o971j782
5890a7007l29q60K552N339M308o389n722J265O218k920O203R128J8438p363j4806
5875a945r689j318n414k687J2103Q485J743O484l794j1918j1297J1218J4341M055
5861A0367n668n901N72Q539j1025m316n740m374O514O21l422L125M663k72r58
5846g275n545o555R074J2461O420l399K521J2730k452j5583r001m339m591M350
5832a1184R559M006O626K902M990j5021j9791N144J2171O048o796N326j762o482
$$ y = [14357, -3426, -14262, -19018, -28997, -29875, -20039, -8941, -3825, -13523, -6932, -3632, -15745, -11639, -4429, -7597, -15123, -11658, -7353, -6978, 678, -18109, -10385, -8357, -5672, 3043, -4670, -16078, -10657, -13538, -12029, -12926, -7823, 4045, 6291, -8901, -16632, -11119, 3477, 2214, 1065, -8254, -15225, -17007, -17336, -18196, -15644, -10305, -5997, -12386, -18108, -16843, -10625, -13545, -7342, 1786, 20224, 12861, -1945, -11634, -12952, -18366, -21053, -8950, -465, 1278, 7762, 3968, -7950, -19247, -8029, 6312, 10367, 4699, -1202, -630, 7909, -3116, -7432, -13172, -17546, -11032, -10411, -13833, -10708, -6045, -6317, -7275, -12820, -19375, -10301, 2160, 8580, 5181, 7702, 20432, 17980, 2397, -6604, -10943, -15534, -11184, -1625, 2381, 9007, 11909, 16899, 1878, -17913, -12769, -598, 5450, -1346, 3980, 2218, -4264]
5818d264M360n153j3980J233o048Q451R866J8375j1940j7733l037K1336J5033
5805A6499m63J214o54j4887p392J7231j381j3925M837O998l082o053o59J360k037
5790b394m983J1448J8650n020m205R018j7603j4120Q437P836k605j415j0026j939
5776h921K073k694l864q623J138r02J006N021J5339J0583r938j6385j726l270
5762b1163Q078l480j891L4j859R147m524R369J6821o802p930o873O23n789k245
5747a8484M021L280Q922P034r506m731q137k2409M083K0018J7724k571Q642j468
5733F418j6090J458N201M524N086N579M127j1914j0260J2287q921j5463k679O188
5719a4459N421M119m036p718K644Q082J728Q181J2860q603o151K891m877p125
$$ y = [-4264, 96, -5057, -19037, -17804, -23852, -15401, -5535, 12840, 900, -16833, -19870, 1466, 16499, 16036, 17250, 16596, 1709, -5683, 11548, 10167, -3758, 1079, 8077, 4995, -1058, -1717, -357, -2394, -7377, 4071, 22721, 17701, 13496, 22514, 4911, -9209, -772, 7064, 4459, 3044, -6982, -8921, -6848, -9542, -13406, -22029, -20891, -21793, -20787, -15766, -427, 10156, 218, -16167, -17893, -21163, -13085, -16565, -18456, -18422, -20281, -11134, -15658, -6289, 10532, 3730, -4200, -11073, -10450, -16239, -18484, -14463, -11183, -2261, 4773, -4733, -9464, -17601, -40010, -35927, -15909, 1815, -756, 7886, 6418, -9672, -8214, -3013, 1511, 6597, 12176, 16303, 4389, -5871, 6416, -2505, -17968, -20647, -14459, -9038, -4919, -8955, -16673, -14029, -5947, -4219, 3962, 16822, 8219, 2068, 4959, 82, -7043]
5705g043r277j1490p42J1289R864J2713n269j1279m700K793N886Q016l274o042
5691h555j2968j0521M322J3954M648J2633R529q587j4744p91p67O31O776K5266
5677B0826N213l1791j7708K321K682J6244J2837m891j1308k7255J021Q340M056
5664a9413k07O493N836r317l449Q658J0064o939j069J056k923L454J86L650j663
5649e583J193j9964J16K940J7214N52m465Q478K129m313J77k044J0011j0029j3350
5634a6938j1556O971J5090L916L912l143j620J3380j066q443j1197k245m12o46
5620a3997N673K613P569R165j6125j6474N340J4199J3226J2365o868k0180j761
5607e255N203k234l069r593N991N042K867P512j7356j6645N962P594K943N453
$$ y = [-7043, -16320, -27810, -28552, -17263, -7399, 5314, 45, -11234, -15934, -13141, -7255, 761, -2513, -8555, -21523, -32044, -27722, -13768, -9120, 3513, 13042, 4455, -10289, -11080, -11847, -11216, -4440, 20826, 26039, -5752, -23460, -21139, -18457, -2213, 10624, 5733, -5575, -32830, -31809, -23469, -19413, -19620, -13127, -7291, -16608, -20057, -11399, -1335, -8274, -9343, -8287, -11210, -7756, -7570, -3920, -5583, -4390, -24354, -24238, -21298, -4084, -3532, -7997, 481, 2610, -1703, -1526, -3570, 6441, -3588, -16938, -28494, -21523, -6433, -2517, 1395, -1748, -3368, 10012, 8946, 503, -10694, -12939, -13351, -13997, -8324, -5711, 1858, 11023, -5102, -21576, -16236, -2037, 11189, 23554, 16686, -3494, -5255, -52, -2286, -5355, -14948, -8957, -3915, -1048, 6464, -10892, -27537, -21575, -13981, -11038, -5585]
5593e585M822M671L959k3259m907J2724N035j358n789R216J080K11j6936j2542
5579b8658O710r50N628p631j556Q881P207N650p900l449J9109M554m807m740p445
5564i397j2363m381J292M210M745J8645R464j0035r699L443p484K230N294m938
5550h974r98m077K700R297J1327o151m121o161N115J0648l92l610j1138J111j2019
5535a7443j141J0177K2836N174m821N547J1318L36j4538p552r338j2161k691M28
5521a3869Q299Q998N188o310J241L24r826Q55m403k366j3321j2219O225J7969
5507a3215L490j0273q712o333J5030J5645q554j0409K660J0225R77K72Q291r69
5493a875o07o145r394J1650J16j1091l53Q292j791J1051j990l64L708K243j6807
$$ y = [-5585, -763, 3908, 7867, -15392, -20299, -7575, -2540, -3898, -9687, -471, 609, 820, -16116, -28658, -21948, -22898, -17270, -24901, -26457, -17576, -10369, -4719, -12619, -16068, 3041, 7595, 2788, -1952, -9397, -21760, -26141, -24849, -20639, -15894, 2751, 12215, 2180, -7519, -4076, -11560, -9330, -4036, -8974, -9972, -14049, -11349, -2052, 9275, 3124, -997, -7158, -2043, 8605, 8213, 4603, -6535, -5424, -17443, -18584, -8407, 14429, 19603, 14782, 20329, 31647, 31983, 17445, 9893, 555, -11606, -14297, -13869, -5570, 3428, 8616, 2306, 3547, 3871, -5955, -5100, -9503, -11869, -25190, -37409, -31184, -13215, -9725, -19998, -28710, -35043, -20013, -4368, -12922, -23331, -20671, -10446, -9469, -9197, -906, -1875, -2482, -8627, -18021, -6371, -6255, -17346, -17699, -9407, -11198, -147, -2137, -2501, 1207, 3450, -13357]
5478a3357O990J350j8753n39M978J4291K763j2550M456R904J191j0174o760P312
5464h898M828N087R917k0j2456j0197o467J0444N405M916M064K2953j881j4925
5450A2770o782n569n651j0834l702Q250j2768L664J2214J244o49n73O637P526
5436E777K600J965l738j3318j4101j860J0383J0188J135P413o339r306l123J2789
5422D65j416J4299J3577q715j1135M229r877j697M077j035l328r799j7445n06
5408b8306J3721P958J1777n394k094L797j4735j392J5707M676j7750j240J926
5395a1349o65L745R985j3710l293P187j1374l097n686J040R551p195k858M437
5381b3282K137K1299J0559R199r510l693p945j4611r623J7388Q060j520L732j571
$$ y = [-13357, -6367, -5017, -23770, -24309, -19331, -5040, -2277, -14827, -10371, -467, 724, -9450, -16210, -8898, -4070, 1017, 10934, 10914, -1542, -11739, -18206, -7762, -2357, 2559, 6623, 29576, 27695, 12770, 5988, 419, -5232, -16066, -19768, -11518, -24286, -20622, -8408, -7164, -7813, -8386, -1749, 5777, 8377, 10342, 6604, -6714, -20815, -22675, -12292, -2104, -969, 6444, 105, -9201, -12324, 465, -951, 13348, 26925, 18210, 7075, 11304, 1427, -270, 3807, 2772, -556, -10355, -27800, -28306, -14585, -6627, 5150, -244, -2338, 1459, -13276, -14668, 1039, 5715, -12035, -13275, -11349, -12014, -8269, 1716, -11994, -15287, -8100, -19474, -22571, -28257, -27217, -17666, -24861, -27719, -23282, -21145, 154, 10713, 19912, 10402, 6709, -1236, -15847, -25470, -8082, -22, -1542, 2190, 619]
5367F19j4055L757Q186P743n404K635l985p739o531m573K0975J375m333Q764M713
5352A2147o580n056Q771M01j1412r379M634n625K987m037r056J617O325J369m595
5337a7489m296P643J5543O773o972k4975m310M593J6266M355M782j723j0412j1753
5323b1975q892P533J1227j1106o91M567J2758P086R490q29L513N115q29m9p818
5308I100n056j0094m331l980j954Q270J6216L185L601n959k962j023P856N427
5294A8296l507j0827p521k346k093K107M254j430m070Q251K289m514p760K874
5280e997M494O387l358J680l685n498n612m719J0857M340L33j1771N997p760n646
5265a9958O637J4742R655K16o741n111q820J1896n636p464o695L079k650J8762
$$ y = [619, -13436, -9679, -1493, 6250, 846, 3481, -504, -8243, -14774, -19347, 1628, 3003, -1330, 7434, 12147, 5567, 511, 9282, 9683, -1729, -11108, -6474, -12099, -9112, -13149, -22205, -20588, -14263, -12894, -17489, -21785, -14142, 1401, 8174, 1202, -23773, -28083, -23490, -7224, -2869, 1913, 190, -10222, -21975, -30867, -23334, -12107, -23213, -23904, -19337, -6579, 507, 9997, 9168, 12681, 17796, 16967, 16918, 9100, 4044, -6050, -10381, -14361, -16315, -8045, 8171, 11356, 14957, 8998, 6036, 5013, 12869, 18296, 14789, 3962, -3559, -5905, -7998, -5891, -1637, -3067, -7137, 1114, 3403, -1111, -8871, -5997, -1503, 4884, 1526, 3206, -479, -5977, -11589, -16308, -5451, -1111, -778, -12549, -6552, -14312, -19958, -13321, 1421, 11076, 11292, 4551, -560, -9380, 2516, -3120, -10584, -17279, -14200, -16850, 1912]
5251A912N880k1729M344P613P535n01p591j132n059j284K977P350K594j001j0492
5236h584m504J5372O636P636N825N817k912j2204j0952j2526P911q612j388P710
5222d775n608j2044l196Q951J2836n012j75l4P220M264p479n459m1P597N723N75
5206C343R688n727j530q608j5999m818K736N441q716m499R33L973N326m055Q981
5191a3531P480J2774K1739j775j5406M09o114m997p69L661q535M780k82l940Q23
5176c683j579q5J4616K13l458m743O387J0290r169r849J0823L619J395n181J354
5161A0950k681R684J141m405n71q667l242j1773j2968J0442J3727K655n71j1315
5147g594j0436q074k749L318J8273J2254O407j3395M454L81q052R185j701k816
$$ y = [1912, 7792, -13937, -9593, -1980, 5555, 5054, -2537, -3669, -8728, -10012, -7035, 315, 2909, 1908, -8584, -13088, 2284, 8920, 16556, 22381, 28198, 25286, 13082, 2130, -10396, -2485, -11097, -12485, -4775, -10383, -22427, -25623, -16672, -3836, -8848, -9023, -9057, -1837, 2427, -5052, -10511, -10552, -2955, 2768, 3343, 13031, 7304, 5774, -2834, -18833, -23651, -20915, -15474, -24190, -28689, -27756, -23783, -18457, -22512, -13531, -6051, 6723, 28462, 26687, 11281, 11690, 5576, 579, -190, 3471, -5064, -284, -566, -4506, -3683, -5262, -5347, 9269, 9482, 6024, 1281, 7668, 17958, 8789, -1060, 9763, 13382, 14777, 9596, 10950, 8269, 17953, 19094, 14689, 14118, 5451, 2209, -9564, -22532, -12090, 1637, 4292, 3721, -7594, -18030, -26104, -28853, -25535, -7262, 4992, 11399, -1996, 2458, 2839, -5213, 3972, 2271, -545]
5133e45p707P413P221o390N333L455K499R428k418p727j4492j634o031L677J1943
5118D025o708q486j93l281J20N599P184m750o2r441l039P285k893R717m62o448
5102a1833L711m072k735R188N527J2643R55j6516j1475J1079O104j7292Q879J0319
5088D482Q305l772Q878N304o775j2148j2505K425M632o09r37L166J4612R117M502
5073B8677j1022n185p331l135m713m983O522o81q140N545J044J0728q181m822
5059e677O443n440k375j884K774K962J292m37r125l380k671m71Q806K0196p456
5044C557o076L172l57j23p909j469q970l247J8012J3577M116k291l698o215j6849
5029a4770j8298J769N01J2427Q814j0196r132J839O926n494j0616P729R982P068
$$ y = [-545, -8252, -839, 6382, -8, 5325, 8780, 11279, 20707, 18289, 10562, -3930, -5564, -11595, -7918, 4025, -2683, -11169, -11362, -14643, -14523, -8924, -1740, -6490, -6552, -15993, -19032, -11747, -14640, -4923, -5385, -11833, -8122, -12194, -14929, -5741, -214, 12429, 13384, -3132, -14607, -3528, 2576, -14716, -5837, 4482, 12787, 9015, 17893, 23197, 16422, 4274, -8231, -5806, -1174, -1783, -2720, 446, 15058, 24175, 28677, 17655, 12470, 5139, 2004, -2709, -7692, -1170, -1851, -9991, -4446, -3402, 7326, -855, -5677, 766, -4674, -7049, -8933, -6159, -3197, -1905, -2342, -11467, -14847, -17518, -17989, -9183, 11013, 3557, -2519, 653, 296, 173, -7736, -9205, -18175, -21422, -3410, 10167, 14283, 11992, 8294, 2079, -14770, -33068, -31299, -30798, -18371, -9557, -19753, -28885, -27046, -20120, -25614, -36230, -28501, -18519, -11451]
5015a1451j1117Q113k081o103J0670l0R123P306j1075K06J895M766K252J4449
5001A6923j195m962r170n494j0198l071m252N135P059l829m857J211J1217j304
4987f787q093L665J6854n092j1206K540L282M285j4975j0591l146P67O073N964
4973a6460M656J2544k277j6892j034P303J8043J8369n727K427N004j4605N012
4960A6363L046l116k479j7210j1701l092J2367m074J258P594L014n27O818L132
4946A1393r552l651j2124L241J1343N973J854j285j527R121O803j716j7350m438
4932a915J081k071K868P198j1619j6779j1809J0495m060M064n48L136P442m257
4918a6774M956J5283N862q858J0753J4742j4386j0210n928M466j1799j9388p69
$$ y = [-11451, -22568, -14455, -16536, -22639, -11969, -11999, -2876, 4430, -6645, -6439, -4544, 222, 2474, 16923, 15728, 10766, 1596, -3898, -14096, -17167, -21419, -16284, -9225, -13054, -17911, -16700, -5483, -6787, -14880, -11215, 5639, 547, -10659, -8119, -4837, -552, -15527, -26118, -29264, -28497, -22424, -16460, -11804, 740, -1537, -18429, -19463, -12160, 5883, 24252, 18525, 20952, 25956, 11351, 16363, 19409, 16293, 13814, -3396, -15097, -18189, -5822, -9896, -8638, -1044, 1970, 1443, 8261, 11393, 1841, -1810, -13934, -10693, 650, 6623, 8477, 7192, 5665, 14786, 21589, 19873, 2523, -1915, -834, -2905, -37, 7161, -4458, -21237, -33046, -22551, -26611, -22547, -23095, -19959, -12517, -16774, -11818, 3465, 9327, 469, 11222, 25964, 11578, 1368, -4560, -94, -11893, -31281, -32050]
4905c2050Q200J2332r945k544J7223J8080J3225n842n361q36l064m310j2470m246
4891a1608J3418O298M507l188j1413r878M182J3527N184l18m074r536n14J879
4877a534J936j327o889o40J1571R893P499j2699j4221n645K287R10J6547N940
4863A3628J343n121k7548q044J0965N632R966R543O740R344n369o233o295p644
4849I07N067K870l155j8292n054M947Q996J2921n180M23j0018Q728M007L049j8113
4834g897L076J831q363m714K939k046m553J4617l607o185n617k961O144P181l180
4819a3335l103J4090j924q022J468r821q200O703K0478q019l44O268O606N979
4805H824J855j20K104J207J00l109R157l890r67p100j2015m043J523O397J2097
$$ y = [-32050, -23850, -11518, -21463, -24007, -6784, 11296, 24521, 18679, 13318, 12482, 9418, 5108, -7362, -11608, 1810, 8108, 12615, 9427, -1986, -11864, -7682, 5845, 11029, 10711, 6637, -2899, -3413, -1534, 402, -925, -7814, -8454, 3117, 13010, 20509, 7810, -6411, -12056, -9769, -8859, 7688, 13628, 14971, 9850, -17698, -25742, -14777, -9145, 821, 10364, 17104, 26448, 21079, 14846, 8551, 907, 5974, 8844, 5689, -12603, -17657, -12710, -3714, 9207, 4027, 4450, -5568, 3160, 7167, 10216, -7897, -4821, -2990, -11353, -16067, -13128, -15174, -19727, -5110, -8717, -14902, -20519, -23480, -17336, -10155, -13335, -16438, -2348, -4272, -12294, -10826, -20647, -28847, -22144, -1666, -9685, -10029, -3761, 2845, 8824, 10679, 10559, 12663, 13870, 13970, 10861, 20018, 16128, 15161, 8061, -3954, -7997, -6474, -77, 12020]
4790A2020Q097N6j0752j1574L991p070l645q418m341k868M148Q085J3464Q292
4776I485O868n926j6797q044K170J0901M870K040O276r820j6589J917Q624P244
4762C219L390n037k535J4267K990J255J048l175J1M381q424j2290j1582P848J2034
4747G400k594o665n978N617J1144p791m704N034O303N949K243m529m856J251J262
4732I086j34j9737j4462J3559K3630k361J024j461o448j3097j9749L028J781l480
4718b8821N066J0960L501k378M170L066k359l412L681q224k854L917j0959j200
4704b5846J4002P186Q475P895k390m816K609m228k0934J366J3474q585m845Q956
4690g681Q396m826L849M910J1812J4354m365q185k1907j2495m228M538L602M730
$$ y = [12020, 20117, 20173, 9421, -2153, 1838, -5232, -8877, -17295, -21636, -24504, -20356, -12271, 1193, 9485, 16353, 10427, -6370, -14414, -12244, -1343, 3527, 5567, 11843, 2023, -14566, -12649, -4025, 3219, 6609, 1572, -963, 13304, 16294, 17549, 18597, 15422, 15433, 19814, 11390, -900, -12482, -4634, 7400, 4806, -1859, -7837, -2220, 8924, 1133, -3571, 1463, 7766, 13715, 15958, 11429, 6573, 7824, 9086, 8952, -10785, -25247, -11688, 11942, 9581, 10605, 9144, 2696, -10401, -30150, -27122, -25341, -28821, -23755, -12795, -9294, -11672, -7502, -4436, -6795, -10207, -6526, -14750, -17604, -13687, -24646, -25846, -11844, -4658, 3817, 11712, 9322, 4506, 7115, 2887, -18047, -16681, -3207, -11792, -16637, -7681, 715, -4111, -262, 4648, 16460, 30814, 26449, 18264, -3643, -16138, -20366, -15828, -12226, -7496]
4676g496J7521J1844k914q244K805j3097j865m471K935Q239l554n477R486o927
4662a215j1084j1478L189J3771J1232j3198n70P741l296j0085J947p523j1311
4649c1880k172J2419O396K584Q808o293j2894j269k488n000m194J4374J8181J2599
4635I171K325j847j0683L548p627j584J1676N764l878p087o922m573o47J955l088
4620a3497p997N431j131R957j048J0610j522j891J571P27J1985J0796R722q239
4606B5474o295q051p111k3960j6494Q466J7788J0621K666J7835j728k2804n974
4593i567r82J3741J9955J5525j830m665j0271l863M049o974o660j2362j3304m579
4579b1787K286J2420k401J681N584m321p797m828L914J324L428N832J3594m658
$$ y = [-7496, 10025, 21869, 18955, 10711, 13516, 419, -1446, -5917, -2982, 5257, 1703, -3774, 5712, -1215, -12299, -23777, -20588, -6817, 4415, -8783, -9353, -1612, -4908, -14993, -13046, -20569, -31880, -34052, -21633, -15237, -12653, -3845, -10138, -23032, -24301, -26789, -31789, -35983, -21609, -3428, 9171, 11496, 9649, -1034, 2514, -5113, -6697, 4979, 10743, 6865, -222, -7144, -11717, -12364, -10409, -13497, -21494, -16063, -17194, -7237, -8285, 2325, 803, -1088, 483, 1210, 13195, 23991, 33713, 25474, 19179, 11128, 4017, -19943, -36437, -27971, -10183, 438, 3104, 20939, 19211, -3593, -9567, -10549, 3192, 23147, 38672, 36842, 32177, 21906, 18043, 22092, 15118, 8458, -3904, -17208, -21787, -19501, -7081, -9482, -7801, -2217, -6538, -14335, -19163, -15249, -13925, -10497, -4665, 8929, 4271]
4565D271j1216K585O82K443r170l219L066Q881n060l824M208K396p380o578j630
4550a9545o337J4195O317Q264N909l65j205k265J0727M570o529J918J270j0040
4536F884J666K445K409K120n558j1143j3232J337R068Rj2537L49J1215m973k516
4521a2457L356o493j494O861r507m257J0145k103L614N299R65k05O468L219J829
4506E240k666q274K130J1944m193p747L296O391O207R204J1832j7871j5376k894
4492b777J2425R57j0006K394m067R48O030K756j656j3096j6587L98Q878M419j2421
4477b1405m56J2605j0231J804J8059M828R59l296l949q785K000J2384o934l171
4463e588M412L779R857k19j7341p101O397P425P906J2506M781l178k7917Q50J0282
$$ y = [4271, -6945, -4360, -3678, -1235, -10405, -13624, -10558, -1677, -6737, -10561, -6353, -3957, -11337, -17915, -19545, -25882, -11687, -5370, 2894, 8803, 8438, 7233, 4968, 15695, 20265, 13736, 15654, 16924, 6884, 8550, 10995, 13404, 15524, 9966, -1177, -14409, -13072, -4004, -3995, -16532, -16183, -4968, -9941, -12457, -9101, -15594, -17088, -10227, -19734, -23991, -13846, -15949, -12335, -7036, -6071, -6276, 192, 3411, 5240, 2574, -5700, -3570, 8374, 4181, -3566, -270, 6121, 12328, 21532, 33364, 15493, 117, -2777, 9648, 10605, 599, 2993, -1074, -126, 5904, 8660, 7004, -6092, -22679, -22281, -13403, -8984, -21405, -21861, -9256, -19487, -17683, 376, 5204, 6163, 2867, -1082, -9867, -7867, 4517, -2417, -5588, -1176, 2603, 12460, 12241, -5100, -12201, -5804, 1621, 9527, 22033, 26814, 23636, -4281, -3431, 6851]
4448F851l697K3R772r203l981n392K153R137N288L028j0848j48O79L901j5050
4433g487p522O476M142J8058n421j5776J3923Q913n522j1404j4885J780Q953O362
4419E90M602l416J549k114j035l42O463O379K350j7220r383N076J181j5502o736
4404b7558J6573R287o384l09l954N764N503j385N565m955j2643j1461J7360J5330
4390F733j6898j6676L637N058J3133O422M16m64j571j3087M037J01r261P78O920
4375a0722L239n715Q561N105Q469k99o822j189k244q577K314O722j219j0653O531
4360f499O892J511k531J4563J452K380l257q88m65K027M107j0700J159L677k709
4345A0719m606n460L863O307o678n793J304n33o234K357j199J0396N179n165j5881
$$ y = [6851, 3154, 3177, 12949, 3746, -235, -5627, -3474, 5663, 10951, 13979, 3131, 2983, 3662, 7563, -7487, -15009, -8533, -4391, 13667, 8246, -7530, 6393, 15306, 9784, -1620, -16505, -14725, -5772, 590, 5192, 1776, 3325, 1211, 176, -166, 6297, 12676, 15026, -2194, -11577, -6501, -5320, -20822, -27558, -10985, -1698, -8082, -8391, -12345, -6581, -1078, -2463, 3102, -1853, -14496, -25957, -8597, 6733, -10165, -26841, -23204, -18146, -5013, 1409, 1825, 1361, -210, -13297, -9260, -9159, -18420, -17642, -10722, -7483, -13198, -4637, 468, 8937, 8638, 1816, 627, -1617, -10194, -7880, -1158, -2377, -13030, -6499, 393, 1904, -627, 13936, 15388, 17768, 14511, 13623, 13158, 15185, 19292, 8592, 9751, 13428, 10719, 6113, 653, 4516, 10823, 4145, -1648, -344, -877, -7111, -4754, -5953, 4443, 9622, 4457, -11424]
4330a1424R085P443J893O60m273k825R837o403p338J629M84o56O592j080J964
4315E588p307j3500J5095J7652J822L576j1576N701j028r484n459M605j1013j1281
4301a6609L575Q804N951o096K741J5070l296j6534l038J953q689J4915O496O716
4287A1959n120m772J252L16L774j2798q920J4850M871r071l727K714O288N095
4273F711o131r545L414j0266J0759J320J970L346K618P840j4616k872j942J628
4259e766N645p700mL497J3574j75j5734n375n508Q227l094k08R772L871L04j0220
4243h894p855J0213K5130P910j154k510j0032j587Q931l771l436J125j2177J4795
4229A6688J8757j8236k4177n651R030K360q256Q615J0656k429r498n03J1672j1839
$$ y = [-11424, -2339, 5104, 6997, 7657, 3384, 559, 10396, 3993, -3345, -1716, -1232, -1888, 4704, 3624, 5588, -1719, -15219, -124, 17528, 19350, 22926, 11350, 17051, 16023, 6539, 1080, 5685, -5328, -16609, -13034, -4230, 1721, -4375, -1634, 13436, 10140, -6394, -9432, -7479, -16168, -1253, 5243, 11959, 6839, 2067, 3319, 3635, 7409, -5389, -14309, 541, 5412, -3659, -7386, -4672, 1616, 6711, 580, -8965, -5551, -15817, -5058, -3738, -1768, 1578, 4196, 12036, -2580, -5452, -7394, -5766, -121, -7821, -7825, -4328, 9246, 9071, -6663, -12038, -17546, -9319, -12413, -12621, -2849, 1022, 1326, -8894, -16749, -6536, 18594, 26504, 25350, 22840, 12808, 11221, 20152, 16381, 12945, 14070, 1893, 16688, 35445, 17209, -6968, -12619, -3589, -1229, -9485, -870, 9786, 7357, -2141, -2644, 9028, -2811]
4215b811q176Q233P849m783q838O940J028L860J0096J818r379m786N328L663l952
4200F090L686O394p970r202Q262J1667o158P3o631l357R598N336P643n377L632
4185B3686k13r315J023K231q797K093K259q621j687J0049j0252k88J2052J3572
4171B7792J952j6130n661J4456J4340m025j1063j5511R291J3334q718m31M83j5640
4157D469k479M326R39p616p995j818M452J834J0354k341k600l593j510r56n757
4142a0291o765J159n448R171N785K195J3175O537m094j8319m449j5571j2615p920
4128d7450M4395L5405j1790o982K1186L0673J5511j8975l5431k2359o086J0803
4116H900l302r253L767j1667L770K694j0938M66p21m819O223P673Q551Q339j808
$$ y = [-2811, -10987, -2754, 5095, 312, -8526, -1586, -558, 3302, 13398, 15216, 5837, 1051, 6379, 10042, 6090, 9776, 16170, 8200, -1002, 7260, 18927, 12769, 12842, 6211, 2854, 12452, 17788, 25431, 20054, 23686, 23473, 14158, 15181, 17412, 8615, 10708, 12967, 4346, 2659, 12708, 2456, 2168, 14220, 27792, 29744, 13614, 7953, 22409, 36749, 32724, 21661, 6150, 15441, 28775, 20057, 19626, 20109, 4469, 1990, 6316, 7255, -361, -8356, -10174, -5722, -3888, 6466, 4125, 1525, -2068, -3578, -4534, -10291, -17056, -15897, -21345, -12174, -6389, -4194, 8981, 15518, 11424, -6895, -11344, -26915, -39530, -47450, -3055, 32350, 20560, 13578, 34764, 65437, 80948, 61973, 26542, 4183, -1903, 8900, 5598, -3655, 112, -11555, -7785, -5091, -16029, -15563, -16284, -21103, -14880, -7207, 1344, 9683, 7875]
4101G875J160p027k634P897J1511k3976j2811j3364j674J5978J6872O731m099
4088B439j774m91n807j8839j381L0285K8534P448p433J0196K4449P840m532k9918
4074D1016l7039j0030r884m406J5846K715Q115p30r020j3362n073J4853Q221m720
4060c498n101Q119Q339Q95k43J5559j3400j3941O246P817o386o564n710Q103L112
4045C347J0690J0293P757j1763j2901j1889q935J357J157m161R938O979J3959
4032A5828J8135j0980j6669L16j0418q444m453J0277l999p158P002r622j0178
4019c0363P266O497L149n813l044Q496P627M234j772J02J470J232K132K250R417
4004A2880j784m507Q265Q263j0276p439M791K746J3983J5430j0052k7263j4625
$$ y = [7875, 9035, 2008, -626, 7271, 18782, -5194, -18005, -31369, -33043, -17065, -193, 6538, 2439, 665, 174, -5633, -24472, -25853, 4432, 32966, 40414, 32981, 43177, 67626, 75466, 70934, 41016, 3977, -6053, -15937, -20343, -4497, -1782, 6333, 5603, -3417, -16779, -21852, -6999, 1222, -3498, -8599, -480, 7859, 8754, 8511, 24070, 10670, -3271, 2975, 10792, 4406, -2158, -7868, 235, 3347, 14037, 24330, 32087, 20324, 7423, -4466, -13401, -12044, -10887, -15048, -5110, 1869, 15828, 33963, 22983, 6314, 6630, -3788, -12232, -16685, -6408, -10407, -17565, -10563, -20185, -30363, -23097, -16600, -13451, -19264, -22308, -13812, -6185, -1951, -3723, -3621, -2151, -919, 1213, 3463, 12880, 11096, 6589, 14854, 23117, 12841, 5402, 10193, 12939, 26922, 42352, 32300, 5037, -9588]
3991i588k979J0821R368J3618m987j2341k3993O331J3739J2698l356M050n204
3978H177p052j0397p117P720M73J3390j2148p433J0664J5172K742p205q485K596
3964A097J3164N586p067j1333J993Q740j3107p894J9539P663r635L580j696N058
3950A5688k64L380r293j0162L131j2552j6121o35J2101P95J939J04M721Q648R29
3935B409o6j4599k113J5589J6000k423j0775L376J962o189r77j3425k101J3000
3921c32O433m137L248l432M075R905N726J919l08J4623J3059k6212k8332j2485
3907a6250j2090J2833K2058P408O426n938P359j073J38M148R730n288j4266j2524
3893B671j2752Q262K751M706P307J662Q528N978l385m810k403r262q135Q20L973
$$ y = [-9588, -12567, -1746, 7622, 21240, 16253, 3912, -20081, -13750, -11, 12687, 9331, 13381, 8177, 1125, -9272, -16389, -8669, -8196, 5194, -6954, -14387, -3723, 11449, 14191, 6986, -1499, 1097, 14261, 19847, 12780, 1447, 3440, 12180, -927, -8821, 10718, 18381, 8746, 12326, 10630, 15688, 15424, 18804, 9511, -651, 2480, -10072, -26193, -26828, -14727, -13932, -11993, -11889, -7168, 1480, 2409, 2343, -12256, -14369, 1220, 17220, 14797, 4022, 7398, 9360, 3171, 2194, -11231, -13332, -332, 6101, 1964, 5212, 1780, 5855, 15760, 21486, 23405, 23097, 37720, 50779, 24567, -3765, -16250, -28340, -15507, 6551, 13959, 20385, 14447, 21806, 20733, 20871, 25019, 34749, 29461, 15195, 2671, -10081, -1819, 932, 5638, 12945, 14607, 23135, 29113, 25728, 20918, 18515, 9253, 1118, 1938, 5911]
3878E911n2j2161j1787j68J36l525N648N707Q483O504r51Q125O078l892p027q599
3862a570K232P509q87K723j1879J973l896R591Q338k3205r543M130J0703j950
3848e731j807Q9m893Q45K785k010l466J1712J7257j2501j3775N866O052J3932
3834A4355l431j6306p572J5960J3704O369k7504j1533M241J2963Q506q171j812
3821b31J1369j229P46m864m02k240M604M44N00L152K445M623L153m941l970J880
3805A5039j1835j5397n162L864q6M079J661j3296l599p822m004N154J2300Q928
3791a0176J1307M194K851m287j4199q893J861P573J4072o004p23L460l739j0013
3777a2716m152N577L480O276J9499M369k493q451j3470k3805j1232k205k278J2646
$$ y = [5911, 5859, -6302, -18089, -18257, -18121, -21646, -15998, -10291, -1808, 4696, 3745, 11870, 17948, 14056, 7029, -1570, 662, 8171, 7284, 10007, -1872, 101, -3795, 5796, 14134, -9071, -18614, -14484, -3781, -5731, -7538, -7449, -12342, -11497, -8712, -10722, -14188, -2476, 14781, 2280, -11495, -5629, 423, 14355, 10924, -5382, -12954, 3006, 16710, 23079, -4425, -15958, -11717, 1246, 9752, 1581, -231, 11138, 9909, 10655, 5791, 5389, 3149, 7753, 8197, 8697, 11849, 14294, 18917, 22070, 17129, 13159, 15039, 3204, -12193, -17355, -13491, -13577, -9498, -7837, -21133, -24732, -32554, -36558, -31404, -19104, -10176, 1131, 5325, 8176, 3889, -10310, -19203, -17342, -9769, 4303, -1701, -2424, 1036, -2703, -12716, -16868, -11291, -7811, -1535, 17964, 22333, 19840, 11389, -2081, -25886, -37118, -39323, -41601, -28955]
3763b8955R849J666O49R857N705j0162q798j794J3626J1192n180J4448L645P80
3749A6528r06L188m596p836m587n57J3465p822j0812J0662K988m338q473O656
3735C560Q87q69J985n041j8517N174P750M177K83o334J629L742j847k1502m424
3720b9347p77j4663J2482j309m367k447J2959J0458L432K898m37J6895M350L304
3706A3431j1588K006O58M131r556m609j849o302m087p405Q649J728O496J7028
3692H731l01j5108l194O024j203j908O201o777R537o903p039j0910k875J7465
3678h260Q642j718n263J78J6917k170l278j1463j7066R669J2383O042M211Q722
3664A7546K317l797k1399P542J4029j0762j1403R123J3165m963k632K230J4614
$$ y = [-28955, -19106, -17440, -16791, -6934, -1229, -11391, -20189, -21983, -8357, 2835, -2345, 12103, 15748, 16528, 15622, 18810, 14214, 6378, 1791, 1234, 14699, 6877, -3935, 6727, 9715, 5377, -3096, 3560, 4447, 3578, 5563, 522, -17995, -12821, -5071, -894, -611, -6945, -5316, -1574, -3421, -24923, -29347, -30124, -44787, -32305, -33614, -37981, -40428, -27469, -17011, -13579, -10681, -11118, 5777, 10127, 13431, 1843, 3849, 4507, 8638, -918, -5527, -7376, -13678, -17765, -25170, -16521, -14793, -8297, 8731, 8430, -6678, -9872, -3848, -5051, -6959, -758, -7535, 2002, -4901, -11940, -22850, -25725, -8260, 382, -1336, -6599, -6421, 10496, 8326, 5048, -6415, -23481, -13812, -1429, 4613, 8824, 17546, 19863, 16066, -5333, 2209, 16238, 5476, -5927, 3196, 16361, 11398, 8766, 10996, 25610]
3651B5610O309j2826o489l552k996O708j4860J115J0814N777p840k2121R829J7332
3637A2810K878j458j1023j7033J3825K1267n70j012j009O870k342j634k067j3047
3623F455q280l60J7371L465l875m679m443J6767o14o860J870l814j9179n222k301
3608a3699J7306J1973r00J725o048K0694m452j6767j0740q811M87j0136k591O243
3594a5716q804O500M547Q92m721O950J4116Q400r369k2501k2813p140K3572J0585
3580a5502K288K548r859k039J1087P641j973l005M020k465j209N382O210M954
3566H078q925J520L51J1454J4589k914L931j4238k2569L713N935N233L578J4975
3552B4711Q104K529j3237l993p474o240m046L75j530K999o721k654L5L236L18
$$ y = [25610, 31919, 19093, 12604, 9052, 6056, 12764, -2096, -981, 9833, 15610, 7770, -14351, -4522, 12810, 15688, 14230, 3207, -13826, -1, 21266, 20696, 19684, 18675, 25545, 23203, 21569, 19502, 6455, -1825, -2185, 15186, 18651, 14776, 10097, 5654, 22421, 21807, 14947, 16817, 13003, -6176, -11398, -13699, 3607, 15580, 14680, 16405, 10357, 31051, 26599, 9832, -908, -9719, -9232, -19368, -21959, -15716, -24520, -18020, -13473, -12581, -17302, -10352, 3764, 12164, 2795, -19706, -42519, -49659, -26087, -15502, -13214, -10666, -20525, -22564, -11477, -3836, -5809, -8814, -4794, -7259, -8468, -3086, 3124, 8078, -847, 673, 1024, 12478, 27067, 24153, 28084, 13846, -8723, -5010, 925, 6158, 9736, 24711, 32815, 35344, 22107, 18114, 10640, 4400, 354, 729, -801, 2198, -4523, -7177, -7142, -3906, -3588]
3537c588r990J848K1573m791p401n130J7304P3J1m746K037N388M433j984J0872
3522B5909r739j0431q081m723k41l738M719p182j727N586K943M18l304j3001k873
3507b5465J8811K01N896p407R685K906p648N544k495l559k348M032k677n053L876
3492e701N063q380r165k497m668J4287J0335q502J616O720M198o301P81k903O102
3477I85N886j275o252J0427l265J649j2203p233j335j766K667P064J0171K656
3463H176q362P502J0311K3j7650K988j2027n716J7978J338q276R904l423j1640
3449h874n36N779R735J740N006m994q045p633J0430J1587J0201j0227k905o176
3435E088l784R943J4143l763j5016L886l756k149j671J5560m81p409j0638r697
$$ y = [-3588, -13578, -11730, 9843, 5052, -2349, -7479, 9825, 9898, 9909, 5163, 7200, 12588, 17021, 15037, 25909, 16170, 5739, -2342, -7065, -7306, -11044, -6325, -13507, -15234, -9648, -6705, -6287, -9591, -22592, -25465, -6654, -6453, -557, -7964, 1721, 4627, -3021, 2523, 28, -3531, -5879, -1847, -4524, -9577, -5701, -638, -9018, -18183, -20680, -25348, -11061, -726, -9228, -7612, -892, 3306, -2995, -2214, -5117, 985, 6871, 5596, -656, 9771, 6506, 8155, -4048, -11281, -12616, -14382, -11715, -4651, 5520, 8176, -186, 7316, 17627, 17650, 0, 2988, -9039, -14755, 3223, 4561, -3715, 6189, 2766, -8874, -9410, -3631, 6104, 7844, 12850, 7856, -189, -7822, 2608, 14195, 24396, 14169, 11264, 5088, 1304, 11247, 25390, 21627, 6611, 10497, 6741, 4592, 2921, 18481, 18000, 10591, -47, -9744]
3421i744j076N771j1238R811J1033P667n338j1059M154J0510N937n754j6520P047
3407A201j48p151J5929l950q829O9R767J216j184o144j8080j612M253J212N590
3392g861K585P580M997j841K015m834j1303O923J6197J578m015M124r900M81P67
3377G493J4362p993j3757j2376r460k789J2809N639M28j1968j3088J0908J0546
3364i246M902L407L129k182N355O655J2375R906K559j7506p740L249j0396p45
3350C722P343J772j2823m726j154n891J584Q454n867l806l411R526L828O131O389
3335A1071l042j2805N587N701K956K68j0322P094l583q308O845P426L864M969
3321A7721n605j1486L399J0004r370j610P560K0006l388j1798n250l669N569m569
$$ y = [-9744, -10820, -5049, -16287, -6476, 4557, 12224, 6886, -4173, -19, 10491, 16428, 10674, -5846, 1201, 1053, -6098, 9831, 5881, -2948, -2879, 6888, 8104, 6920, 776, -17304, -18916, -14663, -13451, -7861, -5276, 2304, 7301, 5460, 7475, 2641, -8662, -1739, 14458, 16036, 12021, 16145, 6245, 6726, 7493, 21855, 13862, 105, -12271, -21731, -24520, -11711, -6072, -5644, -17612, -30700, -19792, -9246, -4344, -937, 2192, 10, 5365, 12020, 24395, 34301, 36860, 19354, 11614, 14863, 4467, 3722, 11065, 12837, 14, -4712, -5866, -11757, -10173, -1719, -7586, -11392, -14803, -5277, -1449, 4682, 11071, 8029, -4776, 811, 6512, 9468, 9736, -586, 6508, 2925, -5383, 1462, 8888, 12752, 17721, 12116, 630, 4029, 14033, 4663, 3053, 10613, 30619, 27231, 15433, 10183, 6514, 12083, 7514]
3307G514K126M625l341j3j4626j0203p095K972J4482L689K40m913K69Q884m275
3292C35q233j621K816J6720M737n698p126o178Q401N37N918r103J517K053R409
3277A4484O216o317m299O32J2048j382j503P100L333k823j492P46J448l552J845
3262B6484k444k320j3334j2208R738J1183M863j4979o830m44o446o784M804N016
3248c701L509R240L7j1088L387R738M055m614K210j603o326N929N860Q086j0386
3233A4333M851J537k713o492p239k368R954P186j465o94j2766m134j70K818M299
3218F937K729O400k940J393n846p48J563J0966J009k275j0652j7883n577J2064
3204b860j15J362q5j52N738K019q603j312r605J022J5854j287J789M71n899j848
$$ y = [7514, 9640, 14265, 10924, 10911, -3715, -13918, -21013, -18041, -3559, 130, 370, -4543, -4274, 4610, 335, -7898, -9519, -6703, 10017, 14754, 9056, 1930, -4248, 4153, 4690, 10608, 1505, 3022, 5075, 14484, 20700, 14383, 10084, 10716, 22764, 21382, 19879, 26979, 30312, 27489, 25997, 26743, 28191, 24639, 26484, 24040, 21720, 8386, -3822, 5916, 17099, 21962, 6983, 153, -291, -6737, -13521, -8717, -3701, -192, 9048, 9085, -2003, 1384, 11122, 15177, 10563, 12773, 11170, 4844, 10773, 16633, 24719, 14333, 19184, 20721, 18008, 11516, 4277, 1909, 11863, 19049, 17584, 16890, 4124, -10, -180, 2638, 6937, 9666, 16066, 13126, 14519, 8673, 7925, 9488, 20454, 21463, 19188, 8536, -9347, -14924, -2860, -2975, -1613, -1698, -1850, 3888, 5907, -2696, -4008, -13613, -12591, 3263, 1976, 3765, 4236, -1663, -3511]
3188c511P105p055j1142O90Q025k61j4113k781R005j047q62j656J0472J9237O88
3173A2794j717R272Q669o168l1561j2301J7828J1912n651j2472N086J0910J4950
3160B1551o687j3543k629n369k764O681P514k622O00m532n54J5646M745N810k717
3145B1130j601o168Q874M540j3594M047j9K3906P318j3652k1458q573o136M939
3131C553m859p056j8202j2476J3550O519n005j0468J2312N463j959K097L761q208
3117b0978n543J7897j2208J2763J3439r00O450R39j3206r039j4721O87J3155J0918
3103c47O211p514j6408R021J3736o7j1651j2847k691j305J0627l818J4697J4223
3089A1867K61j5027p177m807P74R55P983j125O720R14Q94Q492P612r189m867q296
$$ y = [-3511, 3594, -3461, -14603, -13913, -5888, -6149, -20262, -23043, -14038, -15085, -15947, -17603, -7131, 12106, 12794, 11077, 20349, 29018, 22850, -8711, -21012, -3184, 8728, 3077, -9395, -4309, 6601, 21551, 14864, 1321, -1308, -6677, -9441, -2760, 4754, 2132, 2732, -1800, -2354, 13292, 18037, 23847, 21130, 19529, 13361, 22235, 26775, 13181, 17228, 17209, 41115, 48433, 34781, 13323, 4750, -1386, 3553, -1306, -8362, -26564, -39040, -25490, -18971, -23976, -34444, -22132, -16669, -18628, -16531, -12770, -20978, -26521, -8624, -20832, -8069, 5370, 4470, 10920, 11859, -1347, -10386, -25107, -24420, -11265, -347, 5864, -1650, -18058, -9037, 4699, 4632, -7019, -19866, -22557, -23862, -13235, -17053, -2356, 11867, 12128, -2899, -10076, -14883, -14109, -13154, -5171, -6296, 424, 1338, 2232, 10724, 18336, 9147, 4280, -4016]
3073d016K181L665j121M98O260M076m783O001L827n412j8118M88l756P213R641
3058F644l881n205j509j835o508L755q331m248J0710L220L68k552j888j274m488
3043a7022Q546P648R852l57N50M763O978N957j9686j1618l805l529K14L459P406
3028f44P364Q137l904o078j2405p122O388j208K39Q482L780l178j2148K043k12
3013a0466N658J4177L695j2951j0948n702J755K038k807n055N394J0786J0621
3000F195J260j0962M801O293j2070J2339J8144O649n991r378M984j6955M868O281
2986A6458P772J34m956r006o934q64K187K156O826m092q761M912M316J126J208
2971A2482K90P657j3406n642M659o103P09J4724M102J395L160j2262o203O244
$$ y = [-4016, -1835, 1830, 709, 1207, 7467, 11543, 6760, 12761, 16588, 11176, -6942, -6454, -10210, -2997, 6644, 2763, -2442, -3951, -5786, -12294, -8539, -16870, -21118, -10408, -7188, -6820, -9372, -11260, -12534, -17022, -8476, -828, 9024, 8667, 9217, 13980, 20958, 26915, 7229, -4389, -8194, -11723, -11509, -8050, -644, 6720, 14857, 10953, 4875, -7530, -14652, -8264, -9472, -9233, -751, 3029, -149, -12297, -10254, -10466, -4808, 9369, 13064, 113, -10835, -16537, -14782, -12744, -15551, -20606, -15212, -4426, 6195, 7455, -3507, 1294, 7587, -4483, 7856, 26000, 32649, 26658, 17280, 22264, 5309, 10177, 16458, 24230, 24364, 19408, 10402, 3468, 2604, 4791, 6947, 13773, 9681, 920, 5832, 10148, 11274, 12482, 12772, 20429, 7023, 1381, 6040, -63, 646, 15370, 19472, 20867, 24027, 11765, 5562, 11806]
2957A1806L227m758q416O994J0174jo168o109M536j1108j5233J605M181O224o794
2942i840J589J9328O799j376j0731l524M41p799l435O300l570O253R120P87r653
2927F89n998j0858k0868N081J2600K43M098J2845J4985P888k501j0212O845p433
2913G404p911m643J5887M862j2518P405K543j0285j321m322q40m442M210k00N38
2898c633J5817k901J1635M605L670j2564j8552J0017K7143J642j3815j4367k0608
2885a1911j0400J303J1315J1905P142j570k763N45p012k351j371J938J202m110
2871f138m521r11p94J145K1421K0031q972j7896j1694J26J0411M49p015M033P411
2856G086N784j842O50j440j4725l429O610r112k011p531n489J2076K073J444K535
$$ y = [11806, 15033, 10275, 1859, 8853, 19027, 19026, 12858, 6749, 11285, 177, -15056, -13451, -9270, -3046, -9840, -8251, 11077, 17876, 16500, 5769, 2245, 2686, -5113, -8548, -2248, -5818, 435, 9555, 10342, 689, -5309, -16167, -37035, -31954, -19354, -19111, -15013, -2168, 12817, 20705, 18204, 7992, 14837, 7404, -507, -5150, 10737, 15599, 3081, 10486, 13029, 2744, 1423, -2899, -3739, -8181, -3971, -4171, -3633, 12184, 9283, 20918, 25523, 29193, 16629, -1923, 8094, 35237, 36879, 23064, 8697, -11911, -22311, -21008, -9693, 2212, 9354, 7784, 5021, 5566, -1446, -3797, -5168, -3230, -2028, -6138, -10659, -11570, -12364, -11219, 10202, 30233, 21261, 3365, -8329, -8203, 2208, 2657, -4358, -325, 7086, 12870, 11028, 11678, 10238, -4487, -7916, -1306, -10418, -12429, -19960, -25449, -13373, -11300, -9856, -7321]
2841g321M579n623l688J5491P640j538m558l358l70o777J261O869N386j4715L646
2826c076L053P492M093r576m359j0988j1856K75k500N189J1283k775l738J296
2812a6187Q729J6667k117j0517O551K239n468q996n201j115J3434J5577L010j4559
2798B047r931K715M212J0188K914l052k25n298r411l896J7550M418n330m303j3622
2783a1024p170J7920J173j14n671J4447o289p098l794m290o616K838p191m420
2769b7299K9121J9577p97j7600j4001P106j508k764O653J3244L720p875q548J1728
2755A0757P399q323j552R398j0186k4404n235Q739m83L961N779k252J295P600
2741B493J199n239Q524j807k848p144n788K133L948m108M557J892P110N282o150
$$ y = [-7321, -2742, -8365, -12053, 3438, 11078, 9540, 4982, 1624, 1254, -5523, -4262, 2607, 7993, -6722, -3076, -23, 7469, 11562, 1986, -2373, -13361, -25217, -24942, -27442, -22253, -10970, -13745, -17483, -16187, -7458, 9209, 7092, -3425, 3126, 5365, -103, -9099, -14300, -15415, -1981, 13596, 16606, 2047, -7884, -5169, -957, 9231, 12145, 9093, 8868, 3570, -5841, -9737, 7813, 12231, 6901, 2598, -11024, -18194, -274, 899, 785, -4886, 9561, 3272, -3826, -7620, -11910, -18526, -15688, -22879, -27299, 1822, 21399, 20602, 3002, -10999, -3893, -5401, -8165, -1512, 11732, 15452, 7577, -971, 10757, 18156, 9833, 8281, 17679, 7493, -16911, -22146, -13407, -13890, -9929, -4150, -6402, -5107, 2493, 3692, -1547, 6977, 5170, 2322, -4822, -10610, -8477, -4529, -8637, -4080, -2188, 4922, 10204, 4054]
2726D054k456j4900r689o247P557K1031J2L469j2679p989R891J6678m195n824
2712a287j1833O688P220q896p008r278k974P107J736l136R359O327k826O641Q626
2697F466K32k699P295k401r410r463n587q884M649R464J2165O646j4963k0497
2683b6987m025K0588Q234q499p772l615O193R97J3599q833o717j201m643j824
2669b4505J3128M039m309R168k248j5244k719J2798n426n587R401J1700K525O592
2655I313j5181n202m982K1P984M085j114L497N789N175k682P455M319M252M388
2640B7117j1069J190K593q939k336k2100l8018J2177L2647J3239P211j9009p019
2627a2316m2N059m22K0754J170q488r374l880Q816O968K909n179l082N726J2895
$$ y = [4054, 1598, -13302, -22991, -29238, -21681, -650, -638, 2831, -9848, -17837, -7946, 8732, 4537, -1287, -13120, -6432, 788, -8108, -15116, -24394, -27368, -20261, -18525, -21661, -12302, -5975, -8801, -2160, 6466, 6698, 3999, 11294, 8893, -517, -9980, -15567, -24451, -19802, -10338, 1827, 8473, -6490, -26987, -31012, -10424, -2190, -10689, -18461, -22076, -15883, -14886, -1287, -10120, -16837, -18038, -22681, -24505, -11377, -7338, -11647, -2479, -4727, -19971, -22690, -9892, -15318, -20905, -11504, 196, 2721, 9313, -5868, -11070, -16052, -16031, -8047, -3962, -5076, -1579, 4210, 9385, 6703, 14158, 18477, 22729, 27117, 16048, 17238, 19831, 10892, 8556, -13544, -51562, -39385, -6738, 6501, 13712, -5297, -12316, -12358, -7299, -7721, 13033, 14203, 5715, -3659, -7539, 1277, 8245, 11154, 5975, 2893, 8619, 21514]
2612B1514j3951L576N836j2765k914M710j226l50K780K646R939l874k69o814n638
2597C200n767j741M968j44p53R332k935P942k784r267N434N72J5566p46q380j1601
2581B896j2163q311R488R52M16j757r559j4678N139R163J1721q084m927M109P030
2566h565k156J0509j6450p58P159J5653J3970m995j4173j1495j678K505l072J503
2552a2043j573Q872Q657Q183p769R168J1306l614R376p118j1156M364n372j4761
2538c480r116O866J7616J15l452r727L306p993n037O028J0960J7928K654q354
2524A8314k629l817j850L37l729j8163J1323J1252k413o290j835M651r225n980
2510a0054J3234M98j4289j459K55J2947R930L759J2626L221o397k1093l525K419
$$ y = [21514, 7563, 11139, 16975, 4210, 1296, 6006, 4780, 4430, 7210, 9856, 19795, 15921, 15652, 8838, 3200, -2567, -4308, 660, 516, -237, 9095, 6160, 14102, 11318, 2051, 7485, 8057, 23623, 22877, 14497, 2896, -9267, -17578, -8090, -7138, -6722, -8479, -18038, -32716, -27577, -18414, -6693, -14777, -19704, -15595, -8565, -10721, -212, -16662, -17420, -10261, 5392, 19362, 14367, 194, -11301, -12979, -10474, -13546, -12043, -13616, -4744, 3913, 12096, 4327, 13495, 24801, 21187, 30563, 23445, 12289, 16653, 11281, -3480, -12596, -5730, 11886, 12001, 8549, -1178, 2128, -5865, -10902, -4874, 6086, 24014, 26668, 18314, 15685, 11868, 10018, 10355, 6626, -11537, -214, 11038, 8625, 2335, 500, 5151, -4074, -10054, 3180, 3678, -10611, -12070, -11815, 1132, 11062, 14821, 27447, 30668, 24271, 3178, -347, 2072]
2496B072J77J168l657j547N633o032r790m86K847J6205K0294R99j636L414n24
2481B9137j0828j423l205K887J9292q586k5593j8482L680R251J0323Q768j4077
2468A144j0990m389o779M802P040K934P765K1636J1578L685J535j7443n749J0151
2454B6920j379m478j0593K171L938j0261q161N58l495o286K734m36O4n787J0949
2439c542m867L268J8940m189r169l99q933o46J1498J1160J958p243l127N203K532
2424A2444r058n713j8410q887p367M955l451L965m040O478J2946R524r73n725
2410a3312O465K58M495M494j137m580k992r814n780J3143Q215J0621l200m617
2396B259p162N013N787J6071m753r229m233K929j317k813p318J87k20N23k382
$$ y = [2072, 2249, 3417, -240, -1787, 3846, -2186, -11976, -12462, -9615, 6590, 26884, 27883, 26247, 29661, 29137, 18309, 16886, 13681, 16568, 35860, 27274, 1681, -16801, -13121, -3870, 6453, 15221, 1144, -9846, -14235, -21014, -16212, -9172, -6238, 1527, 23163, 34741, 38426, 39961, 22518, 16769, 26920, 25541, 21063, 10470, 12641, 16579, 6318, -1843, -1285, -4780, -11066, -8332, -8768, -8704, -14491, -3542, -8409, -5141, 13799, 9610, 441, 42, -8891, -9537, 1961, 13121, 15079, 7836, 4709, 9912, 12444, 3386, -2327, -20737, -29624, -36991, -32036, -35487, -31522, -35562, -29084, -16138, -6614, -7587, -13312, -6847, -6589, -2094, 2400, 1263, -3317, -6309, -16123, -21903, -8760, -545, 10076, 6876, 2259, -4903, 110, 5897, 21968, 17215, 7986, 3753, 6682, 5365, 2552, -4766, -4579, -4799, -4276, -6658]
2381f658O900k726k043O370N141J2685O581m061j1091n469l366o477O766J1130
2367A3682r703r227j8124l852J7604J422L127N404o400n879J1746l429J0347M944
2353A1662n879O238J267j8190j21J267P57P847o756q020p962O448N606j0160J3359
2338b637R367o684j3521N013O56P131R58N326R630m870j3486m050Q597J1013j5839
2323c396j439O389P64m055M10R07j2237l684R093N143Q900J1851j710p363L342
2308A2915R292j5502l010J870j840Q584K703p467m939k990R985J7317j3340j1280
2294B298l324K881m68o991Q042M339l813o80K032k792Q045O871m710j6907l732
2279h909L01Q302Q300L131k319k350K797p430j482n523L825K487j0232n68M253
$$ y = [-6658, 242, -2484, -4527, 1843, 6984, 19669, 26250, 22189, 11098, 5629, 2263, -4214, 2552, 13682, 3979, -5248, -23372, -27224, -9620, -8198, -5071, 333, -6067, -11946, -200, -3629, 6718, 11662, 5783, 12021, 13288, -4902, -5023, -3756, -2999, 4848, -1908, -9928, -17890, -11442, -5836, -15996, -2637, 6730, 46, -13475, -8462, -7806, -675, 283, 5609, 15239, 10369, -3117, -7167, 1430, 12443, -3396, -4835, 1554, 2318, -1737, -1327, -420, -12657, -16341, -7248, -2105, 6795, 18646, 16936, 9573, 12915, 22207, 6705, 3695, 5565, 3725, 12309, 15012, 7545, 2606, -384, 9601, 26918, 13578, 2298, -1026, 1855, 1387, -5604, 2438, 6777, 2964, 2284, 4316, 1524, 9569, 16440, 11730, -5177, -8909, -8608, -306, 7994, 11125, 8806, 6456, 9253, 1823, 341, -5182, -1357, 1130, -9102, -9670, -5417]
2264e417r182N000Q108j740k389P646Q49p906j1309J174R650N747r483r342L235
2249a5359K430N343J2993J5414j331l607j2132O487m519M464N348o925p592M919
2235E933j2285n399N432p147m661J0046J5401J5292p427p803j2695j1233J8514
2222A968J7776p784j4521L934P228l139M780L383J136K99k482L08L142q279r207
$$ y = [-5417, -14599, -9599, -1491, -3231, -5620, 2026, 2875, -5031, -16340, -15166, -5516, 231, -9252, -18594, -15359, -12929, -7586, 5407, 20821, 19490, 15883, 3751, 10238, 5719, 10183, 15531, 8606, 1014, 5933, -6352, -11751, -6319, -13466, -18127, -8081, 7320, 22612, 15185, 7382, -5313, -16546, 1968, 19744, 11960, -2561, 1373, 8601, 5462, 10242, 13625, 14761, 15060, 12578, 12886, 16028, 7749, -1458]
$$ [...]
##END NTUPLES=NMR SPECTRUM
##END=
