##TITLE=Analysis number 308235
Compound Code cc 24404
Book Reference 350/147/3
Project Code adrs
Chemist Name chrisr
##JCAMPDX= 6.0         $$ Bruker NMR JCAMP-DX V2.0
##DATA TYPE= NMR SPECTRUM
##DATA CLASS= NTUPLES
##ORIGIN= Bruker BioSpin GmbH
##OWNER= NMR
$$ XWIN-NMR		Version 3.5
$$ Mon May 23 13:02:57 2005 GMT Daylight Time (UT+1h)  MAYBRIDGE\NMR@NMR_250MHZ
##.OBSERVE FREQUENCY= 250.131544655141
##.OBSERVE NUCLEUS= ^1H
##.ACQUISITION MODE= SIMULTANEOUS (DQD)
##.ACQUISITION SCHEME= undefined
##.AVERAGES= 16
##.DIGITISER RES= 18
##SPECTROMETER/DATA SYSTEM= dpx250
##.PULSE SEQUENCE= zg30
##.SOLVENT NAME= CDCl3
##.SHIFT REFERENCE= (INTERNAL, CDCl3, 0, 16.522)
##AUDIT TRAIL= $$ (NUMBER, WHEN, WHO, WHERE, WHAT)
$$ ##TITLE= Audit trail, XWIN-NMR		Version 3.5
$$ ##JCAMPDX= 5.01
$$ ##ORIGIN= Bruker BioSpin GmbH
$$ ##OWNER= NMR
$$ C:\u/data/dgb/nmr/ADRS/3300/pdata/1/auditp.txt
$$ ##AUDIT TRAIL=  $$ (NUMBER, WHEN, WHO, WHERE, WHAT)
(   1,<2005-05-23 13:02:38.18 +100>,<MAYBRIDGE\NMR>,<NMR_250MHZ>,
      <created by zg, POWCHK disabled, PULCHK disabled
       configuration hash MD5:
       62 19 C7 07 E1 42 D1 B7 37 6C 3D D0 77 39 F9 E6
       data hash MD5: 64K
       2D A3 66 B4 81 EF 88 B9 59 AD DB D8 20 76 F3 1C>)
(   2,<2005-05-23 13:02:49.71 +100>,<MAYBRIDGE\NMR>,<NMR_250MHZ>,
      <Start of raw data processing
       ef LB = 0.3 FT_mod = 6 PKNL = 1 SI = 32K 
       data hash MD5: 32K
       08 03 24 79 34 76 B7 93 92 FB E6 52 58 27 26 78>)
(   3,<2005-05-23 13:02:51.68 +100>,<MAYBRIDGE\NMR>,<NMR_250MHZ>,
      <apk 
       data hash MD5: 32K
       6A E0 64 A8 E8 20 66 C8 C6 78 F2 86 87 5F 25 DA>)
(   4,<2005-05-23 13:02:52.40 +100>,<MAYBRIDGE\NMR>,<NMR_250MHZ>,
      <abs ABSG = 5 
       data hash MD5: 32K
       E5 93 83 E3 48 AA E7 9F 34 55 E6 45 DA A7 73 E5>)
$$ ##END=
$$ 
$$ hash MD5
$$ CA A7 8E 30 C6 8E 5B 7E 02 29 80 9B 72 FA 26 A7
##$RELAX= 
##$RELAX= 
##$RELAX= 
##$RELAX= 
##$RELAX= 
##$RELAX= 
##$RELAX= 
$$ Bruker specific parameters
$$ --------------------------
##$DU= <C:\u>
##$EXPNO= 3300
##$NAME= <ADRS>
##$PROCNO= 1
##$TYPE= <nmr>
##$USER= <dgb>
##$AMP= (0..31)
100 100 100 100 100 100 100 100 100 100 100 100 100 100 100 100 100 100 
100 100 100 100 100 100 100 100 100 100 100 100 100 100 
##$AQSEQ= 0
##$AQ_mod= 3
##$AUNM= <au_zg>
##$AUTOPOS= <30 >
##$BF1= 250.13
##$BF2= 250.13
##$BF3= 250.13
##$BF4= 250.13
##$BF5= 500.13
##$BF6= 500.13
##$BF7= 500.13
##$BF8= 500.13
##$BYTORDA= 1
##$CFDGTYP= 0
##$CFRGTYP= 5
##$CHEMSTR= <none>
##$CNST= (0..31)
1 1 145 1 1 1 1 1 1 1 1 1 1 1 1 1 1 1 1 1 1 1 1 1 1 1 1 1 1 1 1 1 
##$CPDPRG= <>
##$CPDPRG1= <>
##$CPDPRG2= <>
##$CPDPRG3= <>
##$CPDPRG4= <mlev>
##$CPDPRG5= <mlev>
##$CPDPRG6= <mlev>
##$CPDPRG7= <mlev>
##$CPDPRG8= <mlev>
##$CPDPRGB= <>
##$CPDPRGT= <>
##$D= (0..31)
0 1 0 0 0 0 0 0 0 0.06 0 0 0 0 0 0 0.0002 0 0 0 0 0 0 0 0 0 0 0 0 0 0 
0 
##$DATE= 1116849757
##$DBL= (0..7)
120 120 120 120 120 120 120 120 
##$DBP= (0..7)
150 150 150 150 150 150 150 150 
##$DBP07= 0
##$DBPNAM0= <>
##$DBPNAM1= <>
$$ [...]
##$SUBNAM7= <"">
##$SUBNAM8= <"">
##$SUBNAM9= <"">
##$SW= 20.6930455092707
##$SWIBOX= (0..15)
0 0 3 0 0 0 0 0 0 0 0 0 0 0 0 0 
##$SW_h= 5175.983436853
##$TD= 65536
##$TD0= 1
##$TE= 295.16
##$TE2= 300
##$TE3= 300
##$TEG= 300
##$TL= (0..7)
0 120 120 120 120 120 120 120 
##$TP= (0..7)
150 150 150 150 150 150 150 150 
##$TP07= 0
##$TPNAME0= <>
##$TPNAME1= <>
##$TPNAME2= <>
##$TPNAME3= <>
##$TPNAME4= <>
##$TPNAME5= <>
##$TPNAME6= <>
##$TPNAME7= <>
##$TPOAL= (0..7)
0.5 0.5 0.5 0.5 0.5 0.5 0.5 0.5 
##$TPOFFS= (0..7)
0 0 0 0 0 0 0 0 
##$TUNHIN= 0
##$TUNHOUT= 0
##$TUNXOUT= 0
##$USERA1= <user>
##$USERA2= <user>
##$USERA3= <user>
##$USERA4= <user>
##$USERA5= <user>
##$V9= 5
##$VALIST= <valist>
##$VCLIST= <CCCCCCCCCCCCCCC>
##$VD= 0
##$VDLIST= <DDDDDDDDDDDDDDD>
##$VPLIST= <PPPPPPPPPPPPPPP>
##$VTLIST= <TTTTTTTTTTTTTTT>
##$WBST= 1024
##$WBSW= 4
##$XGAIN= (0..3)
0 0 0 0 
##$XL= 0
##$YL= 0
##$YMAX_a= 597758
##$YMIN_a= -361698
##$ZGOPTNS= <>
##$ZL1= 120
##$ZL2= 120
##$ZL3= 120
##$ZL4= 120
##$ABSF1= 16.522
##$ABSF2= -4.171173
##$ABSG= 5
##$ABSL= 3
##$ALPHA= 0
##$AQORDER= 0
##$ASSFAC= 0
##$ASSFACI= 0
##$ASSFACX= 0
##$ASSWID= 0
##$AUNMP= <proc_1d>
##$AZFE= 0.1
##$AZFW= 0.1
##$BCFW= 0
##$BC_mod= 0
##$BYTORDP= 0
##$COROFFS= 0
##$CY= 12.5
##$DATMOD= 1
##$DC= 0
##$DFILT= <>
##$DTYPP= 0
##$F1P= 14.0000005364418
##$F2P= -0.99999901652339
##$FCOR= 0.5
##$FTSIZE= 32768
##$FT_mod= 6
##$GAMMA= 0
##$GB= 0
##$INTBC= 1
##$INTSCL= 1
##$ISEN= 128
##$LB= 0.3
##$LEV0= 0
##$LPBIN= 0
##$MAXI= 10000
##$MC2= 0
##$MEAN= 0
##$ME_mod= 0
##$MI= 0
##$NCOEF= 0
##$NC_proc= -5
##$NLEV= 6
##$NOISF1= 0
##$NOISF2= 0
##$NSP= 0
##$NTH_PI= 0
##$NZP= 0
##$OFFSET= 16.522
##$PC= 1
##$PHC0= -76.92227
##$PHC1= 16.53893
##$PH_mod= 1
##$PKNL= yes
##$PPARMOD= 0
##$PSCAL= 4
##$PSIGN= 0
##$REVERSE= no
##$SF= 250.13
##$SI= 32768
##$SIGF1= 0
##$SIGF2= 0
##$SINO= 400
##$SIOLD= 32768
##$SREGLST= <1H.CDCl3>
##$SSB= 0
##$STSI= 32768
##$STSR= 0
##$SW_p= 5175.98343685301
##$SYMM= 0
##$S_DEV= 0
##$TDeff= 65536
##$TDoff= 0
##$TI= <Analysis number 999999
Compound Code 99
Book Reference 9
Project Code 9>
##$TILT= no
##$TM1= 0
##$TM2= 0
##$TOPLEV= 0
##$USERP1= <user>
##$USERP2= <user>
##$USERP3= <user>
##$USERP4= <user>
##$USERP5= <user>
##$WDW= 1
##$XDIM= 32768
##$YMAX_p= 276683795
##$YMIN_p= -401205
$$ End of Bruker specific parameters
$$ ---------------------------------
##NTUPLES= NMR SPECTRUM
##VAR_NAME=  FREQUENCY,     SPECTRUM/REAL,   SPECTRUM/IMAG
##SYMBOL=    X,             R,               I
##VAR_TYPE=  INDEPENDENT,   DEPENDENT,       DEPENDENT
##VAR_FORM=  AFFN,          ASDF,            ASDF
##VAR_DIM=   32768,         32768,           32768
##UNITS=     HZ,            ARBITRARY UNITS, ARBITRARY UNITS
##FACTOR=    0.157963299565203, 1,           1
##FIRST=     4132.6476996994, 0,             0
##LAST=      -1043.33573715361, 0,           0
##MIN=       -1043.33573715361, -401205,     0
##MAX=       4132.6476996994, 276683795,     0
$$ Real data points
##PAGE= N=1
##DATA TABLE= (X++(R..R)), XYDATA
$$ [...]
27776 -42463 -88946 -55091 3186 10731 -83175 -82308 -108199 -90453 -57749 23038 -713 -80234
27764 -80234 -39277 49204 15767 -14626 -56898 -42995 -40643 -109127 -87435 -75071 -116571 -201231
27752 -201231 -190250 -50455 -16915 25402 136473 152837 51121 56511 141951 118130 6506
27741 6506 -38598 -32275 -55066 -47646 -41848 -37887 -121936 -79159 30971 58940 251 -29597
27729 -29597 -70098 -86624 -24759 120785 159208 141517 66546 -26988 -59672 53191 88131
27718 88131 89308 108468 155676 133295 69369 50958 66942 87099 32133 -11535 -72677 -49817
27706 -49817 -41913 -56952 -61965 -93950 11976 -27078 36305 103450 116091 135369 102911 38737
27694 38737 23596 -48893 -110776 -37638 11804 -21427 -89424 -149994 -169975 -69424 -73812 -13791
27682 -13791 -4028 7672 -48827 9711 77991 -13207 -11463 76449 49923 -43006 -117657 -173671
27670 -173671 -159385 -71922 32133 66728 83077 65219 -15268 -5354 -13596 -61425 -162361
27659 -162361 -126570 -137046 -76748 -30851 -92609 -22964 10605 57795 86820 105327 -37298
27648 -37298 -205520 -192557 -57844 3482 123542 190054 213917 152910 8822 -83448 -25233
27637 -25233 -60116 -141755 -104118 -29104 30901 53719 62606 82285 115534 141590 18330 2644
27625 2644 11619 50519 71185 48839 -61823 -134294 -120710 -13173 17347 79323 210068
27614 210068 190963 137591 129902 179213 202708 153679 24598 15634 108752 117860 -34452 -140502
27602 -140502 1366 137273 53125 13216 15070 -9339 -83693 -101808 -122355 -63666 -40339
27591 -40339 8575 -3084 -20188 -36247 -77481 -6531 41310 -5008 -9582 14519 -41740 -120096
27579 -120096 -62842 -52934 -4930 -12935 67228 108253 123595 88241 74380 60980 101075 108427
27567 108427 100711 -19793 -185491 -174870 -164174 -118387 -56668 -48993 689 84304 28676
27556 28676 2225 74149 67836 76516 3161 5152 -4855 -69408 -73728 -13684 -70878 -81655
27544 -81655 -99949 -23363 105410 135383 74860 29974 -30324 -71253 -128744 -133854 -81011 -64401
27532 -64401 47143 23632 44106 139798 8492 -71919 -63614 -1073 2583 31382 -17897 -53691
27520 -53691 -3916 -23681 -117069 -77278 41089 50021 -10507 -63457 -27734 -86700 51704
27509 51704 92493 -20401 -75258 -154497 -82056 -85127 -26482 42245 162700 155577 48332
27498 48332 -84539 -119842 -78967 -21067 -50829 -80432 33 -7003 -39083 -78301 -74211 -49652
27486 -49652 -29998 -93802 17095 157238 115358 64224 195055 256508 226423 186152 106053
27475 106053 -35091 -65925 -10870 -58623 -70754 16863 -15248 -14439 -23698 -21434 -94739 -76403
27463 -76403 -57240 52393 104834 135915 104944 56453 126029 117408 -14636 -9952 -63088 -116076
27451 -116076 -258555 -291479 -222019 -95734 -85819 -66161 -52269 -13476 20548 95258 126439
27440 126439 79152 34256 14466 7108 -67940 -55440 -91774 -64918 -21968 -82199 -39745 47036
27428 47036 152709 262171 251283 35564 -87999 -59620 -1795 9460 79641 242228 239017
27417 239017 128110 23942 36710 145193 65012 -13585 -33070 40705 105707 26118 -126511
27406 -126511 -120406 -112399 -119554 -176615 -91740 -23547 59449 108193 17410 42056 79791 148850
27394 148850 175070 252466 181115 109667 98783 51120 -28189 -96030 -51235 -38597 -65522
27383 -65522 -103160 -178421 -130292 -127864 -31068 82589 64124 34694 -10797 -84323 13239 97460
27371 97460 125198 82166 -70525 -149778 -165105 -100671 -54639 -27532 -29326 14213 31939 69132
27359 69132 77388 18615 -120281 -172308 -146338 -23808 -3946 -42022 -36688 -22357 42163 104008
27347 104008 86392 61542 -52636 -83517 -32612 -1217 -102206 -204786 -225743 -130051 -78548
27336 -78548 -71200 -134053 16552 63329 104877 18792 -49637 -57424 27847 44393 25248 -52739
27324 -52739 7088 -39358 -165131 -141741 -27658 27342 81934 3829 84287 655 -42475
27313 -42475 -34887 3499 -18274 -35007 -96879 -147296 -157260 -115088 20121 54939 -25410 -120624
27301 -120624 -128601 -92191 -68211 -63516 -9515 -32596 -22343 -12540 -62322 -70596 -44946 -56488
27289 -56488 -86896 -44079 32285 3195 -20337 -572 -69229 47477 7667 -104310 -136880
27278 -136880 -182936 -1971 102893 -10654 -99282 -90368 -81856 -68039 -58358 1018 -35793
27267 -35793 -66226 33772 49253 71567 42668 -22017 -80247 -92695 -101894 -6220 70897 59294
27255 59294 65273 19164 -38500 -58267 -49455 -45719 -62153 13973 33722 -12837 13049 -6347
27243 -6347 -25387 20138 79541 56591 -10583 -46716 19881 -35684 -55047 45044 118426 27113
27231 27113 55756 -26290 -40895 -97514 -28123 -85001 -142935 -160041 -126201 -123020 -103040 -93258
27219 -93258 -20732 -17698 -8615 -15766 -57165 -56114 3663 -41418 -43161 31522 70985 75434 52132
27206 52132 139382 136205 90996 2407 -17871 -23025 2591 55324 85687 32819 -80349 -61841
27194 -61841 -13750 -2135 -20592 -3782 -15781 -70930 -120385 -147482 -95399 -116768 -126877 -24288
27182 -24288 90978 180453 30032 -45149 -29544 63913 39155 -39071 -11243 13595 -171554
27171 -171554 -159363 -59246 69086 41180 57813 74339 99115 152262 72665 -10045 13049
27160 13049 76632 27490 56788 67971 -65823 -136832 -170103 -191764 -193396 -150566 -77205 -47005
27148 -47005 -91423 -74915 -99043 -59554 -81225 -145760 -121567 -171372 -199706 -111830 -166707 -158428
27136 -158428 -115940 -122316 -138421 -180307 -119962 -59086 -50592 -96477 35955 63315 51010 80471
27124 80471 16606 47167 129887 76235 32778 -21131 43718 85553 34592 16130 72782 -74612
27112 -74612 -120062 -69901 -28492 67898 113754 -10587 -54762 -41354 -81324 -188184 -108251
27101 -108251 -30261 77185 93244 18916 -11932 -36412 -52158 78380 91873 32191 69023
27090 69023 123143 115575 -4580 -144361 -237178 -221271 -110638 -63585 -53676 -56704 -48458 75070
27078 75070 89333 73980 10949 -14661 81074 138557 20472 -101712 -116554 -124679 -137015
27067 -137015 -77375 -68442 -66539 -82672 -155280 -89494 20835 55459 -107850 -208274 -154247
27056 -154247 -54445 55448 48076 1374 62442 95038 21168 -63998 -186927 -235332 -175252
27045 -175252 -102458 -23155 23236 29372 48728 15687 20399 120930 198999 221011 184841 103056
27033 103056 101966 47218 -26226 -79635 -99101 -10441 1264 -14979 53759 121481 14050
27022 14050 -155701 -253149 -148401 -71402 -53731 41020 41473 2758 40018 5340 3742 77381
27010 77381 -13133 -21501 -42689 -71920 -38377 -10473 2272 23700 -68556 -95395 -42162 -99374
26998 -99374 -70318 -146281 -116053 -65544 -55474 -28557 73860 85647 104902 109263 41407 -109680
26986 -109680 -83969 -63766 -73576 -31324 -51995 -63747 -51871 -31518 -31245 -45449 -61018 -93498
26974 -93498 -186311 -150482 21683 95180 77180 164536 98258 136305 52717 -37632 8657
26963 8657 42681 48033 -8907 9220 52700 75666 116149 202173 201626 77305 69223 55243
26951 55243 3765 61626 94266 114266 43135 117200 96993 -8767 -57125 1821 -34559
26940 -34559 101961 168042 34493 -98936 -102423 -9321 -102630 -29831 36276 58125 48634
26929 48634 48793 43939 86585 148160 101357 3334 10453 62337 92080 75624 62717 76308
26917 76308 115540 -16971 -2799 42326 -65100 -76119 1075 18636 -56568 -4703 9710
26906 9710 21981 17041 51371 102723 14054 63772 41638 -47755 14247 -33350 -12402 -25236
26894 -25236 -108789 34748 89788 35832 29512 138356 98282 72091 158599 235660 127163
26883 127163 49796 -3096 3673 66433 25386 1310 1808 14906 19473 55226 28729 -37659
26871 -37659 28133 44529 -63743 -193408 -224554 -148305 -135130 -132479 -80946 -26621 -3960
26860 -3960 -20754 -50046 22320 84932 86140 -15654 -7676 7452 -2843 72271 -31044 -55840
26848 -55840 -65337 -56443 54484 9828 -109521 27496 39014 82819 99121 -18819 -48729
26837 -48729 -63051 -86440 -52259 -40852 17113 10463 -87107 -127098 -127415 -115464 9057 157468
26825 157468 171105 -2397 -37406 -59365 -28847 825 4763 106138 69410 63695 18428
26814 18428 43367 -64839 1233 91848 83801 -40539 -35352 11142 65858 18928 44008 80404
26802 80404 7911 -55265 -33273 -76409 -52540 125408 148874 191048 107893 81648 122475
26791 122475 136906 78280 12651 13344 43550 54709 6293 -34573 -50190 13352 -22819 -43955
26779 -43955 -6984 -79020 -31111 -41234 8907 2021 -132614 -92306 -45656 -33009 -73468 -61229
26767 -61229 -76124 -21014 -29500 71507 -45733 -85551 -83761 -26327 67665 134839 176413 144817
26755 144817 76256 241406 301272 266302 222571 129092 50847 -98516 -98779 -62936 1258
26744 1258 13494 86927 67688 63963 88161 145901 119740 39345 23092 -13677 3944 29243
26732 29243 75147 40307 -39284 -87919 50066 126587 -24599 -75133 -126747 -93340 24245
26721 24245 52197 30730 119132 120586 63316 -19705 -67917 -49086 -119739 -193759 -196811 -195046
26709 -195046 -192462 -91053 -48432 -6431 -58547 -415 22107 -57975 -97354 -80046 34284
26698 34284 100144 138425 109830 -57389 -41178 -20514 -50888 -61772 -109703 -108168 -136130 -32193
26686 -32193 -11372 -101742 -43933 -28894 -142277 -83847 -46438 54858 59453 50039 -31572 -13616
26674 -13616 -37024 5502 -88277 -207818 -119528 -37650 -56724 -105213 -164965 -211545 -219619 2487
26662 2487 2159 68393 127035 84621 116491 126622 49381 24519 86491 3749 -47226 -11784
26650 -11784 33136 -23041 -42498 -105586 -110300 27840 61066 -18365 -101896 -106394 -119610 -157170
26638 -157170 -107942 -37954 36556 60653 93560 42827 -45487 964 191609 173083 55784
26627 55784 -41151 -96912 -14261 -56899 -219968 -198485 15028 33827 -42061 29957 69639
26616 69639 154723 255119 145522 -377 -51789 -3811 -21548 -61195 -135242 -159504 -125178
26605 -125178 -110229 -159109 -212892 -169943 -304 172308 128094 57061 -14328 -64332 -37780
26594 -37780 33163 131400 43726 -47515 69151 116200 25576 9258 110090 109247 28085 35828
26582 35828 76686 59150 24699 23448 45800 116654 3840 -69560 -91236 -123611 -67277 10413
26570 10413 -78539 -151781 -99081 -54887 -151336 -188618 -115636 -18932 72429 148422 67014 3214
26558 3214 -9053 -3740 -40443 -96629 -67876 37708 89663 128864 128211 154962 162147 80350
26546 80350 -72176 -75166 -44939 -149357 -71145 56921 83269 93855 104778 2353 -156604
26535 -156604 -185560 -139691 -44565 -37721 -64116 -104512 -94158 -19747 51849 32702 -11722 20174
26523 20174 22149 -64388 -114096 -33933 169390 155995 66312 122270 110672 112389 80512 164070
26511 164070 163888 51420 118765 178619 105621 92628 59081 25668 115242 156238 163350 37096
26499 37096 -56013 -79912 -49290 -8092 -100113 -117630 -135702 -30965 33120 92535 39855
26488 39855 19786 23836 14545 -16524 -55332 -137982 -144045 -20727 21143 -32297 -40412 -63164
26476 -63164 -159754 -196721 -180789 -197490 -129975 -115479 -184309 -202251 -165769 -129670 -43825 -13070
26464 -13070 -906 -47733 -100561 17537 79637 172001 197061 85571 87397 40267 -1070
26453 -1070 -38295 -82582 -126784 -95383 -109720 -68380 -48139 -54769 -70509 -1782 95090 133717
26441 133717 24933 10428 72106 17423 121368 160141 56991 -29419 -111299 -167017 -124484
26430 -124484 -25603 -48799 -76527 -68012 -35513 34742 23521 62605 -11670 -30649 -22364 -32642
26418 -32642 -4367 -5616 -39437 -84963 -101033 -78515 -137942 -45265 13198 32547 -103622 -247400
26406 -247400 -275173 -137292 -63668 -57238 -61462 -82496 -53383 -132930 -163882 -142947 -109812 -58700
26394 -58700 -99089 -74851 45652 66113 -4795 -47359 -68688 -89430 -96112 -10375 28757 89460
26382 89460 38228 -109544 -39552 -11136 -28636 -47952 -70990 -124778 -109056 -103112 -91381 -94790
26370 -94790 -29676 4640 44531 -39774 -146128 -236828 -248849 -244187 -243807 -243375 -236874 -215802 -147148
26357 -147148 -1436 165497 128811 105554 135919 196396 214602 213966 149274 64762 39873
26346 39873 123574 103044 78981 21310 30782 10730 -169412 -242402 -263221 -222815 -189228 -58699
26334 -58699 16782 78659 -8531 -94378 -60992 -131512 -88697 -34779 -5669 -1795 -81478 -92973
26322 -92973 -46927 -75797 -14102 20347 -58920 -155491 -156466 -116998 -72647 22995 141129 138247
26310 138247 83833 -8945 53021 145151 34434 -93374 -41920 -108814 -184621 -122153 -117306
26299 -117306 -65068 -53207 -136387 -164669 -114497 -72937 -94642 -96383 3370 64211 -62210
26288 -62210 -130779 -50928 -100657 -125094 -177478 -161516 -172038 -230945 -190717 -72273 92950
26277 92950 67831 3451 -54685 11655 82681 81110 86246 -45608 -140633 -115801 -139315 -47787
26265 -47787 54294 1435 -94911 -172132 -158988 -182573 -183218 -136661 -144728 -137003 -127992 -23952
26253 -23952 -25607 -43354 -42953 36562 147449 190125 174871 126331 49481 21841 63548 27837
26241 27837 30213 39426 29333 -10262 -39400 -62000 -105010 -28522 32049 14454 -8499 -56366
26229 -56366 -84665 -41006 64516 -18801 -154225 -124722 -21974 52142 18438 -3922 64644
26218 64644 33999 -34027 -75901 -137385 -102112 -27119 -23523 52966 -43263 -135313 -203162 -134097
26206 -134097 -59325 -57550 87185 167821 163267 150259 170254 41943 -10588 19010 66374
26195 66374 49876 109022 27388 64446 6800 -47270 -28888 -70974 61994 77652 -43589
26184 -43589 -37565 16966 78362 43635 -65559 -35355 -112241 -18497 29852 -44675 -100151 -16960
26172 -16960 6957 73404 99942 232095 190736 28423 -14378 112195 61977 -4240 -25636
26161 -25636 103098 142698 134587 119519 52172 109234 79649 -8560 66359 126410 97368 77570
26149 77570 87045 33428 -28829 -170707 -227219 -112925 -88014 -64897 -127418 -111019 -53783
26138 -53783 -73833 -118982 -117743 -96481 -70170 58097 53274 8637 33528 -33734 -55452 -77820
26126 -77820 -91924 -67632 -23540 43835 83461 172451 320775 287967 221642 85831 82303
26115 82303 3926 -6043 -1402 -37872 -75053 -98040 -114869 -91753 -84505 -237292 -207104 -182651
26103 -182651 -196187 -124085 17214 21709 -64760 -10106 -13337 19008 6067 -16540 1274 19014
26091 19014 12168 2170 -52997 -15900 -24747 15149 115272 62077 -14027 -47367 -73685 -104414
26079 -104414 -180423 -96630 -66369 -98569 -172370 -95222 -38618 -49128 -65581 -24111 5552
26068 5552 -47799 41831 150406 219260 146520 64538 83956 72466 116546 122266 106781 66506
26056 66506 3760 69965 101946 65860 41623 -42864 -10200 -50306 -58613 -127526 -174938 -148320
26044 -148320 -154726 -101399 -158572 -135429 -50624 31682 -35577 -102738 -165452 -122137 -94223 -81593
26032 -81593 -21193 37821 58310 46095 -30443 -44310 40113 39038 28490 -72078 -59414 13370
26020 13370 62459 131775 150184 12191 13805 4212 -42025 -45067 -74923 -175584 -263507 -106397
26008 -106397 -35047 -118389 -112441 3422 -21796 -41574 -72600 35508 82151 62950 67957
25997 67957 -98793 -141266 -111189 -70373 43939 101933 28585 31925 33605 -2741 -109277
25986 -109277 -241320 -256472 -183081 -82297 -73759 -21003 -133093 -210233 -139371 -70234 20276
25975 20276 78044 -32152 -96634 -80095 -83535 -127156 -133756 -235154 -180911 493 -71353
25964 -71353 -219365 -229731 -136979 -159203 -233392 -196418 -92939 -30055 20408 -67634 -36043
25953 -36043 94400 107749 62311 86336 36862 82528 141828 112525 77488 17037 -46884
25942 -46884 -20661 94874 125533 127735 62254 82023 78633 40451 -47251 -76031 -67369 -37209
25930 -37209 35814 85032 28390 -39398 38760 52644 68277 102893 27284 -71500 -84921 -52368
25918 -52368 -20504 -12966 -31654 -50489 15147 64276 136746 100635 1026 -100494 1170
25907 1170 851 -64039 24398 65173 57031 -42536 -67347 11069 103258 109004 88677 -9193 -31111
25894 -31111 -125894 -184087 -76968 -41319 47142 70212 15423 -102731 -23755 -7252 -39693
25883 -39693 7800 22190 -74489 -68992 34558 65928 90494 32489 -20757 38745 67170 -75548
25871 -75548 -181349 -213685 -191848 -140918 -150117 -106355 8918 154048 110286 32603 31061
25860 31061 81791 181503 98839 22546 79307 85403 144701 7014 -130984 -158081 -52254
25849 -52254 84256 118744 -29840 -123665 -33970 -79741 -148803 -152892 -133226 -138390 -127083 -186496
25837 -186496 -171313 -18510 121971 113580 76955 667 -12166 -91835 -70322 32556 15794
25826 15794 50499 37357 277 33096 158915 233002 186666 149784 68447 47836 58843
25815 58843 46600 68493 58459 4168 -85575 -148294 -155894 -127021 -45786 9834 -48641 -82624
25803 -82624 -63997 -61446 -42661 -144078 -77968 -34072 -64130 -60680 -122630 -93938 -14006 -91543
25791 -91543 -105577 -28334 33183 98428 -4528 -71901 -121824 -129939 -128149 -11669 -48304 -189383
25779 -189383 -201341 -227585 -212114 -102359 -145734 -94888 -37035 -46645 -169724 -174519 -90754
25768 -90754 -56072 -19606 -37800 -41148 -57220 -161946 -34649 36587 -9956 -61403 -80071
25757 -80071 -34003 -28657 -113132 -131653 -28707 4120 23293 60998 108083 74719 56091 5717
25745 5717 -59834 -74930 -160991 -124634 -151705 -117660 -50792 11902 11624 -11152 15280 37489
25733 37489 127754 80980 65683 13150 48067 113765 112646 28949 -20115 -75695 -60797 -114208
25721 -114208 -126431 -67019 -51123 35396 161693 126187 74337 105514 44602 28565 12755
25710 12755 161667 202602 109629 25889 11683 -148342 -173486 -85391 -97417 -97117 -105538 -53400
25698 -53400 63681 11598 22876 134 -33195 -182446 -224719 -227840 -115913 21864 106185
25687 106185 65047 35131 19855 -87510 -152706 -68793 -803 -21494 -56582 18313 89105
25676 89105 98324 101672 127435 47871 -47587 -80774 -82106 -85103 -86503 -81784 51507 65609 -13450
25663 -13450 16973 77999 59182 64296 -102973 -236132 -163934 -186931 -252180 -243348 -171121 -90394
25651 -90394 33591 81990 108199 106695 140666 2803 -26725 2139 -36816 -62115 -104126
25640 -104126 49578 82887 28803 41377 62038 126940 56889 -44583 48533 112616 166587
25629 166587 91911 34572 6527 60508 97008 -1909 -25225 -15942 53039 43574 -29563 71765
25617 71765 106420 143012 112622 82132 40270 123652 97204 36601 13364 -39928 -54310 30700
25605 30700 18758 116787 149763 169390 281660 178816 77813 148513 106871 99947 19747
25594 19747 -108857 -129418 -19397 -18552 -45140 -81546 -96677 -133076 -70872 57969 62072 72805
25582 72805 -15536 707 -65733 -125503 -127467 -63666 -5479 -54229 -30888 -71387 -79867 -104061
25570 -104061 -105611 -162459 -139589 -58246 -48697 63702 14382 -43775 -17807 -30097 -56696 14432
25558 14432 48203 -58044 -94935 -55257 -70997 15173 41456 12405 57074 100331 160082
25547 160082 172612 145926 93831 53342 60356 29303 2982 34613 37403 101884 160468 168331
25535 168331 92175 21663 -135309 -111202 32799 51631 15786 -17254 -119893 -90650 -74538
25524 -74538 -4669 -17723 -35831 -107963 -65810 -67661 -42494 -47122 -69102 -176944 -142200 -100494
25512 -100494 -22171 9751 79212 104402 138484 96092 43432 -8857 -44506 -67893 -59547 42785
25500 42785 40386 -41871 27892 57377 82821 51379 -4049 -75192 -122750 -23685 -6249 39386
25488 39386 -17801 -9360 129841 123922 15660 -110034 -83228 -98157 -44716 30530 140845
25477 140845 136901 84499 56756 85650 68170 52737 32429 -22471 23709 -46042 -109710 -72579
25465 -72579 -38609 -79937 -112899 -74730 21911 66013 -20074 -61910 -22400 -33588 -152534
25454 -152534 -141855 -90470 -21523 71810 77252 -14736 10660 19856 -24612 -94325 -31109 -7932
25442 -7932 28863 36316 61839 82908 37577 98693 31072 11751 5235 66127 9835 13177
25430 13177 60993 40855 35841 69819 30979 -114519 -180413 -27986 88405 22642 -57167
25419 -57167 -24465 -40740 19234 68877 52265 -14882 -175978 -141455 -78017 -182008 -187581
25408 -187581 -111798 -45604 17400 -31875 -47451 -79926 -153595 -194215 -180936 -135478 -84669
25397 -84669 -85980 -139647 -98759 -9074 127263 45735 14670 61757 91422 66193 26686 33940
25385 33940 42893 142749 78295 83851 133921 95082 140680 90740 -4975 -44538 -110757 -309933
25373 -309933 -324343 -181013 -63 27420 60852 71146 38571 59745 63498 70902 29025
25362 29025 -10083 49814 10637 -84407 -100078 67263 132513 96631 38093 -73202 -142491
25351 -142491 -53659 35791 61797 92264 49126 56280 18091 -27527 10496 -125732 -205349
25340 -205349 -121396 -96227 25623 93411 46550 43682 61688 6541 -43250 -123751 -102002
25329 -102002 -22337 131717 259539 275202 169570 141822 67088 38720 -47768 119206 194382
25318 194382 85672 66058 123955 184328 148287 86373 69104 4782 -1750 -30383 -21367 -51507
25306 -51507 -32590 23018 45881 41226 13943 -30319 11821 10941 3535 126252 34387 -9885
25294 -9885 95399 123310 143245 73562 24455 -46988 -36167 -81007 -76566 7191 45393 37950
25282 37950 75760 91437 27968 15393 3960 -27510 -84341 -75154 -165845 -235322 -205156 -125296
25270 -125296 -116949 -144906 -40297 63295 58990 41504 49196 -17577 -60698 -378 42738 79096
25258 79096 -1059 -24468 57078 30542 125020 63692 72058 94691 90989 25666 -46459 -20894
25246 -20894 -28022 -49247 -39844 -24571 -15288 -16158 -68062 -189535 -210686 -196722 -231465 -134921
25234 -134921 -157478 -107472 -107680 -94448 -117859 -38983 32436 73164 28053 42361 145030 132661
25222 132661 139504 -30628 -163947 -178395 -176023 -148020 -112952 -128091 -117615 -11994 107789
25211 107789 123281 141767 22462 15693 -26588 -40802 -113685 -146718 -120805 7361 58912
25200 58912 98847 85872 166337 187204 141142 96467 -10906 -71153 -131628 -187233 -138657
25189 -138657 -60811 36806 128203 82619 27440 43699 -13385 18504 71579 4155 -119991
25178 -119991 -161812 -110301 -109129 -138213 -139487 -51594 -5083 16729 42176 73013 9195 -108706
25166 -108706 -95795 -160583 -145129 -57130 -23136 -59076 -36605 26759 73225 30944 -73317
25155 -73317 15418 102397 155715 14012 -44666 -17968 -124529 -217588 -156347 -154852 -162597 -94250
25143 -94250 -89303 -29127 1850 -125384 -75172 -83179 -61770 8905 8598 -37243 -63100 -89552
25131 -89552 -168679 -261584 -240601 -173945 -70452 -33189 -142003 -141893 -150028 -158288 -120563 -35737
25119 -35737 -67576 -105203 -29861 -32379 -33631 39928 -2833 -62569 47576 139410 70347 33009
25107 33009 -6947 3584 73081 60401 89400 154465 66921 40166 41621 30458 13576 -12701
25095 -12701 3960 27276 -91294 -107457 -14538 -76851 -99392 49054 56316 -77713 -197092
25084 -197092 -125616 16266 90753 63390 30301 -29481 -34250 -38004 -55760 -9174 97881
25073 97881 159271 181626 43356 -4521 -21653 40006 183632 188365 49606 -124287 -79751
25062 -79751 -22267 -28103 -73836 -130473 -127883 -1671 62693 125157 132150 141086 207037 242887
25050 242887 123615 -17087 -19272 33149 -30059 1910 68377 16037 -9281 55990 99581
25039 99581 83412 62120 87095 18403 -68129 -68328 6748 -45979 -140178 -81112 23012 3112
25027 3112 -68672 4514 16439 -46561 -31428 -17863 9254 75812 -19854 -28567 -53800 33719
25015 33719 42157 13567 -30984 -13092 -44268 -45071 -20965 21326 -30807 -42894 57853 153150
25003 153150 210993 42822 -23808 -25955 -67180 -157063 -121147 -77844 -17488 -62490 -148916
24992 -148916 -51274 -7991 17039 -36995 -15333 -29097 10616 19117 69344 154569 107177 134433
24980 134433 140841 80142 13906 -57926 -4797 40457 72773 113753 8668 -133314 -183199
24969 -183199 -164415 -262183 -278197 -230140 -162461 -135010 -141016 -26870 -10191 -22133 -53750
24958 -53750 -79407 -20630 12959 -2403 -18241 -18166 54755 -4518 -15395 39255 29332 41674
24946 41674 38301 46223 36059 -51089 -42855 -54315 -93389 -8922 95199 178897 173125 30300
24934 30300 -94046 -132556 -26523 -345 -4641 79995 86071 5148 -19660 -73529 -86640 -16400
24922 -16400 32184 11229 -15360 24623 124062 126698 69352 -37857 -102006 -135557 -138094 -83505
24910 -83505 -128233 -196906 -135048 -16616 3044 19507 37369 32232 23754 3876 -47869 7658
24898 7658 103152 94066 73315 59998 53157 -29659 -72790 -93723 -84798 -56537 -7116 -37088
24886 -37088 -27547 -65360 -88259 -9415 23258 65577 83811 127144 101252 71052 48078 31656
24874 31656 -18422 -85615 -108502 -102338 -56412 49251 28055 -45567 -19168 -6257 -103505 -80417
24862 -80417 72257 98084 166456 136579 76321 13987 29174 -63733 -81352 -169846 -206445
24851 -206445 -161332 -24107 38937 -33152 -1469 -66852 -104541 -57590 -108085 -134431 -130224
24840 -130224 -118964 -98643 -102645 -87770 -346 69505 118402 146108 150426 209320 257478 196861
24828 196861 109989 65075 10377 90354 253724 239184 131212 105839 48148 -5705 -8997
24817 -8997 68740 90357 158883 166098 222915 255709 173633 33020 -104799 -47852 -2877 1695
24805 1695 88839 181564 224303 203934 100984 102116 108914 67710 -7421 -70921 -88908 -25099
24793 -25099 -35406 -11366 -54120 -81695 -18328 -27090 -45713 72617 33584 28469 66148 91499
24781 91499 104341 103176 34150 62499 77897 180855 197943 180304 136138 112460 158885 230552
24769 230552 149206 15995 -26259 4241 -5225 -109313 -104052 4455 18096 -42731 -38510
24758 -38510 31676 10009 17698 -3131 2188 30760 8323 -41759 -25578 233 -84888 -62583
24746 -62583 -49245 -63429 13396 -43697 -110747 40473 103920 69715 9546 -17141 949
24735 949 -18343 -38626 -18855 7874 73511 74152 78475 114521 80922 -12624 -104620 -171448 -67266
24722 -67266 -136930 -271081 -251069 -151682 -87811 -25811 19750 -38205 -100990 -76102 -56287
24711 -56287 55825 14852 -62918 3017 61153 89384 102216 53012 15375 57167 19048
24700 19048 -73763 -45913 -62123 -108801 -157738 -120466 -38540 79252 90918 58872 86635
24689 86635 239055 230818 126177 -7703 -16039 22137 -75819 -61803 -27230 6256 71884
24678 71884 111050 145567 235387 167934 82074 16158 10959 127538 119828 168584 95005 17569
24666 17569 4012 12689 11169 27907 -58758 3266 -21791 -63785 34906 54404 90412 64598
24654 64598 -29473 -23947 -1990 35636 55882 71529 81655 94935 59921 -54654 -43443 14499
24642 14499 -80019 -45687 42003 62190 127130 123120 38683 3587 24876 15338 -51849 -157352
24630 -157352 -128093 -49768 62244 13922 -45516 -77809 -181497 -183535 -114989 -63755 -91546
24619 -91546 -137127 -186127 -240082 -289518 -256350 -203030 -183185 -134617 -10202 41435 142993
24608 142993 40648 -2184 40497 37360 -119009 -175986 -144671 -54813 -26986 -38777 -91576
24597 -91576 -108663 -119932 -113713 -86289 -68926 -69499 -45605 52438 94283 50964 80999 156504
24585 156504 31062 -37247 -23448 -45970 -92857 -52428 34019 69841 47973 84048 44415
24574 44415 4796 -92228 -94530 -451 74281 5510 27307 110726 115058 41378 -45198 69234
24562 69234 70421 95541 69086 68660 27817 -34787 -88044 -46993 -34579 -16194 -30686 24257
24550 24257 26937 -61020 -141960 -190332 -94332 14361 -25787 -81284 -118998 -36112 12251 9930
24538 9930 -120659 -172334 -155256 -114933 -86745 -82963 -38014 -50815 -24101 -1336 -17530 28736
24526 28736 81211 30645 -36577 -111186 -65122 97323 236509 111411 57790 75965 62600
24515 62600 49590 -22678 -5398 -28891 -40126 -34169 -99911 4304 -18161 87613 96122 2356
24503 2356 -138072 -80089 78435 122511 51804 -22211 60583 182609 140871 42512 14131
24492 14131 -20085 -50205 -93721 -120611 38242 138732 80217 37403 8779 45830 102110
24481 102110 154316 129237 39161 19163 54524 60378 17187 -38014 -66964 -87065 -72721 22503
24469 22503 107439 83848 65551 97522 78641 154301 94432 51770 116984 135260 36536 -75365
24457 -75365 -1211 31470 -32139 1618 -22062 -108522 -186556 -255272 -247393 -202799 -140527 -147345
24445 -147345 -201138 -167595 -191447 -122146 -109293 -70166 -79026 -182594 -248551 -147956 -55722
24434 -55722 5800 -6543 5963 69567 86796 128069 61777 -32597 -74535 -69378 -88450 -81238
24422 -81238 -125364 -36969 45660 1240 -52620 -54176 -5803 18177 67920 56053 73276 93503
24410 93503 93885 -20517 -80529 -46663 -80014 -90730 -44218 -158544 -147393 -23343 -38269
24399 -38269 29296 5635 -105785 -65741 -63964 -50348 -114722 -158412 -68541 -1544 -17376 33908
24387 33908 109867 142767 48186 116159 164864 249460 252811 189946 75996 23316 31768 31659
24375 31659 73524 44300 -25982 -70069 -47712 -31231 70000 145636 106994 13869 101139
24364 101139 221459 213564 77769 -71809 -33491 51383 14209 25519 7811 -39434 -85447
24353 -85447 -77508 -126552 -67508 12760 59976 58666 41262 13207 55970 78382 102738 112904
24341 112904 79573 7328 -15588 -85432 -139285 -84628 57280 63668 43179 -38303 -101660
24330 -101660 -121923 -95687 -99403 -103592 -76199 -99636 -79424 -38040 -45428 -15587 10450 -110340
24318 -110340 -99963 -92486 -113997 -192929 -242983 -194677 -86902 -2721 64156 44845 89442
24307 89442 110393 81761 -27026 -24943 23954 -42696 -46351 -9745 53017 116871 182975 209041
24295 209041 229822 148162 36115 13848 -18615 -73813 -8014 7233 -39164 -54339 42911
24284 42911 91267 57590 -35005 48189 196345 198422 41744 -92830 -90831 -144618 -175088
24273 -175088 -136098 -60209 -81354 -19849 78725 120085 28761 -80180 -80327 -150560 -143658 -84229
24261 -84229 -87777 26302 27122 114820 12707 35637 -9813 28484 117059 41100 -51049 -5761
24249 -5761 13397 114626 95118 49084 131257 178773 57077 28189 69455 94241 46981
24238 46981 25621 38468 -8075 -20662 52282 50633 15978 29620 119809 158857 69540 16145
24226 16145 -68844 -24144 39615 -45258 -105366 -135725 -125413 -109910 -13806 72753 72440 105849
24214 105849 140123 -20426 -75347 22993 93558 43262 83955 58004 -28990 -21911 82807
24203 82807 187523 153639 -33000 -137894 -69702 4057 72730 153013 116374 56137 37018
24192 37018 71532 45549 -15381 44625 35967 -92747 -158431 -189958 -206474 -238984 -197691 -28965
24180 -28965 26713 -13052 100955 175822 81658 72366 69414 63576 19935 -14691 -38166 12847
24168 12847 86885 154011 81036 66493 105873 75794 44785 65624 42292 64640 63447 2550
24156 2550 35484 -9390 -107541 -80293 -14826 34069 39163 45048 -14508 -67937 86342 172850
24144 172850 60983 14804 33822 86280 155876 122414 112698 77785 -18517 -44295 -32918
24133 -32918 -4215 22300 -51277 -87994 -84964 -106819 -210631 -181255 -184749 -178362 -44998 -11101
24121 -11101 30851 57307 13968 -18705 -43997 -70469 -139553 -119111 -78737 -11529 37446 73424
24109 73424 61042 32000 -103863 -179967 -33942 128303 119965 100437 52830 -13823 -139638
24098 -139638 -93259 54745 61416 27172 -22186 26804 32054 -76522 -65715 3227 -53455
24087 -53455 -7007 70865 186213 170641 72650 38713 36879 -105480 -120507 -75092 -137065
24076 -137065 -186080 -114915 -50498 -44851 -41473 -4360 19890 10507 53061 115197 82809 12637
24064 12637 629 80220 126674 43311 -22539 -25646 14955 17914 47830 77888 174672 195546
24052 195546 139515 110032 121131 98088 116149 96247 87794 22383 78816 223861 277375
24041 277375 192226 99918 90319 24882 -63019 -84386 -259 102775 123125 89201 -15961
24030 -15961 -489 -33174 -37685 -28737 -116367 -103013 -855 50014 98056 170873 207171 157437
24018 157437 120287 -32249 -49862 90788 54821 90481 92462 46255 -29020 -101269 -44125
24007 -44125 -33499 1181 73779 133009 187041 147075 169595 153873 221193 246009 169088 110224
23995 110224 93100 128499 125020 122588 191677 149227 42229 84977 143885 196714 92833
23984 92833 33879 84734 30820 28475 129411 93226 5296 18289 -77903 -124069 -40826 -57325
23972 -57325 27028 78295 70405 -70175 36678 108214 155539 87565 37135 37268 61277 115740
23960 115740 140699 106823 181696 238355 239317 179605 72253 94969 49451 150358 110311
23949 110311 108057 43743 -31732 37767 130621 44854 131437 183929 102687 -22254 -103047
23938 -103047 -63297 -20110 77847 -30489 37867 52232 -14798 -137129 -159774 28397 100115
23927 100115 150970 124348 134177 137470 134815 159735 111296 15897 8487 48057 21166 -49964
23915 -49964 -116106 25563 53185 32254 193720 234574 137399 69911 159096 183137 77254
23904 77254 18878 -54447 -94592 -84023 -62229 6178 -74253 -139721 -147349 -45115 -14726 -154909
23892 -154909 -67073 39675 113407 115947 198841 173869 -41872 -164541 -207294 -138083 -65067
23881 -65067 -88349 -53758 -44126 -57425 -114293 -11134 82759 33665 98911 65901 -55836
23870 -55836 -116047 -30781 71898 -50600 -150335 -64693 52297 50688 114336 163023 87665
23859 87665 3352 5990 40557 11771 37095 97215 123908 189728 215163 132435 32998 104941
23847 104941 67483 -11894 995 -12419 81314 97404 135627 149367 46838 -123161 -69960
23836 -69960 -99299 -167578 -184972 -218638 -139839 -68464 23298 55486 61233 78374 12479 14459
23824 14459 2186 -97191 -129242 -34048 -21246 -67174 -76660 -146955 -48003 67152 117806 89253
23812 89253 37610 -45483 -130197 -25131 37832 -38028 -140782 -61284 7381 -17763 -82986
23801 -82986 8300 17003 55529 17715 20883 38696 105006 61888 -68564 -44235 -35110 -10375
23789 -10375 -44845 -2061 933 -38038 -52076 -93032 -13659 22951 -8396 25305 40240 52090
23777 52090 70892 106706 89907 77245 68602 48281 -85994 -4130 80736 80929 45244 70524
23765 70524 9805 2336 -51551 -53666 39403 79705 81006 48642 37394 -25375 -16059 -56866
23753 -56866 -66259 -22557 9887 -26586 -4324 62157 84273 193049 191467 179672 255988 273649
23741 273649 225444 185131 169406 110551 104207 106383 148286 190176 106306 24317 12863 53682
23729 53682 -21596 -89306 21084 138136 168164 5980 -15465 37534 -25209 57036 72301
23718 72301 41634 29974 46954 90458 38589 79369 128495 172018 99151 125647 23553
23707 23553 72606 92299 15752 -50390 -115249 -103784 64023 93191 55066 105733 58621
23696 58621 10767 24413 67578 84452 28732 72363 101066 926 -36641 -7479 -43873
23685 -43873 25894 77717 74551 157802 208990 185005 121582 71395 31119 16278 135228 73783
23673 73783 14407 24600 35569 28540 -20634 -42671 -44388 -48935 -75891 26187 90843 43183
23661 43183 -40819 -96215 -55040 88682 66436 28532 2651 -148427 -211374 -197272 -158656
23650 -158656 -105447 -71647 -47268 -9736 -36426 -81775 -96673 -29955 -3334 108438 181564
23639 181564 49670 -144310 -150338 -86134 6376 60450 72670 54359 52688 50084 67827 118054
23627 118054 152401 72874 19215 78952 122986 36017 59816 153356 194968 153607 105082
23616 105082 77534 -31585 -45159 63755 181465 168424 93567 125270 167613 19135 -52304
23605 -52304 25588 122484 106449 79963 79199 109616 161542 75919 -4029 -86330 -1135 89676
23593 89676 105444 28520 26483 12064 -87356 -73426 -46184 -15047 63041 128302 184163 203526
23581 203526 137070 45238 -18789 -4383 96878 67106 -28598 -18981 91861 155248 225909
23570 225909 192164 120996 70409 32024 -19784 -62180 -34120 -50543 -56036 -60500 -101746 -3614
23558 -3614 62317 71009 63054 -50375 -53180 -5751 123747 219017 140174 137899 119147 97124
23546 97124 91766 43895 47634 80122 145286 106079 55971 128122 187741 90108 9779 5401
23534 5401 62909 58985 4946 96776 176192 152764 125620 188121 307111 217726 156596 175015
23522 175015 187191 118812 89775 90534 207421 180192 92656 101928 182431 219798 186134 140820
23510 140820 100088 119568 22173 34776 42171 119338 118901 8521 31541 32052 72375 115340
23498 115340 184558 309031 244654 151016 190205 209969 129159 109906 92117 6548 669
23487 669 16324 33386 -77338 -47864 44173 62451 58483 16080 26877 -13859 -27997 -16674
23475 -16674 79690 109216 137410 127749 152833 113106 75405 3673 -111410 -31596 121475
23464 121475 63625 32289 24888 -68830 -125318 -10 22246 34032 166548 228910 174630
23453 174630 68441 -1940 6028 -735 -75698 -258 56652 77663 131218 144066 82942 -27600
23441 -27600 -73825 -5365 34067 -5466 47651 236750 252667 162215 54013 54363 6389 -31923
23429 -31923 5689 35761 79543 26512 70898 119711 110288 103888 47669 1401 83141 89985
23417 89985 81655 11802 -63667 13040 73746 69504 -23585 -56917 -30496 44758 20470 90922
23405 90922 10626 -6877 737 6399 73995 197330 164212 138562 124530 61010 67174 54407
23393 54407 40809 -41350 -38248 25027 29817 98389 158545 150698 110925 158982 192036 95878
23381 95878 30046 -10140 -29731 -54452 -58660 -1147 37964 -49703 -91763 -81716 48236 30047
23369 30047 172181 222112 173512 120083 118920 110554 73236 78414 136229 239408 274587 261508
23357 261508 248677 321809 330455 106172 49312 107304 54125 50253 -20943 28947 -4362 17628
23345 17628 49620 55018 -58550 -45638 23565 -23133 49773 31450 -63036 -136225 -158241 -96796
23333 -96796 -12613 156457 230730 186551 166712 114214 198140 215493 252612 161205 142145
23322 142145 123513 131039 144259 158968 206696 209600 210927 186718 94250 72498 52716 6149
23310 6149 84172 37386 -44424 -30326 68180 95851 94769 -29336 -38223 -11775 -57783 67097
23298 67097 180003 139639 107215 16018 -1600 -38928 90206 194794 165760 180958 134606
23287 134606 103103 -17 108647 181290 169688 136708 211180 210704 163707 130166 38886
23276 38886 46244 101201 130991 141795 91866 99092 88194 63272 -1350 93058 103388 31308
23264 31308 120302 113491 169240 224832 154886 57082 26141 77957 58577 65002 160451 215332
23252 215332 265907 227876 73329 56230 77864 21967 94752 190278 193775 143235 78286
23241 78286 29138 -25129 -53743 -16201 110577 105437 57045 4372 16346 98847 113508 25234
23229 25234 43632 136037 133799 76814 17017 46519 130412 150456 145363 39443 -111874 32019
23217 32019 124316 107551 189239 216723 129239 85040 45547 53583 55753 103309 81103 111849
23205 111849 119230 151142 52454 15492 -10082 158034 234525 164440 147748 162662 184818
23194 184818 208721 54154 88766 183610 135343 151264 106194 48474 90089 189964 202023
23183 202023 146989 135890 250913 297915 272824 290415 223220 142299 59497 10449 39394
23172 39394 123403 209997 218337 276175 309451 224164 185881 155326 123675 97840 57752 44288
23160 44288 145919 259438 175784 249217 300108 286038 232028 207857 292203 351360 300865
23149 300865 294808 286140 315927 262234 183995 139904 223643 285635 343001 312521 271795 287159
23137 287159 218890 198534 266275 281321 213496 229137 335241 318470 258158 293536 315930
23126 315930 296610 260091 221927 258691 289813 226334 145867 100017 49817 75478 92405
23115 92405 14509 72387 123252 166401 176990 148890 74406 79018 91076 130827 268034 378707
23103 378707 300993 229915 250153 341530 371517 319663 226450 114895 209419 332458 366321
23092 366321 389887 364840 341795 409536 458006 459865 342606 321883 293153 277899 355781
23081 355781 543907 551656 420894 480702 653489 814467 901670 895779 930225 1064821 1132548
23070 1132548 1190746 1261210 1377096 1484053 1590822 1655791 1692413 1688829 1642062 1552041 1545603
23059 1545603 1501127 1369507 1299474 1270297 1165017 1118247 1064877 914872 830445 723095
23049 723095 636723 645030 650803 571463 646249 609879 469682 377085 368608 433464 535908 615470
23037 615470 540514 414965 378920 403503 288427 323208 335426 318295 296191 210055 190442
23026 190442 260567 260489 216096 222642 341307 416871 406928 431865 377215 223373 157276 221801
23014 221801 219552 223152 218669 288701 239040 188247 215230 209554 153651 212330 244757 275439
23002 275439 272752 266283 307751 333740 184515 170383 136692 132053 182994 259489 345477 361934
22990 361934 299703 213470 135218 189849 177764 130004 142503 108583 46619 136529 253167
22979 253167 333832 279559 216390 102659 170459 200495 282267 401746 360589 336802 330140
22968 330140 315663 297820 360835 320572 331658 349224 329891 417912 374242 318058 319452 358752
22956 358752 387465 384089 383443 405365 401714 321499 359256 367474 413677 433855 481215 597235
22944 597235 543318 359665 325138 205008 161019 237023 318902 286669 140448 145602 213699
22933 213699 330744 309873 262674 311403 348036 376536 334567 234311 207627 299569 313770
22922 313770 150706 6556 76586 99274 144834 126008 181703 284349 313968 416318 436302
22911 436302 358873 289821 322315 415783 331814 197000 184598 197235 148770 225035 288603
22900 288603 347871 389942 402190 379547 389727 376357 288304 260520 286844 307264 391221
22889 391221 365103 484219 488550 437270 347589 388538 460406 482777 395044 546939 579353
22878 579353 394665 277055 179544 240242 349055 519116 586392 522453 475787 529778 656275
22867 656275 775363 718053 634560 629751 657460 687749 657266 562682 421412 362630 336802
22856 336802 326780 319659 464787 608206 697062 617081 539382 456905 435226 404254 418381
22845 418381 510399 680719 759631 711459 708742 636123 553721 692836 746177 660369 640670
22834 640670 595200 633577 658161 704592 702318 588178 439027 405867 366664 358838 373821
22823 373821 480483 463034 437102 367072 296605 265521 335109 358647 385903 394628 365704
22812 365704 382297 405990 449541 609356 658897 610491 618029 632431 652933 636484 575747
22801 575747 576222 606628 530804 455965 518602 638466 670278 744129 640452 509613 541908
22790 541908 577006 514688 559308 616848 638991 534241 409274 486656 538453 594534 611544
22779 611544 573103 678413 658269 620521 703495 690238 772267 731182 670475 721616 788216
22768 788216 751433 722089 643521 587866 658742 621135 624154 728235 754021 758407 650224
22757 650224 600377 700025 802588 694406 679395 796852 823272 876699 852771 760471 829140
22746 829140 948840 1032610 985589 876428 816387 811682 873875 910639 875741 859916 777004
22735 777004 765345 880957 918939 909359 958542 870262 881138 918156 931354 910727 864095
22724 864095 818106 856063 929590 980604 1002051 974741 921734 941022 999732 1043796 1037616 1025779
22712 1025779 1127037 1100305 1017043 991466 1169354 1176898 1095542 1036823 1100660 1063675 1123063
22701 1123063 1170873 1204891 1179523 1131276 1189963 1284575 1250490 1218085 1156369 1101321 1106485
22690 1106485 1164247 1236270 1232500 1280415 1270877 1193414 1152420 1147615 1182576 1136753 1008355 965698
22678 965698 956216 1038116 1030398 1148712 1279114 1294473 1436181 1458593 1359626 1359479 1323464 1368600
22666 1368600 1466882 1478217 1580424 1584989 1519711 1444013 1344986 1302868 1383334 1430468 1506272
22655 1506272 1642176 1688784 1660224 1557524 1505554 1524540 1554223 1688767 1794467 1845436
22645 1845436 1894006 1882375 1816949 1747470 1844903 1918623 1997116 2021518 1940938 1967804 2088222
22634 2088222 2147105 2152895 2117828 2193746 2288039 2348659 2385093 2310098 2344195 2381094 2457340
22623 2457340 2603973 2556891 2449263 2462473 2503540 2446298 2412261 2391699 2367910 2407396 2426665
22612 2426665 2455446 2494908 2480261 2493439 2597975 2592421 2601105 2655945 2735144 2732757 2785005 2843218
22600 2843218 2886538 2934190 2944952 2952425 2938720 2943756 3045466 3242787 3377925 3426058 3411728
22589 3411728 3438095 3439625 3520726 3607418 3747620 3904280 3954182 4048514 4040807 4002463 4108396
22578 4108396 4241719 4318667 4455557 4689247 4863036 4882251 4892227 4983766 5098606 5282740
22568 5282740 5464747 5696361 5888736 6143256 6282049 6411393 6644342 6926913 7153822
22559 7153822 7326595 7526702 7610719 7632741 7849294 8139801 8337042 8397849 8446401 8563042
22549 8563042 8745464 8874728 9052803 9205228 9343542 9432387 9646803 9860214 10049139 10229698
22539 10229698 10547121 10887615 11260395 11681372 12067627 12437249 12841060 13241822 13628846
22530 13628846 14114944 14547005 15147641 15708672 16359011 17141326 17892544 18602943 19430326
22521 19430326 20310035 21255974 22378621 23457669 24435040 25615932 27006044 28564928
22513 28564928 30137592 31777877 33635362 35676953 37848874 40173015 42865704 45913577
22505 45913577 49320714 53034646 57146768 61766003 66984541 72725493 79108894 86324907
22497 86324907 94415771 103515513 113679957 124945471 137323407 150855247 165667581
22490 165667581 181391258 197748373 214419363 230622003 245561118 258342899 268241049
22483 268241049 274508853 276683795 274642235 268642286 259060828 246382161 231457373 215043230
22475 215043230 198028227 181100961 164678402 149350922 135356274 122576327 111074733
22468 111074733 100830931 91618384 83425743 76114618 69542133 63670730 58534915 53966379
22460 53966379 49819629 46137722 42803405 39769228 36916966 34426108 32220389 30105575
22452 30105575 28212660 26530092 24985705 23435247 21949539 20775445 19736545 18733686
22444 18733686 17818998 17000489 16151722 15364669 14652741 14032075 13564976 13088265 12606197
22435 12606197 12168338 11613488 11078564 10589111 10179194 9699874 9365701 9125964 8945690
22426 8945690 8706646 8375941 8102471 7894553 7696726 7546338 7474220 7326927 7186366 6964316
22416 6964316 6770195 6566964 6361224 6315826 6340266 6222141 6079579 6038442 6027365 5989910
22406 5989910 5885601 5707490 5603170 5540461 5480103 5299744 5081079 4867462 4704890 4469186
22396 4469186 4248505 4126091 3989680 3739317 3536812 3407639 3319357 3258394 3194164 3053407
22386 3053407 2925042 2859751 2849730 2725261 2823482 2725776 2789660 2800181 2666032 2512766
22376 2512766 2445120 2432984 2404160 2344692 2273546 2252625 2277679 2270069 2188329 2115470 1982362
22365 1982362 1941420 1852113 1818139 1824030 1791936 1919871 1948426 1822399 1785715 1684068 1589872
22354 1589872 1659107 1648366 1671481 1617288 1528216 1418890 1415852 1392394 1197914 1115228 1212851
22343 1212851 1188471 1099457 1059930 987283 880387 877426 903826 870669 893473 932948 891476
22332 891476 806666 829613 857858 925329 932991 884885 728940 623218 558603 625542 711782
22321 711782 681542 575674 559731 570349 637299 538383 484988 459165 556031 542472 589384
22310 589384 661453 513283 509906 486887 502664 453714 437020 353501 315072 328720 265975
22299 265975 462139 537609 509609 505978 413781 403208 535383 586134 613553 604097 473858
22288 473858 427514 467040 489909 414967 301976 295652 309960 339439 330782 375835 404829 390042
22276 390042 352995 299022 383153 387183 294585 142176 98613 97799 146666 166085 159606 219771
22264 219771 249735 205858 219062 271041 274586 293982 228719 144307 88389 197431 156671
22253 156671 70587 169311 206928 241000 387734 513522 462055 471903 473097 426718 427700 442858
22241 442858 300250 231741 241168 397879 400647 366210 391684 449580 373602 265725 196732
22230 196732 229210 246171 217053 148678 76983 47114 116954 126613 184810 250372 267836 320034
22218 320034 296635 270238 330142 312794 221958 132161 142376 166658 145148 123319 71692
22207 71692 81836 111924 127197 87512 -23939 20064 44326 115542 92614 75596 176499
22196 176499 174412 92876 70544 41163 148707 149695 65805 159722 289530 244114 108702
22185 108702 128343 193748 105739 29861 -5722 115154 218780 207227 91001 91771 73327
22174 73327 65340 9871 23417 75588 91115 176069 240481 212766 237788 292610 375160 350569
22162 350569 300978 214876 265175 222253 54128 -88312 -37033 174948 252998 213874 180031
22151 180031 64635 -15646 -13107 46767 58297 16580 -327 21344 1950 46203 -26610
22140 -26610 -15944 -68245 -81961 -89924 -56473 -3861 16725 5521 -87876 -53975 -57110 -193227
22128 -193227 -234600 -74379 -32472 -147764 -164340 -125061 -67353 -66552 -37558 -43990 -120054 -148529
22116 -148529 -113791 -53528 9351 140940 146579 92763 -55428 -123525 -58287 71399 170552
22105 170552 189583 69586 -7911 -115314 -214805 -178175 -49801 -37948 52 25628 -15926
22094 -15926 -45355 29978 154202 131490 82939 69838 45214 80441 -12917 29792 83557
22083 83557 120598 102608 94734 44765 56420 103788 47516 -20683 -10760 58274 7745 -3340
22071 -3340 932 -45920 -114647 -115264 -70339 -5877 -2693 48846 37782 -83085 -26353 86824
22059 86824 91939 -12304 -44818 -114604 -28163 78873 91891 115771 120661 51077 -25524 -25183
22047 -25183 13 -44666 -137992 -78961 2003 -116652 -167868 -100089 -11855 41736 77560
22036 77560 138312 95594 -42255 -88721 -42236 19215 -70494 -179379 -241861 -186117 -71212
22025 -71212 -7122 -16950 -81385 -12157 -13919 -51186 -15232 49114 111687 97056 42666 58566
22013 58566 58838 6855 632 -89603 19473 101444 33908 3477 97446 126818 30955 -62709
22001 -62709 -215268 -217557 -95042 -67775 -103709 -160968 -217876 -79505 19318 -100878 -265903
21990 -265903 -217564 -119790 -50659 -13940 -19055 -120823 -106734 51619 171730 151326 39178
21979 39178 -27024 114377 166519 94458 67604 216935 225884 188656 159780 94109 13424
21968 13424 -82198 -72416 -90822 -113558 -81176 29539 79665 -5606 50709 121927 185435 114721
21956 114721 -75412 -104650 -4519 21773 -66843 -48910 -45803 -93325 -86908 -62252 -27354
21945 -27354 -2390 88459 126597 86364 87153 100012 96172 88724 125403 51248 26113 -117107
21933 -117107 -164438 -97713 -88086 -59710 -93511 37009 65325 80493 90534 83828 31657 -11005
21921 -11005 -3107 16209 156918 227716 190884 153045 148526 246495 308546 433422 455657 458192
21909 458192 422458 380922 451505 564890 668408 691617 630248 605413 703869 808902 899512
21898 899512 1026027 1073398 1043993 1184314 1258121 1380748 1369193 1301184 1215789 1243084 1193503
21887 1193503 1107172 1071366 942218 791764 679192 631215 509195 432510 451574 467315
21877 467315 519293 435274 352537 320995 317577 303391 269562 264696 214113 152090 170034 119342
21865 119342 103522 62983 -66887 -74590 -133573 -148995 -42523 10171 43105 47551 76166
21854 76166 103098 169228 230187 294368 229940 91664 117738 126699 33136 -22772 -12877 -20725
21842 -20725 -36986 -25163 -124545 -91791 -67201 -45823 -53430 -21450 31016 129938 171625 103519
21830 103519 30956 -35502 -52554 -122078 -238570 -325960 -219676 -129948 -103611 12345 80133
21819 80133 4825 19943 30051 37025 -36904 -32539 -66823 -13575 71483 33249 -27954 -28265
21807 -28265 -56733 -131676 -169492 -178782 -242489 -193153 -167622 -109736 -100897 -188447 -238098 -122429
21795 -122429 -44373 -19542 11169 -1313 -29295 -32179 -138918 -218464 -126994 -101813 -74172
21784 -74172 -47728 8818 71405 -22663 -33763 -131415 -204061 -197988 -127432 -130700 -94456 -59221
21772 -59221 -91751 -100117 -225438 -261721 -151639 -159731 -145807 -86825 -50719 -112545 -198852 -187666
21760 -187666 -119155 -219362 -289951 -255563 -243501 -183018 -125175 -67243 -93354 -108357 -90302
21749 -90302 -30099 -121835 -175356 -130753 -37541 117310 153989 35177 6837 53705 52733 92710
21737 92710 27858 32796 87466 158369 148039 155839 161490 133072 -16234 -49593 -122472 -140402
21725 -140402 -119686 -81621 -61993 -119543 -78501 -6734 25884 -6383 -83101 -123099 -166159
21714 -166159 -176466 -236583 -150669 -2323 74666 53889 88940 105016 111537 24115 37829
21703 37829 131837 20204 -197770 -234671 -236102 -228355 -265449 -169302 -125568 -153704 -136002 -121724
21691 -121724 -140043 -214868 -108346 -31023 16325 40483 -54746 -143436 -92907 -25067 -61655
21680 -61655 -59591 42090 69786 21249 -63934 -69313 -61805 -124544 -129789 -77658 -17034 66271
21668 66271 164211 154417 42446 -66229 1192 -20107 -42448 -10325 108854 74354 14609
21657 14609 -14770 -59020 -162314 -201796 -101810 -111437 -129102 -75865 -49765 -60226 -34775 -104553
21645 -104553 -154717 -128795 -44198 18645 45976 11419 -83417 -38379 -79932 -195518 -246745
21634 -246745 -184362 -188359 -241094 -192199 -97327 -34908 -44310 -120087 -134379 -87918 -85433 -111488
21622 -111488 -106806 -27357 -50558 -106535 -160185 -92012 18430 -8661 -56805 -114107 -47047
21611 -47047 74083 47562 -59213 -45462 -101110 -135042 -86411 -90745 -104715 -28981 7554
21600 7554 -34853 -168107 -199005 -148925 9712 33660 -46495 -67364 4987 93410 10165
21589 10165 -29670 -128858 -235433 -229965 -71937 -153053 -189167 -234212 -184727 -151608 -170185
21578 -170185 -140409 -115368 -135442 -208508 -218915 -220018 -227840 -160966 -86376 -134272 -133308 -10699
21566 -10699 -31614 -162906 -218671 -195386 -244534 -185271 -88450 -9087 -72995 -43058 -5476
21555 -5476 28147 -45639 -21940 -20193 -110561 -95561 -112657 -83320 -164731 -184068 -264840 -137069
21543 -137069 -77932 -153215 -185736 -64452 -98503 -189692 -170100 -213090 -166725 -167326 -89411 -63318
21531 -63318 -88685 -112074 -142076 -179868 -32543 18210 14904 29627 7937 -55332 -40186 36886
21519 36886 130092 154600 118922 52977 4807 74683 65606 -34656 -170313 -114306 -37906
21508 -37906 -30267 -54570 -51357 -75105 -81804 -58007 -13590 -1827 8581 -60376 -56970 -3604
21496 -3604 -102724 -188098 -219480 -93322 -96350 44105 38861 64897 -36146 -117334 -188277 -196078
21484 -196078 -220496 -183223 -93118 -88734 -53921 -97413 -118516 -60171 -85916 -172701 -227038 -223272
21472 -223272 -207554 -105880 -62808 -1454 44020 76526 157161 -2153 -96776 9618 -24046
21461 -24046 -112030 -228884 -207756 -127385 -28797 713 -3875 -30905 2432 -1590 -17620 -74756
21449 -74756 -170254 -153685 -103440 -86040 -4326 24669 -27904 -97422 -108145 -65844 -127989 -183671
21437 -183671 -160358 -186152 -133309 -189542 -298519 -271631 -218723 -227417 -176387 -99161 -94984 -66419
21425 -66419 -22331 -16291 -2246 -21470 -52643 -118382 -96801 -106623 -64398 5992 -4779 -17080
21413 -17080 -138690 -143050 -166258 -194022 -250304 -226352 -187857 -101022 -165034 -130746 -24867
21402 -24867 -39609 -114258 -163810 -201831 -217535 -149547 7086 52905 -11236 -131977 -120870
21391 -120870 -60039 -68659 -52833 -73954 -38969 6233 -9595 -10554 -115577 -93868 -74759 -13691
21379 -13691 53960 1460 -115090 -250866 -198897 -57835 25684 5184 -12097 -115748 -166520
21368 -166520 -121329 -69857 -51322 -77575 -81823 -31931 1340 -97053 -178526 -227579 -226502 -182055
21356 -182055 -139026 -171858 -125091 -104829 -142076 -127360 -48333 -82351 -110024 -153248 -87364
21345 -87364 -67901 -147740 -170806 -149359 -130318 -234111 -225484 -117471 -121496 -56383 -63615 -107559
21333 -107559 -83630 -36160 -29737 7625 75830 83795 3945 5983 51702 62095 81902 113271
21321 113271 151625 146997 121726 -17352 -96148 -127389 -206277 -250732 -205018 -213908 -237910 -252877
21309 -252877 -159863 -40494 -48816 -85150 -57224 24013 64487 17949 94815 30185 -119721
21298 -119721 -126498 -141502 -20171 55837 -21331 -15982 54921 48702 -17975 -98197 -112737 -98970
21286 -98970 -165886 -117676 -111888 -189717 -210048 -202178 -195923 -162312 -166719 -198937 -130044 -58628
21274 -58628 -62913 -117800 -92548 -167817 -168837 -145296 -72004 -25799 39627 49059 5087 -88836
21262 -88836 -70990 3296 58446 101004 -11514 -18760 21228 -47661 -141780 -197231 -172732 -178625
21250 -178625 -124971 -102039 -68042 75716 187380 84112 -42889 -147088 -185207 -158077
21240 -158077 -59423 -68069 -69625 -119766 -154979 -164931 -115094 -170926 -235535 -159189 -129296 -215816
21228 -215816 -245213 -240128 -172839 -141350 -225196 -143734 -129293 -100758 -123324 -146254 -46839 -21047
21216 -21047 -54005 -55789 -52098 -174432 -226151 -173503 -131790 -65776 -80345 -64860 -125456 -219830
21204 -219830 -136013 -32554 12788 -4802 75521 118691 -10905 -116864 -129736 -83489 -81309
21193 -81309 -72761 -153070 -263916 -208470 -135419 -97144 -73163 -136956 -202898 -275289 -238739 -217723
21181 -217723 -178956 -152051 -137952 -125879 13669 137574 87730 36515 -7407 -5979 -80896
21170 -80896 -152457 -156525 -14536 -12222 1903 -111885 -273451 -338712 -235903 -178810 -128233
21159 -128233 13545 -5630 -164914 -231164 -120435 -48515 -4949 28195 13317 -32138 -73780
21148 -73780 -119966 -62194 -20300 -44561 -75948 -99402 -59937 -133538 -242501 -262934 -254414 -145076
21136 -145076 -59101 -28254 -67786 -90656 -156176 -165698 -158708 -136952 -7251 55222 76019 27874
21124 27874 8012 -69077 -156680 -144857 -99184 -116915 -56517 49660 37041 72964 44645
21113 44645 8670 98773 50501 56607 -34610 -30916 -97068 -162283 -114718 -4199 -168918 -293630
21101 -293630 -121306 -77444 -36944 15595 59867 84659 58209 10731 -23459 462 36252
21090 36252 21465 48849 38012 -79590 -159556 -157876 -135350 -76008 6127 80920 141017 111198
21078 111198 5419 -117774 -100267 -67549 -57095 -168717 -192263 -113247 47523 2830 -71006
21067 -71006 -217335 -170790 -46345 -103588 -87067 27185 95509 -40129 3974 34976 5405
21056 5405 -23948 -75224 -151093 -103433 -15436 -2661 -37239 -130978 -135893 -25232 17927 47256
21044 47256 72673 69205 -104859 -117700 -132676 -38137 99584 127823 -64894 -117379 -90989
21033 -90989 -83202 -109758 -194833 -205643 -160509 -158190 -195450 -246741 -253580 -204487 -122815 -33149
21021 -33149 -92585 -70277 -50063 -30657 -69739 17368 -55888 -89976 -47293 20131 10178 -29277
21009 -29277 -22807 22944 99001 92981 -40938 -22499 -19423 -9901 -50512 -79856 -1551 87283
20997 87283 179617 114923 40399 -15670 -98074 -709 76191 -147198 -116295 -38829 -40523 -41513
20985 -41513 -102657 -60695 -3466 22294 97919 71388 -31885 -68574 -148006 -137561 -152463
20974 -152463 -124765 -32131 16302 78014 17508 32839 148136 240412 252282 116267 52802
20963 52802 17978 1065 -27000 -62500 -105208 -67414 -12679 104 40873 -88519 -66193
20952 -66193 98362 125458 133554 170630 164910 93530 -72861 -44445 17408 101459 151038 126361
20940 126361 153263 100484 45586 -30810 -142972 -118898 -9494 13869 -64036 -128421 -142969
20929 -142969 -31920 46966 36199 67333 3098 -31215 -911 -11378 48885 68384 86277
20918 86277 35929 5208 -18073 20834 -56396 -101078 -103406 -199641 -226936 -192703 -144787 -139503
20906 -139503 -121906 -118807 -126655 -108447 -45768 44032 73363 -20382 17214 11293 46954 129221
20894 129221 134336 37658 -31312 -55681 -10229 24234 -14491 -121825 -52266 -73785 -139293
20883 -139293 -136619 36893 37755 -8141 -55839 -90143 -85686 15252 -59096 -96727 -3526 70054
20871 70054 130083 119665 47711 5245 -45290 -77768 -11296 80760 -270 11146 30320 -78298
20859 -78298 -99810 11779 30084 -37693 -160844 -164709 -110031 -14789 34970 81554 94296
20848 94296 147090 91814 133096 223756 235815 163616 162704 224157 152134 161759 186072 123085
20836 123085 10666 12775 35420 -62397 -178537 -203778 -254656 -156914 -78506 -58835 25420
20825 25420 232780 183699 34773 -119126 -119248 -81382 19880 89496 78542 13679 -118675
20814 -118675 -107091 25236 122642 169129 220428 191196 134588 20042 26359 49287 12507
20803 12507 2707 42275 40509 -73381 -111562 -92895 -195841 -206815 -165542 -70018 37110
20792 37110 -69782 7801 140406 164579 52795 23225 29879 62663 4047 47729 103171
20781 103171 43960 -54912 -55041 -30593 -26088 18558 99762 111607 -7097 -55048 -35703 55402
20769 55402 60082 -46128 -83103 -77106 6817 -55406 -75100 -64287 -96323 -105096 -102338 17671
20757 17671 60264 -14017 -23897 -11715 52226 -6710 -42699 -61439 2725 67181 50711 25042
20745 25042 -8155 6786 27482 309 73501 140688 49440 56562 75389 41113 78655 82452
20733 82452 -1142 -57259 -14320 15238 -35845 -18052 -98175 -85625 46147 11188 -62076
20722 -62076 -87883 -108695 -108902 15979 98037 60487 109864 133627 130952 140833 141357 170855 113485
20709 113485 84562 109677 105602 79454 -2972 -67839 -6246 116273 140196 102980 87381
20698 87381 79444 109847 135939 75128 35053 3796 4030 -1430 -35844 -33907 -63765 -42837 50079
20685 50079 119280 65682 -42763 2383 68098 100742 119168 142136 143909 72696 2549 -41848
20673 -41848 47730 113352 136071 88519 125260 206146 271834 341989 285692 193590 195105 168659
20661 168659 73733 -50329 -24672 38553 34681 119135 135188 260363 258598 192952 166115
20650 166115 158692 188989 106783 -33460 -61799 34034 126729 150782 51581 16780 98620
20639 98620 236800 114720 64544 -35677 -127851 -10887 111574 147170 114179 50071 -43458
20628 -43458 -30642 1402 -44775 37246 11382 -20146 95314 142238 144549 163358 172055 191896
20616 191896 223323 161485 189382 133197 102693 30948 -103339 -201094 -220277 -125862 24039
20605 24039 56364 109278 14953 -84495 -68232 27366 37618 149642 116036 25 -56267
20594 -56267 15817 3624 -79349 -56730 -34198 -15114 46592 -3020 -52656 -78031 -146195 -209667
20582 -209667 -209264 -55373 99155 84036 62858 21748 -66287 -192101 -242215 -151305 -82738
20571 -82738 17004 130566 141890 113775 84518 15838 -53035 -98606 -24694 14605 -10398
20560 -10398 64451 137508 167639 165661 77301 -7571 -4400 142249 286519 272900 246089 159799
20548 159799 202630 320723 296714 226257 193164 155009 116385 102278 82344 85523 -55278
20537 -55278 -85911 -34236 62217 98973 78645 74604 21823 20937 5814 -43861 56801 10633
20525 10633 -111647 -165936 -118968 -53514 -32072 88713 198708 137269 87836 88717 161092
20514 161092 20676 -49261 5536 112974 121884 134185 119635 166165 227305 283610 213073
20503 213073 254438 188280 52448 62015 169238 295819 321284 227741 156088 179372 240238
20492 240238 255214 168382 198363 144357 137323 97713 133325 126866 149991 139863 69275 54333
20480 54333 103167 175032 94921 106526 73364 94538 3334 18842 -3044 -55841 -10289 120736
20468 120736 250705 191597 166416 154417 174110 106858 1858 -30327 23722 160407 109020
20457 109020 163578 108152 88740 123902 82133 -15744 -44615 89100 69350 7552 -150773
20446 -150773 -152303 -116431 -64990 44598 87849 103987 169634 99679 18313 15248 -5591 -75264
20434 -75264 5412 45977 99441 53131 40394 6337 34600 15079 3251 -20102 7886 71799
20422 71799 143806 99571 23942 -103278 -49282 -39234 -5317 -26198 -39266 -31794 67138 52757
20410 52757 -56232 -83093 -87689 -102634 19519 23095 -88794 10263 60087 65792 79138 75990
20398 75990 117800 145675 147905 -23216 -90025 -99718 -16670 56778 70032 49974 103353 129654
20386 129654 26054 51512 168548 211649 91544 61278 128623 166560 64665 54134 -69455
20375 -69455 -141952 -207687 -154358 -85541 -8393 128017 179245 224824 288535 240119 166666
20364 166666 204951 85483 -117505 -159628 -71319 -2182 156284 82997 -14720 29497 77467
20353 77467 84420 74884 9751 1184 58369 -19070 -23658 27068 158824 306196 299887 136462
20341 136462 75662 -59888 -115450 -171083 -141205 6580 73603 82666 75821 96795 101795 91756
20329 91756 128358 192747 170025 185064 292171 203323 213050 159064 53456 40638 87063
20318 87063 76089 2159 -19340 -47165 16305 123573 189781 144648 133296 87898 -46821
20307 -46821 -98531 -172146 -103380 22155 56980 19299 93294 87500 96994 175593 225886 235977
20295 235977 246005 190904 107315 62408 -53043 -119188 -15185 51949 218348 185110 187248
20284 187248 138367 110338 182391 68496 84701 74101 78957 121269 75264 102612 32824
20273 32824 120534 31450 -9941 120096 133848 76952 166952 147263 140390 142193 166255 129843
20261 129843 59718 68609 61937 -78233 -86704 16175 -31318 -87670 -127855 -74052 -86004 -124828
20249 -124828 -49095 76562 187719 190192 261564 303722 252946 257061 258544 285031 330548 337236
20237 337236 342766 302129 248728 231838 198484 195312 193462 116731 105300 90573 49775 48208
20225 48208 -32368 -17056 -1249 59465 83914 47168 60939 158639 108337 11596 50298 23002
20213 23002 19458 115281 144167 185487 216496 215467 127432 132767 207044 243804 261200 259760
20201 259760 151511 84150 54745 62568 99721 144891 153894 199213 235127 237977 174718 183231
20189 183231 183578 234253 132765 114191 134035 203541 238901 172264 151826 223306 233067 262038
20177 262038 258380 242700 237422 245545 152102 151009 204711 211277 229138 210500 130031 122380 238242
20164 238242 238698 152591 102087 85168 186013 219479 260698 266102 281809 172347 121964 200038
20152 200038 164720 152487 200085 227950 291505 273597 393490 417430 327247 215234 244568
20141 244568 281097 192091 124591 77417 125857 170327 208931 211189 100486 43358 83511
20130 83511 157932 103996 118062 208932 214411 274955 346703 320719 303325 135761 93974 106992
20118 106992 83901 65792 130058 97007 35361 59589 -44608 -92580 -69317 -31873 89611
20107 89611 211382 138100 15414 -82032 -63777 33804 81263 248164 328224 223184 116545
20096 116545 63940 102376 139879 241825 216284 156856 215537 212306 204410 212911 187622 246617
20084 246617 264993 207458 154096 97386 122995 129253 134685 255380 392380 385808 256735
20073 256735 202590 152240 195104 214685 169303 150447 225944 271920 263375 249329 268342 177694
20061 177694 187447 155172 75273 43820 73529 120437 213589 316674 365900 292496 188984
20050 188984 252973 307677 223168 246625 244742 262779 387346 412093 324716 239402 150681
20039 150681 86570 94428 185101 249557 229274 182411 143545 102303 36466 2728 -36012 -15597
20027 -15597 61583 158863 380424 475856 465296 394892 283092 253035 228106 390410 445466
20016 445466 265121 270993 311091 269631 216034 359240 265037 141709 168983 270237 239537
20005 239537 115932 120604 138176 188521 293712 301187 230986 300634 287946 280354 245915 225455
19993 225455 269289 253016 158303 273428 399713 418095 410629 336183 248702 317555 348005
19982 348005 344060 441448 450820 307850 182800 199023 214642 247486 254081 216233 118478 177892
19970 177892 286728 333091 271265 193983 251930 130937 116340 218609 278321 289792 325477
19959 325477 461676 489785 401661 362948 389057 414432 318853 274379 394944 335354 240803
19948 240803 320760 366949 325631 327133 339919 370655 284729 258276 254023 219392 211357 300754
19936 300754 346618 268103 247121 232824 154471 54203 45951 109825 143584 215983 313219
19925 313219 358312 289756 250322 237328 267994 224585 224994 263396 212155 238433 284645 370161
19913 370161 433740 369406 274282 337786 473235 507907 486186 446127 396210 385138 361923
19902 361923 412956 429969 469254 490944 415686 399538 465618 439315 377639 334766 353941
19891 353941 468480 411140 381287 472556 477417 422672 427234 428713 423216 376960 300819 409931
19879 409931 426253 466518 570284 556101 464417 499631 454141 500334 527649 495004 493978
19868 493978 566062 633346 704408 772453 818383 817203 820715 841953 863157 909932 1000278 984987
19856 984987 838984 853492 850123 912325 914244 909305 1004910 1107399 1063977 931831 858265
19845 858265 841360 930861 907674 853859 717937 630335 755473 805786 826267 792311 782963
19834 782963 680476 637358 768725 827033 778068 706164 707547 761404 767705 754331 737336
19823 737336 746832 809725 897033 950631 900942 887688 892413 910674 911873 932781 1036345 1025869
19811 1025869 984497 1016438 1087739 1114876 1161660 1164102 1135237 1130775 1074364 1095892 1145086 1158143
19799 1158143 1104290 1125030 1161039 1113185 1013429 887139 810396 794830 763903 705760 705727 652763
19787 652763 662550 679287 717129 763411 771372 721696 773327 802195 726533 642275 697196 756359
19775 756359 780156 808792 816400 648851 631987 723855 654714 481688 490025 522005 697862
19764 697862 768623 744258 684703 670841 604704 562270 659638 760551 784627 731190 760353
19753 760353 740263 636438 702746 633890 641688 704400 623150 588399 625328 630714 643596 594777
19741 594777 632735 682515 703871 684495 628959 642188 593406 603667 607769 473856 568083
19730 568083 660980 559704 465979 451797 463241 449830 420634 463213 417102 404551 469867
19719 469867 604445 627157 540324 616792 742079 779684 769590 790295 725116 676683 655943
19708 655943 638057 632407 676442 759695 737232 679428 641244 632725 605376 581486 647042 664968
19696 664968 702697 780098 853150 781059 746180 658658 670433 642460 661534 687084 782467
19685 782467 904812 925799 915761 878570 723872 672558 607267 688379 793098 739127 733314
19674 733314 791143 689596 658634 729074 748783 752316 765209 727054 694643 773011 784903
19663 784903 662919 650902 703958 795194 862220 845205 820751 788015 673356 716172 685207
19652 685207 746784 836471 853268 865239 921052 984515 1019216 959154 917468 936901 911113
19641 911113 861071 878859 950208 1045545 1154062 1075179 995860 970406 891225 926805 992695
19630 992695 989894 1106488 1184133 1120864 1022244 972279 1077779 1184258 1250021 1396515 1526578
19619 1526578 1578493 1576567 1663901 1811115 1916065 1854186 1882996 1865684 1874963 1928674 1976032
19608 1976032 1941921 1830910 1834962 1789413 1770734 1758252 1820132 1906443 2008793 2053879 1987541
19597 1987541 2033226 2048818 2002331 1965267 1994290 1892717 1794768 1642505 1607620 1587781 1550716
19586 1550716 1530870 1504686 1559262 1515841 1499246 1466228 1543758 1636694 1627111 1535061 1522745
19575 1522745 1431422 1443137 1478177 1485456 1501670 1564391 1588915 1541500 1618843 1709834 1697691
19564 1697691 1712055 1704160 1648083 1586767 1680532 1798184 1799518 1713709 1748645 1912666 2080806
19553 2080806 2224825 2319646 2236471 2203442 2217309 2191140 2253399 2372557 2428508 2457408 2413387
19542 2413387 2338083 2262164 2281278 2270386 2223449 2394686 2504142 2294311 2139907 2105024
19532 2105024 2079205 2083963 2053066 2059442 2011205 1843552 1628930 1649026 1728370 1640178 1647139
19521 1647139 1690723 1704404 1778074 1817141 1734216 1698959 1640562 1660889 1649122 1640999 1675413
19510 1675413 1686029 1644766 1682086 1693820 1720723 1616855 1586344 1697539 1717866 1810262 1820541
19499 1820541 1827197 1803438 1697683 1583857 1657803 1758941 1764954 1744751 1794657 1930622 2028774
19488 2028774 2118834 2136642 2183080 2268047 2246141 2187982 2160914 2051824 1970916 2029601 2096551
19477 2096551 2094069 2173115 2172813 2263228 2265134 2229806 2189023 2095875 2166180 2258070 2316333 2322582
19465 2322582 2170409 2159364 2251934 2282398 2364900 2347241 2415065 2493252 2519754 2503547 2522843
19454 2522843 2475310 2618228 2596901 2537354 2588361 2641287 2704628 2783230 2780254 2753798 2730145
19443 2730145 2836041 2914142 2947517 2960063 2995434 3103944 3159370 3258181 3292009 3248684 3109382
19432 3109382 3106615 3163862 3303262 3388445 3449917 3552392 3652313 3716065 3723341 3709714 3845740
19421 3845740 3974599 4011431 4045776 4097680 4118425 4179320 4329097 4443958 4464569 4543126 4608511
19410 4608511 4614034 4664892 4794433 4914778 5025779 5115806 5247478 5346706 5420881 5527235
19400 5527235 5642354 5842736 6013832 6160497 6307324 6461738 6709325 6956310 7140761
19391 7140761 7227694 7506341 7772649 7917704 8087292 8399485 8780417 9126332 9375608 9738921
19381 9738921 10148812 10615890 11095061 11530362 11975739 12411720 12884330 13437895 14050030
19372 14050030 14725909 15440268 16243659 16939759 17767483 18728176 19816401 20907295 21932871
19363 21932871 23065731 24498884 26101431 27695543 29534558 31611571 33949570 36476109
19355 36476109 39352806 42589493 46117618 49994468 54248342 58764357 63656258 68921067
19347 68921067 74321573 79698776 84851097 89622477 93803451 97349571 100374985 102889254
19339 102889254 105183886 107210001 109207763 110965634 112575686 113888710 114563177 114321420
19331 114321420 113240856 111106774 108108885 104306794 99672109 94566492 89302015 83971980
19323 83971980 79049425 74593674 70531801 66886218 63794229 61119146 58852737 57120890
19315 57120890 55879435 54993799 54469611 54210937 54397492 54979357 55768883 57018060 58521825
19306 58521825 60319815 62287064 64626180 67227082 70051221 73092012 76486212 80239159
19298 80239159 84351578 88929267 93901356 98979764 104246014 109483778 114449859 118929768
19290 118929768 122775401 125848300 128025143 129425470 129942009 129686893 128501686 126484647
19282 126484647 123393374 119304109 114252466 108400441 101811290 95006548 88026852 81188894
19274 81188894 74670717 68501764 62813018 57712066 53167939 49129200 45429779 42004628
19266 42004628 38950720 36187767 33767915 31655259 29601127 27936391 26293546 24758705
19258 24758705 23457973 22192620 21107759 20183760 19231678 18332500 17431606 16583316 15864152
19249 15864152 15149782 14586219 14026204 13486428 12984063 12503627 12149493 11733728 11322222
19240 11322222 11064346 10676408 10287631 10084037 9913135 9726275 9497277 9261708 9011346
19231 9011346 8722844 8590713 8512454 8379512 8108281 7899293 7763738 7646905 7511158 7323184
19221 7323184 7089471 6992229 6893089 6765500 6529817 6258708 6209921 6246984 6284827 6205322
19211 6205322 6070294 6010415 5808558 5731658 5731802 5681896 5593485 5529875 5512669 5452868 5399168
19200 5399168 5337977 5295423 5301832 5194161 5111010 5105028 5132301 5171446 5196240 5196527 5121428 4956388
19188 4956388 4882365 4925252 4941616 4882706 4865344 4909316 4848313 4786899 4786054 4746334 4783527 4747657
19176 4747657 4819075 4774173 4862296 4885663 4874323 4900285 4927690 4942784 4912878 4937176 4898626
19165 4898626 4928098 5029775 5021622 5042983 5032486 4923133 4807808 4767765 4708358 4797466 4885945
19154 4885945 4941959 5062146 5129651 5121938 5115971 5034258 5062850 5165575 5167892 5139222 5079946
19143 5079946 5014751 5022145 5056189 5146798 5096906 5085334 5178282 5285544 5415887 5398852 5322456
19132 5322456 5164480 5126512 5240212 5323586 5396587 5431187 5444573 5463257 5575338 5719284
19122 5719284 5831480 5900816 5955809 6045158 5976418 6079699 6291029 6361496 6402836 6462354 6425767
19111 6425767 6468043 6606582 6696190 6688300 6771939 6970956 7095700 7055815 7048210 7183594 7312243
19100 7312243 7422734 7648991 7922528 8081484 8229793 8307192 8374716 8486777 8663199 8881935
19090 8881935 9105197 9205851 9325309 9402956 9660398 9869719 10028716 10282848 10636603 10935239
19080 10935239 11222328 11368866 11631963 11882991 12128373 12445087 12868124 13246539 13597833
19071 13597833 13922737 14317445 14798245 15249519 15696210 16100453 16560519 17221146 17798400
19062 17798400 18352526 18988669 19696242 20314795 21075842 21988840 22965566 23788378 24657177
19053 24657177 25700605 26899663 28170994 29535206 31053945 32435271 33860777 35546152
19045 35546152 37545707 39620111 41723243 44065169 46809350 49697299 52790594 56317312
19037 56317312 60349618 64800429 69698270 75176764 81189511 87957037 95447811 103566885
19029 103566885 112510862 122076576 132287114 142924058 153602396 164038232 173796959
19022 173796959 182411206 189637514 195156206 198829445 200828562 201580741 201402131 200763718
19014 200763718 200159501 199803242 200077880 201006846 202526434 204223337 205790199 206766814 206546337
19005 206546337 204783381 201340724 196248098 189406008 181161793 172029066 162463642 152849444
18997 152849444 143730765 135048436 126910209 119685638 113297409 107638524 102760413 98743197
18989 98743197 95425771 92715320 90590544 88963870 87830448 87388539 87403477 88036869 89166098
18980 89166098 90811072 92862410 95506099 98729631 102563440 106931669 111733341 117366159
18972 117366159 123636758 130512635 137969458 145877120 154128751 162441049 170635898 178523348
18964 178523348 185905644 192447992 198220472 203028914 206623100 209115387 210803773 211723818
18956 211723818 211843257 211238919 209900146 207813428 204675934 200618227 195528596 189372220
18948 189372220 182085456 173911026 165121229 155878934 146612443 137233780 128042992 119297406
18940 119297406 111079609 103351581 96175521 89623977 83546385 77957904 72922187 68283005
18932 68283005 64024706 60225038 56673579 53420822 50450360 47825761 45371434 43233157
18924 43233157 41166993 39235195 37473897 35769285 34271777 32939691 31703382 30423248
18916 30423248 29364886 28322201 27144514 26209799 25238813 24283828 23442470 22725106 22040268
18907 22040268 21376255 20757869 20239237 19604874 19015576 18600307 18125945 17685457 17265126
18898 17265126 16923408 16561396 16242989 15861699 15561400 15318849 14962043 14567865 14335561
18889 14335561 14009820 13710011 13488836 13295929 13187791 13089929 13027336 12812278 12728179 12656424
18879 12656424 12574325 12475082 12380741 12229990 12125215 12143028 12108992 12097208 12091573 12011224 11975536
18868 11975536 12036247 11992896 12028461 12078673 12091103 12173774 12320292 12404323 12532757 12684937
18858 12684937 12910351 13107173 13335097 13496484 13659364 13875017 14174183 14517041 14890627
18849 14890627 15289312 15635373 16008581 16472418 17053611 17745890 18391851 19137560 20067499
18840 20067499 20970970 22075252 23315381 24511702 25909857 27464389 29305972 31211612
18832 31211612 33303903 35737688 38201224 40714885 43288227 45699502 47879071 49695668
18824 49695668 51179882 52490473 53631357 54448785 55190698 55764199 56170831 56443389 56487936
18815 56487936 56248384 55684963 54795297 53527858 52033611 50485390 48870893 47237431
18807 47237431 45858686 44586972 43501251 42540679 41772462 41298227 40906127 40787986 40865801
18798 40865801 41117618 41573926 42264948 43210163 44280398 45407336 46934295 48910480 51184739
18789 51184739 53819593 56825157 60469373 64568913 68970965 73788751 79004409 84598363
18781 84598363 90230649 95774559 101048955 105795602 109870770 113009836 115065204 116046862
18773 116046862 116282657 115753752 114428258 112670377 110663955 108330485 105946478 103427088
18765 103427088 100817353 98065830 94999391 91863545 88435145 84762799 80851345 76937838
18757 76937838 72934482 69003374 65470973 62252835 59279286 56651118 54390787 52540379
18749 52540379 50954463 49657527 48744167 48205579 47895741 47875500 48171519 48831061 49817630
18740 49817630 51116931 52852095 54905819 57275515 59936771 62895888 66241426 69792404
18732 69792404 73365667 76886604 80160664 82983793 85184773 86795763 87802362 88339274
18724 88339274 88394089 88127221 87616980 86787669 85563836 83931599 81604431 78872538 75754836
18715 75754836 72110061 68116088 63852422 59548572 55415254 51435969 47593962 43958771
18707 43958771 40715815 37692281 35101751 32809938 30689345 28930976 27279270 25769713
18699 25769713 24466642 23183893 22005753 20867225 19904862 19036020 18096511 17270721 16645441
18690 16645441 16093061 15540197 15031587 14590685 14092137 13515710 13082090 12773614 12469949
18681 12469949 12102559 11635386 11274721 10909319 10593251 10277593 10202713 10069668 9995384 9890372
18671 9890372 9814724 9683813 9421383 9222046 9076798 8951071 8858789 8794607 8725625 8628589
18661 8628589 8597018 8599207 8604853 8469076 8282585 8108532 8065796 7953590 7905352 7811144 7750979
18650 7750979 7759518 7688465 7645230 7656460 7622325 7628716 7601323 7583252 7533622 7544102 7471257 7392829
18638 7392829 7512041 7537013 7407811 7318483 7418386 7541347 7667696 7614017 7549013 7567177
18628 7567177 7653125 7609153 7717279 7901042 8022903 8130703 8166256 8144747 8381843 8547221
18618 8547221 8609745 8645596 8865570 8948478 9058504 9206115 9228007 9272391 9391054 9452854
18608 9452854 9484971 9632124 9665202 9697225 9769465 9892118 10076162 10271273 10356599 10516158
18598 10516158 10637986 10744937 10886819 10955887 11185832 11478884 11791581 12002196 12278155
18589 12278155 12638249 12956728 13162733 13488291 13922594 14410739 14941460 15492190 15984976
18580 15984976 16535687 16997389 17640925 18403453 19096662 19833260 20578901 21470130 22462779
18571 22462779 23552862 24651560 25884216 27104367 28507793 30141153 31796444 33628886
18563 33628886 35581042 37893198 40526496 43416943 46479743 49789777 53426435 57274657
18555 57274657 61342388 65498132 69716702 74023355 78257510 82364509 86104563 89481627
18547 89481627 92452975 94946142 96853339 98118462 98626281 98460147 97660509 96382752
18539 96382752 94695858 92529356 90086185 87605908 85243862 83087456 81103677 79492865
18531 79492865 78293920 77478550 77277602 77626440 78446983 79733843 81506648 83901923 86909122
18522 86909122 90555868 94872935 99741623 105358700 111717882 119096106 127318128 136295558
18514 136295558 146064097 156662099 167837476 179460369 191382541 203367749 215094400
18507 215094400 226471711 237230465 246968641 255518235 262458867 267516927 270195021 270468350
18499 270468350 268252592 263445743 256572685 247915210 237709187 226567948 214874043
18492 214874043 202797553 190660898 178758873 167432632 156715126 146735144 137674069
18485 137674069 129472851 122134932 115637417 109651690 104504497 100180707 96614706 93688128
18477 93688128 91385503 89520770 88280418 87503579 87143107 87368240 88350890 89944690 92167825
18468 92167825 94970877 98201508 102233277 106876918 112163613 117848372 123900386 130424553
18460 130424553 137096940 143605858 149699198 155432076 160483110 164580421 167657142 169515909
18452 169515909 169960338 168612906 165604653 161080884 154942406 147711008 139624844 131061544
18444 131061544 122308704 113739022 105575301 97705374 90445754 83815332 77520021 71796943
18436 71796943 66576102 61883046 57718945 54001590 50499086 47298335 44553832 42082153
18428 42082153 39722403 37624457 35787457 33980183 32280577 30756411 29217541 27807698
18420 27807698 26545070 25477251 24310875 23217367 22308932 21401339 20561498 19845058 19026577
18411 19026577 18230575 17678152 17164198 16655498 16167598 15663458 15301082 15041992 14776860
18402 14776860 14192434 13699696 13396902 13132964 12821341 12621206 12294764 11942240 11818020
18393 11818020 11552924 11319424 11263316 11194456 11021983 10807499 10574671 10397311 10153986 9872308
18383 9872308 9753370 9640866 9415437 9121823 8965276 8784504 8513388 8404662 8283698
18374 8283698 8077273 7804452 7671862 7498043 7322396 7246538 7157860 7075622 6977070 6911738
18364 6911738 6797735 6682824 6642002 6597900 6493279 6351851 6184990 6055322 5947030 5881428
18354 5881428 5890446 5801622 5643323 5471700 5273894 5126637 5056908 4964808 4997685 5021312 4922166
18343 4922166 4840882 4810374 4703414 4630378 4603442 4575714 4638862 4618876 4408157 4224195 4106313
18332 4106313 4002495 3943578 3952622 3993336 4013150 3864744 3831704 3811545 3599268 3416709 3315148
18321 3315148 3273494 3323930 3322996 3301627 3279567 3222787 3141048 3049136 3032345 3040245 3027786 2974193
18309 2974193 2820420 2697499 2761018 2753603 2719910 2772241 2782280 2770153 2713980 2700544 2746391
18298 2746391 2722626 2595934 2474372 2471394 2537361 2637765 2714168 2668272 2648638 2699364 2737597
18287 2737597 2625136 2446867 2416437 2466000 2438903 2386719 2390338 2350303 2232290 2122842 2020151
18276 2020151 1957888 1942079 2013747 2110109 2113896 2111761 1934918 1942271 2113363 2027311 1951356
18265 1951356 2043895 2019513 1947147 2005280 2034519 1983409 2052888 2164280 2125235 2161537 2116597
18254 2116597 2040971 1973192 2098457 2141442 2181588 2290218 2272588 2272313 2275029 2193668 2077928
18243 2077928 2132981 2133937 2074947 2014871 2067590 2167739 2108533 2106195 2061715 1997767 1946539 1934784
18231 1934784 1905759 1859754 1816494 1841363 1816083 1757310 1699306 1595841 1768681 1823338 1793968
18220 1793968 1767884 1772665 1776194 1721672 1737273 1643560 1550371 1567142 1576581 1645255 1741900 1821436
18208 1821436 1883255 1840060 1803287 1847960 1846412 1854520 1856427 1853927 1883499 1958654 1876823 1721988
18196 1721988 1611832 1663307 1750584 1698487 1754548 1811623 1875892 1863471 1910692 1881002 1834416
18185 1834416 1786685 1859974 1891320 2000625 1999842 1952220 1904058 1879251 1938127 1868246 1897353
18174 1897353 1899985 1915437 1949395 1974108 2094190 2071403 2013632 2118283 2143979 2235747 2277897
18163 2277897 2272239 2340820 2290018 2257435 2280198 2265384 2474690 2634505 2787260 2803620 2730682
18152 2730682 2747383 2819677 2995861 3136849 3341142 3486045 3536185 3632337 3784877 3976579
18142 3976579 4194625 4415232 4552299 4670628 4852235 5175273 5473817 5697511 5994654
18133 5994654 6403321 6887048 7276961 7579768 8034288 8709102 9418720 10203953 11067608
18124 11067608 12091466 13267709 14377035 15572963 17114612 19076188 21250224 23900083
18116 23900083 26695920 29760104 33299593 37293971 41569040 46143261 50730298 54894549
18108 54894549 58305552 60698604 61699517 61066644 59044761 55625349 51526802 47132636
18100 47132636 42484440 38049066 33945354 30222086 26892364 23980076 21599333 19632137
18092 19632137 17762851 16107222 14654384 13402476 12347875 11359273 10451890 9697281
18084 9697281 8979580 8365505 7753559 7257362 6841995 6399856 6077555 5712643 5371166
18075 5371166 4938107 4671952 4520630 4251356 4033387 3888564 3760120 3638174 3352943
18066 3352943 3240841 3149344 3170737 3089033 2985778 2862489 2720031 2509231 2397898 2306923
18056 2306923 2306254 2249020 2118582 2066728 2055852 2077173 2049029 2030099 1983864 1848871 1873709
18045 1873709 1915046 1815664 1759622 1731751 1615345 1538702 1595106 1641616 1723189 1781393 1747565
18034 1747565 1683069 1647764 1604178 1641561 1575972 1576218 1593412 1602049 1627254 1591557 1634294 1571143
18022 1571143 1458033 1430810 1420461 1491543 1575655 1529137 1413107 1444307 1457059 1332475 1303299
18011 1303299 1198531 1134377 1119423 1251768 1282945 1226924 1161655 1225920 1279917 1342363 1259068
18000 1259068 1228541 1166286 1213281 1317924 1340822 1370354 1400125 1504104 1497030 1504627 1571087
17989 1571087 1635286 1773054 1739265 1722936 1692217 1757081 1887143 1846515 1873423 1997131 2019935
17978 2019935 1819720 1714384 1708114 1673777 1662562 1538081 1436360 1402681 1299854 1135713
17968 1135713 1125407 1084315 981621 988628 969828 977022 1001774 1025892 1020255 983205 1016927 1112828
17956 1112828 1111729 1097138 1147548 1102686 914388 803605 840732 1010613 924528 906966 994940
17945 994940 971888 929136 996541 1204976 1365602 1397043 1424145 1417971 1431027 1426047 1422165 1473508
17933 1473508 1536449 1454974 1294625 1114390 1083672 1019492 1154168 1177875 1162230 1249982 1116051
17922 1116051 898997 779618 742920 810630 780327 744402 673085 691823 625295 671392 568712
17911 568712 408751 437235 590257 601968 568523 509849 444734 456133 473800 512887 456139
17900 456139 297539 330554 356534 339275 341251 288428 244527 355478 421712 460343 359003
17889 359003 389021 424181 401241 400063 408048 361211 323425 397597 439249 353799 279032 249497
17877 249497 197169 266559 369452 457610 438906 361471 332091 215505 168560 192291 167485
17866 167485 257010 192251 123470 137805 206739 173010 171436 137661 130688 223343 233317 261429
17854 261429 419775 271033 169183 276605 338137 185536 143388 168847 263506 344849
17844 344849 439377 405195 211760 149947 123634 89737 201742 333039 415101 415934 383760
17833 383760 419701 436863 384404 243496 173691 121317 65706 119103 157156 144318 142943
17822 142943 204728 280331 292354 272718 284922 314290 296528 201978 180210 231531 264617
17811 264617 341944 333419 351201 307307 207256 70205 42884 109363 204083 219575 161670
17800 161670 165416 132982 59415 103962 143951 278813 180553 112406 132577 265510 331208
17789 331208 278279 232997 264370 162571 217649 305973 246367 173798 66793 152134 233913
17778 233913 235440 217480 309109 337092 394840 368589 296935 269168 235290 202778 248461 260260
17766 260260 296576 275342 305650 235707 213675 179262 200527 231643 149886 198337 231272
17755 231272 226535 293372 296350 269266 223878 246625 206704 127641 43713 -48062 -68191 21901
17743 21901 188433 320190 274255 262971 232440 110217 99556 27072 51219 127540 174212
17732 174212 126771 56992 158917 232789 186003 64138 100273 125885 5073 -106101 165
17721 165 20527 35774 -9346 87332 211252 185075 137344 183965 105601 55007 102817 96790
17709 96790 42440 10798 85694 119161 5362 -63972 4846 -37241 -110854 -107315 2854
17698 2854 116771 111680 101633 75313 141714 119340 100735 99749 59978 113285 92254 48316
17686 48316 113097 130924 48430 94707 125209 125548 87119 -32900 62400 132584 151096 193197
17674 193197 164517 48102 17740 68048 82961 129771 48093 -26336 -28399 57520 135393
17663 135393 102418 77332 107602 150648 134834 130946 162933 231584 273212 285385 241191 202144
17651 202144 141552 211779 218138 185958 120174 145090 177532 135959 76711 127451 119409 156140
17639 156140 93815 112328 195406 148338 66455 32717 113574 108890 38478 62227 96601 188754
17627 188754 196495 249266 130279 -24478 5177 16767 -25962 26797 59005 -7144 -6367 62710
17615 62710 172323 191412 175370 81266 114448 147198 67116 38274 84548 116197 221323
17604 221323 177601 240689 292162 288780 284028 238113 215143 221654 186814 161940 170584 94446
17592 94446 55817 39380 154321 183946 115369 108580 134066 179596 221751 199704 146532 17466
17580 17466 9620 79802 132534 188915 207722 257641 219104 106559 72092 166044 290051
17569 290051 294348 277650 358638 407084 321642 328924 442103 489322 504399 502375 601892 566243
17557 566243 492230 603311 699835 770162 777476 846519 848155 810339 839839 862671 1022393
17546 1022393 1073239 1013856 1012362 1017070 1138257 1081692 1035930 986773 1040248 1177853 1219469
17535 1219469 1193157 1139647 1106325 1024442 859977 972948 983833 899126 877309 846446 768336
17524 768336 746892 904840 913549 860659 849217 857849 749718 674355 671954 663661 575467 564609
17512 564609 602943 569734 455550 365969 315013 358824 332164 289355 276540 337660 407858
17501 407858 455341 380640 238048 300203 308937 254361 285042 300705 418614 447541 422088
17490 422088 400267 347294 250204 154161 89390 80767 184790 239964 176929 130994 178010
17479 178010 218377 212964 218449 35276 -98184 38561 295934 366223 175310 156275 275277
17468 275277 253792 181632 145682 93140 47878 97640 186015 251710 320280 256311 208022
17457 208022 191740 232967 292490 331224 423797 469101 408512 347575 332590 408439 479508
17446 479508 539014 503157 490166 456349 492426 473187 454555 491148 483545 457513 529510 522291
17434 522291 521558 546312 495437 505430 459700 403067 398660 348930 342663 261727 179729 262364
17422 262364 275154 226103 108527 166303 173138 225716 209271 73472 121864 95756 120707
17411 120707 179896 221548 290035 300123 334907 331154 215583 257205 322410 314194 309581 291286
17399 291286 278172 343732 274816 148700 93477 57667 70842 162997 235532 250544 263725
17388 263725 255858 307993 233643 209188 254025 256317 244867 236404 189726 127682 138992 191320
17376 191320 139979 262054 351774 318847 382871 438208 342873 235516 227646 165812 117497
17365 117497 159160 269936 198675 108106 100673 109227 248030 352070 389043 434109 466492
17354 466492 381686 328069 288489 244695 234756 280123 348753 282184 163991 131990 102353
17343 102353 145682 257938 168117 177293 224846 321977 346738 398796 301988 234089 253499
17332 253499 283373 436560 450353 393694 406757 347935 261808 164460 157886 162005 180893 158646
17320 158646 260703 267556 300179 257911 126262 75897 150538 164606 108026 19429 15080
17309 15080 118749 167858 172726 227811 147126 72116 98221 68323 138688 175544 129395 80164
17297 80164 -33901 -11104 -1648 31369 161448 230366 165247 170028 181957 156042 220500 293228
17285 293228 355022 357850 367843 405711 427236 408657 328950 233204 243730 301581 290182 248556
17273 248556 164571 101981 134745 132795 212865 262394 214186 200319 184244 123711 117094 217066
17261 217066 360283 395816 321527 296071 313493 322551 317808 412992 474271 392618 317305 357813
17249 357813 476506 538326 541977 449312 373098 373253 480446 456809 423681 466964 597216
17238 597216 607343 508068 518585 552569 591993 710390 744847 749074 671033 749553 797682
17227 797682 696978 614281 690414 665294 624442 638240 738721 803696 718111 798247 793798
17216 793798 603794 599450 665339 705945 789704 807451 662990 607617 655357 535958 505115
17205 505115 560687 519343 576502 711421 749454 694746 712901 730312 650350 612492 580869
17194 580869 538683 577713 670915 634517 623694 737130 759725 789487 844297 886746 830150
17183 830150 765462 767357 794542 760593 732647 760205 821369 899294 851071 779270 801201 842330
17171 842330 848613 881322 830012 790842 825803 832487 865499 897395 920731 884514 936087 851021
17159 851021 873250 1014848 955589 867259 859622 947320 1012855 982905 972227 1028043 1031110 1008268
17147 1008268 1048897 1060548 1126330 1090650 1189923 1133973 1109591 1119336 1132565 1151440 1142337 1183738
17135 1183738 1199097 1122701 1201599 1266744 1281649 1273214 1160882 1215617 1267911 1354860 1499313
17124 1499313 1642348 1614980 1523596 1307625 1286317 1457600 1524368 1529308 1527814 1510973 1613890
17113 1613890 1647904 1662655 1719513 1746098 1760809 1848478 1827227 1862211 1898864 1874888 1887676
17102 1887676 1834852 1909552 1956355 1917613 1911624 1931097 1925586 1967804 1995910 1989850 2053639 2113257
17090 2113257 2158203 2158809 2141452 2241239 2360541 2392565 2405263 2481200 2684857 2719409 2864489
17079 2864489 2871288 2780767 2694429 2713505 2880103 2951646 3012387 3008652 3132625 3192988 3169658
17068 3169658 3303058 3421599 3581925 3705767 3807548 3760482 3856531 4039302 4088774 4154035
17058 4154035 4258249 4295924 4504019 4697545 4771105 4894941 5109357 5341962 5421668 5511991
17048 5511991 5702704 5797166 5920798 6087694 6313953 6698699 6972929 7162018 7357355 7598755
17038 7598755 7850366 8037962 8263898 8582800 9016774 9381901 9655839 9991005 10413986
17029 10413986 10791197 11173095 11689045 12184769 12761645 13393284 14132764 14863026 15596628
17020 15596628 16273422 17131705 18118599 18977782 19891156 20820753 21957913 23394837 24891511
17011 24891511 26392149 28051122 29810746 31791447 33802846 36125045 38712076 41530479
17003 41530479 44682730 48298914 52229253 56525541 61442994 66876685 72615280 78944353
16995 78944353 85832207 93050939 100642660 108372171 115970631 123281295 129952247 136014403
16987 136014403 141510327 146512034 151185609 155727741 160293677 164864215 169645746 174571427
16979 174571427 179214132 183267481 186650692 188923944 189850733 189418973 187729477 184706526
16971 184706526 180838038 176302238 171441659 166572676 161807448 157205679 152660694 147992992
16963 147992992 143114156 137965632 132170535 125601773 118726581 111432980 103909453 96453870
16955 96453870 89229017 82201908 75716926 69770061 64356913 59372761 54997328 51086133
16947 51086133 47364208 43982598 40951649 38267898 35778898 33581045 31606062 29795657
16939 29795657 28081497 26562834 25083029 23685131 22497374 21435438 20328584 19297502
16931 19297502 18451676 17637019 16813799 16055538 15422280 14843027 14243587 13666022 13201449
16922 13201449 12712602 12213041 11702073 11218121 10819791 10459415 10119735 9693831 9336394
16913 9336394 9074157 8842938 8625105 8329658 8045266 7787288 7557313 7381861 7206462
16904 7206462 7042661 6868698 6679489 6440933 6180134 6092376 6030910 5861104 5690655 5657059
16894 5657059 5550611 5379309 5218009 5011606 4933290 4831648 4712292 4682101 4533879 4461517
16884 4461517 4434816 4411325 4407085 4251601 4173863 4137254 4083923 3946510 3851841 3720713 3660715
16873 3660715 3677600 3603911 3566376 3497987 3514729 3576794 3404334 3205729 3064141 3048830 3106477
16862 3106477 3181974 3149973 3082998 3018691 3096521 3208259 3152234 3122241 3106045 3040562 3054504
16851 3054504 3078100 3027880 3014296 3073056 3057968 3135384 3166351 3093308 3003105 3048865 3007529
16840 3007529 3091787 3124467 3201101 3300955 3386342 3481572 3553737 3655427 3689904 3659704 3712937
16829 3712937 3695646 3702764 3669913 3718293 3634088 3666445 3799157 3904964 4039791 4059988 3977966
16818 3977966 3845780 3728073 3624357 3635466 3636660 3482072 3327532 3350096 3341917 3224589
16808 3224589 3167990 3090053 2967566 2884499 2682944 2538982 2489991 2456970 2335186 2313306
16798 2313306 2311075 2228318 2018041 1904301 1928166 1889422 1761811 1632803 1553597 1638707 1715373
16787 1715373 1633819 1489962 1440500 1355147 1266176 1244264 1150366 1191627 1257115 1165364 1074760
16776 1074760 1031840 1043403 1115602 1070126 1077304 1002789 885757 874871 939420 898434 778558
16765 778558 778575 876506 902198 728188 707221 756480 877771 855054 779456 721209 770548 807024
16753 807024 805781 873452 922468 868754 810935 832480 796838 734198 661463 675157 701829 631091
16741 631091 709088 782099 723158 634732 597516 547412 542075 505468 545977 615785 709845 708740
16729 708740 691677 602148 647094 734984 714268 666695 600301 652140 652668 624448 612782 722626
16717 722626 578722 518261 598957 549195 547227 589261 558872 493930 554885 582343 409217
16706 409217 298617 277376 333915 401853 480368 543840 528554 361158 333260 357580 391511
16695 391511 461430 529145 545920 558362 536200 427949 406653 379548 501794 636841 553320
16684 553320 365029 402114 455402 434091 452608 501669 527483 559781 441572 377745 372375
16673 372375 315064 372840 550081 667502 654530 527202 363690 431712 543157 577989
16663 577989 619843 689383 649230 595417 536047 483338 497830 561349 493258 448101 586280
16652 586280 672057 630173 579430 426209 478900 557556 496735 442906 447848 510504 412103
16641 412103 241031 256879 348827 391745 277996 244659 148398 174618 170827 211104 316640
16630 316640 270842 139807 74459 89036 84797 71297 94473 82501 237044 209153 197558
16619 197558 166545 119358 209309 206392 210470 173646 125574 198521 261299 214656 37769 137960
16607 137960 229266 200316 172712 173926 179275 123610 33441 5127 44130 7886 73572 83233
16595 83233 138808 96458 121187 144216 167585 165500 204793 193057 242565 225853 229460 178417
16583 178417 243916 326643 291993 241830 227610 150137 185732 206755 264176 326305 302009
16572 302009 272281 169376 153782 182276 166874 239997 265294 63285 27611 37530 153679
16561 153679 272045 166909 85307 12252 -5435 49472 131950 180246 154323 192313 207212
16550 207212 253646 343124 269030 245757 315884 303441 180834 6938 21416 25336 105420
16539 105420 73098 136088 182050 234979 326391 272929 76659 11352 -23238 40947 16353
16528 16353 98314 76915 163699 225550 158103 158683 202954 233157 218014 243458 291364 169395
16516 169395 131100 122645 241742 217688 7258 -68627 -41623 64420 123168 20269 -100968
16505 -100968 -29296 139536 174522 69142 158595 260298 292048 163822 105353 116041 137910
16494 137910 119651 155027 120160 132164 192232 193553 252701 305195 250924 297698 350642 352500
16482 352500 350075 249739 243484 264767 289194 248586 237789 162543 69744 17996 102793 161630
16470 161630 153687 149377 155098 143730 130960 139050 201658 182740 296366 348828 350299 339749
16458 339749 334287 292191 268802 161430 72471 95899 133221 150953 237459 176198 164262
16447 164262 140227 168924 208748 229953 315061 292896 267234 313484 401432 443948 483954
16436 483954 455530 441874 405115 437276 526799 459422 453003 459954 501661 491155 561155 643474
16424 643474 701474 776925 868421 883012 870048 877822 858426 1013188 1072059 1043831 1018036
16413 1018036 1043972 1083299 1069855 1030420 1072020 1231472 1233244 1223325 1177420 1133681 1158068
16402 1158068 1134297 1170042 1120195 1018188 950282 935026 997040 1011191 961582 952876 906557
16391 906557 801888 714507 584634 611361 613138 535852 486685 460933 431177 502026 432483
16380 432483 344030 404350 373539 333286 362643 308310 367024 378335 234432 115856 175435
16369 175435 222689 149862 37849 -31146 72469 127118 199254 187229 198278 282638 252302
16358 252302 218590 130842 71051 13880 29153 49551 98102 228488 281838 147823 48669
16347 48669 48760 -63902 -82762 -128346 -36225 4507 -29455 -15065 93597 127806 135040 75844
16335 75844 -1917 -6145 -24705 92308 98172 148394 124988 86518 -6235 -93342 -71858 -10205
16323 -10205 -73800 -31063 -49525 63925 7006 -150956 -27438 225998 334261 224684
16313 224684 130863 70070 26523 17397 32674 -19679 41536 -104291 -75145 -32115 -7517
16302 -7517 -33439 -37841 15250 33278 5096 37257 140649 177440 147286 64873 37821 39570
16290 39570 46606 -4269 -18295 18966 64023 31704 40959 111046 68638 21881 -51887 -50922
16278 -50922 -29826 -93166 -25375 29878 83253 -34877 -170652 -241156 -146158 -93066 -63534
16267 -63534 -56123 -106079 -131691 -46655 16921 48469 39892 13772 -23508 -71445 -155920 -114626
16255 -114626 -36332 -79834 -111408 -36676 77999 85344 32183 -17701 33636 28453 119717 6539
16243 6539 -11683 -12360 18949 3017 61275 140941 186544 130472 68828 26055 75339 20977
16231 20977 86204 180756 228621 248726 135401 126852 206448 202722 40896 57921 128946 216583
16219 216583 208478 158696 180006 131199 83518 82423 82574 70171 67596 -6363 -75205 -54007
16207 -54007 -112507 -81671 -8191 42991 72326 190769 258656 264601 278150 199176 209864 180424
16195 180424 198006 142646 73346 131083 79873 57434 69300 175071 152283 85852 128888
16184 128888 185496 89333 -148767 -128860 26981 42018 59482 18310 -37319 96467 268334
16173 268334 201161 15777 -65951 -43193 -12428 -61287 -64007 -25200 13517 -8853 -13054 -51402
16161 -51402 -582 -100589 -45868 72076 80490 49686 -44169 -62495 14119 43050 3379
16150 3379 -5759 69685 149161 313032 207017 103443 3944 73867 129813 56397 2701
16139 2701 51675 85549 99941 128010 190410 214994 190836 105429 107426 103554 93151 102129
16127 102129 126958 81399 19730 -31484 -51056 -60598 36598 79063 64998 48269 88675 156334
16115 156334 89153 18905 -38398 -31255 -71859 -158357 -104844 -21872 34013 -28009 -145232
16104 -145232 -102900 -69868 -146059 -125305 -9721 53032 7608 -47079 -9494 -96859 -135877
16093 -135877 -179511 -109529 -952 -45761 -67248 -42990 -11597 11398 71861 135804 222791
16082 222791 157252 10173 -38640 9069 47772 62685 237210 211368 119621 1057 45
16071 45 -16180 -75632 -27331 -57878 -163100 -160680 -115466 -99240 -128079 -150334 -91808 -19638
16059 -19638 -53575 25281 47009 -31140 55914 36533 -125108 -184414 -149298 -21207 34273
16048 34273 58844 141780 66387 34303 -5502 -78088 -97010 -10958 -1518 -27933 -27759 -32318
16036 -32318 -25370 50072 65527 69399 17675 -60149 -125093 -60791 28886 99851 19766 -50085
16024 -50085 -55881 -15312 33132 3388 -62099 4927 169950 263632 197954 106265 96986 42510
16012 42510 64034 43564 67208 77284 146602 218215 157185 56976 -6260 -51766 -5414
16001 -5414 -5567 -55576 21883 36003 143856 189746 160422 142716 75361 -29144 13738 113
15989 113 14845 110118 271320 266516 215247 265660 248743 251746 224542 193271 93204 95815
15977 95815 156287 210708 148423 108043 182211 189832 127793 80058 128332 141509 199297 232134
15965 232134 183283 68505 8121 -75581 -155488 -190167 -166474 -76921 31189 92297 51405
15954 51405 11924 -73305 -43474 -82909 -107410 15464 89312 54375 39265 36693 -80381
15943 -80381 -139430 -54858 74776 41555 -16083 -87606 -191143 -63998 37654 98592 11781
15932 11781 -37153 33077 64183 127065 191457 128724 19533 124953 125899 121156 150994 137132
15920 137132 143387 134618 57606 75583 68915 175645 197441 106601 64691 103140 48719 -86530
15908 -86530 -74935 -114715 -82757 -73109 -70303 8055 80043 -23986 -123443 -90499 -80762 -116048
15896 -116048 -68395 -102278 -47827 -99379 -156487 -100073 -64401 -25566 -28601 -59983 -63193 -69722
15884 -69722 37075 81372 93274 -3484 -165784 -82955 -24728 -60017 -29288 -71308 -67440
15873 -67440 -84147 -104757 -108970 -105687 -37254 49112 -6754 -123756 -266930 -218456 -107785
15862 -107785 -111657 -64144 -38613 -991 92699 80440 102082 236622 275150 220670 85768
15851 85768 -55856 -28921 115021 129445 21453 -99612 -77866 -131477 -97333 -41851 -74236
15840 -74236 -121885 -161472 -151998 -119625 -12963 41370 111948 60262 -68330 -113010 -120282 -57402
15828 -57402 30053 21190 -6520 -8356 33942 8237 -47080 -63239 -65354 -128588 -126574 -9741
15816 -9741 -1368 -3858 3550 -98477 -210327 -166981 -139335 -27923 -29099 46601 26459 13872
15804 13872 44161 2867 -3231 14156 -56376 -9983 79744 189775 157464 126190 -6010
15793 -6010 -54501 -24197 77032 95704 51535 87141 101760 32413 -87169 -219857 -221210
15782 -221210 -120958 -89118 -7191 74933 45849 -34742 -109176 -169091 -156017 -86391 30837
15771 30837 75195 28768 23033 20507 -45653 -198035 -172050 -81081 -17953 43472 69462 127978
15759 127978 97852 69837 18236 -56268 -200966 -159343 -143753 -131347 -125071 -44421 -922
15748 -922 49154 8601 -10980 41539 72128 46098 108957 120038 78695 69057 106184 75971
15736 75971 4984 13914 45756 70150 -107774 -240118 -212829 -97232 -158479 -145928 -36449
15725 -36449 -4771 -51495 -161577 -84527 -26753 -26037 -44889 63180 95298 56839 -42037 -57499
15713 -57499 -34195 -9253 12551 72320 130452 175421 202355 147254 140795 45137 -33361 -101200
15701 -101200 -143192 -137866 -60919 -130038 -59674 -20069 -10256 -46825 62547 109813 154674 171884
15689 171884 112314 56981 -42860 -76795 -92712 -114691 -113557 -51622 -120943 -190564 -136205 69716
15677 69716 127284 163636 142821 114532 98327 127296 85521 14606 -9570 67785 35217 9043
15665 9043 14963 15363 16271 13848 -21421 -77753 -55228 -56929 -40330 -18609 8725 -14368 39171
15652 39171 57857 50086 -17558 44960 220362 122587 8420 1601 47581 132865 225651 150194
15640 150194 113380 59716 75213 52779 -53601 -94766 -170570 -221361 -203661 -62049 44614
15629 44614 21973 33418 -41403 5463 -4889 -22409 60769 65160 11825 -232791 -205767 -111830
15617 -111830 -75740 2324 87500 75119 -22951 -107619 -20532 36991 -31666 -42080 -89077
15606 -89077 -11531 79494 34877 37684 82913 7590 31438 78286 134078 128373 61039 124392
15594 124392 153025 56509 -166091 -159570 24343 121730 177706 150492 53028 -13290 -83344
15583 -83344 -162839 -163810 -5744 169618 185075 118213 156170 215462 209335 169039 34887 -17766
15571 -17766 2576 27140 -58305 -104577 -85528 -6326 41283 44444 77287 6607 -11929 10226
15559 10226 6151 14008 -13458 22944 65257 111040 15345 -31987 50382 20280 -36079 7673
15547 7673 70474 71791 -71537 -93360 22662 15053 22396 60391 53914 33197 -4405 88715
15535 88715 45514 -38888 -42815 1099 52308 -4454 90006 127520 18057 -62962 -12047 44199
15523 44199 25402 -17363 -95841 -146991 -42918 -24091 -5139 -111021 3588 1904 -112678
15512 -112678 -133889 -67189 -74075 -65646 -81812 -79940 -79721 -96462 -37262 976 26655 -4317
15500 -4317 -49540 -19956 49774 105271 -43018 -96073 -85011 -73012 -58179 -63938 -42775 15826
15488 15826 -4407 -25140 -45129 -44398 -155882 -140906 -49342 43231 123646 94318 -33309 -50811
15476 -50811 -29352 34467 54734 65193 -1381 36268 195096 222985 113791 94273 125974
15465 125974 95497 -21813 25119 65455 -37410 -35592 -1949 -35748 -107031 -91403 -101274
15454 -101274 -141117 -230685 -212112 -145558 -112985 -160833 -110196 -88768 -24273 -157574 -211114
15443 -211114 -207720 -62481 -37419 -61976 -70274 -59007 -94931 -50777 70180 71608 10189 -49419
15431 -49419 -159569 -105164 -71468 6122 55796 91515 131559 147150 1114 -143488 -129693
15420 -129693 -187131 -240808 -295826 -236937 -81992 -41570 -18746 -63053 -62761 -46587 -120077 -200660
15408 -200660 -216403 -245434 -66437 31381 69267 -72158 -73852 -74774 -61225 -24395 78635
15397 78635 68765 39388 104388 93162 95942 19413 -102816 -148749 -177680 -235578 -136826 -3201
15385 -3201 32448 9700 -18656 -12793 25128 -50926 -8282 29360 9015 -1370 -52534 -90646
15373 -90646 -154919 -225955 -197292 -124332 -72428 -3643 -18493 -192153 -264391 -283252 -204596
15362 -204596 -125529 -156825 -198095 -155094 -124900 -25322 66715 31775 -11298 -45915 -57386
15351 -57386 -36724 -28552 -70922 -52590 -60496 -139898 -113085 -103118 -109399 -131143 -90449 1123
15339 1123 94635 92930 36106 121 23847 -139993 -62630 -131486 -212146 -148859 -35788 90718
15327 90718 52837 47986 38413 -41264 -83751 -112066 -18665 118991 99113 -55068 -31235 38583
15315 38583 101593 197128 154195 236276 240838 142659 167047 125963 53714 -3249 -4827 753
15303 753 59793 213502 94756 22976 154131 240097 168778 132371 193473 205021 80786
15292 80786 31082 -14117 18985 96332 60518 -27294 -28992 53640 99426 107157 90634 -76025
15280 -76025 -45963 -90325 -172447 -124371 -140497 -114921 -186742 -157980 -204564 -157813 -106309 -53764
15268 -53764 -45288 13932 -16486 -18265 99661 124882 90513 84178 16560 -28670 -78372 -7330
15256 -7330 12279 1958 67267 81528 43194 82823 8749 -31094 -13368 -45075 -87549 -20375
15244 -20375 5603 -72386 -91168 -6571 16423 -23661 -93839 -106335 28488 76696 25937
15233 25937 -28761 -79625 -211216 -269293 -224559 -226354 -187479 -126421 -101319 44704 23141
15222 23141 19583 6220 19907 116966 145410 21583 -81128 -44226 -37694 -124173 -183157 -238006
15210 -238006 -172727 -80403 -90690 -9525 31267 47816 51274 -14981 -119487 -213608 -147940
15199 -147940 -49746 -24284 14699 -81115 -92345 -139318 -189810 -82656 -116327 -64600 28885
15188 28885 92739 129514 69418 -46987 -215215 -251430 -158157 -82877 -26409 -53811 -84447
15177 -84447 -32172 -90402 -160099 -130175 -53651 -7512 -45369 -97055 -78876 -160599 -163553 -104715
15165 -104715 -124768 -100015 -161588 -143815 -144764 -159458 -180383 -209012 -237837 -297246 -337221 -317815
15153 -317815 -275486 -260363 -152841 -231483 -315411 -293596 -257131 -327891 -251189 -219081 -109551
15142 -109551 -87175 -76397 -31605 15126 15122 2796 16633 58878 90765 62061 39913 45964
15130 45964 57521 15511 41402 125643 112986 17099 -30770 -72807 -195553 -165402 -37676
15119 -37676 6010 -1598 32635 -4566 19207 38950 26645 24985 -46945 -61231 -87318 -98180
15107 -98180 -159514 -139853 -138356 -153464 -125860 -79998 -80587 -177002 -207222 -196383 -125345 -82823
15095 -82823 -16323 18975 -5989 -39005 -89316 -92185 -120299 -5655 10213 9288 -36715 -40674
15083 -40674 -23045 -11207 39229 80531 -100745 -168444 -106775 -17480 -42815 -76348 -104126
15072 -104126 -80552 42884 79172 -18600 -112843 -111819 -113579 77653 138138 158071 146540
15061 146540 121918 70037 57608 12988 20379 -3931 -240 63593 2849 -1188 100540 101489
15049 101489 7331 -61732 -48381 -47216 -30983 -63605 -134671 -155332 -40645 -6700 -10787 -39765
15037 -39765 5428 36259 39910 2023 -31351 -13305 34078 54503 49752 61793 -183 -131044
15025 -131044 -187412 -89120 12385 58596 126752 59657 16025 -6923 52326 76502 174086
15014 174086 178423 99525 89338 176191 217848 215846 114554 67751 219669 333752 384370
15003 384370 373584 440220 387491 311929 429904 587839 609488 721681 899257 967725 1088203
14992 1088203 1266523 1353405 1402179 1563428 1555217 1464994 1307151 1275500 1269653 1179626 1068971
14981 1068971 1021046 834957 752514 619914 469924 467135 455414 316281 322725 327365 394467
14970 394467 336186 268754 211468 124096 12368 -76391 -25822 -14290 68132 131775 182690
14959 182690 147248 33607 -20269 -26853 -15913 65489 56045 69811 -847 -129851 -112778
14948 -112778 -130895 -89861 -47986 21922 102192 132703 37908 3044 10509 23809 65974 89505
14936 89505 65620 51714 78251 187398 173193 226127 250687 247563 223159 173131 157539 149177
14924 149177 11820 -83971 -57129 -70863 -107195 -62000 31807 12802 47217 9819 116057
14913 116057 143026 184966 101457 79603 69597 97405 151545 197999 76864 -88122 -164289
14902 -164289 -173117 -55571 120601 203268 77147 32280 -766 -21148 -40094 -19450 35335
14891 35335 4682 52663 89067 8467 -45063 11565 -1052 83977 155473 51076 -54162
14880 -54162 -18030 61327 24201 74057 60045 46252 -38012 -123623 -100478 -50778 -29443 -85167
14868 -85167 -71455 -60481 -75771 -84005 -76201 -14911 15239 -23022 -63896 -79412 8942 293
14856 293 -108537 -130611 -125528 -172783 -149038 -63993 -20791 160777 238865 141035 9355 -45329
14844 -45329 -48659 40656 67676 109991 95574 28760 -130536 -145576 -176393 -175891 -184899 -79729
14832 -79729 -4487 38233 41766 45000 -40157 -65606 -111947 -221068 -168218 -26998 67840 108200
14820 108200 16134 -16771 -90301 -105598 8972 115511 71666 -12895 94165 82766 23300
14809 23300 -127262 -153108 -168724 -25788 17801 11535 14646 52960 34774 -45555 -17465 -44576
14797 -44576 -147397 -151044 -46730 -4021 -60405 -31561 69856 76065 50681 53315 10685 -50610
14785 -50610 -105161 16926 81259 2963 -113728 38992 84636 77394 -41111 -13867 56431
14774 56431 79827 50290 27770 -29036 22457 79983 45986 -3633 48849 12317 -43443 -82198
14762 -82198 32879 36461 77283 73879 62764 30151 -55387 1963 62521 -46560 -27364 -50667
14750 -50667 -75430 -133472 -155823 -109591 19701 38701 -1591 12862 -40586 -47410 -35227 -76365
14738 -76365 70354 34619 -59221 -119155 -142333 -203299 -92504 30667 23818 1533 -22549
14727 -22549 -11654 -9761 27307 -19505 29075 36303 37201 55259 -28187 -202851 -168142 -120340
14715 -120340 -142885 -75417 105636 193902 174511 84833 13480 9905 -36914 -89425 -167169
14704 -167169 -44467 28095 -41843 -95473 -112116 -113657 -162826 -209780 -184033 -239208 -210949
14693 -210949 -120549 -73415 -71159 -115669 -176957 -202238 -105772 -30544 19282 -109756 -162950
14682 -162950 -201031 -268914 -275426 -134566 18446 101490 157735 91540 49000 -42016 -73374
14671 -73374 -163717 -77738 22566 63454 116652 69074 84826 81884 -21706 -84516 12437
14660 12437 11601 -61842 -180462 -222694 -124218 38061 74354 -10381 -156126 -106438 -107104 -75556
14648 -75556 -127990 -144197 -85828 6700 741 -70024 -122216 -126490 -127713 -83080 -82162 -84967 -35273
14635 -35273 1408 -29429 -30104 87161 128859 161435 95339 -22065 -62263 -97619 -207317
14624 -207317 -126113 -100672 -54274 -84346 -97531 -29363 -64341 21809 -25936 -6203 2512 67659
14612 67659 49441 8089 -24666 -73048 -6317 -105993 -107823 -50937 16706 62447 122398 97775
14600 97775 -29995 -91761 -78454 -7714 3381 -69235 -161795 -98343 20006 -23714 -141767
14589 -141767 -111476 -1435 57670 40716 -72250 -35481 43528 28232 53631 -26335 -41544
14578 -41544 -64824 -125253 -78253 -41858 32943 132121 53555 24663 37558 76130 -11726 -23887
14566 -23887 38488 135774 155748 71772 143010 178750 106337 -34229 -81445 -577 -33997
14555 -33997 -96220 -31426 -89947 -104811 -121606 -77375 -69723 -142111 -143908 -156221 -179612 -152903
14543 -152903 -118545 -122526 -136639 -189175 -307563 -293634 -89485 -17843 -45563 -5738 34786
14532 34786 -3005 -128431 -127117 -11042 33957 45143 17177 8516 -95455 -99340 -80659 -91454
14520 -91454 -83372 -64791 -153978 -177728 -187342 -125824 -112009 -18553 119065 69889 37367 103927
14508 103927 132553 106273 111559 66663 7901 39566 71723 118772 214419 140795 99398 54796
14496 54796 -53988 -46505 -56437 5519 -40964 -47279 20744 -41391 -103964 -129304 -177284 -128513
14484 -128513 -17123 31176 -6304 28138 -5174 -33598 -31853 6843 71328 153191 127504
14473 127504 44195 -55834 -113661 -44261 -137189 -229599 -204086 -156079 -45029 -9351 13625
14462 13625 85042 53785 25174 120045 89128 95849 54887 -47488 -109826 -135344 -88455 -129576
14450 -129576 -235210 -253617 -121136 -25697 23858 43143 -3162 4169 14551 60925 89491
14439 89491 81804 71838 -25599 42243 87927 26090 7170 31995 92509 -43244 -72888 49916
14427 49916 5239 -65397 -5046 137086 29078 -83366 -215206 -236113 -267667 -227147 -167651
14416 -167651 -90565 -48215 -43 44814 66233 104682 10278 -75427 -44041 -31011 -35913 115452
14404 115452 129696 90113 101497 166164 302442 243237 -31064 -99647 -60240 -30485 -72067
14393 -72067 -67615 -49909 -42085 -6225 24170 66242 81321 42433 -26450 22838 41351 32275
14381 32275 -66395 -201244 -260891 -154392 -94312 22662 57042 63682 141619 195260 193943
14370 193943 137780 9565 -51510 9852 3696 -159950 -284702 -262169 -166135 -120785 -169351
14359 -169351 -152099 -179841 -25121 11710 52880 38408 58765 11031 -22268 -39930 -34085
14348 -34085 -68932 -151671 -175576 -220051 -233965 -153152 -64614 -19061 -53474 -80751 -101957 -86493
14336 -86493 -82690 -33571 -42255 -50546 -94569 -73736 19585 -31254 -144091 -173808 -122725 -96586
14324 -96586 -5072 -31915 -38244 -72483 -188223 -227002 -171988 -51631 -3566 164880 85845
14313 85845 -53105 -88320 -88765 -112832 -65652 7907 -105816 -215677 -207290 -106194 -28949
14302 -28949 -54014 -25749 -34091 -81260 -171231 -211940 -169461 -78366 -77505 -127089 -87256 -73345
14290 -73345 -70016 -43434 -100837 -181771 -186017 -149058 -46181 -55785 -14927 60517 55736 -36785
14278 -36785 -36647 33041 10651 -12248 -51354 -15164 -11663 -160873 -276963 -310428 -162817 -160269
14266 -160269 -113734 -52264 -21077 -45269 -112305 -69949 -159081 -177881 -187507 -163265 -39765
14255 -39765 -60403 -141729 -120598 -54779 25182 126423 67526 -82661 -121014 -146383 -213870
14244 -213870 -169008 -14619 38548 40829 -65314 -48062 -128949 -134036 1746 50367 32070
14233 32070 -133636 -12309 114150 159111 79878 83520 -78600 -87362 -127491 -201705 -172656
14222 -172656 -124434 -85963 -81439 -65166 -48814 -42256 -51110 -68844 -52846 -94660 -94199 34876
14210 34876 139072 174342 164582 205936 203872 191523 95697 -7635 -130867 -183107 -151242
14199 -151242 -81007 -33145 -5651 -34523 -42025 -44258 -104062 -114098 -49858 -51504 -61747 -104687
14187 -104687 -41803 34237 86907 121728 -1157 37367 109167 -34071 -42143 -7902 -21562
14176 -21562 -80361 -116397 -81238 -82701 -115596 -94723 -202711 -44891 72030 62517 -72220
14165 -72220 -128515 -206210 -213876 -159701 -80970 -48540 -70868 -11410 64766 101113 102113 183369
14153 183369 105745 -109533 -140217 -7570 28220 12461 -131807 -262005 -254336 -159013 -129624
14142 -129624 -45283 20850 -6870 -31480 28575 145748 73032 81149 6512 -33614 -48366
14131 -48366 -101068 -68850 29365 108592 75145 67413 186986 137823 149967 97638 -38024
14120 -38024 -57577 -7866 -60529 -97658 -39744 -40330 -37854 -89167 -111383 -51302 -103756 -91271
14108 -91271 -125750 -133889 -86145 -19152 -30527 -41969 -43375 -83704 -121619 -132991 -75922 -51357
14096 -51357 -16190 29456 100258 105339 104780 22954 -51660 -93969 -140365 -84413 -121283 -179869
14084 -179869 -218168 -135388 -65623 16589 43447 153291 199413 224852 31498 -186733 -207229
14073 -207229 -17060 -32982 -47756 -116530 -264371 -233531 -126484 -134258 -155109 -219985 -195050
14062 -195050 -161889 -15198 19298 20030 108170 181523 137837 80792 58936 34485 89842 144457
14050 144457 77601 69420 146615 214385 178973 86717 43113 -37065 -129499 -63329 -140559 -173329
14038 -173329 -213633 -152986 -73940 -27365 11900 86373 47076 -1824 -36196 -68973 -82596
14027 -82596 -35169 -21943 -28153 -26815 -138088 -184205 -95110 -73697 12616 108895 227711 180755
14015 180755 38883 24632 22935 30303 -11311 -37578 -86819 -47493 -134150 -118828 -127919 -175219
14003 -175219 -222368 -191981 -92263 -96215 -72501 -42773 -33137 -85566 -8297 -100260 -169414 -114671
13991 -114671 -105254 -80929 -6501 38114 84395 37356 843 78483 37921 37554 143906 144923
13979 144923 82284 21415 33750 26070 168451 63620 -41444 -19028 11939 23336 10275
13968 10275 62772 -52251 -190172 -132298 -82664 -95278 -86632 21414 70216 2138 -110623
13957 -110623 -50706 -43341 -12236 -51966 -53920 20725 5790 9423 64132 18974 -75732 -33104
13945 -33104 -7734 53528 -24559 -89019 -113235 -79876 49372 -115432 -176601 -134916 -78268
13934 -78268 -117668 -142405 -240152 -257182 -228548 -218740 -250899 -169131 -131286 -52323 -32626 7191
13922 7191 52413 23679 -27180 -150513 -76494 -16293 -6118 -28869 -41488 -91475 -84828 -34441
13910 -34441 -29171 -1006 7009 35288 72021 165482 51682 -56311 -45102 -45309 67026 57915
13898 57915 -7107 -69390 -116360 -140876 -217931 -223208 -164532 -117744 -102830 -52126 -3500 -15743
13886 -15743 -11130 53015 63798 29001 39694 -21856 -41043 -39822 -82748 -127129 -152984 -149841
13874 -149841 -148719 -112249 -150527 -99535 -78479 -138907 -107763 -55688 -82012 -182471 -104066
13863 -104066 -25999 26007 -23611 -88901 20491 188981 72845 -99361 -168775 -152917 -140597
13852 -140597 -17446 60452 83110 72665 142610 194664 89827 -38821 -155189 -188718 -144619
13841 -144619 -122774 -115488 -33563 30985 -19452 -63098 -109709 -96728 34596 69896 -7875
13830 -7875 -45995 -102562 -130837 -31355 25629 -85529 -103099 -47698 -28039 -117361 -222886
13819 -222886 -289636 -241252 -126032 -75611 -59316 -48426 -109923 -75918 26521 65776 113681
13808 113681 67119 110346 108641 103933 31292 -29740 -17987 18999 -4241 17039 -1089 4755
13796 4755 -111397 -149166 -2838 148552 207677 178322 118898 129054 119316 62629 45720
13785 45720 69454 41918 -29161 -51766 -121604 -136382 -131113 -195385 -222576 -147408 -139634 25170
13773 25170 86970 32283 4130 -111167 -183622 -193539 -115154 -75609 -33259 -569 -55902 -71181
13761 -71181 -125248 -162914 -97212 -65846 -53761 -138666 -165254 -89973 -36795 -101988 -154674 -204590
13749 -204590 -229371 -238127 -235232 -56192 7319 67547 78350 68459 46066 54146 83048 101748
13737 101748 136160 204225 189212 173250 123408 34443 33974 92334 47562 85551 54355 32027
13725 32027 -44682 -137142 -109354 -58394 -5558 16760 24293 -121097 -178487 -97830 -126278 -216295
13713 -216295 -150728 -1270 72176 96468 55586 71873 34653 36509 68556 89994 99267 44677
13701 44677 -47978 -127078 -94841 -26577 -115455 -288218 -360627 -305912 -141587 -20088 -27549
13690 -27549 -80422 -91756 -165136 -190052 -122875 -69221 -87423 -106283 -51469 -1876 5467 -7204
13678 -7204 40076 111397 -17932 -58147 -56395 11191 -59834 -4682 -53309 -67214 -75973 -91100
13666 -91100 -98743 -136512 -123691 -80889 -34113 122288 101941 -37012 -109750 -204722 -281254
13655 -281254 -90323 60157 50868 73589 6084 -57222 -126721 -76867 -35021 -85996 -41997
13644 -41997 -79707 -83149 427 65564 100292 178845 230048 210584 166553 13458 -9594 -89120
13632 -89120 -99718 -767 83576 111740 58454 17203 32434 -22546 -133405 -45071 26196
13621 26196 -18987 36329 -8357 -15977 -101473 -87115 -113522 -37817 -67308 -122306 -99548 -128527
13609 -128527 -63747 -69281 -12592 56077 -93105 -116714 -42961 41808 -35029 -87114 -174472
13598 -174472 -219495 -64064 -74672 -184807 -175614 -72715 -36379 8503 1661 -11735 -12227 -15099
13586 -15099 -101030 -146589 -119919 -152853 -155230 -97559 -115382 -35524 25319 47438 77015 90553
13574 90553 53662 22979 -61145 -88204 -25049 -51343 -162546 -168282 -116680 -110524 -19849 -43579
13562 -43579 54882 53753 45773 85471 165767 192685 57536 -98698 -119230 -193353 -83358
13551 -83358 44738 626 -75025 -120789 -93548 -37839 -65635 -96332 -63622 28930 143859
13540 143859 289357 278772 203682 250735 176420 45763 9341 -36768 -9268 -515 22227
13529 22227 92802 40797 2010 31710 -30261 -89646 -116419 48776 125925 74871 24804
13518 24804 150901 209887 136645 66987 17365 41673 9535 1880 -33258 40624 28355 -3524
13506 -3524 -7510 3461 -14665 -4625 7030 -18820 35591 77960 102513 47981 104673 113077
13494 113077 89533 117386 -38406 -70726 -23678 -19394 57862 41182 -38750 -108147 -162
13483 -162 1338 -7359 -4879 6027 1591 -71440 -60751 -25124 -47783 -167379 -284863 -280323 -276577
13470 -276577 -309939 -170981 -124749 -126156 -115076 -57223 -55984 -76144 -27500 -20977 2974 -22273
13458 -22273 -41435 -41075 -66579 -14598 9231 42591 38546 18965 -11209 65843 117357 188602
13446 188602 217968 253363 201887 186630 158900 130931 102714 22789 58987 78289 67374
13435 67374 47420 74966 41817 142031 111385 4717 64661 86093 -17106 -72709 -67037
13424 -67037 -62114 -84113 -919 -24112 -65649 -24796 54521 -1976 -152817 -119440 -70484 -52432
13412 -52432 44511 41840 83590 95656 24398 15796 7424 36299 -45065 -103858 -39873 39211
13400 39211 -45514 -9245 -1134 -48231 65146 108740 11767 483 101995 63039 51434
13389 51434 -51230 -45890 8055 -57372 -95561 -63791 9319 -32248 8925 -21824 -89275 -61057
13377 -61057 -34211 -56922 -133131 -141048 -132471 -35776 39483 -5800 -23253 28686 94708 233715
13365 233715 210817 206853 121098 83831 36637 16224 -76437 -136673 -156630 -130313 -233998
13354 -233998 -260240 -209255 -98786 -86029 -76362 -83551 -47898 -20759 -76992 -64263 -20778 -42044
13342 -42044 -84156 -110346 -68935 -137663 -72109 -23458 -63716 43551 98202 -32308 -126008
13331 -126008 -148703 -192814 -48943 -152336 -263372 -225247 -158710 -112089 -65218 -56876 -27683
13320 -27683 33765 -11068 -189951 -197397 -142881 -60898 -88825 -110320 -36014 -98917 -93277 -34978
13308 -34978 -10465 -53089 -54491 -21989 -17898 -15949 -21007 23279 107531 69890 56531 156935
13296 156935 129835 65048 139689 82388 14576 32527 -48398 -137471 -79192 -150838 -165614
13285 -165614 -151830 -81046 -39900 9271 -55801 -65791 -72729 -85462 -56453 -170479 -146618 -52086
13273 -52086 27274 -10896 -4156 -1533 19807 36327 -22862 -116204 -47740 49827 22861 45616
13261 45616 109332 105328 121815 66013 96188 46330 -31925 1082 3520 -15461 -65127 -234239
13249 -234239 -287684 -235195 -26883 95069 81345 10241 -27249 -51127 -121145 -171694 -120646
13238 -120646 -68934 -100410 -59163 -106512 -138992 -112224 -100200 -139050 -123340 -192978 -158005
13227 -158005 -39178 -4134 -6082 21734 5808 24569 154343 118792 127511 255286 234094
13216 234094 230347 260348 127821 51746 8496 -13141 49129 197469 262671 260618 219261
13205 219261 149499 186829 154659 101812 52874 38784 114908 166277 180075 133965 6905
13194 6905 -131053 -129424 -162654 -233593 -229606 -244283 -243661 -119423 -131481 -112436 22577 136449
13182 136449 191833 233374 169889 2340 -92773 -51099 -119581 -129940 -49316 -44487 -143530
13171 -143530 -236463 -212426 -150144 -159049 -168576 -157956 -74628 -138464 -72893 -10763 -30447 -32210
13159 -32210 -56063 -75455 -57655 66233 179916 135166 42079 42629 19573 8797 141368
13148 141368 222449 202176 144963 -40189 -112294 -104360 -59089 66281 95648 59785 24665
13137 24665 -45284 -52465 -85830 -93909 -91529 -156063 -245607 -265446 -73749 81999 78078 7843
13125 7843 -53575 -45516 -94480 -46890 -20439 38969 -4919 -112426 -33760 -55355 -190381 -115391
13113 -115391 -31898 -127391 -74149 3015 25707 47682 24109 -41537 -120881 -122864 -71587 -142503
13101 -142503 -154078 -122414 -74961 -104785 6149 104132 19943 -71920 -28395 23807 46961
13090 46961 4656 -47281 -90393 -146661 -218567 -179990 -212492 -171666 -143941 -153885 -17701 61247
13078 61247 24507 -18541 3543 33842 -133700 -188368 -175305 -133255 32436 -33816 -35362
13067 -35362 23170 54270 18744 5138 41467 -707 -36518 -73970 -187648 -239952 -167170
13056 -167170 -126582 -80371 13679 -48754 -89377 -69002 -104731 -134032 -44434 -3439 -57617
13045 -57617 -142487 -110642 50121 66931 -73443 -96619 -6918 85079 51000 -21790 -61090
13034 -61090 5012 92879 66902 112294 91213 13295 -19705 -1910 43082 29494 34918 35432
13022 35432 39638 -14490 -2446 31488 -29015 -22141 19195 28245 -27366 -6638 -38200 -51166
13010 -51166 -27838 -137723 -36736 -33787 -208231 -188930 -201135 -158329 -20805 7122 88103
12999 88103 4319 -96396 -63544 -1596 76055 121858 97027 100982 167669 103315 18
12988 18 -103119 -126346 -236193 -323307 -278624 -212312 -13912 67289 18763 13985 15251 62546
12976 62546 174532 149162 191319 178666 132276 117089 67767 78256 76652 242883 255148
12965 255148 207493 213208 175940 115743 74510 36390 137 -84470 -5483 111031 74660
12954 74660 -2699 -101909 -96194 -103417 -170485 -204879 -157316 -184081 -80619 -94217 -171425 -111183
12942 -111183 -107394 -63509 -39979 -21321 26547 24912 37556 10022 16399 71449 34196 62457
12930 62457 49892 37483 29774 34492 76899 95875 48850 31561 108417 102982 85283 85575 17796
12917 17796 -3272 -2332 -41470 -143023 -137556 -118178 -121449 -69803 26953 106252 69755 8813
12905 8813 -104904 -141637 -158966 -183540 -234719 -286977 -214255 -45916 92475 157136 144235
12894 144235 132733 170412 195788 139891 98236 13762 -46401 -18240 68562 26444 -76657
12883 -76657 -94613 -90731 -102100 -61647 -135614 -166434 -142809 -79022 17674 121912 17025
12872 17025 -86861 -6474 50018 59705 -4359 42873 73414 72313 48640 44779 -6454 15179
12860 15179 110307 69620 59613 46996 26204 61156 65117 12984 -19963 79672 201244 111141
12848 111141 101538 27858 -103578 -84591 79820 50658 -20924 -117285 -88445 -63257 -48364
12837 -48364 19688 82886 88619 112953 228942 203197 92798 63895 142566 96479 12104
12826 12104 -34321 -54366 -156254 -300390 -180227 -32639 69555 110689 199658 115578 -10598
12815 -10598 11033 13197 -39387 -84338 -84505 21604 2734 29063 35061 1502 -47667 -31075
12803 -31075 -121187 -176202 -149745 20638 35297 -58773 -78866 -30354 -24472 -10821 -17430 -30150
12791 -30150 -39245 -86357 -131714 -205813 -96720 32023 92268 105439 32513 60344 17784
12780 17784 80037 50010 10583 16417 71858 94129 56241 18335 56235 63139 114163 122368
12768 122368 59489 52421 80681 63589 168287 132608 23715 -26662 14768 15537 77831 81077
12756 81077 44191 47944 -59012 -80405 -66431 -120447 -146533 -187597 -228525 -35512 28541
12745 28541 128211 102950 58176 34662 -19518 -98025 -136875 -72362 -39120 -10318 68942 106153
12733 106153 118421 48071 -17459 -23409 -15762 -13823 -66082 -44622 16986 28477 -62727 -6815
12721 -6815 112651 92270 130331 192513 293722 232614 168317 48814 54753 143397 88808
12710 88808 -93330 -168501 -28912 13351 128112 22026 11526 38974 1947 -28709 -6263
12699 -6263 -32245 -59028 13968 -82697 -188261 -145070 -130728 -152402 -128524 -69861 -13972 78720
12687 78720 66524 78037 160557 110179 61864 78029 -4075 -96385 -9006 31532 -24663 -1897
12675 -1897 -25527 15997 62239 114213 184328 109207 46260 65128 70984 91589 13825 -46830
12663 -46830 -51284 -93597 -87962 54615 69302 71549 64507 12490 -66361 -61232 -21944 -25172 26540
12650 26540 28669 -1697 19518 65534 119185 95839 30581 22296 -55132 -156394 -116335 -127059
12638 -127059 -190059 -215256 -117092 47654 139926 121601 75952 36630 26702 98166 152937
12627 152937 138824 66910 -47842 -99258 -94452 -49143 -93547 -44598 78329 84544 -6698
12616 -6698 7412 59216 37295 -23276 9272 -23478 89018 97689 90330 -11679 58739 103887
12604 103887 184127 192452 171244 111687 128210 109288 68380 50483 21025 -36226 -63832 -55573
12592 -55573 -29267 -112426 -140845 -65056 -95331 -109662 -112848 35123 87767 31649 67887 79878
12580 79878 37736 31584 129350 175080 278627 261158 211863 162942 117765 -47678 27904
12569 27904 81486 52469 41649 97136 162319 215120 263165 202503 131675 154346 202738 184174
12557 184174 231785 280687 314189 290017 288307 316951 406330 409713 431401 408803 423263 445526
12545 445526 364910 414811 437306 470850 627306 758942 792535 787373 783262 890287 931284
12534 931284 920098 949315 1039791 1100143 1247486 1429063 1571747 1727986 1805319 1864965 2021089
12523 2021089 2271480 2383083 2490469 2765048 3006094 3395746 3875425 4311464 4682643
12514 4682643 5184889 5828268 6587045 7302759 7911799 8608327 9335458 10101924 10805603
12505 10805603 11234670 11416689 11498595 11457551 11098085 10495977 9684660 8952676 8269233 7516675
12495 7516675 6751110 6085885 5522002 5060814 4545523 4212576 3920223 3593104 3248851
12486 3248851 2944500 2771279 2544803 2415563 2193791 1986416 1874914 1798386 1733718 1645393
12476 1645393 1608351 1512707 1480968 1398180 1361477 1263540 1241924 1238957 1119757 878536 863749
12465 863749 902854 910106 858127 852830 822567 794725 716795 711902 664355 574322 461246 459738
12453 459738 434289 475141 461152 380851 334230 322467 362033 341565 296649 179482 289157
12442 289157 395730 443275 369438 236331 191726 121122 89510 147071 235343 226908 260328
12431 260328 225628 255897 238660 275367 327821 196629 137965 130846 142077 244938 266080
12420 266080 318962 281888 192073 110705 -9507 -98060 -77835 -8343 -27271 73831 108661
12409 108661 9986 85474 166094 164067 156029 157273 149000 90287 49962 -10691 -5460 42816
12397 42816 -7627 33739 -22345 -23053 -4759 -68135 6364 102540 101130 91366 154658 276438
12385 276438 206931 136444 147765 118262 4400 106938 132556 132000 118008 -13603 -73796
12374 -73796 -11865 81425 145034 259408 250313 218789 63018 29539 80155 66521 46230
12363 46230 72635 102027 -4328 -28952 100312 114657 107975 214941 269270 203741 214664
12352 214664 112474 68965 51111 40415 -72022 -18208 76598 47919 87264 125050 63998
12341 63998 27349 4735 60837 79408 110604 99081 111056 125538 262271 191185 93210
12330 93210 44730 121295 -1299 -108698 -114205 -159028 -106512 -72339 79033 124121 163534
12319 163534 47850 18755 31143 49627 163912 194083 51004 -52160 -197586 -215539
12309 -215539 -144914 -16598 29256 70167 52472 38646 3086 -38615 -83669 -81790 -66455
12298 -66455 -37653 -1669 85627 197470 212649 183994 46866 -27980 77290 227676 263352
12287 263352 274757 233697 173405 157614 179640 224283 163555 90207 9810 54883 33360
12276 33360 21046 -55772 -28357 -150451 -50938 65095 -1882 -16995 -2925 -17826 -49335
12265 -49335 -5266 27185 58391 111486 99092 118847 83194 110779 110664 -5313 16961 388
12253 388 -96030 -96759 -84072 -36922 -26681 -2703 135804 134604 195868 156278 125288 148519
12241 148519 92589 9296 14787 23762 9877 50770 189273 191491 100019 206557 212897 138206
12229 138206 132132 127369 55729 -4231 -21400 9994 -110111 -43810 -52220 -110975 -57336 49988
12217 49988 103456 21375 -20069 -19847 30591 57177 -19083 -35854 67761 89255 38136 12286
12205 12286 107619 171611 178084 140759 172978 90784 52165 4718 -69827 -132959 -126214 -97523
12193 -97523 24328 66813 74108 40588 24676 147743 106382 27333 87824 161036 147773
12182 147773 90835 43887 89503 105585 23097 -5985 -24498 1526 37443 45382 9581 38575
12170 38575 120946 117505 66154 32442 61140 -12042 -5564 112967 102852 83271 -10054 -88702
12158 -88702 -122545 37148 94873 36950 65425 60441 123448 101787 86717 -5115 -57451 -56313
12146 -56313 -25495 18776 63186 14270 91518 115400 91282 90650 90694 128989 138331 162446 142236
12133 142236 107303 -16123 -47340 44133 167638 123750 15427 -2914 8915 17570 55941
12122 55941 21640 20431 -75396 -70041 -50951 -4941 -16298 -24578 -50193 130556 187403 141499
12110 141499 49495 -107032 -144414 -98957 49631 72519 67151 98856 37967 -10722 -108400
12099 -108400 -177446 -200412 -62818 84618 -14859 -143780 -191669 -174783 -25681 9746 -31908
12088 -31908 -159907 -206841 -104123 64642 9916 29742 47016 69561 50633 113923 153623
12077 153623 205933 206481 148951 187250 254683 123979 31197 -55873 17718 12303 -19955 86757
12065 86757 134224 155399 125578 43187 -7034 -59457 -31290 -83954 -24810 -19489 -42186 95844
12053 95844 177269 197880 104862 59255 114303 67577 79590 67992 57842 132012 229568 198492
12041 198492 122957 69983 40616 20864 22532 21549 24222 68470 42084 8716 62164 81286
12029 81286 89603 22479 -84300 -98231 -96755 -75715 -144579 -76611 -40798 -60744 -42301 43772
12017 43772 122504 203192 156480 140199 155701 23104 -51236 -66235 -91246 4517 -13680
12006 -13680 674 65181 42380 -28729 -54912 -131349 -206433 -244505 -193879 28234 175748
11995 175748 52958 56135 141609 105453 76577 65262 16473 65618 78736 -47361 -110269
11984 -110269 -60147 64010 47900 164862 266991 188845 91887 1397 74895 -24412 -61737
11973 -61737 -45896 -49112 -6940 27543 -36368 -70378 -23801 81570 98975 77753 116501 171102
11961 171102 188590 175974 41705 -79798 -114996 -129196 -48629 -34631 -42705 -142222 -79320
11950 -79320 17235 64176 63936 56873 114265 108331 135986 40706 -21853 -119869 -166525 -132140
11938 -132140 -21927 131371 187847 144224 146962 58085 -905 -79163 -85981 -19942 54845
11927 54845 149714 64862 35645 111490 61442 26511 51318 -56501 -33682 -23234 -124893
11916 -124893 -147321 -19345 59141 -40066 -61768 -27127 -9799 -6194 140012 170121 63624
11905 63624 -20518 -65451 -130907 -82311 -150337 -257127 -246664 -174002 -138355 -105754 -115896
11894 -115896 -137968 -186686 -127700 -71922 -70412 -75149 -103800 -97592 -9989 -20491 -60529 -126793
11882 -126793 -162337 -111201 -62250 18126 73994 20277 -79011 -121726 -69725 -73449 -60126 -72327
11870 -72327 67917 57722 -18286 -70601 -82485 -98312 -98957 -178537 -216871 -172523 -215811 -267268
11858 -267268 -245726 -187013 -120277 -80321 -131580 -147188 -105234 -39150 17625 -32963 -15924
11847 -15924 19151 -32281 -7674 -4052 -111552 -218834 -220889 -147431 -155123 -173736 27264 51660
11835 51660 -490 31678 22204 44302 -7946 -95634 -97979 -136710 -195986 -146965 -100541 -133233
11823 -133233 -46563 59698 -9458 -156222 -170189 -149968 -127193 -114268 -125617 -116655 -26840
11812 -26840 -27062 18117 103658 85249 -19337 78603 124855 115442 14382 -21156 -75275 -165
11800 -165 74351 113474 62196 -23670 -47888 -116878 -47874 -93761 -89686 -134495 -78922 -20798
11788 -20798 -189308 -243501 -201109 -126220 -60825 13244 38614 -48847 -99535 -13011 35900
11777 35900 -35056 -28377 -591 -56508 -30146 6771 -41429 55269 101284 113821 63682 8176
11765 8176 -15932 -12793 -42898 -91053 -120366 -55185 29077 -49875 -108167 -167684 -109286 -84955
11753 -84955 -43042 -12661 -55700 39563 55337 51131 72357 -4408 21638 104872 104360 52916
11741 52916 -4433 -24697 -71008 -43832 -84977 -100307 1596 40251 4507 23800 -18863
11730 -18863 -117965 -79465 -68731 -129747 -45984 19624 24577 -24912 -34411 -143558 -84032 68390
11718 68390 128925 57466 -5013 -52940 -24354 47386 60671 48439 108411 110523 49762 -11142
11706 -11142 -72224 -82577 -94341 23285 75415 39697 93730 205417 140209 24597 -43400
11695 -43400 -43275 49298 105994 42537 -84381 -169373 -135857 -178777 -43019 92725 -6767
11684 -6767 -171081 -87383 79869 16818 -102254 -58195 14336 10074 -4503 -64400 -5516
11673 -5516 77171 43631 -107617 -261457 -199084 -122569 -59322 6189 88315 57238 -114909
11662 -114909 -183693 -192348 -137861 -114874 -96213 -36893 35513 -57805 -100897 -112159 -76562 -51635
11650 -51635 -102411 -102382 -205645 -189157 -91687 -116164 -161672 -109478 -66511 -438 -14663 -124860
11638 -124860 -184592 -165969 -155543 -83584 -107475 -126237 -33850 -2327 -81079 -122120 -37708
11627 -37708 57957 696 -33323 -15314 -6388 48526 -2953 -131378 -224917 -220935 -139183 -149110
11615 -149110 -179420 -194864 -30406 95632 99762 21397 -30190 -42770 -21145 -8092 13828
11604 13828 36202 -48225 -124266 -22474 -71842 -116088 -101168 -72216 40098 46925 78333
11593 78333 99094 62352 6257 -75411 -95704 -52308 22310 46153 57205 96593 75726 -17324
11581 -17324 -60178 -116157 -103361 -19954 -55245 -82741 -101286 -128257 -16009 17258 -11942
11570 -11942 85753 134594 101198 -17644 19181 19828 -38053 -30926 82749 65751 -74111 -202016
11558 -202016 -270446 -220289 -146968 -27750 -26193 -117649 -141161 -74786 -2014 -36238 -151024
11547 -151024 -194507 -202768 -230958 -233706 -218707 -111888 3050 -55732 -84946 -131795 -122019 -59002
11535 -59002 -30810 -2598 15921 37271 -63050 12704 22208 52470 93315 43046 -56719 -81938
11523 -81938 -123599 -119473 -64716 -43274 -83890 -23755 -5039 129571 41509 -36423 5945 14443
11511 14443 17670 107842 165718 78840 -31998 -55819 -4212 -65462 -53428 54091 -35481
11500 -35481 -48153 64728 -56804 -115749 -223605 -222122 -177788 -229424 -198475 -213318 -162399
11489 -162399 -160259 -184818 -242041 -297839 -300196 -207752 -160636 -91511 -42833 -64184 -98423 -54289
11477 -54289 -84421 -81916 -109379 -81814 -95056 -118695 -88613 -88200 -114488 -115073 -68387 12942 84273
11464 84273 87736 94759 57393 55737 139722 129471 153348 -93683 -104607 65415 127672 86286
11452 86286 7628 -90350 -108718 -19945 -29298 -56510 -48408 57470 120979 101262 23274 -47275
11440 -47275 -22898 -37164 -130287 -138417 -15048 11381 -91177 -137082 -166144 -124023 -65100
11429 -65100 -62273 61816 129198 -8077 -45315 -75716 -108403 -97833 -73255 -62420 -148786
11418 -148786 -150444 -50524 -70443 11389 -34423 -107281 -113188 -64278 -51252 -71751 -6536 8021
11406 8021 -75633 -159054 -208199 -219787 -175367 -135451 -92720 -6315 -30181 -28401 6240 4405
11394 4405 -13851 7739 159 15961 -9327 39530 -46753 -141064 -119893 -87663 -235946 -213014
11382 -213014 -247613 -218399 -117358 -45625 -38421 -156560 -158156 -201825 -147220 -41255 -65761
11371 -65761 -93783 -122011 -71970 -34647 -147605 -252537 -203683 -47203 69105 81285 54539
11360 54539 56295 -25616 -78554 -68413 -84662 -119690 -141765 -10212 -22331 -145121 -161355
11349 -161355 -109130 -32960 -53499 -30780 964 -26999 13075 38171 -160063 -225845 -139993
11338 -139993 -68249 -16766 24327 16932 83415 -3965 -73491 -45293 -21031 4661 -99266
11327 -99266 -119110 -106773 -121133 -126651 -79229 -69877 -26897 -33983 -84805 -146899 -81214 -63268
11315 -63268 -76534 77702 82749 72334 6900 -53446 -48394 -90689 -92055 -92239 -150457 -194909
11303 -194909 -152625 -94112 -107052 -83260 -33326 7084 40944 71473 7418 -28227 -95283
11292 -95283 -140283 -115032 -139726 -117537 -38682 56528 68252 41017 14550 39164 53520 63349
11280 63349 -27818 -92130 -31201 96878 24838 18817 109356 21559 -74758 -138601 -198700 -194980
11268 -194980 -164191 -189835 -218284 -163598 -140124 -118841 -67652 50619 -28261 -18966 50051
11257 50051 23175 -68317 -21736 68668 65541 -56820 -135181 -217013 -294508 -225253 -204453 -300332
11245 -300332 -369264 -313196 -277810 -278676 -132608 -32831 -38967 -56172 -143827 -48884 126423 70292
11233 70292 -15318 -19965 -47527 -5462 72820 47614 -60840 -118964 -156108 -80109 -25169 -25341
11221 -25341 -983 84814 114451 126573 29431 -97357 2014 -31369 -117245 -160411 -178591
11210 -178591 -140388 -74574 -98037 -116700 75004 100795 12062 -52969 -113200 -199811 -143389
11199 -143389 -10937 -36558 -86942 -90660 -212300 -144583 18666 137000 144449 79908 33707
11188 33707 -7286 -24089 10355 -51670 -147416 -173327 -137312 -115815 -174252 -167688 -183748 -158777
11176 -158777 -173487 -60342 77057 253170 152502 123407 71363 56636 15103 -17136 -21900
11165 -21900 -151716 -130659 -48487 -36319 -93012 -150958 -92106 -49540 -210337 -192751 -107999
11154 -107999 -107651 -152758 -190101 -189673 -186254 -132047 -40916 -47401 -12818 76317 133690 97523 -32882
11141 -32882 -131991 -116846 -49412 31011 -18720 -121105 -225063 -263224 -214061 -96471 -75740
11130 -75740 -111472 -150705 -225295 -224972 -108309 20423 43878 88807 15429 -150409 -213843
11119 -213843 -272367 -141324 -40811 94521 45893 -76578 -140179 -160930 -45968 27251
11109 27251 -61462 -151451 -117418 -120109 -82372 3725 -15958 -4117 1439 -28581 -8382 -16524
11097 -16524 -8826 47343 27108 156210 144550 74971 -32494 -71671 -77855 -62141 -74959 -149810
11085 -149810 -161311 -209416 -166508 -152044 -241506 -198683 -43837 40299 -70941 -109090 -61743
11074 -61743 126346 84575 -23301 -95881 -177966 -146676 -116352 -26269 -26083 -113450 -210044 -104943
11062 -104943 26570 -52594 -125333 -74319 -48222 17431 12669 -5201 -2281 -73812 -84740 -40280
11050 -40280 3636 111739 137981 41226 -139169 -105201 82613 56766 -39791 -58048 -25605
11039 -25605 -15045 -75924 -38317 34967 76092 168756 184938 66641 -2028 5321 8331 -38347
11027 -38347 -151235 -199876 -97394 34021 101219 13240 -82195 -172666 -222449 -62294 84415
11016 84415 116504 57456 46431 22476 -5138 2950 47818 -126710 -159507 -74875 32502
11005 32502 81548 17345 -33825 -44983 -6399 -138064 -210136 -175857 -100407 -195416 -193366 -153172
10993 -153172 -175561 -120088 -57866 -9805 -7167 -9269 -52659 -72275 -94796 39882 120849 -50713
10981 -50713 -99293 -6949 -61107 -91438 -47784 -19787 -98623 -158467 -59995 59024 192767
10970 192767 161220 51167 6329 -99635 -111735 28243 152780 241301 220264 114906
10960 114906 -10289 11739 -9300 59605 134123 110324 41751 -8963 -82988 -139248 -63680
10949 -63680 -47663 -100893 -125439 -139811 -102029 24439 71213 95696 67026 -42111 -97075
10938 -97075 -113235 -113068 -74327 -39814 -59120 -4633 -44093 -64950 -49919 8846 -70790 -204406
10926 -204406 -135060 -48658 29275 -74765 -118899 -45299 18164 56596 60263 23545 -20422
10915 -20422 -54585 -100099 -67638 -85257 -128211 -201109 -114899 -65369 -28810 -30101 -2364 16973
10903 16973 -72057 -120763 -67582 -13471 -42564 -54577 -52223 -22568 24298 24116 -43910 -74528
10891 -74528 -106363 -110984 -122673 -159737 -135535 -179983 -86534 63505 -61225 -68032 -37394 -17967
10879 -17967 69515 -83102 -217865 -192337 -95738 99966 122837 146234 126378 94167 50422
10868 50422 78042 115078 114181 38482 -37929 -43594 4055 -32797 -99716 -109350 -105916 -106350 -109043
10855 -109043 -86732 -98097 -64359 -40903 -48544 -26021 -66337 -68402 17428 2082 -118487 -238991
10843 -238991 -235504 -154623 -120767 -126526 -115561 -101967 -30990 72633 127221 88592 25044 4373
10831 4373 -95035 -150687 -35273 -37791 12134 70428 62891 65133 72599 46939 -16278 -62199
10819 -62199 -108298 -104290 -85303 -64451 10693 -42736 -109399 -162610 -180620 -176684 -114229 -168560
10807 -168560 -265012 -205258 -181481 -90415 -6930 53797 25031 38550 22093 -50642 -68201
10796 -68201 -57193 -105754 -75525 12936 45628 129828 164340 96667 13886 -5140 126513
10785 126513 123854 -29060 -46709 -92380 -125533 -35765 35029 82460 16846 -55707 -70212
10774 -70212 -80191 -66213 -35971 -34172 -54659 -143602 -184898 -70635 -104765 -68419 84937 122761
10762 122761 49526 -35478 -116226 -44236 85788 109761 96862 196058 280891 235751 80369
10751 80369 50334 53618 -31117 -150071 -99520 -103337 -20065 -32019 20833 29752 61196 39327
10739 39327 85364 64605 -5544 -126308 -179748 -96533 -14584 20415 -93667 -98308 -78855
10728 -78855 -45649 -72686 -41632 105768 38917 -149673 -203722 -131724 -64171 -103518 -136772
10717 -136772 -89035 65507 91469 171478 194394 32697 -36749 -54494 -54229 -19363 -51806
10706 -51806 -80758 -63124 -83609 -104893 -60212 36481 145550 181758 137802 136155 190479 93469
10694 93469 69528 -31586 -108942 -140507 -21557 60759 27548 -58876 -122380 -75158 68217
10683 68217 139366 62543 -105775 -134810 -63397 27646 14671 -52065 -70760 -61056 -7270 -93762
10671 -93762 -130296 -140018 -63087 -16868 2833 -76919 -115292 -185037 -238443 -235051 -95782 30275
10659 30275 -79663 -105376 -37594 -115687 -288465 -264866 -218533 -143190 -53206 -17897 -72692
10648 -72692 -166455 -162403 -131612 -95188 -45203 -82213 -41904 40381 78164 81390 7721 -45134
10636 -45134 -56888 -54493 11000 -14444 -4081 -52103 40881 223770 159175 99710 23709 -71683
10624 -71683 -88673 -96697 -141834 -166472 -46722 90948 120731 -5348 -33869 69957 56486
10613 56486 -48294 -23029 28888 -15192 45914 210145 237385 91775 136812 179820 148221
10602 148221 224058 159195 91647 117985 56112 -76464 -149601 -155015 -155414 -95802 -34777 4585
10590 4585 64153 3245 -119912 -185527 -114159 -121145 -111300 -143688 -123815 46681 105718 -56
10578 -56 29535 19549 28686 110630 100004 38335 -40679 -37537 81587 117484 88192 89786 55468
10565 55468 -17793 -40385 -50700 5371 55165 78816 58024 81489 56960 104003 121575 68740
10553 68740 129242 174179 229230 204920 73544 44780 50778 -4096 -143328 -182749 -28795
10542 -28795 46333 141409 133415 -805 -106349 -62258 77588 117499 97230 21319 -35854
10531 -35854 -174033 -237448 -200670 -178323 -144270 -146210 -173696 -160169 -60700 39146 3734 39244
10519 39244 92625 66526 44777 126655 154744 84881 144449 167994 61913 74245 47948
10508 47948 -20920 3928 -9599 -23569 -31681 -79179 -5417 2530 -24274 11845 -47435 -121615
10496 -121615 -96703 -178689 -220390 -211649 -121653 -93528 2604 -23185 -8131 -65993 -65687 12563
10484 12563 -19391 -37865 -23613 5533 -25602 -6324 -73937 -192972 -273996 -187153 -114216
10473 -114216 -151332 -129463 -178914 -239624 -259259 -223044 -151774 -72993 4273 -20550 -34123
10462 -34123 -68045 -56536 -51918 -100238 -20875 -78707 -72253 -45644 -52466 -103344 -105411 -26225
10450 -26225 13129 -113256 -113516 -141492 -84222 42337 -66610 -206441 -136590 -58651 -34203
10439 -34203 -112354 -151942 -52235 184428 278770 274887 207472 52115 67336 -79283 -170928
10428 -170928 -25349 31989 69755 96292 95161 115694 161805 171228 47108 -55956 -118380
10417 -118380 -90951 -108920 -92789 -86581 -80213 -138725 -175032 -193192 -127859 -101583 -120434 -124289
10405 -124289 -92968 -70257 -119735 -78719 65567 132925 17891 43549 12960 -41485 -78969
10394 -78969 -62215 -106574 -108704 35642 95055 61661 7043 -15535 73030 149048 89283 40317
10382 40317 29858 -23677 -115557 -268806 -215396 -137572 -27235 -51416 -70980 -56643 58913
10371 58913 79333 16884 40805 71247 311 -96687 -48416 -66282 -67062 -66899 -68086 44052
10359 44052 97097 164572 66387 12776 50866 22772 32588 75454 60631 11963 -766 -3497
10347 -3497 13291 146307 120836 129804 152882 161306 99742 130463 138390 122012 124154 125142 15972
10334 15972 -14778 13435 50944 41873 16633 16850 29742 79950 43134 69235 148398 183964
10322 183964 134374 76014 80264 66587 32764 -124196 -200331 -171498 -41986 76886 66867
10311 66867 -30392 -7238 106983 85037 8041 -119747 -106738 99221 63084 -69938 -150047
10300 -150047 -89350 -9218 103434 159578 20978 -23707 24194 145140 168301 65155 62726
10289 62726 79027 -26212 30601 169031 217840 101510 13279 12707 55324 14781 -54840
10278 -54840 44465 78468 32386 28070 42402 36302 25396 16865 47133 49149 21188 18432 70449
10265 70449 35472 -57846 -123702 -116571 -102189 41638 72027 67313 46154 40242 26196 97265
10253 97265 72651 77207 81057 32698 -68594 -111320 -74320 17591 -33139 13935 69291 78253
10241 78253 91421 107606 61489 39926 27535 63702 38698 -30466 27285 54175 13942 67266
10229 67266 98579 14234 4677 90068 45744 69802 170160 130229 83460 -4962 -90440 -41698
10217 -41698 89129 65340 -38354 54091 74578 88349 72424 -10241 -51175 -133294 -160908
10206 -160908 -61276 14173 23760 -15066 10740 142926 58496 -55879 -107600 -34918 -10576
10195 -10576 -42317 -700 -31493 -51869 15994 84095 73304 68322 50501 -1947 45841 7326
10183 7326 -16578 -9535 -15166 10932 23906 120977 127943 66725 82876 80719 59478 -10250 -32285
10170 -32285 -68097 -57484 -10636 44733 47301 16292 -63226 -156373 -8853 53220 59647 78706
10158 78706 79735 47644 -56319 -31677 -88710 -135753 -157064 -169652 -86140 -36130 -81517 -48281
10146 -48281 -101522 -144996 -117528 -70338 -32173 -36653 -97783 -80717 61837 79534 60046 31736
10134 31736 6326 56545 59044 88818 71055 41109 -64418 -101548 -133756 -84291 -24513 -23427
10122 -23427 48610 116277 74608 111308 90130 -27807 -46971 -2131 127442 141116 45657
10111 45657 -18019 -29786 -31174 -105551 -163571 -106010 -210568 -295999 -173494 -75291 20900
10100 20900 72816 -13072 -12925 -13626 -75394 106930 251021 146469 25539 6458 52226 17053
10088 17053 -190263 -211817 -143341 -108887 -54765 -83232 -45299 46008 71504 36671 87446
10077 87446 31145 42714 71611 -20996 -144801 -134725 -73313 82163 125582 43366 42102
10066 42102 -13970 1786 -67908 41417 81733 -6313 -74457 -9748 62399 -17328 -45300
10055 -45300 -77464 5684 17736 -17227 14478 64582 -29463 -137666 -81843 -3501 53887
10044 53887 138958 222941 220831 130919 172469 187570 284326 321880 197295 86305 98050
10033 98050 316975 412104 345996 306081 188866 162198 218979 287437 306190 142678 122988
10022 122988 99628 -4895 -83173 -121669 -111136 -133319 -5957 90695 176013 184051 111708
10011 111708 142402 213172 130823 73520 26153 -29748 56775 101508 79950 11570 22655
10000 22655 15713 -45686 -70191 -50582 -6839 20534 -18418 -42941 -79795 -65418 -112988 -178766
9988 -178766 -103948 -61725 -147168 -214063 -148658 13098 31559 -174141 -220990 -97930 -48029
9977 -48029 -66180 -113099 -87777 -149371 -150050 -258628 -259241 -238710 -214601 -167294 -96305 -51715
9965 -51715 -13337 -52165 -17188 -75142 -133972 -81880 -27164 -46596 -145815 23573 54531 44164
9953 44164 54718 25038 16452 -134610 -222529 -149161 -156778 -219730 -151836 -76635 -46729 7630
9941 7630 44248 17074 -33032 -125559 -149751 -145078 -117300 -103926 -96766 -57528 -132774 -231016
9929 -231016 -166344 -162124 -104701 -16365 96742 141090 133775 123088 94219 81312 160518 118121
9917 118121 36361 -54085 -38023 37661 119827 108440 128452 111765 131881 -31 -43433
9906 -43433 12901 124296 220135 221978 172035 69859 51884 2939 -41337 -8056 -13968 44385
9894 44385 -3261 -41285 40593 161587 152565 47595 786 100275 159747 200333 215143 111339
9882 111339 3977 -34286 28994 57339 86942 -21781 -80694 -207737 -203153 -92466 -70585
9871 -70585 53705 -2571 -38323 131495 216858 195463 151287 132596 -18610 -178552 -190475
9860 -190475 -59789 -14559 -61554 -124866 -94559 -129387 -185471 -212927 -220858 -159097 -62300 -33497
9848 -33497 -39121 -37116 -24913 -110583 -53315 9008 -30180 -48871 37305 132012 116649 225883
9836 225883 192151 198230 234317 155600 110294 167693 133705 126092 57951 1713 22939 104555
9824 104555 137081 81331 147859 195359 209334 126133 86705 99717 -119 -37834 -11674 -73250
9812 -73250 -241457 -206620 -116234 -89835 -37363 -13221 10688 52432 111554 125001 154468 125065
9800 125065 159015 167148 109330 64372 26633 -58279 -99823 -37873 125715 273614 183422
9789 183422 -3447 -40922 -26922 40212 83416 27347 82121 122711 90092 189727 302949
9778 302949 305941 209867 50047 -1343 -29203 -40308 2521 21033 24671 102764 119465 112789
9766 112789 15334 -38116 -60345 -55635 5130 58474 19433 67273 148499 223508 159504 153035
9754 153035 187904 204836 182889 152359 130315 1098 50884 15331 -75041 -32717 30806
9743 30806 6783 -30657 -24202 -117110 -165235 -169801 -84349 29856 3118 -26577 2882 -8071
9731 -8071 -41849 -70694 -150513 -255456 -230420 -193289 -157285 -163157 -188501 -172730 -71281 -97083
9719 -97083 25800 50228 12445 -76285 -142489 -189014 -110186 -67981 -58290 -65614 27401 165804
9707 165804 255744 177410 106849 45310 -69648 -87621 20973 91198 111435 70905 71213 111983
9695 111983 15087 -58861 -70930 -57235 19458 5319 47022 19512 -9402 49258 190033
9684 190033 100074 88729 175898 159236 92161 84014 -55415 -139501 -123962 -6797 91633
9673 91633 144489 91782 48353 104802 128307 110752 113824 58291 55320 6338 123934 164269
9661 164269 179887 210173 88754 68736 73169 98844 166959 122515 -15944 -87894 -8135
9650 -8135 3020 -34539 6400 9822 0 -44615 -71275 -98927 11585 133933 86860 -4972
9638 -4972 -15856 6384 8712 38552 6947 -72383 2195 3736 44037 50930 69380 93070 42125
9625 42125 39571 130772 244146 256519 194600 194550 215790 125955 19024 27860 60883 184320
9613 184320 72322 -82632 -37265 114595 152506 148208 135373 69005 -4656 -39745 -37773
9602 -37773 -18338 103446 139426 88833 197119 116275 14422 60013 138148 137661 195504 308222
9590 308222 301870 309707 328819 341053 316391 395282 278693 245759 226244 208699 40944 -79202
9578 -79202 -19700 124898 155636 282188 356465 375297 332720 274710 196874 189300 173709 86340
9566 86340 101807 185554 149669 80661 137333 139563 130944 89195 121705 149376 140025 255676
9554 255676 275931 210114 157820 169302 148070 158826 160033 144810 157557 180996 250671 214527
9542 214527 123979 107397 252445 327981 236785 158801 172662 136603 190780 170873 93879
9531 93879 70395 56447 105376 148993 183958 219716 202747 186491 208729 229880 200488 135475
9519 135475 99505 73567 130714 101916 125746 231331 313959 292859 258250 254689 289634 209324
9507 209324 156130 266568 338270 444499 394669 164047 219775 204135 173983 288962 314672
9496 314672 318519 333399 250300 208852 220664 190956 235708 318977 283974 223478 251629 265529
9484 265529 265747 214837 238220 203562 228074 292039 262015 216675 307500 351041 345677 308601
9472 308601 210743 254653 262028 329972 368453 294361 272406 351430 351775 379590 381436 289167
9460 289167 303965 429182 494194 541616 526566 481825 487705 425183 403667 417362 457538 442881
9448 442881 420257 471809 538388 541096 487153 469178 487406 482411 503359 480704 468179 436040
9436 436040 514393 629710 521782 462402 489741 488343 487007 597999 596192 522622 565396 662002
9424 662002 640425 593609 602711 583979 549419 540507 472746 384887 303480 418419 428981 479303
9412 479303 528749 584392 551252 573001 615512 573925 541169 519378 528746 491872 463458 509061
9400 509061 629021 775419 865953 841934 832819 813715 765966 714993 737007 754813 789104
9389 789104 730580 716440 715870 800116 921650 1011132 928049 859539 884260 898705 831226 849573
9377 849573 941822 975242 969954 906992 1029937 1082638 962356 954288 1001093 1097051 1117950 1104041
9365 1104041 1138276 1106482 1064184 1027633 1142442 1235041 1272491 1431430 1437406 1314496 1179018
9354 1179018 1170129 1292613 1276773 1372925 1405221 1317680 1319584 1225085 1207086 1325761 1456482
9343 1456482 1565977 1644450 1680486 1726512 1685954 1724604 1679103 1553651 1544077 1583951 1553810
9332 1553810 1592143 1615355 1635884 1624969 1639476 1774694 1806418 1764269 1750070 1786465 1880813
9321 1880813 1948668 1948473 1909785 1807141 1817770 1873449 1860784 1996779 2104720 2053941 1984693
9310 1984693 1901721 1944375 1984181 1900469 1801890 1849752 1862598 1933771 2043487 2159778 2243630
9299 2243630 2276319 2253304 2284470 2153309 2159791 2220073 2237299 2257037 2326404 2303252 2320513
9288 2320513 2405817 2328175 2389747 2373850 2317838 2386977 2348627 2363395 2373269 2388984 2339675 2364019
9276 2364019 2342542 2314790 2170368 2214982 2370530 2424201 2343680 2398015 2408215 2414933 2317763
9265 2317763 2276437 2391976 2329710 2350831 2280243 2172541 2188444 2309253 2470675 2354041
9255 2354041 2287921 2288174 2252224 2146872 2158036 2136594 2083379 2064973 2046861 2115621 2139199 2025615
9243 2025615 1987632 2107069 2192563 2230524 2113955 2036877 2056966 2149590 2176461 2232857 2212679
9232 2212679 2111549 2060199 1991535 1911817 1873403 1818139 1903756 1943977 1921481 1945347 1813061
9221 1813061 1693413 1703688 1807673 1851815 1807586 1702312 1755121 1803883 1770309 1702367 1648964
9210 1648964 1599056 1563331 1561315 1583848 1626667 1612026 1569417 1446110 1478203 1461528 1421359
9199 1421359 1362486 1318184 1280951 1267996 1309849 1372458 1367053 1377841 1437380 1413513 1313788 1291369
9187 1291369 1294941 1189086 1114226 1124013 1136065 1153962 1266251 1305166 1279844 1237638 1256319
9176 1256319 1320504 1225910 1249091 1264528 1172416 1159625 1184233 1070008 918788 968894 1108434
9165 1108434 1110342 1117219 1192657 1049985 762351 747315 894110 1066324 1018352 886615 762893
9154 762893 785386 855048 923832 959592 939010 952182 932273 864579 809181 800041 787271 791165
9142 791165 799067 815033 764272 776479 729817 620033 566983 514681 460675 482755 699089
9131 699089 735954 670459 671016 778148 830660 792536 781801 751772 772079 718941 722461 746537
9119 746537 818933 872342 802632 755252 746728 711087 696175 711724 720029 758468 813685 829243
9107 829243 734177 609741 557830 430946 448833 445209 409524 517313 571543 541822 565487
9096 565487 507904 496943 421323 452876 492061 485326 419220 407462 449455 473828 387338 305324
9084 305324 369395 476017 470756 578325 687504 702895 690728 551472 502911 435172 424408
9073 424408 331371 337501 315040 362170 402553 403666 402531 426105 471430 449977 358586 324021
9061 324021 372800 419594 379996 375619 420757 451464 495834 512355 395117 375520 317920 386120
9049 386120 443903 458544 408554 283916 261450 284365 291179 296966 371819 362696 400791 425694
$$ [...]
##END NTUPLES=NMR SPECTRUM
##END=
