##TITLE=Analysis number 311493
Compound Code cc 24413
Book Reference 350/158
Project Code adrs
Chemist Name chrisr
##JCAMPDX= 6.0         $$ Bruker NMR JCAMP-DX V2.0
##DATA TYPE= NMR SPECTRUM
##DATA CLASS= NTUPLES
##ORIGIN= Bruker BioSpin GmbH
##OWNER= NMR
$$ XWIN-NMR		Version 3.5
$$ Fri Jul  8 12:01:16 2005 GMT Daylight Time (UT+1h)  MAYBRIDGE\NMR@NMR_250MHZ
##.OBSERVE FREQUENCY= 250.131544655141
##.OBSERVE NUCLEUS= ^1H
##.ACQUISITION MODE= SIMULTANEOUS (DQD)
##.ACQUISITION SCHEME= undefined
##.AVERAGES= 16
##.DIGITISER RES= 18
##SPECTROMETER/DATA SYSTEM= dpx250
##.PULSE SEQUENCE= zg30
##.SOLVENT NAME= CDCl3
##.SHIFT REFERENCE= (INTERNAL, CDCl3, 0, 16.522)
##AUDIT TRAIL= $$ (NUMBER, WHEN, WHO, WHERE, WHAT)
$$ ##TITLE= Audit trail, XWIN-NMR		Version 3.5
$$ ##JCAMPDX= 5.01
$$ ##ORIGIN= Bruker BioSpin GmbH
$$ ##OWNER= NMR
$$ C:\u/data/dgb/nmr/ADRS/5530/pdata/1/auditp.txt
$$ ##AUDIT TRAIL=  $$ (NUMBER, WHEN, WHO, WHERE, WHAT)
(   1,<2005-07-08 12:00:52.61 +100>,<MAYBRIDGE\NMR>,<NMR_250MHZ>,
      <created by zg, POWCHK disabled, PULCHK disabled
       configuration hash MD5:
       62 19 C7 07 E1 42 D1 B7 37 6C 3D D0 77 39 F9 E6
       data hash MD5: 64K
       FB 73 D9 F6 B0 CF 39 29 EA 30 79 9B CA 33 39 5F>)
(   2,<2005-07-08 12:01:05.74 +100>,<MAYBRIDGE\NMR>,<NMR_250MHZ>,
      <Start of raw data processing
       ef LB = 0.3 FT_mod = 6 PKNL = 1 SI = 32K 
       data hash MD5: 32K
       9C A2 B9 92 CD 6C 96 7C 31 AD B8 26 CF 61 60 66>)
(   3,<2005-07-08 12:01:07.69 +100>,<MAYBRIDGE\NMR>,<NMR_250MHZ>,
      <apk 
       data hash MD5: 32K
       47 02 50 CC 8C BB FC 06 BB 4B 22 33 1D 90 39 95>)
(   4,<2005-07-08 12:01:08.50 +100>,<MAYBRIDGE\NMR>,<NMR_250MHZ>,
      <abs ABSG = 5 
       data hash MD5: 32K
       20 34 69 67 24 AA 6B BD FB 03 F3 C4 32 ED 34 15>)
$$ ##END=
$$ 
$$ hash MD5
$$ 38 8F 48 0C 7D D9 1B 55 80 40 F5 53 A3 15 4D 87
##$RELAX= 
##$RELAX= 
##$RELAX= 
##$RELAX= 
##$RELAX= 
##$RELAX= 
##$RELAX= 
$$ Bruker specific parameters
$$ --------------------------
##$DU= <C:\u>
##$EXPNO= 5530
##$NAME= <ADRS>
##$PROCNO= 1
##$TYPE= <nmr>
##$USER= <dgb>
##$AMP= (0..31)
100 100 100 100 100 100 100 100 100 100 100 100 100 100 100 100 100 100 
100 100 100 100 100 100 100 100 100 100 100 100 100 100 
##$AQSEQ= 0
##$AQ_mod= 3
##$AUNM= <au_zg>
##$AUTOPOS= <23 >
##$BF1= 250.13
##$BF2= 250.13
##$BF3= 250.13
##$BF4= 250.13
##$BF5= 500.13
##$BF6= 500.13
##$BF7= 500.13
##$BF8= 500.13
##$BYTORDA= 1
##$CFDGTYP= 0
##$CFRGTYP= 5
##$CHEMSTR= <none>
##$CNST= (0..31)
1 1 145 1 1 1 1 1 1 1 1 1 1 1 1 1 1 1 1 1 1 1 1 1 1 1 1 1 1 1 1 1 
##$CPDPRG= <>
##$CPDPRG1= <>
##$CPDPRG2= <>
##$CPDPRG3= <>
##$CPDPRG4= <mlev>
##$CPDPRG5= <mlev>
##$CPDPRG6= <mlev>
##$CPDPRG7= <mlev>
##$CPDPRG8= <mlev>
##$CPDPRGB= <>
##$CPDPRGT= <>
##$D= (0..31)
0 1 0 0 0 0 0 0 0 0.06 0 0 0 0 0 0 0.0002 0 0 0 0 0 0 0 0 0 0 0 0 0 0 
0 
##$DATE= 1120820451
##$DBL= (0..7)
120 120 120 120 120 120 120 120 
##$DBP= (0..7)
150 150 150 150 150 150 150 150 
##$DBP07= 0
##$DBPNAM0= <>
##$DBPNAM1= <>
$$ [...]
##$SUBNAM7= <"">
##$SUBNAM8= <"">
##$SUBNAM9= <"">
##$SW= 20.6930455092707
##$SWIBOX= (0..15)
0 0 3 0 0 0 0 0 0 0 0 0 0 0 0 0 
##$SW_h= 5175.983436853
##$TD= 65536
##$TD0= 1
##$TE= 295.16
##$TE2= 300
##$TE3= 300
##$TEG= 300
##$TL= (0..7)
0 120 120 120 120 120 120 120 
##$TP= (0..7)
150 150 150 150 150 150 150 150 
##$TP07= 0
##$TPNAME0= <>
##$TPNAME1= <>
##$TPNAME2= <>
##$TPNAME3= <>
##$TPNAME4= <>
##$TPNAME5= <>
##$TPNAME6= <>
##$TPNAME7= <>
##$TPOAL= (0..7)
0.5 0.5 0.5 0.5 0.5 0.5 0.5 0.5 
##$TPOFFS= (0..7)
0 0 0 0 0 0 0 0 
##$TUNHIN= 0
##$TUNHOUT= 0
##$TUNXOUT= 0
##$USERA1= <user>
##$USERA2= <user>
##$USERA3= <user>
##$USERA4= <user>
##$USERA5= <user>
##$V9= 5
##$VALIST= <valist>
##$VCLIST= <CCCCCCCCCCCCCCC>
##$VD= 0
##$VDLIST= <DDDDDDDDDDDDDDD>
##$VPLIST= <PPPPPPPPPPPPPPP>
##$VTLIST= <TTTTTTTTTTTTTTT>
##$WBST= 1024
##$WBSW= 4
##$XGAIN= (0..3)
0 0 0 0 
##$XL= 0
##$YL= 0
##$YMAX_a= 513163
##$YMIN_a= -577833
##$ZGOPTNS= <>
##$ZL1= 120
##$ZL2= 120
##$ZL3= 120
##$ZL4= 120
##$ABSF1= 16.522
##$ABSF2= -4.171173
##$ABSG= 5
##$ABSL= 3
##$ALPHA= 0
##$AQORDER= 0
##$ASSFAC= 0
##$ASSFACI= 0
##$ASSFACX= 0
##$ASSWID= 0
##$AUNMP= <proc_1d>
##$AZFE= 0.1
##$AZFW= 0.1
##$BCFW= 0
##$BC_mod= 0
##$BYTORDP= 0
##$COROFFS= 0
##$CY= 12.5
##$DATMOD= 1
##$DC= 0
##$DFILT= <>
##$DTYPP= 0
##$F1P= 14.0000005364418
##$F2P= -0.99999901652339
##$FCOR= 0.5
##$FTSIZE= 32768
##$FT_mod= 6
##$GAMMA= 0
##$GB= 0
##$INTBC= 1
##$INTSCL= 1
##$ISEN= 128
##$LB= 0.3
##$LEV0= 0
##$LPBIN= 0
##$MAXI= 10000
##$MC2= 0
##$MEAN= 0
##$ME_mod= 0
##$MI= 0
##$NCOEF= 0
##$NC_proc= -3
##$NLEV= 6
##$NOISF1= 0
##$NOISF2= 0
##$NSP= 0
##$NTH_PI= 0
##$NZP= 0
##$OFFSET= 16.522
##$PC= 1
##$PHC0= -78.75047
##$PHC1= 7.266208
##$PH_mod= 1
##$PKNL= yes
##$PPARMOD= 0
##$PSCAL= 4
##$PSIGN= 0
##$REVERSE= no
##$SF= 250.13
##$SI= 32768
##$SIGF1= 0
##$SIGF2= 0
##$SINO= 400
##$SIOLD= 32768
##$SREGLST= <1H.CDCl3>
##$SSB= 0
##$STSI= 32768
##$STSR= 0
##$SW_p= 5175.98343685301
##$SYMM= 0
##$S_DEV= 0
##$TDeff= 65536
##$TDoff= 0
##$TI= <Analysis number 999999
Compound Code 99
Book Reference 9
Project Code 9>
##$TILT= no
##$TM1= 0
##$TM2= 0
##$TOPLEV= 0
##$USERP1= <user>
##$USERP2= <user>
##$USERP3= <user>
##$USERP4= <user>
##$USERP5= <user>
##$WDW= 1
##$XDIM= 32768
##$YMAX_p= 284199788
##$YMIN_p= -48822
$$ End of Bruker specific parameters
$$ ---------------------------------
##NTUPLES= NMR SPECTRUM
##VAR_NAME=  FREQUENCY,     SPECTRUM/REAL,   SPECTRUM/IMAG
##SYMBOL=    X,             R,               I
##VAR_TYPE=  INDEPENDENT,   DEPENDENT,       DEPENDENT
##VAR_FORM=  AFFN,          ASDF,            ASDF
##VAR_DIM=   32768,         32768,           32768
##UNITS=     HZ,            ARBITRARY UNITS, ARBITRARY UNITS
##FACTOR=    0.157963299565203, 1,           1
##FIRST=     4132.6476996994, 0,             0
##LAST=      -1043.33573715361, 0,           0
##MIN=       -1043.33573715361, -48822,      0
##MAX=       4132.6476996994, 284199788,     0
$$ Real data points
##PAGE= N=1
##DATA TABLE= (X++(R..R)), XYDATA
$$ [...]
22900 10639 3471 -1686 -1991 14018 6793 -6754 -19679 -19789 -16803 -11741 482 9140 261 -9617
22886 -9617 -11382 -20001 -26864 -21775 -11295 -10645 -22826 -23463 -15363 -12465 -19680 -10480 -387 -4348
22872 -4348 -15140 -8134 -13015 -10029 -7917 -8417 -15452 -10817 10349 6727 -5375 -4441 -13926 -10849
22858 -10849 -1462 7724 12394 928 -13450 -337 -1543 -1422 -11740 -4956 -2199 -8590 -1911 -2403
22844 -2403 -1824 -115 -3046 1589 3016 -8992 -7906 -14803 -24649 -32058 -23472 -9592 -17704 -21834
22830 -21834 -14761 -20205 -23778 -19444 -30054 -23813 -3477 7383 -2662 -3318 7932 9816 1138
22817 1138 374 252 -3760 -2962 -6467 -3688 4561 3711 -4113 -1229 -2405 2643 3229 -3227 9292 16407
22801 16407 19745 9884 8613 12360 7406 4092 10911 11490 7123 5474 -3482 -11746 -24427 -9305
22787 -9305 3850 -6580 -21401 -30372 -27290 -15579 -16101 -11994 -3317 -3734 10188 15287 12428 10480
22773 10480 11198 11533 4707 -8782 -10042 1673 8076 9088 15931 15188 16556 15739 12229 13052 15812
22758 15812 12776 -460 -7993 -1879 -71 -2391 -20693 -18186 450 4057 7941 8897 11929 9273
22744 9273 -588 -4889 -5581 1302 9198 5185 1119 -8507 -13261 -11070 -10487 4062 1485 -11964 -17412
22729 -17412 -23685 -24470 -23730 -17576 -11875 -17519 -6 3095 -6451 -12188 -6792 6683 1748 13156
22715 13156 19255 21435 29877 17812 6072 -6930 -11551 -11012 -3740 -10219 -21146 -27114 -12780
22702 -12780 168 -2763 13338 26777 13338 6923 1816 -7531 -9592 -11877 -19694 -20933 -8008
22689 -8008 -6576 -2474 6524 -2015 -26502 -29515 -23711 -12469 -8117 -10722 -17527 -21469 -18061 -16740
22675 -16740 -11213 3886 1307 -8252 -8486 -4200 380 4867 6045 5147 644 -4313 -9293 -17925 -19675
22660 -19675 -17488 -13360 1829 3797 15070 21772 15870 105 -1882 -3394 -16303 -11281 -2599
22647 -2599 -5744 -18553 -18165 -8934 4837 10023 4706 -2244 -8198 -8672 -9132 -9488 -5916 -5053 -12714
22632 -12714 -17217 -18092 -33789 -25821 -20304 -17022 -2220 2865 1243 2973 15272 2461 -13988
22619 -13988 -9108 -10441 -13182 -13554 -25408 -26692 -20837 -10044 -15477 -15395 -13957 -4411 1620 -3548 -17141
22604 -17141 -12717 -18992 -8696 -6876 -10639 -11549 -27766 -35101 -16905 -7899 -5957 -14391 -28202 -24748
22590 -24748 -6086 -1010 -6274 -12882 -22025 -19480 -13789 -13292 -15058 -12732 -18742 -21036 -9883 7061
22576 7061 13450 9769 9599 1432 -9652 -13712 -4315 1806 4971 6645 -7045 -10017 -3 -4703
22562 -4703 -14007 -2963 7065 9048 8006 -733 -11787 -18448 -17330 -8102 -16467 615 11309
22549 11309 14858 11741 2716 -6247 -8882 -11074 -15330 -17358 -24424 -18684 -14876 -16179 2344 25666
22535 25666 31026 16410 3678 -8523 -1491 2220 12751 12023 6215 -1845 3864 9925 13444 1504
22521 1504 -17295 -9648 -9942 -20353 -20422 -18838 -9362 1276 -11656 -28354 -20787 -8259 2229 6067
22507 6067 8114 22303 22557 15522 23464 23269 18892 12487 5561 -8491 -7732 -5653 1727 -4882 206
22492 206 1876 3566 -5319 -8510 -3321 -10497 -23283 -29298 -11239 -5712 -6780 853 19588 10631
22478 10631 6193 -2580 -157 -2912 -11834 -17331 -17784 -13952 -7335 5365 16515 -2967 -22801 -37100
22464 -37100 -31104 -12592 -6993 -5791 -11145 -9314 -9468 -12902 -3491 -6813 -10894 -12153 -15639 -24892
22450 -24892 -23303 -17281 -24443 -24583 -5451 22489 31487 15820 9053 7548 4855 -3942 -8241 -20365
22436 -20365 -28836 -31602 -26869 -12683 -6014 714 -5965 -14556 -12792 9953 9409 -9826 -20142 -8035
22422 -8035 6575 18386 14480 8076 16279 13727 23388 21314 4617 -15225 -26347 -33869 -40329
22409 -40329 -33719 -31697 -29390 -24859 -23247 -22776 -17400 -15925 -16324 -12465 -16532 -17871 -20165 -9422 -7946
22394 -7946 -4593 -6367 -8201 -1332 8034 -31 -9718 -11132 -7794 -9591 -19336 -16709 -6371 6531
22380 6531 4859 -16083 -32928 -23423 -12706 -14499 -11443 -13972 -11572 -11670 -16179 -18568 -5169 4968
22366 4968 443 4306 6949 12031 3178 -2413 -1153 7548 3855 -2415 8739 15754 12479 1671
22352 1671 -4453 3801 3144 1398 -450 -16743 -15798 -6754 -10313 -8701 -13863 -14815 -8006 -4563 -10598
22337 -10598 -580 7659 6136 3599 4212 5385 4990 8606 12874 1000 4936 -666 18120 34958
22323 34958 31017 14738 -2766 -11418 -18124 -6090 -5181 -3490 -308 6317 10374 6156 -8689 2246
22309 2246 10306 10311 4700 8815 14533 4790 -658 -4683 -14083 -14436 -15052 -14042 -2549 3804 5403 -3498
22293 -3498 -15449 -11024 -2723 3134 5088 4753 1629 -9906 -12318 -5132 -10914 -11744 -6125 -13209 -4354
22278 -4354 -4765 -13652 -19244 -30653 -29800 -18610 -13920 -12019 -18327 -22801 -19045 -18092 -4570 -13982 -16146
22263 -16146 -19516 -7763 5915 6584 338 -269 -7317 -12037 -7859 -11104 -15976 -5761 -12056 -24324
22249 -24324 -27376 -7303 -3461 -4148 -3339 -1633 -354 -4176 2918 6021 -158 -16962 -23990 -30655
22235 -30655 -19192 -18800 -8187 12541 7523 3824 5064 -4667 -13730 -4900 12909 5688 -6981
22222 -6981 -5567 -877 598 -4746 -13496 -23285 -16946 -9256 -10423 -5766 -4264 3060 -2037 -5217 -8128
22207 -8128 -6810 1119 -2500 -7560 -11547 -9242 -3174 3888 8503 -3747 -3855 -7213 -10447 -7753 -7376
22192 -7376 -4022 4175 8870 2897 -1321 -2626 -5235 -16157 -10914 14932 17094 5937 -10663 -9113
22178 -9113 4679 11923 10507 8742 3607 -981 -8269 -11348 -7947 -210 2500 -5095 -13293 -11560
22164 -11560 -18633 -17297 -10442 -2108 1556 5091 -5770 -6622 -4766 -8998 -14667 -28893 -40468 -28571
22150 -28571 -12952 -3536 -1781 -2371 8144 3125 -2369 -2650 2202 -2696 -3282 -8759 -25222 -19331
22136 -19331 -11999 -10919 -11304 -5601 6929 431 -6429 12251 21351 12970 6758 8237 882 2113
22122 2113 9556 12639 12504 11335 11250 13028 5679 -8531 -24082 -24867 -15966 -15805 -19841 -13980 -1681
22107 -1681 1185 15062 23191 2495 -1320 -4455 4310 832 -6880 -3259 -10080 -4592 -9938 -16449
22093 -16449 -10239 -3097 -12150 -11158 -14575 -20083 -19973 -6166 -18384 -21805 -14547 -10053 -22103 -20665
22079 -20665 -18155 -18959 -11377 -17525 -10292 990 5827 -1931 5911 10370 18830 21685 15212 18939
22065 18939 14684 1239 -15214 -15973 -12410 -22752 -25206 -11367 -3330 -1164 8180 26517 35462
22052 35462 33029 20909 20037 18975 10874 14056 9807 -1954 -12196 -1405 -6339 -20896 -27467
22039 -27467 -11570 -11230 -16172 -15085 -16360 -16025 -16934 -18010 -11344 12832 14403 -2130 -11369 -12339 -19324
22024 -19324 -11129 -4366 -1470 -7049 -6111 -4654 3491 4527 -1619 710 -12015 -20029 -17455 -16242
22010 -16242 -16309 -23271 -19693 -15959 -20357 -11447 -8593 -6154 -2551 -3094 -1146 -13356 -12899 -2931 -9870
21995 -9870 -17132 -11102 -9856 -4389 -9456 -15525 -21478 -22356 -16473 -23811 -16847 -18909 8348 25909
21981 25909 32155 20517 -5056 -12854 -5464 6767 6991 -4019 -14297 -9148 -6935 -10983 -13052
21968 -13052 -5067 -3986 -4039 -5999 -8761 -6750 -6338 -1969 -12214 -24001 -27035 -24284 -21240 -17382 -19811
21953 -19811 -26111 -15384 -969 1037 3440 4040 4268 -4332 6651 19554 15985 7280 7375 8202 -319
21938 -319 -7276 -7159 -11238 631 -7672 -20145 -12669 9983 20937 23145 6066 -7700 -17411 -18212
21924 -18212 -13085 -2525 803 -6868 -13806 -9707 -6157 -12149 -11928 -10727 2440 12075 156 -14420
21910 -14420 -12312 -35012 -40229 -29561 -23383 -21970 -29313 -28316 -29175 -26279 -14605 -12913 -14761 -4325
21896 -4325 12221 5102 5923 9341 17206 873 -820 8441 4941 -6607 -17429 -6970 -6795 -10397
21882 -10397 -3374 5691 1799 -9661 -15176 -18786 -14970 -16040 -17507 -19305 -27943 -17879 -10881 954
21868 954 3724 -907 -15517 -17414 -24735 -18144 -10515 -8272 -10080 7007 8325 7390 -6776 -16594
21854 -16594 -10417 -14440 -20962 -19018 -24305 -32580 -30740 -19894 -15067 -18322 -8628 -18497 -28144 -22551
21840 -22551 -23455 -26287 -17272 -10359 5926 15321 15599 -3663 -3004 14805 8089 -9183 -9103 -3581 7426
21825 7426 12451 5761 4085 -1001 -454 10462 13597 15614 4399 -3952 -10515 -6727 980 8824
21811 8824 15762 22539 15132 6748 3052 -1186 -4603 5205 7474 9281 -1337 -16296 -11593 -3491
21797 -3491 -12203 -21702 -15848 -229 -9193 -12149 -6430 950 -12956 -24925 -26054 -27840 -25452 -4630
21783 -4630 1500 595 -4214 144 5984 19015 8992 -1625 -1400 -14104 -30037 -35239 -24043 -21857
21769 -21857 -23789 -10847 -9536 -8705 -7384 -1591 -621 -2801 -4356 3887 19825 11453 1747 3092
21755 3092 -52 4599 -2323 -16770 -16453 -154 -2343 -6252 -6251 -16224 -13874 -5419 -4295 -5579 -21825
21740 -21825 -21215 -13051 -14725 -8996 -15598 -16334 -16676 241 -138 -12454 -29720 -9851 10388 15715
21726 15715 12334 10433 8005 11288 -2215 624 3984 3333 -1543 -10023 -16020 -11054 -9255 -7358
21712 -7358 -8158 -9812 -10038 -16890 -13568 -8231 -7765 -11403 -13578 -22889 -23812 5088 11339 4199 -13044
21697 -13044 -4772 -1239 -721 7003 8329 2690 -7236 -3653 -9052 -14586 -12846 -18795 -8700 4788
21683 4788 16032 12261 1391 -10248 -12647 -2268 152 1747 15282 20635 7569 13492 7434
21670 7434 4284 12052 12894 -3507 -13843 -10062 3916 9904 7342 12276 1375 -371 -15281 -12412
21656 -12412 -15271 -5159 3593 1820 -16942 -26158 -28182 -18778 -6979 -5449 -14308 -14261 -1097 6694
21642 6694 -5090 -16589 -30200 -30517 -35148 -25171 -10490 -7325 -5262 -1573 -3901 -20548 -24958 -23228
21628 -23228 -16162 -9164 -8909 -4481 -5423 -4054 -3518 -6478 -21534 -17978 -5088 8442 4123 -9507
21614 -9507 -11300 -5505 9731 7287 -6340 -11578 -7917 -10802 -7004 -9356 -5204 -2087 5100 8178
21600 8178 -734 -735 3423 2222 1048 4491 11334 3300 3636 -2460 -9249 -6169 -3539 2659 11258 18937
21584 18937 12651 -1177 5885 -1657 -10962 -9474 -14892 -16447 -6147 344 -10993 -12203 -16086 -21798
21570 -21798 -22005 -14442 -982 10767 17767 7770 4687 10638 11707 3801 3138 8574 1882 -1332
21556 -1332 1472 -6179 -8020 -10129 -17730 -21334 -31532 -24423 -15194 -1704 1507 -3344 4427 6300
21542 6300 2168 -12349 -15522 -7759 6912 7690 17787 10101 2113 -9195 -13961 -6857 -3927 -21915
21528 -21915 -30443 -25241 -26238 -33066 -33461 -35384 -27920 -16603 -20251 -19390 -16723 -15618 -14222 -12535 -21580
21513 -21580 -36795 -33999 -27110 -18758 -17015 -9767 -15248 -12574 -14530 -5557 -5316 -8541 -6614 1169
21499 1169 -15725 -17791 -7903 -11923 -18685 -17787 -7051 6081 10394 10670 -1021 -648 1103 2591
21485 2591 3601 -302 5687 17555 16080 27147 21270 14858 12602 5580 -2714 9078 3968 -4148
21471 -4148 -10835 -21822 -19453 -21236 -16928 -14813 -17223 -15622 -5343 2496 -5499 -1026 -2768 -4116
21457 -4116 -4012 -4465 -2197 -8902 -15104 -32712 -24469 -11147 -4255 -380 -3230 -1364 -7770 -12863 -10906
21442 -10906 -1629 173 -1227 -1588 7177 9725 -3599 -15679 -19056 -24971 -17888 -12656 -21126 -5813
21428 -5813 7048 2998 -10292 -14423 -9896 -8073 2478 22689 22528 11351 9031 -1258 -15894
21415 -15894 -17641 -16244 -12979 -14337 -6297 7646 24904 26856 11995 7296 9024 -393 -11407
21402 -11407 -7623 2491 7566 8304 9479 5090 -6186 -14822 -17496 -12169 -4047 485 1082 1455 2686
21387 2686 -10926 -19087 -22343 -12121 -2533 -4486 -12679 -7293 -621 -1536 8180 19785 14594 11418
21373 11418 8599 1146 3828 -3798 5160 5809 72 4856 -60 -14534 -20182 -18054 -17295 -164
21359 -164 -4982 -16379 -25474 -8151 -208 -1738 -7966 -15557 -20404 -21900 -20014 -24186 -17797 -9078
21345 -9078 -9141 -11484 -1003 -1693 3421 6533 8115 11235 7903 -14588 -27288 -21425 -15812 -30326
21331 -30326 -25119 -14319 -15440 -5174 3196 665 2889 -415 2919 -7232 -14729 -5218 -10456 -4786
21317 -4786 -10720 -2692 3428 -9250 -18413 -5502 -17204 -24602 -5408 -3356 -7338 -1305 -4416 -10642
21303 -10642 -6688 -16083 -29202 -14430 -15440 -20353 -13688 -14792 -14585 -15410 -15668 -11832 -987 9962
21289 9962 807 -7272 -15780 -13634 -4039 -7049 -5442 -1749 1601 -1553 -9237 -5651 2445 4689 630
21274 630 2190 9692 6854 -9695 -20920 -21435 -17470 -11110 -6381 -3006 -2286 -2940 1495 4706 7733
21259 7733 12913 4743 2616 6012 -1601 -10259 -13719 -1719 16642 18580 18943 24449 17059 14351
21245 14351 5025 -7922 -22408 -20221 -18668 -32552 -38041 -35412 -30054 -33325 -33985 -22152 -16448 -12979
21231 -12979 -14490 -4478 4167 2943 -1832 -7484 -11297 -9961 -14927 -16012 -12853 -4843 -1213 -8148
21217 -8148 -9744 -11201 -4274 -2267 4530 4408 -2170 -7468 -10676 -7213 -1861 -8318 -14307 -19507 -16629
21202 -16629 -6901 -14106 -17556 -13418 -19480 -14088 -4354 -12823 -22997 -18871 -10265 -18539 -14239 -4994
21188 -4994 9198 2114 -14069 -20331 -11353 -3369 -4003 -12136 -16627 -17414 -17116 -14526 -5443 -9692 -3844
21173 -3844 -1619 -17432 -11503 -3065 -2075 5040 2691 -6077 -6290 -20941 -23347 -19151 -10862 -4698 1639
21158 1639 -8148 -11406 -11582 -7532 -11157 -31345 -41626 -36438 -35080 -26470 -11470 2061 627 -8694
21144 -8694 -13889 -14332 -2386 1804 -340 -1789 -7473 -12308 -9901 -4805 -8399 -6140 -12001 -15236 -10570
21129 -10570 -1588 -8406 -11266 -16409 -11731 -14307 -12265 -1522 -2079 3243 6417 -4491 -14668 -26833
21115 -26833 -18245 -4782 -3291 -10446 -20351 -16808 -25160 -23815 -12464 -6483 -2220 7132 6524 7283
21101 7283 -192 7481 2703 -5443 1621 8571 6913 5324 -8344 -9135 -12716 -20294 -25686 -27198 -29037
21086 -29037 -16490 -12771 -7455 -9460 -12826 -9332 -13287 -11724 -8683 4920 4980 -7881 -9798 -15408
21072 -15408 -22701 -687 7870 9765 1222 831 9256 9550 10723 -3427 -20150 -7889 835 -574
21058 -574 -5550 -12728 -6805 -1569 7713 9323 2670 -8061 -9554 3195 8188 -2891 -5652 -9782
21044 -9782 -11140 -5759 -4594 -366 -5976 -11662 -7875 -5353 822 21390 31680 15109 4446 -2969
21030 -2969 -9773 -4866 -22068 -26210 -19377 -23277 -29687 -19920 -17614 -8077 7738 11595 1180 -14114
21016 -14114 -3642 7273 -4161 -10966 -14136 -12118 -2615 -2394 -3234 -9925 -17125 -17761 -10951 -15860
21002 -15860 -28791 -30649 -28252 -28582 -19235 -12337 -18017 -10488 -8281 -11154 -6126 12445 15128 44
20988 44 2829 13547 28175 26230 14752 10266 -2161 -1065 4266 -532 -7668 -3751 667 -220
20974 -220 1349 -1663 -10072 -1322 2565 -3358 -3669 3931 17277 21271 12813 4281 -2188 -15608 -23426
20959 -23426 -29399 -12524 -12031 -25999 -27342 -25256 -23219 -20346 -15498 -12741 -4822 -5582 1986 145
20945 145 3735 3989 2024 5017 16658 11854 19151 16169 1585 3697 11276 17280 15283 3474
20931 3474 10354 -13135 -21175 -12095 -25165 -42462 -46488 -32608 -8029 -2830 1151 6652 10182
20918 10182 -4278 896 -2327 -9493 -8023 -8130 -10668 -13525 -4750 -8395 -13964 -18765 -16514 -17737
20904 -17737 -7576 -6235 -2421 -4158 939 -7314 -7467 -8842 -11853 -8459 -11384 -2692 7830 9682
20890 9682 -1434 -5466 1790 -7657 -7025 -5398 -14512 -7601 11914 10291 10020 6109 10312 8889 -6306
20875 -6306 -17392 -22262 -18145 -11722 1324 -5456 -14706 -9580 -6430 172 12862 4767 216 -6137
20861 -6137 -7625 -4987 -11823 -2186 16934 12388 -4723 -21141 -2223 157 -12425 -11438 -6924 -4702
20847 -4702 -5499 -10602 -11002 -10493 -30415 -29164 -11869 3529 -5060 -21336 -31547 -39847 -40575 -24722
20833 -24722 -13729 -5822 8689 9363 -3784 -7966 -3787 -12392 -17476 -7116 -5057 -14854 -6013 -14681
20819 -14681 -8943 5845 -8925 -20014 -17796 -14001 -7274 -380 -5474 -20196 -27589 -28980 -14511
20806 -14511 824 3206 3047 -16140 -31648 -27762 -22735 -18525 -5888 2585 4213 1548 6608 7244
20792 7244 -357 -11832 -15008 -16064 -15587 -1881 13037 15114 16647 -5003 -11639 998 -11168
20779 -11168 422 3796 -11501 -28332 -27844 -23482 -29016 -33464 -31857 -28840 -17052 -12235 -12047 -24935
20765 -24935 -20041 -13748 -17772 -12128 -3298 -11313 -18412 -24986 -29309 -27280 -24571 -14018 5777 -5295
20751 -5295 -18859 -27759 -36119 -32637 -33122 -26794 -17485 1359 14614 28340 18823 12489 7084 -15879
20737 -15879 -12362 -10694 -8442 -3395 -23831 -31117 -25501 -17304 -4614 2300 -4090 -11072 -5882 6747
20723 6747 16572 15437 15293 8142 -5199 -14366 -14548 -14701 -12569 -9409 -5902 -16505 -14289 -10751 1016
20708 1016 -6964 -16013 -14122 -302 10309 783 -9800 -3536 -2330 -11035 -15897 -19179 -23852 -26158
20694 -26158 -24935 -23419 -21220 -2893 -1228 -5907 -8207 -20923 -27613 -32187 -25718 -9181 2633
20681 2633 1955 -9450 -7959 916 -4083 -14483 -16776 -9041 1422 -4603 -10868 -5772 2829 6918
20667 6918 -6478 -4700 -2552 -6278 -8254 -8532 -4804 -1475 -1493 -379 3009 7092 -1401 4232 2005
20652 2005 -3112 -17876 -17227 -8833 -5425 1723 -198 -9715 -14523 -11497 -11859 -19886 -21456 -16449 -2741
20637 -2741 -5674 -5307 -2236 -8782 -13163 -22108 -17302 -18931 -21914 -14609 -17 1684 -5251 -19289
20623 -19289 -14180 -9877 -21283 -21099 -29641 -20598 -21019 -19313 -10276 -9272 -6190 -8905 -9961 -10650 -9367
20608 -9367 -6607 3480 -4546 -8563 -17354 -25624 -12599 -956 -1951 1506 4406 1220 -7017 -3538
20594 -3538 -975 -7793 -12198 -24587 -33283 -30710 -22756 708 4712 4297 638 -1809 -17826 -22220
20580 -22220 -19603 -31656 -30075 -10789 -6118 -7863 7903 7391 1714 -15457 -7008 368 5092 -2066
20566 -2066 5067 -3535 -13522 -10925 -2875 -3801 -11335 -14088 -6322 -581 -5077 -6883 -3703 7667 16001
20551 16001 598 3044 13265 3999 -5752 -1751 8939 24884 17150 1458 -18547 -17621 7498
20538 7498 23509 17035 14267 3349 996 -3647 4803 16137 20258 10097 7810 -2761 -9292
20525 -9292 -17810 -24699 -24356 -19328 -24779 -30496 -21957 -11403 7631 9891 9971 14900 15274 14638 6538
20510 6538 4368 -4602 -8221 -19882 -17024 -12712 -2234 3210 7101 16494 15138 5364 799 8290
20496 8290 8830 6857 6720 18449 15863 1339 -6423 -18066 -10148 3316 847 -3852 -9228 -18044
20482 -18044 -7708 -5959 -6965 1682 805 1503 8839 3844 1712 -1188 -1111 -3291 -12982 -17661 -11293
20467 -11293 -8330 -2333 -269 -14881 -33059 -40264 -38845 -42460 -33072 -12060 -9086 -6142 -7523 -10830
20453 -10830 -6976 -5759 -17652 -15375 -122 8601 5225 6436 3573 -8641 100 -1699 5436 3872
20439 3872 1055 -2248 -10005 -18145 -19133 -15676 -20656 -14863 -14388 -12636 -14633 -20228 -15094 -2187 3135
20424 3135 -3566 8920 -9469 -34387 -24978 -13044 -10565 -1736 4682 -1230 -3986 2012 -2592 -9383
20410 -9383 -3233 -3949 4259 587 -15802 -15897 -22917 -12563 -18773 -16505 -12915 -13905 -14193 4485 3466
20395 3466 -4217 4097 2560 453 -2570 -13811 -20455 -6560 -1280 -2176 530 -2035 -12695 -3014
20381 -3014 13973 19772 10838 2775 12323 6281 6158 -4799 -7203 -3874 -3816 -12564 -11431 -3884 -13963
20366 -13963 -19038 -10278 -7121 -745 250 -4454 -18323 -14080 -19263 -9638 2617 -6659 -13793 -11549
20352 -11549 -11831 -21350 -28357 -27217 -26038 -26499 -25718 -13815 -21652 -27878 -23388 -17832 -1179 13187
20338 13187 18013 8062 -13933 -23567 -25080 -37968 -40043 -37362 -35729 -29427 -20835 -15142 -4006 -3407
20324 -3407 2655 6446 8746 12209 7349 -2976 -3137 -9950 -14073 -19784 -13383 -9742 -21138 -29266
20310 -29266 -14005 -5907 -9795 -15790 -20321 -11278 6319 -1534 -18917 -25528 -28543 -20129 -2704
20297 -2704 5255 -6622 -19447 -8256 -9791 -9394 -6110 -7960 -11300 -4884 -8770 -12476 -2904 -7415
20283 -7415 -13414 -7728 9067 16181 2330 -6512 -12484 -4774 6866 -6338 -10931 -5212 1618 5450
20269 5450 1400 8335 6688 13185 11672 7910 8218 12405 13043 3559 -5853 -7087 -13629 -18984 -21468
20254 -21468 -16059 6338 10809 18177 12406 -4233 -10586 -7909 -3059 3797 8504 10832 -5554 -5752
20240 -5752 -18806 -23953 -15798 -1435 -6427 -11272 -21499 -21518 -16621 1013 13386 11835 12559 5807
20226 5807 1583 9681 6423 -12540 -13896 -2790 -3894 -636 -12381 -11326 -2409 -9489 -16644 -21538
20212 -21538 -14592 6876 19301 29773 30921 16908 3504 4659 13141 15474 10018 -4049 -4113
20199 -4113 -4599 -7597 -13200 -14778 -5558 -12353 -11872 10899 25199 15546 3927 -7251 -14484 -21631
20185 -21631 -22098 -7103 8164 17399 7136 7353 11290 7384 5702 599 -6541 -8205 -9407 -7816
20171 -7816 -5371 -395 4794 -1114 16430 27558 8232 -13439 -11082 -4825 4158 4911 -10046 -9764
20157 -9764 11695 18459 14545 992 1397 -313 -4714 -7556 -1333 1647 3161 2842 -18136 -19338
20143 -19338 -23688 -28952 -25030 -5382 -5013 -3083 2068 5268 15430 4925 -8388 -21998 -12595
20130 -12595 -9855 -13883 -6186 -67 -1064 -10187 -6996 -16239 -10825 3475 3037 -14424 -17787 -18176 -18377
20115 -18377 -9959 -8225 -2526 -9990 -6643 -8346 -11682 -16078 -6583 -507 -3749 -1024 6183 -176
20101 -176 -4232 -14494 -18245 -16085 -9635 -7182 1051 11515 14798 2536 -17898 -25223 -30529 -15225
20087 -15225 -1411 -5858 143 -3456 -11913 -6426 -148 -216 0 -7590 4606 16181 16051 11773 11327
20072 11327 4413 5251 -2195 -1084 -5967 -3792 -304 -3246 -561 13198 7002 -12366 -13372 -6049
20058 -6049 12121 17789 15801 1537 -10969 -18029 -14712 -3337 131 -3011 5432 9579 5098 1876
20044 1876 -15459 -6819 3715 -1729 1405 -6742 -6299 976 16855 12837 10927 6760 6342 -14526
20030 -14526 -17358 -11683 -10099 669 9684 8870 -4191 6641 18095 17626 12569 8850 13181 9567
20016 9567 3842 9147 10077 -2979 10785 6282 -2344 5869 9650 9085 7534 19636 10537 7592
20002 7592 6470 -3544 -22477 -31401 -15481 -11412 -14920 -8751 2205 -2779 -704 -4928 -7662 -2447
19988 -2447 8819 10733 15721 32368 31929 14050 9596 6125 13804 30569 26365 20770 9594 -3789
19974 -3789 -14097 -10400 2489 25182 35063 19593 7500 6675 11882 16148 14345 10395 6798 16455
19960 16455 15983 14765 7780 -592 -19 11683 8557 4817 -5528 -6994 -4132 3027 4932 -2743
19946 -2743 2241 -1053 -3681 -870 -4502 -3540 -2388 -4554 -7218 4141 15860 14207 13982 12132 4841
19931 4841 -12226 -19858 -1882 4012 6397 6543 -14 3060 4884 8772 15705 -746 -11940 -7186
19917 -7186 499 12937 20307 11091 -8191 -4604 -8402 -6335 -5119 -989 4496 6018 -5227 -6075
19903 -6075 6343 15222 7129 -60 5089 10260 -4323 -15437 383 8668 5585 2323 -5932 -19150
19889 -19150 -19065 -7018 -2045 8256 770 -6516 -10242 -13265 -16274 -8463 -6534 -1778 -13902 -12214
19875 -12214 -13237 -9701 -4670 -7989 -1042 -5782 -8561 -2711 -5304 -7734 -6984 -3565 4566 -107 -6371
19860 -6371 -8226 -12202 -9467 10014 3632 3617 9591 -1588 3132 2013 1628 2607 4105 4733 13143
19845 13143 6034 1806 7650 9372 12997 7928 22713 16152 -3334 -4203 3315 11953 12235 3450
19831 3450 -2768 -2066 -773 10729 16656 13679 15713 2005 -1609 6300 -1687 -9920 -9320 -948 8471
19816 8471 9155 14481 13648 13831 11952 9144 3141 -1284 616 19057 26208 21853 15409 14427 25326
19801 25326 18878 10746 8864 -572 -3906 3237 3220 605 -2016 7596 20685 18230 5256 1100
19787 1100 796 2019 -2564 -11962 -7515 4334 999 -14006 -1979 1978 8309 16149 2983 -165
19773 -165 8574 11384 8133 13907 8589 4961 2863 -2575 538 4483 3735 -2010 -3478 -3618 -5588
19758 -5588 1007 9617 4034 -246 5470 4200 -10339 -9920 -6740 6311 4316 -5736 -3404 -1947
19744 -1947 -18596 -14565 -10258 -26779 -17772 1590 3987 -4156 5802 3606 -5659 -11615 -9442 -13986
19730 -13986 -4542 -1347 7208 3039 -9611 -6885 9128 14302 9860 8393 16510 10568 -7475 4808
19716 4808 7314 -6411 -3787 18612 21669 5583 -5765 -23522 -17732 -2037 19738 12287 8090
19703 8090 7344 6167 6104 20136 16770 5101 -622 -4926 -9706 -2610 942 -3837 9314 2793 -3101
19688 -3101 8145 7091 -4784 -12856 -5171 2616 3972 -4647 -4672 1848 4282 13596 571 1173 1123
19673 1123 -2576 291 4779 4535 12358 13229 5473 8703 -6231 -919 -1374 -12799 -4997 787 11004
19658 11004 -1836 -15745 -27159 -21869 -7923 -1495 -2049 -5486 5889 5231 1133 7737 15337 10558
19644 10558 4912 -2183 3602 20876 29341 13631 273 -2400 -15239 -10002 18213 30464 35337
19631 35337 32137 17457 2737 5151 10530 15005 7698 1444 10598 22064 36178 26433 15415
19618 15415 21883 39678 39640 20181 22633 21771 3685 -1875 -13542 -12043 -767 27775 41635
19605 41635 23676 3211 4167 5240 924 -9713 1687 1111 -19 8289 27220 47017 48489
19592 48489 44790 42199 30199 35798 41627 40055 47138 53403 53506 51941 47362 52548 49968 51715
19578 51715 50189 40445 45025 54356 47827 40132 46173 49379 32157 10863 15659 16026 24856 16769
19564 16769 6638 7221 4046 18897 18505 9715 16898 11234 21731 17962 1148 -3424 -22 -4488
19550 -4488 216 -5901 -724 -9814 -1547 5715 8746 26973 26676 25263 26096 20630 4969 8644 6624
19535 6624 4325 10044 15623 26119 26685 24867 17184 18763 29915 36240 41171 47450 47632 65478
19521 65478 74731 70539 65090 73913 86422 82575 60136 51272 59328 50014 38117 18614 13759
19508 13759 24285 23278 8453 -577 6783 13224 23762 27916 22595 23151 17894 25875 27993 45046
19494 45046 55981 63550 45288 47825 50927 94076 112765 107940 101304 91997 77184 86637 88826
19481 88826 74957 58248 61928 71934 71861 65115 68485 64762 75114 111168 133206 122362 111696
19468 111696 118956 108735 103426 99539 90496 67798 53802 64380 69235 63732 58927 47492 36232
19455 36232 27661 30569 33495 38752 44348 44004 46924 50088 51237 47511 47945 42481 30235 22432 19161
19440 19161 9509 24340 39618 38717 44424 58193 71067 78164 79360 91046 87363 97770 126305
19427 126305 148176 148530 175525 209785 246176 299469 339309 374465 395315 400781 392878 375154
19415 375154 352296 326414 307067 320401 338767 370035 384243 386910 393856 393947 378716 361554
19403 361554 341406 302948 265352 247621 239448 248838 266594 306512 379300 442602 458912 458789
19391 458789 469209 477288 458054 414489 363290 316601 289141 285897 283196 298372 324580 373368
19379 373368 432609 451230 454309 479811 495666 471544 416687 346706 287721 253090 231466 207268
19367 207268 194802 194950 181579 160732 145245 141758 143847 120935 105238 117867 124404 129524 128858
19354 128858 140761 140856 136440 127586 133297 120888 113769 114713 120432 126159 122510 118292 113013 105067
19340 105067 84450 71298 73943 78720 65337 60220 60282 70653 77975 81065 89609 88223 71297
19327 71297 66721 54300 50314 45062 41739 29823 46689 58258 78821 87369 86238 63772 69068
19314 69068 77286 69261 53694 44339 48251 52932 54320 54683 49846 51434 53598 35345 22075 25402
19300 25402 31997 35460 36153 55453 59203 54877 51010 25858 24114 25211 19357 5028 -103 16222
19286 16222 21989 22192 22983 13047 8302 10540 11112 27558 46442 56966 61200 55525 53199 49966
19272 49966 37043 27322 35666 40001 34624 31929 29339 26818 31991 24055 8496 11644 24886 28280
19258 28280 17629 538 -5719 -1840 -8934 2789 13298 15105 10553 9774 16829 26825 32434 31810
19244 31810 22095 18031 24799 43277 42192 41528 48822 46415 42345 37807 36129 39729 53087 40281
19230 40281 26927 21812 36159 36427 32926 33990 27528 -395 1508 15878 5880 4451 12818 11732
19216 11732 -1653 13356 30961 32866 30622 31044 28609 29694 25691 23156 17425 19615 27909 15314
19202 15314 5688 6920 8907 17050 13969 16326 28839 38153 42623 54043 58207 56342 37565 17415
19188 17415 17802 16050 23746 26035 29230 26998 17607 7404 25281 44711 55684 65212 62402 66003
19174 66003 65581 60681 55490 49580 51069 48575 34633 20830 18737 20885 31152 42288 50715 49007
19160 49007 49627 49614 57358 44415 34685 44897 49190 36383 38961 43814 30312 35294 42714 45942
19146 45942 40759 42059 35113 24256 23384 23612 22572 30057 38181 42179 40412 47963 51513 39254
19132 39254 32976 41373 38808 28280 29332 26489 28543 41663 39554 25236 45010 55917 48689
19119 48689 43230 54855 57388 56401 63798 52568 38359 48770 60233 64382 73425 65172 63415
19106 63415 60407 52105 48031 55536 62125 58784 54439 65790 76942 70205 62184 60052 71729 96055
19092 96055 113233 122696 132939 124935 123106 119154 109351 100955 100690 120171 130416 128752 126460 136296
19078 136296 147137 150547 144619 146375 140226 123461 95003 89041 97083 98720 101953 103725 91850
19065 91850 82588 86192 101915 116961 123065 122206 136055 149313 163430 169543 174753 184991 169354
19052 169354 152889 139769 132939 123182 115466 123136 129706 132837 130358 133805 137546 142050 142125 134140
19038 134140 129828 123442 125235 120327 99094 91963 87719 93130 109611 107319 99569 81769 66595
19025 66595 58152 77741 88433 90868 91796 99260 102496 104603 109591 110068 100709 97515 95019 85282
19011 85282 81986 79834 86230 95828 80556 71384 79164 84878 83398 82055 88488 99429 101045 102821
18997 102821 101672 88168 95644 106484 121295 133750 136116 126914 120753 123699 125900 125697 134523
18984 134523 144313 150151 156865 169955 170147 166762 161553 157595 174070 179519 178854 177905 195124 208375
18970 208375 219516 246955 289662 312295 330787 355184 373435 400465 419021 418792 419408 442527
18958 442527 473899 495244 507757 528286 557566 580850 589630 585835 573108 574380 573666 567174 572577
18945 572577 559369 534754 529507 524146 530440 537332 554637 567825 585125 589125 577860 577541 568938
18932 568938 571500 572195 596516 634922 657288 643758 641734 661317 686095 707614 727799 755446
18920 755446 786518 819333 834090 832287 839298 861832 878438 874608 851408 856537 901508 932223
18908 932223 957130 986556 1014734 1050372 1081959 1101352 1108415 1104356 1106173 1117386 1123461 1142485
18896 1142485 1166746 1174035 1173796 1169853 1167575 1167006 1155385 1145782 1147945 1150555 1162450 1179068 1203616
18883 1203616 1248461 1283219 1305187 1366361 1446365 1517501 1570887 1606135 1663598 1737424 1815885
18872 1815885 1910196 1990604 2078965 2179253 2284559 2387411 2510191 2643288 2746191 2842578
18862 2842578 2954171 3080537 3215029 3355932 3500242 3658409 3851740 4084836 4361337
18853 4361337 4689960 5036198 5407618 5840131 6370158 7034226 7858010 8886250 10231494
18844 10231494 12021724 14470336 17858249 22532059 28807501 36645285 44861840 51427178
18836 51427178 56034262 60017090 63666509 65197850 63323092 59465624 55799881 53994159
18828 53994159 54996592 58654687 63222513 66399776 68057936 69402674 70280893 68595458
18820 68595458 63349915 55980269 48369725 41747250 36550227 32662157 29841688 27944958
18812 27944958 26849492 26481494 26817191 28076316 30737718 35525859 43584200 56145271
18804 56145271 70492184 77328810 77080116 76385362 77950447 76909995 69699918 60501891
18796 60501891 52191304 46286615 43223913 42943463 45620194 51933409 62968487 76249609
18788 76249609 82359826 81158347 79438264 80046236 78258555 70032297 59417752 49376379
18780 49376379 41299563 35376141 31138576 28104518 25934081 24325125 22928917 21656223
18772 21656223 20585069 19680755 18755272 17755507 16810687 15950890 15163021 14461485 13888239
18763 13888239 13497377 13264410 13187043 13182627 12997084 12684728 12367588 12072649 11636824 11011021
18753 11011021 10349543 9725989 9138908 8582279 8086848 7633627 7219717 6830430 6469566
18744 6469566 6150950 5862798 5597544 5340547 5090698 4865197 4660629 4481038 4307946
18735 4307946 4129451 3962609 3812776 3665485 3516215 3360730 3214065 3095146 2990309
18726 2990309 2897938 2811666 2733906 2654942 2556526 2470640 2384970 2299708 2202747 2107992 2007994
18715 2007994 1933123 1843596 1766721 1713576 1677448 1636863 1605422 1571203 1541831 1517146 1479698
18704 1479698 1415919 1344122 1285320 1231999 1177671 1131586 1098172 1055058 1018947 996539 975873
18693 975873 949663 915055 876761 864010 861606 867230 854809 841187 817555 769690 742578 730122
18681 730122 724473 718752 720300 734838 787667 827451 831207 838869 853896 868155 884321 878414 858462
18668 858462 831883 802855 773131 753524 746399 760100 795781 832959 836304 820676 810356 805194
18656 805194 777369 738393 703040 666672 632361 594831 565004 548929 534058 535365 524508 516749
18644 516749 515731 509385 502893 502254 501353 501296 505440 512229 508470 507030 507418 510493 519035 512580 511317
18629 511317 520011 513940 511292 520742 506701 496726 506719 501443 489915 479875 468472 471992 479052
18616 479052 489747 494233 491449 479902 481498 470846 445985 430768 414396 408649 402991 396566 392694
18603 392694 403268 415858 425122 431512 422089 426638 425506 413780 413768 414414 409401 402713 426663 428593
18589 428593 413216 415465 409258 414045 420876 421081 405318 409839 413722 396994 380643 382377 386425
18576 386425 376107 370104 363113 364273 375989 386738 383647 380661 380154 377447 368024 349385 367954
18563 367954 387983 372568 363354 366617 374818 380546 409183 446270 499287 557646 607669 648031
18551 648031 700519 770583 814988 859469 922019 985059 1017189 1066461 1128385 1184218 1200233
18540 1200233 1201001 1200083 1172427 1134471 1121080 1079399 1012689 964379 926100 893717 858393 831428
18528 831428 790295 757667 732595 717135 704736 699401 708290 708254 715742 724948 754087 769762 782776
18515 782776 796979 832356 901963 992878 1095126 1168884 1202133 1228120 1250487 1278337 1327397
18504 1327397 1414462 1530675 1631165 1726458 1851692 2003840 2183981 2325531 2395964 2417178
18494 2417178 2399056 2370774 2328954 2263848 2212214 2199227 2214198 2194085 2136705 2084371 2033567
18483 2033567 1998211 1963503 1910557 1858993 1830428 1850578 1879689 1905731 1976255 2070790 2179972
18472 2179972 2291920 2440244 2631060 2882244 3228128 3726946 4456707 5535347 7073188
18463 7073188 9003688 11094322 13474014 15933828 17718593 18847318 19600205 19975087
18455 19975087 19642512 18749226 17902997 17356088 17325822 18207766 20150280 22828920 25649012
18446 25649012 27594683 28338336 27614624 25353597 22495175 19481522 16601552 14167826
18438 14167826 12273088 10841818 9802506 9057444 8504196 8077038 7769964 7581698 7466596
18429 7466596 7420147 7464240 7576945 7784571 8099768 8604686 9402876 10614323 12434044
18420 12434044 14890674 17547603 20095874 23042643 26204998 28070314 28867749 29843053
18412 29843053 31167520 32508924 34012628 36498686 40438793 44505802 47535320 50254841
18404 50254841 52612237 52895342 51883277 50411688 48268708 46474933 45033359 42411946
18396 42411946 38867497 35074610 30886134 26624612 22867063 19832281 17517072 15834833
18388 15834833 14639446 13774932 13036495 12328020 11691556 11151358 10677155 10262851 9890535
18379 9890535 9564077 9291282 9081745 8963871 8912823 8884721 8893938 8903277 8839251 8769385 8752432
18368 8752432 8788390 8745188 8529582 8233286 7939418 7756193 7656591 7596746 7663409 7962165
18358 7962165 8594790 9709827 11554016 14361658 17759359 20403737 20811235 19117554
18350 19117554 16473218 13895870 11865089 10450416 9523038 8977029 8737485 8812883 9236955
18341 9236955 10088125 11547531 13880588 17408534 21904441 25245383 25221699 22642500 19174925
18332 19174925 15946525 13458509 11719651 10535393 9703543 9096748 8667936 8383376 8263072
18323 8263072 8378537 8756811 9413056 10409239 11885024 14118980 17448499 21862297 26702785
18314 26702785 31278794 33722729 33290521 30819684 27211134 23669177 20570466 18096789
18306 18096789 16368428 15411355 15224671 15774783 17167010 19722790 23888859 30055523
18298 30055523 37603113 44273688 46903651 44641991 39139483 32859657 27498855 23684462
18290 23684462 21484466 20616123 20188917 19160573 17686922 16227617 15008319 14101676
18282 14101676 13521982 13276237 13392628 13916827 14970259 16799342 19741488 23889436 28340805
18273 28340805 31473287 32600227 32246649 30582516 28090986 25447414 23275798 21858497
18265 21858497 21244393 21451455 22360054 23871515 25961355 27197725 26201433 23951012 21740905
18256 21740905 20342798 20137540 21315958 24102893 28584372 33805122 37404937 37241082
18248 37241082 33835469 29024685 24451075 20824387 18230827 16463826 15297661 14565089
18240 14565089 14121275 13893557 13869928 14051107 14446064 15134886 16237259 17796605 19829401
18231 19829401 22444243 26060629 31499003 39740972 50749830 61843211 68393849 68233567
18223 68233567 63008469 55744102 48763547 43613142 41082441 41602108 45640001 53238877
18215 53238877 62175388 67283427 65231801 58166485 49841184 42707788 37643382 34570685
18207 34570685 33173686 33229843 34807917 38327494 44463799 53321382 62913098 69766564
18199 69766564 73017474 75096653 77554747 78016794 73684763 65874978 57586009 50893406
18191 50893406 46628296 45086241 46485118 51415339 60212711 70351550 77695368 80706817
18183 80706817 77577116 70172652 62679325 57802405 57071812 61530628 70827831 78794373
18175 78794373 78022010 70117635 59692152 49943752 42238724 36583825 32443963 29312848
18167 29312848 26881406 24929682 23330992 21969405 20792097 19761127 18878982 18132870
18159 18132870 17537121 17155655 16992082 17162935 17844819 19159647 20956495 22606729 23530536
18150 23530536 23183998 21465064 19200237 17049191 15276578 13919189 12927016 12156406
18142 12156406 11503290 10946310 10484230 10148144 9968607 9988901 10145379 10089311 9681154 9128152
18132 9128152 8639496 8333874 8177828 7922209 7474617 6947381 6458070 6045035 5721777
18123 5721777 5466421 5270236 5138741 5027438 4946107 4927223 4980512 5134723 5449318 5995971
18113 5995971 6932637 8526377 11301462 16058934 21601478 22314193 19287133 15439389
18105 15439389 11978769 9463801 7778540 6627641 5817229 5254070 4855261 4534031 4284614
18096 4284614 4076668 3884943 3701963 3523505 3343050 3192544 3064639 2957689 2889869 2832884
18086 2832884 2784116 2720124 2629089 2525961 2426040 2350980 2285101 2234902 2203735 2191386 2178498
18075 2178498 2145067 2101622 2063287 2010923 1957985 1928573 1897912 1850281 1803103 1747496 1680378
18064 1680378 1616218 1565921 1527822 1483031 1438982 1399583 1375170 1367711 1363770 1362241 1355589 1357963
18052 1357963 1358194 1332631 1318752 1307287 1280851 1250244 1211317 1168507 1119065 1075919 1029976 980900
18040 980900 965505 941791 916425 911876 915598 916475 918206 923215 907553 888096 874138 887899 884790
18027 884790 884660 884721 865171 858254 848890 833565 839025 810051 795483 806199 804027 818122 827415
18014 827415 827055 806197 781087 792656 771505 760477 756566 731360 699832 682346 670746 657746
18002 657746 646973 643693 643115 640804 641036 646350 620594 609252 591977 564055 548771 539361 516842
17989 516842 514168 495781 488225 498190 499026 488613 464002 470753 486156 476274 464774 474164 474897
17976 474897 481524 478017 483074 483043 496214 485494 476445 473329 462838 437881 422707 428745 435264
17963 435264 426487 423738 430233 432787 439967 438492 419405 399199 394197 395462 394789 401723 415564 428975
17949 428975 447117 480152 492221 497954 512223 525072 526977 528693 534766 523995 518167 519246 511245
17936 511245 504793 503028 491298 486468 460569 445095 421243 397380 372066 350990 326893 309788
17924 309788 292771 299603 293057 290272 298281 302989 304698 295260 276189 257013 250247 251657 249869
17911 249869 264715 291483 315162 325907 357464 387329 397609 399999 408590 413408 400446 399011
17899 399011 410232 429958 449849 474428 486671 484328 467946 446756 421420 411994 398559 392547
17887 392547 382830 353018 342925 334145 315389 301808 300420 279437 268508 266737 269657 263423 245812
17874 245812 225167 226985 231263 225007 227127 222450 218642 214799 212685 199680 203008 209421 215505 231666
17860 231666 251502 265517 271276 267603 259132 246747 246243 249796 255249 270056 288655 307907 314546
17847 314546 297839 291875 280313 281596 289785 294266 316078 343991 346424 343883 349621 360905 351430
17834 351430 329281 318103 309836 291949 284588 266498 253008 256031 252880 269915 279017 276275 280684
17821 280684 268048 242708 231365 215731 203892 190064 189168 189820 185698 184063 181326 189874 193706
17808 193706 180355 176830 201961 222010 230813 244537 246280 230028 224791 243845 264351 297261
17796 297261 308091 321568 365401 398623 396209 384908 377299 373320 356477 336341 313056 315539
17784 315539 326207 326525 302269 288422 299396 304738 308400 293703 287255 282564 291017 279814 270791
17771 270791 249735 243294 232215 224790 219465 208117 189171 193523 210025 209646 222258 221059 206338
17758 206338 201139 201371 218822 230091 261626 306469 336608 338180 317669 311191 329197 346565
17746 346565 348407 350778 351699 349487 346432 351957 335968 311758 302911 295431 294190 308890 314935 318959
17732 318959 305348 275444 265979 268476 265945 251614 242783 237404 216040 217404 216626 206162 198990
17719 198990 191540 186243 184051 194671 196660 201051 199726 201385 222687 248303 259994 274656 300654
17706 300654 316893 327443 344464 350391 352768 358287 380740 410244 446111 475329 508686 526727
17694 526727 537627 517979 489092 446548 419722 405501 391553 380009 391957 395013 381350 372545
17682 372545 356348 354162 370391 368378 355454 350224 352683 344616 325326 298095 265776 248253
17670 248253 236626 230977 237490 241186 215672 201021 200717 206283 200450 208853 229734 259804 275677
17657 275677 306066 327072 351543 384403 446956 511429 561506 590436 619498 629950 624171 622916
17645 622916 615823 585812 551286 525156 504617 498767 517917 526820 532752 536747 534914 523246 487975
17632 487975 446386 420834 406981 404540 430681 449872 456166 438360 407311 390575 374213 340429
17620 340429 295169 280240 250968 228591 222992 217069 225906 237964 228892 213302 207600 188262
17608 188262 162540 140993 138428 128647 122342 115675 110492 117551 125270 125516 122388 126558 123023 129138
17594 129138 134729 126126 127862 139435 164792 162224 150829 148011 173255 173651 179349 183887 194493
17581 194493 223896 257394 265781 274274 271332 272803 270495 275359 288233 282545 266981 240871 212783
17568 212783 197364 173336 161760 158485 148767 146708 142904 132172 116467 108621 100490 104671 96342
17555 96342 92723 94297 88882 84300 79102 65003 70413 69308 55978 59181 61705 60787 67606 63838
17541 63838 54706 53235 66523 62749 72612 79931 70800 69890 81433 93424 89046 91477 95321 101914
17527 101914 98195 109826 129590 148382 168442 184373 189159 200013 215748 214367 201141 192483
17515 192483 197210 206921 209354 207213 220705 213870 201314 184682 160313 141604 132102 119312 122001
17502 122001 107392 96312 98037 97201 90609 82689 83496 70459 55384 53093 55131 57923 48992 53332
17488 53332 61004 66815 65169 65337 58734 50075 47956 65220 85234 82495 89068 92539 95960 110862
17474 110862 124355 122391 114770 109618 121399 138943 136393 121531 101710 113282 132463 148770
17462 148770 156111 161673 167483 161829 143274 116262 99810 100893 92980 80273 75563 80855 88045
17449 88045 91452 86199 69962 73328 85303 83706 101330 128089 134943 131999 120234 101211 91027
17436 91027 73865 61378 49537 62652 57641 50239 45554 48033 58390 49268 44837 28333 37672
17423 37672 47950 46373 38973 35315 23274 20557 24882 25064 32882 27313 30079 45996 41908 41704
17409 41704 47887 56393 54678 46103 45237 34389 23375 33875 39798 40727 54008 62013 58641 54083
17395 54083 36722 30172 29562 34062 46294 56381 64446 62796 66296 74489 85112 110598 152152
17382 152152 209517 250245 266197 267523 228122 199149 175764 161820 160959 170837 189487 217180
17370 217180 260968 323676 370384 391161 399586 398658 375938 320477 275441 237532 208990 192088
17358 192088 183537 186014 206691 241724 284274 302854 284071 263690 226424 209518 174703 138480
17346 138480 134590 128730 124911 118164 108211 87892 81887 75603 80802 95729 92141 79646 93694
17333 93694 100033 73040 69905 62358 52451 60144 65049 64062 64938 74648 73777 73416 74520 73199 73018
17318 73018 66677 63673 50216 61896 62950 52339 47964 57927 64932 65792 60667 63480 57649 41064
17304 41064 45396 30940 21572 29508 40804 47029 46596 58278 60492 52470 48391 49029 40938 45448
17290 45448 47688 35035 20516 35488 40683 33039 42764 40549 31013 23490 54596 48902 20462
17277 20462 2081 -5096 -9379 -10949 3635 -1764 793 14868 12896 7348 4013 9264 7574 17836
17263 17836 19002 7059 -6769 -6541 1681 -2855 -5602 -972 11057 8387 3500 10687 17981 16869
17249 16869 9336 20240 26239 7912 1459 -375 -13639 -9585 -6188 -5373 -3395 -3297 71 7778
17235 7778 3788 -4199 155 3020 6562 16367 38151 36775 39088 26914 18997 14429 12832 6443
17221 6443 -8433 -7447 14871 16112 1659 12512 13985 16292 20329 28655 19921 7245 11030 28299
17207 28299 26151 37439 41870 34275 17299 15466 23050 39395 35364 20396 36510 48897 36391
17194 36391 26536 32221 35672 29517 10332 3459 15735 18893 10701 19155 29199 35646 35641 36611 44994
17179 44994 48664 53867 57388 53729 39617 29740 22841 34044 42961 49967 55592 68528 53953
17166 53953 46243 48163 51111 57130 54723 54655 65452 61266 59078 66671 66986 66483 82165 83933 60684
17151 60684 59433 58310 46376 29752 25687 27415 29403 35031 39858 54279 58716 47895 43185
17138 43185 37837 57893 69394 72517 75509 72032 78890 65572 66109 76081 74277 71994 80986 97217
17124 97217 102915 92042 76126 68407 67303 65252 57253 59003 57624 59605 53298 47495 46457 55484
17110 55484 56973 55589 62463 62928 58620 45066 45958 46516 40212 45463 53831 50838 63173 59129 63827
17095 63827 58350 49211 57339 58836 55249 52226 43433 46641 61888 79499 90024 98432 91062 83380
17081 83380 79541 89831 101639 102909 107028 96555 81065 69799 73987 68308 61075 62633 66398
17068 66398 69437 84274 94159 92179 94002 95018 107860 115219 107746 96642 100045 103331 106564 94345
17054 94345 87307 101377 96186 86315 103231 98566 81211 75789 73857 63459 44784 41534 40910
17041 40910 56183 57975 42800 34449 27628 31971 31886 31430 32669 29742 31527 23541 29253 35727 33588
17026 33588 35289 24294 15156 -4804 -28219 -22763 -11354 4283 -3845 -8442 1232 7463 -1183
17013 -1183 -7645 -7488 -12702 278 13432 15547 5234 -1593 8198 30253 35522 40446 44085 37265
16999 37265 41288 26374 9575 5324 13214 29574 50886 56138 61876 67599 53836 46996 50271
16986 50271 41075 38911 39794 35904 37554 50844 62494 48938 52717 53696 56203 61493 63469 49911
16972 49911 48647 42666 46391 57271 75716 92217 107126 110367 117249 91969 74303 76377 94058
16959 94058 94841 92381 89716 99039 133054 152971 154324 157555 158050 163757 166078 179200 184724 169090
16945 169090 154713 141634 143848 154844 161391 155052 162555 172500 185542 200086 205026 195877 203900
16932 203900 203381 202927 193370 180435 171792 174978 180102 185750 176825 170824 169600 181578 200199 198270
16918 198270 200739 213184 216601 213247 198847 197282 194164 200754 195296 180692 178294 178410 186280 184125
16904 184125 202580 212963 220690 235776 240875 254426 264317 270572 265954 280247 291793 290323 294350
16891 294350 306990 311514 317613 337425 363398 362361 374752 395678 403166 413301 423000 427135 435656
16878 435656 432877 435815 445961 469400 494800 534538 561962 578784 582541 591438 609528 618012
16866 618012 619623 650608 668171 684444 701876 715425 723718 740457 771874 818237 871391 934003
16854 934003 1007951 1068339 1132760 1222256 1297847 1343707 1383274 1397894 1440406 1504147 1581350
16843 1581350 1674404 1797260 1952480 2158939 2394997 2610443 2818092 3034057 3255624 3510551
16833 3510551 3840276 4297312 4973783 5939453 7298396 9248769 12115727 16364819 22807841
16824 22807841 32336072 43424575 48879624 46115088 39736155 33157411 28234567 25513620
16816 25513620 24901502 26395068 30328459 37461303 48639604 61937684 70790187 74999819
16808 74999819 77811804 75534138 66803888 56115430 46360131 38947190 34108609 31521668
16800 31521668 31012361 32689084 37106405 44798080 53598964 56272576 51427854 43652292
16792 43652292 35928901 29698881 25131881 21838034 19378470 17451387 15913014 14683659
16784 14683659 13670248 12856167 12199219 11681030 11280702 10985349 10736334 10484480 10177104
16775 10177104 9775859 9329274 8866711 8401257 7968372 7577545 7234684 6955539 6722425
16766 6722425 6557725 6398355 6241018 6067174 5816492 5540943 5268789 5002761 4766541
16757 4766541 4566585 4408368 4303681 4284690 4353793 4471191 4457124 4239191 3941770 3652959
16747 3652959 3391163 3184596 3027976 2953493 2946584 3038111 3259371 3515017 3668889 3730640
16737 3730640 3731453 3583603 3277086 2913242 2587283 2331007 2157358 2042722 1960045 1969276
16727 1969276 2069152 2248973 2420982 2419155 2238516 2002786 1764765 1556731 1404120 1286872
16717 1286872 1196785 1119201 1065806 1017741 982806 953925 928042 908377 874507 827459 788313
16706 788313 754240 721111 688391 659810 638925 626498 603448 575666 555104 542243 534888 547275
16694 547275 526657 483994 464325 461061 439456 426834 421476 407148 389081 386126 392094 384248
16682 384248 366296 355209 364948 367560 337520 309641 285929 272752 267435 258364 248148 255541
16670 255541 257854 259167 257190 244845 229840 220053 212154 212789 205882 173206 184966 209465 211441
16657 211441 204695 209980 209955 208656 211104 210628 201763 199765 200316 195600 194740 184182 174022 171780 191153
16642 191153 202964 213303 218703 214920 199131 184168 187397 189865 187673 189957 192260 191464 192745
16629 192745 202667 197825 200671 197190 192262 195804 199851 207167 206522 204407 198086 198992 202492 200555 190456
16614 190456 191502 202827 203736 191015 198152 213904 217347 210394 203768 199902 189642 194265 193711 178944
16600 178944 164188 172677 181869 187291 184326 183611 173383 162960 143657 126160 130618 123786 120713
16587 120713 128420 127525 127834 131329 133978 129734 126984 125913 128276 118378 108773 120164 125256 131279
16573 131279 136157 167146 194405 203765 204585 194318 172318 154613 149780 153194 150744 152476 178165
16560 178165 215163 275567 318175 319866 287728 248749 216913 191069 155527 136161 124022 108946
16548 108946 114372 124794 162027 181224 184213 177522 161871 143579 124317 119122 99424 99285 113872
16535 113872 111549 107906 99840 86109 81791 69367 75415 85722 85549 79342 76088 63747 58433
16522 58433 65633 86089 87632 84421 100303 119444 120122 108209 96559 94056 102320 98979 86766
16509 86766 78964 85198 81200 73087 52798 51997 58874 64237 81474 96068 84778 81018 81182 68721
16495 68721 67776 65403 67901 74032 72267 66797 63248 64399 65075 67238 50342 36244 38925 46393
16481 46393 47128 38905 34612 27523 33798 44827 47269 38499 35666 39684 45983 55836 64843 77171
16467 77171 66772 59725 53696 45402 47487 58809 60920 61613 64075 57552 51619 53700 59423 77870
16453 77870 89662 94426 87567 77723 74132 67706 68340 82421 94681 92239 95981 98321 91186 106505
16439 106505 120470 120545 120619 133579 127725 123550 108948 85036 83675 83945 78737 81981 81226 87710 100523
16424 100523 102845 92723 82252 75100 67486 45045 28335 33547 38674 41697 44294 57862 64365
16411 64365 59399 45322 46316 39297 44142 52177 59123 61631 59165 55444 46465 50416 39586 32669
16397 32669 36489 43072 50172 50653 57760 48834 33599 41675 48717 42063 26086 23711 32527 26578
16383 26578 23501 16842 17561 11566 9826 11590 14831 19153 15507 12032 16117 26467 10867 2757
16369 2757 7521 854 -10915 9554 22190 30349 31362 42761 41681 31214 39787 42051 32665
16356 32665 44760 47853 43628 46935 44622 38196 40609 44294 37024 33543 42041 54902 55868 34588
16342 34588 27178 29698 27231 28195 27127 22625 30465 37236 28792 16889 28919 33770 20800 6903
16328 6903 11168 7944 2577 -5062 1239 -3927 -7495 -8228 -10928 -5680 -11945 -4683 7438 4318 -12236
16313 -12236 3076 12624 13045 10420 3935 -13282 -21669 -10233 -12472 -10694 -13641 -8882 -9490 721
16299 721 7953 8382 22437 22918 26634 28387 30624 29856 33284 29137 17273 20117 9878 -1710 -5856
16284 -5856 2622 -3020 -7945 -15004 2220 9629 5328 -5979 -8601 2740 17168 26353 42364
16271 42364 47559 41391 35551 44298 43185 35052 34066 48204 67417 83566 108372 148251 197337
16258 197337 241206 245300 236848 202930 162576 143006 127828 136771 162823 197397 250314 312271
16246 312271 368783 392677 408339 410770 384841 334724 282186 225481 193989 188076 178913 175415
16234 175415 192593 210657 243772 279669 284206 259529 227521 190751 162891 130788 115238 95723
16222 95723 82125 82842 87580 85442 70313 58176 53981 44297 59895 80981 85313 72952 53224
16209 53224 39201 51144 56765 53240 50804 49713 54124 53669 49230 46299 40133 47305 50965 42937
16195 42937 37169 39799 38101 25403 14177 17467 24007 38249 49950 57023 48805 32807 25738
16182 25738 23457 25636 24609 27224 36182 26525 20241 34460 37978 32459 28986 24056 27120 27638
16168 27638 24441 27262 26962 23911 16473 3353 7114 17246 9095 6480 5850 11360 18403 31898
16154 31898 24366 7664 5252 8164 7327 8254 6852 4543 -6729 -14010 -19440 -29642 -18514 1641
16140 1641 1378 519 7175 14542 10163 594 -8888 -8466 -7044 2256 -951 1711 6290 8526 8554 15107
16124 15107 12085 5357 -9332 -14484 -12731 222 4161 -11992 -15388 -6095 2760 15413 17874
16111 17874 7591 11155 6004 396 -4393 6333 3947 -149 999 5334 3709 -1226 -446 -7904
16097 -7904 -525 6301 10119 -6397 -13957 -3536 6557 6344 -7198 -11825 -4637 -6445 -1286 -999
16083 -999 -3999 -7873 -17276 -20082 -14274 -5210 -5035 374 1798 2507 10872 9130 4869 1697 -1676
16068 -1676 1988 8790 -1380 -3138 295 12652 15996 3941 9502 17254 22013 9348 -9022
16055 -9022 -9376 -12021 -12651 -1213 3855 2803 1650 3160 2907 -1981 2566 8618 10585 7876 5245
16040 5245 -9928 -15381 -15925 -24421 -26567 -16043 -11140 -18154 -12759 -1782 -4603 -21724 -10791 -1085
16026 -1085 -5544 -8084 -18033 -17755 -5390 5073 -5096 -14713 -2657 12512 15200 9447 6156 -7070
16012 -7070 -10693 -1590 -3324 -9859 -13413 -10534 -13363 -9960 1213 834 -10635 -15964 -15242 -6982 -10689
15997 -10689 -8006 -8909 -147 2732 7176 14150 12162 9592 1106 6884 18269 4167 -7699 -597
15983 -597 -3417 -10817 -19244 -7226 3498 1805 -3031 5327 15090 14512 8847 4424 1529 -735 9549
15968 9549 6537 -8690 -6912 -9232 -17132 -21796 -12591 4362 -6698 -12705 -19376 -21109 -4123 -5071
15954 -5071 -8158 -9663 -2268 1056 11101 8007 8578 16657 6681 -11566 -12106 -11871 -8727 66 -9590
15939 -9590 -17399 -18103 -12414 -1386 -574 -4077 -1562 7026 4727 -10123 -12525 1135 -10808 -17232
15925 -17232 -8801 -1013 1032 -4447 -10568 -12141 -4218 -2290 -6165 -7059 -11093 -17798 -11452 -4865 -2550
15910 -2550 2958 -1603 -2476 -12248 -8359 -15695 -34356 -31540 -16567 -2959 1693 1274 -8276 -19171
15896 -19171 -9491 -14717 -14410 -12918 3717 15605 19913 15892 -1084 -11115 3421 4255 -50 4607
15882 4607 -2794 -14926 -12840 1137 19140 15809 11397 14792 8440 12180 17810 16579 3489 2106
15868 2106 612 -4312 8426 5181 12092 -3943 -21168 -17208 -15207 -10671 -5279 6681 18834
15855 18834 15903 11933 -1212 -15914 -12102 -2112 -1174 -14939 -4033 863 2928 -1955 -5005 -11653
15841 -11653 -2448 10551 7510 5921 66 -6289 -8551 -6171 994 8313 506 5462 15133 24019
15827 24019 15110 11207 10286 11402 8937 -11085 -20298 -17471 -21016 -9858 -10064 -20682 -25508 -34006
15813 -34006 -27898 -7283 9492 25982 28323 21228 18515 16461 4072 -6307 9430 22494 6979
15800 6979 -15753 -7987 5877 9747 1825 2193 401 2332 8540 7823 12649 17345 12192 11829 11481
15785 11481 5666 -488 -12281 -12066 -765 7255 -782 -5843 -16887 -23962 -13440 -19282 -21774 -24772
15771 -24772 -38866 -24034 -23624 -23937 -16681 -14378 -6761 1913 3985 525 -4561 -3759 -20928 -19397
15757 -19397 -27274 -22573 -23961 -20554 -18982 -32146 -28981 -12489 -13758 -4522 -4059 8708 11090 15922
15743 15922 15027 2935 9617 1759 1920 7923 10594 9612 6185 -584 -3958 -5835 1719 9828 15753
15728 15753 12961 10961 2203 -1103 7514 12634 14898 18690 27326 25563 15210 2290 -5459 -6195
15714 -6195 -13780 -19030 -8052 -15885 -15255 2264 6991 -26501 -48718 -43518 -32886 -28877 -29242 -11715
15700 -11715 -20835 -16321 -9940 -21485 -9722 7186 11486 -7950 -14721 -10666 -6656 -3201 -4055 -2820
15686 -2820 4716 9223 -3704 -8822 -11258 -2604 -12250 -20946 -18916 -19039 -12120 -7846 -4268 2290 9709
15671 9709 12356 3993 -15398 -15309 -12801 -5678 -15017 -22651 -24474 -27732 -21969 -10804 -3892 1074 2666
15656 2666 8822 23384 31045 29742 17382 8158 9595 6506 16433 19415 2276 -11491 -6431 -8881
15642 -8881 -18394 -23548 -14436 -10524 -4157 544 -5904 5482 2732 -4786 -16428 -18786 -22692 -28769
15628 -28769 -11929 -8882 -5353 12040 9557 2378 4112 8646 3131 -4115 -10305 -10632 -14943 -5251
15614 -5251 -12989 -24901 -23036 -17989 -15134 -11290 -3770 -13382 -9771 -8527 -10268 -2315 -5849 -7896
15600 -7896 -20458 -24416 -22118 -28200 -23782 -24491 -21324 -18007 -16747 -17258 -4861 -4532 -342 5934 -4945
15585 -4945 -11297 -18948 -18246 -10406 -26571 -35967 -47982 -41237 -24920 -20687 -25250 -15358 -7305 -4729
15571 -4729 -4844 -22078 -35030 -31097 -23493 -7364 803 12994 11247 12878 8478 8700 4828 7318
15557 7318 8680 -952 -4570 -6814 -14468 -13644 -16454 -18530 -4931 7377 15956 3187 -1013 8194
15543 8194 4590 15433 7930 -3324 7294 15688 6076 -8354 -9794 -8149 -13383 -11327 -3423 -6412
15529 -6412 -6262 -5575 3743 -5379 -9386 -321 11928 25110 28488 22918 15581 2262 -2828 5425
15515 5425 -4507 -12972 -7554 304 3078 -14664 -15117 -10165 -13764 -12603 -1951 3427 -7949 -9162
15501 -9162 -8541 -3123 7850 8665 5159 -575 -5798 -13156 -17020 -16590 -9758 -4006 -10315 -8678 -5843
15486 -5843 -8291 -11459 4863 8434 11097 21160 21756 22030 26249 13025 -170 -392 -6176 -7938
15472 -7938 -3424 -8475 -5870 -7699 -10437 -9899 -5945 -104 -2119 -1366 -1537 -7325 -13879 -19382 -20651
15457 -20651 -14112 -1294 2815 -6592 -16703 -17752 -19136 -18936 -19741 -16211 -14131 -16781 -19459 -21694
15443 -21694 -8965 -4270 -14503 -18522 -6403 4564 5461 3908 6580 -4324 -9619 -10914 -25468
15430 -25468 -20010 -8689 -5151 -8313 -15475 -11456 -18126 -29686 -35359 -22583 -5706 -12627 -14924
15417 -14924 -13270 -14194 -5901 -3376 -11039 -10852 -15526 -12958 -1560 3760 9779 -2171 -10530 -3769
15403 -3769 -6484 -6103 -4629 -12145 -7206 -3758 -10815 -1231 18874 14424 4495 -7912 -7623 -9512 -12447
15388 -12447 -14673 -17744 -32581 -28581 -13930 -10822 -20750 -7816 10108 11422 14147 9036 1876
15375 1876 -2812 8956 12149 12888 -2051 -14068 -1309 -3594 -13916 -21826 -30174 -27393 -21666 -27658
15361 -27658 -14165 -8160 -564 -11640 -25067 -18904 -5578 9805 6130 -8287 -17986 -10230 -7233
15348 -7233 -1584 2207 5429 10891 8716 6447 481 -7248 -447 -3652 -5632 -11620 -14934 -8041 -17951
15333 -17951 -19181 11321 19491 14252 -2837 -9890 -12019 -30630 -26651 -19934 -14536 2480 2457 2669
15319 2669 -4330 -921 8482 -1085 -13213 -16574 -21144 -5049 5726 2907 -5001 -11276 -19476 -10501
15305 -10501 -9022 -106 9642 13214 10063 -1611 -10269 -8897 -769 -5706 -18062 -22383 -25954 -14189
15291 -14189 -11720 -15763 -12435 -10813 -10574 -4432 -14 274 -6090 -11706 -21645 -29598 -40319 -28409
15277 -28409 -20476 -10644 6050 9386 -2158 -5472 -20240 -20147 -24879 -24717 -12744 -15910 -22309 -15873
15263 -15873 -11408 -8208 -8155 -3212 864 9289 2603 -12850 -21059 -24680 -26859 -28805 -30251 -10156
15249 -10156 10 4739 -7153 -9434 -19417 -27633 -24557 -14195 -22625 -15715 -14428 -14964 -17476 -8180
15235 -8180 -22567 -30040 -19464 -12361 -8139 -14967 -34647 -24484 -13635 -16039 -22591 -16084 -6738
15222 -6738 1663 -3818 -10762 -6829 -9962 -13364 -11979 -13038 -18464 -7751 -249 -1797 7423 3242
15208 3242 -17174 -25250 -25152 -17548 -19790 -15558 -14444 1699 -10412 -10723 6296 11110 9262 -5297
15194 -5297 -20396 -18880 -17574 -176 -104 -6136 -21478 -28032 -21892 -12734 -5955 7351 6305 1531
15180 1531 1019 10063 6761 2535 -4625 -5208 -3488 1707 1427 993 -13116 -603 23530 9818 311
15165 311 -1432 -7891 -19667 -22465 -27307 -29436 -15126 -16689 -6526 8460 1285 -4493 -14590 -18263
15151 -18263 -13823 -4410 -3831 -15148 -16444 -328 7565 -3955 -19989 -28741 -31391 -19275 -3786
15138 -3786 3661 -724 1647 -11420 -9147 6707 5466 9561 14869 10506 1395 -10988 -7663 158
15124 158 -4376 -1513 9984 4597 5393 3361 -6687 -15545 -20935 -1928 290 -6666 -17193 -29191
15110 -29191 -26672 -11959 -21125 -34792 -39719 -35062 -33735 -27681 -21727 -9247 -7423 -26325 -28213
15097 -28213 -32155 -25247 -20038 -26084 -31091 -21585 -3143 -9138 -11215 -12856 -10563 -13564 -11087 -3045
15083 -3045 -4657 -16588 -30809 -20863 -23056 -12822 -2171 -9519 -25454 -25422 -20545 -11803 -10274 -13357
15069 -13357 -23401 -18471 -17560 -3853 -2323 -17425 -17104 -14042 -12484 -12162 -13569 -20933 -10764 -1600
15055 -1600 -11686 -9718 -9983 -17236 1851 9584 3950 5952 9225 -5829 -15341 -20348 -13228 -8695
15041 -8695 4455 11689 4157 -1277 -9529 -16402 -13882 -15636 -3278 -2230 -5384 -193 -10589 -10395
15027 -10395 919 2209 -12317 1425 509 -12296 -5044 6934 8075 8072 -78 2558 11856 4271
15013 4271 -9268 -16351 -20834 -20616 -8824 -1595 9738 8424 -1456 -5189 17143 23742 23538 7324
14999 7324 8408 12435 7802 -6910 -25107 -30953 -22273 -1322 -835 -4469 -10020 -16253 -12651 -2596
14985 -2596 -719 2611 11906 12365 7591 5090 -13328 -19607 -8470 2184 1420 9518 -3539 -3155
14971 -3155 6329 -6047 -16405 -6891 -257 -18637 -28770 -28523 -31580 -29898 -34695 -34421 -34530 -31326
14957 -31326 -24645 -20592 -11843 -3041 4846 -5344 -16131 -12558 15 1503 -5937 -5555 -14863 -18823
14943 -18823 -12202 -9566 -24993 -35024 -35002 -25455 -24622 -21798 -21734 -4602 -9915 -7920 2194 2367 901
14928 901 3505 -9280 -9488 -6733 -9942 -13871 -12736 -10517 2411 14883 1858 -7307 -989 -8093
14914 -8093 -8006 -1463 -1309 -8988 -17759 -13828 -13325 -6384 -3610 -6473 -9155 -29240 -38486 -31864 -20242
14899 -20242 -10817 8292 27481 43957 41519 30618 16175 18233 15801 5603 -10415 -17442 -22425
14886 -22425 -16672 -464 6835 -2878 -9724 -10839 -15711 -16671 -19970 -3886 1345 14670 17165 13587
14872 13587 6415 -12682 -13463 -14451 -4983 -1788 -2106 -7999 -1126 -6109 -12901 -7699 -18781 -19164 -13359
14857 -13359 -7893 -14036 -17483 -8570 -8659 -11736 -13459 -13141 -18777 -14401 -5242 6127 -477 -9787 -12910
14842 -12910 -14581 -20158 -21926 -11945 4055 8278 12130 -5740 -27366 -31986 -23623 -14893 -33243
14829 -33243 -35126 -19430 -6422 -6623 -16504 -19323 -8095 -4465 -5079 -5037 -17130 -19435 -27123 -31608
14815 -31608 -20126 -24306 -31352 -18353 -2297 -4269 -16873 -25108 -29621 -16661 -17664 -16500 -12688
14802 -12688 -16816 -23108 -25007 -24945 -14854 -7098 568 9100 -9039 -17913 -13007 -8741 -9760 -8357
14788 -8357 -20640 -22056 -19850 -8948 -4563 -12993 -3931 -8298 -4674 2513 11394 24522 21331 8611
14774 8611 -3622 -5851 -7794 -5797 -9177 -17485 -26555 -12542 -9200 -15067 -19807 -14796 3412 3892
14760 3892 -12251 -26577 -17412 -14652 -14697 -10387 6149 4251 -1718 -12410 -15713 -13524 4117 3488
14746 3488 6938 14097 5883 -13604 -9656 -4415 -18442 -19453 -17458 -23519 -31515 -33125 -14943 -3458
14732 -3458 6458 -6051 -19565 -9076 3540 11579 22364 14030 -2638 -8911 -8670 -8093 -1241 3899
14718 3899 4312 6734 502 -6431 -17375 -14560 -7960 -10070 -5921 -4602 -6550 -8714 -12212 -9537 4010
14703 4010 3651 3718 3816 1533 -4611 -20932 -30458 -28871 -23719 -16291 -31341 -40641 -31880 -13710 -1214
14688 -1214 -2550 -12961 -7648 1029 -5532 3601 13065 20437 16112 1883 -10233 -10502 -5151 -4245
14674 -4245 4639 7859 14519 15718 10058 5040 -10440 -19248 -24106 -24870 -18088 -11036 -8568 -12972 -14856
14659 -14856 -6727 5680 -2718 3228 6384 6102 21172 16485 -2000 -6386 -1034 -12487 -25703
14646 -25703 -20899 -23908 -17592 1554 6741 4336 3497 3858 -5487 -16903 -15280 458 -5061 515
14632 515 -182 -8529 -4712 -6528 1286 5337 -6339 -12074 -17125 -22675 -24060 -10689 -5521 -13476 -12892
14617 -12892 -7399 5139 -6831 -21246 -18223 -25968 -24853 -13142 -20205 -29396 -26901 -17442 -14841
14604 -14841 -24319 -24328 -13097 -8246 -11707 -17448 -32672 -37432 -39579 -32419 -24693 -16389 -16450 -16936 -19104
14589 -19104 -21504 -22569 -27151 -25455 -22719 -18147 -8919 -11899 -16390 -16924 -12549 -9819 -19171 -27328 -31147
14574 -31147 -11832 -314 -5528 -12219 -12832 -9336 -10212 -14303 -26641 -38118 -36716 -33838 -30164 -33607
14560 -33607 -28584 -12667 -8581 -22923 -23181 -5045 -6467 -6234 -13211 -11885 -7690 -6626 -2400 -5775
14546 -5775 -12169 -8586 -5770 -18583 -20182 -13946 -5240 -11723 -9382 -3652 -16482 -15130 -20823 -22206
14532 -22206 -15320 -16183 -11949 -17331 -9076 -7040 -10270 -15159 -22441 -25091 -29971 -30727 -20447 -925
14518 -925 -10080 -27504 -30474 -17655 -22257 -24072 -21871 -23488 -12431 -6819 -7464 -9977 -3806 -10482
14504 -10482 -16273 -11598 -9729 4915 -6340 -3876 3446 8265 13313 16269 6968 -1055 1118 1418
14490 1418 9000 9068 18975 5831 -12544 -12517 -11075 -6994 -13488 -10346 -8422 5557 1767 -2915 5257
14475 5257 12928 17391 7935 -7227 -4572 -7669 -888 19726 43189 60585 88588 119894 153280
14462 153280 189021 213264 220023 215904 192619 171943 136486 117975 107396 97666 90738 64338
14450 64338 44195 41585 39197 49448 48115 35203 30033 20941 16028 8311 3044 5590 9112 -5740
14436 -5740 -8448 -7812 -11834 -1685 -7741 -8345 -5874 2147 7780 8558 10877 10358 12877 18731 15184
14421 15184 14375 17979 19379 13015 2050 -8181 -12660 -14418 4926 12744 3373 -18364 -24452 -14120
14407 -14120 -7948 -2247 4985 6169 2352 -13482 -24552 -21077 -2522 5484 11110 10534 -685 -8540
14393 -8540 -8183 668 2318 -4889 -14537 -14818 -10048 -678 -4487 -367 4480 -5188 -10564 -294 6975
14378 6975 11659 14598 -2032 -17891 -21813 -15998 -10780 -19904 -17576 -4065 2768 -2137 -13061 -14439
14364 -14439 -25418 -18573 -9535 -11333 -25412 -22377 -10784 -4053 -4506 -8335 -10546 -11080 -16008 -12760
14350 -12760 -11395 -16374 -19522 -24469 -33560 -31189 -22930 -15123 -17667 -13601 -18962 -23238 -23020 -24322 -21602
14335 -21602 -5786 3552 1120 9720 2013 -2127 1228 -4141 -16968 -24482 -27373 -23274 -17316 -13160
14321 -13160 3260 -896 -8316 -11594 -9758 497 4167 -6186 -18139 -19104 -7712 -7447 -21181
14308 -21181 -24982 -26044 -23760 -7263 3995 -6597 -16377 -11059 -8031 -4886 -1725 1349 3380 1370
14294 1370 9854 23434 18384 12363 14846 18265 14734 11290 10241 11949 19743 27230 26635 28179 19490
14279 19490 10056 -1813 -5250 1914 3271 -13892 -21334 -22834 -11798 4544 9489 -265 -12301
14266 -12301 -20016 -24803 -17321 -14467 -20795 -30875 -28760 -27397 -26692 -20636 -5854 -399 -7636 -9758
14252 -9758 3126 7756 -9462 -7153 -5985 2057 2044 -635 -5188 -5559 -6979 -13428 -12069 -943 -6314
14237 -6314 -19391 -20840 -17686 -2108 -9381 -8436 -7138 -10176 -16129 -10089 -12290 -10896 -15898 -28005
14223 -28005 -14508 -8035 -939 5670 12199 7536 2103 -15339 -13557 6509 15230 6755 -2179 -1365
14209 -1365 14148 12939 12754 32046 18743 10621 5153 6412 -6524 -3748 10643 5763 -5781
14196 -5781 -20730 -24129 -13563 -3116 -14313 -5108 522 -12918 -10542 684 11195 7562 8995
14183 8995 -10013 -23551 -14878 -18870 4010 12948 1639 -12846 -15080 -8725 -12163 -10391 -13772
14170 -13772 -12510 -14710 -19385 -18167 -7077 -13631 -6016 -3470 3975 5448 3515 9050 23608 14120
14156 14120 6147 429 -12636 2801 8295 2924 -3732 -2349 9852 13950 11307 -1341 -7292
14143 -7292 -8683 -11031 -11188 -17305 -9378 -3234 8837 7129 8733 10931 22178 31691 33951 47774
14129 47774 52811 49219 48956 39835 42350 60141 71747 71245 69989 76948 85984 84140 76922 63369
14115 63369 57302 54908 49126 40736 31305 23899 31926 40935 32759 10731 7320 18907 18131 15102
14101 15102 18391 21662 8074 7914 9070 14796 13675 13186 9976 10630 -5132 -19858 1734 2163
14087 2163 -2181 -2779 3176 13471 3860 -14659 -18743 -7225 2240 343 990 -4987 -3992 2448 5703
14072 5703 -7013 5036 8080 8880 6449 11269 -2550 -2325 8055 -12169 -34008 -25052 -1831
14059 -1831 -1656 -1914 14012 6924 -5631 2562 11288 7945 3565 -900 -8775 6501 14620 -4618
14045 -4618 -7424 -9029 -10271 -5886 -7587 -2643 -489 9783 6456 13032 19233 11668 2063 9708
14031 9708 11723 8083 7168 6264 4599 16534 21321 30532 39986 57485 36684 40586 36498 35362
14017 35362 41136 56866 66070 64945 61219 57766 53445 47592 43575 37019 36730 37248 31172 19105
14003 19105 21498 32732 27054 7424 -11095 -13045 -10343 -14457 -22566 -10029 -613 -4095 8662
13990 8662 4174 3653 -223 12500 16797 15412 4555 -4643 -1173 2123 -3598 2074 -1342 -5879
13976 -5879 -12072 -17418 -5981 10485 1500 142 -10895 -19661 -15710 -16430 -21414 -10422 -5663 -7693
13962 -7693 -9421 -19473 -16710 -13029 -5770 -9407 -7302 -4126 -3581 15320 24675 9894 -1191 -5728
13948 -5728 -12291 -19414 -7997 -5934 -2678 3995 -13396 -27012 -25190 -16356 -10742 -274 3245 12473
13934 12473 19981 22911 14583 -2911 -453 7098 -7283 -17518 -15227 -13970 -3427 5891 -12686
13921 -12686 -22145 -12205 -2116 -2774 -8232 -14931 -16017 -5558 -6559 -6191 -6464 -2000 -5574 -18113
13907 -18113 9843 23616 9508 11301 22494 28307 15525 -1382 9159 14616 7917 10062 10601
13894 10601 -109 -12335 -3270 20903 15107 13091 17366 18834 12328 8973 4809 -1609 1162 6186
13880 6186 13385 6407 12658 20618 25743 26871 26924 29796 34411 19528 -1145 -14180 -5486 3014
13866 3014 16282 23154 32630 32291 30944 23200 22379 21671 2797 -11436 -9549 1209 15646 12866
13852 12866 1447 469 1257 -591 -287 8984 1171 -3630 -14388 -12565 -10180 -11698 -12358 -8508 -10579
13837 -10579 -11895 -8798 -8557 -4627 1742 8941 7098 2606 962 1064 13368 24420 34930 29039
13823 29039 8686 55 -2839 -13214 -14459 -5498 -14533 -23006 -21490 -22485 -14376 -10359 -10392 -5231 1066
13808 1066 -5326 -19091 -25449 -21512 -21259 -18396 -15994 -8776 -5035 -8123 -17545 -18148 -25227 -29231 -23451
13793 -23451 -17802 -16588 4800 7875 4788 -1467 -4439 -15259 -21778 -20383 -10518 -8262 -13209 -7383
13779 -7383 -6019 -14517 -9428 -816 -7163 -15147 -22676 -18985 -9675 -3486 10233 24491 18679 -2627
13765 -2627 -8009 -9847 -4301 1553 6171 10536 18265 9106 16409 14597 4407 -15632 -22312 -20043
13751 -20043 -17563 -16312 -19524 -4952 7724 8552 1306 -18925 -20262 -11340 -11166 -16326 -13448 -15933
13737 -15933 -8371 -8246 -8408 -13473 -12844 -6640 -2101 7795 9754 20946 21255 11643 22105 27333 32596
13722 32596 19036 7127 3803 7373 24121 28875 22463 19794 18166 29558 46550 35230 28004
13709 28004 24713 17221 16158 18479 18678 27546 35507 30010 19736 22988 28684 19126 12585 8747
13695 8747 -2773 -24029 -13631 -12960 -16409 930 -72 -3818 5948 18947 14019 12322 6718 2612
13681 2612 11567 17164 12702 14347 10836 85 -7257 -2710 13269 17574 14805 7596 -5572 -12887
13667 -12887 -12539 -20213 -19552 -13965 -23341 -32778 -29117 -25503 -20844 -4187 7849 11563 7316 13596
13653 13596 22621 32003 23781 23108 17818 22314 22126 24487 36279 37113 32809 39386 55275 62876 62877
13638 62877 68986 68362 64559 72723 64564 43775 42983 51648 62587 54881 51202 40326 48705 33140
13624 33140 18270 21850 34117 27571 23152 16180 19482 11135 2402 801 7611 5532 -1045 -5486
13610 -5486 -2363 -2212 -3293 -2366 -3989 5198 17456 11947 9285 2696 3972 9425 22071 27691 21297
13595 21297 13489 14596 27638 24795 24378 14212 10132 4849 15807 16770 7784 11632 17174 18054
13581 18054 18858 29980 37104 45533 39353 26818 25609 22016 27747 14670 7779 3950 4248 9336
13567 9336 11840 11596 14039 11320 7662 7000 6788 6096 12033 -226 -1925 4057 2637 987 -2884
13552 -2884 -8381 -4469 6405 24624 49995 57903 54461 58862 39481 39858 30250 18667 25738 37033
13538 37033 28552 27111 27931 18093 23698 27900 10468 11390 6432 7519 27436 48667 46069 29802
13524 29802 18115 23523 29376 29703 39220 37782 25430 14064 19020 16910 16893 4585 10494 16905
13510 16905 26422 34625 35357 51642 57072 53592 43140 38377 50128 44463 35887 32932 34838 38725
13496 38725 32598 29781 36508 32346 41175 53265 54674 66179 71961 69087 78602 90048 95974 103856
13482 103856 116123 123033 134991 156619 173651 185623 201539 219656 254999 300239 341151 391596
13470 391596 451357 513049 602152 701924 797242 907998 1037017 1160939 1302711 1453272
13460 1453272 1605961 1780205 1958100 2119063 2276611 2441989 2602665 2740221 2836861 2930735
13450 2930735 3032605 3094132 3132907 3146021 3140487 3134849 3096244 3019610 2934962 2852106 2748785
13439 2748785 2625726 2494104 2345243 2198235 2071216 1931957 1788622 1647562 1531782
13430 1531782 1418062 1310469 1200941 1094913 1009048 927534 852776 802729 753750 706060
13420 706060 673410 646708 612923 575842 555466 535995 514901 495785 481446 467509 455893
13409 455893 425425 398034 393938 383653 373558 370964 361075 338795 327936 321480 306911 303229
13397 303229 320685 323780 317815 300062 277349 261439 247466 219148 204924 181111 182508 174754
13385 174754 147040 133812 123809 113800 121932 108038 111291 127138 118731 97706 75906 76957
13373 76957 85551 76598 65779 71956 72558 86096 95606 73754 61370 67742 78096 89957 107972
13360 107972 120174 118464 115193 112533 111871 109404 110566 101473 88970 75179 65148 56704 60329
13347 60329 68986 62628 52369 42778 43329 37310 16818 15659 19338 21200 32835 35891 21777 25561
13333 25561 33802 25849 23454 31419 19762 5606 9620 9410 12368 10960 26080 22048 6938 12595
13319 12595 21425 25288 34254 29412 29262 58777 77363 81133 79389 78940 73475 58499 55767 34819
13305 34819 20880 17466 13812 6272 5076 5781 11269 21943 33673 26146 9273 5306 6741 12445
13291 12445 18618 33857 41780 59458 72603 86272 109733 144393 161310 166088 164490 159492 147402
13278 147402 126752 113619 96795 76894 72099 61329 52669 52382 40795 25527 38620 45336
13266 45336 31203 12360 16389 5896 4984 18101 20618 12917 11553 9276 26275 42959 42274
13253 42274 35311 29493 19878 17067 7697 -2834 1308 11764 9146 2386 6570 19283 12850 23063
13239 23063 26574 22293 13474 1385 2683 174 -11148 -1519 344 -3997 4280 2670 5894 4057
13225 4057 -9896 -11196 6997 15445 15997 18735 20657 20374 16800 9609 -5920 -10034 2078 12087
13211 12087 12882 10222 3069 6195 -5386 -6404 3075 2895 8974 5919 9632 29123 31367 31718 33471
13196 33471 27540 9550 5582 -405 -3372 -15057 -23140 -17516 13189 30508 31254 20623 12851
13183 12851 7924 9123 14128 13581 6361 -10153 -19387 -6850 1619 -374 -490 -3454 -9460 -2998
13169 -2998 -3509 -4602 -2292 -6125 -388 -2765 3950 13058 5789 2986 -8922 -9329 -5292 -838 2859
13154 2859 9235 16399 18609 29094 34486 6827 -11205 -14747 -5939 12457 4801 -12650 -26113
13141 -26113 -15408 1783 15251 9895 2348 8179 12311 23895 34086 29938 24485 32351 37409
13128 37409 38678 25429 20152 12226 -212 -5966 1101 16312 15371 5045 497 -7487 -13494 -12958
13114 -12958 -11296 -12207 -19268 -18522 -7216 4337 22578 26611 32061 38611 23256 6198 7151 15262
13100 15262 12869 27174 41166 34510 19462 7738 10082 24928 32504 26392 22871 16215 22826
13087 22826 31109 24598 6922 2999 5161 34327 39338 31316 33499 36090 35974 30681 19737 30532
13073 30532 38062 22900 12027 16714 25993 34555 32556 26800 26441 18366 16718 12179 7117 1110
13059 1110 -1040 -128 -894 3142 1403 5306 12980 30651 39554 40709 23161 29810 38626 40420 39672
13044 39672 23134 11500 12377 7976 10566 3431 6326 14358 21258 24738 32276 51364 50719 40519
13030 40519 39958 40220 31154 29780 29369 26146 23722 23134 28533 28386 26365 38094 39898 36554 40661
13015 40661 31427 23781 13397 7497 15027 16652 11737 18554 27207 46536 45995 28932 26205 23480
13001 23480 25825 30096 29964 23082 26749 16883 11224 17271 17664 18575 26426 35318 39577 50357 56650
12986 56650 61446 65483 55725 43465 34386 32278 23756 28965 36020 38339 35194 46400 64865 49321
12972 49321 36121 52593 52026 60101 52828 43549 45007 59449 67036 81866 115241 139105 153253
12959 153253 172538 202496 238749 268410 279775 273500 235759 211378 192413 168280 141821 120731
12947 120731 116739 112814 113084 110250 121519 136109 156610 174982 178092 183396 188018 198853 213928
12934 213928 214645 227624 238378 246438 249884 257478 250841 241453 225260 206104 209332 201199 225170
12921 225170 235786 226768 209932 195851 203506 194354 182158 167358 136949 117777 113631 117366
12909 117366 107933 108791 108453 100581 115713 132492 147367 154726 159327 180654 201167 217411 246164
12896 246164 288096 380226 498378 665876 894880 1142619 1349584 1476000 1504359 1436367
12886 1436367 1287168 1087595 891404 712564 576875 481051 414702 381586 347094 309722
12876 309722 284622 270286 248518 231375 222228 208717 194548 183701 177464 176611 176392 167533 154480
12863 154480 154630 148177 139975 137116 139148 126808 124560 121726 112876 114112 127554 133268 126850 119927
12849 119927 111207 109393 107031 92786 84536 74612 65963 77136 87751 87880 84517 95231 107833
12836 107833 103139 84108 71759 68724 64265 66644 65345 52924 40022 30601 36874 45105 61700
12823 61700 62694 45394 41123 41539 40882 33318 32673 24072 18051 18204 19315 13702 13354 12208 7963 14981
12807 14981 28645 36981 40231 34626 31803 24968 27388 36721 37913 39990 54245 57584 68895 73387
12793 73387 80746 79980 85975 115133 128773 121408 126592 123204 114222 107525 93273 93852 97467 99903
12779 99903 115565 144485 166505 191412 231027 258950 253758 247968 246852 205152 168081 148851
12767 148851 134946 121977 112740 113609 110393 106678 97638 102759 100087 93571 110533 117389 109356 102382
12753 102382 97123 90316 98008 100914 109602 108575 105753 117322 128555 133376 140738 139735 133417 119812
12739 119812 115097 106001 103893 111706 127125 146833 147987 154880 153473 154030 151623 176275 199333
12726 199333 224089 266647 307695 345703 398035 467671 558831 682077 862508 1138082 1547004
12715 1547004 2101282 2755003 3396956 3889341 4183099 4299415 4166583 3845852 3462394
12706 3462394 3072522 2676715 2279920 1914834 1611232 1367224 1173939 1024645 909792
12697 909792 825229 760730 709635 678456 635869 591265 551692 537179 517596 498958 477079
12686 477079 437337 411029 400400 392867 400626 398939 404630 400662 388751 368622 353573 334810
12674 334810 298842 262501 242882 223757 203569 182894 169757 153639 145603 139690 130276 116933
12662 116933 100186 85096 76636 92326 112851 123480 134386 152471 176498 179050 176633 166345
12650 166345 145836 127849 136951 133690 128725 112936 122956 117988 111472 100654 88890 88828 78546
12637 78546 79084 83753 92189 92328 102194 118388 128074 126634 115866 114491 117261 120925 129723 158104
12623 158104 182644 179644 151591 133566 126417 121483 120148 115183 121252 122480 107035 99330 102790
12610 102790 114604 119021 119444 124399 128856 120285 103571 102555 104228 115339 136539 138954 134533
12597 134533 131686 139385 154901 188681 217252 237331 257210 271311 284290 316094 378020 441372
12585 441372 480910 503292 514279 500238 457301 410158 375000 330158 296324 275058 259941
12574 259941 260790 260005 266438 275256 272961 276096 268921 261554 260280 255458 270715 285774 293314 303203
12560 303203 310259 313810 299298 289538 313303 335301 364965 395803 437870 479324 495425 517797
12548 517797 540095 552207 547737 542430 551356 552047 563746 586920 615770 647594 685700 715361
12536 715361 731532 750795 765399 794676 804276 801328 808099 824179 848607 871423 882132 899983
12524 899983 907985 911859 927606 936605 964480 996134 1017190 1014819 1017848 1040557 1072887 1125798
12512 1125798 1179235 1231530 1283234 1334083 1395111 1455879 1500290 1558062 1613370 1649283 1693118
12501 1693118 1756574 1815633 1852722 1901045 1965438 2025591 2117271 2211612 2323466 2457504 2636439
12490 2636439 2839279 3047076 3284824 3546355 3823340 4107586 4429014 4779541 5178767
12481 5178767 5684203 6347483 7203687 8262121 9524645 10989190 12658952 14427209 16257125
12472 16257125 18249873 20649520 23804467 28206428 34582210 44070936 58379897 80043991
12464 80043991 112428548 157346805 209074059 253270620 277742528 284199788 274467437
12457 274467437 246181203 206075930 165696426 131546428 105548752 86789286 73396601
12450 73396601 63772242 56785070 51577088 47504087 44173788 41332717 38740579 36255420
12442 36255420 33910570 31745646 29797840 28091047 26606237 25327878 24262989 23399737
12434 23399737 22696674 22114186 21699231 21409994 21229241 21069165 20860676 20539841 20069598
12425 20069598 19441965 18642097 17723608 16758238 15782182 14849254 13958627 13138913 12383397
12416 12383397 11706753 11092317 10524816 9983977 9451888 8982613 8537106 8095116 7682284
12407 7682284 7300014 6944507 6587982 6261284 5947694 5663332 5396038 5156520 4927850
12398 4927850 4704145 4494461 4296972 4111370 3946899 3803883 3661722 3545714 3445482
12389 3445482 3338148 3205104 3079252 2942489 2796402 2656243 2531595 2405517 2266243
12380 2266243 2147432 2059320 1983807 1922191 1870385 1791379 1717052 1633259 1547057 1465959 1402442
12369 1402442 1344262 1288578 1240807 1191587 1151740 1122012 1084160 1048126 1024301 993719 956623
12358 956623 914157 874579 847802 821739 792738 767424 758957 749232 734428 724202 716778 688680
12346 688680 671740 653871 633882 621113 591064 554886 530386 518306 520815 528644 551750 597367
12334 597367 648887 668503 679828 689635 675412 621961 570783 538381 509721 497538 487413 469621
12322 469621 458604 448019 445434 440276 416409 389818 379090 374824 373003 376689 374167 366783 356963
12309 356963 366739 366352 362739 362844 389952 413048 439405 485534 511790 539008 554135 560996 549403
12296 549403 539879 543212 538538 534364 535550 530435 524532 507790 517760 523061 523301 530896 538309 544475
12282 544475 558451 557689 571268 567757 543035 520860 493746 483812 481705 478169 483922 494290 499171
12269 499171 494926 490820 484363 483874 507416 550114 616641 683246 723752 755207 777523 776978 759748
12256 759748 722386 682805 643338 616615 585637 547761 538314 520819 508300 498322 489786 481798
12244 481798 467181 459138 435607 405358 379641 367020 351399 336144 310571 303568 296257 285086
12232 285086 278391 271167 266591 242785 243652 248213 238846 243751 243895 242494 244373 251231 267543 278033
12218 278033 283604 275603 271214 272056 266046 259677 253756 236999 232470 241243 227114 214558 201910
12205 201910 194722 183947 186134 190455 172873 168931 167778 162266 162617 171484 171267 170148 169733 166963
12191 166963 164577 184919 202148 220925 238726 256277 291440 312514 332866 350383 328837 315156
12179 315156 290710 272221 249388 227551 212701 209548 201361 182317 170617 161378 166069 180086
12167 180086 180448 173050 173730 174264 172903 181782 179407 171559 179467 171349 168111 169245 161061 160293 173206
12152 173206 177573 184163 176623 166720 163502 163681 151251 143522 148481 142121 141472 154672 160969 150456
12138 150456 146954 159033 156483 152714 147471 132243 128407 123577 101805 98302 103057 109441 112849
12125 112849 127052 131863 128166 124445 123070 130615 124300 115353 109990 109887 119891 123647 121406 119055
12111 119055 131687 127704 116036 114195 123948 106670 95798 99046 100061 100793 97877 90563 86045
12098 86045 81491 93325 101482 104184 107017 103936 109238 103928 102075 98938 79127 76816 75322 67269
12084 67269 60173 59012 84300 87152 77543 92504 86764 79516 79215 73601 63879 66206 62165 62184 63868
12069 63868 72973 70899 71290 64254 56710 55617 50093 42275 54487 59474 53827 50271 51186 55111 64793
12054 64793 68907 81643 87817 73456 74762 61851 65453 70611 77502 84538 86236 91722 94590 109334
12040 109334 119604 131198 152544 163471 162431 170567 195990 221941 252689 315102 408812 552287
12028 552287 748924 999678 1251481 1435418 1525445 1511976 1408754 1238376 1039550 849500
12018 849500 687746 563245 484829 422269 384892 359718 339873 312025 284640 282340 279387
12007 279387 253057 228604 221233 224629 208457 207092 203335 198211 197412 212416 225905 239190 241331
11994 241331 248483 244107 229250 198688 169319 135663 122836 119591 119976 116627 99065 84547 79582
11981 79582 85907 98302 109133 122312 110917 87410 74348 75483 68406 59279 61889 75802 82145
11968 82145 64154 46096 34440 30913 31391 38791 22932 8300 12852 32582 53191 52353 56345
11955 56345 51337 50552 40812 38116 36422 44634 46207 45000 36714 28979 32938 41003 37063 30240 25677
11940 25677 33841 37932 32207 24665 23613 30561 26348 14994 22158 25146 18135 29773 40142 33604
11926 33604 16101 8475 4056 15482 31266 35202 26883 17556 5441 958 1737 -7830 -10827 12953
11912 12953 1617 -9453 -3636 5128 10657 12477 21351 16893 6689 8660 4692 2992 3442 2885
11898 2885 -1762 -5686 -5360 -8105 -5482 14927 13595 11407 15498 22143 22861 32723 43925 21709
11884 21709 6419 8128 6057 2252 4976 12482 20361 24241 28518 30665 18844 11598 15732 15892
11870 15892 17824 17915 8620 4077 3382 9630 12626 27213 22441 27974 33005 28661 22659 28466 26856
11855 26856 23889 30782 39916 52271 42990 24176 15272 21909 27595 19525 13069 -2400 -14438
11842 -14438 -324 -6259 -9536 1691 2997 8077 5894 2693 1606 5490 16627 15961 -4802 -8380
11828 -8380 -11339 -8155 -5722 2432 20264 16702 8133 5725 8089 9363 11648 11291 6178 9010 8909
11813 8909 15580 21539 27928 32850 26282 24495 23223 19123 24495 40872 51320 57083 57501 40178
11799 40178 41466 37494 29299 17037 23970 21276 20037 24399 24269 17200 19717 22940 15615 6791
11785 6791 -7879 2703 12211 7106 -3604 -17052 -18949 -2632 6816 15349 19489 18677 14406 15601
11771 15601 15479 -21 -4492 149 4939 7551 2469 9828 8816 14814 14970 1513 -5073 -7875
11757 -7875 -5668 -2220 -2857 -2800 -625 3823 2668 2314 7778 -5908 -18577 -2066 14229 15678 26154
11742 26154 15366 5319 11211 4965 3876 1485 -5225 -11857 8002 25057 36334 45328 45291 43991
11728 43991 46875 54465 48221 41091 33193 18081 4650 7862 2468 -8870 -6435 3969 13333
11715 13333 9733 12952 23356 21571 21749 25107 31365 17707 1982 12957 16607 11138 5584 7372
11701 7372 17962 10417 7152 16272 8644 8019 5265 6301 -9808 -10679 4742 13619 23673 13625
11687 13625 -2659 -2926 8228 20794 28213 18334 -113 -901 -606 7861 20492 15485 -10744 -7811
11673 -7811 8917 13208 14206 10860 16768 24090 3384 -3460 -7910 -8579 3388 12858 6493 -4906
11659 -4906 -5019 -1774 -8070 -4259 5311 18790 12868 -2768 -58 11014 9565 -216 -6141 -12289
11645 -12289 -5852 12468 11685 10695 11128 -341 4128 16680 16214 17029 18585 6230 5087 7425 18050
11630 18050 15306 18152 15763 10104 18978 16771 6399 13494 21223 4869 13502 17827 26306 15936
11616 15936 10498 26487 36043 28329 20317 13102 9954 -2556 -1378 8616 17189 5617 -3039 483
11602 483 5900 15096 14425 17312 7116 -1744 382 7276 13023 6904 5382 7435 6195 6113 8560
11587 8560 8897 24147 23840 4095 2868 6078 11474 17193 22223 19435 27017 24359 19378 14626 5878
11572 5878 625 3721 10889 14602 15718 10027 19412 20891 10352 5722 9104 18426 13278 5103
11558 5103 749 -1515 4803 10704 13422 18192 14100 10608 10934 30849 36749 23612 5135 587
11544 587 -2481 6327 7607 17282 22518 27510 33040 13130 -4081 -8354 -1873 5790 18580 12121
11530 12121 6329 -2417 758 -3941 -6007 -2080 -236 7337 17423 11130 5313 18881 13566 -4140
11516 -4140 -15499 -14488 -1323 -6320 -10668 -4499 8582 -2468 -13905 -21180 -14287 -6188 12108
11503 12108 21948 19809 10943 -28 -3254 -11673 -15717 -11056 -46 1429 -3061 -8929 -29406 -32387
11489 -32387 -25710 -22507 -19514 -12138 -3337 6283 19279 10174 -3616 -18926 -8753 -13601 -22315
11476 -22315 -24794 -15417 -15212 -17940 -9962 682 1671 2909 12070 12001 11560 10539 8038 8848 5968 1441
11460 1441 -3145 -19122 -29523 -34466 -37917 -25746 -9982 -11689 -15039 -14459 -3080 3983 -624 -14843
11446 -14843 -11496 -535 14878 23515 17481 7250 11059 7685 -4101 -1402 2139 794 2553
11433 2553 6654 -2516 -7844 -5620 5102 -11045 -21546 -20632 -17687 -8276 -3318 -4897 5637 12781
11419 12781 4502 -8654 -14752 -1827 19470 17234 13868 31357 22211 7361 9777 15443 20126
11406 20126 21989 10036 -18023 -38043 -37348 -25142 -10603 -12392 -7033 -13450 -12900 -11218 -25784
11393 -25784 -27463 -14159 -16474 -17705 818 -4990 -5183 -11914 -11469 -15948 -11965 -9784 -19634 -9528
11379 -9528 -10219 -7998 -16382 -8773 12934 9648 -8413 -1001 -13203 -17986 -8602 -9209 -11626 -1572
11365 -1572 -4546 -5968 -821 3943 7065 12901 12449 6158 -3403 -1346 8385 -1117 -10863 -15431 -11202
11350 -11202 -16423 -19990 -17883 -29335 -29623 -20884 -15965 -11866 -7209 -7555 -4192 -15036 -11247 744
11336 744 -4334 -10639 -3467 -3860 -4904 5551 16217 12528 12340 2502 -1286 -1126 -4185 -12004 -10743
11321 -10743 3689 7808 -4985 -3623 -4457 -9665 -7972 444 -764 -351 -192 9787 16652 9687 4721
11306 4721 2108 1990 -3014 9572 23880 28745 15535 4318 4585 9600 1784 22 7322 304
11292 304 -10131 -5044 -9801 -13874 -13530 -3802 6887 16353 11531 11654 16459 9480 3167 5173 5575
11277 5575 14621 10754 10506 4581 5020 18752 21422 13520 17823 13583 2585 -3262 9417 11381
11263 11381 6082 -4033 -10551 -12494 -8977 -6305 -326 3263 3149 734 6860 -1032 -6983 -16820
11249 -16820 -11712 13443 19922 9035 -11389 -19207 -9897 -6535 -9945 -617 2386 -6099 -504 9268
11235 9268 695 -11250 -20752 -14967 -11254 -11071 -10459 -1590 -5118 -2038 13566 12569 11807 14497 12745
11220 12745 -2259 -4967 -4430 -6208 -6984 -10547 -8279 -2499 -14566 -14641 -6551 -8073 -11401 -18218 -24688
11205 -24688 -2693 -7983 -12137 -22302 -25162 -15131 -17880 -14950 -8063 3973 3718 -893 -909 1396
11191 1396 1688 4875 -3952 -5991 1268 8743 3690 16789 15888 5025 3589 403 -13521 -9875
11177 -9875 -4549 -6932 -11070 -3583 -5332 -6528 1285 11326 13142 12955 -9450 -9817 -1681 -8082 -10424
11162 -10424 -23448 -13806 7318 14183 12042 7438 10471 21732 16778 9851 8764 5763 17192
11149 17192 12315 9541 14044 24215 25487 9012 7825 12347 4784 4337 6841 7716 -374 -1556
11135 -1556 -7518 -7821 -1102 -97 7372 6273 -3622 -2090 -1113 -8824 -8232 -9004 -1162 11992 13549
11120 13549 365 -17503 -19054 -8018 -4493 -14382 1126 7319 11578 228 -9459 1907 9771
11107 9771 5264 2704 960 -2506 -6141 -4819 -2498 -8427 3471 2560 1514 10206 11672 9008 872
11092 872 -9007 -3747 -8257 -20843 -18071 -18502 -26203 -28594 -23564 -2132 13718 4797 -6668 -14061
11078 -14061 -20959 -25512 -25349 -17382 -2805 -744 -2078 4609 2644 -10533 -715 -2454 -10329 -20270
11064 -20270 -25815 -22992 -18822 -17676 -24086 -18487 -12171 -9941 -5819 -6257 -5299 -3753 -10802 -17071 -26328
11049 -26328 -36369 -29524 -11986 -8450 -10368 -17391 -8830 -1632 -3280 -16694 -21005 -11266 -13121 -10302
11035 -10302 -6651 -20651 -16699 -4480 -3880 -1820 -6901 -11723 -13185 -21757 -22871 -16836 -26433 -28791
11021 -28791 -15022 7406 13050 1824 -9202 -19838 -21225 -20756 -21987 -16081 -22902 -25737 -32274
11008 -32274 -39932 -33429 -24816 -17596 -27727 -18883 -10443 -2512 3519 -8445 -7776 -1582 -4868 -11070
10994 -11070 5242 19963 26867 7683 1837 1619 4604 9889 7331 6263 12924 17081 -1729 -16257
10980 -16257 -17421 -15147 -9930 15706 27809 19876 11046 9245 10903 26377 29058 13400 4365
10967 4365 630 -537 5138 20942 15531 -5838 -6223 -221 3989 14689 16131 8971 -4757 -3483
10953 -3483 12617 20245 17537 28796 16734 -119 -3258 1372 8628 11306 10575 8606 11855 23478
10939 23478 34923 27841 25146 15823 1077 4919 -4143 -17200 -10066 -11603 -19392 -25061 -24228 -24209
10925 -24209 -16956 1787 5782 -1068 -7942 948 18163 29942 36624 27328 20528 14349 -5906
10912 -5906 -10998 -6171 -10535 -10296 -24260 -23957 -17771 -10310 -11501 -2841 2780 -765 -10954 -13976 -6318
10897 -6318 96 -2276 8543 31414 21904 25477 16699 415 -6767 -10347 -14994 -19526 -17534 -15541
10883 -15541 -13806 -17781 -18753 -9707 1223 5850 4653 -4790 -5107 1847 2835 14866 14116 4746 5063
10868 5063 8098 4644 4423 11195 -708 10729 33350 72293 97686 104208 105752 93323 76489
10855 76489 41828 17293 15043 17023 -90 -9240 -8752 -2402 11369 13219 14793 14459 25413 21936
10841 21936 9312 772 3827 3326 -664 8559 14942 4148 5252 -2301 -12724 -19426 -2420 2374
10827 2374 517 2552 8418 3783 5946 2071 5927 16788 17517 12701 4389 -14076 -17835 -10460
10813 -10460 2004 -7992 -7425 757 1486 -6789 -8147 -5350 565 6108 10786 5792 2649 -3027 -1239
10798 -1239 -6830 -6646 14361 10268 1699 -5784 -21452 -16948 -7738 -3257 -2477 -429 -5720 -10721 -10653
10783 -10653 -12925 -13665 -1639 5025 -5733 126 -4528 -12086 -20386 -16692 -4933 6803 21139
10770 21139 16944 -8652 -13897 -18120 -23777 -12494 -10103 -6691 -3136 -1580 -2 -2360 5387 5603
10756 5603 -4139 -6928 -906 5388 -8060 -4406 -1553 -2575 -9843 -7705 6434 10656 6622 1217
10742 1217 -333 -2779 -6045 -15229 -18341 -8910 279 -2329 -2672 -70 11508 2969 1534 -13647
10728 -13647 -20482 -22218 -17360 -12887 -4700 18023 2874 -616 1156 -7277 -8533 1586 4516 -9617
10714 -9617 -18174 -6488 8937 12148 8143 4713 1068 10868 14935 12287 11684 18386 29466 18617
10700 18617 13809 19642 15030 15356 14395 8440 11788 9920 -2918 -1434 10540 29327 42613 35492
10686 35492 16604 14785 21089 16434 2198 1418 13004 4968 -8887 -9485 -10617 -4642 11468 13062
10672 13062 7316 13520 13268 11395 6104 14456 13817 14563 16167 -4725 -19738 -11105 -3466 369 5459
10657 5459 2607 -597 -1127 4242 7897 -1575 -13484 -15525 -12201 -4209 -2524 -6090 159 14280
10643 14280 20236 -272 -8057 -7999 -4884 7099 16849 3916 -10265 2045 1172 14287 12643 4273
10629 4273 1193 -6345 -16925 -14071 -12566 -9771 -2354 490 6704 11203 9409 16907 15737 9972
10615 9972 19948 17931 14607 -3573 -2767 -1 2183 3444 -3990 -1013 -5719 -11847 -14077 -9904 -1331
10600 -1331 4399 9071 15518 12340 10274 9472 2977 -5856 -632 -12572 -18375 -4446 -2213 -3246
10586 -3246 -10910 -18214 -2098 -4790 -11305 -5983 -3895 3601 4133 13 -8438 -7223 -17044 -4782
10572 -4782 6105 -5331 -4922 -6260 -6240 -596 3014 -22748 -24997 -6834 -6971 -8882 -1322 -181 -8244
10557 -8244 -22856 -4655 10708 6174 -3302 -4889 -8424 4499 21184 17650 22937 31484 13186
10544 13186 2078 10931 5762 10528 15401 21371 28342 18706 8953 433 5684 8436 -13723 -6688
10530 -6688 3153 2109 14758 27078 23040 24307 37552 41829 51463 59651 84423 120140 171680
10517 171680 236633 309601 324959 286190 243884 207709 163013 125795 92054 67038 51819
10506 51819 48103 51017 41985 52902 54284 37661 38239 39159 29350 11443 26919 24418 20745 13104
10492 13104 9737 -467 7032 15220 17320 13996 16587 34224 55854 45608 47670 49483 32449
10479 32449 17086 -4133 -2182 10625 31400 30163 22523 17852 25743 20460 23666 23346 22218 19205
10465 19205 14102 15300 13287 10400 2485 17702 22765 12099 562 11259 21720 23316 30420
10452 30420 30975 20560 17447 29785 37582 33684 25961 36522 37149 35619 35291 29722 28128 19340
10438 19340 29683 31629 36708 32817 23067 24258 18385 17498 17127 12443 537 -2004 -6153 -4624
10424 -4624 1679 -11941 -12056 -1444 300 1340 5137 8919 13566 21678 13875 17565 25048 32040
10410 32040 27809 15555 -217 -8358 -11201 -2830 -702 12201 21094 16560 14220 1111 -9065
10397 -9065 -3024 2965 7009 10430 14330 3218 -14240 -18947 -32 4442 -5269 -1376 8070 14361
10383 14361 13421 2874 7719 7617 -2876 -7282 663 10504 22588 23773 26609 31432 13911 -3908
10369 -3908 433 3141 8591 15899 14907 15949 32395 43686 55768 76002 106832 155065 237434
10356 237434 348987 461469 516396 487391 410497 325621 256227 206304 160016 136403 119018
10345 119018 109425 102458 96922 90866 91176 96881 82511 86054 82930 83808 90663 96369 107343 119924
10331 119924 126971 130975 144124 148879 146813 133715 114134 96469 89863 79927 80149 87169 83551
10318 83551 71571 67776 57416 68150 67470 58672 52398 60807 64062 64125 55999 47069 47378 42924 38045
10303 38045 31698 32147 47517 54247 46721 40519 33710 31254 15976 1362 7858 16669 25692 14401
10289 14401 3519 15538 22467 22541 30040 30325 31883 23887 25227 23173 22799 18313 6204 812 3602
10274 3602 13727 15274 12338 4402 11523 7843 1573 10245 14271 8428 1950 2611 10700 9953 15309
10259 15309 16660 14150 15892 3631 -13302 -13959 -20032 -12894 4920 11603 6593 17941 23091 7419
10245 7419 -7934 -9656 -11952 -9464 4059 19098 18383 12988 10409 13352 15553 22876 33006 31196
10231 31196 32749 28225 23457 24278 27149 24323 7792 1833 -5261 -7379 -10467 -11800 -1116 -6952
10217 -6952 5655 23629 20846 30854 31489 31650 11069 3301 10422 22744 25831 25651 35316 38050
10203 38050 42696 51164 72496 82972 83693 81888 99067 133834 171616 211935 279648 346003 401322
10190 401322 466000 528623 568652 569588 542648 513220 477701 431244 366566 308073 254994 209459
10178 209459 174450 154118 160207 152517 148397 145510 138517 124769 102336 97779 104426 112622 110298
10165 110298 98061 101167 89039 81900 78885 69706 70038 70969 79663 79955 73839 78146 86804 79326
10151 79326 71798 63239 65573 65711 53191 54532 55450 57168 71415 86134 99462 105166 103583 87491
10137 87491 81790 79116 61689 41615 17629 19582 29941 30200 30280 34116 31744 25690 22930 22931 33604
10122 33604 40045 35256 38564 33939 33076 22829 23061 25283 18606 13250 17460 36404 34996 28925
10108 28925 20071 10086 5413 733 -16 5564 11921 6015 5322 5655 13146 30658 51115 55346 40648
10093 40648 29306 34005 34024 36479 30236 25539 24832 27403 21469 13094 19975 19967 22597 18960 14631 18312
10077 18312 22406 13506 7827 14870 19303 26117 47252 43212 22230 15631 5571 10852 20994
10064 20994 30297 37432 40991 28314 17024 7320 -2258 10208 35008 51672 50111 43411 42186
10051 42186 36394 22479 13323 27693 37320 35109 29076 35360 42169 45489 45572 45311 53237 51764 44726
10036 44726 40747 46655 63414 70534 68104 65713 74817 67618 65542 65699 77480 100103 120050 145422
10022 145422 180477 232319 304037 419409 587474 864767 1340933 1751028 1671685 1372172
10012 1372172 1063396 794153 599703 471584 384707 333481 282240 235450 204651 189873
10002 189873 180743 152546 135648 132092 120415 122222 128411 128214 107221 104438 105367 92766 79346
9989 79346 67969 76296 87613 93494 91126 98099 112736 112681 98565 90372 77955 74346 84497 82416
9975 82416 81449 80929 65021 56073 59710 61031 56282 62810 55130 62812 58860 45246 46108 42310 39106
9960 39106 51422 57250 60402 45999 34475 23713 30647 35110 29891 37866 43840 40892 36257 31907
9946 31907 33219 22612 13314 22670 19375 20386 30339 37959 47454 34429 32998 29940 36062 28111
9932 28111 25084 30115 30186 27009 40689 47798 50533 38362 36139 50510 43571 40777 42638 36174
9918 36174 39791 44283 44663 36954 55723 69507 80559 80580 76653 93210 113009 112730 110600 99344
9904 99344 98667 130343 148981 168376 178617 181160 156018 129133 120021 118680 120318 123237 115871
9891 115871 108640 94941 90719 103043 105762 99438 90874 83871 81460 94372 91141 85211 76399 68911
9877 68911 72317 90190 94787 85113 70364 63891 74527 78371 68109 61252 79785 94794 90400
9864 90400 80636 84906 79196 71709 64511 70660 77140 83874 90720 99050 87381 75780 81239 93372
9850 93372 100819 102201 96150 99323 104456 97443 92924 94459 91778 88447 103579 97698 94198 92201
9836 92201 97463 105655 112426 116610 114075 121344 141126 159367 177319 183821 188318 188518 193282 199475
9822 199475 209380 225464 228760 229326 216821 211836 226176 248868 267273 291522 327710 381699 442931
9809 442931 493293 554347 658877 805719 988907 1268963 1682347 2268506 3006102 3674433
9799 3674433 3945669 3869106 3668340 3543484 3648797 4097499 4960166 6208973 7390081
9790 7390081 7683489 7086800 6138444 5253721 4613600 4308163 4316143 4581946 4870380 4818175
9780 4818175 4378551 3774643 3172259 2660393 2267997 1994510 1789250 1630465 1507951 1401871
9770 1401871 1326858 1262220 1209324 1146152 1093764 1045712 998620 957465 926678 899971 881003
9759 881003 864305 849496 826021 793810 761739 731699 703211 679696 652292 621960 607199 588179
9747 588179 565538 548615 534191 520035 527834 533265 548232 601538 661305 679195 650103 596481
9735 596481 558575 531194 508216 485453 448106 402192 364594 342466 316705 286225 259871 260054
9723 260054 253891 236001 223024 216128 216009 222168 224926 213088 201691 204977 208862 204284 199665 188731
9709 188731 176631 181894 176741 165891 167321 167853 157586 159790 161994 158367 152887 148589 158263 161614
9695 161614 152034 154357 171329 204814 246701 297171 369608 443887 465516 448241 405717 361766
9683 361766 325262 276265 243676 219714 202987 197333 180143 183613 192478 181850 169645 159749
9671 159749 156909 153087 146587 139493 147886 140779 124920 117473 126443 130503 130771 137849 169039 174902
9657 174902 182287 210670 229508 250090 276766 297093 281311 243344 222607 217605 221727 216939
9645 216939 203363 186187 164177 154318 142797 133740 142673 156030 147424 138997 136255 137244 129488
9632 129488 114491 106525 104920 97318 84566 74568 85343 93416 109660 136296 149747 146121 138004
9619 138004 125437 116422 135881 154165 150604 139103 128310 126747 119067 117154 143316 156889 160366
9606 160366 162310 152585 133291 128123 150496 150740 128947 125937 120564 124456 131504 121229 113190 116317
9592 116317 128693 123997 111642 106907 108119 110226 116092 118108 126611 126068 112138 121318 126044 123402
9578 123402 124103 128285 133741 128553 130083 137384 139269 143615 131777 109769 108296 122976 127262 133829
9564 133829 136173 134651 128760 127301 132856 139591 142793 138211 130984 136348 144901 152380 153574 144699
9550 144699 135728 136070 135682 128154 124947 120126 124568 114947 106136 106340 120747 129556 130774 139510 150674
9535 150674 141150 136910 134906 129522 128104 132299 139941 147264 154707 167089 170444 168199 172201 178545
9521 178545 184581 179212 177747 182963 166782 156926 169339 193031 199842 216981 234940 253421 247710
9508 247710 234626 215691 202744 202530 212220 225449 226382 219844 206244 207943 195322 203084 214134
9495 214134 234032 248236 255254 248742 245032 247123 241798 244838 260157 277464 275343 275875 274847 276401
9481 276401 279950 285011 284607 301953 300432 293981 306363 318633 324249 320241 313952 328843 339328
9468 339328 342430 330530 346490 369770 379315 391676 407007 415490 435065 459401 467899 453115
9456 453115 458479 477414 500795 525140 546132 569651 588016 601052 620706 655221 689429 751102
9444 751102 814866 874349 937609 1018569 1152709 1324548 1569259 1935924 2482123 3276420
9434 3276420 4293727 5253693 5931982 6522976 7382469 8630395 9582271 9481365 8781516
9425 8781516 8075934 7592103 7114439 6363738 5437014 4545657 3804431 3240758 2826444 2503120
9415 2503120 2254779 2071130 1911956 1798121 1705606 1632267 1556906 1485510 1425040 1386970 1355770
9404 1355770 1323959 1302437 1288015 1253934 1226091 1216865 1205508 1190766 1177260 1170031 1153588 1140202
9392 1140202 1122699 1092169 1076750 1066766 1054680 1029402 995894 963011 930358 903090 887898 886987
9380 886987 870001 851789 848645 840800 818601 798939 790370 775998 769107 774966 748476 736501 733085
9367 733085 724824 725467 729554 738839 729195 724433 721553 727940 734814 733301 723959 719565 711840 709156 719663
9352 719663 740649 754874 751808 741639 744767 752405 766087 780978 784005 791180 788259 780279 798718
9339 798718 820793 830435 839475 861240 875404 881192 900536 925740 931851 934016 949787 975493 1003916
9326 1003916 1022413 1037794 1049787 1073850 1101868 1123881 1138325 1143975 1165434 1184285 1204783 1217352
9314 1217352 1229907 1250693 1270241 1279494 1289077 1305013 1309648 1330232 1364453 1384549 1388806 1397894
9302 1397894 1420446 1463456 1485203 1515918 1555585 1585263 1609499 1632029 1667673 1700830 1738971
9291 1738971 1763484 1804309 1860653 1904666 1937150 1973696 2026224 2081348 2129260 2174094 2221014
9280 2221014 2287156 2364340 2424763 2469698 2525949 2583097 2643447 2720646 2783507 2845727 2895750
9269 2895750 2952944 3027165 3109019 3203020 3303046 3390836 3453092 3521990 3614338 3718496 3824236
9258 3824236 3923881 4034383 4155030 4278886 4407618 4537636 4683902 4847772 4990610 5151696
9248 5151696 5319422 5486725 5671506 5869224 6073371 6292146 6523204 6757974 7001441 7282961
9238 7282961 7586549 7908001 8241220 8592805 8967772 9390360 9829403 10301098 10789091 11319311
9228 11319311 11888447 12518477 13201708 13922871 14722749 15591466 16534813 17563946 18705523
9219 18705523 19939033 21282207 22759656 24380904 26165023 28180800 30406517 32857640
9211 32857640 35549702 38513625 41808656 45431580 49408776 53757131 58479731 63548838
9203 63548838 68914181 74506150 80183801 85777015 91086455 95843157 99826092 102808019
9195 102808019 104645054 105245948 104606971 102821877 100071080 96560574 92510958 88136075
9187 88136075 83613771 79080760 74635581 70357043 66318356 62536423 59021896 55754261
9179 55754261 52730353 49937954 47379560 45022970 42859451 40857324 39017052 37331242
9171 37331242 35782581 34350081 33014045 31764040 30591680 29511788 28476229 27488392
9163 27488392 26536813 25613077 24724892 23873061 23037571 22222336 21425943 20644082 19891966
9154 19891966 19160277 18448419 17753411 17087684 16444209 15829178 15239876 14660601 14116572
9145 14116572 13613598 13116525 12648718 12187032 11745309 11316012 10884434 10469875 10088788
9136 10088788 9725862 9378708 9051542 8743888 8432877 8144419 7870095 7603212 7346270
9127 7346270 7099488 6863909 6627913 6416249 6212043 6022346 5839106 5648279 5462788 5275589
9117 5275589 5109417 4957669 4810255 4669374 4537853 4422617 4305628 4186254 4075156 3978279
9107 3978279 3874796 3755824 3646868 3555584 3452818 3333252 3240324 3162495 3089480 3012374
9097 3012374 2942622 2841296 2753066 2692499 2627165 2567361 2515608 2475092 2436621 2374862 2302551
9086 2302551 2251126 2187992 2143803 2098104 2057593 2013613 1978040 1949579 1921545 1886048 1858166
9075 1858166 1837081 1811536 1788937 1762307 1725468 1697170 1662014 1637327 1625449 1601140 1585449
9064 1585449 1563979 1531051 1502592 1478007 1443612 1411296 1395540 1382539 1360217 1354186 1321083 1295923
9052 1295923 1273028 1240813 1214613 1202791 1197346 1185270 1177600 1166059 1156019 1157861 1143819 1118705
9040 1118705 1121574 1114338 1114601 1110628 1106883 1096355 1088994 1094853 1101371 1118784 1150626 1191828 1230790
9027 1230790 1254852 1238366 1224606 1191760 1148153 1114411 1089831 1068889 1056273 1039298 1026251
9016 1026251 1010402 978194 962118 949044 943787 937067 931291 916226 910546 898262 895088 888127 867021
9003 867021 856287 857083 865071 858732 849693 845058 851467 839450 836167 845879 840156 836066 816433 795245
8989 795245 771795 765780 762189 761342 764714 763289 756834 740220 725486 714408 696289 686237 681018
8976 681018 672675 655386 633054 617885 615120 599817 588111 588540 572425 572339 571822 569057 565723 560579
8962 560579 552084 540099 531451 529033 506668 491643 482702 489837 497834 488199 489194 497384 491185 481480
8948 481480 483614 484151 478572 462015 442818 427832 429042 434308 426571 419495 418315 420684 417973 423034
8934 423034 434731 413905 399495 391884 392616 387402 389371 394626 388366 378296 385710 395983 388336
8921 388336 362101 349842 349019 347298 337479 335668 342781 336487 332036 337758 338412 326438 321990 327078
8907 327078 345113 351899 347014 343022 336227 325075 320560 323597 321585 316327 319170 333798 344405
8894 344405 341574 322135 317445 321850 331457 341065 342089 353156 345078 361632 368782 367408 364377 364365
8880 364365 356516 343997 346769 348734 354502 379513 382183 383927 387152 393575 411210 444613 487750
8867 487750 506607 526824 556596 583251 629665 701938 799419 943140 1156607 1486886 1995541
8856 1995541 2744092 3675028 4370808 4353139 3829893 3155962 2514175 2030595 1679764 1439072
8846 1439072 1269515 1141521 1047930 984378 923026 859174 807376 765547 740156 706935 674537
8835 674537 646920 612102 592771 578710 567755 537940 515060 497997 495768 498093 494798 489149
8823 489149 478711 488048 488654 474271 468666 461558 430961 415773 406869 403011 408943 393567 374839
8810 374839 361667 350520 350794 346309 345548 329818 308106 302560 292403 291883 287085 273326 279207 282489
8796 282489 261517 245088 245177 245499 246804 242205 248404 251734 249408 260130 250554 222996 223449 233552
8782 233552 237758 241719 237395 231386 231643 224590 222114 214629 221114 233771 229206 229354 239418 247112
8768 247112 260958 276301 291529 307773 320109 343862 395225 473233 600651 796861 1050683
8757 1050683 1315434 1401356 1284363 1079122 891606 739946 626536 534757 462792 418982
8747 418982 401793 383084 360336 342546 322551 319659 316864 308567 309094 319629 305971 286977 276904
8734 276904 268879 259378 250077 243055 251809 254486 258691 258868 252203 240076 224597 227527 216856 213583
8720 213583 211606 206306 200447 207472 209993 197893 182402 173138 175794 190215 188604 188675 187892 185126
8706 185126 195840 216329 225635 218046 200351 185413 169632 154168 149080 155687 163525 175104 175365
8693 175365 149889 146504 154071 150369 137403 145605 125971 123563 139387 147870 141679 135195 129578
8680 129578 149096 162800 166510 166713 152720 139751 142381 140025 154278 169771 173384 180529 194470
8667 194470 202586 203193 191992 181646 165656 159293 152373 149851 148692 141232 126613 106132 101495
8654 101495 100564 102981 105667 110499 118556 126109 131163 127271 132907 148698 170157 168606 153251 143035
8640 143035 140182 138444 129971 125802 124163 128066 134126 141205 143059 153425 162050 173485 168025 168048
8626 168048 161745 159761 155615 143553 144261 138889 148564 146021 132729 132924 131129 129086 128243 129042 127993
8611 127993 131729 124990 122668 133407 142369 129374 146737 172275 169542 160217 169445 193494 191702
8598 191702 197267 213874 222576 211597 218277 231927 247756 254625 265363 280429 287566 291273 287950
8585 287950 304781 319402 334956 348077 355056 358604 352841 321298 288755 272860 258397 258794 262416
8572 262416 240372 218149 195207 181675 179105 160207 155579 166507 167643 149475 139837 152892
8560 152892 161144 153306 149037 148306 146688 142293 130589 119854 129475 143557 149756 166567 176019 150425
8546 150425 134244 132793 129419 128064 128502 120993 128060 133303 133348 119383 125471 133954 137664 150548
8532 150548 161480 166970 154510 135424 137691 139845 143038 133688 122438 111514 114148 111685 105558
8519 105558 100991 106849 105824 97041 94896 107549 107346 111071 114665 99689 97438 110624 100196 99292
8505 99292 118534 122852 115743 118782 122030 127175 123910 124754 132322 152100 169188 178940 172999 161765
8491 161765 153876 146143 129630 120918 122942 123600 123397 120604 126088 131675 133061 120165 105202 86861
8477 86861 77136 88364 83903 89852 110679 101015 97625 91279 82232 88026 84083 78115 73359 88160
8463 88160 91888 84259 81446 92481 96442 99095 109028 122146 118041 126260 147254 146762 126368 124020
8449 124020 125115 114801 116685 120692 116999 105862 88020 85647 96021 96587 86112 74959 71585
8436 71585 73147 79363 85102 102017 111061 99195 88691 84621 70898 77858 76244 74520 75367 78720
8422 78720 70377 53221 55790 64355 65607 60539 54410 56999 51587 45085 63879 76146 64088 65927
8408 65927 76245 78857 74801 74861 84992 94460 90638 87317 76204 71904 69867 74939 84593 80131
8394 80131 75926 68003 52169 48327 51919 56226 67073 57908 66667 81787 75387 69888 68327 59585
8380 59585 51880 57773 64162 60040 47373 49808 47919 35872 40358 53927 54274 51982 53618 58843
8366 58843 73459 91056 88132 75248 88370 90789 95169 92773 83994 66873 57624 54465 65143
8353 65143 77067 82532 76726 67433 58243 54209 60844 61732 60022 54889 61345 56459 48460 62643
8339 62643 79579 79223 64831 63113 57589 51650 50131 53565 54065 32296 38018 56468 73367 80605
8325 80605 83208 73414 79350 86236 86616 101159 92587 81268 85920 99311 117936 120712 129192 133899
8311 133899 112295 117064 123982 115536 90964 70532 71599 71864 59379 59935 57236 65464 81353 91522
8297 91522 85419 72054 81468 86819 95912 90365 79708 73566 75991 81491 64509 57339 70804 69085
8283 69085 64316 61222 49682 47881 54374 42590 58281 73934 77681 69830 64157 62434 62242 70713
8269 70713 70934 69770 69507 63154 62034 57894 65996 66415 59336 62878 60689 60381 52343 51214 46469 50130
8253 50130 54321 62530 56952 58436 45728 41600 46883 38958 32472 28169 36529 22422 16150 35976
8239 35976 44777 29190 21547 21950 22440 42369 55231 62757 51465 47811 46221 55156 43232 29211
8225 29211 27684 32258 48956 57450 53636 62062 57290 57997 63641 67870 62757 47026 30092 40783
8211 40783 58925 66547 61940 55552 54059 57323 46973 46936 38148 46115 53867 55315 62343 55592 54873
8196 54873 44155 44219 52331 50191 45445 43988 41505 42384 39399 48787 41241 34166 35314 40767 57353
8181 57353 66382 72739 77442 85396 83911 88389 88951 92187 80209 73047 71816 58973 53915 50498
8167 50498 39468 48762 55657 46664 42222 51032 44996 45401 48693 34710 40190 46168 44539 45656
8153 45656 40914 40509 37108 35809 44948 38284 33688 32738 39578 37914 41785 50127 50893 48993 39308
8138 39308 29276 22208 37908 42795 32784 39961 46776 53622 48903 40215 37104 48299 55690 48161
8124 48161 40831 39183 47152 49390 41258 32688 36400 49885 58231 69842 79997 74336 80160 92764
8110 92764 80533 67752 54227 47051 35949 32124 29052 45935 53242 48291 56400 61747 50706
8097 50706 41964 35534 36914 40888 40236 43722 35638 29540 27872 26182 32252 35769 25201 21219 14101
8082 14101 11010 17678 -463 -18806 -5888 10155 14878 7601 26333 35462 35985 40691 35581 39711
8068 39711 31872 26551 12115 7760 27444 32304 26498 11851 21113 29287 36300 49936 47640 39893
8054 39893 40658 47304 42162 40789 28919 36607 33464 23516 21007 23189 23493 32322 36653 29177 24901
8039 24901 34206 49117 55467 55018 57842 62752 65080 63579 60647 61033 45567 43319 34106 34753 55241
8024 55241 58585 55563 50213 60608 60663 47718 45708 62010 63899 63258 65176 64104 58624 49280 33714
8009 33714 40126 45098 53823 50384 45495 45900 42882 35120 46165 63715 58553 48087 42019 38292
7995 38292 38015 43377 45202 45050 59421 78008 83501 87429 73330 83619 95210 97156 97624 93402
7981 93402 88433 71590 63039 62570 62692 70872 74070 64484 61838 61655 66079 67899 58406 52413 48823
7966 48823 47453 35627 28198 40121 52798 51874 55731 46058 43914 54528 63074 65421 59380 63750
7952 63750 68737 67658 54171 45682 32802 30511 38840 56783 59567 58557 66029 71570 64884 59340
7938 59340 59087 57004 54562 52840 48096 39936 38565 38023 31082 27112 36331 40573 30676 42547 55230
7923 55230 59504 55900 49473 44653 45180 35991 39727 34157 31527 37645 56745 64816 60562 63867 61225
7908 61225 42807 39632 51269 56007 69099 61123 43473 52182 60342 57372 68672 68745 58346 51629
7894 51629 45388 40409 49419 57305 51308 49192 48542 45953 43085 46885 45253 42036 31619 30637 38961
7879 38961 44635 46915 47297 43233 30635 23300 26857 33163 37603 41521 49504 50110 53700 50216 49070
7864 49070 53813 48999 55764 46978 29540 21011 12797 -3156 -8740 864 18672 26866 31960 29958
7850 29958 26684 24103 22997 28048 23671 14374 1217 5806 30911 46327 50354 42541 47294 46994
7836 46994 60546 60542 45825 36556 47749 51515 43155 26431 29142 27970 25413 20976 26696 24423
7822 24423 12851 11987 18845 28314 37657 26896 22244 11311 -2928 -7746 -3953 10206 11555 10011
7808 10011 13170 21435 31109 19179 14960 15456 9175 12433 12533 18211 17284 18876 24567 28375 20659
7793 20659 18483 18764 19891 30870 24549 32698 35261 24481 22039 19411 21222 20342 22193 24279 30844
7778 30844 26786 7498 3196 3449 -383 13097 13687 -429 696 5437 -2271 1670 12433 19750
7764 19750 24292 28621 24953 3000 -8881 2108 -1208 2978 9404 7089 15887 18257 19486 6551
7750 6551 7377 16494 6558 -4162 -4176 -8353 -3469 4458 13640 9618 7020 11725 7986 11420 18647
7735 18647 4623 1898 -3021 6450 1644 517 10211 5054 2573 2625 6853 803 -6075 8496 7256
7720 7256 -6227 -7724 -6316 -443 10137 7414 9577 1017 905 5481 9259 13976 19210 20458 16945
7705 16945 9589 17343 16204 18481 24799 9420 2105 -4544 -8384 919 15102 12588 9980 18304
7691 18304 18511 9618 12024 9 -11466 -4757 9745 17231 2846 -10712 -13952 -7282 -2556 -9147
7677 -9147 -10319 -20669 -27974 -20307 -10219 6800 14245 23122 26411 20494 -2503 -13589 2150
7664 2150 7616 4620 2165 3071 11687 20748 17293 16683 10776 14704 11285 4255 -11501 -27740 -23848
7649 -23848 -4406 4747 12462 10505 6984 8192 -319 -8529 -2894 -3081 4035 11566 -2735 -5503
7635 -5503 6509 12893 8259 4413 7137 -6042 -5980 -5041 -5418 9853 13455 19025 13787 9322 -870
7620 -870 -1093 -1925 -4312 -11210 -3864 -2163 6846 363 -5806 -12677 -19338 -22385 -18175 -25863 -16738 -8662
7604 -8662 -2151 -2510 -12494 -10814 -6010 -1915 -3406 7931 2196 4067 737 1582 11343 11894 17303
7589 17303 9510 8819 14149 9028 -1168 -14745 -19737 -18237 -12552 -17450 -20272 -10167 -14175 -8665
7575 -8665 -7345 -8601 -2175 -5423 -2652 554 -3654 -794 15157 10357 -6256 -8138 -4509 9902
7561 9902 17675 17866 9101 1043 10589 12080 9127 16855 19742 20175 8378 4534 2958 -625 4425
7546 4425 13657 20659 13576 12471 19340 4465 21607 27562 19926 3244 -2594 -6711 -1694 -7263
7532 -7263 -11206 -4020 3479 13251 14591 3175 -2672 -5732 -1272 -4204 -2355 7886 6439 18212
7518 18212 19291 6224 14931 22951 20969 4643 -4619 1999 6400 -8375 -9898 -1227 2931 -10272
7504 -10272 -9855 -8035 -11918 -9517 -1418 10194 10946 8542 1848 8324 9378 7271 25743 26233 19045
7489 19045 9657 10779 15162 7152 3364 1310 11317 15650 2653 -6899 -9510 -360 -2461 -13112
7475 -13112 -23669 -16379 -1695 2015 -7274 97 3729 -10605 -15669 -20367 -9802 -18068 -15287 -12693
7461 -12693 -10817 -10513 -9997 484 15449 21475 22076 34980 29099 20107 19882 25548 10567 -7460
7447 -7460 -8649 -2819 -12607 -11032 -3050 2191 6369 596 -3976 -5730 -3640 5347 -4417 -11191 -11422
7432 -11422 -2731 11624 220 -8481 -4615 3566 4140 7798 -10995 -8269 -3103 2029 -2776 -153
7418 -153 -1379 11182 22785 15698 8632 10806 17980 23595 27268 37612 28002 10420 -3198 -3580
7404 -3580 2800 12319 16447 8397 8193 -2618 -4960 -4335 13712 14537 7096 4856 3684 3343 9309
7389 9309 17698 21107 13468 -6081 -10956 -840 14241 15180 530 1711 -4238 -13891 -12534 -14365
7375 -14365 -8312 -13040 -7213 -1447 -3005 166 5036 -4786 -5880 416 -595 4778 2404 -10407
7361 -10407 -20652 -26635 -23300 -11259 1650 4731 7582 -902 -17445 -15456 3357 -8342 -15027
7348 -15027 -15501 -17840 -22737 -26431 -15650 1409 7334 -3401 -8804 -15772 -23812 -15021 -9887 -13867
7334 -13867 -14302 -11047 -7837 -3796 -11569 -17506 -25259 -13229 3578 13273 22107 17911 12846 13436 7891
7319 7891 2181 -5910 -18462 -36702 -16169 -7545 -346 6485 738 6013 13893 21122 21900 -2261
7305 -2261 51 13908 8292 1241 -4145 -9718 -14809 -781 5560 2625 6200 -1517 -751 -303 251
7290 251 11107 7197 8128 -722 1527 1005 -8101 -18588 -27120 -21049 -15935 -1611 19370 25464 21395
7275 21395 9501 4840 1118 -8064 -13103 -1860 -4557 -8334 -10698 -10386 -9072 -14618 -18309 -17423 -17323
7260 -17323 -20520 -21149 -10571 -20078 -18815 -15814 -15000 -7226 -5170 264 0 -5177 -11470 -20606 -23612
7245 -23612 -12816 -10956 628 1609 -1616 -4868 -1954 -17590 -29744 -27653 -13801 404 -7867
7232 -7867 -25108 -12617 2777 -2970 1094 21244 8280 -8972 -7182 -10578 -8948 4897 9341
7219 9341 1690 3793 11617 15596 6280 9430 13624 3126 2622 12780 7225 9602 27781 39529
7205 39529 35797 19247 9575 11464 7675 5599 10309 18522 28887 28319 19752 6373 -10205 -21606
7191 -21606 -16198 -8347 -1388 -9018 -20521 -18241 -19105 4127 16483 19052 15727 17061 33767 31205
7177 31205 20682 6488 1030 12797 8012 -10026 -12899 -20906 -12367 -6031 -17147 -14510 -14207 -13993
7163 -13993 -6320 1257 1560 -3843 6054 9241 -7101 -14295 -10606 -61 -5734 -5061 -17448 -19093
7149 -19093 -23790 -14751 -14872 -17203 -17206 -18198 -3238 62 12221 21031 19404 12565 -3642 -8636 -1708
7134 -1708 -1126 -2874 -1005 923 13969 11269 2816 -1700 -7996 -61 -6041 -12615 -11871 -23940 -22410
7119 -22410 -20462 -12302 -3135 2591 5409 9841 10474 1040 -7637 -13010 -17125 -9997 -7132 -11276 -10916
7104 -10916 -6274 -5242 -6421 -4366 -14256 -11020 -11769 -10368 5471 7202 2615 3752 -1402 6364 23418
7089 23418 10757 4816 -4495 714 14001 6868 9537 15543 28045 16847 7014 -5722 209
7076 209 7921 5017 -6197 8359 8944 5443 7432 4568 8429 4585 -641 690 -9783 -10228 -10037
7061 -10037 -9908 -16485 -3365 17649 18888 18712 23294 -3108 -3944 -5932 -13022 -9538 -10488 -19906 -23455
7046 -23455 -29866 -18675 -3227 -9074 -22221 -28804 -24387 -10626 -2508 -1500 -6404 -4802 -1407 -1959
7032 -1959 -159 -1375 -6159 -3779 -5526 -4036 -6601 -11410 -8667 -16106 -21012 -14584 5589 20744
7018 20744 23059 19889 11192 -9221 -12568 -2809 -3596 -10701 -10433 1993 13290 6582 672 1285 10941
7003 10941 4036 -4030 265 -3125 2380 8943 -482 4511 -8875 -13052 -11922 -11823 -14017 -10103 -5145
6988 -5145 -3309 -2273 17 -859 -5232 -5890 -3320 -14151 -14020 504 6004 6540 -2927 -12331 -21072
6973 -21072 -18910 -16909 -25458 -23214 -15115 -13443 -10568 -1420 11937 15254 19850 10303 7762 6940 16857
6958 16857 13920 2697 -2969 3119 450 8891 10142 4224 -4697 -3643 932 -18018 -34073 -18262
6944 -18262 -5144 -4364 -10336 -1052 5391 -2766 -4666 -6141 -13474 -11704 -2581 13323 26374 9766
6930 9766 -4096 -591 1704 -1156 9345 25745 26857 21830 16845 3643 2450 2068 1689 4893
6916 4893 6085 7724 1587 -2711 3644 13372 19200 10357 15635 5032 16050 15797 12042 22910
6902 22910 20191 -1470 -14345 -6933 -6962 -12996 -10304 -3891 -12175 -12843 1727 2515 7210 6968 -1428
6887 -1428 6218 14813 11348 155 -3158 -4840 -4821 -2157 1743 2254 1318 1210 -5250 -3072 5807 14940
6871 14940 30639 23481 11816 -517 -1108 -2969 7282 -3751 -17642 -10251 -8667 -17723 -12324
6858 -12324 1715 5035 1603 -13241 -17695 -23773 -15086 -2219 1311 3669 319 -6775 -12540 -12438
6844 -12438 -9974 -19777 -13912 -16917 -19799 -14529 -16927 -24685 -18016 -10988 -15931 -3125 8364 19911
6830 19911 12093 2076 -4601 -12087 -24346 -28851 -23924 -7728 14606 14357 -2541 -13041 -6229
6817 -6229 5857 8534 9038 15190 14043 23191 11245 3656 -4982 -15711 -21673 -6721 -2671 -4809
6803 -4809 -10936 -22004 -19205 2418 11445 999 -10459 -13176 -21249 -8344 -16699 -18539 -19851 -26967
6789 -26967 -22638 -17257 -24791 -31850 -34021 -39654 -30352 -30715 -27140 -27410 -18530 -18573 -28572 -25225 -31777 -27182
6773 -27182 -21253 -17248 -13383 -27 14091 8869 17851 25006 5200 1914 -15881 -30258 -31479
6760 -31479 -32011 -18075 -9061 -11919 -9085 -2339 -7255 -4746 -286 -3139 -1919 -408 -10467 -6828
6746 -6828 2905 -1860 4836 -493 -8426 -669 -10780 -9073 -5768 -3071 15628 18484 9603 -3953
6732 -3953 -12432 -1555 5801 3632 -3375 -4496 -5125 13978 26042 28927 30653 21677 6946 14578
6718 14578 10791 6365 2737 -11068 -18886 -23563 -33707 -36626 -32725 -14145 12215 24401 12079
6705 12079 4336 -7048 -10687 -2481 -5482 -18142 -16099 -4752 13266 23248 34931 32227 29439
6692 29439 33598 22758 2334 4909 4599 6403 -3676 -19124 -17623 -7986 -112 -2235 -7643 -25148
6678 -25148 -31225 -31053 -21395 -13361 -12935 -9940 -3603 -11626 -6849 -10332 -13830 5725 8739 9108 8282
6663 8282 5337 -4150 5449 14373 13212 16159 13914 8972 549 4713 6199 11554 12667 8145 808
6648 808 1381 828 -5640 -3136 7462 15027 7269 -5967 -6525 3030 1161 -9498 -15611 -19282 -18783
6633 -18783 -18889 -23287 -19776 -8376 -1360 10568 6789 1147 -575 2666 -181 -3923 3911 13603
6619 13603 12759 3499 1579 10024 68 -6746 -12468 -2981 4500 10266 19591 31546 24234 13617
6605 13617 -55 -2773 -3996 -14435 -12033 -10879 -5048 -3156 -6800 -18914 -15450 2309 7997 1757
6591 1757 -5602 131 1038 -4836 -7876 -13198 -1385 -1640 -11770 -10074 -14682 -2609 -2680 -5957 -8279
6576 -8279 5635 2847 -4169 -4978 -3938 550 10314 13479 21437 21106 14512 625 -6404 -8883 -22727
6561 -22727 -27596 -28253 -28664 -17574 -15651 -3342 10056 7636 1292 907 2244 -4148 -26688 -26608 -14055
6546 -14055 -13366 -13621 -27523 -30216 -15837 -4256 6589 2959 9231 7043 699 -4639 -3030 -5831
6532 -5831 -2997 -7200 -8041 -4323 -5879 111 754 -5273 4197 4449 -4535 2282 1829 -4298 1586 15442
6516 15442 17092 22064 28931 26961 31827 29545 13122 -3154 -10000 -13279 -15766 -6174 -16051 -16361
6502 -16361 -13042 -21007 -14788 -815 -8949 -6253 8959 5588 -11221 -30121 -26578 -22135 -8800
6489 -8800 2535 1496 -1705 -11695 -10870 -3312 -1368 -3155 -5265 -3190 2133 4906 -7415 -16064 -5758
6474 -5758 15593 25588 16102 -5784 -9404 -3174 -5491 -3116 4940 -1822 10983 16681 9608 701
6460 701 -3697 -6727 -11511 -5454 -12685 -19720 -15779 -25421 -24614 -21569 -14216 -2172 415 -1926 -1495
6445 -1495 -4719 -14746 -10680 -6711 7755 19884 19115 -4842 -8150 -14962 -17302 -5230 2054 -11172
6431 -11172 -13808 -21905 -30384 -14659 -11716 -21570 -30004 -23163 -19414 -15046 -6071 -4540 -17063 -24371
6417 -24371 -16389 -13718 -3563 -8348 -18517 -14855 -16566 -2993 6468 8498 5033 -2636 -18259 -9072
6403 -9072 -17987 -31144 -41613 -27457 -14895 -17077 -16443 -10959 2350 4840 14540 27670 4212
6390 4212 -6764 2034 15145 18260 3927 -11646 -6703 -1751 -1869 5746 3383 -13121 -20573 -15276
6376 -15276 -15402 -2029 3024 4868 -9248 -25941 -13951 -1669 5102 -6255 -2274 680 5683
6363 5683 2620 1618 628 9567 10551 1685 3438 -3674 -5310 2119 -1700 -19905 -26343 -26616 -13511
6348 -13511 -10152 -7758 -2199 1018 1442 9973 5373 -7159 -7222 4947 18665 12784 6091 2812 -719
6333 -719 3895 5292 6181 10288 11388 -489 7210 -7705 -8688 3489 10345 12161 2759 -5294 -5097
6318 -5097 -8821 -11100 -11150 339 9453 10298 1139 -7517 -23385 -29538 -23621 -20384 -15063 -6341 -8321
6303 -8321 -15179 -16749 -12850 -16205 -8464 -4378 7565 5646 8341 3643 -1274 -3474 -2659 -1393 3265
6288 3265 2245 -6023 -8283 -7134 -6202 -5130 975 3670 -9572 -22888 -14490 -9517 -10551 -10431 5368
6273 5368 15782 19901 20007 15915 -3717 -9484 -10914 -11464 -10224 -2081 4273 9908 9749 18530 25191
6258 25191 16151 -4471 -11639 -15370 -16801 -6348 -7032 -3904 -775 5128 1540 5225 8363 8333 4968
6243 4968 6424 6956 -12857 -5653 1407 19255 14720 9724 3514 -11275 -23186 -22655 -20006 -5091
6229 -5091 4022 -2974 -6141 -16052 -12479 -14087 -29245 -19203 -10497 -3120 -9761 -20870 -10808 -5192
6215 -5192 -6727 -9761 -18681 -18485 -8069 -511 -10602 -25166 -23326 -18379 -6959 -7943 -19817 -20027
6201 -20027 -12926 3652 8555 1566 6542 5974 3662 -5049 -12101 -1776 -16565 -17888 -20572 -19114
6187 -19114 -20521 -18021 -16376 -12508 -7101 4620 -6148 -15755 -11154 574 3101 -14291 -20634 -14784
6173 -14784 -8801 -20118 -13206 -12325 -8223 867 1034 -6291 -19596 -11143 -13169 -10504 -6395 -11079 503
6158 503 1134 6998 9509 4142 -10311 -7554 -7872 -10582 -4631 5234 3339 -6142 -17882 -24158 -22107
6143 -22107 -16176 -6324 -13329 -10389 11717 22673 19491 29963 24836 8839 12305 13573 14643 3116
6129 3116 -8377 -10585 -15480 -10148 3330 2185 -627 5955 -3709 5997 9182 17114 6746 16875
6115 16875 19471 2058 -841 3218 70 -14731 -30427 -32872 -23879 -16840 -16208 -4932 -5924 -14729
6101 -14729 -21872 -7523 2354 6313 -6263 253 11771 11173 14388 12067 -2041 4994 10427 15189
6087 15189 19940 1032 -14904 -15371 -5773 1900 -3148 -2582 -11272 -8121 1555 4193 1318 3815 9103
6072 9103 108 2688 5150 1253 1130 1877 9373 4498 -3551 -2472 -3161 -6651 -11416 -10281 -6021 -17105
6056 -17105 -25306 -21338 -16980 -10683 -7207 -6631 -7327 -1603 -14417 -16486 -20790 -18669 -13271 -15981 -13931
6041 -13931 -3880 -9197 -6559 -6559 -19357 -15316 -7146 1446 1770 -2199 -8204 -10888 -21408 -26409 -15842
6026 -15842 -8756 -8198 -8903 -27381 -34277 -31900 -9372 -615 11233 9299 -9892 -9736 -17279 -17220 -7942
6011 -7942 -11545 -22482 -26523 -17817 -16635 -13743 4274 11210 8298 16019 20052 4785 343 -4437
5997 -4437 -12577 -27100 -18738 -21954 -26397 -19227 -13306 -5686 -22363 -30150 -18834 -7136 -12690 -23851
5983 -23851 -23006 -11704 -14595 -8326 2870 -4467 -2302 12250 14527 888 -6785 -2502 -5642 1161
5969 1161 6858 -4068 -16097 -17607 -10651 2978 3423 -16327 -23405 -25109 -23422 -10228 -206 -1295
5955 -1295 -6920 -3929 -12926 -21345 -9310 1962 2650 -3716 -7695 -17067 -21492 -16461 -10565 -13983 -9368
5940 -9368 -5137 -2690 -5270 -7024 -9754 -5921 -8466 -7637 -14742 -17208 -15183 -13095 -24262 -30709 -35778
5925 -35778 -34366 -24591 -16843 -24553 -26532 -23707 -16826 -9483 -17836 -33182 -24252 -25917 -19905 -19456 -18638
5910 -18638 -23841 -15821 -14660 -22077 -19289 -24262 -28952 -12857 -1368 -6282 -20716 -20258 -13205 11701
5896 11701 9631 -12262 -12558 -12558 -19624 -3806 -9909 -24081 -20114 -15179 5973 3820 -5564 -3599 -7344
5881 -7344 -10517 -5006 762 -2013 2790 12018 9762 3563 -6119 -5650 -2162 5111 -6132 -30497 -32663
5866 -32663 -20461 -27342 -32523 -20279 -17613 -16908 3601 -326 11247 6484 -11993 -24966 -29019
5853 -29019 -16538 3847 3532 5598 6773 1105 -7190 -344 2291 -4560 -10369 -9791 6842 316
5839 316 -10189 -14738 13114 15269 18106 17493 3835 -268 -4858 -14612 -24493 -12698 11401 8765
5825 8765 -6791 -7169 -6036 6088 24914 19845 8589 1430 674 10208 -3506 -23420 -24139 -17775
5811 -17775 -5544 -2373 -4982 -8578 -25006 -18216 -15527 -17527 -23842 -21734 -23437 -6895 8066 262
5797 262 -5110 -3760 -3008 -3729 3943 8966 -5584 -26528 -28854 -29246 -17269 -5312 -401 -8547 1469
5782 1469 -8072 -13204 3887 17529 19413 16042 12228 749 -7279 11828 6963 -3676 -1948 -10190
5768 -10190 -4097 5166 9241 8824 6243 9147 998 -14834 -20509 -17071 -10235 -10507 -3126 -8231 -2570
5753 -2570 -2627 -4807 -2669 6365 12881 7816 -2420 -6943 -7434 -8030 -7733 5548 13342 11004 6585 11283
5737 11283 11602 3578 1368 -4851 -17219 -8144 13834 20030 14522 5334 18685 6574 -5582 -3492
5723 -3492 -609 3018 -2868 -51 -2040 -644 -2445 7547 9307 -1826 -2186 4508 13077 20819 18155
5708 18155 8964 8023 11550 -8417 -10189 -9347 -8748 -4143 -7827 -9716 -2324 3846 13318 19064 26201
5693 26201 19233 1026 -16645 -13830 -10977 -16837 -4245 2104 3519 11245 24286 30923 31343 17606
5679 17606 14621 8700 13098 12895 2751 77 -6010 -5117 9333 19563 12233 -7349 -31409 -25739
5665 -25739 -11260 10712 18831 2610 -8301 -12349 -21474 -15979 -15902 -29115 -23706 -19297 -13537 -15299
5651 -15299 -10255 -11199 -19936 -20452 -21288 -22881 -27403 -18859 -22624 -25275 -18399 -25112 -29444 -33288 -26501
5636 -26501 -10972 -4247 -10809 -8777 -8167 4767 -1636 -11759 -9582 -8564 7392 18267 1455
5623 1455 -12021 -9562 -1814 6474 12637 22646 11622 13026 7813 -8941 -26148 3348 21850
5610 21850 13568 24120 24694 14312 12963 22731 15989 4553 566 8329 8761 13739 20646 14426
5596 14426 -6786 -1038 10971 -1693 -22146 -28111 -24532 -6587 1771 1923 2380 -2388 -14684 523
5582 523 11605 13271 18779 18656 11846 21423 24004 3947 -6238 -13620 -5574 3347 9694 6208 6951
5567 6951 2474 3639 445 -14073 -17541 -11644 -1828 1647 -2223 -7069 8038 4717 -15454 -23049
5553 -23049 -15326 -9239 -885 -8539 -6108 -10849 -7617 -8516 -2944 4888 -10549 -13868 7321 21837
5539 21837 7717 2219 2456 -1115 7033 14611 4130 8842 16342 7604 -6514 -7235 -2786 -1080
5525 -1080 -7324 -15166 -4513 -9806 -21245 -16918 -14913 -6225 -8697 -4776 -4020 -4908 -3037 -6032 -1211
5510 -1211 5344 10070 9497 613 -2993 -967 -1600 6570 9285 4936 -9458 -12012 -12973 570 11390
5495 11390 15825 6808 -6908 -7553 6441 5165 5939 8475 10197 7933 -8453 -9941 5126 12901
5481 12901 9302 10360 17473 12702 -1649 -7810 1869 -2707 -5196 -729 -4585 7564 11722 11456
5467 11456 -130 -7804 -1060 6143 1601 -4054 -7314 -3930 264 -9236 -1069 8684 6485 2862
5453 2862 2002 -5591 -10634 -11101 -15413 -4257 755 -2386 -8431 -7195 -3151 -10969 -7177 -1687 3112
5438 3112 5536 9858 178 -6639 -11688 4067 14589 4161 3502 2407 -9697 -12681 -17254 -22824
5424 -22824 -20545 -5885 3366 4450 2230 9255 -1054 -6761 -1755 1771 6190 -3093 -18876 -26933
5410 -26933 -23636 -6358 -9337 -11296 -10873 -17203 -16845 -6587 -9791 -19054 -8592 2668 22986 21911
5396 21911 8002 98 -10016 -19313 -17221 -7481 -9636 -11428 9902 27028 10857 -5549 -10506
5383 -10506 -10673 -12293 -9062 -16876 -11339 -5586 -469 -6363 478 8727 2824 5421 -527 -4788 -13241
5368 -13241 -933 12968 15810 19414 17458 13478 -5646 -9539 -1430 -3355 -6815 -7988 -1256 14823
5354 14823 5931 -14375 -25282 -20209 -17306 -9927 8701 23548 15946 6967 6967 8847 -5004 -2936
5340 -2936 -6434 -21297 -20784 -18437 -11880 -3861 3489 -120 -1682 3460 4488 -6536 -10385 -9658 -2286
5325 -2286 4983 2195 -1962 -4757 -14858 -15861 -23273 -22864 -16670 -16366 3582 9999 5242 8173 1800
5310 1800 -5253 -9120 -4559 9850 578 -5835 2689 3766 3491 -9598 -12868 -4813 -4467 -9818 5209
5295 5209 5153 -9099 -1819 4867 8712 10512 7314 14362 26736 23758 12079 14517 549 -4156
5281 -4156 2268 5000 -6403 -29268 -11857 -6932 -14168 -10313 -1032 6144 14203 14026 1306 12444
5267 12444 14341 3104 -12872 -18580 -10074 -9320 -29281 -20441 -4080 -1655 -580 -4491 -1399 -5034
5253 -5034 -8131 -14848 -13233 -5818 11502 23648 2615 -13649 -15316 -16918 -16836 -14855 -26534 -24829
5239 -24829 -17231 -10115 -12100 -19303 -83 9853 5046 -5347 -13994 -18968 -13618 -10196 -5563 -9771
5225 -9771 -7497 -8836 -7198 3955 8413 1616 -75 -1862 -1285 -1656 2895 3259 -1837 -1723 -9516 -18706
5209 -18706 -18320 -6075 3631 11048 8237 9091 -5013 -15104 -5299 -7053 -16586 -21264 -18305 -13049
5195 -13049 -3866 -3465 2484 -5073 -17975 -10160 -7776 -3520 -17045 -16737 -4475 -15694 -15973 -9805
5181 -9805 -4415 -11179 -6790 -5078 2750 -446 -1149 -2147 -11893 -18323 -22909 -12059 -2074 6508 -1302
5166 -1302 -282 -2137 -16810 -14102 -10486 -16087 -16021 -6622 -12165 -6971 1717 -8310 -9920 -8082 -2281
5151 -2281 8829 10643 -6444 -30103 -29411 -26785 -14812 -18244 -26252 -25639 -24989 -23680 -14404 -16309 -12597
5136 -12597 -13104 -12547 -4628 -5360 -14403 -16287 3058 9132 17454 2632 1879 -5575 -6473 4921 11816
5121 11816 7997 -10021 -16637 -9525 -2190 -7050 -25455 -25108 -17718 -10393 4223 -10502 -16421 -16217
5107 -16217 -18010 -9470 5350 1536 -2751 -5005 -4808 5647 8059 11352 5569 -267 -3753 -9320
5093 -9320 7384 854 3653 8029 2505 -4473 -4591 -6979 -16528 -12868 1983 -4975 -19554 -3797
5079 -3797 4329 4682 -6748 761 8248 12644 11232 4182 -12294 -17707 -26734 -31766 -35582 -39459 -38006
5064 -38006 -15404 1565 9043 -413 -5067 -10150 -7532 -4590 -8265 -19632 -24402 -24243 -34056 -25650
5050 -25650 -9451 -12631 -19284 -18989 -11642 2174 15901 19913 12835 -2890 -11232 -8397 -8496 3995
5036 3995 14107 12829 5129 13813 17104 4912 11288 12531 11864 13005 14296 -8788 -14940 -3231
5022 -3231 -7393 3611 3509 -7694 -18944 -24880 -19506 -5114 -2975 -3108 -17852 -27225 -25617 -18308
5008 -18308 -4780 5624 6556 19705 9846 7845 18812 17839 16819 17558 3297 3787 8611 -1189
4994 -1189 3206 5521 -9468 -19892 -23237 -7131 -7015 -12470 -7682 5969 23374 34138 32057 26568
4980 26568 16104 8420 1755 -17988 -20636 -13654 -10501 -6824 -12710 -9971 -3141 -13381 -26202 -36253
4966 -36253 -34639 -23881 -8579 -4814 -9749 -13618 -16349 -18558 -14029 -3107 -4721 -4379 -4377 -11951 -9828
4951 -9828 5949 7948 19509 22834 20595 -1372 -4529 -8205 -3429 4297 8252 11015 4090 1945
4937 1945 -2641 165 -825 -617 -1201 5794 9647 20300 16745 10428 1039 -67 2619 4119 -1581
4922 -1581 2920 -3603 -13949 -16583 427 10016 2374 -2979 -13980 439 9440 2721 -3315 49
4908 49 7099 11231 9973 5193 -757 -1486 11847 3156 -1965 -4670 -3714 13549 16835 9009 1997
4893 1997 -6064 1771 8362 725 -3324 -7739 -21022 -14859 -13972 -13163 -6676 -15013 -17751 -28217 -27769
4878 -27769 -6944 9575 27471 36423 27604 25955 16730 6731 -988 1066 -1975 -5339 -19427 -25119
4864 -25119 -14985 -17161 -28823 -26848 -26299 -22951 -21860 -15739 3886 5952 -440 -5751 -9615 -3151
4850 -3151 1461 -5219 -2886 -468 4380 14226 4797 -6013 -11974 3043 4944 8720 10824 11511 5458
4835 5458 10223 15672 14874 6104 3168 3000 -3436 -7659 -15855 -11212 -5880 -1188 15111 13138 -9099
4820 -9099 -13132 -11467 -4095 7087 -3976 -4811 -20222 -27980 -15955 -3060 3640 -3860 -17195 -25767
4806 -25767 -10165 -3797 -4446 -7179 712 -772 -2376 -7683 -3640 -512 -2350 -10068 -13860 -10802 -7555
4791 -7555 -5980 -6391 -3956 -1743 -9964 -2626 -11607 -14637 -4531 6804 15993 1424 -10085 -17414
4777 -17414 -10426 1167 9953 5150 1917 6880 8752 -3876 3891 -4193 -9879 -7332 3343 8057
4763 8057 18978 28201 11139 1763 -2951 -6748 -12144 -888 -678 -18318 -25401 -14892 -14717 -6878
4749 -6878 -1572 -5324 6688 8616 -311 -8870 -5025 3277 6030 -1274 -2214 -4375 -10688 -13214 -9775
4734 -9775 3932 14150 10786 9163 -16155 -37841 -32873 -7939 -6100 -12288 -12831 -17750 -10392 -3418
4720 -3418 -5114 -8829 -2327 -9470 -5971 -7975 -10610 -12913 -10414 -5884 416 2809 -6631 -14197 -3799
4705 -3799 -9867 -15882 -1423 14572 27954 37850 31850 26884 28969 23409 21084 12706 1769 4052
4691 4052 296 8134 20889 21221 27872 25914 13920 5424 9575 8459 1551 240 -3266 5178 10611
4676 10611 11261 5166 -8312 -18447 -16626 -13603 -8073 -16336 -26343 -27739 -19718 -18083 -7636 -1454
4662 -1454 -287 6517 10886 6651 9110 7507 10111 9129 11197 11331 9639 7141 3613 -11680 -19572
4647 -19572 -15011 -10633 -2347 -7166 -19025 -5463 -2956 -6256 -3447 7525 13288 10738 23 -9548
4633 -9548 -7137 1407 1749 1549 869 -5844 5219 7598 -16461 -13477 4587 2548 10133 10435 17734
4618 17734 15449 3314 -7108 -11021 -15762 -23798 -17168 -10397 -7562 614 -5076 -12071 -7062 807
4604 807 -7310 -16225 -13705 597 577 8608 18327 26730 28191 8888 16508 19331 7947 -2062 1931
4589 1931 10301 20085 28173 21631 4597 -8091 -9992 -4606 -9005 1610 10003 -3607 -12977 -11684
4575 -11684 -9913 54 18857 17616 10601 6739 -1097 -11724 -8005 -16338 -7624 2186 -1136 -9640
4561 -9640 -19523 -28980 -31312 -18861 765 4481 8620 812 -11626 -22634 -678 21156 8346
4548 8346 11104 8324 -2933 -7492 -6582 -4852 -5575 7107 3160 -6584 -11631 -7155 -226 198 10888
4533 10888 9185 -5936 -10241 -20059 -26311 -27954 -28370 -36121 -43655 -35046 -13800 2013 1441 -7356
4519 -7356 -9823 -19292 -14785 -4167 -15353 -34410 -28494 -14650 -19395 -16330 -10202 -3874 -4213 3048
4505 3048 -199 6037 1384 4616 9195 1448 -7985 -16263 -1909 4307 -15714 -20002 -27208 -18919
4491 -18919 -15208 -15689 -19455 -17500 -9387 -3286 -7870 -4660 3656 9175 16434 3611 -2648 -8944 -26828
4476 -26828 -37564 -21393 -10312 -2130 -8009 -13290 -11271 -1449 10301 8698 15009 26700 24544
4463 24544 14037 12407 5053 -14279 -14703 -3046 9730 8081 -11956 -16377 -2006 -8036 -9437
4450 -9437 -14945 -20730 -19660 -14241 -16001 -14136 -48 7630 12897 4365 67 -4970 -5158 -9869 -13550
4435 -13550 -13166 -7825 -11420 -9659 -5612 -12597 -8711 7679 -3661 -13110 -16018 -13803 -5495 -3487
4421 -3487 -5924 -14785 -27608 -20744 -15675 -14804 -15011 -15175 -2397 -11026 -26053 -13462 -9438 -15581 -15498
4406 -15498 -13750 -391 9999 12896 3808 -8809 -16470 -18133 -15799 -24971 -42066 -41703 -28529 -21944
4392 -21944 -30264 -23081 -21028 -17611 -16081 -17968 -5335 1248 6911 3762 1298 8365 15731 21213
4378 21213 22754 31097 28446 13906 4486 5567 2688 -4274 -768 -4096 -9348 -8482 -10990 -14076 -16177
4363 -16177 -21225 -26151 -26223 -24471 -12462 -3851 -13147 -17205 -6240 14142 13932 11948 11951 8044 3236
4348 3236 -4633 -5853 -8305 -12705 -12879 -16480 -30158 -28118 -18104 -10814 -6644 -3896 18787 15869
4334 15869 1238 -18106 -13384 -14631 -10128 -11852 -10474 5770 6725 -9529 -32187 -43771 -35352
4321 -35352 -6729 1222 12497 12195 4737 3360 -526 4296 1957 8313 17631 15014 244 -9598
4307 -9598 -8644 -11272 -26315 -20511 -19399 -6680 -4389 -19018 -3063 7829 -1316 -10693 -15929 -19987
4293 -19987 -3681 -9120 -13195 -1250 3283 -12968 -10127 268 4822 -2760 -18845 -23443 -16359
4280 -16359 -4637 -1179 4999 46 -8475 -6890 -6249 5397 -6840 -13808 -11482 -7773 -1728 5808
4266 5808 2724 4965 7815 9618 3475 -3349 4502 3139 5327 3465 -11624 -19382 -15967 -3423
4252 -3423 4437 -7369 -25896 -19455 -20712 -19463 -13424 -13659 773 7111 18875 22168 18483 12361
4238 12361 9936 -828 9716 15231 6332 3611 -1260 -16195 -24176 -26629 -33467 -16186 -3328
4225 -3328 -11846 -24810 -18262 -15990 -5436 -4715 -13295 -3090 24606 31009 16785 390 -2128 -8798
4211 -8798 -6334 -15942 -13622 -26188 -31998 -34224 -14265 -2224 -1964 614 368 -10545 -17630 -9092
4197 -9092 -7825 -15916 -2544 4882 11414 12116 3697 -13560 -7235 6798 6794 8346 2508 -3139 11656
4182 11656 7719 4501 579 -5082 -2878 8545 10451 4223 -3215 -737 3623 5740 10569 5708
4168 5708 7963 4950 6928 2820 -13818 -14722 -13465 -23176 -27571 -30870 -15119 -5032 -12799 -6715
4154 -6715 -1193 -9479 3724 9089 2006 3592 3821 -4480 -12190 -13200 -7284 -695 -5104 3130 -1239
4139 -1239 -12087 -8741 -2362 12010 11541 12551 16330 20430 17781 13623 15491 18061 10868 10039 8703
4124 8703 11711 19507 20803 9756 4095 4085 -7549 -4246 -5907 -11073 -3867 -7666 -3951 -5194 -7011
4109 -7011 -1236 1211 -6709 -22084 -26858 -8840 -684 -3310 -5719 -5920 6541 9977 1198 11577
4095 11577 9106 5551 8874 9190 4106 -1183 813 -3869 -27303 -36189 -25123 -16513 -11844 -275
4081 -275 7179 8299 8369 21991 23547 19984 16077 2931 -4205 -12463 -18692 -11455 -13987 -33719 -29669
4066 -29669 -9365 -6799 7622 4186 -331 -5402 -7488 -1869 6699 4393 4699 2867 2729 2205 -1057
4051 -1057 -3704 -3868 6221 6228 869 8436 5431 2829 7539 9651 7326 10561 5661 229 5886 4220
4035 4220 5464 -1032 -7086 7595 -3913 1443 13102 2356 -13554 -16901 -18423 -12075 -9204 1531
4021 1531 9304 7253 393 -2068 10425 13993 -2354 -12110 -17533 -25703 -24430 -4032 1122 -3279
4007 -3279 16919 11739 -587 -5232 1576 4885 4675 1117 -4105 490 296 -2986 5583 10802 22309
3992 22309 21941 6007 -8265 -18099 -19189 -14146 -1908 7386 -1828 -3837 8985 9950 2514 -11381
3978 -11381 -12526 -3661 1610 -22810 -29667 -12182 -2199 4312 13074 11208 308 -3607 -11245 -18117
3964 -18117 -8395 -8438 -15929 -14347 -7252 -2121 -1785 -4982 -19353 -26598 -12257 -8275 -9890 -17086 -12536
3949 -12536 -9902 -22349 -25972 -26072 -18258 -13863 -2016 9996 1873 -2908 -9653 5508 10978 8180
3935 8180 3475 -2115 -7902 -8974 -6165 -8550 -11882 -17981 -21693 -587 8672 8704 6329 -238 -3729
3920 -3729 -11981 -9914 -976 -3432 4879 14531 8146 4579 -3503 -5405 3969 -523 2648 185 -13162
3905 -13162 -12565 -7033 -5555 -3124 -14131 -16624 -16781 -13518 -12912 -5776 -3602 -626 5985 3062 7355
3890 7355 10950 16650 6545 5067 -5542 -19283 -11132 -7947 11594 17272 14935 12561 11532 3272
3876 3272 2711 4553 249 -11631 -9771 1508 4450 3162 8874 10257 -8753 -15058 5576 13498
3862 13498 4952 -5586 -13761 -2714 5036 -938 137 5234 17072 29472 25601 14272 6935
3849 6935 -4946 -878 -595 10359 3227 -9756 -5704 -4004 100 5022 -16888 -13193 -5544 -8391
3835 -8391 -8679 -6023 -4531 4714 12503 9205 -2092 -15067 -10453 -10268 -11266 -6454 -19825 -16373 -10848
3820 -10848 -8404 -7307 -8501 -11679 -6903 6008 14899 7622 10153 11491 10361 -1557 -7990 8382
3806 8382 2568 3684 3270 11552 9483 3682 8566 10437 -2580 -8000 -4098 -9302 -16850 -15758 -13057
3791 -13057 -9428 -7183 -7532 -3468 1969 3847 8498 18237 26447 11751 1128 -579 -6386 -15162
3777 -15162 -16966 -4694 -10787 -13637 -3341 1428 -5467 -5990 4155 4529 -899 -12933 -11486 -5440
3763 -5440 4107 8574 -323 -2700 8266 5584 -1143 3997 14074 748 -7496 -10924 -24453 -22870
3749 -22870 6954 25802 26911 5636 6251 4517 14235 13331 9918 19397 16285 3600 703 7767
3735 7767 3955 3892 1979 13998 10135 9467 15041 23955 27695 22805 7573 -11630 -20946 -26000 -10809
3720 -10809 -4929 -5949 -12904 -19399 -15237 2350 20567 31528 25474 7796 6897 12214 14568 8774
3706 8774 9053 23267 24330 12293 257 -15553 -11847 -8729 -2619 -284 1750 5453 16834 12089
3692 12089 10835 27005 25281 8757 -1033 -139 4346 10744 11867 6377 2842 -19226 -20088 -17856
3678 -17856 -16392 -5039 3678 5679 2728 -8201 -17486 -8201 5875 -844 5092 16103 16824 2848
3664 2848 -8541 -10114 6446 5061 -13861 -13482 -13960 291 9254 12676 19143 13348 1116 5696
3650 5696 25790 24394 10599 14888 17171 7708 7835 -6764 -9561 -13859 -6553 -3725 252 -8602
3636 -8602 1495 10402 15013 1851 -4898 -12749 -14068 -6379 -8387 -5481 -9033 -12786 1600 8899
3622 8899 -788 -6295 -26593 -26657 -12075 -12768 -14590 -9691 -4531 13534 28474 16017 -1126 2636
3608 2636 8888 2233 -1973 1166 2001 11012 14038 -5457 -9526 -11553 -11686 -6974 3360 3810 13154
3593 13154 10977 18797 12123 4314 -1498 -4907 -3815 252 6078 19327 17467 7823 7307 -4826
3579 -4826 -8914 9411 11518 10270 16109 16960 17159 25902 19569 6898 -9041 -10979 5694 4178
3565 4178 -16160 -30164 -25145 -16209 -4527 3929 -9947 -15614 -17598 -10524 -1965 -230 2510 10780
3551 10780 10858 12181 14130 15111 10028 7941 3206 -2766 974 -10281 -8453 -1839 -7472 -2740 -4602
3536 -4602 -1440 1150 10732 18642 12384 1185 6466 7233 -222 -958 -2281 -7705 -2343 -589 -8889
3521 -8889 -20053 -10771 1275 6352 16222 5466 3766 12074 3545 -4475 -7773 -13482 -14717 -21562
3507 -21562 -7930 -3416 -5785 -25393 -22822 -16570 -15918 -11958 -7901 -10523 -19395 -7481 -2711 -13340
3493 -13340 -12355 -16377 -5219 5460 4720 -2033 -14278 -15027 12684 2911 -9164 -15240 -20966 -20716
3479 -20716 -26489 -22320 -19669 -15593 -18048 -21598 -25954 -27751 -12313 5028 8535 1239 -8905 -4795
3465 -4795 -9698 -5970 300 10829 26680 30586 21811 20637 15921 16293 8014 1444 11961 23352
3451 23352 18246 7002 3400 5990 -12836 -18976 -3735 8713 9556 6512 17094 12356 6797 5995
3437 5995 5477 -7625 -17488 -12136 -6339 789 -12646 -14360 -2358 -5435 -13973 5890 4368 2952
3423 2952 11404 22784 20023 1760 -2557 2784 20314 32112 25968 24567 19552 852 -8958 -15619
3409 -15619 -11033 -11844 -649 9599 6247 8143 -9365 -13886 2126 4651 -170 6928 23014 28545
3395 28545 26567 18964 8742 8026 -1372 -15527 -20469 -11637 -1915 4890 -1404 -9682 -16365 -20816
3381 -20816 -20481 -19030 -6054 2081 6882 8408 -3281 -7980 -798 -7006 -16619 -18725 -17479 -16404
3367 -16404 -25901 -27289 -15949 -14281 -14639 -12236 5342 15506 10309 -8807 -7630 7425 11259 -7
3353 -7 -26466 -37344 -22662 -8925 -7961 -12492 1608 7467 10088 16408 11084 8221 10265 11574 7261
3338 7261 4671 4423 4466 12514 -1883 -9657 -17660 -5914 -10318 -9194 -13967 -24924 -21539 -21979 -31040
3323 -31040 -15433 -6890 -9177 -9446 -4776 -6268 -3804 12163 19880 6568 2208 10876 13757 9893
3309 9893 11743 7391 -1428 -2587 -4667 3901 10147 4091 -4951 -20467 -20662 -23976 -12971 -3037 1844
3294 1844 6825 1496 -8458 -14530 -9081 4251 10604 21238 22076 12316 -1824 -7203 3700 5581
3280 5581 8053 11610 1588 7606 7190 -534 -9719 -10734 -3792 5364 14286 3423 440 1599 9944
3265 9944 11622 15465 9155 7304 6617 3699 428 -9332 -11082 -19771 -9736 2234 5158 -606 9843
3250 9843 6568 13104 10197 13154 18780 8255 9672 34206 43561 39801 24286 7369 4608 5571
3236 5571 13581 6348 7737 13771 18907 6820 1953 832 -2651 -13034 -20296 -21795 -30376 -22174
3222 -22174 -17047 -8208 -1068 -15407 -22464 -22063 -19941 -12358 -3525 7710 7385 -7286 -24412 -33839
3208 -33839 -20946 -13390 -6347 4602 6747 -4039 -4355 3461 2228 27 7375 14179 12892 3435
3194 3435 -6114 -16886 -36255 -33780 -32563 -17838 -1398 525 2504 -572 -9898 -19532 -29779 -33603
3180 -33603 -23658 -21211 -7337 2657 9922 15146 -1132 -16789 -20633 -27270 -28747 -29540 -30376 -14643
3166 -14643 3771 5388 12508 17016 10396 10566 6118 -6666 -14912 -19511 -20986 -29471 -38388 -35702
3152 -35702 -23535 -21373 -13080 -2420 8109 10268 17146 14694 4813 15819 11025 -3292 9969
3139 9969 19263 12621 2177 6329 7645 -1939 -9348 -4106 -8374 -19590 -18853 -1991 3438 12865
3125 12865 186 -23571 -25695 -9919 4335 10082 215 11084 11502 12463 17306 8272 -983 4835
3111 4835 20521 19734 18015 20202 16122 20729 6905 -5957 -7442 -7687 -5255 5947 9287 11500
3097 11500 13621 3870 -826 2970 5129 3160 7496 9501 860 5316 19382 22045 8222 -8913
3083 -8913 -6520 -18786 -33974 -22893 -17505 -19614 -14774 -545 12684 3396 -1298 7796 7388 4748
3069 4748 13176 15937 -2458 -5666 -12215 -7325 1702 -1411 7627 6081 4694 -14744 -24033 -13164
3055 -13164 -10384 -7979 7911 -873 -5836 -4741 -4906 -4551 -5147 11691 1402 -10202 3665 23845
3041 23845 20881 6576 -2913 -3821 -2457 -1517 2942 5656 -9718 -16600 -16055 -10768 5597 13795 24499
3026 24499 21755 19908 13026 9784 3699 2011 -3109 3117 2810 2585 -11146 -28309 -23119 -14984 -9583
3011 -9583 -3200 -4759 1825 920 2539 2683 3908 11252 6092 -5605 -15229 -14274 -9856 -6856 -21688
2996 -21688 -22855 -8842 6058 7238 1920 -11759 6576 26749 25623 25098 15761 9557 13108 -1267
2982 -1267 -10306 -11983 -5747 12572 20574 23843 9020 10196 -742 -9296 -8178 5647 12503 -42
2968 -42 -11864 -15371 -19574 -16953 -21967 -17511 -9625 -18002 -23811 -20180 -15057 -3709 11367 10837 10679
2953 10679 5791 -3508 15932 6649 5855 10465 13314 9211 10587 7860 5954 13904 8795 879 -4924
2938 -4924 -7715 -16811 -19984 -12875 -13194 -10463 -11376 -13525 -14266 -10417 -13036 -8242 -9921 -7456 -4450 -13838
2922 -13838 -21480 -8671 -8336 -12616 -14958 11470 31305 15869 -2113 -12076 -2857 2222 4430 4114
2908 4114 -131 -13131 -21439 -28186 -20868 -17959 -13900 -10795 -10024 -1251 -5954 -14216 -15881 -20615 -31065
2893 -31065 -24553 -18574 -10259 5621 14479 6721 5015 13113 2154 -7112 -14060 -16710 -14892 -6489
2879 -6489 -398 -3424 5148 -2992 -21310 -14324 2774 14849 13694 19702 -6642 -21980 -16993 -6908
2865 -6908 -8435 -9329 -14363 -7702 -4991 8001 -4413 8305 17464 11510 10989 14529 7119 8082 15210
2850 15210 20349 15951 17468 13574 7630 -10302 -4822 16679 14749 24368 16565 8617 -3668 -4551
2836 -4551 13097 13814 12610 21737 18226 21096 20435 4970 -5611 -5181 4572 26498 35922 31565 29218
2821 29218 29862 22961 19109 17973 11165 3111 -1557 -8312 -2634 1681 9291 14168 12556 9984 5804
2806 5804 714 297 -2948 -8065 -2992 537 -473 -3122 -5782 -8067 -7791 -8895 -8665 -7390 -5150 3691
2790 3691 -1565 -12022 -12824 -13941 -15659 -13053 -11474 -6216 4534 4548 6461 9130 -4922 -136 373
2775 373 5103 7836 5151 -3333 7995 -1849 -9644 2689 5360 -8403 -5232 -5226 -3589 -3341 5441
2760 5441 12359 12658 19970 12755 10068 595 -7390 -11490 -812 -390 -10247 -5281 -991 -10953 -10180
2745 -10180 -14576 -14263 -15026 -14897 -22196 -16567 -3576 -5734 -9702 -11858 -12505 -313 -6723 -25003 -33447
2730 -33447 -26144 -36102 -29929 -6102 15215 26399 13476 13573 4313 1207 -1117 -3545 -211 6144
2716 6144 7707 13592 16281 9856 -1473 -10673 -18206 -6351 -3811 -3597 7690 7541 -3182 -4612
2702 -4612 -11314 -11461 2607 5958 3959 -2146 3103 6352 -2307 -16716 -16937 -7644 -16739 -20686 -18182
2687 -18182 -16357 -14486 -10042 6010 13530 1323 -9736 -13068 -2658 -15124 -15070 -2028 -6227 -4238
2673 -4238 -2522 -4059 -1155 4349 200 -11106 -12320 -4349 4822 -9767 -6908 4089 -6701 -2517
2659 -2517 9113 9152 10295 15616 16802 13796 24987 24229 19053 15510 13366 14453 11634 5631 3987
2644 3987 9138 22781 20577 4328 -1765 6396 7289 -815 2032 -132 -1326 891 -1417 -7331 -12448
2629 -12448 -947 4695 -6864 -15100 -14562 -9175 -12604 -6591 -3738 -782 -3885 2419 5333 -5116
2615 -5116 -8457 -11882 -8831 -1826 -6892 -1229 13573 15719 11306 -184 -12125 -6337 -6117 -5523 -13596
2600 -13596 -19267 -23738 -12970 -5109 -7592 -5976 -3553 2092 296 -9878 -9590 10797 13146 10914
2586 10914 9019 6584 4165 4600 7737 13929 16251 9870 6682 -3719 -5274 -6385 2863 6077 3498
2571 3498 6996 -764 -7325 -15280 -16290 -10392 -2707 -8991 -7715 -4438 1713 10823 21972 13975 12735
2556 12735 6450 8952 739 -13920 -17777 -18936 -8853 -1054 -3690 11353 8712 3544 3843 5083
2542 5083 -28 2345 6130 10856 8847 -1579 1155 10365 4800 -330 1228 20216 23995 8390
2528 8390 -10179 -11803 -10191 9485 6952 -454 13330 17186 14089 15615 18660 10175 2573 1390
2514 1390 -2450 3932 6954 3167 1660 -5651 -7956 4136 10272 1868 -7137 -13196 -10065 10086
2500 10086 9012 10057 14191 23887 35337 35156 10967 -6838 -16140 -15360 -14750 -18513 -15098 -515
2486 -515 5349 12432 5072 -2174 -401 -3255 -8825 -19634 -23833 -20057 -1286 17428 18314 15582 11453
2471 11453 8410 2508 -10052 -17423 -14921 -3033 3957 -3771 -14442 -5758 6050 -55 1005 3830
2457 3830 -4486 8081 10681 26707 28467 16278 16323 14466 3230 6006 16236 13898 11846 4958
2443 4958 -1090 1865 -3215 -8683 -1313 -8047 -9193 -6982 -1258 -3562 -8341 -8499 -19547 -18691 -15968
2428 -15968 -12673 -588 -9466 -16366 -9796 -11539 -11089 -8834 -6475 16495 18026 17708 10820 -694
2414 -694 4069 15105 19072 16951 13433 10052 2785 -1159 -2266 -3133 -2039 10610 10480 9476 9663
2399 9663 113 -1279 -7146 -13527 -16685 -15320 -14828 -3667 2068 9658 13626 6870 -6101 -13489 -12520
2384 -12520 -2327 17463 21725 10869 3539 10498 16898 -332 -983 10543 13233 -3106 -2728 14384
2370 14384 14880 16961 33264 37868 29647 31525 22770 13128 14662 10127 12377 7018 14901 17833 18576
2355 18576 11021 13972 11123 11229 12230 6487 16048 15139 19545 15724 8595 9980 10849 8363 -8562
2340 -8562 -8680 -3551 -3841 -3303 -3380 -16967 -21507 -18647 -7150 7904 12799 -1481 -6568 11081 24098
2325 24098 12421 6467 1365 134 -2968 4978 17876 18655 9657 850 4686 2561 -5874 -1020
2311 -1020 7928 4068 5877 9402 4094 16582 25154 3401 -13889 -11517 -7867 1209 11797 18844
2297 18844 5601 -2962 2072 10056 1853 -4169 4487 9798 11853 13551 3606 4231 8500 7706 3805
2282 3805 10345 -3715 -15347 -6318 6478 -1524 -2980 -3797 -3802 -4508 706 9823 3070 -3437 -4885
2267 -4885 1612 3977 10631 26328 28015 17875 10166 14858 15689 -1954 89 -12992 -13716 -10190
2253 -10190 -1048 7905 8022 10861 10166 3638 7839 5862 2905 -1298 4163 11488 1103 -7295 -11066
2238 -11066 -3308 -557 4985 6744 -63 9928 14509 -1872 -4598 261 751 2003 8227 8000 3613
2223 3613 -1723 -1751 30 5284 16294 11894 5526 -3546 6034 4575 3062 -424 -12127 -23797 -17539
2208 -17539 -21573 -9407 23 22139 20188 10678 9851 5094 -2880 -385 -8959 -12668 -10351 -35
2194 -35 1556 1067 5147 13774 21375 13611 3946 -9393 -3928 -7358 -12838 -5855 -7097 -13662 -13660 -7413
2178 -7413 -1432 9332 13329 11020 6999 5409 1902 1643 858 -6592 -11814 -8775 380 -3604 -2666
2163 -2666 6043 20478 18094 24432 31205 21901 13440 10483 -1546 -6966 -957 13654 20130 22823
2149 22823 19065 15710 869 -2404 5353 13074 7943 2883 -2418 -2610 -5272 -8561 -8420 6022 13952
2134 13952 8856 -8040 -8214 -11635 -14801 -11220 -7207 -8578 6471 15878 17164 18999 20394 24228
2120 24228 18337 9355 15000 4493 1374 2501 -11014 -14080 -10964 -21440 -16838 -16447 -25817 -9986
2106 -9986 -444 512 -734 -15483 -13562 -20030 -13133 -10464 -13366 -6957 -1616 -3802 493 518 13066
2091 13066 22832 12692 9187 11226 21056 22240 18454 14381 10029 3893 632 5508 3161 1472
2077 1472 -5531 -31376 -37706 -28010 -25939 -21573 -16072 -7784 -4669 2279 5077 6148 618 -744 -749
2062 -749 -11470 -1753 5869 5428 6982 2848 -3411 18352 31293 23085 584 -6176 8325 14114
2048 14114 16223 19243 19646 16165 10224 16911 5373 -502 9479 13084 13137 3862 -9554 -21132 -10122
2033 -10122 1866 -9550 -19327 -265 -998 7425 18252 7156 -1071 -8167 -3013 5223 17655
2020 17655 10731 4972 10085 17486 8436 6891 14780 5503 -3784 -15760 -18776 -3503 -1262 5360
2006 5360 20446 23303 16505 3699 -6429 -14614 -14028 -10620 -769 -407 -8192 -30150 -36531 -30782
1992 -30782 -28925 -19562 5410 4542 -1091 -4593 -4335 -3984 -11198 -6340 4765 -1761 -6457 -11495 -17925
1977 -17925 -8171 5166 4560 2640 -9656 -11217 -14452 -6610 -9481 -4032 -7260 -8465 -16113 -18240
1963 -18240 -8574 -8639 -9454 -7589 -19414 -9419 689 2377 5941 20064 24278 17852 -5421 -15788
1949 -15788 -15237 -7855 -4047 -7216 2106 15906 21415 5457 -5169 -9644 1057 5381 8168 10754
1935 10754 5081 7068 3186 10550 25524 20066 6166 822 13877 29121 26468 23459 27814 34518
1921 34518 27439 19794 16274 10744 7626 6627 1919 9886 2615 78 -10341 -13951 311 6163
1907 6163 2850 7905 12031 14381 11723 8603 3149 -81 8153 19714 26630 21329 6609 -1844
1893 -1844 3295 -8417 -6779 -5961 -602 5379 3777 2081 -4649 8987 26854 25736 40122 34508
1879 34508 17821 344 7571 17878 22642 8935 7772 7660 7199 12092 10526 14865 8800 -1805
1865 -1805 -8091 -5426 -8072 -13847 -1918 9958 7997 -2265 -1871 -10058 -4642 9798 23206 32612
1851 32612 30512 27997 23346 21188 30609 26144 18254 20178 8715 -4373 -16888 -29167 -18861
1838 -18861 491 6872 150 11965 12452 -3950 -6312 -6879 -10288 -14219 -8426 -2094 8273 3284
1824 3284 -4696 -721 -3605 2365 7352 15667 23487 19696 10087 4528 -768 7676 13218 13040 -3567
1809 -3567 -2319 8082 18943 14569 3985 -3399 674 -9240 -1740 -4631 -1581 9607 4830 9613
1795 9613 -4630 -7280 821 -5932 -4909 -6930 -13732 -16059 -10781 -6690 -1651 -3733 -7839 1083 9339
1780 9339 3156 -3196 -7846 -4666 5095 10489 25854 20656 5342 1599 3271 6686 16886 14360
1766 14360 14170 9203 4331 5205 13883 12169 -1390 -1620 -779 1838 14639 6438 2588 10883 11683
1751 11683 -162 -8187 -18893 -19713 -18450 -16940 -2405 4053 12260 21960 24711 17994 9976 18324
1737 18324 25566 15181 4748 8004 3096 -2093 -10860 -12913 -6117 -3403 -10988 -20252 -2964 6946
1723 6946 10368 16098 16762 14718 8363 12719 1935 16074 20705 11089 4101 9494 11647 12178 12583
1708 12583 12235 1586 -14221 -18241 -8670 11936 33261 45118 33892 18230 27616 34034 27812
1695 27812 25501 25668 23638 21094 3968 15584 18066 1208 6316 14690 13959 11856 7716 2307
1681 2307 -5091 -4536 -16838 -24016 -1530 7393 -4761 -14746 270 19731 11935 10629 8200 -256
1667 -256 -10850 -5027 3631 3129 5316 5539 4449 14335 -1801 -12965 -16468 -13216 3567 3083 -11179
1652 -11179 -8822 -6239 -15567 5358 8589 1023 10062 2953 -5459 -11850 -25347 -15360 3045 5733
1638 5733 -4820 -19854 -20345 -1382 -1358 -6615 3636 13620 14269 6073 12205 1627 -11359 -7896
1624 -7896 2885 13587 26686 32271 22488 -2340 -10863 -8414 -20 -1191 -9528 1602 4406 4753
1610 4753 6800 9544 4169 8736 11176 5967 12133 4055 -3918 -5086 -9579 -7143 -4989 -15420 -25914
1595 -25914 -20909 -14937 -5040 -2026 -6647 -6268 -5748 3782 8933 -1300 3967 3319 -9177 -8109 -10082
1580 -10082 -14861 -10318 -16057 -26879 -25245 -28234 -23294 -12451 -3319 -9665 -1677 -10342 -16221 -14897
1566 -14897 -7429 -5123 -2216 -6866 744 3431 7483 11031 17822 9972 -5828 4518 -3663 -12396
1552 -12396 169 2935 -3980 -6491 -17706 -19949 -21279 -13218 -459 -9937 -18377 -16392 -26146 -23949
1538 -23949 -6828 3879 5781 3440 4203 -4597 -18913 -20226 -6567 -160 4452 6634 259 -609
1524 -609 12384 12408 -6596 -10463 -1728 36 -2665 13295 15268 6268 -4412 -5212 -5194 -11960 -11679 790
1508 790 3326 12303 3109 -9745 -17283 -11623 -1675 -12776 -17050 -12747 -7589 -3050 -5886 -14884 -25112
1493 -25112 -18659 -3821 7349 13229 6516 8170 12623 16660 11664 1839 -3258 -5839 998 -10238
1479 -10238 -12568 -9767 -7031 -8292 -3748 9397 12202 -206 -2656 1888 6786 5833 -6354 -10466
$$ [...]
##END NTUPLES=NMR SPECTRUM
##END=
