##TITLE=Analysis number 310859
Compound Code cc 24416
Book Reference 350/154/1
Project Code adrs
Chemist Name chrisr
##JCAMPDX= 6.0         $$ Bruker NMR JCAMP-DX V2.0
##DATA TYPE= NMR SPECTRUM
##DATA CLASS= NTUPLES
##ORIGIN= Bruker BioSpin GmbH
##OWNER= NMR
$$ XWIN-NMR		Version 3.5
$$ Fri Jun 24 10:10:09 2005 GMT Daylight Time (UT+1h)  MAYBRIDGE\NMR@NMR_250MHZ
##.OBSERVE FREQUENCY= 250.131544655141
##.OBSERVE NUCLEUS= ^1H
##.ACQUISITION MODE= SIMULTANEOUS (DQD)
##.ACQUISITION SCHEME= undefined
##.AVERAGES= 16
##.DIGITISER RES= 18
##SPECTROMETER/DATA SYSTEM= dpx250
##.PULSE SEQUENCE= zg30
##.SOLVENT NAME= CDCl3
##.SHIFT REFERENCE= (INTERNAL, CDCl3, 0, 16.522)
##AUDIT TRAIL= $$ (NUMBER, WHEN, WHO, WHERE, WHAT)
$$ ##TITLE= Audit trail, XWIN-NMR		Version 3.5
$$ ##JCAMPDX= 5.01
$$ ##ORIGIN= Bruker BioSpin GmbH
$$ ##OWNER= NMR
$$ C:\u/data/dgb/nmr/ADRS/4770/pdata/1/auditp.txt
$$ ##AUDIT TRAIL=  $$ (NUMBER, WHEN, WHO, WHERE, WHAT)
(   1,<2005-06-24 10:09:48.25 +100>,<MAYBRIDGE\NMR>,<NMR_250MHZ>,
      <created by zg, POWCHK disabled, PULCHK disabled
       configuration hash MD5:
       62 19 C7 07 E1 42 D1 B7 37 6C 3D D0 77 39 F9 E6
       data hash MD5: 64K
       9A 07 59 BC 9F 9E 92 F1 8A CC 13 5E 51 A2 CA 34>)
(   2,<2005-06-24 10:09:59.80 +100>,<MAYBRIDGE\NMR>,<NMR_250MHZ>,
      <Start of raw data processing
       ef LB = 0.3 FT_mod = 6 PKNL = 1 SI = 32K 
       data hash MD5: 32K
       CA 34 71 C0 85 30 B1 B4 9F 38 3B 4F 85 12 E2 44>)
(   3,<2005-06-24 10:10:01.66 +100>,<MAYBRIDGE\NMR>,<NMR_250MHZ>,
      <apk 
       data hash MD5: 32K
       59 99 8A 56 04 D7 13 80 BD 40 9F C2 6D C7 E6 22>)
(   4,<2005-06-24 10:10:02.33 +100>,<MAYBRIDGE\NMR>,<NMR_250MHZ>,
      <abs ABSG = 5 
       data hash MD5: 32K
       4C EF D2 7D 3B D5 AA 38 B4 B3 FA BF B3 7A F9 BE>)
$$ ##END=
$$ 
$$ hash MD5
$$ A7 9A 6E 28 B3 84 E4 96 20 B0 4F 78 20 C5 F8 A7
##$RELAX= 
##$RELAX= 
##$RELAX= 
##$RELAX= 
##$RELAX= 
##$RELAX= 
##$RELAX= 
$$ Bruker specific parameters
$$ --------------------------
##$DU= <C:\u>
##$EXPNO= 4770
##$NAME= <ADRS>
##$PROCNO= 1
##$TYPE= <nmr>
##$USER= <dgb>
##$AMP= (0..31)
100 100 100 100 100 100 100 100 100 100 100 100 100 100 100 100 100 100 
100 100 100 100 100 100 100 100 100 100 100 100 100 100 
##$AQSEQ= 0
##$AQ_mod= 3
##$AUNM= <au_zg>
##$AUTOPOS= <10 >
##$BF1= 250.13
##$BF2= 250.13
##$BF3= 250.13
##$BF4= 250.13
##$BF5= 500.13
##$BF6= 500.13
##$BF7= 500.13
##$BF8= 500.13
##$BYTORDA= 1
##$CFDGTYP= 0
##$CFRGTYP= 5
##$CHEMSTR= <none>
##$CNST= (0..31)
1 1 145 1 1 1 1 1 1 1 1 1 1 1 1 1 1 1 1 1 1 1 1 1 1 1 1 1 1 1 1 1 
##$CPDPRG= <>
##$CPDPRG1= <>
##$CPDPRG2= <>
##$CPDPRG3= <>
##$CPDPRG4= <mlev>
##$CPDPRG5= <mlev>
##$CPDPRG6= <mlev>
##$CPDPRG7= <mlev>
##$CPDPRG8= <mlev>
##$CPDPRGB= <>
##$CPDPRGT= <>
##$D= (0..31)
0 1 0 0 0 0 0 0 0 0.06 0 0 0 0 0 0 0.0002 0 0 0 0 0 0 0 0 0 0 0 0 0 0 
0 
##$DATE= 1119604187
##$DBL= (0..7)
120 120 120 120 120 120 120 120 
##$DBP= (0..7)
150 150 150 150 150 150 150 150 
##$DBP07= 0
##$DBPNAM0= <>
##$DBPNAM1= <>
$$ [...]
##$SUBNAM7= <"">
##$SUBNAM8= <"">
##$SUBNAM9= <"">
##$SW= 20.6930455092707
##$SWIBOX= (0..15)
0 0 3 0 0 0 0 0 0 0 0 0 0 0 0 0 
##$SW_h= 5175.983436853
##$TD= 65536
##$TD0= 1
##$TE= 295.16
##$TE2= 300
##$TE3= 300
##$TEG= 300
##$TL= (0..7)
0 120 120 120 120 120 120 120 
##$TP= (0..7)
150 150 150 150 150 150 150 150 
##$TP07= 0
##$TPNAME0= <>
##$TPNAME1= <>
##$TPNAME2= <>
##$TPNAME3= <>
##$TPNAME4= <>
##$TPNAME5= <>
##$TPNAME6= <>
##$TPNAME7= <>
##$TPOAL= (0..7)
0.5 0.5 0.5 0.5 0.5 0.5 0.5 0.5 
##$TPOFFS= (0..7)
0 0 0 0 0 0 0 0 
##$TUNHIN= 0
##$TUNHOUT= 0
##$TUNXOUT= 0
##$USERA1= <user>
##$USERA2= <user>
##$USERA3= <user>
##$USERA4= <user>
##$USERA5= <user>
##$V9= 5
##$VALIST= <valist>
##$VCLIST= <CCCCCCCCCCCCCCC>
##$VD= 0
##$VDLIST= <DDDDDDDDDDDDDDD>
##$VPLIST= <PPPPPPPPPPPPPPP>
##$VTLIST= <TTTTTTTTTTTTTTT>
##$WBST= 1024
##$WBSW= 4
##$XGAIN= (0..3)
0 0 0 0 
##$XL= 0
##$YL= 0
##$YMAX_a= 535436
##$YMIN_a= -394886
##$ZGOPTNS= <>
##$ZL1= 120
##$ZL2= 120
##$ZL3= 120
##$ZL4= 120
##$ABSF1= 16.522
##$ABSF2= -4.171173
##$ABSG= 5
##$ABSL= 3
##$ALPHA= 0
##$AQORDER= 0
##$ASSFAC= 0
##$ASSFACI= 0
##$ASSFACX= 0
##$ASSWID= 0
##$AUNMP= <proc_1d>
##$AZFE= 0.1
##$AZFW= 0.1
##$BCFW= 0
##$BC_mod= 0
##$BYTORDP= 0
##$COROFFS= 0
##$CY= 12.5
##$DATMOD= 1
##$DC= 0
##$DFILT= <>
##$DTYPP= 0
##$F1P= 14.0000005364418
##$F2P= -0.99999901652339
##$FCOR= 0.5
##$FTSIZE= 32768
##$FT_mod= 6
##$GAMMA= 0
##$GB= 0
##$INTBC= 1
##$INTSCL= 1
##$ISEN= 128
##$LB= 0.3
##$LEV0= 0
##$LPBIN= 0
##$MAXI= 10000
##$MC2= 0
##$MEAN= 0
##$ME_mod= 0
##$MI= 0
##$NCOEF= 0
##$NC_proc= -5
##$NLEV= 6
##$NOISF1= 0
##$NOISF2= 0
##$NSP= 0
##$NTH_PI= 0
##$NZP= 0
##$OFFSET= 16.522
##$PC= 1
##$PHC0= -75.18421
##$PHC1= 1.867295
##$PH_mod= 1
##$PKNL= yes
##$PPARMOD= 0
##$PSCAL= 4
##$PSIGN= 0
##$REVERSE= no
##$SF= 250.13
##$SI= 32768
##$SIGF1= 0
##$SIGF2= 0
##$SINO= 400
##$SIOLD= 32768
##$SREGLST= <1H.CDCl3>
##$SSB= 0
##$STSI= 32768
##$STSR= 0
##$SW_p= 5175.98343685301
##$SYMM= 0
##$S_DEV= 0
##$TDeff= 65536
##$TDoff= 0
##$TI= <Analysis number 999999
Compound Code 99
Book Reference 9
Project Code 9>
##$TILT= no
##$TM1= 0
##$TM2= 0
##$TOPLEV= 0
##$USERP1= <user>
##$USERP2= <user>
##$USERP3= <user>
##$USERP4= <user>
##$USERP5= <user>
##$WDW= 1
##$XDIM= 32768
##$YMAX_p= 356065260
##$YMIN_p= -405401
$$ End of Bruker specific parameters
$$ ---------------------------------
##NTUPLES= NMR SPECTRUM
##VAR_NAME=  FREQUENCY,     SPECTRUM/REAL,   SPECTRUM/IMAG
##SYMBOL=    X,             R,               I
##VAR_TYPE=  INDEPENDENT,   DEPENDENT,       DEPENDENT
##VAR_FORM=  AFFN,          ASDF,            ASDF
##VAR_DIM=   32768,         32768,           32768
##UNITS=     HZ,            ARBITRARY UNITS, ARBITRARY UNITS
##FACTOR=    0.157963299565203, 1,           1
##FIRST=     4132.6476996994, 0,             0
##LAST=      -1043.33573715361, 0,           0
##MIN=       -1043.33573715361, -405401,     0
##MAX=       4132.6476996994, 356065260,     0
$$ Real data points
##PAGE= N=1
##DATA TABLE= (X++(R..R)), XYDATA
$$ [...]
28531 -32125 -28833 -33800 -94829 -154844 -135908 -46140 -46786 -32805 -121950 -44593 49491 18062
28519 18062 -53353 -81299 -22255 -47046 -73613 -68476 -103574 -45994 -69376 -135956 -140223 -82010
28507 -82010 44180 -16969 -68205 -27600 94795 -31570 -169359 -163028 -221100 -125431 -16242
28496 -16242 -120892 -186987 -87019 -96631 -115514 15323 98207 129518 90055 -27280 -41712
28485 -41712 -37591 -18829 38572 138446 -21389 1666 66909 56317 73393 25534 46975 55552
28473 55552 37975 -28276 -61555 -214 -26534 -61838 -41682 -70 -106228 -138107 21300
28462 21300 36227 -37300 -36850 86598 119682 98401 53498 73164 90011 170876 185873 67870
28450 67870 1831 41902 55262 13282 20745 52385 114526 130296 104113 74022 13186 -5920
28438 -5920 45454 29898 5559 -19512 -7491 62106 92385 101553 59701 32967 82056 55978
28426 55978 -17444 -162909 -217397 -151893 -95733 -50229 109301 227171 292752 292585 106850
28415 106850 60556 4012 -102028 -12450 130448 134545 177341 106088 77343 12061 -104447
28404 -104447 -88636 6302 -87403 -172180 -157305 -1251 60859 155237 101875 -82231 -156262
28393 -156262 -80040 -301 32344 -32256 -194435 -175815 -106749 -144334 -121876 -87490 72729
28382 72729 131673 131139 119637 117860 45506 39440 55203 -4887 -51374 -25032 -139828 -222064
28370 -222064 -200061 -131369 -83543 -99868 -120482 -237306 -189735 -6225 58755 44164 100898
28359 100898 145421 91106 54590 88186 96470 16211 -24270 -53878 20714 165686 302321
28348 302321 314403 253374 46452 45282 135050 261358 149140 -10174 -36180 4209 95425
28337 95425 105116 70256 -24841 -29147 -111277 -118070 -116826 -115709 -92701 -106574 -46727 -3843 7071
28324 7071 -104958 -134775 -113574 -139068 -78243 -70256 -53003 -19831 -14805 -89742 -18582 87742
28312 87742 116390 149083 124023 128397 79659 22939 -28730 -8126 13226 109180 142293 188312
28300 188312 214145 134505 138440 116636 94362 72584 36867 -24243 -64703 49766 108445
28289 108445 57526 -8594 -6146 32640 -630 -42719 1871 -27781 71950 40062 -8403 23889
28277 23889 14202 -25954 -113146 -161440 -158077 -220797 -170911 -132284 -116668 -89935 2681 49441
28265 49441 65290 68845 15017 91637 36939 102927 103862 119205 180719 100447 81437 23235
28253 23235 -116257 -120026 -56986 23327 57540 49543 -13659 -54742 -93054 -84142 -36225 -135383
28241 -135383 -157402 -87770 -54779 -57303 -13509 62210 7128 -109419 -111248 -1132 23229
28230 23229 -112773 -189361 -136041 -21374 -39586 -125611 -114643 -83140 -114999 -142596 -187232
28219 -187232 -132586 -125422 -76281 -58219 -131787 -123228 -134536 -118386 16353 54966 22005 -27483
28207 -27483 -12646 -80458 -85023 -47906 9767 105104 104137 -17285 -10011 9820 -39810 -36037
28195 -36037 -50821 -42663 -24823 -32074 37159 43797 32877 -150102 -218719 -63650 17131 -109291
28183 -109291 -114152 -139723 -268049 -296558 -207870 -76270 21142 -49283 -40633 -74262 -71235 -164916
28171 -164916 -265080 -164894 -97205 -55819 -102449 4255 89033 23351 108876 85957 50118
28160 50118 21047 35873 197797 206282 178225 157830 182893 147722 87525 31557 55041 71013
28148 71013 34158 -42318 -115957 -80481 14256 85836 101788 171717 229079 245912 69241
28137 69241 463 2477 -47579 -71652 -135123 -149487 -106825 12508 31053 -85413 -174762
28126 -174762 -160264 -107103 -90850 -1677 -52669 -88136 -33073 89556 2081 19856 79560
28115 79560 191958 160154 -72486 -97870 -12623 42061 142879 208405 118619 61705 59654
28104 59654 63516 53930 -52 -59970 -11244 113697 187366 53553 1231 123371 110220
28093 110220 9912 -17880 -55027 -109409 -87356 -7118 -82760 -158763 -106112 22043 83077
28082 83077 132556 138501 134488 36188 -79619 -20907 133723 146237 109028 116691 247326 236671
28070 236671 143096 -70137 -96947 -26377 24750 -27081 -93173 -122300 -3913 14177 33463
28059 33463 63087 75625 -91649 -71409 -22661 -3349 13371 77451 83179 29692 33139 72859
28047 72859 61079 102084 124781 84193 -30990 -71907 -91421 -73126 12061 -583 90062
28036 90062 136534 33340 36671 73312 7175 -102308 25101 51700 54452 66933 47807
28025 47807 119626 222738 183048 -26243 38352 120380 64100 -95714 -140781 -120726 -137808
28014 -137808 -188760 -137337 -159697 -80239 -161446 -239174 -347679 -218643 -56807 -34030 47586
28003 47586 118982 297106 284765 112510 -17285 -169209 -84680 -60481 -14195 110199 197115
27992 197115 324662 290029 179526 193110 110163 106164 106794 129422 93964 186573 171336 141024
27980 141024 277204 344887 133312 45859 -42917 -62865 46246 96901 17522 -25884 -6012
27969 -6012 44789 99782 181428 191073 202154 230520 246038 224321 220135 254808 239380 156578
27957 156578 32255 56535 5480 -200507 -162231 -65708 16028 51471 98151 17741 -59551
27946 -59551 -12891 158884 240892 240743 202094 107141 101378 92534 25715 -20555 -1376 50723
27934 50723 14489 -94868 -11893 29084 12873 -103869 -90835 -124558 -186346 -194341 -111995
27923 -111995 78574 151749 72879 76868 62128 -131480 -100407 -38630 -41041 -35101 4556 41989
27911 41989 84903 11986 -15630 -59849 -25634 105844 58228 41172 -10362 -20067 -65417 -133462
27899 -133462 -179005 -93925 -72509 14078 43405 29422 71386 61859 35780 115076 112734 -45915
27887 -45915 -165694 -95266 -69967 -87934 -9068 -93708 -197590 -267854 -229149 -89937 27614
27876 27614 42825 46262 30945 91292 12892 2490 -53920 -37254 -37769 768 54072 53839 10566
27863 10566 -53524 -29251 -139635 -158495 -136730 -18150 -14986 5114 38056 209994 291609
27852 291609 198753 132981 -40753 -151494 -79259 29381 21037 103800 136338 157534 94286
27841 94286 13142 26573 166708 289652 201497 207681 281327 334781 337241 287749 155047
27830 155047 -18212 -72909 -32221 -50824 -68944 96360 90752 32448 14854 60990 65800
27819 65800 143500 194086 126567 16201 134571 156871 159407 102919 94908 124481 69322 62954
27807 62954 92691 37729 38589 -101666 -228130 -277263 -215731 -133098 -135881 -139392 -160930 -152521
27795 -152521 -174284 -230186 -229432 -95362 -162913 -81798 -74732 -105575 -89894 -147265 -221591 -247359
27783 -247359 -232212 -77324 -47751 -70216 -109218 -171598 -165945 -72927 41730 -31399 -96977
27772 -96977 9175 -9581 23372 -250 -113457 -137095 -133176 -231240 -195984 -151378 -2964
27761 -2964 39558 33876 -36870 -28416 161827 104937 83751 77038 1504 92799 191678 164740
27749 164740 12131 -56891 -70813 12309 44203 -4522 41692 128411 106435 -73671 -27291
27738 -27291 -68262 -34527 -27188 -64922 8412 -1219 -4833 -68064 -91594 -64135 52107 -37728
27726 -37728 -55299 59297 89123 25869 -23465 -3188 -64136 -26850 48818 -40855 -66708
27715 -66708 77255 142188 80566 173147 223111 288110 231322 -12057 -145579 -101351 -39104
27704 -39104 55020 80262 41475 -65481 7547 86960 68204 49738 -31420 6815 -68877
27693 -68877 -186933 -149911 -62671 -99605 -166884 -104158 82334 148121 170425 37934 -43838
27682 -43838 -65806 -49438 -6470 133349 107950 32429 -8994 -57662 57600 83003 17417
27671 17417 -97990 -41300 -86529 247 -22929 -95206 -131010 -29371 64278 103736 87667
27660 87667 102340 222590 204337 84854 94740 169442 235261 207017 267506 284488 252745
27649 252745 261141 320588 323775 235847 190780 185638 87687 72591 4718 -161314 -223730 -98233
27637 -98233 -119243 -211147 -210692 -177034 -107421 -109631 -85030 -36167 -30243 29106 33958 2374 58202
27624 58202 53764 57240 -55945 -85405 -69104 -24299 -82713 -190106 -143962 -57294 -56910 -88052
27612 -88052 -88696 -10431 -41956 -83108 -2265 94832 21324 33905 -49395 -102157 -70618 -146385
27600 -146385 -5823 -10998 26249 12479 101062 84198 13286 37268 54128 40052 73646
27589 73646 122953 85464 175234 206578 86985 74211 54257 -6653 55500 84116 66422
27578 66422 75331 191325 159515 -47373 -58316 -83670 -92501 -86863 -114303 -160659 -212848 -194359
27566 -194359 -196551 -99371 -64970 -85106 -103949 -50625 -25315 -17075 117195 198886 211443 170375
27554 170375 228498 266463 316299 155778 -96217 -133901 -42584 -4792 -7572 76014 70878
27543 70878 72849 103255 128444 103574 102783 84918 94867 152615 77670 -84489 -127552 -107567
27531 -107567 -150076 -187801 -202002 -130008 -200480 -154010 -185250 -54223 -89195 -82355 -146240
27520 -146240 -235898 -166066 -39542 60265 -2283 -48594 -120529 -159611 -68186 20418 -29729
27509 -29729 -2924 87313 45771 84537 160992 175326 223124 191823 71351 52736 36407
27498 36407 -9300 41528 55579 34959 103885 32966 37351 20816 53276 35442 -31569 -103212
27486 -103212 -78405 37890 70143 8824 1457 -54252 69580 32279 95382 192592 297533
27475 297533 164158 121712 193880 134760 -103860 -247942 -160306 -85483 -128500 -120952 -81499
27464 -81499 -72457 22020 101524 5786 -59906 -62562 55788 118781 120597 79048 166987 231086
27452 231086 156257 30314 -82042 -52670 -9922 41266 35480 109359 40635 634 12008
27441 12008 74424 -6054 -148208 -107280 -132099 -50620 83893 135892 56441 29879 -15605
27430 -15605 -51276 -26442 3041 9001 -109001 -129081 -154584 -176831 -128730 -59284 -35531 -94571
27418 -94571 -184266 -139964 -104245 -28588 95095 93556 22605 9996 101950 61139 72534 30547
27406 30547 -53176 -37556 -94106 -30334 -9918 -42759 -125439 -74223 -20776 77199 68348 95865
27394 95865 129698 85519 100968 105843 30666 -16078 2581 21086 90959 57140 -59734 -172249
27382 -172249 -226698 -103343 -2839 -42742 -52828 -9443 55727 49658 51815 126973 177058
27371 177058 286071 161810 55871 96917 84787 175268 208511 129777 122988 173800 83998
27360 83998 -67348 -59643 18000 66747 76972 15664 76770 118866 59616 103924 134134 114503
27348 114503 3261 -14142 88290 105361 5642 44786 67401 53620 25795 93683 55934
27337 55934 37994 -14369 -184036 -103212 -21405 -11705 134556 67247 -10356 -68303 -103673
27326 -103673 -151292 -146467 -119735 -143297 -69735 81677 138145 134716 167321 126318 133367 128292
27314 128292 175758 118357 67566 22114 -11443 5425 -54416 -67960 22210 57221 135716
27303 135716 110857 40958 -116111 -141663 -158512 -151465 -56626 65545 46874 24338 512
27292 512 6024 51712 89822 134408 93738 42400 14151 102936 47374 82169 141166 62011
27280 62011 39710 101160 167660 177035 152936 -744 -31515 -42504 -159493 -222804 -200698
27269 -200698 -97596 11623 -18429 -32178 -9103 -86196 -55256 -16182 -91499 -110848 -87348
27258 -87348 5527 26198 10939 25512 65523 60653 153294 110041 50147 -15651 -44814 -21351
27246 -21351 -115462 -225230 -136327 2672 84723 234392 234433 175266 106367 43003 -8025 -78205
27234 -78205 -15786 199427 289053 225019 137878 101865 70374 166557 106405 100080 116868 133358
27222 133358 -45373 -117143 20714 46031 90294 186972 151988 160851 214233 204045 165928
27211 165928 46806 -20796 -59817 -123775 -97355 -5464 94185 -20603 76166 183171 131844
27200 131844 87224 33425 40793 86478 46601 19564 7587 18546 122937 139654 92332
27189 92332 -30307 -67470 -76386 -35340 -82477 -59352 -804 -59391 -47253 33965 70616 141677
27177 141677 187143 256732 225040 251951 113405 18378 32926 7294 39143 135877 113543
27166 113543 82694 125059 94273 110414 91906 98196 162703 198347 117645 148773 177195 60888
27154 60888 182053 176133 222004 212417 70012 4319 18352 -15878 -6119 -19039 112198 167629
27142 167629 116935 32123 8563 103012 131962 -29601 -67419 -85713 -125301 -104495 48442
27131 48442 51455 10558 -78111 -129101 -44840 45008 113518 112130 92614 -32026 -83585 52160
27119 52160 87140 135447 172926 202020 205103 142773 131521 136536 92300 55862 -25311 -60112
27107 -60112 -79180 2054 18158 -101029 -158766 -57631 73181 201865 253719 159459 168439
27096 168439 153689 -15405 -59512 -114331 -99309 -135562 -143749 -32388 -32491 -61686 -44318 -14542
27084 -14542 -9729 -16631 32121 71753 51633 -35964 -58712 -48154 7047 15927 24447 8969
27072 8969 -139254 -184335 -167719 -154884 -155014 -110061 -26615 108740 108129 133517 104627 50601
27060 50601 -10823 -5375 -20620 46166 91162 95197 90376 157356 137054 182988 214865 289502
27048 289502 236865 185443 114420 47015 26508 -9121 -105690 -146572 -60254 -5432 -79206
27037 -79206 -197920 -215859 -163299 -60362 -118818 -159914 -150535 -128409 -86957 -104511 -122822
27026 -122822 -99857 -31789 100160 108806 55860 67416 26501 7897 -47212 76897 118215
27015 118215 4552 -76348 -68592 -21192 80342 83313 119774 131450 121014 111072 82339 100798
27003 100798 134951 64682 24452 -61397 -732 22046 99840 154783 108827 102346 109246 74230
26991 74230 55975 7794 75906 86369 58854 21175 79211 39704 83633 163209 255093 259671
26979 259671 131365 -33908 33820 116144 72542 -25486 -143341 -94906 -11408 16537 44241
26968 44241 43666 57947 64320 11419 10140 -50011 542 -59257 -155389 5412 39836 -58911
26956 -58911 -112698 -101054 -28664 53334 20896 63064 68043 74116 80217 -8177 -22687 -18950
26944 -18950 18417 131484 66750 81552 178276 117558 16067 -23388 17323 45564 129024
26933 129024 153649 46042 -7006 -26947 -57880 -49981 -35596 -33884 -57626 -53140 -131427 -11127
26921 -11127 165019 207566 194153 123732 42612 -7976 12811 -39444 -32652 -47845 25678 58223
26909 58223 92543 -14634 -217690 -245050 -113962 -30380 54184 105209 107752 23860 -10950
26898 -10950 2780 -74434 -16544 86667 75462 -59082 -52730 5448 56971 80191 134843
26887 134843 40660 -124737 -95412 2616 50018 31032 32587 105978 127333 100989 82006
26876 82006 79934 -3346 -83987 -31747 46008 49794 -16541 -129184 -185411 -168025 -88582 -95449
26864 -95449 75551 128584 200732 68012 -127569 -55338 33662 23983 27932 -6999 -27479
26853 -27479 -10849 -28900 -73345 -156667 -231903 -226028 -155628 -132464 -71566 -95775 -11429 5173
26841 5173 -59273 -116479 -117260 -74209 -78737 -35266 39795 95818 39350 -15133 -108008 -76092
26829 -76092 -78380 -67290 -55418 -1969 186446 210866 178465 180612 152564 43933 79549 180676
26817 180676 75743 -27994 116520 100275 68805 124830 100804 102657 120690 68350 8815
26806 8815 -37874 45479 16910 49491 78376 -31351 -136313 -114117 -58608 -40549 45746
26795 45746 16330 -18479 -159469 -173834 20931 168873 20171 -88457 -24537 -74283 -68143
26784 -68143 27976 1026 -70830 -38718 139720 188098 111800 73799 21362 60436 58122 -63303
26772 -63303 -184100 -89771 36370 -52292 -70059 -38187 -2019 -107668 -206817 -205753 -111800
26761 -111800 -17937 53464 80434 54963 35527 78272 33390 166585 288988 227475 158724
26750 158724 163137 130355 126829 -38366 -162573 -250115 -200713 -58139 3136 81852 144626
26739 144626 21725 -42382 -1894 -5484 5052 51582 -25646 -61839 -18476 -91721 49522
26728 49522 126660 50480 -19951 -59455 -59375 -100979 -32573 45543 43255 -95306 -99817 -77299
26716 -77299 58974 137287 10819 -14625 -404 -21888 12070 45401 28923 80459 88718
26705 88718 90005 79152 43034 68961 114891 89201 28693 -61504 -39834 -64686 -95419 -112507
26693 -112507 -120809 -17110 26907 102051 103978 -35087 32160 55085 98772 110004 54558
26682 54558 -23139 -131323 -102328 -101196 -81446 -110520 -103176 -70002 -29456 -159698 -47856
26671 -47856 -117636 -51239 13670 58779 163849 270989 146498 12984 -117767 -133530 -37179
26660 -37179 84089 108552 151590 61782 66226 -11063 -99804 21534 149809 110593 130579
26649 130579 153944 109137 71204 -9559 -28552 -135493 -162169 -121570 -141810 -42820 101329
26638 101329 1523 -20132 -92870 -65568 49440 -17275 -33532 58620 -72861 -267999 -156880
26627 -156880 -32263 -13804 -30250 -79114 -127591 -48060 -100950 -146544 -23417 46089 49142
26616 49142 18726 40037 -4911 -123981 -171545 -49881 22293 4822 63836 51329 29215
26605 29215 13327 -8517 11232 81644 16543 -57532 -23586 35777 -25395 -77040 -54250 -159214
26593 -159214 -237797 -222668 -189161 -6677 47740 85924 68107 77718 61319 68358 51602 33322
26581 33322 109149 229690 169943 14036 -57320 -87529 -86957 -137179 -111280 31441 87878
26570 87878 29276 -44074 -35623 21143 -152347 -219204 -65938 -35249 -63050 61357 62493
26559 62493 -525 -67421 15880 105910 92195 -87898 -273666 -254903 -150033 -115913 -93303
26548 -93303 -108031 -98773 -118600 -17100 27563 -59141 -1874 -15388 -1964 -1506 -65244 -9192
26536 -9192 31174 -127154 -162089 -185610 -241550 -155342 -46172 -37900 -51847 -57972 -151335 -70938
26524 -70938 95605 81031 -11442 -23750 10100 137342 139999 113235 83133 9047 2270 43423
26512 43423 -100610 -141535 -122473 -98086 -37014 51550 132092 127461 177386 98983 13316 42616
26500 42616 67782 177525 115169 1535 -72621 -70953 137 -40038 23447 -82753 -236183
26489 -236183 -194516 -191366 -119494 -90440 -118926 -163187 -172156 -134194 -162149 -124182 -148155 -67033
26477 -67033 51622 64131 84939 95153 82140 212321 302084 267329 241443 196534 298180
26466 298180 242103 122869 114364 32335 64048 68750 37466 16295 53508 -30527 -150790
26455 -150790 -175896 -187902 -214524 -224039 -113014 -125117 -203149 -115040 -18236 34809 44403 19083
26443 19083 118709 47756 -6432 -54297 -71592 -36985 9182 -15509 -48198 -2198 87417 34506
26431 34506 85320 128771 -10043 2198 52810 62744 62483 -33482 -45913 49844 71763 106558
26419 106558 60657 -81390 -24088 10301 -75957 -63533 54945 92339 -24737 -112993 -96496
26408 -96496 -34428 -34079 8142 47808 154560 127958 -21982 -135471 -124040 -84093 -42727
26397 -42727 -69615 35638 45994 66412 16605 3420 -90168 -71092 -85667 -17511 -44273
26386 -44273 -62352 -22884 -108686 -134566 -95894 -18344 22497 53309 153433 87503 33943
26375 33943 8954 10396 -71502 9942 40682 67077 167286 213050 208950 107451 30947 7502
26363 7502 -41159 -108752 -170917 -209032 -381125 -348456 -101331 15869 109940 5023 -50658
26352 -50658 -191856 -206486 -110650 -50448 -28541 45788 49350 43324 20432 -26663 -58407 42643
26340 42643 138397 138032 25886 114968 178411 146722 158093 75942 -30180 -96057 -62365 -84773
26328 -84773 35928 121944 29297 3274 28552 5148 -37750 -30874 -108097 -189770 -156953 44553
26316 44553 110441 28734 -9920 10084 -16982 46056 47037 -49215 -148543 -282850 -254099 -106451
26304 -106451 -26707 -45761 18539 -48266 65750 58400 50949 -56076 -52374 -49919 -81352 -58722
26292 -58722 -59401 -46493 -44411 -45795 -13609 -58711 -110290 -72452 -137283 -71568 -100960 -118083
26280 -118083 -113616 -72963 17270 8208 -29570 39359 196296 233794 150858 112367 151553 117927
26268 117927 95311 11811 -56135 -47193 -115853 -125168 31971 111904 141822 28340 -62851
26257 -62851 -101949 -86788 -9929 74942 105852 182978 82920 -18051 24773 139709 173210
26246 173210 129177 88355 42276 17695 57901 96486 47248 -34204 76307 156558 119390
26235 119390 68004 12641 19401 87492 10411 -32545 43033 126591 182412 186034 207664 318844
26223 318844 333247 229566 78289 127316 170342 235829 214602 131677 136152 107403 128477
26212 128477 34650 -74246 -143204 -22074 158836 94719 98837 193043 239784 100650 -13118
26201 -13118 -15395 24991 114742 91766 93681 240341 213957 73961 70421 21382 46542 81906
26189 81906 107452 59583 -35902 -106881 -21951 -3292 10026 -36009 -36628 78158 -14321 -32651
26177 -32651 -14691 -37714 -90294 -137616 -135088 -110209 -84662 -62509 -30943 -41545 27107 6902
26165 6902 -14414 -112919 -154612 -83425 38814 57351 82470 61865 96852 86480 -76742
26154 -76742 -209599 -191664 -106201 -25110 -12886 -91027 -40144 44106 43942 218632 202774 89622
26142 89622 139364 194584 253837 188596 175596 271757 172052 130178 73778 128801 210906 151113
26130 151113 -17076 -68716 26342 32671 -114453 -75720 -13572 2234 -55157 -37186 72344
26119 72344 -8805 31635 -42592 -197192 -211064 -180046 -190317 -188690 -103441 -57766 -104647 -65623
26107 -65623 10583 -419 -40352 77229 86844 75081 39702 56633 5514 -20940 -83137 -17834
26095 -17834 33679 26893 -39075 -1579 13759 32718 12233 -66900 -258975 -225658 -137309 -23012
26083 -23012 38281 -40629 -51020 -30237 49188 55651 16017 -5424 36356 18027 16604 54969
26071 54969 -1156 21209 102571 120839 68839 -55203 -129083 -86738 -92194 -194172 -208722
26060 -208722 -82784 -76386 -104017 -23615 -209517 -345420 -287410 -91916 -47891 -75807 -89424
26049 -89424 -22378 150775 276232 267324 166573 -14812 -123974 -24507 102211 241988
26039 241988 235191 149949 111316 70799 179533 11930 -166376 -167170 -130864 -35402 33186
26028 33186 -44207 -284 31769 40160 35305 42391 -18522 -129790 -206671 -137594 -28398 58540
26016 58540 59912 132440 207903 190955 62130 82174 -83754 -144864 -75946 -35091 -198830
26005 -198830 -366143 -283318 -103321 -62462 -58837 -61315 -63025 72827 227232 176846 93648
25994 93648 114376 200227 133714 110809 120517 11336 -48453 3639 49151 97987 147777 145809
25982 145809 70535 90875 163918 85689 80981 75468 21131 -118257 -180814 -145890 -33037
25971 -33037 135441 178004 92496 83035 41494 73506 -9745 -122489 -85572 -6840 -7218 -94424
25959 -94424 -62382 -7937 18299 12500 40429 93991 175351 225587 149016 28322 -47727 -115624
25947 -115624 -93699 -21804 -42192 -47414 -5373 50995 -10446 -40290 -18094 65996 48152 -41717
25935 -41717 -155787 -40059 -6532 3830 73976 -64054 -90639 -46030 46120 45884 -33884
25924 -33884 -98194 -31739 -95606 -86127 45679 207352 105522 24169 -47876 -85724 -50806
25913 -50806 -18907 38429 -55317 -83654 -64813 -114766 -34960 14875 24230 76319 23440 -119403
25901 -119403 -131353 -45861 42529 18041 -115847 -140514 -109852 -163834 -52824 7837 29215
25890 29215 80500 191165 73215 39020 58177 37150 -967 -9174 10662 -28494 -94868
25879 -94868 -222822 -225376 -85422 4237 33019 63970 20404 132436 160013 71436 -40492
25868 -40492 -32109 -1261 135131 133343 -23689 24396 80335 62619 28309 -130439 -182390
25857 -182390 -105373 -182037 -182401 -76992 -61206 -80412 -191010 -149046 -84651 -109546 -55810
25846 -55810 11514 -55068 -102868 -106025 -24642 -20611 -78091 -86578 -135461 -147033 -170863 -256838
25834 -256838 -220685 -74258 -101422 -76304 70820 -19384 -52766 30260 -17974 -3185 54561
25823 54561 193194 230353 77576 -10008 -54427 -64710 -21680 -3093 -84422 -115798 -162934
25812 -162934 -75119 -46418 -56310 79986 -72167 -180258 -119860 -142104 -177171 -139080 10926
25801 10926 -23188 -97172 -30686 -26351 -244207 -232962 -56728 -37433 -36438 -18587 6179 45185
25789 45185 -43556 -140455 -10320 24147 8103 -50586 -8687 548 -16203 14825 82827 150575
25777 150575 111867 -4174 -48336 27514 -43223 -90382 -24051 101818 125082 88968 -7801
25766 -7801 19172 36501 32478 -73029 -86527 -87223 -15999 59799 135310 40799 16909 -10199
25754 -10199 -30290 -85208 -165914 -108388 47432 22415 -55915 -44638 -51733 -125505 -171850 -142292
25742 -142292 -16780 -12710 -74201 -69084 4873 100122 148460 181711 162973 72565 34726 50244
25730 50244 54103 -68943 -137830 -134684 -166058 -107449 29006 12767 -6241 81943 167761 113217
25718 113217 75893 84511 9503 -159095 -181276 -43794 -29751 22739 45682 33399 10265
25707 10265 -35844 -25454 -35590 -4755 28488 138245 57038 29157 34306 -145174 -87005
25696 -87005 -12234 -33725 47116 -32639 -133382 -57819 23834 12254 34066 -58431 2285
25685 2285 3659 22851 62084 74316 108513 22462 -131126 -162800 -191189 -260238 -247534 -192414
25673 -192414 -12705 155854 99535 -77610 -156343 -95883 -8044 -4856 35817 -106503 -156734
25662 -156734 -89144 -35470 -68638 26129 60669 -48263 -76508 28087 2158 -245 62604
25651 62604 133727 125606 -1564 -51345 -73479 86298 90285 41732 115222 98072 114490 273695
25639 273695 256794 194916 126307 19255 97053 42424 97111 212343 61070 -105680 -9851
25628 -9851 146257 -15893 31914 21642 -142249 -209215 -131814 -57231 18853 100696 97253
25617 97253 146882 127317 -19932 -63856 -58715 21251 68042 62638 36899 -12992 -24837 -33883
25605 -33883 29791 151388 248688 338428 307775 213438 65874 45144 10131 -209624 -281379
25594 -281379 -266999 -138648 -94901 -76215 -78899 -62546 34781 112722 91185 62303 180179
25583 180179 213581 201022 117424 -44771 -114834 -57608 -44319 -117878 -134675 -204591 -248563
25572 -248563 -291847 -236787 -85935 39335 62129 128752 160147 155364 46773 75210 140897
25561 140897 24654 -13523 -12862 -22298 -53203 -117311 -78971 -78282 -43909 -6055 40780 109990
25549 109990 149445 76955 -47823 -138343 -140369 -73568 -148893 -147492 -89720 -77172 -94394 -128780
25537 -128780 -107953 -185350 -219304 -175277 -55888 7326 -38189 -16720 37617 48734 2210
25526 2210 17263 29319 -4625 -50904 -85899 -52068 20971 13237 38146 -11710 -128727 -162901
25514 -162901 -118671 -19715 14876 -47409 -120430 -138848 -66769 -49142 28976 14758 -64928
25503 -64928 -61677 -92215 -180531 -160047 -145271 -144978 -88980 -25751 -4377 25263 40379 127813
25491 127813 35416 -123019 -147628 -162398 -84919 -66689 -973 79375 70456 -57113 37777
25480 37777 116653 16783 -56495 -115184 -8367 50858 18515 24704 33929 77296 6793 -128654
25468 -128654 -316380 -284477 -142565 5051 72558 120552 128634 147546 141546 48046 -79665
25457 -79665 -37421 82881 167252 99988 -83801 -91971 -87333 -67075 14264 -46454 -69092 -135143
25445 -135143 -96295 39587 -5278 -6136 -61200 -160880 -140043 -74784 -66470 -94637 -111283 -74631
25433 -74631 28134 165816 85954 -109886 -90029 45713 131010 112502 64404 31379 44433
25422 44433 79420 10903 124659 63241 58938 77438 55676 56143 88160 83287 90308 132229
25410 132229 199082 131669 48010 -28797 -134313 -92982 -3447 -13791 -76771 -98499 -96808
25399 -96808 -213789 -285316 -267167 -132057 -92899 -77982 -16859 12932 -74025 -138736 -83125
25388 -83125 2763 117781 60802 -5741 30378 174939 252234 122374 117059 173696 104801
25377 104801 6152 -90490 37311 166491 152785 -62546 -136365 -138063 -159146 -93137 -73188
25366 -73188 -43185 -111396 -115683 -160119 -80786 -97945 -19857 72675 196363 278895 279196 126745
25354 126745 -74348 -132899 -68381 62894 -66078 -133496 -54556 -82513 -129893 -136808 -149485
25343 -149485 -267407 -298934 -129696 -130821 -34336 86 -8984 -77410 -44610 -21731 135616
25332 135616 214527 245079 162095 92434 108934 69027 -50876 -3403 20800 -68359 -6429
25321 -6429 73676 67282 -7657 -43647 55800 41209 -18837 -73385 -7458 -56290 -136805 -154244
25309 -154244 -104562 -135058 -173809 -230667 -189836 -127207 -13344 -11712 11605 126572 173344
25298 173344 176649 142170 46113 -23342 -149587 -37647 50263 81913 65771 121448 -4103
25287 -4103 32374 -65098 -128878 -71639 -37096 -53763 -157755 -135274 -58181 79842 70853 -29355
25275 -29355 -159021 -154637 54564 72750 77157 18826 -70097 -53573 -50212 -61640 -34918 107031
25263 107031 239982 240053 228523 195022 71244 -88638 -187885 -120894 -70562 -33832 156321
25252 156321 219693 157353 123101 191560 266671 201190 209274 117879 123472 179813 141870 135324
25240 135324 108715 -4306 -61607 4361 32081 52264 136767 158695 52592 -2605 -3096
25229 -3096 -13739 -70413 -228755 -267004 -96333 8513 30862 -35181 -130596 -117267 -172859
25218 -172859 -134168 24971 32841 -117768 -106361 -64276 -69003 -114335 -159086 -82378 943
25207 943 71474 138584 75257 20509 34219 45563 116387 131248 181942 225270 179300 70034
25195 70034 72280 -24536 -180224 -124646 -97518 -183146 -92021 -10138 -28185 10247 -49201 -41938
25183 -41938 -10151 -34724 -28872 64173 103540 105406 64218 56700 14756 -50146 -64963 -35796
25171 -35796 -83573 -117449 -236575 -144575 8048 -48980 -45912 22198 -31131 -23030 34649 79172
25159 79172 157231 195013 139680 86700 53649 -22185 54686 108463 101588 57396 -59577 -121385
25147 -121385 94948 132142 94459 -9279 -141037 -165077 -172688 -87220 -38466 97314 137731
25136 137731 117204 -30328 -124127 -69728 -18720 65296 116948 90422 47932 161422 233967
25125 233967 152048 42101 156405 145247 113371 84802 21869 56663 107346 75946 91935
25114 91935 76350 24255 -6850 -131752 -79003 88284 70795 171693 181161 74790 19257
25103 19257 11184 -33462 -3321 -37168 -120625 -144100 14053 88588 44431 -9159 46736 85387
25091 85387 163591 211675 138309 -15443 -99358 -176540 -81893 -10225 -58329 -28767 -116590
25080 -116590 -158178 -79505 110481 147452 66972 13429 39635 6085 40591 38116 49195
25069 49195 217525 201545 69115 -17819 -47831 -22577 22777 82221 23670 4424 -75096
25058 -75096 -38943 -35041 -24578 101222 95570 -28431 -125997 -172339 -135583 -115259 -84304 -47803
25046 -47803 24160 40874 -16639 25007 79076 84384 146463 138351 55621 -31304 40754 67089
25034 67089 67708 -30249 -206169 -140815 91650 162191 105930 108955 96976 29353 -8801 -68407
25022 -68407 -99625 -196777 -288705 -49102 112237 -28297 -87679 -3213 5677 -31839 -57728
25011 -57728 -148304 -170421 -74377 -9300 -13621 14020 -88983 -105465 -36187 -30225 20947 -4688
24999 -4688 61172 153430 169283 76715 10875 12704 77826 134258 76625 49032 -93884 -176459
24987 -176459 -49215 -24530 -21173 26197 118028 75436 62107 89188 101988 -28352 -46114
24976 -46114 -50831 25871 151483 43513 59058 34377 84817 33675 -59596 -101385 -163672
24965 -163672 -208651 -78577 54012 -24715 -84695 44534 154994 58061 1426 21510 102656
24954 102656 213241 40790 -120598 -176529 -107918 -75225 -91936 -171526 -209698 -139524 -177148
24943 -177148 -232099 -104155 45590 175168 255645 198422 236822 238953 153936 154641 153543 15011
24931 15011 -89688 -162662 -76866 -27467 -43292 32543 45853 6103 -36880 34519 145904
24920 145904 342525 386815 240117 154942 104851 161242 86741 34826 -92150 -16508 135763
24909 135763 133155 72488 14052 24809 133403 108005 13936 -112591 -123027 -115853 -80159
24898 -80159 62253 74065 44203 166097 250466 230448 202105 28207 -48319 -16270 -32664
24887 -32664 -26613 1416 110773 114810 21537 2234 -22324 97854 129291 179569 174198 220763
24875 220763 252009 226378 197958 169229 130659 88365 31083 28445 42091 64969 68122 18104
24863 18104 62523 121401 128223 90206 73120 47009 100703 68967 57497 41942 55682 64
24851 64 -13062 -22452 17114 -21792 24539 36030 -52690 -195651 -197623 -205883 -119042 -87443 -150204
24838 -150204 -170485 -58327 -4028 -87585 -148729 -180047 -204641 -123377 -51921 -77693 34189
24827 34189 41493 34 -135816 -177143 -236963 -200483 -97975 -38309 -60708 -79416 3843
24816 3843 112045 -7088 -39586 -27844 32813 98282 72876 59334 -33286 -76418 30550
24805 30550 46106 48987 307 -579 -68195 -67288 -22357 49650 27002 47112 59676 98052 173884
24792 173884 164109 110656 -74824 -219425 -321028 -320975 -196234 -154444 -116284 -50320 -96799
24781 -96799 -162923 -248123 -173302 -22016 11498 49139 40756 -64064 -65998 -12805 -48706 -182715
24769 -182715 -167176 36390 25453 27462 -32134 -133336 -160433 -100797 -163674 -198340 -197513 -196168
24757 -196168 -93984 -59522 13260 106068 130767 15607 -76867 -100860 -41178 41645 58532
24746 58532 -74479 -94536 67456 142314 62383 77986 94920 193903 128309 -32382 -19834
24735 -19834 -23737 -117298 -71851 -72512 -32738 68069 -29447 18628 154612 113339 79043 40992
24723 40992 -52935 -110098 -94557 21927 110320 170509 127443 106778 -33752 -13513 23413
24712 23413 5698 -7439 103915 194258 199855 138322 120070 -52184 -132761 -11914 11751
24701 11751 10571 -56764 -90544 -168223 -217448 -128910 -145835 -170239 -233899 -215271 -41887 -13218
24689 -13218 -62852 -113071 -100231 -76393 -15307 64234 92162 -64305 -67829 -12283 -48804 -25972
24677 -25972 -37003 66533 76644 54732 95997 123734 209716 -35823 -145894 33185 50688
24666 50688 21180 -692 -61789 -170782 -156232 -107713 -64542 4638 93843 31623 -30979
24655 -30979 -113805 -159433 -100243 -35791 -32692 -54886 32335 56814 63710 94520 33228 -38505
24643 -38505 24539 -11948 -20335 53142 134806 158715 108286 -13427 -20740 63029 145532 199864
24631 199864 219033 93962 -8698 7837 -49728 -80674 -88549 -16185 14638 -9312 -124714
24620 -124714 -28719 82635 45225 -15860 -108140 -39481 -27216 69795 189533 273431 312156
24609 312156 174189 124063 136462 113807 174739 311808 131446 -25993 -65753 86709
24599 86709 155459 14943 -88013 -176833 -176092 -287676 -268918 -148579 -166257 -158286 -127041
24588 -127041 788 52245 -72429 -127518 -96142 -86727 -60528 62489 72071 18827 33510
24577 33510 -11797 -61898 -28617 88514 3179 30215 -12252 -43232 -14334 -73220 -29791
24566 -29791 48003 103625 36608 -24491 -83488 -172941 -285603 -265613 -89144 -101567 -72764
24555 -72764 -16396 14509 -9357 -42670 -55323 -132954 -190363 -304666 -359413 -258838 -227880
24544 -227880 -102338 -32445 -19938 -28381 -139711 -130153 -67881 -103580 -81397 7025 -39171
24533 -39171 -6031 -116574 -201861 -77333 88158 134507 48154 51455 49603 14131 -76294
24522 -76294 -9661 49343 137576 86735 -14274 -5092 64541 183918 303072 227060 46088
24511 46088 4622 -35958 88556 186555 239516 208912 125815 44630 27134 70472 169803
24500 169803 177900 38076 -22671 -25055 -64033 -51075 -39854 -15151 -22328 -110256 -135524 -6829
24488 -6829 54922 17691 -55445 -156588 -164462 -144680 -153239 -133318 -65556 -60576 -31296 -7960
24476 -7960 -38010 -68470 -114443 -277102 -309412 -221282 -287458 -210117 -134432 -114582 -101715 -185037
24464 -185037 -187420 -137856 -168194 -260266 -229823 -216888 -330488 -207002 -128320 -64291 -27809
24453 -27809 30262 185587 143630 135039 209225 69360 -149538 -101404 -6304 74531 71200
24442 71200 6105 25636 80401 -12917 -73153 -40400 60712 107232 56815 -77190 -123940
24431 -123940 -94653 -5349 16410 -64593 66484 118266 42023 118389 219762 190503 73204
24420 73204 34344 103512 26558 -49817 -74923 -84026 -25796 18336 99846 157001 116302 57359
24408 57359 -20488 -73366 112281 105268 80028 53081 -6371 -42624 -7723 -28594 42387 136391
24396 136391 238628 207040 112754 71981 -33494 -20814 -21066 -132540 -167675 -205536 -143761
24385 -143761 -145041 -249248 -110656 22755 -16504 -122221 -224255 -254632 -292788 -226409 -61324
24374 -61324 -40555 -48785 -61847 -2561 20058 12623 -70634 -123170 -29868 -152846 -30440 5144
24362 5144 -25097 -66542 -59354 -2416 25509 -2245 -13404 51210 12105 10079 76071 37003
24350 37003 -23794 28984 15272 -42600 44737 7538 28997 29961 36341 36037 -72829 -65604 -9910
24337 -9910 56446 139089 95182 93736 46006 -39016 -15203 -15963 -11545 -104194 -95744 -27383 -32645
24324 -32645 -88662 -172372 -115542 -51811 -52007 826 68639 31248 -34654 -12206 -15056 -88591
24312 -88591 -21473 146094 12630 -111659 -160805 -73783 -27784 -100507 -195856 -236850 -116451
24301 -116451 -58071 30738 52967 71430 121890 109542 -57183 -94116 -133710 -126191 -41406
24290 -41406 62843 89432 77129 143980 139827 28444 -32592 -87900 -15924 -65173 -98371
24279 -98371 -5202 -78719 -114571 -102213 -101798 -33136 11251 21848 -24209 -15338 -4846 68457
24267 68457 20280 -46922 -215181 -282504 -209890 -126684 -12207 96935 68139 -53190 -165843
24256 -165843 11525 123416 86053 -45606 109 61839 -44036 -87603 -130281 -78360 21673
24245 21673 23643 -16817 -91347 -52168 -92657 -65641 -80322 -130900 -125562 -33276 115928 78478
24233 78478 40752 -8023 -127732 -126349 -63940 -140636 -168008 -116314 -16855 32750 92120 50150
24221 50150 -39758 -87813 -101032 -43356 -130074 -9085 135543 168678 140302 90843 35042
24210 35042 -15752 -43820 -3340 25024 71698 78328 115316 -24360 -64361 9116 102444 116429
24198 116429 23543 39463 52023 -78484 -122722 -58628 -61384 -45659 -128382 49821 107456
24187 107456 115436 45338 -133907 -189788 -127049 -44009 -31720 -107174 -118623 -112032 -64820 -2633
24175 -2633 -44359 -69193 -29389 -122858 -120942 1772 -5927 -95658 -213338 -275683 -257838 -112605
24163 -112605 -78283 -53815 -2104 59913 38994 72523 -26767 -62044 -75739 10305 93597
24152 93597 210612 91689 -45498 -20298 -17404 -108438 -150133 -212805 -149142 -176392 -119995
24141 -119995 -85602 -142110 -104200 -137374 -60644 34855 46275 19479 109949 111879 114578 83112
24129 83112 105715 109605 97572 68124 83320 7844 74457 133300 107320 92112 -19902 -184044
24117 -184044 -127840 -48715 -57438 -73202 -83108 -128295 -200244 -192645 -194407 -199335 -219089 -158491
24105 -158491 -97055 -147652 -248075 -300580 -229285 -116283 -4460 -50040 -49452 -65205 -13869
24094 -13869 39479 24579 -98466 -24761 59900 49125 60210 31114 -18091 -56918 -82251
24083 -82251 50751 139101 51151 -53120 -138128 -93222 -42223 -97985 -69825 -80586 -233859
24072 -233859 -244830 -102050 -101427 -71226 66201 181490 252980 127032 -37416 627 68158
24061 68158 111383 67039 -12185 -75475 -159729 -144122 -175970 -44895 38210 -18575 58621
24050 58621 63330 23787 -46666 68 -8351 -100900 -110843 72969 79404 -28448 -110927 -10759
24038 -10759 -36253 -115013 -129055 -199293 -183960 -142503 -82421 -78527 -3836 4913 -17247 30221
24026 30221 20208 256 33571 37609 63126 105872 16065 -32935 -74723 -204465 -197639 -39067
24014 -39067 1513 -599 7544 -25444 -129397 -136375 -166505 -40932 56413 116880 58675 -17018
24002 -17018 -22161 -9915 -13668 -125534 -179478 -104175 5745 -27525 -112107 -96158 -49818 -26332
23990 -26332 37654 99487 20401 27838 -20818 -45304 12037 55728 135335 182965 101184 -29933
23978 -29933 -6012 -39680 9811 -73699 -150962 -89462 -48680 10684 4888 -11226 -24893 -105691
23966 -105691 -143267 -97115 -23191 -77981 -174033 -158063 -117095 -64985 -4714 -16571 13899
23955 13899 55279 57549 63535 114276 160733 80864 16459 -64221 -54355 -18204 101524 109327
23943 109327 57438 59630 83903 21142 -90028 -206677 -126505 -44664 -21560 -27548 -116895
23932 -116895 -191980 -143786 -168587 -200002 -164592 -90501 20409 64043 27776 21143 114474
23921 114474 64813 14365 41632 101027 141929 38391 -162182 -131729 -7845 -9429 -390
23910 -390 15464 -125200 -163255 -75977 5458 62157 -19162 -114777 -121141 -58185 -69903 22915
23898 22915 -35185 -4156 -10367 33501 9422 85585 123086 63797 74970 38550 -121720 13428
23886 13428 49851 -3657 31544 23003 28503 116705 160481 153778 64531 12858 -24306 -26780
23874 -26780 27840 50251 104660 55297 -23281 -59177 -45157 -106737 -135938 48116 169739
23863 169739 204543 257922 342418 308146 259962 123638 66067 27957 127238 125660 133479 93923
23851 93923 -27849 -72653 -38943 -61682 -418 55631 47437 45692 -8794 -86335 -122160 -19093
23839 -19093 -82224 -33951 -83515 -58936 -79680 -162414 -177335 -51810 -68233 -135332 -193564
23828 -193564 -184440 -251992 -313150 -285738 -236462 -317544 -243726 -128254 -24594 2237 -110597
23817 -110597 -211028 -212241 -141166 -133069 -61092 19502 36481 13576 100532 5333 -61096 -140224
23805 -140224 -55852 -61590 -88975 34337 62105 103227 23298 -39992 196 36733 124516
23794 124516 58404 -165199 -245009 -147645 -112948 -43802 -61285 -61468 65456 48341 31350
23783 31350 86175 66174 -44924 -42080 -83061 -28980 -31157 36092 8021 -69599 -145248 -100301
23771 -100301 -189702 -230238 -215314 -183032 -233347 -274140 -207978 -143245 -103917 -126096 -90274
23760 -90274 -8028 -1830 66923 -37395 -436 56925 10266 -66523 -179046 -156777 -92741
23749 -92741 -24398 69294 66824 -4682 -110979 -186330 -266021 -205836 -102161 -31040 73692
23738 73692 138793 173604 137588 60140 -149976 -243989 -151359 -29603 -15724 -67040 -69984
23727 -69984 -61512 39336 -35150 -65193 -14360 -27337 -122877 -105339 -25785 -9728 34655 68897
23715 68897 63211 8000 -33576 39919 60866 54064 79939 41856 38436 -23282 35776 25086
23703 25086 107255 215746 171565 69270 -1480 -120256 -185131 -233202 -164445 -71227 18109
23692 18109 -23223 118755 191507 185062 113123 -20776 30923 208167 207602 232651 150152 139813
23680 139813 226664 210591 175996 195779 178125 102423 -36472 -124769 -128176 -40656 43763
23669 43763 50521 57887 96929 79062 -16054 -6007 116707 76682 26372 61674 107500 157553
23657 157553 95251 -56314 -119706 12772 49984 3920 -61052 23257 43258 21352 -43436
23646 -43436 6530 108397 128046 68995 32631 -6964 -10339 65411 -6087 113592 224360
23635 224360 217766 118075 66388 104309 89805 85096 153515 115988 104784 155505 136848 99533
23623 99533 75090 164535 165376 29406 -76388 -58920 -59661 -77734 -124531 -61107 -31468 -148699
23611 -148699 -223327 -315158 -270134 -175241 -111757 -52325 -63132 -37901 8411 95601 95052 117063
23599 117063 127302 140789 123545 114365 140206 138321 29289 24200 -62031 -19977 66233 186450
23587 186450 128091 188556 188730 194955 182698 108033 40698 22015 87316 28757 -57191 -116768
23575 -116768 -86508 -49960 47549 85739 143115 177925 276053 307647 193313 20207 -35370
23564 -35370 -46950 -37681 -137864 -178612 -114249 -32451 29922 139844 196680 144685 34712
23553 34712 41476 129630 34782 -22455 109801 146162 -4666 -82644 -130297 -135150 -113747 -4399
23541 -4399 -45601 -24793 101824 123033 81313 120854 196344 74515 -52380 -160710 -121483
23530 -121483 7681 73968 -256 -3423 -14526 48788 147512 178567 175190 92734 -1417 -111423
23518 -111423 -73584 2419 49544 46924 105304 248773 217787 11864 -3994 -20021 -43694
23507 -43694 -49879 -48274 -164932 -166233 -19991 11222 48996 -16549 -12821 136967 187213 183112
23495 183112 122147 43177 24282 30224 196668 123316 -102367 -170950 -17756 147985 210425
23484 210425 191506 122903 80450 56474 -31424 -45539 -4547 53884 -1053 -37298 -8551
23473 -8551 43520 5814 -100149 -61027 -34159 40200 21323 -43387 -84601 -75944 44080 89775
23461 89775 57886 -3283 -100663 -71981 -44219 -19231 43905 62227 16974 22630 68291 17885
23449 17885 34121 123337 108503 104136 176164 191756 191684 103296 20617 55190 71392 116655
23437 116655 -14417 -4393 161904 174871 212523 110526 6055 6149 37048 189250 238962
23426 238962 142523 128619 150005 70581 -32199 -94921 -31158 -50249 -15550 24900 47266
23415 47266 -94210 -42880 5744 67669 172421 233807 186785 166587 31777 -5171 -88296
23404 -88296 -18895 50578 34874 3131 8840 -58256 40778 39974 47421 21234 17516 -76986 14250
23391 14250 107452 82485 64235 -98943 -188762 -208881 -235279 -232478 -140903 -89326 -124562 -76482
23379 -76482 -34462 5049 22489 -145796 -105400 -39397 -54817 -103010 -97972 -30322 10739 5744
23367 5744 -83134 -88798 52554 39820 119679 134594 16461 9317 48358 -1281 -87332 -108841
23355 -108841 -66126 -9402 -60635 -127223 -72426 -55210 -34842 12558 64255 33057 13128
23344 13128 -47737 3289 101744 75362 -50103 -55580 55315 36589 78235 54962 -55722
23333 -55722 -104283 -155950 -225469 -236809 -182840 -26540 -76700 -93224 -74858 -214252 -329650
23322 -329650 -318746 -280026 -158656 -45311 73226 118513 98473 78841 142114 122271 102020
23311 102020 138921 244592 187795 176227 154141 83423 60010 51682 34695 34532 7433 -104756
23299 -104756 -78658 -17808 10153 93846 115107 126105 41597 4809 21233 8935 -41549
23288 -41549 24297 20292 -5516 -34235 -118919 -209814 -207752 -232206 -161663 -117481 -168817 -50342
23276 -50342 -69796 -194732 -238203 -223059 -89861 -142797 -130664 -151133 -166623 -147682 -128449
23265 -128449 -106402 -75810 -27376 -44507 -45849 11863 24336 -67558 -123142 -76954 -95285 -92383
23253 -92383 -65685 -67869 -37250 -134409 -101694 -160656 -39396 29688 -88509 -43755 -78193
23242 -78193 -63511 9373 -59889 -111499 -132836 -136661 -73819 -1025 83358 57956 112033 118600
23230 118600 38987 -16770 -54012 -9140 9152 -13359 -73983 -44606 43152 -3401 -131312
23219 -131312 -92476 -7857 -17472 -85877 -126710 -132628 -62219 -77061 -133625 -55948 -5391 -40441
23207 -40441 -128652 -130246 -129773 -199411 -106647 8307 -1355 -6969 1644 29167 42752 79863 65680
23194 65680 18251 34020 90099 14991 49939 129106 205027 163012 8347 -8408 -47226
23183 -47226 -63679 -11382 39083 84499 195641 174215 85789 -37034 -57359 -114264 -160770
23172 -160770 70194 132460 74400 57074 -25876 14562 4400 -36639 10560 10890 -37053 36338
23160 36338 165598 206400 219840 185588 170946 148118 -10683 -39708 63889 170958 211849
23149 211849 123405 -2698 -38788 -7760 -93133 -25731 45879 53064 -742 -86730 -85190 -157520
23137 -157520 -159793 -105541 -93224 -130351 -167867 -200234 -281651 -295214 -165303 -111600 -131779
23126 -131779 -90114 -38611 -31438 -106688 -81867 16677 184711 166373 269090 142421 60203
23115 60203 86322 132353 134947 159903 251199 149836 92599 -352 -23760 -2443 31325 -37738
23103 -37738 -171378 -267091 -302479 -205772 -132641 -191173 -181566 21357 47628 10550 -34840
23092 -34840 -17932 49324 60009 -56835 -178640 -119367 3678 95404 41833 18592 51900
23081 51900 -156954 -338264 -307431 -84670 -16518 -5178 104251 80349 5112 -38121 13648
23070 13648 -13636 -31273 -74631 -98978 -137026 -174709 -260927 -236613 -138832 27027 47372
23059 47372 86227 197951 181665 -26345 -170444 -80187 -69188 -25019 23236 -153817 -183663
23048 -183663 -79161 -26883 9434 -97563 -42887 20279 98135 80524 33817 95776 158874
23037 158874 63992 -51580 1004 -42838 -132321 -230466 -212833 -159708 -103866 -86848 -62931
23026 -62931 -34387 42572 38085 -7583 -78779 -53149 34685 105660 93853 140793 202010 201202
23014 201202 95336 29470 -40733 29825 -11385 -12259 -401 55710 -12740 -79925 72742
23003 72742 71794 20075 8644 -8930 304 -5388 -47287 -150336 -85504 47780 1781 -54959
22991 -54959 -109690 -94445 -58199 -73192 -8276 -14813 -109182 -181254 -140022 -72325 -68870 6009
22979 6009 -21552 -51946 -52610 -92504 -128150 -77920 -51736 28351 53030 -49512 -190940 -280035
22967 -280035 -247857 -226712 -96127 -21628 15355 -22320 70642 80690 -7071 -93225 -164105
22956 -164105 -129629 -19171 32082 12550 -92112 -199745 -113771 -157285 -224152 -265313 -311854
22945 -311854 -246704 -294959 -255985 -151403 -106958 -118711 -87644 -25400 69500 29361 43191
22934 43191 17262 -20124 7010 11945 6616 -47193 -703 61435 -51875 -172548 -232839 -182123
22922 -182123 -88435 35309 101144 168597 210842 207155 39845 -117142 -255224 -165372 -70514
22911 -70514 -19505 -36291 -15472 174168 100458 62798 118136 50543 65975 66712 -18384 -110393
22899 -110393 -220916 -207763 -154640 7203 150476 199890 112881 45225 47262 118129 150335
22888 150335 89843 41939 -166653 -231710 -137848 -132713 -234471 -215945 -83248 28841 -4505
22877 -4505 -17954 71575 43291 1312 -17395 -20767 -4026 89980 65071 -17921 -72125 -105691
22865 -105691 -118484 -113572 -111618 -63092 -81629 -154643 -170547 -78502 39630 156211 120840
22854 120840 37205 -39729 -17708 20277 100460 80460 -7547 -108451 -119447 -11427 42277
22843 42277 -63399 -129086 -117048 -156146 -199377 -191689 -235047 -200676 -119704 48743 156795
22832 156795 67288 -60971 -107810 -91434 58773 3947 -60879 58650 22593 -22673 -11862
22821 -11862 47937 111903 71039 -27004 -94527 -141419 -151946 -94514 -60033 -48482 -120680 -66122
22809 -66122 -41752 -49287 11049 133935 189259 62030 15232 -32526 -3133 -110132 -122075
22798 -122075 -77580 16357 50722 59447 93311 38406 121781 64603 9902 -83546 -163800 -177278
22786 -177278 -134422 -236127 -215904 -185932 -165890 -90436 76955 114160 142178 127425 88043
22775 88043 68187 78256 169104 234582 260121 213395 174547 52426 -1911 -6244 -55910 -127384
22763 -127384 16069 136211 109761 18957 -34048 6827 112383 89279 -48035 -161326
22753 -161326 -107631 -97870 -101848 -59517 -49183 -50373 -149705 -242619 -144872 4366 62347 9558
22741 9558 -114355 -84586 -702 114693 121138 98383 -3644 -5738 -55524 -51171 -48012 -40668
22729 -40668 -129088 -132091 -174691 -224716 -221176 -148263 -126975 -204160 -193823 -112744 -90416 -104995
22717 -104995 -191606 -219989 -187288 -104701 -1307 20164 -16890 15077 -33972 17867 56125
22706 56125 70912 -104289 -140087 -233476 -262532 -195884 -129934 -14703 -46157 -97862 4481
22695 4481 96111 73512 88526 63452 -16411 -74949 100407 105163 43642 18931 32147 16434
22683 16434 -25790 -144696 -177841 -170275 -96843 -81321 -93234 -126287 -45016 32598 -93212
22672 -93212 -241541 -304269 -240589 -154212 -175702 -168260 -20888 29950 4373 -21180 -74596
22661 -74596 46734 38803 51153 4949 -94998 -75532 11825 41698 -5022 -23425 -68011 92453
22649 92453 52740 20473 82486 155335 71067 -123290 -93204 -99318 -60772 -69184 -151724 -142560
22637 -142560 -79282 -47685 47480 124060 93809 -55559 -86835 -53730 -300 82471 27379
22626 27379 -25300 -8852 -132872 -221260 -220490 -164034 -97140 6942 -35572 -104231 -144360 -164431
22614 -164431 -122873 -134293 -116785 -93384 -84454 -46522 -66147 -141109 -218209 -144088 2180
22603 2180 -3017 12338 -24577 -63092 39894 89985 60623 72941 -41267 -159285 -160951 -173185
22591 -173185 -52553 29367 44476 62999 24269 -45550 34590 -6601 -187302 -298874 -192423
22580 -192423 53101 79142 25806 19905 133416 167305 135797 55342 -53457 -239148 -373124
22569 -373124 -302405 -187847 -120279 -145068 -86914 -38017 -48909 -2899 43403 92306 123256
22558 123256 114216 117264 103057 115522 47373 48107 80978 58518 -62701 6789 -10524 -111206
22546 -111206 -45370 -35663 -69986 -228295 -174007 -77850 -57611 -141765 -101327 -96331 -69991 -62976
22534 -62976 -23190 37884 42087 9584 -42592 1055 14591 61735 33816 45905 7752 -58395
22522 -58395 -16463 -4200 -3401 -32156 33044 15658 -71778 -52808 4393 -62582 -61942 -58925 34486
22509 34486 64791 26592 137382 193210 231703 177377 52944 -15459 -74754 70387 47220
22498 47220 -32358 8884 18912 68642 32403 16950 171034 170136 117830 103005 152260 160539
22486 160539 179477 164462 167376 151423 102144 38943 38252 37125 33888 -127997 -108390 -43510
22474 -43510 -124703 -128763 -24570 19623 -38915 -43665 31270 16975 3773 -35768 -96388 6773
22462 6773 -2912 -66447 51100 128162 121493 153721 -6855 18800 -43796 -64771 -8572 94963
22450 94963 49251 14904 27563 68219 69699 11844 -21836 -10159 -76918 -138781 -246860 -220041
22438 -220041 -160820 -51609 64973 73705 18556 30088 -61604 -36428 -6571 48006 64427
22427 64427 -1950 76299 -17636 -5515 88858 -10028 22968 15723 -32603 53609 106749 63126
22415 63126 -3505 106845 164631 95904 860 -66114 -62320 -13725 -39824 -111052 -187709 -229739
22403 -229739 -191064 -66403 38960 124561 48538 -38931 -98744 -98249 -132943 -59376 50973
22392 50973 118705 168348 26266 -105064 -104844 -109726 -45013 57912 130495 89693 33452 -81416
22380 -81416 -113569 -172778 -134564 8830 112853 31220 -16326 34020 -9063 -158952 -170171
22369 -170171 -130542 -161140 -65380 102301 82852 -2057 -64656 -83317 43414 -9034 -128051
22358 -128051 -33094 63084 69678 53058 21065 -75993 -28537 -33524 -129697 -111353 -52410 92618
22346 92618 111107 -24205 -131308 -230274 -258738 -99166 -542 34034 -12916 -26050 20905
22335 20905 -56808 -223429 -230437 -248040 -203489 -130689 -161194 -76111 -114753 -56034 -33069 -54869
22323 -54869 22078 47161 -30466 -51160 6728 -23986 -60612 -60771 -91486 -46978 -19697 -11023
22311 -11023 30969 -122261 -152817 -122757 -167459 -61147 23449 4808 -26086 -79757 -213806
22300 -213806 -244619 -87928 1664 -83505 -26119 36074 24445 82774 66170 18776 -10396
22289 -10396 -134127 -194451 -92635 -115597 -61939 -52094 15822 41701 34407 39333 66726 8739
22277 8739 -16174 -3420 -152510 -221684 -231463 -195075 -117451 -28099 12908 67343 108254 67042
22265 67042 60123 68757 9161 -115957 -189969 -220508 -293172 -253119 -225619 -99061 -26542 81643
22253 81643 144056 98304 84488 -10934 -54573 -108157 -117548 -153633 -139808 -27721 65431 65919
22241 65919 -28473 -20572 31098 42171 -2001 -66612 32155 14762 -102136 -248497 -306487
22230 -306487 -315070 -304948 -194074 -148855 -118070 -36066 58630 67444 144589 63495 -72880
22219 -72880 -114041 -62191 -104827 -32580 39121 70608 17813 -10158 7596 69906 231642
22208 231642 292819 244730 247435 122315 -138847 -214389 -110206 -41064 -14486 13465 -16726
22197 -16726 -80835 28033 15994 52266 91553 208828 200132 157719 107678 33655 -103596
22186 -103596 -256072 -210504 -9896 136547 57498 13935 101481 31513 -26038 -67159 -130986
22175 -130986 -147573 -115638 -137556 -115023 -106287 -38720 7486 21010 -57758 -65567 22763 36600
22163 36600 102124 156388 118194 87181 79993 -23813 -75424 -104702 18412 -55076 -119782
22152 -119782 106605 285815 331427 268805 85329 16503 40488 74900 -7204 104758 116192
22141 116192 151026 181956 105469 -113489 -107348 4955 204122 212232 93288 33846 -9160
22130 -9160 -105773 -94489 6462 70838 50748 71343 99429 -72888 -200055 -16547 69474
22119 69474 -70453 -92078 4527 94494 92794 21085 86081 38480 -2434 46962 28524 44031
22107 44031 115489 25692 -45704 -47334 -55422 -78169 -83596 -170467 -210634 -236628 -186071 -60712
22095 -60712 -38947 603 6545 -28318 -25284 27540 -78254 -137712 -53536 38177 51330 92175
22083 92175 68691 34449 102887 135578 134672 70395 18997 27725 -19677 -40505 -14824 -44261
22071 -44261 63012 46191 -74379 -128509 -199991 -175989 -162644 -114278 12251 8458 28412
22060 28412 48803 122583 121728 170471 219404 189972 180827 74452 27704 47314 92999 49602
22048 49602 20455 65416 17121 -98996 -117480 -112140 -48664 59858 -7695 -14521 89524
22037 89524 91756 110691 130359 171268 116743 5515 120719 -7128 -14089 -113144 -196019
22026 -196019 -159642 -154451 -113753 -46055 26513 -60833 -132960 25705 28042 -64616 -20949 60753
22014 60753 74005 26986 -64827 -117496 -202165 -152895 -61324 -37651 -118299 -84691 -111651 -103096
22002 -103096 -5678 -28100 -57872 -90844 -96297 25330 -5078 67160 57232 146653 218567 129985
21990 129985 63078 -48847 -173496 -38009 9856 57524 76264 38127 -133369 -223722 -129688
21979 -129688 -188232 -213623 -172490 -224381 -191954 -137951 -122550 -45252 -22072 58694 205920
21968 205920 128427 -17320 -162701 -258081 -54942 -7187 -111643 -37058 73683 134421
21958 134421 99991 10481 10779 135138 144927 60737 19479 -15035 23068 64269 109741 122940
21946 122940 138807 142146 158857 22162 -121884 -120961 -36770 -12278 -1161 111462 68517
21935 68517 -56665 3393 69603 47047 -181899 -264526 -301537 -286236 -204376 -127920 -83602
21924 -83602 -165626 -185230 -108954 -75539 -48864 89218 134311 102040 108516 125911 88815 -47015
21912 -47015 -72784 -22110 6857 -57278 -167171 -170557 -65157 24219 150140 67444 54451
21901 54451 160889 62089 54274 -14116 -51590 -64812 6294 49285 113029 209642 156860 155404
21889 155404 118175 36094 -78867 -200916 -173601 -132494 -89100 -56028 -17252 -40987 -141323
21878 -141323 -165291 -112753 -83461 -141870 -217941 -86138 -88439 -87246 -129220 -139429 -60512 -89637
21866 -89637 -80766 -39291 38474 -3846 -20480 -3110 45091 43235 34806 133412 147428 79771
21854 79771 5616 143687 181755 108142 -101508 -234514 -326184 -202953 -94327 -73488 -26829
21843 -26829 -1323 -39413 -59321 9736 4784 -23811 -63971 -31083 -67716 -150290 -183612 -111776
21831 -111776 -122424 -128978 2112 71496 -24895 36134 99503 159142 117209 78539 88672
21820 88672 65966 63300 135593 134799 49854 -47944 58274 139901 125599 102405 122797 70052
21808 70052 98253 104066 135976 33958 -12768 39494 16773 -27086 -21952 60645 69030 63068
21796 63068 -7307 -43497 81658 72824 32445 6087 -75050 -166457 -91365 -75949 39154
21785 39154 49107 -47857 -119182 -150110 -74746 96964 67352 7853 -2433 -9000 54370 133412
21773 133412 202153 115474 10880 -27576 26505 -126660 -239227 -297778 -210791 -143837 50886
21762 50886 95284 89061 119678 176020 267111 243594 261406 126864 48841 10255 25539 153826
21750 153826 84896 10809 -6816 -43048 77636 143772 108282 77644 83647 82289 114274 74330
21738 74330 103508 165760 102888 129361 139410 180194 138148 -12983 -108394 -37665 137748
21727 137748 182735 62031 42008 164246 180135 68717 -109924 -68064 -99193 -162774 -132059
21716 -132059 -123272 -158256 -139639 -52239 57316 36450 -54488 -47819 -4833 -9020 25281 112852
21704 112852 144794 72545 -102675 -80864 81229 28746 -43816 -181100 -149098 -81812 -11056
21693 -11056 -12090 14382 103353 112098 94112 -37232 -85602 -20719 -24334 -85055 -63093 145410
21681 145410 186560 121942 106907 81407 -108416 -143247 -99339 -45853 -25322 10452 -51625
21670 -51625 -65874 -162486 -61365 75075 52377 35714 142057 54188 399 -134242 -275941
21659 -275941 -247248 -163867 -113832 -436 16733 77979 53149 83375 60389 25236 53411
21648 53411 195489 159806 29351 -14111 76957 120231 157206 97314 39450 5611 11042
21637 11042 -8910 -14609 -18261 -158056 -213347 -167844 -158935 -169290 -165974 -155169 -97854 -132914
21625 -132914 -146757 -56122 -48743 61694 137685 129739 152339 103164 38235 69668 -33067
21614 -33067 -159425 -114150 -120465 -86755 78875 154938 180121 140784 70199 200214 168608
21603 168608 -32175 -92562 -60855 -74364 -97555 -121522 -96888 -22555 62733 84638 -5703
21592 -5703 46022 36396 93915 -28611 -140934 -156397 -170951 -102073 -59266 -174123 -59048
21581 -59048 59351 2961 1792 -7735 -2356 94663 144073 193044 151635 87765 -13170 -29994
21569 -29994 -16439 -59058 -57913 -74190 -157128 -99722 -128424 -58208 18294 14938 198477 241446
21557 241446 244554 212590 88517 11092 -45350 -57001 95336 26117 50893 99250 79244
21546 79244 86259 -54825 -197369 -238043 -179435 -154572 -69228 78029 196787 220887 175359
21535 175359 36874 32506 70942 53867 -17799 -39784 20715 87160 68617 -18079 -65094
21524 -65094 52965 13080 -7567 19316 78303 -3559 52300 131167 179982 178636 81190 69040
21512 69040 69751 73551 57372 66710 41743 -74766 -24882 -109621 -93192 -4472 38635 -47370
21500 -47370 -43092 -98535 -144672 -66110 84732 28865 -73170 -7166 -25290 -80484 -73165 -41477
21488 -41477 -24540 -82511 36885 115342 145447 107256 88809 17308 -33414 -47690 -79140
21477 -79140 -108147 -43273 21241 92707 95097 -29302 -1324 -1978 86147 18345 -15114 5341
21465 5341 81059 103579 90703 -21763 -85676 19476 31493 9725 97522 167092 231636
21454 231636 183876 148178 75117 -62341 -32048 -20748 -42252 58179 44579 -37987 -190071
21443 -190071 -135815 -89242 -103202 -142649 -208661 -48798 -65443 -4480 20828 37214 59043
21432 59043 -23173 -30659 23179 -34019 -102407 -36621 23837 -42669 -90083 -60940 -198960 -262955
21420 -262955 -197675 -49823 14062 103994 112761 43046 41843 128427 168830 106874 65987 38915
21408 38915 -21362 17260 8454 -518 35349 101900 13067 -13502 56828 29917 -119248 -87358
21396 -87358 42968 86873 43265 67735 -25496 -129546 -113059 -85868 -43588 51890 28683
21385 28683 -151008 -292390 -229695 -115034 -142810 -151407 -146265 -43365 -41514 -170103 -256182
21374 -256182 -117377 -82723 -126770 -32403 18287 34556 38615 39861 105857 107048 -16703 -19147
21362 -19147 -8390 53822 72234 69287 -86179 -109370 -114118 -115347 30203 88362 125509 184278
21350 184278 125933 30585 68054 65620 -59858 -194996 -270350 -191882 -193090 -149887 -170198
21339 -170198 -136663 -89896 4651 156274 159703 130320 177362 102914 16290 -89524 -160618
21328 -160618 -71342 12322 18634 35271 81117 58022 -17903 74617 98829 121955 43633 43740
21316 43740 98181 -4485 20608 10600 -41743 -64196 -146290 30765 46508 17337 15854
21305 15854 984 38467 -13171 -43665 2247 -19501 43393 99852 153398 137405 90840 135642
21293 135642 111229 73238 29949 -19145 -74800 -20599 1389 35503 750 95012 146342
21282 146342 119092 13946 93185 159457 -33780 -111970 -68736 109287 211751 159444 215042
21271 215042 265684 179048 168808 126265 -42987 -74014 -40868 161619 267853 170133 50394
21260 50394 -8993 -5242 46919 86891 12054 -108929 -282151 -260554 -246629 -98000 56214
21249 56214 297 -52407 -8590 57560 113677 147118 94854 39303 56711 96119 33076 39125
21237 39125 12519 -63812 -213752 -284391 -308052 -92832 95464 95692 38676 43368 77159 76987
21225 76987 90403 239177 273245 219318 238826 189366 185724 141722 221145 204584 180422 143223
21213 143223 146815 58090 -3102 10 -25278 -52559 -68442 -42049 -28094 -130482 -132884 -48615
21201 -48615 -67054 27008 181111 177705 209936 241923 289563 167099 -5134 -57331 -42245
21190 -42245 -39807 -28995 95361 58115 42792 -35453 -94369 -142686 -103234 9189 9165 -92931
21178 -92931 -20513 -38217 -50195 -17489 20598 3767 -78074 -125715 80164 96141 167336
21167 167336 118327 -20050 -68885 24166 88988 121738 121074 27631 71135 186137 140682
21156 140682 21344 26087 17468 71168 114922 -11724 -12081 -83916 53851 113143 63640 20641
21144 20641 67237 130473 65843 20719 -57607 -91814 -106544 -127754 -156464 -242688 -184490 -130760
21132 -130760 -134250 -168383 -114252 -61505 -58936 -98851 -26238 56032 59037 37048 -21907 -77631
21120 -77631 -82240 -116720 -96544 -98603 -55520 55022 65047 53793 51677 -30074 -87920 -42176
21108 -42176 57034 8836 32908 142983 96525 125453 110782 33533 -34388 62976 75399
21097 75399 59661 43503 34968 -13012 34028 13177 -6380 48062 84922 111466 99957 41365
21085 41365 13584 26409 -64428 -147193 -126013 -153951 -93169 -211756 -193380 -123942 -63846
21074 -63846 -42626 -55038 -179115 -76675 47755 128068 10401 -29650 -51907 -106961 -55640
21063 -55640 -38564 -60924 -130359 -139866 -103147 -117907 -73983 58612 139900 164873 80767 109664
21051 109664 168861 19454 -51503 -104902 -132942 -122124 -55671 -154055 -187783 -145866 -188818
21040 -188818 -170559 -195175 -77884 80378 61831 10592 -79813 -92919 -72300 -66397 5954
21029 5954 10971 12507 55601 18292 -155230 -110511 -76164 -52692 -68760 -48656 64948 127585
21017 127585 137630 28089 -50123 -147581 -48934 -11118 -93444 -151914 -4774 8285 -63597
21006 -63597 -135630 84727 268477 215056 210105 224239 232122 147571 116102 -91923 -190299
20995 -190299 -115280 -115165 -66650 23953 -17558 -126751 17944 114263 2656 -50853 -46848
20984 -46848 -103202 -97587 -64365 -10023 -21188 28756 47856 -16768 -41104 20930 4633 21977
20972 21977 84476 113913 76717 42925 12514 7305 71817 -19865 -93936 -142730 -60202 -36174
20960 -36174 -52138 -228092 -196397 -83571 -49451 -35321 -90057 -52 17761 7201 -82252
20949 -82252 -145451 -174724 -196171 -181037 -130878 61623 121371 15337 -26446 13191 60193
20938 60193 142675 139685 80194 -47996 -139627 -273392 -268637 -257863 -145052 -103240 -71727
20927 -71727 22787 109590 63719 35574 43145 146614 207479 236217 95760 89978 -27100
20916 -27100 -93487 123850 160570 79422 61211 32017 -29348 -98636 -132854 -106959 -75562
20905 -75562 -122688 -122126 -233076 -65600 56430 204039 146447 83717 40142 65919 -16681
20894 -16681 20990 -5140 -72734 -58519 -64839 -41640 -52112 -93130 -168085 -193494 -221266 -188367
20882 -188367 -132340 -123998 -214124 -208740 -82683 -91299 -178472 -132294 -150878 -85250 7879 113822
20870 113822 191145 135580 83934 101001 74066 34967 -7710 42442 32522 99288 223390
20859 223390 68310 18297 19515 -47105 -93240 -55654 101191 68500 61496 76559 -8304
20848 -8304 6277 34063 54583 12698 31811 91139 240072 138636 155149 178092 77191
20837 77191 -21718 -74126 25226 -6722 -50567 -86776 -58463 14992 128315 46824 18300
20826 18300 85140 120796 79251 27738 -64097 -78967 -1930 60410 169388 124235 30694
20815 30694 -32034 -121989 -190716 -137602 -56959 -11657 22901 17325 -57751 -70979 30623 57079
20803 57079 48625 50128 43154 36480 27203 43593 68128 81831 85525 53630 14025 -30182 -15401
20790 -15401 56426 109444 166257 97305 109495 62987 107282 85499 100613 180654 125580 24013
20778 24013 17979 -139972 -144802 -93657 19001 65158 59744 82884 29124 -37490 51361 9315
20766 9315 -46419 -58418 -37010 -4263 1150 10046 -31802 -93082 -3747 1542 -66886 -10842
20754 -10842 18486 147434 51850 35253 36424 58372 -62696 -8527 63806 43040 32050
20743 32050 132111 140001 39347 -91394 -111066 -153810 -78766 95722 85382 44271 28045
20732 28045 159121 279361 251720 204468 181057 166536 120104 -33784 -37607 139903 215363
20721 215363 220758 212995 154279 115305 215662 252747 193930 44663 -42007 -51759 41818 67153
20709 67153 29555 55139 51243 77560 130174 157868 63219 102177 208724 116315 143395 74825
20697 74825 61710 99105 107189 36525 -69808 -92368 -42476 -76525 -184364 -174166 -117100
20686 -117100 -95178 -92435 -140489 -308025 -223518 -43640 13512 96556 78771 110505 147089
20675 147089 102475 72154 84407 33599 63351 1911 -70070 -30944 11926 32604 20221
20664 20221 4595 -116569 16758 78509 4819 -47852 129522 159752 77910 -44962 -100910
20653 -100910 -50750 -95816 -67907 34101 146524 201768 124671 -29540 -1982 31691 -63213
20642 -63213 -9575 54462 43382 49682 -66036 -101287 -43656 -51698 -77074 -137675 -12892 125127
20630 125127 195225 255638 243798 139562 -10384 -16061 -24753 39382 -1046 -39672 -70951
20619 -70951 -75027 -65886 63132 170107 168945 212183 108764 -19228 -38104 86337 194015
20608 194015 268218 280233 176068 78079 60440 87370 55017 106077 147157 197813 124054
20597 124054 27862 35314 -93257 -45980 -51776 -1369 143805 98270 14790 -112106 -131706
20586 -131706 -102626 -68582 -72806 -26474 -47300 -48028 28098 18813 33002 26530 66028 92763
20574 92763 16650 -13327 -86556 16248 147240 150050 184103 188258 154040 161309 252847 245779
20562 245779 120162 -9951 -79927 -98291 19862 83607 89379 215175 281178 202498 114047
20551 114047 -60425 -81766 -15385 -13076 44783 88604 -26419 23252 20951 -23852 -104304
20540 -104304 -177149 -72817 24824 13769 -56644 -39055 93987 50616 126914 189611 97312
20529 97312 75013 41925 -62018 -173887 -77308 2513 -29741 -152077 -112949 20287 -2514
20518 -2514 -20032 67894 7167 44345 91994 36979 30169 38965 -5565 -52299 -36333 -42915
20506 -42915 49121 118932 181618 225166 169686 155281 101786 92039 62030 -125622 -119605 -29749
20494 -29749 -2375 24592 61254 98948 140471 115729 79798 20113 38125 23201 21893 87325
20482 87325 131339 124145 114448 56446 48249 120071 158824 150107 107995 29244 56549 98523
20470 98523 6929 35041 71720 68245 2864 10721 28407 51142 83149 7774 21506 -106001
20458 -106001 -90805 -715 -67508 -78755 55902 39492 -6020 18058 17872 54947 196557
20447 196557 252044 136026 113048 166438 184857 93416 -24106 47225 21476 -27250 -18791
20436 -18791 20139 -1760 -75487 -101834 -55129 208 -10528 37496 118971 143072 95345 36595
20424 36595 -9670 -59899 62242 104289 65168 3192 -61346 -93830 -95490 -61701 -29064 -48870
20412 -48870 -41893 -19464 87764 149456 146938 155720 93613 99438 77320 139951 149050 128232
20400 128232 171408 64780 -67309 -152313 -180775 -156039 -9607 72578 85864 63708 19756
20389 19756 73174 101655 123632 192899 189315 173682 76328 -9747 -41932 -57807 -15117 29148
20377 29148 60269 52142 268999 203211 143108 178317 187169 66994 88133 58637 103577 24555
20365 24555 4610 201145 319120 359684 348390 290043 205720 178951 311818 287600 260859
20354 260859 243721 238798 102002 12735 -34051 115681 179250 154236 60443 91315 181209
20343 181209 248994 245477 131063 34224 -20625 71247 42412 1333 -6312 -30465 21408 140727
20331 140727 129832 82540 76897 104217 174426 136388 54186 63574 85099 114954 19074 4318
20319 4318 84031 171844 135569 173845 85185 -24453 16651 82535 173962 120872 58791 79357
20307 79357 53174 28370 34020 88805 77492 28629 -4239 125437 170366 187862 99799 -38166
20295 -38166 -170088 -160507 -107102 28359 39549 -22550 -39800 -2267 139610 368742 331574
20284 331574 332575 316051 254496 101183 115858 33315 -13982 -50885 -86391 -85207 -85689 -118766
20272 -118766 -55098 -31405 44706 106165 139388 186725 222982 153296 98540 5079 -52552
20261 -52552 -9940 112218 107876 4310 -16323 38003 122476 154026 207472 197451 88715
20250 88715 108532 151448 137676 111524 101624 -38032 -55922 107480 100356 31065 162047
20239 162047 219218 135726 102930 102007 80288 -10820 -21178 121007 36846 -1952 108557
20228 108557 220184 225312 102935 24373 20183 -20203 -106555 -187096 -168639 -26467 80891
20217 80891 198054 89500 -53857 -38158 20068 100395 78668 55276 179577 219180 174058
20206 174058 86051 -33056 2279 76174 99244 76752 117840 171566 281941 211476 45171
20195 45171 3972 104405 146242 34303 64805 148809 146234 212579 242099 201661 149739
20184 149739 -14295 -43062 57311 131521 111351 65979 72004 136025 152226 -1626 -67416
20173 -67416 -31579 14767 79015 214920 88517 -27478 -9068 23025 63132 15262 -61206
20162 -61206 -34785 66304 150726 86372 148400 196883 220708 286864 182277 58529 -79318
20151 -79318 -165622 61115 224766 348228 309528 250833 69257 100038 192131 99044 37490
20140 37490 75783 107374 126360 61677 46762 86197 -13211 -62234 31998 160154 223909
20129 223909 297710 360560 227009 164474 209047 185843 200042 205586 172305 197131 294544
20118 294544 350074 371719 355301 354234 397025 383059 491996 554528 698632 774640 870448
20107 870448 908538 970588 1023364 1152515 1306556 1376153 1341435 1413890 1302870 1153506 1101934
20096 1101934 1062275 1095403 1118080 1133494 1104092 1121031 1181789 1379537 1536678 1543503 1589043
20085 1589043 1545253 1556322 1520318 1346476 1097794 886814 789930 762303 785267 754927 710068
20074 710068 582400 578877 581596 499179 436950 385665 386517 496409 573853 565332 530554 595778
20062 595778 534697 450437 448138 559956 559940 489217 352481 352014 373619 324049 365448 302127
20050 302127 313933 386594 453534 527653 416275 413118 449863 461042 356153 183793 100761
20039 100761 -8340 -56242 -77503 52381 98356 235818 289162 232375 161922 30414 -6927
20028 -6927 164789 206231 211850 119209 5934 -69489 -110948 -19017 79084 118290 171367 248530
20016 248530 303929 239130 139390 68990 29261 26979 38842 40283 21590 -33933 -47087 -101691
20004 -101691 -68686 -31457 35426 41710 -96968 -158816 -40802 50044 90858 167190 105564
19993 105564 93050 103832 110611 121357 108326 101349 141451 76264 60625 133511 180774 73568
19981 73568 85688 53819 -22592 61273 34703 34425 -24042 -7762 97728 155877 154047 105767
19969 105767 102714 100821 63561 149469 163777 52821 8823 139314 245975 134014 68047
19958 68047 5095 128430 157048 102420 143751 246520 319018 370104 331317 336911 305534
19947 305534 322373 159708 118692 119865 185135 176396 -1204 76149 17643 65396 156956
19936 156956 214035 217316 312913 261212 198143 263261 199639 145051 45761 -14713 17296 84623
19924 84623 -689 -112595 -11563 170518 261288 294898 378889 360954 170602 30844 63282
19913 63282 172413 148500 172107 130407 179614 225144 277357 326695 340707 304022 231108
19902 231108 236103 177683 137676 177263 209384 185218 198783 231530 252446 335510 303082 242360
19890 242360 181654 248783 376239 401340 284989 338142 384219 335673 391805 385249 450370
19879 450370 441183 422682 405373 319625 217672 165284 40986 -8762 61252 145792 93286
19868 93286 117604 71816 141852 161942 119879 31767 -13188 70890 96406 105610 115178 119201
19856 119201 243512 321152 367525 343768 289282 345793 406948 293256 257588 194296 157900
19845 157900 163720 216029 239577 153952 131406 189277 204188 246666 187856 175703 314151
19834 314151 367812 391093 317625 272502 338583 435254 348432 182412 140137 156866 146229
19823 146229 89474 108185 149679 247737 322575 325401 336682 360210 343078 229224 314791
19812 314791 388479 376689 391720 270861 190976 234033 252091 274713 352636 369784 396030
19801 396030 423820 454050 496607 476406 470032 396332 318285 259911 256615 379801 486537
19790 486537 383583 279324 301328 329458 271067 170343 183302 243023 177138 209039 319800
19779 319800 406641 497021 458403 330663 224346 328369 294528 263231 305488 427446 583454
19768 583454 575018 683711 695074 718205 662375 641790 594854 464918 499927 621026 691611
19757 691611 723103 726119 710024 648598 535971 525665 664595 839099 932636 876167 868907
19746 868907 892577 798385 712151 779943 716425 602233 515393 468501 400958 452302 477738
19735 477738 452430 422302 382905 384814 402736 535041 421594 314796 398371 449266 475739
19724 475739 433810 469865 515319 461629 479793 512063 404470 378076 455435 459063 338618
19713 338618 294901 240025 193221 240576 248548 277207 225838 312742 288166 346397 354152 345305
19701 345305 377251 485158 476125 381850 336839 240921 213621 277052 287615 208043 297511
19690 297511 418854 430025 441372 455020 452075 321086 302307 448398 559301 541635 597807
19679 597807 524565 441013 457492 529249 473128 484930 474637 459450 564563 635578 573082
19668 573082 570662 623284 620834 582418 548818 590304 722968 663319 665669 642358 588553 551370
19656 551370 571696 530834 349829 536138 708634 754771 815509 821699 765182 764230 678800
19645 678800 647922 608952 584933 684605 671206 621317 580710 482640 539703 585258 607699
19634 607699 611458 525512 456299 524177 578458 574690 630149 822647 857867 844312 815307 830380
19622 830380 805217 819289 906573 895256 841463 771301 826935 807705 777363 853419 886714
19611 886714 881129 761810 765734 830864 931542 1184062 1227626 1210653 1262052 1297224 1261422
19600 1261422 1336918 1437762 1605748 1598703 1547366 1678179 1798297 1852079 1878374 1983250
19590 1983250 2104866 2179932 2335699 2368635 2405822 2412243 2572156 2700836 2799667 3009279
19580 3009279 3162784 3218187 3362805 3655508 3875681 4007630 4292841 4353290 4323087 4234383
19570 4234383 4322671 4440802 4439530 4454285 4606197 4785200 4977835 5046710 5166412 5246230
19560 5246230 5201040 5147994 5278887 5399526 5395818 5300473 5349389 5376233 5398917 5514545 5579558
19549 5579558 5821854 5940421 6066306 6151177 6316988 6473841 6718559 6927564 6995747 7277119
19539 7277119 7727542 8082407 8424969 9029935 9691434 10144475 10541054 10984153 11503140
19530 11503140 11875922 12301936 12699428 13138084 13890445 14938230 16056272 17350814 19077710
19521 19077710 21147201 23582092 26723716 30601546 35326086 41370314 49189339 59312554
19513 59312554 72237919 88769888 110134750 138529030 175538824 213669178 236011254
19506 236011254 241935040 246149957 245715952 226805544 195664146 167501344 148347231
19499 148347231 137788545 134225945 136682204 144714304 158438671 179253076 209193025
19492 209193025 245018463 270778247 276955582 276515746 275071223 258702876 225031722
19485 225031722 189349604 160805077 140155080 125557029 114918088 106870494 100523865
19478 100523865 95448706 91277895 87655756 84198709 81087868 78368780 75907785 73561514
19470 73561514 71411283 69320060 67261616 65451566 64016137 62579351 61002684 59204706
19462 59204706 57634961 56370496 55045859 53440741 51785812 50091223 48533062 46941428
19454 46941428 45265470 43548728 41929732 40311939 38815208 37299119 35604113 33951493
19446 33951493 32195985 30497255 28919723 27476429 26097231 24794935 23618813 22580173
19438 22580173 21409472 20401475 19348467 18363842 17598659 16770097 16034766 15298250 14502373
19429 14502373 13915926 13252167 12369607 11807597 11306403 10813826 10438817 10003629 9617741
19420 9617741 9253636 8751952 8192434 7718168 7307259 6912855 6590580 6416574 6231265
19411 6231265 5901029 5629687 5380037 5143671 4846545 4656834 4497434 4374955 4272860
19402 4272860 4029820 3809181 3569192 3379345 3266263 3195861 3102324 3008881 2890785 2703170
19392 2703170 2659209 2656530 2684458 2635861 2617277 2641186 2655839 2848633 2760199 2732084 2681201
19381 2681201 2670602 2582270 2513620 2477650 2390468 2275153 2297184 2308982 2234116 2053365 1913398
19370 1913398 1880811 1960883 2048771 2074908 2082724 1979439 1984834 2149397 2158770 1982830 1835685
19359 1835685 1839749 1829937 1752578 1639477 1585979 1484224 1490639 1546723 1514996 1473923 1451966
19348 1451966 1330458 1422398 1554681 1658912 1738074 1781911 1735435 1749402 1842882 2125108
19338 2125108 2386801 2488444 2398598 2282092 2282548 2351431 2394584 2417590 2469491 2608472 2645660
19327 2645660 2605370 2550507 2511084 2594992 2742552 2685762 2650985 2609456 2592488 2479518 2344134
19316 2344134 2360491 2430469 2416714 2221723 2175529 2265190 2394703 2478312 2466228 2348964 2246770
19305 2246770 2159171 2280303 2394498 2273399 2107455 2091785 2190142 2086066 2152308 2261578
19295 2261578 2311124 2297804 2332834 2251278 2263443 2329968 2359579 2195427 2064878 2098230 2229865
19284 2229865 2400945 2491382 2428741 2224866 2229943 2187771 2051763 2094552 2273265 2304951 2110626
19273 2110626 1984171 1933532 1828329 1750801 1632070 1599975 1512928 1625970 1721888 1733792
19263 1733792 1724632 1647571 1589712 1593892 1605687 1582100 1722102 1641441 1534522 1630564 1661960
19252 1661960 1646240 1600781 1609733 1668218 1763534 1815447 1728579 1682722 1692420 1646612 1662377 1698573
19240 1698573 1755714 1766635 1804315 1818975 1796784 1710388 1712181 1740432 1799990 1766433 1764778 1869508
19228 1869508 1865795 1868703 1846805 1843101 1822061 1642876 1585106 1579474 1487960 1361081 1382758 1483386
19216 1483386 1469243 1493888 1534103 1511368 1534678 1479748 1467826 1424282 1402808 1404694 1462657
19205 1462657 1552888 1613134 1585158 1576626 1518324 1573258 1541832 1528164 1441123 1243061 1225411
19194 1225411 1360293 1366472 1321324 1326346 1453327 1638269 1723429 1623189 1409177 1379035 1482545
19183 1482545 1437733 1506320 1639199 1705093 1587097 1570967 1659963 1561158 1654757 1827358 1886837
19172 1886837 1816576 1742482 1691398 1758953 1785372 1763248 1720780 1706250 1733989 1877747 2002961
19161 2002961 2044700 2031977 2002845 2052943 2053161 2061511 1994852 1867029 1800047 1847335 1748471 1705270
19149 1705270 1847455 1825251 1817261 1863057 1826223 1847905 1695322 1541464 1574650 1663781 1698760
19138 1698760 1667559 1748473 1757540 1717211 1682910 1736375 1814418 1739691 1805220 1821689 1773014
19127 1773014 1706734 1819821 1886303 1891255 1829302 1743768 1736445 1812782 1822092 1736775 1905078
19116 1905078 2021530 2154004 2196341 2097425 2066938 2041492 2093363 2099696 2212127 2195408 2207032
19105 2207032 2153352 2197340 2102132 2028697 2040249 2055852 1970884 1922634 1881401 1793530 1840532
19094 1840532 1884804 2012559 2042408 2086308 2140101 2190138 2335227 2444974 2455763 2461493 2588665
19083 2588665 2636621 2647874 2606692 2687860 2814896 2950206 3101789 3317475 3411150 3585504
19073 3585504 3721661 3850225 4000803 4112564 4213017 4305931 4381227 4475454 4640761 4780473
19063 4780473 4981410 5216111 5363612 5465778 5512257 5633279 5721370 5752059 5858315 5887137
19053 5887137 5983717 6092117 6133130 6327185 6511853 6566915 6645599 6770874 6967090 7258725
19043 7258725 7425231 7576728 7691032 7908796 7959501 8240971 8565294 8765573 8981145 9223769
19033 9223769 9489261 9608199 9919433 10202050 10630494 11141504 11514216 11848553 12303312
19024 12303312 12787932 13226586 13768597 14260999 14841907 15397305 15923645 16515676 17228291
19015 17228291 17973065 18676014 19229189 19856123 20632209 21593114 22532507 23599920 25013557
19006 25013557 26645146 28352389 30206653 32299368 34614856 37415079 40804834 44730058
18998 44730058 49064184 54267221 60886910 69078468 79162548 91537096 106610102 124829254
18990 124829254 146716242 171932869 198909647 223884929 243763576 258703808 270031146
18983 270031146 278094415 283697600 289684025 297075657 305314096 317443837 334604927 349523234
18975 349523234 355833979 356065260 355481722 353884860 344975381 326085894 304159090 283935004
18967 283935004 262433160 239584292 220234693 206982090 199599182 197465901 200432617
18960 200432617 209389751 222447626 232196387 234490147 235932843 238504733 235045632 225861647
18952 225861647 219184995 219536745 227215644 236804005 241168042 243066791 246360854 242478435
18944 242478435 225006683 203163215 184986656 171891674 162565822 155944936 151685650
18937 151685650 149549110 149116622 150511936 154298269 160769790 170165733 183269886 201705134
18929 201705134 227502131 256779298 276792193 282222777 283722696 285906721 282398038
18922 282398038 274598202 271995846 277718005 285148553 288881150 293224078 296996547 289372969
18914 289372969 269694582 250177342 239223508 239198319 247578202 255171756 255666864 255506486
18906 255506486 257162682 252298035 240535403 231456829 230490348 239716548 256734551 268770841
18898 268770841 263894680 250331180 237482621 220911715 198721743 177106117 159887141
18891 159887141 147100933 137631926 130461103 124732110 119727930 115299988 111251117 107444573
18883 107444573 103799423 100686636 97889471 95228372 92737151 90425821 88314949 86396854
18875 86396854 84846384 83623417 82850011 82676927 83311766 84733895 87311584 91307665
18867 91307665 97025518 104643724 114931097 129546158 148608088 163359382 161439096
18860 161439096 146854123 132235002 122815751 118841385 119508112 124797423 135294492 146757593
18852 146757593 147038768 132407385 113668256 97846682 86154660 77768388 71448431
18845 71448431 66568887 62731289 59532351 56679466 54173171 52246530 50723529 49458416
18837 49458416 48522550 47958252 47725905 47485495 47240794 47156584 47493182 47812856 48067755
18828 48067755 48561032 49721714 51528128 53959618 56959345 61040462 66660891 74190928
18820 74190928 83550541 95769060 112209423 134742971 158999442 169679394 160880657
18813 160880657 146065560 136207231 134243581 138678760 144159445 147559130 153241708 162364737
18805 162364737 164529806 153063724 136730378 124304931 117904664 113856136 105866070
18798 105866070 94424579 83815411 75408694 69153728 64430120 60547812 57497648 54977389
18790 54977389 53042587 51445748 50089056 49078642 48275535 47551150 46946625 46279076 45500560
18781 45500560 44873539 44318834 43860941 43628104 43523356 43325628 43242612 43345485 43768372
18772 43768372 44667214 46230630 48446809 51466089 55518615 61120385 68607637 79007278
18764 79007278 90017282 93309936 86187858 76079884 68283994 63785065 62059534 62859374
18756 62859374 66016663 72218539 79970947 82161575 75184113 64529930 55261487 48456636
18748 48456636 43653943 40140763 37314808 35111612 33268042 31715370 30522543 29514830
18740 29514830 28600804 27682919 27143566 26680322 26153344 25528770 24774999 24090855 23396611
18731 23396611 22709584 22033562 21546312 21107072 20534980 19923153 19639791 19328805 18876377
18722 18876377 18341817 17784083 17108501 16455600 15858168 15382130 14988535 14643996 14184528
18713 14184528 13790434 13402039 13087333 12997177 12755484 12479021 12149502 11827711 11817991 11795684
18703 11795684 11920405 12341467 12766507 12701238 12220991 11693156 11379647 10991508 10572882
18694 10572882 10313561 10081136 9902755 9831234 9788437 9878268 9774440 9486968 9301676 9016440
18684 9016440 8698310 8362807 7944603 7551835 7294287 7030912 6861681 6822496 6785692 6707657
18674 6707657 6565372 6433954 6402608 6409954 6303813 6105847 5858276 5765851 5717443 5711767 5520884
18663 5520884 5376912 5442018 5608715 5983139 6344867 6533323 6654318 6871692 7334327 7792953
18653 7792953 7989667 8120723 8209538 8081201 7922590 7546621 7055404 6428186 5959558 5609078
18643 5609078 5351971 5189593 5209441 5437155 5674181 5889448 5989406 6018576 5974402 5803064
18633 5803064 5560574 5200444 4947974 4859297 4718485 4605384 4677866 4745144 4723490 4832267
18623 4832267 4949446 4825458 4705757 4469693 4247075 4133893 4052436 3894159 3741572 3520146
18613 3520146 3448354 3406599 3480427 3472047 3494721 3508073 3527530 3549633 3534712 3652923 3884520
18602 3884520 4140759 4278164 4164601 3954446 3817620 3542032 3230402 3175795 3175216 3141375
18592 3141375 3184824 3276644 3366278 3362331 3232268 3040811 2999892 3009414 2936916 2760107 2591018
18581 2591018 2544419 2457439 2438388 2314263 2211743 2196913 2177785 2183670 2180173 2213610 2191859
18570 2191859 2181536 2064754 2098285 2197606 2201881 2181679 2241785 2060444 1942004 1862336 1749622
18559 1749622 1604585 1505087 1535654 1656464 1845343 1883866 1731164 1636657 1565420 1562886 1538738
18548 1538738 1313509 1135728 1142095 1198042 1256889 1329849 1372840 1497695 1547819 1451904 1335081
18537 1335081 1401396 1465203 1500847 1545415 1640129 1748476 1624017 1600771 1585626 1519181 1504173
18526 1504173 1514830 1474749 1483913 1523527 1547789 1481856 1546357 1574213 1623887 1668106 1552065
18515 1552065 1553507 1610626 1659551 1716419 1819093 1892185 2005844 2092513 2037756 1964192 1918394
18504 1918394 1879955 1886960 1930914 1882539 1813791 1782636 1847505 1998611 2066307 1967593 2080361
18493 2080361 2260282 2262368 2422538 2548169 2557141 2579480 2699349 2677534 2638456 2594466 2628399
18482 2628399 2733647 2691269 2629143 2631668 2634310 2714818 2745011 2763555 2805846 2981457 3200084
18471 3200084 3267291 3414804 3477321 3287978 3171103 3211440 3439948 3551190 3566397 3656322
18461 3656322 3724503 3809699 3885542 3894905 4031788 4370304 4398541 4604077 4925330 5179951
18451 5179951 5588404 5878502 5919245 6210415 6596483 6893984 7138280 7530314 8051321 8416594
18441 8416594 8708090 9135442 9557289 10136302 10737216 11525936 12551087 13874508 15458297
18432 15458297 17392050 19957616 23374473 27757580 33470888 40622670 49550039 61140409
18424 61140409 76996273 96184806 109085231 106478512 95291353 85979505 81549157
18417 81549157 81919425 86987480 97669064 111516376 117349319 107091933 89528944 74024041
18409 74024041 62833343 54970092 49409399 45419220 42398404 40119457 38468796 37367220
18401 37367220 36423392 35736366 35342149 35338243 35423300 35542363 35742520 35908660 36296170 36920127
18391 36920127 37623923 38349025 38998679 39680384 40702204 42556820 45088174 48574275 53188409
18382 53188409 59098969 66432244 75776198 88198378 104680176 125833613 148587091
18375 148587091 165039601 173672502 176176918 169165443 158390462 152898939 155799177 163985642
18367 163985642 168109448 165779707 163345691 157037353 140286578 119441763 101874562
18360 101874562 88855410 79491256 72651806 67355842 63222102 59916375 57289503 55229432
18352 55229432 53739580 52710729 52186545 52116218 52248796 52112273 51534026 50471275 49176862
18343 49176862 47946738 46925272 46097178 45392886 45011512 45044638 45456531 46052642 46854518
18334 46854518 47994393 49540856 51691041 54678179 58775896 64397224 72562126 83708380
18326 83708380 93379727 94251949 87512532 80478288 76431611 75924813 79258146 86245061
18318 86245061 92768962 90279085 78807847 66132481 56048261 48666421 43235517 39116884
18310 39116884 35984715 33541790 31517323 29757801 28155075 26784880 25790267 24909577
18302 24909577 24113879 23375743 22745461 22197172 21646362 21097861 20503725 20132383 19850329
18293 19850329 19546013 19286151 18867665 18495652 18232053 18094881 17817135 17391257 16696461
18284 16696461 16023973 15399776 14758481 14120293 13438410 12819343 12270048 11699339 11177954
18275 11177954 10632265 9972208 9363790 8929868 8520314 8080735 7700179 7353353 7078587
18266 7078587 6632219 6131943 5813164 5640893 5477860 5277797 5087223 4970377 4751835
18257 4751835 4494880 4344690 4199327 4116455 4128488 4066485 3933659 3774793 3693397 3624319
18247 3624319 3536306 3561039 3539289 3511173 3482055 3252793 3148594 3107565 3148660 3140939 3110726
18236 3110726 2946370 2725111 2565941 2458144 2383750 2279850 2211876 2072192 1998121 2012997
18226 2012997 2093633 1933686 1754823 1771908 1734410 1750775 1768997 1774195 1729639 1646361 1572176
18215 1572176 1580607 1675453 1645941 1631205 1527824 1605088 1678676 1745107 1736897 1764702 1746179
18204 1746179 1849925 1888244 2008866 1954686 2035498 2030416 2023302 2019889 2009902 2017820 2171715 2149909
18192 2149909 2129987 2214152 2251032 2193571 2129871 2013761 2141415 2236620 2228888 2165525 2047375
18181 2047375 2039153 2104341 2063260 2222544 2264214 2254213 2290286 2227992 2170315 2174542 2239687
18170 2239687 2188687 2221423 2421592 2752667 3090623 3386607 3847140 4251212 4383029 4459169
18160 4459169 4457623 4494004 4712184 5151845 5372797 5063557 4482332 4132595 3869375 3605983
18150 3605983 3488043 3444216 3311909 3292246 3295141 3262978 3264223 3214374 3054827 3048528 3178769
18139 3178769 3290042 3344302 3380295 3545769 3622164 3677534 3716813 3770832 3901601 4147189
18129 4147189 4439708 4626274 4937308 5289380 5705610 6257820 7031502 7816299 8801525
18120 8801525 10160286 12028606 14401891 17407904 21273299 26085940 32392777 40468612
18112 40468612 50638436 63712723 82705626 108784342 127044736 118333057 94110216
18105 94110216 72324984 56994505 47088784 40466999 35646959 31967908 29229430 27066579
18097 27066579 25298384 23809122 22728843 21592855 20406873 19418144 18620374 17973623
18089 17973623 17296096 16632569 15906833 15342792 15049789 14909677 14795660 14610783 14257173
18080 14257173 14155043 14155947 14235730 14299936 14211006 13978444 13661103 13202491 12806538 12569696
18070 12569696 12596804 12513024 12286541 12003386 11789860 11348893 10720328 10189501 9859910 9758539
18060 9758539 9577054 9337176 8927496 8421963 7758985 7138694 6811451 6595705 6648925 6797566
18050 6797566 6976824 7163884 7317575 7537679 7781373 7982733 7860783 7615608 7310743
18041 7310743 7164029 7135483 7098101 6780951 6241510 5681402 5397971 5170305 4972392 4761496
18031 4761496 4422598 4103722 3998319 3836514 3697957 3384999 3041036 2923062 2834840 2766877
18021 2766877 2640828 2533279 2417508 2336045 2319958 2318085 2216756 2036570 1985299 1960216
18011 1960216 1878507 1820241 1797503 1636947 1482326 1538533 1698318 1716227 1804347 1778519 1791168
18000 1791168 1919834 2007193 2028476 2063272 2095884 2294099 2405726 2538275 2643543 2637795
17990 2637795 2704487 2924112 3084024 2971213 2779689 2777144 2753927 2641599 2572244 2563418 2510929
17979 2510929 2286503 1952932 1583193 1387684 1339970 1316079 1180660 1015936 1021695 1030932
17969 1030932 1022988 964668 849939 766976 836516 832219 816968 781266 800226 884855 995897
17958 995897 937196 761008 814668 788706 644495 718640 798158 761653 670468 616947 664589
17947 664589 675430 711379 753866 718966 731735 798075 812383 817240 987049 1082108 1087640 1071109
17935 1071109 1015762 1032630 999842 892769 925569 996157 935410 803311 749453 765544 653595
17924 653595 592090 601319 615067 630285 654451 659562 528666 550767 577239 610093 641451 699494
17912 699494 608952 468207 420124 445666 460980 577154 701639 704664 733446 632055 641900
17901 641900 636482 732581 877554 827751 843987 894230 895965 959657 962582 1011631 1057864 1050663
17889 1050663 1111177 1208400 1221290 1155464 1149214 1168761 1244515 1270259 1174477 960244 782592
17878 782592 680401 584586 610514 481564 439163 583475 735774 802443 775636 719496 792825
17867 792825 882556 810899 793764 740771 776362 829950 997522 1082737 1235104 1315128 1248812
17856 1248812 1304847 1335528 1300783 1348906 1547756 1775815 2032585 2073999 1918320 1864416
17846 1864416 1855619 1829515 1684824 1570884 1580657 1700288 1795013 1723524 1735514 1624232 1425139
17835 1425139 1213695 1126265 1159976 1073953 948788 950814 1011451 966689 927012 951324 832930
17824 832930 812235 811734 782535 716022 643639 721045 713924 732773 719027 709576 711527 771969
17812 771969 805488 747818 904213 1042134 1039886 882223 827522 799328 1014922 1257759 1369030
17801 1369030 1459267 1380729 1277468 1250997 1269159 1268798 1352941 1389085 1269956 1173281 1103177
17790 1103177 1023894 1102182 961323 843413 701029 650665 693881 688470 759031 730421 768890
17779 768890 815110 856810 734029 757206 695048 570158 427166 359428 313981 328518 323228
17768 323228 286725 332385 330112 360472 348799 314678 226395 267956 215372 292353 406640
17757 406640 323203 106335 69248 94073 165785 296055 310301 236639 199348 280437 230979
17746 230979 240466 175742 129411 187617 170920 174463 239657 209345 115705 101540 187328 246068
17734 246068 267958 330266 375637 324135 371296 375151 348136 274268 124818 127162 254989
17723 254989 149175 32140 -56594 46837 70690 100080 213751 260010 226648 207189 117359
17712 117359 23543 50970 145175 21305 -93481 -93025 -28646 -15873 -62287 29439 141593
17701 141593 137211 194578 303074 268656 227522 110211 51164 75408 -20343 -77831 -21906
17690 -21906 29873 61143 148242 213342 171660 220781 355218 363471 236421 92560 177958
17679 177958 250384 317636 255573 133750 80718 6723 39152 168417 379826 508504 457820
17668 457820 451669 441610 391282 257802 288200 250356 211433 222867 221602 188170 125445 132962
17656 132962 227569 220232 144857 188253 247855 245509 276389 166832 134644 152953 254337
17645 254337 231763 199442 185596 240091 240592 115412 93932 197846 243215 199854 202843 285439
17633 285439 323087 221112 203228 240166 204939 227257 339700 330653 318502 323251 263045
17622 263045 296703 357456 340900 179358 187825 179184 215771 203267 195229 147812 261495 354835
17610 354835 200546 130910 152716 146543 90827 143338 279618 251308 185384 165873 237220
17599 237220 223867 98804 -24040 35362 287705 284272 247919 262135 299144 270589 238291
17588 238291 212536 243411 220834 238640 289128 249621 243439 201746 174772 260363 415270
17577 415270 436757 396680 379123 371387 258812 308770 206647 148942 189918 224736 260349
17566 260349 240022 203108 122395 199195 293988 316834 256234 254466 388949 400237 421743
17555 421743 586764 693799 767203 730971 803033 850798 777415 681248 616080 512316 578881
17544 578881 793040 1061958 1223635 1321979 1441761 1492223 1509343 1506838 1485913 1454314 1373082
17533 1373082 1180538 1000547 812931 852084 919017 958427 1073218 1200086 1360302 1458556
17523 1458556 1296164 1008817 870023 753670 681843 598464 573668 638956 748794 714487
17513 714487 609753 556568 627726 661348 758828 823684 678979 516426 476316 560221 587754
17502 587754 557507 586465 679252 622298 580433 642950 743365 767611 699975 623328 535343
17491 535343 497106 434911 514636 653115 758612 804354 791814 732558 621786 565598 572880
17480 572880 521916 527701 490404 482296 478035 290776 343810 364636 448532 468524 380001 315049
17468 315049 312064 228119 326856 383480 204951 220187 226280 295512 408265 325620 197871
17457 197871 64541 36387 -57302 -39401 -58912 -96077 -13276 -401 93259 238001 209251
17446 209251 203615 281380 519879 792073 925197 958068 1028329 1085390 957799 734439 595658
17435 595658 688453 717416 685779 577021 604544 656502 616874 579084 509235 292854 266254
17424 266254 351904 412730 436419 416404 434099 495124 425795 314058 304723 248164 277828
17413 277828 384391 252881 200829 295278 278801 218082 269322 317930 258640 241342 238590
17402 238590 275208 309557 373116 405957 363544 344725 181349 135398 58765 -100307 -104866
17391 -104866 80160 169241 117191 104123 242404 232875 272727 327811 256064 298971 275009
17380 275009 257351 257293 318912 285665 279446 220884 175761 203142 222788 191588 255358 376127
17368 376127 385606 340624 228338 145306 142564 125382 100821 100634 138095 106520 101369 122275
17356 122275 189964 329325 374014 328841 234744 181232 241402 204955 113535 -73418 -56453
17345 -56453 12896 107511 134783 -19146 1400 111617 127475 172330 23630 95566 90964
17334 90964 31917 81177 97380 92010 -26619 -29495 46971 88375 69768 -5082 59980 82088
17322 82088 156208 194285 206775 243954 187269 206708 168178 97673 106158 15342 -47861 22780
17310 22780 155636 164128 121451 1557 -40167 50200 33936 117915 199314 240504 267944
17299 267944 253033 179788 228682 225977 204380 235699 234945 248144 287604 191782 220425 291585
17287 291585 392041 363876 492488 446615 398837 356883 439891 394102 296966 214489 235210
17276 235210 264784 329917 391192 274731 218304 79457 44288 59935 130033 192577 216356
17265 216356 218909 217339 128482 242431 374154 347199 282254 353379 295692 316570 282967
17254 282967 272376 365252 353102 255952 121156 156962 242176 332192 329296 346368 382894
17243 382894 392781 325880 377250 283777 495484 634524 725163 717170 640700 730582 793207
17232 793207 735081 717023 742918 827451 916854 792045 779595 704606 704621 725785 708943 710789
17220 710789 581079 455608 379121 401226 413845 519623 614719 629596 516103 320111
17210 320111 254348 422813 427718 400263 279513 281049 341863 388874 416899 325530 243760
17199 243760 157757 156179 253518 385678 443946 344358 259202 180434 238837 366098 480959
17188 480959 473269 373710 305978 191074 209366 262473 176242 129469 151660 212073 309285
17177 309285 380872 389899 246656 233615 176412 141702 188682 243154 258284 252606 246419 188716
17165 188716 201405 215079 272330 363219 360349 303851 207340 209620 307604 355113 336082 356195
17153 356195 410454 502446 535541 484672 365793 339900 321180 297495 390644 526490 350002
17142 350002 216457 291667 468553 647832 594730 566513 560727 475913 532757 537421 542612
17131 542612 544560 552003 603545 603884 607771 577478 580675 530601 694803 826352 702824 634659
17119 634659 613369 614316 640444 638027 668085 612077 525833 336674 328430 528894 573071 660634
17107 660634 688998 665520 732462 752346 795446 754198 653670 727004 797491 804072 832969
17096 832969 842018 768098 839507 875673 794417 796612 725630 842243 961466 852107 805084
17085 805084 758200 849679 979840 1068142 1061472 1100209 1184884 1291424 1374251 1315880 1332506
17074 1332506 1434825 1509853 1714668 1776790 1753583 1783902 1911631 2021992 2063583 2083492
17064 2083492 2146992 2199201 2345675 2515470 2552599 2564949 2715181 2755152 2750810 2697222 2796971
17053 2796971 2927161 3048806 3033902 3132433 3372308 3613890 3624169 3555189 3539908 3621910
17043 3621910 3710134 3826418 3943112 3848689 4006722 4271746 4482319 4468610 4454680 4427822
17033 4427822 4657389 4833932 4975725 5056542 5234554 5406275 5481049 5524444 5813291 6099790
17023 6099790 6339633 6632240 6863044 7169544 7600684 7933695 8389100 8642042 8678202 8844434
17013 8844434 9188052 9734039 10487149 11253649 11996378 12837537 13914061 15099601 16189404
17004 16189404 17355288 18868290 20715134 23075747 26070218 29894567 34702936 40949739
16996 40949739 49128421 59520710 72340660 88333041 109135497 135006450 159446497
16989 159446497 168395645 158050372 140589556 126722358 119606652 119257387 124951912 136221154
16981 136221154 153563802 178242935 207584525 230117585 235579200 231346502 230965626
16974 230965626 237067438 237820244 222573823 197982657 175542414 159928304 151163539
16967 151163539 148557086 151301868 159203812 172771609 191327408 206219662 203954964
16960 203954964 184438550 160102082 139236351 123153364 110978157 101768761 94735539
16953 94735539 89085039 84505704 80771812 77619045 74817648 72446144 70383518 68333199
16945 68333199 66389839 64654588 63082650 61549200 59842275 57943034 55966968 53791398
16937 53791398 51748073 50018118 48432962 46983819 45442881 43961645 42594791 41215748
16929 41215748 39520040 37766363 36095423 34477829 32929807 31530020 30163204 28705000
16921 28705000 27155633 25713127 24406588 23126317 21836423 20579715 19500234 18487743
16913 18487743 17543766 16608089 15654174 14955487 14258599 13446383 12650361 11984337 11354086
16904 11354086 10804621 10131135 9573362 9153053 8756775 8333921 7946094 7483156 7069881
16895 7069881 6668763 6361593 6058727 5700484 5367018 5145823 5000318 4775455 4575541
16886 4575541 4330891 4214518 4034917 3831905 3591458 3340369 3189629 3008444 2855866
16877 2855866 2768561 2698993 2593961 2430370 2214273 2051595 2026063 2019655 1894496 1772724
16867 1772724 1763859 1806783 1776730 1741722 1753345 1688758 1510987 1394344 1400239 1434702 1412034
16856 1412034 1361088 1396481 1562943 1580393 1513503 1514643 1488082 1482783 1476267 1423373 1374696 1249706
16844 1249706 1149636 1058197 929091 815964 799874 792952 863051 997945 949453 911792 903883
16833 903883 931001 827894 908963 873304 842424 844695 823850 797494 948726 958374 904089
16822 904089 872767 835046 763081 778802 802426 736479 825584 931763 1007783 1008981 1055791
16811 1055791 1204275 1171737 1144423 1180476 1137996 1044461 1022221 1163768 1280088 1293657 1253925
16800 1253925 1176438 1214052 1403807 1509592 1417729 1317717 1231852 1340630 1477361 1289327
16790 1289327 1188680 1302761 1370452 1434448 1417668 1360974 1448791 1457242 1438066 1313990 1209217
16779 1209217 1075394 1010435 1055014 1127864 1210332 1057463 976132 1075672 1171198 1141074 1061488
16768 1061488 985522 947746 994144 961788 947193 924788 952924 925450 825939 833754 755938
16757 755938 789071 832097 767248 737020 729412 762905 752844 786597 790247 818987 806609 676525
16745 676525 594004 470405 455136 534204 663538 531299 443078 513667 466676 503786 376317
16734 376317 325052 538883 647156 650181 637959 509342 392608 355220 432539 463965 370106
16723 370106 346484 259157 301405 375214 310107 361338 294539 296527 345165 274966 235100 133631
16711 133631 155465 186864 181430 47797 -77858 -4503 169225 218507 105657 49923 86819
16700 86819 4957 -69467 -20909 22027 40280 81819 87392 131937 116949 35738 4064 10079
16688 10079 53690 92838 152439 126745 153897 119858 53496 124596 229059 257986 269036
16677 269036 215845 271570 373353 356837 300827 244475 196386 8279 19880 91927 91959 170576
16665 170576 218114 238937 155048 177577 227726 279218 242212 284938 314362 183153 154196
16654 154196 145621 156085 290386 360834 262929 212046 273818 358891 299067 142803 82753
16643 82753 67584 49538 94055 303365 351545 280922 173635 237261 373239 358810 377512
16632 377512 450815 424652 374230 331581 357409 262971 137898 66411 19034 115021 64988
16621 64988 205285 233691 275899 174824 157939 184321 152436 26247 26776 91745 191622
16610 191622 180931 153690 183471 149734 94860 131175 196328 96838 182053 182753 68770 -18453
16598 -18453 -17991 -53519 -29453 -95429 -149967 -83366 -25601 -77130 -87995 -22462 -26282 -45988
16586 -45988 95171 61985 84177 155645 86882 101674 73426 129162 -24696 -56057 59046
16575 59046 75382 -24424 46634 155129 162512 52789 -37127 -176293 -177690 -107735 -102533 9122
16563 9122 128911 231174 138299 11933 -20818 -32378 5006 2002 -9633 -8770 -35604 -52857
16551 -52857 -77462 -64825 -349 50851 -49730 -93940 -70251 -101371 -106292 -76212 -132605 -69189
16539 -69189 -79829 -87541 -67754 -93664 -11407 73719 55339 167149 160192 35700 37622 146685
16527 146685 110773 16492 67854 102528 123223 91148 82888 150635 127564 -103571 -198183
16516 -198183 -165089 -106689 -39340 -47823 -67735 -56713 -101137 -68186 -39397 47065 87072 12148
16504 12148 -58612 -60843 10380 97550 43787 48938 136985 179314 76712 21912 82712 -27990
16492 -27990 -7647 -17577 66633 71165 53277 130719 192418 163257 92011 35345 75212 78415
16480 78415 99501 79063 38158 166507 147865 89901 -21822 49955 91249 32125 97317
16469 97317 125134 -8239 -114341 -50221 82980 78849 79555 179359 130365 69051 79803 143962
16457 143962 160448 188376 172730 177642 117503 65321 80849 106250 40738 63280 52516 88627
16445 88627 116095 44258 -974 -31879 16797 -45197 -1737 141927 198805 140480 145145 188432
16433 188432 209261 148487 75804 74558 84740 183667 251636 286472 346186 484149 571962
16422 571962 671245 815404 882776 900136 840449 762365 817919 825529 781540 832981 817771
16411 817771 903889 1048454 1086185 1027551 1087336 1231301 1332249 1318405 1294379 1186660 1026022
16400 1026022 871301 965081 1054180 975727 973413 1081592 1218966 1215215 1210486 1144247 990799
16389 990799 925212 838805 725071 680702 710648 752718 677951 553954 413142 447736 427094
16378 427094 454938 290633 245355 227286 237911 344987 400815 364910 386948 343675 303573
16367 303573 264407 141707 104033 100897 64684 109170 106230 139036 95649 185638 120416 111625
16355 111625 140342 143096 135274 183627 27342 7336 -80443 -54721 40757 144818 134856 58223
16343 58223 71659 22889 15375 67412 118993 51509 -33819 -109524 -100502 -106225 -16202 -27786
16331 -27786 -133149 -117481 -86571 -101639 -21051 -37225 21555 83613 149706 56530 50970 12844
16319 12844 -52536 -231280 -291531 -165173 -50735 -66372 -97761 -120828 -94762 -99558 -171253
16308 -171253 -145075 -84090 -95968 -193349 -148528 -233314 -254037 -140712 -52859 -79955 21781
16297 21781 22575 8175 117115 187409 154558 36850 -37569 31836 87952 -34 -63586 6646
16285 6646 -35282 4918 -58762 -11358 50129 -38385 -190836 -135770 -15962 103646 107821
16274 107821 91149 60073 15439 -53425 -66826 9962 42348 99608 12241 -111743 -141138
16263 -141138 -164600 -218434 -164598 -133290 -192206 -206074 -192846 -174482 -131004 -126528 -25929
16252 -25929 -87263 -169005 -127327 -100014 48155 236943 251324 233091 94301 -36682 -21391
16241 -21391 61511 12558 12187 -12188 -79084 -33839 7264 123652 103375 -38107 -73185 -76107
16229 -76107 -141716 -152382 22987 121872 134110 -35396 -106939 -71988 -93417 -94936 -69046
16218 -69046 -119357 -172484 -107774 -108639 -205089 -228707 -212948 -165041 -4260 4136 -69289 -161455
16206 -161455 -228493 -154855 -166602 -151338 -146014 -27074 131303 115749 -30557 -8303 53814
16195 53814 86590 48156 90512 49350 -51709 -84330 -120935 -45100 42956 9112 -76309
16184 -76309 18678 20864 -7606 -41049 -71473 -6487 -58330 7001 142645 132369 155789 191885
16172 191885 175686 15122 -59722 -7094 44341 11384 -58633 -111772 -24112 54349 67292
16161 67292 -3757 -51715 -57556 -55128 -14155 43753 108757 14345 -26886 10917 -31057 -44469
16149 -44469 8223 21955 15430 -6395 -53684 -131541 -237851 -132171 -5620 -54760 -7133
16138 -7133 -25850 -140467 18748 108916 182493 256977 255585 100222 7348 5028 -11499 12762
16126 12762 5187 25432 70904 -7507 -29107 -42569 5581 -26821 -18502 -124037 -70179 -36161
16114 -36161 -50302 -154917 -139265 -147153 -112715 -87163 -33644 -16600 -90768 -95782 -159767 -290905
16102 -290905 -288562 -155796 -109625 -38014 -47049 -127324 -92665 15503 -9175 -84571 -50856
16091 -50856 -84967 -68028 -57771 -125535 -144980 -132271 -113585 -196436 -166530 -12302 97470
16080 97470 86881 122477 85071 71263 51982 2287 -118888 -148995 -81454 -7079 -19000
16069 -19000 -157579 -202531 -119898 -25814 -121605 -221475 -175719 -192428 -162571 4969 -3768
16058 -3768 -32959 -50255 -102851 -135338 -97797 43396 143871 43502 -87388 -70641 -122807
16047 -122807 -95930 -35690 24351 -46704 -128628 -185747 -174757 -161963 -94882 3921 11207 18878
16035 18878 1811 -18136 -51470 -75958 -3025 28605 1732 -31794 57229 51293 -72802 -167999
16023 -167999 -107560 -88863 -195122 -133383 -128217 -120443 -66337 -52504 -54329 -43831 -77386 -74510
16011 -74510 -117614 -64301 46746 83362 173783 189969 39960 -43635 -45416 -2817 40073
16000 40073 8176 -68909 -66330 -95949 -104986 -110404 -93666 -19290 61637 97035 101852 -14948
15988 -14948 -36600 70644 8091 19915 919 -86469 -71819 -72684 -133386 -87891 -109269 -77740
15976 -77740 -135384 -120216 -76817 -145948 -98963 -80030 -122681 -134137 -93028 9365 69117
15965 69117 119646 147469 164821 127078 133989 71115 48909 -29091 -131753 -142527 -44355 22540
15953 22540 -81652 -50463 -149666 -174244 250 -27290 -58889 -51008 -19753 24420 23623 9266
15941 9266 27854 29094 53542 -20296 -83640 -157542 -143976 -116204 -219364 -222310 -85917 85937
15929 85937 161551 75834 84500 2753 79176 78757 80280 80679 26483 17940 90287 147890 136698
15916 136698 179705 135821 99756 80617 18935 62032 152964 128070 123622 25481 -60918 -115529
15904 -115529 -142117 -155713 -123606 -138565 -93173 -93362 -160132 -82856 -25355 -105037 -137377 -97200
15892 -97200 -209504 -317359 -230393 -222141 -157175 -98400 10681 83931 165813 44913 48124
15881 48124 75232 78229 21229 -6826 109204 104037 57919 71725 57429 26694 36935 21427
15869 21427 -44842 -107868 -103196 -111244 -153879 -110772 -27330 7431 -74275 -99952 -31932 -18861
15857 -18861 -3333 -17188 -52463 -51371 -24855 25712 23307 -38860 -8815 -39541 -87163 -56969
15845 -56969 13504 3345 -99966 -42886 39978 88924 66960 -12033 2280 -71261 -227076
15834 -227076 -219884 -182352 -209927 -71171 89160 174158 97493 116953 128687 83361 -51999
15823 -51999 -135354 -58251 -65530 -30349 -81314 -187225 -19301 57201 103114 112125 81663 62819
15811 62819 89946 4600 -28960 -50594 -195698 -202821 -195550 -136652 -69810 -108868 -174775 -46107
15799 -46107 56844 -7269 -70224 -43264 32161 106945 67731 6647 -112796 -141310 -174697
15788 -174697 -158475 -78834 -36072 -82183 -128275 -88337 -49581 -87765 -150382 -195466 -195574 -77230
15776 -77230 -75764 -125691 -139880 -153890 -136350 -133494 -61696 36361 -20770 -170059 -237998 -161867
15764 -161867 29292 137514 108406 97229 41484 -12926 12007 8909 23100 40982 -70975
15753 -70975 13171 120639 93451 45243 14773 -155 -131899 -213343 -138379 -122797 -122311 -12941
15741 -12941 -26474 -57622 -118190 -97716 -64505 -113863 -57278 30454 71251 56988 46632 -217
15729 -217 -51450 -67328 -134854 -255988 -235517 -141996 3391 191369 152235 94145 11085
15718 11085 -71291 -66380 -40419 8917 23131 117330 201254 180215 193199 84906 18272 40021
15706 40021 -24829 36695 92400 -56326 -136172 -136784 -40845 87738 74989 10176 -57364 -81795
15694 -81795 -81324 -61476 -3054 -25235 -45228 -89650 -44842 1316 10948 -117989 -107554 -174590
15682 -174590 -201834 -279686 -290357 -188692 -179692 -86755 -80540 -77957 -85290 -135862 -117933 -89893
15670 -89893 49574 67069 -40874 -92265 -142845 -81314 86 -132074 -96082 -37217 16215
15659 16215 182018 205399 65716 -24714 39829 -12389 -101533 -110752 -128734 -299482 -278572
15648 -278572 -164567 -16430 -85916 -112790 -64716 -62912 -147023 -150262 -161139 -179633 -215937
15637 -215937 -280951 -241807 -265484 -248392 -238670 -174958 -205885 -218396 -225958 -112681 -42117 28866
15625 28866 32306 -73629 -8437 148949 176569 72885 49816 -6350 -5435 6254 -12468 53302
15613 53302 -17621 -85140 -81146 -64211 35859 145289 184744 51400 -12858 5162 28165
15602 28165 -41984 -71707 -9466 13258 93163 173020 149894 40529 -94572 -81222 74157
15591 74157 99705 57656 21450 26848 -35159 -12955 36089 -45355 -191891 -277193 -157943
15580 -157943 -62867 29449 14386 -18396 -59828 65047 163312 171837 -21019 -34902 -95094
15569 -95094 -84755 -71046 -93193 -82931 -38548 -59701 -33486 -130224 -139239 -125509 -2042 23326
15557 23326 -104838 -115789 -70460 -46235 -85420 -65900 28275 -39616 -203132 -256946 -248209
15546 -248209 -244021 -228808 -100060 116301 213193 198858 95382 -15645 -14132 553 -101266
15535 -101266 -85771 -63184 -40047 -59225 -89790 -49427 -1188 64100 3175 75747 48297
15524 48297 -22861 2238 -10152 123254 67474 77357 121683 98308 68551 53736 138678 162236
15512 162236 158172 120973 38110 -152396 -101145 -60760 -164428 -175540 -240893 -290696 -167599
15501 -167599 -165772 -176380 -209069 -266713 -333970 -213158 -114110 -82877 -2276 -31728 -67490
15490 -67490 -155833 -101003 56818 76308 25417 -51307 -52132 49406 79477 -57132 -66920 -46679
15478 -46679 41267 85188 -36561 -96558 -193959 -70075 -39698 -71754 -49698 -1820 -24668
15467 -24668 84114 78797 93746 76743 -23440 -16794 -1732 8169 11546 17277 122359 101849
15455 101849 39008 50628 -11522 -10195 85595 136962 133475 140917 172218 186258 100599 164549
15443 164549 157047 149679 119510 -27863 -3254 153920 174287 128446 43377 -81072 -56197
15432 -56197 83780 48388 69900 88969 61014 84025 47909 36772 -2553 97622 257163
15421 257163 299871 152080 52401 87365 26431 -125622 -269362 -216169 -112262 18579
15411 18579 -42415 -72373 -46939 -37024 -81804 -51183 78805 91883 91695 89150 22060 -127479
15399 -127479 -131754 -19672 679 10242 109664 56228 -46726 -9528 5536 -88683 -134384
15388 -134384 -130603 -61065 -2336 82167 59738 49959 72785 3480 -85196 -68946 -88626 -98931
15376 -98931 -109284 83615 256149 150823 60843 56752 103452 172659 214547 138811 55308
15365 55308 -65298 46302 219437 110762 1051 29320 43281 -24286 -75361 23364 69394
15354 69394 35217 -43483 -98157 -61682 30852 137325 72399 93903 111231 61088 54968 -73725
15342 -73725 -193599 -265997 -275782 -90147 -25151 -60675 -62151 -8547 49877 -68837 -58767
15331 -58767 -26576 -81571 -8712 102223 97347 8774 -117164 -109407 -128695 -49846 -11170 -67092
15319 -67092 -32157 44691 -9127 -74041 3274 5323 -133136 -198463 -288816 -175322 -152744
15308 -152744 -110192 -61535 -51181 96509 38415 110152 152708 143628 69564 110859 85133
15297 85133 76140 -30003 -54000 -64232 -147373 -226453 -212933 -200100 -279166 -255428 -242360 -301184
15285 -301184 -260160 -134296 -31004 11238 13114 56131 -21404 -164620 -177594 -45165 -42653
15274 -42653 -153366 -107880 -5117 74432 92275 113893 -3482 -97715 -108148 -111971 -121636
15263 -121636 -132020 -148429 -105733 -115325 -28020 37901 58343 33778 62054 123036 73401 -42941
15251 -42941 -42967 51545 24785 -93146 6969 28100 -8742 25639 3751 -42400 -75898 -16575
15239 -16575 47658 -63464 -136515 9677 72352 34839 48826 -20008 29981 27896 50048
15228 50048 115159 210537 157190 162348 58652 67214 104598 114831 -53314 -92680 -80696 -106907
15216 -106907 -48125 70993 114236 14099 -120880 -153595 -98882 10064 7782 -95052 -159735
15205 -159735 -86714 -92263 -87664 62379 33629 -8685 -53511 -85583 -100168 -31613 23926 25253
15193 25253 -26608 -16255 35875 70571 -56897 -121262 -207691 -196562 -102107 -206297 -288059
15182 -288059 -169268 -74010 -69783 -74461 -116186 -106786 -146470 -125358 -103982 -12114 71185 142986
15170 142986 164464 104302 1673 -20743 23759 101371 176260 70169 -25802 -51709 -848
15159 -848 21207 -31948 -32418 -67673 -4633 -36844 -56755 -180646 -215051 -127763 9170 39678
15147 39678 47121 -406 -15779 -17202 -141608 -206848 -143430 -156958 -143353 -127126 -102721 -145088
15135 -145088 -39839 1473 -31733 -115231 -218246 -226117 -75478 -76758 -143462 -79231 -92243
15124 -92243 -149397 -167169 8376 68446 -73477 -128880 -67752 -85410 -131386 -129207 -78200
15113 -78200 -92154 -47115 -35513 -60977 -18668 -91569 -79993 -43667 27925 56102 47152 11741
15101 11741 -37788 -127834 -112097 -129052 -208914 -237281 -87422 85265 68101 87746 187207
15090 187207 156640 61770 89695 105376 41514 -26242 -94691 -48121 34542 25812 -87410
15079 -87410 -65258 -51588 11538 114723 241242 194387 143769 92931 -8722 -53367 3859
15068 3859 102257 211821 81904 13319 -8774 -60986 -110394 -131713 -135218 -206871 -124476 10974
15056 10974 -25537 -184067 -208784 -258606 -261730 -134210 51605 139331 -24475 -26191 59429
15045 59429 -2779 -140108 -94977 -112560 -243978 -183051 -88102 -164507 -231749 -101042 22686
15034 22686 26069 66558 -36618 -68371 -128552 -194130 -143946 26781 78888 68040 10277
15023 10277 -3697 -53246 10243 6231 -120990 -249991 -121322 73916 145671 196339 160453
15012 160453 117501 115936 126334 50423 15128 -101102 -103872 -14233 37320 41537 135152 138902
15000 138902 34363 -91865 -93844 -70818 -21354 -26084 14942 41372 115792 267595 125003
14989 125003 -59504 -36198 68275 94117 -7140 9550 89281 16581 83015 133958 58327
14978 58327 -29242 -97316 -1173 108267 98213 67753 -36894 -20785 60562 -6977 -45991
14967 -45991 65145 82106 17460 -19420 -79030 -66212 -6905 93920 120318 49024 2969
14956 2969 79024 64389 80977 168616 213342 56363 -100351 -163876 -252403 -236272 -125379
14945 -125379 -61236 -96366 -38029 110895 190703 157619 114807 204626 292186 154270 24663
14934 24663 -45077 -71580 -52701 110838 80949 80654 66922 -17883 -29078 18892 32772 -23113
14922 -23113 -100641 -161841 -145255 -91909 -114403 -210377 -204038 -43999 -9772 6327 -102264
14911 -102264 -186347 -184920 -151671 -166059 -105686 -32567 74468 126231 -8411 -100882 -99118
14900 -99118 -17748 -29172 24529 21292 -61317 32220 127694 93540 -77592 -122208 -89510 -99831
14888 -99831 -77984 -118948 -190966 -133646 -37611 -18051 -63458 -127865 -94191 -165876 -140851 -43014
14876 -43014 -25294 -19237 4740 -109168 -207085 -58378 76758 80900 107812 144901 170130
14865 170130 86180 -19312 -56159 -65132 -4210 25190 56663 19888 32130 134338 167894
14854 167894 133024 131921 185412 213684 109306 -35730 -108435 -129208 -18795 -3504 13462
14843 13462 9413 3463 -60550 -142413 -238169 -131189 -86256 -27083 -41120 -86679 -107699 -91044
14831 -91044 -50483 41780 20452 -76827 -103874 -134062 -162564 13143 83134 59860 -32488
14820 -32488 -107565 -109737 -138702 -38954 -98113 -121710 -90118 54660 134932 197706 35787
14809 35787 -39835 -103206 -152357 -91894 -54106 -84034 -86794 -70921 -72355 -23241 34320 27964
14797 27964 -32390 -38958 -9267 52907 41349 -36547 -57388 27715 80148 78556 64438 -145590
14785 -145590 -224388 -138226 -97415 -101700 -202164 -135227 -190027 -391300 -387271 -298579 -194944
14774 -194944 -78206 56276 66335 137322 35661 -128590 -130636 -120267 -144265 -129858 -175433
14763 -175433 -132254 -109893 -181709 -303668 -270522 -236112 -328232 -322055 -236995 -41619 59272
14752 59272 83813 12949 -36902 -16393 6506 -40045 -61634 -128085 -146704 -51070 -74031 -71979
14740 -71979 -40691 -1098 55649 30535 -38052 -2320 16004 41390 -5354 -71635 -66544 41885
14728 41885 32647 21104 59732 54449 -14514 -32695 -50318 -22760 -79388 -108714 -115547 -68221
14716 -68221 -12676 28443 45013 118359 28954 10557 -2748 59245 133572 138763 25196 -94974
14704 -94974 -9340 -2679 -71828 -92005 -101896 32656 -26891 -23132 83348 102924 209779 167329
14692 167329 196245 90160 -6284 -99959 -66480 -87121 60958 131665 97266 46828 -21307
14681 -21307 -131082 -158649 -142616 -10412 99231 137546 32408 -120552 -160087 -100978 -18243
14670 -18243 -25972 -132000 -82595 -117224 -152522 -135036 -57402 -1705 24661 -53296 -132270 -208469
14658 -208469 -126941 -82345 -240986 -74956 37980 92919 203207 33701 14202 55541
14648 55541 153800 167440 69693 120377 -809 -112147 -118703 -30674 21065 122772 244896
14637 244896 141113 -11401 -42885 -138905 -72152 -178755 -208590 -279876 -247085 -189230 -68518
14626 -68518 109957 82044 76989 -34288 -87538 -78880 983 73115 -16317 -37106 -71301 -151856
14614 -151856 -187096 -123093 -50494 -62523 -5817 -58929 -107611 -88110 -96787 -115558 -91062 -111235
14602 -111235 -132725 -129310 -167421 -200059 -208828 -234323 -278237 -293195 -163270 -62547 5174
14591 5174 76456 123359 121349 196386 303898 246317 96899 50470 -9310 -119148 -183122
14580 -183122 -174512 -42336 23664 43550 86493 37068 56785 -19867 25265 127239 111116
14569 111116 56565 -18655 -88748 -37088 -41758 4047 -9380 -48877 45895 24939 -75517
14558 -75517 -55989 -8882 -57943 17054 113491 184776 132547 -2345 27949 29957 83084 7111
14546 7111 -46920 -49193 16181 -58104 -22821 -310 -58128 -123020 -89023 -78605 -108498 -9483
14534 -9483 116949 160223 122392 48162 32677 -22673 -75820 -114974 -103912 -7952 -21434 13691
14522 13691 73826 -2328 -60239 -114311 -62299 -43845 -13144 -124600 -151378 -139015 -76283
14511 -76283 -22536 -102880 -140254 -174278 -238366 -175826 -96776 -13675 -32105 -66867 7373 214675
14499 214675 207506 68023 -21912 -47587 95395 43047 77730 165033 68882 -33741 -188136
14488 -188136 -296306 -259788 -235927 -168659 -104333 -168305 -189450 -224299 -112412 -118890 -15939
14477 -15939 -30295 -91239 -16608 -2387 -106316 -126266 -29130 32906 134854 78624 56292
14466 56292 136093 111377 96183 56234 23442 30895 -44331 -43440 -118032 -114421 14266 144310
14454 144310 77875 -40105 -162737 -282074 -214630 -113042 -29657 -48514 2800 -30148 -85341
14443 -85341 13542 97626 15828 -124889 -113602 -163989 -118381 -18907 -84539 -65048 -31752
14432 -31752 -30214 32419 27203 49784 125904 -35487 -75562 -62635 -2496 63291 45938 -29362
14420 -29362 -10416 112464 200193 106471 -31600 -111281 -16452 19268 -13870 -68002 -98200
14409 -98200 -54910 31350 6493 -5115 -162 -30128 42062 79167 11462 16297 80347 -25580
14397 -25580 -129200 -114355 -79965 -62401 -44514 -3295 60336 7031 38642 64150 59836 43732
14385 43732 57331 175809 226887 148078 141951 117273 103440 23186 -72589 -80725 -26948 -8535
14373 -8535 -9782 -63432 -67429 -26480 -6938 -45752 74803 75953 -71433 -88129 -112850 -155486
14361 -155486 -157089 -184236 -59344 85816 158429 175906 78019 38509 -16633 -31136 -35636
14350 -35636 71848 100927 143183 178996 158535 128883 231254 199982 32056 -95828 -22242
14339 -22242 -13281 -39890 -132009 -138686 -53643 8106 -15012 50344 115648 8748 -56897 28315
14327 28315 46675 97066 112297 -36823 -23649 41805 119258 68447 22797 11875 32750
14316 32750 67911 -3731 -21547 -89325 -118165 -68009 117293 159425 60387 52953 -24811 -36495
14304 -36495 -54023 -116073 -116406 -200817 -160244 -38696 19089 28422 77947 2124 -143736 -181023
14292 -181023 -146718 -69523 -29090 131889 261411 195652 164843 191323 164728 280 -71996
14281 -71996 -137319 -118113 -35198 -88134 1655 35079 -92999 -162954 -164023 -45529 165755
14270 165755 106961 -91559 -197428 -211979 -91968 -13508 -64437 -42958 5774 77198 112419
14259 112419 97191 -64101 -135600 -151604 -66091 -63429 -77747 -15778 65801 2763 -26371
14248 -26371 42346 34972 -29746 -86615 -46603 70987 -15977 -4731 1362 -2332 -26531 -78575
14236 -78575 -55312 -80186 21971 -1516 -24361 -22752 107491 192385 91207 14950 -16969
14225 -16969 -4207 57681 -51418 -56328 -17488 -23778 40696 125655 69005 17860 -16856 -78934
14213 -78934 -167051 -190858 -88598 -23429 -98859 -91140 28370 -6383 -54174 5430 -104035
14202 -104035 -113771 -39590 -21077 -5633 -38004 31560 75955 143311 74236 -48024 -103372
14191 -103372 -64712 -37690 -75297 -32884 -21343 -115059 -81057 -16866 -110096 -132394 -92013
14180 -92013 41437 61348 -43655 35330 112523 78169 11984 -54893 -58401 27617 55910
14169 55910 -2819 -46221 -175754 -240332 -213574 -249216 -174865 -116484 -82805 -145088 -160565
14158 -160565 -99341 -57915 -158786 -227138 -266119 -284935 -205051 -162057 -86067 -32460 -27252
14147 -27252 51180 134496 124202 172545 84261 34996 -126293 -205709 -97819 -74127 -81649
14136 -81649 -111345 -51827 58623 40613 -2980 -4074 10295 -75471 -128295 -155221 -37212
14125 -37212 -182 -35173 -66870 32410 126982 163546 89375 31854 42272 28610 9904 32213
14113 32213 -38470 25439 -16825 -124739 -117918 -2865 -59193 -46884 53632 -10131 -86348
14102 -86348 -7796 29265 -98195 -104472 -130173 -172717 -61133 13748 -67194 -97435 -96001 -114332
14090 -114332 -24526 52925 31931 -33070 -8607 -21339 4229 65633 31523 31246 -6649 -74951
14078 -74951 -99336 -177881 -187668 -172685 -20078 20630 -87686 -163293 -163116 -16562 444 -16452
14066 -16452 -48959 -77589 -109350 -95272 -22109 3204 -71337 -66986 -44854 -88108 -47920 61712
14054 61712 113438 39675 61349 109183 -57699 -155300 -114446 45779 65654 -10180 54108
14043 54108 15235 34326 113155 23238 -87176 -131742 -182998 -234457 -191558 -166759 27393
14032 27393 183726 98062 -19648 -53593 -30175 -102237 -228767 -306430 -207217 -114842 -137324
14021 -137324 -219203 -316383 -205062 -145084 -149043 -133317 -146435 -14663 34232 -14771 17590
14010 17590 14749 162467 124173 36630 109817 78452 -77105 -196611 -220200 -139743 -119160
13999 -119160 -163265 -79803 -83360 -117976 -203236 -153269 -42789 -44513 -64598 -204689 -290569
13988 -290569 -212889 -131578 -114344 8346 109014 164382 54688 73167 198554 195811 147584
13977 147584 78578 53843 25955 -15469 -66440 -20035 22904 29949 57713 -11665 -84343 -65479
13965 -65479 -216144 -163328 -114380 -97543 -339 -37332 -17597 75537 38117 56560 42558
13954 42558 3870 31676 150580 128734 50317 -50851 -63195 -112568 10945 125316 99654
13943 99654 -17443 -136543 -185919 -111503 -52025 -13536 -119786 -194461 -178997 -123386 -44580
13932 -44580 28077 -259 -98036 -124446 -158334 -141724 -4806 -82169 -207332 -121200 43700
13921 43700 -69647 -82359 -23641 -19558 -76855 -150056 -113315 -102517 -113901 21705 -32622
13910 -32622 -129907 548 -56288 -131341 -239675 -199958 2248 91855 143294 119692 90343
13899 90343 26585 -73286 -225313 -167319 -102985 -75722 1213 -1805 96748 120898 144923 99279
13887 99279 47499 -22839 -38245 -19288 -37866 -32908 -65144 -111496 20976 49960 -63523
13876 -63523 -67433 -82106 -138809 -41661 -14475 -33761 -6700 55588 93292 91953 75150 -26361
13864 -26361 -79946 -170554 -109845 -53796 -86629 -20054 -35363 -50634 91831 55843 92909
13853 92909 73098 -67172 -157420 -139168 -235530 -119777 -27205 -463 6897 -33628 -17333
13842 -17333 -23265 107139 139721 111202 119480 248583 270803 129665 24963 21764 -90062
13831 -90062 -178528 -77797 62501 146084 63762 -66831 -30737 95757 55982 -74148 -144087
13820 -144087 -220327 -90010 154228 221703 182538 68745 59745 61391 25413 -51446 -91232
13809 -91232 -80631 22950 -15310 49765 -44377 -152257 -159539 -109999 -81602 -3971 17264
13798 17264 -17868 -32224 -35031 -46088 -46037 -116384 -109628 26075 -23958 -40549 -23224 16777
13786 16777 89365 83813 40818 -52046 -97790 -38656 -23068 -23455 10432 20657 -25734 -42234
13774 -42234 -69314 8225 89637 60457 119276 169089 127203 9027 -61644 45350 149998
13763 149998 227920 216240 180712 163750 169539 150970 114130 16173 54384 23875 67847 153547
13751 153547 80723 10875 -463 -14678 -4876 -6568 -10469 -23645 -121770 -146868 -98258 56506
13739 56506 57067 20228 74871 44429 7770 166502 22705 -89309 75157 1156 -139883
13728 -139883 -125006 90609 150593 -12800 -22753 171238 249762 216493 75330 48690 86837
13717 86837 5387 90212 35061 -19546 13623 85091 -15168 -85537 -105458 -115147 -14905
13706 -14905 71992 36820 -105651 -109702 -157495 -85383 71511 109314 53798 45858 59519 98673
13694 98673 57522 134511 224805 222833 193618 43979 -26842 -5388 16883 4663 -78984 -219112
13682 -219112 -167666 3312 90980 8152 -33136 -16475 -17319 -16557 36939 100779 64192 -41586
13670 -41586 30284 29073 33833 121782 53652 -47028 52987 199507 211486 40270 -23458
13659 -23458 -77333 -59888 -95102 -75850 8366 41172 -17643 -49776 -75710 57382 138244
13648 138244 81822 -37765 16171 28658 99229 132518 154698 245398 200008 36653 -59722
13637 -59722 23009 37560 79154 89612 77312 -23268 -18759 -128478 -153948 -94441 -67818
13626 -67818 126341 187544 59717 -10451 20219 146036 142259 114539 40994 11509 8446
13615 8446 -20163 81397 39471 46337 33222 79304 86007 -69589 -99488 -40090 62290 150537
13603 150537 177026 179324 137833 16215 -52945 -33369 -53585 -62327 -88139 -121592 -81428 -4716
13591 -4716 -57264 -105568 -32283 -31601 -24330 -38228 12738 -2534 147774 232236 230994 314891
13579 314891 251736 135471 108276 125689 162397 119302 -12672 -54904 36303 63252 66415
13568 66415 154959 157189 103789 -23777 -106894 -153485 -115165 -118173 -114659 35096 56090 28796
13556 28796 7077 8561 112700 89741 -95648 -98124 -115669 -73304 -15390 -20617 37325 115934
13544 115934 134757 213636 153092 89111 108192 172276 215609 249439 181868 186016 128631 90643
13532 90643 837 -53271 -108877 -28323 -101764 -67055 -24325 54809 125924 175529 154271 120597
13520 120597 112592 39397 76016 93083 145571 31827 -78670 -110763 -78338 -57222 -141
13509 -141 8148 -55420 -31100 88907 44397 51044 49816 14650 -17420 -94771 -94912 -156649 -162768
13496 -162768 -131778 -125222 -93666 -113275 -86346 -2956 40542 38011 6546 52250 76962 57858
13484 57858 -21603 37447 59959 74895 -28095 -75635 106585 138199 37763 -97379 -107414
13473 -107414 -90259 24946 45599 80581 85881 79811 25947 17813 39778 51268 -53020 -174255
13461 -174255 -138967 -67863 -5987 -35605 -28271 60450 192066 110085 33773 57623 -6160
13450 -6160 2192 -4580 34029 -112289 -173376 -145299 -83908 -82308 26765 22344 63272 2140
13438 2140 -119489 -136618 -151173 -161575 -136206 -56319 -52026 -131783 -151810 -189162 -208237 -262137
13426 -262137 -219408 -110639 -114109 -68634 -50607 20177 61961 23916 -54551 -10882 32535
13415 32535 94996 98342 85856 38124 10799 -43101 3153 48167 12975 -63155 -83912 -154256
13403 -154256 -163746 -137038 -211882 -135980 -24353 21718 96777 80749 158769 174323 86213
13392 86213 66399 45727 14949 -4285 205799 247777 138502 91577 -17598 -66058 -31111
13381 -31111 26283 -18192 -58590 85885 135072 9141 11864 90613 198988 178278 93946
13370 93946 -18833 -17900 3866 19057 -8368 47502 62840 10940 13692 35415 -20069 12043
13358 12043 -10836 -1403 -37939 -42975 -15604 -43936 -40644 -61917 22938 98833 64922 2589
13346 2589 -65026 -23492 -64809 -39498 -70365 -72167 -73170 23224 -25527 -45224 66545 102619
13334 102619 7016 -52890 -8329 15951 24395 -22350 -118196 -214562 -294836 -160259 -133124
13323 -133124 -76461 -160697 -272522 -266274 -257128 -204086 -153400 -246882 -266623 -195230 -71181
13312 -71181 11990 -26377 -61257 -116130 -155760 -221464 -186295 27926 114505 210027 212032 131199
13300 131199 131293 123293 44313 -56666 20185 145860 -25484 -189573 -98499 -1418 8316 -47051
13288 -47051 -50164 -26596 -23277 20797 38483 -17295 -145419 -172028 -113097 -24820 122860 117916
13276 117916 99313 -63943 -60324 2644 76330 90023 -18821 -96264 -88221 46714 99944
13265 99944 25072 -39060 -48423 -22042 -29411 17838 -101 52200 -35006 -50532 15349 77429
13253 77429 99047 -27739 -54003 69770 45855 -27985 -94456 10040 71148 -52546 -108591
13242 -108591 -58995 -37893 -22225 54089 89611 140278 110520 46702 43989 62913 45375 86768
13230 86768 39926 -43 -39914 -29045 92850 89243 15679 -147164 -96396 1422 -59766
13219 -59766 -91215 4999 45328 -15704 -122953 -158863 -54259 950 81568 -19499 52064
13208 52064 93935 -75009 -187816 -97605 -58805 -88249 -148689 -156424 -66186 -55675 -48068 -36676
13196 -36676 26294 14047 -31048 -59729 24342 73624 114832 119344 103349 136081 178976 211707
13184 211707 -28599 -156705 -199903 -164862 -144655 1108 27145 -97762 -42091 49218 64572
13173 64572 42729 -24976 -124316 -110556 -168141 -157725 19998 101903 110222 35096 -4936 20412
13161 20412 -3165 -75291 -119338 1542 39236 21318 62834 111464 74142 -52876 -53116 -21490
13149 -21490 50153 175487 181230 117533 -13326 -29607 -20119 -43372 -29026 7901 4895 -74798
13137 -74798 -106229 -17324 36514 5193 -30324 -131209 -107512 -137801 -196019 -218477 -97539
13126 -97539 11810 11215 84812 152096 91004 -18809 -160221 -284316 -231973 -69437 27856
13115 27856 122061 93002 -37266 -6331 21985 8290 -6856 -35806 7898 -21148 -46601
13104 -46601 43754 50961 114724 118905 2425 -10380 -26991 53483 -25957 -116895 -109671 -74114
13092 -74114 -116058 -125082 8909 190410 184078 113220 142482 191837 6865 -111886 -169309
13081 -169309 -74449 -70659 -122951 25923 85589 -57064 -76161 -59006 -47797 -30596 -17899
13070 -17899 74202 25133 98826 191948 105638 115448 172441 220635 121498 -66414 -143512 -200514
13058 -200514 -231824 -149794 -137851 -144496 -85847 19037 -15081 13741 19615 100916 54582 75129
13046 75129 -87109 -114545 3486 124766 106171 46058 79390 181492 180772 56074 32772
13035 32772 59187 93625 161818 187361 101550 -4301 -126102 -131132 -54576 -65497 -114417
13024 -114417 -149264 -165578 -57661 -5414 29469 36409 10849 39261 122605 194709 149303
13013 149303 3817 -78411 -6560 -70459 -26072 34971 6898 -50529 -39520 -98318 -145032
13002 -145032 -69243 7461 -109418 -167500 -145167 -256557 -285732 -182903 -134707 -209958 -89416
12991 -89416 35685 2250 3575 -130142 -148515 -18806 -56261 -81266 11711 64192 130748
12980 130748 33669 -108513 -168615 -188444 -184902 -148601 -134483 -70142 -96688 -31270 -37217 -63171
12968 -63171 -39080 -73978 -135308 -162650 -207667 -134490 -110774 35024 24532 -14600 -46083
12957 -46083 -62530 -115351 -149998 -80142 2760 -154686 -99918 -100609 -62763 -13941 -53997 -63708
12945 -63708 -32027 18940 -82962 -94941 -77505 -81851 59272 43145 -82877 -142068 -140513
12934 -140513 -60345 77246 54827 -43791 -167310 -119989 -96567 -78710 -111360 29777 212064
12923 212064 129614 45081 -53620 -68427 -70895 -155467 -256278 -252782 -219107 -142877 -104909 -176529
12911 -176529 -253593 -196569 -61664 -35524 -52422 -9657 44820 91303 11269 77663 121439
12900 121439 139310 167050 136391 32799 -19685 -5121 -82616 17602 154626 63392 50894
12889 50894 186178 112197 115934 -28606 -107312 -93729 -111113 -95444 -73062 25813 57535
12878 57535 34677 -6539 118678 285327 197678 57114 -14355 32773 45355 63606 146
12867 146 -100093 -40696 64703 156560 78038 -67449 -87610 -68826 -65461 60513 116651
12856 116651 95789 54931 -124849 -188735 19903 131951 65597 -27869 83877 175637 5248
12845 5248 -20605 -66263 -204636 -122606 5401 56080 34926 18631 66309 60991 90388 11332
12833 11332 40373 -40494 -30145 42219 142267 98606 13573 -51069 -57995 74008 151021
12822 151021 52448 -34488 -16905 -27574 2375 -65673 -55273 -54540 -132380 -67996 -82347 -67370
12810 -67370 36925 52686 29118 -30232 -17013 22876 13674 -10315 29927 64354 9902 2760
12798 2760 89914 199811 177288 18989 -30746 36540 94317 136231 85582 28233 9358
12787 9358 22878 86673 73340 70994 173830 162594 74092 79488 23349 -33124 -95570 6677
12775 6677 95817 42682 -52721 -14975 33354 46566 44742 -77106 -174530 -85740 -58102 -76963
12763 -76963 80692 62310 -46580 -96614 -88828 -71266 -88469 -38447 36255 110111 -6345
12752 -6345 -14990 -43804 21974 95037 189580 107182 -11580 -162364 -230657 -200649 -242947 -132823
12740 -132823 -95578 -73002 -78568 -42662 14171 -17716 99955 185161 183864 114563 12961
12729 12961 -77761 -144610 -129629 -45614 32922 103375 21430 -70356 -530 8585 16737 9171
12717 9171 71008 82903 136671 25590 -90246 -213039 -96821 -118245 -84072 121122 52254
12706 52254 -173765 -296079 -213517 -149369 -119472 -86097 -76836 -56255 -111160 -163001 -127153
12695 -127153 -99834 -10894 119397 121526 98571 12313 -39247 -44420 -9821 8208 -110772
12684 -110772 -154782 -33141 5404 -59261 -102970 -200911 -38476 9500 7690 113682 144861
12673 144861 36042 -49354 -110679 -99991 15772 45050 -30404 -52226 -89318 -107354 -122317
12662 -122317 -35865 7862 -129699 -200232 -186691 -152730 -76959 66726 70547 47444 -102090
12651 -102090 -175411 -48623 64179 165156 72362 -30333 -34364 77340 160249 76478 -56264
12640 -56264 -15496 -2833 -22809 -9618 -44274 2691 17667 20912 82638 68296 8781 -110377
12628 -110377 -166683 -147060 -97784 -55249 -71598 4455 43510 -65999 -52662 -25114 -228096
12617 -228096 -368926 -283455 -146931 -30004 28834 58797 73541 13955 -19549 -14211 20476
12606 20476 23028 -9235 -41467 61762 121635 134586 83340 104420 325135 309599 202125
12595 202125 144482 267334 199121 86954 -18021 -3323 44882 61909 49304 24834 166457
12584 166457 126843 38827 -33718 -47898 73089 150188 70587 47733 143297 89479 43602
12573 43602 11762 31476 80559 38487 -13000 -34261 -17884 -119574 -64181 18784 32298
12562 32298 -87685 -1633 14385 -44380 -60943 -152174 -201348 -79764 -3274 -57123 -115865
12551 -115865 -138188 -20004 -67470 -70830 -26353 -44044 -115341 -90126 -10947 -31502 -25324 -130107
12539 -130107 -111262 143130 197966 173938 182917 117274 29171 -18955 -60415 -131431 -152224
12528 -152224 -141326 -169758 -153375 -4681 121063 89789 7032 6427 34314 40246 92980 68136
12516 68136 23630 -19539 99089 158215 169378 171214 -15814 -108122 -140638 -37646 66544
12505 66544 120559 84258 -33228 -77238 -51984 -24257 -57034 -6109 -22451 4127 75446
12494 75446 41909 19864 -39130 -40677 -32641 -49193 43669 -1565 40695 86323 39137 -28933
12482 -28933 31396 39242 80732 82807 40488 -62138 -153225 -181356 -23341 35956 45830 10063
12470 10063 -129402 -179211 -180893 -111849 -86131 -58835 -16576 117046 124406 104994 79686 147547
12458 147547 181870 113559 -9978 -18164 16197 20408 -25555 -117142 -69540 -55925 -63311 19286
12446 19286 -48550 9257 44723 11827 -62049 -96828 35235 71463 -15248 -105057 -112363 -42740
12434 -42740 -102805 -95377 -86846 -20553 -33194 26767 2567 -13456 57256 27581 -119969 -214512
12422 -214512 -78878 -716 -90216 -53795 -88614 -241856 -212739 7050 -26591 -11208 -46135
12411 -46135 -58931 -85382 -26874 -12631 15114 -118579 -99191 -41242 -41285 -207275 -259031 -200857
12399 -200857 -108779 -66538 -63548 87323 86346 -4394 -27465 -2449 25914 -17964 -59795 -4741
12387 -4741 61993 -31900 -42334 34060 -22846 -78098 -127067 -148145 -212150 -189483 -98684 2595
12375 2595 -1208 -64476 -4939 69465 53624 -48076 -85268 -168761 -109762 53769 128221 65309
12363 65309 -68112 41609 -18341 -192143 -181405 -141848 -54017 -28800 -9641 51365 -49322
12352 -49322 -199140 -217665 -165415 -140770 -88587 -80391 16359 92669 65862 103526 61198 -34561
12340 -34561 -24232 19059 4796 52880 51498 79054 59938 -887 -14602 14634 19130 107373
12328 107373 70147 153783 223084 219896 231966 293821 269376 170743 113936 47693 -28782 -38687
12316 -38687 51195 101397 -40414 -13052 5895 -41177 -27203 3749 -16219 4111 28854
12305 28854 20255 96435 130079 46639 38834 -8826 21611 -72909 -223578 -197076 -60850 -67654
12293 -67654 26261 44072 -97771 -70935 58771 126335 102188 74768 156373 774 -124998
12282 -124998 -56635 59018 21059 53677 60795 34507 -51529 -177310 -139934 -153614 -109645
12271 -109645 -23567 -66673 -102157 -31974 -84533 -69460 -35501 43188 117489 160096 110228
12260 110228 99060 72343 24821 -31868 -52587 -26803 -15096 17520 17643 50230 -73292 -100217
12248 -100217 -106855 -105900 -144380 -74621 -84274 -253783 -160420 -94245 -112490 -216229 -161454 37149
12236 37149 122867 15678 -98036 -106360 1216 2172 27535 -73432 -75830 21289 -76311 -84989
12224 -84989 66838 57779 74103 93158 95263 67229 27295 -13152 71249 105070 120099 91280
12212 91280 136243 37888 98771 58959 -32121 -23972 -62861 -35836 6532 -48260 -21830 38283
12200 38283 106650 84841 114107 42880 142837 247211 238279 158297 92424 83135 -24766 -99368
12188 -99368 -18919 -18830 -53168 -33566 -136168 -115748 -96968 -71547 -71174 -72604 -109010 -200220 -159245
12175 -159245 -112685 3642 46642 -17822 20896 -96347 -126376 -167527 -120733 -61090 -21222
12164 -21222 66072 89801 49254 46836 62622 123440 112847 58227 -133207 -93941 82591
12153 82591 84864 52180 27245 46145 90848 66188 21322 -2448 -31399 -109100 -163530 -121923
12141 -121923 -132670 -137873 -99886 -124679 -94580 -149789 -29413 -27509 -68456 -68654 -125978 -233418
12129 -233418 -143590 -100006 -56961 -29632 -145609 -298186 -364608 -331926 -195351 -199569 -202333
12118 -202333 -2355 173535 103230 33532 50813 75722 -25165 -46627 -74416 -71656 -82318
12107 -82318 -123463 -108718 -17663 13501 -86885 -44457 50531 -20186 -57168 -134535 -160239
12096 -160239 -50612 -4545 242 -35360 -10704 -44795 -140838 -161720 -128470 -208305 -182982
12085 -182982 -105481 -175277 -234005 -130746 -2057 40522 15944 45060 5902 -10303 8479
12074 8479 -866 32355 -60992 -63432 -53978 38438 21927 -69107 -14845 96781 117442 -1184
12062 -1184 -26894 8625 -10735 11788 33595 40209 -34653 -21190 -62364 24927 95487 -25005
12050 -25005 -73266 -22763 -52570 -202240 -111231 -84872 -82090 -78130 -89968 -56664 -71099 -83982
12038 -83982 71290 82917 46116 45567 -61411 -138211 -112650 -102930 -101090 3198 166505 230799
12026 230799 178194 -3859 -34749 -23478 -45610 -97824 -125903 -57216 -80995 -14629 -47641
12015 -47641 -122934 -103644 -136880 -100086 -63876 -18998 -69664 -102039 -83460 -33359 25190 67794
12003 67794 48341 -639 -85371 11014 -22164 -84694 -37345 17950 -40684 -105087 -39575 -92386
11991 -92386 -93098 -76982 -42271 -51500 -91825 -189210 -81504 -14396 -82601 -135108 -34615 -68886
11979 -68886 -293970 -309436 -65202 -65261 -29326 -29972 -43122 -28193 3483 -1338 -32090 12295
11967 12295 98726 104364 -10264 -189147 -193535 -105767 21721 44670 -49659 -11660 -20576 -57804
11955 -57804 -126980 -116755 -63673 100448 265471 258005 153358 88543 54748 125569 106597
11944 106597 66412 155554 80577 -37156 -3715 5581 -12892 -26671 -42202 -123449 -146973
11933 -146973 -188397 -118035 -64832 -105709 -96924 -103161 -49689 62159 130025 51825 5199 29822
11921 29822 187758 219903 194834 133969 110782 92726 136055 241316 182403 201233 250821
11910 250821 88410 35183 177625 210481 78393 -4948 -123633 -157411 -315062 -222966
11900 -222966 -209228 -2791 103820 -20479 -99874 -69532 -65633 -111534 -96979 -61716 -94164
11889 -94164 -99826 -47650 -32626 23388 32345 79157 153824 245043 141293 14044 -74756 -92062
11877 -92062 -110833 -58835 48359 2261 13473 22582 -456 27018 78279 -11447 20654 44943
11865 44943 -45519 -11362 -145895 -226234 -208930 -188290 -82524 81827 166736 182930 153032
11854 153032 21412 84289 76467 44771 170052 201858 138768 22436 55104 9223 -79453
11843 -79453 -67468 -99329 -43011 106030 199459 80289 -21809 -74269 -41107 -35453 -1526
11832 -1526 -148668 -104554 -88098 -105178 -121725 -100574 12869 -26096 -65444 -154239 -165014
11821 -165014 -52162 -2587 -13657 72300 22564 -32539 32608 35517 65151 91314 120509
11810 120509 69443 119798 33527 -117330 -163388 -84846 -28701 62832 41851 51878 115297
11799 115297 -880 -50308 -85923 35519 134141 203638 159455 75992 -10643 28150 26709
11788 26709 58349 33973 48421 104425 111484 45124 -127118 -292258 -276820 -223784 -132701
11777 -132701 -63491 113684 151378 106325 68646 109316 170247 218884 223902 142222 -24901
11766 -24901 18368 -89738 -203875 -151516 35805 160986 116599 139069 57778 -17428 15309
11755 15309 74165 45522 14085 15060 -63081 -107571 -64530 -54347 -64872 36286 94149 -6037
11743 -6037 35553 109718 133112 67856 56493 106931 77884 107080 129685 44481 22560 35056
11731 35056 9268 -200 46125 23592 -96132 -166540 -222831 -136180 -143788 -125732 -121475 -205730
11719 -205730 -222478 -54451 18584 23754 -2254 10513 34163 -17829 52502 32030 14378
11708 14378 -2076 -116362 -134822 23747 8003 -52063 -91499 -223294 -217632 -123595 -85901
11697 -85901 63930 63861 130277 148891 208091 199986 110339 72146 47151 -18604 35916 86213
11685 86213 -22196 -71590 21547 42418 114434 152085 144409 94799 137504 172825 152450 152855
11673 152855 129137 185155 42130 64887 118944 38688 -53009 -5649 59464 111156 44553
11662 44553 9042 -20058 -20434 53534 -10479 -2930 -2357 130111 139340 123286 157783 166532 127483
11649 127483 42503 91444 78941 5664 -32409 -11405 -46808 -78421 -140676 -95795 -64849
11638 -64849 57353 160683 125854 160269 259032 139856 -28047 -49054 -82365 -59333 -45050
11627 -45050 -90400 -43608 43069 104063 93971 137623 168659 134831 149629 128592 23822
11616 23822 -5733 52370 84673 55463 -27983 -113641 -174944 -195176 -127295 41012 81383
11605 81383 36217 -32399 -32846 51879 8704 45540 88960 114831 127472 95229 34450 -41660
11593 -41660 -42234 -142756 -189004 -163727 -128171 -215091 -150661 -47321 63224 128924 251453
11582 251453 280798 151125 98204 -11850 -46909 -25770 8417 -67321 22840 -11522 -21481
11571 -21481 16242 51684 15827 108299 -31599 -132665 -31713 116200 207173 158399 7907
11560 7907 -98894 -214343 -236258 -104362 -29283 -90485 -124076 30934 11106 -56593 16088
11549 16088 118864 150697 127891 78680 69226 -44908 -11048 35494 54793 44187 -4015
11538 -4015 93098 141429 -47862 -224438 -222671 -100187 -62159 -8679 444 50982 68760 2492
11526 2492 -32074 -16411 -47643 -4915 19408 52039 69858 -23596 52304 -51153 -49655 -51685
11514 -51685 -153551 -216855 -216172 -172693 -144596 -93750 -53991 -66631 -12068 12734 -67565 -72216
11502 -72216 -96080 -110426 -150373 -130916 -79100 -89731 24833 66043 -16199 -60751 -53812 -45048
11490 -45048 -37601 47536 48801 20582 -6670 82168 10965 -16933 30274 106401 160409 246043
11478 246043 146255 20684 11044 9618 -138121 -204596 -170504 -190512 -226175 -196883 -127044
11467 -127044 -98940 42008 104111 66638 86368 30291 3866 28454 68978 187576 49969
11456 49969 -37701 56091 88962 44679 5565 78883 109322 52753 -131415 -149810 -85859
11445 -85859 61858 -24800 -39485 40936 96998 66109 3675 -12635 72488 147188 132070
11434 132070 98747 223954 258587 244302 243577 296236 342309 419260 327410 301556 259785 212598
11422 212598 46334 2002 89067 120503 46935 11493 65377 45798 50320 43739 18069 104748
11410 104748 135674 111932 59982 145610 240680 236482 220157 210256 155484 135721 147724 114821
11398 114821 138012 74161 -52280 67111 202107 89660 -72519 -70639 -1369 63060 -28229
11387 -28229 -147414 -72621 42637 13356 -5448 68470 17396 -94095 -13237 -36115 -15585
11376 -15585 -20939 57617 71158 118668 71625 14704 36963 1025 8180 55839 71932 16354
11364 16354 -47938 -41300 -34278 -116447 -80769 19699 53888 33471 66309 56177 47113 92674
11352 92674 75329 3466 -114962 -327543 -299149 -60906 -24321 16085 -7476 -135642 -109049
11341 -109049 -37965 -36050 -18001 -21702 -73858 -44344 6570 74995 6681 28862 109238 88252
11329 88252 207052 316647 303731 330800 238593 183255 171187 129247 189254 236757 95084
11318 95084 74316 137578 146198 79687 105969 44474 -3843 99935 112743 52148 84256 104222
11306 104222 97770 27245 -75148 -132478 -239596 -154114 -4223 71384 -29068 -70606 14574
11295 14574 11323 71471 147249 104596 113300 156052 158688 218612 352599 494824 472074 422664
11283 422664 542100 844590 986939 1128837 1156478 1095461 1093861 966506 685041 504622
11273 504622 305714 245131 247242 211497 196216 203769 259777 250645 264991 267024 269508 223742
11261 223742 166694 202328 255341 208159 299394 372250 354271 227723 126637 147447 287673
11250 287673 288220 314899 387528 313927 252088 192481 189557 175260 150320 116894 74127 39343
11238 39343 12555 137646 156600 85268 77610 129580 79814 11611 -73081 -111558 8162
11227 8162 79006 103068 104277 26929 -58280 56467 149470 176564 52197 -89243 -83066 -13625
11215 -13625 2812 -43390 -122286 -139722 -180200 -147821 -207606 -262565 -165382 -138904 -222601 -229514
11203 -229514 -199461 -201861 -151637 -81233 -14767 49879 103735 131170 83005 15643 -20949 32179
11191 32179 -18525 -81964 -81933 -21773 -76555 -112095 -68092 -49213 -139831 -122786 21233 163849
11179 163849 189150 150041 153074 73970 26609 121763 195761 148414 243834 472649 643209
11168 643209 789589 750728 770033 829437 811847 822475 864707 800353 693989 650879 551804
11157 551804 397857 281326 135873 142155 181868 225766 157132 121399 301414 285534 186619
11146 186619 208150 141034 131007 103849 207591 182191 157510 242987 167392 99926 55912
11135 55912 46606 67324 -32197 104345 203280 214035 187874 151403 337300 276963 132105
11124 132105 114786 164608 182537 49394 31552 18108 -57122 -20531 50724 40162 61716
11113 61716 34912 53358 -1824 -104720 -156227 -184122 -222107 -185241 -132814 -11982 44916
11102 44916 -40487 -144723 -120897 -128505 -94393 -77889 -62353 -99463 -55940 -12374 -4866 26510
11090 26510 -10250 -87496 -63610 -16440 -43864 -55716 -22916 -44823 -98585 -38497 -3222 91586
11078 91586 155675 68076 -2715 -112261 -29703 3552 42260 147046 164055 199001 173940
11067 173940 180564 99965 4060 38575 -26235 -49587 70274 18244 -31405 -84582 -81505 -196233
11055 -196233 -169292 -146158 -210540 -187443 -155896 -77990 -112360 -148921 -130904 -78659 -19550
11044 -19550 -45278 -50598 -67678 -82651 10642 37256 45168 -55609 19160 109472 61513 95277
11032 95277 72380 40276 60187 -77712 -106164 -222680 -229360 -73221 -26767 79985 60202
11021 60202 -82083 -223466 -263252 -214881 -301676 -234512 -178458 -113407 -159069 -128188 -111826
11010 -111826 9270 16243 3774 16857 66360 -29161 -67548 44735 178926 184887 20745
10999 20745 -41035 -79311 -140728 -151194 -100264 -85062 -110368 -132172 -90786 -88167 -8935 117666
10987 117666 122090 59950 -72068 -166938 -105658 -62610 -151800 -175862 -127319 -181154 -117752
10976 -117752 -75914 -19144 95450 78757 32781 -7414 -36283 -10544 -15050 7929 -89637
10965 -89637 -185738 -105077 -214766 -318354 -251410 -104092 -92552 18477 -39376 -47168 56477
10954 56477 33561 -35911 -185044 -117651 44690 44620 19695 52071 97746 101825 139762 153728
10942 153728 170155 177625 65025 -51842 -54198 -61010 66338 137611 26567 -84286 24112
10931 24112 -50632 -88597 -44096 -135986 -146819 -140437 -193347 -133539 -104650 11738 63407 17431
10919 17431 19988 48477 61971 69395 23180 -36712 -91799 -148229 -154309 -127984 -26978 -94757
10907 -94757 -191432 -86336 -30266 34725 33765 85644 134798 83327 -6290 -36589 27719 -27244
10895 -27244 -4544 120787 6562 33237 89879 53215 65265 93330 63143 13474 -66079
10884 -66079 -176658 -148378 -75042 -43679 -73764 -25546 50315 9977 95076 156414 75841
10873 75841 -3060 -60581 -7615 -11720 -36937 -10686 -49219 -95527 -60952 -21610 -19642 -50358
10861 -50358 -115907 -185180 -223859 -133934 -72010 -30176 17143 27060 -54523 -88943 -10196 -49281
10849 -49281 -79643 -148833 -209988 -151582 -27780 35828 87695 90798 101904 51104 -21322 -71603
10837 -71603 -70863 -34750 -81344 -173275 -124148 -135822 -92427 -66277 77485 205472 151542 -23943
10825 -23943 -85907 -111192 -144794 -118645 -59972 3540 -49846 -71415 -124676 -100970 -27917 -6844
10813 -6844 28887 -23859 -23885 25661 63011 128741 189811 95167 -49681 -108284 -120377 -125704
10801 -125704 -133126 -126258 -90182 -80183 38580 94397 98552 -48665 -116624 -163090 -64053 -65677
10789 -65677 -157931 -144107 -184444 -158491 7279 174201 165196 82695 84198 90381 142689 61559
10777 61559 -90704 -84842 11785 66137 113996 66259 46486 160928 163738 159820 90755 87375
10765 87375 94969 78561 -19101 -70088 -32038 23080 -18813 -39138 70405 54220 69516 -22622
10753 -22622 -130308 -109402 -92921 -27858 26930 87264 41453 22896 45514 122475 197392
10742 197392 278052 520309 704290 651720 635206 592656 422215 383214 380802 261461 166645
10731 166645 120643 211182 213222 200675 169003 210635 127002 -53137 -68684 140586 279537
10720 279537 239028 66640 134348 125480 112421 133306 164642 163263 186478 378783 284774
10709 284774 136175 -752 -65698 3347 -3518 25762 21222 125874 -38686 -168204 -34982
10698 -34982 192398 238174 218747 212152 176394 99759 52851 1597 -136852 -65473 50763
10687 50763 33950 64880 96430 98976 47317 63073 140891 110856 115508 81806 -2559 67395
10675 67395 101798 98335 78835 58459 127810 173385 158694 116226 151849 178267 109027 150765
10663 150765 116445 65771 259476 451946 537201 705529 832820 888505 804438 580492
10653 580492 358882 267437 244476 258046 184373 219760 276468 254345 187017 137658 165049
10642 165049 163707 203089 231399 152132 106477 130798 199598 351972 379899 261815 157121
10631 157121 110579 93306 42627 22872 -27760 -25777 11838 209771 267302 282924 311443
10620 311443 216303 160025 96497 70760 65602 77517 109086 105981 123788 59831 -17254 -20714
10608 -20714 -29497 -72551 -80269 -95213 -132303 -1981 -62143 -137964 4519 71836 -69647
10597 -69647 -93430 -107212 -89678 18722 -23719 14083 40613 66151 29537 36338 29114 67015
10585 67015 79279 137684 184982 221307 117220 17846 -54930 -35702 -28746 -74628 -113137 -56234
10573 -56234 -41330 -94873 -53269 -52127 -49698 -108073 -109135 -133418 -71244 -34470 -5099 -2602
10561 -2602 23609 -15011 -98249 56703 179986 215241 138659 6422 45426 60103 43130
10550 43130 20110 21032 -63708 -25638 9333 80684 63239 124138 121976 -91671 -349574 -312254
10538 -312254 -134086 13304 75115 -35379 -9554 -30901 47242 36457 69148 76254 -31332
10527 -31332 -43224 2668 -69730 -113586 -48368 -31119 -132925 -105272 13428 26735 -95550
10516 -95550 -145591 -105527 -86939 -112285 -41948 63145 134428 81361 -122178 -256673 -237960
10505 -237960 -234112 -293379 -309853 -229116 -193478 -140441 -117876 -149417 -189173 -232891 -100139
10494 -100139 33575 89479 14026 -29703 9714 83151 128808 49732 -119283 -6989 -2775
10483 -2775 -1651 65051 135278 159948 167213 128836 45779 56682 43651 -62053 -141010 -136727
10471 -136727 1007 53734 116050 -22035 -93768 -66036 -36273 -55598 -150288 -159479 -92960
10460 -92960 -12884 24522 1666 -62029 -89036 -85962 -58171 -94956 -56376 1117 55647 93885
10448 93885 -34624 -110375 -81539 -61098 91977 224504 184408 129091 50276 25666 66171
10437 66171 215979 166856 161830 252242 143970 122506 114119 150255 120184 75427 129227 53012
10425 53012 -49203 -92742 28814 123989 48307 -19866 -119456 -183008 -176630 -151745 -84819
10414 -84819 -23974 57117 256529 286638 155728 90024 12259 -96132 -154961 -42255 88003
10403 88003 213643 261482 194783 195345 153185 215701 237605 171686 99854 167234 308659 314670
10391 314670 321956 272681 223707 353189 448053 387569 355514 294228 196135 -2856 -90661
10380 -90661 44699 28667 4541 4646 89812 38343 -5164 56366 156131 198708 152750 22638
10368 22638 38341 59956 102176 111719 98213 44653 64239 132850 114945 61890 62911 172317
10356 172317 106947 -25189 -113373 -172521 -167869 -76317 -47652 38294 97180 48994 44143 56214
10344 56214 138184 2643 57583 77450 -57313 -127680 -152068 -113088 -19783 -63502 -42623
10333 -42623 -34659 11009 8141 117628 188792 154106 74106 -8731 41375 82816 93854 113884
10321 113884 56839 -45065 -44730 31226 175998 145277 124702 84114 -104354 -196802 -117666
10310 -117666 28189 135173 82633 51562 211 -24976 -25299 -30750 -7451 -86022 -141336 28522
10298 28522 20511 -19420 82034 64783 101262 65949 114831 147575 87607 221756 221409 203910
10286 203910 97380 29399 -12228 -127505 -40501 53310 105448 113255 231978 198677 61040
10275 61040 1123 78862 19119 -18610 -76864 -98610 -120961 -29972 23118 -6537 -164692
10264 -164692 -147516 -85326 -89892 12755 27748 95279 234928 221766 81926 16474 177096
10253 177096 183330 116178 139527 220359 200412 6370 -58184 -27070 64528 62969 -11252 -2770
10241 -2770 127086 112976 109700 63402 -1227 10625 170378 282528 280172 118590 45793
10230 45793 3496 9603 209263 203864 103460 10894 -16015 37626 67054 -20091 -24652 81537
10218 81537 129207 106543 46020 76809 23154 -25065 -38046 16352 77738 52738 18276 85004
10206 85004 157912 255110 215210 216351 218628 101563 43805 7984 20362 39129 -98313 -81997
10194 -81997 -55845 -80910 -125599 -37920 27066 -5908 -46403 16486 -15232 -52930 -215260
10183 -215260 -363689 -309129 -242167 -200516 -79138 -2845 86278 74136 -7282 46093 -7292
10172 -7292 -90536 -133169 -136042 -106860 -50888 20679 -8008 -139202 -209283 -339740 -237005
10161 -237005 -119031 -63732 -10925 3575 45927 10541 2041 8077 -326 20567 57586 70296
10149 70296 -17905 25649 66413 -73432 -61910 -36326 -9118 25414 148611 117214 -22732
10138 -22732 -42830 -64979 -78921 -93552 -127611 -37913 70108 94717 35742 -17995 -146226
10127 -146226 -175016 -52237 23329 28612 26301 63958 59188 27492 30309 116410 143187 145323
10115 145323 148435 114834 34649 110055 85389 45050 -2985 -61044 -149204 -108635 -126824 -90290
10103 -90290 -91105 -17799 32507 42414 79053 118118 25371 28377 -8456 -11345 23776 -3286 -20933
10090 -20933 59331 -257 11088 -23726 45374 68045 63018 -25743 -68083 47179 206811
10079 206811 251024 188508 235611 177498 123122 138212 140487 22665 -30231 -87689 -39165
10068 -39165 -103479 -53409 116647 246110 208187 120719 111309 125267 207221 340472 439155
10057 439155 368226 290834 309942 316603 339328 364152 371205 355237 364272 381951 417610 373164
10045 373164 282860 284613 313074 308819 295342 280240 171934 146012 207013 226333 110765
10034 110765 38679 -9900 -72033 -55306 -55822 -64483 58693 159982 92597 77821 19305 88622
10022 88622 51558 -69153 -72002 125848 77171 50273 160290 162167 130659 140372 125361 59365
10010 59365 -114244 -1281 -43841 -130456 -22312 52579 11045 -1233 -4669 -6560 -28228
9999 -28228 -30714 -8327 -116187 -68843 14502 174455 229808 165236 164807 163912 116427 177621
9987 177621 190243 211170 167599 142957 128576 49556 76648 61987 61199 -13313 -2476 93039
9975 93039 110651 101380 159081 166153 67942 38228 121191 239645 206420 147976 110412 89501
9963 89501 29687 53891 62587 9703 74107 250328 326533 212941 109382 71707 37390
9952 37390 29610 -44143 67228 74281 27670 47727 60132 49130 104551 88807 65391 74473
9940 74473 132393 125733 107823 25525 88760 143639 140918 84505 78068 126838 85794 37272
9928 37272 155836 178052 147374 204602 235089 312225 301141 248120 181003 179999 271442 303627
9916 303627 198128 102949 50518 69547 50869 36850 170704 254781 209801 213677 138000
9905 138000 41240 -95916 -186227 -157450 -91022 -57887 -10563 -23463 23635 102373 58645
9894 58645 116089 136639 55392 34310 -118312 -172366 -149129 -76192 -74934 -121377 -35032 21889
9882 21889 18109 51217 37248 5801 75634 -28194 -3623 24541 188592 207038 80445
9871 80445 -66745 94735 148795 154992 136326 153610 26413 -54357 -33908 1741 96229
9860 96229 149713 172621 116611 48527 109921 241537 160705 30063 -111246 -62907 120161
9849 120161 180476 168627 101304 112959 62539 133435 250520 181499 133599 157047 116464
9838 116464 90788 42736 -14209 46251 -46321 -192235 -156035 -94648 6523 11740 -13218
9827 -13218 55207 49435 30382 16868 19353 -24215 -80899 33984 189734 326442 132803
9816 132803 -57755 -67837 34777 5356 -97658 -53912 15922 78923 101947 123846 149177
9805 149177 271282 348604 219115 86783 12441 -10967 10074 36767 61771 28024 118862
9794 118862 170355 68137 19060 -30752 -30014 98802 34559 -53426 -134926 -138639 -175776 -123854
9782 -123854 -152650 -172323 -154136 -145149 -205481 -296799 -233183 -145624 -58271 60886 88265 63953
9770 63953 139012 98819 -6180 42914 -7443 -54141 -17841 29083 31588 -71893 -107679 65206
9758 65206 43311 -25430 37479 36462 70906 98217 156242 266320 218975 98946 107993 182449
9746 182449 236576 195415 116741 98856 45877 20393 -29161 39473 173789 135417 14974
9735 14974 -29513 -164294 -44974 91760 250030 151999 45883 22547 8119 -58389 15441
9724 15441 15345 -77310 -94141 -42975 -31985 -74810 -48722 -11829 -43626 -84899 -130367 -106266
9712 -106266 -68658 18430 191251 298919 255827 149351 180962 216389 97334 -26466 -54471
9701 -54471 62051 214777 274344 197643 66279 138481 268450 244802 94126 -82474 -67017
9690 -67017 -51738 -10688 7292 -18713 45994 -18564 -53205 -4874 123910 104190 143399 160247
9678 160247 117131 110009 126466 166328 157624 61236 65883 85401 -1746 -43327 -17352 18572
9666 18572 -7423 -30556 91724 148424 36487 44582 94428 50977 61259 187675 109808
9655 109808 62602 -83509 -3598 129673 100489 133657 116740 2097 -54469 -122327 -45981
9644 -45981 24232 15459 9427 18290 -27778 -4775 44883 -53293 -22380 132022 211111 314990
$$ [...]
##END NTUPLES=NMR SPECTRUM
##END=
