##TITLE=Analysis number 307916
Compound Code cc 24806
Book Reference 428/55
Project Code adrs
Chemist Name janep
##JCAMPDX= 6.0         $$ Bruker NMR JCAMP-DX V2.0
##DATA TYPE= NMR SPECTRUM
##DATA CLASS= NTUPLES
##ORIGIN= Bruker BioSpin GmbH
##OWNER= NMR
$$ XWIN-NMR		Version 3.5
$$ Tue May 17 11:23:27 2005 GMT Daylight Time (UT+1h)  MAYBRIDGE\NMR@NMR_250MHZ
##.OBSERVE FREQUENCY= 250.131544655141
##.OBSERVE NUCLEUS= ^1H
##.ACQUISITION MODE= SIMULTANEOUS (DQD)
##.ACQUISITION SCHEME= undefined
##.AVERAGES= 16
##.DIGITISER RES= 18
##SPECTROMETER/DATA SYSTEM= dpx250
##.PULSE SEQUENCE= zg30
##.SOLVENT NAME= CDCl3
##.SHIFT REFERENCE= (INTERNAL, CDCl3, 0, 16.522)
##AUDIT TRAIL= $$ (NUMBER, WHEN, WHO, WHERE, WHAT)
$$ ##TITLE= Audit trail, XWIN-NMR		Version 3.5
$$ ##JCAMPDX= 5.01
$$ ##ORIGIN= Bruker BioSpin GmbH
$$ ##OWNER= NMR
$$ C:\u/data/dgb/nmr/ADRS/3040/pdata/1/auditp.txt
$$ ##AUDIT TRAIL=  $$ (NUMBER, WHEN, WHO, WHERE, WHAT)
(   1,<2005-05-17 11:23:08.87 +100>,<MAYBRIDGE\NMR>,<NMR_250MHZ>,
      <created by zg, POWCHK disabled, PULCHK disabled
       configuration hash MD5:
       62 19 C7 07 E1 42 D1 B7 37 6C 3D D0 77 39 F9 E6
       data hash MD5: 64K
       20 AA F9 43 8C 7C 75 64 6A F8 FC D4 4C 32 97 98>)
(   2,<2005-05-17 11:23:19.59 +100>,<MAYBRIDGE\NMR>,<NMR_250MHZ>,
      <Start of raw data processing
       ef LB = 0.3 FT_mod = 6 PKNL = 1 SI = 32K 
       data hash MD5: 32K
       55 F0 17 BE D4 C6 A4 7B 31 86 2B D6 0F A8 29 0E>)
(   3,<2005-05-17 11:23:21.42 +100>,<MAYBRIDGE\NMR>,<NMR_250MHZ>,
      <apk 
       data hash MD5: 32K
       02 4B 02 B3 9A C1 B4 5D E0 14 63 AC 31 B8 DB 17>)
(   4,<2005-05-17 11:23:22.07 +100>,<MAYBRIDGE\NMR>,<NMR_250MHZ>,
      <abs ABSG = 5 
       data hash MD5: 32K
       D1 DB FD 62 27 E3 66 CC 02 D1 48 26 E9 55 8B DF>)
$$ ##END=
$$ 
$$ hash MD5
$$ 55 7E 63 EB C1 E8 CB E7 8E 2C 23 2A D2 A6 90 E6
##$RELAX= 
##$RELAX= 
##$RELAX= 
##$RELAX= 
##$RELAX= 
##$RELAX= 
##$RELAX= 
$$ Bruker specific parameters
$$ --------------------------
##$DU= <C:\u>
##$EXPNO= 3040
##$NAME= <ADRS>
##$PROCNO= 1
##$TYPE= <nmr>
##$USER= <dgb>
##$AMP= (0..31)
100 100 100 100 100 100 100 100 100 100 100 100 100 100 100 100 100 100 
100 100 100 100 100 100 100 100 100 100 100 100 100 100 
##$AQSEQ= 0
##$AQ_mod= 3
##$AUNM= <au_zg>
##$AUTOPOS= <22 >
##$BF1= 250.13
##$BF2= 250.13
##$BF3= 250.13
##$BF4= 250.13
##$BF5= 500.13
##$BF6= 500.13
##$BF7= 500.13
##$BF8= 500.13
##$BYTORDA= 1
##$CFDGTYP= 0
##$CFRGTYP= 5
##$CHEMSTR= <none>
##$CNST= (0..31)
1 1 145 1 1 1 1 1 1 1 1 1 1 1 1 1 1 1 1 1 1 1 1 1 1 1 1 1 1 1 1 1 
##$CPDPRG= <>
##$CPDPRG1= <>
##$CPDPRG2= <>
##$CPDPRG3= <>
##$CPDPRG4= <mlev>
##$CPDPRG5= <mlev>
##$CPDPRG6= <mlev>
##$CPDPRG7= <mlev>
##$CPDPRG8= <mlev>
##$CPDPRGB= <>
##$CPDPRGT= <>
##$D= (0..31)
0 1 0 0 0 0 0 0 0 0.06 0 0 0 0 0 0 0.0002 0 0 0 0 0 0 0 0 0 0 0 0 0 0 
0 
##$DATE= 1116325387
##$DBL= (0..7)
120 120 120 120 120 120 120 120 
##$DBP= (0..7)
150 150 150 150 150 150 150 150 
##$DBP07= 0
##$DBPNAM0= <>
##$DBPNAM1= <>
$$ [...]
##$SUBNAM7= <"">
##$SUBNAM8= <"">
##$SUBNAM9= <"">
##$SW= 20.6930455092707
##$SWIBOX= (0..15)
0 0 3 0 0 0 0 0 0 0 0 0 0 0 0 0 
##$SW_h= 5175.983436853
##$TD= 65536
##$TD0= 1
##$TE= 295.16
##$TE2= 300
##$TE3= 300
##$TEG= 300
##$TL= (0..7)
0 120 120 120 120 120 120 120 
##$TP= (0..7)
150 150 150 150 150 150 150 150 
##$TP07= 0
##$TPNAME0= <>
##$TPNAME1= <>
##$TPNAME2= <>
##$TPNAME3= <>
##$TPNAME4= <>
##$TPNAME5= <>
##$TPNAME6= <>
##$TPNAME7= <>
##$TPOAL= (0..7)
0.5 0.5 0.5 0.5 0.5 0.5 0.5 0.5 
##$TPOFFS= (0..7)
0 0 0 0 0 0 0 0 
##$TUNHIN= 0
##$TUNHOUT= 0
##$TUNXOUT= 0
##$USERA1= <user>
##$USERA2= <user>
##$USERA3= <user>
##$USERA4= <user>
##$USERA5= <user>
##$V9= 5
##$VALIST= <valist>
##$VCLIST= <CCCCCCCCCCCCCCC>
##$VD= 0
##$VDLIST= <DDDDDDDDDDDDDDD>
##$VPLIST= <PPPPPPPPPPPPPPP>
##$VTLIST= <TTTTTTTTTTTTTTT>
##$WBST= 1024
##$WBSW= 4
##$XGAIN= (0..3)
0 0 0 0 
##$XL= 0
##$YL= 0
##$YMAX_a= 501219
##$YMIN_a= -391993
##$ZGOPTNS= <>
##$ZL1= 120
##$ZL2= 120
##$ZL3= 120
##$ZL4= 120
##$ABSF1= 16.522
##$ABSF2= -4.171173
##$ABSG= 5
##$ABSL= 3
##$ALPHA= 0
##$AQORDER= 0
##$ASSFAC= 0
##$ASSFACI= 0
##$ASSFACX= 0
##$ASSWID= 0
##$AUNMP= <proc_1d>
##$AZFE= 0.1
##$AZFW= 0.1
##$BCFW= 0
##$BC_mod= 0
##$BYTORDP= 0
##$COROFFS= 0
##$CY= 12.5
##$DATMOD= 1
##$DC= 0
##$DFILT= <>
##$DTYPP= 0
##$F1P= 14.0000005364418
##$F2P= -0.99999901652339
##$FCOR= 0.5
##$FTSIZE= 32768
##$FT_mod= 6
##$GAMMA= 0
##$GB= 0
##$INTBC= 1
##$INTSCL= 1
##$ISEN= 128
##$LB= 0.3
##$LEV0= 0
##$LPBIN= 0
##$MAXI= 10000
##$MC2= 0
##$MEAN= 0
##$ME_mod= 0
##$MI= 0
##$NCOEF= 0
##$NC_proc= -4
##$NLEV= 6
##$NOISF1= 0
##$NOISF2= 0
##$NSP= 0
##$NTH_PI= 0
##$NZP= 0
##$OFFSET= 16.522
##$PC= 1
##$PHC0= -73.18263
##$PHC1= 5.628635
##$PH_mod= 1
##$PKNL= yes
##$PPARMOD= 0
##$PSCAL= 4
##$PSIGN= 0
##$REVERSE= no
##$SF= 250.13
##$SI= 32768
##$SIGF1= 0
##$SIGF2= 0
##$SINO= 400
##$SIOLD= 32768
##$SREGLST= <1H.CDCl3>
##$SSB= 0
##$STSI= 32768
##$STSR= 0
##$SW_p= 5175.98343685301
##$SYMM= 0
##$S_DEV= 0
##$TDeff= 65536
##$TDoff= 0
##$TI= <Analysis number 999999
Compound Code 99
Book Reference 9
Project Code 9>
##$TILT= no
##$TM1= 0
##$TM2= 0
##$TOPLEV= 0
##$USERP1= <user>
##$USERP2= <user>
##$USERP3= <user>
##$USERP4= <user>
##$USERP5= <user>
##$WDW= 1
##$XDIM= 32768
##$YMAX_p= 291114871
##$YMIN_p= -144966
$$ End of Bruker specific parameters
$$ ---------------------------------
##NTUPLES= NMR SPECTRUM
##VAR_NAME=  FREQUENCY,     SPECTRUM/REAL,   SPECTRUM/IMAG
##SYMBOL=    X,             R,               I
##VAR_TYPE=  INDEPENDENT,   DEPENDENT,       DEPENDENT
##VAR_FORM=  AFFN,          ASDF,            ASDF
##VAR_DIM=   32768,         32768,           32768
##UNITS=     HZ,            ARBITRARY UNITS, ARBITRARY UNITS
##FACTOR=    0.157963299565203, 1,           1
##FIRST=     4132.6476996994, 0,             0
##LAST=      -1043.33573715361, 0,           0
##MIN=       -1043.33573715361, -144966,     0
##MAX=       4132.6476996994, 291114871,     0
$$ Real data points
##PAGE= N=1
##DATA TABLE= (X++(R..R)), XYDATA
$$ [...]
$$ plain form
24369 45766 -3810 -34702 -63919 -52415 -58240 -77686 -88968 -67455 -43839 -28708 8622 43670
24357 43670 39966 22840 28155 37062 64384 46463 7718 7024 -14519 -16762 -10825 2112 -5229
24344 -5229 4748 15499 16958 24978 7532 -24920 -67144 -49902 -20941 -12451 -543 4141 4605
24331 4605 -9745 -23093 -32693 -40354 -70823 -105582 -102821 -70263 -43174 -28964 -2287 -19537
24319 -19537 -2533 13922 25549 2072 -6750 -31133 -60086 -59230 -34041 23143 33755 42358
24307 42358 10514 -10659 -37496 -49595 -32398 -25741 -5046 21666 6636 -9335 27346 38594
24295 38594 19174 -17863 -15557 -9930 -11398 -37542 -11244 6990 27403 29703 4808 -25833
24283 -25833 14837 37417 6913 -4995 -5919 17495 17377 -11953 5484 11022 7746 37081 25200
$$ packed form
24369D5766m9576l0892k9217J1504n825j9446j1282K1513K3616J5131L7330L5048
24357D3670l704j7126N315Q907K7322j7921l8745o94k1543k243N937J2937p341
24344e229R977J0751J459Q020j7446l2452m2224J7242K8961Q490J1908M684M64
24331D605j4350j3348r600p661l0469l4759K761L2558K7089J4210K6677j7250
24319a9537J7004J6455J1627k3477q822k4383k8953Q56K5189N7184J0612Q603
24307D2358l1844k1173k6837j2099J7197O657K0695K6712j5030j5971L6681J1248
24295C8594j9420l7037K306N627j468k6144K6298J8234K0413K300k4895l0641
24283b5833M0670K2580l0504j1908r24K3414j18k9330J7437N538l276K9335j1881
$$ plain form
24270 25200 28932 33861 31871 44810 28854 -963 -42480 -35363 -43438 -77206 -80783 -21793 -1984
24257 -1984 -26267 -46171 -28769 -23643 -26723 -18278 -26175 -58638 -101358 -67818 -48102 -80130 -64706
24244 -64706 -43298 -37279 -50851 -44147 -20645 -8393 12366 16154 31735 -14884 -33933 -54118
24232 -54118 -32388 -17393 -10717 -3771 -4890 15386 5037 -10303 -26497 -31043 8132 -3878
24220 -3878 -20234 8773 31615 8337 -7832 -18379 -14806 -14854 2055 48597 77667 52279 35869
24207 35869 49944 47650 47777 60320 42117 62162 25560 9290 2235 32182 39956 47804 43300
24194 43300 40226 47006 10190 6955 5978 -11794 -24218 -15896 -12759 4448 11200 48824 26235
24181 26235 -46403 -70368 -31235 -1943 12612 33537 45118 79594 78814 60199 28633 6393
$$ packed form
24270B5200L732M929j990J2939j5956k9817m1517P117q075l3768l577N8990J9809
24257a984k4283j9904J7402N126l080Q445p897l2463m2720L3540J9716l2028J5424
24244f4706K1408O019j3572O704K3502J2252K0759L788J5581m6619j9049k0185
24232e4118K1730J4995O676O946j119K0276j0349j5340j6194m546L9175j2010
24220c878j6356K9007K2842k3278j6169j0547L573m8J6909M6542K9070k5388j6410
24207C5869J4075k294J27J2543j8203K0045l6602j6270p055K9947P774P848m504
24194D3300l074O780l6816l235r77j7772j2424Q322L137J7207O752L7624k2589
24181B6235p2638k3965L9133K9292J4555K0925J1581L4476p80j8615l1566k2240
$$ plain form
24169 6393 24505 15604 28837 31826 -20727 -65218 -61000 -71051 -52781 19619 -7040 -21205
24157 -21205 -38388 -56220 -49266 -23090 9143 33371 46998 37198 22048 23251 26656 -6386
24145 -6386 -8401 -35605 -9818 1704 8678 -22732 -16695 6056 34516 39393 4696 -24654 -16861
24132 -16861 -31251 -21031 -42675 -35204 10032 1778 -24495 21741 33143 8038 -20921 -12389
24120 -12389 -15449 -34408 8945 -2791 -64292 -77911 -24315 -2816 -55834 -54304 -32609 -35894
24108 -35894 -35903 -45240 12132 58598 80825 68597 39712 31017 -597 5874 -1927 -6767 45772
24095 45772 40045 29422 40686 63816 49431 23385 19799 41353 26928 6075 25347 19555
24083 19555 4309 539 921 -42773 -73125 -44406 -17933 13635 13119 1 7060 -12261 -10070
$$ packed form
24169F393J8112q901J3233K989n2553m4491M218j0051J8270P2400k6659j4165
24157b1205j7183j7832O954K6176L2233K4228J3627r800j5150J203L405l3042
24145f386k015k7204K5787J1522O974l1410O037K2751K8460M877l4697k9350P793
24132a6861j4390J0220k1644P471M5236q254k6273M6236J1402k5105k8959Q532
24120a2389l060j8959M3353j1736o1501j3619N3596K1499n3018J530K1695l285
24108c5894rr337N7372M6466K2227j2228k8885q695l1614O471p801m840N2539
24095D5772n727j0623J1264K3130j4385k6046l586K1554j4425k0853J9272n792
24083A9555j5246l770L82m3694l0352K8719K6473L1568n16j3118P059j9321K191
$$ plain form
24070 -10070 -1418 31692 75742 88223 99408 92633 71073 46580 41538 28156 28228 -7118 -52846
24057 -52846 -36679 -45699 -22921 6945 -10456 -17764 -2408 37133 18588 13878 26746 4263
24045 4263 -11689 -6176 -6207 -5220 -5128 -610 -19119 -16441 10026 31343 57494 92084 51982 5979
24031 5979 -2885 1752 -14558 24420 62515 94473 45483 -9998 -10926 -1971 14961 23702 1078
24018 1078 -2916 1197 -13145 1533 30587 38182 15946 13478 -861 -31843 -38529 -17709 -15580
24005 -15580 -20209 9596 22953 4279 -35761 -33345 -34141 -30929 -43646 -52463 -68379 -86640 -32960
23992 -32960 6960 29781 29079 -3797 -20712 -45387 -33089 -31634 -22693 5363 -8249 -31133
23980 -31133 -11072 -20255 1079 -31413 -51773 -36432 -21615 -7281 -36657 -63127 -44785 -30394
$$ packed form
24070a0070Q652L3110M4050J2481J1185o775k1560k4493n042j3382P2l5346m5728
24057e2846J6167r020K2778K9866j7401p308J5356L9541j8545m710J2868k2483
24045D263j5952N513l1R87R2M518j8509K678K6467K1317K6151L4590m0102m6003
24031E979q864M637j6310L8978L8095L1958m8990n5481r28Q955J6932Q741k2624
24018A078l994M113j4342J4678K9054P595k2236k468j4339l0982o686K0820K129
24005a5580m629K9805J3357j8674m0040K416p96L212j2717q817j5916j8261N3680
23992c2960L9920K2821p02l2876j6915k4675J2298J455Q941K8056j3612k2884
23980c1133K0061r183K1334l2492k0360J5341J4817J4334k9376k6470J8342J4391
$$ plain form
23968 -30394 -20049 -5802 3372 -21505 -45780 -32676 -14198 -5371 13613 -20960 -48978 -43017
23956 -43017 -34789 -35337 -9113 29848 17263 -8925 -31711 -21357 5483 13340 -5659 -38211
23944 -38211 -38496 -7034 5336 2035 -21066 2466 11352 3363 -4724 9279 43765 51739 36572
23931 36572 19384 -1207 -13513 -21975 2234 -7391 -5503 -13982 -9433 18664 27625 15813 31322
23918 31322 34092 2861 39007 27633 2832 -6695 29426 40351 -1676 -34299 -28324 -4580
23906 -4580 4459 13352 -8207 -48716 -45651 -6629 -4528 -21355 -27444 -50933 -10866 19692 6227
23893 6227 -11172 -10458 -8547 -25859 -42343 -6217 7201 33327 59239 24415 -13269 -15346 -19931
23880 -19931 -1372 -12429 -5247 23661 12501 38315 20817 16142 27016 22225 37005 30849
$$ packed form
23968c0394J0345J4247R174k4877k4275J3104J8478Q827J8984l4573k8018N961
23956d3017Q228n48K6224L8961j2585k6188k2786J0354K6840P857j8999l2552
23944c8211k85L1462J2370l301k3101K3532Q886p989q087J4003L4486P974j5167
23931C6572j7188k0591j2306q462K4209r625J888q479M549K8097Q961j1812J5509
23918C1322K770l1231L6146j1374k4801r527L6121J0925m2027l2623N975K3744
23906d580R039Q893k1559m0509L065L9022K101j6827o089k3489M0067L0558j3465
23893F227j7399P14J911j7312j6484L6126J3418K6126K5912l4824l7684k077m585
23880a9931J8559j1057P182K8908j1160K5814j7498m675J0874m791J4780o156
$$ plain form
23868 30849 26891 -15768 -53181 -75857 -46024 -17908 -37483 -41534 -36753 29943 64975 29870
23856 29870 9950 8434 5277 -34320 -26405 10507 7965 21351 7674 3085 5920 6021 38006
23843 38006 30068 -23499 -28684 16385 21148 33325 18302 82 -22485 -5887 -8040 -13382 -4945
23830 -4945 -5475 -10251 -34979 -35074 8860 -8214 -35849 -46666 -32724 -2122 30557 29143 -1034
23817 -1034 -11015 -12070 -40116 -43890 -20353 -11432 1014 7520 -14914 -21986 -20956 -41466 -31163
23804 -31163 -33596 -38471 -56445 -45096 -28917 -36263 -36760 4876 19722 19448 2025 21984 17606
23791 17606 -6966 -6724 -16775 -27221 -28551 -64239 -80474 -45664 -8094 -6310 6593 -11808
23779 -11808 12037 25247 14338 20032 50725 53930 47204 37888 -15787 -41813 -20421 -6153
$$ packed form
23868C0849l958m2659l7413k2676K9833K8116j9575m051M781O6696L5032l5105
23856B9870j9920j516l157l9597P915L6912k542J3386j3677m589K835J01L1985
23843C8006p938n3567n185M5069M763J2177j5023j8220k2567J6598k153n342Q437
23830d945n30m776k4728r5M3934j7074k7635j0817J3942L0602L2679j414l0177
23817a034r981j055k8046l774K3537Q921J2446O506k2434p072J030k0510J0303
23804c1163k433m875j7974J1349J6179p346m97M1636J4846k74j7423J9959m378
23791A7606k4572K42j0051j0446j330l5688j6235L4810L7570J784J2903j8401
23779a1808K3845J3210j0909N694L0693L205o726r316n3675k6026K1392J4268
$$ plain form
23767 -6153 14342 -34959 -71907 -68871 -22123 34670 36415 -11322 -47056 -50641 -16063 13571
23755 13571 935 11352 895 -4453 -5212 15171 14508 8654 1382 -4495 5535 -41023 -50227
23742 -50227 -56994 -53360 -59138 -53889 -58127 -80219 -26357 42769 61673 22702 10377 -12852 -19850
23729 -19850 8545 -38454 -64558 -53511 -14732 1714 7704 22282 31755 1182 18283 18447
23717 18447 -11998 -12124 4221 17203 27076 7152 -52365 -52651 -16365 -20020 -34909 -9943 -9037
23704 -9037 -6014 -6139 -11795 -15407 -39159 -51131 -32883 -11366 -1322 -11892 -40193 -19246 -10546
23691 -10546 -13764 -21440 -38822 -21545 -36815 -17100 3310 -370 9174 22561 -7418 -33160
23679 -33160 -18625 -16227 -4548 -20333 -41477 -50859 -38072 -30452 -44169 -69194 -99597 -108253
$$ packed form
23767f153K0495m9301l6948L036M6748N6793J745m7737l5734l585L4578K9634
23755A3571j2636J0417j0457n348p59K0383o63n854p272n877J0030m6558r204
23742e0227o767L634n778N249m238k2092N3862O9126J8904l8971j2325k3229o998
23729a9850K8395m6999k6104J1047L8779J6446N990J4578R473l0573J7101J64
23717A8447l0445j26J6345J2982R873j9924n9517k86L6286l655j4889K4966R06
23704i037L023j25n656l612k3752j1972J8248K1517J0044j0570k8301K0947Q700
23691a0546l218p676j7382J7277j5270J9715K0410l680R544J3387k9979k5742
23679c3160J4535K398J1679j5785k1144r382J2787P620j3717k5025l0403q656
$$ plain form
23667 -108253 -98916 -33527 -25181 -35358 -5820 8380 -16591 -30123 -19716 11403 22655 20504
23655 20504 12575 6199 -22147 -39356 -22740 -26380 -53298 -38418 -21689 -15147 -16554 -44337 -55648
23642 -55648 -39405 -49697 -60942 -40931 -23308 1515 -13263 -2289 -9071 1445 14891 11182
23630 11182 30460 45741 36420 56575 42849 15113 14687 6301 21499 21959 11836 10738 25897
23617 25897 44178 66326 39637 56791 69743 29638 23600 22108 16649 12061 23548 -20956
23605 -20956 -12543 2334 -5585 2451 2247 19189 -2819 -37507 -44618 -47395 -33977 -5905 -6625
23592 -6625 -18204 -5922 21198 10577 -25251 -44874 -24152 -36024 -26676 -35362 -26281 -22292 -47737
23579 -47737 -38436 -48661 -45571 -33122 -5430 -1435 -7731 2069 -23840 -52792 -43457 -25088 -18475
$$ packed form
23667a08253R337O5389Q346j0177K9538J4200k4971j3532J0407L1119J1252k151
23655B0504p929o376k8346j7209J6616l640k6918J4880J6729O542j407k7783j1311
23642e5648J6243j0292j1245K0011J7623K4823j4778J0974o782J0516J3446l709
23630A1182J9278J5281r321K0155j3726k7736m26q386J5198M60j0123j098J5159
23617B5897J8281K2148k6689J7154J2952m0105o038j492n459m588J1487m4504
23605b0956Q413J4877p919Q036k04J6942k2008l4688p111k777J3418K8072p20
23592f625j1579J2282K7120j0621l5828j9623K0722j1872R348q686R081L989k5445
23579d7737R301j0225L090J2449K7692L995o296R800k5909k8952R335J8369O613
$$ plain form
23566 -18475 -20859 -56017 -57777 -38237 -28940 -53734 -53047 -66329 -17868 13845 5912 -33630 -51936
23553 -51936 -75536 -60960 -24506 -5760 -13214 -17040 -13360 -20133 -8557 -4487 4450 -6948 -14957
23540 -14957 3670 10100 -3715 -28853 -39754 -8449 16787 6963 12849 31552 36313 -990
23528 -990 -41146 -14810 29891 50097 10393 -16416 -23506 -45052 -1432 60509 48369 57827
23516 57827 38619 45100 85306 60283 26826 15664 -13044 -27240 -41353 -55863 -11030 13293
23504 13293 66625 62920 58509 29470 -18758 -67576 -91207 -74838 -46494 -39882 -32234 -14472
23492 -14472 -22106 -43273 -67442 -50969 -26406 -3238 2247 18891 11984 15722 17193 -20936 -22334
23479 -22334 -9963 -10960 -14381 -43914 -51758 -5500 -12499 6856 18035 8621 -2703 -4350 -48177
$$ packed form
23566a8475k384l5158j760J9540R297k4794O87j3282M8461L1713p933l9542j8306
23553e1936k3600J4576L6454J8746p454l826L680o773J1576M070Q937j1398q009
23540a4957J8627O430j3815k5138j0901L1305K5236r824N886J8703M761l7303
23528i90m0156K6336M4701K0206l9704k6809p090k1546M3620O1941j2140R458
23516E7827j9208O481M0206k5023l3457j1162k8708j4196j4113j4510M4833K4323
23504A3293N3332l705m411k9039m8228m8818k3631J6369K8344O612P648J7762
23492a4472p634k1167k4169J6473K4563K3168N485J6644o907L738J471l8129j398
23479b2334J2371r97l421k9533p844M6258o999J9355J1179r414j1324j647m3827
$$ plain form
23466 -48177 -94973 -70010 -43888 -31990 -8187 21940 31782 47952 38462 -2140 -1127 -29480
23454 -29480 -33841 -15412 14038 -1168 -41007 -37370 -55508 -57664 -16358 -11022 3428 -7477
23442 -7477 -26976 -18448 -16998 12602 40474 21385 9253 -5046 43039 57614 62514 63919 68093
23429 68093 50493 63095 29869 -53195 -81100 -42954 -41969 -20223 -16864 1536 -14751 -19588
23417 -19588 -19859 -9259 3409 43415 63627 44651 22924 47211 41421 11118 11979 9364 5916
23404 5916 498 9213 9728 5188 -6361 -27786 -38404 -6872 14158 18853 29042 18074 -7331
23391 -7331 -9522 2863 18424 5614 -8369 1503 70299 54783 20737 19093 25287 33693 25994
23378 25994 -432 -34901 -58101 -64131 -84841 -94297 -66126 -16463 -32465 -46511 -84825 -87804
$$ packed form
23466d8177m6796K4963K6122J1898K3803L0127R842J6170r490m0602J013k8353
23454b9480m361J8429K9450j5206l9839L637j8138k156M1306N336J4450j0905
23442g477j9499Q528J450K9600K7872j9089j2132j4299M8085J4575M900J405M174
23429F8093j7600J2602l3226q3064k7905L8146R85K1746L359J8400j6287m837
23417a9588k71J0600J2668M0006K0212j8976k1727K4287n790l0303Q61k615l448
23404E916n418Q715N15m540j1549k1425j0618L1532K1030M695J0189j0968k5405
23391g331k191J2385J5561j2810j3983R872O8796j5516l4046j644O194Q406p699
23378B5994k6426l4469k3200o030k0710r456K8171M9663j6002j4046l8314k979
$$ plain form
23366 -87804 -81296 -72169 -61665 -40633 -3779 34287 34197 4655 6133 19544 34768 48391 50108
23353 50108 35856 57274 41223 4233 -11377 -7205 8739 20125 22327 14519 -10580 -27651
23341 -27651 -31056 -39126 -65991 -78369 -58613 -21318 6167 14237 11287 -27696 -60751 -61481 -4696
23328 -4696 2735 -34510 -11633 -15139 -39861 -41985 -42049 -15315 -8111 14177 -15059 -16216 -27530
23315 -27530 -40038 4016 13217 -4108 -9384 -20060 -49698 -23034 9856 -6921 -35133 -40934
23303 -40934 -13185 10359 -957 4969 21375 29242 66613 89288 71183 56151 29788 41050
23291 41050 31944 -11674 -43717 -46039 -16841 14078 1742 -45544 -71405 -81847 -69837 -21557
23279 -21557 -9960 -7355 -630 24731 66282 16990 -10376 -17821 -3531 15574 7810 13701 27593
$$ packed form
23366h7804O508R127J0504K1032L6854L8066r0k9542J478J3411J5224J3623J717
23353E0108j4252K1418j6051l6990j5610M172J5944J1386K202p808k5099j7071
23341b7651l405q070k6865j2378J9756L7295K7485Q070k950l8983l3055p30N6785
23328d696P431l7245K2877l506k4722k124o4K6734P204K2288k9236j157j1314
23315b7530j2508M4054R201j7325n276j0676k9638K6664L2890j6777k8212n801
23303d0934K7749K3544j1316N926J6406P867L7371K2675j8105j5032k6363J1262
23291D1050r106m3618l2043k322K9198L0919j2336m7286k5861j0442J2010M8280
23279b1557J1597K605O725K5361M1551m9292k7366p445J4290J9105p764N891J3892
$$ plain form
23266 27593 32085 35253 69205 68233 26017 21948 14563 13565 21279 6401 -25866 -18558 -47064 -51422
23252 -51422 -45151 -21596 -11369 -7417 -48771 -40890 -6750 9535 2411 21233 -13854 -35769
23240 -35769 -32114 -18623 -18178 -7756 -12057 -26927 -33118 -6052 20840 23402 8449 -7577 -8063
23227 -8063 18114 53808 41369 20159 29752 25784 -523 3905 35163 9592 28133 56470
23215 56470 18752 9402 32810 28824 3557 18714 59533 6778 18508 31717 18400 14011
23203 14011 17933 12545 1928 -13924 -7761 10376 19702 -2245 -15725 -2031 3220 -28957 -57066
23190 -57066 -35033 -29855 -55656 -49866 -40846 -22408 -14363 -11632 -8980 8145 27319 31223 25666
23177 25666 3542 -17175 -50395 -61149 -40384 -46630 -54272 -34153 -18472 -54973 -76966 -67429
$$ packed form
23266B7593M492L168L3952r72m2216m069p385r98P714j4878l2267P308k8506m358
23252e1422O271K3555J0227L952m1354P881L4140J6285p124J8822l5087k1915
23240c5769L655J3491M45J0422m301j4870o191K7066K6892K562j4953j6026m86
23227h063K6177L5694j2439k1210R593l968k6307M428L1258k5571J8541K8337
23215E6470l7718r350K3408l986k5267J5157M0819n2755J1730J3209j3317m389
23203A4011L922n388j0617j5852O163J8137R326k1947j3480J3694N251l2177k8109
23190e7066K2033N178k5801N790R020J8438Q045K731K652J7125J9174L904n557
23177B5666k2124k0717l3220j0754K0765o246p642K0119J5681l6501k1993R537
$$ plain form
23165 -67429 -48044 -4486 1664 -25850 -52799 -49848 -28630 -11479 2420 -32342 -24462 -12170
23153 -12170 8547 -5969 5564 12531 12139 13567 -518 -15630 -31777 -39771 -58473 -17839 31568
23140 31568 12830 -1387 -25286 -49906 -36759 -67871 -101808 -81042 -81835 -59599 -51672 -67537
23128 -67537 -75475 -66701 -89726 -110491 -100263 -123605 -144966 -98472 -43858 -16231 3650 7158
23116 7158 -1982 557 1975 -5252 -9509 -17498 -19895 11600 10215 -11223 -17563 -21200 17333 23772
23102 23772 20521 39954 57262 25028 -10786 -14410 -30233 -22575 -19070 -17125 -50498 -56600 -49941
23089 -49941 -34608 -44493 -33466 -18511 -29390 -21695 -28079 -45608 -29231 -30379 -21136 22011 56183
23076 56183 10709 -4526 -45597 -41865 -60155 -38465 -25928 -18151 32576 46693 57876 32366
$$ packed form
23165f7429J9385M3558O150k7514k6949K951K1218J7151J3899l4762P880J2292
23153a2170K0717j4516J1533O967l92J428j4085j5112j6147p994j8702M0634M9407
23140C1568j8738j4217k3899k4620J3147l1112l3937K0766p93K2236P927j5865
23128f7537p938Q774k3025k0765J0228k3342k1361M6494N4614K7627J9881L508
23116G158r140K539J418p227m257p989k397L1495j385k1438o340l637L8533O439
23102B3772l251J9433J7308l2234l5814l624j5823P658L505J945l3373o102O659
23089d9941J5333r885J1027J4955j0879P695o384j7529J6377j148R243M3147L4172
23076E6183m5474j5235m1071L732j8290K1690J2537P777N0727J4117J1183k5510
$$ plain form
23064 32366 3697 9534 12176 -751 6661 16277 7817 -24382 -16234 -2891 -4360 -13475 8804
23051 8804 26074 53760 23065 -19615 -43232 -30925 13189 28565 35094 27040 38434 35207
23039 35207 38339 23431 5419 27701 19376 10556 7221 -3532 715 26159 68346 94854 43141
23026 43141 -12819 -48601 -36788 -20460 9200 25218 30264 21536 55286 56573 25818 -6325
23014 -6325 -5004 172 -6602 -7225 -60281 -60989 -70831 -66263 -52388 -38536 -43982 -36192 -11613 23821
23000 23821 35658 16320 -26822 -71084 -38921 -22222 -2065 -4994 -32544 -54688 -37556 -59060
22988 -59060 -41531 27714 37361 -991 -55957 -87817 -90640 -91198 -98967 -106469 -92294 -67630 -34406
22975 -34406 -12355 -29559 -38042 14621 11358 -8284 -8195 7268 -2577 6743 23651 8704 16042
$$ packed form
23064C2366k8669N837K642j2927P412R616q460l2199Q148J3343j469r115K2279
23051H804J7270K7686l0695m2680k3617J2307M4114J5376O529q054J1394l227
23039C5207L132j4908j8012K2282q325q820l335j0753M247K5444M2187K6508n1713
23026D3141n5960l5782J1813J6328K9660J6018N046q728L3750J287l0755l2143
23014f325J321N176o774o23n3056p08r842M568J3875J3852n446P790K4579L5434
23000B3821J1837j9338m3142m4262L2163J6699K0157k929k7550k2144J7132k1504
22988e9060J7529O9245R647l8352n4966l1860k823n58p769p502J4175K4664L3224
22975c4406K2051j7204q483N2663l263j9642Q9J5463r845R320J6908j4947P338
$$ plain form
22962 16042 -14327 -49067 -82392 -88414 -38927 -45168 -49473 -17416 2977 -19054 -6691 7066
22950 7066 5901 4667 38108 39724 4571 -43433 -42596 -6497 -22648 -27334 -42031 -21445 -17666
22937 -17666 -19787 -48673 -50107 -38015 -532 23623 33502 38758 23937 21730 32630 -2570 -29279
22924 -29279 -36639 -15879 -28385 -52510 -41721 -6495 -7857 14227 17727 -23129 -41391 -25325
22912 -25325 -51688 -69928 -33487 -60472 -42236 -60946 -90876 -58145 -50425 -33813 -30088 -57726
22900 -57726 -73072 -67621 -76715 -85250 -110469 -95240 -53431 -43219 -62421 -47184 -27828 -56676
22888 -56676 -52931 -44475 -75368 -78058 -89753 -109965 -91490 -67036 -53010 -47156 -35623 -5693
22876 -5693 -6540 -16997 -28626 -41261 -49840 -26824 -47637 -54472 -15631 10549 14392 9384 13017
$$ packed form
22962A6042l0369l4740l3325o022M9487o241m305L2057K0393k2031J2363J3757
22950G066j165j234L3441J616l5153m8004Q37L6099j6151m686j4697K0586L779
22937a7666k121k8886j434J2092L7483K4155R879N256j4821k207J0900l5200k6709
22924b9279p360K0760j2506k4125J0789L5226j362K2084L500m0856j8262J6066
22912b5325k6363j8240L6441k6985J8236j8710k9930L2731P720J6612L725k7638
22900e7726j5346N451r094q535k5219J5229M1809J0212j9202J5237J9356k8848
22888e6676L745Q456l0893k690j1695k0212J8475K4454J4026N854J1533K9930
22876e693q47j0457j1629j2635q579K3016k0813o835L8841K6180L843n008L633
$$ plain form
22863 13017 18470 10511 -22882 -9557 -555 24674 33092 25067 7414 -38374 -29761 -8641 -16790
22850 -16790 -13603 -1749 -5194 -14204 -7134 -1611 6978 -30575 -7941 8818 -19314 -45370 -38725
22837 -38725 -38997 -34880 -39171 -23990 -40489 -61172 -26409 -23640 -32074 -14546 -43728 -48033 -45747
22824 -45747 -64226 -70979 -66728 -51589 -17454 27982 46751 37936 -1958 11189 19967 -15505
22812 -15505 -32672 -43023 -17556 36762 55398 48373 19142 4708 16142 -6965 -63315 -68877
22800 -68877 -49588 -54780 -33242 16595 -3830 -29727 -9344 -1493 -28079 -26325 -31134 3917
22788 3917 31907 36398 16363 5857 -13536 -36089 -34946 -64396 -71277 -41808 -23420 -35573
22776 -35573 -43274 -65044 -69107 -90160 -67424 -59509 -43875 -21107 -5168 3427 9106 -19360 -29389
$$ packed form
22863A3017N453p959l3393J3325R002K5229Q418q025j7653m5788Q613K1120q149
22850a6790L187J1854l445r010P070N523Q589l7553K2634J6759k8132k6056O645
22837c8725k72M117m291J5181j6499k0683L4763K769q434J7528k9182m305K286
22824d5747j8479o753M251J5139L4135M5436J8769q815l9894J3147Q778l5472
22812a5505j7167j0351K5467N4318J8636p025k9231j4434J1434k3107n6350n562
22800f8877J9289n192K1538M9837k0425k5897K0383P851k6586J754m809L5051
22788C917K7990M491k0035j0506j9393k2553J143k9450o881K9469J8388j2153
22776c5573p701k1770m063k1053K2736P915J5634K2768J5939Q595N679k8466j0029
$$ plain form
22763 -29389 -36211 -13419 12243 38813 47534 19473 -20704 -18360 -32334 -9173 -16543 -10272 60304
22750 60304 43476 28916 -4971 -24290 33935 53587 10046 -41207 -23968 24124 10252 -22786
22738 -22786 -21528 8995 33401 35887 20679 -27497 -19093 -26430 -7131 2019 24927 47364 -4227
22725 -4227 -46443 -48001 -18862 -1242 901 6383 7375 26063 16173 5192 -11679 1437 32
22712 32 2312 -4932 -3212 -10244 -65985 -103348 -123181 -73295 5107 56570 52809 57728 33242
22699 33242 4868 -18731 -24115 -9822 19658 49303 41260 17047 14980 2861 584 17849
22687 17849 17051 36247 5560 5792 1855 -26668 -13327 -31501 -52126 -42102 -58950 -16320 56118
22674 56118 64807 25264 10370 15219 7954 -16484 -20337 -55831 -55180 -18174 -3352 -14491 -48133
$$ packed form
22763b9389o822K2792K5662K6570Q721k8061m0177K344j3974K3161p370O271P0576
22750F0304j6828j4560l3887j9319N8225J9652m3541n1253J7239M8092j3872l3038
22738b2786J258L0523K4406K486j5208m8176Q404p337J9299R150K2908K2437n1591
22725d227m2216j558K9139J7620K143N482R92J8688r890j0981j6871J3116j405
22712C2K280p244J720p032n5741l7363j9833M9886P8402N1463l761M919k4486
22699C3242k8374k3599n384J4293K9480K9645q043k4213k067j2119k277J7265
22687A7849p98J9196l0687K32l937k8523J3341j8174k0625J0024j6848M2630P2438
22674E6118Q689l9543j4894M849p265k4438l853l5494O51L7006J4822j1139l3642
$$ plain form
22661 -48133 -55322 -30722 -27796 -24200 -3629 -5867 -7671 -8905 -6485 16244 6572 3349 -53233
22648 -53233 -48425 4288 41138 18933 3164 -13319 -31014 5331 -5909 -3475 -5052 -25771
22636 -25771 -34835 -28507 1400 18158 30501 32932 29737 10505 -45375 -92720 -72563 -44361
22624 -44361 -45493 -22810 9582 6914 23820 39038 33880 42179 45355 6906 -6803 -34623 -50503
22611 -50503 -50989 -74653 -78319 -45333 -861 27248 5640 -29915 17996 32678 4470 9062
22599 9062 20631 36946 36198 11847 -14921 -40523 -67025 -70910 -56536 -28389 -26468 -54682 -47974
22586 -47974 -59796 -57387 -68430 -54148 -31425 -17592 15177 14139 -10266 -42326 -50348 -30008
22574 -30008 -9840 -33380 -39031 -19357 -658 25148 31444 15990 38639 49076 5968 -35344
$$ packed form
22661d8133p189K4600K926L596K0571k238j804j234K420K2729r672l223n6582
22648e3233M808N2713L6850k2205j5769j6483j7695L6345j1240K434j577k0719
22636b5771r064O328K9907J6758J2343K431l195j9232n5880m7345K0157K8202
22624d4361j132K2683L2392k668J6906J5218n158Q299L176l8449j3709k7820j5880
22611e0503m86k3664l666L2986M4472K8109k1608l5555M7911J4682k8208M592
22599I062J1569J6315p48k4351k6768k5602k6502l885J4374K8147J921k8214O708
22586d7974j1822K409j1043J4282K2723J3833L2769j038k4405l2060q022K0340
22574c0008K0168k3540n651J9674J8699K5806O296j5454K2649J0437m3108m1312
$$ plain form
22562 -35344 -62786 -59005 -32736 -27360 -27671 -26224 -15311 -11133 1929 -13046 -41241 -36583 -36733
22549 -36733 -38773 -9906 -13877 -37644 -51536 -55255 -11045 12433 -11569 -23061 -8295 6304
22537 6304 -22403 -20138 -11650 -31111 -30890 -31495 -46112 -68092 -49235 -91489 -67823 -49933 -34695
22524 -34695 -25142 -30662 -12569 17220 51595 61559 53204 57870 46486 30516 24774 41430 20007
22511 20007 -23077 -47995 -59117 -35678 -25782 -44851 -45287 -25606 -4686 -17706 -23327 23070
22499 23070 62231 87089 80007 35830 -119 -353 -26760 -9392 32868 24769 6977 15091 5788
22486 5788 -37865 -24356 7231 26890 11602 4355 10503 26633 -5443 -26705 -18252 -25406 -20837
22473 -20837 4489 41665 47097 15892 -22447 -14572 -21069 -27897 -4540 7691 25688 49018
$$ packed form
22562c5344k7442L781K6269N376l11J447J0913M178J3062j4975k8195M658j50
22549c6733k040K8867l971k3767j3892l719M4210K3478k4002j1492J4766J4599
22537F304k8707K265Q488j9461K21o05j4617k1980J8857m2254K3666J7890J5238
22524c4695R553n520J8093K9789L4375R964q355M666j1384j5970n742J6656k1423
22511B0007m3084k4918j1122K3439R896j9069m36J9681K0920j3020n621M6397
22499B3070L9161K4858p082m4177l5949k34k6407J7368M2260q099j7792Q114r303
22486E788m3653J3509L1587J9659j5288p247O148J6130l2076k1262Q453p154M569
22473b0837K5326L7176N432l1205l8339P875o497o828K3357J2231J7997K3330
$$ plain form
22461 49018 33573 21611 -6289 -39138 -21060 -6807 -4134 -52238 -56328 -29809 -37531 -19381
22449 -19381 -11687 -39740 -38269 -31073 -34264 -30865 -11271 -657 12068 7016 -922 -3600 7117
22436 7117 2471 9153 10018 -22698 -32598 -33697 -33939 -40929 -13470 -21253 -31515 9952 1402 16504
22422 16504 53214 43426 1455 -4527 28467 26899 -16921 -65879 -40780 -13739 6337 13494
22410 13494 57508 110738 76620 48608 -15471 -50745 -10152 -6024 -4165 -9149 -16968 366
22398 366 -5818 -8242 -24265 -68336 -88714 -100890 -49721 -2233 23349 36406 8603 -29192
22386 -29192 -14232 -17779 -30101 -85329 -115462 -81064 -37998 -74889 -70342 -32079 187 16597
22374 16597 26805 11921 10310 19260 4506 8370 -2829 -11479 -4386 45088 60731 48176 5049
$$ packed form
22461D9018j5445j1962k7900l2849J8078J4253K673m8104m090K6519p722J8150
22449a9381P694k8053J471P196l191L399J9594J0614J2725n052p938k678J0717
22436G117m646O682Q65l2716r900j099k42o990K7459p783j0262M1467q550J5102
22422A6504L6710r788m1971n982L2994j568m3820m8958K5099K7041K0076P157
22410A3494M4014N3230l4118k8012o4079l5274M0593M128J859m984p819J7334
22398C66o184k424j6023m4071k0378j2176N1169M7488K5582J3057k7803l7795
22386b9192J4960l547j2322n5228l0133L4398M3066l6891M547L8263L2266J6410
22374A6597J0208j4884j611Q950j4754L864j1199q650P093M9474J5643j2555m3127
$$ plain form
22361 5049 14570 -8933 -25188 -24317 -30426 -8688 -13604 -30753 -36372 -34370 11329 37708 21170
22348 21170 -47606 -45847 -29201 -24633 22280 24358 33057 31445 23016 -17070 -45045 -61824 -50635
22335 -50635 -20989 -6410 -3891 -22664 -31637 -18397 -30444 -62050 -50246 -70034 -48676 -23165
22323 -23165 -7927 12056 14 -3043 -12568 -47564 -86689 -107642 -70351 -18878 -24747 -51418
22311 -51418 -35375 -44653 -73203 -67204 -53890 -35278 -15413 -10385 -20548 9193 -4987 -68053
22299 -68053 -117498 -82177 -87331 -105733 -100146 -63754 -11853 -6360 -54862 -85751 -78741 -85248 -116343
22286 -116343 -117508 -96594 -71483 -81472 -75655 -47771 -21169 -13221 -41490 -55353 -65978 -65479 -68304
22273 -68304 -60110 -8606 20670 37982 57115 25003 28733 -43 15701 9837 24216 1915
$$ packed form
22361E049R521k3503j6255Q71o109K1738m916j7149n619K002M5699K6379j6538
22348B1170o8776J759J6646M568M6913K078Q699j612q429m0086k7975j6779J1189
22335e0635K9646J4579K519j8773q973J3240j2047l1606J1804j9788K1358K5511
22323b3165J5238J9983j2042l057r525l4996l9125k0953L7291N1473n869k6671
22311e1418J6043r278k8550N999J3314J8612J9865N028j0163K9741j4180o3066
22299f8053m9445L5321n154j8402N587L6392N1901N493m8502l0889P010o507l1095
22286a16343j165K0914K5111r989N817K7884K6602P948k8269j3863j0625M99k825
22273f8304Q194N1504K9276J7312J9133l2112L730k8776J5744n864J4379k2301
$$ plain form
22261 1915 -25868 1782 -893 -16764 -19707 -18638 -15774 -9820 8245 47952 49912 12245 -6277
22248 -6277 -16562 6135 46459 34385 30579 36089 26994 33624 34531 14677 -5762 26128 14769
22235 14769 2084 -818 6586 8058 38020 7337 1202 -15482 -48513 -25729 -37180 -62617
22223 -62617 -39322 -39067 -56515 -57097 -49520 -49532 -52290 -29931 15197 8704 1996 -17732 -39670 -55877
22209 -55877 -43784 -40338 -35885 20407 59810 50460 49541 38046 27805 25162 19741 -2435 -2768
22196 -2768 -9656 -20910 11106 17665 5160 -3183 -10601 26305 37502 20945 68086 72060 40726
22183 40726 20689 19728 29752 65479 53353 12820 16319 -138 -14224 -6432 -24261 -38202
22171 -38202 -80913 -79491 -45271 -1193 22718 12100 -13391 -53843 -55933 -41291 -68399 -62470
$$ packed form
22261A915k7783K7650k675j5871k943J069K864N954J8065L9707J960l7667j8522
22248f277j0285K2697M0324j2074l806N510r095O630R07j9854k0439L1890j1359
22235A4769j2685k902P404J472K9962l0683o135j6684l3031K2784j1451k5437
22223f2617K3295K55j7448n82P577j2k758K2359M5128o493o708j9728k1938j6207
22209e5877J2093L446M453N6292L9403r350r19j1495j0241k643n421k2176l33
22196b768o888j1254L2016O559j2505q343p418L6906J1197j6557M7141L974l1334
22183D0726k0037r61J0024L5727j2126m0533L499j6457j4086P792j7829j3941
22171c8202m2711J422L4220M4078K3911j0618k5491m0452k090J4642k7108N929
$$ plain form
22159 -62470 -49828 -23961 -16523 -204 5350 11682 18197 5152 13144 -665 19253 22381 -21295
22146 -21295 -77937 -78703 -40713 -31222 -30582 -49391 -17472 4723 16686 469 -12395 -20101 -27762
22133 -27762 -18845 -18538 -9957 -23143 -16664 -9976 -1655 8130 18210 42896 10304 -1695 6375
22120 6375 -7255 -33193 -27693 -12129 -22296 -37381 -23849 22034 33061 20083 32690 31572
22108 31572 29424 29454 -13047 -66279 -61207 -35181 -40702 -16587 10440 -664 -11199 -15981 -6837
22095 -6837 -22288 -17105 -38610 -45066 -10025 -271 -14618 -13075 15680 -5907 -22745 -9747 -19106
22082 -19106 -21558 -17989 19167 33092 17416 28208 45016 84958 74153 19489 -28315 -42926
22070 -42926 -44516 -38076 -28985 -12771 2087 -20020 -16783 -6325 3305 9515 495 4741 9648
$$ packed form
22159f2470J2642K5867P438J6319N554O332O515j3045P992j3809J9918L128m3676
22146b1295n6642p66L7990R491O40j8809L1919K2195J1963j6217j2864p706p661
22133b7762Q917L07Q581j3186O479O688Q321R785J0080K4686l2592j1999Q070
22120F375j3630k5938N500J5564j0167j5085J3532M5883J1027j2978J2607j118
22108C1572k148L0m2501n3232N072K6026n521K4115K7027j1104j0535m782R144
22095f837j5451N183k1505o456L5041R754j4347J543K8755k1587j6838J2998r359
22082a9106k452L569L7156J3925j5676J0792J6808L9942j0805n4664m7804j4611
22070d2926j590O440R091J6214J4858k2107L237J0458R630O210r020M246M907
$$ plain form
22057 9648 -31495 -31603 -38787 -43177 -5749 5055 -20381 -39747 -33164 -20285 -41133 -42076 -23562
22044 -23562 -44336 -43516 -18459 25783 39354 6554 10508 -2482 -25113 -7696 -7369 17254 20996
22031 20996 13842 -12513 -72626 -75805 -52134 -27263 -11872 6267 14324 38714 27909 14172
22019 14172 6196 255 16644 5648 -29421 -35785 -27893 -5684 1681 -53033 -39679 -57011 -76181
22006 -76181 -67161 -9319 41764 54329 37533 36053 13256 17596 6217 12047 29165 7044
21994 7044 -19920 -13070 29340 42142 29294 -22292 -18106 -51629 -71847 -54432 -44665 -16598
21982 -16598 2135 1003 22671 35900 46031 41589 7498 -4107 11927 7168 14142 11
21970 11 -5076 -3992 33621 64700 65242 16746 -1109 7684 2088 8989 18718 2044 -6662 19583
$$ packed form
22057I648m1143j08p184m390L7428J0804k5436j9366O583J2879k0848r43J8514
22044b3562k0774Q20K5057M4242J3571l2800L954j2990k2631J7417L27K4623L742
22031B0996p154k6355o0113l179K3671K4871J5391J8139Q057K4390j0805j3737
22019A4172p976n941J6389j0996l5069o364P892K2209P365n4714J3354j7332j9170
22006g6181R020N7842N1083J2565j6796j480k2797M340j1379N830J7118k2121
21994G044k6964O850M2410J2802j2848n1586M186l3523k0218J7415R767K8067
21982a6598J8733j132K1668J3229J0131m442l4091j1605J6034m759O974j4131
21970A1n087J084L7613L1079N42m8496j7855Q793n596O901R729j6674q706K6245
$$ plain form
21956 19583 47831 57019 55990 19149 -11647 -14181 809 34560 56583 59610 36131 34707 13292
21943 13292 -4812 784 -14245 -10534 996 5906 -2900 -28354 -20409 14185 37127 -743 15707
21930 15707 35242 24727 23384 37549 41419 22857 32768 40295 29201 8140 -14104 -25084
21918 -25084 -19614 -4444 -11393 -45869 -40980 -57381 -65548 -17825 1305 13757 36065 46211
21906 46211 32249 26130 45110 35216 20510 7449 -287 -29119 -33681 7998 -13681 -46474
21894 -46474 -38376 -25756 -3145 26951 14780 3456 4872 -7872 -1036 -12361 -15145 -8620 12453
21881 12453 4008 12578 29979 31950 -7066 -50046 -59239 -54586 -12276 4933 14141 -15308 -15393
21868 -15393 -30262 -17916 -12835 -5772 -12670 -61828 -61482 -36387 -24453 -37048 -55398 -50696 -45751
$$ packed form
21956A9583K8248R188j029l6841l0796k534J4990L3751K2023L027k3479j424k1415
21943A3292j8104N596j5029L711J1530M910q806k5454P945L4594K2942l7870J6450
21930A5707J9535j0515j343J4165L870j8562R911P527j1094k1061k2244j0980
21918b5084N470J5170o949l4476M889j6401q167M7723J9130J2452K2308J0146
21906D6211j3962o119J8980r894j4706j3061p736k8832m562M1679k1679l2793
21894d6474Q098J2620K2611L0096j2171j1324J416j2744O836j1325k784O525K1073
21881A2453q445Q570J7401J971l9016m2980r193M653M2310J7209R208k9449q5
21868a5393j4869J2346N081P063o898m9158L46K5095J1934j2595j8350M702M945
$$ plain form
21855 -45751 -65665 -67605 -55574 -14615 54567 89962 42393 4032 -16869 9559 -32010 -38701
21843 -38701 -9689 -16915 -28809 -7432 33101 53526 89596 73365 44639 14013 -23515 -59766
21831 -59766 -29010 -11016 -20713 -33466 -27020 -16196 -21143 -30577 -2410 5208 -5007 -29846 -10037
21818 -10037 -4325 -14662 -13155 4717 12627 -12185 -1373 23766 -8090 -31410 -32401 -53921 -90786
21805 -90786 -66179 -4806 -11380 -25541 -12248 6688 13302 17819 -23336 -33825 -4562 -1498
21793 -1498 -38098 -59314 -41255 -23682 -15231 -37638 -52229 -44093 -20314 6764 4317 6081 16155
21780 16155 -3077 -10399 -56940 -85431 -83213 -55509 -9606 -16762 -51547 -61915 -33346 -61381
21768 -61381 -88429 -90341 -82236 -41599 -46671 -52718 -59567 -50142 -37891 -4396 15799 18993 9689
$$ packed form
21855d5751j9914j940J2031M0959O9182L5395m7569l8361k0901K6428m1569o691
21843c8701K9012p226j1894K1377M0533K0425L6070j6231k8726l0626l7528l6251
21831e9766L0756J7994r697j2753O446J0824m947r434K8167P618j0215k4839J9809
21818a0037N712j0337J507J7872P910k4812J0812K5139l1856k3320r91k1520l6865
21805i0786K4607O1373o574j4161J3293J8936O614M517m1155j0489K9263L064
21793a498l6600k1216J8059J7573Q451k2407j4591Q136K3779K7078k447J764J0074
21780A6155j9232p322m6541k8491K218K7704M5903p156l4785j0368K8569k8035
21768f1381k7048j912Q105M0637n072o047o849R425J2251L3495K0195L194r304
$$ plain form
21755 9689 16331 -30751 -53930 -55258 -52499 -60121 -67105 -30888 -10826 -21545 8181 -4130 -28517
21742 -28517 -2093 -250 -53091 -95352 -60198 -62570 -24022 -13677 -9859 -21613 -42532 -50089
21730 -50089 -23785 23057 27653 29344 60800 51833 27000 37829 35443 41453 20123 17919 -2533
21717 -2533 -8336 9614 15310 5598 -4200 -5821 2345 2103 24673 31977 -3224 -27561 -8712 1971
21703 1971 13133 -1217 -13609 -8141 4912 -13564 16272 24580 39781 42062 13853 27939
21691 27939 33419 4833 -7902 -31534 -71941 -76246 -53498 -36548 -18200 -14629 -10240 -22560
21679 -22560 -57555 -78887 -48093 -64581 -93301 -76012 -88512 -75571 -65515 -58302 -16904 37946
21667 37946 69287 64496 44552 25970 23942 18192 19951 -18027 -23933 -19535 -37846 -41047 -54856
$$ packed form
21755I689O642m7082k3179j328K759p622o984L6217K0062j0719K9726j2311k4387
21742b8517K6424J843n2841m2261L5154k372L8548J0345L818j1754k0919p557
21730e0089K6304M6842M596J691L1456q967k4833J0829k386O010k1330k204k0452
21717b533n803J7950N696r712r798j621Q166k42K2570P304l5201k4337J8849J0683
21703A971J1162j4350j2392N468J3053j8476K9836Q308J5201K281k8209J4086
21691B7939N480k8586j2735k3632m0407m305K2748J6950J8348L571M389j2320
21679b2560l4995k1332L0794j6488k8720J7289j2500J2941J0056P213M1398N4850
21667C7946L1341m791j9944j8582k028n750J759l7978n906M398j8311l201j3809
$$ plain form
21654 -54856 -38047 -28512 -26169 -24876 -38099 -28466 -28677 -52844 -71951 -63291 -59777 -43507 -30526
21641 -30526 -23383 7263 -20742 6633 41487 27050 5753 -7095 -32714 -27740 -25748 812
21629 812 29680 -6501 -33823 -34202 -25185 -31689 -27367 11779 40335 13945 31190 33301 -6510
21616 -6510 24782 31522 44948 48231 46096 35366 21768 26774 6875 10536 29490 30010 49539
21603 49539 17612 -27710 -29877 -42089 -19757 5723 28849 15641 17101 65105 63541 29774
21591 29774 1888 7255 23790 -1049 272 -2206 -25207 -9634 -8604 -11637 -22555 -23680 -24582
21578 -24582 -37230 -35054 -18079 -10660 -11334 -10539 1059 -39988 -47141 -32359 -28654 -56200 -62112
21565 -62112 -76489 -40544 -19594 -26803 -54924 -58037 -58606 -50457 -25445 -23781 -54792 -52365 -35908
$$ packed form
21654e4856J6809R535K343J293j3223R633k11k4167j9107Q660L514J6270J2981
21641c0526P143L0646k8005K7375L4854j4437k1297j2848k5619M974J992K6560
21629H12K8868l6181k7322l79R017o504M322L9146K8556k6390J7245K111l9811
21616f510L1292O740J3426L283k135j0730j3598N006j9899L661J8954N20J9529
21603D9539l1927m5322k167j2212K2332K5480K3126j3208J460M8004j564l3767
21591B9774k7886N367J6535k4839J321k478k3001J5573J030l033j0918j125r02
21578b4582j2648K176J6975P419o74P95J1598m1047p153J4782L705k7546n912
21565f2112j4377L5945K0950p209k8121l113n69Q149K5012J664l1011K427J6457
$$ plain form
21552 -35908 -58348 -32725 3129 10515 52889 54835 37798 33963 7523 28295 -3743 5630
21540 5630 33890 44315 39123 24933 15518 16624 43958 60477 42311 2478 25437 47953
21528 47953 55372 45118 19761 25581 46970 56795 84245 72955 65661 61861 63704 49323 34819
21515 34819 -42014 -86879 -97713 -53868 -18218 9345 36428 17058 36218 49578 40144 12479
21503 12479 5943 16852 9012 15560 18528 1970 -5495 7975 -24809 -21204 -4705 18722 19667
21490 19667 4938 32999 -1340 -28283 -27769 -29869 -44353 177 24700 34089 8815 7172 5921
21477 5921 -25878 -7462 29246 41737 28700 7845 14915 -1447 -44927 -45482 -32244 -36884 -53531
21464 -53531 -52290 -43474 -58288 -67312 -59285 -21288 12533 21245 58484 60905 14210 19578 28626
$$ packed form
21552c5908k2440K5623L5854P386M2374J946j7037l835k6440K0772l2038R373
21540E630K8260J0425n192j4190r415J106K7334J6519j8166l9833K2959K2516
21528D7953P419j0254k5357N820K1389R825K7450j1290p294l800J843j4381j4504
21515C4819p6833m4865j0834M3845L5650K7563K7083j9370J9160J3360r434k7665
21503A2479o536J0909p840O548K968j6558p465J3470l2784L605J6499K3427R45
21490A9667j4729K8061l4339k6943N14k100j4484M4530K4523R389k5274j643j251
21477E921l1799J8416L6708J2491j3037k0855P070j6362m3480n55J3238m640j6647
21464e3531J241Q816j4814r024Q027L7997L3821Q712L7239K421m6695N368R048
$$ plain form
21451 28626 12216 -29577 -32581 -19796 277 -8779 -46414 -65687 -55993 -22080 -32246 -39995
21439 -39995 2431 47406 -1174 -53664 -64114 -39493 -9052 5758 8825 -13995 -2303 6192
21427 6192 -10157 10169 12587 38483 18090 15707 22523 8903 20888 40292 35017 9684 -2528
21414 -2528 -20909 -42912 -20257 -21177 5079 16156 320 -16898 -41542 10818 46337 49600
21402 49600 67611 44986 15570 -13310 -26455 -3551 9174 8903 15482 1626 4583 24322
21390 24322 18760 -20769 -35861 -76971 -80763 -79377 -91095 -80479 -73784 -44690 -7235 -4693 -18670
21377 -18670 -16901 -11984 -57348 -41819 -36889 -42042 -19850 -5879 9733 -29220 -62048 -71934 -96125
21364 -96125 -77341 -41205 -35252 -21906 -20349 -44219 -31973 303 -17875 -33518 3718 5169
$$ packed form
21451B8626j6410m1793l004J2785K0073r056l7635j9273R694L3913j0166p749
21439c9995M2426M4975m8580n2490j0450K4621L0441J4810L067k2820J1692Q495
21427F192j6349K0326K418K5896k0393k383O816j3620J1985J9404n275k5333j2212
21414b528j8381k2003K2655r20K6256J1077j5836j7218k4644N2360L5519L263
21402D9600J8011k2625k9416k8880j3145K2904J2725k71O579j3856K957J9739
21390B4322n562l9529j5092m1110l792J386j1718J0616O695K9094L7455K542j3977
21377a8670J769M917m5364J5529M930n153K2192J3971J5612l8953l2828r886k4191
21364i6125J8784L6136N953J3346J557k3870J2246L2276j8178j5643L7236J451
$$ plain form
21352 5169 4920 -6861 -11477 6414 18044 6383 7518 -23698 -47015 -72096 -70766 -72636 -45352
21339 -45352 -11159 -1031 -46722 -76890 -98192 -71827 -45020 -26164 -27106 -12364 11321 16649
21327 16649 -1914 -2905 -19742 -33918 -14040 -8263 -10351 3084 44763 65079 77318 49135
21315 49135 2512 -1641 -5796 -14085 -3713 5092 3683 -18090 -24517 -43556 -70401 -56052 -39972
21302 -39972 -21926 -9810 -48037 -51102 -19205 -25500 -46058 -20515 -12886 -560 -13025 -8149
21290 -8149 3457 -2716 -4687 -7701 -43717 -8392 -3368 16831 407 -7176 4961 20169 30445
21277 30445 50926 56795 39536 -14126 -29276 -13475 -24972 -40178 -25316 40393 50973 33910
21265 33910 42435 48720 46996 71216 47636 2944 -19649 -21475 -27015 -24850 -714 27619 47891
$$ packed form
21352E169k49j1781m616J7891J1630j1661J135l1216k3317k5081J330j870K7284
21339d5352L4193J0128m5691l0168k1302K6365K6807J8856r42J4742K3685N328
21327A6649j8563r91j6837j4176J9878N777k088J3435M1679K0316J2239k8183
21315D9135m6623m153m155q289J0372Q805j409k1773o427j9039k6845J4349J6080
21302c9972J8046J2116l8227l065L1897o295k0558K5543P629J2326j2465M876
21290h149J1606o173j971l014l6016L5325N024K0199j6424p583J2137J5208J0276
21277C0445K0481N869j7259n3662j5150J5801j1497j5206J4862O5709J0580j7063
21265C3910Q525O285j724K4220k3580m4692k2593j826n540K165K4136K8333K0272
$$ plain form
21252 47891 2931 -53741 -78991 -68339 -36331 -21544 -41624 -38515 -27985 -23627 -68646 -45149
21240 -45149 -23862 -37887 -42706 -57544 -7831 14116 50624 60892 40036 24193 -41477 -54489
21228 -54489 -23856 -48374 -50942 -17576 -31801 -61840 -28896 7360 40989 28614 27760 36823
21216 36823 47545 34093 18504 -21868 -26660 -12381 -25918 -29046 -4578 -2953 -43358 -43906 -47873
21203 -47873 -44314 -61053 -83549 -41570 -33781 -67129 -62017 -36707 -36504 -22559 8367 20801 15904
21190 15904 -5628 -6294 -1693 -25654 -43170 -48077 -30442 22232 74697 86676 54436 55891 58342
21177 58342 15297 9579 -10938 23343 34154 1650 -30271 -41768 -12268 22221 5102 31959
21165 31959 60379 103107 58314 28084 14100 -1627 -40337 -33317 -18091 -7599 -25845 9144
$$ packed form
21252D7891m4960n6672k5250J0652L2008J4787k0080L109J0530M358m5019K3497
21240d5149K1287j4025m819j4838M9713K1947L6508J0268k0856j5843o5670j3012
21228e4489L0633k4518k568L3366j4225l0039L2944L6256L3629j2375q54R063
21216C6823J0722j3452j5589m0372m792J4279j3537l128K4468J625m0405n48l967
21203d7873L559j6739k2496M1979P789l3348N112K5310K03J3945L0926J2434m897
21190A5904k1532o66M601k3961j7516m907J7635N2674N2465J1979l2240J455K451
21177E8342m3045n718k0517L4281J0811l2504l1921j1497K9500L4489j7119K6857
21165C1959K8420M2728m4793l0230j3984j5727l8710P020J5226J0492j8246L4989
$$ plain form
21153 9144 27646 40318 40026 21998 772 -39312 633 12891 -19969 -22580 -34455 -51215
21141 -51215 -41942 -32147 -59131 -70782 -60450 -39160 -31853 -15216 -17005 22530 44417 37973 -8201
21128 -8201 -14311 15480 31759 12470 10345 17706 -11365 -16423 -21379 -41295 -43525 -31937 -8826
21115 -8826 23172 18225 10150 23531 -7428 20269 39185 30840 15750 7212 -28437 -47193 -57682
21102 -57682 -90178 -88100 -80543 -54450 -27261 -28310 -31764 -11385 38307 -11423 -9199 2917 4406
21089 4406 18980 84 -21931 -3157 5878 42496 50833 31274 34153 -7166 -62435 -63907 -42332
21076 -42332 -21890 -21495 -12415 -30168 -46769 -34763 -13747 -46729 -25715 28664 10058 9100 38489
21063 38489 -515 -57229 -26180 365 -20997 5475 9382 29164 34028 16376 -6120 -45624
$$ packed form
21153I144J8502J2672k92j8028k1226m0084L9945J2258l2860k611j1875j6760
21141e1215R273R795k6984j1651J0332K1290P307J6637j789L9535K1887o444m6174
21128h201o110K9791J6279j9289k125P361k9071n058m956j9916k230J1588K3111
21115h826L1998m947q075J3381l0959K7697J8916q345j5090q538l5649j8756j0489
21102e7682l2496K078P557K6093K7189j049l454K0379M9692m9730K224J2116J489
21089D406J4574j8896k2015J8774R035L6618Q337j9559K879m1319n5269j472K1575
21076d2332K0442L95R080j7753j6601J2006K1016l2982K1014N4379j8606r58K9389
21063C8489l9004n6714L1049K6545k1362K6472L907J9782M864j7652k2496l9504
$$ plain form
21051 -45624 -38628 -24740 9147 22897 44139 50997 37667 47848 38281 12465 60076 63371
21039 63371 37119 29201 28571 16624 -6784 -2573 2623 -4303 -16638 -26766 -18611 -22959 -12683
21026 -12683 6080 27522 -954 -56849 -67031 -73857 -49530 -54455 -9948 12119 764 -16471
21014 -16471 -21135 -43062 -40382 -5381 -9804 -56079 -30634 -5490 -10929 -27810 -53397 -39954
21002 -39954 -3509 41771 25246 -21710 -33309 -48350 -69281 -46187 -17367 -54219 -78180 -50470
20990 -50470 -25037 -41966 -44426 -20362 -315 -19732 -30765 -44408 -16568 19816 22017 -4875
20978 -4875 -11932 -12883 -26981 -32398 -65707 -81204 -66781 -75059 -67437 -54021 -46797 -28942 -7218
20965 -7218 19346 6999 -1994 25995 46488 19417 -4752 23409 44582 20465 9201 -1513
$$ packed form
21051d5624O996J3888L3887J3750K1242O858j3330J0181r567k5816M7611L295
21039F3371k6252p918o30j1947k3408M211N196o926j2335j0128Q155m348J0276
21026a2683J8763K1442k8476n5895j0182o826K4327m925M4507K2067j1355j7235
21014a6471m664k1927K680L5001m423m6275K5445K5144n439j6881k5587J3443
21002c9954L6445M5280j6525m6956j1599j5041k0931K3094K8820l6852k3961K7710
20990e0470K5433j6929k460K4064K0047j9417j1033j3643K7840L6384K201k6892
20978d875p057r51j4098n417l3309j5497J4423q278P622J3416P224J7855K1724
20965g218K6564j2347q993K7989K0493k7071k4169K8161K1173k4117j1264j0714
$$ plain form
20953 -1513 12866 37148 30489 12743 13509 24295 40168 -11517 -42312 -15009 21768 6361
20941 6361 -9192 -25487 -15052 -2980 8104 -50720 -46594 -39702 -33680 -28147 -35557 -30074 -1067
20928 -1067 14466 37961 59308 86521 63168 27807 17872 3110 -16013 18840 10559 19287
20916 19287 -5006 -36151 -36903 -11715 6010 12333 6284 870 1982 -882 -16290 -44283 -44373 2690
20902 2690 6806 3080 -4461 6594 -3910 -6884 -6409 25321 54365 52720 13399 14357 25947 33755
20888 33755 38073 20834 -18818 -16053 4734 -10221 -26599 17633 43543 61080 75663 60749
20876 60749 67544 71667 110036 107483 108084 136242 131598 118867 112479 54949 37111 7593 7110
20863 7110 56171 34152 44158 52842 30172 26378 33605 68481 54186 44071 45251 45318 33010
$$ packed form
20953a513J4379K4282o659j7746P66J0786J5873n1685l0795K7303L6777j5407
20941F361j5553j6295J0435J2072J1084n8824M126O892O022N533p410N483K9007
20928a067J5533K3495K1347K7213k3353l5361r935j4762j9123L4853q281Q728
20916A9287k4293l1145p52K5188J7725O323o049n414J112k864j5408k7993r0M7063
20902B690M116l726p541J1055j0504k974M75L1730K9044j645l9321R58J1590P808
20888C3755M318j7239l9652K765K0787j4955j6378M4232K5910J7537J4583j4914
20876F0749O795M123L8369k553O01K8158m644j2731o388n7530j7838k9518m83
20863G110M9061k2019J0006Q684k2670l794P227L4876j4295j0115J180O7j2308
$$ plain form
20850 33010 30217 65430 68198 47251 60215 96776 133645 100680 68084 71438 82717 76491
20838 76491 56220 22778 26112 73143 92886 54045 57761 87390 84749 83985 110089 104464 57220
20825 57220 22773 34790 45454 35746 29140 17760 -1755 -34353 -36252 2952 -80 27487
20813 27487 25745 28698 64783 73614 41112 11690 8352 16805 -20862 -22949 -11341 -13380 -8099
20800 -8099 27417 64003 70601 51113 52701 45340 52761 73074 68361 53919 32185 52522 78858
20787 78858 77565 72303 70066 64866 67524 30436 16199 6032 7438 -48169 -5503 33059 1269
20774 1269 -15399 42591 48709 32242 16191 7740 14054 18387 25265 33991 19683 4231 11954
20761 11954 17002 39994 24809 16007 15002 20089 26276 19757 -16093 4128 40998 55869 78320
$$ packed form
20850C3010k793L5213K768k0947J2964L6561L6869l2965l2596L354J1279o226
20838G6491k0271l3442L334M7031J9743l8841L716K9629k641p64K6104n625m7244
20825E7220l4447J2017J0664r708o606j1380j9515l2598j899L9204l032K7567
20813B7487j742K953L6085Q831l2502k9422l338Q453l7667k087J1608k039N281
20800h099L5516L6586O598j9488J588p361P421K0313m713j4442k1734K0337K6336
20787G8858j293n262k237n200K658l7088j4237j0167J406n5607M2666L8562l1790
20774A269j6668N7990O118j6467j6051q451O314M333O878Q726j4308j5452P723
20761A1954N048K2992j5185q802j005N087O187o519l5850K0221L6870J4871K2451
$$ plain form
20748 78320 83085 46740 -6560 -1841 45709 69117 82895 90041 67978 79769 91157 68548
20736 68548 50772 78387 74512 51172 24827 26081 13714 9317 37726 23587 28432 69334
20724 69334 56287 84171 112629 83264 22407 26405 52890 64590 80789 75394 45508 45619
20712 45619 43729 52373 65774 92161 89276 33457 9913 -367 16107 12569 9337 27333 33041
20699 33041 -11494 -47257 -42848 -44408 -7012 41942 37593 33908 16454 -16900 -51421 -54846 -47441
20686 -47441 -29016 -45952 -16227 -15548 -66452 -41381 -27980 -49434 -81969 -73469 -44767 -50253
20674 -50253 -73243 -81254 -68379 -56257 -11116 -16237 -28315 -4454 -38974 -52200 -3415 37391
20662 37391 39103 30023 45121 26855 -4579 -1269 27288 38267 26168 38698 36378 39796 37704
$$ packed form
20748G8320M765l6345n3300M719M7550K3408J3778P146k2063J1791J1388k2609
20736F8548j7776K7615l875k3340k6345J254j2367m397K8409j4139M845M0902
20724F9334j3047K7884K8458k9365o0857L998K6485J1700J6199n395k9886J11
20712D5619j890Q644J3401K6387k885n5819k3544j0280J6474l538l232J7996N708
20699C3041m4535l5763M409j560L7396M8954m349l685j7454l3354l4521l425P405
20686d7441J8425j6936K9725O79n0904K5071J3401k1454l2535Q500K8702n486
20674e0253k2990q011J2875J2122M5141n121j2078K3861l4520j3226M8785M0806
20662C7391J712r080J5098j8266l1434L310K8557J0979j2099J2530k320L418k092
$$ plain form
20649 37704 8763 -72894 -55938 -38759 -10701 23152 40272 54306 46675 46687 28998 28523 16065
20636 16065 39521 62834 77067 75478 50838 39784 29910 16925 8263 6587 -3116 -5228 38561
20623 38561 28949 16986 47874 74713 69464 68898 79420 74026 41552 39255 58617 81677 75404
20610 75404 42382 213 -18602 -20352 379 -13864 -54461 -5560 4307 2465 11718 17838 43562
20597 43562 35927 39774 14253 13256 -1420 4074 21297 29960 8624 5015 13714 35701 82499
20584 82499 81864 96277 103483 95423 87688 88065 92224 85457 93528 77615 84246 136300 109592 40146
20570 40146 2922 45385 91789 133900 99867 75314 128271 125284 50784 -12457 -19376 -1640
20558 -1640 12419 8176 -28132 -11893 -2929 18232 -13124 -29586 9783 47034 49152 46759 32985
$$ packed form
20649C7704k8941q1657J6956J7179K8058L3853J7120J4034p631J2j7689m75j2458
20636A6065K3456K3313J4233j589k4640j1054r874j2985q662j676r703k112M3789
20623C8561r612j1963L0888K6839n249n66J0522n394l2474k297J9362K3060o273
20610G5404l3022m2169j8815j750K0731j4243m0597M8901R867j842R253O120K5724
20597D3562p635L847k5521r97j4676N494J7223Q663k1336l609Q699K1987M6798
20584H2499o35J4413P206q060p735L77M159o767Q071j5913O631N2054k6708o9446
20570D0146l7224M2463M6404M2111l4033k4553N2957k987p4500o3241o919J7736
20558a640J4059m243l6308J6239Q964K1161l1356j6462L9369L7251K118k393j3774
$$ plain form
20545 32985 23785 9274 34476 49088 12794 -20340 -3026 10934 24581 13582 15643 -2161
20533 -2161 5030 -13629 -35088 -36002 -42969 -22098 14718 37405 68750 67732 75104 88242 82082
20520 82082 82466 79734 77003 57056 46129 55160 26690 19519 33491 44940 73783 54169 73556
20507 73556 71766 3623 -15897 -41506 -23021 -16843 -12178 -25150 4351 21853 31550 65105
20495 65105 65215 24688 15953 39247 40468 22151 18822 2646 -30167 -44819 13910 20288 18
20482 18 -5290 -12863 -15626 -4403 -44813 -27444 -6724 14538 -5207 -29361 -1272 27319 33843
20469 33843 6310 29379 49278 37984 22777 30245 21952 10812 -4808 -12597 -38365 -39372
20457 -39372 -11042 -8655 -12346 -12190 -48108 -56927 -44868 -28052 15800 33836 10227 45620 64829
$$ packed form
20545C2985r200j4511K5202J4612l6294l3134J7314J3960J3647j0999K061j7804
20533b161P191j8659k1459r14o967K0871L6816K2687L1345j018P372J3138o160
20520H2082L84k732k731j9947j0927R031k8470p171J3972J1449K8843j9614J9387
20507G3556j790o8143j9520k5609J8485O178M665j2972K9501J7502R697L3555
20495F5105J10m0527q735K3294J221j8317l329j6176l2813j4652N8729O378k0270
20482A8n308p573k763J1223m0410J7369K0720K1262j9745k4154K8089K8591O524
20469C3843k7533K3069J9899j1294j5207P468q293j1140j5620p789k5768j007
20457c9372K8330K387l691J56l5918q819J2059J6816M3852J8036k3609L5393J9209
$$ plain form
20444 64829 75323 57014 36202 2206 7228 -13732 28768 48883 4462 4019 17237 16638 15842
20431 15842 49832 61692 57105 28630 -3506 -26021 4987 68562 72899 15875 8796 17014
20419 17014 21524 30443 12771 -9705 12891 22397 9936 25826 37496 30138 23684 5674 -20206
20406 -20206 -73052 -73882 -29218 -43399 -31718 -12391 -6319 1209 30174 35525 3129 -21438 -29070
20393 -29070 -43110 -54465 -27027 2043 658 -253 -11449 6230 -28236 -34153 -17755 -45087
20381 -45087 -40837 -14250 -8133 -34916 -38328 -34862 -13422 4749 -10405 1336 19191 17753 11592
20368 11592 17599 50883 98017 90608 46283 56207 43157 7667 5983 4179 -33341 -27012 11179
20355 11179 31580 10714 11676 35110 18920 26407 43241 20482 -4327 -12916 -7127 -4128 -42895
$$ packed form
20444F4829J0494j8309k0812l3996N022k0960M2500K0115m4421m43J3218n99p96
20431A5842L3990J1860m587k8475l2136k2515L1008O3575M337n7024p079Q218
20419A7014M510Q919j7672k2476K2596R506j2461J5890J1670p358o454j8010k5880
20406b0206n2846q30M4664j4181J1681J9327O072P528K8965N351l2396k4567p632
20393b9070j4040j1355K7438K9070j385r11j1196J7679l4466n917J6398k7332
20381d5087M250K6587O117k6783l412L466K1440J8171j5154J1741J7855j438o161
20368A1592O007L3284M7134p409m4325R924j3050l5490j684j804l7520O329L8191
20355A1179K0401k0866R62K3434j6190P487J6834k2759k4809q589N789K999l8767
$$ plain form
20342 -42895 -39176 24267 62167 69081 39537 5019 -45614 -46710 31775 41739 -14111 -42452
20330 -42452 -41065 -33853 -11079 -5667 -24271 -12911 38107 50875 9757 -206 14093 38264
20318 38264 59531 62384 47492 25762 19912 48280 42513 27760 10570 21464 27331 -6973
20306 -6973 25550 33858 34825 27721 46035 29385 14194 -10570 -16915 23805 46341 30764 27485
20293 27485 -26716 -23839 24934 50289 20540 -1268 2502 -9385 -13540 -11583 -21264 -1919 -4476
20280 -4476 -4281 -26300 37081 51863 18486 4727 -28891 -22597 -8318 25242 23897 16853 4013
20267 4013 11129 40238 34292 30810 21341 45914 64328 79269 61576 24591 -1055 -5346 -8635
20254 -8635 -3326 3048 27608 28280 39272 69283 63834 60554 35248 34260 28444 28041 22598 23051 26497
$$ packed form
20342d2895L719O3443L7900O914k9544l4518n0633j096P8485R964n5850k8341
20330d2452J387P212K2774N412j8604J1360N1018J2768m1118r963J4299K4171
20318C8264K1267K853j4892k1730n850K8368n767j4753j7190J0894N867l4304
20306f973L2523Q308R67p104J8314j6650j5191k4764o345M0720K2536j5577l279
20293B7485n4201K877M8773K5355k9749k1808L770j1887m155J957r681J9345k557
20280d476J95k2019O3381J4782l3377j3759l3618O294J4279L3560j345p044j2840
20267D013P116K9109n946l482r469K4573J8414J4941j7693l6985k5646m291l289
20254h635N309O374K4560O72J0992L0011n449l280k5306r88n816m03n443M53L446
$$ plain form
20239 26497 30059 25944 41559 11068 6549 -13088 6243 10739 -25999 -57120 -61690 -37712 -47332
20226 -47332 -9659 37726 24643 15287 7348 -3440 -3753 -11321 -5358 -8121 -3873 -14171 -23395
20213 -23395 7459 -3545 -10342 11521 37098 59510 69291 45925 16643 -11428 4254 -5098
20201 -5098 -13887 27656 26148 31653 56545 40776 40028 6297 -1285 47156 31693 2027 7813
20188 7813 61243 44520 15548 -1977 -26115 -771 3276 -30608 -54058 -28025 213 11517
20176 11517 23539 22523 28278 45022 65746 40333 2371 -31716 -25151 -15116 17867 39476
20164 39476 57422 56186 38653 6025 30337 38699 47344 56321 93138 126112 74542 42178
20152 42178 46544 9230 25812 56958 46545 -3370 43122 92725 98884 54475 3295 -7144
$$ packed form
20239B6497L562m115J5615l0491m519j9637J9331M496l6738l1121m570K3978r620
20226d7332L7673M7385j3083r356p939j0788l13p568N963k763M248j0298r224
20213b3395L0854j1004o797K1863K5577K2412R781k3366k9282k8071J5682r352
20201e098q789M1543j508N505K4892j5769p48l3731p582M8441j5463k9666N786
20188G813N3430j6723k8972j7525k4138K5344M047l3884k3450K6033K8238J1304
20176A1517J2022j016N755J6744K0724k5413l7962l4087O565J0035L2983K1609
20164C9476J7946j236j7533l2628K4312Q362Q645Q977L6817L2974n1570l2364
20152D2178M366l7314J6582L1146j0413m9915M6492M9603O159m4409n1180j0439
$$ plain form
20140 -7144 3296 7328 24502 34412 39302 22463 44280 74175 70347 21761 27723 41552 50996
20127 50996 45737 60597 34627 -14968 -41953 -6062 26945 31373 17980 23934 65339 73929
20115 73929 73138 40611 42440 49995 8161 16587 19604 2299 27697 51311 30271 19799 20170
20102 20170 33829 29579 41504 35549 29139 42877 35870 61094 63562 34611 34161 33450 23105
20089 23105 26544 25204 23518 27140 13767 11158 -24831 -108 57369 44442 23293 24923 51832
20076 51832 65399 64728 71854 65650 76569 110120 61230 46068 39243 44469 35632 17947 4337
20063 4337 -21625 -9379 -7102 4495 20645 -14492 -23942 -242 4727 10078 39372 34160 37066
20050 37066 8584 -29735 -14702 13980 20214 -4626 35763 31809 19053 72128 56351 -2928
$$ packed form
20140g144J0440M032J7174R910M890j6839K1817K9895l828m8586N962J3829R444
20127E0996n259J4860k5970m9595k6985L5891L3007M428j3393N954M1405Q590
20115G3929p91l2527J829P555m1834Q426L017j7305K5398K3614k1040j0472L71
20102B0170J3659m250J1925n955o410J3738p007K5224K468k8951m50p11j0345
20089B3105L439j340j686L622j3373k609l5989K4723N7477j2927k1149J630K6909
20076E1832J3567o71P126o204J0919L3551m8890j5162o825N226q837j7685j3610
20063D337k5962J2246K277J1597J6150l5137r450K3700M969N351K9294n212K906
20050C7066k8482l8319J5033K8682O234k4840M0389l954j2756N3075j5777n9279
$$ plain form
20038 -2928 -17985 10106 3196 -20993 -19446 -2480 -17152 -26419 12511 19016 41855 51389 62209
20025 62209 78499 76590 42778 19923 31040 21539 36120 22706 16427 30100 46720 61615
20013 61615 64379 13482 -24461 -27780 7318 -23116 -26790 -34694 5785 63723 75713 61408
20001 61408 68799 63778 44780 29851 45523 36643 18252 9905 -2337 -12174 -7531 16625 14637
19988 14637 30168 12035 3306 28054 46888 77521 42621 4978 -6279 12606 26517 9069
19976 9069 -25547 -34858 -13854 -2826 8156 15268 67805 102907 108118 69781 59478 51171 45265
19963 45265 44902 56072 11089 40335 29792 32182 48480 19194 23670 19028 12061 21348 7197
19950 7197 -1397 -24996 -8221 43339 89153 88970 108711 141243 130889 102394 93068 97428 81676
$$ packed form
20038b928j5057K8091o910k4189J547J6966j4672r267L8930O505K2839R534J0820
20025F2209J6290j909l3812k2855J1117r501J4581j3414o279J3673J6620J4895
20013F1615K764n0897l7943l319L5098l0434l674p904M0479N7938J1990j4305
20001F1408P391n021j8998j4929J5672q880j8391q347j2242r837M643K4156j988
19988A4637J5531j8133q729K4748J8834L0633l4900l7643j1257J8885J3911j7448
19976I069l4616r311K1004J1028J0982P112N2537L5102N211l8337j0303q307n906
19963D5265l63J1170m4983K9246j0543K390J6298k9286M476m642o967R287j4151
19950G197q594k3599J6775N1560M5814j83J9741L2532j0354k8495r326M360j5752
$$ plain form
19937 81676 48637 38127 28664 18363 -24121 17661 57648 50591 64614 75438 28725 26698
19925 26698 39205 17043 7689 38784 58975 68302 59795 59375 102910 69283 25102 20226 67237
19912 67237 58334 36084 42364 87654 75879 57577 53986 40092 45916 25375 17299 48761 26678
19899 26678 -507 2299 8676 16466 -17035 -9836 24952 26753 2012 8758 23208 66626 82590
19886 82590 70615 54998 25866 -14919 -29131 -14203 36066 55797 68161 89488 51926 27654
19874 27654 29545 10707 1797 72075 102164 62291 7355 -16893 25914 88580 100636 87413
19862 87413 57881 53564 47103 66762 72504 71277 61608 84630 54661 65936 84233 72570 33141
19849 33141 163 8249 36297 76148 63530 51406 43908 57372 53599 54275 35370 26425 -11167
$$ packed form
19937H1676l3039j0510r463j0301m2484M1782L9987p057J4023J0824m6713k027
19925B6698J2507k2162r354L1095K0191R327q507m20M3535l3627m4181m876M7011
19912F7237q903k2250O280M5290j1775j8302l591j3894N824k0541q076L1462k2083
19899B6678k7185K806O377P790l3501P199L4788J801k4741O746J4450M3418J5964
19886H2590j1975j5617k9132m0785j4212J4928N0269J9731J2364K1327l7562k4272
19874B7654J891j8838q910P0278L0089l9873n4936k4248M2807O2666J2056j3223
19862H7413k9532m317o461J9659N742j227r669K3022k9969J1275J8297j1663l9429
19849C3141l2978Q086K8048L9851j2618j2124p498J3464l773O76j8905q945l7592
$$ plain form
19836 -11167 -51263 -27872 11473 64447 40897 20893 37545 52960 41727 45562 65267 33806
19824 33806 23440 -1945 15961 5195 -868 31007 72705 45337 18528 37169 45465 74242
19812 74242 91935 67842 6943 -21318 -13643 35462 51337 39522 37652 70877 63338 32200
19800 32200 15460 -4620 -734 1588 64294 90542 70760 68061 102229 34619 14458 34478
19788 34478 25500 31039 44018 -14602 -15068 -26498 -33111 -8447 -36342 -34566 -1206 20658 -10917
19775 -10917 -25312 -19435 15400 34757 26410 1291 52106 39588 1944 -13038 -1576 32185
19763 32185 68017 65672 56476 28774 -19244 3978 17477 28669 23781 34388 44238 35636 51298
19750 51298 44647 37940 38059 61404 61598 26218 17800 18465 8245 28308 76791 89033 66159
$$ packed form
19836a1167m0096K3391L9345N2974k3550k0004J6652J5415j1233L835J9705l1461
19824C3806j0366k5385J7906j0766o063L1875M1698k7368k6809J8641Q296K8777
19812G4242J7693k4093o0899k8261P675M9105J5875j1815j870L3225p539l1138
19800C2200j6740k0080L886K322O2706K6248j9782k699L4168o7610k0161K0020
19788C4478q978N539J2979n8620m66j1430o613K4664k7895J776L3360K1864l1575
19775a0917j4395N877L4835J9357q347k5119N0815j2518l7644j4982J1462L3761
19763C2185L5832k345r196k7702m8018K3222J3499J1192m888J0607R850q602J5662
19750E1298o651o707J19K3345J94l5380q418O65j0220K0063M8483J2242k2874
$$ plain form
19737 66159 59574 59854 36557 8827 37247 54398 65731 73563 128943 144887 101703 57710
19725 57710 62999 62506 29615 -2267 -18273 9452 32102 69648 97097 72389 68222 93745
19713 93745 97052 56281 39123 37499 43538 70223 110904 95396 35311 1483 11261 32950
19701 32950 46791 47552 37214 16327 45910 48114 36908 19110 17337 62883 94530 125148
19689 125148 120688 86532 61569 120467 98916 58211 6733 22077 16841 -5223 49396 67108
19677 67108 44124 21370 33842 76534 104048 78725 51261 37078 53837 40150 6233 1930
19665 1930 39800 59028 82537 86662 56027 65010 113260 124597 123509 126570 130189 121370 91663
19652 91663 54964 70354 65028 89769 91334 90213 98225 107688 131313 125378 128982 111976 114796
$$ packed form
19737F6159o585K80k3297k7730K8420J7151J1333P832N5380J5944m3184m3993
19725E7710N289m93l2891l1882j6006K7725K2650L7546K7449k4708m167K5523
19713I3745L307m0771j7158j624O039K6685M0681j5508o0085l3828R778K1689
19701C2950J3841P61j0338k0887K9583K204j1206j7798j773M5546L1647L0618
19689A25148m460l4156k4963N8898k1551m0705n1478J5344n236k2064N4619J7712
19677F7108k2984k2754J2472M2692K7514k5323k7464j4183J6759j3687l3917m303
19665A930L7870J9228K3509M125l0635Q983M8250J1337j088L061L619q819k9707
19652I1663l6699J5390n326K4741J565j121Q012R463K3625n935L604j7006K820
$$ plain form
19639 114796 92718 57478 64499 42532 38425 41830 34229 43009 71639 71636 56079 49310 38001
19626 38001 41959 49031 86549 91939 71859 61781 81872 61087 75026 117190 126112 76114
19614 76114 60234 51042 83962 116496 115056 74104 31490 20069 4513 6714 36407 40578
19602 40578 40130 57733 45858 54948 48069 24111 48910 46905 71301 91610 66495 43347 48082
19589 48082 54325 60331 84103 90545 86772 101229 90851 55275 22987 20896 13785 45946 54573
19576 54573 51583 47032 77002 68031 77529 63849 47924 86872 147041 155509 154418 115843 111474
19563 111474 140219 127711 86989 61513 39816 69376 76054 47581 8492 -13416 -28358 15631
19551 15631 57050 76413 105549 121733 133698 102174 98009 153828 184395 164564 138386 108194
$$ packed form
19639A14796k2078l5240P021k1967m107L405p601Q780K8630lj5557o769j1309
19626C8001L958P072L7518N390k0080j0078K0091k0785J3939M2164Q922m9998
19614G6114j5880r192L2920L2534j440m0952m2614j1421j5556K201K9693M171
19602D0578m48J7603j1875R090o879k3958K4799k005K4396K0309k5115k3148M735
19589D8082O243O006K3772O442l773J4457j0378l5576l2288k091p111L2161Q627
19576E4573k990m551K9970q971R498j3680j5925L8948O0169Q468j091l8575m369
19563A11474K8745j2508m0722k5476k1697K9560O678k8473l9089k1908j4942M3989
19551A5631M1419J9363K9136J6184J1965l1524m165N5819L0567j9831k6178l0192
$$ plain form
19539 108194 101187 90005 112401 95544 92550 101101 89453 87238 43799 21726 49275 106685
19527 106685 94310 75570 86205 79602 66803 92981 132462 133064 116100 114473 109702 114109 138785
19514 138785 143105 122499 143097 182821 190206 195947 200388 201422 229704 274699 318809 409445
19502 409445 544481 706800 853216 944658 990622 1083168 1215143 1280323 1187653 1085681
19492 1085681 1036772 988520 865515 656409 502307 442262 368727 347214 337434 291771 277402
19481 277402 276811 261737 270933 274893 251413 252055 263326 270552 266247 246379 255916 234200 222575
19468 222575 226259 250023 248014 215739 226110 234901 221941 224036 189053 218666 240783 237103
19456 237103 224186 216108 195890 214004 278654 332823 392989 463738 576252 739565 923730
$$ packed form
19539A08194p007j1182K2396j6857k994Q551j1648k215m3439k2073K7549N7410
19527A06685j2375j8740J0635o603j2799K6178L9481O02j6964j627m771M407K4676
19514A38785M320k0606K0598L9724P385N741M441J034K8282M4995M4110R0636
19502D09445J35036J62319J46416R1442M5964R2546J31975O5180r2670j01972
19492A085681m8909m8252j23005k09106j54102o0045p3535k1513r780m5663j4369
19481B77402n91j5074R196L960k3480O42J1271P226m305j9868R537k1716j1625
19468B22575L684K3764k009l2275J0371Q791j2960K095l4983K9613K2117l680
19456B37103j2917q078k0218J8114O4650N4169O0166P0749J12514J63313J84165
$$ plain form
19445 923730 1013257 1088703 1222209 1286034 1307330 1258242 1168546 1087107 986147 855650 688647
19434 688647 550667 417546 334280 269855 246724 236905 256479 278384 289583 304150 321055
19423 321055 332754 360410 315286 273892 290617 343515 319033 279780 305476 317854 284907
19412 284907 283016 330877 342491 285377 224954 233387 234741 234460 227599 209907 225964 218574 188786
19399 188786 173800 186705 120760 82403 87011 86323 145789 140579 148566 159206 148380 148820 201522
19386 201522 208383 180183 137698 100075 101050 99352 110520 171548 188723 141910 88181 90570
19374 90570 103928 137423 125517 140106 117614 91553 89599 137953 143736 144661 125230 150493
19362 150493 164145 156240 155633 162043 207797 196543 207236 172997 116842 110451 132613 160921
$$ packed form
19445I23730Q9527P5446J33506O3825K1296m9088q9696q1439j00960j30497j67003
19434F88647j37980j33121q3266o4425k3131r819J9574K1905J1199J4567J6905
19423C21055J1699K7656m5124m1394J6725N2898k4482l9253K5696J2378l2947
19412B84907j891M7861J1614n7114o0423Q433J354k81o861j7692J6057p390k9788
19399A88786j4986J2905o5945l8357M608o88N9466n210P987J0640j0826M40N2702
19386B01522O861k8200m2485l7623R75j698J1168O1028J7175m6813n3729K389
19374I0570J3358L3495j1906J4589k2492k6061j954M8354N783R25j9431K5263
19362A50493J3652p905o07O410M5754j1254J0693l4239n6155o391K2162K8308
$$ plain form
19350 160921 168463 189608 196519 209579 203059 197527 184606 140585 182026 216826 185026 159680
19338 159680 143143 141032 120404 100131 130911 131416 137772 166462 195938 207458 202267 181192
19326 181192 197468 216673 240123 233322 237758 256712 255735 250942 213873 223642 233995 201253 156691
19313 156691 141631 181690 195045 174580 134362 130884 145346 181108 194656 219504 209989 197449
19301 197449 189445 156307 165651 179952 189039 175937 164929 112909 91264 78884 65040 12810
19289 12810 1523 9783 28574 32311 55192 80688 87750 86635 106556 116915 125375 157373 154635
19276 154635 146557 174825 156058 152767 155269 156925 119527 132040 151980 143218 152298 185630 228020
19263 228020 234947 246334 221118 269492 298429 288119 286305 258176 231351 194880 175923 186670
$$ packed form
19350A60921P542K1145O911J3060o520n532j2921m4021M1441L4800l1800k5346
19338A59680j6537k111k0628k0273L0780N05O356K8690K9476J1520n191k1075
19326A81192J6276J9205K3450o801M436J8954r77m793l7069R769J0353l2742m4562
19313A56691j5060M0059J3355k0465m0218l478J4462L5762J3548K4848r515j2540
19301A97449q004l3138R344J4301R087j3102j1008n2020k1645j2380j3844n2230
19289A2810j1287Q260J8791L737K2881K5496P062j115J9921J0359Q460L1998k738
19276A54635q078K8268j8767l291K502J656l7398J2513J9940q762R080L3332M2390
19263B28020O927J1387k5216M8374K8937j0310j814k8129k6825l6471j8957J0747
$$ plain form
19251 186670 247372 243842 240866 227200 222446 202624 178206 194942 159819 136919 145715 196812
19239 196812 213976 187350 174493 220827 248031 289188 326974 382960 474024 508229 493498
19228 493498 483674 500384 497213 525649 516057 473493 429945 400950 415891 402134 371745 377860
19216 377860 389073 406809 430634 446203 414933 360819 315671 290840 281851 268404 288949 319538
19204 319538 299958 306346 312672 314216 325698 300777 301698 325320 308794 286171 292110 276202 268138
19191 268138 303808 301711 292856 297137 264818 234948 295092 360639 367858 369452 402088 434755
19179 434755 488490 506307 542413 557524 513015 536535 561319 528163 492930 468731 466369 440553
19167 440553 429655 432765 450904 418154 365221 370371 357405 362537 401301 400101 358984 367905
$$ packed form
19251A86670O0702l530k976j3666m754j9822k4418J6736l5123k2900Q796N1097
19239A96812J7164k6626j2857M6334K7204M1157L7786N5986R1064L4205j4731
19228D93498r824J6710l171K8436r592m2564m3548k8995J4941j3757l0389O115
19216C77860J1213J7736K3825J5569l1270n4114m5148k4831q989j3447K0545L0589
19204C19538j9580O388O326J544J1482k4921R21K3622j6526k2623N939j5908q064
19191B68138L5670k097q855M281l2319k9870O0144O5547P219J594L2636L2667
19179D34755N3735J7817L6106J5111m4509K3520K4784l3156l5233k4199k362k5816
19167D40553j0898L110J8139l2750n2933N150j2966N132L8764j200m1117Q921
$$ plain form
19155 367905 377470 364888 343836 355001 376193 409757 445654 449617 455573 435162 417399 455116
19143 455116 452348 406773 418599 404614 400032 417702 413008 421900 394488 381906 386140 379228 375480
19130 375480 391300 383213 394550 413708 440398 473881 459129 432063 413982 418424 445362 492631
19118 492631 511589 532735 557483 589399 583142 550545 561289 564797 596654 613908 659303 713110
19106 713110 808730 885003 939849 1118911 1372971 1632124 1785498 1801699 1821347 1804819 1674000
19095 1674000 1437670 1265087 1100580 981861 902764 870898 869033 829882 807304 829431 810517
19084 810517 801288 820745 822289 831435 801064 827301 851522 895448 879194 876984 904036 929649
19072 929649 978213 1079833 1206725 1381950 1613647 1903721 2161015 2329310 2408848 2450729
$$ packed form
19155C67905R565j2582k1052J1165K1192L3564L5897L963N956k0411j7763L7717
19143D55116k768m5575J1826j3985m582J7670m694Q892k7412j2582M234o912l748
19130C75480J5820q087J1337J9158K6690L3483j4752k7066j8081M442K6938M7269
19118D92631J8958K1146K4748L1916o257l2597J0744L508L1857J7254M5395N3807
19106G13110R5620P6273N4846J79062K54060K59153J53374J6201J9648j6528j30819
19095A674000k36330j72583j64507j18719p9097l1866j865l9151k2578K2127j8914
19084H10517r229J9457J544R146l0371K6237K4221M3926j6254k210K7052K5613
19072I29649M8564J01620J26892J75225K31697K90074K57294J68295P9538M1881
$$ plain form
19062 2450729 2407573 2295493 2161369 2068654 2094349 2195328 2322904 2454794 2511200 2564426
19052 2564426 2590846 2477773 2330869 2176421 2054545 2019537 2045998 2109094 2220439 2399748
19042 2399748 2556538 2637290 2658477 2618938 2535102 2383428 2209141 2044324 1911272 1860362
19032 1860362 1923314 1989244 1980772 1966693 1984866 2071331 2143800 2180235 2239130 2270915 2324800
19021 2324800 2415812 2542180 2667484 2808528 3020342 3272115 3552460 3723498 3920950 4183577
19011 4183577 4477464 4704291 4816500 4921231 5120437 5405529 5681567 5945287 6223173
19002 6223173 6550313 6988693 7563806 8198594 8791407 9381246 10156570 11253147 12535497
18993 12535497 14005279 15958526 18599852 22224427 27185555 34103150 44412069 60465068
$$ packed form
19062B450729m3156j12080j34124r2715K5695J00979J27576J31890N6406N3226
19052B564426K6420j13073j46904j54448j21876l5008K6461O3096J11345J79309
19042B399748J56790Q0752K1187l9539q3836j51674j74287j64817j33052n0910
19032A860362O2952O5930q472j4079J8173Q6465P2469L6435N8895L1785N3885
19021B324800R1012J26368J25304J41044K11814K51773K80345J71038J97452K62627
19011D183577K93887K26827J12209J04731J99206K85092K76038K63720K77886
19002F223173L27140M38380N75113O34788N92813N89839P75324J096577J282350
18993A2535497J469782J953247K641326L624575M961128O917595J0308919J6052999
$$ plain form
18985 60465068 84755363 114738267 137643341 149767004 165634913 191067688 210989895
18978 210989895 208809406 189190795 171122236 161505942 147289134 120791938 92291810
18971 92291810 69392381 52920715 41445645 33469791 27919690 23961637 21095510 19056096
18963 19056096 17530698 16388105 15502285 14775721 14231748 13824478 13391021 12938226 12568638
18954 12568638 12286222 12129699 12054713 11947513 11938728 12040914 12156937 12331591 12586921 12885397
18944 12885397 13207165 13595375 14121091 14860003 15932464 17333608 19273408 21989463 25754852
18935 25754852 31023225 38437764 49567343 66952089 93263298 125961112 151387400
18928 151387400 164890996 182005423 209551072 231509178 229549526 208079258 187855375
$$ packed form
18985F0465068K4290295K9982904K2905074J2123663J5867909K5432775J9922207
18978B10989895k180489j9618611j8068559r616294j4216808k6497196k8500128
18971I2291810k2899429j6471666j1475070p975854n550101l958053k866127k039414
18963A9056096j525398j142593q85820p26564n43973m07270m33457m52795l69588
18954A2568638k82416j56523p4986j07200q785J02186J16023J74654K55330K98476
18944A2885397L21768L88210N25716P38912J072461J401144J939800K716055L765389
18935B5754852N268373P414539J1129579J7384746K6311209L2697814K5426288
18928A51387400J3503596J7114427K7545649K1958106j959652k1470268k0223883
$$ plain form
18921 187855375 177090809 161702994 132693472 101086326 75570844 57186299 44312180
18914 44312180 35325614 29070361 24600415 21247465 18702584 16746415 15112357 13808404
18906 13808404 12827775 12013887 11215618 10433303 9747625 9208273 8743288 8224639 7719860
18897 7719860 7262373 6914965 6657633 6419220 6139851 5728072 5272063 4903356 4579163
18888 4579163 4203615 3826089 3465434 3198372 2985907 2800865 2629261 2498911 2384060
18879 2384060 2253496 2190382 2129089 2059138 2009220 1952220 1885384 1843909 1831014 1814939 1828007
18868 1828007 1786093 1696236 1631780 1575394 1553114 1522114 1480890 1407350 1361914 1338803 1313963
18857 1313963 1261189 1229076 1200008 1150709 1078761 1024870 1003522 1006083 993104 973453 965712 972866
$$ packed form
18921A87855375j0764566j5387815k9009522l1607146k5515482j8384545j2874119
18914D4312180q986566o255253m469946l352950k544881j956169j634058j303953
18906A3808404r80629q13888p98269p82315o85678n39352m64985n18649n04779
18897G719860m57487l47408k57332k38413k79369m11779m56009l68707l24193
18888D579163l75548l77526l60655k67062k12465j85042j71604j30350j14851
18879B384060j30564o3114o1293o9951m9918n7000o6836m1475j2895j6075J3068
18868A828007m1914q9857o4456n6386k2280l1000m1224p3540m5436k3111k4840
18857A313963n2774l2113k9068m9299p1948n3891k1348K561j2979j9651p741P154
$$ plain form
18845 972866 968347 892148 808343 795820 778978 765314 716525 666451 664801 691223 674521 626337
18833 626337 656989 659770 634906 635784 614314 612039 601478 563623 592456 638722 626702 651396
18821 651396 677531 677442 710737 702655 673307 648705 620608 597144 614289 638241 639931 655498
18809 655498 624810 607151 645744 669402 652701 643224 635007 706303 733149 750262 736245 724945
18797 724945 742284 767829 759387 745779 741841 720307 708379 730866 734015 737635 754284 750763
18785 750763 736778 740875 754848 780068 823586 864050 864974 800440 767924 761900 795999 821568
18773 821568 818071 803045 832088 841410 832453 856338 935838 971991 955370 893341 823120 728236
18761 728236 656198 591387 525456 494858 537112 527342 478273 449026 467335 487225 479962 468995
$$ packed form
18845I72866m519p6199q3805j2523j6842j3664m8789n0074j650K6422j6702m8184
18833F26337L0652K781k4864Q78k1470k275j0561l7855K8833M6266j2020K4694
18821F51396K6135q9L3295q082k9348k4602k8097k3464J7145K3952J690J5567
18809F55498l0688j7659L8593K3658j6701r477q217P1296K6846J7113j4017j1300
18797G24945J7339K5545q442j3608l938k1534j1928K2487L149L620J6649l521
18785G50763j3985M097J3973K5220M3518M0464R24o4534l2516o024L4099K5569
18773H21568l497j5026K9043R322q957K3885P9500L6153j6621o2029p0221r4884
18761G28236p2038o4811o5931l0598M2254r770m9069k9247J8309J9890p263j0967
$$ plain form
18749 468995 455077 432224 439685 473463 476999 485060 513304 545084 584583 622797 642528 678093
18737 678093 671807 660244 685324 702252 663301 630907 639981 637990 587168 558876 543557 543216
18725 543216 534152 544265 568557 584774 578863 585605 624907 630838 616213 651817 690399 704939
18713 704939 701657 709637 736609 740627 714171 697263 725179 715051 705587 702906 685818 689985 668883
18700 668883 622976 673979 703726 689488 707910 722857 756947 798857 831247 883525 909209
18689 909209 923970 936184 1012709 1114373 1268635 1431389 1585527 1632013 1603042 1583314 1571565
18678 1571565 1604125 1593594 1481089 1318978 1164483 1106654 1068095 1071325 1064970 1072867 1093884
18667 1093884 1081071 1092792 1132304 1121028 1046236 1006517 985055 969977 983679 1006539 1061094
$$ packed form
18749D68995j3918k2853P461L3778L536Q061K8244L1780L9499L8214J9731L5565
18737F78093o286j1563K5080J6928l8951l2394R074j991n0822k8292j5319l41
18725E43216r064J0113K4292J6217n911O742L9302N931j4625L5604L8582J4540
18713G04939l282P980K6972M018k6456j6908K7916j0128r464k681j7088M167k1102
18700F68883m5907N1003K9747j4238J8422J4947L4090M1910L2390N2278K5684
18689I09209J4761J2214P6525J01664J54262J62754J54138M6486k8971j9728j1749
18678A571565L2560j0531j12505j62111j54495n7829l8559L230o355P897K1017
18667A093884j2813J1721L9512j1276p4792l9719k1462j5078J3702K2860N4555
$$ plain form
18656 1061094 1113577 1166547 1216876 1325793 1471865 1681446 1924911 2176934 2358865 2435494
18646 2435494 2390245 2369084 2389934 2376834 2264151 2051386 1827519 1641360 1484935 1385446
18636 1385446 1315235 1299960 1288075 1278930 1275119 1319884 1343762 1395025 1411339 1419436 1411739 1440302
18624 1440302 1489154 1549061 1561994 1569568 1578358 1627540 1725119 1776780 1811956 1894841 1963243 1995507
18612 1995507 2017582 2001910 2013701 2084279 2136436 2177011 2169896 2172784 2237418 2248977 2253678 2262004
18600 2262004 2303230 2346779 2380140 2425999 2505113 2601810 2683644 2742121 2853426 2914214 3020737
18589 3020737 3090883 3170738 3301296 3412035 3549448 3715898 3919019 4105383 4288383 4486378
18579 4486378 4671685 4810827 4958156 5165102 5392548 5636863 5918451 6289114 6723922
$$ packed form
18656A061094N2483N2970N0329J08917J46072K09581K43465K52023J81931P6629
18646B435494m5249k1161K0850j3100j12683k12765k23867j86159j56425r9489
18636A385446p0211j5275j1885r145l811M4765K3878N1263J6314Q097p697K8563
18624A440302M8852N9907J2933P574Q790M9182R7579N1661L5176Q2885O8402L2264
18612A995507K2075j5672J1791P0578N2157M0575p115K888O4634J1559M701Q326
18600B262004M1226M3549L3361M5859P9114R6697Q1834N8477J11305O0788J06523
18589C020737P0146P9855J30558J10739J37413J66450K03121J86364J83000J97995
18579D486378J85307J39142J47329K06946K27446K44315K81588L70663M34808
$$ plain form
18570 6723922 7227891 7839080 8457797 9096399 9686001 10290701 10908393 11590449 12315740
18561 12315740 13151829 14088783 15219389 16565425 18235510 20270124 22678468 25518957
18553 25518957 28909132 33035453 38140955 44656670 53355873 65710106 84096213 111624219
18545 111624219 148898435 189334435 223194398 245612389 257588305 260032654 251567208
18538 251567208 230300693 200012916 170782648 152045630 147610288 158873822 185494514
18531 185494514 220682414 253056163 275122837 286447497 288410285 280946816 262813788
18524 262813788 237104186 214470067 208515201 225301578 254875164 275442987 280333749
18517 280333749 280003290 270809657 239872170 193351863 148440211 113699210 89043265
$$ packed form
18570F723922N03969O11189O18717O38602N89602O04700O17692O82056P25291
18561A2315740Q36089R36954J130606J346036J670085K034614K408344K840489
18553B5518957L390175M126321N105502O515715Q699203J2354233J8386107K7528006
18545A11624219L7274216M0436000L3859963K2417991J1975916K444349q465446
18538B51567208k1266515l0287777k9230268j8737018m435342J1263534K6620692
18531A85494514L5187900L2373749K2066674J1324660J962788p463469j8133028
18524B62813788k5709602k2634119n954866J6786377K9573586K0567823M890762
18517B80333749l30459r193633l0937487m6520307m4911652l4741001k4655945
$$ plain form
18510 89043265 71938466 60093193 51816346 45943149 41759453 38831656 36745582 35180624
18502 35180624 33988649 33070576 32175217 31450265 31005646 30905848 31401163 32698270 34954072
18493 34954072 38449202 43580870 51073292 62042761 78600371 104534227 145085199
18486 145085199 199898387 251075786 278832428 288419120 291114871 275198027 232216476
18479 232216476 177865237 130881592 96496462 72863349 56783737 45795534 38063271
18472 38063271 32518150 28495411 25439575 23043543 21205742 19735361 18382354 17096927
18464 17096927 15939223 14908678 13920719 12951502 12045412 11223476 10588858 10207846 9917178
18455 9917178 9591914 9329836 9080700 8758732 8374792 7922934 7313747 6627416 5958654
$$ packed form
18510H9043265j7104799j1845273q276847n873197m183696k927797k086074j564958
18502C5180624j191975r18073q95359p24952m44619r9798M95315J297107K255802
18493C4954072L495130N131668P492422J0969469J6557610K5933856M0550972
18486A45085199N4813188N1177399K7756642R586692K695751j5916844m2981551
18479B32216476n4351239m6983645l4385130k3633113j6079612j0988203p732263
18472C8063271n545121m022739l055836k396032j837801j470381j353007j285427
18464A7096927j157704j030545r87959r69217r06090q21936o34618l81012k90668
18455I917178l25264k62078k49136l21968l83940m51858o09187o86331o68762
$$ plain form
18446 5958654 5386216 4907274 4536549 4229622 4030827 3871485 3721457 3540495 3397202
18437 3397202 3274522 3146576 3028114 2944021 2828201 2708422 2620081 2596712 2600773 2563270
18427 2563270 2537587 2488169 2406460 2305304 2189498 2101378 2051080 1980437 1951419 1945187 1922870
18416 1922870 1927524 1927253 1952794 1970394 1994191 2008713 2037196 2146542 2307602 2512566 2601376
18405 2601376 2680864 2822546 2908073 2959263 2891914 2780126 2680592 2577969 2404999 2202918
18395 2202918 2009625 1895598 1813908 1699038 1638158 1613350 1555966 1473595 1433106 1430728 1468289
18384 1468289 1474679 1507514 1561915 1658431 1745490 1814350 1870426 1893191 1843356 1717366 1590131
18373 1590131 1472609 1344088 1281483 1316663 1367034 1462995 1594466 1699110 1690822 1671865 1705154
$$ packed form
18446E958654n72438m78942l70725l06927j98795j59342j50028j80962j43293
18437C397202j22680j27946j18462q4093j15820j19779q8341k3369M061l7503
18427B563270k5683m9418q1709j01156j15806q8120n0298p0643k9018o232k2317
18416A922870M654k71K5541J7600K3797J4522K8483J09346J61060K04964Q8810
18405B601376P9488J41682Q5527N1190o7349j11788r9534j02623j72970k02081
18395B202918j93293j14027q1690j14870o0880k4808n7384q2371m0489k378L7561
18384A468289O390L2835N4401R6516Q7059O8860N6076K2765m9835j25990j27235
18373A590131j17522j28521o2605L5180N0371R5961J31471J04644q288j8957L3289
$$ plain form
18362 1705154 1638805 1504334 1366441 1256535 1202480 1189475 1170452 1071039 967348 864183
18352 864183 847821 834109 808339 785766 765691 766139 777722 745872 745023 727286 697622 709707
18340 709707 739304 744747 730725 711394 712356 752196 763312 776356 769436 796732 816911 881493
18328 881493 974705 1109686 1245313 1320794 1312009 1346439 1361853 1290295 1202380 1101236 995632
18317 995632 938657 928277 969928 1065185 1165895 1217216 1229275 1242678 1254919 1191053 1141272
18306 1141272 1010416 914597 850841 798895 730684 697910 696611 690172 682480 637927 644163 598169
18294 598169 588948 605505 627484 615596 608700 606564 607997 544048 534153 545261 551170 611846 666254
18281 666254 700173 705162 719268 759208 762399 735721 720592 753131 753040 727535 749436 743152 748564
$$ packed form
18362A705154o6349j34471j37893j09906n4055j3005j9023r9413j03691j03165
18352H64183j6362j3712k5770k2573k0075M48J1583l1850q49j7737k9664J2085
18340G09707K9597N443j4022j9331R62L9840J1116J3044o920K7296K0179O4582
18328H81493R3212J34981J35627P5481q785L4430J5414p1558q7915j01144j05604
18317I95632n6975j0380M1651R5257J00710N1321J2059J3403J2241o3866m9781
18306A141272j30856r5819o3756n1946o8211l2774j299o439p692m4553O236m5994
18294E98169r221J6557K1979j1888o896k136J433o3949r895J1108N909O0676N4408
18281F66254L3919M989J4106L9940L191k6678j5129L2539r1k5505K1901o284N412
$$ plain form
18268 748564 776023 762821 734827 705887 696455 684976 693407 673782 656994 670754 667148 683292
18256 683292 632792 581937 607383 633829 648931 663175 681882 700727 745204 787745 797427 811660
18244 811660 837351 890036 911402 943921 1009325 1047878 1023208 982907 1014973 1052387 1084461
18233 1084461 1124305 1093937 1053651 1046296 1078242 1083868 1057742 1056644 1105558 1108332 1068167 1077196
18221 1077196 1092037 1100791 1132182 1190299 1235061 1269621 1274910 1301266 1302701 1297748 1301183 1322543
18209 1322543 1380679 1445794 1508770 1515696 1536376 1565529 1600492 1650363 1677223 1720387 1801297
18198 1801297 1885930 1966191 2059600 2135197 2225299 2273575 2309835 2388162 2450012 2481728 2557721
18187 2557721 2676738 2794616 2915011 3044079 3179919 3304006 3429559 3578900 3764234
$$ packed form
18268G48564K7459j3202k7994k8940r432j1479Q431j9625j6788J3760l606J6144
18256F83292n0500n0855K5446K6446J5102J4244J8707J8845M4477M2541R682J4233
18244H11660K5691N2685K1366L2519O5404L8553k4670m0301L2066L7414L2074
18233A084461L9844l0368m0286p355L1946N626k6126j098M8914K774m0165R029
18221A077196J4841Q754L1391N8117M4762L4560N289K6356J435m953L435K1360
18209A322543N8136O5115O2976O926K0680K9153L4963M9871K6860M3164Q0910
18198A801297Q4633Q0261R3409P5597R0102M8276L6260P8327O1850L1716P5993
18187B557721J19017J17878J20395J29068J35840J24087J25553J49341J85334
$$ plain form
18178 3764234 3958868 4192171 4462373 4883324 5418030 5966693 6446483 6902445 7388412
18169 7388412 7994188 8643449 9241371 9824708 10379074 10957479 11644738 12340699 13093105
18160 13093105 13995094 15156417 16611557 18451537 20918731 24222127 28729134 34948411
18152 34948411 43709769 56625640 76568128 107768404 150952499 194145464 221931231
18145 221931231 229886316 225940366 227259325 234674928 232913907 212581902 174844070 133433192
18137 133433192 99862371 75999254 59881520 49122360 41743029 36493410 32800674
18130 32800674 30265709 28626737 27612055 26946458 26510311 26353857 26645240 27490565 28847818
18121 28847818 30837219 33535999 37307023 42838028 51160876 64063096 84550601 115795765
$$ packed form
18178C764234J94634K33303K70202M20951N34706N48663M79790M55962M85967
18169G388412O05776O49261N97922N83337N54366N78405O87259O95961P52406
18160A3093105R01989J161323J455140J839980K467194L303396M507007O219277
18152C4948411Q761358J2915871J9942488L1200276M3184095M3192965K7785767
18145B21931231P955085l945950J318959P415603j761021k0332005l7737832m1410878
18137A33433192l3570821k3863117j6117734j0759160p379331n249619l692736
18130C2800674k534965j638972j014682o65597m36147j56454K91383Q45325J357253
18121B8847818J989401K698780L771024N531005Q322848J2902220K0487505L1245164
$$ plain form
18113 115795765 154701505 188534080 208539548 216228738 225211093 246816652 262616879
18106 262616879 248670091 209248347 160623935 118002462 86715049 65331846 50914986
18099 50914986 40985094 33883495 28682700 24835231 22050187 19970427 18344634 17045335
18091 17045335 15928761 14984990 14247022 13618976 13036018 12405423 11702624 10899393 10052736
18082 10052736 9286142 8588300 7967968 7325213 6654470 6055949 5559320 5133940 4775275
18073 4775275 4494292 4232425 3954652 3676444 3437589 3222285 3095473 2992399 2851629
18064 2851629 2738433 2657350 2575236 2500150 2435720 2336260 2270360 2168251 2057213 2021914 1968841
18053 1968841 1898234 1869916 1843614 1797438 1756613 1704110 1673967 1628124 1620804 1593875 1525578
$$ packed form
18113A15795765L8905740L3832575K0005468P689190Q982355K1605559J5800227
18106B62616879j3946788l9421744m8624412m2621473l1287413k1383203j4416860
18099E0914986r929892p101599n200795l847469k785044k079760j625793j299299
18091A7045335j116574r43771p37968o28046n82958o30595p02799q03231q46657
18082A0052736p66594o97842o20332o42755o70743n98521m96629m25380l58665
18073D775275k80983k61867k77773k78208k38855k15304j26812j03074j40770
18064B851629j13196q1083q2114p5086o4430r9460o5900j02109j11038l5299n3073
18053A968841p0607k8318k6302m6176m0825n2503l0143m5843p320k6929o8297
$$ plain form
18042 1525578 1459782 1406805 1365767 1358795 1356574 1375750 1354944 1372427 1440166 1433596 1445337 1456165
18030 1456165 1495473 1590008 1687332 1819961 1967916 2167167 2332756 2427598 2467789 2412820
18020 2412820 2305248 2149589 2018330 1916039 1835526 1825138 1932287 2100112 2280066 2411131
18010 2411131 2447596 2445432 2365051 2223356 2013960 1752821 1569877 1429890 1303739 1196949
18000 1196949 1125003 1121398 1103310 1067529 1023355 1017514 1025215 1011381 1022479 1012306 990811 968078
17988 968078 924253 894013 879884 901579 931131 938825 936712 934024 909801 852417 814426 821919
17976 821919 832293 837277 800481 800914 809968 827931 822092 839356 867113 848890 820764 831330
17964 831330 833144 828545 828532 816032 821122 775371 785375 812921 832131 829722 868545 881382 874911
$$ packed form
18042A525578o5796n2977m1038o972k221J9176k0806J7483O7739o570J1741J0828
18030A456165L9308R4535R7324J32629J47955J99251J65589R4842M0191n4969
18020B412820j07572j55659j31259j02291q0513j0388J07149J67825J79954J31065
18010B411131L6465k164q0381j41695k09396k61139j82944j39987j26151j06790
18000A196949p1946l605j8088l5781m4174n841P701j3834J1098j0173k1495k2733
17988I68078m3825l0240j4129K1695K9552P694k113k688k4223n7384l7991P493
17976H21919J0374M984l6796M33R054J7963n839J7264K7757j8223k8126J0566
17964H31330J814m599j3j2500N090m5751J0004K7546J9210k409L8823J2837o471
$$ plain form
17951 874911 893750 856450 825525 843689 849194 854804 870904 885657 900905 973010 1043280 1063322
17939 1063322 1086570 1129562 1205642 1246314 1310468 1393106 1447123 1556938 1731460 1985265 2342286
17928 2342286 2632961 2852883 2960887 2956220 2836097 2613378 2397237 2187815 1996882 1862698
17918 1862698 1802451 1814454 1839592 1888878 1995714 2133662 2302599 2524662 2813322 3180847
17908 3180847 3594409 4056771 4450725 4711958 4855934 4886360 4763743 4552758 4373275 4265222
17898 4265222 4282951 4395643 4554727 4775467 5051814 5266328 5331677 5423915 5562499 5632882
17888 5632882 5657193 5803283 6051542 6392779 6895332 7452804 7949942 8503195 9132283 9748642
17878 9748642 10426195 11346026 12637908 14376482 16751699 19929825 24201279 30119132
$$ packed form
17951H74911J8839l7300l0925J8164N505N610J6100J4753J5248P2105P0270K0042
17939A063322K3248M2992P6080M0672O4154Q2638N4017J09815J74522K53805L57021
17928B342286K90675K19922J08004m667j20123k22719k16141k09422j90933j34184
17918A862698o0247J2003K5138M9286J06836J37948J68937K22063K88660L67525
17908C180847M13562M62362L93954K61233J43976L0426j22617k10985j79483j08053
17898D265222J7729J12692J59084K20740K76347K14514O5349R2238J38584P0383
17888E632882K4311J46090K48259L41237N02553N57472M97138N53253O29088O16359
17878I748642O77553R19831J291882J738574K375217L178126M271454N917853
$$ plain form
17870 30119132 38687957 51644321 71551124 99139395 126274449 140445432 145129898
17863 145129898 148844265 144611356 126260563 103241775 84938883 73961978 70107776
17856 70107776 73652722 85646692 106452218 130219292 143958841 146410853 147158781 142734694
17848 142734694 124324378 98178761 74655056 56973467 44524856 35962134 29966718
17841 29966718 25580099 22289092 19841746 18029950 16721856 15814700 15103476 14454399
17833 14454399 13995642 13681854 13456167 13262417 13046290 12878382 12853295 12976037 13210923
17824 13210923 13593078 14266256 15266506 16671502 18581474 21253543 24916229 29981760
17816 29981760 37319111 48641101 66185422 90815587 115412677 128362221 132402702
$$ packed form
17870C0119132Q568825J2956364J9906803K7588271K7135054J4170983M684466
17863A45129898L714367m232909j8350793k3018788j8302892j0976905l854202
17856G0107776L544946J1993970K0805526K3767074J3739549K452012P47928m424087
17848A42734694j8410316k6145617k3523705j7681589j2448611q562722n995416
17841B9966718m386619l291007k447346j811796j308094r07156p11224o49077
17833A4454399m58757l13788k25687j93750k16127j67908k5087J22742K34886
17824A3210923L82155O73178J000250J404996J909972K672069L662686N065531
17816B9981760P337351J1321990J7544321K4630165K4597090J2949544M040481
$$ plain form
17809 132402702 135563954 131791914 115220446 94021446 76926009 66316968 62203605
17802 62203605 64786390 75028196 93483065 115130666 127777527 130012223 130870391 127400607
17794 127400607 111141855 87482788 65956478 49702114 38227541 30258175 24750648
17787 24750648 20732575 17675393 15326800 13611712 12371503 11434035 10618828 9871817
17779 9871817 9179829 8563707 7913067 7225542 6556671 6009594 5563267 5180808 4864230
17770 4864230 4633436 4481119 4361658 4205196 4037024 3867677 3701326 3489734 3215507
17761 3215507 2946818 2711305 2530478 2389357 2287634 2210928 2059738 1960167 1897004 1844128
17751 1844128 1807404 1735636 1634956 1558192 1521589 1445879 1385020 1331830 1293430 1271929 1214246
$$ packed form
17809A32402702L161252l772040j6571468k1199000j7095437j0609041m113363
17802F2203605K582785J0241806J8454869K1647601J2646861K234696Q58168l469784
17794A27400607j6258752k3659067k1526310j6254364j1474573p969366n507527
17787B4750648m018073l057182k348593j715088j240209r37468q15207p47011
17779I871817o91988o16122o50640o87525o68871n47077m46327l82459l16578
17770D864230k30794j52317j19461j56462j68172j69347j66351k11592k74227
17761C215507k68689k35513j80827j41121j01723p6706j51190r9571o3163n2876
17751A844128l6724p1768j00680p6764l6603p5710o0859n3190l8400k1501n7683
$$ plain form
17740 1214246 1198733 1239103 1248234 1219126 1156052 1124348 1092474 1042850 968793 955760 929524
17729 929524 916269 901230 893643 862902 839209 813732 810789 786880 770112 763933 765911 782207
17717 782207 745745 712301 698181 671349 650717 594929 577421 590151 571595 553179 535030
17706 535030 544656 568347 590666 596891 580579 541694 515762 465699 446867 443309 469867 462636
17694 462636 444430 412569 379418 365169 321557 318795 343689 350257 362420 345737 354998 370134
17682 370134 353666 337745 361826 336962 289504 309238 320018 297971 341430 350148 390071 411505
17670 411505 421027 410368 386423 392656 383364 394706 401709 375543 327995 267321 219151 198985
17658 198985 190394 212747 243795 245339 268619 291175 233381 273142 310549 316623 329814 323146
$$ packed form
17740A214246j5513M0370R131k9108o3074l1704l1874m9624p4057j3033k6236
17729I29524j3255j5039p587l0741k3693k5477k943k3909j6768o179J978J6296
17717G82207l6462l3444j4120k6832k0632n5788j7508J2730j8556j8416j8149
17706E35030R626K3691K2319O225j6312l8885k5932n0063j8832l558K6558p231
17694D62636j8206l1861l3151j4249m3612k762K4894O568J2163j6683R261J5136
17682C70134j6468j5921K4081k4864m7458J9734J0780k2047M3459Q718L9923K1434
17670D11505R522j0659k3945O233r292J1342P003k6166m7548o0674m8170k0166
17658A98985q591K2353L1048J544K3280K2556n7794L9761L7407O074J3191o668
$$ plain form
17646 323146 305097 259406 217854 179335 174929 145860 133235 174816 178785 158024 167866 185328
17634 185328 209570 186584 186738 183215 151415 152238 149501 196870 248059 257621 229714 191960 205535
17621 205535 219261 208692 203159 221973 260740 250809 240954 281359 345953 420054 503447 600700
17609 600700 738316 924653 1129368 1256309 1319309 1332937 1383609 1464389 1449808 1319674
17599 1319674 1125002 906852 739285 647765 577099 505458 455872 437223 408909 396644 361834
17588 361834 334801 340326 350924 374085 393107 430302 463329 481951 540319 598829 695091 792239
17576 792239 978746 1263156 1609195 2001440 2308996 2531596 2713053 2859632 3046328 3165436
17566 3165436 3200908 3187278 3063737 2821804 2650913 2650093 2683076 2745683 2824676 2841877 2836880
$$ packed form
17646C23146j8049m5691m1552l8519m406k9069j2625M1581L969k0761R842J7462
17634A85328K4242k2986J54l523l1800Q23k737M7369N1189R562k7907l7754J3575
17621B05535J3726j0569n533J8814L8767r931r855M0405O4594P4101Q3393R7253
17609F00700J37616J86337K04715J26941O3000J3628N0672Q0780j4581j30134
17599A319674j94672k18150j67567r1520p0666p1641m9586j8649k8314j2265l4810
17588C61834k7033N525J0598K3161J9022L7195L3027J8622N8368N8510R6262R7148
17576G92239J86507K84410L46039L92245L07556K22600J81457J46579J86696J19108
17566C165436L5472j3630j23541k41933j70891q20L2983O2607P8993J7201m997
$$ plain form
17555 2836880 2874544 2950190 2953763 2901456 2836086 2650252 2391686 2191368 2013905 1821139
17545 1821139 1643246 1459180 1287761 1102879 936769 787766 669826 560720 494683 450664
17535 450664 423204 400914 353690 302533 289118 260436 226727 204699 184890 198998 193932 183388
17523 183388 176824 154932 172176 149315 143504 108860 95661 103228 114216 125417 188295 218243
17511 218243 221715 224032 208745 213575 214903 212509 206748 198205 217778 231745 226919 214705 198779
17498 198779 213319 258358 315215 313448 271374 263640 318027 378857 446463 510985 638469 815024
17486 815024 1031516 1215962 1353499 1461160 1663608 1868936 1883649 1759835 1637903 1562614
17476 1562614 1521343 1414152 1278759 1235858 1241745 1254755 1292948 1397033 1536518 1618643 1572988
$$ packed form
17555B836880L7664P5646L573n2307o5370j85834k58566k00318j77463j92766
17545A821139j77893j84066j71419j84882j66110j49003j17940j09106o6037m4019
17535D50664k7460k2290m7224n1157j3415k8682l3709k2028j9809J4108n066j0544
17523A83388o564k1892J7244k2861n811l4644j3199P567J0988J1201O2878K9948
17511B18243L472K317j5287M830J328k394n761q543J9573J3967m826j2214j5926
17498A98779J4540M5039N6857j767m2074p734N4387O0830O7606O4522J27484J76555
17486H15024K16492J84446J37537J07661K02448K05328J4713j23814j21932p5289
17476A562614m1271j07191j35393m2901N887J3010L8193J04085J39485Q2125m5655
$$ plain form
17465 1572988 1392834 1274266 1195510 1075577 940085 814373 673537 566211 450534 382825
17455 382825 361989 325716 288444 242991 238348 227561 236987 292029 296204 281568 274842 289230
17443 289230 365467 494117 589679 615942 576286 564853 561954 652561 763863 913030 1038964
17432 1038964 1112987 1226312 1395562 1492038 1452924 1367465 1257246 1184179 1126799 1113702 1053341
17421 1053341 1007256 994062 1004002 1038944 1165401 1294710 1311687 1170110 1046512 982573 907224
17410 907224 842451 747341 622809 466069 389735 328790 291993 230882 148728 123389 166567
17399 166567 158423 155937 153534 144958 149192 146212 121471 115190 99573 119857 164408 168389 171210
17386 171210 176266 127037 83350 71513 65724 67015 92867 91764 105288 97123 94164 122191 144067
$$ packed form
17465A572988j80154j18568p8756j19933j35492j25712j40836j07326j15677o7709
17455C82825k0836l6273l7272m5453m643j0787R426N5042M175j4636o726J4388
17443B89230P6237J28650R5562K6263l9656j1433k899R0607J11302J49167J25934
17432A038964P4023J13325J69250R6476l9114q5459j10219p3067n7380j3097o0361
17421A053341m6085j3194R940L4942J26457J29309J6977j41577j23598o3939p5349
17410I07224o4773r5110j24532j56740p6334o0945l6797o1111q2154k5339M3178
17399A66567q144k486k403q576M234k980k4741o281j5617K0284M4551L981K821
17386A71210N056m9229m3687j1837n789J291K5852j103J3524q165k959K8027K1876
$$ plain form
17373 144067 111867 76736 53811 68051 23380 24778 51902 65740 95729 113049 106055 108834
17361 108834 120830 86924 63702 81831 113860 99781 117628 151112 178303 197352 233897
17350 233897 294294 370820 467696 575868 713144 809827 821210 839046 814787 716711 579564
17339 579564 505841 441990 421247 445934 494202 598047 754431 827865 864497 881155 834816
17328 834816 722211 571253 423190 369022 304831 229583 175120 135531 94543 81840 87370
17317 87370 100379 104825 123669 122510 119020 77888 73060 103289 130068 118381 98405 116116
17305 116116 103086 77270 77320 50194 73909 109978 137783 162840 158936 187025 247272 381092
17293 381092 524154 616764 692611 716292 718063 689347 612141 492769 367965 339542 360726
$$ packed form
17373A44067l2200l5131k2925J4240m4671J398K7124J3838K9989J7320o994K779
17361A08834J1996l3906k3222J8129L2029j4079J7847L3484K7191J9049L6545
17350B33897O0397P6526R6876J08172J37276R6683J1383J7836k4259r8076j37147
17339E79564p3723o3851k0743K4687M8268J03845J56384P3434L6632J6658m6339
17328H34816j12605j50958j48063n4168o4191p5248n4463l9589m0988j2703N530
17317H7370J3009M446J8844j159l490m1132m828L0229K6779j1687j9976J7711
17305A16116j3030k5816N0k7126K3715L6069K7805K5057l904K8089O0247J33820
17293C81092J43062R2610P5847K3681J771k8716p7206j19372j24804k8423K1184
$$ plain form
17282 360726 390340 451805 533899 607551 687126 729300 725969 704957 624970 490222 373612
17271 373612 286894 218035 168258 143822 105587 89932 96348 82295 79699 78528 31753 -13737
17259 -13737 -26896 -5059 5177 16231 37816 14002 2054 -11080 4155 -704 4884 -5836
17247 -5836 21249 41277 49127 31462 7033 -10580 1749 10430 4757 22763 19763 29865 38485
17234 38485 17825 -5030 -19728 -31075 -7815 -5335 -11541 70 -6154 -5464 -13745 5121 21928
17221 21928 36918 32829 36707 59374 93057 74323 59583 3592 -12702 -1630 51981 21645
17209 21645 -22816 -39926 10452 46606 60392 79036 87681 91595 112630 131079 128898 172618
17197 172618 187535 138846 104924 92361 117663 129406 111563 97714 106538 109530 101110 118001
$$ packed form
17282C60726K9614O1465Q2094P3652P9575M2174l331k1012p9987j34748j16610
17271C73612q6718o8859m9777k4436l8235j5655O416j4053k596j171m6775m5490
17259a3737j3159K1837J0236J1054K1585k3814j1948j3134J5235m859N588j0720
17247e836K7085K0028P850j7665k4429j7613J2329Q681n673J8006l000J0102Q620
17234C8485k0660k2855j4698j1347K3260K480o206J1611o224O90q281J8866J6807
17221B1928J4990m089L878K2667L3683j8734j4740n5991j6294J1072N3611l0336
17209B1645m4461j7110N0378L6154J3786J8644Q645L914K1035J8449k181M3720
17197A72618J4917m8689l3922j2563K5302J1743j7843j3849Q824K992q420J6891
$$ plain form
17185 118001 153596 135254 133397 133768 98676 114059 88338 76041 83988 97585 86812 92033
17173 92033 69153 33244 36807 62323 71118 81522 66859 32396 61609 48580 25790 21841
17161 21841 -8052 -2590 34453 49162 29792 -12986 -17123 -21595 -43874 -89000 -87423 -58949
17149 -58949 -48054 -14913 18280 43800 33963 25689 20468 30942 33147 14853 32961 43481
17137 43481 36776 19482 8646 44817 17168 11776 46575 33752 41626 58299 45801 45668 -12148
17124 -12148 -17045 342 -4750 -3930 43906 60878 52385 6161 -31379 -19741 -46343 -44789 -32684
17111 -32684 -50463 -38298 -30354 -20066 -25482 -13517 -28182 -31677 -50723 -54758 -39021 -21709
17099 -21709 19646 56831 37987 37751 43966 35466 5775 14136 38765 2870 15809 27350 11048
$$ packed form
17185A18001L5595j8342j857L71l5092J5383k5721j2297P947J3597j0773N221
17173I2033k2880l5909L563K5516Q795J0404j4663l4463K9213j3029k2790l949
17161B1841k9893N462L7043J4709j9370m2778m137m472k2279m5126J577K8474
17149e8949J0895L3141L3193K5520r837q274n221J0474K205j8294J8108J0520
17137D3481o705j7294j0836L6171k7649n392L4799j2823P874J6673j2498j33n7816
17124a2148m897J7387n092Q20M7836J6972q493m6224l7540J1638k6602J554J2105
17111c2684j7779J2165P944J0288n416J1965j4665l495j9046m035J5737J7312
17099b1709M1355L7185j8844k36O215q500k9691Q361K4629l5895J2939J1541j6302
$$ plain form
17086 11048 1397 9619 26280 43734 86995 84212 81658 93027 111414 93520 48432 14061
17074 14061 7306 -409 -22027 -26791 -12298 28413 15057 -33766 -53814 -329 23912 52446
17062 52446 54571 60804 56004 33321 36210 31505 4986 -28223 -6025 5343 7919 15992 38095
17049 38095 41151 28531 33322 53665 38459 33430 19951 28116 69847 93378 81312 50283
17037 50283 12976 -7732 3748 1586 -21952 -4956 22727 23557 43459 85664 83814 48392
17025 48392 51740 6916 16611 39991 7929 -12056 -11677 -13400 -9013 -25512 -8486 25541 20041
17012 20041 33731 52907 41538 24472 25434 29459 8218 11002 -8706 -41810 -39388 -23522 -36344
16999 -36344 -31596 -4528 9076 -14135 -27302 -15574 -9602 -27734 -40948 -50735 -6574 29743
$$ packed form
17086A1048r651Q222J6661J7454M3261k783k554J1369J8387j7894m5088l4371
17074A4061o755p715k1618m764J4493M0711j3356m8823k0048N3485K4241K8534
17062E2446K125O233m800k2683K889m705k6519l3209K2198J1368K576Q073K2103
17049C8095L056j2620M791K0343j5206n029j3479Q165M1731K3531j2066l1029
17037E0283l7307k0708J1480k162k3538J6996K7683Q30J9902M2205j850l5422
17025D8392L348m4824R695K3380l2062j9985L79j723M387j6499J7026L4027n500
17012B0041J3690J9176j1369j7066R62M025k1241K784j9708l3104K422J5866j2822
16999c6344M748K7068J3604k3211j3167J1728N972j8132j3214r787M4161L6317
$$ plain form
16987 29743 56964 36860 4753 656 -4176 1068 2237 5383 987 30165 56038 91270 78402
16974 78402 38021 694 -243 15541 -4645 -36375 -49672 -20345 -27437 -14742 -16427 -2014
16962 -2014 -1832 -27992 -49463 -42227 -13358 -23372 -8637 -4554 -19404 1615 30428 29021 8238
16949 8238 4108 24864 24596 31984 45794 43968 56983 79166 42014 18164 27832 4294 2934
16936 2934 7992 -18853 -19727 -3810 34216 46286 48071 19768 14972 5249 18778 8813 16918
16923 16918 6979 -14607 -33717 -19871 6600 16206 24037 13074 -3542 9103 5020 8628 32914
16910 32914 53139 -6010 -40842 -19781 -2045 18821 24464 7731 14519 -12571 -7747 8822
16898 8822 -2163 -5893 24781 27394 -1723 -5843 1262 -25632 -39414 -34556 -43393 -75426 -88204
$$ packed form
16987B9743K7221k0104l2107m097m832N244J169L146m396K9178K5873L5232j2868
16974G8402m0381l7327r37J5784k0186l1730j3297K9327p092J2695j685J4413
16962b014J82k6160k1471P236K8869j0014J4735M083j4850K1019K8813j407k0783
16949H238m130K0756k68P388J3810j826J3015K2183l7152k3850R668k3538j360
16936B934N058k6845q74J5917L8026J2070J785k8303m796r723J3529r965Q105
16923A6918r939k1586j9110J3846K6471R606P831j0963j6616J2645m083L608K4286
16910C2914K0225n9149l4832K1061J7736K0866N643j6733O788k7090M824J6569
16898H822j0985l730L0674K613k9117m120P105k6894j3782M858q837l2033j2778
$$ plain form
16885 -88204 -80383 -80788 -26828 15985 13215 -1999 19038 59656 68145 18632 -16847 -16188 32979
16872 32979 55100 51239 21784 -2908 -42512 -58996 3746 19216 -1621 -52033 -82337 -84378
16860 -84378 -77509 -44896 -74671 -62114 -8766 7799 10662 10814 -7040 -41686 -44085 -34751 -26934
16847 -26934 -51622 -45896 -7459 -31947 -23716 -7381 35027 37654 22174 21556 -5756 -20605 -35999
16834 -35999 -3040 52146 75436 75575 40404 22068 42023 85989 90775 55209 56201 61611 61941
16821 61941 61488 44476 20445 2870 -21889 -19501 1460 -29301 -25015 -12502 -15086 -21671 -4954
16808 -4954 11789 -4335 -1872 -32548 -27038 -27257 -21297 -12652 -18650 19001 17098 -10327 -17366 -31030
16794 -31030 -13569 -3027 -24689 -35265 -28795 -40022 -22880 -29200 1595 4490 -7285 17220
$$ packed form
16885h8204P821m05N3960M2813k770j5214K1037M0618Q489m9513l5479O59M9167
16872C2979K2121l861k9455k4692l9604j6484O2742J5470k0837n0412l0304k041
16860h4378O869L2613k9775J2557N3348J6565K863J52j7854l4646k399R334P817
16847b6934k4688N726L8437k4488Q231J6335M2408K627j5480o18k7312j4849j5394
16834c5999L2959N5186K3290J39l5171j8336J9955M3966M786l5566R92N410L30
16821F1941m53j7012k4031j7575k4759K388K0961l0761M286J2513k584o585J6717
16808d954J6743j6124K463l0676N510k19N960Q645n998L7651j903k7425p039j3664
16794c1030J7461J0542k1662j0576O470j1227J7142o320L0795K895j1775K4505
$$ plain form
16782 17220 5201 -30324 -43931 -58825 -6175 9102 -47886 -56146 -18497 -14722 -23195 -36824
16770 -36824 -9378 19605 -1338 22372 19457 -20339 3122 50849 73703 63586 23921 6878
16758 6878 -10830 -58919 -61623 -33777 -49089 -44365 -19222 36033 49245 52739 56945 46099 21243
16745 21243 18087 38838 31004 40167 9595 21273 14806 -7548 -18351 -15313 -8825 -5887 14268
16732 14268 -10156 -29564 -29347 -8654 13965 -37796 -33452 -24144 -51769 -68591 -45052 -11139
16720 -11139 -370 5250 -1989 -11785 3942 -10034 -27971 -42111 -29369 -23309 -15088 10712 20544
16707 20544 27236 -11857 -33717 -67002 -38085 -33622 -38618 -44393 -75141 -39605 1158 -10683
16695 -10683 -54478 -74852 -55511 -51965 2121 27810 7702 21199 6267 -11544 -27271 -23179
$$ packed form
16782A7220j2019l5525j3607j4894N2650J5277n6988q260L7649L775q473j3629
16770c6824K7446K8983k0943K3710k915l9796K3461M7727K2854j0117l9665j7043
16758F878j7708m8089k704K7846j5312M724K5143N5255J3212L494M206j0846k4856
16745B1243l156K0751p834R163l0572J1678o467k2354j0803L038O488K938K0155
16732A4268k4424j9408K17K0693K2619n1761M344R308k7625j6822K3539L3913
16720a1139J0769N620p239r796J5727j3976j7937j4140J2742O060Q221K5800R832
16707B0544O692l9093k1860l3285K8917M463m996n775l0748L5536M0763j1841
16695a0683m3795k0374J9341L546N4086K5689k0108J3497j4932j7811j5727M092
$$ plain form
16683 -23179 -3185 -15373 -22898 -1343 41374 27840 -2562 -34025 5917 19504 28411 63641
16671 63641 117290 119180 90095 82446 76679 77487 40437 -10498 1222 -845 26431 64894 72229
16658 72229 59455 40625 8848 26753 38810 14308 782 6965 -2741 -21657 -28026 -26922
16646 -26922 -11189 -2031 4348 -24300 -49078 -55346 -26504 -2542 1955 -32086 -21335 33594
16634 33594 57882 63777 35951 47301 27626 -24560 -39245 -6046 23224 16440 -11931 -2709
16622 -2709 -24450 -38303 -53783 -63615 -51225 -23896 -26039 -15642 -33291 -37637 -6798 -6108 -8699
16609 -8699 -9333 -20805 -26224 122 8243 -17114 -28425 14225 41440 26700 -15731 -45694 -41220
16596 -41220 -38574 -59933 -75247 -71717 -72945 -64042 -28214 -3973 -15542 -19708 -45089 -27538 -29069
$$ packed form
16683b3179J9994j2188p525K1555M2717j3534l0402l1463L9942J3587Q907L5230
16671F3641N3649J890k9085p649n767Q08l7050n0935J1720k067K7276L8463P335
16658G2229j2774j8830l1777J7905J2057k4502j3526O183r706j8916o369J104
16646b6922J5733R158O379k8648k4778o268K8842K3962M497l4041J0751N4929
16634C3594K4288N895k7826J1350j9675n2186j4685L3199K9270o784k8371R222
16622b709k1741j3853j5480r832J2390K7329k143J0397j7649m346L0839O90k591
16609h699o34j1472n419K6346Q121k5357j1311M2650K7215j4740m2431k9963M474
16596d1220K646k1359j5314L530j228Q903L5828K4241j1569m166k5381J7551j531
$$ plain form
16583 -29069 -54787 -60451 -84361 -52873 -15469 10165 -3578 -14000 -36807 -34254 -20104 -35162
16571 -35162 18106 41780 51602 14882 -13451 -3943 -1852 -24621 -45172 -22853 -20924 4580
16559 4580 108 7289 21704 -7897 7075 38816 39762 18304 5137 -12279 -32906 10596 1999
16546 1999 392 -18812 -20989 -4323 -3247 208 -15878 -14645 1367 -2951 -21450 -25122 -38505
16533 -38505 -8590 6609 -9059 -47868 -65779 -44147 -11898 1435 -3185 10586 20184 33398
16521 33398 23663 -22348 -72431 -47137 -26326 -1664 -5492 -3855 -16471 -21852 -30719 -12812 -37043
16508 -37043 -77355 -81545 -64345 -8059 23897 28261 25400 17771 28213 25845 61105 55187 36495
16495 36495 18021 -22702 -66810 -73486 -88432 -83092 -67396 -51856 -45899 -14437 -11311 -6821 4938
$$ packed form
16583b9069k5718n664k3910L1488L7404K5634j3743j0422k2807K553J4150j5058
16571c5162N3268K3674R822l6720k8333R508K091k2769k0551K2319J929K5504
16559D580m472P181J4415k9601J4972L1741R46k1458j3167j7416k0627M3502q597
16546A999j607j9204k177J6666J076L455j6086J233J6012m318j8499l672j3383
16533c8505K9915J5199j5668l8809j7911K1632L2249J3333m620J3771R598J3214
16521C3398r735m6011n0083K5294K0811K4662l828J637j2616n381q867J7907k4231
16508c7043m0312m190J7200N6286L1956M364k861p629J0442k368L5260n918j8692
16495C6495j8474m0723m4108o676j4946N340J5696J5540N957L1462L126M490J1759
$$ plain form
16482 4938 -23931 -40105 -24062 -25645 -48022 -36703 8343 -12847 -56709 -38397 -16003 -4126
16470 -4126 2890 -8735 681 -17024 -62234 -31464 20019 13309 25894 11108 -16988 1050
16458 1050 -19737 -12073 -14244 11155 -20505 -14489 29584 49921 62990 87004 83684 51998 53909
16445 53909 39563 13045 3234 -6868 -1160 24116 1269 -45213 -46984 -35899 -24009 -28654
16433 -28654 -41802 -57249 -48050 -53099 -33685 -12736 20519 19857 15057 -18442 -51290 -49280 -25798
16420 -25798 -26324 -51655 -59538 -94247 -93333 -93631 -64537 -24334 -17883 -47343 -18411 -9650 -39195
16407 -39195 -55441 -70879 -91628 -100795 -60229 -14449 -20506 -6734 35943 17426 157 22002
16395 22002 9197 -14053 -17210 -28584 -16350 12602 -643 1003 1802 -21320 -12079 7893 -14885
$$ packed form
16482D938k8869j6174J6043j583k2377J1319M5046k1190m3862J8312K2394J1877
16470d126P016j1625R416j7705m5210L0770N1483o710J2585j4786k8096J8038
16458A050k0787P664k171K5399l1660O016M4073K0337J3069K4014l320l1686J911
16445E3909j4346k6518r811j0102N708K5276k2847m6482j771J1085J1890m645
16433b8654j3148j5447R199n049J9414K0949L3255o62m800l3499l2848K010K3482
16420b5798n26k5331p883l4709R14k98K9094M0203O451k9460K8932Q761k9545
16407c9195j6246j5438k0749r167M0566M5780o057J3772M2677j8517j7269K1845
16395B2002j2805k3250l157j1374J2234K8952j3245J646P99k3122R241J9972k2778
$$ plain form
16382 -14885 -16743 11861 10654 -9802 -9774 -2869 -17104 -24795 -27165 16922 58445 48274 8494
16369 8494 -3870 -2466 7948 33473 57509 28104 41951 48669 15647 -25198 -13353 -43457
16357 -43457 -74118 -26939 1271 -16371 -6713 -3664 8767 505 13958 18741 4181 -12841
16345 -12841 -28960 -54941 -41313 -21381 13469 11392 -11957 22943 5966 -13087 -21555 -1903
16333 -1903 3479 1653 15323 16781 -19071 -58447 -37328 -28448 994 18076 27341 14123 5001
16320 5001 33631 26969 1965 19261 -11101 7376 -17883 -17902 -26328 1403 21983 -17255 21377
16307 21377 58811 53367 51136 35148 29883 61163 65228 53463 -4781 -5574 2338 -30083 -56372
16294 -56372 -26005 366 1054 -18154 -11875 -10647 -32027 -24558 3420 6856 -25042 -7989 28424
$$ packed form
16382a4885j858K8604j207k0456K8O905j4235p691k370M4087M1523j0171l9780
16369H494j2364J404J0414K5525K4036k9405J3847O718l3022m0845J1845l0104
16357d3457l0661M7179K8210j7642R658L049J2431q262J3453M783j4560j7022
16345a2841j6119k5981J3628J9932L4850k077k3349L4900j6977j9053q468J9652
16333a903N382j826J3670J458l5852l9376K1119Q880K9442J7082R265j3218r122
16320E001K8630o662k5004J7296l0362J8477k5259j9q426K7731K0580l9238L8632
16307B1377L7434n444k231j5988n265L1280M065j1765n8244p93P912l2421k6289
16294e6372L0367K6371O88j9208O279J228k1380P469K7978L436l1898J7053L6413
$$ plain form
16281 28424 35928 31498 12087 -4444 18311 22251 33805 15789 -22523 2787 -2341 166 11815
16268 11815 8802 4033 -25041 17326 27139 35075 13137 -8395 -32217 -43534 -43127 -223 5717
16255 5717 14175 20000 7519 18821 13637 37629 6712 -10254 -31743 -31175 -41149 -34075 -42303
16242 -42303 2648 53051 58679 40850 23574 5438 -21631 -21910 -46914 -42269 -27678 -15571
16230 -15571 -32231 -24245 -33601 -11509 982 29550 36280 57155 -14778 -50699 -22441 -25161
16218 -25161 -28445 318 -16341 -40935 -33480 -29817 -47494 -55119 -51269 -58809 -63656 -28773 17401
16205 17401 70970 64932 30867 10872 8229 5175 -8545 -29040 -13025 207 -10506 -50555
16193 -50555 -40824 -29718 -29809 -62705 -44382 -14338 11472 -8137 -37967 -35880 -36166 -45083 -20049
$$ packed form
16281B8424P504m430j9411j6531K2755L940J1554j8016l8312K5310n128K507J1649
16268A1815l013m769k9074M2367R813P936k1938k1532k3822j1317M07M2904N940
16255E717Q458N825j2481J1302n184K3992l0917j6966k1489N68r974P074q228
16242d2303M4951N0403N628j7829j7276j8136k7069k79k5004M645J4591J2107
16230a5571j6660P986r356K2092J2491K8568O730K0875p1933l5921K8258k720
16218b5161l284K8763j6659k4594P455L663j7677p625L850p540m847L4883M6174
16205A7401N3569o038l4065j9995k643l054j3720k0495J6015J3232j0713m0049
16193e0555R731J1106r1l2896J8323L0044K5810j9609k9830K087k86q917K5034
$$ plain form
16180 -20049 -6384 22380 21589 -2433 -1487 -2898 2962 -17243 -16313 -5376 38847 84983 104725
16167 104725 69348 17423 17984 47632 20395 18180 -3904 6923 -9373 -42972 -47004 -18031
16155 -18031 20673 15914 -2372 -143 39812 35856 29870 16625 7009 -19417 -20735 14431 -11504
16142 -11504 -22751 -13468 -39019 492 58335 37008 57317 90186 57124 -4421 -22133 2048
16130 2048 -3829 -26321 -44155 -9255 -28070 -60302 -20240 -7276 -16933 -46294 -43484 -62157
16118 -62157 -52913 -63709 -73516 -48243 -30683 -26969 -44057 -61991 -69432 -40309 -26558 -35262 -36873
16105 -36873 -29455 -7805 12475 600 -36402 -7862 10923 25238 29896 15697 -8174 16603
16093 16603 52738 59368 57528 60132 34845 15437 -6966 -7201 19305 39457 3438 -9064 -8493
$$ packed form
16180b0049J3665K8764p91k4022R46j411N860k0205R30J0937M4223M6136J9742
16167A04725l5377n1925N61K9648k7237k215k2084J0827j6296l3599m032K8973
16155a8031L8704m759j8286K229L9955l956n986j3245r616k6426j318L5166k5935
16142a1504j1247R283k5551L9511N7843k1327K0309L2869l3062o1545j7712K4181
16130B048n877k2492j7834L4900j8815l2232M0062J2964r657k9361K810j8673
16118f2157R244j0796r807K5273J7560L714j7088j7934p441K9123J3751q704j611
16105c6873P418K1650K0280j1875l7002K8540J8785J4315M658j4199k3871K4777
16093A6603L6135O630j840K604k5287j9408k2403k35K6506K0152l6019j2502N71
$$ plain form
16080 -8493 -20555 -22211 -18304 -11652 -13877 -33237 -28892 -20371 18094 79291 79516 57236 84917
16067 84917 88790 53113 7203 12845 34557 68582 116534 116485 98133 41558 38988 59033 41502
16054 41502 1358 -39957 -54904 -60388 -5519 -11492 -36034 -42428 -26487 4225 3104 26204
16042 26204 34437 13005 -14504 -49888 -32873 6867 13509 -15157 -34831 -49042 -43316 -60350
16030 -60350 -73989 -62698 -32527 -26640 -59652 -26355 1697 -22486 -1639 22039 35237 16372
16018 16372 1779 -8878 -26838 3161 2189 7727 347 16951 24867 38041 25210 42296 38682
16005 38682 2565 7346 24764 16986 -5981 31707 57822 46158 14291 -21565 31364 38660
15993 38660 18194 16449 1108 10547 25660 24126 38819 26766 27661 24641 29720 11281 -25325
$$ packed form
16080h493j2062j656L907O652k225j9360M345Q521L8465O1197K25k2280K7681
16067H4917L873l5677m5910N642K1712L4025M7952m9j8352n6575k570K0045j7531
16054D1502m0144m1315j4947n484N4869n973k4542o394J5941L0712j121K3100
16042B6204Q233k1432k7509l5384J7015L9740O642k8666j9674j4211N726j7034
16030f0350j3639J1291L0171N887l3012L3297K8052k4183K0847K3678J3198j8865
16018A6372j4593j0657j7960K9999r72N538p380J6604P916J3174j2831J7086l614
16005C8682l6117M781J7418p778k2967L7688K6115j1664l1867l5856N2929P296
15993C8660k0466j745j5341R439J5113j534J4693j2053Q95l020N079j8439l6606
$$ plain form
15980 -25325 18459 27390 19976 -8723 -45104 -41690 -43679 -52278 -19526 -16541 -36505 -47808 -20294
15967 -20294 -12405 19184 45176 35048 2979 15806 23843 17817 14418 -3542 -11547 -24991 -24102
15954 -24102 1475 7559 -33562 -27166 -7651 -12247 -3435 -45359 -29316 18572 34302 35246 26504
15941 26504 3843 23215 51011 38485 32916 25928 26129 -12768 2450 28133 32338 11533 -13672
15928 -13672 13895 -3002 -8448 3124 3542 -22437 -72663 -80108 -77920 -28186 4469 18893 6175
15915 6175 16547 22486 67128 74570 48733 58286 46279 30827 2135 -25755 -6613 11745
15903 11745 12084 27434 -26224 -49501 -43693 -56485 -100653 -93104 -87977 -60111 -62279 -37457 -23329
15890 -23329 709 13664 12569 17828 8364 -44946 -78570 -67168 -49058 -84873 -64659 -13274
$$ packed form
15980b5325M3784Q931p414k8699l6381L414j989q599L2752K985j9964j1303K7514
15967b0294P889L1589K5992j0128l2069J2827Q037o026l399j7960q005j3444Q89
15954b4102K5577O084m1121O396J9515m596Q812m1924J6043M7888J5730R44q742
15941B6504k2661J9372K7796j2526n569o988K01l8897J5218K5683M205k0805k5205
15928a3672K7567j6897n446J1572M18k5979n0226p445K188M9734L2655J4424j2718
15915F175J0372N939M4642P442k5837R553j2007j5452k8692k7890J9142J8358
15903A1745L39J5350n3658k3277N808j2792m4168P549N127K7866k168K4822J4128
15890b3329K4038J2955j095N259r464n3310l3624J1402J8110l5815K0214N1385
$$ plain form
15878 -13274 31784 44421 33727 5853 -5359 6534 47308 61476 28280 -10202 -15830 -27786
15866 -27786 13088 34345 48501 74784 81342 81490 46086 53009 38174 57696 54631 28993 12355
15853 12355 33375 24248 -43538 -84522 -99106 -52200 -58054 -51608 -6605 -10392 -21735 11588
15841 11588 40666 9935 1175 -24622 -11130 3338 -14730 -13401 12079 33186 53358 44380
15829 44380 15146 -20150 -38231 -23051 -435 3234 -18863 -42725 -22796 -1201 14804 5883
15817 5883 -19719 -12563 6135 9618 11984 2705 -20007 -40792 -54749 -53775 -50777 -30373 -15467
15804 -15467 -12617 -16391 -30580 -41173 -20577 9401 60868 52652 42136 58868 77985 67093
15792 67093 49799 41153 28169 -2415 -11154 4826 38792 39661 23003 -27067 -73821 -80181 -62367
$$ packed form
15878a3274M5058J2637j0694k7874j1212J1893M0774J4168l3196l8482n628j1956
15866b7786M0874K1257J4156K6283O558J48l5404O923j4835J9522l065k5638j6638
15853A2355K1020r127o7786m0984j4584M6906n854O446M5003l787j1343L3323
15841A1588K9078l0731q760k5797J3492J4468j8068J329K5480K1107K0172q978
15829D4380k9234l5296j8081J5180K2616L669k2097k3862J9929K1595J6005q921
15817E883k5602P156J8698L483K366r279k2712k0785j3957R74K998K0404J4906
15804a5467K850l774j4189j0593K0596K9978N1467q216j0516J6732J9117j0892
15792F7093j7294q646j2984l0584q739J5980L3966Q69j6658n0070m6754o360J7814
$$ plain form
15779 -62367 -17736 7020 -10007 -46962 -85072 -76642 -37817 10202 24557 21029 18270 33378
15767 33378 50904 62835 -26018 -59733 -16172 16683 -14399 12482 17782 -13210 -30858 -31878
15755 -31878 -5049 -40935 -25639 -16527 6599 13613 17306 -1045 -9029 1647 4870 8219 2023
15742 2023 12982 -653 -41629 -45487 24566 39579 34380 26729 12215 -12155 -36186 -22836
15730 -22836 -28024 -26737 7823 24678 13967 14580 3823 7566 1976 5912 -3678 -14844 19192
15717 19192 -3829 -41006 -44261 -42115 -34986 -11969 -10781 -14241 11902 -15903 -21868 -20816 -39808
15704 -39808 -48463 -37665 -18179 14443 -45024 -55224 -4587 1092 -11058 -39073 -61131 -48872
15692 -48872 -44085 -36508 -21534 -12701 -39195 -50021 -7533 34334 20048 30326 25658 10480
$$ packed form
15779f2367M4631K4756j7027l6955l8110Q430L8825M8019J4355l528k759J5108
15767C3378J7526J1931q8853l3715M3561L2855l1082K6881N300l0992j7648j020
15755c1878K6829l5886J5296R112K3126P014L693j8351p984J0676L223L349o196
15742B023J0959j3635m0976l858P0053J5013n199p651j4514k4370k4031J3350
15730b2836n188J287L4560J6855j0711O13j0757L743n590L936r590j1166L4036
15717A9192k3021l7177l255K146P129K3017J188l460K6143k7805n965J052j8992
15704c9808q655J0798J9486L2622n9467j0200N0637N679j2150k8015k2058J2259
15692d8872M787P577J4974Q833k6494j0826M2488M1867j4286J0278m668j5178
$$ plain form
15680 10480 -20859 -29057 -10806 -12278 -3543 27369 67564 71434 35812 14109 -14213 -39180
15668 -39180 -28773 -29299 -5532 7506 -12872 -56053 -81774 -85839 -70180 -57882 -30987 3876
15656 3876 6239 -37463 -31163 -4370 -6170 20542 11218 11845 6777 670 -2020 -32371 -59511 -66585
15642 -66585 9572 65747 95333 58824 -2770 -343 17725 37396 49702 37706 37189 14985
15630 14985 -22735 616 22070 38196 32265 35138 57112 22629 -11625 -8816 -20562 -40374
15618 -40374 -7214 29283 46649 63969 71454 42494 11934 -26516 -63851 -46044 -50543 -63588
15606 -63588 -57361 -23490 8216 24085 28893 7166 -2600 13436 7971 1934 -6382 -22811 -29555
15593 -29555 -33997 -8210 20062 -7792 -27725 -33612 -45165 -55660 -68020 -67763 -60658 -54190 -48601
$$ packed form
15680A0480l1339q198J8251j472Q735L0912M0195L870l5622k1703k8322k4967
15668c9180J0407n26K3767J3038k0378m3181k5721m065J5659J2298K6895L4863
15656C876K363m3702O300K6793j800K6712r324O27n068o107k690l0351k7140p074
15642f6585P6157N6175K9586l6509o1594K427J8068J9671J2306j1996n17k2204
15630A4985l7720K3351K1454J6126n931K873K1974l4483l4254K809j1746j9812
15618d0374L3160L6497J7366J7320P485k8960l0560l8450l7335J7807m499j3045
15606f3588O227L3871L1706J5869M808k1727r766J6036n465o037q316j6429o744
15593b9555m442K5787K8272k7854j9933n887j1553j0495j2360K57P105O468N589
$$ plain form
15580 -48601 -51568 -18308 -9296 -9786 -9011 -7571 -11441 -13977 13083 336 -5942 -38823 -24949 4233
15566 4233 -5183 724 13120 -13569 -30259 -37713 18822 14131 -24079 5304 30860 60786 58295
15553 58295 45054 2230 6267 12418 -27051 -45995 -44523 -21389 1096 3275 -10549 -43821
15541 -43821 -32134 -16068 -21163 -18255 -51932 -53407 -70011 -40335 -3424 -9390 -47350 -50999 -33142
15528 -33142 -11929 -21252 -15320 -30075 -44664 -14444 10998 -28466 -8239 -13459 -31206 -21426
15516 -21426 2271 7255 -5124 -17622 -18556 -37835 -13963 -53883 -56340 -76254 -92237 -66295
15504 -66295 -24813 -4015 2623 28119 23251 -25273 -49651 -38181 -13491 -6582 -26735 -47603
15492 -47603 -24484 7681 22679 10341 -32503 -78427 -76541 -63260 -96322 -76921 -41885 -68904
$$ packed form
15580d8601k967L3260R012m90P75J440l870k536K7060j2747o278l2881J3874K9182
15566D233r416N907J2396k6689j6690p454N6535m691l8210K9383K5556K9926k491
15553E8295j3241m2824M037O151l9469j8944J472K3134K2485K179j3824l3272
15541d3821J1687J6066n095K908l3677j475j6604K9676L6911n966l7960l649J7857
15528c3142K1213r323N932j4755j4589L0220K5442l9464K0227n220j7747R780
15516b1426K3697M984j2379j2498r34j9279K3872l9920k457j9914j5983K5942
15504f6295M1482K0798O638K5496m868m8524k4378J1470K4690O909k0153k0868
15492d7603K3119L2165J4998j2338m2844m5924J886J3281l3062J9401L5036k7019
$$ plain form
15480 -68904 -23885 -3583 -7453 -3919 -12128 -12409 19862 56771 72890 46984 -9844 -55635 -35167
15467 -35167 -53787 -44463 -69050 -43386 -10311 5879 -38071 -58185 -49735 -53849 -45138 279
15455 279 -5187 -40058 -41699 -33428 -34417 -57846 -62368 -56700 9953 33283 -593 -30799 -36353 -26652
15441 -26652 -10122 -11880 -34702 -77959 -59336 -1146 -9436 -44893 -70682 -77993 -57491 -54784
15429 -54784 -10798 23452 5544 17575 48121 51070 39961 27658 16949 7741 -9964 -9831
15417 -9831 29359 35997 32363 12703 -11311 -33283 -36637 -32618 -38082 -31949 3660 32385 6898
15404 6898 4364 3147 34468 65546 40441 -2127 -3189 -28621 -52540 -46380 -14361 3537 4289
15391 4289 17111 6250 23606 18025 11302 -7137 11935 40828 27074 13271 6868 -36119
$$ packed form
15480f8904M5019K0302l870L534q209k81L2271L6909J6119k5906n6828m5791K0468
15467c5167j8620R324k4587K5664L3075J6190m3950k0114Q450m114Q711M5417
15455B79n466l4871j641Q271r89k3429m522N668O6653K3330l3876l0206n554R701
15441b6652J6530j758k2822m3257J8623N8190q290l5457k5789p311K0502K707
15429e4784M3986L4250j7908J2031L0546K949j1109j2303j0709r208j7705J33
15417i831L9190O638l634j9660k4014k1972l354M019n464O133L5609K8725k5487
15404F898k534j217L1321L1078k5105m2568j062k5432k3919O160L2019J7898P52
15391D289J2822j0861J7356n581o723j8439J9072K8893j3754j3803o403m2987
$$ plain form
15379 -36119 -45449 4399 3521 -24933 -30856 -33946 -38491 -30383 -43277 -4923 33176 34845 11323
15366 11323 -8204 13267 33794 14571 -3776 4191 -3094 -14187 -14943 -25753 -16815 20250 46439
15353 46439 28755 -20437 -24293 -9453 -8597 27683 40432 58818 67939 18430 3468 420 13942
15340 13942 8508 -31695 -16809 14823 -17567 -69729 -69139 -41900 -17220 -30070 -12694 -8720
15328 -8720 -16949 -29244 -16561 -36251 -41015 -34807 -25998 -19986 -12409 -15540 4048 -1761 -23146
15315 -23146 -28060 -18297 -1545 7558 34540 25995 25283 44630 43660 4130 -22527 -7247 -29697
15302 -29697 -29263 1295 30650 44312 6728 6724 12491 26180 14447 -1559 -16933 -31752 -40604
15289 -40604 -40777 722 2237 -5256 20161 22410 -9213 -6014 21425 -10669 -21853 -25278 -1109
$$ packed form
15379c6119r330M9848q78k8454n923l090m545Q108j2894L8354L8099J669k3522
15366A1323j9527K1471K0527j9223j8347P967p285j1093p56j0810Q938L7065K6189
15353D6439j7684m9192l856J4840Q56L6280J2749J8386R121m9509j4962l048J3522
15340A3942n434m0203J4886L1632l2390n2162N90K7239K4680j2850J7376L974
15328h720q229j2295J2683j9690m764O208Q809O012P577l131J9588n809k1385
15315b3146m914R763J6752R103K6982q545p12J9347r70l9530k6657J5280k2450
15302b9697M34L0558K9355J3662l7584mN767J3689j1733j6006j5374j4819q852
15289d0604j73M1499J515p493K5417K249l1623L199K7439l2094j1184l425K4169
$$ plain form
15276 -1109 -1037 -14611 12841 40764 43782 32433 -12272 -65661 -79604 -73429 -55615 -21728 -16577
15263 -16577 4506 -14694 -38655 -32442 -16113 -11796 -16206 -9797 -9934 -9323 12069 39371 41331
15250 41331 27355 1618 25441 38637 16985 9601 2014 -5711 -6958 -8789 -28703 -6761 34877
15237 34877 32526 -18077 -3920 -34580 -47889 -46922 -9564 18813 4408 1472 5762 20710 36413
15224 36413 5094 4521 20194 -15610 -35898 -21122 -28951 -34217 -55321 -48645 -46691 -27995 -33782
15211 -33782 -63570 -32289 -30143 -38738 -25482 -6331 8391 53917 63693 45179 32023 10468
15199 10468 18996 58618 94703 91115 72936 70419 51515 3257 -11891 -1825 -27522 -24761
15187 -24761 -33701 -55796 -60390 -66806 -67464 -41589 -18184 -14145 -15324 -21691 8061 41964 35160
$$ packed form
15276a109P2j3574K7452K7923L018j1349m4705n3389j3943O175J7814L3887N151
15263a6577K1083j9200k3961O213J6329M317m410O409j37O11K1392K7302J960
15250D1331j3976k5737K3823J3196k1652p384p587p725j247j831j9914K1942M1638
15237C4877k351n0603J4157l0660j3309R67L7358K8377j4405k936M290J4948J5703
15224C6413l1319n73J5673l5804k0288J4776p829n266k1104O676J954J8696n787
15211c3782k9788L1281K146q595J3256J9151J4722M5526R776j8514j3156k1555
15199A0468Q528L9622L6085l588j8179k517j8904m8258j5148J0066k5697K761
15187b4761q940k2095m594o416o58K5875K3405M039j179o367K9752L3903o804
$$ plain form
15174 35160 -2814 -39698 2429 46341 37403 11497 9263 -4322 13832 -635 -30273 -24146
15162 -24146 -55585 -47285 -78777 -61707 2324 32514 63296 52466 31441 13133 -5123 -4087
15150 -4087 10293 -16900 -44019 -13635 35437 53435 7373 -30253 -34973 -53040 -41347 -11587
15138 -11587 21546 11368 -17118 -32801 -18802 -22778 -37384 -15001 1037 12527 -16233 -23850
15126 -23850 -30542 -32505 -34129 5803 -245 12441 40495 37187 32188 28723 41822 28697 22620
15113 22620 17452 31636 -284 12380 16136 -14389 -26484 -26439 -19622 -14117 -9007 2604 19513
15100 19513 33252 26674 50085 80855 35102 -25496 -59286 -42533 -18774 -24090 -51305 -19458
15088 -19458 6930 5804 -3680 -7480 -7897 9139 -19383 -63425 -80581 -60964 -46002 -20956 17975
$$ packed form
15174C5160l7974l6884M2127M3912q938k5906k234j3585J8154j4467k9638O127
15162b4146l1439Q300l1492J7070O4031L0190L0782j0830k1025j8308j8256J036
15150d087J4380k7193k7119L0384M9072J7998m6062l7626m720j8067J1693K9760
15138a1587L3133j0178k8486j5683J3999l976j4606K2383J6038J1490k8760p617
15126b3850o692j963j624L9932o048J2686K8054l308m999l465J3099j3125o077
15113B2620n168J4184l1920J2664L756l0525j2095M5O817N505N110J1611J6909
15100A9513J3739o578K3411L0770m5753o0598l3790J6753K3759n316k7215L1847
15088a9458K6388j126r484l800m17J7036k8522m4042j7156J9617J4962K5046L8931
$$ plain form
15075 17975 24787 6784 -295 -14374 6943 -5145 -22666 -24662 -6811 8135 -11730 -21802
15063 -21802 -15147 -7741 9414 27707 50493 6699 -24569 -17372 19815 -12281 -21404 -18053 -18399
15050 -18399 1650 14823 18541 20285 21096 -12126 7224 20977 48129 58827 11875 -36619
15038 -36619 -32708 -13240 213 12941 1089 -13076 14209 33806 7394 -2553 12205 24253
15026 24253 40614 56648 20140 -17800 -17526 -7228 -48524 -59955 -43419 -29546 -4780 -23699
15014 -23699 -22882 -12294 -30687 -57219 -60251 -29578 -47007 -70147 -25207 -22342 -25569 28670 37123
15001 37123 47340 84060 88362 52732 13162 18754 -5089 5881 8239 25298 24816 23639 2269
14988 2269 10422 3647 5294 24605 9237 2023 4986 16621 -5756 -50271 -41000 -4235 13119
$$ packed form
15075A7975O812j8003p079j4079K1317j2088j7521j996J7851J4946j9865j0072
15063b1802O655P406J7155J8293K2786m3794l1268P197L7187l2096r123L351l46
15050a8399K0049J3173L718J744Q11l3222J9350J3753K7152J0698m6952m8494
15038c6619L911J9468J3453J2728j1852j4165K7285J9597k6412r947J4758J2048
15026B4253J6361J6034l6508l7940K74J0298m1296j1431J6536J3873K4766j8919
15014b3699Q17J0588j8393k6532l032L0673j7429k3140M4940K865l227N4239Q453
15001C7123J0217L6720M302l5630l9570N592k3843J0970K358J7059m82j177k1370
14988B269Q153o775J647J9311j5368p214K963J1635k2377m4515R271L6765J7354
$$ plain form
14975 13119 6019 -3389 -12838 16644 8461 -10045 9369 -386 -15930 -38698 -37333 -29241 -27677
14962 -27677 -12782 5561 36857 42348 20748 -3462 -24068 3915 54310 75494 24433 339
14950 339 -19189 20432 48188 21747 -878 4874 21560 50026 73186 70608 25810 31892 41342
14937 41342 55048 64589 36889 22113 -5744 -67334 -92189 -46929 -53695 -63906 -58239 -51945
14925 -51945 -52174 -21433 -28031 -40418 -40741 -38025 -43108 -42800 -20571 -7446 -4743 1966 -10911 -42086
14911 -42086 -20021 13948 31102 29649 17376 -22989 -37812 -36830 -14171 -9924 8595 -438 -35119
14898 -35119 -39046 -19953 -33102 11182 48362 68215 68000 60174 49891 62374 83420 80868 61393
14885 61393 30872 40639 50098 34946 28792 15861 4744 2766 13683 -502 -11903 -1042
$$ packed form
14975A3119p100r408r449K9482q183j8506J9414r755j5544k2768J365Q092J564
14962b7677J4895J8343L1296N491k1600k4210k0606K7983N0395K1184n1061k4094
14950C39j9528L9621K7756k6441k2625N752J6686K8466K3160k578m4798O082R450
14937D1342J3706R541k7700j4776k7857o1590k4855M5260o766j0211N667O294
14925e1945k29L0741o598j2387l23K716n083L08K2229J3125K703O709j2877l1175
14911d2086K2065L3969J7154j453j2273m0365j4823R82K2659M247J8519r033l4681
14898c5119l927J9093j3149M4284L7180J9853k15p826j0283J2483K1046k552j9475
14885F1393l0521R767R459j5152o154j2931j1117j978J0917j4185j1401J0861
$$ plain form
14873 -1042 40505 88297 97215 75669 28365 28451 31411 22568 17688 4828 -11263 -35186 -61167
14860 -61167 -34600 -35027 -73075 -95429 -67078 -5965 13530 14538 8255 34660 25682 -14162 -13746
14847 -13746 -1955 12760 20548 37352 50336 35220 39759 29634 35813 21760 201 -11072
14835 -11072 -13588 -29711 -66773 -58878 -930 617 26547 5278 -4738 -15256 -20992 -20687 -43813
14822 -43813 -43910 -38110 -56754 -32487 -18589 33368 77656 60156 14354 -4282 -12267 719 -27980
14809 -27980 -54849 -31662 7371 3858 15765 33224 55056 19251 27200 9159 1297 973 -22490
14796 -22490 -61371 -41271 -11419 -7608 -7859 7637 6623 -36151 -55689 -69658 -59273 -25841
14784 -25841 3422 21541 28027 1142 -12615 380 -90 40102 63421 38193 18113 -8298
$$ packed form
14873a042M1547M7792Q918k1546m7304Q6K960q843m880j2860j6091k3923k5981
14860f1167K6567m27l8048k2354K8351O1113J9495J008o283K6405q978l9844M16
14847a3746J1791J4715P788J6804J2984j5116M539j0125O179j4053k1559j1273
14835a1072k516j6123l7062P895N7948J547K5930k1269j0016j0518n736L05k3126
14822d3813r7N800j8644K4267J3898N1957M4288j7500m5802j8636p985J2986k8699
14809b7980k6869K3187L9033l513J1907J7459K1832l5805P949j8041p862l24k3463
14796b2490l8881K0100K9852L811k51J5496j014m2774j9538j3969J0385L3432
14784b5841K9263J8119O486k6885j3757J2995m70M0192K3319k5228k0080k6411
$$ plain form
14772 -8298 -19353 -18519 -26663 -39266 -21864 -16648 -21305 -18369 -7745 -2292 -15490 -9769 -1751 -24021
14758 -24021 -5058 1330 -4834 -13569 -74846 -93202 -86133 -34470 -19094 -33509 -48513 -51793 -46012
14745 -46012 -35308 -22812 -15090 -32496 -16297 -9512 -7511 -22429 6143 -5831 -17237 -39701
14733 -39701 -39875 -26624 -21246 -23071 -24455 -19879 -14793 -14945 -27223 -14666 -17859 -17203 -450 -3951
14719 -3951 -35491 -44097 -73618 -67245 -44776 -22232 -14497 -30080 -22849 -1094 15980 18747 30338
14706 30338 20517 5185 18741 20019 10263 -368 -19983 -52117 -62617 -24124 -14013 -38255
14694 -38255 -40147 -30230 -5734 8001 18586 26443 13037 -9785 -7669 -35870 -72702 -66437 -67103
14681 -67103 -64150 -47745 -12478 24510 33322 70708 95486 63252 32935 30395 47201 31248
$$ packed form
14772h298j1055Q34q144j2603J7402N216m657K936J0624N453j3198N721Q018k2270
14758b4021J8963O388o164q735o1277j8356P069N1663J5376j4415j5004l280N781
14745d6012J0704J2496P722j7406J6199O785K001j4918K8572j1974j1406k2464
14733c9701j74J3251N378j825j384M576N086j52j2278J2557l193O56J6753l501
14719c951l1540q606k9521O373K2469K2544P735j5583P231K1755J7074K767J1591
14706C0338r821j5332J3556J278r756j0631j9615l2134j0500L8493J0111k4242
14694c8255j892R917K4496J3735J0585P857j3406k2822K116k8201l6832O265o66
14681f7103K953J6405L5267L6988Q812L7386K4778l2234l0317k540J6806j5953
$$ plain form
14669 31248 23086 10067 18001 3383 -36592 -39199 -19695 -50749 -49945 -34201 -38011 21445 56376
14656 56376 51268 498 -42427 -54844 -22718 -7812 -7992 1317 30644 14322 -31205 -44609
14644 -44609 -14684 -27854 -24701 38801 79846 78912 40823 -8534 -15329 58664 69250 38277
14632 38277 -918 -27513 22342 51448 18289 -54123 -49959 -73788 -101672 -109467 -87804 -51494
14620 -51494 -51685 -51423 -35843 -26330 -56056 -80624 -109131 -109787 -59755 -25515 -38450 -31630 -10385
14607 -10385 2189 52472 51017 17238 8593 -25615 -50837 -31171 -23578 -37999 -16450 13141
14595 13141 41728 20020 9793 -17136 -48217 -63699 -80110 -45895 -25151 -41189 -7901 -16472
14583 -16472 -11318 29028 70348 90317 78740 9684 -47871 -50818 -56130 -7087 23151 12741
$$ packed form
14669C1248q162j3019P934j4618l9975k607J9504l1054Q04J5744l810N9456L4931
14656E6376n108n0770m2925j2417L2126J4906j80R309K9327j6322m5527j3404
14644d4609K9925j3170L153O3502M1045r34l8089m9357o795P3993J0586l0973
14632C8277l9195k6595M9855K9106l3159p2412M164k3829k7884p795K1663L6310
14620e1494j91K62J5580R513k9726k4568k8507o56N0032L4240j2935O820K1245
14607a0385J2574N0283j455l3779q645l4208k5222J9666P593j4421K1549K9591
14595A3141K8587k1708j0227k6929l1081j5482j6411L4215K0744j6038L3288q571
14583a6472N154M0346M1320J9969j1577o9056n7555k947n312M9043L0238j0410
$$ plain form
14571 12741 7149 -28292 -42868 16672 46522 79208 73821 70965 61236 25419 28939 48167 58030
14558 58030 42908 4360 -26775 -24315 -33107 -11321 -14375 23496 59460 38781 32735 21181
14546 21181 24748 -2982 36299 78610 68645 45260 35983 -17892 -32222 -39150 -34719 -31030 -74233
14533 -74233 -83379 -41517 -15146 -10776 -29782 -14734 -19951 11934 17052 20881 2711 -43263 -53570
14520 -53570 -13964 -9981 -15498 -39342 -10209 -9142 -42558 -32375 -6917 27697 76128 76469 65939
14507 65939 73913 65007 80934 48523 34099 25758 15349 8897 13071 -26550 -48081 -34697 -49275
14494 -49275 -66082 -34362 -2833 20014 9082 -3310 -10052 -6869 10648 37734 52178 30532
14482 30532 15313 -2181 9296 14428 13981 12577 2018 3755 13775 -11801 -30229 -18284 20518
$$ packed form
14571A2741n592l5441j4576N9540K9850L2686n387k856r729l5817L520J9228R863
14558E8030j5122l8548l1135K460q792K1786l054L7871L5964k0679o046j1554
14546B1181L567k7730L9281M2311r965k3385r277n3875j4330o928M431L689m3203
14533g4233r146M1862K6371M370j9006J5048n217L1885N118L829j8170m5974j0307
14520e3570L9606L983n517k3844K9133J067l3416J0183K5458L4614M8431L41j0530
14507F5939P974q906J5927l2411j4424q341j0409o452M174l9621k1531J3384j4578
14494d9275j6807L1720L1529K2847j0932j2392o742L183J7517K7086J4444k1646
14482C0532j5219j7494J1477N132m47j404j0559J737J0020k5576j8428J1945L8802
$$ plain form
14469 20518 -9052 -40433 -66851 -52803 -71548 -73435 -8571 12332 -3408 -15274 -25545 -27409
14457 -27409 -54649 -63316 -35070 -10576 -20342 -40648 -14086 25497 16611 -9684 -24486 -41419
14445 -41419 -23848 25206 43154 22227 -25871 -7894 29478 4139 -13821 -32140 -41518 -35213
14433 -35213 -32349 -29156 -16392 8743 18169 -3037 -35887 -44609 -25835 465 24587 33410 37965
14420 37965 -3991 -7802 -10917 -21609 -14616 -3155 24697 24863 -2262 -13132 -18699 -46839 -50009
14407 -50009 990 58910 52020 34252 16883 1857 7030 -24679 -36780 -32014 -47264 -19954
14395 -19954 -11919 -2340 -16405 -5671 18286 16796 10414 32656 46205 46095 23697 3666 816
14382 816 -31810 -41153 -85303 -58608 -8474 -26048 -34839 -80179 -65050 -32358 2828 49016
$$ packed form
14469B0518k9570l1381k6418J4048j8745j887O4864K0903j5740j1866j0271j864
14457b7409k7240q667K8246K4494r766k0306K6562L9583q886k6295j4802j6933
14445d1419J7571M9054J7948k0927m8098J7977L7372k5339j7960j8319r378O305
14433c5213K864L193J2764K5135R426k1206l2850q722J8774K6300K4122Q823M555
14420C7965m1956l811l115j0692O993J1461K7852J66k7125j0870n567k8140l170
14407e0009N0999N7920o890j7768j7369j5026N173l1709j2101M766j5250K7310
14395a9954Q035R579j4065J0734K3957j490o382K2242J3549j10k2398k0031k850
14382H16l2626r343m4150K6695N0134j7574q791m5340J5129L2692L5186M6188
$$ plain form
14370 49016 81750 70631 11578 1780 5166 -15435 -36966 -35602 -28406 -16381 1913 17379
14358 17379 28065 14652 -26418 -33064 -21901 -28978 -22259 -26767 -21412 -29067 -50551 -37685 -52707
14345 -52707 -22675 1755 -46399 -52723 -51753 -39222 -60132 -55005 -25789 -7324 6870 54240
14333 54240 60892 58165 60897 35907 -2103 -23824 -36348 -25348 -8701 35789 42618 48889 48675
14320 48675 16844 40358 81123 56666 28857 5244 -4586 -19461 10228 6485 -12481 -46655
14308 -46655 -43857 -40526 -15127 21434 13123 -4512 13997 -13947 -22658 8278 -12614 -15283 -43041
14295 -43041 -31194 -354 22649 33029 32190 24100 -24997 -49583 -47969 -6362 -6505 -18170 12453
14282 12453 32337 22695 16879 -15558 6331 33625 62233 59602 60338 47782 27304 29484 8793
$$ packed form
14370D9016L2734j1119n9053r798L386k0601k1531J364P196J2025J8294J5466
14358A7379J0686j3413m1070o646J1163p077O719m508N355p655k1484J2866j5022
14345e2707L0032K4430m8154o324R70J2531k0910N127K9216J8465J4194M7370
14333E4240O652k727K732k4990l8010k1721j2524J1000J6647M4490O829O271k14
14320D8675l1831K3514M0765k4457k7809k3613r830j4875K9689l743j8966l4174
14308d6655K798L331K5399L6561q311j7635J8509k7944q711L0936k0892k669k7758
14295d3041J1847L0840K3003J0380q39q090m9097k4586J614M1607j43j1665L0623
14282A2453J9884r642n816l2437K1889K7294K8608k631P36j2556k0478K180k0691
$$ plain form
14269 8793 -25588 -31609 -39205 -14839 1236 22001 10855 -12155 -34361 -30781 10298 23475
14257 23475 21914 16860 -20900 -25647 -39225 -25961 -18461 8890 -27858 -50832 -64632 -51015
14245 -51015 -21644 25439 40254 -14165 -26473 -10463 6004 9252 713 31468 51928 17056
14233 17056 518 -50847 -41386 -20168 -27606 8727 3446 -23384 -25444 8735 -2999 -28431
14221 -28431 -15051 7071 19747 19684 15 -5822 -14923 16670 56395 69119 11110 -15048 17222
14208 17222 30720 30694 20631 39595 53212 10963 -5229 -35767 -9585 -16344 -28133 -25605 -37005
14195 -37005 -27898 9618 13846 19842 22808 -23583 -38100 -32567 -43920 -39229 -19327 -17185 -14761
14182 -14761 -6954 -30390 -8669 15462 19584 14157 10329 24168 12548 -12941 -48668 -78640
$$ packed form
14269H793l4381o021p596K4366J6075K0765j1146k3010k2206L580M1079J3177
14257B3475j561n054l7760m747j3578J3264P500K7351l6748k2974j3800J3617
14245e1015K9371M7083J4815n4419j2308J6010J6467L248q539L0755K0460l4872
14233A7056j6538n1365R461K1218p438L6333n281k6830k060L4179j1734k5432
14221b8431J3380K2122J2676o3j9669n837r101L1593L9725J2724n8009k6158L2270
14208A7222J3498k6j0063J8964J3617m2249j6192l0538K6182o759j1789K528j1400
14195c7005R107L7516M228N996K966m6391j4517N533j1353M691J9902K142K424
14182a4761P807k3436K1721K4131M122n427l828J3839j1620k5489l5727k9972
$$ plain form
14170 -78640 -34870 16829 -11481 -35230 -45009 -74272 -62528 -12312 -18220 -39790 -59579 -49952
14158 -49952 -20168 -2667 -6802 -18639 -47226 -52607 -39196 -39270 -46321 -49560 -21098 -22459 -32780
14145 -32780 -43308 -31930 27380 43118 32304 10761 6077 -24708 -41719 -11949 -14690 -28760
14133 -28760 -11521 40055 42467 62064 47603 51307 43556 33934 47017 66487 46339 25440
14121 25440 43628 31292 4386 43 -10229 -26493 21257 14377 28841 -5996 -14834 33090
14109 33090 36810 5378 -1722 8454 27578 22008 -15258 11040 24920 39725 25467 19251
14097 19251 8571 -3299 14416 22785 55989 57225 13848 18096 -19974 -35722 -21095 -18659
14085 -18659 -43644 -52656 -65302 -54512 -52011 -46910 -9050 25329 31766 5192 -31504 -43437
$$ packed form
14170g8640M3770N1699k8310k3749r779k9263J1744N0216n908k1570j9789R627
14158d9952K9784J7501m135j1837k8587n381J3411p4p051l239K8462j361j0321
14145c2780j0528J1378N9310J5738j0814k1543m684l0785j7011K9770k741j4070
14133b8760J7239N1576K412J9597j4461L704p751r622J3083J9470k0148k0899
14121B5440J8188j2336k6906m343j0272j6264M7750o880J4464l4837q838M7924
14109C3090L720l1432p100J0176J9124n570l7266K6298J3880J4805j4258o216
14097A9251j0680j1870J7715Q369L3204J236m3377M248l8070j5748J4627K436
14085a8659k4985r012j2646J0790K501N101L7860L4379O437k6574l6696j1933
$$ plain form
14073 -43437 -24147 -22266 -9622 -19230 -2029 7647 42304 70934 11237 -16015 -4003 38090
14061 38090 50103 35176 21157 5046 9008 25341 28499 49950 6681 -2391 2004 13624
14049 13624 34969 19538 -18449 -15977 -10188 -29621 -22471 12139 56913 54647 29223 32565 18826
14036 18826 25852 25866 9412 1040 176 12789 32204 44976 64933 19708 -20129 -22607 15667
14023 15667 29217 38973 560 -42672 -23653 -4512 6568 12734 5539 -18025 20048 35644
14011 35644 57488 50821 7986 11134 11732 28850 62218 59647 52001 15069 -41456 -9825 25573
13998 25573 22372 33361 -3226 -20269 6385 11364 -3693 -4869 6005 28993 46560 52992
13986 52992 24754 20657 15164 11114 -36448 -55792 -3567 40093 36192 -15759 -15838 -15763 -16435 21345
$$ packed form
14073d3437J9290J881J2644r608J7201R676L4657K8630n9697k7252J2012M2093
14061C8090J2013j4927j4019j6111L962J6333L158K1451m3269r072M395J1620
14049A3624K1345j5431l7987K472N789j9433P150L4610M4774k266k5424L342j3739
14036A8826P026J4j6454q372q64J2613J9415J2772J9957m5225l9837k478L8274
14023A5667J3550R756l8413m3232J9019J9141J1080O166p195k3564L8073J5596
14011C5644K1844o667m2835L148N98J7118L3368k571p646l6932n6525L1631L5398
13998B5573l201J0989l6587j7043K6654M979j5057j176J0874K2988J7567O432
13986E2992k8238m097n493m050m7562j9344N2225M3660l901n1951p9P5o72L7780
$$ plain form
13972 21345 26726 24267 2194 -27546 -20096 -1683 8555 22180 4342 -34890 -60611 -70675
13960 -70675 -37428 -10792 13860 19795 -9441 -13476 -35063 -50357 -36520 -12430 8739 40013
13948 40013 2998 -38457 -32110 -15199 281 18026 3049 27528 66545 64392 52900 27891
13936 27891 15648 34063 23363 7075 10489 23781 20502 39173 33164 24337 39273 34350 31011
13923 31011 32235 56415 44299 4596 -11809 -13910 -53751 -53286 -50209 -35737 227 40885 -14945
13910 -14945 -46385 12090 43772 34137 70125 62641 71227 63665 30238 -19806 -40849 -26549
13898 -26549 15471 48766 44998 14997 13622 -3300 -9208 9149 28933 48463 61755 38875
13886 38875 43698 20191 17654 22908 16889 -12347 -35532 -65480 -30108 -16780 -27070 -21943 -14261
$$ packed form
13972B1345N381k459k2073k9740P450J8413J0238J3625j7838l9232k5721j0064
13960g0675L3247K6636K4652N935k9236m035k1587j5294J3837K4090K1169L1274
13948D0013l7015m1455O347J6911J5480J7745j4977K4479L9017k153j1492k5009
13936B7891j2243J8415j0700j6288L414J3292l279J8671o009q827J4936m923l339
13923C1011J224K4180j2116l9703j6405k101l9841M65L077J4472L5964M0658n5830
13910a4945l1440N8475L1682r635L5988p484Q586p562l3427n0044k1043J4300
13898b6549M2020L3295l768l0001j375j6922n908J8357J9784J9530J3292k2880
13886C8875M823k3507k537N254o019k9236k3185k9948L5372J3328j0290N127P682
$$ plain form
13873 -14261 4158 16457 19602 30007 10532 54926 62976 51184 44505 38306 46430 32162 30784
13860 30784 17438 34851 15399 7928 23894 20606 17013 20272 6848 9989 10464 22715 -4532
13847 -4532 -50707 -22548 -22224 -40006 -50461 -10573 -9161 6672 25554 18770 59430 92330 92886
13834 92886 102786 104657 109016 97495 68552 77846 126085 127150 86697 19350 62786 62844 27858
13821 27858 16772 1016 29152 33711 13911 23363 39753 49868 11157 -18729 -32041 -2902
13809 -2902 21618 6032 -27604 -13318 7365 29494 31530 38804 29142 33561 42973 55889 52848
13796 52848 90063 82061 52928 65229 45674 54572 58241 77554 60665 8053 17872 -1497
13784 -1497 -4473 -19454 -22287 2166 7376 15207 71181 43056 42553 68809 62179 49617 27552
$$ packed form
13873a4261J8419J2299L145J0405j9475M4394Q050j1792o679o199Q124j4268j378
13860C0784j3346J7413j9452p471J5966l288l593L259j3424L141M75J2251k7247
13847d532m6175K8159L24j7782j0455L9888J412J5833J8882o784M0660L2900N56
13834I2886R900J871M359j1521k8943R294M8239J065m0453o7347M3436N8l4986
13821B7858j1086j5756K8136M559j9800R452J6390J0115l8711k9886j3312K9139
13809b902K4520j5586l3636J4286K0683K2129K036P274r662M419R412J2916l041
13796E2848L7215q002k9133J2301j9555Q898L669J9313j6889n2612R819j9369
13784a497k976j4981k833K4453N210P831N5974k8125n03K6256o630j2562k2065
$$ plain form
13771 27552 -7361 -48250 -32528 -4316 21499 13280 -2115 -30899 -41670 -29962 15701 38025
13759 38025 15410 -12532 -2185 35510 27296 52420 62540 91735 156558 193530 217845 301297
13747 301297 401101 531973 763329 1114097 1354615 1185607 846754 558297 396222 297375
13737 297375 192037 154831 125159 137075 144357 99499 52932 95572 85636 99052 126629 154737
13725 154737 133213 108681 96424 98084 118765 114280 81693 55725 56807 95305 67126 64812
13713 64812 83247 64896 32695 39014 29879 28472 34596 25676 15577 1307 4907 10249 3788
13700 3788 17972 62035 106443 89537 44014 47295 46883 5705 326 39628 54058 32902 27659
13687 27659 14695 14381 -18068 -30602 -16312 755 -2503 -37340 -69107 -68537 -44241 -32710 5799
$$ packed form
13771B7552l4913m0889J5722K8212K5815q219j5395k8784j0771J1708M5663K2324
13759C8025k2615k7942J0347L7695q214K5124J0120K9195O4823L6972K4315Q3452
13747C01297R9804J30872K31356L50768K40518j69008l38853k88457j62075r8847
13737B97375j05338l7206k9672J1916P282m4858m6567M2640r936J3416K7577K8108
13725A54737k1524k4532j2257J660K0681m485l2587k5968J082L8498k8179k314
13713F4812J8435j8351l2201O319r135j407O124q920j0099j4270L600N342o461
13700C788J4184M4063M4408j6906m5523L281m12m1178n379L9302J4430k1156n243
13687B7659j2964l14l2449j2534J4290J7067l258l4837l1767N70K4296J1531L8509
$$ plain form
13674 5799 8143 22393 74570 73874 55288 50859 40960 63123 83430 74838 87222 62453 47789
13661 47789 52268 21880 -34281 -52319 -51219 -14351 4170 15790 30221 59401 49565 37636
13649 37636 26278 11830 40339 69152 67028 45479 54248 67917 85265 64721 55988 89889
13637 89889 95183 109385 79976 33379 16269 36177 41316 70332 56470 53580 57441 59373 48395
13624 48395 54789 55304 39553 40267 49880 65520 53091 38268 11935 14216 28606 34364 22117
13611 22117 10618 19909 -9842 -25843 9612 17126 -16114 10751 27353 54982 42591 32736
13599 32736 7888 -3037 -40501 -17215 30153 49837 55881 64483 55638 33461 15802 -6967
13587 -6967 -1691 45008 91693 107935 65657 37872 51005 79288 82024 55763 40899 16444
$$ packed form
13674E799K344J4250N2177o96j8586m429r899K2163K0307q592J2384k4769j4664
13661D7789M479l0388n6161j8038J100L6868J8521J1620J4431K9180r836j1929
13649C7636j1358j4448K8509K8813k124k1549Q769J3669J7348k0544q733L3901
13637H9889N294J4202k9409m6597j7110J9908N139K9016j3862k890L861J932j0978
13624D8395O394N15j5751P14R613J5640j2429j4823k6333K281J4390N758j2247
13611B2117j1499R291k9751j6001L5455P514l3240K6865J6602K7629j2391r855
13599C2736k4848j0925l7464K3286M7368J9684O044Q602q845k2177j7659k2769
13587f967N276M6699M6685J6242m2278k7785J3133K8283K736k6261j4864k4455
$$ plain form
13575 16444 27548 32726 21847 28781 30368 15606 -9905 -31454 -41125 8521 50921 66414
13563 66414 40599 -517 8837 44423 66391 69050 39707 17090 36505 39249 41179 52161
13551 52161 9133 -23559 -30043 -1811 16550 29326 40582 67949 63782 36551 -15491 -41130
13539 -41130 -21407 -27637 2467 13720 -6832 -15834 19726 26421 584 -20597 -51828 -19848
13527 -19848 7119 28095 6175 34566 62013 32811 -5905 -2157 14367 -5782 -1417 -25888
13515 -25888 -46942 -36930 -6387 27096 42757 17135 -16355 -19821 -36665 -39229 -1947 -2271
13503 -2271 -20508 -9637 4246 -7035 -40172 -18319 29267 26224 -14976 -20810 -28119 -25306 -33635
13490 -33635 -21412 -6273 5577 37188 38055 29525 18678 13505 -12587 -3641 15877 23423 10544
$$ packed form
13575A6444J1104N178j0879O934J587j4762k5511k1549r671M9646M2400J5493
13563F6414k5815m1116R354L5586K1968K659k9343k2617J9415K744J930J0982
13551E2161m3028l2692o484K8232J8361J2776J1256K7367m167k7231n2042k5639
13539d1130J9723o230L0104J1253k0552r002L5560O695k5837k1181l1231L1980
13527a9848K6967K0976k1920K8391K7447k9202l8716L748J6524k0149M365k4471
13515b5888k1054J0012L0543L3483J5661k5622l3490l466j6844k564L7282l24
13503b271j8237J0871J3883j1281l3137K1853M7586l043m1200n834p309K813q329
13490c3635J2223J5139J1850L1611Q67q530j0847n173k6092Q946J9518P546j2879
$$ plain form
13477 10544 28809 39608 3301 5268 4273 -25680 -22053 -11236 -16614 -13584 -2859 -7445 -10717
13464 -10717 -32394 -64092 -50749 -20121 -3424 4191 1345 -1643 -16912 -5666 51130 48381
13452 48381 -27029 -11330 47165 54196 43418 -471 -8021 12888 35108 38612 58597 53833
13440 53833 17024 -5085 -5987 -4599 7381 9542 20524 4670 -12307 3063 13839 -15294
13428 -15294 -16260 -14671 -31738 -48430 -41457 -22421 -6859 13413 17892 -21561 -34849 -5235 17227
13415 17227 18229 7354 49672 68842 48391 42030 45683 15937 24001 48515 77901 82988 62516
13402 62516 49901 38196 34915 19078 1513 21259 11961 -3892 11202 26906 27732 -10433
13390 -10433 -36013 -59606 -60054 -10378 13057 -2188 -43709 -48120 -116 -11927 49 18801
$$ packed form
13477A0544J8265J0799l6307J967r95k9953L627J0817n378L030J0725m586l272
13464a0717k1677l1698J3343L0628J6697P615k846k988j5269J1246N6796k749
13452D8381p5410J5699N8495P031j0778m3889p550K0909K2220L504J9985m764
13440E3833l6809k2109r02J388J1980K161J0982j5854j6977J5370J0776k9133
13428a5294r66J589j7067j6692O973J9036J5562K0272M479l9453j3288K9614K2462
13415A7227J002j0875M2318J9170k0451o361L653k9746Q064K4514K9386N087k0472
13402F2516j2615j1705l281j5837j7565J9746r298j5853J5094J5704Q26l8165
13390a0433k5580k3593m48M9676K3435j5245m1521m411M8004j1811J1976J8752
$$ plain form
13378 18801 1920 -19280 -5169 -24231 -49060 -41786 -35677 3821 29625 26110 33328 10844
13366 10844 -5419 33375 37277 42507 41523 38998 67396 57127 37027 52854 28835 7394 -2312
13353 -2312 -39945 -51025 -12392 10903 -12946 14580 34142 27238 21691 2037 -3688 13320
13341 13320 -445 -1934 509 4867 -31518 -47159 -23974 14651 51126 50960 39738 72098 66416
13328 66416 11463 -12855 -32132 -60204 -58745 -17075 -10342 -21838 -11888 5826 -19952 -451
13316 -451 19319 -22989 -17780 36060 80324 81647 54830 51781 61106 43681 7191 4892 31683
13303 31683 41783 20340 -2859 -18298 -53143 -22167 -17710 -12475 15808 21249 -6290 -17959
13291 -17959 -11005 -4109 11046 18669 45425 58700 66300 25700 11440 41266 62678 47618
$$ packed form
13378A8801j6881k1200J4111j9062k4829P274O109L9498K5804l515P218k2484
13366A0844j6263L8794L902N230r84k525K8398j0269k0100J5827k4019k1441r706
13353b312l7633j1080L8633K3295k3849K7526J9562o904n547j9654n725J7008
13341A3320j3765j489K443M358l6385j5641K3185L8625L6475j66j1222L2360n682
13328F6416n4953k4318j9277k8072J459M1670O733j1496R950J7714k5778J9501
13316d51J9770m2308N209N3840M4264J323k6817l049R325j7425l6490k299K6791
13303C1683J0100k1443k3199j5439l4845L0976M457N235K8283N441k7539j1669
13291a7959O954O896J5155P623K6756J3275P600m0600j4260K9826K1412j5060
$$ plain form
13279 47618 2301 -5259 1371 -12820 280 33183 -9245 -62294 -32649 33365 20568 20526 21613
13266 21613 44489 41100 15556 7444 16029 -311 -4224 3065 -1035 20368 21484 29351 12105
13253 12105 -14022 767 14327 -342 -451 21237 -9186 -23827 -29060 -11350 -6406 -5389 1614
13240 1614 -19864 -7706 -6609 -41391 -42087 -34868 9550 15141 25638 12541 3053 -9717 -24474
13227 -24474 -27317 -20980 -24417 -12476 8042 51082 92082 86036 46989 29688 52619 29226
13215 29226 9586 3863 6125 -17823 -1493 14011 8157 11326 40536 47675 35055 19563 15528
13202 15528 -2046 13240 43914 52140 32142 59995 37081 -13619 14717 46556 17501 -3088
13190 -3088 20613 26232 12315 7238 12828 15845 19054 24818 874 -24352 -23501 -13056 -30332
$$ packed form
13279D7618m5317p560O630j4191J3100L2903m2428n3049K9645O6014j2797m2J087
13266B1613K2876l389k5544q112Q585j6340l913P289m100K1403J116P867j7246
13253A2105k6127J4789J3560j4669j09K1688l0423j4641n233J7710M944J017P003
13240A614k1478J2158J097l4782o96P219M4418N591J0497j3097r488j2770j4757
13227b4474k843O337l437J1941K0518M3040M1000o046l9047j7301K2931k3393
13215B9226j9640n723K262k3948J6330J5504n854L169K9210P139j2620j5492m035
13202A5528j7574J5286L0674Q226j9998K7853k2914n0700K8336L1839k9055k0589
13190c088K3701N619j3917n077N590L017L209N764k3944k5226Q51J0445j7276
$$ plain form
13177 -30332 -34979 -24579 -49137 -55639 -31257 -14710 -39265 -27488 24025 69186 75940 40144
13165 40144 32266 48217 27332 -20921 -8394 17002 -22249 -34628 -44937 -63061 -38466 -47269
13153 -47269 -35969 15128 -7414 -68526 -81892 -75961 -79136 -59786 -65239 -21135 -18491 -63120
13141 -63120 -58583 -24055 -16540 -56965 -36470 -19370 -16692 -4204 3247 -15688 -66466 -59978 -24127
13128 -24127 -34762 -43456 -11715 19595 44308 53246 64123 42569 38931 24048 1007 3099
13116 3099 -3911 -14817 -9307 -15070 -3430 -2763 501 8631 25382 17307 26900 47394 11418 4606
13102 4606 -19498 -92148 -80288 -36583 -14762 14004 33083 49908 31366 12496 -13466 -33063
13090 -33063 -48359 -78947 -65255 -29143 -36451 -31733 -2534 16764 893 -33183 -36043 -28978
$$ packed form
13177c0332m647J0400k4558o502K4382J6547k4555J1777N1513M5161O754l5796
13165D0144p878J5951k0885m8253J2527K5396l9251j2379j0309j8124K4595q803
13153d7269J1300N1097k2542o1112j3366N931l175J9350n453M4104K644m4629
13141f3120M537L4528P515m0425K0495J7100K678J2488P451j8935n0778O488L5851
13128b4127j0635q694L1741L1310K4713Q938J0877k1554l638j4883k3041K092
13116C099p010j0906N510n763J1640O67L264Q130J6751q075R593K0494l5976o812
13102D606k4104p2650J1860M3705K1821K8766J9079J6825j8542j8870k5962j9597
13090c3063j5296l0588J3692L6112p308M718K9199J9298j5871l4076k860P065
$$ plain form
13078 -28978 24872 63824 45267 33429 33446 15610 6428 9986 -11638 -17470 -14337 -11746 3330
13065 3330 55821 67447 19137 13153 38712 36492 10386 20013 46837 19960 13870 32198 22668
13052 22668 33122 5426 -16252 -30022 -35051 -49162 -29188 -52087 -39591 -21136 -11778 -20748
13040 -20748 -10205 -12018 -9000 21293 13060 -20435 -35172 -31886 -9573 5875 -5357 -5581 4934
13027 4934 12967 -32772 -58058 -39373 -25547 7687 44335 39958 -3262 32343 58962 64373
13015 64373 30827 -11073 -37361 -44184 -51977 -41310 -5710 1722 2935 11262 32691 14910 -13866
13002 -13866 -35483 -27720 -32748 -44811 -52418 -35681 -2886 -25300 -48666 -42458 -15372 3174
12990 3174 -1727 -16223 -22210 28383 43550 -7362 -6232 20491 34032 11170 8735 -13906 -22985
$$ packed form
13078b8978N3850L8952j8557j1838J7j7836r182L558k1624n832L133K591J5076
13065C330N2491J1626m8310n984K5559k220k6106R627K6824k6877o090J8328r530
13052B2668J0454k7696k1678j3770n029j4111J9974k2899J2496J8455R358q970
13040b0748J0543j813L018L0293q233l3495j4737L286K2313J5448j1232k24J0515
13027D934Q033m5739k5286J8685J3826L3234L6648m377m3220L5605K6619N411
13015F4373l3546m1900k6288o823p793J0667L5600P432J213Q327K1429j7781k8776
13002a3866k1617P763n028j2063p607J6737L2795k2414k3366O208K7086J8546
12990C174m901j4496n987N0593J5167n0912J130K6723J3541k2862k435k2641r079
$$ plain form
12977 -22985 -5880 -2147 -28347 1850 24581 8721 3985 2077 -5394 -14311 -13060 -11045 -29583
12964 -29583 -37668 -27332 -15085 26356 42719 22609 -13225 -39989 -32187 1658 32163 31210
12952 31210 32006 35255 31269 17930 15684 11290 -22877 -18682 -2691 -18269 -40886 -9911 -3742
12939 -3742 -18970 -30336 -54444 -45514 24596 15976 17316 41768 24568 -1010 -28956 -21599 -40043
12926 -40043 -36066 -24224 23985 5443 -6609 -25187 -37113 -65209 -65384 -26264 5800 17104
12914 17104 26998 6841 -4658 -43585 -85791 -107475 -109729 -121574 -91187 -78204 -45704 -33704
12902 -33704 -50949 -26508 -43140 -50923 -61099 -104230 -112818 -79730 -78574 -71910 -65014 -49726 -15987
12889 -15987 -12876 -37834 -1768 30945 -6336 -21387 -8657 -2243 22186 26106 18482 7856
$$ packed form
12977b2985J7105L733k6200L0197K2731j5860m736j908p471q917J251K015j8538
12964b9583q085J0336J2247M1441J6363k0110l5834k6764P802L3845L0505r53
12952C1210P96L249l986j3339k246m394l4167M195J5991j5578k2617L0975O169
12939c742j5228j1366k4108Q930P0110q620J340K4452j7200k5578k7946P357j8444
12926d0043L977J1842M8209j8542j2052j8578j1926k8096j75L9120L2064J1304
12914A7104R894k0157j1499l8927m2206k1684k254j1845L0387J2983L2500J2000
12902c3704j7245K4441j6632p783j0176m3131q588L3088J156O664O896J5288L3739
12889a5987L111k4958L6066L2713l7281j5051J2730O414K4429L920p624j0626
$$ plain form
12877 7856 -115 692 -8624 -19296 -24559 -20995 -36631 13617 47166 45496 223 -23364 11774
12864 11774 37421 16817 -20672 -46139 -40215 4014 26159 26670 13162 30898 31094 33457 25022
12851 25022 4400 25088 14568 -10528 -4214 17812 49647 42071 -1252 -40332 -31441 2092
12839 2092 2110 6534 -23277 -28730 -9148 44876 71949 81811 52566 13322 6043 54456 43764
12826 43764 34255 42584 64169 48391 25000 42140 43575 23591 9189 226 -16149 -20853 -21267
12813 -21267 -42755 -24211 19875 18852 9204 14319 40158 47723 30288 12224 43887 16521
12801 16521 1022 -33510 -85132 -50168 7621 19762 -5063 -30565 -37022 -8334 -7169 -38265
$$ packed form
12877G856p971Q07r316j0672n263L564j5636N0248L3549j670m5273k3587L5138
12864A1774K5647k0604l7489k5467N924M4229K2145N11j3508J7736J96K363q435
12851B5022k0622K0688j0520k5096O314K2026L1835p576m3323l9080Q891L3533
12839B092J8M424k9811n453J9582N4024K7073R862k9245l9244p279M8413j0692
12826D3764r509Q329K1585j5778k3391J7140J435j9984j4402q963j6375m704m14
12813b1267k1488J8544M4086j023r648N115K5839P565j7435j8064L1663k7366
12801A6521j5499l4532n1622L4964N7789J2141k4825k5502o457K8688J165l1096
$$ [...]
##END NTUPLES=NMR SPECTRUM
##END=
