##TITLE=Analysis number 310500
Compound Code cc 25513
Chemist Name endeavour
##JCAMPDX= 6.0         $$ Bruker NMR JCAMP-DX V2.0
##DATA TYPE= NMR SPECTRUM
##DATA CLASS= NTUPLES
##ORIGIN= Bruker BioSpin GmbH
##OWNER= NMR
$$ XWIN-NMR		Version 3.5
$$ Mon Jun 20 14:02:57 2005 GMT Daylight Time (UT+1h)  MAYBRIDGE\NMR@NMR_250MHZ
##.OBSERVE FREQUENCY= 250.131544655141
##.OBSERVE NUCLEUS= ^1H
##.ACQUISITION MODE= SIMULTANEOUS (DQD)
##.ACQUISITION SCHEME= undefined
##.AVERAGES= 16
##.DIGITISER RES= 18
##SPECTROMETER/DATA SYSTEM= dpx250
##.PULSE SEQUENCE= zg30
##.SOLVENT NAME= CDCl3
##.SHIFT REFERENCE= (INTERNAL, CDCl3, 0, 16.522)
##AUDIT TRAIL= $$ (NUMBER, WHEN, WHO, WHERE, WHAT)
$$ ##TITLE= Audit trail, XWIN-NMR		Version 3.5
$$ ##JCAMPDX= 5.01
$$ ##ORIGIN= Bruker BioSpin GmbH
$$ ##OWNER= NMR
$$ C:\u/data/dgb/nmr/ADRS/4210/pdata/1/auditp.txt
$$ ##AUDIT TRAIL=  $$ (NUMBER, WHEN, WHO, WHERE, WHAT)
(   1,<2005-06-20 14:02:37.61 +100>,<MAYBRIDGE\NMR>,<NMR_250MHZ>,
      <created by zg, POWCHK disabled, PULCHK disabled
       configuration hash MD5:
       62 19 C7 07 E1 42 D1 B7 37 6C 3D D0 77 39 F9 E6
       data hash MD5: 64K
       D8 D4 AF 20 5A EF 68 D4 20 11 26 E1 B8 AC AB 62>)
(   2,<2005-06-20 14:02:48.75 +100>,<MAYBRIDGE\NMR>,<NMR_250MHZ>,
      <Start of raw data processing
       ef LB = 0.3 FT_mod = 6 PKNL = 1 SI = 32K 
       data hash MD5: 32K
       8E 93 85 F9 78 BD AE 16 E6 BC 2B 28 86 03 98 36>)
(   3,<2005-06-20 14:02:50.60 +100>,<MAYBRIDGE\NMR>,<NMR_250MHZ>,
      <apk 
       data hash MD5: 32K
       94 83 D7 79 C4 BC BA 5D 06 89 9C 36 33 A6 52 44>)
(   4,<2005-06-20 14:02:51.33 +100>,<MAYBRIDGE\NMR>,<NMR_250MHZ>,
      <abs ABSG = 5 
       data hash MD5: 32K
       A9 45 42 42 3B 0E 35 95 2A CA 7A 94 15 90 16 07>)
$$ ##END=
$$ 
$$ hash MD5
$$ 12 62 32 81 27 99 8F 54 49 A3 6E 21 BD 05 4B A7
##$RELAX= 
##$RELAX= 
##$RELAX= 
##$RELAX= 
##$RELAX= 
##$RELAX= 
##$RELAX= 
$$ Bruker specific parameters
$$ --------------------------
##$DU= <C:\u>
##$EXPNO= 4210
##$NAME= <ADRS>
##$PROCNO= 1
##$TYPE= <nmr>
##$USER= <dgb>
##$AMP= (0..31)
100 100 100 100 100 100 100 100 100 100 100 100 100 100 100 100 100 100 
100 100 100 100 100 100 100 100 100 100 100 100 100 100 
##$AQSEQ= 0
##$AQ_mod= 3
##$AUNM= <au_zg>
##$AUTOPOS= <13 >
##$BF1= 250.13
##$BF2= 250.13
##$BF3= 250.13
##$BF4= 250.13
##$BF5= 500.13
##$BF6= 500.13
##$BF7= 500.13
##$BF8= 500.13
##$BYTORDA= 1
##$CFDGTYP= 0
##$CFRGTYP= 5
##$CHEMSTR= <none>
##$CNST= (0..31)
1 1 145 1 1 1 1 1 1 1 1 1 1 1 1 1 1 1 1 1 1 1 1 1 1 1 1 1 1 1 1 1 
##$CPDPRG= <>
##$CPDPRG1= <>
##$CPDPRG2= <>
##$CPDPRG3= <>
##$CPDPRG4= <mlev>
##$CPDPRG5= <mlev>
##$CPDPRG6= <mlev>
##$CPDPRG7= <mlev>
##$CPDPRG8= <mlev>
##$CPDPRGB= <>
##$CPDPRGT= <>
##$D= (0..31)
0 1 0 0 0 0 0 0 0 0.06 0 0 0 0 0 0 0.0002 0 0 0 0 0 0 0 0 0 0 0 0 0 0 
0 
##$DATE= 1119272556
##$DBL= (0..7)
120 120 120 120 120 120 120 120 
##$DBP= (0..7)
150 150 150 150 150 150 150 150 
##$DBP07= 0
##$DBPNAM0= <>
##$DBPNAM1= <>
##$DBPNAM2= <>
##$DBPNAM3= <>
$$ [...]
##$SUBNAM7= <"">
##$SUBNAM8= <"">
##$SUBNAM9= <"">
##$SW= 20.6930455092707
##$SWIBOX= (0..15)
0 0 3 0 0 0 0 0 0 0 0 0 0 0 0 0 
##$SW_h= 5175.983436853
##$TD= 65536
##$TD0= 1
##$TE= 295.16
##$TE2= 300
##$TE3= 300
##$TEG= 300
##$TL= (0..7)
0 120 120 120 120 120 120 120 
##$TP= (0..7)
150 150 150 150 150 150 150 150 
##$TP07= 0
##$TPNAME0= <>
##$TPNAME1= <>
##$TPNAME2= <>
##$TPNAME3= <>
##$TPNAME4= <>
##$TPNAME5= <>
##$TPNAME6= <>
##$TPNAME7= <>
##$TPOAL= (0..7)
0.5 0.5 0.5 0.5 0.5 0.5 0.5 0.5 
##$TPOFFS= (0..7)
0 0 0 0 0 0 0 0 
##$TUNHIN= 0
##$TUNHOUT= 0
##$TUNXOUT= 0
##$USERA1= <user>
##$USERA2= <user>
##$USERA3= <user>
##$USERA4= <user>
##$USERA5= <user>
##$V9= 5
##$VALIST= <valist>
##$VCLIST= <CCCCCCCCCCCCCCC>
##$VD= 0
##$VDLIST= <DDDDDDDDDDDDDDD>
##$VPLIST= <PPPPPPPPPPPPPPP>
##$VTLIST= <TTTTTTTTTTTTTTT>
##$WBST= 1024
##$WBSW= 4
##$XGAIN= (0..3)
0 0 0 0 
##$XL= 0
##$YL= 0
##$YMAX_a= 496974
##$YMIN_a= -551702
##$ZGOPTNS= <>
##$ZL1= 120
##$ZL2= 120
##$ZL3= 120
##$ZL4= 120
##$ABSF1= 16.522
##$ABSF2= -4.171173
##$ABSG= 5
##$ABSL= 3
##$ALPHA= 0
##$AQORDER= 0
##$ASSFAC= 0
##$ASSFACI= 0
##$ASSFACX= 0
##$ASSWID= 0
##$AUNMP= <proc_1d>
##$AZFE= 0.1
##$AZFW= 0.1
##$BCFW= 0
##$BC_mod= 0
##$BYTORDP= 0
##$COROFFS= 0
##$CY= 12.5
##$DATMOD= 1
##$DC= 0
##$DFILT= <>
##$DTYPP= 0
##$F1P= 14.0000005364418
##$F2P= -0.99999901652339
##$FCOR= 0.5
##$FTSIZE= 32768
##$FT_mod= 6
##$GAMMA= 0
##$GB= 0
##$INTBC= 1
##$INTSCL= 1
##$ISEN= 128
##$LB= 0.3
##$LEV0= 0
##$LPBIN= 0
##$MAXI= 10000
##$MC2= 0
##$MEAN= 0
##$ME_mod= 0
##$MI= 0
##$NCOEF= 0
##$NC_proc= -2
##$NLEV= 6
##$NOISF1= 0
##$NOISF2= 0
##$NSP= 0
##$NTH_PI= 0
##$NZP= 0
##$OFFSET= 16.522
##$PC= 1
##$PHC0= -78.05843
##$PHC1= 5.14924
##$PH_mod= 1
##$PKNL= yes
##$PPARMOD= 0
##$PSCAL= 4
##$PSIGN= 0
##$REVERSE= no
##$SF= 250.13
##$SI= 32768
##$SIGF1= 0
##$SIGF2= 0
##$SINO= 400
##$SIOLD= 32768
##$SREGLST= <1H.CDCl3>
##$SSB= 0
##$STSI= 32768
##$STSR= 0
##$SW_p= 5175.98343685301
##$SYMM= 0
##$S_DEV= 0
##$TDeff= 65536
##$TDoff= 0
##$TI= <Analysis number 999999
Compound Code 99
Book Reference 9
Project Code 9>
##$TILT= no
##$TM1= 0
##$TM2= 0
##$TOPLEV= 0
##$USERP1= <user>
##$USERP2= <user>
##$USERP3= <user>
##$USERP4= <user>
##$USERP5= <user>
##$WDW= 1
##$XDIM= 32768
##$YMAX_p= 311281911
##$YMIN_p= -29853
$$ End of Bruker specific parameters
$$ ---------------------------------
##NTUPLES= NMR SPECTRUM
##VAR_NAME=  FREQUENCY,     SPECTRUM/REAL,   SPECTRUM/IMAG
##SYMBOL=    X,             R,               I
##VAR_TYPE=  INDEPENDENT,   DEPENDENT,       DEPENDENT
##VAR_FORM=  AFFN,          ASDF,            ASDF
##VAR_DIM=   32768,         32768,           32768
##UNITS=     HZ,            ARBITRARY UNITS, ARBITRARY UNITS
##FACTOR=    0.157963299565203, 1,           1
##FIRST=     4132.6476996994, 0,             0
##LAST=      -1043.33573715361, 0,           0
##MIN=       -1043.33573715361, -29853,      0
##MAX=       4132.6476996994, 311281911,     0
$$ Real data points
##PAGE= N=1
##DATA TABLE= (X++(R..R)), XYDATA
$$ [...]
25191e768K528o03J534N829j509k753k204k267p3N85K214M168J0023j014j011
$$ -5768 -3240 -3843 -2309 3520 2011 -742 -2946 -5213 -5286 -4701 -2487 1681 11704 10690 9679
25176I679m676m726q402L76M754j418k902L151N008l109j355l529L33L9L202L950
$$ 9679 5003 277 -8125 -7749 -2995 -4413 -7315 -4164 844 -2265 -3620 -7149 -6816 -6777 -3575 375
25160C75m60k444L091j616j720J095k243l337K466L914j292J86Q526O463n786
$$ 375 -85 -2529 562 -1054 -2774 -1679 -3922 -7259 -4793 -879 -2171 -1985 6541 13004 7218
25145G218k642K361M886L570k840j2443K203l113k386n96k993O675j032l966R15
$$ 7218 4576 6937 11823 15393 12553 110 2313 -800 -3186 -3782 -6775 -100 -1132 -5098 -4183
25130d183O210Q75M423N068n283n631j018N477o116k724j006M46q463j469O061
$$ -4183 2027 2902 7325 12393 7110 1479 461 5938 -178 -2902 -3908 -3462 -11925 -13394 -7333
25115g333J530j123L308N1L661L593j22O434L027Q19P46O51p413j2522j986M259
$$ -7333 -5803 -6926 -3618 -3567 94 3687 3565 9999 13026 13845 14591 15242 7829 -4693 -6679 -2420
25099b420Q54k89o15K391L03j313n40k866j27J492m31K898k526j123l838k260
$$ -2420 -1566 -1855 -2470 -79 224 -1089 -1629 -4495 -4622 -3130 -3561 -663 -3189 -4312 -8150 -10410
25083a0410M42Q86K920N948O052k722n086m670L353q95J247P253m739l656M300
$$ -10410 -9968 -9082 -6162 -214 5838 3116 -1970 -6640 -3287 -4182 -2935 4318 -421 -4077 223
25068B23k200K140N637n04n247K254K222k486k012o37J743l112p094l241J0240
$$ 223 -1977 163 5800 5296 49 2303 4525 2039 27 -610 1133 -1979 -9073 -12314 -2074
25053b074R199L885o694m715O683m41j443k199p16m553p888j938O930N539o35
$$ -2074 7125 11010 4316 -399 6284 5843 4400 2201 1485 -3068 -10956 -12894 -5964 -425 -1060
25038a060J827L786K882j660K714L803m966q109J571N302r15j398N50r238M46
$$ -1060 767 4553 7435 5775 8489 12292 7326 -783 788 6090 5175 3777 4327 -4911 -4465
25023d465J027M112R168m09n152j0278J539q42k84O026Q749L872k820p726L66
$$ -4465 -3438 674 9842 9433 4281 -5997 -4458 -5300 -5584 442 9191 13063 10243 2517 2883
25008B883J541O411m85l446n47n360r22L459k378r345n221O476N075K502J487
$$ 2883 4424 10835 10350 6904 6357 997 75 3534 1156 -8189 -13410 -6934 -1859 643 2130
24993B130j441l700M64J1855L857m575n522o049L505P604N004M83m254o633o791
$$ 2130 689 -3011 -2547 9308 13165 8590 3068 -2981 524 8128 13132 13615 9361 2728 -4063
24978d063j623O715P08O653P075J106m180K63R27q019n664J62p34j84m975p083
$$ -4063 -5686 1029 1737 8390 15465 16571 12391 12654 13581 5562 -102 60 -674 -858 -5833 -12916
24962a2916O381K441M20R628N720l461j5r782k02K018K262j748K491l750n0j279
$$ -12916 -6535 -4094 -3674 5954 11674 8213 8198 -1584 -1786 232 2494 746 3237 -513 -563 -1842
24946a842K138l71Q764m371L37j667N42K310m74p94L391P89l257p03j457M149
$$ -1842 296 -75 8689 4318 4655 2988 3530 5840 5366 4572 7963 8752 5495 4792 3335 7484
24930G484j212j638k102m156j330n520P325j354j347r50J349o12N509L6k225J444
$$ 7484 6272 4634 2532 -1624 -2954 -8474 -1149 -2503 -3850 -4800 -3451 -4063 1446 1482 -743 701
24914G01M09m5O76j766L248q27j57J531K816r32J16N885l411k829k097o116l019
$$ 701 1110 1065 1741 -25 3223 2396 2239 3770 6586 5654 5770 11655 8244 5415 3318 -2798 -5817
24897e817L189k89N69J400l334J36N919m809j230k162j016N239K455J265j233
$$ -5817 -2628 -2917 -2348 -948 -4282 -4146 1773 -3036 -4266 -6428 -7444 -2205 250 1515 282
24882B82j640N077j434k796J794J670k243L94j840k946k68J542o15L803N544n43
$$ 282 -1358 3719 2285 -511 1283 2953 710 1104 -736 -3682 -3950 -2408 -3023 780 6324 5781
24866E781M40m900k443l73k513K586k765l759k162P493M863l393l872k519j419
$$ 5781 6221 1321 -1122 -1495 -4008 -1422 -4187 -7946 -10108 -2615 2248 -1145 -5017 -7536 -8955
24851h955L541L374Q85O10l560M847k212n55o86L56k730j785R600J0883l504n34
$$ -8955 -5414 -2040 -1155 -545 -4105 742 -1470 -2025 -2711 -2355 -5085 -6870 2730 13613 10109 9575
24835I575n526k547K203N479n55k144l885K443N540n933o239k118O93l30J838
$$ 9575 4049 1502 3705 9184 8629 6485 2600 5043 10583 4650 -1589 -3707 -3014 -3344 -1506
24820a506L253j0279p879M016J1875Q850j189o533m657p30k458O103n805l179
$$ -1506 1747 -8532 -16411 -12395 -520 8330 7141 608 -4049 -4779 -7237 -1134 -6939 -10118
24806a0118K779L671K530L897N294N782l456q55k77m96K739n680l525N44j194
$$ -10118 -7339 -3668 -1138 2759 8053 13835 10379 9524 9247 8751 11490 5810 2285 2829 1635
24791A635J877K194J973k001m669J890J598J43k416k216m66L89J322O66L08l318
$$ 1635 3512 5706 7679 5678 1009 2899 4497 4640 2224 8 -458 -69 1253 1919 2227 -1091
24775a091m394P46J164L664J284j302j032k588l254P830P03k123l771L589K392
$$ -1091 -5485 -4739 -3575 89 1373 71 -961 -3549 -6803 1027 1730 -393 -4164 -575 1817
24760A817j822j210l725N678N263q700j488n114P507P453k973j180J808O161k317
$$ 1817 -5 -1215 -4940 738 6001 -2699 -4187 -9301 -1794 5659 2686 1506 3314 9475 7158
24745G158l541r14K326m40J448K890L916k060p555n795L709K189k240p28M4j908
$$ 7158 3617 2703 5029 4589 6037 8927 12843 10783 3228 -2567 1142 3331 1091 363 407 -1501
24729a501J001K085m353K935m28l211L497J511l454R74P041K245M19j071n489
$$ -1501 -500 1585 -2768 167 -261 -3472 25 1536 -1918 -944 6097 8342 8761 7690 2201
24714B201l408M372L758n291o608o799J866N59L178K034L476P436K277m250j427
$$ 2201 -1207 3165 6923 1632 -4976 -11775 -9909 -9350 -6172 -4138 -662 6774 9051 4801 3374
24699C374P99L832l044n872j540p231q166N694L925M875L23K280m22M95l389K538
$$ 3374 4173 8005 4961 -911 -2451 -9682 -17848 -12154 -8229 -3354 -3031 -751 -1173 -678 -4067 -1529
24683a529N607K07K85l782L931N029m954r99k271j963l22L384L408M591m571l125
$$ -1529 4078 4285 4570 788 4719 9748 4794 3795 1524 -439 -761 2623 6031 10622 6051 2926
24667B926n640M02j028o00n97L389J369p113l10L335j888k203K904n306K67L197
$$ 2926 -2714 -2312 -3340 -3940 -4537 -1148 221 -6892 -7202 -3867 -5755 -7958 -5054 -10360 -10093 -6896
24651f896k516L607O814l903n29K140J058Q491J559n774k47L229j02k709J104
$$ -6896 -9412 -5805 1009 -2894 -3423 -1283 -225 8266 9825 4051 3804 7033 6931 4222 5326
24636E326N528m107J1K552K966N93j550j399m501O447K11k094M74m332p539K278
$$ 5326 10854 6747 6758 9310 12276 12869 11319 9920 5419 11866 12077 9983 10457 6125 -1414 864
24620H64J176M613m098m507R09R84l514L133k780q26P461j08n065m011l611P002
$$ 864 2040 6653 2555 -1952 -1043 -59 -3573 -440 -3220 -4046 3415 3307 -1758 -5769 -9380 -2378
24604b378K056P59J675k542J370k623j413K041J687Q10k643j409K617k31J155
$$ -2378 -322 437 2112 -430 940 -1683 -3096 -1055 632 1442 -1201 -2610 7 -224 931
24589I31j077j863m804K356J3877P940J559o24l328p640p630k530J915L558l372
$$ 931 -146 -2009 -6813 -4457 9420 17360 18919 18295 14967 7327 -303 -2833 -918 2640 -732
24574g32R0k246l034K885l55O169M799l057j687J083K387J140N776k90k625p887
$$ -732 -642 -2888 -5922 -3037 -3392 2777 7576 4519 2832 3915 6302 7442 13218 12928 10303 2416
24558B416j816L712L953k410l189K694L650l024j907K711J368m077l463j293L549
$$ 2416 600 4312 8265 5855 2666 5360 9010 5986 4079 6790 8158 4081 618 -675 2874
24543B874n72m817o568k835J776J287O730Q684P380N87j734k373p553k142N353
$$ 2874 2302 -2515 -9083 -11918 -10142 -8855 -2125 6559 13939 14526 12792 10419 2866 724 6077
24528F077j748l467l371m737L218P141k755q736K441M942m649m70J726M862r91
$$ 6077 4329 862 -2509 -7246 -4028 3113 358 -8378 -5937 -995 -5644 -6114 -4388 474 -517
24513e17J328L948m482J253J179K551k720l260J663l240n679O090K822J424K712
$$ -517 811 4759 277 1530 2709 5260 2540 -720 943 -2297 -7976 -1886 936 2360 5072
24498E072K765k640n393J020J511m906n677P67M051J79j070q397o445R104P351
$$ 5072 7837 5197 -196 824 2335 -2571 -8248 -7481 -3430 -3251 -4321 -12718 -19163 -10059 -2708
24483b708l468N95j731l92J143O063L591Q2J320n817J031Q786o715m228K900P511
$$ -2708 -6176 -5581 -7312 -7704 -6561 -498 3093 3175 4495 -1322 -291 8495 1780 -2448 452 7963
24467G963m072j662K32k533J067l173j483J221l517N76J969j800K790K661k805
$$ 7963 3891 2229 2461 -72 995 -2178 -3661 -2440 -5957 -5381 -3412 -5212 -2422 239 -2566
24452b566L50O364n884j0925M422M665R11P12J067O28k300J326j702J190j694
$$ -2566 -2216 4148 -1736 -12661 -8239 -3574 -2663 -1951 -884 -256 -2556 -1230 -2932 -1742 -3436
24437c436n82K798j421O834Q837k54l838k836o555m774l033j166R71m98L428m565
$$ -3436 -4018 -1220 -2641 4193 13030 12776 8938 6102 -453 -5227 -8260 -9426 -8455 -8953 -5525 -10090
24421a0090J772K795K310j465Q84L189Q31N519l545j0930l522L286O497K747K646
$$ -10090 -8318 -5523 -3213 -4678 -3794 -605 226 5745 2200 -8730 -12252 -8966 -2469 278 2924
24406B924J231q2o6K834j039m336m516K93j773M203P485P4p892l142L101J126
$$ 2924 4155 4073 4007 6841 5802 1466 -3050 -2757 -4530 -327 7158 7232 -660 -3802 -701 425
24390D25l589l856N014O623J947J523l484j037r07J830J749l95p659M17O12n671
$$ 425 -3164 -7020 -2006 4617 6564 8087 4603 3566 2659 4489 6238 5843 -1816 -1399 -787 -6458
24374f458j379Q841P235J071l378J692K339k601m796J2117l564l587k877J649
$$ -6458 -7837 1004 8239 9310 5932 7624 9963 7362 2566 14683 11119 7532 4655 6304
24360F304m86M92l734m64K001j513q97r94K568K766j75K369p867l454L173M655
$$ 6304 5818 6310 2576 2112 4113 2600 1703 709 3277 6043 5868 8237 370 -3084 89 4744
24344D744m442n947L229K780L871l33J501o3n505J364n437k825l004j412L370
$$ 4744 302 -5645 -2416 364 4235 3902 5403 5340 -165 1199 -4238 -7063 -10067 -11479 -8109
24329h109O583M680k579k368L0J994m9l012K140m072M479R004j103k336p494M069
$$ -8109 -1526 3154 575 -1793 -1763 231 182 -2830 -690 -4762 -283 8721 7618 5282 -2212 1857
24313A857J1601l085o139M46j940n60o79j63j281J98K64p846m247J0557P585P9
$$ 1857 13458 10373 4234 4680 2740 2180 1501 1338 57 255 519 -7327 -11574 -1017 6568 6647
24297F647l818j282L946O460k187J660r37m893K93p83l976n131o63L536J277L181
$$ 6647 2829 1547 5493 11953 9766 11426 10489 5596 5889 5106 1130 -4001 -4664 -1128 149 3330
24281C330k636j080L696k283k417k147m1R58M715l85k547K600K513K99j990k906
$$ 3330 694 -386 3310 1027 -1390 -3537 -3578 -2620 2095 1710 -837 1763 4276 4575 2585 -321
24265c21O0J88K330k395L065K484k973L887l933m194M093K330m287J000K763R39
$$ -321 -261 -73 2257 -138 2927 5411 2438 6325 2392 -1802 2291 4621 334 1334 4097 5036
24249E036m452l927O178L608J207L161N708l372r432m859M304J898j896k710K612
$$ 5036 584 -3343 2835 6443 7650 10811 16519 13147 3715 -1144 3160 5058 3162 452 3064
24234C064L070M904r42m736j890n015p391J01J0360L750k766l747k696l76j076
$$ 3064 6134 11038 10096 5360 3470 -1545 -8936 -8835 1525 5275 2509 -1238 -3934 -4310 -5386
24219e386K898J623m037l08j52j306Q636J482Q83n918p943k128Q863K047o538
$$ -5386 -2488 -865 -4902 -5210 -5362 -6668 1968 3450 4333 -1585 -9528 -11656 -2793 -746 -7284
24204g284j127j635J499Q59j117j357N892K763k528K537K371K91r87L340o11K11
$$ -7284 -8411 -10046 -8547 -7688 -8805 -10162 -4270 -1507 -4035 -1498 873 1164 177 3517 2906 3117
24188C117k2K362R54n339m669k555M863j757M70O795p874l730L311j208j7N296
$$ 3117 3095 5457 6411 1072 -3597 -6152 -1289 -3046 -2576 4219 -3655 -7385 -4074 -5282 -5299 -3
24172cJ733J03l066p19N046l738m327K834m89n371R98N306p64M892J718N65K626
$$ -3 1730 1833 -1233 -1952 3094 -644 -4971 -2137 -2626 -7997 -6999 -1693 -2457 2435 4153 4718 7344
24155G344L760m014l112M774K829k355p248j4933p682K75R245M533K370k061M597
$$ 7344 11104 7090 3978 8752 11581 9226 1978 -12955 -20637 -20362 -11117 -6584 -4214 -6275 -1678
24140a678L58n341L634J578k975M10J564q86m122m045O94Q65l68P634J0610M218
$$ -1678 -1320 -6661 -3027 -1449 -4424 -4014 -2450 -3336 -7458 -11503 -10809 -9944 -10312 -2678 7932 12150
24124A2150o073m295J161n605n726R63J0171j210K635K696j219k92K078J385j389
$$ 12150 6077 1782 2943 -2662 -8388 -7425 2746 1536 4171 6867 5648 5356 7434 8819 7430
24109G430j809M732k303o964k163o344M127J2102j311o739J85L987r72J321J217
$$ 7430 5621 10353 8050 1086 -1077 -7421 -3294 8808 7497 758 943 4930 3958 5279 6496
24094F496m246r562J581n330Q6j174k332N670J0832O5o547j1274q75J0575J317
$$ 6496 2250 -7312 -5731 -11061 -10975 -12149 -14481 -8811 2021 2086 -4461 -15735 -16610 -6035 -4718
24079d718K196J23l756L509m30n17P10K332J842j845J703n537o027O99J0861K95
$$ -4718 -2522 -2399 -6155 -2646 -3076 -3593 -2883 -551 1291 -554 1149 -4388 -10415 -9716 1145 1440
24063A440n625K97j13n19K66l993k71Q770K438k552j169j923m745N20N88R33M502
$$ 1440 -4185 -3888 -4001 -4520 -4254 -8247 -8518 252 2690 138 -1031 -2954 -7699 -7179 -6591 -5658 -1156
24046a156m65N60M112L084K509j44n913q375k731P979Q227K728k345p351p205
$$ -1156 -1621 -1061 3051 6135 8644 8500 2587 -5788 -8519 -540 7687 10415 8070 719 -6486
24031f486P843l54k790j546l539K180J34Q4n597J873R527M97n490O400Q91j614
$$ -6486 1357 1003 -1787 -3333 -6872 -4692 -4558 -4474 -10071 -8198 1329 1826 -3664 2736 3627 2013
24015B013J209M585j026l325k150n192p844L543M267j220J345P330J193k635J92
$$ 2013 3222 7807 6781 3456 1306 -3886 -11730 -8187 -3920 -5140 -3795 3535 4728 2093 2285
24000B285K385j955N948J437j494P46q372l843O068p28K85k696j391m220N91O426
$$ 2285 4670 2715 8663 10100 8606 9352 980 -2863 3205 2477 2762 66 -1325 -5545 -4954 1472
23984A472K000j703L276L798q681r254l758J002M564O261M4K73m834m413J127
$$ 1472 3472 1769 5045 8843 162 -9092 -12850 -11848 -7284 -1023 -979 -706 -5540 -9953 -8826
23969h826R497M721k981m425p244p55L756M799n448L10K491j663K203L035J922
$$ -8826 671 5392 2411 -2014 -9258 -10013 -6257 -1458 -6906 -6596 -4105 -5768 -3565 -530 1392
23954A392K662l31L38k134l427l674k392m626M98m00N330L776J436j987m761K583
$$ 1392 4054 3723 4061 1927 -1500 -5174 -7566 -12192 -11694 -12094 -6764 -2988 -1552 -3539 -8300 -5717
23938e717J783M659M816J03r165L21O92m114k933k831j173J866M522L223r26p06
$$ -5717 -3934 725 5541 5644 -3521 -3200 -2508 -6622 -9555 -12386 -13559 -11693 -7171 -3948 -4874 -5580
23922e580M007P779M3l539l385n743N587K316N28L628N148l949J2j134J087K311
$$ -5580 -1573 6206 6249 2710 -675 -6418 -831 1485 2013 5641 10789 6840 6852 5718 6805 9116
23906I116k207J853K489K59l081k572J421n236J744J0617O269J16p951o854J57
$$ 9116 6909 8762 11251 11510 8429 5857 7278 2042 3786 14403 20672 20788 12837 5983 6140
23891F140O834O55K82o562m902q307O208O363K645j407k085k633o5r78O25k023
$$ 6140 12974 13629 13911 7349 2447 -5860 348 6711 9356 7949 5864 3231 3166 2188 2813 790
23875G90k234l5R207P951j0840n161J551n74j195n655m863M681O135P68m85m860
$$ 790 -1444 -1479 7728 15679 4839 -322 1229 655 -540 -6195 -11058 -6377 -242 526 41 -4819
23859d819J198J127N53j553J12J308n895o91l97J067k052J187Q064j696J505l651
$$ -4819 -3621 -2494 -1941 -3494 -3382 -2074 -7969 -8660 -9057 -7990 -10042 -8855 -791 -2487 -982 -4633
23843d633j0582N34J970J781N439O634n77p321M330M302p50j026l35k269j859
$$ -4633 -15215 -14681 -12711 -10930 -5491 1143 566 -6755 -2425 1877 1127 101 -234 -2503 -4362
23828d362M096J956M15O578o580l834j146j780K290O158L000O15m130n503m40
$$ -4362 -266 1690 2105 8683 2103 -1731 -2877 -4657 -2367 3791 6791 7406 3276 -2227 -2667
23813b667K984M105n973K626M158K909K830j1622k187J121k211n073o123N613
$$ -2667 317 4422 -1551 1075 5233 8142 10972 -650 -2837 -1716 -3927 -9000 -15123 -9510
23799i510J2355k182L301O734J166p509k159PL939J989n668j2996K153K434M582
$$ -9510 2845 663 3964 10698 11864 4355 2196 2203 6142 8131 2463 -10533 -8380 -5946 -1364
23784a364J338m317M693L764O599J347m380p004o99R345J2157J3132P557m795
$$ -1364 -26 -4343 350 4114 10713 12060 7680 676 -23 9322 21479 34611 42168 37373
23770C7373j3579j7940n919n302l811L140p8P42K845k937l899k122M786R82l04
$$ 37373 23794 5854 -65 -5367 -9178 -6038 -6116 -5374 -2529 -5466 -9365 -11487 -6701 -5719 -6023
23755f023Q346L859Q89J478r532l817k2n735o540O563P734K429O703L235J108
$$ -6023 2323 6182 7071 8549 -983 -4800 -4822 -10557 -17097 -10534 -2800 -371 6332 9567 10675
23740A0675l535n354l516j152K20o201k411K839J744N413j874r55P758N491o044
$$ 10675 7140 1786 -1730 -2882 -2662 -8863 -11274 -8435 -6691 -1278 -3152 -4107 3651 9142 3098
23725C098p716m799K35k003j499J230K459Q171O088n914n217M992p178k665L24
$$ 3098 -4618 -9417 -9182 -11185 -12684 -11454 -8995 -824 5264 -650 -5867 -875 -8053 -10718 -10394
23710a0394k023m754P778M357L480j569L904K533k123m916O909K874k81M798P11
$$ -10394 -12417 -17171 -9393 -5036 -1556 -3125 779 3312 1189 -3727 3182 6056 5775 10573 11284
23695A1284l005k652L897q247p122l289K251J633n253J000K765m040m188P782
$$ 11284 8279 5627 9524 1277 -5845 -9134 -6883 -5250 -10503 -9503 -6738 -10778 -14966 -7184
23681g184O273p47j282L818j118L179k59J95L090L000o56r316q567N536O222l177
$$ -7184 -911 -1658 -2940 878 -240 2939 2680 2875 5965 8965 8309 -1007 -9574 -4038 2184 -993
23665i93m72r72k617O086N21j125K521k089l135N017k344r026j579K595O382j311
$$ -993 -1465 -2437 -5054 1032 1553 428 2949 860 -2275 2742 398 -8628 -10207 -7612 -1230 -2541
23649b541p067m402P022P956q108o176j507k16O760N551o51k069j927L325k04
$$ -2541 -9608 -14010 -6988 968 -7140 -13316 -14823 -15039 -8279 -2728 -3379 -5448 -7375 -4050 -4254
23634d254k069j160k071O822O297k130l843j502k00n240L155K617o10O18L287
$$ -4254 -6323 -7483 -9554 -2732 3565 1435 -2408 -3910 -4110 -9350 -6195 -3578 -4188 -3570 -283
23619b83l678J371N422l177m337O066j553j607J671p763m533Q385O183R4k005
$$ -283 -3961 -2590 2832 -345 -4682 1384 -169 -1776 -105 -7868 -12401 -4016 2167 2261 256
23604B56K245O321R42l797l286l202Q89j631K800Q59L344M170M094q917o295r97
$$ 256 2501 8822 9764 5967 2681 -521 368 -1263 1537 2396 5740 9910 14004 5087 -1208 -2205
23588b205P914m699n637L230L744n033K74N319n090k02m851k039N079k122p887
$$ -2205 5709 1010 -4627 -1397 2347 -2686 -2412 2907 -2183 -2385 -7236 -9275 -4196 -6318 -14205
23573a4205L513J2539M048m34p8l538o979K367J1301K22q85n134j517j86n713
$$ -14205 -10692 1847 5895 5461 5383 1845 -5134 -2767 8534 8756 7871 2737 1220 1034 -4679
23558d679k935j529J444N527K236m805n14K542k518K232M597M564j317p547o30
$$ -4679 -7614 -9143 -7699 -2172 64 -4741 -5255 -2713 -5231 -2999 1598 6162 4845 -2702 -3332
23543c332k699j062j139o315J067k54j343M53N366O172m389j98O435j724n246
$$ -3332 -6031 -7093 -8232 -14547 -13480 -13734 -15077 -14624 -9258 -3086 -7475 -7673 -1238 -2962 -8208
23528h208k06P350n743l976k822K657L148k514K745P680L284m884l509k934M58
$$ -8208 -8414 -1064 -6807 -10783 -13605 -10948 -7800 -10314 -7569 111 3395 -1489 -4998 -7932 -7474
23513g474l774k457R214M269O485n93p567n909J166k096l280O806R822k932N896
$$ -7474 -11248 -13705 -4491 -222 6263 5670 -1897 -7806 -6640 -8736 -12016 -5210 4612 1680 7576
23498G576N101j576l964l296J932p988k940J609N145J0375J824m119m78r07k511
$$ 7576 12677 11101 7137 3841 5773 -2215 -5155 -3546 1599 11974 13798 9679 9201 8294 5783
23483E783K65L400o5j2878j2266k604Q692M729o329k315J757k893j0J4744P424
$$ 5783 6048 9448 9383 -3495 -15761 -18365 -9673 -4944 -11273 -13588 -11831 -14724 -14734 10 7434
23468G434p465q515j81N684M390k329k652M646O200k299m056J386K22k855j570
$$ 7434 -31 -8546 -8727 -3043 1347 -982 -3634 1012 7212 4913 857 2243 2465 -390 -1960
23453a960J273q65m198k261J1063P209k465p674r099L182J00n476j344L166K389
$$ -1960 -687 -1552 -5750 -8011 3052 10261 7796 122 -8977 -5795 -5695 -11171 -12515 -9349 -6960
23438f960K189j177L040K261J502n932m575n466o15L593J0770L196K27R15j483
$$ -6960 -4771 -5948 -2908 -647 855 -5077 -9652 -15118 -15733 -12140 -1370 1826 2053 2968 1485
23423A485K508n534K592J172j20l769M612L995q428l578m713M787K501K125J119
$$ 1485 3993 -1541 1051 2223 2103 -1666 2946 6941 -1487 -5065 -9778 -4991 -2490 -365 754
23408G54N25K241k406k969k007k845K734l202m429k73j785J74QK235P510N918
$$ 754 1279 3520 1114 -1855 -3862 -6707 -3973 -7175 -11604 -11877 -13662 -13488 -13480 -11245 -3735 2183
23392B183l174l115Q925k537j602j291k723n99N231J1058r36n901r147O23K874
$$ 2183 -991 -4106 4819 2282 680 -611 -3334 -3933 1298 12356 11420 5519 -3628 -3005 -131
23377a31R70P08p197L32k152J038O685l231o456L809N92r93L24L346r962m542
$$ -131 839 1547 -5650 -5318 -7470 -6432 253 -2978 -9434 -5625 -5033 -6026 -5702 -2356 -12318 -16860
23361a6860J0999Q703N311J367m574q659n165l013K560K438N355k459l282k631
$$ -16860 -5861 2842 8153 9520 4946 -3713 -8878 -11891 -9331 -6893 -1538 -3997 -7279 -9910
23347i910K508L461J104O623Pj1122j431L158M84l918o526K235q59J990N584J0010
$$ -9910 -7402 -3941 -2837 3786 3793 -7329 -8760 -5602 -5118 -9036 -15562 -13327 -14186 -12196 -6612 3398
23331C398J301j711k968m244o106k415P538j78J025L269K574m866n23L009J443
$$ 3398 4699 2988 20 -4224 -10330 -12745 -5207 -5385 -4360 -1091 1483 -3383 -3906 -897 546
23316E46k496l749J414L492O872k283P98k39r15j395Q743j275l032j221n501q879
$$ 546 -1950 -5699 -4285 -793 6079 3796 4594 4355 3440 2045 10788 9513 6481 5260 -241 -9120
23300i120K25N781M316j015L156O094N594O0p559l761M169j820L620J143o23p973
$$ -9120 -8895 -3114 1202 187 3343 9437 15031 15091 7532 3771 7940 6120 9740 10883 10260 2287
23284B287k277K95j327n173J168L324P53j561L711L631J954k882j623j832j115
$$ 2287 10 305 -1022 -6195 -5027 -1703 -950 -2511 1200 4831 6785 3903 2280 448 -667
23269f67K864P67l885m702J174M127M088K461m729j6541k074L677Q503O137P191
$$ -667 2197 2964 -921 -5623 -4449 -322 3766 6227 1498 -15043 -17117 -13440 -4937 1200 8391
23254H391K831Q42n417m097l855l736k775L147l87l85M975l540k824N621n42l966
$$ 8391 11222 12064 6647 2550 -1305 -5041 -7816 -4669 -5056 -5441 -466 -4006 -6830 -1209 -1751 -5717
23238e717p90M537n26k306N806J924q172k604P935n724r20M041K441NL819L454
$$ -5717 -6507 -1970 -2496 -4802 1004 2928 -5244 -7848 87 -5637 -6557 -2516 -75 -70 3749 7203
23222G203l185k538l561K724N790P42o085j3035L930L698l3N082M701K961p835
$$ 7203 4018 1480 -2081 643 6433 7175 1090 -11945 -8015 -4317 -4350 732 5433 8394 559
23207E59M08j998L230Q50M820L464r37k565J936L713J018o293j1490m561j580
$$ 559 967 -1031 2199 3049 7869 11333 10396 7831 9767 13480 14498 8205 -3285 -7846 -9426
23192i426m33j10K274P015L068m435l329k339k544J947L950L09l774L134M423
$$ -9426 -9859 -9969 -7695 -680 2388 -2047 -5376 -7715 -10259 -8312 -4362 -4053 -7827 -4693 -270
23177b70N958j689o47n672L96K154r053l202R12J043K101J772L418O226M420m820
$$ -270 5688 3999 3352 -2320 -1924 230 -8823 -12025 -11113 -10070 -7969 -6197 -2779 3447 7867 3047
23161C047p236j580P808K168J415p26j362k053M78k580o873k168Q93R509K240
$$ 3047 -4189 -5769 2039 4207 5622 4896 3534 1481 1959 -621 -7494 -9662 -8769 740 2980
23146B980P10k514m686J693p22K153N196k989l333j304K359j258q461m485M72
$$ 2980 3690 1176 -3510 -1817 -2539 -386 4810 1821 -1512 -2816 -457 -1715 -10176 -14661 -14189
23131a4189O577K335j817Rm729J29N786J1405J903j067l202m149q43k230J648
$$ -14189 -7612 -5277 -7094 -7085 -11814 -11685 -5899 5506 7409 6342 3140 -1009 -1852 -4082 -2434
23116b434L07m31M88k74Q669M182P98o841l416J273n398K075J936m811l590O10
$$ -2434 -2127 -2558 -2070 -2344 6325 10507 11305 4464 1048 2321 -3077 -1002 934 -3877 -7467 -6857
23100f857K741K422P72k517o247J541l12q05j692J080p277n53R991J3988Q69n467
$$ -6857 -4116 -1694 -922 -3439 -9686 -8145 -8457 -9262 -10954 -9874 -17151 -17704 -7713 6275 7144 1677
23084A677J794R23p4o130m25p971l116k739Q657O911J978q899J108L779j665N972
$$ 1677 3471 4394 4320 -1810 -2235 -10206 -13322 -16061 -7404 -493 1485 -7414 -6306 -2527 -4192 1780
23068A780J463N5j889K260j103j447M148k533p712O235L860n183j210N83o191
$$ 1780 3243 3298 1409 3669 2566 1119 5267 2734 -4978 1257 5117 -66 -1276 -693 -6884
23053f884M466M343K443L196N569O772P43j2551m584N754Q186n076j490m386j1079
$$ -6884 -2418 1925 4368 7564 13133 19905 20648 8097 3513 9267 17453 12377 10887 6501 -4578
23038d578j982l387p177k679N347N997p82N321O160K480L002K543K935q899j49
$$ -4578 -6560 -9947 -17124 -19803 -14456 -8459 -9241 -3920 2240 4720 7722 10265 13200 4301 4152
23023D152m157m193k10J016m570M196k547L77q61L608L137J599K128K69K440R00
$$ 4152 -5 -4198 -4408 -3392 -7962 -3766 -6313 -5936 -6797 -3189 -52 1547 3675 3944 6384 7284
23007G284r453n176J0467M76O27n46K36L774m743p557K914p52j2268r363Q866
$$ 7284 -2169 -7345 3122 3598 4225 3679 3915 7689 2946 -4611 -1697 -2449 -14717 -24080 -15214
22992a5214J0783j482J104j520K964J947n180m750M264N742k006m506K929J935
$$ -15214 -4431 -5913 -4809 -6329 -3365 -1418 -6598 -11348 -7084 -1342 -3348 -7854 -4925 -2990
22978b990P48L289K00q28m079K87O060K690j274n221p426j652K892P231P388m50
$$ -2990 -2242 1047 1247 419 -3660 -3373 2687 5377 4103 -1118 -8544 -10196 -7304 -73 7315 6865
22962F865M177k150o726o128K991M82K888k273l565Q53O749L836l572N24n771
$$ 6865 11042 8892 2166 -3962 -971 -489 2399 126 -3439 -2586 4163 7999 4427 4951 -820
22947h20l144R6M247j273J70J541J875O55j513M317m150l005j581O629M9K31Q419
$$ -820 -3964 -3868 379 -894 -724 817 2692 3347 1834 6151 2001 -1004 -2585 4044 4093 4324 12743
22930A2743O41j1899J427J715J074l839n374l847N765L837q7O270l139J18n387
$$ 12743 13384 1485 2912 4627 5701 1862 -3512 -7359 -1594 2243 2156 8426 5287 5405 18
22915A8o907o8K133O485J0648K212n327l465j3266q933L539P825P757j415l759
$$ 18 -6889 -6957 -4824 1661 12309 14521 9194 5729 -7537 -16470 -12931 -5106 2651 1236 -2523
22900b523M91m342n435J848P089R426j221j0102n680K429K56L549P990J467O46
$$ -2523 -2032 -6374 -11809 -9961 -2872 6554 5333 -4769 -10449 -8020 -7764 -4215 3775 5242 5888
22885E888O79N498m696m453m299K28N222j155j483j465M456k144l128k320l375
$$ 5888 6567 12065 7369 2916 -1383 -1155 4067 2912 1429 -36 4420 2276 -852 -3172 -6547
22870f547l411j029k270M875N546P28n022q356M61N697J711k332k84J779P389
$$ -6547 -9958 -10987 -13257 -8382 -2836 -2108 -7130 -15486 -15025 -9328 -7617 -9949 -10233 -8454 -1065
22855a065J630M620q404q130J854N551M396O556n79q899r314P06P621o15O288
$$ -1065 565 5185 -3219 -11349 -9495 -3944 452 7008 6429 -2470 -11784 -11078 -3457 -4072 2216
22840B216K205m10P915o611n548o643K324L717L570j600j0242N185M914q9k62
$$ 2216 4421 4011 11926 5315 -233 -6876 -4552 -835 2735 1135 -9107 -3922 992 903 641
22825F41N63K101J972r94k042l855k813l378J464l64k13L728O13l283n75J505
$$ 641 1204 3305 5277 4283 2241 -1614 -4427 -7805 -6341 -6705 -6918 -3190 -2577 -5860 -6435 -4930
22809d930N655k10j376l453O471K713m016l864l001J294p02M11K151N070j979
$$ -4930 725 515 -861 -4314 2157 4870 854 -3010 -6011 -4717 -5419 -5008 -2857 2213 234
22794B34p21n482r1k24j871N089M29k527k169J037Q38J082M959j231J264L117
$$ 234 -487 -5969 -6060 -6284 -8155 -3066 -2637 -5164 -7333 -6296 -5458 -4376 583 -648 616 3733
22778C733J296M473m472n638k175J252l659k484Q469K886N00L708j389K006n449
$$ 3733 5029 9502 5030 -608 -2783 -1531 -5190 -7674 795 3681 4181 7889 6500 8506 3057
22763C057q092N469N401l349n326j590m605P02O572L461j01j024l887R00R073
$$ 3057 -5035 434 5835 2486 -2840 -4430 -9035 -8333 -1761 1700 1599 575 -3312 -2412 6661
22748F661J435l048o83j45o73j606L883r20j0397k993N741L709n657n275R1J592
$$ 6661 8096 5048 4365 4220 3547 1941 5824 4904 -5493 -8486 -2745 964 -4693 -9968 -9877 -8285
22732h285M627K686M400O815l105j0107m964k039P290O870J94r218K41n09o377
$$ -8285 -3658 -972 3428 10243 7138 -2969 -7933 -9972 -2682 4188 4382 -4836 -4595 -5104 -11481
22717a1481o266M609P324l472q812P08Q045M464l049K667L161l282L264m185k56
$$ -11481 -17747 -13138 -5814 -9286 -18098 -17390 -9345 -4881 -7930 -5263 -2102 -5384 -2120 -6305 -6561
22702f561m096j760N629N121l292m685k320M718N485n507o748K034Q3J2159O293
$$ -6561 -10657 -12417 -6788 -1667 -4959 -9644 -11964 -7246 -1761 -7268 -14016 -11982 -11899 260 6553
22687F553n972l505J368o385J42Q199P755M649n762o965j467K988l19j514k184
$$ 6553 581 -2924 -1556 -7941 -7799 400 8155 12804 7042 77 -1390 1598 1279 -235 -2419
22672b419l756L006J140k104K865K176r762L940R439l90n28R60p09q15j1129p615
$$ -2419 -6175 -3169 -2029 -4133 -1268 908 -8854 -4914 4525 4135 3607 4567 3858 3043 -8086 -15701
22656a5701M472N650L178j675l411O965M232j337J494j577k218N231j502n204
$$ -15701 -11229 -5579 -2401 -4076 -7487 -522 3710 2373 3867 2290 72 5303 3801 -1403
22642a403K202M430m993m267J594m478N011N820m717j470J527M844k037K158J619
$$ -1403 799 5229 236 -4031 -2437 -6915 -1904 3916 -801 -2271 -744 4100 2063 4221 5840
22627E840o489m688m250j949N4L701K857j548L246J41M866l594k008n374k487
$$ 5840 -649 -5337 -9587 -11536 -11482 -7781 -4924 -6472 -3226 -3085 1781 -1813 -3821 -9195 -11682
22612a1682O5J983M979O277j02k446M882l759n255L920l607Q35k165Q09n984m566
$$ -11682 -11617 -9634 -4655 1622 1520 -926 3956 197 -5058 -1138 -4745 -3910 -6075 -5266 -11250 -15816
22596a5816J364P925L013N852p813O166J061m853J153K676o375l447R572K198
$$ -15816 -14452 -6527 -3514 2338 -5475 691 1752 -3101 -1948 728 -5647 -9094 478 2676
22582B676J138o803m040J071J167J244K876m014J605L665n859k986N521M379o211
$$ 2676 3814 -2989 -7029 -5958 -4791 -3547 -671 -4685 -3080 585 -5274 -8260 -2739 1640 -4571
22567d571q273L61N253k511k304N408M921R82n622m400L691J583L803L612o85
$$ -4571 -12844 -12483 -7230 -9741 -12045 -6637 -1716 -734 -6356 -10756 -7065 -5482 -1679 1933 1248
22552A248m183k623j373o886l565J550l629Q857N921M713J466o330n266o05R955
$$ 1248 -2935 -5558 -6931 -13817 -17382 -15832 -19461 -10604 -4683 30 1496 -4834 -10100 -10705 -750
22537g50L116n451m192L865N389J98m839j51J796O310j399J200K111N227k583
$$ -750 2366 -3085 -7277 -3412 1977 2175 -2664 -2815 -1019 5291 3892 5092 7203 12430 9847
22522I847k807J34l744P97o079o606K508L559k757K00M194j235P66J0987R19j0406
$$ 9847 7040 7174 3430 4227 -1852 -8458 -5950 -2391 -5148 -4948 -754 -1989 -1223 9764 10683 277
22506B77r554m059O305P808J710K014J249m59Q222j0327l875M145P59k424o85
$$ 277 -9277 -13336 -7031 777 2487 4501 5750 5291 13513 3186 -689 3456 4215 1791 1106
22491A106K776o775o588K265K678m14J750j290j771K398k760L422K792m143o154
$$ 1106 3882 -2893 -9481 -7216 -4538 -4952 -3202 -4492 -6263 -3865 -6625 -3203 -411 -4554 -10708
22476a0708N890M594j672M083o8n03l924J042m375m462M197k289Q915K328l876
$$ -10708 -4818 -224 -1896 2187 2119 1616 -2308 -1266 -5641 -10103 -5906 -8195 720 3048 -828
22461h28m497K180k037k483j803k833j110M749K104j611L611J786j107l513M53
$$ -828 -5325 -3145 -5182 -7665 -9468 -12301 -13411 -8662 -6558 -8169 -4558 -2772 -3879 -7392 -6939
22446f939K300M334J229p708o473P493J2560o872n771J1806N977o339j2480K594
$$ -6939 -4639 -305 924 -6784 -13257 -5764 6796 -76 -5847 5959 11936 5597 -6883 -4289
22432d289N128M222l474N5J305p12m321j319M781m992j816k99l607L934m848j0216
$$ -4289 839 5061 1587 1642 2947 2235 -2086 -3405 1376 -3616 -5432 -5731 -9338 -5404 -10252 -20468
22416b0468N203Q442j683K014k110o56J063L582K120k419J32K972l345l245k29
$$ -20468 -15265 -6823 -8506 -6492 -8602 -9258 -8195 -4613 -2493 -4912 -4780 -1808 -5153 -8398 -8627
22401h627p06m424P656N754m684l704n108k072M218P591j540K738L690o801p452
$$ -8627 -9333 -13757 -6101 -347 -5031 -8735 -13843 -15915 -11697 -4106 -5646 -2908 782 -6019 -13471
22386a3471P67O777K237k038j154L89K453P112J905m304k20K936m187J61K498
$$ -13471 -12704 -5927 -3690 -5728 -6882 -6493 -4040 3072 4977 673 453 3389 -798 -637 1861
22371A861Q89J052k426k322k930K378J316n745n437O450M888p331j040J236J091
$$ 1861 2750 3802 1376 -946 -3876 -1498 -182 -5927 -11364 -4914 -26 -7357 -8397 -7161 -6070
22356f070m583k957R53R42P96N162l044j018O096L563M538l047J961L8n114p157
$$ -6070 -10653 -13610 -12657 -11715 -10919 -5757 -8801 -9819 -3723 -160 4378 1331 3292 3330 -1784 -8941
22340h941L790J993k310J0482M287m018K112K254l931l983m877N83j914k972r830
$$ -8941 -5151 -3158 -5468 5014 9301 5283 7395 9649 5718 1735 -3142 -2559 -4473 -7445 -17275
22325a7275L460O901K734r62J105M530o174m249r34k907J325M729N222J033J173
$$ -17275 -13815 -6914 -4180 -5142 -4037 493 -5681 -9930 -10864 -13771 -12446 -7717 -2495 -1462 -289
22310b89K401N986k728m089l427l128L23k756j1309j0837N663P873K097M371q64
$$ -289 2112 8098 5370 1281 -2146 -5274 -4951 -7707 -19016 -29853 -24190 -16317 -14220 -9849 -10713
22295a0713j032J637K307M436o335O903J552K915P44p319o623J96n20m043O233
$$ -10713 -11745 -10108 -7801 -3365 -9700 -2797 -1245 1670 2414 -4905 -11528 -11332 -11852 -15895 -9662
22280i662n53r6j577M064O611K861N36O342j1710o982P377R42k854l666j2807
$$ -9662 -10215 -10311 -11888 -7824 -1213 1648 2184 8526 -3184 -10166 -2789 -1847 -4701 -8367 -21174
22265b1174r98N383K876J685j682M2M130P735l451l56j995L672J0396K375M473
$$ -21174 -22172 -16789 -13913 -12228 -13910 -13868 -9738 -2003 -5454 -5810 -7805 -4133 6263 8638 13111
22250A3111n830o977l121q0Q191K322l433n369m511J394K338J609N341n000q340
$$ 13111 7281 304 -2817 -2897 5294 7616 4183 -1186 -5697 -4303 -1965 -356 4985 -15 -8355
22235h355m319m936M67P531J2066N268j379p74m409m14K45M18L195P354J81j12
$$ -8355 -12674 -17610 -17143 -9612 2454 7722 6343 5569 1160 746 991 1409 4604 11958 12139 12027
22219A2027m12q433l203l416k247J929l18N387l664R95K663o925n702k788P070
$$ 12027 11615 3182 -21 -3437 -5684 -3755 -4073 1314 -2350 -1355 1308 -5617 -11319 -14107 -7037
22204g037K897K08P627O342n618q906k359m399J152k99M452Q371m551j65M301
$$ -7037 -4140 -3932 3695 10037 4419 -4487 -6846 -11245 -10093 -10392 -5940 2431 -2120 -2285 2016
22189B016K887K467l955k263j142n23n06J69j619J622m704N636J375q381l235
$$ 2016 4903 7370 3415 1152 10 -513 -1019 -850 -2469 -847 -5551 85 1460 -6921 -10156
22174a0156L049J100R973M935k09k762k486j749m200o51m59L946k731l346r47
$$ -10156 -7107 -6007 3966 8901 8692 5930 3444 1695 -2505 -3156 -3615 331 -2400 -5746 -6693
22159f693k512k078K001j547J779K745k40M939O534k179p153q78o757J491M924
$$ -6693 -9205 -11283 -9282 -10829 -9050 -6305 -6545 -1606 4928 2749 -4404 -5282 -12039 -10548 -5624
22144e624j123L246l130k809K004P18M860J481j741k090j736K972N074r37m246
$$ -5624 -6747 -3501 -6631 -9440 -7436 -6718 -1858 -377 -2118 -4208 -5944 -2972 2102 1165 -3081
22129c081J67r86j193o269j276p52o114J580J188n50M955M875k168m393J462M257
$$ -3081 -2914 -3900 -5093 -11362 -12638 -13390 -19504 -17924 -16736 -17286 -12331 -7456 -9624 -14017 -12555 -8298
22113h298R874R29l599n680R110m74N009M348j3587o954M110O485q25K426o580
$$ -8298 1576 2505 -1094 -6774 2336 1862 6871 11219 -2368 -9322 -5212 1273 448 2874 -3706
22098c706J502R34j2172J174j193L017L031j047O24N22P61k946j661K755o083
$$ -3706 -2204 -1270 -13442 -12268 -13461 -10444 -7413 -8460 -7836 -7314 -6553 -9499 -11160 -8405 -14488
22083a4488j455J1558K011k887j079L22k285Q017N693j3L920m73n988l0J54l915
$$ -14488 -15943 -4385 -2374 -5261 -6340 -6018 -8303 -286 5407 5394 9314 8841 2853 2823 2977 -938
22067i38K539n03K644k85l006m496n063N21L481K500p30j560k652N251K750j463
$$ -938 1601 1098 3742 3457 451 -4045 -9108 -8587 -5106 -2606 -3336 -4896 -7548 -2297 453 -1010
22051a010j296J988M349O515K53j532k632n895l672L13L500K230O09j156l833
$$ -1010 -2306 -318 4031 10546 10799 9267 6635 740 -2932 -2619 881 3111 3720 2564 -1269
22036a269j142J111K87n115l663j315K83L234J78k128J564m584K089N035k208
$$ -1269 -2411 -1300 -1013 -6128 -9791 -11106 -10823 -7589 -7411 -9539 -7975 -12559 -10470 -5435 -7643
22021g643k34J464P997K129j719R83K145l5l413p002k869j82N131O080Q60l766
$$ -7643 -7877 -6413 1584 3713 1994 2977 5122 5087 1674 -5328 -8197 -8379 -3248 2832 3692 -74
22005g4K204o304K771N35n723K741k636l263k307k738k10j159Q976N575K048n474
$$ -74 2130 -4174 -1403 -868 -6591 -3850 -6486 -9749 -12056 -14794 -15004 -16163 -7187 -1612 436 -5038
21989e038j247M422l099r79K282L059P775p20m923J625j1983j2763Q358P524N823
$$ -5038 -6285 -1863 -4962 -5941 -3659 -600 7175 6455 1532 3157 -8826 -21589 -13231 -5707 116
21974A16O370L606m974j536K137k694K77n223P859J060p103j59N724J304K131
$$ 116 6486 10092 5118 3582 5719 3025 3302 -1921 5938 6998 -105 -264 5460 6764 8895
21959H895p425n214R05j760k492l749o579j577K612L430K134M181j831k806L758
$$ 8895 1470 -3744 -2839 -4599 -7091 -10840 -17419 -18996 -16384 -12954 -10820 -6639 -8470 -11276 -7518
21944g518K409K398l66J843P91k034p24j28j718k00N282k125n353o603P159P80
$$ -7518 -5109 -2711 -3077 -1234 -443 -2477 -3201 -3329 -5047 -5247 35 -2090 -7443 -14046 -6887 -6107
21928f107l788J527M154j940l02j004L564L199K084Q22j261J23m94o571K623n223
$$ -6107 -9895 -8368 -4214 -6154 -6456 -7460 -3896 -697 1387 2209 948 1071 577 -5994 -3371 -8594
21912h594M58n415o062N122j145O952R329k138l114J005j212m651L180K377n927
$$ -8594 -8136 -13551 -19613 -14491 -15636 -8684 645 -1493 -4607 -3602 -4814 -9465 -6285 -3908 -9835
21897i835K17L960J300J526k309O08Q741L629M412o221j121j744p662n253N23
$$ -9835 -9618 -5658 -4358 -2832 -5141 -4533 4208 7837 12249 6028 4907 3163 -4499 -9752 -9229
21882i229L03K863j388N671k334o150P64k347L087M991j840R92J981P347K799
$$ -9229 -8926 -6063 -7451 -1780 -4114 -10264 -9500 -11847 -8760 -3769 -5609 -4617 -2636 4711 7510
21867G510q923o582J480o57k004J099O78K136o29k244J083m397J93L204O879L276
$$ 7510 -1413 -7995 -6515 -7172 -9176 -8077 -7399 -5263 -5892 -8136 -7053 -11450 -11257 -8053 -1174 2102
21851B102L409J549m277o831k823N463k157l936O31P114J111L69j154M479j238
$$ 2102 5511 7060 2783 -4048 -6871 -1408 -3565 -7501 -6870 244 1355 1724 570 5049 3811
21836C811l608K709l78k790P029N591j823m392J21j67p858n47O122o870n851O228
$$ 3811 203 2912 2534 -256 6773 12364 10541 6149 6270 6103 -1755 -2302 3820 -3050 -8901 -2673
21820b673K916J55K754K9k519J210k598J085m422L875J087j938J10K447o242m785
$$ -2673 243 398 3152 3181 662 1872 -726 359 -4063 -188 899 -1039 -929 1518 -4724 -9509
21804i509J949J602l829J718N219j533p494N833N934J0524o20n145O58j563n051
$$ -9509 -7560 -5958 -9787 -8069 -2850 -4383 -11877 -6044 -110 10414 9794 4649 5307 3744 -1307
21789a307m597o692L48j072Q270L63J013K146L503m65p620J809M044m446n648
$$ -1307 -5904 -12596 -12248 -13320 -5050 -4687 -3674 -1528 1975 1510 -6110 -4301 -257 -4703 -10351
21774a0351L158K743j005l821K451L142k234K05L734j0394P128J0373k708k019
$$ -10351 -7193 -4450 -5455 -9276 -6825 -3683 -5917 -5712 -1978 -12372 -5244 5129 2421 402
21760D02j253l790L537m83k953N055L741j983q040o592k149K292R578Q509k1K755
$$ 402 -851 -4641 -1104 -1587 -4540 515 4256 2273 -5767 -12359 -14508 -12216 -2638 5871 5850 8605
21744H605m778j098M103n090p510r7Q179j693p904m9K386K042J0248k858m399
$$ 8605 3827 2729 6832 1742 -5768 -5865 2314 621 -7283 -7332 -4946 -2904 7344 4486 87
21729H7l616m065o596O371P088K54k813L445j594l065j275J797N033K38J717k94
$$ 87 -3529 -7594 -14190 -7819 -731 -477 -3290 155 -1439 -4504 -5779 -3982 1051 1289 3006 2712
21713B712q112j82J615J92lj29l656L905k209j622O490L852M345P55k209J097
$$ 2712 -5400 -5582 -3967 -3775 -3778 -3907 -7563 -3658 -5867 -7489 -999 2853 7198 7953 5744 6841
21697F841L57m482n549O82l370j397K332n230L894P638l89L051l025k881n893
$$ 6841 7198 2716 -2833 -2151 -5521 -6918 -4586 -9816 -5922 1716 1327 4378 1353 -1528 -7421
21682g421k979O849L153j928m61l67n135L879K597m941l61P01n761M463J1173
$$ -7421 -10400 -3551 -398 -2326 -2787 -3154 -8289 -4410 -1813 -6754 -7115 -6414 -12175 -7712 3461
21667C461l42n172N846J514n649k657J484k460J170%K042L386L636L925m55l103
$$ 3461 3119 -2053 3793 5307 -342 -2999 -1515 -3975 -2805 -2805 -763 2623 6259 10184 9729 6626
21651F626l919l125n826o205k242K634M902K932n013L018L654K59O777k206j617
$$ 6626 2707 -418 -6244 -12449 -14691 -12057 -7155 -4223 -9236 -6218 -2564 -2305 4472 2266 649
21636F49k395p05N899K944p313n25n639m567Q413J121J932m349j443J672K089
$$ 649 -1746 -2451 3448 6392 -921 -1446 -7085 -11652 -3239 -2118 -186 -4535 -5978 -4306 -2217
21621b217K342J888L771j224r898r061K450K014N0K579k879r047P696P866k725
$$ -2217 125 2013 5784 4560 -5338 -14399 -11949 -9935 -9885 -7306 -10185 -19232 -11536 -3670 -6395
21606f395J261l96l591M519P401j830m049q37m001j048K049p33M278M581l302
$$ -6395 -5134 -5530 -9121 -4602 2799 969 -3080 -3917 -7918 -8966 -6917 -7650 -3372 1209 -2093
21591b093K87L40J356K836J788q175l871L24K151K836L194l770l204k3j448K312
$$ -2093 -1806 -1466 -110 2726 4514 -3661 -7532 -7208 -5057 -2221 973 -2797 -6001 -6024 -7472 -5160
21575e160k897n156m303N173N951L591M966o06n591k979j764n972j065L987O482
$$ -5160 -8057 -13213 -17516 -12343 -6392 -2801 2165 1559 -4032 -7011 -8775 -14747 -15812 -11825 -5343
21560e343k528N565J676k500p42k97l758q859L299L715J0333m160k05N221R108
$$ -5343 -7871 -2306 -630 -3130 -3872 -4169 -7927 -16786 -13487 -9772 561 -3599 -3804 1417 10525
21545A0525p90j498m337p82j781J10M64o516K862O443K573j683j399o762l228
$$ 10525 9735 8237 3900 3118 1337 1447 1911 -4605 -1743 4700 7273 5590 4191 -2571 -5799
21530e799M461M283j635o104L441Q33o37k322o59j959k962m11N268N78j049K594
$$ -5799 -1338 2945 1310 -4794 -1353 -520 -1157 -3479 -4138 -6097 -9059 -9470 -4202 -3624 -4673 -2079
21514b079K10j412j961j992K817j233l589K855M4k389L638K822m062m403n134
$$ -2079 -1869 -3281 -5242 -7234 -4417 -5650 -9239 -6384 -6340 -8729 -5091 -2269 -6331 -10734 -15868
21499a5868J64J458R103M178O04o20k180j386j92j476K151O95j473M721L709k786
$$ -15868 -15704 -14246 -5143 -965 -361 -981 -3161 -4547 -4739 -6215 -4064 -3369 -4842 -121 3588 802
21483H02k340K266j639n380j859L211k87M086J555o392R64L415K171m338k113
$$ 802 -1538 728 -911 -6291 -8150 -4939 -5226 -1140 415 -5977 -5013 -1598 573 -3765 -5878
21468e878l36N989R40j383o015K391J175K058L114M857n740p877m75L650l798
$$ -5878 -6214 -225 715 -668 -6683 -4292 -3117 -1059 2055 6912 1172 -6705 -7180 -3530 -7328
21453g328l589JK952O320j669l275KK525K397R79n473k183L728k487N600J602
$$ -7328 -10917 -10916 -7964 -1644 -3313 -6588 -6586 -4061 -1664 -685 -6158 -8341 -4613 -7100 -1500 102
21437A02k400N961N034j0815q189N730j282j403n539n62o57M038N297l79o466
$$ 102 -2298 3663 8697 -2118 -10307 -4577 -5859 -7262 -12801 -13363 -14020 -9982 -4685 -5064 -11530
21422a1530p6l363j881J586M566J41n382L259J469o0N206N874L892J917J111k698
$$ -11530 -11606 -14969 -16850 -15264 -10698 -10557 -15939 -12680 -11211 -11271 -6065 -191 3701 5618 6729 4031
21406D031m469o99K766O14N176J322j1026j0591k514L194n52O723Q097L227l38
$$ 4031 -438 -1137 1629 2243 7419 8741 -2285 -12876 -15390 -12196 -12748 -6025 2072 5299 4961
21391D961k2k772k394q929n560N18M766Q798Q075J190j530r835K781M126j705
$$ 4961 4939 2167 -227 -9156 -14716 -14198 -9432 -634 7441 8631 7101 -2734 47 4173 2468
21376B468J931n375l658m068k750J363L888l99J586m543k250K696k446j190N57
$$ 2468 4399 -976 -4634 -8702 -11452 -10089 -6201 -6600 -5014 -9557 -11807 -9111 -11557 -12747 -12190
21361a2190j157N42R755n54k065m971L462L294j840l388j973r03Q84R250k122
$$ -12190 -13347 -12805 -3050 -3604 -5669 -10640 -7178 -3884 -5724 -9112 -11085 -11988 -11104 -1854 -3976
21346c976m064Q18L30p92O590j187q11J209O254N744p384m812n172M834o260k160
$$ -3976 -8040 -7222 -6892 -7684 -1094 -2281 -3092 -1883 4371 10115 2731 -2081 -7253 -2419 -8679 -10839
21330a0839j560p257L964R970J326o416J018N670M559l54l96K859J375j581K028
$$ -10839 -12399 -19656 -15692 -5722 -4396 -10812 -9794 -4124 435 81 -315 2544 3919 2338 4366
21315D366j0l34j729M189Q759Q63j58p562r836j270m243O88l697P435O326p169
$$ 4366 4356 4022 2293 6482 15241 16104 15946 8384 -1452 -2722 -6965 -6277 -9974 -2539 3787 -3382
21299c382n716K704J971l442p08K669O512o550n134j611L933N461R30nO014N025
$$ -3382 -9098 -6394 -4423 -7865 -8573 -5904 608 -5942 -11076 -12687 -8754 -3293 -2363 -2368 3646 8671
21283H671l669k864M2J277K17r497o571L532O694J368k144r23L915L339J08M392
$$ 8671 5002 2138 2180 3457 3674 -5823 -12394 -8862 -2168 -800 -2944 -3867 48 3387 3495 7887
21267G887k037o504m069p01K76M116k180L235m588j679Q56l566l678L872P042
$$ 7887 5850 -654 -4723 -5424 -5148 -1032 -3212 23 -4565 -6244 -5388 -8954 -12632 -8760 -1718
21252a718M146q012l303J186m81J799M446L487O86n479o364j939P73Q886M294
$$ -1718 2428 -5584 -8887 -7701 -8182 -6383 -1937 1550 2236 -3243 -9607 -11546 -10773 -1887 2407
21237B407K57m097k347L835j931n96M65k539l557K730p75O825j205r183l794P49
$$ 2407 2664 -1433 -3780 55 -1876 -2472 -2007 -4546 -8103 -5373 -6148 677 -528 -9711 -13505 -12756
21221a2756J051J0304J2637N667l783p128q1m398o86J201j174m715J570K878j997
$$ -12756 -11705 -1401 11236 16903 13120 5992 5911 1513 827 2028 854 -3861 -2291 587 -1410
21206a410k540j071p376K847L592N77M215k64o057n28K285k579N94n430L655N845
$$ -1410 -3950 -5021 -12397 -9550 -5958 -5381 -1166 -1430 -7487 -8015 -5730 -8309 -7715 -13145 -9490 -3645
21190c645m496l28P510J0532o245q357l752k446K890p52k118M900K806P434J090
$$ -3645 -8141 -8469 -959 9573 3328 -5029 -8781 -11227 -8337 -9089 -11207 -6307 -3501 3933 5023
21175E023p878p267K62N395K268k732J20p31O16K175j572n66m811M22P904O252
$$ 5023 -2855 -10122 -9860 -4465 -2197 -4929 -4809 -5540 -4924 -2749 -4321 -4887 -9698 -9276 -1372 4880
21159D880j624m669m436L46O297M033J321q398J532K078N538j415J46p064m756
$$ 4880 3256 -1413 -5849 -5503 794 4827 6148 -2250 -718 1360 6898 5483 5629 -1435 -6191
21144f191J185M91L069M758k571l670j650n255n62n873J106Q158L726K282L059
$$ -6191 -5006 -4515 -1446 3312 741 -2929 -4579 -9834 -10396 -16269 -15163 -7005 -3279 -997 2062
21129B062M638L494l692j0701K084l377j993L132M428q56j356l631m30K89J502
$$ 2062 6700 10194 6502 -4199 -2115 -5492 -7485 -4353 75 -781 -2137 -5768 -6198 -5909 -4407
21114d407n4K511J973k362k032K923o467j452K466J495O575M892k718n317L162
$$ -4407 -4461 -1950 23 -2339 -4371 -1448 -7915 -9367 -6901 -5406 1169 6061 3343 -1974 1188
21099A188N135k401m608j085l02m049J36K686O55P475j800j06n207j623L983r37
$$ 1188 6323 3922 -686 -1771 -2073 -6122 -5986 -3300 -2645 4830 3030 2924 -2283 -3906 77 -860
21083h60M414n318l737J509j259L861l524R00J828l629k896J832N269M948k753
$$ -860 3554 -1764 -5501 -3992 -5251 -1390 -4914 -4014 -2186 -5815 -8711 -6879 -1610 3338 585
21068E85k385L651j610q522j160M618O807N244n024n422o798O04L627j686j053
$$ 585 -1800 1851 241 -8281 -9441 -4823 1984 7228 2204 -3218 -10016 -9412 -5785 -7471 -8524
21053h524K22j359L91L695K021j610k805k618k269k132O34J544L618L910O002
$$ -8524 -8302 -9661 -9270 -5575 -3554 -5164 -7969 -10587 -12856 -14988 -14354 -12810 -9192 -5282 720
21038G20M002o603n380J454L699R47k899m370o507m603J048O341P820K577n134
$$ 720 4722 -1881 -7261 -5807 -2108 -1161 -4060 -8430 -14937 -19540 -18492 -12151 -4331 -1754 -6888
21023f888L27m90K054j734k211L035j357l506j72M69N467P788l068P7o92j359
$$ -6888 -6561 -7051 -4997 -6731 -8942 -5907 -7264 -10770 -10942 -10473 -5006 2782 -286 -209 -901 -2260
21007b260j606K87j165L166R89m71N961o844r754m55K214O473n297m978j185K854
$$ -2260 -3866 -3579 -4744 -1578 -589 -1060 4901 -1943 -11697 -12152 -9938 -3465 -8762 -13740 -14925 -12071
20991a2071K562J321M396N658k8L914j872k956m333l156j990K049J955p829q173
$$ -12071 -9509 -8188 -3792 1866 1838 5752 3880 924 -3409 -6565 -8555 -6506 -4551 -12380 -20553
20976b0553N309R322J53J135k404q133K85O103J265N147K106M124R13L46k681
$$ -20553 -15244 -5922 -5769 -4634 -7038 -15171 -14886 -8783 -7518 -2371 -265 3859 4772 5118 2437
20961B437j453l790p73l559K281N0q1j909l111J59m283p37L830j378l508L399
$$ 2437 984 -2806 -3579 -7138 -4857 -4807 -4888 -6797 -9908 -9749 -14032 -14769 -10939 -12317 -15825 -12426
20945a2426J1083O615L206p655n79n105p870j970N414k712j061k123M140L426
$$ -12426 -1343 5272 8478 823 244 -4861 -12731 -14701 -9287 -11999 -13060 -15183 -11043 -7617
20931g617p07N383j499o877L742L59J024j748N451l459J794l668J220L188L145
$$ -7617 -8324 -2941 -4440 -11317 -7575 -7216 -6192 -7940 -2489 -5948 -4154 -7822 -6602 -3414 -269
20916b69o231j232j963K284O348k938l902K486P78N944K331j290l364n026m78
$$ -269 -6500 -7732 -9695 -7411 -1063 -4001 -7903 -5417 -4639 1305 3636 2346 -1018 -6044 -6522
20901f522J269L466J966K66k198j492J765j140m342L357J625q948Q04O997n729
$$ -6522 -5253 -1787 179 445 -1753 -3245 -1480 -2620 -6962 -3605 -1980 -10928 -10124 -3127 -8856
20886h856j1439J071N041L601K019p8O867J586k672L730K195L296j555n295O222
$$ -8856 -20295 -19224 -14183 -10582 -8563 -8641 -1774 -188 -2860 870 3065 6361 4806 -489 5733
20871E733L12m755p585R06k822j373J999o584m259j187m691J420J090L992J0137
$$ 5733 6045 1290 -6295 -5389 -8211 -9584 -7585 -14169 -18428 -19615 -24306 -22886 -21796 -17804 -7667
20856g667K161O97l41j275m234O35L21j795k02Q20N131N331o58K15o306J367P20
$$ -7667 -5506 -4809 -5150 -6425 -10659 -10024 -9703 -11498 -11700 -10880 -5749 -418 -1076 -861 -7167 -5800 -5080
20839e080K665K809k572K437P845K672K554l294p298o466l860K417K500K086j062
$$ -5080 -2415 394 -2178 259 8104 10776 13330 10036 2738 -3728 -7588 -5171 -2671 -585 -1647
20824a647L13L067K719q331j3280o61O971K658M675N208J325k164o179j472m750
$$ -1647 -1334 1733 4452 -3879 -17159 -17820 -10849 -8191 -3516 1692 3017 853 -5326 -6798 -11548
20809a1548k149M217j058p83J334j200j904j947P496N835l63l883m985m978j04
$$ -11548 -13697 -9480 -10538 -11321 -9987 -11187 -13091 -15038 -7542 -1707 -2070 -5953 -10938 -15916 -16020
20794a6020M050K570l651J584M558O886J321j067j033M502K79j732R57k399l926
$$ -16020 -11970 -9400 -13051 -11467 -6909 -23 1298 231 -802 3700 3979 2247 3204 805 -3121
20779c121O2M287n18J311N538l570o943M389n64M712M063m59J032m732r183m593
$$ -3121 -3059 1228 710 2021 7559 3989 -2954 1435 871 5583 9646 9187 10219 5487 -3696 -8289
20763h289J027p52J46L973j427L21M435O068P60n503q616l032J360J590l77m162
$$ -8289 -7262 -8014 -7868 -3895 -5322 -5001 -566 5502 6262 759 -7857 -10889 -9529 -7939 -8316 -12478
20747a2478R12L984L712N822n510r285L755K405K952L324j147m41J491n25l959
$$ -12478 -11566 -7582 -3870 1952 -3558 -12843 -9088 -6683 -3731 -407 -1554 -1995 -504 -1029 -4988
20732d988M99J350J2300M504m252l478L909m642n441m407l76k39J565J06j822
$$ -4988 -4489 -3139 9161 13665 9413 5935 9844 5202 -239 -4646 -5022 -5261 -3696 -3590 -5412
20717e412J211l339o431N71L53M654M764L416k337n682o089L563j478L886L765
$$ -5412 -4201 -7540 -13971 -13400 -13047 -8393 -3629 -213 -2550 -8232 -14321 -10758 -12236 -8350 -4585
20702d585N542J0K038K894r629o629J435Q071P97r068j32l017n703N807K684l582
$$ -4585 957 967 3005 5899 -3730 -10359 -8924 -853 -56 -9124 -9256 -12273 -17976 -12169 -9485 -13067
20686a3067q07J060K540M87j385o53L00N866K737L208O698m055q457L525N817
$$ -13067 -13874 -12814 -10274 -9787 -11172 -11825 -11525 -5659 -2922 286 6984 2929 -5528 -2003 3814
20671C814L460k014p11o013J790O55m653L51O488J311J552J932n458M330J743
$$ 3814 7274 5260 4549 -1464 326 981 -3672 -3321 3167 4478 6030 7962 2504 6834 8577
20656H577k68n392j814N234K036n028j234n126n119p318k061M693Q511L875n000
$$ 8577 8309 2917 1103 6337 8373 3345 2111 -3015 -8134 -15452 -17513 -12820 -4309 -434 -5434
20641e434n51J266O71L809j250N04J679K113m713K38j1236q165K764L154O457
$$ -5434 -5985 -4719 -4048 -239 -1489 -985 694 2807 -1906 -1668 -12904 -21069 -18305 -15151 -8694
20626h694M801p208K523k840l28K748K764P39J604J458j640k855Q511J244R74
$$ -8694 -3893 -11101 -8578 -11418 -11746 -8998 -6234 -5495 -3891 -2433 -4073 -6928 1583 2827 3801
20611C801m818l907k726J360j671k023k354n221M368Q425N166N73q479P97N073
$$ 3801 -1017 -4924 -7650 -6290 -7961 -9984 -12338 -17559 -13191 -4766 400 973 -7506 -6709 -1636
20596a636p108m225r20m71O983N044M440L4m401l385L168l483m323L988L543m780
$$ -1636 -8744 -12969 -13889 -14360 -7377 -2333 2107 2141 -2260 -5645 -2477 -5960 -10283 -6295 -2752 -7532
20580g532L728l774M601L406l675o061L00L414j130J777K330M950q111k974J0048
$$ -7532 -3804 -7578 -2977 429 -3246 -9307 -9007 -5593 -6723 -4946 -2616 2334 -5777 -8751 1297
20565A297O261o11n072r479o927k672J375K199L903M149R36k071j376j048r83
$$ 1297 7558 6947 1875 -7604 -14531 -17203 -15828 -13629 -9726 -5577 -4641 -6712 -8088 -9136 -10119
20550a0119K626L015j95N381M416J547j446k574o334r02J0085L570k654m029J347
$$ -10119 -7493 -4478 -4673 708 5124 6671 5225 2651 -3683 -4585 5500 9070 6416 2387 3734
20535C734J441n925j128n4r541J731j576m066P303K014K153j097P95j294K397
$$ 3734 5175 -750 -1878 -1932 -11473 -9742 -11318 -15384 -8081 -6067 -3914 -5011 -4216 -5510 -3113
20520c113Q422j900m194o958L761K967K01j025K048P000r87k737J28m737rK596
$$ -3113 5309 3409 -785 -7743 -3982 -1015 -814 -1839 209 7209 6222 3485 3613 -1124 -1133 1463
20504A463k951P46j197m003K633K19p943o351j203N812M813j86L341Q758P511
$$ 1463 -1488 -742 -1939 -5942 -3309 -3090 -11033 -17384 -18587 -12775 -7962 -8148 -4807 3951 11462
20489A1462q9p180Q14K402p208m386o1O007p749j194J094q887P49J443O274N359
$$ 11462 11373 4193 5007 7409 201 -4185 -4246 1761 -5988 -7182 -6088 -14975 -14226 -12783 -6509 -1150
20473a150M305L127k0m72Q14o78j01q139o222N036P474R81k182q784r916K953
$$ -1150 3155 6282 6262 5790 6604 5926 5825 -2314 -8536 -3500 3974 4955 2773 -6011 -15927 -12974
20457a2974L635M011O15m043L602J288J791K464L438o176l687L397L170N827j310
$$ -12974 -9339 -5328 -4713 -8756 -5154 -3866 -2075 389 3827 -2349 -6036 -2639 531 6358 5048
20442E048o795j409M024o990q435k366P202M949O527n82n102K538p97L628M306
$$ 5048 -1747 -3156 868 -6122 -14557 -16923 -9721 -4772 1755 1173 -3929 -1391 -2188 1440 5746
20427E746Q3m171n984l753O529N259m25l625o77L244N068K240p653k397l02n654
$$ 5746 5829 1658 -4326 -8079 -1550 3709 3284 -341 -1018 2226 7294 9534 1881 -516 -818 -6472
20411f472L292N050K531O43O58m316J572K239l164k117J220k271m129k860j195
$$ -6472 -3180 1870 4401 5044 5702 1386 2958 5197 2033 -84 1136 -1135 -5264 -8124 -9319
20396i319O726K935o932J251Q379L792o926n6J105l560q16N476k901o460l599
$$ -9319 -2593 342 -6590 -5339 3040 6832 -94 -150 955 -2605 -3421 2055 -846 -7306 -10905
20381a0905J530j021M259R222M29m684k151k670l12j226J195j058o22J514L608
$$ -10905 -9375 -10396 -6137 3085 3514 -1170 -3321 -5991 -6303 -7529 -6334 -7392 -8014 -6500 -2892
20366b892L373P176L810K177M179l267j1506j73k13j483j534N730L134L506k442
$$ -2892 481 7657 11467 13644 17823 14556 3050 2877 2664 1181 -353 5377 8511 12017 9575
20351I575n689n39N126q80m489l443j697l174p320K234M521M427M068O13n94O175
$$ 9575 3886 3347 8473 7593 3104 -339 -2036 -5210 -12530 -10296 -5775 -1348 2720 3333 2739 8914
20335H914j356m298j675m829K620q58N047k561m163k568n94J73P28O346K75q72
$$ 8914 7558 3260 1585 -3244 -624 -1482 3565 1004 -3159 -5727 -6321 -6148 -5420 926 1201 329
20319C29o075n36O350Q16L373n90j169o625K815K355K282J785m600O478J070Q40
$$ 329 -5746 -6282 68 884 4257 3667 2498 -4127 -1312 1043 3325 5110 510 6988 8058 8898
20303H898j399k455j103M586j26M720K993J196m686n341j578k232k030l796n506
$$ 8898 7499 5044 3941 8527 8401 13121 16114 17310 12624 7283 5705 3473 1443 -2353 -7859
20288g859k622P762Q745L323M551l914n434p225l693J362j505N10m632m569K636
$$ -7859 -10481 -2719 6026 9349 13900 9986 4552 -2673 -6366 -5004 -6509 -5999 -10631 -15200 -12564
20273a2564K538L544J940N455K659r176j649k343J529L41K753J763k319J444k069
$$ -12564 -10026 -6482 -4542 913 3572 -5604 -7253 -9596 -8067 -7726 -4973 -3210 -5529 -4085 -6154
20258f154q56K705k808K372N015l990j934n18N365N423j133p486L87j887n453
$$ -6154 -7010 -4305 -7113 -4741 274 -3716 -5650 -6168 -803 4620 3487 -3999 -3612 -5499 -10952
20243a0952M656M161m559J470K051n695n013J203J1208L074r79l826L636K573
$$ -10952 -6296 -2135 -6694 -5224 -3173 -8868 -13881 -12678 -1470 1604 625 -3201 435 3008
20229C008j810r66n645L181M461j957o87q80p446p03j571l566j239N197M396N563
$$ 3008 1198 232 -5413 -2232 2229 272 -415 -1295 -8741 -9444 -11015 -14581 -15820 -10623 -6227 -664
20213f64m013o10j619l899n72P495L396R76M180p600O98O68r724K533P127N604
$$ -664 -4677 -5287 -6906 -10805 -11377 -3882 -486 490 4670 -2930 -2232 -1564 -11288 -8755 -1628 3976
20197C976o678q16k277M16j047j713K115N055l398J418M643K382k515p113J449
$$ 3976 -2702 -3518 -5795 -5379 -6426 -8139 -6024 -969 -4367 -2949 1694 4076 1561 -5552 -4103
20182d103J459L854j246k712L479k9q441k760L502Q940M257j471J927o54k940
$$ -4103 -2644 1210 -36 -2748 731 702 -7739 -10499 -6997 1943 6200 4729 6656 6002 3062
20167C062k506m681k750J609L359j69M174J779j384M118k30l123n689K775L576
$$ 3062 556 -4125 -6875 -5266 -1907 -2076 2098 3877 2493 6611 6381 3258 -2431 344 3920
20152C920m818q019l864M497P612L991J962j473o251n843k962M953J905k0Q762
$$ 3920 -898 -8917 -12781 -8284 -672 3319 5281 3808 -2443 -8286 -11248 -6295 -4390 -4410 4352
20137D352k41j476m414R59k65O079O411k659K991j709L09o818n506L737P94m696
$$ 4352 4111 2635 -1779 -820 -1085 4994 11405 8746 11737 10028 10337 3519 -1987 1750 2544 -2152
20121b152M846j717R5P345L751j906o987m440J034K810P543j126l242M06N134
$$ -2152 2694 977 1072 8417 12168 10262 3275 -1165 -131 2679 10222 9096 5854 6260 11394
20106A1394n532n887L564k386j816N457L47m686L302J546l999j020j447J181j823
$$ 11394 5862 -25 3539 1153 -663 4794 5141 455 3757 5303 1304 284 -1163 18 -1805
20091a805J763k263k16L528K34p80Q00J935K532k323m676k283j503o924R91J296
$$ -1805 -42 -2305 -2521 1007 1241 461 1261 3196 5728 3405 -1271 -3554 -5057 -11981 -10990 -9694
20075i694K032k596j426O949j314Kj234l79M987K699M6M489m796n205J012L349
$$ -9694 -7662 -10258 -11684 -4735 -6049 -6047 -7281 -7660 -2673 26 72 4561 -235 -5440 -4428 -1079
20059a079m68O11K331m081j324O039m98j417J2o21l231k830r624Q96N961l318
$$ -1079 -1547 -936 1395 -2686 -4010 2029 1531 114 126 -495 -3726 -6556 -16180 -15284 -9323 -12641
20043a2641P40R928Q673k610m784o965N38j444O885l06l125m671J409J2097L977
$$ -12641 -11901 -1973 6700 4090 -694 -7659 -7121 -8565 -1680 -1986 -5111 -9782 -8373 3724 7701
20028G701k546l086j695k303j332L740L327m9K488o059r930j765P502R228K805
$$ 7701 5155 2069 374 -1929 -3261 479 3806 3757 6245 186 -9744 -11509 -4007 5221 8026
20013H026M961j932n1N38k849k951k599Q83p67l23K279Q5K031l192k581K040k849
$$ 8026 12987 11055 11004 11542 8693 5742 3143 4026 3259 2936 5215 5300 7331 4139 1558 3598 749
19996G49K921k01kQ78j441l063l239Q860P486l346j602M121j425r021n914L078
$$ 749 3670 3469 3467 4345 2904 -159 -3398 5462 12948 9602 8000 12121 10696 1675 -4239 -1161
19980a161P965P089L11j0014m845k247r52l266j440j480K852N994L218M593M671
$$ -1161 6804 13893 14204 4190 -655 -2902 -3854 -7120 -8560 -10040 -7188 -1194 2024 6617 11288
19965A1288j1570k449R672N833M31O03j846o59K904J352P057L63M971K016J423
$$ 11288 -282 -2731 6941 12774 13205 13808 11962 11303 14207 15559 22616 22979 27950 29966 31389
19950C1389O383Q854L839j160n639o63N63k859o846J537j65r70J823L56m268j190
$$ 31389 37772 46626 50465 49305 43666 43003 43566 40707 33861 35398 35233 34263 36086 36442 32174 30984
19934C0984Q83q628j2001p840J923J820N631J723J652m53p503j612p46m209Q323
$$ 30984 31867 23239 11238 3398 5321 7141 12772 14495 16147 15694 8191 6579 5833 1624 9947
19919I947M376n637p701o680M670Q175r17m268l311j1K972R657J93r266l516J014
$$ 9947 14323 8686 985 -5695 -1025 7150 6233 1965 -1346 -1357 1615 11272 11465 2199 -1317 -303
19903c03K04K598K745K424K19L47l335k32K560K332l575m444N831n039q156j748
$$ -303 -99 2499 5244 7668 7887 8234 4899 4667 7227 9559 5984 1540 7371 2332 -5824 -7572
19887g572M537L980P591O788N705N658p652q796n556n411J339P035O96o626j1830
$$ -7572 -3035 945 8536 15324 21029 26687 19035 10239 4683 -728 611 7646 8342 1716 -10114
19872a0114M340P600O610l91m510n330q917o423N154J0615M629j226M110L094
$$ -10114 -5774 1826 8436 8045 3535 -1795 -10712 -17135 -11981 -1366 3263 2037 6147 9241
19858I241j548L68n79l677l894K908j068k144R594O872n439l977N415M840L1k897
$$ 9241 7693 8061 7482 3805 -89 2819 1751 -393 9201 16073 10634 6657 12072 16912 16943 14046
19842A4046k681p231j0427j523O452j51K42n84q15N752j079r765p981O799J2096
$$ 14046 11365 4134 -6293 -7816 -1364 -1515 -1273 -1857 -2672 3080 2001 -7764 -15745 -8946 3150
19827C150N298k468L908j747r683n703q52Q550O446R033j83q844r913q04K566
$$ 3150 8448 5980 9888 8141 -1542 -7245 -8097 453 6899 15932 15749 6905 -3008 -3812 -1246
19812a246M389M325L199j721m260k646L675k667K956J657N405q899q255M748L750
$$ -1246 3143 7468 10667 8946 4686 2040 5715 3048 6004 7661 13066 4167 -4088 660 4410
19797D410l81N012j816k864j191j481J409k83J547k628j299M283R38l449l118
$$ 4410 4029 9041 7225 4361 3170 1689 3098 2815 4362 1734 435 4718 5656 2207 -911
19782i11r3Q80l310j5J1246K565j3517o027j311P896j625o237l254K845k73k070
$$ -911 -1004 -124 -3434 -3449 7797 10362 -3155 -9182 -10493 -2597 -4222 -10459 -13713 -10868 -11141 -13211
19766a3211R869J0775M450K488m424k914K500k231L8Q5J265J03k377p256l80Q858
$$ -13211 -3342 7433 11883 14371 9947 7033 9533 7302 7340 7425 8690 8793 6416 -840 -1220 7638
19750G638Q01j0637j602K953L907K36q35m044J217L587M166O2m861J143J519m258
$$ 7638 8439 -2198 -3800 -847 3060 3296 2461 -1583 -366 3221 7387 7449 2588 3731 5250 992
19734I92j748J18k948k978L106J708l499Q704P872K463m299q912k383M369n09
$$ 992 -756 -638 -3586 -6564 -3458 -1750 -5249 3455 11327 13790 9491 579 -1804 2565 2056
19719B056J997P926J825n09l738j923J99j845L020P80m688J956K252K183m890
$$ 2056 4053 11979 13804 13295 9557 7634 7833 5988 9008 9788 5100 7056 9308 11491 6601
19704F601R85N408j716k576L421p73j421j693l651n896j382n43j158R46K846N515
$$ 6601 7586 12994 11278 8702 12123 11350 9929 8236 4585 -1311 -2693 -3236 -4394 -3448 -602 4913
19688D913J912j36K099Q81l185l737q477K749o70J752K260O767M345o220J701
$$ 4913 6825 6689 8788 9669 6484 2747 -5730 -2981 -3651 -1899 361 7128 11473 5253 6954
19673F954K537k587m115l68J052k297L492M75m687K448j023j1618n297L169L705
$$ 6954 9491 6904 2789 2421 3473 1176 4668 5143 456 2904 1881 -9737 -15034 -11865 -8160
19658h160N697O023O124j726p025j513m02k652L791N111N049r133n230j692L406
$$ -8160 -2463 3560 9684 7958 933 -580 -982 -3634 157 5268 10317 1184 -4046 -5738 -2332
19643b332L509L105p846j788R098L498j1293L038R86j368K368L513O351Q8j268
$$ -2332 1177 4282 -3564 -5352 3746 7244 -4049 -1011 -25 -1393 975 4488 10839 10927 9659
19628I659o401k182L225N41K955K376j609p978M315N523P1J588J010j803m313
$$ 9659 3258 1076 4301 4842 7797 10173 8564 586 4901 10424 10495 12083 13093 11290 6977
19613F977J793J736k146k271r42P58m545M670Q320l38n016J704p819n345p12N495
$$ 6977 8770 10506 8360 6089 5147 5905 1360 6030 14350 14012 8996 10700 2881 -2464 -3176 2319
19597B319M021k009j601l22Q650l673o968k567K363k9k894l314J52N846J319k51
$$ 2319 6340 4331 2730 2408 11058 7385 417 -2150 213 184 -2710 -6024 -5872 -26 1293 1042
19581A042j358L516n86L462m09q922j417L411l926R26o944J448L722L242O966
$$ 1042 -316 3200 2614 6076 5667 -3255 -4672 -1261 -5187 -4261 -11205 -9757 -6035 -2793 4173
19566D173P262l501l601J633L470j423k618k949R41P631K109l692k743k717k436
$$ 4173 11435 7934 4333 5966 9436 8013 5395 2446 3387 11018 13127 9435 6692 3975 1539
19551A539m340K567N49j039L232m215k64K49P867Q934k822p276m9j85R44K265
$$ 1539 -2801 -234 315 -724 2508 -1707 -1971 -1722 6145 15079 12257 4981 4932 4747 5691 7956
19535G956k380k365n21J421M537K997L350r2m5j0729j95N215k1n304L920K52l102
$$ 7956 5576 3211 2690 4111 8648 11645 14995 14903 14858 4129 3934 9149 9128 3824 7744 7996 4894
19518D894j61K956p150o494j046K31m876K933R702m996j165K990N288J912p96
$$ 4894 4733 7689 539 -5955 -7001 -6770 -11646 -8713 989 -4007 -5172 -2182 3106 5018 4222
19503D222L737J727O41K292j635n127m695M618J719k601J803j534l55p282o466
$$ 4222 7959 9686 10327 12619 10984 5857 1162 5780 7499 4898 6701 5167 4812 -2470 -8936
19488h936O413N291M738P12L65O39j1171k385N112J23k628L504k403n83J768N636
$$ -8936 -2523 2768 7506 8218 8583 9222 -1949 -4334 778 901 -1727 1777 -626 -1209 559 6195
19472F195J122k453M031Q497l757k387m357o444K803L114l047L537o283m417J486
$$ 6195 7317 4864 8895 17392 13635 11248 6891 447 3250 6364 3317 6854 571 -3846 -2360
19457b360j480J365N35L375J293j571k685j705j425O597Q081n26j2704k48O598
$$ -2360 -3840 -2475 -1940 1435 2728 1157 -1528 -3233 -4658 1939 10020 9494 -3210 -3458 3140
19442C140N718M430L118Q03l972o674l484L382k341K204P73j527J203J803k611
$$ 3140 8858 13288 16406 17209 13237 6563 3079 6461 4120 6324 7097 5570 6773 8576 5965
19427E965k866J971N377j375l332r072n881J1155R162j014m375n635L460J516
$$ 5965 3099 5070 10447 9072 5740 -3332 -9213 1942 11104 10090 5715 80 3540 5056
19413E056l525O756K047n499m109O287K510K123l788m963K521L970J897k424k565
$$ 5056 1531 8287 10334 4835 726 7013 9523 11646 7858 2895 5416 9386 11283 8859 6294
19398F294j359J493O46n479k069m576P98k093P08j655j893N233O382M268R96m048
$$ 6294 4935 6428 7074 1595 -474 -5050 -4252 -6345 -5637 -7292 -9185 -3952 2430 6698 7694 3646
19382C646K259K959k955L46M978M498n193o537j236K196L477k496M287J02q299
$$ 3646 5905 8864 5909 6255 11233 15731 10538 4001 2765 4961 8438 5942 10229 10331 2032
19367B032n629l655N695O413r477J487J0542N206j73J042J717m269l549L401M064
$$ 2032 -3597 -7252 -1557 4856 -4621 -3134 7408 12614 12441 13483 15200 10931 7382 10783 14847
19352A4847k602q229j041M873N979K653j270n855R56k047K158L974J421K01j128
$$ 14847 12245 4016 2975 7848 13827 16480 15210 9355 10311 8264 10422 14396 15817 16018 14890
19337A4890j646n492l888O6k912K981J512j106M78L563L5L436K978l595n266n231
$$ 14890 13244 7752 3864 3930 1018 3999 5511 4405 4883 8446 8481 11917 14895 11300 6034 803
19321H03K361M179L985J633p547j92L650l572j200m539O301K411K739j244j228
$$ 803 3164 7343 11328 12961 5414 5222 8872 5300 4100 -439 5862 8273 11012 9768 8540
19306H540K904O183q50r86l84k597l84K546J759k192m12l155j569n417n360l417
$$ 8540 11444 17627 16777 15791 15407 12810 12426 14972 16731 14539 14127 10972 9403 3986 -1374 -4791
19290d791J432J403J742M132J965L905j77L41P87J834o238L62n073k279P016P087
$$ -4791 -3359 -1956 -214 3918 5883 9788 9611 9952 10739 12573 6335 6697 1624 -655 6361 13448
19274A3448P95l064k380N80k581N391q10k457O290J210l764l65o414k047J359
$$ 13448 14243 11179 8799 9379 6798 12189 11379 8922 15212 16422 12658 12293 5879 3832 5191
19259E191p23J550O108N535r160J455k556N628N12l513M406m008l664Q24O087
$$ 5191 4468 6018 12126 17661 8501 9956 7400 13028 13540 10027 14433 10425 6761 7585 13672
19244A3672l80p091J054O917J401n118k010m384m599Q22N332N097O170j656j047
$$ 13672 13292 6201 7255 14172 15573 10455 8445 4061 -538 284 5616 10713 16883 15227 14180
19229A4180m04J922M011L009p035l529j853q43M855o898J31M070l971o188N093
$$ 14180 13776 15698 19709 22718 15683 12154 10301 9458 14313 7415 7546 11616 7645 1457 6550
19214F550K280N515P128n158k838O126Q142N196p834r766n239J621M241J94j893
$$ 6550 8830 14345 21473 16315 13477 19603 27745 32941 25107 15341 10102 11723 15964 16158 14265
19199A4265l336J981o305J952K351Q88M205K808m390o276L6N323J332k656q086
$$ 14265 10929 12910 6605 8557 10908 11796 16001 18809 14419 8143 8179 13502 14834 12178 4092
19184D092J957R611O771j98M97n037j1554k243R040O261J3n044k746O97k22n18
$$ 4092 6049 15660 22431 22233 22730 17693 6139 3896 12936 19197 19210 14166 11420 12117 11895 11377
19168A1377j1337N33Q677n793k362j857j247J610N173k937j1L786M310J12K328
$$ 11377 40 573 9250 3457 1095 -762 -2009 -399 4774 1837 1826 5612 9922 10034 12362
19153A2362K345m239o67P612l429l421L605j175n01j334N083K394k46k314O44
$$ 12362 14707 10468 9801 17413 13984 10563 14168 12993 12492 11158 16241 18635 18389 16075 16719
19138A6719K663j217l07L047L077k38j72j935m762L143N651r276m945r128m238
$$ 16719 19382 18165 17858 20905 23982 23744 23572 21637 16875 20018 25669 16393 11448 2320 -1918
19123a918j126L451L41K628N919K071m618Q358J015O465N040k249J61m096K762
$$ -1918 -3044 407 748 3376 9295 11366 6748 15106 16121 22586 27626 25377 25538 21442 24204
19108B4204m578p06J108m057l125K463L243Q37M097K686o40K37J0917M236k642
$$ 24204 19626 18920 20028 15971 12846 15309 18552 19389 23486 26172 25532 25769 36686 40922 38280
19093C8280m584L089k545j589N080J0782J1081R415J0695P444N037m792j1091
$$ 38280 33696 36785 34240 32651 37731 48513 59594 69009 79704 87148 92185 87393 76302
19080G6302q319l955j828m083M03o055o055o589o91L408j338o236j260j815r691
$$ 76302 67983 64028 62200 58117 58520 52465 46410 39821 39130 42538 41200 34964 33704 31889 22198
19065B2198N410J2525J148o863m983m341j858L94O768M695p877m142N65M604L359
$$ 22198 27608 40133 41281 34418 29435 25094 23236 23630 30398 35093 27216 23074 23639 28243 31602
19050C1602j048K58J383P355L048K863L239K201O630J149k560k4o535j539M884
$$ 31602 30554 30812 32195 39550 42598 45461 48700 50901 57531 58680 56120 56096 49561 48022 52906
19035E2906k186N208O892J1993J5004J3301Q625k348q296j3405r532o580q065
$$ 52906 50720 55928 62820 74813 89817 103118 111743 109395 101099 87694 78162 71582 63517
19022F3517m796p920l378l169m399j750l161k471N908L304O89J224K759J090m745
$$ 63517 58721 50801 47423 44254 39855 38105 34944 32473 38381 41685 42374 43598 46357 47447 42702
19007D2702q174p895J102L846j336q10K113J850J388m440k832k213n115j223J0179
$$ 42702 34528 26633 27735 31581 30245 29435 31548 33398 34786 30346 27514 25301 20186 18963 29142
18992B9142K962N06o593l826J490M308O205l435P040L366o821j2198N68R217L564
$$ 29142 32104 32610 26017 22191 23681 27989 34194 30759 37799 41165 34344 22146 22714 31931 35495
18977C5495n968n492k633K327N376P067j87n059p46J526q38k986K182k637k87
$$ 35495 29527 24035 21402 23729 29105 36172 35985 30926 30180 31706 30868 27882 30064 27427 27140
18962B7140L126N872j889m442o0o235k449J475k298Q03l34R867M378j327r24n904
$$ 27140 30266 36138 34249 29807 29747 23512 21063 22538 20240 21043 20709 30576 34954 33627 32703 26799
18946B6799l198J5Q813L60l108k542J043j346m512j207M287k169l592J504M192
$$ 26799 23601 23616 32429 32789 29681 27139 28182 26836 22324 21117 25404 23235 19643 21147 25339
18931B5339K987m018m112L533L113m300M29J970J991L66j149n347J862L733K75
$$ 25339 28326 24308 20196 23729 26842 22542 22971 24941 26932 27298 26149 20802 22664 26397 26672
18916B6672r809o400L993O377M386J054j872j27p57m235Q08o600J211N306J933
$$ 26672 16863 10463 14456 20833 25219 26273 24401 24274 23517 19282 20090 13490 14701 20007 21940
18901B1940J385q26J698R4N070k851m571J048R377P026K325k565k594m714l102
$$ 21940 23325 22499 24197 24291 29361 26510 21939 22987 32364 39390 41715 39150 36556 31842 28740
18886B8740m926k021L549m491l897L846L906j034j866j566K53K673L431r63M62
$$ 28740 23814 21793 25342 20851 16954 20800 24706 23672 21806 20240 20493 23166 26597 25634 26096
18871B6096N155k340j508N073K461M497N67m449N712l273k063R60L327l443m315
$$ 26096 31251 28911 27403 32476 34937 39434 40001 35552 41264 37991 35928 36888 40215 36772 32457
18856C2457j214K133P976O843q71j26k330m368K345O538o93j846l70J113O45o717
$$ 32457 31243 33376 41352 48195 47324 47198 44868 40500 42845 49383 48690 46844 46474 47587 48232 41515
18840D1515m779P845J2790N120r234p107K921K168K005l09R943Q128O949L084
$$ 41515 36736 44581 57371 62491 53257 46150 49071 51239 53244 52935 62878 71006 77955 81039
18826H1039N109R091L556N168J9968K5071K1937K3966K0650K0067R544Q389Q414
$$ 81039 86148 95239 98795 103963 123931 149002 170939 194905 215555 235622 245166 253555 261969
18813B61969N040P551l332q655n443R783R085Q631R329J0019j5j2901j9943j1939
$$ 261969 267009 274560 271228 262573 257130 266913 275998 284629 293958 303977 303962 291061 271118 259179
18799B59179l191n470m817p844j1558j6642j2217q327o766j076l953o917r1q63
$$ 259179 255988 250518 245701 237857 226299 209657 197440 189113 182347 181271 177318 170401 170310 169447
18785A69447p620k921j885M590R585q42p593j019n261p824k832q25L199L307Q347
$$ 169447 161827 158906 157021 161611 171196 170354 162761 161742 156481 148657 145825 145000 148199 151506 159853
18770A59853R028J3246J9624K3145K1238M925J684J6828K7717K2228K6517J5288
$$ 159853 168881 182127 201751 224896 246134 251059 252743 269571 297288 319516 346033 361321
18758C61321l54l401M782Q406R392J3507J9433L117j9402k0828k8686k0772r438
$$ 361321 360967 357566 362348 370754 380146 393653 413086 416203 396801 375973 347287 326515 317077
18745C17077K021n825j0813k1298k9714m1965k9137j3604n743j0914l888o072
$$ 317077 319098 313273 302460 281162 251448 209483 180346 166742 160999 150085 146197 140125
18733A40125j9715p381O179N657m876m614p360q262N130N291P369N868k285j1209
$$ 140125 120410 113029 119208 124865 119989 115375 108015 99753 104883 110174 117543 123411 121126 109917
18719A09917j2351j6369p081N497O158N116l343l021n96O196P40o019j248k475
$$ 109917 97566 81197 74116 79613 85771 90887 87544 84523 83927 90123 90863 84844 83596 81121
18705H1121m075n589K230J071j696j506r414j0903k731J0140M553m816K226N591
$$ 81121 77046 71457 73687 74758 73062 71556 62142 51239 48508 58648 63201 58385 60611 66202
18691F6202l124j448P783m792j486R608M123j04k598n801n333l49k593k008O305
$$ 66202 63078 61630 69413 64621 63135 72743 76866 76762 74164 68363 63030 62681 60088 58080 64385
18676F4385N314l37J547K016k585k247K473O13M337N534O150N818o1j957k788
$$ 64385 69699 69362 70909 72925 70340 68093 70566 71179 75516 81050 87200 93018 92957 91000 88212
18661H8212k004M126K355j153q054k01K195M535k350r454r822l033J546R15j720
$$ 88212 86208 90334 92689 91536 83482 83281 85476 90011 87661 78207 68385 65352 66898 67813 66093
18646F6093J660r25M093l977l743n119L391L556k40J923p753q413j93N119J105
$$ 66093 67753 66828 70921 66944 63201 58082 61473 65029 64789 66712 58959 50546 50353 55472 56577
18631E6577k337P59O119N249m31K224O606k045N833P638r51q580l748K666j90
$$ 56577 54240 54999 61118 66367 65936 68160 74766 72721 78554 86192 85241 76661 72913 75579 75389
18616G5389K652L651L44Q458J0157P059m134j414n839q428j900q342n669k25L72
$$ 75389 78041 81692 82036 90494 100651 107710 103576 102162 96323 87895 85995 77653 71984 71759 72131
18601G2131p754j075J186N113L594J1083P732M056L293m15K004O593p12p285j395
$$ 72131 64377 63302 64488 69601 73195 84278 92010 96066 99359 98944 100948 107541 106829 99544 98149
18586I8149k293k901k271o246l947J119N369Q51k885k716n710n664L881P454P591
$$ 98149 95856 92955 90684 84438 80491 81610 86979 87830 84945 82229 76519 70855 74736 82190 89781
18571H9781p098j3408K48N936L09k848o86P709N148N184Q620Q213q79m67J1294
$$ 89781 82683 69275 69523 75459 75768 72920 72234 79943 85091 90275 98895 107108 106229 105762 117056
18556A17056R564r49k440k071J589L167J142j163J695R84M889K896J1712J6916
$$ 117056 126620 125671 123231 121160 122749 125916 127058 125895 127590 128574 133463 136359 148071 164987
18542A64987J0860J8242K5980K5776L0337K3255J8044J4562J5470J5262Q655j7831
$$ 164987 175847 194089 220069 245845 276182 299437 317481 332043 347513 362775 371430 353599
18530C53599k8429l2362l2460j5934j3078j7694j5411j0690n176q705j0524p046
$$ 353599 325170 292808 260348 244414 231336 213642 198231 187541 182365 173660 163136 156090
18518A56090j890M12k255j600M65M338J064l105m706K061P013L250P128O544j911
$$ 156090 154200 154612 152357 150757 151222 155560 156624 153519 148813 150874 157887 161137 168265 174809 172898
18503A72898o726l406k6J065K509J677r141o636k419O28K049l981m045J508L935
$$ 172898 166172 162766 162740 163805 166314 167991 158850 152214 149795 150423 152472 148491 144446 145954 149889
18488A49889P267Q340R714R694M697J170l115m909n09J981N767J625j2093n733
$$ 149889 157156 165496 175210 184904 189601 190771 187656 182747 182238 184219 189986 191611 179518 173785
18474A73785K129P894K4410L6418K8453J4920J5814J0607N405L216n497j5417
$$ 173785 175914 183808 208218 244636 273089 288009 303823 314430 319835 323051 317554 302137
18462C02137j1807j0657l736P66l351o39j930l228M721K579J1545K7968K7614
$$ 302137 290330 279673 275937 276703 273352 272713 270783 267555 272276 274855 286400 314368 341982
18449C41982M4487N5097K9084o477k4745j4668L697J4646R612K592j2816k1103
$$ 341982 386469 441566 470650 464173 439428 424760 428457 443103 452715 455307 442491 421388
18437D21388j5221k3976j5508n419M059M505O109J8105N1100P3396L7283k4776
$$ 421388 406167 382191 366683 361264 365323 369828 375937 394042 445142 518538 555821 531045
18425E31045n3195m7985l9753j8830m748O728J3341L0593M4328M5563N0100N0473
$$ 531045 477850 429865 390112 371282 366534 373262 386603 417196 461524 507087 557187 607660
18413F07660K2448j473l1702l6080l6799k5307m701L8973N8555M8543J8532p35
$$ 607660 630108 628635 596933 560853 524054 498747 494046 533019 591574 640117 658649 657914
18401F57914M767Q474q373k5523k0627j8475p401q202n827m611P849J6452K8036
$$ 657914 662681 671155 662782 637259 616632 598157 590756 582554 576727 572116 579965 596417 624453
18388F24453M4041L6413K0180R248o057r179r556j3825r564k520J71L388M871
$$ 624453 668494 704907 725087 734335 728278 719099 709543 695718 686154 683634 683805 687193 692064
18375F92064Q923J2688R948J5839K0438J6032J8335J3619J4337J0965J3801J6340
$$ 692064 700987 713675 723623 739462 759900 775932 794267 807886 822223 833188 846989 863329
18363H63329J8393K6558K8647K3241K4970K8475M1761M9220N0000M5268M4535
$$ 863329 881722 908280 936927 960168 985138 1013613 1055374 1104594 1154594 1199862 1244397
18352A244397N0286M4291L3801L0737K7458L6737L7015M7103N8573Q3008J15386
$$ 1244397 1294683 1338974 1372775 1403512 1430970 1467707 1504722 1551825 1610398 1693406 1808792
18341A808792J58685J83500J74418J60237J45452J34625J04797R7074J17060J47644
$$ 1808792 1967477 2150977 2325395 2485632 2631084 2765709 2870506 2967580 3084640 3232284
18331C232284J41202P5237j1673q1106j16134j00748o1542j1605Q825J0391M537
$$ 3232284 3373486 3448723 3437050 3355944 3239810 3139062 3077520 3065915 3074740 3085131 3089668
18320C089668n875P167J9763M8696J00884J69235K06638K06050K08664K07158
$$ 3089668 3083793 3090960 3110723 3159419 3260303 3429538 3636176 3842226 4050890 4258048
18310D258048J60292J18651J24576J78488K69613L54697M25854M99442N52447
$$ 4258048 4418340 4536991 4661567 4840055 5109668 5464365 5890219 6389661 6942108
18301F942108N91596N96066N97148O40713P76619R73314J190376J487725J883232
$$ 6942108 7533704 8129770 8726918 9367631 10144250 11117564 12307940 13795665 15678897
18292A5678897K322549K726111L210541M045200N430027P538079J0767328J5865900
$$ 15678897 18001446 20727557 23938098 27983298 33413325 40951404 51718732 67584632
18284F7584632K3962356L6059278N1096838O2588795N5025429J4964583l5058587
$$ 67584632 91546988 127606266 178703104 241291899 296317328 311281911 276223324
18277B76223324n6764218n2452511m1238251k9694030k0332593j4049101j0189843
$$ 276223324 219459106 167006595 125768344 96074314 75741721 61692620 51502777
18270E1502777p654437n845875m535964l534187k749262k144626j732682j462466
$$ 51502777 43848340 38002465 33466501 29932314 27183052 25038426 23305744 21843278
18262B1843278j303850j192006j104940r96911q46082o95367n86986n21579m54740
$$ 21843278 20539428 19347422 18242482 17245571 16399489 15704122 15117136 14595557 14140817
18253A4140817l89235l55368k93679k09290j25943o9476p4998p0848l0993J703
$$ 14140817 13751582 13396214 13102535 12893245 12767302 12697826 12622828 12551980 12520987 12522690
18243A2522690m103q9428k73142m71771n60351n75461n58577n24337m67274m06207
$$ 12522690 12518587 12429159 12156017 11684246 11123895 10548434 9989857 9465520 8998246 8592039
18233H592039l55934l03413k59180k49570l12201l62750l19816k42892j62511
$$ 8592039 8236105 7932692 7673512 7423942 7111741 6748991 6429175 6186283 6023772
18224F023772j14477j60989k43498k77462k92430l24697l11831k68712k39077
$$ 6023772 5909295 5748306 5504808 5227346 4934916 4610219 4298388 4029676 3790599
18215C790599k07120j85766j73922j63099j43627j25088j13591j08125r9800r8857
$$ 3790599 3583479 3397713 3223791 3060692 2917065 2791977 2678386 2570261 2470461 2371604
18205B371604j05313j07588r9346r0577q5860q6027q4394p8774o6242n2868n1679
$$ 2371604 2266291 2158703 2059357 1968780 1882920 1796893 1712499 1633725 1567483 1514615 1462936
18194A462936m7703m6051m2817m0024l6142l8654l2071k2709o135P890J8356K5685
$$ 1462936 1415233 1369182 1326365 1286341 1250199 1211545 1179474 1156765 1150630 1158520 1176876 1202561
18182A202561j4115o6321r0329q9480p4780n0294m3273m7173m1183k2796j9356
$$ 1202561 1188446 1122125 1031796 942316 867536 817242 773969 726796 685613 662817 643461
18171F43461j4957j3776j7151j5905j4130j3375j8857j5675j0678J378J0167J1341
$$ 643461 628504 614728 597577 581672 567542 554167 535310 519635 508957 510335 520502 531843
18159E31843m364k5179m7669o0095j7998Q2601J78823J27454J55n7735n0651l2683
$$ 531843 527479 502300 454631 394536 376538 459139 637962 765416 765571 707836 657185 624502
18147F24502l7457l6007k7305l6511l5861k3300j4630j1290j885O198R095J0168
$$ 624502 587045 551038 523733 487222 451361 428061 413431 402141 400256 406454 415549 425717
18135D25717L822P68N479N276R326J0064M125j2598j8055q887J0500L1285M5669
$$ 425717 429539 430307 435786 441062 450388 460452 464577 451979 433924 425037 435537 466822 512491
18122E12491M1821L5510M6378N7095Q0536J12687J52672K07950K95222M36079
$$ 512491 554312 589822 636200 693295 773831 886518 1039190 1247140 1542362 1978441
18112A978441O71814J094655J819418K747630K673172O213k249334k177248j721326
$$ 1978441 2650255 3744910 5564328 8311958 10985130 10991343 8742009 6564761 4843435
18103D843435j243221q25715n44942l76746k66655j98279j53896j25319q9951
$$ 4843435 3600214 2774499 2229557 1852811 1586156 1387877 1233981 1108662 1018711
18094A018711p2964o6620m0234k7376k8780j8729o91O172Q512k337j8053j5077
$$ 1018711 945747 879127 838893 811517 782737 764008 763317 769489 778001 775664 757611 742534
18082G42534k1371k2680j0157m604r375j0541o712q226k653Q843J3346J4565K387
$$ 742534 721163 698483 688326 683722 674347 663806 657094 648868 646215 655058 668404 682969 685356
18069F85356j3748k2119j8666k5184k5797k5222k5004k3105k3081k4793j3798
$$ 685356 671608 649489 630823 605639 579842 554620 529616 506511 483430 458637 444839
18058D44839j6821j5949q351q819j0076j2428j2205j3807o969j031L822k989l947
$$ 444839 428018 412069 403718 394899 384823 372395 360190 346383 339414 338383 342205 339216 335269
18045C35269O628K292k007J25J373j1672j0631k745n585o280n866J347l678k51
$$ 335269 341897 344189 342182 342307 343680 332008 321377 318632 313047 306767 300901 302248 298570 298319
18031B98319P806J3633K1717Q514r842n072k58L20k333j2526k0332j7542j5812
$$ 298319 306125 319758 341475 349989 340147 335075 334817 335137 332804 320278 299946 282404 266592
18018B66592j4880k75J211K996o79k793n590j0960j6447p579m117p31q776j3098
$$ 266592 251712 251437 252648 255644 254965 252172 246582 235622 219175 211596 207479 206748 197972 184874
18004A84874m417K442j459N608J476J176L157j696l77l347m035j814M894p77P7
$$ 184874 180457 182899 181440 187048 188524 189700 192857 191161 190784 187437 183402 181588 186482 185705 185782
17989A85782L695r69L09j596l428k376K011J1259L671j054p30M127K0317J8689
$$ 185782 189477 188508 188817 187221 183793 181417 183428 194687 198358 197304 196574 200701 221018 239707
17975B39707J0788n384L05l562q735o441l351K102P156P683R634J3454J8642K0521
$$ 239707 250495 245111 245416 241854 233119 226678 223327 225429 232585 240268 249902 263356 281998 302519
17961C02519J384o866L993O61K416K749J0600P299J6350J4294O289M422N032J1477
$$ 302519 303903 297037 301030 301691 304107 306856 317456 324755 341105 355399 361688 366110 371142 382619
17947C82619M121o897N922J7850J6593K4859K7987K7710K3517J9825J2066L895
$$ 382619 386740 379843 385765 403615 420208 445067 473054 500764 524281 544106 556172 560067
17935E60067l060p672N300J5461Q925J6250L6051O9429J01122J32599J44889J37066
$$ 560067 557007 549335 554635 570096 579021 595271 631322 700751 801873 934472 1079361 1216427
17923A216427J38696J24568P3340p308l7224m9791o7270j04485j04189o9632n6956
$$ 1216427 1355123 1479691 1553031 1545723 1508499 1458708 1391438 1286953 1182764 1113132 1056176
17912A056176l3174j0931O830J3832R461j2136k6334k2966k8132k7120k2461j8040
$$ 1056176 1023002 1012071 1018901 1032733 1042194 1030058 1003724 980758 952626 925506 903045 885005
17900H85005r187l402m240l450J9507L2095L1564L3297K9107K6268K6916L7282
$$ 885005 875818 872416 868176 864726 884233 916328 947892 981189 1010296 1036564 1063480 1100762
17888A100762L6228M2179N2455O2517P9465R4414R9598J12923J20535J29793J68305
$$ 1100762 1136990 1179169 1231624 1294141 1373606 1468020 1567618 1680541 1801076 1930869 2099174
17877B099174K15697K23156J83060J05238N6088P0527J27182J55599J87246K49103
$$ 2099174 2314871 2538027 2721087 2826325 2882413 2952940 3080122 3235721 3422967 3672070
17867C672070L07986L14646L43072M59148M99698M14657L68048M66977O91966
$$ 3672070 3980056 4294702 4637774 5096922 5596620 6011277 6379325 6846302 7538268
17858G538268J053492J642195K565388M001139O237506R085434J0032190M564379
$$ 7538268 8591760 10233955 12799343 16800482 23037988 32123422 42155612 46719991
17850D6719991l636214o221860n240536m067031k981305j615264J9207J856680
$$ 46719991 43083777 36861917 31621381 27554350 24573045 22957781 22976988 24833668
17842B4833668M215854P419238J1132496J2991775R910019K958280m274422r543016
$$ 24833668 29049522 36468760 47601256 60593031 70503050 73461330 69186908 59643892
17834E9643892j1196980r460380o825458m345287k185787k84793J417138K956776
$$ 59643892 48446912 38986532 32161074 27815787 25630000 25345207 26762345 29719121
17826B9719121M969106P627775P942417J472237o784961q828466p536045n835445
$$ 29719121 34688227 42316002 50258419 51730656 44945695 36117229 28581184 22745739
17818B2745739m173342k878384j975064j369346r60066p20919o20088n81245n78193
$$ 22745739 18572397 15694013 13718949 12349603 11389537 10668618 10048530 9467285 8889092
17809H889092n65740m86058m00642l22619k38747j69825q4840k9832k5499o9872
$$ 8889092 8323352 7837294 7436652 7114033 6875286 6705461 6620621 6590789 6565290 6495418
17799F495418j20244j81142k71437l22810l07269k76819k35492k04907j81549
$$ 6495418 6375174 6194032 5922595 5599785 5292516 5015697 4780205 4575298 4393749
17790D393749j64237j38875j19272r6337j07044j34195j54261j61243j55656j57964
$$ 4393749 4229512 4090637 3971365 3875028 3767984 3633789 3479528 3318285 3162629 3004665
17780C004665j59779j47298j26015j15617j06398j05611j01140r9857j07440r2250
$$ 3004665 2844886 2697588 2571573 2455956 2349558 2243947 2142807 2042950 1935510 1843260
17770A843260r3032p7785p4232o7470m9567n4513n0486m8770l3887k8557l0850
$$ 1843260 1750228 1672443 1598211 1530741 1481174 1426661 1376175 1327405 1293518 1264961 1234111
17759A234111l5940l1511k3999k5514l7115l6931l6721l7808k8490k5436k9798
$$ 1234111 1198171 1166660 1142661 1117147 1080032 1043101 1006380 968572 940082 914646 884848
17748H84848l0287k6916k9489k6187j6277k1480k1179k1246l0754m1928m2857
$$ 884848 854561 827645 798156 771969 755692 734212 713033 691787 661033 619105 576248
17737E76248l9448k3779j488j820m878n336R98o005j3255l0344l2893j9614L0
$$ 576248 536800 513021 511533 509713 504835 499499 500497 494492 481237 450893 418000 398386 398416
17724C98416m156k2273k1428j3932q187p206o289j4127j1861j7007k5666j1438
$$ 398416 394260 371987 350559 336627 328440 321234 314945 300818 288957 271950 246284 234846
17712B34846J8714K7522J7848R403o865k0378j5964j0456k684J187J196n72j3165
$$ 234846 253560 281082 298930 308333 301468 281090 265126 254670 251986 253173 254369 253797 240632
17699B40632j963J9247N0567M1698K8414K4815K4379J0925n675p25n212j9366
$$ 240632 238669 257916 308483 350181 378595 403410 427789 438714 433039 432314 427102 407736
17687D07736k4239l0575l1508l6774l4674j6212j3556j7157j2823o425r377m933
$$ 407736 383497 352922 321414 284640 249966 233754 220198 203041 190218 183793 174416 169483
17675A69483L676O497J531L19j0216o385l917M395P273m05l808J97n03m64k921
$$ 169483 173159 179656 181187 181506 171290 164905 160988 165383 172656 172251 168443 168640 168137 167673 164752
17660A64752r246L235R159Q83k155k503m356j2591o709J569k393p86m084j875
$$ 164752 155506 158741 167900 168783 166628 164125 159769 147178 140469 142038 139645 138859 134775 132900
17646A32900J877m72Q942O526l777j491k746o898J132P58n010k221k327k20N16
$$ 132900 134777 134305 143247 149773 145996 144505 141759 134861 135993 136751 131741 129520 127193 126973 127489
17631A27489P401J1759m220q894n192o476m831J654m831n814n689l350K620j563
$$ 127489 134890 146649 142429 133535 128343 121867 117036 118690 113859 108045 102356 99006 101626 100063
17617A00063o041p796K096P165Q71M842j950l708n588n361k807O557L464p194
$$ 100063 94022 86226 88322 95487 96358 101200 99250 95542 89954 84593 81786 88343 91807 84613
17603H4613n039j118K428M220L268r765m168P926O378r30K442n245R0M354M895
$$ 84613 79574 78456 80884 85104 88372 78607 74439 82365 88743 87813 90255 85010 85100 89454 94349
17588I4349L439n864p975l472q080O31j737m688K553M521l394l827j115l449k48
$$ 94349 97788 91924 83949 80477 72397 73028 71291 66603 69156 73677 70283 66456 65341 61892 61644
17573F1644K450n484L308k523j815j31l790K60k699P34q90K61L997l237l015N72
$$ 61644 64094 58610 61918 59395 57580 57449 53659 53919 51220 51954 51064 51325 55322 52085 49070 49642
17557D9642L709k98j559K091N719L902q684n579l186n971P11r19L27Q40K541j949
$$ 49642 53351 53053 51494 53585 59304 63206 54522 48943 45757 39786 40497 39578 39905 40745 43286 41337
17541D1337k653M309K784r71l800J1336P669l123p064m031j131q075k4L684K547
$$ 41337 38684 42993 45777 44806 41006 52342 60011 56888 49824 45793 44662 36587 36563 40247 42794
17526D2794j719J589O33P51j035o339N8R117m217o680j668M134Q902J2055l150
$$ 42794 41075 42664 43297 44048 43013 36674 36732 45849 41632 34952 33284 37418 46320 58375 55225
17511E5225o403n643m617o33P618M712N320l905j0910k814L929J060k048M374
$$ 55225 48822 43179 38562 37929 45547 50259 55579 51674 40764 37950 41879 42939 40891 45265
17497D5265L682J519J297L403j937n118J207N046n914p603r10J558K646L788m296
$$ 45265 48947 50466 51763 55166 53229 48111 49318 54364 48450 40847 39937 41495 44141 47929 43633
17482D3633n594P05n11N937m037P67k787l451J815O384J619N940m575j2224k135
$$ 43633 38039 38744 38233 44170 40133 40900 38113 34662 36477 42861 44480 50420 45845 33621 31486
17467C1486J177J31n287k870l609N100o52k302J335Q88J017K983o417J605N665
$$ 31486 32663 32794 27507 24637 21028 26128 25476 23174 24509 25397 26414 29397 22980 24585 30250
17452C0250j67j149l878L391q88N68O306O768J2378R511J5095R008r41p162j6719
$$ 30250 30083 28934 25056 28447 27559 28127 34433 41201 53579 63090 78185 87193 86252 79090 62371
17437F2371j5526k104m770o177o889p71M071m21L454l657n127m229j846M485J381
$$ 62371 46845 44741 39971 33794 26905 26134 30205 29784 33238 29581 24454 20225 18379 22864 24245
17422B4245l616K991K381j1230n831M808M497k611J0714Q500p06j918r514m372
$$ 24245 20629 23620 26001 14771 8940 13748 18245 15634 26348 34848 34142 32224 22710 18338
17408A8338O890N813n549p409M279r73K690N881K273M784K193P012n07o351n078
$$ 18338 25228 31041 25492 18083 22362 21389 24079 29960 32233 37017 39210 46222 45715 39364 34286
17393C4286j867m65p160L042q98k694J054j992K770n107j112N435N745M497J612
$$ 34286 32419 31954 24794 27836 26938 24244 25298 23306 26076 20969 19857 25292 31037 35534 37146
17378C7146l794J521J2975M374n032k929n278p03j931L013P155Q270K668j2797
$$ 37146 33352 34873 47848 52222 47190 44261 38983 38280 36349 39362 46517 54787 57455 44658
17364D4658o345M69J243N44p831j440O239L229J901o110N844K11m691j184M694
$$ 44658 38313 38782 40025 40569 32738 31298 37537 40766 42667 36557 42401 42612 37921 36737 41431
17349D1431m422r49M254J61L156N530P521k361k877l491m206j154M552m824o67
$$ 41431 37009 36060 40314 40475 43631 49161 56682 54321 51444 47953 43747 42593 47145 42321 41654
17334D1654M491n094K977K961J236M04K704L111K2l548m773j860k692m850L163
$$ 41654 46145 41051 44028 46989 48225 48629 51333 54444 54466 50918 46145 44285 41593 36743 39906
17319C9906J645p326k619L072L702k911n152l671M830P966p59o543j467r957l078
$$ 39906 41551 34225 31606 34678 38380 35469 30317 26646 31476 39442 38683 32140 30673 20716 17638
17304A7638R957J0632p449J267k415p10K19N03N343P678P29j008n436O209K794
$$ 17638 27595 38227 30778 32045 29630 28920 29139 29642 34985 42663 43392 42384 36948 43157 45951
17289D5951P44K239L63k759m519L151L188M706J446N86l23l713j523L509Q898
$$ 45951 46695 48934 49297 46538 42019 45170 48358 53064 54510 55096 54773 51060 49537 53046 61944
17274F1944Q602J2088J3846J2821K1530K6033Q317j2055j6450r977o820l798j186
$$ 61944 70546 82634 96480 109301 130831 156864 165181 153126 136676 126699 119879 116081 114895
17261A14895J1450J7843L3687M6026L9944M1893K0869J063n990k7334m5838k5125
$$ 114895 126345 144188 177875 223901 263845 305738 326607 327670 321680 294346 248508 223383
17249B23383j2613j1121j160R445K0499L8351P4520Q6540O3835P351m5459o8511
$$ 223383 210770 199649 198489 207934 228433 266784 341304 427844 491679 499030 453571 385060
17237C85060o5522m5791l2593k0330p840L687J6775L3274L8345M9053K4972o06
$$ 385060 319538 273747 241154 220824 212984 216671 233446 266720 305065 354118 379090 378484
17225C78484q366j7335k4372j7605j7686N487J6695M551j2367k3803j2773J923
$$ 378484 370118 352783 328411 310806 293120 298607 315302 319853 307486 283683 270910 272833
17213B72833M806L993j2329j6615r664L815J5029K3546L2749J8754j8288l4190
$$ 272833 277639 281632 269303 252688 243024 246839 261868 285414 318163 336917 318629 284439
17201B84439l6669k8690k4132j3680o740n297j928N025K1929J7872J3575O780
$$ 284439 247770 219080 194948 181268 174528 169231 167303 172328 194257 212129 225704 232484
17189B32484j0594k4188j9434j9799j5670j2572j0356M55n92m290o201k378r710
$$ 232484 221890 197702 178268 158469 142799 130227 119871 120326 119734 115444 109243 106865 97155
17176I7155p843K227k157m627l191J695p861K225l541o359N54q273j2206K173
$$ 97155 89312 91539 89382 84755 81564 83259 75398 77623 74082 67723 68277 60004 47798 49971
17162D9971K222L47M170o328j046L069J934J680L3Pm714k546r79O125k561j0535
$$ 49971 52193 52540 56710 50382 49336 52405 54339 56019 56052 56059 51345 48799 47820 53945 51384 40849
17146D0849m851O660j413N930L673M10N403P26L505R862m011q595K512R706N28
$$ 40849 35998 42658 41245 47175 50848 51258 56661 57387 60892 70754 66743 58148 60660 70366 70894
17131G0894k006k769n896j142R255j656N834N705o819r19j386j874K945j654Q12
$$ 70894 68888 66119 60223 59081 68336 66680 72514 78219 71400 70481 69095 67221 70166 68512 69324
17116F9324l858o85M876L299j196p177k424M8L943K667N141P490K491J885K654
$$ 69324 65466 64781 69657 72956 71760 64583 62159 62207 66150 68817 73958 81448 83939 85824 88478
17101H8478J1015J6954J1284K1530K4117K8434R692n101r453o089k644j887Q039
$$ 88478 99493 116447 127731 149261 173378 201812 211504 206403 196950 190861 188217 186330 194369
17088A94369J9008K9718L9367N7573P5421J11640J66738K19682K36972J96572
$$ 194369 213377 243095 282462 340035 415456 527096 693834 913516 1150488 1347060
17078A347060R6922j2768j04074j54981j67756j60539j32061r9472n8386k3284
$$ 1347060 1443982 1431214 1327140 1172159 1004403 843864 711803 612331 553945 530661
17068E30661j666J5292J7895K858j8832m6734n9624n9753m9468l3736k9760k6505
$$ 530661 528995 544287 562182 565040 546208 499474 439850 380097 330629 296893 267133 240628
17056B40628k1262j6375m467N5k29j4584n6J698J146M402R635J7382K4081K0568
$$ 240628 219366 202991 198524 198579 198350 183766 183710 185408 186554 190956 200591 217973 242054 262622
17042B62622K4654M0262M4842N6441N9377L0298p92r887j5977j1921J4693M8566
$$ 262622 287276 327538 372380 428821 488198 518496 517704 507817 491840 479919 494612 543178
17030E43178P8738J08053J32919J50217J52464J21671N2536n4831j44076j88773
$$ 543178 621916 729969 862888 1013105 1165569 1287240 1339776 1284945 1140869 952096
17020I52096j78926j46941j16362q6929o1376m6715l7106k2576n807J449N500
$$ 952096 773170 626229 509867 422938 361562 314847 277741 255165 249358 250807 256307
17009B56307J409Q600P497j2280j1396k1135j7458j0014p196j0437r927j0905
$$ 256307 257716 266316 273813 261533 250137 229002 211544 201530 194334 183897 173970 163065
16997A63065j1901l201J989R01N43j1633k237j227j219l229k681l132q588k666
$$ 163065 151164 147963 149952 150853 151396 139763 137526 136299 135080 131851 129170 126038 117450 114784
16983A14784m959o848m782J80k75k673q941q062p126K906M447O466L393n667r125
$$ 114784 109825 102977 98195 98375 98100 95427 86486 78424 71298 74204 78651 85117 88510 82843 73718
16968G3718n908J030J542J609J30k626L576K582l27l781k108k132M435P934O868
$$ 73718 67810 68840 70382 71991 72121 69495 73071 75653 75326 71545 69437 67305 71740 79674 86542
16953H6542O116j119R21J313j064j756j446J608R131R738N726q15k130q053M202
$$ 86542 92658 91539 92460 93773 92709 90953 89507 91115 100246 109984 115710 114895 112765 104712 108914
16938A08914L532o39M21j621j167J029J812N190k377L632l20q199l521n544k476
$$ 108914 112446 111807 112228 110607 109440 110469 112281 117471 115094 118726 118406 110207 106686 101142 98666
16923I8666J622M779N595L01n290o721M026k154O20J139n497L766k768l055R44
$$ 98666 100288 105067 110662 110963 105673 98952 102978 100824 101444 102583 97086 100852 98084 95029 95973
16908I5973n228o432m310o150k413K927l773j171J303P397Q72l017k750K540k51
$$ 95973 90745 84313 80003 73853 71440 74367 70594 69423 70726 78123 78995 75978 73228 75768 75517
16893G5517O213m416j4666P592O139J680k048k98N50j521N25q9K391M410k899
$$ 75517 81730 77314 62648 70240 76379 78059 76011 75713 76263 74742 75267 75178 77569 81979 79080
16878G9080l7P673K397j583M231l178j2330l313P380R661M135K766O300K908n506
$$ 79080 79043 86716 89113 87530 91761 88583 76253 72940 80320 89981 94116 96882 103182 106090 100584
16863A00584N713J519l340j1101K691L862n48j463q142m018N241M093j200p445
$$ 100584 106297 107816 104476 93375 96066 99928 99380 97917 89775 85757 90998 95091 93891 86446
16849H6446J589j929m127k142L512L218l965q727O068j740k196k065j860m70P212
$$ 86446 88035 86106 81979 79837 83349 86567 82602 73875 79943 78203 76007 73942 72082 71612 78824
16834G8824Q19O17L314P28L104o132K863J109j514k643J781O61n640O733O024
$$ 78824 79643 80260 83574 84302 87406 81274 84137 85246 83732 81089 82870 83531 77891 84624 90648
16819I0648J459K615N365J4191N950K181r112j1361j266K885J876L214M466N307
$$ 90648 92107 94722 100087 114278 120228 122409 113297 101936 100670 103555 105431 108645 113111 118418
16805A18418p34M3K507J5505J9771N182l321M279q25J357R63m035N117P623m483
$$ 118418 117684 117727 120234 135739 155510 160692 157371 161650 160825 162182 163145 159110 164227 171850 167367
16790A67367n59R517R306P589N442L265l410m141l091J694j271k379M804P674
$$ 167367 166808 176325 185631 193220 198662 201927 198517 194376 191285 192979 191708 189329 194133 201807
16776B01807M566P148J0561L391N522O072Q705K749j281M645J4876L928j978Q301
$$ 201807 206373 213521 224082 227473 232995 239067 247772 250521 249240 253885 268761 272689 270711 279012
16762B79012J4197J3964J3517J1876P531M721R837J69J0287J1346P838R990Q477
$$ 279012 293209 307173 320690 332566 340097 344818 354655 354824 365111 376457 384295 394285 402762
16749D02762J5243J6522J9955J1963Q518J4899J8445J2419J6628J8577K2363K9307
$$ 402762 418005 434527 454482 466445 474963 489862 508307 520726 537354 555931 578294 607601
16737F07601L6081L0880J6013J4761K2706K0981J8924J7387K3889L1310K5000
$$ 607601 643682 674562 690575 705336 728042 749023 767947 785334 809223 840533 865533
16726H65533M1725M9212N5000N6496N8308O0748P5038Q4361J03011J40748J77321
$$ 865533 907258 956470 1011470 1067966 1126274 1187022 1262060 1346421 1449432 1590180 1767501
16715A767501J84618J64131J01779M9774J1597K6611O8980J12965J35283J74658
$$ 1767501 1952119 2116250 2218029 2267803 2279400 2306011 2374991 2487956 2623239 2797897
16705B797897K46741L28897M36199N31268O02097O65897P76897R98685J365752
$$ 2797897 3044638 3373535 3809734 4341002 4943099 5608996 6385893 7384578 8750330
16696H750330J962694K868440M236408O266868Q672456R185982M342326k941284
$$ 8750330 10713024 13581464 17817872 24084740 32757196 41943178 46285504 43344220
16688D3344220n852982n294099m187471k943610j450174J94272K031335M286088
$$ 43344220 37491238 32197139 28009668 25066058 23615884 23810156 25841491 30127579
16680C0127579P101366J0023626J1286154R111637L609100l512636r015732j0526610
$$ 30127579 37228945 47252571 58538725 67650362 71259462 67746826 58731094 48204484
16672D8204484r042793o663746m292890k205511l81793J184274K582305M370622
$$ 48204484 39161691 32497945 28205055 25999544 25617751 26802025 29384330 33754952
16664C3754952O532181O514510J226569n518225p714993o936161n519906m039677
$$ 33754952 40287133 46801643 48028212 42509987 34794994 27858833 22338927 18299250
16656A8299250k848209k001378j412378j028177p91147o46684n70712n34925n06309
$$ 18299250 15451041 13449663 12037285 11009108 10217961 9571277 9000565 8465640 7959331
16647G959331m44939l69526l10172k54940j93772j36434r3210p6537j08118j39567
$$ 7959331 7514392 7144866 6834694 6579754 6385982 6249548 6156338 6079801 5971683 5832116
16637E832116j66748k20088k61870k75857k68261k42931k07866j66861j46180
$$ 5832116 5665368 5445280 5183410 4907553 4639292 4396361 4188495 4021634 3875454
16628C875454j30590j11267j01181j12415j37697j53553j54680j49976j47615
$$ 3875454 3744864 3633597 3532416 3420001 3282304 3128751 2974071 2824095 2676480
16619B676480j32401j26147j17497j10925j03898r8133q8199r5490q4771q1353
$$ 2676480 2544079 2417932 2300435 2189510 2085612 1987479 1899280 1803790 1719019 1637666
16609A637666q5949q2578o8203o0444n8763n0084n6912n2135m2091m6343m9868
$$ 1637666 1551717 1469139 1400936 1340492 1281729 1231645 1174733 1122598 1080507 1034164 984296
16598I84296m9141m3198m3844l7396l8467l5015l2939k7393k4870k5546k9581
$$ 984296 935155 891957 848113 810717 772250 737235 704296 676903 652033 626487 596906
16587E96906k8487k0283j8797k3848j9592j9783k6303k5025j8099j2011r726j9378
$$ 596906 568419 548136 529339 505491 485899 466116 439813 414788 396689 384678 374952 355574
16575C55574j7818j2635q566j6512j1441j3471j5218j2353j1653j0895j769J6733
$$ 355574 337756 325121 316555 300043 288602 275131 259913 247560 235907 225012 223243 239976
16563B39976J7275p044j2913p561j3204j3771r971q513p053j2931j4321l889R036
$$ 239976 257251 250207 237294 229733 216529 202758 192787 184274 177221 164290 149969 146080 155116
16550A55116J6445K0061R948j412o980p173o603r618q000n905q809j9681j8588
$$ 155116 171561 191622 201570 200158 193178 186005 179402 169784 161784 155879 147070 127389 108801
16537A08801O083K4442J0630l250o794j2541r062n342o751n489l292J899o906
$$ 108801 114884 139326 149956 146706 139912 127371 118309 112967 106216 100727 97435 99334 92428
16524I2428l471K245K390m554J650m56Q728j780m431M65j110O194P532j843o006
$$ 92428 88957 91202 93592 89038 90688 90232 98960 97180 92749 93214 92104 98298 105830 103987 97981
16509I7981m373n3L011J438m210p158k653m91L241L406K789L253M757m254m55
$$ 97981 93608 93555 96566 98004 93794 86636 83983 83492 86733 90139 92928 96181 100938 96684 96229
16494I6229l615Q39p121m540K303Q94k981R080p73p209J944P390J1467K188k304
$$ 96229 92614 93453 86332 81792 84095 84989 82008 91088 90315 83106 85050 92440 103907 106095 103791
16479A03791q605m083K18M1L193n491j1155p11J731J784N894m447m532r13l389
$$ 103791 95186 91103 91321 91362 94555 89064 77909 77198 78929 80713 86607 82160 77628 76715 73326
16464G3326J749K909P368j052p212l678j0253L013P761j062l193m220n256j692
$$ 73326 75075 77984 85352 84300 77088 73410 63157 66170 73931 72869 69676 65456 60200 58508
16450E8508M964M045K52O62o276m162J460l985n035o96L572J952j640Q59M363
$$ 58508 63472 67517 67769 68431 62155 57993 59453 55468 50433 49737 53309 55261 53621 54480 58843
16435E8843K288M953J525m235q279m839l14k100j696j495J068O79j13l296j761
$$ 58843 61131 66084 67609 63374 55095 50256 49942 47842 46146 44651 45719 46398 46285 42989 41228
16420D1228N943K36m755m358m45M289N266j916J705M924l293q542q827q863n20
$$ 41228 47171 47407 42652 38294 37849 42138 47404 45488 47193 52117 48824 40282 31455 22592 22072
16405B2072Q274l503o878n344O275M781N354q97j1700L916q775J030J0576j220
$$ 22072 30346 26843 19965 14621 20896 25677 31031 30134 18434 22350 13575 14605 25181 23961
16391B3961m326m107o66M457L077P4J248j231l32o104k640O503k271k420J390
$$ 23961 19635 15528 14862 19319 22396 22470 23718 22487 22155 16051 13411 19914 17643 15223 16613
16376A6613M409J529M01j356J901p4k339j1242l000J383J2146L638K94k560k314
$$ 16613 21022 22551 22952 21596 23497 23423 21084 9842 6842 8225 20371 24009 24303 21743 19429
16361A9429o39l247R689J0774j427m253k44j18n514n555J003P59n072k241l33
$$ 19429 18790 15543 25232 36006 34579 30326 30082 29964 24450 18895 19898 20657 15585 13344 13011
16346A3011K671O002O503l667o966o016P345K652k675j832Q186K386L965j13M47
$$ 13011 15682 21684 28187 24520 17554 11538 18883 21535 18860 17028 25214 27600 31565 31452 31899
16331C1899N54L482o444J698N028j861q720k489K67L100Q529j889j032k742l689
$$ 31899 32453 35935 29491 31189 36217 34356 25636 23147 23414 26514 35043 33154 32122 29380 25691
16316B5691K387N730P68j286o109M1J724o692N82O55k421K298K206J739m38N292
$$ 25691 28078 33808 34576 33290 27181 27222 28946 22254 22836 23491 21070 23368 25574 27313 26875 32167
16300C2167R55o148k407n263q18K292J1000J422m437l451n057l927J401J878K630
$$ 32167 33122 26974 24567 19304 18486 20778 31778 33200 28763 25312 20255 16328 17729 19607 22237
16285B2237j217n08l01k827R17K650m157M69p742n026M090j326P50k904l654l464
$$ 22237 21020 20512 20211 17384 18301 20951 16794 17263 9521 4495 8585 7259 8009 5105 1451 -2013
16269b013K724Q165L104j325j506p144o06O230L901m752j145Q6k978j786M063
$$ -2013 711 8876 11980 10655 9149 2005 1399 7629 11530 6778 5633 5719 2741 955 5018
16254E018L185m077L55Q97R77M662l309N817p326k410k756J236j405J917K816
$$ 5018 8203 4126 4481 5378 6355 11017 7708 13525 6199 3789 1033 2269 864 2781 5597
16239E597n272R02N234Q710q94q868o41l79l048j337L431L332L636K568m922l69
$$ 5597 325 1227 6461 15171 14277 5409 4768 4389 1341 4 3435 6767 10403 12971 8049 7680
16223G680n475K294M049M30N769K925J964k318k956q465L039k090k317O515J3532
$$ 7680 2205 4499 8548 8978 14747 17672 19636 17318 14362 5897 8936 6846 4529 11044 24576
16208B4576Q546j0139j0732k717K973M352M457m96o112k069m208R94R640O505
$$ 24576 33122 22983 12251 9534 12507 16859 21316 20820 14708 12639 8431 9425 19065 25570
16194B5570J171n243J028L929J110k429k940M221M130K936j161k779p102O983
$$ 25570 26741 21498 22526 26455 27565 25136 22196 26417 30547 33483 32322 29543 22441 29424
16180B9424L908n922l775L16O881J371q619j2820N290J370l477n616k550J1003
$$ 29424 33332 27410 23635 23951 30832 32203 23584 10764 16054 17424 13947 8331 5781 16784
16166A6784J0926N450j490K497N594R689J0912J6418K3766K3714J3760L36j2160
$$ 16784 27710 33160 31670 34167 39761 49450 60362 76780 100546 124260 138020 138356 126196
16153A26196j8931j4824j0413n012J996J5578J6761K0273J7600K6615K2684J3803
$$ 126196 107265 92441 82028 77016 79012 94590 111351 131624 149224 175839 198523 212326
16141B12326J112o122j4810j6000m741K279R808J1678k411j0424o811O848P028
$$ 212326 213438 207316 192506 176506 171765 174044 183852 195530 193119 182695 175884 182732 189760
16128A89760N585k464j2465j5549n95J2756K0400J9114J3273p802k5024k9577
$$ 189760 195345 192881 180416 164867 164272 177028 197428 216542 229815 222013 196989 167412
16116A67412k6891j8944j7024j3250m197m398J164J9472J2995J5004O502m190
$$ 167412 140521 121577 104553 91303 87106 82708 83872 103344 116339 131343 137845 133655
16104A33655j5108j5199k0485k1104j1868L37l680o369l67J52J845n122p461j582
$$ 133655 118547 103348 82863 61759 49891 50228 46548 40179 39812 39964 41809 36687 29226 27644
16090B7644Q583m112j464n659l334K897M345J086P69m27o793p686M72M195M240
$$ 27644 36227 32115 30651 24992 21658 24555 28900 29986 30755 30328 23535 15849 16321 20516 24756
16075B4756k615n143N823P507k299r555N656j113L320K523o113m853L694N27k045
$$ 24756 22141 16998 22821 30328 28029 18474 24130 23017 26337 28860 22747 17894 21588 22115 20070
16060B0070n365K529K142p450o914j939K071K096K557k699m503L133n996k155
$$ 20070 14705 17234 19376 11926 5012 3073 5144 7240 9797 7098 2595 5728 -268 -2423
16046b423Q328R96j71o572K92O326J890j0932j409K562L784K865M841J338n582
$$ -2423 5905 6901 6730 158 450 6776 8666 -2266 -3675 -1113 2671 5536 10377 11715 6133
16031F133k631l188m695O33p26O003m190J020M381l787p26P324k242j804k159
$$ 6133 3502 314 -4381 -3748 -4474 1529 -2661 -1641 2740 -1047 -1773 5551 3309 1505 -654
16016f54Q87M553k335MM032m822j0035N72P187P32m670l054K253J241m549M059
$$ -654 233 4786 2451 2455 6487 1665 -8370 -7798 -611 121 -4549 -7603 -5350 -4109 -8658 -4599
16000d599l224m120P815N368j137m586l988m399n434K92L804P478j542n268O81
$$ -4599 -7823 -11943 -4128 1240 103 -4483 -8471 -12870 -18304 -18012 -14208 -6730 -8272 -13540 -12859
15985a2859L357L827K659O542l74k927j016q117j815Q254R674K866q016m254N05
$$ -12859 -9502 -5675 -3016 3526 3152 225 -791 -8908 -10723 -2469 7205 10071 2055 -2199 -1694
15970a694k934n999k520J823j923m039o242K560R375N044m789L513L594L191J681
$$ -1694 -4628 -10627 -13147 -11324 -13247 -17286 -23528 -20968 -11593 -6549 -11338 -7825 -4231 -1040 641
15955F41j164m871R65m300M432J0198l149l34J011N185m553m461j1372m15K706
$$ 641 -523 -5394 -4429 -8729 -4297 5901 2752 2418 3429 8614 4061 -400 -11772 -12187 -9481
15940i481q030P053R527M460q458n527O511J601k910j520M730n642j590J414r164
$$ -9481 -17511 -10458 -931 3529 -4929 -10456 -3945 -2344 -5254 -6774 -2044 -7686 -9276 -7862 -17026
15925a7026p4O604L717P690N82L938J054o404J4K08L810N74n677m886k883M16
$$ -17026 -17100 -10496 -6779 911 1493 5431 6485 81 95 303 4113 4687 -990 -5876 -8759 -8343
15909h343K005k470j090j456L933q61m333J051J315N184N175k850o083j805J723
$$ -8343 -6338 -8808 -9898 -11354 -7421 -8282 -12615 -11564 -10249 -5065 110 -2740 -8823 -10628 -8905
15894h905o5N29J774j799k097L832N061K951J309l346m724q409K56P461L272K951
$$ -8905 -8970 -8441 -6667 -8466 -10563 -6731 -1670 1281 2590 -756 -5480 -13889 -13633 -6172 -2900 51
15878E1J325n960r08k573k393K713P37R36Q651j895r042m900j407P511L912k891
$$ 51 1376 -4584 -5492 -8065 -10458 -7745 -7008 -6072 2579 684 -8358 -13258 -14665 -7154 -3242 -6133
15862f133l569m91K956j666K861k598p823J70M268j391l775j363Q044O114l13
$$ -6133 -9702 -10193 -7237 -8903 -6042 -8640 -16463 -16293 -12025 -13416 -17191 -18554 -10510 -4396 -4709
15847d709M0P39q947J435L725m029o556r0P681N996j268k557J990K480M24O02
$$ -4709 -4669 -3930 -12877 -11442 -7717 -11746 -18302 -18392 -10711 -4715 -5983 -8540 -6550 -4070 -3646 -3044
15831c044J606O27o965p245m218M603O298J80m716r60J869J833M82P99K801N16
$$ -3044 -1438 -811 -7776 -15021 -19239 -14636 -8338 -8158 -12874 -13834 -11965 -10132 -9650 -8851 -6050 -5534
15815e534k670k283J494K896M153J683Q33J719P299m382r012J011k559K402M479
$$ -5534 -8204 -10487 -8993 -6097 -1944 -261 572 2291 9590 5208 -3804 -2793 -5352 -2950 1529
15800A529l723r08N9K451l876K43k046L476K991m016K203K288J361k360q539J350
$$ 1529 -2194 -3102 -3043 -592 -4468 -4225 -6271 -2795 196 -3820 -1617 671 2032 -328 -8867 -7517
15784g517O745R13q231m189M337J3228L795n881q553n48J216n706k925M563N356
$$ -7517 -772 141 -8090 -12279 -7942 5286 9081 3200 -5353 -5901 -4685 -10391 -13316 -8753 -3397
15769c397K185j185q063k979j364N919M14j773J632k569L899k096K210J270j269
$$ -3397 -1212 -2397 -10460 -13439 -14803 -8884 -8470 -10243 -8611 -11180 -7281 -9377 -7167 -5897 -7166
15754g166p011K574J0426L72k463J235J741k011N97L613J811n218k55k27J0601
$$ -7166 -14177 -11603 -1177 -805 -3268 -2033 -292 -2303 -1706 1907 3718 -1500 -1755 -1982 8619
15739H619J390p915j616m90P140m801m523j292j782O600Q457N507j982o024K645
$$ 8619 10009 2094 478 -12 7128 2327 -2196 -3488 -5270 1330 9787 15294 13312 7288 9933
15724I933n171o540l277k493l562j971k811j06Q040Q944j92n721n724l63N622
$$ 9933 4762 -1778 -5055 -7548 -11110 -13081 -15892 -15998 -7958 986 794 -4927 -10651 -11014 -5392
15709e392o923m175L365K119Q400Q961l086j1920o338O715J309L091K160q081
$$ -5392 -12315 -16490 -13125 -11006 -2606 6355 3269 -8651 -14989 -8274 -6965 -3874 -1714 -9795
15695i795n854K678J125m008M787J231L661k54M466j243n938J963J310L287o825
$$ -9795 -15649 -12971 -11846 -15854 -11067 -9836 -6175 -6429 -1963 -3206 -9144 -7181 -5871 -2584 -9409
15680i409k631L038N044N710j985l732O456O915L584l820n720j271K139J459p47
$$ -9409 -12040 -9002 -3958 1752 -233 -3965 2491 9406 12990 9170 3450 2179 4318 5777 5030
15665E030j649j126m003m78J941n480j752o133M816K117l931K581j37l58L965
$$ 5030 3381 2255 -1748 -2226 -285 -5765 -7517 -13650 -8834 -6717 -10648 -8067 -8204 -8562 -4597
15650d597l11K844m185J414M842n225l693O89o0N260o517M012J724M060m705n279
$$ -4597 -4908 -2064 -6249 -4835 7 -5218 -8911 -8222 -8282 -3022 -9539 -5527 -3803 257 -4448 -9727
15634i727r16Q50O875L635J708k840p974m641M756K800k903P79K137j446k73M996
$$ -9727 -10643 -9793 -2918 717 2425 -415 -8389 -13030 -8274 -5474 -8377 -7598 -5461 -6907 -7180 -2184
15618b184j888j978N55Q4J32k235k784J902L688L012P540P80k393J300n74k622
$$ -2184 -4072 -6050 -5495 -5411 -5279 -7514 -10298 -8396 -4708 -1696 5844 6624 4231 5531 4957 2335
15602B335l782k964N186J710m495n776J260J108p722k934N321P45K296K558K813
$$ 2335 -1447 -4411 775 2485 -2010 -7786 -6526 -5418 -13140 -16074 -10753 -10008 -7712 -5154 -2341
15587b341K00o715M000M036p520l933o042p23M900N512M891j783K551l23J848
$$ -2341 -2141 -8856 -4856 -820 -8340 -12273 -18315 -19038 -14138 -8626 -3735 -5518 -2967 -3290 -1442
15572a442M820L289N034J185m165q894J56l79R21m489j162L292k21m604k141L946
$$ -1442 3378 6667 11701 12886 8721 -173 -17 -396 525 -3964 -5126 -1834 -2055 -6659 -8800 -4854
15556d854O891Q23j495J202m193K106M460M217m431r518j1104l338M234L291l43
$$ -4854 2037 2860 1365 2567 -1626 480 4940 9157 4726 -4792 -15896 -19234 -15000 -11709 -12052
15541a2052J824M203j595K082k151o418m221K34J094O396q10J228J498M052Q896
$$ -12052 -10228 -6025 -7620 -5538 -7689 -14107 -18328 -18094 -17000 -10604 -11414 -10186 -8688 -4636 4260
15526D260j973k955m278K93n48r990J848N186j157M31J674J048J441o27j310P406
$$ 4260 2287 -668 -4946 -4653 -5201 -15191 -13343 -8157 -9314 -8883 -7209 -6161 -4720 -5347 -6657 749
15510G49L100p069O89K494L574N66l929j161o226p249O95M908k420j370R47K905
$$ 749 3849 -3220 -2531 -37 3537 4103 174 -987 -7213 -14462 -13767 -8859 -11279 -12649 -11702 -8797
15494h797J0631K254M123l086p247q407p580l093Q461M703k593j429K372k552
$$ -8797 1834 4088 8211 5125 -2122 -10529 -18109 -21202 -12741 -8038 -10631 -12060 -9688 -12240
15480a2240L950O005L04m79k307k873o35j137M391M121L300Q45M091L04r330p658
$$ -12240 -8290 -2285 -1981 -2460 -4767 -7640 -8275 -9412 -5021 -900 2400 3245 7336 7640 -1690 -9348
15464i348j344k017j715n611l116l538O583P734m400n212M57P978Q056P455K134
$$ -9348 -10692 -12709 -14424 -20035 -23151 -26689 -20106 -12372 -16772 -21984 -21527 -13549 -5493 1962 4096
15449D096J507j1099j711M844k033n173o02j831q074P99N925R111j130j862N2
$$ 4096 5603 -5496 -7207 -2363 -4396 -9569 -10171 -12002 -20076 -19277 -13352 -4241 -5371 -7233 -7181
15434g181j588J194J091m905l977P16N365j566J948l110j335N899R24l044K133
$$ -7181 -8769 -7575 -6484 -11389 -15366 -14650 -9285 -10851 -8903 -12013 -13348 -7449 -6525 -9569 -7436
15419g436j029k813N68K052k308P15L119j852m957J60L32K941K02l013K041N067
$$ -7436 -8465 -11278 -10710 -8658 -10966 -10251 -7132 -8984 -13941 -13781 -13449 -10508 -10306 -13319 -11278 -6211
15403f211M892m118k398l624k419N359J0846j034n276R94m520k152k585N08L527
$$ -6211 -1319 -5437 -7835 -11459 -13878 -8519 2327 1293 -3983 -2989 -7509 -9661 -12246 -11738 -8211
15388h211J794M885j498n401o10L98l633J007L667m98k851l848J310J220J102
$$ -8211 -6417 -1532 -3030 -8431 -9041 -8643 -12276 -11269 -7602 -8100 -10951 -14799 -13489 -12269 -11167
15373a1167n350P15J081K158R56M096m50m272O931O947L765m612j0788L115m110
$$ -11167 -16517 -15802 -14721 -12563 -11607 -7511 -7961 -12233 -5302 1645 5410 798 -9990 -6875 -10985
15358a0985l192J138r610m912J0590Q362R588Q612p733q316n086n225M727P451
$$ -10985 -14177 -13039 -22649 -27561 -16971 -8609 979 9591 1858 -6458 -11544 -16769 -12042 -4591
15344d591K996K031q77n143l276J51M700K202n802J767m56J137K07n111J102K972
$$ -4591 -1595 436 -441 -5584 -8860 -8709 -4009 -1807 -7609 -5842 -6298 -5161 -4954 -10065 -8963 -5991
15328e991L816r70Q751J017l572j696j367o496k897L493j311o715l166l856N519
$$ -5991 -2175 -3145 5606 6623 3051 1355 -12 -6508 -9405 -5912 -7223 -13938 -17104 -20960 -15441
15313a5441Q13l681o49N068j306m113j495m205M18J702P341R490J1364P55n256
$$ -15441 -14628 -18309 -18958 -13890 -15196 -19309 -20804 -25009 -24591 -22889 -15548 -6058 5306 6061 805
15298H05m774q145J163J363J935p38p83k499M280K729q12n683K140Q73K521M072
$$ 805 -3969 -12114 -10951 -9588 -7653 -8391 -9174 -11673 -7393 -4664 -5476 -11159 -9019 -8146 -5625 -1553
15282a553p155N48Q632Q241n114r792J729J0382L229o596q812r03o910n662K325
$$ -1553 -8708 -8160 472 8713 3599 -6193 -4464 5918 9147 2551 -6261 -7164 -14074 -19736 -17411
15267a7411K871Q025p01k323j1R71q6j967k186J811q9M621n106j537K998J1839
$$ -17411 -14540 -6515 -7216 -9539 -9550 -8579 -8665 -10632 -12818 -11007 -11096 -6475 -11581 -13118 -10120 1719
15251A719m273n394l377M238k685l064K680N044M677M92M55n248Q81l299J158
$$ 1719 -2554 -7948 -11325 -7087 -9772 -12836 -10156 -5112 -435 57 512 -4736 -3855 -7154 -5996
15236e996L530j814N816M74p18k375m455n66L323J855p004o38K108M933Q520N07
$$ -5996 -2466 -4280 1536 2010 1292 -1083 -5538 -6104 -2781 -926 -7930 -8568 -6460 -1527 6993 7500
15220G500l054o052m945m322K152L84o415o114m611L365L273j289l115k66M514
$$ 7500 4446 -1606 -6551 -10873 -8721 -8337 -14752 -20866 -25477 -22112 -18839 -20128 -23243 -23509 -18995
15205a8995Q505j155K327K449M846O00j481J653J127k717p811K197K519N530n228
$$ -18995 -10490 -11645 -9318 -6869 -2023 -1423 -2904 -1251 -124 -2841 -10652 -8455 -5936 -406 -5634
15190e634j960L804M908J070r873m40k584K764p433k487L362J511j063k385J865
$$ -5634 -7594 -3790 1118 2188 -7685 -8125 -10709 -7945 -15378 -17865 -14503 -12992 -14055 -16440 -14575
15175a4575K83m799P86M288R644j565j776q183p218M438N334M089K758o71n841
$$ -14575 -14292 -19091 -18305 -14017 -4373 -5938 -7714 -15897 -23115 -18677 -13343 -9254 -6496 -7167 -13008
15160a3008K971M187L120J968j26L451n962k885o34k715J893m69p69j646J886
$$ -13008 -10037 -5850 -2730 -762 -888 2563 -3399 -6284 -6918 -9633 -7740 -8209 -8978 -10624 -8738
15145h738J191k543J922o40k32j004n336L927J317K50P49N164N72j393R48j535
$$ -8738 -7547 -10090 -8168 -8808 -9040 -10044 -15380 -11453 -10136 -9886 -9137 -3973 -3401 -4794 -3846 -5381
15129e381K476l100m247J395l522n28J565r17k796j264j710K132J047r24L289
$$ -5381 -2905 -6005 -10252 -8857 -12379 -12907 -11342 -12259 -15055 -16319 -18029 -15897 -14850 -15774 -12485
15114a2485M935j647r97L393k485J082o457n445O220M398l058L878J402M953k915
$$ -12485 -7550 -9197 -10194 -6801 -9286 -8204 -14661 -20106 -13886 -9488 -12546 -8668 -7266 -2313 -5228
15099e228l351J641M32p9L125j410l261r60m678K714M722L702M988l784p464m450
$$ -5228 -8579 -6938 -6506 -6585 -3460 -4870 -8131 -9091 -13769 -11055 -6333 -2631 2357 -1427 -8891 -13341
15083a3341r06j30M768K962j963J615N382l030J216j346l075j162J082N476k623
$$ -13341 -14247 -14377 -9609 -6647 -8610 -6995 -1613 -4643 -3427 -4773 -7848 -9010 -7928 -2452 -5075
15068e075m189L21m471m938K714O212k737J030R459P444l893q306J558Q05o489
$$ -5075 -9264 -8943 -13414 -18352 -15638 -9426 -12163 -11133 -1674 5770 1877 -6429 -4871 -4066 -10555
15053a0555M318L915O923J78n159k942Q70p157n794p23Q581Q234m111l332m982
$$ -10555 -6237 -2322 4601 4779 -380 -3322 -2452 -9609 -15403 -16126 -7545 689 -3422 -6754 -11736
15038a1736K589l89q55j224o192J035K916R250k574m587L955l431n431o067M3
$$ -11736 -9147 -9536 -10391 -11615 -17807 -16772 -13856 -4606 -7180 -11767 -7812 -11243 -16674 -22741 -22698
15023b2698O672O311K67j764LJ106j34O875m23Q249j475j1967k565J87q88O8L25
$$ -22698 -16026 -9715 -9448 -11212 -11209 -10103 -10237 -3362 -3785 4464 2989 -8978 -11543 -11356 -12244 -12176 -11851
15006a1851l348n528Q847k699o47J499n939j529Q555J518K834Q20l590L75K87
$$ -11851 -15199 -20727 -11880 -14579 -15226 -13727 -19666 -21195 -12640 -11122 -8288 -7468 -11058 -10683 -10396
14991a0396n00k53j568N571K03n5k343q481n236j533J324J392Q55M743n801K577
$$ -10396 -10896 -11149 -12717 -7146 -6943 -6998 -9341 -17822 -23058 -24591 -23267 -21875 -21020 -16277 -22078 -19501
14975a9501O419K174l065Q372k88m263k875k59N221K716J766O275q971j174j493
$$ -19501 -13082 -10908 -13973 -5601 -5889 -10152 -13027 -13286 -8065 -5349 -3583 2692 -6279 -7453 -8946
14960h946j400l68N449K216j906j292l092k676p707j195j240M758Q413N420L377
$$ -8946 -10346 -10714 -5265 -3049 -4955 -6247 -9339 -12015 -19722 -20917 -22157 -17399 -8986 -3566 -189
14945a89l130k085n235m758O135L959l428m616q4L979J407K168K160J158k569
$$ -189 -3319 -5404 -10639 -15397 -9262 -5303 -8731 -13347 -13431 -9452 -8045 -5877 -3717 -2559 -5128
14930e128K300p694m948M556Q097k48J46j672k906o862l46j833J830L043r77L248
$$ -5128 -2828 -10522 -15470 -10914 -2817 -3065 -2919 -4591 -7497 -14359 -14705 -16538 -14708 -11665 -12642 -9394
14914i394j32M022J576J324J718o768o375K944n24N553N964j024N07n641p693
$$ -9394 -9526 -5504 -3928 -2604 -886 -7654 -14029 -11085 -11609 -6056 -92 -1116 -609 -6250 -13943
14899a3943m628N573q90J334M454n538J875L862N07r65j756j841L389N929R5l099
$$ -13943 -18571 -12998 -13888 -12554 -8100 -13638 -11763 -7901 -7394 -8359 -10115 -11956 -8567 -2638 -2543 -5642
14883e642o005O83K168j373j700l274N71N920Q413K063L228K56j0724r438J774
$$ -5642 -11647 -10964 -8796 -10169 -11869 -15143 -14572 -8652 -239 1824 5052 5308 -5416 -14854 -13080
14868a3080N77k95q23J511k086N547M208P232q902o339j109M551J043q91j154
$$ -13080 -12503 -12798 -13621 -12110 -14196 -8649 -4441 2791 -6111 -12450 -13559 -9008 -7965 -8856 -10010
14853a0010p505M686j127l004l381J181K115K290k535J233P885O92m899m085P912
$$ -10010 -17515 -12829 -13956 -16960 -20341 -19160 -17045 -14755 -17290 -16057 -8172 -7480 -12379 -16464 -8552
14838h552j8j877m964l151l383n86K872m89J100J0043l533K176m755Q73M419R96
$$ -8552 -8570 -10447 -15411 -18562 -21945 -22531 -19659 -20148 -19048 -9005 -12538 -10362 -15117 -14244 -9825 -8829
14822h829q6P63K40n53k29J980O023l897n21j257j731k95j080J502M825k216m03
$$ -8829 -8915 -8152 -7912 -8465 -8694 -6714 -691 -4588 -5109 -6366 -8097 -8392 -9472 -7970 -3145 -5361 -5764
14805e764J38n581K414L429K440J228m972J803L966K958n725J376R790m58l593
$$ -5764 -5626 -11207 -8793 -5364 -2924 -1696 -6668 -4865 -899 2059 -3666 -2290 7500 7042 3449
14790C449p676k583j434l936P04R945J593k51q380N08J346m099n31q86K125P891
$$ 3449 -4227 -6810 -8244 -12180 -11476 -1531 62 -189 -8569 -8061 -6715 -10814 -11345 -12231 -10106 -2215
14774b215m22m043L181K652N57K365M011n16M215j731o417j0090O12Q637j543
$$ -2215 -2637 -6680 -3499 -847 -290 2075 6086 5570 9785 8054 1637 -8453 -7841 796 -747
14759g47p307o257N036N872N639m29n064r26O392k905n688O58N09K491j314L695
$$ -747 -8054 -14311 -9275 -3403 2236 1807 -3257 -4183 2209 -696 -6384 -5726 -5217 -2726 -4040 -345
14743c45N10j469J135k184l657j645J113P749J175p919n165l965o599N63J4090
$$ -345 165 -1304 -169 -2353 -6010 -7655 -6542 1207 2382 -5537 -10702 -14667 -21266 -20703 -6613
14728f613Q168p726l034P478N354l145r727q04Q52L293J223l414m918m055M041
$$ -6613 1555 -6171 -9205 -1727 3627 482 -9245 -10049 -9197 -5904 -4681 -8095 -13013 -17068 -13027
14713a3027O861J981K26JM743k182M282P906L693k814l667j664n986p42L391K903
$$ -13027 -6166 -4185 -3959 -3958 785 -1397 2885 10791 14484 11670 8003 6339 353 -389 3002 5905
14697E905K385j891J620N4k895N328j80m500K333n47j410j764P714j714n500l159
$$ 5905 8290 6399 8019 8073 5178 10506 10326 5826 8159 7612 6202 4438 12152 10438 4938 1779
14681A779r31j300K221L494n89n529m301k451j799k755K515j623k728O099R159
$$ 1779 848 -452 1769 5263 4674 -855 -5156 -7607 -9406 -12161 -9646 -11269 -13997 -7898 1261
14666A261Q901l953j434J284k2J94o479o049J586J372l295k323q77J519J1483
$$ 1261 10162 6209 4775 6059 6037 6231 -248 -6297 -4711 -3339 -6634 -8957 -9834 -8315 3168
14651C168Q238m922m279k221n553k900L565R69l087Q271J1490l511n728o855q24
$$ 3168 11406 6484 2205 -16 -5569 -8469 -4904 -3935 -7022 1249 12739 9228 3500 -3355 -4179
14636d179L537k576L727l476k434K246L081q76o187j900L990K734k086K080N67
$$ -4179 -642 -3218 509 -2967 -5401 -3155 -74 -950 -7137 -9037 -5047 -2313 -4399 -2319 -1752
14621a752m329J871K893o943m726O277J155K026K792n012j168J101J941K935j474
$$ -1752 -6081 -4210 -1317 -8260 -12986 -6709 -5554 -3528 -736 -5748 -6916 -5815 -3874 -939 -2413
14606b413m926r209Q63O546M452R028J320j17l802m977o661L316M342j108p209
$$ -2413 -7339 -16548 -15685 -9139 -4687 4341 5661 5544 1742 -3235 -9896 -6580 -2238 -3346 -10555
14591a0555n37J149J1124j668M42J185J099m902O02R546J176o821m490j373m459
$$ -10555 -11092 -9943 1181 -487 -45 1140 2239 -2663 -2061 7485 8661 1840 -2650 -4023 -8482
14576h482O126N082M639l445R46O54J083p33n154k452j905K71J535j846n852N491
$$ -8482 -2356 2726 7365 3920 4866 5520 6603 5870 716 -1736 -3641 -3370 -1835 -3681 -9533 -4042
14560d042O489k714M08j80j091m915N35Q80M896q51m633j69J088J468J705J505
$$ -4042 2447 -267 141 -39 -1130 -6045 -5510 -4630 266 -585 -5218 -5387 -4299 -2831 -1126 379
14544C79m277K178l758K458l372N09M597r8l316M417J004m855K787N839J666o594
$$ 379 -3898 -1720 -5478 -3020 -6392 -5883 -1286 -1384 -4700 -283 721 -4134 -1347 4492 6158 -436
14528d36p207j960j961N129K424K800o73l156K327k26J690J933o23k168J844j205
$$ -436 -7643 -9603 -11564 -6435 -4011 -1211 -1884 -5040 -2713 -2939 -1249 684 61 -2107 -263 -1468
14512a468M216O287J871j349j374q359k16L97k672o79l67l353N671L070j06M704
$$ -1468 2748 9035 10906 9557 8183 -176 -392 5 -2667 -3346 -3713 -7066 -1395 1675 1569 6273
14496F273j963j311M472r481p613m22L531O081J276k673j860N6o11j822n03r38
$$ 6273 4310 2999 7471 -2010 -9623 -10045 -6514 -433 843 -1830 -3690 -3634 -4245 -6067 -6570 -7508
14480g508P64M956k871J649p35n578N54K485o5J560K244J304l608m170L47R76
$$ -7508 -6744 -1788 -4659 -3010 -3745 -9323 -8769 -6284 -6349 -4789 -2545 -1241 -4849 -9019 -8672 -7696
14464g696M649K959n418j713J542j243L720n222j318L761J060K29N1p582J633
$$ -7696 -3047 -88 -5506 -7219 -5677 -6920 -3200 -8422 -9740 -5979 -4919 -4690 -4639 -12221 -10588
14449a0588K543K262O339P242O29p400m875q26q34r45j234k674k793q06O122j223
$$ -10588 -8045 -5783 556 7798 8427 1027 -3848 -4674 -5508 -6453 -7687 -10361 -13154 -13960 -7838 -9061
14433i061l447k615k738o9J627P254M885n591O353L129j743j624p143m014l619
$$ -9061 -12508 -15123 -17861 -17930 -16303 -9049 -4164 -9755 -3402 -273 -2016 -3640 -10783 -14797 -18416
14418a8416p2M721J357N190K746J256J506j808O09J383l680K245J975p87l025
$$ -18416 -18488 -13767 -12410 -7220 -4474 -3218 -1712 -3520 -2911 -1528 -5208 -2963 -988 -1775 -4800
14403d800q63k779K844O19O21K267M615J3184k322p681M21l670J244J181K710
$$ -4800 -5663 -8442 -5598 -4979 -4358 -2091 2524 15708 13386 5705 6126 2456 3700 4881 7591
14388G591m303m807k200j937L71N674M228o21o292n628L70K162j71j125O172k965
$$ 7591 3288 -1519 -3719 -5656 -5285 389 4617 3996 -2296 -7924 -7554 -5392 -5563 -6688 -516 -3481
14372c481r363L766K126J186l575N71M208k98J860n329m400K736l25j69j945N90
$$ -3481 -12844 -9078 -6952 -5766 -9341 -8770 -4562 -4860 -3000 -8329 -12729 -9993 -10318 -10487 -12432 -11842
14356a1842M780O213M383k583q586q310R637J1802n109j226O477N250j913J333
$$ -11842 -7062 -849 3534 951 -7635 -15945 -6308 5494 385 -841 5636 10886 8973 10306
14342A0306J006o761m093l34k292l769M801Q535M766l888j817J908q51j22l114
$$ 10306 11312 4551 458 124 -2168 -5937 -1136 7399 12165 8277 6460 8368 7517 7395 4281
14327D281K960K415l575o08j922n349k361M741K131o471l307K334J939P634P330
$$ 4281 7241 9656 6081 5473 3551 -1798 -4159 582 2713 -3758 -7065 -4731 -2792 4842 12172
14312A2172L178l484o926k954N295K992l006l539M765R364o339P965J8485R457
$$ 12172 15350 11866 4940 1986 7281 10273 7267 3728 8493 17857 11518 19483 37968 47425
14298D7425R330J2877Q226J1647R680Q220J1317m236j5669o419Q35M401M751m314
$$ 47425 56755 69632 77858 89505 99185 107405 118722 114486 98817 92398 93233 97634 102385 98071
14284I8071o781q71o700j6008j4576o855n502j778n187j3023q798n567k43O438
$$ 98071 91290 90419 83719 67711 53135 46280 40778 39000 33813 20790 11992 6425 6182 12620
14270A2620O500k293n115k151j802M18L282P38L137L890l209J724J949k533k689
$$ 12620 19120 16827 11712 9561 7759 8177 11459 12197 15334 19224 16015 17739 19688 17155 14466
14255A4466l403j0469j973Q79l105K582Q57N00j437O937j165n111M107Q7M205
$$ 14466 11063 594 -1379 -500 -3605 -1023 -166 334 -1103 5834 4669 -442 3665 3752 7957
14240G957j544l661n004k595M021l30j775k368k22O964K092L9R41K73k162k281
$$ 7957 6413 2752 -2252 -4847 -826 -1156 -2931 -5299 -5521 1443 3535 3574 4515 4788 2626 345
14224C45k295L251J429n27J356n692p594M901P443K58m677O26R81k386j142l034
$$ 345 -1950 1301 2730 2203 3559 -2133 -9727 -4826 2617 2875 -1802 -1176 -195 -2581 -3723 -6757
14208f757L396L64l305o82J319L316j798K658K761o252m22P26l855j586m746M617
$$ -6757 -3361 -2997 -6302 -6984 -5665 -2349 -4147 -1489 1272 -4980 -5402 -4676 -8531 -10117 -14863 -10246
14192a0246P42j317M324L777N536R230l947l677m876M269m845q486J673L860k497
$$ -10246 -9504 -10821 -6497 -2720 2816 12046 8099 4422 -454 3815 -1030 -9516 -7843 -3983 -6480
14177f480j032O669J270k771j483M094p08J35Q97l824P99n6L34L041J182m335
$$ -6480 -7512 -843 427 -2344 -3827 267 -441 -306 591 -3233 -2434 -2490 -2156 885 2067 -2268
14161b268J765L447L463k346j497p01M829o499o165O459J785j005m169j980L930
$$ -2268 -503 2944 6407 4061 2564 1863 6692 193 -5972 487 2272 1267 -2902 -4882 -952
14146i52O66l591O89J340K610J145n795m395Q183M091K494M078M330Q16p904m455
$$ -952 -286 -3877 -3188 -1848 762 1907 -3888 -8283 -100 3991 6485 10563 14893 15709 7805 3350
14130C350p448k529M202J967m241k681K592L032M371K194j972q624j867P091K595
$$ 3350 -4098 -6627 -2425 -458 -4699 -7380 -4788 -1756 2615 4809 2837 -5787 -7654 -563 2032
14115B032j279l719J284L199R451M297j1731m264J933N168L360J635m474M849
$$ 2032 753 -2966 -1682 1517 10968 15265 3534 -730 1203 6371 9731 11366 6892 11741
14101A1741r26k390K730k734n810q47L780k929n740q854K54J3702J582j0786k550
$$ 11741 10815 8425 11155 8421 2611 1764 5544 2615 -3125 -11979 -11725 1977 3559 -7227 -9777
14086i777O258J931j16k898l735j586K066J727k602P545M585n463O21K052J855
$$ -9777 -3519 -1588 -1704 -4602 -8337 -9923 -7857 -6130 -8732 -1187 3398 -2065 -1444 608 2463
14071B463R14L99o420r613J660O970K371P569l975k049O645j819n767J137K574
$$ 2463 3377 3776 -2644 -12257 -10597 -3627 -1256 6313 2338 289 6934 5115 -652 485 3059
14056C059M54l993K65P69n142m891Q08J823k677k92Q62j569P901L759m208p747
$$ 3059 3513 -480 -215 554 -4588 -9479 -8671 -6848 -9525 -9817 -8955 -10524 -2623 1136 -3072 -10819
14040a0819L45R16J717j404J869j594j277M771P273P00l008m675J960N525R68
$$ -10819 -10474 -9558 -7841 -9245 -7376 -8970 -10247 -5476 1797 2497 -511 -5186 -3226 2299 3267
14025C267l888j377K244j341l904L9Q196L669J390r3p756p750L644J211l079K970
$$ 3267 -621 -1998 246 -1095 -4999 -4960 3236 6905 8295 8202 446 -7304 -3660 -2449 -5528 -2558
14009b558O534L369J454o771k353l162J361j483k728n359o09j447l587J769O176
$$ -2558 3976 7345 8799 2028 -325 -3487 -2126 -3609 -6337 -11696 -12305 -13752 -17339 -15570 -9394
13994i394L263N621L214N590l008l811N464j351n82k955K02p39J245J731n940
$$ -9394 -6131 -510 2704 8294 5286 1475 6939 5588 5006 2051 2253 1514 2759 4490 -1450
13979a450p097J997M048k198P27m036m574Q509P595Q022p01J072n611l268J896
$$ -1450 -8547 -6550 -2502 -4700 -3973 -8009 -12583 -4074 3521 11543 10842 11914 6303 3035 4931
13964D931J946Q34l763k797k191k344k159K306r95Q93p30m096L138M098k223j1759
$$ 4931 6877 7711 3948 1151 -1040 -3384 -5543 -3237 -4232 -3339 -4069 -8165 -5027 -929 -3152 -14911
13948a4911k286M02M576L078K618J2006M215n913O117L243m865n023k330m538
$$ -14911 -17197 -16795 -12219 -9141 -6523 5483 9698 3785 9902 13145 8280 3257 927 -3611
13934c611j83l327N298N899n14l007m754Q13q55R609M776m35q623K140L659P43
$$ -3611 -3794 -7121 -1823 4076 3562 555 -4199 -3386 -4241 5368 10144 9709 1086 3226 6885 7628
13918G628J262l025m768N247k032K794j063l616n331n636L338O631j763k5O38
$$ 7628 8890 5865 1097 6344 4312 7106 6043 2427 -2904 -8540 -5202 1429 -334 -359 279
13903B79O831O67P84l225M01K103o297k371n03j83K240J458o447p097L435L841
$$ 279 7110 7777 8561 5336 5737 7840 1543 -828 -1331 -1514 726 2184 -4263 -11360 -7925 -4084
13887d084P377K01K121j1804P39J2625k571m231J84q434k447N451O959K306l431
$$ -4084 3293 3494 5615 -6189 -5450 7175 4604 373 557 -7877 -10324 -4873 2086 4392 961
13872I61M891J208k718l201K225N358N131K604l308n763j409m77k566N770J462
$$ 961 5852 7060 4342 1141 3366 8724 13855 16459 13151 7388 5979 5502 2936 8706 10168
13857A0168r016n741l697l603P087M107M018J97q093k250M020K797K697R36O53
$$ 10168 1152 -4589 -8286 -11889 -4802 -695 3323 3520 -4573 -6823 -2803 -6 2691 3627 4280
13842D280k307p18K949l031Q53n614k616R781L226n013p669J488J908k659o4j437
$$ 4280 1973 1255 4204 1173 2026 -3588 -6204 3577 6803 1790 -5879 -4391 -2483 -5142 -5206 -6643
13826f643k063m151k585O163M088M566K861K960o431n629o145l513P94J922J570
$$ -6643 -8706 -12857 -15442 -9279 -5191 -625 2236 5196 -1235 -6864 -13009 -16522 -15728 -13806 -12236
13811a2236N068N69n946M240M338k023l527o88K775N855P444q11l926j406O648
$$ -12236 -7168 -6599 -12545 -8305 -3967 -5990 -9517 -10205 -7430 -1575 5869 5058 1132 -274 6374
13796F374O061K868j800n129k677l531L84l931l692M558M05K332K523n567r535
$$ 6374 12435 15303 13503 8374 5697 2166 2550 -1381 -5073 -515 -110 2222 4745 -822 -10357
13781a0357q99O241P330j975q79k803P65o322K974k892k452J591L82M862m79m828
$$ -10357 -11256 -5015 2315 340 -539 -3342 -2577 -8899 -5925 -8817 -11269 -9678 -9296 -4434 -4913 -9741
13765i741L793R904j155j977j411m192J68O064L25q98L847k70J085j883l232J326
$$ -9741 -5948 3956 2801 824 -587 -4779 -4611 1453 1778 880 4727 4457 5542 3659 427 1753
13749A753O467l721k804K588L657k176l294M33K442m456o903j762L904N54j176
$$ 1753 8220 4499 1695 4283 7940 5764 2470 2903 5345 889 -6014 -7776 -3872 -3318 -4494
13734d494K029K676j657J278l792L316Q7K535J261p40k583j643R102r084M055
$$ -4494 -2465 211 -1446 -168 -3960 -644 -557 1978 3239 2499 -84 -1727 7375 -1709 2346
13719B346M413K639L679J747k186Q7j268m526n391j146J6J081o108n08M381j114
$$ 2346 6759 9398 13077 14824 12638 12725 11457 6931 1540 394 410 1491 -4617 -5125 -744 -1858
13703a858j999M937L955n80L003J881M466j643K34Q69j791j823k237J191j696
$$ -1858 -3857 1080 5035 4455 7458 9339 13805 12162 12396 13265 11474 9651 7414 8605 6909
13688F909O86J562o906J7K359m49O663L457l863j667N915j007r76j747l523Q00
$$ 6909 7595 9157 2251 2268 4627 4178 10841 14298 10435 8768 14683 13676 12700 10953 7430 8230
13672H230l141l748Q5N903K794k092N188N523J749l477l663k720r70l013l933
$$ 8230 5089 1341 1426 7329 10123 8031 13219 18742 20491 17014 13351 10631 9661 6648 2715
13657B715p472j0793l920O234M570M175N69k527L49N476n1m103J56R459l754o389
$$ 2715 -4757 -15550 -19470 -13236 -8666 -4491 -3922 -6449 -6100 -624 -675 -4778 -4622 4837 1083 -5306
13641e306M471k263K532k273M06L95K927M258J420K223j790M85J964n332J402
$$ -5306 -835 -3098 -566 -2839 -2433 -2038 889 5147 6567 8790 7000 7485 9449 4117 5519
13626E519l55k613K871K089l348L50l652q217M363P724L010j223n087j773K739
$$ 5519 5164 2551 5422 7511 4163 4513 861 -7356 -2993 4731 7741 6518 1431 -342 2397
13611B397P32m222M977N76L00k752m534n133K213L66j40J530L29K21o50M796N222
$$ 2397 3129 -1093 3884 4460 4760 2008 -2526 -7659 -5446 -5080 -5220 -3690 -3361 -3140 -3790 1006 6228
13594F228J316N396n651l987J337N327J0295l001j0464j834l102p637n63L787
$$ 6228 7544 12940 7289 3302 4639 9966 20261 17260 6796 4962 1860 -5777 -6340 -2553
13580b553K774k252K285R60k053o811J939Q518N315M66N332P1j0564l745q591
$$ -2553 221 -2031 254 1214 -839 -7650 -5711 2807 8122 8588 13920 13991 3427 -318 -8909
13565h909J632Q85P826M770k862J345j912M06J1768J861l527p693j998m776J507
$$ -8909 -7277 -6392 1434 6204 3342 4687 2775 3181 14949 16810 13283 5590 3592 -1184 323
13550C23N102N661k678L310K574l168l637o208l146j168Q368P588o40R80k962
$$ 323 5425 11086 8408 11718 14292 11124 7487 1279 -1867 -3035 5333 12921 12281 13261 10299
13535A0299j185l963k11k491p296L17P360J273j389k767m80R46M52m28p359N649
$$ 10299 9114 5151 4940 2449 -4847 -4530 2830 4103 2714 -53 -533 413 865 437 -6922 -1273
13519a273J584O208L746L378N546O34k508n457m560m028j770R696L200k192k364
$$ -1273 311 6519 10265 13643 19189 19823 17315 11858 7298 3270 1500 11196 14396 12204 9840
13504I840j393L069R76J344R1N32r51m235p915J13J427L188l509j369K763M08
$$ 9840 8447 11516 12492 13836 13927 14459 13508 9273 1358 1471 2898 6086 2577 1208 3971 4379
13488D379K082K335J727P236L582o271r950l679Q448J926n537P27J159J602m354
$$ 4379 6461 8796 10523 17759 21341 15070 5120 1441 9889 11815 6278 7005 8164 9766 5412
13473E412L457K005p31k172J135n46L867J713m300K713K902m721k714N43k055
$$ 5412 8869 10874 10143 7971 9106 8560 12427 14140 9840 12553 15455 10734 8020 8563 6508
13458F508N429Q017p256p959K746J1022p74o471q058j348j919J350n48J240L42
$$ 6508 11937 19954 12698 4739 7485 18507 17733 11262 3204 1856 -63 1287 739 1979 2321
13443B321j411J267L9K333O077r47K35m53j107L58q547o819O429O304O556J65
$$ 2321 910 2177 2216 4549 10626 9679 9914 9461 8354 8712 165 -6654 -225 6079 12635 12800
13427A2800k584n783N60O730L469K928L498J358m741j0577j43q34n57P199m92
$$ 12800 10216 4433 4993 11723 15192 18120 21618 22976 18235 7658 7515 6681 6124 13323 12831
13412A2831M97n437J799Q810J799m072j750k138K598P175K146p686p369n592r01
$$ 12831 13328 7891 9690 18500 20299 16227 14477 12339 14937 22112 24258 16572 9203 3611 2710
13397B710P054j812J863K713K223L25j786k236j748l645o156j397K188J1246Q544
$$ 2710 9764 7952 9815 12528 14751 15076 13290 11054 9306 5661 -495 -1892 296 11542 20086
13382B0086l769p285j637k517l32o219k206J547O635k323J318Q225K498J786j636
$$ 20086 16317 9032 7395 4878 4546 -1673 -3879 -2332 4303 1980 3298 11523 14021 15807 14171
13367A4171k403j863O284J884l46k257J710l932M85lL527O033L002O49o952r216
$$ 14171 11768 9905 16189 18073 17727 15470 17180 13248 13733 13730 17257 23290 26292 26941 19989 10773
13351A0773j658n67l020k311M717K256Q05J0478k424m38K62l017k295P91M271
$$ 10773 9115 8548 5528 3217 7934 10190 10995 21473 19049 18611 18873 15856 13561 14352 18623
13336A8623K083k202o25m315p51L937J966l28j394N503m488p084l497K871p36
$$ 18623 20706 18504 17879 13564 12813 16750 18716 18388 16994 22497 18009 10925 7428 10299 9563
13321I563L59N909L435j316N787M480M410L586m701q181J943J577m297j346L174
$$ 9563 9922 15831 19266 17950 23737 28217 32627 36213 31512 23331 25274 26851 22554 21208 24382
13306B4382K646j159o947J801M853m275l438j527k765j905J977N362j418p08k918
$$ 24382 27028 25869 18922 20723 25576 21301 17863 16336 13571 11666 13643 19005 17587 16879 13961
13291A3961L006J832P5o520q64K971m85J1038M70j0981j933O37m09k98k336j561
$$ 13961 16967 18799 18874 12354 11490 14461 13976 25014 25484 14503 12570 13207 12798 12500 10164 8603
13275H603R380J821J009L819j045n91p52n305l866k549q09K892J770m197k431
$$ 8603 17983 19804 20813 24632 23587 22996 22244 16939 13073 10524 9715 12607 14377 10180 7749
13260G749M589J738l548l391j380L711M591J3315O082J536o636K149J932m667
$$ 7749 12338 14076 10528 7137 5757 9468 14059 27374 33456 34992 28356 30505 32437 27770
13246B7770k590J899P015J1628K195k376m021n041O73L307n016K332N224J0138
$$ 27770 25180 27079 34094 45722 47917 45541 41520 36479 37152 40459 35443 37775 42999 53137
13232E3137L880n343M494Q666R922k349m973m979O10P721O267J0156J6337J6655
$$ 53137 57017 51674 56168 64834 74756 72407 67434 62455 63065 70786 77053 87209 103546 120201
13218A20201K5226L7123M8641O5590R7272J17668J09876Q1724L9217k7547q1476
$$ 120201 145427 182550 231191 296781 394053 511721 621597 703321 742538 714991 633515
13207F33515j06509j05003r4860p0661m3662l0107j9818j4671j6064j6123j0723
$$ 633515 527006 422003 327143 256482 212820 182713 162895 148224 132160 116037 105314
13196A05314k792k502l235j762q958o421j496l383m745n832M177L403n857j088
$$ 105314 102522 100020 96785 95023 86065 79644 78148 74765 70020 64188 68365 71768 65911 64823
13182F4823N21J98J589m519j316q5L762j315M53J470m312P82J257l184J026J064
$$ 64823 65344 65542 67131 62612 61296 61211 64973 63658 64111 65581 61269 62051 63308 60124 61150 62214
13166F2214l619J083k53Q278m467n205q661P6L943l661m348l06j441M071j015
$$ 62214 58595 59678 59425 67703 63236 58031 49370 49446 53389 49728 45380 45074 43633 47704 46689
13151D6689J235k738n193o721J132O24K998J907j740l960l393l520K808N202m394
$$ 46689 47924 45186 39993 33272 34404 35028 38026 39933 38193 34233 30840 27320 30128 35330 30936
13136C0936J983R077Q159J09L678Q359N726J0057J6714O934M526l269j3423r994
$$ 30936 32919 41996 50155 50264 53942 62301 68027 78084 94798 101732 106258 102989 89566 79572
13122G9572l590n685L124l101r861j922n784j0014r70l744m267j220L095O58l725
$$ 79572 75982 70297 73421 70320 60459 58537 52753 42739 41769 38025 33758 32538 35633 36291 32566
13107C2566j031J511K294M848L023k880J259j013P346K141k442K621N804L070
$$ 32566 31535 33046 35340 40188 43211 40331 41590 40577 47923 50064 47622 50243 56047 59117
13093E9117p660l316n602J76N237J945j008n043n486K660j377N426Q746J1264
$$ 59117 51457 48141 42539 42715 47952 49897 48889 43846 38360 41020 39643 45069 53815 65079
13079F5079J5063Q396J0720J7486J6001k18L284m402r691j0650j8291j0934j0127
$$ 65079 80142 88538 99258 116744 132745 132527 135811 131409 121718 111068 92777 81843 71716
13066G1716m629k462M697n77q758l713N173M184k164l125N924O477L537J022l56
$$ 71716 67087 64625 69322 68745 59987 56274 61447 65631 63467 60342 66266 72743 76280 77302 76946
13051G6946P06J1789R268m51K393R053J5277J7764J1770J4059J4697l88j309r624
$$ 76946 77652 89441 98709 98258 100651 109704 124981 142745 154515 168574 183271 182883 181574 171950
13037A71950j1050l446j2121j4460q822p832l803q083r524j0224j2201q152m200
$$ 171950 160900 157454 145333 130873 122051 114219 110416 102333 92809 82585 70384 62232 58032
13024E8032O098k136n479l547L878L841J523M105O767P002J277p278j033N332
$$ 58032 64130 61994 56515 52968 56846 60687 62210 66315 73082 80084 81361 74083 73050 78382
13010G8382N370r66l109m414J85r38L087L16j071l150n22K206j566k17j936L843
$$ 78382 83752 82786 79677 75263 75448 74510 77597 77913 76842 73692 73170 75376 73810 73593 71657 75500
12994G5500R455P596L005K909k220l715N540J664k51j304O269o087r564K360J2960
$$ 75500 84955 92551 95556 98465 96245 92530 98070 99734 99483 98179 104448 98361 88797 91157 104117
12979A04117P557J1613R426R347L781O926M709k798o872j04j578p846P79j44J953
$$ 104117 111674 123287 132713 142060 145841 152767 157476 154678 147806 147702 146124 138278 139057 138913 140866
12964A40866n03n221p235q602k062o81N027j391p667L188k941r613J065J379J4
$$ 140866 140363 135142 127907 119305 117243 116562 121589 120198 112531 115719 112778 103165 104230 105609 105623
12949A05623K859p50K206L174l710j37J2M828l299j052O377J58j0039p298n954
$$ 105623 108482 107732 109938 113112 109402 109265 109277 114105 110806 109754 116131 116289 106250 98952 92998
12934I2998k533M46J552k54P493P131K448Q800Q233R300M492M75j0012p4l69K136
$$ 92998 90465 90911 92463 92209 99702 106833 109281 118081 126314 135614 140106 140581 130569 130495 130126 132262
12918A32262J1108J1720M910P659J5341K3425J9442J7738O166j002k434n745n426
$$ 132262 143370 155090 160000 167659 183000 206425 225867 243605 249771 248769 246335 240590 235164
12905B35164J499j2253k703K41l007l366l305j530k460N177J2682K075K12P859
$$ 235164 236663 224410 221707 221948 218941 215575 212270 210740 208280 213457 226139 228214 228426 236285
12891B36285J617Q330J5834J9932K2262K5785K0155P280n60j0899j7297j4287
$$ 236285 237902 246232 262066 281998 304260 330045 350200 357480 356920 346021 328724 314437
12879C14437q896N96O636L258J1958Q017N046R069J3422J5111J0096L334R600
$$ 314437 305541 306137 312773 316031 327989 336006 341052 350121 363543 378654 388750 392084 401684
12866D01684J3126J2600P652Q882J5456R557J0790R887J2697J6413J7479O397
$$ 401684 414810 427410 435062 443944 459400 468957 479747 489634 502331 518744 536223 542620
12854E42620M282J6908J1560J1129J7575L2022L0714L6608L7735L0421L1000K8058
$$ 542620 546902 563810 575370 586499 604074 636096 666810 703418 741153 771574 802574 830632
12842H30632J2249P139J1826Q875N232J2533J7375Q340P294K2256K5551K6941
$$ 830632 842881 850020 861846 870721 875953 888486 905861 914201 921495 943751 969302 996243
12830I96243L1952L1593L3619L6745L6330K7198K4407L6231M1231O2572Q8223
$$ 996243 1028195 1059788 1093407 1130152 1166482 1193680 1218087 1254318 1295549 1358121 1446344
12819A446344R1490Q4155Q0070P1364P4176Q9271J09480J35180J61325J84986
$$ 1446344 1537834 1621989 1702059 1773423 1847599 1936870 2046350 2181530 2342855 2527841
12809B527841K28615K79921L51652M49651N60963O67836P63675Q20236Q65613
$$ 2527841 2756456 3036377 3388029 3837680 4398643 5066479 5830154 6650390 7516003
12800G516003R38462J053124J227389J524761K052152K862329M081873N925313
$$ 7516003 8454465 9507589 10734978 12259739 14311891 17174220 21256093 27181406
12792B7181406Q701983J2934236J8875450K5034363K6810232K0049216N565309
$$ 27181406 35883389 48817625 67693075 92727438 119537670 139586886 145152195
12785A45152195j0869066k1650299k3941664k0631221j5844775j1505600q142501
$$ 145152195 134283129 112632830 88691166 68059945 52215170 40709570 32567069
12778C2567069n760711m121818k981760k194140j645079j263751j030211r05086
$$ 32567069 26806358 22684540 19702780 17508640 15863561 14599810 13569599 12664513
12770A2664513q75705q85719q38864p35383o18796n08396m21475l47196l00200
$$ 12664513 11788808 10903089 10064225 9328842 8710046 8201650 7780175 7432979 7132779
12761G132779k55798k17239j79422j57570j27142j03932p5668m7188j6336J5120
$$ 7132779 6876981 6659742 6480320 6322750 6195608 6091676 6016008 5968820 5952484 5967604
12751E967604K9683J5334l5853j17073j86100k40205k59484k67210k59434k43879
$$ 5967604 5997287 6012621 5976768 5859695 5673595 5433390 5173906 4906696 4647262 4403383
12741D403383k27401k08173j90256j76350j63984j59626j59909j48361j35907
$$ 4403383 4175982 3967809 3777553 3601203 3437219 3277593 3117684 2969323 2833416
12732B833416j17015j04088r4403j03104j03935j11238j09709j00529r6577q9934
$$ 2833416 2716401 2612313 2517910 2414806 2310871 2199633 2089924 1989395 1892818 1802884
12722A802884q5174p1681o5910o6453n7207n6337m1482l7991l2605k0983k1979
$$ 1802884 1717710 1646029 1580119 1513666 1456459 1400122 1358640 1320649 1288044 1267061 1245082
12711A245082p458J5024M1876O2003Q8312J02451J02871Q1340M7219P434m4285
$$ 1245082 1237624 1252648 1294524 1356527 1444839 1547290 1650161 1731501 1778720 1786154 1741869
12700A741869q2836j21778j44833j42725j40722j24293j02257q2483p1404o4504
$$ 1741869 1659033 1537255 1392422 1249697 1108975 984682 882425 799942 728538 664034
12690F64034n2203m4220l4576k7884k9007k2672j9166j4658j0029j0166j7208
$$ 664034 611831 567611 533035 505151 476144 453472 434306 419648 409619 399453 382245
12679C82245j3740j1563n633j0513j6014j3452o723N80m961j063J930J810l195
$$ 382245 368505 356942 351309 340796 324782 311330 304607 305187 300226 299163 301093 302903 299708
12666B99708n445o487k6281k8874M263L1387N3724M5486J3763j7465k6135k5800
$$ 299708 294263 287776 261495 232621 236884 268271 321995 367481 381244 363779 337644 311844
12654C11844k3388j8935j3954j3544j7939j1764q797o593n943j116M874j613j174
$$ 311844 288456 269521 255567 242023 224084 212320 203523 196930 190987 189871 194745 193132 191958
12641A91958l725m207m255m923n291m361r150j5434r609q03k150j381P013j587
$$ 191958 188233 184026 179771 174848 169557 165196 156046 140612 131003 130200 128050 126669 133682 132095
12627A32095o888j309J394N469O707O476M388L046R072N648K735k436l106J093
$$ 132095 125207 123898 125292 130761 137468 143944 148332 151378 160450 166098 168833 166397 163291 164384
12613A64384J354k373P553L130m161j638l570J68k007p850o938L649o06L738L70
$$ 164384 165738 163365 170918 174048 169887 168249 164679 164847 162840 154990 148052 151701 151095 154833 155203
12598A55203m495L51Q091Q153O860J5069Q209M96r032k58L929l094L773K878m299
$$ 155203 150708 151059 159150 167303 174163 189232 197441 197937 188905 188647 192576 189482 193255 196133 191834
12583A91834n933k413k876r57M305N289K020P000M674J156R61l281k024P936k673
$$ 191834 185901 183488 180612 179655 183960 189249 191269 198269 202943 204099 205060 201779 199755 207691 205018
12568B05018o85O688J1537J6413J4942J6422J5728K2685L2248L6443L4397K9964
$$ 205018 204333 211021 222558 238971 253913 270335 286063 308748 340996 377439 411836 441800
12556D41800K2252K8274L4133N5613P7762J26816J75773K46940L08299L46314
$$ 441800 464052 492326 526459 582072 659834 786650 962423 1209363 1517662 1863976
12546A863976L53373L33618K87930J91585M8459r3211k14740k78252l14505l46772
$$ 1863976 2217349 2550967 2838897 3030482 3078941 2985730 2770990 2492738 2178233 1831461
12536A831461l22811k70553k12612j56704j06191p6876o3349n2764n7393m4264
$$ 1831461 1508650 1238097 1025485 868781 762590 685714 622365 569601 512208 467944
12526D67944l2272l1113k1863j9558j6053j7455j6581j3770k684K552p707j3393
$$ 467944 435672 404559 382696 363138 347085 329630 313049 299279 296595 299147 291440 278047
12514B78047j0232r996q514p550r928o520p462N57J290j257l573n800p178k476
$$ 278047 267815 257819 249305 241755 231827 225307 217845 218402 219692 218435 214862 209062 201884 199408
12500A99408n310k000M623J115l975m904p131r439r819n212l483n754p335p005
$$ 199408 194098 192098 196721 197836 193861 188957 181826 172387 162568 157356 153873 148119 140784 133779
12486A33779j610l984m69J443m2k649n806Q58j2301m999k601m906l702k062j107
$$ 133779 132169 128185 127716 129159 129117 126468 120662 121520 109219 104220 101619 96713 93011 90949 89842
12471H9842N717N0k0k293p728k36N704l089k5l505l033r94k55N575k412j68k577
$$ 89842 95559 95609 95589 93296 85568 85332 91036 87947 87922 84417 81384 80390 80135 85710 83298 83130 80553
12454H0553n280k167O333m54o41O305N799q141l217M338p575j0652k941Q77l36
$$ 80553 75273 73106 79439 78985 78344 84649 90448 82307 79090 83428 75853 65201 62260 63137 62801
12439F2801J762n37n96m027p31K150M376J142k555l749Q079K175o807k422L03
$$ 62801 64563 64026 63430 59403 58672 60822 65198 66340 63785 60036 68115 70290 63483 61061 61364
12424F1364M431M044L09j89r014p145j47J40n298J06N759J863K192K884J973M84
$$ 61364 65795 69839 70148 69959 60945 53800 53653 53793 48495 48601 54360 56223 58415 61299 63272 63756
12408F3756M646R07k296m007o964k327J406j895o841l109K593M263l472o19M808
$$ 63756 68402 69309 67013 63006 56042 53715 55121 53226 46385 43276 45869 50132 46660 46041 50849
12393E0849j160j355J610j213L429K65m435o951k155K868M992j356O665M728m735
$$ 50849 49689 48334 49944 48731 52160 52425 47990 41039 38884 41752 46744 45388 52053 56781 52046
12378E2046N059Q104J171M489L723o66J09N581J0953O356M757J457J3576K4249
$$ 52046 57105 65209 66380 70869 74592 73926 74035 79616 90569 96925 101682 103139 116715 140964
12364A40964J9214K0179L7802O6332J00538J30847J48744J23986M1286m9495j11865
$$ 140964 160178 180357 218159 284491 385029 515876 664620 788606 829892 780397 668532
12353F68532j28366j20089r6119o4995l7800k5127k3301j5208j3958j6228j3267
$$ 668532 540166 420077 323958 258963 221163 196036 172735 157527 143569 127341 114074
12342A14074p800q568o631k119M33j075j119q357l123J0801M177m50l91j0372
$$ 114074 106274 97706 91075 88956 89389 88314 87195 78838 75715 86516 90693 90243 89852 79480
12328G9480r126n879p94R013J805q167l751K678K329N388M328J286Q75r68l751
$$ 79480 70354 64475 63681 72694 74499 66332 62581 65259 67588 72976 77304 78590 79465 78497 74746
12313G4746k325R05P207p62j897k911m1N117k265n539o013n187o679j668Q64L96
$$ 74746 72421 73326 80533 79771 77874 74963 74922 80039 77774 72235 66222 61035 54356 52688 53552 53948
12297E3948k267L378Q200m166K697q02J008k378L27j541O68o797o030j772P05
$$ 53948 51681 55059 63259 59093 61790 60988 61996 59618 59945 58404 59072 52275 46245 44473 45178
12282D5178J285m84j689K303M42p80o32m841R102N793q70m165o619j36L517l694
$$ 45178 46463 45979 44290 46593 47035 46255 45623 40782 49884 55677 54807 50642 44023 43887 47404 43710
12266D3710N231Q208J465o848K443J865R35o605j005J087N01k068P60k902r229
$$ 43710 48941 57149 58614 51766 54209 56074 57009 50404 49399 50486 50987 48919 49679 46777 37548
12251C7548m100J985L210M577k162j839L907l066K328K363L04p453K591L727L12
$$ 37548 33448 35433 38643 43220 41058 39219 43126 40060 42388 44751 45055 37602 40193 43920 44232
12236D4232r65o07k162R21m402r96j67K331k724m400J240M378k539K82k907l680
$$ 44232 43267 42660 40498 41419 37017 36021 35854 38185 35461 31061 32301 36679 34140 34422 31515 27835
12220B7835N096j511k138K082k370K949P080n384l558j249N158J696p85J640j219
$$ 27835 32931 31420 29282 31364 28994 31943 39023 33639 30081 28832 33990 35686 34901 36541 35322
12205C5322L073j139m538l446L558L762l196K038N875j956O998L062L937L454
$$ 35322 38395 37256 32718 29272 32830 36592 33396 35434 41309 39353 46351 49413 53350 56804
12191E6804k166l594l381O913n22m475n655J995N660Q019l994J627K243k490n757
$$ 56804 54638 51044 47663 54576 54054 49579 43924 45919 51579 59598 55604 57231 59474 56984 51227
12176E1227k959O334j493m356m672n700k359K087j151M324L294m752k337M198
$$ 51227 48268 54602 53109 48753 44081 38381 36022 38109 36958 41282 44576 39824 37487 41685
12162D1685L347M270l400k646k420m718K571j659L818m727n328m41L856k265L106
$$ 41685 45032 49302 45902 43256 40836 36118 38689 37030 40848 36121 30793 30352 34208 31943 35049
12147C5049K954k005P472l030n507l562M00R940O26o61l520p820n125K857M561
$$ 35049 38003 35998 43470 40440 34933 31371 31771 41711 42337 41676 38156 30336 25211 28068 32629
12132C2629K07m690k636j612J404J707l11j972j625L58j694O989M841R130L925
$$ 32629 32836 28146 25510 23898 25302 27009 26698 24726 23101 23459 21765 28754 33595 42725 46650
12117D6650r466O51R41O69k485j427J271L645N63j295j749l170M397J395j062
$$ 46650 37184 37835 38776 39445 36960 35533 36804 40449 41012 39717 37968 34798 39195 40590 39528
12102C9528n013l656L870J735l775M79o16K43j28O204k901L15l274k940J440J427
$$ 39528 34515 30859 34729 36464 32689 33168 32552 32795 32667 38871 35970 36285 33011 30071 31511 32938
12086C2938L873N819p485n840k270l865n559o126j697K747P459R716l438q038
$$ 32938 36811 42630 35145 29305 27035 23170 17611 11485 9788 12535 19994 29710 26272 18234
12072A8234J895L945l511p410Q6K835R836J370r86k708M335M114M951K03j0929
$$ 18234 20129 24074 20563 13153 13239 16074 25910 27280 26294 23586 27921 32035 36986 37189 26260
12057B6260n264k013j027K615M041Q991l619n581q52Q51P64o912j329Q226j898
$$ 26260 20996 18983 17956 20571 24612 33603 29984 24403 23551 24402 25166 18254 16925 25151 23253
12042B3253p335K646l21N161k568p995l06l50k221J488P153J642l257l613K05
$$ 23253 15918 18564 18243 23404 20836 12841 12535 12185 9964 11452 18605 20247 16990 13377 13582
12027A3582L173r8n258M554Q571M979M013p883r231J035P005K900k294M06O871
$$ 13582 16755 16657 11399 15953 24524 29503 33516 25633 16402 17437 24442 27342 25048 25454 32325
12012C2325k507m546K239l660j928l437l186K299R037J727j873j566k054M113
$$ 32325 29818 25272 27511 23851 21923 18486 15300 17599 26636 28363 26490 24924 22870 26983
11998B6983q97m787N402l934j367k450J82l287m688m221L201M322N367M336L072
$$ 26983 26086 21299 26701 22767 21400 18950 19132 15845 11157 6936 10137 14459 19826 24162 27234
11983B7234j221j060l124L826J807l297j56L622P80L699l390l782q381m342Q49
$$ 27234 26013 24953 21829 25655 27462 24165 24009 27631 28411 32110 28720 24938 16557 12215 13064
11968A3064n293L40O309k94n152r63j985k777P639N853M42M071M352m419p415
$$ 13064 7771 8111 14420 14126 8974 8011 6026 3249 10888 16741 17183 21254 25606 21187 13772
11953A3772K760k160R54P52p25J490M404R68k691l02J984P197M817j745o705q539
$$ 13772 16532 14372 15326 16078 15353 16843 21247 22215 19524 19222 21206 28403 33220 31475 24770 16231
11937A6231l766O477L392n068k241J871P321K338l057n709m49o76m372O64M019
$$ 16231 12465 18942 22334 17266 15025 16896 24217 26555 23498 17789 17340 16664 12292 12956 16975
11922A6975r70J907k622n3k544k326k08R55P801P305l029j2360l406N145O652
$$ 16975 16005 17912 15290 15237 12693 10367 10159 11114 18915 26220 23191 10831 7425 12570 19222
11907A9222l892m036J185k56k313K901N554p066n806N6j62N039k533l079L593
$$ 19222 15330 11294 12479 12223 9910 12811 18365 11299 5493 5549 5387 10426 7893 4814 8407
11892H407l112o425L964Q347M553j527P473L432k815N70l640q62p109k297k020
$$ 8407 5295 -1130 2834 11181 15734 14207 21680 25112 22297 22867 19227 18365 11256 8959 6939
$$ [...]
##END NTUPLES=NMR SPECTRUM
##END=
