##TITLE=Analysis number 312089
Compound Code cc 26809
Book Reference 382/94/1
Project Code adrs
Chemist Name simons
##JCAMPDX= 6.0         $$ Bruker NMR JCAMP-DX V2.0
##DATA TYPE= NMR SPECTRUM
##DATA CLASS= NTUPLES
##ORIGIN= Bruker BioSpin GmbH
##OWNER= NMR
$$ XWIN-NMR		Version 3.5
$$ Mon Jul 25 12:02:53 2005 GMT Daylight Time (UT+1h)  MAYBRIDGE\NMR@NMR_250MHZ
##.OBSERVE FREQUENCY= 250.131544655141
##.OBSERVE NUCLEUS= ^1H
##.ACQUISITION MODE= SIMULTANEOUS (DQD)
##.ACQUISITION SCHEME= undefined
##.AVERAGES= 16
##.DIGITISER RES= 18
##SPECTROMETER/DATA SYSTEM= dpx250
##.PULSE SEQUENCE= zg30
##.SOLVENT NAME= CDCl3
##.SHIFT REFERENCE= (INTERNAL, CDCl3, 0, 16.522)
##AUDIT TRAIL= $$ (NUMBER, WHEN, WHO, WHERE, WHAT)
$$ ##TITLE= Audit trail, XWIN-NMR		Version 3.5
$$ ##JCAMPDX= 5.01
$$ ##ORIGIN= Bruker BioSpin GmbH
$$ ##OWNER= NMR
$$ C:\u/data/dgb/nmr/ADRS/6540/pdata/1/auditp.txt
$$ ##AUDIT TRAIL=  $$ (NUMBER, WHEN, WHO, WHERE, WHAT)
(   1,<2005-07-25 12:02:32.22 +100>,<MAYBRIDGE\NMR>,<NMR_250MHZ>,
      <created by zg, POWCHK disabled, PULCHK disabled
       configuration hash MD5:
       62 19 C7 07 E1 42 D1 B7 37 6C 3D D0 77 39 F9 E6
       data hash MD5: 64K
       57 E8 04 0A 06 EC 1E 5F ED 23 D3 36 FC 80 9F 48>)
(   2,<2005-07-25 12:02:44.32 +100>,<MAYBRIDGE\NMR>,<NMR_250MHZ>,
      <Start of raw data processing
       ef LB = 0.3 FT_mod = 6 PKNL = 1 SI = 32K 
       data hash MD5: 32K
       3B 35 C0 F7 B4 E4 31 FC 86 42 C8 1F F5 96 48 35>)
(   3,<2005-07-25 12:02:46.08 +100>,<MAYBRIDGE\NMR>,<NMR_250MHZ>,
      <apk 
       data hash MD5: 32K
       49 A1 C4 1C AD C8 1C AD 74 07 C3 2F 91 2A BC 5F>)
(   4,<2005-07-25 12:02:46.80 +100>,<MAYBRIDGE\NMR>,<NMR_250MHZ>,
      <abs ABSG = 5 
       data hash MD5: 32K
       34 D2 8D C0 53 CC 24 BF 03 9E E8 82 EE A2 59 E9>)
$$ ##END=
$$ 
$$ hash MD5
$$ CC D4 95 7E CA E9 8B 35 3C C5 59 6E 73 DE AD 2F
##$RELAX= 
##$RELAX= 
##$RELAX= 
##$RELAX= 
##$RELAX= 
##$RELAX= 
##$RELAX= 
$$ Bruker specific parameters
$$ --------------------------
##$DU= <C:\u>
##$EXPNO= 6540
##$NAME= <ADRS>
##$PROCNO= 1
##$TYPE= <nmr>
##$USER= <dgb>
##$AMP= (0..31)
100 100 100 100 100 100 100 100 100 100 100 100 100 100 100 100 100 100 
100 100 100 100 100 100 100 100 100 100 100 100 100 100 
##$AQSEQ= 0
##$AQ_mod= 3
##$AUNM= <au_zg>
##$AUTOPOS= <13 >
##$BF1= 250.13
##$BF2= 250.13
##$BF3= 250.13
##$BF4= 250.13
##$BF5= 500.13
##$BF6= 500.13
##$BF7= 500.13
##$BF8= 500.13
##$BYTORDA= 1
##$CFDGTYP= 0
##$CFRGTYP= 5
##$CHEMSTR= <none>
##$CNST= (0..31)
1 1 145 1 1 1 1 1 1 1 1 1 1 1 1 1 1 1 1 1 1 1 1 1 1 1 1 1 1 1 1 1 
##$CPDPRG= <>
##$CPDPRG1= <>
##$CPDPRG2= <>
##$CPDPRG3= <>
##$CPDPRG4= <mlev>
##$CPDPRG5= <mlev>
##$CPDPRG6= <mlev>
##$CPDPRG7= <mlev>
##$CPDPRG8= <mlev>
##$CPDPRGB= <>
##$CPDPRGT= <>
##$D= (0..31)
0 1 0 0 0 0 0 0 0 0.06 0 0 0 0 0 0 0.0002 0 0 0 0 0 0 0 0 0 0 0 0 0 0 
0 
##$DATE= 1122289351
##$DBL= (0..7)
120 120 120 120 120 120 120 120 
##$DBP= (0..7)
150 150 150 150 150 150 150 150 
##$DBP07= 0
##$DBPNAM0= <>
##$DBPNAM1= <>
$$ [...]
##$SUBNAM7= <"">
##$SUBNAM8= <"">
##$SUBNAM9= <"">
##$SW= 20.6930455092707
##$SWIBOX= (0..15)
0 0 3 0 0 0 0 0 0 0 0 0 0 0 0 0 
##$SW_h= 5175.983436853
##$TD= 65536
##$TD0= 1
##$TE= 296.16
##$TE2= 300
##$TE3= 300
##$TEG= 300
##$TL= (0..7)
0 120 120 120 120 120 120 120 
##$TP= (0..7)
150 150 150 150 150 150 150 150 
##$TP07= 0
##$TPNAME0= <>
##$TPNAME1= <>
##$TPNAME2= <>
##$TPNAME3= <>
##$TPNAME4= <>
##$TPNAME5= <>
##$TPNAME6= <>
##$TPNAME7= <>
##$TPOAL= (0..7)
0.5 0.5 0.5 0.5 0.5 0.5 0.5 0.5 
##$TPOFFS= (0..7)
0 0 0 0 0 0 0 0 
##$TUNHIN= 0
##$TUNHOUT= 0
##$TUNXOUT= 0
##$USERA1= <user>
##$USERA2= <user>
##$USERA3= <user>
##$USERA4= <user>
##$USERA5= <user>
##$V9= 5
##$VALIST= <valist>
##$VCLIST= <CCCCCCCCCCCCCCC>
##$VD= 0
##$VDLIST= <DDDDDDDDDDDDDDD>
##$VPLIST= <PPPPPPPPPPPPPPP>
##$VTLIST= <TTTTTTTTTTTTTTT>
##$WBST= 1024
##$WBSW= 4
##$XGAIN= (0..3)
0 0 0 0 
##$XL= 0
##$YL= 0
##$YMAX_a= 342601
##$YMIN_a= -433989
##$ZGOPTNS= <>
##$ZL1= 120
##$ZL2= 120
##$ZL3= 120
##$ZL4= 120
##$ABSF1= 16.522
##$ABSF2= -4.171173
##$ABSG= 5
##$ABSL= 3
##$ALPHA= 0
##$AQORDER= 0
##$ASSFAC= 0
##$ASSFACI= 0
##$ASSFACX= 0
##$ASSWID= 0
##$AUNMP= <proc_1d>
##$AZFE= 0.1
##$AZFW= 0.1
##$BCFW= 0
##$BC_mod= 0
##$BYTORDP= 0
##$COROFFS= 0
##$CY= 12.5
##$DATMOD= 1
##$DC= 0
##$DFILT= <>
##$DTYPP= 0
##$F1P= 14.0000005364418
##$F2P= -0.99999901652339
##$FCOR= 0.5
##$FTSIZE= 32768
##$FT_mod= 6
##$GAMMA= 0
##$GB= 0
##$INTBC= 1
##$INTSCL= 1
##$ISEN= 128
##$LB= 0.3
##$LEV0= 0
##$LPBIN= 0
##$MAXI= 10000
##$MC2= 0
##$MEAN= 0
##$ME_mod= 0
##$MI= 0
##$NCOEF= 0
##$NC_proc= -4
##$NLEV= 6
##$NOISF1= 0
##$NOISF2= 0
##$NSP= 0
##$NTH_PI= 0
##$NZP= 0
##$OFFSET= 16.522
##$PC= 1
##$PHC0= -77.57714
##$PHC1= 7.461689
##$PH_mod= 1
##$PKNL= yes
##$PPARMOD= 0
##$PSCAL= 4
##$PSIGN= 0
##$REVERSE= no
##$SF= 250.13
##$SI= 32768
##$SIGF1= 0
##$SIGF2= 0
##$SINO= 400
##$SIOLD= 32768
##$SREGLST= <1H.CDCl3>
##$SSB= 0
##$STSI= 32768
##$STSR= 0
##$SW_p= 5175.98343685301
##$SYMM= 0
##$S_DEV= 0
##$TDeff= 65536
##$TDoff= 0
##$TI= <Analysis number 999999
Compound Code 99
Book Reference 9
Project Code 9>
##$TILT= no
##$TM1= 0
##$TM2= 0
##$TOPLEV= 0
##$USERP1= <user>
##$USERP2= <user>
##$USERP3= <user>
##$USERP4= <user>
##$USERP5= <user>
##$WDW= 1
##$XDIM= 32768
##$YMAX_p= 484908483
##$YMIN_p= -349921
$$ End of Bruker specific parameters
$$ ---------------------------------
##NTUPLES= NMR SPECTRUM
##VAR_NAME=  FREQUENCY,     SPECTRUM/REAL,   SPECTRUM/IMAG
##SYMBOL=    X,             R,               I
##VAR_TYPE=  INDEPENDENT,   DEPENDENT,       DEPENDENT
##VAR_FORM=  AFFN,          ASDF,            ASDF
##VAR_DIM=   32768,         32768,           32768
##UNITS=     HZ,            ARBITRARY UNITS, ARBITRARY UNITS
##FACTOR=    0.157963299565203, 1,           1
##FIRST=     4132.6476996994, 0,             0
##LAST=      -1043.33573715361, 0,           0
##MIN=       -1043.33573715361, -349921,     0
##MAX=       4132.6476996994, 484908483,     0
$$ Real data points
##PAGE= N=1
##DATA TABLE= (X++(R..R)), XYDATA
$$ [...]
15823E0526N5142K3867o9261o8459J6440j9987r7364m4415K8253j8821O56N4627
15811h8796j2264J7721O5523N6850J6971o5460m8812L9819p329o285n4793N7753
15799b9102O3826L4464l2306l295L9113K6524N9235J3369r7287n7321l8043m4490
15787f5313q1652j6528N7778k472O9615J9149K5154N0568p882j4119O428l3765
15775F961o681o287L0488m635p6706K1489m333J2867k9797o27Q350J4940k2536
15762e6507J8183J4480l7790L4272K1790q325N7576j0462j9489P0855J9974J4106
15750A18663j184j9874r1339k1429Q440k645k2740K973O1966M9514M3544n7870
15738F8019r3048M0491j3712j9439J1573J4288j18363J6005M4096N5707M1430
$$ plain form
15823 50526 105668 129535 60274 -8185 8255 -11732 -109096 -153511 -125258 -144079 -143423 -88796
15811 -88796 -101060 -83339 -17816 39034 56005 -9455 -58267 -18448 -25777 -32062 -86855 -29102
15799 -29102 34724 69188 36882 33587 72700 99224 158459 171828 74541 17220 -20823 -65313
15787 -65313 -146965 -163493 -105715 -108187 -38572 -19423 5731 56299 48417 34298 40726 6961
15775 6961 280 -6007 24481 19846 -56860 -35371 -39704 -26837 -56634 -57261 -48911 -33971 -56507
15762 -56507 -38324 -23844 -61634 -27362 -5572 -13897 43679 33217 13728 84583 104557 118663
15750 118663 117479 97605 6266 -15163 -6723 -9368 -32108 -29135 32831 82345 125889 68019
15738 68019 -25029 15462 1750 -17689 -6116 8172 -110191 -94186 -50090 5617 47047
15727D7047r77r014M7887N9745m0475j09304l3735O1182l7253k3497j8310M2773
15715a3931P213O5575Q671r939R14Q945p7543N883L2222J7453l5341p0716m3173
15702a03767J51933L3599j03088l5869R863K4316j2488j2900O4439M5606J957
15691F3601m6524q8628j02618L5739M5673O7772N19n0457j4066P5257J0479j8377
15679b1630m91n1449O305M1891l988j01342L4057J25560L4639p5536m5195k6746
15667h3925N6219N9719k0087J1001L5316K0541j7605o8000J725K3783k0151N9
15655a405M5531n8545l7105N7548M2653k9938n3790J7934o8447p958N1251l1546
15643g3817n6821m7010Q0563K2132J302J7079m3899N538k6620N3326k856L5851
$$ plain form
15727 47047 46070 37056 84943 144688 104213 -5091 -38826 22356 -14897 -38394 -56704 -13931
15715 -13931 -6718 58857 67528 57589 58503 67448 -10095 -4212 28010 45463 10122 -60594 -103767
15702 -103767 48166 81765 -21323 -57192 -47329 -23013 -35501 -48401 16038 61644 63601
15691 63601 17077 -71551 -174169 -138430 -92757 -24985 -24466 -74923 -88989 -13732 -3253 -21630
15679 -21630 -22121 -73570 -67265 -25374 -29362 -130704 -96647 28913 63552 -11984 -57179 -83925
15667 -83925 -27706 32013 11926 22927 58243 78784 61179 -6821 -5096 18687 -1464 -1405
15655 -1405 44126 -14419 -51524 6024 48677 18739 -35051 -17117 -85564 -93522 -42271 -73817
15643 -73817 -130638 -177648 -97085 -74953 -73651 -56572 -100471 -94933 -121553 -68227 -71083 -35232
15631c5232j06659m010L4480j237L4500Q0850L2511L051J2182k1294l9105n066
15619a5029N2217P1956k7896J5379k7189p1281q3390J0168N1540l2076j32754
15608a88355J08135N7433m5552Q81N2572K1625n980p3479K8014L3516n8171n5709
15596a25070O5796O5020J7566m7133P586j196j7065K2521R567L4575j0042K2707
15584D4832J9336N4445k3751o4859J6158p700k5834J03946K4408k4996j20031
15573d046m0088J1203N639j7298K1679n669o2966R4914R1880O9888j7130n4845
15561I3161o5668q7932n0275N1728N2915M6770m2623l9180K1953J6725M7303l6667
15549H210k1520m0121m4489M8034M9796N0315M5120K3682n4536q3181M9917j4534
$$ plain form
15631 -35232 -141891 -145901 -111421 -112658 -78158 2692 35203 38254 50436 29142 -9963 -15029
15619 -15029 37188 109144 81248 96627 69438 -1843 -85233 -75065 -23525 -55601 -188355
15608 -188355 -80220 -22787 -68339 -67458 -14886 6739 759 -72720 -44706 -11190 -69361 -125070
15596 -125070 -59274 5746 23312 -23821 -16235 -17431 -34496 -11975 -2408 32167 22125 44832
15584 44832 64168 118613 94862 30003 46161 38461 12627 116573 140981 115985 -4046
15573 -4046 -44134 -32931 -27292 -44590 -22911 -28580 -91546 3368 95248 165136 148006 93161
15561 93161 27493 -60439 -110714 -58986 -6071 40699 -1924 -41104 -19151 -2426 44877 8210
15549 8210 -13310 -53431 -97920 -49886 -90 50225 95345 119027 64491 -18690 31227 16693
15537A6693r1578m191K4971l1521Q9296P6559P052J5925N8908J5625j10497J4692
15525H1934J4013r6368m6772q100N9007K3602K6548N1311M0262j5688p6943j45204
15513i2398J8637o0570L2667N6804j657J6980n0342j2829O957K495K5582O2514
15501D840R6182L0464p8887q5854l4439L0124P3170M0485m6564n7530N3528J8851
15489D4370n425p2607J7588N9200o3117K556R389l3781N0810K2570J7879j29464
15477h0032r4231J828L7112J8391l53P0501K7709o6146p0137M1700K3007K5708
15465f4943L9148k1033J3601L8043o1048j6904j9181L3200J8980j390J1488L5750
15453E711r309p9316k9779M0821K2349o1209K3925j0216m9028L8966N3051M6942
$$ plain form
15537 16693 -74885 -79076 -54105 -85626 3670 80229 87281 103206 162114 177739 67242 81934
15525 81934 95947 -421 -47193 -55293 3714 27316 53864 105175 145437 129749 52806 -92398
15513 -92398 -73761 -134331 -101664 -44860 -46517 -29537 -79879 -92708 -85751 -83256 -57674 4840
15501 4840 101022 131486 52599 -33255 -67694 -37570 35600 76085 29521 -28009 25519 44370
15489 44370 38945 -33662 -16074 43126 -19991 -17435 -8046 -41827 8983 31553 49432 -80032
15477 -80032 -174263 -172435 -135323 -116932 -117285 -46784 -19075 -85221 -155358 -113658 -90651 -64943
15465 -64943 -25795 -46828 -33227 4816 -56232 -73136 -92317 -59117 -40137 -41527 -30039 5711
15453 5711 -3598 -82914 -112693 -71872 -49523 -110732 -86807 -97023 -146051 -107085 -54034 -7092
15441g092L3157L1860l5947l2369K3126j7893J4680m269L326m466J2568L325J3294
15428C3300j9240k0582j9509J2130j2304m5891m4754R8565L9126j7746r082K9221
15416B3234j2503m8889k4280j8780l6187m9347P5612Q9256O2222J6259k0989m9305
15404F303l1312N9362R8756J8470n3206j8912J1011q2476r2841J9742K7190j4840
15392e2753k8047J572K0640L5060J9314o1137N7567N4966r1714p78N5059m4914
15380c5165l2973M4855j8252o5424M5511P8050r802j1514j52298p9589R3599L4620
15368a08382O8403k4253k7627j2609O1725J7177j13887o7881N6739N8936N6957
15357c4702P9052J8111q3970M4864J0805K8771k6555j24722J5043P7420P7062
$$ plain form
15441 -7092 26065 57925 21978 -10391 12735 -5158 9522 5253 8579 4113 16681 20006 33300
15428 33300 14060 -6522 -26031 -13901 -26205 -72096 -116850 -18285 20841 3095 -5987 23234
15416 23234 10731 -38158 -62438 -81218 -117405 -166752 -91140 -1884 60338 76597 55608 6303
15404 6303 -25009 34353 133109 151579 98373 79461 90472 7996 -84845 -65103 -37913 -52753
15392 -52753 -80800 -79228 -58588 -23528 -4214 -65351 -7784 47182 -44532 -45310 9749 -35165
15380 -35165 -68138 -23283 -41535 -106959 -61448 16602 6800 -4714 -157012 -236601 -143002 -108382
15368 -108382 -39979 -64232 -91859 -104468 -42743 -25566 -139453 -207334 -150595 -91659 -34702
15357 -34702 44350 62461 -21509 23355 34160 62931 36376 -88346 -73303 4117 81179
15346H1179K2354j06190K7064M7763q2787q470l1509r52l7709J064m6870O6852
15334f8211R3505O3692q9382q9323k6316L097R8472k198n3592k9874O0924J128
15322c8078l4118L1017Q6195O3536j7805r5991o404j780j5910K727o0875M627
15310h2859K0161m8708r316K187R8112Q1839J6546k3584j0813n8970l9398k0815
15298g5618l1960R0692P8598J2226j3882l2420J1999l8752o4392j701m25Q0633
15286A4998L2555j8500J6689K2478o4662j5726o158r276L7985J4996M2470n6620
15274A1229r3701n556N9573R4369j3033p1197l1003n6111L5852n4871j2381M459
15262a32371O949N7280L4527j0187L1971N3587J5777m2819o1957k2429J9095N9518
$$ plain form
15346 81179 103533 -2657 24407 72170 -10617 -19087 -50596 -51548 -89257 -88193 -135063 -68211
15334 -68211 25294 88986 -396 -89719 -116035 -112938 -14466 -16664 -70256 -100130 -39206 -38078
15322 -38078 -72196 -41179 45016 108552 90747 -5244 -11648 -13428 -29338 -26611 -87486 -82859
15310 -82859 -62698 -111406 -120722 -118535 -20423 61416 77962 54378 43565 -15405 -54803 -75618
15298 -75618 -107578 -16886 61712 73938 60056 27636 39635 883 -63509 -65210 -65635 14998
15286 14998 47553 29053 45742 68220 3558 -12168 -18326 -27602 10383 25379 67849 11229
15274 11229 -82472 -88028 -28455 65914 52881 -18316 -49319 -105430 -69578 -124449 -136830 -132371
15262 -132371 -125422 -68142 -33615 -43802 -11831 41756 57533 14714 -47243 -69672 -50577 8941
15250H941K9617L7681L8142l3477M5798j02585m9599k0113j3676N087O3018n9481
15238e0647O517J16628R9205l949p5823P774N3830o1263j04110l4739J0461K4752
15226a1364P1702L5285j9064R996l5041o4360p025J4484J06071p0780l7953m5209
15214e3258j8700j2926J01670K9976o6023N6795P475n4111k9092n8484k7113J3750
15202a10041R421R2069Q6192M6915Q619J2545P5719n9335j00407o3726m0825P418
15190c5436K3889j21109n9627L3394L4384O8826O2128K6437P5327n2408j19451
15179f3646p5233L0292J21187j3685k4366J0331j0739l2155k6574L5685P7079
15168B8176K1341j50025o0490K7563J14265N5696N9668P8579M6777m98m8762o4319
$$ plain form
15250 8941 38558 76239 114381 80904 126702 24117 -25482 -45595 -59271 -54184 8834 -50647
15238 -50647 -44130 72498 171703 167754 91931 99705 153535 92272 -11838 -46577 -36116 -11364
15226 -11364 60338 95623 76559 86555 51514 -12846 -19871 -5387 100684 29904 -8049 -53258
15214 -53258 -71958 -84884 16786 46762 -19261 37534 45009 -9102 -38194 -96678 -123791 -110041
15202 -110041 -100620 -8551 77641 124556 133175 145720 221439 162104 61697 -2029 -42854 -35436
15190 -35436 -11547 -132656 -192283 -158889 -124505 -55679 6449 32886 108213 55805 -63646
15179 -63646 -138879 -108587 12600 -1085 -25451 -15120 -25859 -58014 -84588 -48903 28176
15168 28176 49517 -100508 -160998 -133435 -19170 36526 96194 174773 221550 221052 172290 107971
15156A07971j24640o8191k4850k3028R1883Q8572M2591k2425r9910r0464N8415
15145f4076J01751j1519N046M5199j5614J7597n9500o4158m95M1582j6182n7069
15133g7438j8217N5069M2576N0288k0059r4095J6390M5366J9660k7442l3130k5246
15121f6278O1384M3060l7982J8129O620j04715k0193n1113n1124R0521P8403P632
15109b5656k0418K559L3972n1437l3994r35N3402j2950L2341m450L3454p9873
15097g3985N8237O1012q2322n8733R0380R4479M2839j2231k9654M3229q9493q3233
15085c9475l2047J4054R2373J9024Q1946M1205k2111m8882J9448M60o6129l8414
15073B1452o988J7225k8179k0264k6637J8765M3991M2615m6560o2688k8978k9334
$$ plain form
15156 107971 -16669 -84860 -109710 -132738 -40855 47717 90308 67883 -32027 -122491 -64076
15145 -64076 37675 26156 31202 76401 60787 78384 18884 -45274 -45769 -4187 -20369 -77438
15133 -77438 -95655 -40586 1990 52278 32219 -61876 -45486 -120 19540 -7902 -41032 -66278
15121 -66278 -4894 38166 184 18313 24933 -79782 -99975 -151088 -202212 -111691 -33288 -25656
15109 -25656 -46074 -43515 -9543 -60980 -94974 -95909 -42507 -55457 -23116 -27566 5888 -73985
15097 -73985 -15748 45264 -37058 -95791 -5411 89068 131907 119676 90022 133251 43758 -39475
15085 -39475 -71522 -57468 34905 53929 135875 177080 154969 106087 125535 125995 59866 21452
15073 21452 14464 31689 3510 -16754 -43391 -24626 19365 61980 15420 -47268 -76246 -105580
15061a05580k1507K2130N3615L9437j1298L3956o5448m3978o6274Q595R2519Q3057
15049A9224R225J2361Q0737K8171K1847l6631o2092k6744L4899l2646p0192L7219
15037A5378P1899K2919n8861j20947J0502K9225r200p505N9910M7686L7148M601
15025A02755j0822M335L030m0150M5938K6656m3256q7218K3953p573k7713l9585
15013d9650m8683L3226P7770L4652m6931j2207K5433O9152k5231o6979l1692M9583
15001H443N4590O4475N5795l1166j07711p4127J9502Q0375m0193k1494p4624m2747
14989a08882N0705K6522L1689O9778o044m7075L675n748m8451J25193l1799k9039
14977C0524K8414l0907N7907J574n8646j6106k9052j2505j0295k4928j5753K2844
$$ plain form
15061 -105580 -127087 -104957 -51342 -11905 -23203 10753 -54695 -98673 -164947 -156352 -63833 19224
15049 19224 28449 40810 121547 149718 171565 134934 72842 46098 80997 48351 -21841 15378
15037 15378 87277 110196 51335 -69612 -59110 -29885 -39085 -46590 13320 61006 98154 102755
15025 102755 91933 96268 99298 59148 105086 131742 88486 1268 25221 17648 -10065 -49650
15013 -49650 -98333 -65107 12663 47315 384 -11823 13610 82762 57531 -9448 -41140 8443
15001 8443 63033 127508 183303 152137 44426 -29701 -10199 70176 29983 8489 -66135 -108882
14989 -108882 -58177 -31655 34 69812 63768 16693 20368 14620 -33831 91362 59563 30524
14977 30524 58938 28031 85938 87512 28866 12760 -16292 -28797 -39092 -64020 -79773 -56929
14965e6929J40749M6840j04589p5569k6018N2266M5116o779K7410K8452J2101
14954H3050J5573O808n9058p870O8891o2065l1952L803K036K0756O31j2841N4907
14941H2669Q8859p5738r7170q7598J1902Q2092n260L3161M1273k3608k5142R052
14929C4492r1276l1068M4029Q7135o056q4921n2906q47N2170J3684Q3996K8945
14917G7377j4177k3099J1058o9526p3372P4317O6141K4002k4757K259j7812K3367
14905E5778P1766J6878r0600n2120M3330J114m4271J118N1358n775m9271K8242
14893B7547L5784M0803K2989j8547n8681k4033K0918P337J6102r0875n7220l2130
14881a10006O3985J11765l0866j25716N0022P1070j5135j9060J9985n0954j843
$$ plain form
14965 -56929 83820 130660 26071 -49498 -75516 -23250 21866 15087 42497 70949 83050
14954 83050 98623 105431 46373 38503 107394 45329 13377 17180 19216 39972 40603 27762 82669
14941 82669 171528 95790 -1380 -88978 -77076 5016 -244 32917 74190 50582 25440 34492
14929 34492 -56784 -87852 -43823 43312 37256 -47665 -100571 -101418 -49248 -35564 48432 77377
14917 77377 63200 40101 51159 -18367 -91739 -17422 48719 72721 47964 50223 32411 55778
14905 55778 127544 144422 53822 1702 45032 46146 1875 2993 54351 48576 -695 27547
14893 27547 63331 104134 127123 108576 49895 25862 46780 54117 70219 -20656 -77876 -110006
14881 -110006 -46021 65744 34878 -90838 -40816 30254 15119 -3941 16044 -34910 -36753
14870c6753K5318J1658Q1442L1964o434m7337L8q000j8307J2650Q2497k259q8653
14857C7824l7999l3353J6391L9045r366k1626J6941l9459Q0069O7712j7881l3299
14845F4999J03657N9081l8470j9092m514p3220l2131k5333K0151J11460j7548
14834A49040j34871m5363P9277O7255m888J9568P2984l3742j72086k6071J6093
14823a2804P7438L0526j9700p2810K9551k5268N9316O7154m1447q8222m0784N847
14811c1203o2870J8581n1062o0817M6586J38652J04222J0155l2104J5724L6488
14800A32352l882q4873l0800N1098k163K8900M5196m1400n8777j5481l2799K756
14788i873K9065k4453K2490O0876l0482j6797J855m076l9876k1897j124n0032
$$ plain form
14870 -36753 -11435 223 81665 113629 107195 59858 59896 51896 33589 46239 128736 126477 37824
14857 37824 -175 -33528 -17137 21908 12542 -9084 7857 -31602 48467 116179 98298 64999
14845 64999 168656 227737 189267 170175 165661 92441 60310 34977 55128 166588 149040
14834 149040 14169 -31194 48083 115338 110450 130018 203002 169260 -2826 -28897 -12804
14823 -12804 64634 95160 75460 2650 32201 6933 66249 133403 91956 3734 -37050 -31203
14811 -31203 -94073 -75492 -126554 -187371 -140785 -2133 102089 112244 80140 95864 132352
14800 132352 128470 43597 12797 63895 61732 90632 135828 94428 35651 20170 -12629 -9873
14788 -9873 19192 -5261 17229 78105 47623 30826 32681 28605 -11271 -33168 -34292 -84324
14776h4324m3509J5115Q5413J14440J03574n0008q5826k0179L2454K4458K1318
14765A12926O5669n0473k0979K0858J4153J5412J6759p5703n3688M3285k7395
14754F0824o7903J7883M1364J01294k9767m0182m4242j6332M7021k7167r1145
14743d8352L4417P8166j9883J5761J2022k6098r3941l8971N1832Q854k6706M4995
14731g904J6996J15775K9339r5944l2719Q3810L8636l5391k9254p595N7290m4669
14719H8370k0137L667M6220k9599j9034k1455o3840J3641p328n874M9817j8460
14707A5988k1112O1913M3820l3787J0912O466N9330J0292l1459o2938j7555L9326
14695H1196O392o7364l1678n3256Q086Q8422O7817l0391l5688O9737L0483l1140
$$ plain form
14776 -84324 -127833 -112718 -27305 87135 190709 140701 54875 34696 67150 91608 112926
14765 112926 178595 128122 107143 128001 142154 157566 174325 98622 44934 88219 60824
14754 60824 -7079 10804 52168 153462 123695 83513 39271 22939 69960 42793 -48352
14743 -48352 -13935 64231 44348 60109 72131 46033 -47908 -86879 -35047 -26193 -52899 -7904
14731 -7904 9092 124867 154206 58262 25543 109353 147989 112598 83344 75749 133039 88370
14719 88370 68233 71900 118120 88521 69487 48032 -15808 -2167 -9495 -15369 34448 15988
14707 15988 -5124 56789 100609 66822 77734 84200 143530 153822 122363 59425 41870 81196
14695 81196 87588 20224 -11454 -64710 -56624 31798 99615 69224 33536 103273 133756 102616
14683A02616m7114n7742K9802L6099j5911K273n9564j3259O9063L6132J956j8364
14671F5987o4359l1P6138Q926J689k5931o5625q516M9974N4092p2904k8987N1193
14658D1646m1773k3783o263r756j6145M8466j5967m6471L7301K9148n12q996L6594
14645B3489J6353n991O2964M3968k0280q185L899k313j7967k9152k4570j3775
14633B8440K8297j3225m4724K4351o1111p205L8230O720K8867n4625N526K7311
14621F852O6322L0471l5880m0182N1479k2485p2995j49m4053K5921k1257Q6490
14609C0534P754l6952J5251O8936K3454m3055L8585O1150j3070k1850m7852O629
14597H9514k3161j30281J4455R6793J1120M3293o0992K4199k4420m7200K6852
$$ plain form
14683 102616 55502 -2240 27562 63661 47750 50023 -9541 -22800 46263 82395 84351 65987
14671 65987 1628 1597 77735 86661 88350 62419 -3206 -11722 38252 92344 19440 -9547 41646
14658 41646 -127 -23910 -30173 -39929 -56074 -7608 -23575 -70046 -32745 -3597 -4109 -13105 23489
14645 23489 39842 33851 96815 140783 120503 112318 116217 113904 95937 66785 42215 28440
14633 28440 56737 43512 -1212 23139 -37972 -45177 -6947 -227 28640 -25985 -20459 6852
14621 6852 73174 103645 67765 27583 79062 56577 -16418 -16567 -60620 -34699 -55956 30534
14609 30534 38288 1336 16587 85523 108977 65922 104507 165657 152587 130737 82885 89514
14597 89514 66353 -63928 -49473 47320 58440 101733 40741 64940 40520 -6680 20172
14586B0172n861j1423R598J6634k8061P350r20Q0403K5880M2163L6127m4887n1773
14573I5402n5338L3210J3138l1388O8421K4205j12895r204P838l5171j8894P5061
14561E4385l1918j15983l2722J09227m6198k7793M5432k4723K544N2187K4182
14550H620q6052j06605M3323L7594K2347j1697k8592K9926Q3500n0327l5618M9710
14538d3871Q3877J9559n2733j20655p4213J1267J13573P6806Q1326m4441o3763
14527a3268J8302K5029J7286L6067L0273l673j8694K4287k6930l5711l7654j9772
14515d458O8065j3030l6211j4213o1049L5889P5353l6749J433R7811k4799m1832
14503D6210L8036j9147j7058O5810j7141P7733N5963q2665o1719R5312k036m4619
$$ plain form
14586 20172 14311 2888 12486 29120 1059 8409 7489 87892 113772 155935 192062 147175 95402
14573 95402 40064 73274 86412 55024 123445 147650 34755 25551 33389 -1782 -20676 54385
14561 54385 22467 -93516 -126238 -17011 -63209 -91002 -45570 -70293 -67749 -15562 8620
14550 8620 -77432 -184037 -140714 -103120 -80773 -92470 -121062 -91136 -7636 -57963 -93581 -43871
14538 -43871 40006 59565 6832 -113823 -188036 -176769 -63196 13610 94936 50495 -13268
14527 -13268 5034 30063 47349 83416 113689 110016 91322 115609 88679 52968 15314 -4458
14515 -4458 63607 50577 14366 153 -60896 -25007 50346 13597 15030 112841 88042 46210
14503 46210 84246 65099 48041 113851 96710 174443 230406 147741 86022 181334 179298 134679
14491A34679K5630m2177j1346q2489n3316R5967k5599K585J9995O5325L6580r2
14479A65742k5518L8322O5587n2387p1302n8850p919o4079p0720P3512k0909p6234
14467a04755l9061n3874J81530P1742k1437k0992l8748j0911L1715m3519M3117
14456e193m014O645J2196k085J11997j6006L4334M4544l1158j37912K301k1799
14444f150m3061L9973J8411J5502m2621p328j988J8317K8351K2286n6445O0052
14432D5299N5398L8159m3862N2887M327l8563L2102m2337p0384M4976j8365J6858
14420G6495J1165P2268M0279P2181J4242q6300J2291m31L0747j9487r8280n5782
14408F9388l7293J9731P3039n1211M0501N1183m5911L3470l4075p3704k137M5133
$$ plain form
14491 134679 160309 118132 106786 24297 -29019 66948 41349 43934 63929 129254 165834 165742
14479 165742 140224 178546 244133 191746 120444 61594 53675 -10404 -81124 -7612 -28521 -104755
14467 -104755 -143816 -197690 -16160 55582 34145 13153 -25595 -36506 -4791 -48310 -5193
14456 -5193 -9207 -2562 9634 7549 119546 103540 137874 182418 151260 13348 15649 -6150
14444 -6150 -49211 -9238 9173 24675 -17946 -25274 -27262 -8945 19406 41692 -14753 45299
14432 45299 100697 138856 94994 147881 152208 113645 145747 103410 33026 78002 59637 76495
14420 76495 87660 159928 200207 272388 286630 200330 212621 212190 242937 223450 125170 69388
14408 69388 32095 51826 124865 73654 114155 165338 119427 152897 118822 45118 42981 88114
14396H8114K2951J911k9455r688l2899N2135J4741L7869Q1982M1450l0493j11147
14384A27471r8240q508J1366O9174Q1932p5958p6959M9853r069n0055k8188K3493
14372A6312N2490M5618K4871k5926K5413J3337r4360j2390J6521p727L6802N5141
14360A46102n2658m4101m2780k4709M3645O0863J4477M0725l1503K2815O1197
14349A94073K5675n4752k3749J7229l3897n6297p86K4669j4208J7052j0266P688
14337I2431J5137L4860m4846M930N1340K0858j1745M1788m5534p8210j4180o5391
14325A438m2933R0761O0103K0723r7156o2900K7121N6703K1558n1801n0633P7703
14313E0687O949j8673p4110N1408J12425l1045K5076J1498R539M9666n0200m4079
$$ plain form
14396 88114 111065 112976 83521 73833 40934 93069 107810 145679 227661 269111 238618 127471
14384 127471 29231 20723 32089 101263 183195 107237 30278 80131 71062 21007 -7181 16312
14372 16312 68802 114420 139291 113365 138778 152115 57755 45365 61886 54159 90961 146102
14360 146102 93444 49343 6563 -18146 25499 86362 100839 141564 110061 132876 194073
14349 194073 219748 164996 141247 158476 124579 68282 67496 92165 77957 95009 84743 92431
14337 92431 107568 142428 97582 102512 153852 174710 162965 204753 159219 81009 66829 1438
14325 1438 -41495 49266 109369 130092 32936 -29964 -2843 53860 75418 23617 -27016 50687
14313 50687 57636 38963 -35147 16261 128686 97641 122717 134215 143754 193420 143220 99141
14301I9141m5742L669L9931J1142r6275q5308Q6946O2132J6833L0797L2326J0735
14289A66327O9243L8767n6622m0919M1010N3288j4462Q866k6908j6802j07407
14278A14381M8000J822j413O901j5914L4768Q847p144m7544q8326l4665m1472
14266b1759N3570n1536n229N1675J2867k144p3176N1865R3741L9834j6143N7940
14254A91505k4387K4884k9248m3980l9340k2878J21179K7029m7010p9711M1446
14243A19489R6694L2849k4839j3690p1799K4589o0363j5201j8403Q5803J02196
14232B57325j1326j67694n4979L5773R2109J04237K8495o3266j04833p8106m8293
14221a0558O4643P6399L8932O658n1639M2495l5899l6551L0156P887Q1061j8744
$$ plain form
14301 99141 53399 57068 96999 108141 11866 -73442 13504 75636 92469 123266 155592 166327
14289 166327 235570 274337 217715 176796 217806 271094 256632 265498 238590 221788 114381
14278 114381 162381 164203 162790 169691 153777 188545 197392 190248 142704 54378 19713 -21759
14266 -21759 31811 -19725 -24954 26721 39588 37444 -35732 16133 109874 149708 133565 191505
14254 191505 167118 192002 162754 118774 79434 56556 177735 204764 157754 78043 119489
14243 119489 216183 249032 224193 210503 138704 163293 102930 87729 69326 155129 257325
14232 257325 245999 78305 23326 59099 151208 255445 283940 220674 115841 37735 -10558
14221 -10558 54085 130484 169416 176074 124435 166930 131031 94480 124636 132523 213584 194840
14209A94840n1696j8838L9268P5071L6699k6245K2431k9732r4590K228j0066j4181
14197A25189L4717p872N0258j3031M5805J05805n6048k9638M1689K3905n9597
14186B61182l4770L3400j0840J876j00068n1381N6175j9453m8036J1862M4388
14175A44335p1380J5269J2010N588J10873L0838K6030K3318k1248j4155k6689
14164B34789j5006L820l7428P582P605n549j5584O8782O0445k0353l2955K6419
14152B82567m1246l180L1182N9737O797O7577Q0170L6422M5335l8407n8041P5087
14140E44000J16085R8859J36344J5295L5338N3725M3339M1302P1460P8401Q4611
14129A318759o1868r3540L9206o9575j04761q3831j11576J0323o3294r9878j15633
$$ plain form
14209 194840 143144 124306 163574 238645 275344 249099 271530 241798 147208 149436 139370 125189
14197 125189 159906 152034 202292 189261 235066 340871 284823 255185 296874 320779 261182
14186 261182 226412 259812 248972 250848 150780 99399 155574 136121 88085 99947 144335
14175 144335 72955 88224 100234 105822 216695 247533 273563 296881 275633 261478 234789
14164 234789 219783 223603 186175 193757 201362 195813 180229 249011 309456 289103 256148 282567
14152 282567 241321 238141 269323 329060 335857 403434 483604 520026 565361 526954 468913 544000
14140 544000 660085 758944 895288 910583 945921 999646 1042985 1084287 1155747 1234148 1318759
14129 1318759 1256891 1163351 1202557 1132982 1028221 944390 832814 843137 779843 679965 564332
14118E64332n9974p0696j27908m2711J08056R562j1299p1058j5778p1872N4698
14107B65352K1129K0135k1331l5856J0710M7462N582j28490r1209j26L5934k1753
14095A07539n6360J317K4839j1334L4376R178M1375O6923K8030j2345n555k8446
14083A99537J5686K8778R971j2247m7175q6599k1030P3978O6123r8592o0020J05828
14071A74238R09j1476K9990J10657q860q0980k7216O4663L3632j6627P315K5371
14059C01616p5152n8245P0694R137m8183p6888k3248M298l0645M4311P2824N3245
14047B43764M4300K1453l2175M6661q7875n2649J9050L7633p4376p9281k8788
14036E7717O0248j07194K7453J36573j5117L7286J47911k2329p286k7773m2706
$$ plain form
14118 564332 504358 433662 305754 263043 371099 380661 369362 298304 282526 210654 265352
14107 265352 286481 306616 285285 249429 260139 307601 313183 184693 93484 93358 129292 107539
14095 107539 51179 52496 77335 66001 100377 109555 150930 217853 245883 233538 227983 199537
14083 199537 215223 244001 253972 241725 194550 107951 86921 160899 227022 128430 68410 174238
14071 174238 175147 163671 193661 304318 295458 214478 187262 251925 285557 268930 276245 301616
14059 301616 226464 168219 238913 248050 199867 122979 99731 104029 73384 117695 190519 243764
14047 243764 288064 309517 277342 324003 236128 183479 202529 240162 165786 86505 57717
14036 57717 117965 10771 38224 174797 159680 196966 344877 322548 315262 287489 244783
14025B44783m8475M0459K1242J3589p5764k6238J30355J30887M1301J2449P9069
14014E63657R1340R4297J8768o4440k0648j4216J921K8959j05118l2685O4741
14003F26576J7708k9328J7437L4245N6043p406m7988q0065n3822k7837L6609L6246
13991E78418N605q0038q3853K7393J5515O1714j7860j3304j10293j7071L8267
13980D04493J1432l9780l7357p4821K2664J3987M6557j1054K6757P3440j329k2615
13968D12374r4895j2698L3306k2358K0227N0029j8101M9078M3459j23357m6604
13957B90460J1956J4923L1205r807j25519n5227K5093M9008O4548M4781P8991
13946D20412N5443k2903o524q7178n7557N229N7336M6643M4796N7359m8422n5096
$$ plain form
14025 244783 196308 236767 258009 271598 195834 169596 299951 430838 472139 484588 563657
14014 563657 654997 749294 768062 703622 682974 668758 670679 699638 594520 561835 626576
14003 626576 644284 614956 632393 666638 722681 715275 667287 587222 533400 505563 542172 578418
13991 578418 584023 503985 420132 447525 463040 524754 506894 493590 383297 366226 404493
13980 404493 415925 376145 338788 263967 286631 300618 347175 336121 362878 436318 434989 412374
13968 412374 317479 304781 338087 315729 335956 385985 367884 416962 460421 337064 290460
13957 290460 302416 317339 348544 338737 213218 157991 183084 232092 296640 341421 420412
13946 420412 475855 452952 446428 359250 301693 306922 364258 410901 455697 513056 464634 409538
13934D09538J9977l613n5961j0337N3568j1244L4289l0025k3117q5640J6797n747
13922C08485j3587L2265K7377k1424l477L2754L2450k5580l9731L8817p135L525
13910C64739k2097k252R0133P2799N2398J9070q1158p9981O163p0699n978l443
13898C39694j9276r6127Q3416j4992P3247R7480j5891k6619M730o7556K4856O1192
13886D44154M1369O2702o5423J1823L8920k4787k8847j1597j9780k0758J7307
13875D45083P2807K7448m9701O488l4333k2104n8690j3520K5088K9095Q3268R3259
13863F04188j0582j7867k1749m905m7937l5618P6083J610M475o235L9757l5683
13851E45537j0496p433L751O322r552M1682R6469j9323j12490m3966N5692J2077
$$ plain form
13934 409538 429515 425902 369941 359604 413172 401928 436217 406192 383075 297435 314232 308485
13922 308485 294898 327163 354540 333116 329639 362393 394843 369263 329532 368349 361214 364739
13910 364739 342642 340390 430523 503322 555720 574790 493632 413651 419814 349115 343137 339694
13898 339694 320418 224291 307707 292715 365962 463442 447551 420932 425662 358106 382962 444154
13886 444154 485523 548225 482802 494625 533545 508758 479911 468314 448534 427776 445083
13875 445083 517890 545338 495637 502125 467792 445688 386998 373478 398566 427661 510929 604188
13863 604188 593606 575739 553990 549085 501148 465530 541613 543223 547698 541463 581220 545537
13851 545537 535041 527608 531359 537681 528129 569811 666280 646957 534467 490501 546193 558270
13839E58270l6527q810P4844r92k5094K8948J6522P2513P243j5830k2054O1690
13827G10723M2113R5562P465j031J1318k4693j1494m7465J5215J6767j7788M8787
13815H45479J11577j7675L6354Q1587m0244O804M5324r611o1k7888Q170K8342
13803A068158J69p8307p737P3248R7244P3657k2400P324k5992p0459p0177j6328
13791A028400P4624L0325N7395J544J00656L8795j1176l2971m6423O9371K8075
13780A338615j7215Q4262N2551j5200l9186l0429K1267P9479k9631k849J3634
13769A455298M7176P6766k7767Q7789L5053M1320Q7784l3085j6874O9829J62978
13758A986267K7842J1254K0316P5613M2425Q8023N3226l3122K4573J09152K4679
$$ plain form
13839 558270 521743 512933 587777 586785 561691 590639 607161 679674 686917 671087 649033 710723
13827 710723 752836 848398 855863 854832 866150 841457 829963 782498 797713 814480 796692 845479
13815 845479 957056 939381 975735 1057322 1017078 1023882 1069206 1059595 1059534 1031646 1039816 1068158
13803 1068158 1068327 990020 982283 1055531 1152775 1226432 1204032 1211356 1185364 1114905 1044728 1028400
13791 1028400 1103024 1133349 1190744 1192288 1292944 1331739 1320563 1287592 1241169 1310540 1338615
13780 1338615 1321400 1405662 1458213 1443013 1403827 1373398 1394665 1474144 1444513 1441664 1455298
13769 1455298 1502474 1579240 1551473 1639262 1674315 1715635 1803419 1770334 1753460 1823289 1986267
13758 1986267 2014109 2025363 2045679 2121292 2163717 2251740 2304966 2271844 2296417 2405569 2430248
13747B430248m145J19321J43861J61646J24768J10179N2922P5692J74354K11007
13737C599853J66055J37798J29180J47806J65659K18688J12727J88312K66037
13728E132115K82914J90244K26563K75988L45493K32831L15313L35546L52933
13719G689940M55073M97294N26808N34045O06082O29913O50768P20495P97552
13710A3107970R17694J041963J072555J151665J425747J593103J685612J926469
13702B3922778K307288K628709K856814L350755L949616M438160N111223N831420
13694E4396763O728025P878774R258013J1047310J2820194J4470100J6172432
13687A32771611J7368704J7531195J6669057J4297464J0605507N930511N76803
$$ plain form
13747 2430248 2426103 2545424 2689285 2850931 2975699 3085878 3138800 3214492 3388846 3599853
13737 3599853 3765908 3903706 4032886 4180692 4346351 4565039 4677766 4866078 5132115
13728 5132115 5415029 5605273 5831836 6107824 6453317 6686148 7001461 7337007 7689940
13719 7689940 8145013 8642307 9169115 9703160 10309242 10939155 11589923 12310418 13107970
13710 13107970 14025664 15067627 16140182 17291847 18717594 20310697 21996309 23922778
13702 23922778 26230066 28858775 31715589 35066344 39015960 43454120 48565343 54396763
13694 54396763 61124788 69003562 78261575 89308885 102129079 116599179 132771611
13687 132771611 150140315 167671510 184340567 198638031 209243538 215174049 215750852
13680B15750852n011974r948441j3730553j6407054j7719829j7814157j6927751
13673A18191093j5417003j3677855j1840376j0075139q578267p244929o191965
13666D5165559n388220m439862l751176l289365k908667k600565k207305j911310
13658A8669089j597865j472689j363578j104474r84845q53986p82569p11446o27987
13649I169650o62748n78476m52163l70036l98698l44911l43677l40764l43691
13640E334486k31027k53864k74589k53309j56145j53114j11234j27819j79816
13631C593569j88720j79734n4481j01510k04467j29726l9644m2133n3436o6218
13621B533500o4784j36006j06584p6249k2631J644q059n3530n2063j15502j01851
$$ plain form
13680 215750852 210738878 200790437 187059884 170652830 152933001 135118844 118191093
13673 118191093 102774090 89096235 77255859 67180720 58602453 51357524 45165559
13666 45165559 39777339 35337477 31586301 28296936 25388269 22787704 20580399 18669089
13658 18669089 17071224 15598535 14234957 13130483 12145638 11291652 10509083 9797637 9169650
13649 9169650 8506902 7928426 7476263 7106227 6707529 6362618 6018941 5678177 5334486
13640 5334486 5103459 4849595 4575006 4321697 4165552 4012438 3901204 3773385 3593569
13631 3593569 3404849 3225115 3170634 3069124 2864657 2734931 2695287 2653154 2599718 2533500
13621 2533500 2468716 2332710 2226126 2149877 2127246 2128890 2120831 2067301 2015238 1899736 1797885
13610A797885l1330o5895L8057K7856n8152j14080p2722l169j15832m8102J0509
13599A365025o2013l9006n7965p1188o8392J766M298k427o261M7265m5002n5814
13587A010286K7620Q2320P2410l3070r9431j08296q0109k3931r864K6262k8245
13576H35952j7269n062Q8690J0012j08419j95548M1926J11764R4937n9969K0039
13565H17053P1579M4671q2409j00426J5686J6143k522k805O8763L6178j3019j9151
13553H49741m1963J0469j243o1746n0820l5129L0555N1970Q594R6645J38598N6083
13541A051754l9032j31805j11930j83451j65561k3901j0861q34q3566j7600M6967
13530C30180K2532j2244n9606P6857o255M6042j1099j17l068P675L5426j3007
$$ plain form
13610 1797885 1766555 1700660 1738717 1766573 1708421 1594341 1521619 1518450 1402618 1354516 1365025
13599 1365025 1303012 1264006 1206041 1134853 1066461 1068227 1072525 1070098 1063837 1111102 1066100 1010286
13587 1010286 1037906 1120226 1192636 1159566 1060135 951839 871730 847799 837935 864197 835952
13576 835952 818683 813621 902311 912323 803904 608356 650282 762046 856983 797014 817053
13565 817053 888632 933303 850894 750468 766154 782297 779775 776970 845733 881911 868892 849741
13553 849741 807778 818247 817004 755258 704438 669309 699864 751834 760428 857073 995671 1051754
13541 1051754 1012722 880917 768987 585536 419975 396074 385213 384379 300813 283213 330180
13530 330180 352712 340468 280862 357719 351464 397506 386407 386290 383222 390897 426323 413316
13518D13316j50825n9704M4097R8038J4635r0123m3235j7237J19174l017j6575
13507C08544N8659J23011j616m3199r8239L6706J40886J07449J35684Q5718j7981
13496H35622j77664r5984q3774j65996r6512j7275M3947Q1746m2719L237k2645
13485B61983L2121R4884J1424j91974r4639L1990L835p3487k1897J22153L5691
13474B12084j98731p5949J28280R4264o3231o530j5855m0795J3676l9940o3494
13463e6221j0448Q1252J21149m8289L28R777K6879P4920J25029L2561m353l7926
13451C14658q2485m5018k9127K9964n217L947j5933j5574q334O9682J9584l8011
13439A98136j9514o2871L206L5831o7739j5470N7209M431j19534p7919L0293q009
$$ plain form
13518 413316 262491 202787 246884 344922 359557 269434 226199 208962 328136 325119 308544
13507 308544 367203 490214 488598 445399 347160 383866 524752 632201 767885 853603 835622
13496 835622 657958 561974 478200 312204 215692 198417 242364 324110 281391 284628 261983
13485 261983 294104 388988 400412 208438 113799 145789 149624 76137 54240 176393 212084
13474 212084 13353 -62596 65684 159948 96717 90187 74332 33537 47213 7273 -56221
13463 -56221 -66669 14583 135732 87443 87771 97548 124427 199347 324376 356937 352584 314658
13451 314658 232173 187155 158028 187992 182775 186722 170789 155215 146881 216563 236147 198136
13439 198136 178622 115751 118957 154788 87049 71579 128788 133219 13685 -64234 -33941 -41950
13427d1950N0093N0940L3580M3480m9499j2108K4003k4953M3982R6161Q259r489
13415B12499J6074o7817j08736L0299L3704J1740j6173R3889k7493k3753Q471
13404A62704p358k0147o281L6088j1150R958K1161K0321k1048M579l5088k9825
13392A23914l8650k3491L1144N2594K7884j08575l3851K4525O7579j0661n929
13381A06483k0738J2438l5344J2486J6889k1702J2475N4534j623k2022o181J4855
13369A22550m728M9517J0368k890j9257n3379P359n2363m4452L1423k9038N2090
13357F7200j4329M5670J9518l8758l8723l1692n7078N6372O3050m4414j4019k4660
13345a1863K5514N9706j3123j3467M7252M1309k1991K1596Q4719J6193o6918J9637
$$ plain form
13427 -41950 8143 59083 92663 136143 86644 74536 98539 73586 117568 213729 221988 212499
13415 212499 228573 160756 52020 82319 116023 127763 111590 205479 177986 154233 162704
13404 162704 155346 135199 128918 165006 153856 163814 184975 205296 184248 188827 153739 123914
13392 123914 85264 61773 92917 145511 173395 64820 30969 55494 123073 112412 106483
13381 106483 85745 98183 62839 75325 92214 70512 82987 137521 135898 113876 107695 122550
13369 122550 117822 167339 177707 174817 155560 102181 109540 57177 12725 44148 15110 67200
13357 67200 52871 98541 118059 79301 40578 8886 -48192 8180 71230 26816 12797 -11863
13345 -11863 13651 73357 60234 46767 94019 135328 113337 134933 219652 235845 168927 188564
13333A88564m7520j02725L9761K4490k5114j17227j20136o110L9695J3547N5405
13322e7370Q2971K3273l2398j434K6405j0859K2462n34k5512k2693j8419J0342
13310c766j86n5303m895N3494O4238M4732l6934n5554L0648K788N616o43l4640
13297I595j5228P8917O0415J8836J3893l836J326m6688k3101P6572m1775r6048
13285C2878k1554K4641M6439j10587o0383M0802J138R771M9993M7756K3785o023
13273G8656k8416k9409M8448J9597m7841M9218J1280n8518L7760K59J2070k2475
13261G0629l5308m3610j6436n7326J9151N0947O741J01374L8208K4928m5338n4327
13249E9633k8058M3998P3475M143j0163M1124M7649J3900l7512L3549K2676O5435
$$ plain form
13333 188564 141044 38319 78080 102570 77456 -39771 -159907 -166017 -126322 -112775 -57370
13322 -57370 25601 48874 16476 15042 41447 30588 53050 52516 27004 4311 -14108 -3766
13310 -3766 -3952 -59255 -64150 -10656 53582 98314 61380 5826 36474 39262 44878 44235 9595
13297 9595 -5633 73284 133699 152535 166428 162592 163918 117230 94129 170701 128926 32878
13285 32878 11324 35965 82404 -28183 -88566 -47764 -46626 -36855 13138 60894 84679 78656
13273 78656 50240 20831 69279 88876 41035 90253 101533 43015 80775 81034 93104 70629
13261 70629 35321 -8289 -24725 -82051 -62900 -11953 -5212 96162 134370 159298 113960 59633
13249 59633 31575 75573 149048 153191 143028 184152 231801 245701 208189 241738 264414 329849
13237C29849N3325Q7170J15095J18949N0958N1329O8236N5667J21397J09619Q5450
13226A247044K5733j6571q5589j19497j69052r0788p7213m0884n8863p6457Q302
13215E46165o9158r9708m3787j444m7808k3265J5932j10604o0306K4188N8240
13204A88445m59N287p011J1263n866J351j6589n7046J911n127n152J2760P162
13191A30929l0908J7343N7242j9219J31389K8557q2912q6545p4371j9453O058
13180E8110k3848o9748m9806L1850r915R6329M1879j1304M9928P0223o0082k1505
13168A02111M2976P4576k9020m1406j0495N6654J0899J9509q087j19903q1457
13157A6357K8857K3887j4794O4252K6753L5914o3265q1937m5590M1376O1889r48
$$ plain form
13237 329849 383174 470344 585439 704388 755346 806675 874911 930578 1051975 1161594 1247044
13226 1247044 1272777 1256206 1170617 1051120 882068 791280 714067 673183 614320 537863 546165
13215 546165 477007 377299 333512 332068 284260 260995 276927 166323 106017 130205 188445
13204 188445 187986 193273 186262 197525 191659 193010 176421 119375 121286 116159 111007 123767 130929
13191 130929 100021 117364 174606 155387 286776 315333 232421 145876 71505 52052 58110
13180 58110 34262 -35486 -85292 -53442 -63357 32972 74851 63547 113475 183698 123616 102111
13168 102111 145087 219663 190643 149237 138742 195396 206295 225804 217717 97814 16357
13157 16357 45214 69101 54307 118559 145312 181226 117961 36024 -9566 31810 93699 92751
13145I2751p323r4J9462n4486k9806p28n0016k0030M247p7104l2373M6782n705
13132a14423l3977P2021Q8686k9022r0081K2248J8758J1862P8162j8034L718m846
13120E072k4719M406N5981o911L0567K2198m267P3751R350j69422o1108M8996
13108a6106J13701M5179k4905m9336k6387k793O762j4497K2480J9635P578l4714
13096D6597k5594K4326m4126m746P3277N7896k0918m0310o510o3049j45929n8614
13084b07700M6588J12602r319M3361k8394J9151P530P8996N5201r595p2541N2651
13072H8531j5746K1669m0226m8623l4329m2055Q4532r516m4909r6744O5876N0245
13060b1295j5004K7409O3540L6076J6106j9807m4941J3693q11L0061Q7276j14141
$$ plain form
13145 92751 85428 85334 104796 50310 20504 19776 -30240 -50270 -46023 -123127 -155500 -108718 -114423
13132 -114423 -148400 -76379 12307 -16715 -106796 -84548 -65790 -53928 24234 6200 9918 5072
13120 5072 -19647 -15241 40740 33829 64396 86594 82327 156078 165428 -3994 -65102 -16106
13108 -16106 97595 142774 117869 68533 42146 39353 46115 31618 54098 73733 81311 46597
13096 46597 21003 45329 1203 -3543 69734 127630 106712 66402 59892 -3157 -149086 -207700
13084 -207700 -161112 -48510 -57829 -14468 -42862 -23711 -16181 62815 118016 108421 35880 88531
13072 88531 72785 94454 54228 5605 -28724 -70779 13753 4237 -40672 -137416 -71540 -21295
13060 -21295 -36299 -8890 54650 90726 106832 87025 42084 55777 54966 85027 172303 58162
13048E8162r3929Q9714J1927J3137K6658j09393j38388M6245J42321L6041j18934
13037c6439r3339j1574K5687J4357j1212m8121L6532k4682M9045R7463R722j6424
13025h985M7479m1649j3867n1429n8535k178N7447M4488L7596k814J0401O3832
13013H1786J5039q9608o9926P1081J21396o816n123N465o1466q922l064o8308
13001a8466n5809L8117M1803M9750N9690j01431r0797m870M1506J29142P2727
12990A61362l0636r8232p8858L6979M7761J7253L1987J0970l1568j9785N666l3853
12978A9046N089O507L5129O058k6005J5498L6476o4137l5129o3551j8751k7352
12966a11122P643M4932J14839O3055M7352K8074L045J6047n5068p5247l4612l3023
$$ plain form
13048 58162 -35767 53947 65874 79011 105669 -3724 -142112 -95867 46454 82495 -36439
13037 -36439 -129778 -141352 -115665 -101308 -112520 -160641 -124109 -148791 -99746 -2283 7439 -8985
13025 -8985 38494 -3155 -17022 -68451 -126986 -129164 -71717 -27229 10367 7553 17954 81786
13013 81786 96825 7217 -62709 8372 129768 122952 117829 123294 61828 52906 49842 -18466
13001 -18466 -74275 -36158 5645 55395 115085 13654 -77143 -82013 -40507 88635 161362
12990 161362 130726 32494 -46364 -9385 38376 55629 87616 98586 67018 47233 52899 19046
12978 19046 24135 30642 65771 71829 45824 61322 97798 33661 -1468 -65019 -83770 -111122
12966 -111122 -103479 -58547 56292 119347 166699 194773 197818 213865 158797 83550 48938 15915
12954A5915Q475N8682l640R746J2345J1018m176k4614k3859m2867j07786m3229
12942a33990N0607P2047M3046K7007R0274K799M89nm1150l0918M6897r2730k0765
12929A3608K8734m4144l7274N0587O2077Q9711j8659M2033k8692q774j563m6065
12917A01579N0055N7384M4503m7918r5797j9908k6857k9337J05272k7257j8907
12906I2812N514J135L4055r891k9738M4007N1446Q755j7226j0194m7250k3890
12894I9535P463r4517L8477K5864p0450m8133o1994k0571M7807P0239M395J391
12882d94p5245O7746j3448L4357P3422j9604M8842L9181r4396j3575j5738L8662
12870F9710q9366o8964J79092J1810j10677J2702n0451L9365N0639r8635k8993
$$ plain form
12954 15915 24390 83072 79432 89178 101523 112541 108365 83751 59892 17025 -90761 -133990
12942 -133990 -83383 -11336 31710 58717 148991 151790 152279 152274 111124 80206 127103 34373 13608
12929 13608 42342 -1802 -39076 11511 73588 163299 144640 186673 157981 149207 147644 101579
12917 101579 151634 209018 253521 205603 109806 89898 63041 33704 138976 111719 92812
12906 92812 98326 99461 133516 123625 93887 137894 189340 198095 180869 170675 123425 99535
12894 99535 106998 12481 50958 76822 6372 -41761 -103755 -124326 -76519 -6280 -1885 -494
12882 -494 -75739 -7993 -21441 12916 86338 66734 115576 154757 60361 46786 31048 69710
12870 69710 -19656 -88620 90472 102282 -8395 4307 -46144 -6779 43860 -54775 -83768
12859h3768J00363J01959m6400n3500J8297J0202O596K5370M7571J5418n0453
12848I1655l9006M1437n3984k4126J30608J6429r7414Q413k5612Q3123j8048r9018
12836A4457j0320N3506n3046O1992n5684p180P4062J5685p815J5733j52L793l4661
12823G0370o7995M2936L4474R384n6176o009J58721k2802j03051j5716j5834J3814
12811D2116l684l6114J9088N355m6022R0153J12562p309o2313o7949q4945M6068
12799G006M6120o420O2988J1974l7682M0897k8798q6373n6830P2410N2760j6762
12787F1290M3207k8539j7788O674m8389r371J20698M5358L0456m7090n6182n2318
12775D8006M0511K5605l2531k9715k9338n0124k5440N1400j2939m8320q633N0207
$$ plain form
12859 -83768 16595 118554 72154 18654 36951 47153 53749 79119 126690 142108 91655
12848 91655 52649 94086 40102 15976 146584 163013 65599 74012 48400 131523 113475 14457
12836 14457 4137 57643 4597 66589 10905 3725 77787 93472 85657 101390 101238 105031 70370
12823 70370 2375 45311 79785 89169 32993 26984 185705 162903 59852 44136 28302 42116
12811 42116 38432 2318 21406 26761 -19261 70892 183454 176145 113832 45883 -39062 7006
12799 7006 53126 46706 109694 121668 83986 124883 96085 9712 -47118 25292 78052 61290
12787 61290 104497 75958 58170 64844 16455 7084 127782 173140 203596 156506 100324 48006
12775 48006 88517 114122 81591 51876 22538 -27586 -53026 -1626 -14565 -62885 -71518 -21311
12763b1311j167l0053M222N6244M2169n950M1491J7239J9754m309n593k7292M127
12750H9571j6068Q4755J05524p9644n5039K0924p177j9029O57j1780l3616J7500
12738I6578K3986k8165k8596K1218L7567L2083k0536j3854m7771q7515J4861K7442
12726B7298M1389m4200L4293J0595j0077O2618M4724o0259p0736o732J0133p524
12714C1522k9615Q4703M0310r6852j3071L5129Q7744L4554j7401J1428k8970k5134
12702A14347p4548l862K5503K033l9956p0471Q3863M5363L505O6728n0671l2577
12690F9257J6575M794q336j5937k9617J7574N5861J5347L486k0969M5841o7911
12678H5965m1751J3952m1378K263l8130J4634R6581N8554j8957j08224Q2177K6052
$$ plain form
12763 -21311 -22478 -52531 -48309 7935 50104 44154 85645 102884 122638 118329 112736 85444 89571
12750 89571 73503 158258 263782 184138 129099 150023 142846 123817 124474 112694 79078 96578
12738 96578 120564 92399 63803 85021 122588 154671 134135 120281 72510 -15005 -144 27298
12726 27298 68687 24487 58780 69375 59298 121916 166640 106381 35645 28913 39046 31522
12714 31522 1907 86610 126920 30068 16997 52126 139870 174424 157023 168451 139481 114347
12702 114347 39799 35937 61440 63473 23517 -46954 36909 82272 85777 152505 101834 69257
12690 69257 85832 90626 82290 66353 36736 54310 110171 125518 129004 108035 153876 85965
12678 85965 44214 58166 16788 19051 -19079 -4445 92136 150690 131733 23509 105686 131738
12666A31738j5165j3162M243L981j6283J8816p5414l1480L1501M7571O3098J7133
12654A66577M2440J3244o1540n0626J7928k6406N7034m203q8103n7414L3163L0821
12642G2915l4511M3576k033q0521M386K4451p400l769J4101J8284O787K9805q739
12629G7332o9520n2315K009J10138L9337J2568l7657o7057R314N3932J2753m6698
12617D4136o3479N1208M2631O5490J04294j5198j15273j02416q97j0360L6403
12606C6539J710K6353K8766J2725n4660j04668l1185M9961M7239J590j787l597
12594H986L4843l5720q0923P7584K9534N9078P269J2472l7469M3489n1380q2476
12582a4713n260J6458o7583K8408M4747L4426P7385r8573l8965J00337J0470o06
$$ plain form
12666 131738 116573 103411 107654 111635 95352 114168 38754 7274 38775 86346 149444 166577
12654 166577 209017 222261 160721 110095 128023 101617 158651 154448 66345 8931 42094 72915
12642 72915 38404 81980 79947 -574 3812 28263 20863 17094 31195 49479 56266 86071 77332
12629 77332 7812 -44503 -42494 67644 106981 119549 81892 14835 24149 78081 90834 44136
12617 44136 -19343 31865 74496 139986 244280 229082 113809 11393 10496 136 36539
12606 36539 38249 64602 93368 106093 51433 -53235 -84420 -34459 12780 14370 12583 8986
12594 8986 43829 8109 -72814 4770 34304 93382 100651 113123 75654 119143 67763 -14713
12582 -14713 -19973 -3515 -71098 -42690 2057 36483 113868 15295 -23670 76667 87137 86531
12570H6531J4663k2399n3444l7464J2919L3175l4112n2860l9573L7092J19652
12559F4180K5358M4290j9134m7379l9565p9209R1879K8169o3682l6218K600L1185
12547B474L729k2150J9197m308k6887j6249M4116L4243k0871L5902M0440m0480
12535D9156n5718o0895K3425J09449k7498n4611O4802O4722N1325k0791l6977
12524A06389k9079K7239N1685R707j9728k7117k5164j674J7766K1324j8278r312
12512A03758L993m3892l0121O1689L3926M1983l1940K7833l8644k2473M0507m1589
12500A05030p555R189K235m908r05n3736l2374L3521R7007Q419q1766j284k4852
12487D8021j9988P3q7513r8858P1802J14724k1747K6318J34410K8107q03q4951
$$ plain form
12570 86531 101194 78795 25351 -12113 806 33981 -131 -52991 -92564 -55472 64180
12559 64180 89538 133828 114694 67315 27750 -51459 40420 68589 4907 -31311 -28711 2474
12547 2474 6203 -15947 3250 -1058 -27945 -44194 -78 34165 13294 49196 89636 49156
12535 49156 -6562 -67457 -44032 65417 37919 -16692 48110 112832 164157 143366 106389
12524 106389 77310 104549 156234 165941 146213 119096 93932 92258 110024 131348 113070 103758
12512 103758 107751 63859 33738 95427 129353 171336 139396 167229 128585 106112 146619 105030
12500 105030 97475 106664 108899 103991 103086 49350 16976 50497 147504 155923 74157 72873 48021
12487 48021 28033 28106 -59407 -158265 -86463 28261 6514 32832 167242 195349 194546 109595
12475A09595n7772o3975m1626O0275L6585N932k2061N9037L5415K2615O866m0705
12463A10181k4249o988M3762O7411l4512o9903L3352N4880n9310N853k2009l8666
12451E9802M2040J5392J0847P5988J917o3743n8243R036p304J6903j1695R806
12439A00746P018L2113n5723j06023K5319P7853n7636j8058J17152J3232m4610
12428I1383O718n4484k5208J01025J25319K94017K35719O3704p9182l6967K5787
12417G47831K003L4484J3133o7579l8296m6222q1092r5580m6873o5091j4674K7428
12405C69472L5946M212j6314n627O4750j8322N294J66954L65047L16454L61538
12394A649404L5700j70757k02768j67360r3198J3751N4859l4815m4651r5208q0620
$$ plain form
12475 109595 51823 -12152 -53778 6497 43082 49014 26953 85990 121405 144020 150886 110181
12463 110181 85932 78944 122706 190117 155605 85702 119054 173934 114624 120477 98468 59802
12451 59802 101842 117234 128081 204069 205986 142243 84000 93036 85732 102635 90940 100746
12439 100746 107764 139877 84154 -21869 3450 81303 23667 5609 122761 135993 91383
12428 91383 98101 43617 18409 119434 244753 538770 774489 838193 759011 722044 747831
12417 747831 749834 784318 797451 729872 691576 645354 564262 468682 421809 356718 342044 369472
12405 369472 405418 409630 393316 387689 452439 434117 439411 606365 971412 1287866 1649404
12394 1649404 1685104 1514347 1311579 1144219 1051021 1064772 1119631 1084816 1040165 944957 864337
12383H64337q2202r1631j07154n5567Q7189J59643L34990K93363p9614j90368
12373A132986k28958j19383j13587r6723J5631j05152j08647J52333K16095J72401
12363I16996J49743K48232K46512R6474q1260Q119m078J68292J63393n9403k63177
12352A589843l31440k84139k68355j87984o1432r5514j05329p3644J8918L6939
12342B37863l0670j0546k269L6746J5336l6429n5966p785m0578O363J7501l322
12330A26244Q799K8914M5305R7422k3941p1804p4843M7405L5596N1033k908j08138
12318A59084m5405L1767R295m3941K4538k3863k3173j0117J5613N643j5505K7767
12306A11703o000M0717l6731o192N585J2723r3203n2948N312k1115P9625L5261
$$ plain form
12383 864337 782135 690504 583350 527783 614972 774615 1109605 1402968 1323354 1132986
12373 1132986 904028 784645 671058 574335 589966 484814 376167 528500 744595 916996
12363 916996 1066739 1314971 1561483 1657957 1576697 1584816 1580738 1749030 1912423 1853020 1589843
12352 1589843 1258403 974264 705909 517925 456493 360979 255650 182006 200924 237863
12342 237863 207193 196647 194378 231124 246460 210031 154065 146280 105702 112065 129566 126244
12330 126244 135043 163957 209262 306684 282743 210939 136096 183501 219097 270130 267222 159084
12318 159084 113679 145446 154741 110800 135338 111475 88302 78185 93798 99441 83936 111703
12306 111703 105703 146420 109689 103497 109082 121805 28602 -24346 -19034 -40149 39476 74737
12294G4737M800L074N1271J26599J09008j5008p8121N7066J43148J62439J80538
12283H19551K58395K86311J59395q245n5036N2059J27402J38537L6542k44327
12273A570584k16003j56341j85850k68703j82983j7169o7422J5675J6912M1574
12263E50274J90140K61239J95582J14627j1835j72503j81489q2289j5550o1955
12253G86241p8422M2128K02899J78368O0829k1665L4932Q537K1009J74060K49530
12242A658446J57096r3288j74091k05546k91930k15956j41455r1841q0316k9681
12232D91438l5031l0393O523L9528J12581l952q7657p8033Q0501J39951R2718
12221G28174N0055J0871q5272p8005n6902J6831O2421j6331k1801o4523p947l6376
$$ plain form
12294 74737 79537 82611 133882 260481 369489 354481 276360 333426 476574 639013 819551
12283 819551 1077946 1364257 1523652 1515407 1460371 1512430 1639832 1778369 1814911 1570584
12273 1570584 1354581 1198240 1012390 743687 560704 543535 476113 491788 508700 550274
12263 550274 740414 1001653 1197235 1311862 1300027 1127524 946035 863746 848196 786241
12253 786241 707819 749947 952846 1131214 1192043 1170378 1205310 1213847 1234856 1408916 1658446
12242 1658446 1815542 1722254 1548163 1342617 1050687 834731 693276 601435 521119 491438
12232 491438 456407 426014 432537 472065 584646 580694 493037 415004 495505 635456 728174
12221 728174 778229 789100 703828 625823 568921 585752 648173 631842 610041 545518 537571 501195
12209E01195l4110l7919o1384r0269m9549L3835l4129N492j9625r679K6749o0852
12197A69755l9266J4267q030j48741l3264L3643K0121L8082N6879M3473J7034
12186A63953o4730J3857N2075N5551K6984N2305L3933O446J3134k3197j8873O1360
12174C72798M1308j8276j56148o7284q416r3730o8286N5367O7002o6576J11370
12163A69129K7600p2607J421L4330q45o9867j2771R3491K9610j8262n583m1496
12151A34150m1693J5426j8407j9030O8976P5911N6805N0464R981q9353j5488J5811
12139B43553q992j07307p0264N2383M8522Q589l8821q9425o5786L1980p424K2596
12127A9604R1905j0511k1011Q6242l3853k7897L9996L5831l3974o0834m029J0643
$$ plain form
12209 501195 467085 429166 367782 277513 227964 261799 227670 233162 213537 203858 230607 169755
12197 169755 130489 144756 136726 -12015 -45279 -11636 8485 46567 103446 146919 163953
12186 163953 99223 113080 165155 220706 247690 299995 333928 340374 353508 330311 311438 372798
12174 372798 414106 395830 239682 172398 163982 70252 1966 57333 124335 57759 169129
12163 169129 196729 124122 125543 159873 159028 89161 76390 169881 199491 181229 175646 134150
12151 134150 92457 107883 89476 70446 139422 215333 272138 322602 332583 243230 227742 243553
12139 243553 234561 127254 56990 109373 157895 166484 127663 38238 -27548 4432 -2992 19604
12127 19604 111509 100998 79987 166229 132376 104479 144475 180306 146332 85498 81469 92112
12115I2112M8423K8990n4985N1508J5165K3092K7323m5404n7059J5940L1767j747
12103A75125j4647M7019o069q7977o3403m82Q9660J36045K1512j43689j7052N6630
12091A92672J3487K0427p4813k6423O4959q282K3041l0875p2589o2327n400L8797
12079G2674M3006o427n4304J0065K3522j2523Q2666m1048n2493J06862m0619K3437
12067A54818j5407K7584r383o6646L616M0327K5915J7844L0768L1410m2236m5701
12055A52909k0140N6418O0084k4453J8081l4210O8930Q2659N360j23779q1359
12044A60500j5294M297M3359r381L4234N65m803j8002r0120N803O3311R345K099
12031A85913r76J0707j3605J1402k7069Q348j741K7513o387j7189q9529n5925
$$ plain form
12115 92112 140535 169525 114540 166048 181213 204305 231628 186224 129165 145105 176872 175125
12103 175125 160478 207497 201428 113451 50048 49566 139226 275271 296783 153094 136042 192672
12091 192672 206159 226586 151773 125350 190309 182027 205068 174193 101604 39277 33877 72674
12079 72674 115680 109253 54949 65014 88536 76013 158679 117631 65138 172000 131381 154818
12067 154818 139411 166995 157612 90966 94582 134909 160824 178668 209436 240846 198610 152909
12055 152909 132769 189187 249271 224818 242899 208689 277619 360278 365638 241859 160500
12044 160500 145206 149503 192862 183481 217715 218280 213477 195475 105355 111158 174469 183814 185913
12031 185913 184937 195644 182039 193441 166372 174720 172979 200492 194105 176916 87387 31462
12019C1462j816L72Q022O5148m3036K9704J21426P8174k842k6637P717J5932k7432
12006B56194r348L9543R3661N9895N5033K317r6280n5044k9318n3229J4718j7289
11994B60853J9647j051r4787q068J09537J0108O430J0430J00106L0655n4518M7790
11982D37132O1469M3406J307o500O6890M8609l3959l3026J22101J84825R5801
11971I88055J33693J07451J22201J84708L84541N86798J018341J965709L254955
11962H746452K822300J48727j586680k059603k166032j817572j330937q31114
11954A925541m49536l24668j94474j58942j70152p5981p8793n3857J1895j2876
11944D18157q252r6872o2991K9960N8586L431O217n9803J01027O3562p5484n8636
$$ plain form
12019 31462 29646 30018 38040 103188 60152 89856 211282 289456 286614 259977 267694 283626 256194
12006 256194 246846 286389 380050 439945 494978 497295 401015 345971 316653 263424 278142 260853
11994 260853 280500 279449 184662 176594 286131 296239 302669 313099 413205 443860 389342 437132
11982 437132 498601 542007 543314 536814 603704 652313 618354 585328 707429 892254 988055
11971 988055 1121748 1229199 1351400 1536108 1920649 2507447 3525788 5491497 8746452
11962 8746452 11568752 11717479 10130799 8071196 5905164 4087592 2756655 1925541
11954 1925541 1476005 1151337 956863 797921 627769 551788 472995 419138 431033 418157
11944 418157 409905 313033 250042 280002 338588 342019 348236 288433 389460 453022 377538 318902
11932C18902l0901j3591q776K8711k7300J4605Q6254Q772j04943q6358m698M1932
11920B22609n6737j5569N8080J25753L5776o1305j17350N1657K0265J6068P0669
11909C49916K3010j1104m6689q9362j528N053J728p538m9629m6102K0280N9163
11897B07198P2872l6381k6030J0428l8376j4855L4434K7922k4074L8024M4461
11886B95623n954N4167K6891m2072l5809J7040J0741j1097n1495m6526O4675O8686
11874C44870J1406j03432k6388K2956M0710O1640J2781l0052n8578n8774n9757
11863A57382N0483M6465O3834o2560k3617O5574L473J3510m6035R7028J9082r0707
11851B93912m3148n0880L166J9002J5775L6431k5985j6509O5393K8613K6980o679
$$ plain form
11932 318902 288001 274410 265634 294345 267045 281650 367904 376676 271733 185375 180677 222609
11920 222609 165872 150303 208383 334136 369912 308607 191257 242914 263179 279247 349916
11909 349916 372926 361822 315133 225771 224243 229296 231024 223486 173857 127755 148035 207198
11897 207198 280070 243689 217659 228087 189711 174856 209290 237212 213138 251162 295623
11886 295623 289669 343836 370727 328655 292846 309886 320627 309530 258035 211509 276184 344870
11874 344870 356276 252844 226456 249412 290122 351762 364543 334491 275913 217139 157382
11863 157382 207865 254330 318164 255604 231987 297561 301034 314544 268509 365537 384619 293912
11851 293912 250764 199884 203050 222052 237827 274258 248273 231764 297157 325770 352750 346071
11839C46071N1239J3313q6365l7441L3451j00602q9780k7643R214P0160R1581
11828B73198l8828r839m993p6866K7453n6391K2297J0719N991Q0381Q5935N8695
11816C77752R65l3291m5126m8845l0670O9926Q0403p5732r4001R005j8470O6817
11804B58733J3784m563N9542K1526q079J4240J3286j0532l2846j07539j0024R6550
11792C04078j4374j7470L7367k4414n2520m9858o6714P3992N6158P5057N486r303
11780C17485m3288j13982m4714N1233J07452R4505J08388l595j6878j02509n8469
11769B95628o0417K1234J7386r25k8197L2223J12214M1014o3176K3524k1397J1801
11757C80912k5084J7238J5238m8197l5414L0828P1108n6441M8858M5029P612p1754
$$ plain form
11839 346071 397310 410623 324258 286817 320268 219666 129886 102243 111457 181617 273198
11828 273198 234370 224531 219538 142672 170125 113734 136031 146750 152741 233122 319057 377752
11816 377752 378717 345426 300300 251455 220785 290711 371114 295382 201381 210386 191916 258733
11804 258733 272517 267954 327496 349022 340943 355183 368469 357937 325091 217552 207528 304078
11792 304078 289704 272234 309601 285187 232667 182809 116095 190087 246245 321302 326788 317485
11780 317485 274197 160215 115501 166734 274186 368691 477079 473484 456606 354097 295628
11769 295628 235211 256445 273831 272906 244709 276932 389146 430160 366984 390508 369111 380912
11757 380912 355828 373066 388304 340107 304693 335521 406629 350188 399046 444075 451687 379933
11745C79933k0668L541j0801l6480n1113N559o140j0224L7004J27K7617M1517
11733C59872n9301k3316M9307L9227J8483J3424k0202K742J2008k0140k1689K955
11721C53370n9756K0998K4744l675l6231Q3535M2581L4080j953l9363j3432k4658
11709C80240j25949n2637K1814M6910L6078m2106k8041P4354M0465N5161K5967
11698D32256l2330j17840l9184P6809O7866l6242K7731K9534m6638o7036m1475
11687B53451K9979R1035M13J4647K2000n4019O2167m7269l3306N7296O3663N8645
11675E18702K5165n4196o1196l9100o1189m6210n2198N2410L422Q450k7173L345
11663B70232O0974J19338N394l3378R47P2006k202L3585o8622p0530p9573L2964
$$ plain form
11745 379933 359265 362806 352005 315525 264412 269971 263831 253607 290611 290738 318355 359872
11733 359872 300571 277255 326562 365789 384272 397696 377494 380236 392244 372104 350415 353370
11721 353370 293614 314612 339356 335681 299450 382985 425566 459646 457693 418330 404898 380240
11709 380240 254291 201654 223468 270378 306456 264350 236309 310663 351128 406289 432256
11698 432256 399926 282086 242902 319711 387577 351335 379066 408600 361962 294926 253451
11687 253451 283430 374465 374878 389525 411525 357506 419673 372404 339098 396394 460057 518702
11675 518702 543867 489671 428475 389375 328186 281976 229778 282188 285610 294060 266887 270232
11663 270232 331206 450544 455938 422560 423507 495513 493311 526896 458274 387744 308171 341135
11651C41135J09834J03820l8736m4351m8066L0805J426o8311j9666j16647l6863
11640B14380R7395p398j9073R5637N9647P414j2230l2816l0562N8181J6394q460
11628D38509L0525k0393k7731J5549N1425J0293L0670L5100j5706o6658M860q758
11616D77685M654n9640m0845J7453J8553k323O3585L1368q6825k2150P0467M3199
11604E15181l0662o194j7352j24226K100J05999K8172R2688R630M2261j140j04704
11592E11753r9963Q6756R2843j1264p1634r9920j9421j1966M5448Q2749L5430
11581E40811o4518L9280K1156k1103m0551M3546P1785p78j41849m8849P4396L0211
11569E03537Q2446J1605j04537k023K5079j3898j4486K8694j6953R230J07054
$$ plain form
11651 341135 450969 554789 516053 471702 423636 454441 455867 387556 367890 251243 214380
11640 214380 311775 304377 285304 380941 440588 448002 435772 402956 372394 430575 446969 438509
11628 438509 469034 448641 420910 436459 487884 498177 528847 563947 548241 481583 486443 477685
11616 477685 482339 422699 381854 399307 417860 415537 479122 510490 423665 401515 471982 515181
11604 515181 484519 478325 460973 336747 338847 444846 473018 565706 575336 617597 616457 511753
11592 511753 411790 498546 591389 580125 508491 408571 389150 377184 422632 505381 540811
11581 540811 476293 515573 536729 515626 475075 518621 590406 589628 447779 398930 473326 503537
11569 503537 585983 597588 493051 491028 516107 502209 487723 516417 499464 508694 615748
11558F15748P4252l6141o6470m9093J8738R5996j1789n6208l3836k147L6523M0911
11546F26484j3375K3044L8102J0997o3265j428m2115J9425J6512q560l3449r608
11534E62764n1134m8581P8676O5804K8959o5690p083l6026j2162O0276K3851M1329
11522F40983J198m3798j39706L6617O5707l187J1588O1453k7115l2098M7795J4503
11510F33940O3331J337n3846K8443O1924q0929j09430k7958R9033N9899M6352
11499G22096m4368M3602M806m3561k8208M1090M747J5119N0212j2323J132k2676
11487G31668m083m9026j11197k4941J38930P0774l5857r1J5720M9556o4495m7385
11475F69573J0092J5948N740J562J9478j3885q4034N95Q770N8860M1101J2832
$$ plain form
11558 615748 690000 653859 587389 538296 557034 653030 641241 585033 551197 549050 585573 626484
11546 626484 613109 636153 674255 685252 621987 620559 578444 597869 614381 605821 572372 562764
11534 562764 511630 463049 541725 607529 636488 570798 563715 527689 515527 575803 599654 640983
11522 640983 642181 598383 458677 495294 561001 557814 569402 630855 603740 571642 619437 633940
11510 633940 697271 698608 644762 673205 735129 654200 544770 516812 615845 675744 722096
11499 722096 677728 721330 726136 682575 654367 695457 700204 715323 765535 753212 754344 731668
11487 731668 727585 678559 567362 542421 681351 752125 716268 716177 731897 781453 716958 669573
11475 669573 679665 695613 701353 702915 722393 708508 624474 625069 633839 692699 733800 746632
11463G46632M6447J2721n1928q2367K0598O2055P455n6916m0537J0323P2741M377
11451G51601p4488r5872r510K3487K3686O8054L2927J0748l6255R9991O2705K1970
11439H79044q6639o2255k2429J9047O9196O108J7606j9497m3041n6707K1517P0251
11427G92201M0585j057K5544J702K0596M8852k0174m4134o215J130N9648M7929
11415I66607q802L5655O299J2436l6067m6993n4267k4605l9260J4756J46730J2862
11403I85351m737J7795J9809j495q2977m2955M5410J6867k0914o5454n584j07059
11391G54057j033R4469P457M6630Q9043O4209N8175l866l6075k5397l6519o865
11379A004285k1940n8513k3593k0014P2041J4770O4565R6757M7470q6486m0704
$$ plain form
11463 746632 793079 805800 753872 671505 692103 754158 761613 704697 664160 674483 747224 751601
11451 751601 677113 581241 571731 595218 618904 686958 719885 730633 694378 794369 857074 879044
11439 879044 792405 730150 707721 726768 795964 802072 819678 800181 757140 700433 721950 792201
11427 792201 832786 831729 857273 858975 879571 928423 908249 864115 857900 859030 918678 966607
11415 966607 957805 993460 999759 1012195 976128 929135 874868 850263 811003 825759 972489 985351
11403 985351 980614 998409 1018218 1016723 933746 890791 936201 953068 932154 866700 861116 754057
11391 754057 753024 847493 854950 901580 990623 1054832 1113007 1109141 1073066 1047669 1011150 1004285
11379 1004285 982345 923832 900239 880225 952266 967036 1031601 1128358 1175828 1089342 1048638
11368A048638r483j2054n795k6389l6943L5005P0236n776P2719J986m1584n6478
11356A034082m1855o253l3748N6237O2801M2040J0731J2997M9397n3035l5579
11345A097815Q9380K1461K709j34590l9535K6894l8491K2914L9504L2690k9306
11334A091445N7094L6206M9168m6983j0692j9745o0859o1875P8849R7532M2633
11323A252773k4058k1925l7866N3168l3870m7723P60M0657J8778k0950k1613m9136
11311A108995K6409J29555L4050k6868n8415p7896N0990R7032J1612M3485K2227
11300A361176K1526M062O306J6176k2018p0281k0934M9444O3035j0121P970P3775
11288A480116m5982n3051K55L9911O04m6729N6340O2772J8106k7603l8879J4824
$$ plain form
11368 1048638 1039155 1027101 1021306 994917 957974 992979 1063215 1057439 1130158 1132144 1090560 1034082
11356 1034082 992227 985974 952226 1008463 1071264 1113304 1124035 1137032 1186429 1133394 1097815
11345 1097815 1187195 1208656 1211365 1076775 1037240 1064134 1025643 1048557 1088061 1120751 1091445
11334 1091445 1148539 1184745 1233913 1186930 1176238 1156493 1095634 1033759 1112608 1210140 1252773
11323 1252773 1228715 1206790 1168924 1222092 1188222 1140499 1141259 1181916 1200694 1179744 1158131 1108995
11311 1108995 1135404 1264959 1299009 1272141 1213726 1135830 1186820 1283852 1295464 1338949 1361176
11300 1361176 1382702 1386764 1393070 1409246 1387228 1316947 1296013 1345457 1408492 1398371 1406341 1480116
11288 1480116 1434134 1381083 1381338 1421249 1421853 1375124 1431464 1494236 1512342 1484739 1445860 1460684
11276A460684k3165K7362j6541m4688P960L6454P0682k3196P9642L7433o2068
11265A550559l0544L8996N2241N9831N2322k5823M797r4179j01126N8736o012
11254A559798k1860l0681J5447N8912R6574N3345j1761P7157k8328j04021K2891
11243A687473K8263o345l0575q3972P0788M2496q082K0310M030q743Q4968L273
11231A803884k0465j1005L2235O4699k5066k178j1426P1298J9218R801P3082J8701
11219B022778n7740o3290K6511N5229J05047Q2080n1944m0101j7617N0210k7225
11208B083938p1841j8597l046K610K5881m3456k9340Q6694Q3064K7917J69154
11197B312978R3477q8787j16554K5112n55M483J1379M3357R71n3665N6854M0663
$$ plain form
11276 1460684 1437519 1464881 1448340 1403652 1411612 1448066 1518748 1495552 1575194 1612627 1550559
11265 1550559 1520015 1559011 1611252 1671083 1723405 1697582 1702379 1608200 1507074 1565810 1559798
11254 1559798 1537938 1507257 1522704 1581616 1678190 1731535 1719774 1796931 1768603 1664582 1687473
11243 1687473 1715736 1709391 1678816 1594844 1665632 1708128 1700046 1720356 1724386 1715643 1800611 1803884
11231 1803884 1783419 1772414 1804649 1869348 1844282 1842104 1830678 1901976 1921194 1930995 2004077 2022778
11219 2022778 1965038 1901748 1928259 1983488 2088535 2170615 2118671 2078570 2060953 2111163 2083938
11208 2083938 2012097 1993500 1990454 1993064 2018945 1975489 1946149 2032843 2115907 2143824 2312978
11197 2312978 2406455 2317668 2201114 2226226 2225671 2230154 2241533 2284890 2285861 2232196 2289050 2329713
11185B329713L7259J23778J07653r513p5483k3820j460J3043j299j7849j0492
11174B471530N2542N839J23430k446l7145L9115M0797l3900p6250J9599N2748
11163B655859R3894J04845N813k354m2421L5590P5967m928j6602m2132q971L9198
11151B893758L3270L6801L0250m0303P3414O7296l8179K9659n0691J3090L8286
11140C086651J09102J53428O6573o9819p8899q3959n4444j4299P3522J24886Q0584
11129C393326K1585Q838N6264Q3387P5101J7654n6202n393M0768J4085l2496k7150
11117C589767L6463N9799N4085O1368N9421J9111L1606O9733k2191M5683M6107
11106D050952j0510J14929N8496l0135o848j788M6826L8636J11885Q1247l2336
$$ plain form
11185 2329713 2366972 2490750 2598403 2588890 2513407 2489587 2488127 2501170 2499871 2482022 2471530
11174 2471530 2524072 2529911 2653341 2650895 2613750 2652865 2693662 2659762 2583512 2603111 2655859
11163 2655859 2749753 2854598 2860411 2858057 2815636 2851226 2927193 2922265 2905663 2863531 2854560 2893758
11151 2893758 2927028 2963829 2994079 2953776 3027190 3094486 3056307 3085966 3035275 3048365 3086651
11140 3086651 3195753 3349181 3415754 3345935 3267036 3183077 3128633 3114334 3187856 3312742 3393326
11129 3393326 3414911 3423749 3480013 3563400 3638501 3656155 3599953 3594560 3635328 3649413 3616917 3589767
11117 3589767 3626230 3686029 3740114 3801482 3860903 3880014 3911620 3981353 3959162 4004845 4050952
11106 4050952 4040442 4155371 4213867 4183732 4176884 4175096 4221922 4260558 4372443 4453690 4421354
11095D421354N3113M9468k6845l9477J11937J9426J3651P6865Q8210j3552k9664
11084D724486J2748Q6982N3881Q541l8996M4995J14847N2722L4006R1961N0612
11073E236785R0653Q0666l6730o9178j8269Q9106R0365J30822K5140Q575J2931
11062E640866K4311J1703J00291K9052Q4375O2800P4906L9097M5017O3527M9386
11051F225331P0672J25854P3962j5079p1739L1430N8936N8653O7317O6503O4583
11040F756423L6744J02519J05112M6540p937M2510O881N7042J20077J37559K1609
11029G425079k5953L9287J52406J13359N1419O808J7723P8846J23339N2571J4279
11018H049163M0356L7407R8403J52727J21935O2266k1700O2734J58317J11117
$$ plain form
11095 4421354 4474467 4523935 4497090 4457613 4569550 4588976 4602627 4679492 4767702 4754150 4724486
11084 4724486 4737234 4824216 4878097 4886638 4847642 4892637 5007484 5060206 5094212 5186173 5236785
11073 5236785 5327438 5408104 5371374 5302196 5283927 5373033 5463398 5594220 5619360 5627935 5640866
11062 5640866 5665177 5676880 5777171 5806223 5890598 5953398 6028304 6067401 6112418 6175945 6225331
11051 6225331 6296003 6421857 6495819 6480740 6409001 6440431 6499367 6558020 6625337 6691840 6756423
11040 6756423 6793167 6895686 7000798 7047338 7039401 7081911 7088792 7145834 7265911 7403470 7425079
11029 7425079 7399126 7438413 7590819 7704178 7755597 7762405 7780128 7858974 7982313 8034884 8049163
11018 8049163 8089519 8126926 8225329 8378056 8499991 8562257 8540557 8603291 8761608 8872725
11008H872725J08269M8541Q9328J25860J25242J25082P9139j751M6832L7123J09300
10997I765690L7137L5090P9385O8341j1495K3951M0877J2486N4452J12968J27974
10986A0346856J6522K4328L6725P0139J78271P3382l3255Q8776J50687R2117K2531
10975A1067079Q6049L7628M4838j7648J07084J83933J15479Q6246k733O6537K4978
10964A1799470J2491J16769N1991o788O9419R8860Q4052K6294J1567M4877J07647
10953A2416649J3755Q5204J02020J13587K9751J5757q168K4221K6278Q2199j8330
10942A2882923M3101K0366K6352K4648J1083L422m332L8236J0081j426m1060j10155
10930A2903239m5196k7632J24813P0284Q1133L7956j013k8847J9623k5167N1927
$$ plain form
11008 8872725 8980994 9029535 9118863 9244723 9369965 9495047 9574186 9572435 9619267 9656390 9765690
10997 9765690 9802827 9837917 9917302 9985643 9974148 9998099 10038976 10051462 10105914 10218882 10346856
10986 10346856 10363378 10387706 10424431 10494570 10672841 10746223 10712968 10801744 10952431 11044548 11067079
10975 11067079 11153128 11190756 11235594 11217946 11325030 11508963 11624442 11710688 11707955 11774492 11799470
10964 11799470 11811961 11928730 11980721 11973933 12043352 12142212 12226264 12252558 12264125 12309002 12416649
10953 12416649 12430404 12515608 12617628 12731215 12760966 12776723 12768555 12792776 12819054 12901253 12882923
10942 12882923 12926024 12946390 12972742 12997390 13008473 13011895 13007563 13045799 13055880 13054454 13013394 12903239
10930 12903239 12858043 12830411 12955224 13025508 13106641 13144597 13143584 13114737 13134360 13109193 13161120
10919A3161120K4298l5366P508J2207o3343j24232m5251M2762M6843o7049q9797
10908A2869700l4936J0252p0911J6344o2279n1240m0224l6421q4651k3094L158
10897A2495698l839q4374r3029n2090j03949j17941j3647j1338j9110j01615m5972
10886A1848794j2742o3812o0338m1349n2266k5473p0951j66730l9928n8186q0943
10875A1176076J9705l2815j3352m9242l2524j13912o6887j35435q0995j2730m6060
10864A0611829q5224j43691j04847j9249j10300j21095r7048p9137l1441r3412
10854I726385n7200o2339m3729q4682m8011j05999p3707k8454m0438q4410k9098
10843I068318N548p4986j11338j27501l1298o3501m7726o5872j04693p9706r7614
$$ plain form
10919 13161120 13185418 13150052 13157560 13169767 13106424 12982192 12936941 12979703 13026546 12959497 12869700
10908 12869700 12834764 12845016 12774105 12790449 12728170 12676930 12636706 12600285 12515634 12492540 12495698
10897 12495698 12491859 12407485 12314456 12262366 12158417 12040476 12026829 12015491 11996381 11894766 11848794
10886 11848794 11836052 11772240 11711902 11670553 11618287 11592814 11521863 11355133 11315205 11257019 11176076
10875 11176076 11195781 11162966 11149614 11100372 11067848 10953936 10887049 10751614 10670619 10657889 10611829
10864 10611829 10526605 10382914 10278067 10258818 10148518 10027423 9930375 9851238 9819797 9726385
10854 9726385 9669185 9606846 9563117 9478435 9430424 9324425 9250718 9222264 9181826 9097416 9068318
10843 9068318 9073866 8998880 8887542 8760041 8728743 8665242 8617516 8551644 8446951 8367245 8269631
10832H269631r5310K8253m7328r6640n7205r1578J6683K9906m0389q5660j34503
10821G695860j18059n7252o3434j06777n5124M2021L9025o5927p6360j6823J2916
10810G230066r2871n2361O9958J25942K3228R504M41J09279K73150K17109J11214
10799H024659L00867J52430O712L9227j03240j98669k05279k76361m26289k92643
10789G021414k18496k94123j42053r3629j57231j87025j38971p0920o3045n4275
10779E601646j05629j28296m8945n9237n3643K3886K0075J6655o8706q4146R585
10768E123245m1878o7019n0883n9174L492o7035l3012r9387r4426q9521j32313
10757D392089K186O6167k169l9000K5771N837m7410q3514j37612l0079j5407L9346
$$ plain form
10832 8269631 8174321 8202574 8155246 8058606 8001401 7909823 7926506 7956412 7916023 7830363 7695860
10821 7695860 7577801 7520549 7457115 7350338 7295214 7337235 7376260 7310333 7233973 7217150 7230066
10810 7230066 7137195 7084834 7154792 7280734 7303962 7313466 7313907 7423186 7696336 7913445 8024659
10799 8024659 8325526 8477956 8484668 8523895 8420655 8221986 8016707 7740346 7314057 7021414
10789 7021414 6802918 6508795 6366742 6273113 6115882 5928857 5789886 5718966 5655921 5601646
10779 5601646 5496017 5367721 5318776 5259539 5205896 5229782 5249857 5266512 5197806 5113660 5123245
10768 5123245 5081367 5014348 4963465 4904291 4907783 4840748 4807736 4708349 4613923 4524402 4392089
10757 4392089 4394275 4460442 4458273 4419273 4445044 4450881 4403471 4319957 4182345 4152266 4136859 4176205
10745D176205M5914j3134l5986m6535q8688j12609M0133l1481m0904j5349j20787
10734C756779K5409M8541k3335K2490n9150q4931j6417k007K3020K8405L423q5531
10722C636696K5770k0921j14222r0170m1935M4728m2292k6583M8544o3282j2227
10711C344106L1988K3501m3310o103L8673M1541j3965o1293m7017r072N3878j805
10699C351122o1379o5496n4223p4978j6991N5480O444n4912m7383O734r2399K1529
10687B973548J32175J06453M5035L1472j0083p6821p3851n2529k2561l4514q6362
10676B931962k922l7883q6604J3203R412J4284q099o3451j5227l2848l5705o1716
10664B624406m3920p0387m0823n6160p0234R772N1317M5961k5396k5075K8610
$$ plain form
10745 4176205 4222119 4208985 4172999 4126464 4037776 3925167 3965300 3933819 3892915 3877566 3756779
10734 3756779 3782188 3830729 3807394 3829884 3770734 3685803 3669386 3667379 3690399 3718804 3722227 3636696
10722 3636696 3662466 3641545 3527323 3437153 3395218 3439946 3397654 3371071 3419615 3356333 3344106
10711 3344106 3376094 3399595 3356285 3350182 3388855 3430396 3416431 3355138 3308121 3299049 3352927 3351122
10699 3351122 3289743 3224247 3170024 3095046 3078055 3133535 3139979 3085067 3037684 3044418 2952019 2973548
10687 2973548 3105723 3212176 3257211 3288683 3278600 3201779 3127928 3075399 3052838 3018324 2931962
10676 2931962 2929040 2891157 2804553 2817756 2827168 2841452 2833353 2769902 2754675 2721827 2686122 2624406
10664 2624406 2580486 2510099 2469276 2413116 2342882 2352654 2403971 2449932 2424536 2399461 2428071
10653B428071O4481P2856m1217k7057N2199M8138k376P523K0988J8273R600k690
10641B648789Q269M178k713p3518q3104j662n576K0307p5385m4306l4349l2468
10629B328462o090K2630J47852O5395P490K9888J34305K20168K75038K74918K80804
10618C780860K06881J19769J72985J85669J22044n1908k08671k26395l43268k96981
10608C460985k92543k03542j72302j28258j17723r5092p3191j37139r8195N0898
10598B193898Q9100N1554k662q6030q168o6097r8223N480N6186l1666n6171q0346
10586A966855K5283N4684m5046J27233J7147m0115l6973Q4587J358r6393j12587
10575A946033n6257j17857L9139M8603N0122J04846p918p3231q466j2232l2000
$$ plain form
10653 2428071 2492552 2565408 2524191 2497134 2549333 2597471 2595095 2602618 2623606 2641879 2651479 2648789
10641 2648789 2657058 2661236 2658523 2585005 2501901 2500239 2494663 2514970 2439585 2395279 2360930 2328462
10629 2328462 2322372 2345002 2492854 2558249 2565739 2595627 2729932 2950100 3225138 3500056 3780860
10618 3780860 3987741 4107510 4280495 4466164 4588208 4536300 4327629 4101234 3757966 3460985
10608 3460985 3168442 2964900 2792598 2664340 2546617 2451525 2378334 2241195 2143000 2193898
10598 2193898 2282998 2334552 2331890 2245860 2237692 2171595 2073372 2078852 2135038 2103372 2047201 1966855
10586 1966855 1992138 2046822 2001776 2129009 2146156 2106041 2069068 2153655 2155013 2058620 1946033
10575 1946033 1889776 1771919 1811058 1859661 1909783 2014629 2006711 1933480 1925014 1912782 1880782
10564A880782j7556K3403m8446Q330R0251L8097R371p2421m3314N0278L0280q7255
10552A861800r0538k7299R7600Q6344P9046M1821l377k3449N0840P963O502P8741
10540B165994Q7769P2866O75R4057J23951L4500j33383j44552j18079N746p1691
10529B117853m211m3892j8402J09391M2519n4044o8897R069J19589J17903j970
10518B324908L2154J80595J03267O8511j9797k4941J77L7441k037p6070p9786
10507B544422l6181k9394n2959L6898L8037P4742M6470n1298n2722P1200N5960
10496B645175J97232J22629N9639L0337j17895n2959j46216j54918M1365J46840
10486B771229J07021R4146J35829K37935M21515M25589L42507k00k04426k58304
$$ plain form
10564 1880782 1863226 1886629 1838183 1846513 1936764 1974861 1984232 1911811 1868497 1918775 1949055 1861800
10552 1861800 1771262 1743963 1841563 1927907 2006953 2048774 2045397 2021948 2072788 2080751 2087253 2165994
10540 2165994 2253763 2326629 2327304 2421361 2545312 2579812 2446429 2301877 2183798 2189544 2117853
10529 2117853 2113642 2069750 2051348 2160739 2203258 2149214 2080317 2089386 2208975 2326878 2324908
10518 2324908 2357062 2537657 2640924 2709435 2689638 2664697 2664874 2702315 2700278 2624208 2544422
10507 2544422 2508241 2478847 2425888 2462786 2500823 2575565 2622035 2570737 2518015 2589215 2645175
10496 2645175 2842407 2965036 3024675 3055012 2937117 2884158 2737942 2583024 2624389 2771229
10486 2771229 2878250 2972396 3108225 3346160 3767675 4193264 4535771 4535571 4331145 4072841
10476D072841k70075k30623j19516r7444m6099j4022M8360K7320k4412o895N5257
10465C394692J9152P5650K0490J4502N0620J05749j6498j6275O3690L1198J1275
10454C754245O7563J65726o61L5607J22672J18937R2978N5521O2484R7593J44399
10443D717064J42458J98988K53164K07212K01195J93954J75692J50671K55793
10434F496191L43972L14342K90534L89364L00364K23819K96932M20735L43777
10425I420030N00717N35961N44713O12216P48532Q52809R26391R88378J149097
10416A6278844J124829J314830J527465J499037J643000J709835J820092J958458
10408B8876390K229437K647695L117718L779514M472856N342121O405090P644306
$$ plain form
10476 4072841 3802766 3572143 3452627 3355183 3309084 3295062 3343422 3370742 3346330 3339435 3394692
10465 3394692 3413844 3489494 3509984 3524486 3575106 3680855 3664357 3648082 3711772 3742970 3754245
10454 3754245 3821808 3987534 3986873 4022480 4145152 4264089 4357067 4412588 4475072 4572665 4717064
10443 4717064 4859522 5058510 5311674 5518886 5720081 5914035 6089727 6240398 6496191
10434 6496191 6840163 7154505 7445039 7834403 8134767 8358586 8655518 9076253 9420030
10425 9420030 9920747 10456708 11001421 11613637 12362169 13214978 14141369 15129747 16278844
10416 16278844 17403673 18718503 20245968 21745005 23388005 25097840 26917932 28876390
10408 28876390 31105827 33753522 36871240 40650754 45123610 50465731 56870821 64515127
10400F4515127R288486J1692106J4854637J8890585K4319820L1080514L8773134
10393B13414409M6188739N1544169N2374307M6630571L4135242J6527858m063787
10386D56751508k3880480l9266266m8727211n1726862m9559463m4160834l7197977
10379A62232415l0227207k4002204j8871997j4810854j1578218r175560p297348
10372D6269027n842084m688880l788205l135169k668147k190655j804844j518089
10364B0632954j262415j239029j218774j089860j015349j087408j007918r74308
10356A1737893q09989o79117o49545n44181m25002l56766l47422k70135k29332
10347G426404k70067j87467k80047l26793k52241k19298k74043k24705j83752
$$ plain form
10400 64515127 73803613 85495719 100350356 119240941 143560761 174641275 213414409
10393 213414409 259603148 311147317 363521624 410152195 444287437 460815295 456751508
10386 456751508 432871028 393604762 344877551 293150689 243591226 199430392 162232415
10379 162232415 132005208 108003004 89131007 74320153 62741935 53566375 46269027
10372 46269027 40426943 35738063 31949858 28814689 26146542 23955887 22151043 20632954
10364 20632954 19370539 18131510 16912736 15822876 14807527 13720119 12712201 11737893
10356 11737893 10927904 10248787 9599242 9055061 8630059 8273293 7925871 7655736 7426404
10347 7426404 7156337 6968870 6688823 6362030 6109789 5890491 5616448 5391743 5207991
10338E207991j32338q443o8425j9221n7963p4633r8093j10391j43704j06040j05592
10327D283148j46081j93973j08013N6386L9437j00092j24383m5795l6340k9116
10317C595178L8749L8439o6627j60906j6975p7968o9468j44614p8546j03821j48486
10306B804955n5586n5660J2204R7140j232K679L5995M953m2447m2107r164J9858
10294B771588K6133N1763K3767L3533k256L5657J10288q517K6037k8165m173L9074
10282C074729M2867m9827K304L8899m2617q2447O3907N8236R6162k225R9862J13172
10270C413022Q0022M4788J27845J09217O9063O6721J42189K24307K11532K17380
10260D706086J78163J30960R8788J59038J29897J56448J56187K18081J92663J63854
$$ plain form
10338 5207991 5075653 5067210 4998785 4979564 4921601 4846968 4748875 4638484 4494780 4388740 4283148
10327 4283148 4137067 3943094 3835081 3891467 3930904 3830812 3706429 3660634 3624294 3595178
10317 3595178 3633927 3672366 3605739 3444833 3427858 3349890 3280422 3135808 3057262 2953441 2804955
10306 2804955 2749369 2693709 2705913 2803053 2801821 2804500 2840495 2845448 2803001 2760894 2751730 2771588
10294 2771588 2797721 2849484 2873251 2906784 2904528 2940185 3050473 3041956 3067993 3039828 3035655 3074729
10282 3074729 3117596 3067769 3070073 3108972 3066355 2983908 3047815 3106051 3202213 3199988 3299850 3413022
10270 3413022 3493044 3537832 3665677 3774894 3843957 3910678 4052867 4277174 4488706 4706086
10260 4706086 4884249 5015209 5113997 5273035 5402932 5559380 5715567 5933648 6126311 6290165
10250F290165K26442J74787K96088L52175K89570L28290K65486M28028N02288
10241I153319N97069O89525P40263Q99398J051698J142721J184029J386193J500244
10232A8344459J636499J841871J958146K206639K344326K762050L305895L886076
10224C8285961M777049N616819O893507Q575387J0861769J3997263J8224229K4071966
10216A31303950L1355095L9928886M8336861N4473823N6407537N2501762M1558356
10209D55866270K4690871M351342j6682638l4878552m7630780n4333124n4994351
10202B76389038n1115900m4538461l6938252k9474849k2956133j7689778j3583304
10195F0092361j0359913p950409o163307m760354l725282k983135k384271j918822
$$ plain form
10250 6290165 6516607 6691394 6987482 7339657 7629227 7957517 8223003 8651031 9153319
10241 9153319 9750388 10439913 11180176 12079574 13131272 14273993 15458022 16844215 18344459
10232 18344459 19980958 21822829 23780975 25987614 28331940 31093990 34399885 38285961
10224 38285961 43063010 48679829 55573336 64148723 75010492 89007755 107231984 131303950
10216 131303950 162659045 202587931 250924792 305398615 361806152 414307914 455866270
10209 455866270 480557141 484908483 468225845 433347293 385716513 331383389 276389038
10202 276389038 225273138 180734677 143796425 114321576 91365443 73675665 60092361
10195 60092361 49732448 41782039 35618732 30858378 27133096 24149961 21765690 19846868
10187A9846868j528719j319147j303151j244091j204043j210564j017121r40424
10179A0079608q96748q15774p18809o67529m57809m31035m04460l46963l68815
10170D971666l18417k54846k80559k52762k14832j75157j31074r8894j36371r3778
10160C014976q9061o3803o2250n5854k7724n2153p2190o2844p9443m4439m5024
10149B360191j12022p3851K8787o6986l9833q1664j12813m4885K9198N0818n5468
10138A881472j29887p0828r9287o5455J12748l4633j00788K349J5205p3752n3513
10127A383631N2830O4008P232J2482Q6728J73569K10274K33644J52515R7572N230
10116B479715q4892j60102j61364j58815j26737j93614j64065q4256l4263j20249
$$ plain form
10187 19846868 18318149 16999002 15695851 14451760 13247717 12037153 11020032 10079608
10179 10079608 9182860 8367086 7648277 6980748 6522939 6091904 5687444 5340481 4971666
10170 4971666 4653249 4398403 4117844 3865082 3650250 3475093 3344019 3245125 3108754 3014976
10160 3014976 2925915 2862112 2799862 2744008 2716284 2664131 2591941 2529097 2449654 2405215 2360191
10149 2360191 2248169 2174318 2203105 2136119 2096286 2014622 1901809 1856924 1886122 1936940 1881472
10138 1881472 1751585 1680757 1581470 1516015 1628763 1594130 1493342 1495691 1510896 1437144 1383631
10127 1383631 1436461 1500469 1507701 1520183 1606911 1780480 1990754 2224398 2376913 2474485 2479715
10116 2479715 2394823 2234721 2073357 1914542 1787805 1594191 1430126 1345870 1311607 1191358
10106A191358m965n2676j38537k726k7758k2264K8462o668P0427j3193K8702Q219
10094A058381o6470P7753N5952o7404m4337M0502o341o5339l7196J8443J05583
10083A069527O1425Q1007K4675J9104q9745r2281o1146k0053j9863j42401m3284
10072G86965j7841K1885m2953n3212l7216N0586o1279p7059N8162n6583o3865
10061E07590K1402l3439l4242j6280k4437j9566M2484P8763Q021K5347n6438L9165
10049E38370R9527N4273K5110J56588J96954L81277L10833p5238l43092k30767
10039A113835j62867j10390j92057j29031l0382N6985K4583Q0826O9175o4143
10029F56534p1827l6250j7913J7810O6407k2399p1968p5909p605m6226p5193j00810
$$ plain form
10106 1191358 1186393 1133717 995180 992454 964696 942432 970894 964226 1034653 1021460 1050162 1058381
10094 1058381 991911 1069664 1125616 1058212 1013875 1054377 1048036 982697 945501 963944 1069527
10083 1069527 1130952 1211959 1236634 1255738 1165993 1073712 1012566 992513 972650 830249 786965
10072 786965 769124 791009 748056 694844 657628 708214 646935 569876 628038 571455 507590
10061 507590 528992 495553 461311 445031 420594 401028 443512 522275 530296 555643 499205 538370
10049 538370 637897 692170 717280 873868 1070822 1452099 1762932 1687694 1344602 1113835
10039 1113835 950968 840578 648521 519490 489108 546093 570676 651502 720677 656534
10029 656534 584707 548457 530544 548354 614761 592362 520394 444485 436880 390654 315461 214651
10017B14651l7417j3785m0136j04626p548j9124P2687J01541O3242L9081M8601
10006C17167j3436m7303L0175N2213J09140O9914k4157k6717o284K5240n0792
9995D35160n3943J7729J12596N9254J30201J19560J01716J65539K06403J87330
9985A481545R0563k8817j3530R9417R6890J38910J80709K21686J84418K21200
9975B672991J08858K8430r3818k14782j80557k90638l03267k46414j54165j46388
9965A180250j61631j61328q1340p1353j35563m3084j05145k9561o4657L0586n6040
9954C01134q3642m893q7215o8000j7352J0911p233j6806J02217N5875L1272J7132
9942B33400q7539o2356L2919M3859L3527j7549m3039J8412r589L6976M0804K2793
$$ plain form
10017 214651 177234 163449 123313 18687 11139 -7985 64702 166243 229485 268566 317167
10006 317167 303731 256428 286603 338816 447956 517870 493713 466996 460712 485952 435160
9995 435160 381217 398946 511542 570796 700997 820557 922273 1087812 1294215 1481545
9985 1481545 1572108 1543291 1529761 1629178 1726068 1864978 2045687 2267373 2451791 2672991
9975 2672991 2781849 2810279 2716461 2501679 2321122 2030484 1727217 1480803 1326638 1180250
9965 1180250 1018619 857291 775951 704598 569035 525951 420806 391245 326588 357174 301134
9954 301134 217492 212599 125384 57384 40032 50943 43710 26904 129121 184996 216268 233400
9942 233400 145861 83505 116424 160283 193810 176261 133222 151634 142045 179021 219825 242618
9930B42618j5428N620l8495r553K5673P5528N6925P421l362o0675m3650m3327
9918A99295K3659J972l1550j10245k0389L4684N2243N8754K53k214k3539K3453
9906B06376m2605l2153J2295J28246L8583n4518k6704Q931O7829J4403j8400n2771
9894B49512m1167j4176J9726l5287k7696K4865N3936R393K2673L840p4056p8550
9882A13013p4014J1174N0776R006K5733L1949m2254l9952J20487N5631J575r9448
9870A63676j1682m290j7703j6277j4333P4763P7006j0662k6231Q5516P356q7367
9858B19772k1918j41359l9769K6881m1879m6280L6854M7094N6890O6521j498Q537
9846A69846n706o9396L003k7842P9548m6132l8437l626M4475M1989N1542o7975
$$ plain form
9930 242618 227190 232810 194315 184762 210435 285963 342888 350309 346947 286272 242622 199295
9918 199295 222954 224926 193376 83131 62742 97426 149669 208423 208676 206462 182923 206376
9906 206376 163771 131618 143913 272159 310742 256224 229520 238451 306280 320683 302283 249512
9894 249512 208345 194169 213895 178608 150912 175777 229713 239106 261779 265619 191563 113013
9882 113013 38999 50173 100949 109955 135688 167637 125383 85431 205918 261549 263124 163676
9870 163676 151994 147704 130001 113724 99391 174154 251160 240498 214267 299783 307139 219772
9858 219772 197854 56495 16726 43607 1728 -44552 -7698 39396 96286 162807 161309 169846
9846 169846 164140 94744 97747 69905 149453 103321 64884 61258 105733 147722 199264 131289
9834A31289n5161L3782R1793q2342k9539K0797N9567P2394j09275n6550L4190
9823A10945O7233J11940J41591J39800J52153L4012r4906p7714p7315q9291m8212
9812C70236J203Q442P084J02774J37861P8084j6910J39856K49804L36181M02739
9801A817354K83896K35198K84000K34572P8001J9370p0148j87727l50484l71088
9791A972944l64249l02351k24227j88282r8317j55086j45700p07K8265p8657n7495
9780C86138n8627p2228l0686p5812j6150J3781O796p3653N1896j9193l6180J5741
9768I1823Q3439L3337k8876J4226L1126o9021j22950m189O3585N9593P8254j2035
9756B18312q467o443l3669J9643o405j03205J9279m0929l143j29095l6975N7451
$$ plain form
9834 131289 76128 109910 201703 119361 89822 110619 170186 242580 133305 76755 110945
9823 110945 178178 290118 431709 571509 723662 757674 662768 585054 507739 418448 370236
9812 370236 371439 379881 386965 489739 627600 705684 688774 828630 1078434 1414615 1817354
9801 1817354 2101250 2336448 2620448 2855020 2933021 2952391 2882243 2694516 2344032 1972944
9791 1972944 1608695 1306344 1082117 893835 795518 640432 494732 494025 522290 443633 386138
9780 386138 327511 255283 224597 148785 132635 146416 153212 79559 131455 112262 76082 91823
9768 91823 175262 208599 179723 193949 225075 156054 33104 28915 92500 152093 230347 218312
9756 218312 209845 203402 169733 189376 182971 79766 99045 58116 54973 -74122 -111097 -53646
9744e3646N7707N6162P6309J8420l4734k8819K1142k372M5182L7449k864k7140
9732A62796k8965p7535o3595o776j7667m4425L5045R0675K9110p7368M6414k060
9720D5649M1433K9280j3166k2525k564L6202k8347n3170J4430R3414O704j2799
9708A34541k9803J635q7628N0432K0205O7537P1654p846K7623J2877p5996n8702
9696A26529j7809N1317N7019l4503m6867O842M8083J11516J51198L2694J02444
9685E88463J31471L6702J46m2410m5004m4117K4636m8172j79524r5013k12585
9674A14593K2907O4000n2559J9057K0583P009o3737k2008O356j02226l4737Q6296
9662F5534P2462L7802k296L8473m3033j06921l9455M5929M8623q035L997J0104
$$ plain form
9744 -53646 4061 60223 136532 154952 120218 91399 112541 110169 155351 192800 189936 162796
9732 162796 133831 56296 -7299 -14075 -31742 -76167 -41122 49553 78663 1295 47709 45649
9720 45649 87082 116362 103196 80671 78107 114309 85962 32792 47222 140636 147340 134541
9708 134541 104738 106373 18745 69177 89382 156919 228573 220727 248350 261227 185231 126529
9696 126529 108720 160037 217056 182553 135686 142528 190611 302127 453325 486019 588463
9685 588463 719934 756636 756782 714372 669368 625251 649887 601715 422191 327178 114593
9674 114593 137500 201500 148941 167998 188581 195590 131853 109845 116201 13975 -20762 65534
9662 65534 137996 175798 173502 211975 168942 62021 22566 68495 117118 109083 113080 123184
9650A23184j8833l9094J5890M6113j19545r2036P4837R0132O4558q1307p3810
9639i911j1544N6647J5443m2610n6548P8503L2552K3229L6171m7439r8948K4992
9627E37P0450m6974l7648m128n8290r772n9987L7962P1024P9285K1171k1609K1045
9614F3066L1380L4264l6676J9831l12j3804J3829K736k1082n5839m8865p435p178
9601b6085K9596O6945m3096L5973M142K2463r777m0684k6881N0845j5553j19379
9589g1491n5421k9857J7533O9775N9262L8779K9022j0539n9387m969P5993m5933
9577A2767n8230p0811J14507J1220n9996L716M4251K7294r521J702K4265O7514
9565A08678k1762m0713M0954k911m6853j5404m2872j07079M5478J67267k7177
$$ plain form
9650 123184 104351 65257 81147 127260 7715 -84321 -9484 80648 145206 63899 -9911
9639 -9911 -21455 35192 50635 8025 -48523 29980 62532 85761 121932 74493 -24455 537
9627 537 70987 24013 -13635 -17763 -76053 -85825 -145812 -107850 -36826 42459 63630 42021 63066
9614 63066 94446 128710 92034 111865 111553 97749 111578 114314 93232 37393 -11472 -18907 -26085
9601 -26085 3511 70456 27360 63333 67475 89938 80161 39477 12596 63441 47888 -71491
9589 -71491 -126912 -156769 -139236 -69461 -10199 28580 57602 47063 -12324 -17293 58700 12767
9577 12767 -45463 -116274 -1767 9453 -50543 -46827 -2576 24718 15197 16899 41164 108678
9565 108678 86916 46203 87157 84246 37393 21989 -20883 -127962 -82484 84783 57606
9554E7606l0265m7738m8715K3518m599L2336N1714J6960o6029k7177N3094L979
9542A4684n2353L5694M1376M0808N946O4556M9312q9876j32054k6745N5107M4172
9530E0627j6275l1069o4659J0006P9080m241M9638O4809q526k1470l0792j562
9518G5566K7094J4708o6547j1396l2317j6221p304k5380J1920K5391j0573O7354
9506E2295K9061m865N1631o1486n162O818l7858Q912L2405k3150n6152K2683R0116
9493A05248j5195p33R7972L4566o0420n5377J3970m2974m001p3750l6792M8329
9481A0843r1p1539K264j3628k794k3397k0863J7401q223R3900O4131L3510n459
9468G6055n5649m8883l3659m1465n1836K5168J12764R8614j2370j33025r2534
$$ plain form
9554 57606 27341 -20397 -69112 -45594 -50193 -17857 33857 50817 -15212 -42389 10705 14684
9542 14684 -37669 -1975 39401 80209 86155 150711 200023 110147 -21907 -48652 6455 50627
9530 50627 34352 3283 -61376 -51370 27710 23469 73107 137916 129390 107920 77128 75566
9518 75566 102660 117368 50821 39425 7108 -9113 -16417 -41797 -29877 -4486 -15059 52295
9506 52295 81356 76491 128122 66636 61474 68292 30434 39346 71751 48601 -7551 15132 105248
9493 105248 90053 89320 187292 221858 161438 106061 120031 77057 73056 -694 -37486 10843
9481 10843 10752 -60787 -58523 -72151 -74945 -98342 -119205 -101804 -110027 -16127 48004 81514 76055
9468 76055 20406 -28477 -62136 -103601 -155437 -130269 -17505 81109 68739 -64286 -156820
9457a56820O305J37369k8322j5134K6326p4369j1999Q0204O9626M016K2247J9543
9445G8992P8295J9288q9215j05387o9877N5446J14742N6890l0738r536n6152j28932
9433h6184l9563J00193k6344J795j7955n899L5014J1752J01911J4670q4819j0391
9421e820R5118L6791p1362L9274J03436q5453n2344K6234l0313M7321j8992Q901
9409I2791o265j8038j2557J4120P467m943K4124O4882j4591o2960K3737p444j00966
9396f43J7713M2453j0842N5943l4429m7650p2079J4858J25087J14729k1837p0577
9384A12726J0196j699n3907R327N224N95m2613k7700j8356M1607m6647m0266M8538
9371b975L9300O722r3921j9484K7910p221K2761m5674l0885N2294R8164m0953
$$ plain form
9457 -156820 -150515 -13146 -41468 -56602 -30276 -104645 -116644 -36440 33186 37202 59449 78992
9445 78992 157287 176575 87360 -18027 -87904 -32458 82284 139174 108436 98900 42748 -86184
9433 -86184 -125747 -25554 -51898 -50103 -68058 -73957 -38943 -27191 74720 89390 4571 -5820
9421 -5820 89298 126089 54727 94001 197437 111984 59640 85874 55561 102882 83890 92791
9409 92791 86526 68488 55931 70051 77518 72575 96699 161581 146990 84030 107767 100323 -643
9396 -643 17070 59523 48681 104624 70195 22545 -49534 -34676 90411 205140 183303 112726
9384 112726 122922 121223 67316 76643 81867 82462 39849 12149 -6207 35400 -11247 -51513 -2975
9371 -2975 36325 43047 -50874 -70358 -42448 -49669 -26908 -72582 -103467 -51173 46991 6038
9359F038N2919N3077m1640K7291K3466q990j5260q6396p8339Q6267L8792k8474
9347B8751P7954m9126m2539q111K5481M380l271k0141M1833l6501M7329p5144
9335i105p4305O1553Q0685j8470j8005j9299O927n088K4593M6593O8108K9702
9323A73889M694r2830j26036k5766J6838Q5713n376k2086O9583K7649p5859r2828
9311f2415K5632L8638m5143j5156j6123l4452J5538K566m2132k8748R2834N3134
9299a5827n2601o0858J4448P1680L6672N3753J0110j1195o0379N7077K8399L6196
9287A07475K6392m1076k6187n1593N545P90J4433O7591N7916r7244p3064J5524
9275F502l7310j09183p5149N8335J87304K8965k4515r3074o6868k1230p2941P7003
$$ plain form
9359 6038 58957 112034 70394 97685 121151 112161 96901 10505 -67834 18433 57225 28751
9347 28751 106705 57579 15040 6929 32410 36790 33519 13378 55211 18710 66039 -9105
9335 -9105 -83410 -21857 58828 40358 22353 3054 9981 4893 29486 76079 144187 173889
9323 173889 178583 85753 -40283 -66049 -49211 36502 31126 9040 78623 106272 30413 -62415
9311 -62415 -36783 1855 -43288 -58444 -74567 -109019 -93481 -90915 -133047 -161795 -68961 -15827
9299 -15827 -68428 -129286 -114838 -43158 -6486 47267 57377 46182 -14197 42880 71279 107475
9287 107475 133867 92791 66604 15011 20556 21346 35779 103370 161286 64042 -9022 6502
9275 6502 -30808 -139991 -215140 -156805 30499 59464 34949 -58125 -124993 -146223 -219164 -142161
9263a42161J58327O9312l8664J4530o4332l1569P559m8743m4542L9317P1613n1812
9251f1165n1543L3319N034J0633K3107J5168J5299L7946R7545J7102m9110l5600
9239E7735J1146j5250l3956m046j5843o2788M1148L1596m9439k2787k2758M2642
9227d2600K2902M7649J9757l5190k9745p302q350Q1425J03282J311l3052l5296
9215H4791n9313j2342j7842n4949n3198P5594N859l493Q8028Q8172L2698O184
9203A80189o9647Q263n7372m9493N974q2076m024k5327m9743l2498j0524M3881
9191a42397Q1967Q5297M0376K2632N201n1839J09009j9305n2964j517j4092L6354
9179I8722m4520m4278L1605j9314j2432K6055P580m1922l8381l8202N6938J7891
$$ plain form
9263 -142161 16166 85478 46814 61344 -2988 -34557 -26998 -75741 -120283 -80966 -9353 -61165
9251 -61165 -112708 -79389 -74355 -63722 -40615 -25447 -10148 27798 125343 142445 93335 57735
9239 57735 68881 53631 19675 15629 -214 -63002 -21854 9742 -39697 -62484 -85242 -42600
9227 -42600 -19698 27951 47708 12518 -17227 -24529 -32879 48546 151828 153139 120087 84791
9215 84791 25478 13136 -4706 -59655 -112853 -37259 -31400 -34893 53135 141307 174005 180189
9203 180189 110542 118805 61433 11940 17914 -64162 -68186 -93513 -143256 -175754 -186278 -142397
9191 -142397 -60430 24867 65243 87875 93076 41237 150246 130941 77977 76460 62368 98722
9179 98722 54202 9924 41529 22215 9783 35838 43418 1496 -36885 -75087 -18149 -258
9167b58n792N1229J8765J236j2953o802J0705j9849J3069n3297p738M0643k2593
9154F365P1425N4028J9157j17931J311j6928q7637k245J5048K7799n4645n1040
9142a35293L5744R6235N2951J3773j2576m1351l7020L7156J4148m3469q023N2291
9130B4566P7871J8277j4275j14240n0644O8233l0403n8778q187N1577j4713q0940
9118a31656j8876P705N3878o100O7601Q7562m971k4935K4371K9056j4359K6451
9106I5727O354p3566J9166K2702l6644r415q204l7935m1710J25k860J5375M7824
9093c061N6Q053J3952J4542l4023j02183K6196K7771m0648o2017o5321J02498
9081a14185N1030j1641p6965K5987J42385Q1867j6713m5946m5275O608p895L1167
$$ plain form
9167 -258 -6050 45179 63944 65180 52227 45425 56130 36281 49350 -3947 -11685 28958 6365
9154 6365 77790 131818 150975 33044 34355 17427 -70210 -72455 -57407 -29608 -84253 -135293
9142 -135293 -99549 -3314 49637 63410 50834 9483 -27537 9619 23767 -19702 -27725 24566
9130 24566 102437 120714 106439 -7801 -58445 9788 -20615 -79393 -87580 -36003 -50716 -131656
9118 -131656 -150532 -142827 -88949 -95049 -27448 60114 55143 30208 54579 83635 69276 95727
9106 95727 102081 28515 47681 70383 33739 24324 16120 -21815 -63525 -63400 -66260 -50885 -3061
9093 -3061 -3005 5048 19000 33542 -481 -102664 -76468 -48697 -89345 -151362 -216683 -114185
9081 -114185 -63155 -74796 -151761 -125774 16611 98478 81765 35819 -9456 -2848 -10743 20424
9069B0424l3080l7993K2042Q088K1748O6960Q5495m3300n4510J3576J1398m613
9057G6235K3045k9025k8294j6394M2445k6786m5430M983P7523l9116l8546l375
9045b735n019M9791j3510j1020k3613K4360Q9463p5941m6827J25287L5106l5036
9033A10306p2860K4647k988M8429l5518m7489o36l0133o8791J2386Q697L3531
9021b0419J0942j0807p8016K8059R3936P0774m2462p4402J4782K2693l9097J4402
9009i615L7381j3404N0519l8646j8650N4122j9359l4763J0141k9293p7534l8484
8997a27585P6064P2872J6724j5301n582n0944j01974M7592R1672Q4953l8851j52463
8985a02823k2060J3609M0842P6136o7264j4191P9813O0424p9027l2411K3496K6914
$$ plain form
9069 20424 -12656 -50649 -28607 -20519 1229 68189 153684 110384 55874 69450 80848 76235
9057 76235 99280 70255 41961 25567 68012 41226 -4204 779 78302 39186 640 -2735
9045 -2735 -7754 42037 28527 17507 -6106 18254 107717 31776 -15051 110236 145342 110306
9033 110306 37446 62093 59105 107534 72016 24527 23891 -6242 -75033 -62647 -53950 -20419
9021 -20419 -9477 -20284 -98300 -70241 23695 94469 52007 -22395 -7613 15080 -24017 -9615
9009 -9615 27766 14362 64881 26235 7585 61707 42348 7585 17726 -11567 -89101 -127585
8997 -127585 -51521 21351 38075 22774 17192 -33752 -135726 -88134 3538 88491 49640 -102823
8985 -102823 -124883 -111274 -70432 5704 -61560 -75751 4062 64486 -14541 -46952 -23456 3458
8973C458J6143N9145K544O2658K1492j6314j17177q7322N7701M774R059Q791m8269
8960b3317q7935k3905M5819O0279N8811j5715J9217n931j7168J1019Q267O930
8948C6371P801j2462l9483N7321J6374R0701m5320o6613K29K2157M4948L6587
8936A48611K5804j8473j6037j4835o915K7439O0157l3501l8581p6730m7457K7544
8924C7026p9590p2971M0025Q9673J35776M7653L2478m7066k5555o0194l6614n293
8912E5348L2867L8117K3787j5032p4377O082P1391P360L862J6765L1637n4013
8900A43794r2345K8601P0425N795K2881n6730p0123L5875k2278N2153k7296l9248
8888E1504L6296K3480L6789q6878l404j1942M4335o8622o4427r5266m8326N8220
$$ plain form
8973 3458 19601 78746 81290 143948 165440 149126 31949 -55373 2328 7102 16161 24952 -23317
8960 -23317 -111252 -135157 -89338 -29059 29752 14037 33254 27323 10155 21174 29441 36371
8948 36371 44172 31710 -7773 49548 65922 156623 111303 44690 44919 67076 112024 148611
8936 148611 174415 155942 139905 125070 118155 145594 205751 172250 133669 56939 9482 37026
8924 37026 -42564 -115535 -75510 14163 149939 197592 230070 183004 157449 97255 60641 55348
8912 55348 88215 126332 150119 135087 60710 66792 138183 145543 149405 166170 197807 143794
8900 143794 51449 80050 150475 156270 179151 122421 52298 88173 65895 118048 90752 51504
8888 51504 87800 111280 148069 61191 57787 45845 90180 21558 -42869 -138135 -186461 -128241
8876a28241L0056Q5720M22L8302j806M9788L6254J1687M4441k5218L6836K5444
8864B03685m4753J0812N7760J3387L9753l9980q2354J0517L7048o2404j8864n7853
8852F6754j6440P7004P9341L5699k1071j9802J5413J7999J30186J37494Q8830
8841E91407K9933r9708P235K556j38609j46896o4081o4289m3155M947n179N213
8829G9374N0368o4762j2034M5152L3781l0762M286o6081m4662P1490O2185L5325
8817A63660Q262l0327Q7149n9498j28373n1099N2295K388P515m5354j592J06930
8805A11956J02756O689k369J00515R7951O0568n2095R2192K19431K48545J00655
8794A086794o0040j13692j58920j75018j55671j30234j10549j03489j07989j6369
$$ plain form
8876 -128241 -98185 -12465 -12043 26259 24453 74241 110495 122182 166623 141405 178241 203685
8864 203685 158932 169744 227504 240891 280644 240664 158310 168827 205875 143471 124607 66754
8852 66754 50314 127318 206659 242358 221287 201485 216898 234897 365083 502577 591407
8841 591407 621340 521632 528867 531423 392814 245918 181837 117548 74393 79340 74161 79374
8829 79374 129742 64980 52946 98098 131879 101117 105403 39322 -5340 66150 128335 163660
8817 163660 171922 141595 228744 169246 40873 -10226 42069 44457 51972 6618 5026 111956
8805 111956 214712 221401 219032 319547 417498 478066 425971 518163 737594 986139 1086794
8794 1086794 1026754 913062 754142 579124 423453 293219 182670 79181 -28808 -45177
8784d5177K7895k8261L6684Q8750L6523j9073M9098j9312n3959k2192l9668L044
8772A4352L3739N2118O1643L6208L860k2818q0519q0524M2965O9983Q2293J6389
8760B29689K4784J3384l1068P406O559P3424K02850K1823p958M4871M0865l4646
8748E91983r1966k5211j5509j46749j04643l9161o6877n1351L7197q991p1140
8737G582l7869M6093P2806N4274N0360j0507J9642m9405Q5266m9847l9701O7654
8725B16348j1686m7601o3078L3012j5857k5666j157Q6672P0339P9028L4419L9070
8713C93843M2292m9775n9793p908n7234j06716q5530j9924o1871L1355O9382j359
8701H6762o196l3711j2068n0500K9132M08O2748M0810o1472l8461m6518p4289
$$ plain form
8784 -45177 -17282 -45543 -8859 79891 116414 97341 146439 127127 73168 50976 11308 14352
8772 14352 48091 100209 161852 198060 201920 179102 98583 18059 61024 131007 213300 229689
8760 229689 254473 267857 236789 244195 250754 324178 527028 548851 540893 585764 626629 591983
8748 591983 500017 474806 459297 312548 207905 168744 101867 50516 87713 78722 7582
8737 7582 -30287 15806 88612 142886 193246 182739 202381 152976 238242 188395 148694 216348
8725 216348 204662 157061 93983 126995 111138 85472 84315 170987 241326 320354 354773 393843
8713 393843 436135 386360 326567 318659 261425 154709 69179 49255 -12616 18739 88121 86762
8701 86762 80566 46855 34787 -15713 13419 13827 76575 117385 55913 17452 -29066 -103355
8689a03355N9430J05964j2685K1989N3767L6070J2665J3088n8397N2505J21783
8678C02824J1282q2456j08052l0700R720p786K0824L8024N5004O3415k9259p0588
8666A72252n7943l4531J06807j7522m9482k587l2538n330M4236L4578n5421k2878
8654G9641q464L4411M3410n9834q5424N3296M4628N6348K4491M4247l1883k0782
8642A74085N5455J49987J30750r7168j06313r9070J6621M8361k0578j10942p6606
8631F4582N6792M2368L0224K3179K630l7777k3963L7048Q7716K3659k0357m9307
8619B36794L6629N9788j9350p7633j2882k5598L3539K1401K4216K5247l4511M859
8607B72499q934p2862L6077O3979l0682K1573K5863P5841j0033l0790r8830J9113
$$ plain form
8689 -103355 -43925 62039 49354 71343 125110 161180 173845 186933 128536 181041 302824
8678 302824 314106 231650 123598 92898 102618 94832 115656 153680 208684 272099 242840 172252
8666 172252 114309 79778 186585 169063 119581 116994 84456 79126 123362 157940 102519 79641
8654 79641 71177 105588 148998 89164 3740 57036 101664 158012 182503 226750 194867 174085
8642 174085 229540 379527 510277 413109 306796 207726 224347 272708 252130 141188 64582
8631 64582 121374 163742 193966 217145 219775 181998 158035 195083 282799 306458 286101 236794
8619 236794 273423 333211 313861 236228 223346 197748 231287 252688 276904 302151 267640 272499
8607 272499 263565 190703 226780 290759 260077 281650 307513 383354 373321 342531 243701 262814
8595B62814J0911m0172m7081J4985N0666M3416O3480m5910m4483m7294n3714M9105
8583B16723J4512j103K693j10149o1043M129O7139J4387j3355n9824M3803K1273
8571A39185n8032l6385p9350L7123L8177r4499p3908P9246K0375K5609l0222J994
8559c0687O8810K9727j3301M4035m0679k3066J6795L0274j8567k8718k9862L1975
8547C6736N4264J0608M984o8386N433P4948l2622Q58n268l51N3924N436j7989
8534A22575j24522o9058L7104J08478k6175j1671M5483K0121m8814n4620m9332
8523e0431M1107O7870K4697l385k1870j0404j7765o5405j5518N1068Q2188M0169
8511A22321l0301N0143m6167l8231k4117n4078J7792j4701Q4084O2045m2790n6145
$$ plain form
8595 262814 273725 233553 186472 201457 252123 295539 359019 313109 268626 221332 167618 216723
8583 216723 231235 230132 232825 122676 61633 65762 132901 147288 133933 74109 117912 139185
8571 139185 81153 44768 -34582 2541 40718 -53781 -127689 -48443 -28068 -2459 -32681 -30687
8559 -30687 38123 67850 54549 98584 57905 34839 51634 81908 63341 34623 4761 36736
8547 36736 91000 101608 106592 38206 43639 118587 85965 86823 81555 81204 135128 140564 122575
8534 122575 -1947 -71005 -33901 74577 48402 36731 82214 102335 53521 -1099 -50431
8523 -50431 -9324 58546 83243 79858 57988 47584 29819 -35586 -51104 -36 82152 122321
8511 122321 92020 142163 95996 57765 33648 -20430 -2638 -17339 66745 128790 86000 29855
8499B9855n5877j19859K4766J03885N0114r787n8608j6538RJ7868o165R1948R920
8486F1531m1404k870k4938J0881P8931r209p0859p3912r382o501K616j2916K7017
8473g1015j4416J2843k0280J3056j241q5663N470P1954O7557k0685N6567K9967
8461D4114l5681q4476K9452j2414n5906l1529l0268K4030R6092J3983J7841O9293
8449D4531n0817N0669m903j7087k118N6830M6734o0798K0783O727l3232N4725
8437A12044m4424n1184k9274J02849l4239p7647n4801k8256Q7310J16958K9789
8426A29125k822q591l8177Q706r2862L5347R9196j5890o9684n5788k5720J1176
8414b5984J03694k0961m4824J5623K5838J2067L488L2251r91P1970J4991o7004
$$ plain form
8499 29855 -26022 -145881 -121115 -17230 32884 23097 -35511 -52049 -52040 -34172 -40337 51611 61531
8486 61531 20127 17257 -7681 3200 82131 72922 2063 -71849 -81231 -87732 -85116 -98032 -71015
8473 -71015 -85431 -72588 -92868 -79812 -81053 -166716 -161246 -89292 -21735 -42420 14147 44114
8461 44114 8433 -76043 -46591 -59005 -114911 -146440 -176708 -152678 -56586 -42603 -24762 44531
8449 44531 -6286 44383 39480 22393 20275 77105 123839 63041 83824 90551 57319 112044
8437 112044 67620 16436 -12838 90011 55772 -21875 -76676 -104932 -17622 99336 129125
8426 129125 126303 117712 79535 88241 -4621 30726 129922 114032 44348 -11440 -37160 -25984
8414 -25984 77710 56749 11925 27548 53386 65453 68941 101192 100201 172171 187162 120158
8402A20158r9801m3749K1835J5255r3408j1004K2357M6791Q6464k038p2221K5034
8390A5673p5630K9283k13J1291L148m2774n1326j6793O8829J2419l4084K1378
8378e8799j4155j7373K5477M1107N7054K8377L4305l9173p0499r671J6955J5031
8366H636O267R1130K598j16673m8837J1967L3530J6513l0750n867M0243J3157
8354B1914l2032l0813p1739k5791R5217O5114M670l7703n2044j2079L2197P5494
8342C2405M4540n916J4917o7790l4843k6721Q261P334P660l063O6278l7165l7434
8329c1537l1849n3290n2767j9825m7531J29279R9356O3468m686l2189l3564j5327
8317c0462m539M0617k1833k9752l8103O9302j4761m0778L447O588L6886l9296
$$ plain form
8402 120158 20357 -23392 -1557 13698 -79710 -90714 -68357 -21566 64898 62860 -9361 15673
8390 15673 -59957 -30674 -30887 -19596 -16448 -59222 -110548 -127341 -58512 -46093 -80177 -58799
8378 -58799 -72954 -90327 -64850 -23743 33311 61688 95993 56820 -13679 -23350 -6395 8636
8366 8636 14903 106033 108631 -8042 -56879 -44912 -11382 5131 -25619 -31486 8757 21914
8354 21914 -10118 -40931 -112670 -138461 -43244 21870 26540 -11163 -63207 -75286 -43089 32405
8342 32405 76945 71029 85946 18156 -16687 -43408 -35147 -27813 -20153 -23216 43062 5897 -31537
8329 -31537 -63386 -116676 -169443 -189268 -236799 -107520 -8164 55304 50618 18429 -15135 -30462
8317 -30462 -35001 5616 -16217 -45969 -84072 -14770 -29531 -70309 -66862 -60274 -23388 -62684
8305f2684Q838N0973j3516j907M1467M9170m4519L4183o2245L31Q2647P1146r7607
8292E6277K3508K6032l9163m7428L0573k0996J4600L351J9040P948p7430l4219
8280c7907j4332K3852q120m5768N028k5914q9207k0624J7317J01688P1269N325
8268a7393j1476L2368k1761k6959j0535m753P157r1065M783M067j1524K5988R5198
8255b5905N7677l2122j2517K0238J10194k6393o9459p1449O5791K0287m2516r1516
8243i7690j0K2789J4536R770j8616q0462o2716L506J3375M0867O1668J9325O6262
8230g396N3045K0632N2887k6501n3200j2342j5606k9752N6910J3186n3192j9413
8218b0742L6169m775J07639j3181o9383l6408m8191n4818K8936J851K5517P1533
$$ plain form
8305 -62684 -53846 -2873 -16389 -18296 23171 72341 27822 62005 -240 91 82738 153884 56277
8292 56277 79785 105817 66654 19226 49799 28803 43403 46754 65794 73742 -3688 -37907
8280 -37907 -52239 -28387 -36507 -82275 -77247 -103161 -192368 -212992 -195675 -93987 -22718 -17393
8268 -17393 -28869 3499 -18262 -45221 -55756 -60509 -53352 -144417 -139634 -135567 -147091 -121103 -25905
8255 -25905 31772 -350 -12867 7371 117565 91172 21713 -49736 16055 36342 -6174 -97690
8243 -97690 -97700 -74911 -60375 -50605 -69221 -149683 -212399 -208893 -195518 -154651 -92983 -73658 -7396
8230 -7396 45649 66281 119168 92667 39467 27125 11519 -18233 38677 51863 -1329 -20742
8218 -20742 15427 10652 118291 105110 35727 -681 -48872 -103690 -74754 -72903 -47386 24147
8206B4147L8604K7684j02350q1610l2074n601N3059k780J9607P3323Q1772L4920
8194A28701j05808l5631Q3114o223r4459q9386J0083O6795l5813P4935P1854q988
8182E9174p8401J0166L0912j4329m2017m1986q202m2564R660K446P1213J121J410
8169d1397q4468l1121J9304O7093K8980j6718K2628K3883K1054J17844O0564o612
8157A81034o5985p7232P9365M1649o6427r9750o210m039M9951N0364O8519J4289
8145A65528o7529o0142r2840K9260L8010Q168J898N7793M5946L6140r903k5912
8133A26417j26593q0690O6730P1602n2415p5882J3569M0625M057J5861K5901j1233
8121A7949L9009M5095M2025l6354K313J5734j2132j9504p4186p0585R116M2308
$$ plain form
8206 24147 62751 90435 -11915 -93525 -125599 -131200 -78141 -80921 -61314 12009 93781 128701
8194 128701 22893 -12738 70376 64153 -30306 -119692 -109609 -42814 -78627 -3692 68162 59174
8182 59174 -19227 -9061 21851 7522 -34495 -76481 -84683 -127247 -117587 -115141 -43928 -42807 -41397
8169 -41397 -125865 -156986 -137682 -70589 -41609 -58327 -35699 -11816 9238 127082 187646 181034
8157 181034 115049 37817 117182 158831 92404 -7346 -13556 -17595 32356 82720 151239 165528
8145 165528 97999 37857 -54983 -25723 12287 20455 22353 80146 126092 162232 152329 126417
8133 126417 -176 -80866 -14136 57466 5051 -70831 -57262 -16637 -12580 3281 29182 17949
8121 17949 56958 102053 144078 107724 110037 125771 113639 94135 19949 -50636 -41520 788
8109G88L5122M029q677j6018M8987N0894K1035j8459j9717k4773M633p464l8184
8096C2196M3016J4277j3190p0158j4875L937q879K3526m2187l0033L1054J1006
8084b0310M558K2032J8170K7323k4113J08656J0106j03975l8599k7958R204P9642
8072F4736q3892k7236L630k7226N5810J2923Q430o6996N028M4866L0867r2933
8060g1993N6330P520O326k2996l3211p2069J14153Q1221o4016L663m0132K3605
8048a1599J7245j1828Q113N2509O6899q6566k2753L9856O3915N205l3522o7904
8036A9570l2308K2120k450l936O704n332R7568Q2333p536o2881p3758N4165L7099
8023A31358M1164L1515O054K3970n6792j40669n4291L1464j4395K6741m6204l4073
$$ plain form
8109 788 35910 39939 31262 15244 64231 115125 136160 117701 97984 73211 77844 70380 32196
8096 32196 75212 89489 76299 6141 -8734 -4797 -13676 9850 -32337 -62370 -31316 -20310
8084 -20310 -15752 6280 24450 51773 27660 136316 146422 42447 3848 -24110 -14906 64736
8072 64736 -19156 -46392 -42762 -69988 -14178 -1255 7175 -59821 -54793 -9927 20940 -71993
8060 -71993 -15663 -8143 -1817 -24813 -58024 -130093 -15940 65281 1265 4928 -35204 -11599
8048 -11599 5646 -6182 1931 54440 121339 34773 12020 51876 115791 120996 87474 19570
8036 19570 -12738 9382 6932 2996 9700 4368 101936 184269 176733 113852 40094 94259 131358
8023 131358 172522 204037 210091 234061 177269 36600 -17691 13773 -622 26119 -20085 -54158
8011e4158N1078L3788o654l0394M4135Q4355J1267J0618N6945m4418J192K5258
7999A83012R6526k6774k9152N7188q595o6472q1537O131J06416n607K4132L4529
7987B89797o5139k996j3425r261k916r3000q3756L8421R4178M2924r4255J1726
7975A12298R9260K8777j2558J9464L5630j04234J0779K8507l7152k3210N5607
7964B13168J0398j39576n7354q652J3577L5434P8771K1553l8719k863k4152j5093
7952H6492J4703q4854k9753J02892L9114K3225r921K2975P3159j3318q4180K5839
7940A66373N8417J2499p0121m3623K748J2297N8543J2577m4396l6811R2599k5728
7928A95374l0263j559m7654j1779J3377J772N4584O7188O2552k0422j11675k4303
$$ plain form
8011 -54158 -3080 30708 24054 -6340 37795 122150 133417 144035 200980 156562 157754 183012
7999 183012 279538 252764 223612 280800 272205 205733 124196 130327 236743 231136 255268 289797
7987 289797 224658 221662 208237 198976 196060 103060 19304 57725 151903 194827 100572 112298
7975 112298 211558 240335 227777 247241 282871 178637 189416 217923 180771 157561 213168
7964 213168 223566 83990 26636 17984 31561 66995 145766 167319 128600 125737 101585 86492
7952 86492 101195 16341 -13412 89480 128594 151819 141898 164873 238032 224714 140534 166373
7940 166373 224790 237289 167168 123545 126293 138590 197133 209710 165314 128503 221102 195374
7928 195374 165111 163552 115898 104119 117496 119268 173852 241040 303592 283170 171495 147192
7916A47192N1432P8507n1925r9173j904L4887q8493l8955k341N4980M7548j9199
7904A12556n2202m1131M012O8857M9923q7116n4268j675j7998L8302j0633N2648
7892F1275q642j0150k6041n800K7858J21158J09769p270m2057j00977j75515j51176
7880b07568N6543J14285O8988N0741K0212J4136k3199m6137o3436k804P5974J02663
7868A60398K4214k7204k7672N9096m7532o2480M7129O9037n2626n4493j0675J0047
7856H7239N223m7789r3297K8677k005l6171L840N5871M4451J9504n3995j4495
7844b947O94M2612M2041L3561j7309j12647L245j5322p99M8228K0755J632K6297
7831G0041o1746o3485k3890j4206N6729R1719o7745j3817P0694R989m2956q9873
$$ plain form
7916 147192 198624 277131 225206 126033 124129 159016 70523 31568 29227 84207 131755 112556
7904 112556 60354 19223 23235 92092 142015 54899 631 -1044 -19042 19260 8627 61275
7892 61275 52633 42483 16442 10642 38500 159658 269427 262157 220100 119123 -56392 -207568
7880 -207568 -151025 -36740 32248 82989 103201 117337 94138 48001 -15435 -18239 57735 160398
7868 160398 184612 157408 129736 188832 141300 78820 125949 194986 142360 87867 77192 87239
7856 87239 92462 44673 -48624 -19947 -21952 -58123 -54283 1588 46039 65543 11548 -2947
7844 -2947 -2253 40359 82400 115961 98652 -13995 -10750 -26072 -26871 21357 42112 43744 70041
7831 70041 8295 -55190 -79080 -93286 -36557 55162 -12583 -26400 44294 54283 11327 -78546
7819g8546p9698M8796Q253K3169O683j0562J1517J3869j1291r267J06855M6154
7807G5932j02882m1706O345k5433R652j9742l6084m9832L504K4897J1259N3519
7795i0571L3784N0778J1960Q2548k0160j00231r9093M9818N9477M6833r014K7848
7783D3977k8157J5167q7724K6652R4943L9955j00189o6371j5842J6412M7784n3859
7771f7252m218L9636J7069K8166n2305N942l9846l6544J2604P3869J3250m3064
7759e2693K9543l723k7904n6604L087Q0067M1848P795l2135j2795j4408O3364
7747B5442l0901o8502Q217O4886J3729L8825o683n1891j09197J3609N9088L2820
7735a0558K6976n1483j9353M1218J20846Q652r2178l8932k6724P2037k7175l5509
$$ plain form
7819 -78546 -158244 -109448 -101195 -78026 -71343 -81905 -70388 -56519 -67810 -77077 29778 75932
7807 75932 -26950 -68656 -62311 -87744 -78092 -97834 -133918 -183750 -180246 -155349 -144090 -90571
7795 -90571 -56787 -6009 5951 88499 68339 -31892 -130985 -81167 -21690 25143 16129 43977
7783 43977 15820 30987 -56737 -30085 64858 104813 4624 -61747 -77589 -61177 -13393 -67252
7771 -67252 -71470 -31834 -14765 13401 -38904 -32962 -72808 -109352 -96748 -22879 -9629 -52693
7759 -52693 -23150 -26873 -54777 -111381 -108294 -28227 13621 21416 -10719 -23514 -37922 25442
7747 25442 -5459 -73961 -65744 -858 12871 51696 45013 -6878 -116075 -102466 -43378 -10558
7735 -10558 16418 -35065 -54418 -13200 107646 116298 24120 -14812 -41536 30501 3326 -32183
7723c2183k4655o8167o0387k7619R9487J18957N3960l9629J9125L7930j5408k0915
7711D0496j03l5670o6648o505P6053L4406m7200M6914J5271j00905o1613l944
7699a09448l1349L0311K6235l0691K722j6064N5341o9290l4866N4872o64L1941
7687i0950Q1721j6755J5784n7497l6524N6034K2810k9746L9547M9589l8482J504
7675b965K8223k8136m6640J3431k6022m937N0023P0357Q592j7103j476l8867o5282
7662f0802q322J663l1151M8839j00L3597M945M279j3463M6896K3291K7579o2694
7649A4557j09402n9502R426N6778l7663N4713L6667p0080n0831L4809O683Q5825
7637b8020J19695m5189l2556J3882n5414k0286J06846m0783o1134k0532J4360
$$ plain form
7723 -32183 -56838 -125005 -185392 -213011 -113524 5433 59393 19764 38889 76819 61411 40496
7711 40496 40393 4723 -61925 -68430 7623 42029 -5171 41743 57014 -43891 -105504 -109448
7699 -109448 -140797 -110486 -84251 -114942 -112220 -128284 -72943 -142233 -177099 -122227 -122891 -90950
7687 -90950 -9229 -25984 -10200 -67697 -104221 -48187 -25377 -55123 -15576 34013 -4469 -2965
7675 -2965 25258 -2878 -49518 -36087 -62109 -67046 -17023 53334 61926 44823 43347 4480 -60802
7662 -60802 -69124 -67461 -98612 -49773 -49873 -16276 -11331 -7052 -20515 26381 49672 77251 14557
7649 14557 -94845 -154347 -144921 -88143 -125806 -71093 -34426 -104506 -155337 -120528 -113845 -28020
7637 -28020 91675 46486 13930 27812 -27602 -47888 58958 18175 -42959 -63491 -49131
7626d9131L555n053q0051m7959Q0242j7698l9089M1726P9553N145r874O0043M4460
7613F5869p0150j3852M9457K1240l3612M77N4573J4562O600Q1067k6171k8172
7601A21888k7121M6084k3933k2698j19o6706k4647J2511M1813k5946r6852n4000
7589a19726o277n7035J4293M4167q18O7147J4567K9654L2731K1960o705K2209
7577E6167n649k9323j5511K7790o507k6638O4286n3039L123M9434L1559r9295
7565c603j41770j3306N538M0228Q8206l4560m726M7606l8401m823m728l7465M7464
7552e4340p43k5152r112M7335j1271k9021j4569P6898m1561l8940L0732N4824
7540a4920k2557j6323j9559q5688M3110N6814j6283m0543L0916M3938K9690m1105
$$ plain form
7626 -49131 -45576 -50629 -130680 -178639 -98397 -116095 -155184 -113458 -33905 -28760 -38634 21409 65869
7613 65869 -4281 -18133 31324 52564 18952 19429 74002 88564 95164 176231 150060 121888
7601 121888 94767 140851 116918 94220 94101 27395 2748 15259 57072 31126 -65726 -119726
7589 -119726 -126003 -183038 -168745 -124578 -125396 -58249 -43682 -14028 18703 40663 33958 56167
7577 56167 50518 21195 5684 33474 26967 329 64615 11576 14699 64133 95692 -3603
7565 -3603 -145373 -158679 -153141 -112913 -24707 -59267 -63993 -16387 -54788 -59611 -64339 -101804 -54340
7552 -54340 -55083 -80235 -89347 -42012 -53283 -82304 -96873 -19975 -61536 -100476 -69744 -14920
7540 -14920 -37477 -53800 -73359 -159047 -115937 -59123 -75406 -115949 -85033 -41095 -11405 -52510
7528e2510L8837M1060M8870l8756K6042O1556r7510p3289j1995k6618j8540L6265
7516f6588L0078O096l4222l4505o742K0991L2877n0436j0881N1566K3341l8614
7504g7039p16m570n9803k1579J7463P15l2556P9638R672N3728L0051Q846L057
7491F907J04519o141j30745q5487M2781k014j8459o4944j23947N0376Q4512L399
7479a39243R0605O3966k4784o9054p271J8565J4924m2662r8189k4088J27733J5783
7467g3715j00221M177J58419M8398n3066m4959k7802m1781K3769Q9325L2947p0978
7455e5487k1787J37284L7562k6474n6328l0192k4080p4848n449Q013N4628K1582
7443c5576m3239k1795P7597J6932o7030o9382k1165n4648J9797M5351N4741O7024
$$ plain form
7528 -52510 -13673 27387 76257 37501 63543 125099 27589 -45700 -57695 -84313 -102853 -66588
7516 -66588 -36510 -30414 -64636 -99141 -105883 -84892 -52015 -102451 -113332 -61766 -38425 -77039
7504 -77039 -77755 -82325 -142128 -163707 -146244 -145529 -178085 -98447 -88775 -35047 -4996 3850 6907
7491 6907 111426 105285 -25460 -110947 -68166 -70180 -88639 -153583 -277530 -227154 -142642 -139243
7479 -139243 -48638 15328 -9456 -78510 -85781 -67216 -52292 -94954 -193143 -217231 -89498 -73715
7467 -73715 -173936 -169759 -11340 37058 -16008 -60967 -88769 -130550 -106781 -17456 15491 -55487
7455 -55487 -77274 60010 97572 71098 14770 -15422 -39502 -114350 -119799 -111786 -57158 -35576
7443 -35576 -78815 -100610 -23013 -6081 -73111 -142493 -163658 -218306 -198509 -153158 -98417 -31393
7431c1393L8818k0357J762L4803K6380n4827l5561o8833k9289N8766M4896k7002
7419f1837j6263K5697L839r985L8928k2987P2411m3323j2949M0930K5736l5448
7407D749q4943n1182J5227L9463K8807J1895L4134p763m3854q681O1760M3359
7395D2971p4485k1210J6713r7345L6815K8697J9200N8815l2347j7738l4398l0512
7383a04824L2899K0906J5819K2697L5919n7954q0472j1156P7241J07644k0969
7372C7750j8702l6922n0169k5590M7983j12674q5636L4274R2992L8559r5865k1952
7360a95952Q9906q8002n3215J16281J06600j2276o2346K7840P7788K5128k452
7349B9300l5699R361J2288p4990k6489L5342Q3259M3977n5312m4467K5277j1565
$$ plain form
7431 -31393 7425 -12932 -11170 23633 50013 -4814 -40375 -109208 -138497 -79731 -34835 -61837
7419 -61837 -78100 -52403 -48564 -58549 -19621 -42608 29803 -13520 -26469 14461 40197 4749
7407 4749 -80194 -131376 -116149 -76686 -47879 -35984 -1850 -9613 -53467 -62148 -388 42971
7395 42971 -31514 -52724 -36011 -133356 -96541 -67844 -48644 10171 -22176 -39914 -74312 -104824
7383 -104824 -71925 -51019 -35200 -12503 23416 -34538 -115010 -126166 -48925 58719 37750
7372 37750 19048 -17874 -68043 -93633 -45650 -158324 -243960 -209686 -116694 -78135 -174000 -195952
7360 -195952 -106046 -194048 -247263 -130982 -24382 -36658 -99004 -71164 6624 31752 29300
7349 29300 -6399 2962 15250 -59740 -86229 -50887 32372 76349 21037 -23430 1847 -9718
7337i718n5281J0732o125l3559O893K5910O3719J5974J6344K4683l8531l0850
7325i809r6935p924P7965K2242q2311m829M2621M5764n6223r8945O5922N2231
7313e0231O649L312M8617n5106K8226K1750m1949j0828Q9242K6116p6872o2533
7301g3607K3409q9784R66P0240O8420L2152n3972n4891J9111N8914k034o6324
7289f7400m2557J1383L0725k5064L2364M0095j9534m7832m4704l692J8714K2617
7277i4885M5614L2024j490l6637j03583j1099K8383R2044Q8728O5040J6390m5608
7265G4921n4467o6655k3249M233j1497O480J05725J15570r2841j07256P2173n7169
7253c4032j0262M4695M5249o7021M168O6566m55J5842l7777m5698p9852M6501
$$ plain form
7337 -9718 -64999 -54267 -60392 -93951 -87058 -61148 2571 18545 34889 59572 21041 -9809
7325 -9809 -106744 -114668 -36703 -14461 -96772 -101601 -58980 -13216 -69439 -168384 -102462 -50231
7313 -50231 -43582 -40270 8347 -46759 -18533 3217 -38732 -49560 39682 65798 -11074 -73607
7301 -73607 -50198 -139982 -139016 -68776 -356 31796 -22176 -77067 -57956 958 -1076 -67400
7289 -67400 -109957 -98574 -67849 -92913 -60549 -20454 -39988 -87820 -132524 -136216 -117502 -94885
7277 -94885 -49271 -17247 -18737 -55374 -158957 -170056 -141673 -49629 39099 104139 120529 74921
7265 74921 20454 -46201 -69450 -65217 -76714 -70234 35491 151061 58220 -49036 23137 -34032
7253 -34032 -44294 401 45650 -21371 -17203 49363 48908 64750 26973 -18725 -98577 -52076
7241e2076Q9982n9437k4608L1282J2546k6500o5149l1189R8430m8158L7949L5695
7229a233j946j1734P292L7929K5579K1715q364k945l4615j9292N574k2316m6845
7216e1201k2240J5621M1783Q2373l8246j34778o4359Q7339P2271l8862J3318K9282
7204g699M5539J7110o2440o3370J9157N2957Q9655L9166o9291k1535M4110p4048
7192I311j61847J773J56881N3171m3834k5269n911o006k5409k2760j09678J2127
7180a67451j5039K8869J19083r8384r2930J5814Q3113R9558k1508m7126M4632
7169e1369K6200m5179q8369M7565Q0546L4648j0434o3209j595M3086K0174m5838
7157e3774L9930Q767j5091K7111m136k3388m8689k7137L9878K2076J2632J3689
$$ plain form
7241 -52076 37906 -21531 -46139 -14857 -2311 -28811 -93960 -125149 -26719 -74877 -36928 -1233
7229 -1233 -3179 -14913 -7621 30308 55887 77602 69238 66293 31678 12386 17960 -4356 -51201
7216 -51201 -73441 -57820 -16037 66336 28090 -106688 -171047 -83708 -11437 -50299 -36981 -7699
7204 -7699 37840 54950 -7490 -70860 -51703 1254 90909 130075 60784 39249 83359 9311
7192 9311 -152536 -150763 6118 59289 15455 -9814 -15725 -21731 -47140 -69900 -179578 -167451
7180 -167451 -182490 -153621 -34538 -132922 -225852 -210038 -126925 -27367 -48875 -96001 -51369
7169 -51369 -25169 -70348 -158717 -111152 -30606 4042 -6392 -69601 -71196 -28110 -7936 -53774
7157 -53774 -13844 -5077 -20168 6943 2807 -20581 -69270 -96407 -56529 -34453 -21821 -8132
7145h132R239L915k7374j1598P3836j4652j7516L1844K7190N990k4042q4152J2626
7132b2826P0047J163m2865K1396k7012n5950q1587j9518K4161M8957Q2229n9873
7120f1678R563J43898J23953p8410l2914p4157k5012j04608l2304k206K0126J2958
7108a00791m7293j0611J43758k179p4440K4492j1935k6040L259K729j4870L8056
7096g5865O8152J9063j5430n2599o3047J086K182O1497J00806k8659m8685m2429
7084g3928K5396J3307l1684M4256j530J0045N150O3238j6410k6151l490J9098
7072B7297q0135j3061m3242k9407O0568Q63J8008K713j9552o0321K4688L9470
7060g2111n8480o8220J1738Q5156R4619P5025m3661q8098M2551N0298N5626m9723
$$ plain form
7145 -8132 1107 5022 -22352 -33950 39886 25234 7718 39562 66752 72742 48700 -35452 -22826
7132 -22826 47221 48384 5519 26915 -97 -56047 -137634 -157152 -132991 -84034 -1805 -61678
7120 -61678 -52115 91783 215736 137326 104412 30255 5243 -99365 -131669 -133875 -113749 -100791
7108 -100791 -148084 -158695 -14937 -17116 -91556 -67064 -78999 -105039 -101780 -99051 -113921 -75865
7096 -75865 -7713 11350 -4080 -56679 -119726 -118640 -116458 -54961 45845 17186 -31499 -73928
7084 -73928 -48532 -35225 -66909 -22653 -24183 -14138 -8988 54250 37840 11689 8199 27297
7072 27297 -52838 -65899 -109141 -138548 -77980 -77117 -59109 -56396 -75948 -136269 -111581 -72111
7060 -72111 -130591 -198811 -187073 -101917 -7298 67727 24066 -64032 -21481 28817 84443 34720
7048C4720o7607M575n9852k9694P3612O9011l2271m6652m5548R2127J3316K3847
7036B9584O5254P6489L716o7606p7984l6844M1344J6836k9367m6398R990m889
7024a9875j1024m5777o6080K1473O6502o8737J8858J05678N6331k3981l2792n3078
7012e2502k0729L9059L1005Q4963P7416m3563j03059q3967N5787J9671K1095J3852
7000C9028k3515k3686j1853N499k8093k7054p469j6309L3182M3047k9789p1200
6988a18212J5027l6077L8353Q22k4154k8336M3382J0591k4398m5631O075N6360
6976a06198N3972J7905M6586K7916p916j9100n0957n0888K0280o250J3333J12594
6964E1277k9580k4491m7124p6341n9169K170N3969L391J6894k6889p595P5086
$$ plain form
7048 34720 -32887 -28312 -88164 -117858 -44246 24765 -7506 -54158 -99706 -7579 5737 29584
7036 29584 94838 171327 175043 107437 29453 -7391 33953 50789 21422 -24976 -14986 -19875
7024 -19875 -30899 -76676 -142756 -121283 -54781 -123518 -104660 1018 57349 33368 576 -52502
7012 -52502 -73231 -34172 -3167 81796 159212 115649 12590 -71377 -15590 4081 25176 39028
7000 39028 15513 -8173 -20026 -14527 -42620 -69674 -77143 -93452 -60270 -17223 -47012 -118212
6988 -118212 -103185 -139262 -100909 -100087 -124241 -152577 -109195 -98604 -123002 -168633 -162558 -106198
6976 -106198 -52226 -34321 12265 40181 32265 13165 -37792 -88680 -68400 -74650 -61317 51277
6964 51277 21697 -2794 -49918 -126259 -185428 -183258 -129289 -125898 -109004 -135893 -143488 -68402
6952f8402k5154k2430j6695m0719L1502Q4506O0294l4624l6061n018N2563L9142
6940A8904m2451r6342N5524J83491K8042j05308q1351m1023K7367k5631N6878
6929b1900M8777O3567M5110k6301M5537n3116p2908n0624k8555j7l3702n4567
6917a38699R3775M9572r2028J5785O8278M398j1506l3425n8692p1179P8713P3930
6905b1078J01228m1658n7462j1666k768p3893l3410O8368n9788K4291L3982n592
6893g9446l0327N6909o2173N5943L7164n2942n7586O2162M7801J7740r593Q647
6881e701n0581j6742L910Q7340M6835o5573L33l0907j1305l3455k0589N0617K2971
6868b2847l2602J8389O1934l6309J5060L8842n7111j9538J6496o427L8644l6588
$$ plain form
6952 -68402 -93556 -115986 -132681 -173400 -141898 -57392 2902 -31722 -67783 -72801 -20238 18904
6940 18904 -23547 -119889 -64365 119126 147168 41860 -39491 -80514 -53147 -78778 -21900
6929 -21900 26877 90444 135554 109253 154790 101674 28766 -21858 -50413 -50430 -84132 -138699
6917 -138699 -44924 4648 -87380 -71595 -3317 1081 -10425 -43850 -102542 -173721 -95008 -21078
6905 -21078 80150 38492 -18970 -30636 -33404 -107297 -140707 -72339 -132127 -107836 -73854 -79446
6893 -79446 -109773 -52864 -115037 -59094 -21930 -74872 -132458 -70296 -22495 -4755 -14348 -5701
6881 -5701 -56282 -73024 -69114 18226 65061 -512 -179 -31086 -42391 -75846 -96435 -45818 -22847
6868 -22847 -55449 -37060 24874 -11435 3625 42467 -14644 -34182 -17686 -24113 14531 -22057
6856b2057j24133r685K2925L7968O834J5875J1672l9959o342P7846J09773j4372
6844F6345m4018q775M7698R844l7807l6389o8947l0373K1713l8032L0323L3348
6832e5070J5076j4119M515J1308O206L144p844k5763R086L8680l6493O6231J0984
6819B5941k9811r547O414l100O5512J5656L34l6914M5561n3654l4826k6077M2559
6806H048J5618m201m3807m8599o71M4040o1366j405N7420L8250J9681j0505j5166
6793b663o164O0315K1863Q0673j6097l9946n0919p1299n5186k5512J07767Q7701
6781I0533K8367J7090l7706m2960o5430K9332r946J1975j1487p8949L4284M6726
6769A1829o3496j2357L9402M6058m6536J7190O7713q18m4870l610k5768k1214
$$ plain form
6856 -22057 -146190 -155875 -132950 -94982 -88148 -72273 -60601 -100560 -106902 -29056 80717 66345
6844 66345 22327 13552 61250 71094 33287 -3102 -72049 -102422 -80709 -118741 -88418 -55070
6832 -55070 -39994 -54113 -49598 -38290 -32084 -28940 -36784 -62547 -53461 -14781 -51274 14957 25941
6819 25941 -3870 -13417 -7003 -10103 55409 71065 71399 34485 80046 26392 -8434 -34511 8048
6806 8048 23666 19465 -24342 -72941 -73612 -29572 -90938 -92343 -34923 3327 23008 12503 -2663
6793 -2663 -8827 51488 73351 154024 137927 97981 47062 -24237 -79423 -104935 2832 90533
6781 90533 118900 135990 98284 55324 -10106 19226 9280 21255 9768 -69181 -34897 11829
6769 11829 -51667 -64024 -24622 21436 -25100 -7910 59803 58985 14115 10505 -15263 -36477
6757c6477n0716J8895O5890m2356O7001N6509J8472l8786l6335j22203n9152k6465
6745a85723L7843M2584Q7738r1724n5727K1864M8819n631P0466J04001J1626o0763
6733B5373P3603k7232o6501o9528k4676q8464Q221J27757k1456j32783J389O9421
6721a24876J9823L6138O8281K4318J0474k2780j5924M496m0257o7642N8916L0554
6709a8479l1125k3839N349K4977J7404l5118n623J4794m4769N5252O0411M1906
6697F1140J9691N2948j9067l9760p7758l562K3372J4625J10780n3307j19308j41327
6685a71533o9142N6657R8330N9967K0727J4812r0958m1677l6257j23254j2970
6674b95298J28060j7880M625R716k1573P1045k6643K9084N2400L8070m8236o9509
$$ plain form
6757 -36477 -87193 -68298 -2408 -44764 22237 78746 97218 58432 22097 -100106 -159258 -185723
6745 -185723 -147880 -105296 -17558 -109282 -165009 -143145 -94326 -99957 -29491 74510 86136 25373
6733 25373 98976 71744 5243 -64285 -88961 -177425 -169204 -41447 -62903 -195686 -194297 -124876
6721 -124876 -105053 -68915 -634 23684 34158 11378 -4546 -50 -40307 -107949 -49033 -18479
6709 -18479 -49604 -73443 -68094 -43117 -25713 -60831 -66454 -51660 -96429 -41177 19234 61140
6697 61140 80831 133779 114712 74952 -2806 -6368 17004 31629 142409 89102 -30206 -171533
6685 -171533 -240675 -184018 -85688 -25721 -4994 9818 -81140 -122817 -159074 -282328 -295298
6674 -295298 -167238 -185118 -180493 -170777 -192350 -121305 -147948 -118864 -66464 -28394 -76630 -146139
6662a46139O5758N2584J5303l9746n4384r896r083M4008M6869l7860K5339K8705
6650a8542j0095l993J5669r227j0396n4875k8820O4467R1237k5328l0477k4775
6638d5155p0446n9762K8190R7365N4786M153l7375j0390j5876o5644K8523P0454
6626b1177J8328j0883Q100O8173j3552K4109O560o4535m3848q2358m9418O0809
6614i9692L3746p0931K6763L3549l2676n106K1619K3230J512N8958L4117J4218
6602C9307L0121m3127n8179M1049N6494K1249p3043p2053L505J9048k7497L926
6590e9200l9769j7684P1773k003p4601m2034L4010J6114J14033R1027m9807k2456
6578A9403q3078k1912K8296J0163p126r8592K4380p8067n7196K4940O5721J12569
$$ plain form
6662 -146139 -80381 -27797 -12494 -52240 -106624 -116520 -125603 -81595 -34726 -72586 -47247 -18542
6650 -18542 -28637 -32630 -16961 -26188 -36584 -91459 -120279 -55812 35425 10097 -20380 -45155
6638 -45155 -115601 -175363 -147173 -49808 4978 9131 -28244 -38634 -54510 -120154 -91631 -21177
6626 -21177 -2849 -13732 -5632 62541 48989 73098 79658 15123 -28725 -111083 -160501 -99692
6614 -99692 -65946 -136877 -110114 -76565 -109241 -114347 -92728 -69498 -67986 -9028 25089 39307
6602 39307 69428 26301 -31878 9171 65665 86914 13871 -58182 -54677 -35629 -63126 -59200
6590 -59200 -98969 -116653 -44880 -46883 -121484 -163518 -129508 -113394 639 91666 41859 19403
6578 19403 -63675 -85587 -57291 -47128 -54254 -152846 -128466 -206533 -263729 -238789 -173068 -60499
6566f0499J16508o4471k6047L6302L7847K6j3879K763K7198k6984R016P112o0207
6553a5315j16512j08197J8865P2032P1308J13098k5596p7791N4224O1110n4214
6542f988p7763J20507P9659r3566m0435M373m0210o5475j7223J3523K6225m0478
6530a37851q37O8668P7527O238l2280J2405O5000j9444n4478P8302p510j01739
6518d5999k2645L9089N7497K7049j7833l3257j4840J8954R25m1869k7330l0456
6506i0715o108n445M5891M1675L2117k2159k3526p8040M4444O5127q337l5021
6494d0097j9833m7995M3394N7323K599j9284j8893k8662O8720J3167l2076r4366
6482a16003J7702O5151O2446m1641R592M2013L9241J5128o5548p7145n747N8873
$$ plain form
6566 -60499 56009 -8462 -34509 1793 39640 39666 25787 28550 55748 28764 37780 44892 -15315
6553 -15315 -131827 -240024 -221159 -149127 -77819 35279 9683 -68108 -13884 47226 -6988
6542 -6988 -84751 35756 115415 21849 -18586 -14213 -54423 -119898 -137121 -123598 -97373 -137851
6530 -137851 -138688 -70020 7507 13745 -18535 -6130 58870 39426 -15052 63250 55740 -45999
6518 -45999 -68644 -29555 27942 54991 37158 3901 -10939 8015 8940 -32929 -60259 -90715
6506 -90715 -96823 -102268 -56377 -14702 17415 -4744 -28270 -106310 -61866 3261 -5076 -40097
6494 -40097 -59930 -107925 -64531 -7208 -4609 -23893 -42786 -71448 -2728 10439 -21637 -116003
6482 -116003 -98301 -33150 29296 -12345 -2753 39260 78501 93629 28081 -49064 -54811 4062
6470D062k1733l3076q39O237M4944N1504O285L2487k6119J2713j02013k5870k9180
6457h0598q8942J600J471L7466M5409J2157j4300O4407N0601q5575j12039j8287
6445a86630Q4838N7262J695k004P6130K7046m234q108L1802M8365n2191q6579
6433a2608n7461M8918R7903M0145r9248l6159J7029N5288j6057J2982n4355n9025
6421f2648N6910M3065k4658l5979p4923N2334K6032K9677R182o2225j4282K0374
6409c7141K9148L8923r71j11221o7443K5176N5874P4696J8737p1606L775K4337
6397a7716K3268r147O937J2770O9856n8827j23367j4300N3174k3659l2335O8691
6385d4655N3662m1213K4013K8963j5816o9795M4093Q4827M2328P1695o6565r7081
$$ plain form
6470 4062 -17671 -50747 -51586 -45349 -405 51099 57384 89871 63752 76465 -25548 -51418 -80598
6457 -80598 -169540 -167940 -166469 -129003 -83594 -71437 -85737 -21330 29271 -56304 -168343 -186630
6445 -186630 -101792 -44530 -42835 -44839 31291 58337 54103 45995 77797 126162 73971 -12608
6433 -12608 -70069 -21151 76752 116897 17649 -18510 -1481 53807 37750 50732 -3623 -62648
6421 -62648 -5738 37327 12669 -23310 -98233 -45899 -19867 9810 18992 -43233 -57515 -37141
6409 -37141 -7993 30930 29959 -81262 -148705 -123529 -67655 7041 25778 -45828 -42053 -17716
6397 -17716 5552 -3595 3342 16112 85968 27141 -96226 -110526 -57352 -81011 -113346 -44655
6385 -44655 9007 -32206 -8193 20770 4954 -64841 -20748 64079 106407 178102 111537 14456
6373A4456l9799m04k2620K9507j9002n8939K005K9565M7320J4091J4257n4533
6361d4096k928k4583j6802r298m3144P3277J4924n3321L4425j8444L9956P3936
6349B3902k8101j7258m0664o2726J399R8101o8102m3794J18774J01322M1676Q800
6337A33329o8606n4873j7766o006j8254l888M2844L0994n632M524k4392O161k7136
6324h701m2229k0449O7168R135p3162J4290K7083N10K743m1230R101J6303K0830
6311a8608P9563m4141q4507j0354O3744K3478n8165J0369Q1340o2408J0177P6036
6299F6524k448j3817M0425o5999m3152P9317o0676q5518O3736j7201M2384J0046
6287A3621k5621O8633p8402p7091K3822L3665J8273m436J5073O3903n9682l3498
$$ plain form
6373 14456 -25343 -25747 -48367 -18860 -37862 -96801 -94796 -65231 -17911 -3820 10437 -44096
6361 -44096 -47024 -71607 -88409 -97707 -140851 -67574 -52650 -105971 -71546 -89990 -50034 23902
6349 23902 -4199 -21457 -62121 -124847 -123448 -25347 -93449 -137243 -18469 82853 124529 133329
6337 133329 64723 9850 -7916 -13922 -32176 -36064 6780 37774 32142 36666 12274 18435 -8701
6324 -8701 -50930 -71379 -4211 4924 -68238 -53948 -26865 -26355 -23612 -64842 -55741 -39438 -18608
6311 -18608 60955 16814 -67693 -78047 -14303 9175 -48990 -38621 42719 -19689 -9512 66524
6299 66524 64076 50259 90684 24685 -18467 60850 174 -85344 -21608 -38809 3575 13621
6287 13621 -12000 56633 -21769 -98860 -75038 -41373 -23100 -27536 -12463 51440 -8242 -41740
6275d1740L2867K6821O7618J2649q2914k4086j8254K9456j9303j9191n23K8395
6263h205q845k0247J6773r88Q1734l8864n4974P899n6026j15973O8745R8775L3866
6250C670q848n3192N779Q0451L8823j8371l0574k1962J3787P7569Q0046n7025
6238A10153r5831N7799l850k0787J7600O663m5736q4871l800Q8401j1463j43138
6226a28860J04242O5134J6712j35764k1373M7966Q142K2502n0362k8507L382J415
6214i5371P0333J17168l4387p4155k2091n7462l7275M9760P7551O718n4476j9571
6202g3258M9277j0385n2148L2115K5775k7631m859J7898J4431k4028K3724k5597
6190e4686M624n112L2824M8240Q5454M9137o3990q8812o4580p2240K1162J6542
$$ plain form
6275 -41740 -8873 17948 85566 98215 15301 -8785 -27039 2417 -16886 -36077 -36600 -8205
6263 -8205 -17050 -37297 -20524 -21512 60222 21358 -33616 -25717 -81743 -197716 -128971 -30196 3670
6250 3670 -5178 -58370 -52591 27860 66683 48312 17738 -4224 9563 87132 167178 110153
6238 110153 14322 72121 68271 47484 65084 71747 26011 -58860 -62660 25741 14278 -128860
6226 -128860 -24618 40516 57228 -78536 -99909 -51943 -43801 -21299 -71661 -100168 -96786 -95371
6214 -95371 -25038 92130 57743 -16412 -38503 -95965 -133240 -83480 -5929 789 -53687 -73258
6202 -73258 -23981 -34366 -86514 -54399 -28624 -56255 -61114 -43216 -28785 -52813 -29089 -54686
6190 -54686 -50062 -55174 -22350 25890 111344 160481 96491 7679 -56901 -129141 -107979 -91437
6178i1437P9984O2310k9359k6288R184k5035K3868L8654M2104k5202o2231j7140
6166b0588M6585m4640M6608K3624j09781o7187j0192P6056o258L5459J0648K5735
6154F069m3735K4903K2676L0965n804K2736j5430k8625P4187o727q1781q1332
6142h1898j05546j759R0419N171k2031K4376J8312M7379L3404N1476j0631m3131
6130E541L5962k9343j4193K0790m642j8587O3264P340o281J453l6085q3153j22173
6117a80107j9564J02694P5071k2420j0399m2568k6054R0527M2437j5412K901M1009
6105C8115N847K0823K8462n9961n0002L4683l4812J2172Q149m0719m2256j02905
6093a82404R293O3198M2220m7009O0780L9267N9210m5223o1851l955K8972o7945
$$ plain form
6178 -91437 -11453 50857 21498 -4790 4394 -20641 3227 41881 83985 58783 -3448 -20588
6166 -20588 25997 -18643 27965 51589 -58192 -125379 -135571 -59515 -65773 -30314 -19666 6069
6154 6069 -37666 -12763 9913 40878 35074 57810 42380 13755 87942 81215 -566 -81898
6142 -81898 -187444 -189203 -98784 -93613 -115644 -91268 -72956 -25577 7827 59303 48672 5541
6130 5541 41503 12160 -2033 18757 14115 -4472 58792 66132 59851 61304 25219 -57934 -180107
6117 -180107 -199671 -96977 -21906 -44326 -54725 -97293 -123347 -32820 9617 -5795 -2894 38115
6105 38115 43962 64785 93247 33286 -16716 17967 -16845 -4673 3476 -37243 -79499 -182404
6093 -182404 -173111 -109913 -67693 -114702 -53922 -14655 44555 -668 -62519 -66474 -37502 -105447
6081a05447l0403p7589P6509Q3667o313j4059L134K1971L5913R5879K8737p0659
6069D1340j35533k6991L4771N9789J7446p2319L1296j8502l8211j6652L6995K7808
6057e8763N5425Q656r4342L2626J41547l3226J2169q8485m685P173K4977j1263
6045h191q0969o9668N0764R0181P6772M476k5129J9257M6926j280o7246k3932
6033A1961m9637q7587j1381k3222N9632Q5005M228l1626m0091m787j1025o7485
6021a66015K1248L6547J14386P9715m603m9548k2577P3618j6052p053j0183J4058
6009F3541J669j20890k325N4133J4305K8465r2878L86k1421M7176M2805M3801
5997E8767j0946r0392k9112M8383O7580k9376K2535L7447l1254P567N863j077
$$ plain form
6081 -105447 -135850 -213439 -136930 -53263 -59576 -73635 -70501 -48530 -12617 83262 111999 41340
6069 41340 -94193 -121184 -86413 -26624 -9178 -81497 -50201 -68703 -106914 -123566 -86571 -58763
6057 -58763 -3338 5318 -89024 -56398 85149 51923 64092 -24393 -29078 -21905 3072 -8191
6045 -8191 -89160 -158828 -108064 -17883 58889 63365 38236 57493 104419 103139 35893 11961
6033 11961 -37676 -125263 -136644 -159866 -100234 -15229 -11001 -42627 -82718 -87505 -98530 -166015
6021 -166015 -144767 -108220 6166 85881 81278 31730 9153 82771 66719 59666 49483 63541
6009 63541 65210 -55680 -58005 -3872 10433 38898 -53980 -53594 -75015 -27839 14966 58767
5997 58767 47821 -42571 -71683 -23300 44280 14904 37439 74886 43632 51199 57062 55985
5985E5985l4747J43l4198m5662j6245M238Q4422L3115l6811J7412l7594P844k598
5972d696j41185L1958J05758N1001o7665k455J2756n0782r92N4767j1078K2605
5960hj0393m922K6256K4918j0790K0337k8118n7347J5868J6424q906M7623r3211
5947f2269o4564O2214Q6094J2467m227r9830Q8149O7233r8070K4425M150j56759
5935a40987j5109N2136R8261m542q5941j7435l584k021k0103K0851N1359N6542
5923a0573J6582m1813m7380m1490N1246O3361J8832M3423j1015j060N9627N1779
5911A51519o1322j25904o5564k1487M8518R6658O296l4941n6468K0714K7893j4273
5899b8361j1274L9741L7756K1168q6122j36940k4266M9503N7521K1170K6005n860
$$ plain form
5985 55985 21238 21381 -12817 -58479 -74724 -70486 13936 47051 10240 27652 -9942 -2098 -4696
5972 -4696 -145881 -113923 -8165 42836 -24829 -27284 -14528 -65310 -66302 -11535 -22613 -8
5960 -8 -10401 -15323 10933 35851 25061 45398 17280 -40067 -24199 -7775 -16681 30942 -62269
5947 -62269 -126833 -64619 21475 33942 29715 -70115 18034 85267 -12803 11622 15772 -140987
5935 -140987 -156096 -103960 -5699 -10241 -96182 -113617 -117201 -119222 -139325 -118474 -67115 -10573
5923 -10573 6009 -35804 -83184 -124674 -73428 -10067 8765 52188 41173 40113 99740 151519
5911 151519 90197 -35707 -101271 -122758 -74240 22418 28714 -6227 -62695 -41981 -14088 -28361
5899 -28361 -39635 106 37862 59030 -27092 -164032 -188298 -138795 -81274 -60104 -34099 -39959
5887c9959o2641J3942N0498K3498M2906Q4204J244l1196K6368k4657o1911l6491
5875a4195K033p137q100M6800j3551j5629q696K5555l6873J3217R1324M6856o0598
5862F1006M1785K155m4714q1270J3482r991K2656q5895p6998k7542K2274J20713
5850d2339K6956L5210J8301P448k57l3911q4927J1491J9247P0582L3305j9442
5838D1664m7l1206j8447P2793j5877m2113p702K7385M8611k1755k349p5746o6746
5825i1535l2038M4829Q5840O9353n8927j34264l0327r793l0235j8358K4328l5689
5813b16816n5619L0162N4765L8737K1783J18538N1204j8358L7887M7482m4986
5802F4779j5687K199J76K7226J680L7897P093n8984o8059k6816L2601K7319N8280
$$ plain form
5887 -39959 -102600 -88658 -38160 -14662 28244 112448 113692 82496 108864 84207 22296 -14195
5875 -14195 -12162 -19299 -27399 19401 5850 -9779 -18475 7080 -29793 -16576 74748 121604 61006
5862 61006 102791 104946 60232 -21038 -7556 -17547 5109 -80786 -157784 -185326 -163052 -42339
5850 -42339 -15383 19827 38128 45576 45319 11408 -73519 -62028 -42781 27801 61106 41664
5838 41664 41617 10411 -8036 64757 48880 6767 -935 26450 75061 53306 50957 -24789 -91535
5825 -91535 -123573 -78744 7096 76449 17522 -116742 -147069 -156862 -187097 -205455 -181127 -216816
5813 -216816 -272435 -242273 -187508 -148771 -126988 -8450 42754 24396 62283 109765 64779
5802 64779 49092 51291 51467 78693 80373 118270 125363 66379 -1680 -28496 4105 31424 89704
5789H9704K750K4623N1583j027r4357q3917O5898L8367k5865m4181K7027K6914
5777G7519j9017k0424m7001M074L3006K1181L377r631m555O405m1228m2257K3375
5764a5176P0687K5744L0713n2454m0124n2762k740m4617k186P2746J4821k4226
5752a9574k1207m5412n591J56140k1999q3152k4986O1235O4505j8996q1342k8550
5740f8929M6926M1285r5015o659Q9489M0212m938j59445r3960O1819K003O4057
5728h3155M1246j5045l0070o760K5369R5082N5617j3794M0585k0604p6836q9988
5716g8353j699L2357P7396N209P3178L398o4886k6836L5934q007j5741j6334k8437
5703a2821j7973L1110M8707l2296m6537m2928j2844L6414l6436l7765J1632J9595
$$ plain form
5789 89704 92454 117077 168660 167633 73276 -10641 55257 93624 67759 23578 50605 77519
5777 77519 58502 38078 -8923 -4849 28157 49338 52715 43084 38529 44934 3706 -38551 -15176
5764 -15176 55511 81255 111968 59514 19390 -33372 -36112 -80729 -82915 -10169 4652 -19574
5752 -19574 -40781 -86193 -91784 64356 42357 -40795 -65781 -4546 59959 40963 -40379 -68929
5740 -68929 -22003 19282 -75733 -82392 7097 47309 42371 -117074 -211034 -149215 -147212 -83155
5728 -83155 -41909 -56954 -87024 -93784 -68415 26667 82284 68490 109075 88471 11635 -78353
5716 -78353 -80052 -47695 29701 34910 108088 111486 46600 19764 55698 47691 31950 15616 -12821
5703 -12821 -30794 316 49023 16727 -29810 -72738 -85582 -49168 -85604 -123369 -111737 -92142
5691i2142M7590O1947N1976n7533o9969K6578N5410p1703j40443L5023j6131j5447
5679a84844J4749P284J4494N6938n2028L9445l5731o7106L6516K2695O856K7718
5667a13014j8165O7467J14625M4317P6608n4904n6286k4221k119K3399N3361k9471
5655H1597j44721j0927P5684L6689K0639j0223q8967p3931j7420Q485l6762L7193
5643a22664J00524L2281m9821p581K1049M0188j2000m3447l0481K9082o7904m20
5631a11194L1529N3810M2746M3131K0823n2597K5554k1381L2255N1249o5806n5304
5619e185j6250k7276L0632m8278m5931O1670J7963J2084k70j47148l1798J67344
5607c2443J34678j21336p1428l4969K9494J10623Q7395n7047k4136l6002k8277
$$ plain form
5691 -92142 -44552 17395 69371 11838 -58131 -31553 23857 -47846 -188289 -153266 -169397 -184844
5679 -184844 -170095 -162811 -148317 -91379 -143407 -103962 -139693 -206799 -170283 -147588 -140732 -113014
5667 -113014 -131179 -63712 50913 95230 171838 116934 60648 36427 34308 57707 111068 81597
5655 81597 -63124 -74051 1633 38322 58961 48738 -40229 -114160 -131580 -123095 -159857 -122664
5643 -122664 -22140 10141 -39680 -47261 -26212 13976 1976 -41471 -71952 -42870 -110774 -111194
5631 -111194 -79665 -25855 16891 60022 80845 28248 53802 32421 64676 115925 50119 -5185
5619 -5185 -21435 -48711 -18079 -66357 -112288 -50618 -32655 -20571 -20841 -167989 -199787 -32443
5607 -32443 102235 -19101 -90529 -125498 -96004 14619 102014 44967 20831 -15171 -43448
5596d3448p112k5733L4023p322n4802j5289M0002m7490j2278J72549O4337o0399
5584C7038K4976R7675k0363l883N7572m1604k07829O988o9378l3688R0630O9592
5572G726O469q2617l5358O4227M9559m069R8890J0968m6610m2634j6332M4141
5560E4360o725m4118K6243j4024K0300J5190l5492k5905n3925j6050m2150l8848
5548a61144n7131J5316P6809K1466M3258R6609q936j13983L854O6j8739R493J21169
5535B8107J7362j1307l4166M2437N862p5375p0647n4712k6937N5534n4745k5681
5523b04268P5230R5181N4009K6844m5726O6489O348L3867n484k60L4860o5231
5511G1859m8464K491n6944j02932J4327O2872L4724J7122P332J0401m7883M6303
$$ plain form
5596 -43448 -50560 -76293 -42270 -49592 -104394 -119683 -79681 -127171 -139449 33100 97437 37038
5584 37038 62014 159689 139326 135443 193015 151411 -56418 -49430 -118808 -152496 -61866 7726
5572 7726 14195 -68422 -103780 -39553 10006 5937 104827 115795 69185 26551 10219 54360
5560 54360 47635 3517 29760 15736 36036 51226 15734 -10171 -64096 -80146 -122296 -161144
5548 -161144 -218275 -202959 -126150 -104684 -61426 35183 26247 -87736 -83882 -83816 -102555 -93062 28107
5535 28107 45469 34162 -4 42433 48295 -27080 -97727 -152439 -179376 -123842 -178587 -204268
5523 -204268 -129038 -33857 20152 46996 1270 67759 74107 107974 102490 102230 137090 71859
5511 71859 23395 25886 -31058 -133990 -119663 -56791 -22067 -4945 2387 12788 -35095 11208
5499A1208L0164R289L408L7972k7648Q186L714J0669N2761j0365j23348j04917
5487i8907O4199J0159L6193N1274J9501J8069L8139n6931o2156j7872J855k2978
5475a9455k3643M1670L2586J2946J1455J0808J22q682o7837r2342j1401j6126
5463a29899K5748O4180M9884q0372R163K0360o8653o3827J3459N7911O6215L8788
5451B957j9261j5994p275N304P7144N0175n9876J8J8666j7663p1609M857K4489
5438h068N3458m1518p1577r3101J3193J32501J7336m5288M0761P8960k0319k8938
5426B7400j2824L0727l289j39636p1584M8596K746N7210M383L9267l888j07298
5414a28190l5964K8418N2310M9390N2120q0437j04495M8135Q338Q3804P4588m6663
$$ plain form
5499 11208 41372 50661 54069 92041 64393 72579 76293 86962 139723 129358 6010 -98907
5487 -98907 -34708 -24549 11644 62918 82419 100488 138627 81696 19540 1668 3523 -19455
5475 -19455 -43098 -1428 31158 44104 55559 66367 66489 57807 -10030 -102372 -113773 -129899
5463 -129899 -104151 -39971 9913 -70459 -61296 -40936 -109589 -173416 -159957 -102046 -35831 2957
5451 2957 -16304 -32298 -39573 -34269 42875 93050 33174 33192 51858 34195 -37414 -32557 -8068
5438 -8068 45390 3872 -67705 -160806 -147613 -15112 2224 -43064 -2303 76657 56338 27400
5426 27400 14576 45303 42014 -97622 -169206 -120610 -117864 -60654 -56271 -17004 -20892 -128190
5414 -128190 -164154 -135736 -83426 -34036 18084 -62353 -166848 -118713 -110375 -26571 48017 1354
5402A354L8503J8143j19289M6651J3495K4273L2154Q5448L0113m2792j13209K0954
5390C5798P9495J0118p4335o460q0744r5220n7772O6377J64030Q1706m6951J3811
5378H9853P3891k3077n7654q5176L5722k920N1511Q8276m1725j22331j41644J8942
5366a16332M8404M9688N2211P2956J1845q6750n2283o9815k3579R3679Q1733P564
5354F9321n135J4444q9858o8609n376r0694o0879r074J9009P2426R187N8906P1431
5341a4901O0044n9793m1806M163l1089j0414R6791j4958l5945l7698j06620N5346
5329a36880N6872N0394k3215n2111k8350J3207O4065L7935M1924j5905L7396j5821
5317B9511j7658j8768p6805j1103N154R4657K8687P49Q2177k8632J1253N4416
$$ plain form
5402 1354 39857 58000 -61289 -14638 -1143 23130 55284 140732 170845 128053 14844 35798
5390 35798 115293 125411 51076 44616 -36128 -131348 -189120 -122743 41287 122993 76042 89853
5378 89853 163744 140667 83013 -2163 33559 30639 82150 170426 128701 6370 -135274 -116332
5366 -116332 -67928 -18240 33971 106927 118772 32022 -20261 -90076 -113655 -19976 61757 69321
5354 69321 64186 78630 -11228 -79837 -85213 -175907 -236786 -245860 -226851 -154425 -145238 -86332 -14901
5341 -14901 45143 -14650 -56456 -52293 -83382 -93796 2995 -11963 -47908 -85606 -192226 -136880
5329 -136880 -80008 -29614 -52829 -104940 -133290 -120083 -56018 -18083 23841 7936 45332 29511
5317 29511 11853 -6915 -83720 -94823 -89669 4988 33675 34424 116601 87969 99222 153638
5305A53638r8769o9299j7812l1011K9662l4120l4923K6189J2328q503r452j5139
5293i7211O6238J9865K551L2481l2074q4414J2335L2516j4267R683M1846o7417
5281g7868P3748M7509M6190O2250O2754m5412p0527p5926P038Q681j3238j02709
5269g7510J7327m6593l8990M6919J08652j6023p8590J2728L9230n8894O0565N3595
5257B2416m3414k8501N0728P1087P6867L943o8682N151o0562o8152O5650r714
5245A6817M0352J16037P3805r0195o7918m6402m5879p158J840j6576M9473n46
5233B3650N887J0481l0446l9134p2830r795L8547K0384K1932J2294L8155J4919
5221C4044k0812K9667M6020J6311K3686M7846p2428p1901j0208N507N7587m6510
$$ plain form
5305 153638 54869 -14430 -32242 -63253 -33591 -67711 -102634 -76445 -64117 -72620 -82072 -97211
5293 -97211 -30973 -11108 -8557 23924 -8150 -92564 -80229 -47713 -61980 -52297 -10451 -77868
5281 -77868 -4120 43389 89579 151829 214583 169171 98644 22718 29756 38437 25199 -77510
5269 -77510 -60183 -106776 -145766 -98847 9805 -6218 -84808 -72080 -32850 -91744 -31179 22416
5257 22416 -20998 -49499 1229 72316 149183 153126 84444 89595 29033 -39119 26531 16817
5245 16817 57169 173206 247011 156816 88898 42496 -3383 -10541 -8701 -25277 24196 23650
5233 23650 29537 40018 9572 -29562 -102392 -112187 -73640 -53256 -31324 -19030 19125 34044
5221 34044 13232 42899 88919 105230 128916 176762 104334 32433 22225 27732 85319 38809
5209C8809m6427K0173q404j8140K1453m782l8022k4180P0287L7963p7837p2913
5197a02020l1318l7597N5268M3935J16016m3064p5676m1573k3430l6662J34411
5186d1710Q8852L4974L382m735n7094l0638Q5006n9448p9780N531R2784m5127
5174h003k8196r248M5871o8043K2801K1328m5137m3037m7289N1637N5741J2795
5162c8780O0747J5369l7125M3404j2414k519j3527l7671M7577l195o3289m3220
5150h4643n0454J3261l8248J28229P1129o7421n7282Q854M5254K3203Q0234k9106
5138D3010l1009l8034M2112r212L3970r677o6493L7718O846p5179P129P8271K5316
5125D4768m2340n1931P2256M0946o9009l5733K9731o377k3836k8749L4513R3765
$$ plain form
5209 38809 -7618 12555 4151 -13989 7464 2682 -35340 -59520 10767 48730 -29107 -102020
5197 -102020 -133338 -170935 -115667 -71732 44284 1220 -74456 -116029 -139459 -176121 -41710
5186 -41710 47142 82116 85498 80763 23669 -6969 78037 18589 -61191 -55660 37124 -8003
5174 -8003 -36199 -45447 424 -67619 -44818 -23490 -68627 -111664 -158953 -107316 -51575 -38780
5162 -38780 21967 37336 211 43615 31201 28682 15155 -22516 25061 21866 -41423 -84643
5150 -84643 -135097 -121836 -160084 -31855 39274 -28147 -85429 -76575 -31321 -8118 72116 43010
5138 43010 12001 -26033 16079 6867 40837 31160 -35333 2385 9231 -65948 -58819 19452 44768
5125 44768 2428 -49503 22753 63699 -5310 -41043 -11312 -17689 -41525 -70274 -35761 58004
5113E8004P4290k7432j00732o3870j9494Q1792L8865M5431m2644m6524n1691J222
5101e2783J1118L8344n6775j7419N1273J08794k8930O85l8814J6638j4117M1218
5089E9232L3980K0727m8031k1133k331J1343o4170k1299p1440Q749Q9696Q2183
5077G7506m5588n2487J7861L1998k4562M6629J8219L3860n837l2351n0868o945
5065G435p34l1082K7621L5829Q2744N6236M416n1659r7679J8552J9217m8704J2166
5052C4358j5311r8082K4480o325r9401o361P9113R696M4696R8790j4027r126j6413
5039B6087j22673N1162J8478L3608l8833L136P6536j5046M7995K7886p1849k7353
5027I134L3942L2996q490n5194N8744m0262n5267j724k118l7161k6998p38M6971
$$ plain form
5113 58004 132294 104862 4130 -59740 -79234 2558 41423 86854 44210 -2314 -54005 -52783
5101 -52783 -41665 -3321 -60096 -77515 -26242 82552 53622 54307 15493 32131 18014 59232
5089 59232 93212 113939 65908 44775 42444 53787 -10383 -31682 -103122 -94373 -4677 77506
5077 77506 31918 -20569 -2708 29290 4728 51357 69576 103436 97599 65248 14380 7435
5065 7435 6701 -24381 3240 39069 121813 178049 182465 130806 33127 51679 70896 22192 34358
5052 34358 19047 -79035 -54555 -60880 -160281 -166642 -87529 -77833 -33137 65653 51626 42500 26087
5039 26087 -96586 -45424 -26946 6662 -32171 -29035 47501 32455 80450 108336 36487 9134
5027 9134 43076 76072 67582 12388 71132 30870 -24397 -26121 -28239 -65400 -92398 -93136 -46165
5014d6165M1215k1465k9917j5841q624N3319K1252L8188J7062l0268l4929j8466
5002c4639K0730P2580J8773j6207K0203k4244p0662J5736l2903l921P6684l4846
4990G284K1260N9225r9258l7664L1946L8576o3666J3380L9801L9432p1399m6460
4978f7543J2615J10449Q7147J1438K9205j2847o6662o3768j5010K728J8433Q306
4966E4491M1591L8300K1143n1214n4487m2697K5062j756j0732K879l7194j748
4954a6362L6075l7391q4590L448K5706R8103N6229k2067q1399j04598N0820L2860
4942d3166r080J08853k8819m3239l7677q0462m3936O1120N1218o0189J6202Q3200
4930b5975L5822J2282m0557n1183J4696K0416K5655k030j07537j6087J00121M8032
$$ plain form
5014 -46165 -4950 -26415 -56332 -72173 -80797 -27478 -6226 31962 49024 18756 -16173 -34639
5002 -34639 -13909 58671 77444 61237 81440 57196 -13466 2270 -30633 -34554 42130 7284
4990 7284 28544 87769 -11489 -49153 -17207 21369 -42297 -28917 10884 50316 -21083 -67543
4978 -67543 -54928 55521 142668 154106 183311 170464 103802 40034 25024 27752 46185 54491
4966 54491 96082 134382 155525 104311 49824 7127 32189 30433 19701 22580 -14614 -16362
4954 -16362 19713 -17678 -102268 -98820 -73114 24989 81218 59151 -22248 -126846 -76026 -43166
4942 -43166 -52246 56607 27788 -15451 -53128 -133590 -177526 -116406 -65188 -125377 -109175 -25975
4930 -25975 9847 22129 -18428 -69611 -54915 -34499 -8844 -10874 -118411 -134498 -34377 13655
4918A3655j7225l8784j773m1833j02680J0209P157l3050N7202N4246O6329j00259
4906a26806l4826K0535M3036N3781J5067j9117K0914l8128l681R5341k9349k9031
4894c2264M4354N0195L435q6843k5594r2592j109Q6877J5037k7883m4374K8997
4882h1764M1840K7245J5515L7075K1898l6399K756k4826K7866j3237j4093M0371
4870D4247j6386k4331K5130P5330m0965p6994L2971J8671q2387j03300M1693K6765
4858g9556K8333N6435K6787N7904N1927k8658l4905k8681o0307n819O1184J10043
4846A54687p0152j00718K9523O5911p7731K1017O7067k107K5325R2740m2316J0875
4834A74121o9754j07557r3853J2778r559o9639J8624k9551K4859O7584R5543M9098
$$ plain form
4918 13655 -3570 -42354 -44127 -85960 -188640 -178431 -171274 -204324 -147122 -92876 -26547 -126806
4906 -126806 -161632 -141097 -98061 -44280 -29213 -48330 -27416 -65544 -69225 26116 -3233 -32264
4894 -32264 12090 62285 65720 -21123 -46717 -139309 -140418 -53541 -38504 -66387 -110761 -81764
4882 -81764 -39924 -12679 2836 39911 61809 25410 28166 3340 31206 17969 3876 44247
4870 44247 27861 3530 28660 103990 63025 -13969 19002 37673 -44714 -148014 -106321 -79556
4858 -79556 -51223 5212 31999 89903 141830 113172 78267 49586 -10721 -16540 44644 154687
4846 154687 84535 -16183 13340 79251 1520 22537 89604 87497 112822 205562 163246 174121
4834 174121 104367 -3190 -97043 -84265 -93824 -163463 -144839 -174390 -149531 -81947 13596 62694
4822F2694J6785j1803p6633q633M0916j5822o6857L2250j0794J953j8805J5490
4810c9259K0491k1057k5958k9552P6561N3819l8090m2671L4142K7033R862r7585
4798g2264o777N2554p376o3685J10675L8433L751l9146k2921M0248K1151l9770
4786A4873k9642l257K7920q294K1780q2098o6262N1943J17431l1299m871K0275
4774B8499n9544n171M1630l4963p6156l2885L6572k1241Q480M4553M8508j0487
4762c2205J0692J561l1318l8762k1207M6881N2341L5567m0794n750k0782m3092
$$ plain form
4822 62694 79479 67676 -8957 -17590 23326 7504 -59353 -27103 -37897 -35944 -54749 -39259
4810 -39259 -18768 -39825 -65783 -95335 -18774 35045 -3045 -45716 -11574 15459 25321 -72264
4798 -72264 -79041 -26487 -33863 -97548 13127 51560 55311 16165 -6756 33492 54643 14873
4786 14873 -14769 -18026 9894 1600 23380 -58718 -124980 -73037 44394 13095 8224 28499
4774 28499 -31045 -36216 5414 -29549 -105705 -138590 -102018 -123259 -114779 -70226 -21718 -32205
4762 -32205 -21513 -19952 -51270 -90032 -111239 -64358 -12017 23550 -17244 -22994 -43776 -86868
$$ [...]
##END NTUPLES=NMR SPECTRUM
##END=
