##TITLE=Analysis number 312046
Compound Code cc 28101
Project Code adrs
Chemist Name cardiff
##JCAMPDX= 6.0         $$ Bruker NMR JCAMP-DX V2.0
##DATA TYPE= NMR SPECTRUM
##DATA CLASS= NTUPLES
##ORIGIN= Bruker BioSpin GmbH
##OWNER= NMR
$$ XWIN-NMR		Version 3.5
$$ Fri Jul 22 09:48:01 2005 GMT Daylight Time (UT+1h)  MAYBRIDGE\NMR@NMR_250MHZ
##.OBSERVE FREQUENCY= 250.131544655141
##.OBSERVE NUCLEUS= ^1H
##.ACQUISITION MODE= SIMULTANEOUS (DQD)
##.ACQUISITION SCHEME= undefined
##.AVERAGES= 16
##.DIGITISER RES= 18
##SPECTROMETER/DATA SYSTEM= dpx250
##.PULSE SEQUENCE= zg30
##.SOLVENT NAME= DMSO
##.SHIFT REFERENCE= (INTERNAL, DMSO, 0, 16.522)
##AUDIT TRAIL= $$ (NUMBER, WHEN, WHO, WHERE, WHAT)
$$ ##TITLE= Audit trail, XWIN-NMR		Version 3.5
$$ ##JCAMPDX= 5.01
$$ ##ORIGIN= Bruker BioSpin GmbH
$$ ##OWNER= NMR
$$ C:\u/data/dgb/nmr/ADRS/6340/pdata/1/auditp.txt
$$ ##AUDIT TRAIL=  $$ (NUMBER, WHEN, WHO, WHERE, WHAT)
(   1,<2005-07-22 09:47:15.43 +100>,<MAYBRIDGE\NMR>,<NMR_250MHZ>,
      <created by zg, POWCHK disabled, PULCHK disabled
       configuration hash MD5:
       62 19 C7 07 E1 42 D1 B7 37 6C 3D D0 77 39 F9 E6
       data hash MD5: 64K
       44 AD 01 0D 0A 69 C6 FE 27 5F 37 38 A8 48 6E B0>)
(   2,<2005-07-22 09:47:35.30 +100>,<MAYBRIDGE\NMR>,<NMR_250MHZ>,
      <Start of raw data processing
       ef LB = 0.3 FT_mod = 6 PKNL = 1 SI = 32K 
       data hash MD5: 32K
       47 51 62 9F 4E 82 8B AC 76 6C 64 89 B2 D7 4C 9F>)
(   3,<2005-07-22 09:47:40.25 +100>,<MAYBRIDGE\NMR>,<NMR_250MHZ>,
      <apk 
       data hash MD5: 32K
       76 5C D6 92 80 2C 92 93 7B D2 C9 9E 24 29 29 37>)
(   4,<2005-07-22 09:47:41.93 +100>,<MAYBRIDGE\NMR>,<NMR_250MHZ>,
      <abs ABSG = 5 
       data hash MD5: 32K
       C6 D8 C8 44 A3 1B BE C2 B4 52 76 69 79 DA 88 D9>)
$$ ##END=
$$ 
$$ hash MD5
$$ 72 2F 6D D7 22 5C 4D BB 07 B8 4C C1 C9 BC CB 55
##$RELAX= 
##$RELAX= 
##$RELAX= 
##$RELAX= 
##$RELAX= 
##$RELAX= 
##$RELAX= 
$$ Bruker specific parameters
$$ --------------------------
##$DU= <C:\u>
##$EXPNO= 6340
##$NAME= <ADRS>
##$PROCNO= 1
##$TYPE= <nmr>
##$USER= <dgb>
##$AMP= (0..31)
100 100 100 100 100 100 100 100 100 100 100 100 100 100 100 100 100 100 
100 100 100 100 100 100 100 100 100 100 100 100 100 100 
##$AQSEQ= 0
##$AQ_mod= 3
##$AUNM= <au_zg>
##$AUTOPOS= <4 >
##$BF1= 250.13
##$BF2= 250.13
##$BF3= 250.13
##$BF4= 250.13
##$BF5= 500.13
##$BF6= 500.13
##$BF7= 500.13
##$BF8= 500.13
##$BYTORDA= 1
##$CFDGTYP= 0
##$CFRGTYP= 5
##$CHEMSTR= <none>
##$CNST= (0..31)
1 1 145 1 1 1 1 1 1 1 1 1 1 1 1 1 1 1 1 1 1 1 1 1 1 1 1 1 1 1 1 1 
##$CPDPRG= <>
##$CPDPRG1= <>
##$CPDPRG2= <>
##$CPDPRG3= <>
##$CPDPRG4= <mlev>
##$CPDPRG5= <mlev>
##$CPDPRG6= <mlev>
##$CPDPRG7= <mlev>
##$CPDPRG8= <mlev>
##$CPDPRGB= <>
##$CPDPRGT= <>
##$D= (0..31)
0 1 0 0 0 0 0 0 0 0.06 0 0 0 0 0 0 0.0002 0 0 0 0 0 0 0 0 0 0 0 0 0 0 
0 
##$DATE= 1122022033
##$DBL= (0..7)
120 120 120 120 120 120 120 120 
##$DBP= (0..7)
150 150 150 150 150 150 150 150 
##$DBP07= 0
##$DBPNAM0= <>
##$DBPNAM1= <>
##$DBPNAM2= <>
##$DBPNAM3= <>
$$ [...]
##$SUBNAM7= <"">
##$SUBNAM8= <"">
##$SUBNAM9= <"">
##$SW= 20.6930455092707
##$SWIBOX= (0..15)
0 0 3 0 0 0 0 0 0 0 0 0 0 0 0 0 
##$SW_h= 5175.983436853
##$TD= 65536
##$TD0= 1
##$TE= 295.16
##$TE2= 300
##$TE3= 300
##$TEG= 300
##$TL= (0..7)
0 120 120 120 120 120 120 120 
##$TP= (0..7)
150 150 150 150 150 150 150 150 
##$TP07= 0
##$TPNAME0= <>
##$TPNAME1= <>
##$TPNAME2= <>
##$TPNAME3= <>
##$TPNAME4= <>
##$TPNAME5= <>
##$TPNAME6= <>
##$TPNAME7= <>
##$TPOAL= (0..7)
0.5 0.5 0.5 0.5 0.5 0.5 0.5 0.5 
##$TPOFFS= (0..7)
0 0 0 0 0 0 0 0 
##$TUNHIN= 0
##$TUNHOUT= 0
##$TUNXOUT= 0
##$USERA1= <user>
##$USERA2= <user>
##$USERA3= <user>
##$USERA4= <user>
##$USERA5= <user>
##$V9= 5
##$VALIST= <valist>
##$VCLIST= <CCCCCCCCCCCCCCC>
##$VD= 0
##$VDLIST= <DDDDDDDDDDDDDDD>
##$VPLIST= <PPPPPPPPPPPPPPP>
##$VTLIST= <TTTTTTTTTTTTTTT>
##$WBST= 1024
##$WBSW= 4
##$XGAIN= (0..3)
0 0 0 0 
##$XL= 0
##$YL= 0
##$YMAX_a= 417344
##$YMIN_a= -421748
##$ZGOPTNS= <>
##$ZL1= 120
##$ZL2= 120
##$ZL3= 120
##$ZL4= 120
##$ABSF1= 16.522
##$ABSF2= -4.171173
##$ABSG= 5
##$ABSL= 3
##$ALPHA= 0
##$AQORDER= 0
##$ASSFAC= 0
##$ASSFACI= 0
##$ASSFACX= 0
##$ASSWID= 0
##$AUNMP= <proc_1d>
##$AZFE= 0.1
##$AZFW= 0.1
##$BCFW= 0
##$BC_mod= 0
##$BYTORDP= 0
##$COROFFS= 0
##$CY= 12.5
##$DATMOD= 1
##$DC= 0
##$DFILT= <>
##$DTYPP= 0
##$F1P= 14.0000005364418
##$F2P= -0.99999901652339
##$FCOR= 0.5
##$FTSIZE= 32768
##$FT_mod= 6
##$GAMMA= 0
##$GB= 0
##$INTBC= 1
##$INTSCL= 1
##$ISEN= 128
##$LB= 0.3
##$LEV0= 0
##$LPBIN= 0
##$MAXI= 10000
##$MC2= 0
##$MEAN= 0
##$ME_mod= 0
##$MI= 0
##$NCOEF= 0
##$NC_proc= -3
##$NLEV= 6
##$NOISF1= 0
##$NOISF2= 0
##$NSP= 0
##$NTH_PI= 0
##$NZP= 0
##$OFFSET= 16.522
##$PC= 1
##$PHC0= -86.59858
##$PHC1= 6.460823
##$PH_mod= 1
##$PKNL= yes
##$PPARMOD= 0
##$PSCAL= 4
##$PSIGN= 0
##$REVERSE= no
##$SF= 250.13
##$SI= 32768
##$SIGF1= 0
##$SIGF2= 0
##$SINO= 400
##$SIOLD= 32768
##$SREGLST= <1H.DMSO>
##$SSB= 0
##$STSI= 32768
##$STSR= 0
##$SW_p= 5175.98343685301
##$SYMM= 0
##$S_DEV= 0
##$TDeff= 65536
##$TDoff= 0
##$TI= <Analysis number 999999
Compound Code 99
Book Reference 9
Project Code 9>
##$TILT= no
##$TM1= 0
##$TM2= 0
##$TOPLEV= 0
##$USERP1= <user>
##$USERP2= <user>
##$USERP3= <user>
##$USERP4= <user>
##$USERP5= <user>
##$WDW= 1
##$XDIM= 32768
##$YMAX_p= 314095753
##$YMIN_p= -144506
$$ End of Bruker specific parameters
$$ ---------------------------------
##NTUPLES= NMR SPECTRUM
##VAR_NAME=  FREQUENCY,     SPECTRUM/REAL,   SPECTRUM/IMAG
##SYMBOL=    X,             R,               I
##VAR_TYPE=  INDEPENDENT,   DEPENDENT,       DEPENDENT
##VAR_FORM=  AFFN,          ASDF,            ASDF
##VAR_DIM=   32768,         32768,           32768
##UNITS=     HZ,            ARBITRARY UNITS, ARBITRARY UNITS
##FACTOR=    0.157963299565203, 1,           1
##FIRST=     4132.6476996994, 0,             0
##LAST=      -1043.33573715361, 0,           0
##MIN=       -1043.33573715361, -144506,     0
##MAX=       4132.6476996994, 314095753,     0
$$ Real data points
##PAGE= N=1
##DATA TABLE= (X++(R..R)), XYDATA
$$ [...]
18350G82161j9599J7703O7563K1347l4501o5094q4597j00895n2905l4639l7051
18339D59493m0753k2759K851Q576o596j2035J6142l3218k8091k8703J4386R305
18327C38598k0542J699o4329j5130m145M219R996K6968K7762n664K334Q28K7156
18314C29750K5158m4417l7046K6611l760m068l5442j2723N178j3823j0688l2488
18302A92242n0058N610L5974P880J0726M3955j904m6340j7360R889k614j4604
18290A73396p225K480q749J1730M2881m971k8135j5555N5521L3082O835J6104
18278B77394q047j2157k2464j2066k12r12J2673m359k3089J1249k126j7707j6885
18265A81292M4558L8388O600n5921q4061l0519l906N0346N3007k7563m6080o059
$$ y = [782161, 762562, 780265, 847828, 869175, 834674, 769580, 684983, 584088, 531183, 496544, 459493, 418740, 395981, 398832, 407408, 400812, 388777, 404919, 371701, 343610, 314907, 329293, 338598, 318056, 319755, 255426, 240296, 236151, 240370, 250366, 277334, 305096, 299432, 301766, 302594, 329750, 354908, 310491, 273445, 300056, 296296, 292228, 256786, 244063, 249241, 235418, 224730, 192242, 142184, 147794, 183768, 191648, 202374, 246329, 244425, 198085, 180725, 190614, 188000, 173396, 166171, 168651, 159902, 171632, 214513, 209542, 181407, 165852, 221373, 254455, 261290, 277394, 269347, 257190, 234726, 222660, 222448, 221536, 234209, 229850, 206761, 218010, 215884, 198177, 181292, 225850, 264238, 270838, 214917, 130856, 100337, 96431, 146777, 199784, 172221, 126141, 120082]
18253A20082m940j4986j047L6785r370j5069L3145K5244j8245j1535n55l9430
18241A00079j0198P2333L0177l441m3719o4693p980R880K100Q1416K1093k6580
18229A60467J0863j5712l3792j2473l5930k0387j327m074J3636L3845K5388k4951
18217I5553j3590J6992M3196j4807N591J0529k1430l0126m566j8178k6011o612
18205C6541R800L7327M0534k4603j2734k5150l2626J1074J2324l0096k0300p379
18193e288J4305j2326r851J5748L5919R909q086K4920j2958K2950k8893j4638
18181C1711M0227J6260m5325k0829J2928j0902q078K3160K5033J5287l198K491
18169G8765N870q360N821J216K1067k6383m4333L2727M1353k971j6841K4879k6964
$$ y = [120082, 115142, 100156, 99109, 135894, 126524, 111455, 144600, 169844, 151599, 140064, 139509, 100079, 89881, 162214, 192391, 188950, 145231, 80538, 72558, 82438, 84538, 165954, 187047, 160467, 171330, 155618, 121826, 109353, 73423, 53036, 51709, 47635, 61271, 95116, 120504, 95553, 81963, 98955, 142151, 127344, 132935, 143464, 122034, 91908, 87342, 69164, 43153, 36541, 46341, 83668, 124202, 99599, 86865, 61715, 29089, 40163, 52487, 22391, 2091, -5288, 9017, -3309, -13160, 2588, 38507, 48416, 40330, 65250, 52292, 75242, 46349, 31711, 71938, 88198, 42873, 22044, 34972, 24070, 15992, 39152, 64185, 79472, 76274, 78765, 84635, 76275, 82096, 83312, 104379, 77996, 33663, 66390, 107743, 104772, 87931, 112810, 85846]
18156H5846k7199L127q316r361J5926J3397K7760R031j0886m0085k1011P180K5889
18143G1298j3385K954p173j1790M4447j3030j2002K6627K145n1870k7241J5130
18131B6110M8655J8680j33J4758L388k2103k8748L0388J9040j6379k3377o266
18119F4013k759L5685J5306m0495j195L8610J778M74l7818k3923J1771K1615O697
18106H9759j1914j1923q471m1355l1069J9365K130j3227O925O627K97k7679k1481
18093d2016K989j2173N250L2258M1922L0296l3822k6513L423K0484L7233K5119
18081H4450K3691J261J563k7434l3012J9935L3832j6239n3600M32M273n154l2101
18068A897k280o6651J2473M7468n472p775M5759K5550L7924l2904k7096L0049
$$ y = [85846, 58647, 61774, 53458, 44097, 60023, 73420, 101180, 110211, 99325, 59240, 38229, 45409, 71298, 57913, 60867, 53694, 41904, 86351, 73321, 61319, 87946, 90091, 38221, 10980, 26110, 74765, 93445, 93312, 108070, 111458, 89355, 60607, 90995, 110035, 93656, 70279, 64013, 61254, 96939, 112245, 71750, 70555, 109165, 110943, 111417, 73599, 49676, 61447, 83062, 89759, 77845, 65922, 57451, 16096, -14973, 4392, 6522, -6705, 220, 6847, 7144, -20535, -42016, -39027, -51200, -45950, -13692, 28230, 58526, 24704, -1809, 1614, 22098, 59331, 84450, 108141, 109402, 110965, 83531, 50519, 70454, 104286, 88047, 34447, 34879, 39152, 33998, 1897, -383, -67034, -54561, -7093, -12565, -20340, 25419, 50969, 88893, 55989, 28893, 58942]
18056E8942J9425j1855M101l070j407k0560P219j2104k0284p35K3132K5265k2151
18043D5918j6508l9191J0938o586K302N3085K8280K404J5805L0181j1311l8210
18031G7107k2199L1866o83k0106j0113K9912K8546J3212p012K510l9020r347K3733
18018I8406k2895k2349M7031P3742P523L9141P437k195k9159m3528J5470j1543
18006A57081j01260L965N1413Q009J7365L3294K414k3706k7753l4573m698K2365
17994A03916J9433J0083L5248J2671j7451j5761j539l1162L9616M5499j4384K4272
17982B10441K8882N4112K1655m1337j9450j2106Q891K9057n539k2943j3080l8066
17970B00517K4686P976m0191J6418J4547K5615J3241m2707l8492j5517j977L702
$$ y = [58942, 78367, 66512, 70613, 67543, 66136, 45576, 52795, 40691, 20407, 19672, 42804, 68069, 45918, 29410, -9781, 1157, -5429, -3127, 49958, 78238, 80642, 96447, 126628, 115317, 77107, 54908, 86774, 86091, 65985, 55872, 85784, 114330, 127542, 120530, 123040, 84020, 74673, 98406, 75511, 53162, 100193, 173935, 181458, 220599, 228036, 225841, 196682, 153154, 168624, 157081, 55821, 59786, 111199, 119208, 136573, 169867, 172281, 148575, 120822, 86249, 81551, 103916, 123349, 133432, 168680, 181351, 163900, 148139, 146600, 115438, 155054, 200553, 186169, 210441, 239323, 293435, 315090, 273753, 254303, 242197, 251088, 280145, 274606, 251663, 238583, 200517, 225203, 233179, 192988, 209406, 223953, 249568, 262809, 220102, 181610, 166093, 164116, 167818]
17958A67818l9250L289K7539J2455J2091K9554k359J1964k0976l0146j6158k3851
17946A31970m5743j5817J9887P0881O707J1278M0128J6414j5194p600L0703K5375
17934B68989N028L92p665K3629k5573j0016o547j3772k6956K2904J8532K3365
17922B72310l996l2511k5403K5381j609m449n0395M003Q54j21J8936o997L6478
17909B32481K7999k2216j1889J216J853k8195k0558K352k0158m0592n1165j0203
17897F0925O0025M4385M0563Q337l7948q718k4719k7581j054L479N370N2391K6542
17884B01997P052M9K4509K4923k5888m8963K978l4753j8049j998j1040k2876P365
17871A05306K7470k3949Q792J5406m8872J8330M5459L674K3876m4576n8025r888
$$ y = [167818, 128568, 131857, 159396, 171851, 183942, 213496, 211137, 223101, 202125, 171979, 155821, 131970, 86227, 70410, 90297, 161178, 167885, 179163, 219291, 235705, 220511, 212911, 243614, 268989, 274017, 274409, 266744, 290373, 264800, 254784, 248237, 234465, 207509, 230413, 248945, 272310, 268314, 235803, 210400, 235781, 234172, 229723, 179328, 183331, 184185, 184064, 203000, 196003, 232481, 260480, 238264, 226375, 227591, 229444, 201249, 180691, 183043, 162885, 122293, 71128, 60925, 120950, 165335, 205898, 214235, 176287, 167569, 142850, 115269, 114215, 117694, 123064, 175455, 201997, 209049, 209098, 233607, 258530, 232642, 183679, 186657, 151904, 133855, 131857, 120817, 97941, 105306, 132776, 108827, 117619, 133025, 84153, 102483, 147942, 151616, 175492, 130916, 72891, 63003]
17859F3003k921l1925l1232J8161J0029M9088K3556n657l6451j0003q812k0831
17847A6005l35j3126L132N0082K6756n4889k080K738J5581J3028l438l4682k5373
17834f601q159J7359K6546m3334n2921k011N6922N664M2314K6105k085M41m1151
17821A9089m0137L9712L8353k1706k8860j0683K0379J8077k3543R906p943K6931
17809C9575K2264m3044k5630L4944m0692J4127M8700K15l6729j7025p570l7913
17797d8778j6034p410j5326K0150K7554L1438K3888j2963j0944k1444j7197J7829
17785b9237K9953R286j7023K679M0047o572j6473j4573M2894m710m0330k3131
17773b7190R03J4970O36Q388r929N8032J4113O421l2212l7717l1682k232L990
$$ y = [63003, 60082, 28157, -3075, 15086, 25115, 74203, 97759, 92102, 55651, 45648, 36836, 16005, 15670, 2544, 5676, 55758, 82514, 27625, 25545, 28283, 43864, 56892, 53454, 18772, -6601, -14760, 2599, 29145, -14189, -67110, -69121, -12199, -6535, 35779, 61884, 59799, 60240, 19089, -21048, 18664, 57017, 35311, 6451, -4232, 16147, 34224, 10681, 20587, 12644, 39575, 61839, 18795, -6835, 28109, -12583, 1544, 50244, 50459, 13730, -3295, -10865, -48778, -64812, -72222, -87548, -67398, -39844, -8406, 15482, 2519, -8425, -29869, -47066, -29237, 716, 10002, -7021, -4342, 35705, 29133, 12660, -1913, 40981, 36271, -4059, -27190, -26287, -11317, -10681, -2293, -12222, 45810, 59923, 66344, 34132, -3585, -35267, -37499, -33509]
17760c3509L5980j0476M391p757l0830k6785j7837J3494M5666j4237K4792K0145
17748C037j439K0597P357l1153r66M3717m723n2038K0355J3675K468j1526L9249
17735D8610p09l2091m8092J5379J8284j2371j8962K4105J5056M82k5902K2043
17723E832K7554J1190k0539j9159J7149M5369k5230o402K0760j599j5469k0801
17711A8655r836n1455j868j585K5151K1411j7443k9723l0211M0868N0926O5407
17699H0297k8526l2645k722J0519l3643K8200L0393k9541L57R986P411M1121j2647
17686F8560k2580q628l4035k442K2276k5766j6925L2035J5941L9113k9617j8616
17674A9316p795K4956k609j9622j8142J941N80M1736j4301j7191K7494K5156j6769
$$ y = [-33509, 2471, -8005, -3614, -11371, -42201, -68986, -86823, -73329, -27663, -41900, -17108, 3037, 1598, 22195, 29552, -1601, -2567, 41150, 36427, -15611, 4744, 18419, 20887, 9361, 48610, 47901, 15810, -32282, -16903, 1381, -10990, -29952, -5847, 9209, 9691, -16211, 5832, 33386, 44576, 24037, 4878, 22027, 67396, 42166, 35764, 56524, 54925, 39456, 18655, 8819, -42636, -44504, -46089, -20938, 473, -16970, -46693, -76904, -36036, 14890, 80297, 51771, 19126, 16404, 26923, -6720, 21480, 51873, 22332, 22689, 32675, 40086, 81207, 68560, 45980, 37352, 3317, 875, 23151, -2615, -19540, 12495, 28436, 67549, 37932, 19316, 11521, 36477, 33868, 14246, -3896, -1955, -1375, 40361, 26060, 8869, 36363, 61519, 44750]
17661D4750R507J5075m5565k0464o486j1528q368K8873J7824J7637j5233k4950
17649A072r150m814p072J7684J3554l8013l6000j0278J639j2930j2064j3186L4120
17636g5438J4724K2755M9793L129M010k062j4301o984K0222K6135L071l4620k7904
17623a7470K61J561J4288j2247m1258l394k0609J5978L8468L6697o9278j7354
17611g4357L1535K5188l964p381J9151m811J3784J1768J8890K0733j8432m4042
17599a1938o202p901j8041j3936K6090J1465J1817P85j5804J7735L168J2254j619
17586G873J4303J7175m010n760J1329l3389l5747O638O288K1711J2706k27P887
17573B6777J4944j901l1870k3128l7j8955L840J4055O714N858j6833j0396j236
$$ y = [44750, 54257, 69332, 23767, 3303, -3183, -14711, -23079, 5794, 23618, 41255, 26022, 1072, -8078, -12892, -19964, -2280, 11274, -26739, -62739, -73017, -71378, -84308, -96372, -109558, -75438, -60714, -37959, 11834, 14963, 18973, 16911, 2610, -4374, 15848, 41983, 45054, 10434, -17470, -17209, -15648, -1360, -13607, -54865, -58259, -78868, -62890, -24422, 12275, -57003, -74357, -42822, -17634, -21598, -28979, -9828, -14639, -855, 10913, 29803, 50536, 32104, -11938, -18140, -26041, -44082, -58018, -31928, -20463, -8646, -7861, -23665, -5930, -2762, 9492, 7873, 22176, 39351, 35341, 29581, 40910, 7521, -28226, -21588, -15300, 6411, 19117, 18890, 26777, 41721, 39820, 7950, -15178, -15215, -34170, -30330, -16275, -9561, -3703, -20536, -30932, -32168]
17560c2168M1092K4039k4856l3507k9724q084M5215J5139k7053n7327j0153K5429
17548g1958j7738q559O937M9239L060J0675M0012O866O745J3825R58m595J5825
17535E1292j0780J7308j7854n607k8901m0349M657L328Q018M52j4884M1457K6499
17522C4636J818J4621K2086r091l1998k6344J8604J73L2156K7820k4166k8026
17510C2289k1621l859m3086L726K2802K7609n489l0978r668P65l4132o582J9047
17497d9177L3238l2395K7626K5137j3196m4967j5991K2235M8636M3375q229K290
17485C8582K2657k7329l1510k7116j7586K9702J4873J5562l854k1922j5280J8523
17473d698J7012R392j2014K2200O0133k0483l8168N069k1593k6042R908J5332
$$ y = [-32168, 8924, 32963, 8107, -25400, -55124, -63208, -17993, -2854, -29907, -87234, -97387, -71958, -89696, -98255, -91318, -42079, -39019, -28344, 11668, 18534, 25279, 39104, 40062, 35467, 51292, 40512, 57820, 39966, 34359, 5458, -34891, -30234, -26906, -18888, -18436, -33320, 8137, 34636, 36454, 51075, 73161, 64070, 32072, 5728, 24332, 24505, 56661, 84481, 60315, 32289, 10668, 6809, -36277, -32551, -9749, 17860, 12371, -18607, -28275, -27510, -61642, -68224, -49177, -15939, -48334, -20708, 4429, -8767, -53734, -69725, -47490, 1146, 44521, 36292, 38582, 61239, 33910, 2400, -24716, -42302, -12600, 2273, 17835, 13981, -7941, -23221, -4698, 12314, 21706, 9692, 31892, 92025, 71542, 33374, 38443, 16850, -9192, 716, 16048]
17461A6048p000k3925K9359J6267k1371J9125k0344l3457m097k733n964k857J8442
17448b2507L4586O750n093L1258l1465j430m4739N590L1720J0592j1057j3132
17436h927k8702J8645L0155L1372Q698Q492Q320J7046l8020j8213L44N149K6375
17423F0734K9168l8311j8926l4387l4883K7116K0170j883k106j0404l8021J9463
17411b2270M0802L1573k3626j4100j5574j6645N444Q685L886J2553K9149L371
17399D3248J126l349k7844j3697K0235j0358l6889m416M3395K8821m764q665p708
17386A9135P028Q729k7687l2869j8100K8775K8347l362J6273r620J708Q988P198
17373C4543j226n4313j2900K3389L1801L354k7338k7583m1498m756L8463N9903
$$ y = [16048, 9048, -14877, 14482, 30749, 9378, 28503, 8159, -25298, -29395, -32128, -38092, -40949, -22507, 12079, 18829, 13736, 44994, 13529, 12099, -32640, -27050, 4670, 15262, 4205, -8927, -37629, -18984, 11171, 42543, 51241, 59733, 68053, 85099, 47079, 28866, 29210, 34359, 60734, 89902, 51591, 32665, -1722, -36605, -9489, 10681, 8798, 6692, -3712, -41733, -22270, 18532, 50105, 26479, 12379, -3195, -19840, -14396, -5711, -1825, 10728, 39877, 43248, 44374, 41025, 13181, -516, 19719, 9361, -27528, -31944, 11451, 40272, 35508, 26843, 19135, 26163, 34892, 7205, -25664, -43764, -14989, 13358, 9996, 26269, 16649, 18357, 27345, 34543, 33317, -20996, -33896, -10507, 21294, 24648, -2690, -30273, -71771, -76527, -38064, 21839]
17361B1839j9694k5574M6040J0257j193P184k4296p8259K49J5362K4412Q066L4201
17348A8594K2785L734m1680n8866l1216j9058L5609L0380n977J786L1149K2337
17336I577M080k3184j9062j2274j5892Q989K0755j4963K3617M1203K8143l1796
17324A9193m715j2281J5016M4943j5964n5441L514N1656p578j3744j8579O948
17312A2968J8898j4129j2856j3821o42K4145J964m1456k7885P619J7742M900Q786
17299a3767j29l477m1289k4259O148K3415J2940k869J4502K1774j235k0827P694
17286b1379J0282J1957j44k4248j3640K1441o294k7524j4368k7784K7693R834
17274e4174K7332k4240k8549J9605m367K5673K0830L621l2319j7239k936J1706
$$ y = [21839, 2145, -23429, 22611, 32868, 31675, 38859, 14563, -63696, -63447, -48085, -23673, -15607, 18594, 41379, 45113, 3433, -55433, -86649, -105707, -70098, -39718, -45695, -43909, -12760, 9577, 13657, -9527, -28589, -40863, -56755, -47766, -27011, -41974, -18357, 22846, 50989, 19193, 14478, 2197, 17213, 62156, 46192, -9249, -5735, 45921, 38343, 24599, 6020, 12968, 31866, 17737, 4881, -8940, -9582, 14563, 16527, -24929, -52814, -45195, -27453, -22553, -13767, -13896, -17373, -58662, -82921, -76773, -53358, -40418, -43287, -28785, -7011, -8246, -29073, -21379, -11097, 860, 716, -23532, -37172, -15731, -22025, -49549, -63917, -91701, -64008, -54174, -26842, -51082, -79631, -60026, -64393, -38720, -17890, -14269, -46588, -63827, -66763, -55057]
17262e5057n360M587M8278o294j8600J3166m438M068L0864J6943L84K4328l2834
17249B0035j90M156J4128l400j1459k0348P942k6L136k812Q462K6609J0341K1767
17235G8341J9386j6074j2997m603k1699l7798M40N376k2489m7079j3744J4917
17223e8023J0137j1151j3578n600K8654K5910J9070L2053R357m6819Q042M1942
17211C9994j4222j6958l7773k2539j820r014J1036L2504j9629M131L3837N0801
17199E0348l929q097k6838k6958j4269L0586R974n320j4990J6507k0957l3793
17187d7736J556K1371L5340L1587l014j2674j8358k0898J2771K6994K2851j3821
17175C5969q43J7397J7550j5977j318J9074m1721j7461j5743q484o879j0963k6659
$$ y = [-55057, -60417, -55830, -7552, -13846, -32446, -19280, -23718, -19650, 11214, 28157, 28541, 52869, 20035, 19845, 24001, 38129, 34729, 23270, 2922, 10864, 10838, 13974, 11162, 19624, 46233, 56574, 78341, 97727, 81653, 68656, 64053, 42354, 4556, 4996, 10372, -12117, -59196, -72940, -58023, -47886, -59037, -72615, -78215, -49561, -23651, -4581, 27472, 36829, -9990, -1948, 39994, 25772, 8814, -28959, -51498, -53318, -62332, -51296, -18792, -38421, -34290, -453, 50348, 46419, 38322, 11484, -15474, -29743, 843, 10817, 5497, -9493, 7014, -13943, -47736, -46180, -24809, 10531, 42118, 39104, 26430, 8072, -12826, -55, 26939, 49790, 35969, 35126, 52523, 70073, 54096, 52778, 71852, 30131, 12670, -3073, -11557, -18436, -29399, -56058]
17162e6058R182K8929R066J1284l840k7902L2349j705j1304J7923M508j1773m01
17149B58k0217l712L9287J1771j0024k4892L161j1823K8850l4528o721P89P088
17136b0713J0428j5578k0581M2386N2638o820j5169k2282n202J22J1812n810p351
17123b120q027M6387J4296k1201J1407m327k0479l9055j8538L0267J8421P865
17111A4896O53M674J4074j3261J8812l836j5150q691k9286j0835M2628J4728l2344
17098b938k5551j4216K4225k523N903L5880j6206R721k4511j1025n163k0574o783
17085e3761J0661J7433K5098l2011m3679J6945j9783J7727M814l227K7696N0725
17073A8638k5027N649j2176l8459j0887K6282L0230p630j8323N670m219n343j1422
$$ y = [-56058, -46876, -17947, -8881, 2403, -1437, -29339, 3010, 1305, -9999, 7924, 12432, 659, 258, -19959, -23671, 15616, 27387, 17363, -7529, -4368, -16191, 12659, -21869, -28590, -27801, -20713, -10285, -25863, -46444, -4058, 48580, 41760, 26591, 4309, -893, -771, 11041, 5231, -2120, -10147, 36240, 50536, 29335, 40742, 36415, 15936, -23119, -41657, -11390, 7031, 14896, 15549, 20223, 34297, 21036, 39848, 36012, 20862, 12171, -17115, -27950, 14678, 29406, -2938, -28489, -42705, -18480, -21003, -15100, 20780, 4574, 14295, -10216, -21241, -26404, -46978, -53761, -43100, -25667, -569, -32580, -76259, -59314, -79097, -61370, -56556, -59783, -32087, 18638, -6389, -740, -12916, -51375, -62262, -35980, -5750, -13380, -31703, -26033, -30252, -35595, -47017]
17060d7017L4137K7254j6844k8020K6309j2309O753j7226j5759L937J1276n615
17048c3124P083R691L1641l9048l8602q268K8052O4523R412k397k0489J1310m449
17035A5335L4306r99k8992k9052k64Q082k438J3513J2958J4212L1789L9156P017
17022A14623n3069n3748m7081L1703J9403K8454j5899o6133l606J8892q383l5765
17010g0609N756K9272J3365K7677J5683r870k6116m8802K5456J9797p083k8545
16998e4019q661L3738N5696j861j2352m656l7322l035K217J3349J9489K0515N571
16985B8669j016j5761k5533j7613L6610j076k7125k1034J8064K7697N680p494
16973F8j2641K501j7861Q49K6408K8936j5826l8883P642N5445J3028k1768m9037
$$ y = [-47017, -12880, 14374, -2470, -30490, -4181, -16490, -9737, -26963, -42722, -38785, -27509, -33124, -26041, -16350, 15291, -23757, -62359, -70627, -42575, 21948, 31360, 28963, 8474, 19784, 15335, 49641, 48642, 19650, -9402, -9666, -1584, -4022, 9491, 22449, 36661, 68450, 107606, 114623, 61554, 7806, -39275, -7572, 11831, 40285, 24386, -41747, -45353, -26461, -34844, -70609, -64853, -35581, -22216, 5461, 21144, 11274, -14842, -63644, -38188, -18391, -25474, -54019, -62680, -28942, 26754, 24893, 12541, 7885, -29437, -32472, -30255, -16906, 2583, 23098, 28669, 27653, 11892, -13641, -31254, 5356, 4280, -22845, -43879, -25815, 1882, 7562, 68, -12573, -10072, -27933, -27084, -676, 28260, 12434, -26449, -18807, 36638, 49666, 27898, -21139]
16960b1139m2264J4209N4350M6456Q537j9788j090l0946m209p80k8254j5722j1964
16947e2604k3455M2381N2444k3201k7811l3065J290K6225K0277K2540k0778l7847
16935e3604j2360L7464K8704j434J4005j2932l1626K484l5650l6228J5294M1235
16923d4648K3028m202p7071J3249O0061J3755J1479O597M0505n00K219m5006l2937
16910c3471j0074J7924K7861J9781L474l6563n998p903O100j8077J800O643R155
16897a9348j6221k627O667L9998l771k745p680J0694L5156j8675m073l445k5484
16884a1554R232k8532j20K7766J8199Q804l4277j2666m2900l9049L0287n758k1923
16871a02491L8130L6464J7630m1421K3684M2526J5031k7842p1624j3123N1166
$$ y = [-21139, -63403, -49194, 5156, 51612, 60149, 40361, 39271, 8325, 4116, 3336, -24918, -40640, -52604, -76059, -33678, 18766, -4435, -32246, -65311, -64021, -37796, -17519, 5021, -15757, -53604, -65964, -28500, 204, -1230, 12775, -157, -31783, -29299, -64949, -101177, -85883, -44648, -21620, -25822, -102893, -89644, -29583, -15828, -4349, 2248, 42753, 42253, 44472, -534, -33471, -43545, -25621, 2240, 22021, 25495, -11068, -17066, -24969, -18869, -36946, -35146, -28503, -19348, -35569, -38196, -31529, 8469, 4698, 1953, -5727, 4967, 40123, 21448, 17375, 13930, -11554, -2322, -30854, -30974, -3208, 14991, 23795, -10482, -23148, -66048, -105097, -74810, -80568, -102491, -64361, -27897, -10267, -51688, -28004, 14522, 29553, 1711, -69913, -83036, -31870]
16860c1870N3772J064k5134J2609J2800Q086Q414N077l5796k0763l0340K3981
16848a8100Q278j3970L635J2389j4719r775L6310L129l512j3530P831j3274l3833
16835d9141l370Q465L7558J3452J5168j975k2659n001Q162l445J7105M7668k2933
16822C9054n5437j7650L3610k0272K3972K9147k3913k8464n518K1670Q973L5263
16810D0435l6229k1752j8586j29K7466Q291l0843K2919K9381l7759J5142M1157
16798C9493J0938M117K569j5648l293n143P077k808j3379l3936k7388j904J518
16785c7787J7059R254r759L2460m772k2738k0547k2449j8184Q218M0650L2078
16773C483L4012J304K213m6985l3862q062K4935J9008j5875p060M9087M4120M0465
$$ y = [-31870, 21902, 22966, -2168, 10441, 23241, 31327, 39741, 44818, 9022, -11741, -42081, -18100, -9822, -23792, -20157, -7768, -22487, -32262, 4048, 7177, 3665, -9865, -2034, -15308, -49141, -52511, -44046, -6488, 6964, 22132, 20157, -2502, -7503, 659, -2786, 14319, 61987, 39054, -16383, -34033, -423, -20695, 3277, 32424, 8511, -19953, -25471, -3801, 5172, 40435, 4206, -17546, -36132, -36261, -8795, -504, -31347, -8428, 20953, -16806, -1664, 39493, 50431, 54548, 57117, 41469, 38176, 33033, 40110, 37302, 23923, -10013, -37401, -39305, -37787, -20728, -11474, -21233, 11227, 6455, -16283, -36830, -59279, -77463, -69245, -28595, 3483, 37495, 38799, 41012, -5973, -39835, -47897, -22962, -3954, -19829, -26889, 22198, 66318, 106783]
16760A06783k8372j2170l1216k2993j7952k6723k7547N5192K8462n5083m2841
16749g4460K8138O648O076L3622j4234k0164J6539k6537R51K7770k6407J3283
16737b8775L016k4451j4392J6491q142J7946J5388j0261K2031L759n337m0580
16725e3307k0408J8117L3363j2779N908N3408L0354n576k0979k7808r151M433
16713d425j4311l4376k955q750M176n931J9649L3243J4408j1033j1479j7165q675
16700d7624R296K7905K3516r877K3140j2773l7876m3035J133L422L9085j4796
16688c8484k3082K4968L592J2429p649k1615L7297K1393m671J2315K4935K3611
16676F5039p302P210j7099l596l1696k1342L9728l2877n8447J2749K6501M136
$$ y = [106783, 78411, 66241, 35025, 12032, -5920, -32643, -60190, -4998, 23464, -31619, -74460, -46322, -39674, -33598, 24, -14210, -34374, -17835, -44372, -43421, -15651, -42058, -28775, -25759, -50210, -64602, -48111, -56253, -38307, -22919, -33180, -11149, -7390, -12727, -53307, -73715, -55598, -22235, -35014, -29106, 24302, 54656, 49080, 28101, 293, -8858, -4425, -18736, -53112, -56067, -64817, -60641, -66572, -46923, -13680, 728, -10305, -21784, -38949, -47624, -38328, -10423, 13093, 3216, 26356, 13583, -24293, -67328, -66195, -62773, -23688, -38484, -61566, -36598, -33006, -20577, -28226, -49841, -12544, 8849, 4178, 16493, 41428, 65039, 57737, 64947, 47848, 44252, 12556, -8786, 30942, -1935, -60382, -47633, -21132, -16996]
16664a6996J7466K2292N039j1735k389n035j3934j5118K1664K6547p074K9229
16652D9956K2117k3199j9183j3610K4104j7926k1071K9910j7495l5990O417j8829
16640c4799k8770j4696J0553K6359M334N782j4281m864M3508P366n932M7547j1992
16627C0115j1594o047K2894n3716m4640M645p585K8637L3704l2472l1365J8794
16615d8630J9873J6962J279j7752L2391p998L284J2661p398l3946n51J0063j7722
16602c7484j5937J423O491L0685k0594L48M390K1150K2632R792K640J6194j3699
16589B8031j9980J7851l0091l3524k5880J3053N7466J5553l4897J1541J5481o444
16577H160j8091l9686L0066K8504j3833J0990K9679l9310m9556J3320M7412k7680
$$ y = [-16996, 470, 22762, 27801, 16066, 13677, 8642, -5292, -20410, 1254, 27801, 20727, 49956, 72073, 48874, 29691, 16081, 40185, 22259, 1188, 31098, 13603, -22387, -15970, -34799, -63569, -78265, -67712, -41353, -37019, -31237, -45518, -50382, -6874, 492, -5440, 42107, 30115, 18521, 12474, 35368, -18348, -62988, -58343, -65928, -37291, -3587, -36059, -67424, -48630, -28757, -11795, -10516, -28268, 4123, -3875, -591, 12070, 4672, -29274, -29825, -19762, -37484, -53421, -51998, -45507, -14822, -35416, -35068, -30678, -9528, 13104, 22896, 25536, 41730, 28031, 8051, 25902, -4189, -37713, -63593, -50540, 6926, 22479, -12418, -877, 14604, 8160, -9931, -49617, -19551, 8953, -4880, 6110, 35789, -3521, -53077, -39757, 7655, -20025]
16565b0025J8491r569m91k2883m0328J343L6491o568K0137N8412K8650j1980j9224
16552C2456j8431l3719l816q831q9P06k9978L6321P703R418j8718l8347Q835J7956
16538c8534P378m3118M346N4340K1697K0753k7702l4409J8766k1050m6062L7014
16526d6581q104K9141N8687M8763J8887m1645j5252N548j3936k1297j2263K6143
16514B8091m306k2000K788M7696k3420m3764k5665J6406L1674n565l7104N768
16502b9401K1032j0910k2236L9031L6402J0121l679K6838k9359k7593n247l485
16490A514m1638L0499K8406j0392l3507J4664K8480R439j6257l1935R58K5360
16478E591L927k778O983R604J2754k2657j8577J0136o17J286K8570N72j83J2817
$$ y = [-20025, -1534, -11103, -11594, -34477, -74805, -73462, -36971, -43539, -23402, 35010, 63660, 51680, 32456, 14025, -19694, -23510, -32341, -32430, -31724, -61702, -25381, -17678, -8260, -26978, -65325, -56490, -38534, -31156, -74274, -69928, -15588, 6109, 26862, -840, -35249, -16483, -37533, -83595, -46581, -54685, -25544, 33143, 81906, 100793, 59148, 43896, 49444, 35508, 14211, 1948, 28091, 23785, 1785, 4573, 52269, 28849, -14915, -40580, -24174, 7500, 1935, -35169, -29401, -8369, -19279, -41515, -2484, 33918, 44039, 40360, 67198, 37839, 10246, 4999, 1514, -40124, -9625, 18781, 8389, -25118, -10454, 18026, 27465, 11208, -20727, -19769, 5591, 9518, 6740, 13723, 23327, 36081, 13424, -5153, 4983, 4366, 5652, 34222, 34794, 34611, 47428]
16464D7428j9961j2668m138j7248j3407M661K2289J3452l5321o7708l7381L7475
16452h2527J5690k3659J3016J0168J2992J517j7902J1452M1548j1701K611k302
16440b9097K287k6560M4495K7063J8981k4471l9169o314K3124K3286M1770J0835
16428F6230j4934l2536l8823o225K6990o027J1922L1843L7798K3160J5679k0703
16416I4374l5479n5587m0899M6757J6956k5570k3698k2447N4365J9664m5660j9060
16404c6284j1953k1893l3224J6397M6433J5406o796n05Q298K5841Q911K1435j4817
16391A7249j2595q432k839k1136j4437M73k1664K7261J9258L9061M287j1279l1310
16378a6103R823j1980N635qL7235L1751L3328n1797p4529M470L7139k7602k9550
$$ y = [47428, 27467, 14799, 10661, -6587, -19994, -15333, 6956, 20408, -14913, -82621, -120002, -82527, -66837, -90496, -77480, -67312, -54320, -52803, -70705, -59253, -17705, -29406, -26795, -29097, -26810, -53370, -8875, 18188, 37169, 12698, -26471, -32785, -9661, 13625, 55395, 66230, 51296, 18760, -20063, -26288, 702, -5325, 6597, 38440, 76238, 99398, 115077, 94374, 58895, 3308, -37591, 9166, 26122, 552, -23146, -45593, 8772, 28436, -17224, -36284, -48237, -70130, -103354, -86957, -40524, -25118, -31914, -32419, -24121, 1720, 10631, 32066, 17249, 4654, -3778, -6617, -27753, -42190, -41717, -63381, -36120, -16862, 22199, 26486, 15207, -16103, -6280, -18260, -12625, -12633, 24602, 56353, 89681, 37884, -36645, -32175, 4964, -22638, -52188]
16365e2188n174k8781N242N1382j896j6585J0765L3694J3198L500K4376j5339
16353B2194l1688j1445n321l4658k5251J4441R557K4742M2180p625P597J940k3380
16340a6717j5676j0792m595L4217r330M073K1326K1176K1170j4580r559j2643
16328H070J2148p393o1344l0527k7540N1286N9099J4625j4437J0028j0498m387
16316h70R257j6963j3844L7487j6116m1439J5773L6726K747J0612L302q269k257
16303A6146k1645k2493K8969j4690k7908J0489K7916K0562O798l0100m055q53
16291a0864N4003J9509k8538k347O56P399l7486k2995R754J9338m375m0626o922
16278d3494n083L9528K9322Q650k0607J325J1290j2356m3965k7008j1522n255
$$ y = [-52188, -57362, -86143, -80901, -29519, -31415, -48000, -37235, -3541, 9657, 13157, 37533, 22194, -9494, -20939, -26260, -60918, -86169, -71728, -62171, -37429, 4751, -2874, 4723, 6663, -16717, -32393, -43185, -47780, -13563, -22893, -18820, 2506, 23682, 44852, 30272, 20713, 8070, 20218, 12825, -48519, -79046, -106586, -55300, 3799, 18424, 3987, 14015, 3517, -870, 8387, -8576, -22420, 15067, -1049, -42488, -26715, 10011, 12758, 23370, 26672, 18403, 16146, -5499, -27992, 977, -13713, -41621, -31132, -3216, 17346, 24144, -5956, -10011, -10864, 43139, 62648, 34110, 31763, 32419, 39818, 2332, -20663, -10909, 8429, 4054, -36572, -43494, -48577, -9049, 20273, 28923, 8316, 9641, 20931, 8575, -35390, -62398, -73920, -79175]
16266g9175J383L6535j480n733J0635M061J0848K712q24L9301j0852l057j3896
16253i542j8231K1899J2103k6892k6981J6969M381Q046Q195j5270R279l8516k8480
16240h3040q756J3557O3126R347m5269l1246L1878l834k8585k1730M2119K8993
16228c3440K1685N393J7398M677k233L2669K5064k9400l6712l9747r723P417p70
16215c7722K8371K5228j4155L0587K44l9468L571K1632o296K2667j380k6712L355
16202I922J9233R338n5928j9284L7596k8235k7572J9284L4776j1873L7126M556
16190B8939j9163P658K8012o779P695M1258n4o6287l7289j5801K4166l415J7086
16177F026R269j0329J9732K6104l3159l9680l768p053k9256J9002L3924j3423
$$ y = [-79175, -77792, -41257, -42737, -48470, -37835, -33774, -22926, -20214, -21038, 18263, 7411, 4354, -9542, -27773, -5874, 6229, -20663, -47644, -30675, -26294, -18248, -10053, -25323, -16044, -54560, -83040, -91796, -78239, -15113, -5766, -51035, -82281, -50403, -54237, -82822, -104552, -62433, -33440, -11755, -6362, 11036, 15713, 13480, 46149, 71213, 41813, 5101, -34646, -44369, -36952, -37722, -9351, 15877, 1722, 32309, 32553, -6915, -3344, 18288, 11992, 34659, 33279, 6567, 9922, 29155, 38493, -17435, -36719, 877, -27358, -54930, -35646, -870, -12743, 24383, 28939, 9776, 17434, 45446, 38667, 46362, 87620, 87566, 21279, -16010, -31811, -7645, -11060, 6026, 15295, 4966, 24698, 50802, 17643, -22037, -25805, -32858, -62114, -43112, -9188, -22611]
16165b2611L7448R159O027k3084k6348j5725M4613j1684n71Q235j2358M3619K2655
16152E9375K1966k6042p009L154k7244n1576r200O1127j6007j5800l8762k1637
16140f7655o414J8338M3789M9565J3561P332k5705m2039k9466M8094J2514r383
16128A2531q982j3787N054j5779j7387m0964k8489M0320L5300L535j1495j7631
16116e7774m997O2600J520J6050j1011m3531O1j9484l169M3249M534k6245l996
16103d2193j0684R977J7245j7465O925O3865M5944r330j8763l3808l045L6601
16091D5269k1569m4379k2086n792j5289K8389J8087O11K6391N985J1558l2873
16079e698m403K8769K0928M947M398L690L759o4484j5170K9778L6539k5676l9493
$$ y = [-22611, 14837, 23996, 30023, 6939, -19409, -35134, 9479, -2205, -2776, 5459, -6899, 36720, 59375, 81341, 55299, 48290, 51444, 24200, -27376, -36576, 24551, 8544, -7256, -46018, -67655, -74069, -55731, -11942, 37623, 51184, 58516, 32811, -9228, -38694, 9400, 21914, 12531, 3549, -10238, -5184, -20963, -38350, -79314, -107803, -67483, -32183, -28648, -40143, -57774, -62771, -171, 1349, 17399, 6388, -37143, -37082, -56566, -59735, -16486, -11952, -38197, -42193, -52877, -42900, -25655, -43120, -36195, 27670, 73614, 64284, 45521, 11713, 8668, 45269, 23700, -20679, -42765, -48557, -63846, -35457, -17370, -16759, 9632, 15617, 27175, -5698, -10101, 18668, 39596, 44543, 48941, 52631, 56390, -8094, -23264, 6514, 43053, 17377, -22116]
16066b2116o815K5608l3911k417J337J5577L8526L2016N665o4087M3686L1509
16054F4578j3445k5065j1519k3831k9233k1881J1604P604J5930j2304K689L3794
16042a079M4479R313m8138n049O731L1340o4938l7376J8715N02N216J5520M0860
16029A6096K2931m8599p015n860J1300k8344J520L190P049K8861M8567j7328n7134
16016b4766k8742M452N2225O2725k3281m6037m1723K4866J3308j1087P919j0226
16004b0367j5517J7615K7120j5963n718N255Q047P65k6321j2031Q282k4056P96
15991e2093K2670J6869J2593k1237k3521K6327O53j978Q359k3245M467P490M021
15978a8625K0765J7151K215j802j7423j7051l666j4966J9471r169j2377n429Q829
$$ y = [-22116, -28931, -3323, -37234, -39651, -38314, -22737, 15789, 47805, 53470, -10617, 33069, 64578, 51133, 26068, 14549, -9282, -38515, -60396, -48792, -41188, -25258, -37562, -34873, -1079, 43400, 52713, 4575, -474, 6257, 37597, -27341, -64717, -46002, -45500, -40284, -24764, 16096, 39027, -9572, -16587, -22447, -11147, -39491, -37971, -34781, -27732, 1129, 49696, 32368, -24766, -53508, -49056, 3169, 65894, 42613, -3424, -45147, -20281, -6973, -18060, -10141, -20367, -35884, -18269, 8851, -7112, -12830, -7575, 472, 1237, -25084, -37115, -28833, -52889, -52093, -29423, -12554, 39, -21198, -44719, -18392, -17739, -19717, -11358, -34603, -30136, -22646, -18625, 2140, 19291, 21506, 19704, 2281, -14770, -18436, -33402, -13931, -23100, -35477, -40906, -32077]
15965c2077J1117P092N322K8477L8437k3383k389L0435k1916l4482k7607O447
15953a4527K1443r070K1804J6657j6502n2329o561J0882m7843k4980J9915M5086
15941c6025M7707J1180m9199m795K7133J7064K1703m393J4593k7179l8046k7309
15929d7566R643j3372o130J1802J629K9341K7977r884m5317n0088j5532M7123
15917f0374M6057N2746J4439K2212r940J8012k44k5321j4762M339k2302o5195
15905d0333J8909K4371L5471K7650J3548j9309K927j8206m5588n2013p346J910
15893e8009l2097K4472K6385K5473m758K3741K9042k0933P426l4642l9499m0812
15881i4211J6941M2282L4425j936n97o445j7028n217J7126O316q822m947J2149
$$ y = [-32077, -20960, -13868, -8546, 19931, 58368, 34985, 32596, 63031, 41115, 6633, -20974, -14527, 6916, -2154, 19650, 36307, 19805, -32524, -39085, -28203, -76046, -101026, -81111, -36025, 11682, 22862, -26337, -31132, -3999, 13065, 34768, 30375, 44968, 17789, -20257, -47566, -37923, -51295, -57425, -45623, -43994, -14653, 13324, 3440, -41877, -91965, -107497, -60374, -14317, 38429, 52868, 75080, 65140, 83152, 82908, 57587, 42825, 47164, 24862, -40333, -21424, 2947, 38418, 66068, 79616, 60307, 63234, 45028, -560, -52573, -59919, -58009, -90106, -65634, -39249, -13776, -18534, 5207, 34249, 13316, 20742, -13900, -53399, -94211, -77270, -34988, -563, -2499, -3096, -9541, -26569, -31786, -14660, -8344, -17166, -22113, -9964]
15868i964J527m6928N963K1779L4801N1478J379J2670j5233l2398j1540k4373
15856a0839k5406K6545N2687j6667P463M031j5702J9651q316k5127K9042K9792
15844F7154k5478o1630k7237n652o0168n54L2471j6780O42N8666N4107J0367M0735
15831F6643J7254k8722J266n2645l8160j1944L746L1668k0362m1316l799K2794
15819e3577N7476K570l4837Q072K4564N710J1676K4945K9776K9339m0648n2741
15807A2325k1224J5991R282J3291l3868J7254j7218q104O421l1874P504r038p812
15794d7070o880M234K8474M0033J447l8040m2237j2134J9150M9192K7795O217
15782C0181k3027K4645J8102k9315l2986j7579l8071N3524M4374J4866N75j0659
$$ y = [-9964, -8437, -55365, -49402, -27623, 7178, 58656, 60035, 72705, 57472, 25074, 13534, -10839, -36245, -9700, 42987, 26320, 33783, 37814, 22112, 41763, 33447, 8320, 37362, 67154, 41676, -19954, -47191, -52843, -113011, -113565, -81094, -97874, -97232, -38566, 15541, 25908, 66643, 83897, 55175, 56441, 3796, -34364, -46308, -42562, -10894, -31256, -72572, -76371, -53577, 3899, 6469, -28368, -20296, 4268, 9978, 21654, 46599, 76375, 105714, 65066, 12325, -8899, 7092, 16374, 29665, -4203, 13051, -4167, -12271, -5850, -37724, -30220, -39258, -47070, -53950, -49716, -21242, 18791, 20238, -17802, -60039, -72173, -53023, -3831, 23964, 30181, 7154, 31799, 49901, 20586, -12400, -29979, -68050, -14526, 29848, 44714, 45289, 34630]
15770C4630R698k1216m1768J3038p846k1527j4889L0448L1374Q470J6390l2925
15758C877n1851O134M5963J0723m6665k2817J788k590m689M7702J0177j1017L6763
15745B3498J3823k4876K2178m616r080N4354Q656o0945k0979N257k3466K8454
15733A2258o348j3882n3128p252N434L3159K2030J4135j063j1532R834k2646j3405
15720c2406l568p087R553K7563p75q093k9695K8636L1463Q866K6209k520n1306
15707c160n2175l033P451l85K0342L2987J3485M17k3214m3094J6050J4062k3637
15694d3904p093R490m238J1120M4589P25j2420K7616J025l528m2138M790L2586
15681A8620Q773k795k039k2852l3201k3001j601M9167l83m3895k0215j6668O176
$$ y = [34630, 44328, 23112, -18656, -5618, -13464, -34991, -49880, -19432, 11942, 20412, 36802, 3877, -47974, -41840, 4123, 14846, -31819, -54636, -52848, -55438, -60127, -12425, -2248, -13265, 23498, 37321, 12445, 34623, 30007, 20927, 75281, 83937, 22992, 2013, 7270, -16196, 12258, 5910, -7972, -61100, -68352, -62918, -29759, -7729, 6406, 5343, -6189, 3645, -19001, -32406, -35974, -43061, -33508, -5945, -6720, -14813, -44508, -15872, 15591, 24457, 50666, 48146, -3160, -55335, -58368, -50917, -51302, -30960, 2027, 15512, 15929, -7285, -50379, -34329, -20267, -43904, -50997, -41507, -45745, -34625, 9964, 10689, -1731, 25885, 26910, 23382, -18756, -13966, 18620, 27393, 24598, 22559, -293, -33494, -56495, -58096, -8929, -9312, -53207, -73422, -90090, -83914]
15668h3914L0860K2437l3257k8740L4192K9702K6333l185l0051j7028N6403J1559
15656A5311l0702k032q723L536n896m0556K936K7842P250J5853k8069l091J0888
15643c5453j6916P541N7441Q806j2797J4863n2461k9365p558Q900L2913K5939
15631A853J6499j617j6837j294N8942L859m5943k4231p219r227j3976Q872m374
15618c4693m0157p820K1263L42J147m412J9708L3705K2728K6450l077k485k0414
15605A2285q76m980j6392p757J296j5288n103j3101j917J1744P821q498K1092
15592a9674J7344K0065k4595K899k7529l7409k717J6027J8598K4244N8258P289
15580E2800k2696j9005J61j8646j6035j3375o066j1735r34J8932J2659J7800J0827
$$ y = [-83914, -53054, -30617, -63874, -92614, -58422, -28720, -2387, -5572, -35623, -52651, 3752, 15311, -15391, -17423, -26146, -22610, -28506, -69062, -66126, -38284, -31034, -15181, -43250, -46341, -35453, -52369, -44828, 12613, 21419, 8622, 23485, -28976, -58341, -65899, -56999, -24086, 1853, 18352, 16735, -102, -1396, 57546, 61405, 15462, -8769, -15988, -25215, -39191, -30319, -34693, -74850, -82670, -61407, -61065, -59918, -64330, -44622, -10917, 11811, 38261, 35184, 32699, 12285, 11409, 6429, -9963, -17720, -16424, -31712, -36815, -49916, -51833, -40089, -32268, -40766, -19674, -2330, 17735, -6860, -3961, -31490, -68899, -71616, -55589, -36991, -12747, 45511, 52800, 30104, 11099, 11260, -7386, -23421, -36796, -42862, -54597, -55531, -36599, -23940, -6140, 4687]
15567D687m956m280J7859N146O281K4985R206k3526k4546j2953k881M775k093
15554b296j5550L5518K6676k7621l9811N4506J5571j6892j5950l0346n134J3515
15542g814J8665j1852k1926n7602l7070M2895n188K3781J6832o579L0790M904
15530a0164r944O0141J9102k6442o2684j2872O320M6217j227j5496j4227j2450
15518c3726R95K4537j3559j2177P684L0225K0434k9238l8393j3093K021j379M210
15505e1459N6291M4073l499q444j3527j0879l1777K6251N3356J5044k6955j7787
15493C0688J2207j9290p0161n135L1219Q456j3899o000J573K552L727M163K0019
15480A19K9490n2758k4639J5016J5654M805N1975K2866j8642j302j4115l0173
$$ y = [4687, -269, -4549, 13310, 18456, 24737, 49722, 58928, 35402, 10856, -2097, -4978, -203, -2296, -17846, 17672, 44348, 16727, -23084, 31422, 46993, 30101, 14151, -16195, -21329, -7814, 10851, -1001, -22927, -80529, -117599, -74704, -79892, -56111, -39279, -45858, -15068, -10164, -20108, 40033, 59135, 32693, -29991, -42863, -36543, 9674, 8447, -7049, -21276, -33726, -32731, -8194, -21753, -33930, -26246, 3979, 24413, -4825, -43218, -56311, -54290, -55669, -51459, 4832, 48905, 45406, 36962, 23435, 12556, -19221, 7030, 60386, 75430, 48475, 30688, 42895, 23605, -46556, -51691, -20472, -12016, -25915, -31915, -30342, -27790, -24063, -19900, 119, 29609, -23149, -47788, -32772, -17118, -12313, 39662, 62528, 43886, 42584, 28469, -1704]
15468a704K2748J5348J5489j2175k9273j1418J4607j5300J550K1077o632k5308
15456a0991k5447K5471p436k6837n089l9638j5012N1926M9125L9008l7687o6825
15444f9432K2278l535j623k5392J1867L0034j331k4053J3231L6189k396j0920
15432b5083K559J2705K8071l6198m7309l8J0124L4949q9k8245p307j5117L1688
15419c9290J7038l0820Q878M8161j6367n2641l5092M3062K4401O4257N3002k4054
15407F0535m6106j1476K2422k1083l4069j6625k9127K419N1662K4473M193R941
15395A7159j3070j2888J7848k909j2625j1265K0558l0041j3379J0345k243r199
15383d1709N4223M6339J0173j0080n017j7529k6763k5401k3453l1093L9456O901
$$ y = [-1704, 21044, 36392, 51881, 39706, 10433, -985, 13622, -1678, -128, 20949, 14317, -10991, -36438, -10967, -18403, -45240, -50329, -89967, -104979, -53053, -3928, 35080, -2607, -69432, -47154, -50689, -52312, -77704, -65837, -35803, -37134, -61187, -47956, -11767, -14163, -25083, -22524, -9819, 18252, -17946, -65255, -65293, -55169, -20220, -20309, -48554, -55861, -70978, -39290, -22252, -53072, -44194, 3967, -12400, -65041, -100133, -57071, -32670, 31587, 84589, 60535, 14429, 2953, 25375, 4292, -29777, -46402, -75529, -73110, -21448, 3025, 7218, 17159, 4089, -8799, 9049, 6140, -6485, -17750, 2808, -27233, -40612, -30267, -32510, -41709, 12514, 58853, 69026, 58946, 53929, 36400, 9637, -15764, -39217, -70310, -30854, -23953]
15371b3953j0315l882K2017l7580j7518j0244K5464O1666O4195M4728M687j7790
15359A01475m2136l7796o466K2017K2122K493J7530N278j5139j0476l5359l5292
15347a1749L4036j2438k6795q074m346n073J7650L9845Q227r397j9959j5700J3291
15334d82n2133j6901M1051P1706L1230j970k0171L1702P57m5851k9541k27J5586
15321B4756n699Q162K9361k1948l0317J7142J7397l8073J588N84m0756m054N09
15308d1348O2383K2559l673J033k8295k0476p928j9740K277n122l833m497J1610
15295c5050j5383K871N846L1827K4206K8690j4057l1553j8022J6012k9919n446
15283c9978l254J5250j4373k107M0253L0357j713m9786l2693M615j023L369Q749
$$ y = [-23953, -34268, -38150, -16133, -53713, -71231, -81475, -56011, 5655, 69850, 114578, 119265, 101475, 59339, 21543, 15077, 37094, 59216, 61709, 79239, 84517, 69378, 58902, 23543, -11749, 22287, 9849, -16946, -25020, -29366, -34439, -16789, 23056, 31283, 21886, 1927, -13773, -482, -52615, -69516, -28465, 43241, 74471, 72501, 52330, 84032, 84789, 38938, 9397, 9170, 24756, 19057, 27219, 56580, 34632, 4315, 21457, 38854, 781, 2369, 2953, -37803, -41857, -41348, 21035, 43594, 39921, 40954, 12659, -7817, -15745, -35485, -33208, -38330, -42163, -46660, -35050, -50433, -47562, -41716, -9889, 14317, 43007, 28950, -2603, -20625, -4613, -34532, -39978, -43232, -27982, -42355, -44462, -4209, 26148, 24435, -25351, -58044, -53429, -54452, -51083, -42334]
15270d2334m221Q783O884J0047M5600L6594J492l3184j1829m3585J0409L430J5299
15257C385j8486j7348j7437o600j1978j4572N456j3048K044q965K0681N1105K2226
15244c537K8381J2095l7343j1046m589N008K7944j1535J2254j0278j5239L5284
15232B7399P407l7617l9835L4584K1107K5652n081J6903J3510m3096J6362k120
15220C5175K2434n857l1692k4482J1428M00k85J1081r649m5261j2270K4159K3144
15207a675K2602K303K5086n989r101L078k3706k8503o161j0354m64K5188Q59J6235
15193I398J2144J4775K2487j0886Q825M6785K6598k2173l6300l104k4076j274
15181D3199K045k1040l5281m9029j0674O2533L6266o0902l2687K3028N7114j9650
$$ y = [-42334, -46555, -37772, -30888, -20841, 24759, 61353, 62845, 29661, 17832, -25753, -15344, -11914, 3385, -15101, -32449, -49886, -56486, -68464, -83036, -77580, -90628, -88584, -97549, -76868, -25763, -3537, 24844, 36939, -404, -11450, -16039, -11031, 16913, 5378, 17632, 7354, -7885, 27399, 34806, -2811, -42646, -8062, 13045, 38697, 33616, 50519, 64029, 20933, 37295, 35175, 57609, 51752, 20060, -4422, 7006, 7406, 7121, 18202, 8553, -36708, -48978, -24819, -1675, 20927, 23230, 48316, 42327, 33226, 36304, 12598, -15905, -22066, -32420, -32884, -7696, -6837, 9398, 21542, 36317, 58804, 47918, 56743, 103528, 130126, 107953, 71653, 68549, 44473, 43199, 45244, 24204, -11077, -60106, -70780, -8247, 28019, -32883, -65570, -42542, 14572, -5078]
15169e078j7207J6457k263k8248k27m462k813n963J2333J7640K5290l3676J4767
15156a3450K1099O91O80M440r802L0086K801k7697Q320L212n8622K2718M1931
15143B6407J0785J0231P249Q155j2742m7001m4221K4972k308m4993R35M750K3210
15130c4571J3485j4007m614K4819j9315J2258K3165k0722j3173j7243l671J6846
15118c6743j860K0433N4045k7239p470K3342K5795l134j2702j5369J8162k3773
15106A3487k3843M2752J0316j1153l1154m6031J1355M0547K9679l911J7275j4915
15094C4404k6131p763k4338k2346K9597L0419J2239K952l9404j1292M305K7201
15082I843L5186J2637j0615m0106k0129p82L4031k2944l8251m314j4352M2066
$$ y = [-5078, -22285, -5828, -8091, -36339, -36566, -41028, -43841, -49804, -37471, -19831, 5459, -28217, -13450, 7649, 8340, 9020, 13460, 3658, 33744, 36545, 8848, 17168, 20380, -38242, -15524, 26407, 37192, 47423, 54672, 62827, 50085, 3084, -41137, -16165, -18473, -63466, -62531, -57781, -34571, -21086, -35093, -39707, -14888, -34203, -21945, 1220, -19502, -32675, -49918, -53589, -36743, -38603, -18170, 35875, 8636, 1166, 24508, 50303, 47169, 34467, 19098, 37260, 13487, -10356, 32396, 42712, 31559, 405, -45626, -34271, 6276, 35955, 32044, 49319, 34404, 8273, 510, -23828, -46174, -16577, 13842, 26081, 29033, -10371, -21663, -17358, 9843, 45029, 57666, 47051, 6945, -13184, -13966, 20065, -2879, -41130, -45444, -59796, -17730]
15070a7730L1711J0288k8016k199M47n355J6217Q0Q11K4434j2762p350l158m707
15056B711k4450l4873K7595m341M8069J6184l3051m6189Q731L2325j0434l3376
15044e1099j7146K3514k1647M697j351K7307M7080J5543m0748m3294j2760L5568
15032c4336L9311Q103p099K8126J8227J3996k2363J3950J1493j9222l5499j2526
15020B161N502J3276L715q789O2862j332n159j3851k1880j8088l5044J3834J1278
15007H485O91j3816J0216j6640P31J2024k5092J028K8045j3044j3186L8039K7878
14994D5359k9037j3590o591j6135j5626M421M5532m556l384j2166j5622l695k8953
14981e4043M5770J1817k681j108k9151J8940M2484N764j7155M8j4785q25J9720
$$ y = [-17730, 13981, 24269, -3747, -5946, -5499, -10854, 5363, 5443, 6254, 30688, 17926, 10576, 7418, 2711, -21739, -56612, -29017, -33358, 14711, 30895, -2156, -48345, -39614, -7289, -17723, -51099, -68245, -44731, -66378, -61681, -63032, -35725, 11355, 26898, -13850, -57144, -69904, -34336, 4975, 13078, 5979, 34105, 52332, 66328, 43965, 57915, 69408, 50186, 14687, 2161, 7663, 20939, 24654, 15865, 78727, 77395, 72236, 58385, 36505, 18417, -16627, -2793, 8485, 9176, -4640, 5576, -11064, -10333, 1691, -23401, -22373, 5672, -7372, -20558, 17481, 45359, 16322, 2732, -3859, -19994, -35620, -31199, 14333, 9777, 6393, -5773, -21395, -25090, -54043, -8273, 3544, 863, -245, -29396, -10456, 32028, 37792, 20637, 20685, 5900, 5075, 24795]
14968B4795k2474m1033l004J7672J3645k157K1694j2746j7217K3860j1421p841
14956a6227J5503O93J666O125n49n8821q378K5378L9081L9809K193k6363k7231
14943g121k0239o778O149O580K0278J2299j1320j3669n071K5279M4119N49J1096
14930F2151j3576j0978j311q049m1883j2346Q731O077J7641j5354n45O519p929
14917a0852K3359L5554L033k1698J742p126p754J507O619m172n3095M58Q20m487
14903c6092r822J5011K0217k001m4823l134L4778M133n3914j0079K6177L4874
14891b4675j7382M4276J6871J017j6317k7100o792j9730L7520J3539k9303K3555
14879d521L4233K921o766j0059L744J6920K2649J094m4846j2780l3787N201r468
$$ y = [24795, 2321, -38712, -41716, -24044, -10399, -12556, 9138, -3608, -20825, 3035, -8386, -16227, -724, -31, 1635, 7760, 7211, -51610, -59988, -34610, 4471, 44280, 46473, 20110, -7121, -27360, -34138, -27989, -21409, -1131, 11168, -152, -13821, -18892, 6387, 50506, 51055, 62151, 48575, 37597, 36286, 28237, -13646, -25992, -17261, -11184, 6457, -8897, -9442, -2923, -10852, 12507, 48061, 51094, 29396, 31138, 24012, 16258, 17765, 24384, 20212, -32883, -32425, -31605, -36092, -45914, -30903, -10686, -12687, -57510, -60644, -25866, -21733, -75647, -85726, -59549, -24675, -42057, 2219, 19090, 20107, 3790, -23310, -30102, -49832, -12312, 1227, -28076, -4521, 29712, 32633, 25867, 15808, 19552, 36472, 59121, 60215, 15369, 2589, -31198, -25997, -35465]
14866c5465K8616J5523J621N914l1316k9449k7201k1072L113J6735J2286m825
14854f5520n048k7527L8815M6758O599R459L1148K0283j0872l4695K176J3832
14842B5408j9740l6602J0354J3708L2043J1326k1594j9077o055j2120L956p970
14830b6363p803J2370K4804N712P904l907O846K5473l985m1218M46J9915L1026
14817E1220m317R337r982j3493k2625l579K4926J0055j7733K461k0184j8112l3982
14804d6008l2141N711N2856j3209L3N059K8307P611j2067l1608n73L3817L5955
14791C3743n6009j099K7045p670m3997l0561k5448N754M1283J9855K9412J1009
14779C317J5365m807o413n436k4816k0836L9367J3845K501O3739L262j5595q766
$$ y = [-35465, -6849, 8674, 10295, 16209, -15107, -44556, -71757, -92829, -89716, -72981, -60695, -65520, -70568, -98095, -59280, -12522, -5923, 3536, 34684, 54967, 44095, 9400, 11576, 25408, 5668, -30934, -20580, -6872, 25171, 36497, 14903, -4174, -10229, -22349, -18393, -26363, -34166, -21796, 3008, 8720, 16624, 12717, 19563, 45036, 41051, -167, 279, 20194, 51220, 46903, 56240, 46258, 32765, 10140, 6561, 31487, 41542, 23809, 26270, 6086, -12026, -46008, -78149, -72438, -19582, -32791, -32758, -27699, 608, 8219, -3848, -35456, -36029, -2212, 33743, -22266, -23365, 3680, -3990, -47987, -78548, -103996, -98242, -56959, -37104, -7692, 3317, 18682, 13875, 7462, 2026, -22790, -43626, -4259, 9586, 12087, 75826, 79088, 63493, 54727]
14766E4727r20j2880J6465J4166l1138k1132j1661j3391J8507J1741l9899J923
14754a3492k3189Q707L5635J1749r361K0045L3359m1718m1750j4325L6753k2230
14742a9817m467M3746K4607j3154l4644Q970p298r268L147j2223J2305J3750J0077
14729A5731L364j5868k822P082Q243J551k1007j584J1794J8682J0268K2813n5271
14716B976J0031q072n3530k0285N5708K7995L785m871o8546l6K3723N732K3294
14703b096m8214J6996K9882J9581j6649k6496j3366K5930J2712m8400j0064J6599
14691d3585Q066j2044L4083L4687j579k5497p012m221O533J4192j5124k5219j9177
14678e5897K8352k226o3619O502L6111K5071p648L3248J495j6168j4186J09l1944
$$ y = [54727, 53807, 40927, 57392, 71558, 40420, 19288, 7627, -5764, 12743, 24484, -15415, -13492, -36681, -27974, 7661, 19410, 10049, 30094, 63453, 21735, -20015, -34340, 2413, -19817, -24284, 19462, 44069, 30915, -3729, 5241, -2057, -11325, -8178, -20401, -8096, 5654, 15731, 19095, 3227, 405, 7487, 15730, 17281, -3726, -5310, 6484, 25166, 35434, 58247, 2976, 13007, 4935, -48595, -68880, -13172, 14823, 18608, 13737, -54809, -54845, -31122, -25390, -2096, -50310, -33314, -3432, 16149, -500, -26996, -40362, -14432, -1720, -50120, -60184, -43585, -35519, -47563, -13480, 21207, 19628, -5869, -12881, -17102, -10569, 3623, -11501, -36720, -55897, -27545, -29771, -93390, -86888, -50777, -25706, -33354, -106, 1389, -14779, -28965, -28856, -60800]
14665f0800L029P532l2835l4167K6875L9242m001M2752L5508o531Q075j8738q55
14652E086J7457j1143J4013J9685q908n834p8332j9242j1603K6214K2340L3444
14640C177K556k5604k8589P117j7940J3613J317L916j22J5191J9315J8888J4288
14627B7123J2454O051l2703j2389k5510l8904L4460K8938L5394j4201k3397j2106
14615a4790o405K2058K1807K8878k4657m712j4998n8649k2928L1794K9202o537
14603a9937J4723j1260l2389L5882M1870J4566Q803l6535j5124J4889J8585L8231
14591G2304Q114J2482k1569Q131J1838k3980n3200j8756K750j3224r186p24J0029
14578a4991j536J9179N577j448j5594k382J4710M1054Q65K963J3671k0470m7167
$$ y = [-60800, -57771, -50239, -83074, -117241, -90366, -51124, -55125, -12373, 23135, 16604, 24679, 5941, 5086, 22543, 11400, 25413, 45098, 36190, 30356, -47976, -67218, -78821, -52607, -30267, 3177, 5733, -19871, -48460, -41343, -59283, -45670, -44353, -40437, -40559, -25368, -6053, 12835, 27123, 39577, 45628, 12925, 536, -24974, -63878, -29418, -480, 34914, 20713, -2684, -14790, -21195, 863, 22670, 51548, 26891, 22179, 7181, -51468, -74396, -42602, -13400, -19937, -5214, -16474, -48863, -12981, 28889, 43455, 52258, 15723, 599, 15488, 34073, 72304, 80418, 92900, 71331, 79462, 91300, 67320, 14120, -4636, -1886, -15110, -24296, -25020, -14991, -16527, 2652, 8229, 6781, -8813, -11195, 3515, 44569, 45434, 48397, 62068, 41598, -5569]
14565e569k8188J2023j1105l2994L3361L7753n0353P513j5932m0515K7229L2719
14553c4058M1224P953k2334j021O802m40K0007j8447L017l0346j1960l599k5975
14540f9177j780J0190L7425Q476k8848j5414O4099J9185n4119k7107J2848J2486
14528c1736k1241K8827K6667K3989L4676j9720n1885P406K3604o385p768l8614
14516c2180J603J342J6253M8396M6058k6956n5840j8012J9618j2474K2262L6339
14504D6409k5619k3149l30K4994j4689k5128K1226K8182l5247L2577K9270k2470
14492C6026n5288j9000Q335o172K2248j3981j4033j1061O3303J4943l9427O661
14480g446J5957m418O507j0165J9477n871j3133K772M4097M6759j5490j5920m2963
$$ y = [-5569, -33757, -21734, -32839, -65833, -32472, 5281, -45072, -37559, -53491, -94006, -66777, -34058, 7166, 15119, -7215, -8236, -1434, -1874, 18133, -314, 2703, -27643, -39603, -43202, -69177, -70957, -60767, -23342, -14866, -43714, -59128, 4971, 24156, -29963, -57070, -44222, -31736, -52977, -24150, 2517, 26506, 61182, 41462, -10423, -3017, 20587, 14202, 6434, -32180, -30577, -29235, -12982, 35414, 81472, 54516, -1324, -19336, 282, -12192, 10070, 46409, 20790, -2359, -2689, 22305, 7616, -17512, 3714, 31896, -3351, 29226, 58496, 36026, -19262, -38262, -29927, -36099, -13851, -27832, -41865, -52926, 10377, 25320, -14107, -7446, 8511, 4093, 10600, 435, 19912, 14041, 908, 3680, 47777, 94536, 79046, 63126, 20163]
14467B0163k4595j0237J3343L1355j8149j3432J1975J7097K3061j454k833l8554
14455G740l0417j5977K5784l4727q857q145j3467N0845Q758J1747k0637K4244
14443c109j8859p917j0993k7350m6770M6102P8608K5486N754K4721k9702j9705
14431A6266n147K2208J8388J2352l4768l2381k6549J7371L4315J4958K0848P143
14419F5004j5267k6283k675j193J64l0643J2235l833J7338J7564L3675j2378l0193
14406B3515J2188j0025l5912k6552J4662m873n4584J3764N6278L9808k5216l6146
14394c3093k3933o538K4854O1295M577m234L134J9713L3115j2901n0544l9432
14382b3987M1710R247j3905j5617K5058L1860L1096P090m23m3818n9446J6210
$$ y = [20163, -4432, -14669, -1326, 30029, 11880, -1552, 10423, 27520, 50581, 49127, 46294, 7740, -22677, -38654, -12870, -47597, -56454, -64599, -78066, -27221, -18463, -6716, -27353, -3109, -21968, -29885, -40878, -68228, -114998, -68896, 9712, 35198, 40952, 65673, 35971, 16266, 11119, 33327, 51715, 64067, 29299, -3082, -29631, -12260, 22055, 37013, 57861, 65004, 49737, 23454, 20779, 19586, 19750, -10893, 1342, -2491, 14847, 32411, 66086, 53708, 23515, 35703, 25678, -10234, -36786, -22124, -26997, -81581, -67817, -11539, 28269, 3053, -33093, -57026, -63564, -38710, 22585, 27162, 22928, 26062, 45775, 78890, 65989, 15445, -23987, 17723, 26970, 13065, -2552, 22506, 54366, 85462, 92552, 92129, 48311, -11135, 5075]
14370E075M391N044J8796K0070p705k3584j6990o698m928m814K8654J447O386
14357B5144k401j2633J5417J7168k6661k9242k3451J0473M2701K1664p811k869
14345B7499j6913n4877k486K4590J9237K29p168J296m952K9229j0299K8524L2281
14332F6190P368k201k1833j0511j6845k3205K830L3086L1244j0450k3481j9882
14320A2310J3062K0115o083k6943l0549p262J7076J6697k7167J4799M7697J6595
14308F0347l6805l6117R533j8957n0433R26O9813K0031n8808J1314P4643J4450
14296E9937k7916J6944n9258j0971K3978O999n303L864l6131l5948K4632L0798
14284h375j7650N2215l1648o871J2329K4909L1643l6335N170L1462n088l2963
$$ y = [5075, 9466, 14510, 33306, 53376, 45671, 22087, 5097, -1601, -6529, -11343, 17311, 18758, 25144, 22743, 10110, 25527, 42695, 16034, -13208, -36659, -26186, 16515, 38179, 30368, 27499, 10586, -44291, -46777, -22187, -2950, -2721, -9889, -8593, -13545, 15684, 5385, 33909, 66190, 73558, 71357, 49524, 39013, 22168, -1037, 1793, 34879, 66123, 55673, 32192, 12310, 25372, 45487, 39404, 12461, -18088, -25350, -8274, 8423, -18744, -3945, 43752, 60347, 23542, -12575, -3042, -21999, -72432, -71506, -1693, 18338, -40470, -29156, 45487, 59937, 32021, 48965, -10293, -21264, 2714, 9713, 4410, 8274, -27857, -63805, -39173, -8375, -26025, 26190, -5458, -12329, 0, 24909, 56552, 20217, 25387, 56849, 51761, 18798]
14272A8798l8076q537L2337k7452k0514N3764K9041L0961j4447p975o5784j2166
14260c0050M0986k1884k4895J7673k502M521K4153J684J809J6742l5007j9847
14248b6617K8856j1251j8810K5433M058j7216N05J6598L0690L635J893p424l726
14235B6624N266K2365J8225m1217k0184k6054j8889K107k1845P7333N6826r08
14223G9649N407q612l6537J4297L617J4490n2989j4321J7346K5735q667q683M1158
14210G1890k596j9746l8566j7641J0740J0281J0073L5697K0136k3087n1668k1416
14198a5903M836R454k657K8364K415k1075q726k7357J2285M0964J9035l6784k4554
14185a9703J3677j2969j4837j2591k0898j787L6078K7973K7500K7411K610k0008
$$ y = [18798, -19278, -27815, 4522, -22930, -43444, 10320, 39361, 70322, 55875, 47900, -17884, -30050, 10936, -10948, -35843, -18170, -20672, -16151, 8002, 9686, 11495, 28237, -6770, -26617, 2239, -9012, -27822, -2389, 1669, -15547, -15042, 1556, 32246, 35881, 37774, 30350, 26624, 31890, 54255, 72480, 31263, 11079, -14975, -33864, -31757, -53602, 23731, 80557, 79649, 85056, 76444, 39907, 54204, 57821, 72311, 19322, 5001, 22347, 48082, 39415, 30732, 71890, 69294, 49548, 10982, -6659, 4081, 14362, 24435, 60132, 80268, 57181, 5513, -15903, -11067, -1613, -4270, 24094, 26509, 5434, -3292, -30649, -18364, 22600, 41635, 4851, -19703, -6026, -18995, -33832, -46423, -67321, -69108, -33030, -5057, 22443, 49854, 52464, 32456]
14173C2456J1936J6644m1715l4337K432J4037K939l6256K876N7422J8656o895
14161D0195j6759n4091k4375K7463J1467J753p786K390p865N8970L7936k4965
14149D4333K354n107J7189k8625q1061k378j2222K6888K8854m0598j6263k2573
14137h9209J0803K7207N305L8227K3397l3936m3706j0096M8537K8768J0643m851
14125A1089k2455J0000k95L1635R395p5J1615j2856k9497k7298j9267l3665M906
14112f6768J3962r934k987K4677M0114M3533J8482n0339n401R8406K9334p7734
14100E5345q1555R41J4351K8247K3772O623O3326j7018l3889p575K3017n9m529
14087G0997n9103l1962J882j8103j1031j3892P117J38k1985K9935q532J4448J8563
$$ y = [32456, 44392, 61036, 19321, -15016, -12584, 1453, 4392, -31864, -28988, 28434, 47090, 40195, 23436, -30655, -55030, -27567, -16100, -14347, -22133, -19743, -27608, 31362, 69298, 44333, 46687, 41580, 58769, 30144, -50917, -53295, -65517, -38629, -9775, -50373, -66636, -89209, -78406, -51199, -45894, -7667, 15730, -18206, -61912, -72008, -23471, 5297, 15940, 11089, -11366, -1366, -1661, 29974, 39369, 39294, 50909, 38053, 8556, -18742, -38009, -71674, -66768, -52806, -62740, -65727, -41050, -936, 42597, 61079, 10740, 5339, 103745, 133079, 55345, -26210, -25269, -10918, 17329, 41101, 47724, 111050, 94032, 60143, 52568, 75585, 75526, 70997, 11894, -20068, -18186, -36289, -47320, -61212, -54095, -53957, -75942, -46007, -54539, -40091, -21528]
14074b1528j1656j6369J4229J0439J6557M1807n248l7270k061p12j1319K7786
14062D655J9671j9503m6287p707K4297r482M706J3673l4220m1342K4787M1622
14050b5130o526n074L7849J9732j9560N101J0234K4611K3914m0522Q77j5694n1847
14037d2035o078K8667L1932K709j220j2425k4891Q994P477J701K9031J844l0305
14024d599k6590n424K8322m5286O899K8032J4468l6971N314O0510R421j001k7807
14011E288k9112m440j5467j4072M5562j1487j7872l921L681K4233k1959l25K3467
13998a6424K4554K0019K7084l3372o811m1495K605J1739L1381j3512j156Q952
13986A3564k3483k162N297J2000N943K166j8562n4002M9279L3557J9818k3616
$$ y = [-21528, -33184, -49553, -35324, -24885, -8328, 33479, 28231, -9039, -11100, -11812, -23131, 4655, 24326, 4823, -41464, -49171, -24874, -34356, -29650, -15977, -50197, -91539, -66752, -25130, -31656, -36730, 1119, 20851, 1291, 6392, 16626, 41237, 65151, 24629, 25506, 9812, -42035, -48113, -19446, 12486, 15195, 13975, 1550, -23341, -14347, -6870, -5169, 23862, 25706, -4599, -31189, -36613, -8291, -53577, -46678, -18646, -4178, -41149, -35835, 24675, 34096, 33095, 5288, -23824, -28264, -43731, -57803, -12241, -23728, -41600, -45521, -41840, -17607, -39566, -39891, -16424, 8130, 28149, 55233, 21861, 15050, -26445, -23840, -12101, 19280, 5768, 4612, 13564, -9919, -12081, -6784, 5216, 11159, 13325, -5237, -59239, -9960, 23597, 43415, 19799]
13974A9799j9233J4166m283l618N671j0050q886l3628R914J4172J1157k5080J7703
13961a2196M9079k1769o9370m7774L7585j5979m0459K8729M7446N28j0049J8247
13949c5982M7284J2242J613L704J145n1520j7249L5887k9155k8477L927K7455
13937b9126M330O360j25J1769K6542J104L7174J6905k752k6905k0731l8777k0500
13924c4732o472M237J1414J7502q595k2140l5189o286J821J3320J4097J9943J0732
13911b0348K2852K5806j5407n490k0276k4321L2071K9712k8044L5600P731j5261
13899B4625m2646J2396L5753J6454j7938p454j0153k9210o0140j602N2353O497
13887b1065l662K3286L0219j7525j3093l057Q594L07k0171J9494K1288n46j4276
$$ y = [19799, 566, 14732, 10449, 6831, 12502, 2452, -6434, -40062, -30148, -15976, -4819, -29899, -12196, 36883, 15114, -54256, -102030, -64445, -80424, -120883, -92154, -44708, -44180, -54229, -35982, 11302, 23544, 25157, 28861, 30006, -21514, -38763, -2876, -32031, -60508, -56581, -29126, -24796, -18436, -18561, -6792, 19750, 20854, 58028, 74933, 72181, 45276, 24545, -14232, -34732, -41204, -36967, -25553, -8051, -16646, -38786, -73975, -80261, -78440, -65120, -51023, -31080, -20348, 2504, 28310, 12903, 7413, -12863, -37184, -5113, 24599, -3445, 32155, 39886, 24625, -18021, -5625, 30128, 46582, 28644, 21190, 11037, -18173, -78313, -79915, -27562, -21065, -24727, -1441, 28778, 11253, -1840, -4897, 3697, 4004, -16167, 3327, 24615, 24069, 9793]
13874I793k2008K8571K7227k9652m5152J5264K3046K2574l6509l9802k1715R175
13862e9188J9074o189k6168R983K4579o485K2876L2515k6648o71L9260q023k0441
13849e526l2122r529n602N8148M0687j4346J088k745n3726m8046R715j4446l981
13836h0431k6414m303L2235N3657L0484M6118k1075k6256j5218l822J2552M7029
13824D4556j1062m5721k7437j7740K5694K2810O933k0172r949J3809o60r724J2822
13811a5841J9510m993n088Q568R565m026K173k1612l604l8769n986n649N96J4169
13797e0987j5566j8728N1997R670O23Q732k3877j9461K0502M0126j0181r421J8420
13784A849K605l774n845l881k7090k809J5358j9794J2244L6695q722P705j745
$$ y = [9793, -12215, 16356, 43583, 13931, -31221, -15957, 7089, 29663, -6846, -46648, -68363, -59188, -40114, -46303, -72471, -62488, -37909, -44394, -21518, 10997, -15651, -16322, 22938, 14915, -5526, -37648, -47177, -52779, 5369, 46056, 31710, 32798, 30053, -23673, -71719, -62004, -76450, -80431, -106845, -111148, -78913, -25256, 5228, 51346, 30271, 4015, -11203, -15025, -2473, 44556, 33494, -12227, -39664, -57404, -31710, -8900, -1967, -22139, -32088, -18279, -18939, -28663, -15841, 3669, -1324, -6412, 2156, 11721, 7695, 9868, -11744, -15348, -54117, -60103, -65752, -65156, -50987, -66553, -85281, -33284, -23614, -22991, -14259, -38136, -57597, -37095, 3031, -7150, -16571, 1849, 4454, 680, -5165, -9046, -36136, -38945, -23587, -43381, -31137, 5558, -3164, 4541, 2796]
13771B796J0268q093j8381k1493j8947j6631K6997R188j6368J8871L5066K6066
13759B9339O14m72J3212j0783p072J2055K5694j3759n4313J4089j9321j4742n623
13746c1082k5531K6649M2871M407l5478J6075L5418q155K156j0512K9930k82j1147
13733C5319j6874j249J1063k9804j8273O434k2890O130P744M5887j9391j6238
13721a2142J5115R663J9129n6075q873L2031j6428j8213L2734k8782J8761L6851
13709B3771J5120L260j7417n5733m6755O182J0269R811K4079K9559O0384L0680
13697I3210k7389k4368O248m954L1881k8102k5097j9450n2538k8432M0142P7764
13685C8915l9216J6815L4508P835j0184Q602K804r534m7723l4493j2852j2297
$$ y = [2796, 13064, 4971, -13410, -34903, -53850, -70481, -43484, -34296, -50664, -31793, 3273, 29339, 29953, 29481, 42693, 31910, 24838, 36893, 62587, 48828, -5485, 8604, -10717, -25459, -31082, -56613, -29964, 12907, 17314, -18164, -2089, 33329, 25174, 27330, 16818, 46748, 46466, 35319, 18445, 17196, 28259, -1545, -19818, -13384, -36274, -30144, -22400, 23487, 4096, -12142, 2973, 12636, 31765, -24310, -33183, -1152, -17580, -35793, -3059, -31841, -13080, 23771, 38891, 42151, 24734, -30999, -77754, -71572, -61303, -51492, -27413, 2146, 62530, 93210, 65821, 41453, 47701, 42747, 74628, 46526, 21429, 1979, -50559, -78991, -38849, 38915, -301, 16514, 51022, 58857, 48673, 57275, 60079, 50545, 2822, -31671, -44523, -56820]
13673e6820L2952K3481Q793m6538q849J0797L6678p559r361L4455j781K0266j8552
13660A7962n180k545k5440j0167K94r209J7420K3422J707m5765K4632K5201k826
13647I506k3727l4038r627j3807o376O1568n184m1696K2959P921J7234k6509k0163
13634f1939L161q222n024j3426K661L6896K5659P414O510K3074j8979J2768J1037
13621B1590l0756o986K8189K4663k4403j3858M2597J04m9070Q618J028R840J3743
13608B5299k9576m7955l5763K9572J3692n421k1658j5935K5103M0880M69J896
13596a9397J9782K2955k1210J2878K9902k0924N127j8110R141J2666n3748l4478
13584e5416K7809K0924k9985L5504M347l1112j0893L5740M7548l8326j4328M5446
$$ y = [-56820, -23868, -387, 8406, -38132, -46981, -36184, 494, -7065, -16426, 18029, 16248, 36514, 17962, 12782, 10237, -15203, -25370, -25076, -34285, -16865, 6557, 8264, -37501, -12869, 12332, 9506, -14221, -48259, -57886, -71693, -78069, -16501, -21685, -63381, -40422, -32501, -15267, -41776, -61939, -58778, -67000, -72024, -85450, -82789, -45893, -20234, -12820, -6310, 16764, -2215, 10553, 21590, -9166, -16152, 12037, 36700, 12297, -1561, 41036, 41140, -7930, 688, 1716, 11556, 25299, -4277, -52232, -87995, -58423, -44731, -50152, -71810, -87745, -62642, -21762, -21293, -19397, 385, 23340, 2130, 15008, 44910, 23986, 29113, 11003, 20144, 32810, -20938, -55416, -27607, -6683, -36668, -1164, 3183, -27929, -38822, -3082, 44466, 6140, -8188, 37258]
13572C7258J5311k2069m2896M179K1988N692q622j2849J2368N259R060o2j5353
13559I264K920j9890j3289K88R213p399k0601k285L8032l2219J4760K1854j9496
13546a8848K5417q490k6117M600L4720O389j1021l2078J2976J0368M260k200K7815
13533B7791K0903k4255n630j197L68k8360k8921J819k232o896J3669l493l679
13520d0113J8558j0183l0111K017Q776l203O190O5341N6256M39j788j8158l6301
13507A7720J1443J1036J1191j6752R045j6288j6428P925J5888K597j3704R361
13495C3034J7370j2085l4728K437K677J470J0955M084J3857j5151Q322P98J6483
13482D9523o467k045J8198k2125j1216J4704l199k2863l3809l0640N2062M1091
$$ y = [37258, 52569, 30500, -12396, -8217, 13771, 19463, 10841, -2008, 10360, 15619, 24679, 24617, 9264, 12184, -7706, -20995, -20707, -11494, -18893, -39494, -41779, -3747, -35966, -21206, 648, -18848, 6569, -1921, -28038, -23438, 11282, 17671, 6650, -25428, -12452, -2084, 2176, -24, 27791, 48694, 24439, 18809, 17612, 17980, -10380, -39301, -37482, -39714, -46610, -32941, -36434, -40113, -21555, -31738, -61849, -59832, -51056, -54259, -48069, 17272, 73528, 73967, 72179, 54021, 17720, 29163, 40199, 51390, 34638, 43683, 27395, 10967, 18892, 34780, 37377, 23673, 33034, 50404, 38319, 3591, 6028, 8705, 10175, 21130, 25214, 39071, 23920, 32242, 33040, 49523, 43056, 41011, 59209, 37084, 25868, 40572, 37373, 14510, -19299, -49939, 2123, 43214]
13470D3214j1701L0973k6759j4352K1777n0592m0824J3133K1902P240K8828J7315
13458D0154l2455l68J5562L2316M1384k5722l5078r036k3302q878L4049J7196
13446D5822j3786j2773l19j1657l5617K5656K962l3378M393J570q823R47R932
13433b5071L7254J1523j9308O951n388p2562o704K6798J7518K2502O829m3569
13421d3227J1525j1225J1787K4826k235j3664m5138k0903q133K4207P2904M2325
13409D3049j7686J5139j9626j4912J6509p81L156m2850j0348j0156J2767R572
13397a6167N8184R698j0308o200J1664L4692j2733j8111J1144P059m5975n351
13385A7596O936J6010J2728m5831p51R096j9669J1701n66K912M656l2424K0715
$$ y = [43214, 31513, 62486, 35727, 21375, 43152, -7440, -48264, -35131, -13229, -5989, 22839, 40154, 7699, 7331, 22893, 55209, 96593, 70871, 35793, 26757, 3455, -5423, 28626, 45822, 32036, 19263, 18944, 7287, -28330, -2674, 288, -33090, -28697, -27127, -35950, -35003, -25071, 12183, 23706, 4398, 11349, 5961, -66601, -73305, -46507, -28989, -6487, 342, -43227, -31702, -42927, -31140, -6314, -8549, -22213, -67351, -88254, -96387, -72180, 724, 43049, 25363, 40502, 20876, 5964, 22473, 21692, 24848, -18002, -28350, -38506, -25739, -16167, 42017, 51715, 41407, 35207, 46871, 81563, 68830, 50719, 61863, 68922, 22947, 17596, 24532, 40542, 53270, 7439, 6688, 15784, -3885, 7816, 7250, 10162, 14818, -17606, 3109]
13372C109M3984Q960n602l826M956Q123j4884j1121k1110O375l2434l64l1370
13359d5204l705L0799p58J1740j1500K0043J3961j3913k6198K1698J8258L0161
13347D5382K557j5819n494Q260N951j1758j8051j8838j4872J700K9674M7184r818
13334D6058k6551l0765p992j5726R836J6232J7568J9283j8135K0537J3304l8748
13322D901k4819l5592j3205k0945L1365N0361J6367L1090k0387k2688J6007l482
13310H973K6963l670l0801k8154r491k77k7992N817M6452J0652O064L1100P126
13297D2762n750l220q90m8172k8785k1549J9018K8079K5444J4324L5176m741k2012
13284B9684k5241j9598j6565j8403O733m020J0597K5788J673J6752J0767m4700
$$ y = [3109, 47093, 56053, 50451, 46625, 51581, 59704, 44820, 33699, 12589, 18964, -13470, -13834, -45204, -48909, -18110, -18868, -7128, -18628, 1415, 15376, 1463, -24735, -3037, 15221, 45382, 47939, 32120, 26626, 34886, 40837, 29079, 11028, -7810, -22682, -20982, 8692, 55876, 46058, 19507, -11258, -19250, -34976, -25140, -8908, 8660, 27943, 9808, 30345, 43649, 4901, -19918, -55510, -68715, -89660, -58295, -7934, 8433, 39523, 19136, -3552, 12455, 8973, 35936, 32266, 1465, -26689, -36180, -36457, -64449, -58632, -12180, -1528, 4536, 35636, 42762, 37012, 33792, 32902, -15270, -44055, -65604, -46586, -18507, 6937, 21261, 56437, 51696, 29684, 4443, -15155, -31720, -50123, -43390, -47410, -36813, -11025, -9352, 7400, 18167, -26533]
13272b6533P776M6682j3466r330J0623o739k9724l421N120J9282K20J6670N426
13259B2586k0220Q112L2530J8112K5750m0708m1623N052J5080M368j9440k4961
13247a5362o253J9708j1220K107L4862K4795k8943k0K2323j7766Q47o893k513
13234A5672L045J3577M778m4952N936L0874J0189j1033l1076k8887k6208k2349
13222h0434J2491M3733k5356r60P416k1017q734j5319j5059L9900K8286k1396
13210e6449l1097L0730M5490N095j2177J8355J3297j6167l937M8661J0470m1356
13198A0915j8637J1237m3485k795O1088j1752J7577P773l034k1987J5322j7947
13186D275j3566j2227k870o464K0358J1086m463J1564k138j1343q055j993J0022
$$ y = [-26533, -18757, 27925, 14459, 5129, 15752, 9013, -20711, -24132, -19012, 270, 490, 17160, 22586, 2366, 10478, 43008, 61120, 86870, 46162, 4539, 9591, 24671, 29039, 9599, -15362, -21615, -1907, -13127, -11020, 23842, 48637, 19694, 19674, 41997, 24231, 25078, 18185, 15672, 18717, 32294, 37072, -7880, -1944, 28930, 39119, 28086, -2990, -31877, -58085, -80434, -67943, -24210, -49566, -50526, -43110, -64127, -72861, -88180, -103239, -63339, -35053, -56449, -87546, -56816, -11326, -6231, -18408, -53, 13244, -2923, -6860, 41801, 52271, 10915, -7722, 3515, -39970, -42765, 18323, 6571, 24148, 31921, 28887, 6900, 22222, 4275, -9291, -21518, -24388, -30852, -10494, 592, -3871, 7693, 5555, -5788, -13843, -15836, -5814]
13173e814Q812N638M263j6527q040j098Q311p062J6797q921r831j6224n322k259
13159c7277O952M108K8931j1942n829m223N155r637K0462j9548j5043O476J2758
13146a8657M6674m5094l6462O2563P984j5509J7085j5458K2052o476q159p551
13134B992n987L8964j1155k5054R860L4628K189Q519N896k4583k8366p051j3976
13121a3124J1362j473m0368o713M1777O223k3001l8623j344L1121N1470M538J1558
13108C3403J267J1461K2653n0915o7475J4316L0001j7064r887K4265R472K4225
13096B5722j2224l0776j213J5165J6116L4577K2115j5475k0650j7164k5258j5435
13084b4500o288N1804J0648M441j7505m920J5167J075j8407J106j7823J0353K8501
$$ y = [-5814, 2998, 8636, 12899, -3628, -11668, -12766, -4455, -11517, 5280, -3641, -13472, -29696, -35018, -37277, -30325, -26217, 2714, -9228, -15057, -19280, -14125, -23762, -3300, -22848, -37891, -31415, -18657, 28017, -17077, -53539, 9024, 17008, 1499, 18584, 3126, 25178, 18702, 10543, 2992, -2995, 35969, 24814, -240, 9620, 44248, 46437, 54956, 60852, 36269, 7903, 852, -13124, -1762, -3235, -43603, -50316, -8539, -2316, -25317, -63940, -65284, -34163, 17307, 21845, 33403, 34670, 46131, 68784, 17869, -49606, -35290, -5289, -22353, -32240, -7975, 1497, 25722, 13498, -17278, -18491, -3326, 12790, 47367, 69482, 54007, 33357, 16193, -9065, -24500, -30788, 21016, 31664, 36105, 18600, 13680, 28847, 29922, 11515, 12621, -5202, 5151, 33652]
13071C3652m160Q164L694j1997K007k0665l9552m958Q481R125M71l389J1665l198
13057a0660J8552o601k2896K2657p194L7497k6485l8098k3282K5101M1116L7041
13045D6748J609k310O961l438r932J1115l0386j3857K8302l0066k8926J6097L0375
13032B2292J0507q573M455q394J1191J5086K1541p716j3389k2786Q353R869o260
13019C6176k6902J1711k0189k2387m04K0858J8697O760k316J841P828L5719J2673
13006H0065k5718n5180O052M1163o318L486K4947M8010j4121k9826m1007o2451
12994c0898l5740J5759k555J7970L0024J8578J2253N844j5102o265M1198J3803
12982F4869N1426L5177n2701p3285k462l557l182m6852O89K0206l3901m013j2787
$$ y = [33652, 29492, 37656, 41350, 29353, 31360, 10695, -28857, -33815, -25334, -16209, -15738, -19127, -7462, -10660, 7892, 1291, -21605, 1052, -6142, 31355, 4870, -33228, -56510, -31409, 9707, 46748, 48357, 46047, 53008, 49570, 39638, 50753, 20367, 6510, 34812, 4746, -24180, -8083, 22292, 32799, 24226, 28681, 20287, 31478, 46564, 68105, 60389, 47000, 24214, 32567, 42436, 36176, 9274, 20985, 796, -21591, -21995, -1137, 17560, 24320, 22004, 23845, 31673, 67392, 80065, 54347, -833, 5219, 46382, 40064, 43550, 68497, 116507, 102386, 72560, 31553, -30898, -66638, -50879, -53434, -35464, -5440, 13138, 25391, 31235, 16133, 9868, 51066, 64869, 116295, 151472, 98771, 25486, 23024, 19467, 16285, -30567, -29878, -9672, -43573, -47586, -60373]
12969f0373K9144M1000J4047K879L1124n808l564J0471l4115J3817O849j3295
12957C2176l9552J6119L5597n857k1677L0747K9826J5268m356j4153l814j4830
12945E5494k364N793j7764J5570K9983J0043K567J1886j2435k1442k9724L2368
12933G9975R193j9780j0999l2334j045k0662M482n808p111L5601J5302l4117k7334
12920a4637J1154M9533J2851J3982k9547P184P442l2323j0484K4457j8162j2932
12908H518J6959j84L8220K8588l4909o962J2303q208r659L6530K4575j4682j6812
12895G4277k0316l1937J6590K0896N864k0920J7026Q230K105J1361j0388k4820
12883D7968R578l1756k5616j9769l052L0440R805K0382J1925Q683o081M2425M7309
$$ y = [-60373, -31229, 9771, 23818, 26697, 57821, 52013, 48449, 58920, 24805, 38622, 45471, 32176, -7376, 8743, 44340, 38483, 16806, 47553, 77379, 92647, 88291, 74138, 70324, 55494, 53130, 58923, 41159, 56729, 86712, 96755, 99322, 111208, 98773, 77331, 47607, 79975, 89168, 69388, 58389, 26055, 25010, 4348, 8830, 3022, -4089, 31512, 46814, 12697, -14637, -3483, 46050, 58901, 72883, 43336, 50520, 57962, 25639, 15155, 39612, 21450, 8518, 25477, 25293, 63513, 92101, 57192, 50230, 62533, 54325, 44666, 81196, 105771, 91089, 74277, 53961, 22024, 38614, 59510, 65374, 44454, 61480, 69710, 71815, 83176, 72788, 47968, 57546, 25790, 174, -19595, -22647, 7793, 17598, 37980, 49905, 58588, 52507, 94932, 142241]
12870A42241k504J0151M4945J4540l0597l6484K02N7122Q9628N7921M6884J37481
12858E31530J79744K00428K32925K43923J22372j05000k38275j92475j19361j26310
12848G29501j16792j08170j13184p6167n2054j5424j4043n0005o2117L728K7216
12837A52489J4204j0710j7269p056l6057m1626j8944o97K9223R630j4199n063
12825E3925K0161Q301p599k9163J850O524j2536J2740J5981q11J6483m5567l5249
12812E040j2804J0089Q79l0879k2048J4503N7263J9231L000J1042j7627l3993
12800C696k0216R776N227Q735J6633L9240l2902q632K744K79L0501j7715k1977
12787A5389K2498J2862j1297K0184M0498J243o789m9051n830P485K4844k0879
$$ y = [142241, 139737, 149888, 194833, 209373, 178776, 142292, 142494, 199616, 289244, 347165, 394049, 531530, 711274, 911702, 1144627, 1388550, 1510922, 1405922, 1167647, 975172, 855811, 729501, 612709, 504539, 391355, 315188, 263134, 247710, 233667, 183662, 121545, 125273, 152489, 166693, 155983, 138714, 131658, 95601, 53975, 35031, 34334, 63557, 73187, 58988, 53925, 74086, 82387, 74788, 45625, 47475, 53999, 41463, 54203, 70184, 69373, 85856, 40289, 5040, -7764, 2325, 3204, -27675, -49723, -35220, 22043, 41274, 44274, 55316, 37689, 3696, -16520, -6744, -1517, 7218, 23851, 63091, 30189, 21557, 24301, 24580, 55081, 37366, 15389, 37887, 50749, 39452, 59636, 100134, 101377, 94588, 45537, 39707, 47192, 72036, 51157]
12775E1157p030m7632j5773O975N448L5850k579L2892M4131O935k4241j405m4201
12762D0527m3159k467j090J1428L0515J8629m537j4337l2723k3255p040J9010
12750h499M875K3278j4679j9390K5670L1539K9834k8681J7109k5348k2928J510
12738A4290j9241j1568k4416K739K1170L9015J3609K0180L2760j5624k4159l6456
12726A2299O014k9645n011m005J9261J0219J9675J472J7389J0410k7552l8268
12714g742M8261j989k9851K346K1250r432K2100j4056J3202L5729N9618O514m7128
12701I8822l1066j4526l1449N1665L3356j4181j0095J040n8319p672K5226O0496
12689A03297j2177n6597R575L0133K0638K3677k0785L82M2416J141m3941O119
$$ y = [51157, 44127, -3505, -19278, -12303, -6855, 28995, 26416, 59308, 103439, 110374, 86133, 84728, 40527, -2632, -5099, -6189, 5239, 35754, 54383, 49846, 35509, 2786, -20469, -27509, -8499, -3624, 19654, 4975, -14415, 11255, 42794, 72628, 43947, 61056, 35708, 12780, 14290, -4951, -16519, -40935, -38196, -17026, 21989, 35598, 55778, 88538, 72914, 48755, 12299, 18313, -11332, -16343, -20348, -1087, 9132, 28807, 30279, 47668, 58078, 30526, -7742, 40519, 38530, 8679, 11025, 32275, 22843, 44943, 30887, 44089, 79818, 139436, 145950, 98822, 67756, 53230, 21781, 73446, 106802, 92621, 82526, 83566, 25247, 17575, 42801, 103297, 91120, 34523, 44098, 74231, 94869, 118546, 97761, 98143, 140559, 141700, 97759, 103878]
12677A03878K4352J840k8721J3924J1797k0865K6209K5233L7339O8021J379p010
12665B57376J8428J9852q686k44q68k3223R6m9188j6375j5296n0029l9017n597
12652H7229M8019J7880q591k3674r658j4357K0782j152K8304o122m5677J0027
12640A03010L442m2303k2401K7255N522k5394P337M1368L06M080n0316k4227J1703
12627C9382N3685Q95k7533m3271M581K7089J5069l6725q538j2399p027J4990L13
12614B0511k2677K1910n702J7369j2440n794j6593J1663j990j7906k7990p51K1014
12601a9376K7200k3167J4533O1192P6765K269m5097k9249l228J7188l4303o4855
12589b0128J1415N8375N8295M9561p861l1161J5250j2468J6046l3486r382m2731
$$ y = [103878, 128230, 130070, 101349, 115273, 127070, 106205, 132414, 157647, 194986, 263007, 264386, 257376, 275804, 295656, 286970, 286726, 285858, 262635, 262731, 213543, 197168, 181872, 131843, 92826, 87229, 135248, 153128, 144537, 120863, 111205, 96848, 117630, 116478, 144782, 138660, 92983, 103010, 106452, 64149, 41748, 69003, 74525, 49131, 56468, 97836, 98142, 102222, 51906, 27679, 39382, 93067, 93962, 66429, 23158, 27739, 54828, 69897, 33172, 24634, 12235, 5208, 20198, 20511, -2166, 19744, 14042, 31411, 18971, 13177, -3416, 8247, 6257, -11649, -39639, -40390, -19376, 7824, -15343, -810, 60382, 137147, 139416, 94319, 65070, 61842, 79030, 44727, -20128, -8713, 49662, 107957, 157518, 149657, 118496, 133746, 121278, 137324, 103838, 94456, 51725]
12577E1725L040j0119k3263Q035L1560O789j9450k6088m4090O316N1402N6343
12565I2200P7532P6241K2348J0223k4932j2086k011K5191N213j512k5800j5038
12553B27569m2703M083L9656K2715K8315k9514J6026O4475L0352P3239O2843O0646
12541E57702P0171M2574L5627L6718j1733n3705j04987m8520K1920L782O601k6810
12529E29340N6101L4798j0814m373o3945p1164l7696k7481m724l968K1232J0354
12517D27660Q450K1304m4974l089J3447L8403K8077j4878q312l4258J6852J0700
12505D59382n01m8153o4503J2625L8931m2879K5588K3197k9700K6028K0487Q067
12493D28569K0372N0052K6463n081k5176M6469P3131M8729L4249l454m671K2123
$$ y = [51725, 54765, 44646, 21383, 29418, 60978, 67767, 48317, 22229, -21861, -15545, 35857, 92200, 169732, 245973, 268321, 278544, 253612, 241526, 239515, 264706, 269919, 268407, 242607, 227569, 184866, 188949, 228605, 251320, 279635, 250121, 266147, 330622, 360974, 434213, 497056, 557702, 627873, 670447, 706074, 742792, 731059, 677354, 572367, 523847, 545767, 549549, 556150, 529340, 585441, 620239, 609425, 605052, 541107, 469943, 432247, 404766, 400042, 396074, 417306, 427660, 436110, 457414, 412440, 409351, 422798, 461201, 489278, 474400, 466088, 431830, 448682, 459382, 458881, 410728, 346225, 358850, 397781, 354902, 380490, 403687, 373987, 400015, 420502, 428569, 448941, 498993, 525456, 520375, 495199, 541668, 614799, 663528, 697777, 694323, 689652, 711775]
12481G11775K8905K8088J4470k7070N851K8040K259K1947k339J4791J8308K3833
12469H68858M1878M1536M6163O7392M0752N8338N6425M9355N3509L8466M3734
12458A406406P7356J4032K1575N3556N9792R1390J17374Q5195P9932R5478J06278
12447B208364J35003J95103K13563K12022K05690J69945K30404K80830K82474
12438D133398L02836L52582M18126M58462M48119N20986O13495P42481Q74923
12429H865408J041842J205398J437663J684093K008729K470481L074513M019893
12421B5808020N217933O880435R167544J2163375J6695162K3732666L4333041
12414A33998176M8445675O2193616N8075319J1382967m0084247n6089068n0195239
$$ y = [711775, 740680, 768768, 783238, 756168, 762019, 790059, 792318, 814265, 811926, 826717, 845025, 868858, 910736, 952272, 998435, 1065827, 1106579, 1164917, 1221342, 1270697, 1324206, 1362672, 1406406, 1483762, 1497794, 1519369, 1572925, 1632717, 1724107, 1841481, 1926676, 2006608, 2102086, 2208364, 2343367, 2538470, 2752033, 2964055, 3169745, 3339690, 3570094, 3850924, 4133398, 4436234, 4788816, 5206942, 5665404, 6113523, 6634509, 7248004, 7990485, 8865408, 9907250, 11112648, 12550311, 14234404, 16243133, 18713614, 21788127, 25808020, 31025953, 37906388, 47073932, 59237307, 75932469, 99665135, 133998176, 182443851, 244637467, 302712786, 314095753, 274011506, 217922438, 167727199]
12407A67727199l9435792k9070727k1053906j5480351j1822864r274993p305248
12400C4283318n787167m592331l613545k907912k329874j812345j525221j266412
12392A0448511j026834q80114p95092o99659n92644n57264m94346m18998l30915
12383D652645k80227k73246k08630k08000j57561j70735j59526j66398j43610
12374B884712j34481j59013j40343j31947j55220j04466j19102r5392m5810q4348
12364A714590j18826n1830k8440p0003q1010o2421l0959j0539k673o884r804r739
12352A231462o902j838o0245r0579l7646j9140j8170o1967q1114k8484m1216m6844
12340G37317K7240J3247j6727l3203l7948K7779J8934l1667n2119J2755N1925
$$ y = [167727199, 128291407, 99220680, 78166774, 62686423, 50863559, 41588566, 34283318, 28496151, 23903820, 20290275, 17382363, 15052489, 13240144, 11714923, 10448511, 9421677, 8541563, 7746471, 7046812, 6454168, 5896904, 5402558, 4983560, 4652645, 4372418, 4099172, 3890542, 3682542, 3524981, 3354246, 3194720, 3028322, 2884712, 2750231, 2591218, 2450875, 2318928, 2163708, 2059242, 1940140, 1844748, 1798938, 1714590, 1595764, 1543934, 1515494, 1445491, 1364481, 1302060, 1271101, 1260562, 1257889, 1251005, 1241201, 1231462, 1224560, 1222722, 1162477, 1071898, 1034252, 1015112, 996942, 934975, 853861, 825377, 784161, 737317, 764557, 777804, 761077, 727874, 689926, 717705, 736639, 704972, 652853, 665608, 717533]
12329G17533k8188m7418l3449m0614j2677k880l74Q488J2493k6903r484m756j1472
12316E20299K220n482l7061k0201l0132o44J586m000L6993k1376j4998j522j8922
12303D06760n0391k5784J3316N5463L4929k6034j4850L8648k1492n2355k0387
12292C37823J6171k4472j9934K6149M1505M4644K4424J6257J7580M5858K8909
12281E54914j4119m4770m8703J6880j1921k2268m6092k240q371p126k4221m5187
12269B96776m3306m6636m3101M0986R060j0432K8254J8568J9419q175j4098j5688
12257B31627j3999K4711N6750L4758M4778P801r576l8861K9298L0865j4133l8983
12245C45036P983q8m701l5391l5365l5651j972N6893K3602M889j2236m306N2589
$$ y = [717533, 689345, 641927, 608478, 567864, 555187, 552307, 551933, 560421, 572914, 546011, 536527, 531771, 520299, 522519, 517037, 479976, 459775, 429643, 428999, 430585, 426585, 463578, 442202, 427204, 425682, 406760, 356369, 330585, 343901, 399364, 434293, 408259, 393409, 432057, 410565, 358210, 337823, 353994, 329522, 309588, 335737, 377242, 421886, 446310, 462567, 480147, 526005, 554914, 540795, 496025, 447322, 464202, 452281, 430013, 383921, 381681, 373310, 366184, 341963, 296776, 253470, 206834, 163733, 204719, 213779, 203347, 231601, 250169, 269588, 261413, 247315, 231627, 217628, 242339, 299089, 333847, 378625, 386426, 376850, 337989, 367287, 398152, 384019, 345036, 353019, 352931, 348230, 312839, 277474, 241823, 239851, 296744, 320346, 325235, 312999, 308693, 361282]
12232C61282l0675l736j4795j3300R207J2856L184L7917m3000k2278J7395K5041
12220C39098k5018J3153Q5908J8431l2495J8439J323j8241K0750k0428K8k6694
12208C74254r712K1898m473J4819l5885n4881j8960J6246M5414J051k6903j7004
12196C05864R58J4638J6403l2338K2829K6808K2803k7716l3996K7510L4957j9492
12184C59228n3251L7104N8128J4476q720n3746j7095J1702L7977L123K0456l8853
12172C70529p218L4141O368o913k9483k5521K3257L7047k9757j4300J1932K5412
12160C95494o324k5216k3096l5315J0640K2497j0432k3710j123J0774O5087l058
12148C76218l6867j4160J3993k7388J7313J3159k7504m4260j8629K9898N3929
$$ y = [361282, 330607, 326871, 312076, 298776, 307983, 320839, 324023, 361940, 318940, 296662, 314057, 339098, 314080, 327233, 413141, 431572, 399077, 417516, 418839, 400598, 421348, 400920, 400948, 374254, 364542, 386440, 381967, 396786, 360901, 306020, 287060, 303306, 348720, 349771, 322868, 305864, 306822, 321460, 337863, 305525, 328354, 355162, 377965, 350249, 316253, 343763, 378720, 359228, 305977, 343081, 401209, 415685, 406965, 353219, 336124, 347826, 385803, 388926, 409382, 370529, 363311, 397452, 403820, 396907, 367424, 341903, 365160, 402207, 372450, 358150, 370082, 395494, 389170, 363954, 340858, 305543, 316183, 338680, 328248, 304538, 303415, 314189, 379276, 376218, 339351, 325191, 339184, 311796, 329109, 342268, 314764, 270504, 251875, 281773, 335702]
12137C35702K7772l6374j4490j4126k3413J4210N7660J1919m1737L6466J8385
12126C71974J6505k5120o0003r341N971j7974R492j2914P225N2703K9046R935
12114C77499J0597r525J4361M1145M9164N636k7359K981M9937j5700l0376K816
12102D71176M699J4047j4296Q161O469K8173R923k0689l4878J764K6648M9921
12090E51118L0490J8674K4514m33M789K719K3642L7352k2622k9362l1487L2248
12078F41642L5353M1806j5640J8984L531K8546J4205K9714k9839P960M4126K1782
12066H42170M9378L151K5636M0465j4645J4970K8706M7876R243K1985N1969J989
12054A122893K768J1100N0825L664J0134k3704l7579R568r73L77J8887K1656K9105
$$ y = [335702, 363474, 327100, 312610, 298484, 275071, 289281, 346941, 358860, 317123, 353589, 371974, 388479, 363359, 303356, 294015, 299986, 282012, 291504, 278590, 285815, 338518, 367564, 377499, 388096, 378571, 392932, 434077, 483241, 488877, 461518, 464499, 514436, 498736, 468360, 471176, 475875, 489922, 475626, 483787, 490256, 518429, 528352, 507663, 472785, 474549, 501197, 551118, 581608, 600282, 624796, 624363, 629152, 631871, 655513, 692865, 670243, 640881, 609394, 641642, 676995, 718801, 703161, 722145, 725676, 754222, 768427, 798141, 768302, 776262, 820388, 842170, 891548, 894699, 920335, 960800, 946155, 961125, 989831, 1037707, 1046950, 1068935, 1120904, 1122893, 1125661, 1136761, 1187586, 1191250, 1201384, 1177680, 1140101, 1149669, 1148696, 1149073, 1167960, 1189616, 1218721]
12041A218721J9297j1274m055K3124l8098K4183N7320L9789K5627l4324q704K4376
12029A335982O7836J4534m2052M7800N1738L9793M9250L6971m976J5321p580J9822
12017A624439L9719J06946N5744M8156R772J5764L5736K2610L3771Q4822P9181
12006B156660M5462N8530P7563O0065L2999O0041N3379N5665Q9615Q9352Q5602
11995B864933R3775O3384J11483P4584O9896J40421J56028J23655J02881Q2999
11985C884039R8597J43121J39252J32816J94175K04809J42956J70318K26238K36408
11975E572729K15505K60154K60853L26282L47266L34960M26912L95290M31546
11966H571497N35718O05669P05351P49261P01160N62567M76107N08920N84578
$$ y = [1218721, 1238018, 1226744, 1222689, 1245813, 1207715, 1231898, 1289218, 1329007, 1354634, 1320310, 1311606, 1335982, 1403818, 1418352, 1376300, 1424100, 1475838, 1515631, 1564881, 1601852, 1596876, 1612197, 1604617, 1624439, 1664158, 1771104, 1826848, 1875004, 1884776, 1900540, 1936276, 1958886, 1992657, 2077479, 2156660, 2202122, 2260652, 2338215, 2398280, 2431279, 2491320, 2544699, 2600364, 2689979, 2779331, 2864933, 2958708, 3022092, 3133575, 3208159, 3278055, 3418476, 3574504, 3698159, 3801040, 3884039, 3982636, 4125757, 4265009, 4397825, 4592000, 4796809, 4939765, 5110083, 5336321, 5572729, 5788234, 6048388, 6309241, 6635523, 6982789, 7317749, 7744661, 8139951, 8571497, 9107215, 9712884, 10418235, 11167496, 11868656, 12431223, 12907330, 13416250, 14000828]
11957A4000828O61689P58074Q71683R94707J111607J216723J423656J559055J726478
11948B4324500J920634K069085K350491K698174L004589L310861L652498M151241
11940D7482073M687917N125713N682100O189468O660242P028335P177874P100446
11932I7134168O692784N921836M704816L068421J169343q22633k725905m285070
11924A10857760n514335o344427o854682o988182o862135o609184o196210n710892
11916E9777713n244978m737373m262684l869732l529081l140372k777556k499837
11908B9716100k208207k016017j877162j678272j496338j330933j192247j099503
11900A6817421j017521q91623q72207q13650p00643o51290n80025n46478n30421
$$ y = [14000828, 14662517, 15420591, 16292274, 17286981, 18398588, 19615311, 21038967, 22598022, 24324500, 26245134, 28314219, 30664710, 33362884, 36367473, 39678334, 43330832, 47482073, 52169990, 57295703, 62977803, 69167271, 75827513, 82855848, 90033722, 97134168, 103826952, 109748788, 114453604, 117522025, 118691368, 117868735, 115142830, 110857760, 105343425, 98998998, 92144316, 85156134, 78293999, 71684815, 65488605, 59777713, 54532735, 49795362, 45532678, 41662946, 38133865, 34993493, 32215937, 29716100, 27507893, 25491876, 23614714, 21936442, 20440104, 19109171, 17916924, 16817421, 15799900, 14908277, 14036070, 13222420, 12521777, 11870487, 11290462, 10743984, 10213563]
11891A0213563m85447m39924m31016l93417l82034l63951l31864k79404k73321
11882F833185k68265k82349k41974k62394k53355k18303j88246j85212j87228
11873D745859j48535j42791j80859j63422j72629j22215j31040q5002q3649r6583
11863C419134q5988j16370n4227q7747r0777r5399j11484j04162m2222p8600n2040
11852B500118k5688p2782l5197n7251r4106n2894n2749l8774o9536m7376o4630
11841A889135q7580q1814q2530j142M3107p566q7450l9075j7095J4657j2680l3784
11829A496183j8361l7923m5270k7976k9964m1574n0679n7846l8177k0908Q11j007
11817A127309L2536J1122j2124l8877k1300p221j6860j3728J5900R108m3120l3290
$$ y = [10213563, 9728116, 9288192, 8857176, 8463759, 8081725, 7717774, 7385910, 7106506, 6833185, 6564920, 6282571, 6040597, 5778203, 5524848, 5306545, 5118299, 4933087, 4745859, 4597324, 4454533, 4273674, 4110252, 3937623, 3815408, 3684368, 3599366, 3515717, 3419134, 3333146, 3216776, 3162549, 3074802, 2984025, 2888626, 2777142, 2672980, 2630758, 2552158, 2500118, 2474430, 2401648, 2366451, 2309200, 2215094, 2162200, 2109451, 2070677, 2001141, 1953765, 1889135, 1801555, 1719741, 1637211, 1636069, 1679176, 1671610, 1584160, 1545085, 1527990, 1542647, 1529967, 1496183, 1477822, 1439899, 1394629, 1366653, 1336689, 1295115, 1244436, 1186590, 1148413, 1127505, 1128316, 1127309, 1159845, 1170967, 1158843, 1119966, 1098666, 1091445, 1074585, 1060857, 1076757, 1085865, 1042745, 1009455]
11805A009455j8429P631K8027r955o6096k9767j9421m0638j1624K4315J0749m3911
11793H40336l6905j3225p564j3062j3950k8962O850J5355K3783J9085n7561l6438
11781F97742k9688K3001j2745l6632O733j5614n230k3407m231K0137l2096L6600
11769F24570J7244j5532J3893R002r221l2376J810l0102n3446j5460K0608J3559
11757E44549j2614k5210J3548K782k0419k7260K1410K0970K1220k8715j402K7995
11745E36854j892k3534O020k5475P096K5958J3966m1795k0737L4547K7864k6482
11733E12390k4110k5424l035m3524n4603K9423K4522J7321J5369n999L2805k5701
11721D49434n493j6572l5936O527j8722j7774J1466q696N397p276q569m757l3766
$$ y = [1009455, 991026, 998657, 1026684, 1016729, 950633, 920866, 901445, 860807, 849183, 873498, 884247, 840336, 803431, 790206, 782642, 769580, 755630, 726668, 733518, 748873, 772656, 791741, 734180, 697742, 668054, 691055, 678310, 641678, 648411, 632797, 627567, 604160, 599929, 620066, 587970, 624570, 641814, 626282, 640175, 649177, 639956, 607580, 609390, 579288, 525842, 510382, 530990, 544549, 531935, 506725, 520273, 523055, 502636, 475376, 496786, 517756, 538976, 510261, 508859, 536854, 534962, 511428, 517448, 491973, 499069, 525027, 538993, 497198, 476461, 511008, 538872, 512390, 488280, 462856, 459821, 416297, 361694, 391117, 415639, 432960, 448329, 442330, 475135, 449434, 443941, 427369, 391433, 397960, 379238, 361464, 372930, 364234, 369631, 362355, 353786, 349029, 315263]
11708C15263K977K4653K8168J1436n9110k8808j5442m942L0034O777j0220k1072
11696B79714n058O438l3665J922J825M0826k7178j3871L2062r032j7362K2117
11684B78738M3249J7265N38k6573j3707j53p885o0557j6666K8050L610k7857k1592
11671A96460j1810L3520j2668R697M5156L1810k8893o5885n2572J1842J454K6199
11659A84310j7024j4355J4978L2813M357o0668q182P9777J8909j8989k9156j872
11647A84898J3718M0857K3483o564l3557l666k2843r943M985l0654k2405L652
11635A41961K4247M8773K9208j9329k1106k815K4619K3467o7653m6270K3896M0395
11623A99393K5346n160j7029J0989J1972p60j5021j5762K1363J1655k1471n5947
$$ y = [315263, 318240, 342893, 371061, 382497, 323387, 294579, 279137, 274195, 304229, 311006, 300786, 279714, 274656, 281094, 247429, 249351, 251176, 292002, 264824, 250953, 283015, 273983, 256621, 278738, 321987, 339252, 339790, 313217, 299510, 299357, 291472, 230915, 214249, 242299, 245909, 218052, 196460, 184650, 218170, 205502, 215199, 260355, 292165, 263272, 197387, 144815, 156657, 158111, 184310, 167286, 152931, 167909, 200722, 205079, 144411, 136229, 216006, 234915, 215926, 186770, 184898, 198616, 239473, 262956, 256392, 222835, 219169, 196326, 186383, 191368, 160714, 138309, 141961, 166208, 214981, 244189, 224860, 203754, 200939, 225558, 249025, 181372, 135102, 158998, 199393, 224739, 219579, 202550, 213539, 225511, 224751, 209730, 193968, 215331, 226986, 205515, 149568]
11611A49568j876J205M863l4283K7417J3201o035n317K7703K1788n465k5904K4442
11598A91307J4817k3520j8534L707k7704k5605J3336q239n067J2711k179Q522
11586A33552l539n1044K6694J6073k0634k3393K1161M0228n576k7370l9587j5361
11574E1204J8662n546J1126L6769J0269N0215l7796k8496r884J9587p084k1816
11562H7210J5053K8127q206O828j0679j8262K5085K5501M979m1840j2075Q92l0928
11549G1685o452J7711J5217Q08J9217m2947l9410J6812p19K3025K6500L1954P871
11536A41272J7488r282l9237M309K5408k0139K6877K6466k9947j7674k1477R325
11524A13389P074k6721Q397Q944r953m0068j4133O5336N7573m1910j998J217l1450
$$ y = [149568, 147692, 148897, 153760, 119477, 146894, 160095, 154060, 148743, 176446, 198234, 192769, 166865, 191307, 206124, 182604, 164070, 167777, 140073, 114468, 127804, 119565, 114498, 127209, 125030, 133552, 130013, 78969, 105663, 121736, 101102, 77709, 98870, 139098, 133522, 106152, 66565, 51204, 69866, 64320, 75446, 112215, 122484, 172699, 134903, 106407, 96523, 116110, 109026, 87210, 102263, 130390, 122184, 129012, 118333, 100071, 125156, 150657, 155636, 113796, 101721, 102613, 71685, 65233, 82944, 98161, 98969, 118186, 75239, 35829, 52641, 51922, 74947, 101447, 133401, 141272, 158760, 149478, 110241, 114550, 139958, 119819, 146696, 173162, 143215, 125541, 104064, 113389, 120463, 93742, 102139, 111083, 101130, 61062, 46929, 112265, 169838, 127928, 125930, 127147, 95697]
11511I5697p45j8558r479J6926j1262J183K379j8121q613M1701J4638K0440j5280
11498A10906j4603l4378n9724o344L3710k2931l0998R841K4875j3427O414O4079
11486F7420K933Q999K365N536k0955l3093k552M2599J4050l820J1750K8790q979
11473A15043j1304l0736k7022j257M7975M7593m0173m1421l7875J6688P6215J7561
11461A31287j8680l1549K386L278l1530j2913J5486J1449j5981r616J78j4909
11449B8886K2856K3515p67L6691j3041k4626r82j1515j3195k049J847N143L047
11436E5810j3172j1069m6700M8025J7560r408j6781M829K9616J7848O844J6121
11424I9523l8969l7859O042J1725R380M380k34k7975k2078K5088L2767l3067M441
$$ y = [95697, 94952, 76394, 66915, 83841, 72579, 73762, 76141, 58020, 49407, 91108, 105746, 126186, 110906, 96303, 61925, 2201, -4143, 29567, 6636, -24362, -14521, 10354, -3073, 3341, 67420, 70353, 79352, 81717, 87253, 66298, 33205, 30653, 73252, 87302, 83482, 95232, 124022, 115043, 103739, 73003, 45981, 44724, 92699, 140292, 100119, 58698, 20823, 37511, 113726, 131287, 112607, 81058, 83444, 86722, 55192, 42279, 57765, 69214, 53233, 43617, 43795, 28886, 51742, 75257, 74490, 111181, 98140, 73514, 72532, 61017, 47822, 45773, 47620, 52763, 55810, 42638, 31569, -15131, 32894, 50454, 41046, 24265, 29094, 58710, 76558, 83402, 99523, 60554, 22695, 28737, 40462, 49842, 54222, 53988, 26013, 3935, 29023, 61790, 28723, 33164]
11411C3164J6172M116M120j1836J2877N496k6018l1753J8559J0749K2751j7909
11399D0488k3876K4722J0562Q005j2440j4075J9141k315K2747Q809k7514n0336
11387C918L2967M9439K5053K179k6654l3882K570J2702Q380k866j5998K6608N052
11374H9468l0842J644M719K8186r053m5147L4302K3001j2953k2764l3874J8075
11362D4762J9114J9828J7120l8158k5677j3843j8198j0605k8111O954j8653J4369
11350c1098j4653P677J3629L3831r85j790p223K9725j3380J8546j8152m33r905
11337E789J0771J0066J8279j8312k9796J0377m412J6905O9425J0874l3886r784
11325E6296l4475j1348M508Q072j609K2585K3265N033Q214J8256Q686n877k0810
$$ y = [33164, 49336, 53452, 57572, 45736, 58613, 64109, 38091, 6338, 24897, 35646, 58397, 40488, 16612, 41334, 51896, 59901, 47461, 33386, 52527, 50212, 72959, 81768, 54254, 3918, 36885, 86324, 111377, 113556, 86902, 53020, 55590, 68292, 76672, 73806, 57808, 84416, 89468, 58626, 60270, 64989, 93175, 84122, 38975, 73277, 96278, 83325, 60561, 26687, 44762, 63876, 83704, 100824, 62666, 36989, 23146, 4948, -5657, -33768, -26814, -45467, -31098, -45751, -38074, -24445, 9386, 8401, 6611, -612, 29113, 15733, 34279, 16127, 15694, 5789, 16560, 26626, 44905, 26593, -3203, 7174, 2762, 19667, 89092, 99966, 66080, 56296, 21821, 10473, 14981, 23053, 21444, 44029, 67294, 72327, 80541, 98797, 107483, 101606, 80796]
11312H0796J0897k7333j4814l047J9020J3816j0321k949j4701r598L131J3136
11300E8033p279q517q414n279K8019l3347p541J2361m368j1447l890n29M4053
11287E1855J9347J4859k2214j412j2417m6575p012N509J3076L3715M7153K357
11275I8241m5221l3340j7498M902K5642K8935m785R927L2290k886l9400l2529
11263B4278j3744N1412L5627l1612J5697l141j4452n3383k1145L3473N75J2929
11251C6514J4736m970M270j420M3292k2122n865J160M361K603m721J3251j0107
11238G0982l1477k6606j8544J0331J8981J3477k022K9731Q256r534l4246k9035
11226B94K993r956J9669M149q872l8308r686O3309j278j6634k2098P075j1888
$$ y = [80796, 91693, 64360, 49546, 46499, 65519, 79335, 69014, 66065, 51364, 41766, 44897, 58033, 50754, 42237, 33823, 28544, 56563, 23216, 15675, 28036, 23668, 12221, 8331, 7802, 51855, 71202, 86061, 63847, 62435, 50018, 3443, -3569, 1940, 15016, 48731, 95884, 98241, 53020, 19680, 2182, 7084, 32726, 61661, 56876, 66803, 99093, 96207, 56807, 24278, 10534, 61946, 97573, 65961, 81658, 78517, 64065, 10682, -10463, 23010, 23585, 36514, 51250, 46280, 50550, 49130, 92422, 70300, 64435, 65595, 69956, 72559, 67838, 81089, 70982, 39505, 12899, -5645, 4686, 23667, 37144, 35122, 64853, 73109, 63575, 29329, 294, 3287, -6669, 13000, 17149, 8277, -30031, -39717, 23592, 22314, 5680, -16418, -9343, -21231]
11213b1231J7615N6601K1592m3518n7141J2586K2433J6348K2668k5127m325R921
11201B8422M7202O079n0731q437k458m876N4908j6589j1387j4828N896M645k2016
11188A5830l6016M0402m208J322L6661o517n642k0099k1340j1353O663P0462M1863
11175A08028m417k8516j3534j8933K019L3268J1013o9270m078K8728M3151k1114
11163F6345l1645k1633P5122n965n4132L2231K5886j3028l9604J2539r719o656
11151B9741l7975j6502N2820m03n0966K4226K7630M5209j8531j7788M359K4512
11139F6332l6598J935K4362J4451l0874j0107p868j7193K5424l315K7086R480
11127F3115m1564q032m489K8865J9732J7199P067j1027j3123m899j8943r882n781
$$ y = [-21231, -3616, 52985, 74577, 31059, -26082, -13496, 8937, 25285, 47953, 22826, 18501, 28422, 75624, 81703, 30972, 22535, 20077, 15201, 70109, 53520, 42133, 27305, 33201, 37846, 15830, -20186, 20216, 16008, 17330, 53991, 47474, 41832, 21733, 393, -10960, -4297, 66165, 108028, 103611, 75095, 61561, 42628, 44647, 77915, 88928, 19658, 15580, 44308, 87459, 66345, 34700, 13067, 88189, 82224, 28092, 60323, 86209, 73181, 33577, 46116, 36397, 29741, -8234, -24736, 28084, 27681, -23285, 941, 28571, 73780, 55249, 37461, 41820, 66332, 29734, 31669, 56031, 70482, 39608, 29501, 21633, 4440, 29864, 26549, 53635, 63115, 21551, 13519, 9030, 37895, 57627, 74826, 81893, 70866, 57743, 52844, 33901, 24019, 18238]
11114A8238P458J8321j4998j8258l9546l8387R123K4818L1096J3450k5186Q757
11102e114K4395Q198Q755j0645j286J3235n3683o730J7305M6022J442k6211N624
11089B1307L8125n3542j0563J9332j4891J3207J392o282j7047j5310k5963j4062
11077f4297r67L4414J8304K9172J672J2419L2246L3363N9532n3551n3216k8875
11065B0216l132K8901j3799j4506l529q609J7287J1459o402P953n440j7562M741
11052A7578K1315K1951j7752r251J8954k8988j5486J8877N2288K1582N096K250
11040A08414o095M8104J3197k8924n226k09L9337J1141K9627p14j2796k923n0059
11027A42874n672k1875j1343K6731O8127L6421J8369Q9071M054m7095k7290k4911
$$ y = [18238, 25696, 44017, 29019, 10761, -28785, -67172, -58049, -33231, -2135, 11315, -13871, -5114, 19281, 27479, 36234, 25589, 24303, 37538, -16145, -22875, -5570, 40452, 41894, 15683, 21307, 59432, 5890, -4673, 14659, -232, 12975, 14367, 8085, -8962, -24272, -50235, -64297, -65264, -30850, -12546, 16626, 18298, 30717, 62963, 96326, 155858, 102307, 49091, 20216, 17084, 45985, 32186, 17680, 14151, 5542, 22829, 34288, 27886, 35839, 30399, 12837, 17578, 38893, 60844, 43092, 33841, 52795, 23807, 8321, 27198, 79486, 101068, 106164, 108414, 102319, 150423, 163620, 134696, 129470, 129261, 168598, 179739, 209366, 208652, 195856, 192933, 142874, 137202, 115327, 103984, 130715, 198842, 235263, 253632, 342703, 346757, 299662, 272372, 247461]
11015B47461j6921m83l4014m1159K423M7871O1251J6863O752k9064n1892n2817
11003A56271j7038J3303J4774n501l6969l1620j0186j1478K0397j0953j5115K8266
10991I4151J6323j5511k1359m7188k3790K2820N8005J1373n1484j6931J7539j9504
10979B4444J3279j9383k3775j3099N161J6286j6300M4533N5732j1664m28K9180
10967A03966K1166k6929m1672M2638r707j5751K9549J2316m8954j5095J7365n0662
10955A8230n585k7677K8715J9799m0305j1118J9772N149J9182o849J1615k6242
10943D686J3737Q168j585k1566j8589o739K8170J4918Q784M4658J2595m9251j4918
10930B3068l1932j8807L399J2660M804n338p693J354L5953N061J6250L5874m059
$$ y = [247461, 230540, 230057, 196043, 154884, 157307, 205178, 266429, 283292, 290044, 260980, 209088, 156271, 139233, 152536, 167310, 161809, 124840, 93220, 83034, 71556, 91953, 81000, 65885, 94151, 110474, 94963, 73604, 26416, 2626, 25446, 83451, 94824, 43340, 26409, 43948, 24444, 37723, 18340, -5435, -18534, -13373, 2913, -13387, 31146, 86878, 75214, 74786, 103966, 125132, 98203, 56531, 99169, 89462, 73711, 103260, 115576, 66622, 51527, 68892, 18230, 12645, -15032, 13683, 33482, -6823, -17941, 1831, 6980, 26162, 19313, 30928, 4686, 18423, 26591, 25006, 3440, -15149, -21888, 6282, 21200, 29984, 74642, 87237, 37986, 23068, -8864, -27671, -24272, -11612, -6808, -12146, -19839, -18485, 17468, 22529, 38779, 74653, 70594]
10917G0594l4000K600k0670l5921K4958r926o2569k0136N2470M2523K6143m256
10905C1810l9938J737l2288j4760M4590J8927J8461J0268k1072L606k9565j3122
10893b1346j7222K9929M8783Q742K3234l1809m6380j0391q690J2148L8355L5197
10881F0550K0511m3647n8477q913J7531jm549m395J7715L6038J3436J2967J683
10868F0449j569n0015k3634M31J8236K2705J2066N575p994J0367R249R323J3310
10855G8499J737o274J8344J5811p769j9879k0334l6867n237P677L3634K8255J4062
10842A01659l0461l1841k0631j1876Q149m4960m748M3115K6804K951L290j4438
10830B7013R055K2158J4843p896j6409J0001j892L538J6116l3451k2268J7676
$$ y = [70594, 36594, 39194, 18524, -17397, 7561, -2365, -64934, -85070, -32600, 9923, 36066, 31810, -8128, -6391, -38679, -53439, -8849, 10078, 28539, 38807, 17735, 21341, -8224, -21346, -38568, -8639, 40144, 48886, 72120, 40311, -6069, -16460, -25150, -13002, 25353, 60550, 81061, 37414, -21063, -29976, -12445, -12446, -16995, -21390, -3675, 32363, 45799, 58766, 60449, 58880, 8865, -14769, -14338, 3898, 26603, 38669, 44244, 36250, 46617, 55866, 65189, 78499, 80236, 73962, 92306, 108117, 100348, 80469, 60135, 23268, 18031, 25708, 59342, 87597, 101659, 71198, 39357, 18726, 6850, 14999, -29961, -34709, 8406, 35210, 38161, 41451, 27013, 36068, 58226, 73069, 65173, 48764, 58765, 56873, 60411, 76527, 43076, 20808, 38484]
10818C8484k437r884L7961k256l7435j9294k9385j645N935P327j3930r040R073
10805b6526N969L6075j5152L2834N620l6093K5824L2344j3335j0390j7499j3859
10793E812k719J9047k9960j4861L4153j5268j8725m9822l0057N1479O8071M688
10781B1838j595J7187m856j979j3253k5854j4973M667K0009K7926j2646j0758
10769E713m987J5417J8959m4312k4214k3367K7359Q254J8377K173m578j1336l1441
10756d7983o880K3100N7456K2428L827k3036J7476k649P210N942l9829l8180O171
10743a4947M0216K6893m9796M669O6074K0618j0671q2240j72P0099N3764J7069
10731A41576k2143M176L524N04J1953j6967q956j3350L9409L6525L58j8883j0404
$$ y = [38484, 36047, 26163, 64124, 61868, 24433, 5139, -24246, -25891, -19956, -12629, -26559, -35599, -26526, -20557, 15518, 366, 33200, 38820, 2727, 28551, 60895, 47560, 37170, 19671, 5812, 3093, 22140, -7820, -22681, 11472, -3796, -22521, -72343, -102400, -50921, 17150, 21838, 20243, 37430, 32574, 30595, 17342, -8512, -23485, -18818, 1191, 29117, 16471, 5713, 726, 16143, 35102, -9210, -33424, -56791, -29432, -21178, -2801, -628, -5206, -16542, -47983, -54863, -31763, 25693, 48121, 51948, 28912, 46388, 43739, 50949, 56891, 17062, -21118, -14947, 25269, 52162, 2366, 7035, 73109, 93727, 83056, 816, 644, 70743, 124507, 141576, 119433, 123609, 127133, 127637, 139590, 122623, 113667, 100317, 139726, 176251, 176609, 157726, 147322]
10718A47322K3023J0048J3253J0991j5955k1749j775j0809K1750r414j7408N169
10706A54446J2942K1800o21k7782J9463M030o8820k3381j9950N0104K1923o9176
10694G4978J6477K1313n415p295J1983L2039k6468k2001O013L8469m6322m0779
10682E2992L1211L1604k0264L357J1882k2477Q259j3852P96M693J9551M2419N5840
10669B06011M239m0540P917J5534J1191J1779K2643l138K3131K529l5452j7065
10657B08779k5629J9221K7977L6602j8522k8154k9026M210N2895K7093O2055O852
10645C44353r78L6003K9611j0242k4834J4487l379L2758M1519K8278M9504J02268
10633F39348P0241Q0245J04073J35234P4105P9625J07551J64334J87257J67889
$$ y = [147322, 170345, 180393, 193646, 204637, 188682, 166933, 165158, 154349, 176099, 166685, 149277, 154446, 167388, 189188, 188567, 160785, 180248, 184278, 115458, 92077, 72127, 122231, 144154, 74978, 91455, 112768, 107353, 100058, 112041, 144080, 117612, 95611, 101624, 140093, 93771, 52992, 84203, 115807, 95543, 98900, 110782, 88305, 96564, 82712, 83508, 88201, 107752, 150171, 206011, 210250, 169710, 177627, 193161, 204352, 216131, 238774, 235636, 258767, 261296, 225844, 208779, 183150, 202371, 230348, 266950, 248428, 220274, 191248, 195458, 248353, 275446, 337501, 344353, 343375, 379378, 408989, 398747, 373913, 388400, 385021, 417779, 459298, 487576, 537080, 639348, 709589, 789834, 893907, 1029141, 1103246, 1182871, 1290422, 1454756, 1642013, 1809902]
10623A809902K14831L70585M94734O67542R33614J249594J743940K307214K794400
10614A2586356K835901K018951P21769m06769q74245p76088k62551N26968J591238
10605A7961530K930192M474696N724005N607413L340683j50842k809788l618668
10597C3459221l018080j706887j12111J670377L715992N830797P313685O678864
10589E3831858K774917k483652n917332o750973n739788l986256k197661m48341
10581B9082772J296968K964960L909592L143148L36421l094277n205723n391731
10573B7042130m432189l170923j985067q81806L074P24722J024156N12429o10931
10564A8225595j899835k651740k725634k351369j814165j349300j026505q17640
$$ y = [1809902, 2024733, 2395318, 2890052, 3557594, 4491208, 5740802, 7484742, 9791956, 12586356, 15422257, 17441208, 18162977, 17756208, 16881963, 16105875, 15843324, 16370292, 17961530, 20891722, 25366418, 31090423, 36697836, 40038519, 39887677, 37077889, 33459221, 30441141, 28734254, 28622143, 30292520, 34008512, 39839309, 47152994, 53831858, 56606775, 54123123, 48205791, 41454818, 35715030, 31728774, 29531113, 29082772, 30379740, 33344700, 37254292, 40397440, 40733861, 37639584, 32433861, 27042130, 22609941, 19439018, 17453951, 16572145, 16575219, 17299941, 18324097, 18836526, 18225595, 16325760, 13674020, 10948386, 8597017, 6782852, 5433552, 4407047, 3589407]
10556C589407o10800m14488l59358l06408j99940j49442j91696j26308j39167
10547A091800j10480r5978l8567j7328n9734r0672p3885l2353j2387j7162l5682
10536E07572Q58n6450K424L1974j3835n8565n8208o7114m9750M466M2291L6725
10524C22388j2859m5499l5908J3915M174k3203m0416L827J724j065j9463l0033
10512A37582J1747K7430L5640J479k5904j8384J7692K343P647j5016q7294q394
10500H6568K3566q035k1990j4716P309R011m9l5352J772K4732J2484j3216p937
10487F4147j7894O741J0325n603N6510K7334m0851k5866p336J7192J5787n161
10475I5325J4548l4936N447k7674o070O755K9574M5819J532k1533k2937j6480
$$ y = [3589407, 2978607, 2564119, 2204761, 1898353, 1698413, 1548971, 1357275, 1230967, 1091800, 981320, 885342, 846775, 829447, 769713, 679041, 605156, 572803, 560416, 543254, 507572, 508430, 451980, 454404, 486378, 472543, 413978, 355770, 288656, 238906, 243372, 285663, 322388, 309529, 264030, 228122, 242037, 246211, 223008, 182592, 186419, 188143, 187078, 167615, 137582, 149329, 176759, 212399, 213878, 187974, 169590, 187282, 189625, 197272, 182256, 94962, 86568, 110134, 102099, 80109, 65393, 72702, 81713, 81664, 46312, 48084, 72816, 85300, 72084, 64147, 46253, 52994, 63319, 57716, 114226, 141560, 100709, 74843, 67507, 84699, 100486, 95325, 109873, 74937, 80384, 52710, 46640, 53395, 82969, 128788, 130320, 108787, 85850, 69370]
10463F9370j0927K2530M4114L7448j9211J8648j9064m6280l0527m1590j5081p386
10451B044N242P949l054j2276K3544J4962N733m3500L5052m348P497L9114k4239
10438E3720J260M73J3681q222M5388K7549l3611M0185k3951k9443j6990j2406
10426E7633K074J3273J5579K026j1360J4006K1561k5964n5513k0576J8173L7272
10414F8184J3296M3613N659r304l550l7825J313m130l1902o381M25j3948j3615
10401A1835J0948n452J407N2083N4898l2409k2113j5485q004o290j5752L739Q832
10388C8237K364J4754J985J868k7342k3938K2840K2840J1206K9807j2502j978
10376H0141l6049n0766K0183N2133K3872m110m7453l627J150K3566J644j8642
$$ y = [69370, 58443, 80973, 125087, 162535, 143324, 161972, 142908, 96628, 66101, 24511, 9430, 2044, 7286, 15235, 12181, -95, 23449, 38411, 44144, 644, 35696, 31348, 38845, 77959, 53720, 54980, 55453, 69134, 60912, 106300, 133849, 100238, 140423, 116472, 87029, 70039, 57633, 59707, 72980, 88559, 90585, 79225, 93231, 114792, 88828, 33315, 12739, 30912, 68184, 81480, 125093, 130752, 121448, 117898, 80073, 81386, 77256, 45354, 38973, 39398, 25450, 11835, 22783, 17331, 18738, 70821, 125719, 93310, 71197, 55712, 47708, 41418, 25666, 29405, 38237, 40601, 55355, 57340, 59208, 31866, 7928, 30768, 53608, 64814, 94621, 82119, 80141, 44092, -6674, 13509, 65642, 89514, 85404, 37951, 34324, 35474, 59040, 60684, 42042]
10364D2042j7168j17R618o634j1218k4391M093M0273J0425L4456j5193l2871K201
10351C5516K2426J4798J5134R024o9444m7815L3229L9318K6948j738q669L7269
10339A05996J1856k5293j7428J5067J8282m7772k7322m019m0986j217K9810L2223
10327D9197k6686J6099k2855l50N1447N933m6227n2173j659L3254M1981J970k3776
10314B6155O057p735o654r869j6403K0774p516J143K340j462O919Q772J889J0543
10300C4953L3395J2911l2655k3826k6678L2138K1849m2004L4220n337L042L6155
10288G8163l885n9130M335J4407N636l414J0652L300k1565K8218O7054j7206m0942
10275F5623m0489j187R804K0097J3466o09j1753j800K4717j0371k5371k83k9677
$$ y = [42042, 24874, 24757, 34375, 27741, 16523, -7868, -3775, 36498, 46923, 81379, 66186, 33315, 35516, 57942, 72740, 87874, 96898, 27454, -20361, 12868, 52186, 79134, 77396, 68727, 105996, 117852, 92559, 75131, 90198, 108480, 60708, 33386, 29367, -11619, -12836, 16974, 49197, 22511, 38610, 15755, 15405, 66852, 72785, 26558, -25615, -27274, 5980, 47961, 49931, 26155, 32212, 24477, 17823, 7954, -8449, 12325, 4809, 5952, 8292, 6830, 13749, 22521, 24410, 34953, 68348, 81259, 48604, 24778, -1900, 30238, 52087, 10083, 44303, 38966, 42008, 78163, 74278, 15148, 19483, 33890, 39526, 36112, 46764, 50064, 28499, 56717, 123771, 106565, 65623, 25134, 23947, 33751, 53848, 67314, 66705, 54952, 53152, 77869, 67498, 42127, 41844, 12167]
10262A2167J2114J3235l3841j1813j9552M4667L9959N125k723J29l03j5120j2985
10249C1059J9532k4820l0850K1159Q148m29N55p430q794k2402O611M8795M8695
10236H9829n835k0881R028Q059J4994l0062k2170j1651k4479J2522J4732r229
10224B4857J3939l826J3764k7763M560l857K0685o951j7892K4344N9754J3679
10212A15293l3552O432k5809M61j1213J198k6890k3824o044J7333n997p513k990
10199c115j92N1045K6399j1607Q68R160L6479k3067l6069j7457l641K5429J3712
10186F7944K407l9376j6590J2584J4549L5320l348r814M7828J4944J6441j0480
10174A32409l9119j2721R74k0010K5175M8532K4880K4788m793M9782O0834j9510
$$ y = [12167, 24281, 37516, 3675, -8138, -27690, 16977, 56936, 62061, 59338, 59467, 59164, 44044, 31059, 50591, 25771, -5079, 16080, 24228, 23799, 24354, 16924, 8130, -14272, -7661, 41134, 89829, 83994, 63113, 72141, 80200, 95194, 65132, 42962, 31311, 6832, 19354, 34086, 24857, 38796, 34970, 48734, 20971, 25531, 21674, 42359, 35408, 17516, 41860, 101614, 115293, 81741, 88173, 62364, 62825, 51612, 52810, 25920, 2096, -3948, 13385, 7388, -125, -3115, -3307, 47738, 74137, 62530, 63398, 72558, 109037, 85970, 49901, 32444, 28803, 54232, 67944, 70351, 30975, 14385, 26969, 41518, 76838, 73490, 63676, 111504, 126448, 142889, 132409, 93290, 80569, 81543, 61533, 86708, 135240, 160120, 184908, 180115, 229897, 290731, 271221]
10162B71221j9282l5207J688k2754R102K1445K2877L6150J6440P2101J8948o7474
10150C25255p2015m6046l6285j6653l112R10J6085N822J8606J5683P100Q853n041
10137B19162q817l8395m1134L833R611L189k683L962J4819O254m5511o6593J425
10124E9122j5790J5822J147k4343n232P937M1263K1644l5457j6995K4465J5459
10112H9042k9709l9307k9887n343K5735J7698N758q979Q794L809l3467M738J5903
10099B4785j0435L2139L4676k8291k7446p66l9778l4700L6781p916j11q668l2129
10086f1859J8606K3750N0981r197j6715l975j1292J3567k0113p705k5035M6733
10074b254K6983j9837J7356L7174j5348k8030q260J2371M6256oj4066N56l0107
$$ y = [271221, 251939, 216732, 218420, 195666, 204768, 226213, 249090, 285240, 301680, 373781, 392729, 325255, 253240, 207194, 170909, 154256, 151144, 152054, 168139, 173961, 192567, 208250, 215350, 224203, 219162, 210345, 171950, 130816, 134649, 144260, 147449, 144766, 148728, 163547, 169801, 124290, 57697, 59122, 43332, 59154, 60301, 35958, 30726, 38663, 79926, 101570, 66113, 49118, 73583, 89042, 59333, 20026, -9861, -15204, 10531, 28229, 33987, 25008, 33802, 37611, 4144, 8882, 24785, 14350, 46489, 81165, 52874, 25428, 24662, -15116, -49816, -13035, -20951, -21062, -29730, -61859, -43253, -19503, 31478, 22281, 5566, 1591, -9701, 3866, -16247, -23952, -48987, -2254, 24729, 4892, 22248, 59422, 44074, 16044, 7784, 20155, 66411, 66405, 52339, 52895, 22788]
10061B2788j2081k5585O899K0583k41j0739R538K4425n149J1659j0269m0644M0795
10048C1979K5666r745j3885j9401k5967l0788q872L000K5545K9889J5777K2428
10036D5626k2637l4746j1311K0381J9608L0617J3288q235j8424l6245l0972R666
10024b3384K1124L3636k35j4435l3752J6804K0468l8087m1159j0240P2234j766
10012A208l2384J9740J2877j3139j4129R813K9892j1039J2603m9651k2718L5918
10000b1009n957N9235K2811p963m5882j2436L3046K8447n7751l3985K1585j7088
9988c6947K4889J3119j7193L2731L3277j2669J8457P044l5117n0721k1305q029
9976e2464L5107k613P327K5583L6014J0280N634n642j8991j4949P824j2997l1802
$$ y = [22788, 10707, -14878, -7979, 12604, 12363, 1624, 11162, 35587, 30438, 42097, 31828, -8816, 31979, 57645, 47900, 34015, 14614, -11353, -42141, -51013, -48013, -22468, 7421, 23198, 45626, 22989, -11757, -23068, -2687, 16921, 47538, 60826, 52591, 34167, -2078, -33050, -23384, -2260, 31376, 31141, 16706, -17046, -242, 20226, -17861, -59020, -69260, 2974, 1208, -31176, -11436, 1441, -11698, -25827, -16014, 13878, 2839, 15442, -34209, -56927, -21009, -26966, 32269, 55080, 47117, 1235, -11201, 21845, 50292, -7459, -41444, -19859, -36947, -12058, 1061, -16132, 16599, 49876, 37207, 55664, 62708, 27591, -23130, -44435, -52464, -17357, -19970, -12643, 12940, 48954, 59234, 64868, 59226, 40235, 25286, 33110, 20113, -11689]
9963a1689m39J1306K1514K986j2222J223k5743M8844M9546J051M59l0593j4789
9950D1454J906m4265m3997J4049K7976Q0J5405J0697K205l1155j3400J7788K8700
9937B7443j6622M0772L4710k7261m706M3731Q7947J31687J07543n0009j00194
9926B75041r7056r3652J7539J2279k1410n1683k8910N328L8899Q870q0792k276
9914a7823K8209J4935K2827J4220m865k7012o181p897q644k781r08k6437k6846
9901d9203M0912N14o231M4378L1115K052l8572J0151n672L308p961j1893o670
9888F228K6328M4706J219J9176l9498l3295j4141k0822P120J4782k733m3951K3684
9875a1197M5902l0587k2085K2777K3934m6030j1421K8980M882r752k1441K6436
$$ y = [-11689, -12128, -822, 20692, 23678, 11456, 12679, -13064, 35780, 85326, 86377, 86836, 56243, 41454, 43360, -905, -44902, -30853, -2877, -2797, 12608, 23305, 25510, -5645, -19045, -1257, 27443, 10821, 51593, 86303, 59042, 54336, 98067, 186014, 317701, 425244, 375235, 275041, 177985, 84333, 101872, 114151, 92741, 41058, 12148, 17476, 56375, 65245, -15547, -17823, 10386, 25321, 48148, 62368, 57503, 30491, 24310, 16413, 7769, 4988, 4080, -22357, -49203, -8291, -7777, -14008, 30370, 61485, 63537, 24965, 35116, 29444, 32752, 24791, 12898, 6228, 32556, 77262, 78481, 97657, 58159, 24864, 10723, -10099, -2979, 11803, 9070, -34881, -11197, 34705, 4118, -17967, 4810, 28744, -17286, -28707, 273, 5155, -4597, -26038, 398]
9863C98l224j4981l7170M8835L2237M954L5762Q720j2626l488r188m8876k0250
9850a8897l6854P621K8194L5042j5793k5684L5215L4146k692m7305o353M3310
9838B9950O273O906l7603k0619j3570k2261L4658K5532J2812O962o139l278J534
9825B1157j9621m7575l392L0540k2503L2308J5285k5265m6442J7854J7413K4001
9813f240J9245l0085l729K7827j3859j0054q2663k5432N5658M584m484L9154L5808
9800E730l889j8762Q83J1357M1376K8903j2007n4197j6265K4199K4546j4059l1004
9787a3189m4867J4963j1783K4887N5822j5268L5003P2476R3472Q4664R6238R5190
9775D87608j3160j20564j24849o7621k4010o0878l9751L3002j0617n1686l6223
$$ y = [398, -2826, -17807, -54977, -6142, 26095, 31049, 66811, 75531, 62905, 59417, 50229, 1353, -18897, -55751, -48130, -19936, 15106, -687, -26371, 8844, 42990, 40298, -7007, -13360, 29950, 36223, 43129, 5526, -15093, -28663, -50924, -16266, 9266, 22078, 29040, 22901, 19623, 21157, 1536, -46039, -49431, -18891, -41394, -9086, 6199, -19066, -65508, -47654, -30241, -6240, 13005, -17080, -20809, 7018, -6841, -16895, -99558, -124990, -69332, -64748, -69232, -30078, 5730, 1841, -16921, -16038, -4681, 36695, 65598, 53591, -606, -16871, 7328, 31874, 17815, -13189, -58056, -43093, -54876, -29989, 25833, 10565, 45568, 118044, 211516, 296180, 392418, 487608, 474448, 353884, 229035, 161414, 137404, 76526, 36775, 69777, 59160, 7474, -28749]
9764b8749K0657K7306J9619O067j1894m1190n4455l5509M7000L2917M9222O732
9752C7723n9020R397M0398j4749M686J0850k4959j3799K3851q862L2407k1495
9740A6428O896N2700n4267l3900j0924k7603k3211K2153L2405j9836l3840L6430
9728c6569J8140k9080L4216J8250J4057k531J5569J2796r662K3031K723L91j0656
9715E0675l6993k8017P50k0285r73r557J3857J8028K3711K2867r515l8983k5602
9702d0037L4571p341r945k5023J0691O486j9718q590K0102j2668j4525L0317k923
9689c8603k3335J53r437L8796P223j4582K6799L9744k575K3980j3194M825l1800
9676G994l1680K6245K2646j7736q966m8959r27M3851L5871m3203k9747L11M4792
$$ y = [-28749, -8092, 19214, 38833, 44900, 33006, -8184, -62639, -98148, -51148, -18231, 30991, 37723, -21297, -11900, 28498, 13749, 18435, 29285, 4326, -9473, 14378, 5516, 37923, 16428, 23324, 76024, 21757, -12143, -23067, -50670, -73881, -51728, -19323, -39159, -72999, -36569, -18429, -47509, -13293, 4957, 19014, 16483, 32052, 44848, 35186, 58217, 60940, 61331, 50675, 13682, -14335, -13585, -33870, -34843, -44400, -30543, -12515, 11196, 34063, 24548, -14435, -40037, -5466, -12807, -22752, -47775, -37084, -30598, -50316, -58906, -38804, -51472, -65997, -35680, -38603, -61938, -61785, -71222, -32426, -25203, -39785, -12986, 26758, 24183, 48163, 34969, 39794, 7994, -23686, 2559, 25205, 7469, -1497, -50456, -51383, -7532, 28339, -14864, -44611, -44300, 492]
9663D92j608j2113O8912p763L54j4969m2469o1666j9559M8768L9956N4795O9752
9650A22882m890j9086l9761m6947j8435L7092K5497n504j8357K0049j6290j8432
9638A7818J848k8668l0436M282N6554J1652j2170j7698J9087r098N811J1311j1894
9625A8399m2885p960O63K573J4657n309J3612q308J1804M279o422K0805Q969q784
9611A6093R571k6339k0844k7648L7529O6652n306k2190J516J2934j5147L050l451
9598B6420N768j2779o7411J6485M9663J9702k378k4963K4413m60q25N491L1031
9585G0157O108l6421k7411l9353k8250r172L0165Q970q849M0324k3835j9091J9052
9572a7606j511j2441J2935K1698l661K2883J271O270J1748o7142j8679O645L7588
$$ y = [492, -1116, -13229, 55683, 47920, 48274, 33305, -9164, -70830, -90389, -41621, -1665, 53130, 122882, 117992, 98906, 59145, 12198, -6237, 30855, 56352, 50848, 32491, 52540, 36250, 17818, 19666, -9002, -39438, -35156, 21398, 33050, 20880, 3182, 22269, 13171, 18982, 30293, 18399, -24486, -32446, -31783, -29210, -14553, -19862, -6250, -14558, -2754, 1525, -4897, 15908, 24877, 16093, 25664, -675, -21519, -49167, -11638, 55014, 49708, 27518, 29034, 41968, 26821, 29871, 26420, 32188, 19409, -48002, -31517, 18146, 37848, 35470, 10507, 34920, 34460, 33635, 39126, 70157, 76265, 39844, 12433, -26920, -55170, -64342, -34177, -25207, -34056, 6268, -17567, -36658, -17606, -19117, -31558, -18623, 3075, -586, 22297, 23568, 29838, 41586, -25556, -44235, -37590, -2]
9559bM6589k986M874O51O454k7785j1151q323j4798N216M1490L1309l3990p2473
9545c4925l9468L9467K1232J7879j173j8756L3662J990o882q894K1629M7188k1734
9532E1215m2712j6466j2161q042M6833K4599o3246J6361M5781l556j7605j3094
9520G907j1402m630l0428j4254K1735J1880J2009r69J8309J6920l0439K360L0219
9507B9217j1761n8355k2682K4670M3145l906m149k6157m2677L9961M7126P467
9495B1899J4478q139j2360j3773j4534M3677K3598m1723j2971m354l217j0534
9483a7953O834L1616O366N171k3386j1466r822j0131J5464O866K19r064J2005
9470B719l3817L6106O0579N394j4483l3890j4027J184m7986l2208J5529L6283
$$ y = [-2, 46587, 43601, 48475, 49126, 55580, 27795, 16644, 8321, -6477, -1261, 40229, 71538, 37548, -34925, -74393, -34926, -13694, 4185, 3012, -15744, 17918, 19908, 13026, 4132, 25761, 72949, 51215, 8503, -7963, -20124, -28166, 18667, 43266, -19980, -3619, 42162, 38606, 21001, 7907, -3495, -8125, -38553, -52807, -31072, -19192, -7183, -8152, 10157, 27077, -3362, -1002, 29217, 17456, -40899, -63581, -38911, 4234, 328, -3821, -29978, -72655, -32694, 14432, 21899, 36377, 28238, 15878, 2105, -12429, 31248, 54846, 13123, 152, -4202, -7419, -17953, -11119, 20497, 26863, 32034, 8648, -2818, -12640, -22771, -7307, -441, -222, -9286, 2719, -31098, 5008, 65587, 70981, 56498, 22608, 8581, 9765, -38221, -70429, -54900, -18617]
9458a8617K4866K6236p833l0142o779l1108L124o293k4896J907L6622J3464K3194
9445C745K3599J325k5424J5389j3648l1705J1365J5126J4467k0356N493p203J4629
9432F802k1672K186K9826K8324m2684n480L1241J7220R344j1923m289J8343q693
9419D8545k7173l5560M847j2920J0179j4487j5508P599L0489q473J314k5560j7166
9406e3874L4792N1097J2852n0267M432m727l520j8412m9190k1795Q86L6902M8912
9393a1912K9469p048j2871j673l0168M146J0171L2565M1823l6645j8245q715j4146
9380b3249J6877l91k3151K4788j3619Q946o997J8169M8695j0474l0820r188k7480
9367b7894j4581p452J3664n368O7055L0752k6108j1490L310j1773o450k2736k8706
$$ y = [-18617, 6249, 32485, 24652, -5490, -12269, -43377, -40253, -46546, -71442, -69535, -32913, -19449, 3745, 27344, 28669, 3245, 18634, 4986, -26719, -15354, -228, 14239, -6117, -624, -7827, 6802, -14870, -12684, 17142, 45466, 2782, -2698, 28543, 45763, 55107, 43184, 38895, 57238, 48545, 21372, -14188, -9341, -22261, -12082, -26569, -42077, -34478, -3989, -12462, -11148, -36708, -53874, -19082, 32015, 44867, -5400, -968, -5695, -9215, -27627, -76817, -98612, -97726, -60824, -11912, 17557, 10509, -2362, -4035, -34203, -30057, -19886, 12679, 54502, 17857, -388, -9103, -23249, -6372, -6763, -29914, -5126, -18745, -9799, -16796, 1373, 50068, 39594, 8774, -414, -27894, -42475, -49927, -36263, -41631, 25424, 56176, 30068, 18578, 21888, 10115, 3665, -19071, -47777]
9354d7777L8630k0319m4052L429j6206j2377K8620r337k467j3764J3830M0320
9342d1470K8379q097j2371L2431j8562J7351M1474J4020m5844m6208l2983J8851
9330e3029m883K383K090L944K8283l016Q974Q935n1620j99L9526J4520k2142J6651
9316i583J1983J4933l6020k4937M7270M6004j3672L2362L2136j5970m8324j3068
9304B3114J2996m682j7875k9139k9850P583o684J3260M2863M0845N5157m1587
9292F6001l3704k4888m6007J2504j0932N554K8723m501k5911q047j5561k1237
9280g8006K0921J1644K1066J8254J4168m870K1613O324m0980O479M2502j4879
9268B4236l241k4169m7861l533j3836l3725N463L2063R0K9805K2827o4640k8403
$$ y = [-47777, -9147, -29466, -73518, -70089, -86295, -98672, -70052, -79389, -81856, -95620, -81790, -41470, -13091, -21188, -33559, -1128, -19690, -2339, 39135, 53155, 7311, -38897, -71880, -53029, -57912, -55529, -53439, -49495, -21212, -24228, -15254, -6319, -57939, -58138, -18612, -4092, -26234, -9583, 2400, 17333, -18687, -43624, 3646, 49650, 35978, 68340, 100476, 84506, 36182, 23114, 36110, 31428, 13553, -15586, -45436, -37853, -44537, -31277, 11586, 52431, 107588, 66001, 32297, 7409, -38598, -26094, -37026, -31472, -2749, -7250, -33161, -41208, -56769, -78006, -57085, -45441, -24375, -6121, 8047, 3177, 24790, 31114, -9866, -3387, 39115, 24236, 20995, -3174, -51035, -54568, -68404, -102129, -96666, -64603, -64513, -34708, -11881, -76521, -104924]
9255a04924j5262J7665N9853K5157n658m762l6692R964M0188l469o86Q839l069
9242a2856j9883K475K6585J120r983J5722J6485P748j4351j8931k4444j0064m024
9229d4401k3513L5976R846j0153J0320J5478L1k3549O209o137j0728L0423L525
9216f673L8076m37M213n6304j4784L5599J0498J3293K7642o069k0016l4541j8943
9203b8446o723r404J6204J7473J7679l755j2911k6797K664K8232J3422j9294K5661
9190A4005L9540K6860l8874k2873J2618k5674m4757j3130M9877J8706K6012l218
9178C9092J7007N7607R274n8990m7630K0018J4872m287j3041j866l0079k7780
9166b5803J5197j7808J8984r759k936K4648K7772K1036j577l5797l9217j8094
$$ y = [-104924, -120186, -102521, -42668, -17511, -23169, -27931, -64623, -54659, -14471, -17940, -18626, -9787, -12856, -32739, -30264, -3679, -2559, -12542, 3180, 19665, 27413, 13062, -5869, -30313, -40377, -44401, -67914, -31938, -22092, -32245, -21925, -6447, -6416, -29965, -23756, -29893, -40621, -10198, -6673, 31403, 30966, 35179, -21125, -35909, -310, 10188, 23481, 51123, 45054, 25038, -9503, -28446, -35169, -44573, -28369, -10896, 6783, 3028, -9883, -36680, -34016, -5784, 7638, -11656, 14005, 53545, 80405, 41531, 18658, 31276, 5602, -39155, -52285, -2408, 16298, 42310, 39092, 56099, 113706, 122980, 63990, 16360, 36378, 51250, 46963, 33922, 32056, 1977, -25803, -10606, -28414, -9430, -19189, -22125, 2523, 30295, 51331, 49754, 13957, -25260, -43354]
9154d3354j6042J487K8846J0051k8383K8354J1832K2878N168m1133l42O505j3612
9141b7745N79r917k2091j1202J6562j1266k3705K4543L4516k820J5596Q566j4063
9128b2447n3871j7806P902J3158K680R440J1896N3595L7092j3522j8490M577o19
9115A3585k2497l8821R959K1579L5053O1383J2932j3466r0161m2528L992K2338
9103b6652J839J3192K1377K6287r019j2445k6387l1167o402O0761N5201j985k5605
9090C8995k2821o748j7259N419J3867j7768K1505J7093j3817K4690j0408P987
9078D0735P025n6043j8196K0781k694P429M2693K0232l9081l3909l3380k5467
9066f9875j845j3M115J7775L1370j7047l1724K2627K8642j1168Q795J547j121
$$ y = [-43354, -59396, -57909, -29063, -19012, -47395, -19041, -7209, 15669, 20837, -20296, -20638, -14133, -27745, -27166, -37083, -59174, -70376, -53814, -65080, -88785, -64242, -29726, -32546, -16950, -8384, -22447, -76318, -94124, -86222, -73064, -70384, -60944, -49048, 4547, 41639, 28117, 9627, 14204, 13585, -8912, -47733, -37774, -16195, 18858, 80241, 93173, 79707, -10454, -52982, -48990, -26652, -24813, -11621, 9756, 36043, 27024, 14579, -11808, -42975, -49377, 11384, 66585, 64600, 38995, 16174, 9426, -7833, -2414, 11453, -6315, 15190, 32283, 18466, 43156, 32748, 40735, 47760, -8283, -26479, -5698, -8392, -963, 41730, 61962, 22881, -11028, -44408, -69875, -71720, -71733, -67618, -49843, -18473, -35520, -67244, -44617, -15975, -27143, -18348, -16801, -17922]
9053a7922J3217K6763n38l4436n6289K2285p307k1938J5259j4257L4247K9008
9041a1908j1762m507k5914P66M2676K8132K1152m5165p523J2295K2885j4566j7260
9028a0699l1258m115O919j9223j9322p824j2072O749Q423K7496k0198j1102K4886
9015f1340J8589N394j5051J6895K7085J4540L6604M7555L271l8819K3714k2379
9003E6058j1313j7665j5925j9416M20R465k9270l1517j531J2692J9434J3730J3264
8990a574l2028k1662P006j188L579N0327K3994n75K9933j2641n1261k266L8386
8977C0030J0057j0390k4818j7213q044k122L3597k3047J607J289J9077J7907p3
8964B7857P156k1690j4974N249L9719l7310m104K0211k3226j0607K8941K6689
$$ y = [-17922, -4705, 22058, 21520, -12916, -69205, -46920, -54227, -76165, -60906, -75163, -40916, -11908, -23670, -28177, -54091, -53325, -10649, 17483, 38635, -6530, -14053, -1758, 21127, 6561, -10699, -41957, -46072, -39153, -58376, -77698, -85522, -97594, -90845, -82422, -54926, -75124, -86226, -61340, -42751, -37357, -52408, -35513, -8428, 6112, 42716, 90271, 93542, 54723, 78437, 56058, 44745, 27080, 11155, -8261, -7841, 1624, -27646, -59163, -60694, -48002, -28568, -14838, -1574, -33602, -55264, -48258, -49446, -45867, 4460, 28454, 27879, 57812, 45171, -6090, -8356, 30030, 40087, 29697, 4879, -12334, -20378, -22500, 11097, -11950, -10343, -9054, 10023, 27930, 27857, 35013, 13323, -1651, 3598, 43317, 6007, 1903, 22114, -1112, -11719, 17222, 43911]
8952D3911p1621l2262L1169M0595J3309j7407K6129K5641q069r007j6601r810
8940A5977m8871j2522O613M8015j3513j5798m825O328K0174M325R63L8654J2425
8927E7945l8184J5693K5215n2476j2127J5720l7375K973O000m2052j4218m5045
8915a17931L7942M1329L5173J2921j6697j9081k1092L874K3706K9711j2964k2951
8903b6060j7431M2020L5811j3993j8559l0868j6824L8220L1590M0075k6039k6627
8891A1315j9873j3974q828M1216J1505n7487k6066J7706m720K6353J0761j7426
8879b9518J5234K858K0210K6714m731l3975j1051K3869J4549J3779o134J2861
8867D4665P199m3641p818o5065m0671K1580K8506M961L0843P805l0098L35J9201
$$ y = [43911, -27710, -59972, -28803, 11792, 25101, 7694, 33823, 59464, 51395, 42388, 25787, 15977, -32894, -45416, -38803, 9212, -4301, -20099, -24924, -18596, 1578, 5903, 6866, 45520, 57945, 19761, 35454, 60669, 8193, -3934, 11786, -25589, -22616, -16616, -58668, -72886, -117931, -79989, -38660, -3487, 9434, -7263, -26344, -47436, -43562, -19856, 9855, -3109, -26060, -43491, -1471, 34340, 20347, 1788, -29080, -45904, -7684, 23906, 63981, 37942, 11315, -8558, -22532, -31360, 9856, 21361, -36126, -62192, -44486, -49206, -22853, -12092, -29518, -14284, -11426, 8784, 35498, 30767, -3208, -14259, 9610, 24159, 37938, 31804, 44665, 51864, 8223, 405, -64660, -105331, -83751, -55245, -50284, -19441, -11636, -41734, -41399, -22198]
8854b2198J8842j9631j9234k8225L6392K828j3178K0369K3120R156L573M1577
8842E3391p933k6429k5046l6833o601N8149K6104L602l2065O179P611k5180k447
8829g498k9587L7046L4792j6895k7264L8746k463j947o177k1650J9996p381l5306
8816b5588J3793J0284k0844n739K8939J7123J2259k2488k9733j7601J3328j2708
8804c8975m045j6606p388m271M3915K9820r877l6759P507K4360L945N4381R192
8791E5199p025j2253m1095j6278K0306k7506k5373K6121N0352O011j5655L6308
8779D9112j6786j2142M5497j6580q030Q563k4725n213p60K538k1736N122L7085
8766D1945j5075l7070j6133K5813p598l304J726L410Q0l5952M916K5989K4313
$$ y = [-22198, -3356, -22987, -42221, -70446, -34054, -31226, -44404, -24035, -915, 8241, 11814, 53391, 45458, 19029, -6017, -42850, -49451, 8698, 34802, 38404, 6339, 12518, 20129, -5051, -7498, -37085, -39, 34753, 17858, -9406, 29340, 26877, 24930, 18753, -2897, 17099, 9718, -25588, -11795, -1511, -22355, -28094, 845, 17968, 30227, 7739, -21994, -39595, -26267, -38975, -43020, -59626, -67014, -71285, -27370, 2450, -7427, -44186, -36679, -12319, -8374, 46007, 55199, 48174, 35921, -5174, -21452, -1146, -28652, -54025, -27904, 22448, 28459, 12804, 49112, 32326, 20184, 65681, 49101, 41071, 49634, 24909, 19696, 18936, 21474, -262, 4860, 41945, 26870, -10200, -26333, -520, -8118, -11422, -9696, -6286, -6206, -42158, -37242, -11253, 13060]
8753A3060K0178k9758p353k6077j9687l7805j9321L6333J2766L953J5271l4208
8741g2648j4791J1791M2807L4466k5794J045J3059J4783M4049m992K638J5685
8729F2098J5526J4792o2342k3129k5219r17N099o613J1689L3622K9500N627j6049
8716D3684n5518J6324L2378j5929n5570l0088M0445M0670m1573j5423L1610k031
8704a1021p942j8464j1480L5854K3979j7190r688o374m0462J4363j4874j5517
8692g8816k044K191M7988N1589K2980l7722m046L2579J5208j8678m6630J0802
8680d599M0292k074m3201L534N385N5606j4226k8651K3634j8181J973j4227J6179
8667B1444O734J6390J3710j8346k3702l7618K1500M7512K0219k7786j1861j7750
$$ y = [13060, 33238, 3480, -3873, -29950, -49637, -87442, -106763, -70430, -57664, -53711, -38440, -72648, -87439, -75648, -32841, 1625, -24169, -23124, -10065, 4718, 48767, 43775, 46413, 62098, 77624, 92416, 30074, 6945, -18274, -19191, -14092, -20705, -9016, 24606, 54106, 59733, 43684, -11834, 4490, 36868, 20939, -34631, -64719, -24274, 16396, -25177, -40600, -8990, -11021, -18963, -37427, -48907, -13053, 10926, -6264, -15952, -22326, -62788, -48425, -63299, -78816, -80860, -78669, -30681, 20908, 43888, 6166, 2120, 34699, 49907, 31229, -15401, -4599, 35693, 33619, -9582, -6048, -663, 54943, 40717, 12066, 35700, 17519, 19492, 5265, 21444, 28178, 44568, 58278, 39932, 16230, -21388, 112, 47624, 67843, 40057, 28196, 10446]
8655A0446j4266L0167l538p4322j46j8626p820M8076M3911P260l4538m184k4420
8642d2000O830J2304m7704m7284L5918J8731L2937l4J033j9209j1438K407K468
8629e5041j3390K7430M1519j6085k3932L895P874K3270j3328k1041r780N693L2706
8616a0210O6512k7443k7986J2738Q645k2884j3483l3980j2591J129m537k7263
8604i1353K0577K0727K9919J3802n177o022R576k842K3078k4881k0387j1116J4804
8591b9295L2901L3755L3097J4939L7922j6233k1174m2349k5728j0001L8670L0129
8579G6633J3604m1127j5949n2529l906n676J8029r18p84k5180M0263K2596n315
8566A9741K1554j1186k9450K6373M6502j5608n7527j8452k989K0137l387j1202
$$ y = [10446, -3820, 26347, 22809, -51513, -51659, -70285, -78105, -30029, 13882, 21142, -13396, -17580, -42000, -35170, -22866, -70570, -117854, -81936, -63205, -30268, -30302, -29269, -48478, -59916, -57509, -55041, -68431, -41001, 518, -15567, -39499, -35604, -27730, -4460, -17788, -38829, -48609, -42916, -10210, 56302, 28859, 873, 13611, 22256, -628, -14111, -48091, -60682, -59553, -64090, -91353, -70776, -50049, -20130, -6328, -11505, -17527, -7951, -10793, 12285, -12596, -32983, -44099, -29295, 3606, 37361, 70458, 85397, 123319, 107086, 85912, 43563, 17835, 7834, 46504, 76633, 90237, 49110, 33161, -19368, -23274, -28950, -10921, -11839, -12623, -37803, 2460, 25056, 19741, 41295, 30109, 659, 27032, 73534, 57926, 399, -18053, -21042, -905, -4292, -15494]
8554a5494J7474l4048J3462L8159J077R196L5253j6380l0536q910J9077L0234
8542E8564m1573p6657M9633L3111L809j2370R026J3224J846O2918K0951k6568
8530I5914o616n823k2752J281m7552l6878L1668K8490o283k4490j0120k2370r02
8517b6433j1143k6524K5918o038k4898J5986R00J0002K2661O1646k2174n5905
8505c6002L994J1520q958J1290J6325K5611L549j1297j6288l958q336j0128R001
8492a3677L9425K3960o76J8905j0955N664L3832L9558M1031l1278p0272l2410
8480D3107K8732L9883L76k4630m2466l3330p765J3814J0219j981J2053j5844j2826
8467I342k2875k4809K4189m378p506J8262J9612n1012n764L7104J2131L7090J1351
$$ y = [-15494, 1980, -32068, -18606, 19553, 20630, 29826, 65079, 48699, 18163, 9253, 28330, 58564, 16991, -59666, -10033, 23078, 26887, 14517, 23543, 36767, 38613, 101531, 122482, 95914, 89298, 83475, 60723, 62004, 14452, -22426, 9242, 37732, 31449, 6959, -3161, -25531, -26433, -37576, -64100, -38182, -44220, -69118, -53132, -52232, -42230, -19569, 42077, 19903, -36002, -32008, -20488, -29446, -18156, -1831, 23780, 27329, 16032, -256, -4214, -12550, -22678, -13677, 25748, 49708, 49032, 67937, 56982, 62646, 96478, 136036, 177067, 145789, 75517, 43107, 71839, 111722, 112098, 87468, 45002, 11672, 3907, 17721, 27940, 25959, 38012, 22168, 9342, -13533, -38342, -14153, -18531, -26037, -7775, 11837, -39175, -44939, -7835, 4296, 41386, 52737]
8454E2737j6350l5228m1898j3013J8652L3684K6885k8617j9981K9580L3135J3393
8442E2979J7756M9044K600q529J5783j7130l9897l9810j0305l0937R761N0052
8430E1367P918k3160j9436j9006J6721L6496J308m9340j3405l9584M166J1543
8418c4412l95k0025N244r415L4720K0032P508r316k2650j8212M8389l5266J99
8405c3599K3690n122o278m5637P087M3881J1372k0790K9954J1314o425p671r800
8392h024J804M096K968K0535P624R336q424o97K9118N464k1300m8493k3300L1067
8378A774K9319k2135O943q666k7214L5344J4306j9765j2353K5460J9700l0334
8366A2379k9175J4523K8270n640Q511J0935L2234j313k2476j263J9139J7849o0700
$$ y = [52737, 36387, 1159, -40739, -53752, -35100, -1416, 25469, -3148, -23129, 6451, 39586, 52979, 70735, 119779, 122379, 113850, 129633, 112503, 72606, 32796, 22491, -8446, 1315, 51367, 59285, 36125, 16689, -2317, 14404, 50900, 52208, 2868, -10537, -50121, -45955, -34412, -34807, -54832, -49588, -59003, -24283, -4251, 3257, -6059, -28709, -46921, 1468, -33798, -33599, -9909, -15031, -21309, -66946, -59859, -15978, -4606, -25396, 4558, 15872, 9447, 1776, -8024, -6220, -2124, 844, 21379, 29003, 38339, 29915, 29218, 58336, 63800, 42500, -5993, -29293, 1774, 31093, 8958, 15901, 7235, -19979, 15365, 29671, 9906, -2447, 23013, 42713, 12379, -16796, -2273, 25997, 20357, 28868, 39803, 72037, 70724, 48248, 46985, 66124, 83973, 23273]
8353B3273j7950J1062o641n334O1436q033l8981K0710J183j8158L0374l1867k5545
8340d471m920k1893j75K3699L4570J9130l2397P050j5340k748K2989J1783l2037
8327E240k0216K3137J1006m417l9434j5235J8421J846r976K5306K7758K0747J8195
8314F2378J10o4728l1697M772J9708J1972m383K4754m0665J6121K5639M4030K204
8301G0215j745J6519j7957l3109R713K9855K842m6379o3082P086L2556k7519j2254
8288c3259k289J9427k4159l3527J2742Q4707J6718k6056p201J083J2503j6041
8276D648k920p021Q256Q531J221k7454K6942k1320j0912j6693J3223j3117l163
8263c9779k43q157J2420P48j8755o816M26L3879L1686L348M9342m481m3124k250
$$ y = [23273, 5323, 16385, 9744, 4410, 65846, 57813, 18832, 39542, 40725, 22567, 52941, 21074, -4471, -9391, -31284, -31459, -7760, 26810, 45940, 13543, 20593, 5253, 2505, 25494, 37277, 5240, -14976, 8161, 19167, 14750, -24684, -39919, -21498, -19652, -29628, -4322, 23436, 44183, 62378, 62488, -2240, -33937, -29165, -9457, 2515, -1868, 22886, -17779, -1658, 23981, 68011, 70215, 68470, 84989, 67032, 33923, 43636, 73491, 76333, 29954, -33128, -26042, 6514, -21005, -33259, -35548, -16121, -40280, -73807, -61065, 23642, 40360, 14304, 7103, 8186, 20689, 4648, 1728, -5293, 2963, 11494, 12715, -14739, 12203, -9117, -20029, -36722, -23499, -36616, -39779, -40022, -48179, -35759, -35011, -53766, -60582, -60156, -26277, 5409, 8757, 58099, 53618, 10494, 8244]
8249H244L040L987M564J9353j1597J9546J8409K7391j609l5517n3525l0953M832
8236b3835J9817K4071K960k2192o783k7882k6991J9565K5099J3616M443k151o580
8223f843L919J1387K4861j0594j2910q17N629j1063l660k1250m4448J469J738
8210f2582j672n501k5637R158M6136L7023l5848j0977J8789K2966j5431P259J7911
8197A594k0067k0135M2278M31j6704j8757p092K0293J2689M898k4745K0928J5519
8184A1130J4410j1265m4723j0563J3388k8909L4896K6640M3314L760p1154r886
8172b8962M8264J9483p7459p884K6491j0003k2361J0727o554j2750L6023K7152
8160B167l9500O475K4812L4415L196R918J4935k7219o111K0022k4297k4841k8699
$$ y = [8244, 11284, 15271, 19835, 39188, 27591, 47137, 65546, 92937, 91328, 55811, 2286, -28667, -23835, -4018, 20053, 23013, 821, -5962, -33844, -60835, -41270, -16171, -2555, 1888, -263, -6843, -2924, 8463, 33324, 22730, 9820, 9003, 14632, 3569, -91, -21341, -65789, -64320, -62582, -64254, -69755, -95392, -86234, -40098, -3075, -38923, -49900, -31111, -8145, -23576, -16317, 1594, -18473, -38608, 3670, 4101, -12603, -31360, -38452, -18159, -5470, -572, -25317, -4389, 11130, 25540, 14275, -30448, -41011, -27623, -56532, -21636, 5004, 48318, 52078, -19076, -28962, 19302, 38785, -38674, -46558, -20067, -30070, -52431, -41704, -48258, -61008, -24985, 2167, -37333, -30858, -6046, 28369, 31565, 41483, 56418, 29199, 23088, 43110, 18813, -6028, -34727]
8147c4727j3739O484L196p270q966k2829j943L1311J8884M1619K8866j4233j0320
8134A6333j5020J1250R855J0233j8744l4799J3286L0223N060l4929J385L5768
8122B9901J9179K883n4733n4167J5418K7836K0171L5655K6510Q833m8578k8796
8110A12R215k3003k4101J6372p18J2361P120k1858J0970K5804J4994L1239j1654
8097D6853k3832n0839N954J4228J8568k5010o4730J9921L8279J175r318j3036
8085d1787L5056K089P591J003l6185l2239K8163M0423m5094J0790J8929j4634
8073b5895j1134j0335P574j9714K0542L9690L0557m416l9110j4603J3485q281
8061b1640p887O5978L148L772k5376q886Q565L0695j3709j7313j8940R697k1426
$$ y = [-34727, -48466, -41982, -38786, -46056, -55022, -77851, -79794, -48483, -29599, 12020, 40886, 26653, 16333, 1313, 12563, 22418, 32651, 13907, -20892, -7606, 22617, 27677, -7252, -5867, 29901, 49080, 51963, -2770, -56937, -41519, -13683, 6488, 42143, 68653, 77486, 28908, 112, 9327, -13676, -37777, -21405, -22123, -9762, -2642, -24500, -13530, 12274, 27268, 58507, 46853, 23021, -27818, -21864, -7636, 10932, -14078, -78808, -58887, -20608, -19433, -28751, -41787, -6731, -4642, 2949, 3952, -32233, -64472, -36309, 4114, -40980, -30190, -11261, -25895, -37029, -47364, -39790, -59504, -38962, 728, 31285, 26869, -12241, -26844, -13359, -21640, -29527, 36451, 39599, 43371, 17995, 9109, 17674, 48369, 34660, 17347, -1593, 8104, -13322]
8048a3322R756L298P644q287l0844j3879O852K9929R104l2398K7269N8106R593
8035F2821l6791m5599R875Q496j0269K954K054j2432J3528k0704K7965J1285L7400
8022E0583J9413P469J838o298m9544k3945j2452k8624k2209J2141L1014J3924
8010f690Q543O029P96k9598J1559L526r685k9981J2478K4190K6790L1087m5191
7997C853l1360j1372M0617J2257J269K8325m054j7135j8918J7275J7437j1925
7985B6269k7682k5284M1240J8500k6557K919R082k0605R258M3042j4029j0220
7973B5933k5869j3725L3767J9153l7346l548K78p204J8065N2840J028o349j6792
7960D0231j5022K5616L73j1343l0981R280l0938J1568J5038J5749j6332k4875
$$ y = [-13322, -3566, -268, 7376, -911, -31755, -45634, -38782, -8853, 251, -32147, -4878, 53228, 62821, 26030, -19569, -9694, -1198, -11467, -8513, -6459, -18891, -5363, -26067, 1898, 13183, 50583, 69996, 77465, 79303, 73005, 23461, -484, -12936, -41560, -63769, -51628, -20614, -6690, 1853, 7882, 8678, -20920, -9361, -5835, -15520, -45501, -33023, -8833, 17957, 49044, 3853, -27507, -38879, 1738, 13995, 15264, 43589, 39535, 22400, 3482, 20757, 38194, 26269, -1413, -26697, 14543, 33043, 6486, 9405, 18487, -2118, 7140, 50182, 36153, 25933, 64, -13661, 20106, 39259, 1913, -1635, -1357, -8561, 9504, 62344, 63372, 57023, 40231, 25209, 50825, 51198, 39855, 8874, 18154, -12784, -1216, 13822, 29571, 13239, -11636]
7948a1636N231K400q626p848J138L376K2783R316M0651J7063N021k1673R90o053
7934E2133J2647m0106m2359m2828j331L4505L3391K2276L75j5222m0544k0398
7922d7461k9012k373J9420K3454k252J4966L9511j1899k8253N652K9218l211j2665
7909d905M6462k209k591J0424P397l6380r693j9707j3692J8460K9445r606q784
7896D621r628k3298l3775L326N542N5436L8922q850r343q390j4004m4964k2646
7883f7051K1032L7478K5589k6232P412L7149k8771J56l2033L558L5022p251o755
7870f97m2497O025J2196j8008j8036K0709K557n140l6044P271L5865J6267p179
7857b6711N783K0753J1371k3259p48K2428R54j5738R493k6929l1211r740k0487
$$ y = [-11636, -6405, -4005, -12631, -20479, -19341, -15965, 6818, 16134, 56785, 73848, 78869, 57196, 58186, 52133, 64780, 24674, -17685, -60513, -61844, -27339, 6052, 28328, 28703, 13481, -27063, -47461, -76473, -78846, -59426, -35972, -38224, -23258, 16253, 4354, -23899, -18247, 10971, 7760, -4905, 41557, 39348, 36757, 47181, 54578, 18198, 8505, -11202, -24894, -6434, 23011, 13405, 4621, -5007, -28305, -62080, -58754, -53212, 2224, 41146, 32296, 22953, 14563, 559, -44405, -67051, -46019, -8541, 17048, -9184, -1772, 35377, 6606, 6762, -25271, -21713, 13309, 6058, -697, -43194, -37169, -24973, -42981, -61017, -40308, -37751, -42891, -78935, -71664, -35799, -19532, -26711, -20928, -175, 11196, -12063, -12811, 9617, 10571, -5167, 4326, -22603, -53814, -63554, -84041]
7844h4041J9429K0471K1319N1041j1448k3031k6936K3477j5299k072N4785J1022
7832C8717R274j3158k367n0556j1696l0948K6723O2375J4802k1635q635Q863K4956
7819D6715j2677p736o6445k9001Q655K5096K3699L0229P662J1831o0830k0832
7807d3634K1111K2148K7037R686J2018k1636m6077l5269K1074J8511j8128J4803
7795a8356J0910R587k4760j3745p448J5726m464L1024L3380r327k657J6878j5180
7782B1568j3435m5334J0295O0125L5301l8393m6026K207k4847j6288K1103J6838
7770a6886K604K9364k8355m7355J1249J9169J9431K2967L1949J07m9974l3545
7758c9275J3394K7451j845k3163N1367J1428j4600J4449J2223j1106k7679k6126
$$ y = [-84041, -64612, -44141, -22822, 28219, 16771, -6260, -33196, -9719, -25018, -27090, 27695, 38717, 47991, 34833, 32466, -18090, -29786, -60734, -34011, 28364, 43166, 21531, 12896, 21759, 46715, 34038, 26302, -40143, -69144, -60489, -35393, -11694, 18535, 26197, 38028, -22802, -43634, -22523, -375, 26662, 36348, 48366, 26730, -19347, -54616, -33542, -15031, -33159, -18356, -7446, 2141, -22619, -36364, -43812, -28086, -32550, -1526, 31854, 22527, 19870, 36748, 21568, 8133, -37201, -26906, 33219, 68520, 30127, -15899, -13692, -38539, -54827, -33724, -16886, -14282, 15082, -13273, -60628, -49379, -30210, -10779, 12188, 44137, 44244, -5730, -39275, -25881, 1570, -275, -23438, 27929, 39357, 24757, 39206, 51429, 40323, 12644, -13482]
7746a3482n23o702J7320L2044P496j6666l3964m0026L1196K5448j4654l3417j7987
7733f3917P178L5329j9245k2580M3J7205R037J3672j7722j5331L4348N938j1408
7720b7453P911J7380p967O013L445l988j2018M128o616l0384M9367j6028j2481
7707b8691j0385k0290j7744k4171r90M8059M4715K0560j2910k5261k0824J4121
7695c3811L4091L747L035j9444J1109q168k0899R338J5485j7862K561J55j526
7682b2189k26j9693j3081L0918O220k0185Q424J8274K6557J8061M906L553K4394
7669F5933L2273m2076j8975l3843L884L201M0722k051l2972K6343n811k1859L1887
7656D6656K7485j9433m4434j4532m9637J797M8906J5337J5514J2786q457J7617
$$ y = [-13482, -14005, -20707, -3387, 28657, 36153, 19487, -14477, -54503, -23307, 2141, -12513, -45930, -63917, -56739, -21410, -40655, -63235, -63192, -45987, -36950, -23278, -41000, -56331, -21983, -16045, -27453, -19542, -2162, -10129, -4116, -671, -4659, -16677, -12549, -19165, -49549, -182, -16210, -28691, -39076, -59366, -77110, -101281, -102271, -54212, -9497, 11063, -1847, -27108, -47932, -33811, 280, 4027, 7062, -12382, -1273, -9441, -30340, -21002, -5517, -23379, -20818, -20663, -22189, -22415, -42108, -55189, -24271, -18051, -38236, -29812, -11538, 15019, 33080, 37986, 41539, 65933, 98206, 56130, 37155, 3312, 7196, 10397, 51119, 49068, 16096, 42439, 36628, 14769, 46656, 74141, 54708, 10274, -4258, -53895, -52098, -3192, 12145, 27659, 40445, 31988, 49605]
7644D9605N0293N210l2354l8891M094j5898K682m62o067O371j2561j5402k2188
7631b5568J3003N597L2420k6417k2447N1972J3997k1249k3777j1981J0493j8539
7619b2496J100Q299q693J8227j0808k10L1463n868l6045j0076L0348J2027q373
7606a105R342k195Q125k2087j7757j9774M543m362k2973j1065K1741J4608L8571
7593d388P2924K197k7391l0474l678L974l4620r880P116j5447m266J4868L755
7580b5310j4313j6293K1469J469L0217K5324k567j0938K2284J328m3457L0766
7568A9979q894j2916J4777L3527m482l467j9677m5433N899J8048l0480M913P775
7555b0431q012J760M248R927M2376K7106n9416l1105l2564P127J6579j38N44j5793
$$ y = [49605, 99898, 105108, 72754, 33863, 37957, 22059, 24741, 24279, 18212, 24583, 12022, -3380, -25568, -12565, -6968, 25452, -965, -23412, 28560, 42557, 21308, -2469, -14450, -3957, -22496, -21396, -13097, -21790, -3563, -14371, -14581, 16882, 11014, -25031, -35107, -4759, 7268, -1105, 8237, 6042, 14167, -7920, -25677, -45451, -40908, -45270, -68243, -79308, -57567, -42959, -4388, 68536, 70733, 43342, 12868, 9190, 13164, -21456, -31336, -24220, -39667, -43933, -29065, -25310, -39623, -55916, -34447, -32978, -2761, 22563, 19996, 9058, 31342, 32670, -10787, 19979, 11085, -1831, 12946, 46473, 41991, 38524, 18847, -26586, -20687, -2639, -33119, -28206, -20431, -28443, -26683, -22435, -12508, 29868, 56974, -2442, -33547, -66111, -58984, -42405, -42543, -41999, -57792]
7541e7792K6409J6308l0031j73J4401N864n113l5465J4285K7838M474P075n397
7528a7317K6992K6542j2896J45j1233k1987r442K9956k1767J5102p208q792k2011
7515c3916J1981k7239j2896k462r92k1155J419r395j5839J1664M5585J287j4797
7502f6755J9397r557K9881N4091K0128m4321o042J7104l2878k4865L9432K1619
7490A7234k4800P864K9066q199m1759j7661j9742j7864N5359j943k1617p690j46
7477e1898L2305N872K7450J1772P980L78j3757K0040k9265l2403j0884J0790J0595
7464a1025j7634P119Q848K6877L5163M130k6957j7591P643n2741j4086J0008K8305
7451a1941N5398O673L487M123l674l3815j9051M6096J791m7153l9492n585N536
$$ y = [-57792, -31383, -15075, -45106, -45279, -30878, -25014, -30127, -65592, -51307, -23469, -18995, -11920, -17317, 9675, 36217, 23321, 23466, 12233, -9754, -19196, 10760, -11007, 4095, -3113, -11905, -33916, -21935, -49174, -62070, -64532, -65524, -86679, -85260, -94655, -110494, -98830, -53245, -51958, -66755, -47358, -56915, -27034, 27057, 47185, 2864, -3178, 13926, -18952, -43817, -4385, 17234, -7566, 298, 29364, 21165, -20594, -38255, -57997, -75861, -20502, -22445, -44062, -51752, -51898, -19593, -13721, 13729, 25501, 33481, 33859, 20102, 40142, 10877, -21526, -32410, -21620, -11025, -28659, -21540, -12692, 14185, 49348, 53478, 26521, 8930, 16573, -36168, -50254, -40246, -11941, 43457, 50130, 53617, 57740, 54066, 20251, 1200, 47296, 49087, 1934, -37558, -43143, -37607]
7438c7607k5721J3879P264m6967L5639L165K8141M4549R201j7019l0696r107J719
7425b3560J5875L3321K4256K2441k8788O399r932j7901m3826k2830P870j1708
7413d8383m500j0035M295j154j5836M5528K6355K6972K2884n887m4308o6190j3901
7400h4160Q144N148J9265K5704k3402j2762K2696K1830J9258j3086l1620l09Q196
7387c5098O014j2549K0426P251l9934K6609L1441l005J4849K0000J7669j0696
7375D2977k1663k9750J585J2819J0296k9596j0087J6624N7842M626r411l4470
7363A1792l1095j4729J2583o917K3195J2153m715J8089J9487k4979p641o850k9547
7350b9174K956J5693M672k283Q571M5250N364m6039o2828R214R171R300m770K6569
$$ y = [-37607, -63328, -49449, -42185, -89152, -53513, -50348, -22207, 22342, 31543, 14524, -16172, -25279, -23560, -7685, 25636, 49892, 72333, 43545, 49944, 40012, 22111, -21715, -44545, -36675, -48383, -52883, -62918, -58623, -59777, -75613, -30085, -3730, 23242, 46126, 40239, -4069, -70259, -84160, -76016, -70868, -51603, -25899, -49301, -62063, -39367, -17537, 1721, -11365, -42985, -43294, -35098, -29084, -41633, -21207, -13956, -53890, -27281, 4160, 1155, 16004, 36004, 53673, 42977, 21314, -8436, -6851, 5968, 16264, -13332, -23419, -6795, 51047, 55673, 46262, 11792, -19303, -34032, -21449, -28366, -5171, 6982, 2267, 20356, 39843, 14864, 7223, 373, -29174, -26218, -10525, -5853, -8136, 435, 45685, 51049, 5010, -57818, -48604, -39433, -30133, -34903, -8334]
7336h334LK7988M545k8334k1773k5528k8624j2729J0856L9002K4897K490J6539
7323I98N62j622Q13J5238K5304k2230P741k8538l6515p924L1422R658k737j3731
7309b1561l778L3540K7917m7139k7480M3563P3917k699n9345l2354J0230J7530
7297A2341K8334m4405j443J4883J7048R043k4905j5704J3261K045r445l590R240
7284F703K506m5648l5933K1619L8404K6157p785O452k3378J8255m103k2261l9445
7271e8457j2907O2739K3380j7227J215k6296N678K178L9123K7052l3003N2733
7259F6208O054m3733n879o846J4355K6068j844k0128j1272J5822J9736j5489j0989
7246C2063L9300j7271m0140m1406P819K3602K3734j0508j8472M0260M7028k6522
$$ y = [-8334, -8331, 19657, 24202, -4132, -25905, -51433, -80057, -92786, -81930, -42928, -18031, -15541, 998, 1560, -62, 751, 15989, 41293, 19063, 26804, -1734, -38249, -46173, -14751, -5093, -7830, -21561, -25339, 8201, 36118, -11021, -38501, 5062, 78979, 76280, 16935, -15419, -5189, 12341, 40675, -3730, -5173, 9710, 26758, 35801, 10896, -4808, 8453, 10498, 1053, -2537, 6703, 9209, -36439, -72372, -50753, -12349, 13808, 6023, 12475, -10903, 7352, 3249, -19012, -58457, -71364, -8625, 14755, -2472, -1257, -27553, -21875, -19697, 19426, 46478, 13475, 66208, 72262, 28529, 22650, 15804, 30159, 56227, 54383, 34255, 22983, 38805, 58541, 43052, 32063, 71363, 54092, 13952, -27454, -19635, 3967, 27701, 17193, -1279, 38981, 86009, 59487]
7234E9487m1208n1759l5837J6722K5313L2311K5810k8157r377K2189L8428R719
7222F3641k5550k2389m2166J9353j8525N598j445J5535k2311K1664k0933P909
7210a9619O4638K0233k2562k5874r104p798N305j9920L2303P652l241l1814J7321
7197G520l2740Q731J8684j8896l808j187O161J9095K5431j8030j5821l7713R847
7184c2726O367l384J2938K9032K5301M154j7980j3353j5653k4957L200J6250J2744
7171A933j525K1463K4858j8215r526m811j1830k9898K242R483J2481K5642k872
7158A9425M153N906k5327k495p813L8383K7855l2474J5919L758j4236J0323K1885
7145F5262k8426J0599j7409n358J286K0627O688J7549M3097k3205m6021K2181
$$ y = [59487, 18279, -33480, -69317, -52595, -27282, 5029, 30839, 2682, -6695, 15494, 53922, 63641, 38091, 15702, -26464, -7111, -25636, -20038, -21483, -5948, -28259, -6595, -27528, -19619, 45019, 65252, 42690, 16816, 7712, -86, 5219, -14701, 17602, 25254, 22013, -9801, 7520, -25220, -16489, 2195, -16701, -20509, -21696, -15535, 3560, 28991, 10961, -4860, -42573, -32726, -26359, -29743, -16805, 12227, 37528, 41682, 23702, 10349, -5304, -30261, -27061, -10811, 1933, 408, 21871, 46729, 28514, 18988, 14177, 2347, -27551, -25309, -15826, -3345, 22297, 19425, 23578, 29484, 4157, 1662, -6151, 32232, 60087, 27613, 43532, 47290, 33054, 43377, 65262, 36836, 47435, 30026, 24668, 25954, 46581, 53269, 70818, 113915, 90710, 44689, 66870]
7133F6870m2111l6242M124R975K6485J2150r766k4721K855K4571K4766M6864j6514
7120H9306l0306n3169p1593k1419k1240k4328K7476L6691L5095o960k4840J6265
7108d9022K0345K21j7853L647K0870J2611K4548K011l3541l9933J9368K9277K3485
7095A6034J5667m776m2088l137L3866J3210k3317j6370j3773k2133J6244J7243
7083a3330j1173K5239r338K7708L4722j6988n1961l6009J3912J0561L2099M1356
7071D6798J3167j1316p312J1645j3300l2567K110k1566J2298k512k8025K9568
7059a012k4652j5126k686p603J0192J6008L7601k3891o814o496J3019m5444K2117
7046c4787K2233m4407k0817J0389K30L2211K676J1807K6136j9206J9691j4950
$$ y = [66870, 24759, -11483, -7359, 2616, 29101, 41251, 31485, 6764, 9619, 34190, 58956, 105820, 89306, 59000, 5831, -65762, -87181, -108421, -132749, -105273, -68582, -33487, -40447, -65287, -49022, -28677, -28456, -46309, -42662, -21792, -9181, 15367, 17378, -16163, -56096, -36728, -7451, 16034, 31701, 26925, -15163, -18300, 15566, 28776, 5459, -10911, -24684, -46817, -30573, -13330, -24503, 736, -8602, 19106, 53828, 36840, -15121, -51130, -37218, -26657, 5442, 46798, 59965, 48649, 41337, 52982, 39682, 7115, 9225, -12341, -43, -2555, -30580, -1012, -25664, -40790, -43476, -51079, -40887, -24879, 12722, -11169, -17983, -24479, -11460, -56904, -34787, -12554, -56961, -77778, -67389, -67159, -34948, -32272, -20465, 5671, -13535, 6156, -8794]
7034h794j5221l347q984j277L1210M973j7089m9383k1023o406M1991K6400j1159
7021c8109k5236M089K1218J1597J9632O050j3144L106j8961k8687j6111j0116
7009h4672N7457K0643P176J6016j8883j477J4286L0463J2171k5412o8203L944
6997c6491R685l2370k9003o254J9788K9296J591j4196j5371M9381L4280m799Q255
6984A3792K395j3214K37K5395j2339j219j7706J0885K4063L2231p58n5170o0726
6971e2134j833J2118R055l060k0433j4943L3970J7835k6338J027K1983M3383J8589
6958C9219j2016P774J599Q378p138l9892j3190o653l4054j3847K2398p053k4636
6945g9111k04K5376M6950J6457k025L3876J6611M7167Q061p1247L693J6152m7332
$$ y = [-8794, -24015, -27362, -36346, -37623, -6413, -1440, -18529, -67912, -88935, -95341, -53350, -26950, -38109, -63345, -59256, -38038, -26441, -6809, -759, -13903, -10797, -29758, -58445, -74556, -84672, -27215, -6572, 604, 16620, -2263, -3740, 10546, 41009, 53180, 27768, -40435, -36491, -26806, -59176, -88179, -94433, -74645, -45349, -43758, -57954, -73325, -23944, 10336, 5537, 13792, 16187, 2973, 3210, 28605, 16266, 15047, -2659, 8226, 32289, 64520, 63762, 8592, -52134, -53967, -41849, -32794, -35854, -56287, -71230, -37260, -19425, -45763, -44736, -22753, 20630, 39219, 27203, 34977, 36576, 44954, 37816, -2076, -15266, -21919, -55973, -69820, -47422, -54475, -79111, -79315, -53939, -6989, 9468, 7443, 41319, 57930, 105097, 113158, 41911, 45604, 61756, 14424]
6932A4424l3092K517N2518j3412l859m3276k1097J4296K4361j9002k630K3459
6920d793K1212j1222L60n77k5082J2770J2542k4972j1509j6896j997O130J7710
6907b6324k986K7677kp233K1604k8707k6082L5L2941J3911K4585J8091p590r020
6893C0900k7190M4097L3881j6134M6154K327m0621J623M155m8722o8536j2341
6881e0407k933M0999N9414L2397m0847j377j9223K380J8533o088l6374l1535O592
6868b8469Q255Q852n792J1900J0475k5209j6071K601J1549p958O865N301l15k0551
6854c8567P334J5870L3733j6378o583m978k351k2553p935J6340Q313K1971q871
6841d655k8178l5138k0665K2739J7168L7466k1246j1024k5840J5532J5445K1105
$$ y = [14424, -18668, -16151, 36367, 22955, 19096, -24180, -45277, -30981, -6620, -25622, -28252, -4793, 16419, 5197, 5557, 4980, -20102, -7332, 5210, -19762, -31271, -48167, -50164, -44034, -26324, -29310, -1633, -1635, -8868, 12736, -15971, -42053, -42018, -9077, 4834, 29419, 47510, 39920, 30900, 3710, 47807, 81688, 65554, 111708, 114035, 73414, 75037, 79192, 30470, -38066, -50407, -53340, -12341, 47073, 79470, 38623, 37246, 18023, 20403, 38936, 32848, -3526, -35061, -28469, -20214, -11362, -17154, -5254, 5221, -19988, -36059, -33458, -21909, -29867, -23002, -17701, -18016, -38567, -31233, -15363, 18370, 1992, -4591, -9569, -11920, -34473, -42408, -26068, -17755, 4216, -4655, -32833, -67971, -88636, -65897, -48729, -11263, -32509, -43533, -69373, -53841, -38396, -17291]
6829a7291j3424r216m052L1470P043l5545l9532n479L6082J8195K0352J6524J4758
6816A9885j0007p051Q537m364l1674L8369L3617k5087l2051n7224n4080J1749
6804a09381N8556K4465J6353j6935m4806P950K0605L1742j8628q260K2521K2032
6792F214j5735J766l2705k1806J6595K1879K1166l5419j3426L2069M3534Q525
6780C2657l0003j0911M7795j618m2543l5992q106Q851L731M731M7088L9860J6062
6767G1602j7527k6916J7688M749m2451k0647l1370k8555j077Q416P866j8206M5144
6754c1284O4765O4386K0048j4698p64j3169l8653j9655l9783l7110r615j595Q393
6741d8734J48m499L6281M6026J4308m8660l6782J275J2539J0960M509k046j2784
$$ y = [-17291, -30715, -39931, -43983, -12513, -5470, -41015, -80547, -86026, -49944, -31749, -11397, 5127, 19885, 9878, 2827, 11364, 7000, -24674, 13695, 47312, 22225, -9826, -67050, -121130, -109381, -50825, -26360, -10007, -26942, -71748, -63798, -43193, -11451, -30079, -38339, -15818, 6214, -9521, -7755, -40460, -62266, -45671, -23792, -2626, -38045, -51471, -19402, 24132, 32657, 2654, -8257, 39538, 37920, -4623, -40615, -48721, -39870, -36139, -31408, 15680, 55540, 71602, 54075, 27159, 44847, 49596, 7145, -13502, -44872, -73427, -74504, -66088, -58222, -76428, -31284, 33481, 97867, 117915, 103217, 102453, 89284, 50631, 30976, -8807, -45917, -55532, -57127, -48734, -48586, -53085, -16804, 29222, 43530, -5130, -41912, -40637, -28098, -17138, -12629, -14675, -27459]
6728b7459N48j6996K8981P456k6140j5614M9800J4899l5845l8652p333K0958P53
6715d4644P492R378J9489n125R7n397j305q891N5769M3379m4189m9599K4914r06
6701D62J952L456j6809l791K9700M5000P496m867J1916m0760n8052n0733m401
6688g9431K5144L4394L1134m036o618l4873l3151J4983J4328k0400Q029K9468
6676b1029J1976J1686R581Q748m744l319l1378M813o300k0630K2559M0626K8124
6663E0713j8485l0494k2646P257M6107J9606l432k7904k3557l7940j6630Q915
6651d8490k0427P202j1853K7949K5777j3432M91M1549J1738R853l6694l5641M4435
6638B457K0981m3451J1788J8979J3192O06L185j8987p380K1537j14j1835l9621
$$ y = [-27459, -26911, -43907, -14926, -7470, -33610, -49224, 576, 15475, -20370, -59022, -66355, -45397, -44644, -37152, -27774, -8285, -13410, -13313, -18710, -20015, -28906, 26863, 70242, 26053, -23546, 1368, 462, 2414, 5870, -10939, -14730, 14970, 59970, 67466, 62599, 74515, 33755, -24297, -75030, -79431, -54287, -19893, 11241, 7205, 587, -34286, -67437, -52454, -38126, -58526, -50497, -21029, -9053, 2633, 12214, 20962, 16218, 12899, -18479, -13666, -19966, -40596, -18037, 22589, 50713, 32228, 1734, -20912, -13655, 32452, 52058, 48626, 20722, -2835, -40775, -57405, -48490, -68917, -61715, -73568, -45619, -19842, -33274, -32783, 8766, 20504, 30357, -6337, -41978, 2457, 23438, -20013, -8225, 10754, 23946, 24552, 27737, 8750, 1370, 22907, 22793, 10958, -28663]
6625b8663l6550J4214L5654r196L0584J0954L8151m324m2763m3878J0852L2687
6613G722l4515p399M0905N5554j5954p1464j6285k399K6489J4835l3354J7804
6601a8061J4531K9826O909Q281j2774k5920o956J7908k8786J2691j0584J7760
6589D825J8674k6960j318R312J6226k2825r786L5213L1107k5212j2756j4268K646
6576D878J3806O149K5176m3398l8705j0003k2414J8469K5111k5573M391N9702
6564A7589J7825l0486r608l6720j7098q778M315k055N656J5078M7914m581k0765
6551b1714l0946N7089L3572k7063k1751R681P966l7499K033K0627j290j061J2617
6538B261N68M557J6092j0519P552j3766j4262L570K2317k2525J8771j220l3909
$$ y = [-28663, -65213, -50999, -15345, -24541, 6043, 16997, 55148, 50824, 8061, -35817, -24965, 7722, -26793, -34192, 6713, 62267, 46313, -25151, -41436, -43835, -17346, -2511, -35865, -18061, -3530, 26296, 33205, 41486, 28712, 2792, -4164, 13744, -15042, -2351, -12935, 4825, 23499, -3461, -4779, 4533, 20759, -2066, -11852, 23361, 54468, 29256, 16500, 2232, 4878, 18684, 24833, 50009, 6611, -32094, -42097, -64511, -46042, -20931, -46504, -42113, 17589, 35414, 4928, -4680, -41400, -58498, -67276, -62961, -65016, -59360, -44282, 3632, -949, -21714, -52660, 4429, 38001, 10938, -10813, -1132, 6834, -30665, -28632, -8005, -9295, -10356, 2261, 2829, 7386, 23478, 12959, 20511, 6745, -7517, -3947, 18370, -4155, 14616, 13396, -20513]
6525b0513k034l0381J0390J2568l6145J0284K5262n25J2041J8998k7402l6594
$$ y = [-20513, -22547, -52928, -42538, -29970, -66115, -55831, -30569, -31094, -19053, -55, -27457, -64051]
$$ [...]
##END NTUPLES=NMR SPECTRUM
##END=
