##TITLE=Analysis number 311498
Compound Code cc 29602
Book Reference 349/18/1
Project Code adrs
Chemist Name anns
##JCAMPDX= 6.0         $$ Bruker NMR JCAMP-DX V2.0
##DATA TYPE= NMR SPECTRUM
##DATA CLASS= NTUPLES
##ORIGIN= Bruker BioSpin GmbH
##OWNER= NMR
$$ XWIN-NMR		Version 3.5
$$ Fri Jul  8 13:33:53 2005 GMT Daylight Time (UT+1h)  MAYBRIDGE\NMR@NMR_250MHZ
##.OBSERVE FREQUENCY= 250.131544655141
##.OBSERVE NUCLEUS= ^1H
##.ACQUISITION MODE= SIMULTANEOUS (DQD)
##.ACQUISITION SCHEME= undefined
##.AVERAGES= 16
##.DIGITISER RES= 18
##SPECTROMETER/DATA SYSTEM= dpx250
##.PULSE SEQUENCE= zg30
##.SOLVENT NAME= CDCl3
##.SHIFT REFERENCE= (INTERNAL, CDCl3, 0, 16.522)
##AUDIT TRAIL= $$ (NUMBER, WHEN, WHO, WHERE, WHAT)
$$ ##TITLE= Audit trail, XWIN-NMR		Version 3.5
$$ ##JCAMPDX= 5.01
$$ ##ORIGIN= Bruker BioSpin GmbH
$$ ##OWNER= NMR
$$ C:\u/data/dgb/nmr/ADRS/5550/pdata/1/auditp.txt
$$ ##AUDIT TRAIL=  $$ (NUMBER, WHEN, WHO, WHERE, WHAT)
(   1,<2005-07-08 13:33:34.49 +100>,<MAYBRIDGE\NMR>,<NMR_250MHZ>,
      <created by zg, POWCHK disabled, PULCHK disabled
       configuration hash MD5:
       62 19 C7 07 E1 42 D1 B7 37 6C 3D D0 77 39 F9 E6
       data hash MD5: 64K
       1A B5 1C A4 E0 CE 57 9E DE F0 6E B4 15 CA 57 CF>)
(   2,<2005-07-08 13:33:45.46 +100>,<MAYBRIDGE\NMR>,<NMR_250MHZ>,
      <Start of raw data processing
       ef LB = 0.3 FT_mod = 6 PKNL = 1 SI = 32K 
       data hash MD5: 32K
       B8 6F 53 FF D5 21 B9 31 A8 5E A3 9F 90 35 6A 70>)
(   3,<2005-07-08 13:33:47.38 +100>,<MAYBRIDGE\NMR>,<NMR_250MHZ>,
      <apk 
       data hash MD5: 32K
       C6 B9 E6 F3 05 E7 C4 23 64 CF 9A B3 38 49 86 92>)
(   4,<2005-07-08 13:33:48.14 +100>,<MAYBRIDGE\NMR>,<NMR_250MHZ>,
      <abs ABSG = 5 
       data hash MD5: 32K
       D5 31 CE 8A 57 5C 67 7D 6E 7A 87 E3 84 CE 0D D6>)
$$ ##END=
$$ 
$$ hash MD5
$$ 49 78 20 55 85 7F 9E 4D E4 BD 89 AD 80 86 FB 3F
##$RELAX= 
##$RELAX= 
##$RELAX= 
##$RELAX= 
##$RELAX= 
##$RELAX= 
##$RELAX= 
$$ Bruker specific parameters
$$ --------------------------
##$DU= <C:\u>
##$EXPNO= 5550
##$NAME= <ADRS>
##$PROCNO= 1
##$TYPE= <nmr>
##$USER= <dgb>
##$AMP= (0..31)
100 100 100 100 100 100 100 100 100 100 100 100 100 100 100 100 100 100 
100 100 100 100 100 100 100 100 100 100 100 100 100 100 
##$AQSEQ= 0
##$AQ_mod= 3
##$AUNM= <au_zg>
##$AUTOPOS= <35 >
##$BF1= 250.13
##$BF2= 250.13
##$BF3= 250.13
##$BF4= 250.13
##$BF5= 500.13
##$BF6= 500.13
##$BF7= 500.13
##$BF8= 500.13
##$BYTORDA= 1
##$CFDGTYP= 0
##$CFRGTYP= 5
##$CHEMSTR= <none>
##$CNST= (0..31)
1 1 145 1 1 1 1 1 1 1 1 1 1 1 1 1 1 1 1 1 1 1 1 1 1 1 1 1 1 1 1 1 
##$CPDPRG= <>
##$CPDPRG1= <>
##$CPDPRG2= <>
##$CPDPRG3= <>
##$CPDPRG4= <mlev>
##$CPDPRG5= <mlev>
##$CPDPRG6= <mlev>
##$CPDPRG7= <mlev>
##$CPDPRG8= <mlev>
##$CPDPRGB= <>
##$CPDPRGT= <>
##$D= (0..31)
0 1 0 0 0 0 0 0 0 0.06 0 0 0 0 0 0 0.0002 0 0 0 0 0 0 0 0 0 0 0 0 0 0 
0 
##$DATE= 1120826013
##$DBL= (0..7)
120 120 120 120 120 120 120 120 
##$DBP= (0..7)
150 150 150 150 150 150 150 150 
##$DBP07= 0
##$DBPNAM0= <>
##$DBPNAM1= <>
$$ [...]
##$SUBNAM7= <"">
##$SUBNAM8= <"">
##$SUBNAM9= <"">
##$SW= 20.6930455092707
##$SWIBOX= (0..15)
0 0 3 0 0 0 0 0 0 0 0 0 0 0 0 0 
##$SW_h= 5175.983436853
##$TD= 65536
##$TD0= 1
##$TE= 295.16
##$TE2= 300
##$TE3= 300
##$TEG= 300
##$TL= (0..7)
0 120 120 120 120 120 120 120 
##$TP= (0..7)
150 150 150 150 150 150 150 150 
##$TP07= 0
##$TPNAME0= <>
##$TPNAME1= <>
##$TPNAME2= <>
##$TPNAME3= <>
##$TPNAME4= <>
##$TPNAME5= <>
##$TPNAME6= <>
##$TPNAME7= <>
##$TPOAL= (0..7)
0.5 0.5 0.5 0.5 0.5 0.5 0.5 0.5 
##$TPOFFS= (0..7)
0 0 0 0 0 0 0 0 
##$TUNHIN= 0
##$TUNHOUT= 0
##$TUNXOUT= 0
##$USERA1= <user>
##$USERA2= <user>
##$USERA3= <user>
##$USERA4= <user>
##$USERA5= <user>
##$V9= 5
##$VALIST= <valist>
##$VCLIST= <CCCCCCCCCCCCCCC>
##$VD= 0
##$VDLIST= <DDDDDDDDDDDDDDD>
##$VPLIST= <PPPPPPPPPPPPPPP>
##$VTLIST= <TTTTTTTTTTTTTTT>
##$WBST= 1024
##$WBSW= 4
##$XGAIN= (0..3)
0 0 0 0 
##$XL= 0
##$YL= 0
##$YMAX_a= 213131
##$YMIN_a= -189039
##$ZGOPTNS= <>
##$ZL1= 120
##$ZL2= 120
##$ZL3= 120
##$ZL4= 120
##$ABSF1= 16.522
##$ABSF2= -4.171173
##$ABSG= 5
##$ABSL= 3
##$ALPHA= 0
##$AQORDER= 0
##$ASSFAC= 0
##$ASSFACI= 0
##$ASSFACX= 0
##$ASSWID= 0
##$AUNMP= <proc_1d>
##$AZFE= 0.1
##$AZFW= 0.1
##$BCFW= 0
##$BC_mod= 0
##$BYTORDP= 0
##$COROFFS= 0
##$CY= 12.5
##$DATMOD= 1
##$DC= 0
##$DFILT= <>
##$DTYPP= 0
##$F1P= 14.0000005364418
##$F2P= -0.99999901652339
##$FCOR= 0.5
##$FTSIZE= 32768
##$FT_mod= 6
##$GAMMA= 0
##$GB= 0
##$INTBC= 1
##$INTSCL= 1
##$ISEN= 128
##$LB= 0.3
##$LEV0= 0
##$LPBIN= 0
##$MAXI= 10000
##$MC2= 0
##$MEAN= 0
##$ME_mod= 0
##$MI= 0
##$NCOEF= 0
##$NC_proc= -4
##$NLEV= 6
##$NOISF1= 0
##$NOISF2= 0
##$NSP= 0
##$NTH_PI= 0
##$NZP= 0
##$OFFSET= 16.522
##$PC= 1
##$PHC0= -68.43082
##$PHC1= -0.3489305
##$PH_mod= 1
##$PKNL= yes
##$PPARMOD= 0
##$PSCAL= 4
##$PSIGN= 0
##$REVERSE= no
##$SF= 250.13
##$SI= 32768
##$SIGF1= 0
##$SIGF2= 0
##$SINO= 400
##$SIOLD= 32768
##$SREGLST= <1H.CDCl3>
##$SSB= 0
##$STSI= 32768
##$STSR= 0
##$SW_p= 5175.98343685301
##$SYMM= 0
##$S_DEV= 0
##$TDeff= 65536
##$TDoff= 0
##$TI= <Analysis number 999999
Compound Code 99
Book Reference 9
Project Code 9>
##$TILT= no
##$TM1= 0
##$TM2= 0
##$TOPLEV= 0
##$USERP1= <user>
##$USERP2= <user>
##$USERP3= <user>
##$USERP4= <user>
##$USERP5= <user>
##$WDW= 1
##$XDIM= 32768
##$YMAX_p= 444484694
##$YMIN_p= -535195
$$ End of Bruker specific parameters
$$ ---------------------------------
##NTUPLES= NMR SPECTRUM
##VAR_NAME=  FREQUENCY,     SPECTRUM/REAL,   SPECTRUM/IMAG
##SYMBOL=    X,             R,               I
##VAR_TYPE=  INDEPENDENT,   DEPENDENT,       DEPENDENT
##VAR_FORM=  AFFN,          ASDF,            ASDF
##VAR_DIM=   32768,         32768,           32768
##UNITS=     HZ,            ARBITRARY UNITS, ARBITRARY UNITS
##FACTOR=    0.157963299565203, 1,           1
##FIRST=     4132.6476996994, 0,             0
##LAST=      -1043.33573715361, 0,           0
##MIN=       -1043.33573715361, -535195,     0
##MAX=       4132.6476996994, 444484694,     0
$$ Real data points
##PAGE= N=1
##DATA TABLE= (X++(R..R)), XYDATA
$$ [...]
$$ plain form
16365 -38051 -11389 143591 176116 64986 -33296 -108231 -207852 -303693 -138158 10348 174093
16354 174093 254875 353623 355758 175501 158842 92679 155349 78802 -64385 9400 -39800
16343 -39800 -110914 -183498 -257006 -352334 -160890 9340 142884 28485 62995 196918 90780
16332 90780 102608 67807 -10369 -6058 -100294 -155446 -152171 -124123 -61568 111999 126597 218704
16320 218704 269313 154094 195861 178520 121691 -19453 112095 170854 252049 202081 -2138
16309 -2138 -94416 31502 -33045 -99716 -118119 -146712 -140990 -40382 -155091 -273470 -238941
16298 -238941 -148935 34623 119407 51971 -19714 45185 93385 139597 164688 55251 -2015
16287 -2015 -104151 -51247 5059 -70184 -161219 -110477 -105015 -107305 48653 86482 -135131 -203006
$$ packed form
16365c8051K6662J54980L2525j11130r8282p4935r9621r5841J65535J48506J63745
16354A74093Q0782R8748K135j80257j6659o6163O2670p6547j43187P3785m9200
16343c9800p1114p2584p3508r5328J91444J70230J33544j14399L4510J33923j06138
16332I0780J1828l4801p8176M311r4236n5152L275K8048O2555J73567J4598R2107
16320B18704N0609j15219M1767j7341n6829j41144J31548N8759Q1195m9968k04219
16309b138r2278J25918o4547o6671j8403k8593N722J00608j14709j18379L4529
16298b38941R0006J83558Q4784o7436p1685O4899M8200M6212K5091j09437n7266
16287b015j02136N2904N6306p5243r1035N0742N462k290J55958L7829k21613o7875
$$ plain form
16275 -203006 -166657 -267035 -156232 -219480 -340087 -431363 -246471 -83937 -15759 57694
16265 57694 17778 -141783 -68329 40616 41581 -159681 -161952 18168 199338 196139 136070
16254 136070 10808 31637 108439 98636 476 -12619 24401 83136 69810 -45531 -46953
16243 -46953 14278 138013 214443 174946 59426 72972 60486 59252 23200 -31641 -102999
16232 -102999 -127944 -82003 -61317 87851 104842 32370 -26641 -83075 -67065 -38790 -49155
16221 -49155 -116275 -155070 -66761 -77124 -246754 -186405 -14825 60884 2885 7782 -40412
16210 -40412 -166608 -234690 -184495 -275429 -141237 -94497 -186134 -153090 7647 93596 134370
16199 134370 21173 -125041 -59005 47901 17786 -53725 -127826 -50931 -10507 42434 -60871
$$ packed form
16275b03006L6349j00378J10803o3248j20607r1276J84892J62534O8178P3453
16265E7694l9916j59561P3454J08945R65k01262k271J80120J81170l199o0069
16254A36070j25262K0829P6802r803r8160j3095L7020N8735j3326j15341j422
16243d6953O1231J23735P6430l9497j15520J3546j2486j234l6052n4841p1358
16232a02999k4945M5941K0686J49168J6991p2472n9011n6434J6010K8275j0365
16221d9155o7120l8795Q8309j0363j69630O0349J71580P5709n7999M897m8194
16210d0412j26196o8082N0195r0934J34192M6740r1637L3044J60737Q5949M0774
16199A34370j13197j46214O6036J06906l0115p1511p4101P6895M0424N2941j03305
$$ plain form
16188 -60871 6896 -72081 -82264 -26350 72908 38653 -100292 -70519 -21827 8714 -37571
16177 -37571 -36553 45155 25876 117207 141560 197830 290094 279826 144798 87240 170005 207762
16165 207762 220685 222840 18183 -91975 -59081 -27146 -4707 -77066 -37003 171471 137070
16154 137070 -69729 -211762 -223348 -144401 -225581 -263864 -254096 -26549 -12927 -72002 -104994
16143 -104994 47718 3045 -207747 -158369 -122525 -67846 33557 77916 176554 98609 45440
16132 45440 116399 106176 60578 13673 -3395 2909 -45310 -105005 -53842 106881 46032 -83753
16120 -83753 -107154 36514 98654 57232 -18075 60941 111362 70620 -63247 -86197 -25787
16109 -25787 -7258 -57101 16114 -35664 -65069 19764 125242 94439 -70475 -135967 16094
$$ packed form
16188f0871O7767p8977j0183N5914R9258l4255j38945K9773M8692L0541m6285
16177c7571J018Q1708j9279R1331K4353N6270R2264j0268j35028n7558Q2765L7757
16165B07762J2923K155k04657j10158L2894L1935K2439p2359M0063K08474l4401
16154A37070k06799j42033j1586P8947q1180l8283R768K27547J3622n9075l2992
16143a04994J52712m4673k10792M9378L5844N4679J01403M4359R8638p7945n3169
16132D5440P0959j0223m5598m6905j7068O304m8219n9695N1163J60723o0849j29785
16120h3753k3401J43668O2140m1422p5307P9016N0421m0742j33867k2950O0410
16109b5787J8529m9843P3215n1778k9405Q4833J05478l0803j64914o5492J52061
$$ plain form
16098 16094 91579 35228 -40647 -450 63251 87366 14024 -7953 -132941 -272836 -215575
16087 -215575 -133456 -123256 -134458 -15999 13952 -105992 -265141 -262740 -73696 -6729 -3042
16076 -3042 -2095 -51259 -109080 -166227 -173252 -99983 -14689 22840 68326 100513 65663 -76801
16064 -76801 -79454 -11636 1985 -64703 -67335 -6265 -74024 -135995 -3087 47503 -2860 13709
16052 13709 18659 -69666 -118661 -101987 -59947 180102 335788 248646 195160 165673 -59649
16041 -59649 -84920 -14150 61901 -43785 51284 41925 54895 122900 -36937 -67329 27943
16030 27943 10821 -55984 -48830 -99481 -47924 -48855 46107 -118176 -267746 -318337 -142469 -59562
16018 -59562 -35952 1677 -85949 -58302 -41729 -30941 94057 73570 -36057 -90133 -54212
$$ packed form
16098A6094P5485n6351p5875M0197O3701K4115p3342k1977j24988j39895N7261
16087b15575Q2119J0200j1202J18459K9951j19944j59149K401J89044O6967L687
16076c042R47m9164n7821n7147p025P3269Q5294L7529M5486L2187l4850j42464
16064g6801k653O7818J3621o6688k632O1070o7759o1971J32908N0590n0363J6569
16052A3709M950q8325m8995J6674M2040K40049J55686q7142n3486k9487k25322
16041e9649k5271P0770P6051j05686R5069r359J2970O8005j59837l0392R5272
16030B7943j7122o6805P154n0651N1557r31R4962j64283j49570n0591J75868Q2907
16018e9562K3610L7629q7626K7647J6573J0788J24998k0487j09627n4076L5921
$$ plain form
16007 -54212 -154848 -141005 -104361 1120 34309 52828 27798 -58390 -120974 -42762 4853
15996 4853 62184 6693 -79935 -17213 -80482 -90986 -23408 24248 13035 -28940 -6608 9881
15984 9881 16966 95303 -15772 -61447 -160054 -148153 -129431 -265546 -239350 -160838 -152486 -96053
15972 -96053 -51771 39206 57389 30022 -72662 -196884 -193919 -211124 -129035 -27677 66816
15961 66816 147604 149533 121340 29445 56265 163 -166869 -198821 -165504 -178088 -111217 -115556
15949 -115556 -160040 -170811 -143785 -168577 -41136 -8524 93713 107935 152863 201037 149806
15938 149806 -6972 -148138 -293963 -313696 -169082 -111463 22658 131441 108134 87923
15928 87923 40639 -12112 50040 36694 20210 -96386 -190119 -44372 122654 86514 -5035
$$ packed form
16007e4212j00636J3843L6644J05481L3189J8519k5030q6188o2584P8212M7615
15996D853N7331n5491q6628O2722o3269j0504O7578M7656j1213m1975K2332J6489
15984I881P085P8337j11075m5675r8607J1901J8722j36115K6196P8512Q352N6433
15972i6053M4282R0977J8183k7367j02684j24222K965j7205Q2089J01358R4493
15961F6816Q0788J929k8193r1895K6820n6102j67032l1952L3317j2584O6871m339
15949a15556m4484j0771K7026k4792J27441L2612J02237J4222M4928M8174n1231
15938A49806j56778j41166j45825j9733J44614N7619J34121J08783k3307k0211
15928H7923m7284n2751O2152j3346j6484j16596r3733J45747J67026l6140r1549
$$ plain form
15917 -5035 -50336 -89617 -15272 12623 -9709 -14477 23020 18589 82414 57197 46874 23674
15905 23674 -34040 -145336 -214679 -231995 -273393 -228489 -140548 -57363 -20026 -58748 35708
15894 35708 68086 -74877 -213336 -245299 -174153 -101 3879 73363 102908 -90791 -45994
15883 -45994 -18351 8826 59054 78684 29990 29583 17451 -148009 -159170 -57739 9353 124754
15871 124754 110024 66352 4207 -78342 -93975 -125443 -142973 -152461 10293 49220 156011
15860 156011 204611 148556 66725 27988 104613 128749 202425 153858 25514 -73633 -85512
15849 -85512 18278 69443 -14450 -69767 -58058 -5608 -33270 -154888 -173986 -223928 -131680
15838 -131680 -115302 -78286 -142388 -86548 25344 56445 59574 41727 42961 83013 97347 -59506
$$ packed form
15917e035m5301l9281P4345K7895k2332m768L7497m431O3825k5217j0323k3200
15905B3674n7714j11296o9343j7316m1398M4904Q7941Q3185L7337l8722R4456
15894C5708L2378j42963j38459l1963P1146J74052L980O9484K9545j93699M4797
15883d5994K7643K7177N0228J9630m8694m07j2132j65460j1161J01431O7092J15401
15871A24754j4730m3672o2145q2549j5633l1468j7530r488J62754L8927J06791
15860A56011M8600n6055q1831l8737P6625K4136P3676m8567j28344r9147j1879
15849h5512J03790N1165q3893n5317J1709N2450k7662j21618j9098m9942R2248
15838a31680J6378L7016o4102N5840J11892L1101L129j7847J234M0052J4334j56853
$$ plain form
15826 -59506 -30705 17640 84740 32292 56613 42792 -5412 141413 203015 131602 82451
15815 82451 64882 44201 109592 23858 -17208 -112289 -71970 6975 -46572 -26298 -60082 -10407
15803 -10407 34794 -54503 -179414 -174136 -113765 -136632 -240746 -122400 23704 126040 166521
15792 166521 200087 209336 56753 -111228 -116570 -3979 17009 6738 -28441 -59545 -94464
15781 -94464 -268441 -222890 -157226 -217173 -335570 -343178 -274050 -218549 -121967 -117572 -6916
15770 -6916 33569 50102 -83738 -54675 -24160 42187 77237 90177 141399 35336 42109 8555
15758 8555 23572 85020 127076 -4201 -91675 -124025 -69776 12598 -71323 -197056 -149688
15747 -149688 -17165 113453 47752 19604 -109845 -168787 -196512 -169911 59941 61786 -59097
$$ packed form
15826e9506K8801M8345O7100n2448K4321j3821m8204J46825O1602p1413m9151
15815H2451j7569k0681O5391q5734m1066r5081M0319P8945n3547K0274l3784M9675
15803a0407M5201q9297j24911N278O0371k2867j04114J18346J46104J02336M0481
15792A66521L3566R249j52583j67981n342J12591K0988j0271l5179l1104l4919
15781i4464j73977M5551O5664n9947j18397p608O9128N5501R6582M395J10656
15770f916M0485J6533j33840K9063L0515O6347L5050J2940N1222j06063O773l3554
15758H555J5017O1448M2056j31277q7474l2350N4249Q2374q3921j25733M7368
15747a49688J32523J30618o5701k8148j29449n8942k7725K6601K29852J845j20883
$$ plain form
15736 -59097 -181698 -125887 -20007 77516 9918 -104685 -105955 -12474 -12077 7887 70061 70352
15724 70352 126424 48805 -52141 34460 98428 86702 49365 89687 59592 67778 121733 166975
15712 166975 102177 -63603 -232633 -270942 -213204 -146074 -19295 43012 151094 198909 96878
15701 96878 -1183 54200 -60664 -111183 -179744 -226076 -193889 -26834 135446 158891 196429
15690 196429 261931 187400 -6809 -88986 -128717 -144856 -135847 -111437 5428 19959 55320
15679 55320 28373 68517 45624 -13613 39401 119154 94839 -4113 -51392 -17850 16697 -32689
15667 -32689 -95452 -32793 18610 27297 -113596 -156460 -68871 -18115 37841 39590 38553 30501
15655 30501 64248 12407 69360 241607 369318 373596 244036 4294 -108281 17263 -32071
$$ packed form
15736e9097j22601N5811J05880R7523o7598j14603j270R3481L97J9964O2174K91
15724G0352N6072p7619j00946Q6601O3968j1726l7337M0322l0095Q186N3955M5242
15712A66975o4798j65780j69030l8309N7738O7130J26779O2307J08082M7815j02031
15701I6878r8061N5383j14864n0519o8561m6332L2187J67055J62280K3445L7538
15690A96429O5502p4531j94209q2177l9731j6139R009K4410J16865J4531L5361
15679E5320k6947M0144k2893n9237N3014P9753k4315r8952m7279L3542L4547m9386
15667c2689o2763O2659N1403Q687j40893m2864Q7589N0756N5956J749j037q052
15655C0501L3747n1841N6953J72247J27711M278j29560k39742j12575J25544m9334
$$ plain form
15644 -32071 -66372 -56908 -33955 52104 368 64883 90678 -28392 -45344 116368 180054
15633 180054 69031 62318 -75768 -110114 -4629 -6282 51121 -24548 -213245 -225254 -114098
15622 -114098 -8858 47687 24009 5185 50533 87290 139303 57269 -113677 -186783 -153961
15611 -153961 -39023 -105251 -146914 -146978 -117745 -19038 -109737 -151680 -19088 -11667 24019 79454
15599 79454 214852 130568 87726 27346 -25614 -175344 -242881 -156848 -69516 -56960 13197
15588 13197 -1969 -149412 -133278 -148484 -45197 40154 4225 169056 184911 67581 23567
15577 23567 -402 16407 62158 -101681 -101683 -37245 73105 174249 101602 -34005 -3940 7094
15565 7094 -93528 -176790 -140876 48297 58180 81789 43935 -99810 -77970 -116608 -167255
$$ packed form
15644c2071l4301R464K2953Q6059n1736O4515K5795j19070j6952J61712O3686
15633A80054j11023o713j38086l4346J05485j653N7403p5669j88697j2009J11156
15622a14098J05240N6545k3678j8824M5348L6757N2013q2034j70946p3106L2822
15611a53961J14938o6228m1663o4K9233R8707r0699m1943J32592P421L5686N5435
15599G9454J35398q4284m2842o0380n2960j49730o7537Q6033Q7332J2556P0157
15588A3197j5166j47443J6134j5206J03287Q5351l5929J64831J5855j17330m4014
15577B3567k3969J6809M5751j63839kO4438J10350J01144p2647j35607L0065J1034
15565G094j00622q3262L5914J89173R883K3609l7854j43745K1840l8638n0647
$$ plain form
15554 -167255 -73071 419 110409 46995 88137 119065 -14354 8857 6514 -168158 -228437
15543 -228437 -58174 -30572 -235366 -158806 -24361 -59565 -208299 -377809 -225877 -27198
15533 -27198 53811 92465 -23914 -74178 -170250 -186101 -176123 -283021 -246245 -104514 -22741
15522 -22741 -24205 -173606 -155819 -131509 -49147 42779 85301 73920 48045 30413 -319 -80981
15510 -80981 -292765 -224571 -136917 -98991 -12582 -139344 -128711 -166656 -182314 -54656 -86280
15499 -86280 -136586 -214037 -115539 106615 110843 -17387 -103965 -166995 -23343 77253 65623
15488 65623 23862 -37462 -10752 -28700 -153594 -198809 -128986 -104903 -276906 -178608 -93482
15477 -93482 -105462 -175956 -103557 -133920 -146085 -65354 -158324 -232859 -167134 -103672 -10315 4884
$$ packed form
15554a67255R4184P3490J09990o3414M1142L0928j33419K3211k343j74672o0279
15543b28437J70263K7602k04794P6560J34445l5204j48734j69510J51932J98679
15533b7198Q1009L8654j16379n0264r6072j5851R978j06898L6776J41731Q1773
15522b2741j464j49401J7787K4310Q2362R1926M2522j1381k5875j7632l0732q0662
15510h0981k11784O8194Q7654L7926Q6409j26762J0633l7945j5658J27658l1624
15499h6280n0306p7451R8498K22154M228j28230q6578o3030J43652J00596j1630
15488F5623m1761o1324K6710j7948j24894m5215O9823K4083j72003R8298Q5126
15477i3482j1980p0494P2399l0363j2165Q0731r2970p4535O5725O3462R3357J5199
$$ plain form
15465 4884 -30931 -17858 4160 54434 24376 60690 79358 17647 17279 -35475 -42074 24275
15453 24275 -4962 -74711 -48409 38330 31433 87300 -12124 -42673 82882 147072 144038 74104
15441 74104 71591 28283 -18790 17959 37223 -4364 -27493 -49796 -106605 -213953 -160219 -130271
15429 -130271 -101563 -40419 -24702 -47917 80530 152080 75469 43008 4356 6063 -42975
15418 -42975 -52875 -69947 9683 29755 -128266 -321381 -264650 -175322 -97967 -110753 -85549
15407 -85549 -40534 -91366 -126409 -128306 36860 102758 75245 1219 -53581 -100083 -181504 -18354
15395 -18354 88389 73595 -43072 -19456 96932 52887 45319 144262 -15099 -61931 109749
15384 109749 94226 92793 173647 183028 166176 33046 67531 39571 3612 -169141 -210138
$$ packed form
15465D884l5815J3073K2018N0274l0058L6314J8668o1711l68n2754o599O6349
15453B4275k9237o9749K6302Q6739o897N5867r9424l0549J25555O4190l034o9934
15441G4104k513m3308m7073L6749J9264m1587k3129k2303n6809j07348N3734K9948
15429a30271K8708O1144J5717k3215J28447P1550p6611l2461l8652J707m9038
15418d2975r900j7072P9630K0072j58021j93115N6731Q9328P7355j2786K5204
15407h5549M5015n0832l5043j897J65166O5898k7513p4026n4800m6502q1421J63150
15395a8354J06743j4794j16667K3616J16388m4045p568R8943j59361m6832J71680
15384A09749j5523j433Q0854R381j6852j33130L4485k7960l5959j72753m0997
$$ plain form
15373 -210138 -224402 -141084 -98473 8009 27257 -49189 -91187 63887 169168 190916 129762
15362 129762 20897 -47172 -46218 -162939 -161908 -121991 -116799 -10986 51713 142425 141976 163823
15350 163823 140548 67471 25776 160199 192399 32647 -79133 97932 173574 113246 131851
15339 131851 152087 103117 -13155 -59594 -10356 -162717 -131143 -32562 -48264 -78667 -153542
15328 -153542 -256639 -312051 -105419 82836 57351 93619 -9707 -13949 -4494 -27397 -29014
15317 -29014 -21999 37239 88408 237342 320733 147310 -35784 -14429 37534 43007 90153
15306 90153 166279 115776 94302 81191 23288 -45495 -78086 -153064 -91342 -12252 -2916 65182
15294 65182 94686 -38613 64616 -140464 -160722 82673 74163 -105293 13894 84606 44593
$$ packed form
15373b10138j4264Q3318M2611J06482J9248p6446m1998J55074J05281K1748o1154
15362A29762j08865o8069R54j16721J031L9917N192J05813O2699R0712m49K1847
15350A63823k3275p3077m1695J34423L2200j59752j11780J77065P5642o0328J8605
15339A31851K0236m8970j16272m6439M9238j52361L1574R8581j5702l0403p4875
15328a53542j03097n5412K06632J88255k5485L6268j03326m242R455k2903j617
15317b9014P015N9238N1169J48934Q3391j73423j83094K1355N1963N473M7146
15306I0153P6126n0503k1474j3111n7903o8783l2591p4978O1722P9090R336O8098
15294F5182K9504j33299J03229k05080k0258K43395q510j79456J19187P0712m0013
$$ plain form
15283 44593 -29759 -112258 -240043 -328157 -438879 -463303 -265484 -233048 -236157 -294948 -191528
15272 -191528 93065 210899 282867 294826 191259 157353 137188 59486 15046 -82150 -49118
15261 -49118 28263 116344 152031 197330 67912 -105144 -108860 -77186 -30402 31567 -44263
15250 -44263 -7569 33896 57862 100230 10691 108263 134032 81894 472 27952 63778 -26070
15238 -26070 -57048 -80614 -187354 -49571 -50150 64665 100376 15085 -35220 3807 -4838 -22883
15226 -22883 38805 204164 169153 73445 68835 72666 53240 -20512 -126079 -24665 17047
15215 17047 68977 74547 126812 95128 126124 95412 -126098 -72684 18808 -90970 -30997
15204 -30997 -42842 -73039 -214500 -267584 -262039 -124276 16650 -34376 -40573 -68760 23657
$$ packed form
15283D4593p4352q2499j27785q8114j10722k4424J97819L2436l109n8791J03420
15272a91528K84593J17834P1968J1959j03567l3906k0165p7702m4440r7196L3032
15261d9118P7381Q8081L5687M5299j29418j73056l716L1674M6784O1969p5830
15250d4263L6694M1465K3966M2368q9539R7572K5769n2138q1422K7480L5826q9848
15238b6070l0978k3566j06740J37783n79J14815L5711q5291n0305L9027q645j8045
15226b2883O1688J65359l5011r5708m610L831j9426p3752j05567J01414M1712
15215A7047N1930N570N2265l1684L0996l0712k21510N3414R1492j09778N9973
15204c0997j1845l0197j41461n3084N545J37763J40926n1026o197k8187R2417
$$ plain form
15193 23657 178419 148713 199280 283412 227743 101618 57066 66594 137339 105071 93411
15182 93411 53670 -30277 10402 -26309 -86217 -178431 -114442 -52313 42146 161007 94592
15171 94592 116296 193334 149760 140017 16675 -96511 -108704 -104850 -167984 -92539 -32619 -140165
15159 -140165 -247878 -273356 -112819 -100016 -120880 -125010 -118137 -7607 -42993 -109710 -150846
15148 -150846 -187371 -83280 -102832 -173825 -93932 191913 398129 434360 272756 153445
15138 153445 124315 1456 5903 -499 -11008 -113131 -47348 94325 61681 -170487 -370239
15127 -370239 -305347 -80089 68095 -22352 -67898 -46306 79499 25969 -37772 8087 31200
15116 31200 9247 73957 84606 -20048 -50269 900 80229 175253 264742 150457 18269
$$ packed form
15193B3657J54762k9706N0567Q4132n5669j26125m4552R528P0745l2268j1660
15182I3411l9741q3947M0679l6711n9908r2214O3989O2129R4459J18861o6415
15171I4592K1704P7038m3574r743j23342j13186j2193L854o3134P5445N9920j07546
15159a40165j07713k5478J60537J2803k0864m130O873J10530l5386o6717m1136
15148a50846l6525J04091j9552p0993P9893K85845K06216L6231j61604j19311
15138A53445k9130j22859M447o402j0509j02123O5783J41673l2644k32168j99752
15127c70239O4892K25258J48184r0447m5546K1592J25805n3530o3741M5859K3113
15116C1200k1953O4710J0649j04654l0221N1169P9329R5024Q9489j14285j32188
$$ plain form
15105 18269 -46435 -39180 -144766 -71432 3007 191176 225833 56895 14166 24163 64697
15094 64697 7103 -31347 -22696 -100840 -47196 78431 -8879 -69575 -125427 -136871 -23766
15083 -23766 18507 -73144 -172266 -211355 -221869 -129912 -30913 15498 89751 145784 235532 285359
15071 285359 171832 183914 213446 328901 302445 223688 208016 161540 110865 -55446 50325
15060 50325 92654 35649 31734 74072 128500 57050 43869 36157 -54770 112139 199033 54033
15048 54033 -1231 6862 -40435 35493 78454 50051 47083 8768 -34303 -94149 -90116 -125517
15036 -125517 -98891 231 -34953 -83429 -131519 -63831 56311 -35149 -177716 -193086 -166280
15025 -166280 -201032 -116050 -49642 -8594 -60274 -38048 -69974 -50531 -15246 -14623 9172 -22600
$$ packed form
15105A8269o4704P255j05586P3334P4439J88169L4657j68938m2729R997M0534
15094F4697n7594l8450Q651p8144N3644J25627q7310o0696n5852j1444J13105
15083b3766M2273r1651r9122l9089j0514R1957R8999M6411P4253N6033Q9748M9827
15071B85359j13527J2082K9532J15455k6456p8757j5672m6476n0675j66311J05771
15060E0325M2329n7005l915M2338N4428p1450j3181p712r0927J66909Q6894j45000
15048E4033n5264Q093m7297P5928M2961k8403k968l8315m3071n9846M033l5401
15036a25517K6626R9122l5184m8476m8090O7688J20142r1460j42567j5370K6806
15025a66280l4752Q4982O6408M1048n1680K2226l1926J9443L5285O23K3795l1772
$$ plain form
15013 -22600 -80950 -99501 -144382 -149739 -106057 -17569 24890 -90199 -152924 -12042 -32429
15002 -32429 -95251 11312 -61 -246301 -406459 -159069 91677 7044 -172125 -252057
14992 -252057 -273426 -39958 145004 46303 -112499 -40198 129182 99156 36719 -125010
14982 -125010 -149923 -49593 197231 226889 10153 27313 10590 -20038 10134 -39573 -68533
14971 -68533 81193 -61242 -158371 -5876 51825 189513 116056 -29519 26850 113126 26568
14960 26568 58968 90070 -44213 -138549 -44616 -57280 79170 253716 157330 -30076 -1667
14949 -1667 -35011 -40247 -58822 -7428 53732 130510 166287 123245 75392 155788 152201 2971
14937 2971 -70366 13983 14216 36667 137317 120494 1291 74010 70877 107810 170661 148257
$$ packed form
15013b2600n8350j8551m4881n357M3682Q8488M2459j15089o2725J40882k0387
15002c2429o2822J06563j1373k46240j60158K47390K50746q4633j79169p9932
14992b52057k1369K33468J84962r8701j58802P2301J69380l0026o2437j61729
14982a25010k4913J00330K46824K9658k16736J7160j6723l0628L0172m9707k8960
14971f8533J49726j42435r7129J52495N7701J37688p3457j45575N6369Q6276q6558
14960B6568L2400L1102j34283r4336R3933j2664J36450J74546r6386j87406K8409
14949a667l3344n236j8575N1394O1160P6778L5777m3042m7853Q0396l587j49230
14937B971p3337Q4349K33K2451J00650j6823j19203P2719l133L6933O2851k2404
$$ plain form
14925 148257 25495 -836 -52998 -176726 -100777 -81339 -55081 -19618 54072 15176 31321
14914 31321 135730 202439 -1114 -51562 39750 112157 117872 74476 22173 -51311 -123147
14903 -123147 -241947 -275521 -199286 -125373 -34247 -41139 -34949 13346 -110515 -86216 -123949
14892 -123949 -181675 -167501 -65734 -35185 -1408 -102567 -73808 -7998 11375 123429 86514
14881 86514 25369 4627 -537 56486 183108 255208 155607 6967 32199 249102 205789
14870 205789 91006 -19021 -81573 -58910 47879 64392 69321 26974 98332 158176 130598
14859 130598 -4913 -97490 -37817 -26229 -13528 -85569 -151517 -30590 50977 76878 -9162
14848 -9162 -155451 -216191 -238231 -228313 -96109 36211 207918 108563 39707 14523 31687
$$ packed form
14925A48257j22762k6331n2162j23728P5949J9438K6258L5463P3690l8896J6145
14914C1321J04409O6709k03553n0448R1312P2407N715m3396n2303p3484p1836
14903a23147j18800l3574P6235P3913R1126o892O190M8295j23861K4299l7733
14892a23949n7726J4174J01767L0549L3777j01159K8759O5810J9373J12054l6915
14881H6514o1145k0742n164N7023J26622P2100r9601j48640K5232K16903m3313
14870B05789j14783j10027o2552K2663J06789J6513M929m2347P1358N9844k7578
14859A30598j35511r2577N9673J1588J2701p2041o5948J20927Q1567K5901q6040
14848i162j46289o0740k2040R918J32204J32320J71707r9355o8856k5184J7164
$$ plain form
14837 31687 195672 203676 194093 223474 236266 136519 75099 354 -88113 -86656 -61159 -80667
14825 -80667 -144640 -49361 13084 18300 35731 34319 -29665 -46149 -19141 -4584 -41243 4176
14813 4176 56824 179133 126521 84972 -15446 -88498 -94417 -123956 -159765 -79249 -32992 -856
14801 -856 11878 41573 76619 178230 197272 231029 145720 30401 -43708 -51701 -97324 -26008
14789 -26008 98639 127552 22766 8154 22075 102704 36829 89326 163417 170783 108231
14778 108231 25290 -49035 -94678 2424 3709 22627 -36170 -23472 -5858 -24301 -35058 27158
14766 27158 8056 137544 78754 60913 52387 18656 -55608 -74504 -14942 31695 -45260 -51296
14754 -51296 -11686 34091 2491 34917 42700 -27708 94130 180744 146817 -22197 -183759
$$ packed form
14837C1687J63985Q004r583K9381J2792r9747o1420p4745q8467J457K5497j9508
14825h0667o3973R5279O2445N216J7431j412o3984j6484K7008J4557l6659M5419
14813D176N2648J22309n2612m1549j00418p3052n919k9539l5809Q0516M6257L2136
14801h56J2734K9695L5046J01611J9042L3757q5309j15319p4109p993m5623P1316
14789b6008J24647K8913j04786j4612J3921Q0629o5875N2497P4091P366o2552
14778A08231q2941p4325m5643R7102J285J8918n8797J2698J7614j8443j0757O2216
14766B7158j9102J29488n8790j7841q526l3731p4264j8896N9562M6637p6955o036
14754e1296L9610M5777l1600L2426P783p0408J21838Q6614l3927j69014j61562
$$ plain form
14743 -183759 -210035 -47942 -11592 -124418 -132485 14264 -52670 -149000 -107101 -126275 -262735
14732 -262735 -269816 -38103 82177 16707 -113195 -249285 -200362 -136476 -157996 -265911 -272121
14721 -272121 -268915 -72793 12712 -69540 -83977 -54473 -11203 -12418 -175432 -93062 -110749
14710 -110749 -244922 -160460 -118229 26301 243081 326695 223823 69136 -26931 -110527
14700 -110527 -198478 -323247 -313232 -74723 143090 202683 127689 72098 -43020 -49635 -99352
14689 -99352 -158730 -86346 2361 -29080 44213 105866 60058 -1973 -88266 -23136 110870
14678 110870 277898 258829 195606 103155 74395 120773 210570 146768 -54735 -93182 71818
14667 71818 109348 54922 -11511 12622 -69411 -106466 -52155 -59480 -24404 -47485 -46239 24863
$$ packed form
14743a83759k6276J62093L6350j12826q067J46749o6934r6330M1899j9174j36460
14732b62735p081K31713J20280o5470j29902j36090M8923O3886k1520j07915o210
14721b72121L206J96122Q5505q2252j4437K9504M3270j215j63014Q2370j7687
14710a10749j34173Q4462M2231J44530K16780Q3614j02872j54687r6067q3596
14700a10527q7951j24769J0015K38509K17813N9593p4994n5591j15118o615m9717
14689i9352n9378P2384Q8707l1441P3293O1653m5808o2031q6293O5130J34006
14678A10870J67028j9069o3223r2451k8760M6378Q9797o3802k01503l8447J65000
14667G1818L7530n4426o6433K4133q2033l7055N4311p325L5076k3081J246P1102
$$ plain form
14655 24863 -2403 -117671 -200825 -130960 -57938 31907 129889 192749 144239 45617 114902
14644 114902 87470 72034 67397 118654 135435 126179 90182 28137 -31518 36558 70948 10886
14632 10886 -22472 -50628 -236968 -247354 -122058 -80262 6820 87223 -12681 -194267 -118282
14621 -118282 70050 62187 94400 143459 123525 8800 -87342 -84200 -57207 33127 -18561
14610 -18561 -105082 26926 59807 44383 -68458 -18403 -40340 363 57249 38239 60677
14599 60677 6762 -67298 -142567 12117 139200 142057 229421 169709 -10804 -1484 26793
14588 26793 28679 -52205 -29680 -4448 -70703 25863 36671 -26303 68364 44402 8472 63525
14576 63525 10732 -139040 -135665 -103764 -74419 -27313 20152 3558 -49728 -73617 -53213 -38960
$$ packed form
14655B4863k7266j15268q3154O9865P3022Q9845R7982O2860m8510r8622O9285
14644A14902k7432j5436m637N1257J6781r256l5997o2045n9655O8076L4390o0062
14632A0886l3358k8156j86340j0386J25296M1796Q7082Q0403r9904j81586P5985
14621a18282J88332p863L2213M9059j9934j14725r6142L142K6993R0334n1688
14610a8561q6521J32008L2881j5424j12841N0055k1937M0703N6886j9010K2438
14599F0677n3915p4060p5269J54684J27083K857Q7364n9712j80513R320K8277
14588B6793J886q0884K2525K5232o6255R6566J0808o2974R4667k3962l5930N5053
14576F3525n2793j49772L375L1901K9345M7106M7465j6594n3286k3889K0404J4253
$$ plain form
14564 -38960 -124077 -118985 -66185 -88554 -134003 -210033 -169170 33916 138394 93627 -76594
14553 -76594 -66196 83866 203692 227638 26088 4444 125008 127884 11186 -85446 -10110
14542 -10110 42086 79405 -30706 -5482 86879 127681 91559 138410 78607 99342 209030
14531 209030 130109 125810 -3741 -255596 -354255 -224892 -154615 -255153 -244440 -239865 -322317
14520 -322317 -432105 -372926 -318676 -256591 -189215 -73642 -73529 -60611 411 -54693 2664
14509 2664 177627 137707 62850 16202 24236 64837 -88763 -220497 -242594 -190476 -219791
14498 -219791 -176501 76077 178617 164347 155101 79581 18122 -38113 59540 -79969 -196460
14487 -196460 -43993 -23657 -7450 62995 120073 42028 -59643 -128063 -193541 -144755 -147747
$$ packed form
14564c8960q5117N092N2800k2369m5449p6030M0863K03086J04478m4767j70221
14553g6594J0398J50062J19826K3946k01550k1644J20564K876j16698r6632P5336
14542a0110N2196L7319j10111K5224R2361M0802l6122M6851n9803K0735J09688
14531B09030p8921m299j29551k51855r8659J29363P0277j00538J0713M575q2452
14520c22317j09788N9179N4250O2085O7376J15573J13J2918O1022n5104N7357
14509B664J74963l9920p4857m6648Q034M0601j53600j31734k2097N2118k9315
14498b19791M3290K52578J02540j4270r246p5520o1459n6235R7653j39509j16491
14487a96460J52467K0336J6207P0445N7078p8045j01671o8420o5478M8786k992
$$ plain form
14476 -147747 -177998 44242 188901 149591 51364 28870 118098 139741 34208 -71100 -132092
14465 -132092 -71523 -15534 -83158 15877 126739 159308 64676 111745 20942 -117386 -50133
14454 -50133 47222 96331 96554 81168 -35800 -114316 -111402 20698 -18794 -160447 -78530 -16437
14442 -16437 -64438 -58359 -159025 -272316 -184675 -146325 -121039 -78435 -74816 -17616 -39632 -6157
14430 -6157 -91716 -94918 -56017 -153497 -120731 -57754 -104168 -147848 -8301 -40916 -85328 -32179
14418 -32179 -131347 -144213 -156973 -45240 -83361 -131604 -189510 549 75626 22652 15259
14407 15259 -7091 -33386 -3533 95155 208685 137626 89387 79014 49549 -12911 67297
14396 67297 120345 127343 104685 -13975 -3130 58515 63928 -35884 30861 160470 -40520
$$ packed form
14476a47747l0251K22240J44659l9310r8227k2494Q9228K1643j05533j05308o0992
14465a32092O0569N5989o7624R9035J10862L2569r4632M7069r0803j38328O7253
14454e0133R7355M9109K23j5386j16968p8516K914J32100l9492j41653Q1917O2093
14442a6437m8001O079j00666j13291Q7641L8350K5286M2604L619N7200k2016L3475
14430f157q5559l202L8901r7480L2766O2977m6414m3680J39547l2615m4412N3149
14418c2179r9168j2866j2760J11733l8121m8243n7906J90059P5077n2974p393
14407A5259k2350k6295K9853R8688J13530p1059m8239j0373k9465o2460Q0208
14396F7297N3048O998k2658j18660J0845O1645N413r9812O6745J29609k00990
$$ plain form
14385 -40520 -31573 -88169 -36103 44272 28940 138552 54972 -42490 -67045 -37387 27769 98159
14373 98159 47764 -37954 -22621 14597 -68260 -174535 -205470 -188291 -74712 -67167 -80548
14362 -80548 -110829 -194480 -116613 -198908 -310311 -194564 -116614 24065 131525 268293 324608
14351 324608 258258 96883 -34029 -72665 -63172 -152507 -184999 -39956 -2714 86936 114149
14340 114149 -28124 -98335 -138060 35519 121656 81246 100547 -23595 -104481 -125930 -176804
14329 -176804 -111747 -60864 -41658 -24809 -44137 -64879 -10581 82617 45358 55524 93793
14318 93793 -10877 19810 106109 106274 55393 -56865 -118074 -194106 -221370 -67661 -1787
14307 -1787 13976 48358 139138 100066 68078 35025 33120 51860 55663 47324 -20292 -76708
$$ packed form
14385d0520Q947n6596N2066Q0375j5332J09612q3580r7462k4555K9658O5156P0390
14373I8159n0395q5718J5333L7218q2857j06275l0935J7179J13579P545j3381
14362h0548l0281q3651P7867q2295j11403J15747P7950J40679J07460J36768N6315
14351C24608o6350j61375j30912l8636R493q9335l2492J45043L7242Q9650K7213
14340A14149j42273p0211l9725J73579Q6137m0410J9301j24142q0886k1449n0874
14329a76804O5057N0883J9206J6849j9328k0742N4298R3198l7259J0166L8269
14318I3793j04670L0687Q6299J65n0881j12258o1209p6032k7264J53709O5874
14307a787J5763L4382R0780l9072l1988l3053j905J8740L803q339o7616n6416
$$ plain form
14295 -76708 -50138 6244 -56468 42209 114729 -93132 -96158 -9901 1833 -19886 -75389 -119129
14283 -119129 -218544 -166789 -77233 -15186 119229 133704 -14526 -107578 -149142 -99912 -57550
14272 -57550 -79612 -131396 -96944 46576 116344 147250 52111 -62007 -162919 -194461 -186860
14261 -186860 -230043 -133839 97968 186119 34128 -230472 -373524 -241183 -131514 -62214
14251 -62214 -16970 22913 135166 142956 147402 10869 -171330 -264247 -254213 -64075 52430
14240 52430 -27819 56441 69540 -148498 -247535 -174631 -46019 20741 19419 123725 132496
14229 132496 -94225 -181970 -261872 -224260 -69866 29554 89861 97004 74206 -24765 -48495
14218 -48495 60695 -9165 45466 -19507 11553 165773 218310 181086 169128 144947 95937
$$ packed form
14295g6708K6570N6382o2712R8677P2520k07861l026Q6257J1734k1719n5503m3740
14283a19129r9415N1755Q9556O2047J34415J4475j48230r3052m1564M9230M2362
14272e7550k2062n1784L4452J43520O9768L0906r5139j14118j00912l1542P601
14261a86860m3183R6204K31807Q8151j51991k64600j43052J32341J09669O9300
14251f2214M5244L9883J12253P790M446j36533j82199r2917J0034J90138J16505
14240E2430q0249Q4260J3099k18038r9037P2904J28612O6760j322J04306Q771
14229A32496k26721q7745p9902L7612J54394R9420O0307P143k2798r8971k3730
14218d8495J09190o9860N4631o4973L1060J54220N2537l7224j1958k4181m9010
$$ plain form
14207 95937 24777 -185658 -286664 -154227 -123537 -73215 -41366 -78625 -139203 -183377 -217604
14196 -217604 -176183 -160840 -179860 -203968 -220120 -111600 -99255 -199922 -132533 -84042 -87953
14185 -87953 -8512 29361 -22224 -120577 15997 111668 67618 -75897 -70493 32384 83250
14174 83250 64052 144319 191222 108659 -65017 20268 209611 124692 112981 86180 133385
14163 133385 310794 327900 179084 27328 64700 91008 107963 201226 250111 164724 106463
14152 106463 130358 43495 78350 73115 18646 46305 82433 19609 -23422 7207 117031
14141 117031 62004 109007 102027 86883 14573 -23898 87884 74315 22618 26397 -9938 -102082
14129 -102082 -141416 4693 26773 57042 -105508 -115843 -80032 -189326 -220768 -170122 14610
$$ packed form
14207I5937p1160k10435j01006J32437L0690N0322L1849l7259o0578m4174l4227
14196b17604M1421J5343j9020k4108j6152J08520J2345j00667O7389M8491l911
14185h7953P9441L7873n1585r8353J36574R5671m4050j43515N404J02877N0866
14174H3250j9198Q0267M6903q2563j73676Q5285J89343q4919j1711k6801M7205
14163A33385J77409J7106j48816j51756L7372K6308J6955R3263M8885q5387n8261
14152A06463K3895q6863L4855n235n4469K7659L6128o2824m3031L0629J09824
14141A17031n5027M7003o980j5144p2310l8471J11782j3569n1697L779l6335r2144
14129a02082l9334J46109K2080L0269j62550j0335L5811j09294l1442N0646J84732
$$ plain form
14118 14610 156915 145827 117480 167643 243768 114423 -3593 58243 153394 22608 17499
14107 17499 75007 24588 51344 97158 -11618 -26817 -4591 -97079 -86732 -67878 768
14096 768 49907 202452 205928 219738 174977 53977 44726 58689 9364 -55020 -30336 45278
14084 45278 108885 17703 -92633 30321 -58142 -144244 -110280 -111127 13173 42154 -89339
14073 -89339 -166367 -12860 8743 40512 -62031 -124421 47530 141762 64974 104503 135577
14062 135577 33512 -266 -136522 -262009 -244893 -218343 -135038 -9705 123447 234155
14052 234155 271086 104460 9216 34102 43360 53389 101517 128596 177991 112794 -7751
14041 -7751 4371 9934 -113745 -126612 -120566 -214366 -158826 -87619 -28249 48226 -4852 -34949
$$ packed form
14118A4610J42305j1088k8347N0163P6125j29345j18016O1836R5151j30786n109
14107A7499N7508n0419K6756M5814j08776j5199K2226r2488J0347J8854O8646
14096G68M9139J52545L476J3810m4761j21000r251J3963m9325o4384K4684P5614
14084D5278O3607r1182j10336J22954q8463q6102L3964q47J24300K8981j31493
14073h9339p7028J53507K1603L1769j02543o2390J71951R4232p6788L9529L1074
14062A35577j02065l3778j36256j25487J7116K6550Q3305J25333J33152J10708
14052B34155L6931j66626r5244K4886R258J0029M8128K7079M9395o5197j20545
14041g751J2122N563j23679j2867O046r3800N5540P1207N9370P6475n3078l0097
$$ plain form
14029 -34949 -27386 -115171 -210512 -227821 -179357 7057 69109 2593 76752 154543 139502 68836
14017 68836 -10869 33775 45906 93631 -4295 -35283 10508 -53522 -128620 -170533 -78547 67417
14005 67417 58301 -16747 -37632 -23298 22962 -24437 45668 -23574 -61838 -97885 19021 -949
13993 -949 20583 52269 8570 15748 48217 63790 57380 105303 291169 338627 149950 33426
13981 33426 124723 181354 75106 38182 108722 128738 66588 -10167 95975 134903 180703
13970 180703 182646 121214 35180 18814 -43211 30492 133888 36951 31552 -85452 30427
13959 30427 -35002 20778 -14910 -31795 -30638 -37895 -51421 -87378 23681 100463 -35965 -89884
13947 -89884 -69082 -22836 20720 -76382 -92247 -88167 22163 49330 103706 183177 40674
$$ packed form
14029c4949P563q7785r5341j7309M8464J86414O2052o6516P4159P7791j5041p0666
14017F8836p9705M4644J2131M7725r7926l0988M5791o4030p5098m1913R1986J45964
14005F7417r116p5048k0885J4334M6260m7399P0105o9242l8264l6047J16906j9970
13993i49K1532L1686m3699P178L2469J5573o410M7923J85866M7458j88677j16524
13981C3426R1297N6631j06248l6924P0540K0016o2150p6755J06142L8928M5800
13970A80703J943o1432q6034j6366o2025P3703J03396r6937n399j17004J15879
13959C0427o5429N5780l5688j6885J157p257j3526l5957J11059P6782j36428n3919
13947h9884K0802M6246M3556r7102j5865M080J10330K7167N4376P9471j42503
$$ plain form
13936 40674 -102947 -175352 -141971 44879 149722 177486 218710 270300 127617 88806 -38143
13925 -38143 -172167 4161 133354 127744 19729 92729 51613 -52252 -57630 24995 23548
13914 23548 -72753 -55077 -49908 -78505 -89808 -167191 -38860 153059 15978 -46314 -93613
13903 -93613 -152439 -119092 -128146 -89810 -67028 -9184 5398 26028 6031 -60566 -63476 -12919
13891 -12919 85906 48006 -18094 -50787 -17103 99453 24738 -78174 -215174 -117990 5486
13880 5486 -102638 -60021 41277 -15485 -44577 16631 -11303 -803 -51414 55882 44966
13869 44966 16492 -683 -67850 -86031 108725 132697 170986 39591 -49324 25751 -9205
13858 -9205 -74543 97108 123983 123639 -1007 -24082 62191 84878 196400 218538 136851 177295
$$ packed form
13936D0674j43621p2405L3381J86850J04843K7764M1224N1590j42683l8811j26949
13925c8143j34024J76328J29193n610j08015P3000m1116j03865n378Q2625j447
13914B3548r6301J7676N169k8597j1303p7383J28331J91919j37081o2292m7299
13903i3613n8826L3347r054L8336K2782N7844J4582K0630j9997o6597k910N0557
13891a2919R8825l7900o6100l2693L3684J16556p4715j02912j37000R7184J23476
13880E486j08124M2617J01298n6762k9092O1208k7934J0500n0611J07296j0916
13869D4966k8474j7175o7167j8181J94756K3972L8289j31395q8915P5075l4956
13858i205o5338J71651K6875l44j24646k3075Q6273K2687J11522K2138q1687M0444
$$ plain form
13846 177295 116087 97828 59680 59547 123503 73160 -102975 -119182 -57574 -81715 -183470
13835 -183470 -162647 -123695 -115005 -14057 -2659 -50301 59411 183030 195392 93155 143733
13824 143733 174454 227248 224523 137715 -2905 -6321 -10459 -159999 -126775 28734 101507
13813 101507 106327 -94130 -31509 153355 72562 100808 102555 9396 -90361 -155912 -72587
13802 -72587 123720 97175 53427 127039 142963 9443 -40098 -27855 -32433 -91313 -48199
13791 -48199 -51000 8121 26688 -33960 47979 167791 235015 214596 151757 164124 82962 -51429
13779 -51429 -55680 94895 77001 183859 100400 -14300 -73090 -28261 -48192 -64146 -54114
13768 -54114 -83322 -40890 76381 140162 42238 -55154 -91970 -118616 -143141 -147384 -169490 -119739
$$ packed form
13846A77295o1208j8259l8148j33O3956n0343j76135j6207O1608k4141j01755
13835a83470K0823L8952Q690J00948J1398m7642J09712J23619J2362j02237N0578
13824A43733L0721N2794k725q6808j40620l416m138j49540L3224J55509P2773
13813A01507M820k00457O2621J84864q0793K8246J747r3159r9757o5551Q3325
13802g2587J96307k6545m3748P3612J5924j33520m9541J2243m578n8880M3114
13791d8199k801N9121J8567o0648Q1939J19812O7224k0419o2839J2367q1162j34391
13779e1429m251J50575j7894J06858q3459j14700n8790M4829j9931j5954J0032
13768e4114k9208M2432J17271O3781r7924r7392l6816k6646k4525m243k2106M9751
$$ plain form
13756 -119739 -46596 -97719 -51119 -127892 -122007 4349 209457 230170 120870 71274 -38639
13745 -38639 -9587 -63458 -103212 -61039 142750 289092 204161 162492 138299 85360 -17486
13734 -17486 -49913 -43896 -56782 -2881 56761 144359 191412 212917 76505 -18228 3130 7460
13722 7460 124244 261210 299528 228341 99951 124 -36739 -9781 97437 -25350 -123821
13711 -123821 -22240 6273 -73453 8236 -26190 12189 -29506 -238869 -314073 -267442 -148718
13700 -148718 -269573 -284724 -93304 -10220 129173 249286 201449 244977 302970 280522 133843
13689 133843 24273 24837 42952 7434 -16028 -47722 -98126 -129760 -204535 -137624 -72479 -52062
13677 -52062 30387 -7430 77636 43880 38343 35162 -76333 18397 82397 45603 27629 -37704
$$ packed form
13756a19739P3143n1123M6600p6773N885J26356K05108K0713j09300m9596j09913
13745c8639K9052n3871l9754M2173K03789J46342q4931m1669k4193n2939j02846
13734a7486l2427O017j2886N3901N9642Q7598M7053K1505j36412r4733K1358M330
13722G460J16784J36966L8318p1187j28390r9827l6863K6958J07218j22787r8471
13711a23821J01581K8513p9726Q1689l4426L8379m1695k09363p5204M6631J18724
13700a48718j20855j5151J91420Q3084J39393J20113m7837M3528N7993k2448j46679
13689A33843j09570N64J8115l5518k3462l1694n0404l1634p4775O6911O5145K0417
13677e2062Q2449l7817Q5066l3756n537l181j11495R4730O4000l6794j7974o5333
$$ plain form
13665 -37704 -36070 -68641 -57171 -9859 -90305 -171811 -77746 -24254 93209 61161 -19854 -7221
13653 -7221 38644 -67419 -179047 -168260 -306527 -383604 -237601 -128620 -43749 -89223 -51435
13642 -51435 -29486 -27029 9774 -21081 -115865 -193200 -185093 -135880 -180345 -212293 678 140833
13630 140833 105263 35692 -11576 -86773 -135676 -97073 -90217 -70502 -70970 -9603 36208 -23524
13618 -23524 27088 6664 -47039 -63900 39838 121900 156777 140163 142738 46656 -47334 -35842
13606 -35842 41703 2780 72370 230555 229450 343818 312405 349854 380945 260896 290646
13595 290646 339608 274699 45183 -26598 59722 159211 50024 -3610 68791 84396 208207
13584 208207 255570 170422 24036 79607 88604 66099 203699 173587 114850 62085 40210
$$ packed form
13665c7704J634l2571J1470M7312q0446q1506R4065N3492J17463l2048q1015J2633
13653g221M5865j06063j11628J0787j38267p7077J46003J08981Q4871m5474L7788
13642e1435K1949K457L6803l0855r4784p7335Q107M9213m4465l1948K12971J40155
13630A40833l5570o9571m7268p5197m8903L8603O856J9715m68O1367M5811n9732
13618b3524N0612k0424n3703j6861J03738Q2062L4877j6614K575r6082r3990J1492
13606c5842P7545l8923O9590J58185j105J14368l1413L7449L1091j20049K9750
13595B90646M8962o4909k29516p1781Q6320R9489j09187n3634P2401J5605J23811
13584B08207M7363q5148j46386N5571Q997k2505J37600l0112n8737n2765k1875
$$ plain form
13573 40210 65496 113898 -232 -102597 -60649 1567 -36685 -32871 82383 119240 205866
13562 205866 352391 269000 190392 179798 182040 147772 81804 73741 72492 -8723 -73956 -142345
13550 -142345 -178810 -121916 -32985 -43765 47187 97411 101422 8624 69010 147596 120729 130730
13538 130730 128744 50525 19319 7986 126843 127785 79395 174735 261315 201126 141466 155897
13526 155897 225124 193051 59142 16863 -35764 -66190 -128252 -44793 41234 -74195 -127404
13515 -127404 -82261 18564 27476 167001 126672 87465 -38243 -121749 61789 166577 50719
13504 50719 -64787 -243288 -296309 -261121 -161235 -5781 159159 133849 51884 -55459 -127405
13493 -127405 43916 172315 144247 33542 19745 27431 86108 128808 -35903 -152390 -123840
$$ packed form
13573D0210K5286M8402j14130j02365M1948O2216l8252L814J15254L6857Q6626
13562B05866J46525q3391p8608j0594K242l4268o5968q063j249q1215o5233o8389
13550a42345l6465N6894Q8931j0780R0952N0224M011r2798O0386P8586k6867J0001
13538A30730j986p8219l1206j1333J18857R42m8390R5340Q6580o0189n9660J4431
13526A55897O9227l2073j33909m2279n2627l0426o2062Q3459Q6027j15429n3209
13515a27404M5143J00825Q912J39525m0329l9207j25708q3506J83538J04788j15858
13504E0719j15506j78501n3021L5188R9886J55454J64940k5310q1965j07343p1946
13493a27405J71321J28399k8068j10705j3797P686N8677M2700j64711j16487K8550
$$ plain form
13482 -123840 -24570 77571 74513 81130 -8823 -131447 -173546 -136489 -166434 -112080 -60487
13471 -60487 1774 35856 -80050 -142107 -148197 -136592 -189408 -71804 152507 152570 39048 -15195
13459 -15195 63756 46230 36269 -54809 -72178 -131965 -187576 -105063 -111063 -20151 42282 -84241
13447 -84241 29195 186238 295271 111768 -40434 -165301 -92936 -90224 -63280 33408 150525
13436 150525 150347 156701 71869 -55523 109786 168582 73327 -3736 36776 21969 -18796 -103893
13424 -103893 -259976 -215427 -133489 -82624 -83975 -73934 -55199 -36582 -112219 -178973 -182473 -198770
13412 -198770 -114936 -136277 -116193 9913 8422 -116339 -88332 -38528 -82616 -95756 -94604
13401 -94604 -119690 -48609 -47747 -5262 -54612 69709 48802 90299 91255 -27348 100812 95080
$$ packed form
13482a23840R9270J02141l058O617q9953j22624m2099L7057k9945N4354N1593
13471f0487O2261L4082j15906o2057o090J1605n2816J17604K24311O3j13522n4243
13459a5195P8951j7526r961r1078j7369n9787n5611Q2513o000R0912O2433j26523
13447h4241J13436J57043J09033j83503j52202j24867P2365K712K6944R6688J17117
13436A50525j78O354q4832j27392J65309N8796r5255p7063M0512j4807m0765q5097
13424a03893j56083M4549Q1938N0865j351J0041J8735J8617p5637o6754l500j6297
13412a98770Q3834k1341K0084J26106j491j24761K8007M9804m4088j3140J152
13401i4604k5086P1081Q62M2485m9350J24321k0907M1497R56j18603J28160n732
$$ plain form
13389 95080 -52549 108829 257151 251054 125290 124075 134342 117291 12063 74198 98966
13378 98966 44940 33988 -50568 -6390 48090 -26745 -158485 -157580 -16655 185345 232482
13367 232482 259470 216724 146635 -43499 -130791 -70583 3575 84726 134872 145351 62615
13356 62615 117648 121643 115464 91732 -49319 -185159 -215218 -198716 -209814 -110046 10012
13345 10012 103321 122083 61399 -19294 -57927 -315395 -307892 35570 131512 124096 170808 86617
13333 86617 3763 8951 -82041 -24426 63889 -81039 -200141 -303697 -279018 -75301 -10047
13322 -10047 -9333 -159462 -159417 -136859 -17324 39134 -28762 43668 120537 37181 -101872 -53565
13310 -53565 5204 -55738 -33155 5647 -67625 -80591 -112213 -85699 10480 -19110 -15703 -16189
$$ packed form
13389I5080j47629J61378J48322o097j25764j215J0267j7051j05228O2135K4768
13378I8966n4026j0952q4556M4178N4480p4835j31740R05J40925K02000M7137
13367B32482K6988m2746p0089j90134q7292O0208P4158Q1151N0146J0479q2736
13356F2615N5033L995o179k3732j41051j35840l0059J6502j1098R9768J20058
13345A0012R3309J8762o0684q0693l8633k57468P503L43462R5942p416M6712q4191
13333H6617q2854N188r0992N7615Q8315j44928j19102j03556K4679K03717O5254
13322a0047P14j50129M5K2558J19535N6458o7896P2430P6869q3356j39053M8307
13310e3565N8769o0942K2583L8802p3272j2966l1622K6514R6179k9590L407m86
$$ plain form
13298 -16189 -95876 -83644 36048 57450 162584 191683 239037 246461 312290 313921 226071 182896
13286 182896 173989 256708 203327 173228 74905 -55334 -54953 121302 303409 140382 -171
13275 -171 -65155 -213336 -340098 -237923 -240755 -276633 -261706 -218266 -137206 -29975 -12792
13264 -12792 -73359 13318 -39906 7875 71447 23323 19624 114320 184547 173162 117107 133540
13252 133540 169157 -3642 -112572 -107283 -72637 -45743 101366 64366 -4535 -110275 -190949
13241 -190949 -191717 -170251 -197648 -204459 -110957 120550 201679 103486 46206 47688 6252 -14263
13229 -14263 -39360 -49297 -33876 48501 96055 55041 19298 81997 82224 -39813 -36260 115312
13217 115312 40571 -17984 25609 -23038 25603 -24692 -47730 -73307 -5990 3707 -187231
$$ packed form
13298a6189p9687J2232J19692K1402J05134K9099M7354P424O5829J631q7850m3175
13286A82896q907Q2719n3381l0099r8323j30239L81J76255J82107j63027j40553
13275a71o4984j48181j26762J02175k832l5878J4927M3440Q1060J07231J7183
13264a2792o0567Q6677n3224M7781O3572m8124l699R4696P0227j1385n6055J6433
13252A33540L5617j72799j08930N289L4646K6894J47109l7000o8901j05740q0674
13241a90949p68K1466k7397o811R3502K31507Q1129r8193n7280J482m1436k0515
13229a4263k5097r937J5421Q2377M7554m1014l5743O2699K27j22037L553J51572
13217A15312p4741n8555M3593m8647M8641n0295k3038k5577O7317R697j90938
$$ plain form
13206 -187231 -169876 -127745 -73258 -94626 -96846 5311 117543 137603 94296 35631 -112449
13195 -112449 -94175 -11739 -72216 -81996 -22408 -179055 -280172 -131136 82293 34595 -43722
13184 -43722 -73643 -38965 -33264 -158850 -308995 -108561 18323 78652 97768 197808 331608
13173 331608 117049 -37009 -82907 10421 -25057 -86507 8767 85402 123616 74952 9544
13162 9544 -71534 -200292 -54194 -4372 -81666 -131175 -62916 102623 136318 182025 109852
13151 109852 102462 177158 161654 78487 41276 172652 239468 134849 50706 50353 -10117 -8997
13139 -8997 21859 74400 92576 31479 -104045 -176715 -239174 -151350 -31344 -34370 7005 -12466
13127 -12466 -165567 -151730 -97422 -132294 -269622 -127577 19195 -86662 -111325 -30907 -21797
$$ packed form
13206a87231J7355M2131N4487k1368k220J02157J12232K0060m3307n8665j48080
13195a12449J8274Q2436o0477r780N9588j56647j01117J49036K13429m7698p8317
13184d3722k9921L4678N701j25586j50145K00434J26884O0329J9116J00040J33800
13173C31608k14559j54058m5898R3328l5478o1450R5274P6635L8214m8664o5408
13162I544q1078j28758J46098M9822p7294m9509O8259J65539L3695M5707p2173
13151A09852p390P4696j5504q3167l7211J31376O6816j04619q4143l53o0470J120
13139h997L0856N2541J8176o1097j35524p2670o2459Q7824J20006l026M1375j9471
13127a2466j53101J3837N4308l4872j37328J42045J46772j05857k4663Q0418R110
$$ plain form
13116 -21797 -85789 -60702 -63269 72702 102922 72310 41283 119276 171571 164824 167778 148595
13104 148595 149816 220885 260247 261130 290995 215643 61744 111385 241425 154920 6664
13093 6664 -38436 -74004 30558 108025 -10271 -103029 -151328 -251201 -79383 39244 -3888
13082 -3888 -81338 -145549 -134632 -125000 -166719 -156209 -121833 -172970 -176764 -83966 -89666 -59604
13070 -59604 -32099 -157388 -219993 -150421 -91934 -49096 80386 67748 -49329 -59939 28535
13059 28535 144934 24628 -151183 -169075 -170208 -91848 24721 124467 53572 86876 84067
13048 84067 36205 -41375 -133480 -93847 89908 16273 38942 77213 102882 206153 42317
13037 42317 -162426 -335187 -231597 -171449 -80291 1925 36697 60234 -1417 -15344 -36721
$$ packed form
13116b1797o3992K5087k567J35971L0220l0612l1027P7993N2295o747K954j9183
13104A48595J221P1069L9362Q83K9865p5352j53899M9641J30040q6505j48256
13093F664m5100l5568J04562P7467j18296r2758m8299r9873J71818J18627m3132
13082c888p7450o4211J0917R632m1719J0510L4376n1137l794R2798n700L0062
13070e9604K7505j25289o2605O9572N8487M2838J29482j2638j17077j0610Q8474
13059B8535J16399j20306j75811j7892j133P8360J16569R9746p0895L3304k809
13048H4067m7862p7580r2105L9633J83755p3635K2669L8271K5669J03271j63836
13037D2317k04743j72761J03590O0148R1158Q2216L4772K3537o1651j3927k1377
$$ plain form
13026 -36721 -92748 -82375 78109 159094 45522 23597 115356 73748 19409 54120 134923
13015 134923 170164 98178 -57015 -12200 14263 -38149 -27665 -107880 -162652 -158948 -55171
13004 -55171 -41078 -55622 -38454 15658 46622 93089 57823 137810 565 -3702 -97039 -95063
12992 -95063 -23474 130160 219544 227900 157815 11225 -29864 195593 197360 24973 110212
12981 110212 55959 7327 95825 148403 83730 -96982 -98579 -114586 -8195 20699 -23151
12970 -23151 -37350 -91069 -45879 46056 23796 92022 41509 39596 -31650 -103080 -161143 -125335
12958 -125335 -83949 -154170 -38128 119132 41276 111859 134243 -151427 -167760 -21943 20252
12947 20252 -6871 254 -25313 -82642 -91652 -130540 -73503 97656 64381 -94455 -133425 -86845
$$ packed form
13026c6721n6027J0373J60484Q0985j13572k1925R1759m1608n4339L4711Q0803
13015A34923L5241p1986j55193M4815K6463n2412J0484q0215n4772L704J03777
13004e5171J4093j4544J7168N4112L0964M6467l5266P9987j37245m267r3337J976
12992i5063P1589J53634Q9384Q356p0085j46590m1089K25457J767j72387Q5239
12981A10212n4253m8632Q8498N2578o4673j80712j597j6007J06391K8894m3850
12970b3151j4199n3719M5190R1935k2260O8226n0513j913p1246p1430n8063L5808
12958a25335M1386p0221J16042J57260p7856P0583K2384k85670j6333J45817M2195
12947B0252k7123P125k5567n7329r010l8888N7037J71159l3275j58836l8970M6580
$$ plain form
12935 -86845 -11908 137820 97323 -116200 -121986 -98363 -131838 -246271 -219415 -94674 -30218
12924 -30218 26106 100971 69908 -28912 5881 68570 -36605 -123362 93854 264050 285260
12913 285260 303431 347456 370793 415818 338631 118849 7279 -28374 -26808 -110704 -15144
12902 -15144 -60750 -47503 -81711 339 56990 143204 168822 200466 231155 138511 38048
12891 38048 475 107151 99567 45257 -20118 -178104 -93104 -77701 -75646 -127691 -58462 -70941
12879 -70941 -126138 -126740 -162008 -190705 -177753 -23453 -90055 -23925 45525 92076 95360 36368
12867 36368 71523 60720 48390 152410 200634 226854 116438 124563 -1046 -64671 -54249
12856 -54249 56657 188472 225018 182261 209721 231798 130565 181414 138150 191449 245482
$$ packed form
12935h6845P4937J49728m0497k13523n786K3623l3475j14433K6856J24741O4456
12924c0218N6324P4865l1063r8820L4793O2689j05175q6757K17216J70196K1210
12913B85260J8171M4025K3337M5025p7187k19782j11570l5653J566q3896R5560
12902a5144m5606J3247l4208Q2050N6651Q6214K5618L1644L0689r2644j00463
12891C8048l7573J06676p584n4310o5375j57986Q5000J5403K055n2045O9229j2479
12879g0941n5197o02l5268k8697J2952J54300o6602O6130O9450M6551L284n8992
12867C6368L5155j0803j2330J04020M8224K6220j10416Q125j25609o3625J0422
12856e4249J10906J31815L6546m2757K7460K2077j01233N0849m3264N3299N4033
$$ plain form
12845 245482 302317 226009 74048 45321 -12076 -122102 -133126 -48631 28814 96781 8635
12834 8635 34477 -51008 -133917 -169424 -93974 28384 105198 187473 138687 238209 282141 256175
12822 256175 254187 286617 180711 102948 59881 97444 67849 159987 223857 268779 266803 243798
12810 243798 110280 -123544 -193125 -263279 -179380 -92314 -89029 -91106 31654 29213 -31321
12799 -31321 -34511 -118163 -99942 -37597 7861 66168 141963 46357 -44581 -18451 -144114 -130875
12787 -130875 -5316 160960 163551 31267 -10003 62606 190075 65819 431 49794 46441
12776 46441 -56512 -74056 -100040 -140945 -26538 93841 179037 11124 -80952 -29439 -84731
12765 -84731 -39752 120896 209343 159880 77115 -17823 42064 178987 147943 74704 13457
$$ packed form
12845B45482N6835p6308j51961k8727n7397j10026j1024Q4495P7445O7967q8146
12834H635K5842q5485q2909l5507P5450J22358P6814Q2275m8786R9522M3932k5966
12822B56175j988L2430j05906p7763m3067L7563k9595R2138O3870M4922j976k3005
12810B43798j33518k33824o9581p0154Q3899Q7066L285k077J22760k441o0534
12799c1321l190q3652J8221O2345M5458N8307P5795r5606r0938K6130j25663J3239
12787a30875J25559J66276K591j32284m1270P2609J27469j24256o5388M9363l353
12776D6441j02953j7544k5984m0905J14407J20379Q5196j67913r2076N1513n5292
12765h4731M4979J60648Q8447m9463q2765r4938N9887J36923l1044p3239o1247
$$ plain form
12754 13457 -92587 -129522 -70060 51427 143523 106802 -17686 -47256 87266 231556 74148
12743 74148 7291 -29116 -107019 15916 16317 27934 -31333 -25986 -173976 -158303 -77842 -77784
12731 -77784 -33417 -16963 -82889 4770 78920 90281 32181 11986 34670 55386 110225 56608
12719 56608 4112 -62736 -59173 -57194 -31400 11516 50114 42713 26137 51666 119552 52490
12707 52490 -44497 41324 123146 90109 234613 178182 88130 79282 52319 113046 70327 20531
12695 20531 -9723 -38946 -85903 -56133 -19302 -86285 -31654 153981 125531 29237 -94653
12684 -94653 -129948 -60985 16809 -15648 -43802 -118536 -117166 -100392 -18485 199637 357542
12673 357542 436724 413458 347472 143071 131870 165954 105849 -9537 -1880 -6329 81765
$$ packed form
12754A3457j06044l6935N9462J21487R2096l6721j24488k9570J34522J44290j57408
12743G4148o6857l6407p7903J22935M01J1617n9267N347j47990J5673Q0461N8
12731g7784M4367J6454o5926Q7659P4150J1361n8100k0195K2684K0716N4839n3617
12719E6608n2496o6848L563J979K5794M2916L8598p401j6576K5529O7886o7062
12707E2490r6987Q5821Q1822l3037J44504n6431r0052q848k6963O0727m2719m9796
12695B0531l0254k9223m6957K9770L6831o6983N4631J85635k8450r6294j23890
12684i4653l5295O8963P7794l2457k8154p4734J370J6774Q1907K18122J57905
12673C57542P9182k3266o5986k04401j1201L4084o0105j15386P657m449Q8094
$$ plain form
12662 81765 210307 109965 67955 86804 65097 82137 41773 -95843 -159203 -102146 -54654
12651 -54654 -131412 -98399 46377 82670 104339 7921 -157670 -40276 77847 71901 -46043
12640 -46043 -127440 -70688 -55927 108795 -4494 -82861 -87949 -117847 -32994 48745 32835
12629 32835 -9763 -162202 -272884 -308448 -249670 -144430 -148143 -87336 -26809 -16630 32891
12618 32891 -21950 -108485 -185581 -105440 -206395 -247930 -130565 -19471 -124585 -243058 -283712
12607 -283712 -176646 -60811 62076 193308 82781 -109143 -178824 -39116 15624 24580
12597 24580 50034 55081 -7091 -19180 -14958 15268 -9575 -84687 -251460 -327224 -181918 -36703
12585 -36703 -149525 -129404 -17660 19252 -21594 -158401 -92850 68830 51847 158880 157138
$$ packed form
12662H1765J28542j00342m2010J8849k1707J7040m0364j37616o3360N7057M7492
12651e4654p6758L3013J44776L6293K1669r6418j65591J17394J18123n946j17944
12640d6043q1397N6752J4761J64722j13289p8367n088k9898Q4853Q1739j5910
12629C2835m2598j52439j10682l5564N8778J05240l713O0807O0527J0179M9521
12618C2891n4841q6535p7096Q0141j00955m1535J17365J11094j05114j18473m0654
12607b83712J07066J15835J22887J31232j10527j91924o9681J39708N4740Q956
12597B4580K5454N047o2172j2089M222L0226k4843p5112j66773p5764J45306J45215
12585c6703j12822K0121J11744L6912m0846j36807O5551J61680j6983J07033j742
$$ plain form
12574 157138 91251 140892 234572 264917 234987 113048 151401 186829 140630 182276 192875
12563 192875 222332 326335 280803 188761 116418 149522 160027 242274 212148 170994 145029
12552 145029 -27023 -60993 59444 82927 1578 -42308 -58860 -7710 -114182 -214983 -67328
12541 -67328 23638 104743 349749 221283 113830 -2323 -83167 19984 21487 150775 76632
12530 76632 -220965 -274532 -116075 -42452 -124115 -276218 -125817 12954 137770 93152
12520 93152 137654 257559 313802 244444 278845 267384 136770 52402 64241 77497 -45244
12509 -45244 -14843 156816 198259 235195 270236 333371 323280 119884 -118773 -106537 -673
12498 -673 -675 54865 237668 217383 59956 -118145 -113035 -21755 -72933 70280 235644 252068
$$ packed form
12574A57138o5887M9641R3680L0345k9930j21939L8353L5428m6199M1646J0599
12563A92875K9457J04003m5532r2042p2343L3104J0505Q2247l0126m1154k5965
12552A45029j72052l3970J20437K3483q1349m3886j6552N1150j06472j00801J47655
12541f7328R0966Q1105K45006j28466j07453j16153q0844J03151J503J29288p4143
12530G6632k97597n3567J58457P3623q1663j52103J50401J38771J24816m4618
12520I3152M4502J19905N6243o9358L4401j1461j30614q4368J1839J3256j22741
12509d5244L0401J71659M1443L6936L5041O3135j0091k03396k38657J2236J05864
12498f73kN5540J82803k0285j57427j78101N110R1280n1178J43213J65364J6424
$$ plain form
12486 252068 137347 156246 59250 -46600 2888 -57306 14391 98282 124240 59499 120909
12475 120909 177520 2278 28399 152429 172907 172374 144253 208073 44558 -30885 -30309 80863
12463 80863 183947 195741 64008 -130877 -146152 -114829 -119842 -203964 -173988 -164890 -42453
12452 -42453 44829 44712 35681 -109171 -207526 -175799 -35489 124791 121180 30684 -100790 -42571
12440 -42571 -30938 -3521 116750 13118 -70519 24802 134590 91976 103118 14165 -125138
12429 -125138 -123578 -141126 59097 187707 44628 -126573 -118 75855 -135435 -256010
12419 -256010 -186676 -62396 33534 125351 261567 281874 188043 89176 -11181 -120831 -102398
12408 -102398 10590 57213 16689 -37561 7851 16983 -18860 -15989 -19464 -47891 -36884 -39287
$$ packed form
12486B52068j14721J8899r6996j05850M9488o0194P1697Q3891K5958o4741O1410
12475A20909N6611j75242K6121J24030K0478n33k8121O3820j63515p5443N76J11172
12463H0863J03084J1794j31733j94885j5275L1323n013q4122K9976R098J22437
12452d2453Q7282j17r031j44852r8355L1727J40310J60280l611r0496j31474N8219
12440d2571J1633K7417J20271j03632q3637R5321J09788m2614J1142q8953j39303
12429a25138J560j7548K00223J28610j43079j71201J26455P5973k11290j20575
12419b56010O9334J24280R5930R1817J36216K0307r3831r8867j00357j09650J8433
12408a02398J12988M6623m0524n4250M5412R132l5843K871l475k8427J1007k403
$$ plain form
12396 -39287 3548 20154 72248 122239 195892 135802 102676 84681 37586 60656 5938 72545
12384 72545 76883 85791 -144616 -208116 -139449 -102604 -50231 30869 3078 26795 -88833 -254677
12372 -254677 -187491 116765 80674 -102780 -260404 -179049 -136019 -86169 39447 64368 -37347
12361 -37347 -20699 42612 -54528 -141244 -139050 -43635 77839 -51495 -72703 -124807 -102459
12350 -102459 3937 -47785 39746 -9370 -106599 -178819 -120458 -178041 -109174 -53520 -114225
12339 -114225 -103798 -112641 -27167 -11976 -53490 -9927 -22562 -101273 -105084 66998 3491 -46815
12327 -46815 -60315 -91541 -137046 -77152 26723 58375 21562 -88010 -46968 -27554 -171316
12316 -171316 -242352 -199073 -112488 -91859 -8111 18899 89797 160529 151435 136066 107417 33421
$$ packed form
12396c9287M2835J6606N2094M9991P3653o0090l3126j7995m7095K3070n4718O6607
12384G2545M338Q908k30407o3500O8667L6845N2373Q1100k7791K3717j15628j65844
12372b54677O7186L04256l6091j83454j57624Q1355M3030M9850J25616K4921j01715
12361c7347J6648O3311r7140q6716K194R5415J21474j29334k1208n2104K2348
12350a02459J06396n1722Q7531m9116r7229p2220N8361n7583O8867N5654o0705
12339a14225J0427q843Q5474J5191m1514M3563j2635p8711l811J72082o3507n0306
12327d6815j3500l1226m5505N9894J03875L1652l6813j09572M1042J9414j43762
12316a71316p1036M3279Q6585K0629Q3748K7010P0898P0732r094j5369k8649p3996
$$ plain form
12304 33421 36239 54486 83701 -61259 -233299 -162892 -20210 63675 -32673 34827 67642
12293 67642 -36354 -65965 -5317 -65823 -145214 -84513 -45954 -166174 -150055 63865 251978
12282 251978 210295 101758 181880 174674 74266 -89043 -185519 -85244 9534 34958 10570
12271 10570 -8245 74530 143205 168339 191196 145274 133144 80510 38669 30363 47701 12464
12259 12464 -96873 -1233 -15751 -2136 -89471 -163978 -94915 -40181 65346 -43224 -35536
12248 -35536 45868 -3480 37993 227952 200037 69399 -21736 10545 23768 45849 -27728
12237 -27728 -26107 6069 40563 -71833 -90154 14202 28387 -20932 30102 97225 119021
12226 119021 163823 162428 143246 33468 -106280 -128814 -64283 -58942 149 48158 99324
$$ packed form
12304C3421K818J8247K9215j44960j72040P0407J42682Q3885r6348O7500L2815
12293F7642j03996k9611O0648o0506p9391O0701L8559j20220J6119K13920J88113
12282B51978m1683j08537Q0122p206j00408j63309r6476J00275R4778K5424k4388
12271A0570j8815Q2775O8675K5134K2857m5922j2130n2634m1841q306J7338l5237
12259A2464j09337R5640j4518J3615q7335p4507O9063N4734J05527j08570P688
12248c5536Q1404m9348M1473J89959k7915j30638r1135L2281J3223K2081p3577
12237b7728J621L2176L4494j12396j8321J04356J4185m9319N1034O7123K1796
12226A19021M4802j395j9182j09778j39748k2534O4531N341N9091M8009N1166
$$ plain form
12215 99324 190832 107572 61828 218186 295279 329791 125369 -21449 -42179 17318 136284
12204 136284 171247 126687 42781 -48931 62094 83992 58614 -62191 2448 -21642 77332
12193 77332 72085 69952 136340 161076 24257 -58441 -140250 -158811 -67493 72800 201614
12182 201614 34783 14631 78970 66581 10833 -31248 -126412 -166061 -183806 -197815 -161718
12171 -161718 6796 -27138 63793 121096 53493 43447 -15403 -241339 -354001 -251651 -128317
12160 -128317 -107188 -88181 23507 23351 -67912 -97809 -59310 4810 111728 75087 66496 54476
12148 54476 92155 160969 209150 191040 212812 165345 99236 -65042 -81278 88995 69531
12137 69531 136444 164849 189823 241820 223771 157360 90457 18272 148711 138179 266515
$$ packed form
12215I9324R1508q3260m5744J56358P7093L4512k04422j46818k0730N9497J18966
12204A36284L4963m4560q3906r1712J11025K1898k5378j20805O4639k4090R8974
12193G7332n247k133O6388K4736j36819q2698q1809j8561R1318J40293J28814
12182B01614j66831k0152O4339j2389n5748m2081r5164l9649j7745j4009L6097
12171a61718J68514l3934R0931N7303o7603j0046n8850k25936j12662J02350J23334
12160a28317K1129J9007J11688j56r1263k9897L8499O4120J06918l6641q591j2020
12148E4476L7679O8814M8181j8110K1772m7467o6109j64278j6236J70273j9464
12137F9531O6913K8405K4974N1997j8049o6411o6903p2185J30439j0532J28336
$$ plain form
12126 266515 412255 278823 67108 86349 98960 44877 18614 43007 123035 179749 241886
12115 241886 314387 229953 129579 70196 72959 22188 7443 112277 187975 23743 -100070
12104 -100070 -94881 -2688 33739 41572 123657 139885 22614 -76284 -130147 -18674 -14284 -86777
12092 -86777 -86587 45408 164193 326770 144516 -83368 -65911 36430 22253 -61661 -32178
12081 -32178 53961 34621 121397 191343 70820 -20155 83650 65773 421 14912 52452
12070 52452 182324 190662 61676 55806 142136 184031 89803 -24538 36184 86918 76195
12059 76195 19037 46014 90034 -90283 -137825 -138719 -264221 -259169 -145472 -203131 -141853 -21471
12047 -21471 -119530 -9767 44609 27993 -76184 -87319 -5854 24131 47355 44477 -15421
$$ packed form
12126B66515J45740j33432k11715J9241J2611n4083k6263K4393Q0028N6714O2137
12115B41886P2501q4434j00374n9383K763n0771j4745J04834P5698j64232j23813
12104a00070N189R2193L6427P833Q2085J6228j17271r8898n3863J11473M390p2493
12092h6777J90J31995J18785J62577j82254k27884J7457J02341j4177q3914K9483
12081c2178Q6139j9340Q6776O9946j20523r0975J03805j7877o5352J4491L7540
12070E2452J29872Q338j28986n870Q6330M1895r4228j14341O0722N0734j0723
12059G6195n7158K6977M4020j80317m7542q94j25502N052J13697n7659O1278J20382
12047b1471r8059J09763N4376j6616j04177j1135Q1465K9985K3224k878n9898
$$ plain form
12036 -15421 -12434 -90738 -118445 -32302 -45794 -36783 35328 46411 46580 81445 -30987 -30394 27495
12023 27495 40399 -54953 73175 132134 109381 35799 -47327 -160024 -202790 -192205 -115387
12012 -115387 -93164 105660 121363 165746 173500 279065 246477 174924 95898 45921 13587
12001 13587 -49759 -40890 7721 -11721 25388 -41151 -8859 -44446 61879 266051 254722
11990 254722 105003 19911 -53415 84126 194441 85563 -23393 -23818 1576 14429 -4687
11979 -4687 -15402 -24099 -20677 56584 95016 47694 -35322 -120433 6784 88800 115838 27256
11967 27256 -123425 -87030 -61473 -176096 -225317 -122500 -64846 -13430 -10433 78353 149786
11956 149786 98312 94440 92771 48078 -10579 -86320 -201725 -336122 -313563 -114740 -45963
$$ packed form
12036a5421K987p8304k7707Q6143j3492R011P2111J1083J69L4865j12432N93N7889
12023B7495J2904r5352J28128N8959k2753p3582q3126j12697m2766J0585P6818
12012a15387K2223J98824J5703M4383P754J05565l2588p1553p9026m9977l2334
12001A3587o3346Q869M8611j9442L7109o6539L2292l5587J06325K04172j1329
11990B54722j49719q5092p3326J37541J10315j08878j08956m25K5394J2853j9116
11979d687j0715q697L422P7261L8432m7322q3016q5111J27217Q2016K7038q8582
11967B7256j50681L6395K5557j14623m9221J02817N7654N1416K997Q8786P1433
11956A49786n1474l872j669m4693n8657p5741j15405j34397K2559J98823O8777
$$ plain form
11945 -45963 -83801 -168669 -122169 16225 146858 197803 113683 61243 101422 78823 17223
11934 17223 -32333 32391 -25724 40347 -13776 56568 97621 35726 11276 -15505 79772 102192
11922 102192 167579 113561 89971 140139 148173 148546 98463 147002 169406 160901 -36134 6955
11910 6955 138735 269447 290587 351291 320651 367341 337375 242522 174971 212703 131003
11899 131003 69175 27686 81078 94208 22373 37985 -8121 -9579 -18275 -118102 -104568 -48585
11887 -48585 -78635 -8734 -22660 -64690 -93282 -63447 -77890 -51625 -35321 43262 178982
11876 178982 229556 45676 -170598 -301974 -339818 -209716 -141879 -68655 -127513 -131012 -49761
11865 -49761 37334 181269 243151 71018 41560 82870 5910 57047 90974 57966 228801
$$ packed form
11945d5963l7838q4868M6500J38394J30633N0945q4120n2440M0179k2599o1600
11934A7223m9556O4724n8115O6071n4123P0344M1053o1895k4450k6781R5277K2420
11922A02192O5387n4018k3590N0168Q034L73n0083M8539K2404q505j97035M3089
11910F955J31780J30712K1140O0704l0640M6690k9966r4853o7551L7732q1700
11899A31003o1828m1489N3392J3130p1835J5612m6106j458q696r9827J3534N5983
11887d8585l0050O9901j3926m2030k8592K9835j4443K6265J6304P8583J35720
11876A78982N0574j83880k16274j31376l7844J30102O7837P3224n8858l499Q1251
11865d9761Q7095J43935O1882j72133k9458M1310p6960N1137L3927l3008J70835
$$ plain form
11854 228801 305095 187431 100958 1395 -117802 -55931 -172137 -103962 -63306 54293 22007
11843 22007 46626 144646 122887 -89797 -119013 -78113 70864 135339 134450 174251 178294 191522
11831 191522 65342 -31707 -155894 -102592 -81929 -27295 -107759 -160015 -25346 -94 69181
11820 69181 -12293 -85337 -136331 -211408 -123138 -18133 -13407 -19360 -86839 -122190 -8903 136950
11808 136950 136749 167540 170526 51510 -16570 -123726 -101986 49763 217652 356747 362937
11797 362937 232042 109816 91875 8398 37308 -24452 5075 26683 -165340 -165787 -89820
11786 -89820 4806 -5312 40011 2752 77515 60395 53492 169648 137369 64020 75621 154654
11774 154654 177045 190460 174860 89499 -133482 -180899 -85323 12830 -23707 -134518 154685
$$ packed form
11854B28801P6294j17664q6473r9563j19197O1871j16206O8175M0656J17599l2286
11843B2007K4619R8020k1759k12684k9216M0900J48977O4475q89L9801M043J3228
11831A91522j26180r7049j24187N3302K0663N4634q0464n2256J34669K5252O9275
11820F9181q1474p3044n0994p5077Q8270J05005M726n953o7479l5351J13287J45853
11808A36950k01L0791K986j19016o8080j07156K1740J51749J67889J39095O190
11797C62937j30895j22226j7941q3477K8910o1760K9527K1608j92023m47P5967
11786h9820R4626j0118M5323l7259P4763j7120o903J16156l2279p3349J1601P9033
11774A54654K2391J3415j5600q5361k22981m7417R5576R8153l6537j10811K89203
$$ plain form
11763 154685 221484 15527 -42455 3192 67638 -16666 -163439 -121616 -125709 -187559 -120395
11752 -120395 -107352 -180512 -252462 -334708 -427694 -446305 -325167 -115768 -142842 -65889 93536
11741 93536 103821 101325 25616 -69011 1062 90337 -59286 -6944 -89236 -113906 -117656 -237244
11729 -237244 -237477 -128205 1371 199194 110544 49275 107020 150887 191074 186571 66668
11718 66668 98195 -63586 -43033 -49228 43380 51905 73604 142976 264057 204466 111111 72105
11706 72105 20654 91112 252677 232732 79721 103783 103664 113868 6947 -17920 43705
11695 43705 32656 30737 -62445 -96258 -22173 38620 49222 158617 97923 8522 -9053 31213
11683 31213 79008 -28090 -72647 -43391 6414 34017 -22165 -11216 108029 126522 83309
$$ packed form
11763A54685O6799k05957n7982M5647O4446q4304j46773M1823m093o1850O7164
11752a20395J3043p3160p1950q2246r2986j8611J21138K09399k7074P6953J59425
11741I3536J0285k496p5709r4627P0073Q9275j49623N2342q2292k4670l750j19588
11729b37244k33J09272J29576J97823q8650o1269N7745M3867M0187m503j19903
11718F6668L1527j61781K0553o195R2608Q525K1699O9372J21081n9591r3355l9006
11706G2105n1451P0458J61565j9945j53011K4062j19J0204j06921k4867O1625
11695D3705j1049j919r3182l3813P4085O0793J0602J09395o0694q9401j7575M0266
11683C1213M7795j07098m4557K9256M9805K7603n6182J0949J19245J8493m3213
$$ plain form
11672 83309 51176 63701 -56514 -211810 -263116 -197958 -72703 -49380 -29662 124499 140475
11661 140475 115435 207652 223818 114717 137710 149898 121869 112126 110600 147662 250395
11650 250395 364112 241824 10701 -113833 -107121 28142 35469 -22256 24495 139176 163728
11639 163728 66616 -33730 -214059 -296764 -223899 -133688 48216 -21142 -78813 -55897 1642
11628 1642 75795 156668 -53433 -107295 -76706 -108425 -87699 -39698 72699 102395 94274 -33035
11616 -33035 -87598 -7837 -38523 67677 204643 144806 134581 143773 301888 295249 143582
11605 143582 -45984 -228244 -170814 -79770 -90374 -125142 -82955 -61089 38988 142101 104025
11594 104025 -47492 36362 11451 -58922 -20991 -6527 -68926 -86602 -80200 178561 293648
$$ packed form
11672H3309l2133J2525j20215j55296n1306O5158J25255K3323J9718J54161J5976
11661A40475k5040R2217J6166j09101K2993J2188k8029r743j526L7062J02733
11650B50395J13717j22288k31123j24534O712J35263P327n7725M6751J14681K4552
11639A63728r7112j00346j80329q2705P2865R0211J81904o9358n7671K2916N7539
11628A642P4153Q0873k10101n3862L0589l1719K0726M8001J12397K9696q121j27309
11616c3035n4563P9761l0686J06200J36966n9837j0225R192J58115o639j51667
11605A43582j89566j82260N7430R1044j0604l4768M2187K1866J00077J03113l8076
11594A04025j51517Q3854k4911p0373L7931J4464o2399j7676O402K58761J15087
$$ plain form
11583 293648 137423 27258 27939 49150 3548 -62626 -102211 -160102 -279346 -172253 -112382
11572 -112382 -125724 -21905 31132 38987 132774 237996 138036 3003 3847 35738 -2060
11561 -2060 -923 119353 94022 -5364 -13452 -105062 -98733 15765 92156 217468 246711 192000
11549 192000 205812 163429 61346 108441 79337 78949 80868 98959 119805 201717 282026 213713
11537 213713 61790 -19013 -28633 -6605 206675 209033 147501 140984 280706 180802 153859
11526 153859 212856 181581 175351 189988 151991 111072 151889 133165 13052 13834 52207 62221
11514 62221 28013 -16663 -12159 148060 208682 137352 152371 244992 381735 385158 301463 314235
11502 314235 266886 402876 376680 292754 183046 178242 230098 151475 276174 382247 200829
$$ packed form
11583B93648j56225j10165O81K1211m5602o6174l9585n7891j19244J07093N9871
11572a12382j3342J03819N3037P855R3787J05222r9960j35033Q44L1891l7798
11561b060J137J20276k5331r9386q088r1610O329J14498P6391J25312K9243n4711
11549A92000J3812m2383j02083M7095k9104l88J919J8091K0846Q1912Q0309o8313
11537B13713j51923q0803r620K2028K13280K358o1532o517J39722r9904k6943
11526A53859N8997l1275o230J4637l7997m0919M0817j8724j20113P82L8373J0014
11514F2221l4208m4676M504J60219O0622p1330J5019R2621J36743L423q3695J2772
11502C14235m7349J35990k6196q3926j09708m804N1856p8623J24699J06073j81418
$$ plain form
11491 200829 90016 130216 130655 -10622 -8093 128179 94168 167376 74558 -107482 -181422
11480 -181422 -135306 75012 105283 88912 -23648 19044 27922 165738 143113 178939 210937
11469 210937 152753 176303 202233 136638 212793 166431 -37695 -155931 -209539 -233300 -67499
11458 -67499 149787 211779 381269 293532 160649 61078 -1643 -84652 20503 76308 278557
11447 278557 306520 178684 75812 -11122 19148 58927 40180 56672 -74425 -112567 -132172
11436 -132172 -122685 -88476 -1432 67149 -90497 -170090 18132 172457 182928 129720 171270
11425 171270 185264 177929 146529 146952 224337 428145 238670 38842 28832 154142 212404
11414 212404 222500 75932 -25920 87205 355230 358003 303949 423656 357344 77862
$$ packed form
11491B00829j10813M0200M39j41277K529J36272l4011P3208r2818j82040p3940
11480a81422M6116K10318L0271j6371j12560M2692Q878J37816k2625L5826L1998
11469B10937n8184K3550K5930o5595P6155m6362k04126j18236n3608k3761J65801
11458f7499K17286O1992J69490q7737j32883r9571o2721q3009J05155N5805K02249
11447B78557K7963j27836j02872q6934L0270L9779j8747J6492j31097l8142j9605
11436a32172R487L4209Q7044O8581j57646p9593J88222J54325J0471n3208M1550
11425A71270J3994p335l1400M23P7385K03808j89475j99828j0010J25310N8262
11414B12404J0096j46568j01852J13125K68025K773n4054J19707o6312k79482
$$ plain form
11404 77862 33586 59599 186374 292451 414835 277700 207175 210187 190266 230431 250730
11393 250730 209342 159358 218635 226257 118775 177802 419888 390830 400714 461081 466444 468894
11381 468894 521490 660736 765610 935275 1092282 1421161 1879815 2230073 2493680 2451665
11371 2451665 1963020 1345452 849007 571503 494865 464688 478567 502147 439849 372570
11361 372570 307938 319765 172428 100984 144234 63790 112136 89326 104888 134042 220707
11350 220707 252947 162871 77850 83179 108809 158876 96581 84809 200655 304843 302726
11339 302726 259817 233488 219560 83074 146223 198192 290744 414238 308460 233582 217197
11328 217197 203597 293794 415347 398349 301009 298092 342634 315568 155158 74149 83712
$$ packed form
11404G7862m4276K6013J26775J06077J22384j37135p0525L012j9921M0165K0299
11393B50730m1388m9984N9277P622j07482N9027K42086k9058R884O0367N363K450
11381D68894N2596J39246J04874J69665J57007L28879M58654L50258K63607m2015
11371B451665m88645o17568m96445k77504p6638l0177J3879K3580o2298o7279
11361C72570o4632J1827j47337p1444M3250q0444M8346k2810J5562K9154Q6665
11350B20707L2240r0076q5021N329K5630N0067o2295j1772J15846J04188k117
11339C02726m2909k6329j3928j36486O3149N1969R2552J23494j05778p4878j6385
11328B17197j3600R0197J21553j6998r7340k917M4542k7066j60410q1009R563
$$ plain form
11317 83712 50163 -75176 -97776 -64234 94279 183587 251984 243486 55114 -127013 -65671
11306 -65671 46613 266736 256586 121826 39325 64496 127591 217490 177386 76376 191694
11295 191694 262526 255327 255593 262486 206902 138989 167933 143826 200044 208579 138669 99783
11283 99783 112165 71358 66274 18716 55247 221000 292089 238415 154695 70240 34009 61840
11271 61840 -75069 -192400 -208272 -125466 8536 46186 33430 84305 61982 -6381 155949
11260 155949 257388 200994 176172 84666 -54083 -53367 -18226 40185 106896 92311 265772
11249 265772 426543 419016 269660 265892 147890 6176 -167812 -64399 4549 126083
11239 126083 135871 102208 124725 151841 226258 401008 351165 250901 213023 194724 234281
$$ packed form
11317H3712l3549j25339k2600L3542J58513Q9308O8397q498j88372j82127O1342
11306f5671J12284K20123j0150j34760q2501K5171O3095Q9899m0104j01010J15318
11295A91694P0832p199K66O893n5584o7913K8944k4107N6218Q535o9910l8886
11283I9783J2382m0807n084m7558L6531J65753P1089n3674q3720q4455l6231K7831
11271F1840j36909j17331j5872Q2806J34002L7650j2756N0875k2323o8363J62330
11260A55949J01439n6394k4822r1506j38749P16L5141N8411O6711j4585J73461
11249B65772J60771p527j49356l768j18002j41714j73988J03413O8948J21534
11239A26083R788l3663K2517K7116P4417J74750m9843j00264l7878j8299L9557
$$ plain form
11228 234281 410203 513407 394253 353911 332178 346958 330405 495147 607320 671910
11218 671910 647605 600377 471983 522237 463419 367516 378054 247141 185285 111315 46818
11207 46818 199583 230675 339751 454149 404761 337963 367584 346846 374053 379593 367654
11196 367654 353988 140679 103098 328307 342751 216716 112034 176655 235818 311587 362480
11185 362480 224186 136496 121611 112741 156444 164444 124965 171373 101056 249920 332334
11174 332334 228764 170634 320715 352362 270763 209878 133259 181555 171505 152966 251709
11163 251709 237912 323983 291049 299041 294854 343905 327404 194599 251086 353670 520552
11152 520552 640356 603683 458547 410238 377952 512606 563401 626995 571509 493322 506668
$$ packed form
11228B34281J75922J03204j19154m0342k1733J4780j6553J64742J12173O4590
11218F71910k4305m7228j28394N0254n8818r5903J0538j30913o1856p3970o4497
11207D6818J52765L1092J09076J14398m9388o6798K9621k0738K7207N540j1939
11196C67654j3666k13309l7581K25209J4444j26035j04682O4621N9163P5769N0893
11185C62480j38294q7690j4885q870M3703Q000l9479M6408p0317J48864Q2414
11174C32334j03570n8130J50081L1647q1599o0885p6619M8296j0050j8539R8743
11163B51709j3797Q6071l2934P992m187M9051j6501j32805N6487J02584J66882
11152E20552J19804l6673j45136m8309l2286J34654N0795O3594n5486p8187J3346
$$ plain form
11141 506668 469300 561193 469701 330389 372278 372687 320131 333719 218670 228107 113247
11130 113247 201986 273062 196224 197319 275659 221354 290572 269083 158339 117571 331426
11119 331426 444008 476690 456352 528433 526158 547629 574538 599518 577811 553025 469656
11108 469656 494413 622017 689842 720125 649290 662915 745281 685867 695389 727708 777554
11097 777554 865387 988096 1069681 1130464 1052947 808188 699055 780479 724913 688841 616822
11086 616822 647350 679106 726399 759787 681353 666068 659674 608958 610842 760565 703305 698632
11074 698632 752641 904113 896769 836603 867346 849901 801140 766203 688228 825956 757224
11063 757224 781150 830715 889336 1004267 1021966 1046814 1210500 1123227 1196149 1442087 1634960
$$ packed form
11141E06668l7368R1893r1492j39312M1889M09n2556J3588j15049R437j14860
11130A13247Q8739P1076p6838J095P8340n4305O9218k1489j10744m0768K13855
11119C31426J12582L2682k0338P2081k275K1471K6909K4980k1707k4786q3369
11108D69656K4757J27604O7825L0283p0835J3625Q2366n9414R522L2319M9846
11097G77554Q7833J22709Q1585O0783p7517k44759j09133Q1424n5566l6072p2019
11086F16822L0528L1756M7293L3388p8434j5285o394n0716J884J49723n7260m673
11074F98632N4009J51472p344o0166L0743j7445m8761l4937p7975J37728o8732
11063G57224K3926M9565N8621J14931J7699K4848J63686q7273P2922K45938J92873
$$ plain form
11052 1634960 1840636 2031134 2231908 2610979 2960709 3216005 3965656 4961090 5960779
11043 5960779 6834108 7617377 7967060 7748663 6599707 5200202 4116419 3303383 2987130
11034 2987130 2735684 2543308 2442614 2269935 2158926 2171681 2211657 2227512 2186532 2240743
11024 2240743 2327205 2312452 2299163 2316830 2452367 2438017 2463256 2559688 2511079 2466539 2407858
11013 2407858 2607012 2759623 2853205 3051098 3226666 3270962 3283770 3356175 3411326 3420948 3573248
11002 3573248 3775312 3998698 4234990 4358171 4566086 4886678 5153955 5352283 5562006
10993 5562006 5894527 6225013 6761062 7523052 8198683 8994379 10086040 11173856 12127739
10984 12127739 12885901 13594959 14799115 16658176 19258128 22743048 27117435 32566395
$$ packed form
11052A634960K05676J90498K00774L79071L49730K55296P49651R95434R99689
11043E960779Q73329P83269L49683k18397j148956j399505j083783q13036l16253
11034B987130k51446j92376j00694j72679j11009J2755L9976J5855m0980N4211
11024B240743Q6462j4753j3289J7667J35537j4350K5239R6432m8609m4540n8681
11013B407858J99154J52611R3582J97893J75568M4296J2808P2405N5151R622J52300
11002C573248K02064K23386K36292J23181K07915L20592K67277J98328K09723
10993E562006L32521L30486N36049P61990O75631P95696J091661J087816R53883
10984A2127739P58162P09058J204156J859061K599952L484920M374387N448960
$$ plain form
10976 32566395 39456777 48018395 58510237 71208770 87262157 108799822 139693332
10969 139693332 183796040 242460945 311726088 378401485 425938120 444484694 408265963
10962 408265963 304913130 204467068 139575505 101428386 78560026 64178836 54793883
10955 54793883 48330139 43533091 39679530 36361977 33383520 30798092 28840605 27365243
10947 27365243 26256114 25551899 24940753 24500622 24130440 23961537 23908888 23406335 22714427
10938 22714427 22114459 21835836 21995808 22209990 21788787 20651994 19352995 18240702 17198767
10929 17198767 15972041 14754332 13750985 12945694 12042010 11192692 10679120 10187584 9705056
10920 9705056 9183179 8615468 8094097 7681533 7267838 6738184 6271950 5928305 5603385
$$ packed form
10976C2566395O890382Q561618J0491842J2698533J6053387K1537665L0893510
10969A39693332M4102708N8664905O9265143O6675397M7536635J8546574l6218731
10962D08265963j03352833j00446062o4891563l8147119k2868360j4381190r384953
10955E4793883o463744m797048l853561l317553k978457k585428j957487j475362
10947B7365243j109129p04215o11146m40131l70182j68903n2649n02553o91908
10938B2714427n99968k78623J59972K14182m21203j136793j298999j112293j041935
10929A7198767j226726j217709j003347q05291r03684q49318n13572m91536m82528
10920I705056n21877n67711n21371m12564m13695n29654m66234l43645l24920
$$ plain form
10911 5603385 5363198 5041509 4776576 4494145 4168676 3944772 3716659 3519410 3361242
10902 3361242 3165674 2932335 2735421 2784332 2619354 2518879 2416658 2216730 2050571 2178695
10892 2178695 2099054 1831309 1712298 1590182 1449709 1304303 1122351 1014344 1098486 1104644
10882 1104644 975965 918257 837317 869970 863310 757459 698842 708895 729702 640629 544356
10871 544356 536770 471201 372544 286861 213282 308071 361868 233425 263631 230463 237505 251819
10859 251819 299079 304393 131842 12749 -50147 -102916 -17732 -18943 -93815 8253 28134
10848 28134 32485 100622 171294 68271 52783 93375 160346 287914 279013 223677 183042 143429
10836 143429 227064 228533 33790 -113427 -45785 -5270 -67989 -74296 -29821 -23103 -143630
$$ packed form
10911E603385k40187l21689k64933k82431l25469k23904k28113j97249j58168
10902C361242j95568k33339j96914M8911j64978j00475j02221j99928j66159J28124
10892B178695p9641k67745j19011j22116j40473j45406j81952j08007Q4142O158
10882A104644j28679n7708q0940L2653o660j05851n8617J0053K0807q9073r6273
10871E44356p586o5569r8657q5683p3579R4789N3797j28443L0206l3168P042J4314
10859B51819M7260N314j72551j19093o2896n2769Q5184j211p4872J02068J9881
10848B8134M351O8137P0672j03023j5488M0592O6971J27568q901n5336m0635l9613
10836A43429Q3635J469j94743j47217O7642M0515o2719o307M4475O718j20527
$$ plain form
10825 -143630 -166811 -46601 12740 -40809 -99362 43207 80077 90390 113616 89082 239528
10814 239528 217101 -19975 -10302 61180 99277 258349 255381 224954 136469 163153 158838 334128
10802 334128 449162 474639 390232 307890 28487 -94767 80030 106077 98724 179610 274868
10791 274868 244215 318122 457143 381385 188278 45951 144422 -14809 -110957 -23409 -105058
10780 -105058 -19247 -33592 -43612 89575 233836 242289 107519 18240 28269 80813 219695
10769 219695 163296 182947 212106 193802 199768 135026 139087 184338 162467 72571 121702 201089
10757 201089 188089 75583 81828 242955 228211 58093 27159 29752 -112291 -82472 -53469
10746 -53469 -23570 -59810 -3051 -7031 -47850 -6544 123476 158109 48461 -100376 -220909
$$ packed form
10825a43630k3181J20210N9341n3549n8553J42569L6870J0313K3226k4534J50446
10814B39528k2427k37076R673P1482L8097J59072k968l0427q8485K6684m315J75290
10802C34128J15034K5477q4407q2342k79403j23254J74797K6047p353Q0886R5258
10791B74868l0653P3907J39021p5758j93107j42327R8471j59231r6148Q7548q1649
10780a05058Q5811j4345j0020J33187J44261Q453j34770q9279J0029N2544J38882
10769B19695n6399J9651K9159j8304N966o4742M061M5251k1871q9896M9131P9387
10757B01089j3000j12506O245J61127j4744j70118l0934K593j42043K9819K9003
10746e3469K9899l6240N6759l980m0819M1306J30020L4633j09648j48837j20533
$$ plain form
10735 -220909 -249835 -261634 -183462 -159034 -162790 -135223 24639 -47288 -147408 -241713 -248538
10724 -248538 -79899 7047 -91789 -175768 -43627 43 -64516 -61406 -97830 -160557 -144317
10713 -144317 -184433 -181582 -152116 -27983 4973 -21236 -196974 -160971 -56055 -54215 -172780
10702 -172780 -374976 -312269 -54137 51831 69758 -4177 -70147 -246126 -160843 -3056
10692 -3056 -31496 -55424 -109031 -83451 -965 -40111 -36607 -31759 -71011 -107019 -78702 -82295
10680 -82295 -50163 159396 258756 184403 53180 -89349 -210798 -208626 -140526 -121287 -176780
10669 -176780 -178836 -245457 -162207 -137677 -109295 -57820 48747 59675 -42188 -64142 121488
10658 121488 225688 142375 149644 174046 105581 -14611 -104420 -124383 -257823 -259478 -148928
$$ packed form
10735b20909k8926j1799P8172K4428l756K7567J59862p1927j00120r4305o825
10724b48538J68639Q6946r8836q3979J32141M3670o4559L110l6424o2727J6240
10713a44317m0116K851K9466J24133L2956k6209j75738L6003J04916J840j18565
10702a72780k02196O2707K58132J05968J7927p3935o5970j75979Q5283J57787
10692c056k8440k3928n3607K5580Q2486l9146L504M848l9252l6008K8317l593
10680h2295L2132K09559R9360p4353j31223j42529j21449K172O8100J9239n5493
10669a76780k056o6621Q3250K4530K8382N1475J06567J0928j01863k1954J85630
10658A21488J04200q3313P269K4402o8465j20192q9809j9963j33440j655J10550
$$ plain form
10647 -148928 -120407 -72611 -35292 -68683 -110844 -150551 -131309 -132466 -167180 -77780 -28817 -42600
10635 -42600 -176456 -161225 -65764 132081 103849 -24046 1286 14564 -39355 25453 -1548
10624 -1548 -161451 -202858 -102551 -26260 71778 41144 -172727 -321826 -204313 99202 194179
10613 194179 -38640 -38176 -71728 -223176 -219405 -55274 12463 148225 84129 -75632 43034
10602 43034 -10295 -27632 53263 35999 -35278 -16067 -46566 -133936 -187714 -197290 -184806 -146816
10590 -146816 -2788 -54506 -68329 25092 72363 8663 -42176 141177 119067 49635 33032
10579 33032 40109 29692 102452 57800 44845 43934 44807 170936 152616 172455 110312 -2985
10567 -2985 -27580 36805 80820 99034 294640 291131 322854 500575 530380 520208 539725 556141
$$ packed form
10647a48928K8521M7796L7319l3391m2161l9707J9242j157l4714Q9400M8963j3783
10635d2600j33856J5231R5461J97845k8232j27895K5332J3278n3919O4808k7001
10624a548j59903m1407J00307P6291R8038l0634k13871j49099J17513L03515R4977
10613A94179k32819M64l3552j51448L771J64131O7737J35762o4096j59761J18666
10602D3034n3329j7337Q0895j7264p1277J9211l0499q7370n3778r576J2484L7990
10590a46816J44028n1718j3823R3421M7271o3700n0839J83353k2110o9432j6603
10579C3032P077j0417P2760m4652j2955r11Q73J26129j8320J9839o2143j13297
10567b985k4595O4385M4015J8214J95606l509L1723J77721K9805j0172J9517J6416
$$ plain form
10555 556141 734293 1147032 1569846 1901930 2111225 2238419 2288204 1936435 1307028 734318
10545 734318 458949 321504 168916 68845 120412 167399 134931 159463 143563 158022 162346
10534 162346 176744 129841 87209 -26630 82017 34727 107253 137370 169826 250124 240700
10523 240700 139637 216510 118751 113517 93389 -89389 -88591 82104 123771 154662 48073
10512 48073 -63330 -16047 41080 83712 72269 -24001 -72697 -101299 -30306 -24413 8994 44825
10500 44825 90537 -55215 -71773 -29665 1339 30461 36780 74037 124939 62337 18145 -23527
10488 -23527 1494 34855 125055 119627 80670 121054 104445 112377 100634 -1363 -185191 -112025
10476 -112025 12010 171514 101237 62442 80641 -60253 -148817 -180788 -28771 -53481 -62647
$$ packed form
10555E56141J78152M12739M22814L32084K09295J27194M9785l51769o29407n72710
10545G34318k75369j37445j52588j00071N1567M6987l2468K4532j5900J4459M324
10534A62346J4398m6903m2632j13839J08647m7290P2526L0117L2456Q0298r424
10523B40700j01063P6873r7759n234k0128j82778P98J70695M1667L0891j06589
10512D8073j11403M7283N7127M2632j1443r6270m8696k8602P0993N893L3407L5831
10500D4825M5712j45752j6558M2108L1004K9122O319L7257N0902o2602m4192m1672
10488b3527K5021L3361R0200n428l8957M0384j6609P932j1743j01997j83828P3166
10476a12025J24035J59504p0277l8795J8199j40894q8564l1971J52017k4710r166
$$ plain form
10465 -62647 -53075 -26617 74728 -6944 -181586 -186315 41854 89768 -15699 -138485 -114214
10454 -114214 96059 166757 206038 257562 262150 68036 -41888 37725 175974 158797 249650
10443 249650 181026 124632 47745 13252 50913 -3011 -153366 -214107 -154749 -87908 -165433
10432 -165433 -134780 -146692 -307638 -362272 -358847 -266853 -64627 96026 132178 157094 225719
10421 225719 108910 -11870 -489 -6887 -76633 -21122 105299 97053 -138683 -105424 67814
10410 67814 254969 106047 53237 8265 -53836 67873 35992 53449 -20140 -114286 -210976
10399 -210976 -65981 31160 38083 -69359 -64477 -86018 -105702 -92877 -112242 -201802 -201966 -88740
10387 -88740 -103026 -117537 -93696 -167781 -107968 -22628 71162 114053 -10919 -29809 87757
$$ packed form
10465f2647R572K6458J01345q1672j74642m729K28169M7914j05467j22786K4271
10454a14214K10273P0698L9281N1524M588j94114j09924P9613J38249j7177R0853
10443B49650o8624n6394p6887l4493L7661n3924j50355o0741N9358O6841p7525
10432a65433L0653j1912j60946n4634L425R1994K02226J60653L6152K4916O8625
10421B25719j16809j20780J1381o398o9746N5511J26421q246k35736L3259J73238
10410F7814J87155j48922n2810m4972o2101J21709l1881J7457p3589r4146r6690
10399b10976J44995R7141O923j07442M882k1541j9684J2825j9365q9560j64J13226
10387h8740j4286j4511K3841p4085N9813Q5340R3790M2891j24972j8890J17566
$$ plain form
10376 87757 13255 34119 -36175 -22661 -88909 -113555 -172211 -212432 -196384 -124239 -121171 -123327
10364 -123327 -224333 -179764 -219020 -240349 -197704 -150539 -77701 66724 50343 -13656 19741
10353 19741 56476 116984 175268 165916 127411 247320 313079 489575 882985 1103514 1055672
10342 1055672 1004795 894349 1015516 1133238 1019796 764229 555445 489606 463059 423743
10332 423743 375445 311056 254638 218266 295513 192734 98224 -120948 -166985 -42378 32517
10321 32517 -41899 -98830 -131992 -10605 129328 33584 -50936 -77219 -83157 -35119 -29373 -101963
10309 -101963 -159526 -216303 -269792 -106545 -39932 -101555 -35248 61947 15886 -45563 -40451
10298 -40451 -136358 -157915 -71042 -110719 31045 6911 -58604 -108641 -218521 -188168 -171822
$$ packed form
10376H7757p4502K0864p0294J3514o6248k4646n8656m0221J6048P2145L068k156
10364a23327j01006M4569l9256k1329M2645M7165P2838J44425j6381o3999L3397
10353A9741L6735O0508N8284r352l8505J19909O5759J76496L93410K20529m7842
10342A055672n0877j10446J21167J17722j13442k55567k08784o5839k6547l9316
10332D23743m8298o4389n6418l6372P7247j02779r4510k19172m6037J24607P4895
10321C2517p4416n6931l3162J21387J39933r5744q4520k6283n938M8038N746p2590
10309a01963n7563n6777n3489J63247O6613o1623O6307R7195m6061o1449N112
10298d0451r5907k1557Q6873l9677J41764k4134o5515n0037j09880L0353J6346
$$ plain form
10287 -171822 -151937 -59608 -16799 79390 159797 51421 -25481 84116 118606 151301 69351
10276 69351 26855 -68080 -118569 -143240 -145319 -129926 -12223 226091 348590 325912 238689
10265 238689 122104 61805 -16248 -28396 -64812 -56621 -26480 68450 47735 166992 174228
10254 174228 98484 -987 -47397 80824 250103 281520 196790 66422 -34355 -52715 -236958
10243 -236958 -78089 56750 146810 166650 190979 205454 62974 -24963 -143167 -200788 -201393
10232 -201393 -232523 -146495 -41729 45090 120933 52104 -36637 3958 82708 25208 93673
10221 93673 146168 153853 130393 189409 129417 53275 171540 219910 76845 35052 103246
10210 103246 24813 -42395 -26916 -54607 -41706 -137443 -155623 74872 38074 -116380 -200869
$$ packed form
10287a71822J9885R2329M2809R6189Q0407j08376p6902J09597L4490L2695q1950
10276F9351m2496r4935n0489k4671k079J5393J17703K38314J22499k2678q7223
10265B38689j16585o0299p8053j2148l6416Q191L0141R4930k0715J19257P236
10254A74228p5744r9471m6410J28221J69279L1417q4730j30368j00777j8360j84243
10243b36958J58869J34839R0060J9840K4329J4475j42480q7937j18204n7621o05
10232b01393l1130Q6028J04766Q6819P5843o8829q8741M0595P8750n7500O8465
10221I3673N2495P685k3460N9016n9992p6142J18265M8370j43065m1793O8194
10210A03246p8433o7208J5479k7691J2901r5737j8180K30495l6798j54454q4489
$$ plain form
10199 -200869 -82528 36514 133350 120509 62096 40711 120725 86647 -1718 113886 135918
10188 135918 20604 -176772 -116636 78851 96744 -8374 -68902 -45751 -127868 8907
10178 8907 189835 226345 170767 81399 1533 -88909 -31598 3675 17314 72988 31840 -77951
10166 -77951 -73124 73532 242542 186606 132491 4388 18901 118828 235291 152255 162888
10155 162888 114727 64601 -40184 -116020 -158975 -168307 -71186 121408 389831 311945 213369
10144 213369 192076 233700 105945 21691 -9501 -93479 -84002 -153162 -225504 -235921 -105672
10133 -105672 -101481 19395 -9495 -27880 90315 109633 -16459 -68712 -31523 -51838 -42229
10122 -42229 16713 2203 71381 117746 142501 116402 4634 -77796 -33433 18047 142625
$$ packed form
10199b00869J18341J19042R6836j2841n8413k1385Q0014l4078q8365J15604K2032
10188A35918j15314j97376O0136J95487J7893j05118o0528K3151q2117J36775
10178H907J80928L6510n5578q9368p9866r0442N7311L5273J3639N5674m1148j09791
10166g7951M827J46656J69010n5936n4115j28103J4513R9927J16463q3036J0633
10155A62888m8161n0126j04785p5836m2955r332R7121J92594K68423p7886r8576
10144B13369k1293M1624j27755q4254l1192q3978R477o9160p2342j0417J30249
10133a05672M191J20876k8890j8385J18195J9318j26092n2253L7189k0315R609
10122d2229N8942j4510O9178M6365K4755k6099j11768q2430M4363N1480J24578
$$ plain form
10111 142625 321084 352570 262168 82552 47593 119796 69951 18392 -1227 29194 -5773
10100 -5773 151552 170417 126788 127349 202930 240844 90211 143580 217944 264267 391224 368030
10088 368030 346675 289646 212521 115038 35526 -58265 42170 77295 89662 159859 223614
10077 223614 248003 333034 309369 321487 335972 310762 431044 631152 744968 697171 561889
10066 561889 769914 1041714 1338594 1658599 1950159 2197337 2667390 3427542 4543609
10057 4543609 6195791 8448834 10920179 13412428 15200728 16002395 14497266 9953415
10049 9953415 6148768 3916965 2832475 2321397 1809148 1455322 1481712 1323822 1177779
10040 1177779 1017790 987455 1075683 957600 920071 905820 979052 935077 789817 719678 681453
$$ packed form
10111A42625J78459L1486r0402j79616l4959P2203m9845n1559j9619L0421l4967
10100e773J57325J8865m3629N61P5581L7914j50633N3369P4364M6323J26957k3194
10088C68030k1355n7029p7125r7483p9512r3791J00435L5125J2367P0197O3755
10077B23614K4389Q5031k3665J2118J4485k5210J20282K00108J13816m7797j35282
10066E61889K08025K71800K96880L20005K91560K47178M70053P60152J116067
10057D543609J652182K253043K471345K492249J788300Q01667j505129m543851
10049I953415l804647k231803j084490n11078n12249l53826K6390j57890j46043
10040A177779j59989l0335Q8228j18083l7529j4251P3232m3975j45260p0139l8225
$$ plain form
10029 681453 717611 779130 760219 854693 853684 863047 834018 710709 624713 707053 695503 667259
10017 667259 566293 401893 298949 178498 179180 192000 352778 444912 411932 338935 447961
10006 447961 523249 443127 321786 147779 168666 228047 300582 163284 137055 202134 301456
9995 301456 311854 238700 140591 229135 377769 315508 214330 281699 269536 312288 319298
9984 319298 276672 267455 339264 271180 68106 63548 112277 200652 198841 62931 82297 147161
9972 147161 60604 73604 30241 89293 212716 172773 249254 260116 114543 155690 184296
9961 184296 208292 74427 31626 56956 92205 78032 2601 -3263 115402 144519 174572
9950 174572 215328 158783 201210 215386 188348 193967 119525 100967 170024 231666 169622 181653
$$ packed form
10029F81453L6158O1519j8911R4474j009R363k9029j23309q5996Q2340j1550k8244
10017F67259j00966j64400j02944j20451O82J2820J60778R2134l2980p2997J09026
10006D47961P5288q0122j21341j74007K0887N9381P2535j37298k6229O5079R9322
9995C01456J0398p3154r8109Q8544J48634o2261j01178O7369j2163M2752P010
9984C19298m2626r217P1809o8084k03074m558M8729Q8375j811j35910J9366O4864
9972A47161q6557J3000m3363N9052J23423l9943P6481J0862j45573M1147K8606
9961A84296K3996j33865m2801K5330L5249j4173p5431n864J18665K9117L0053
9950A74572M0756n6545M2427J4176k7038N619p4442j8558O9057O1642o2044J2031
$$ plain form
9938 181653 281476 290650 161006 -35847 40574 176859 126077 80062 220322 179364 89271
9927 89271 121011 187850 56806 -68081 27179 176724 216021 352396 430681 262690 4639
9916 4639 33686 130316 -27966 -84034 -66668 98872 208842 231626 238052 235484 327352 264961
9904 264961 157648 21017 -35608 51872 197311 445461 314845 191931 19883 -64752
9894 -64752 7848 10843 -161824 -188806 -103869 -83582 74705 121020 84913 -24508 31599
9883 31599 67648 177573 159553 48415 19662 162246 258825 163857 159689 199604 196793 83414
9871 83414 -34970 13292 163526 311407 439712 321294 262544 273224 287039 87871 47253
9860 47253 246062 333414 373397 363897 316471 335389 235188 312595 336160 354269 307668 172905
$$ packed form
9938A81653R9823R174j29644j96853P6421J36285n0782m6015J40260m0958r0093
9927H9271L1740O6839j31044j24887R5260J49545L9297J36375P8285j67991k58051
9916D639K9047R6630j58282n6068J7366J65540J09970K2784O426k568R1868o2391
9904B64961j07313j36631n6625Q7480J45439K48150j30616j22914j72048q4635
9894f4752P2600K995j72667k6982Q4937K0287J58287M6315l6107j09421N6107
9883C1599L6049J09925j8020j11138k8753J42584R6579r4968m168L9915k811j13379
9871H3414j18384M8262J50234J47881J28305j18418n8750J0680J3815j99168m0618
9860D7253J98809Q7352L9983r500m7426J8918j00201P7407K3565J8109m6601j34763
$$ plain form
9848 172905 337887 414721 356295 276559 237106 189969 144651 125326 134685 126819 162790 177477
9836 177477 58347 -75458 36787 235019 342641 269328 163947 95153 159100 203360
9826 203360 185378 121564 171789 275158 207963 150219 153557 98976 180473 182754 214910 374678
9814 374678 406879 328043 228439 134197 -75490 -72666 74667 247273 289944 227836 192661
9803 192661 86517 27206 73819 142351 52349 -37222 2056 182929 73977 -5429 -3029
9792 -3029 59665 10741 -42619 126332 181461 142212 52107 -90857 -35322 79961 121515
9781 121515 61238 92310 222997 131099 127168 277120 274796 227175 234896 329111 333954 297308
9769 297308 202803 112935 -62775 -171647 -244388 -188723 -162278 -174775 -75002 94413 277003
$$ packed form
9848A72905J64982P6834n8426p9736l9453m7137m5318j9325R359p866L5971J4687
9836A77477j19130j33805J12245J98232J07622p3313j05381o8794O3947M4260
9826B03360j7982o3814N0225J03369o7195n7744L338n4581Q1497K281L2156J59768
9814C74678L2201p8836r9604r4242k09687K824J47333J72606M2671o2108l5175
9803A92661j06144n9311M6613O8532r0002q9571L9278J80873j08952p9406K400
9792c029O2694m8924n3360J68951N5129l9249r0105j42964N5535J15283M1554
9781A21515o0277L1072J30687r1898l931J49952k324m7621P721R4215M843l6646
9769B97308r4505q9868j75710j08872p2741N5665K6445j2497R9773J69415J82590
$$ plain form
9758 277003 221231 118753 194661 243529 206044 167813 174474 178096 238816 104936 155955 91047
9746 91047 171855 256676 266548 167079 119721 178940 298030 270540 343646 430319 403053 386428
9734 386428 438679 393937 331300 405413 325989 179909 44106 -68489 -30045 9913 71810
9723 71810 135457 302580 222788 243493 340680 240813 147983 143742 163257 247330 209891 170792
9711 170792 373343 427525 304985 283087 234386 176359 51022 48060 103594 169131 139223
9700 139223 120845 21000 22260 148172 209432 214951 207821 217702 213528 195141 378042 428007
9688 428007 322889 412244 371020 291374 253389 302959 311684 123670 70167 262897 125123
9677 125123 -60593 80282 308638 436740 378832 338265 205347 235939 266875 183806 229317
$$ packed form
9758B77003n5772j02478P5908M8868l7485l8231O661L622O0720j33880N1019o4908
9746I1047Q0808Q4821R872r9469m7358N9219J19090k7490P3106Q6673k7266j6625
9734C86428N2251m4742o2637P4113p9424j46080j35803j12595L8444L9958O1897
9723G1810O3647J67123p9792K0705R7187r9867r2830m241J9515Q4073l7439l9099
9711A70792K02551N4182j22540k1898m8701n8027j25337k962N5534O5537k9908
9700A39223j8378r9845J260J25912O1260N519p130R881m174j8387J82901M9965
9688D28007j05118Q9355m1224p9646l7985M9570Q725j88014n3503J92730j37774
9677A25123j85716J40875K28356J28102n7908m0567j32918L0592L0936q3069M5511
$$ plain form
9666 229317 321646 401016 411692 402771 325128 435521 508803 409723 377016 493055 622801
9655 622801 538943 332520 251763 402474 377524 342849 394064 471799 629307 484855 207497
9644 207497 156217 207118 335739 516782 605400 515846 362433 308403 342775 460808 416865
9633 416865 575343 671819 657093 528694 340925 333558 461012 413460 296126 536775 618036
9622 618036 625631 656071 490119 625107 742449 619466 575831 520068 506971 445873 365519
9611 365519 399998 491637 485688 412787 511854 603008 647991 745801 699650 555065 578461 531473
9599 531473 508661 559491 524869 474488 558455 529297 515707 623798 724594 630002 578149
9588 578149 599636 546444 580837 603073 539760 476455 379810 425135 423540 360082 258776 330356
$$ packed form
9666B29317R2329P9370J0676q921p7643J10393P3282r9080l2707J16039J29746
9655F22801q3858k06423q0757J50711k4950l4675N1215P7735J57508j44452k77358
9644B07497n1280N0901J28621J81043Q8618q9554j53413n4030L4372J18033m3943
9633D16865J58478R6476j4726j28399j87769p367J27454m7552j17334K40649Q1261
9622F18036P595L0440j65952J34988J17342j22983m3635n5763j3097o1098q0354
9611C65519L4479R1639n949p2901R9067R1154M4983R7810m6151j44585K3396m6988
9599E31473k2812N0830l4622n0381Q3967k9158j3590J08091J00796r4592n1853
9588E78149K1487n3192L4393K2236o3313o3305r6645M5325j595o3458j01306P1580
$$ plain form
9576 330356 453541 524196 630603 512905 432605 523684 569571 689852 821404 792510 688295
9565 688295 631407 612470 659451 732221 737352 734877 609903 436997 418250 557377 708031
9554 708031 728975 701068 680140 685673 762327 777338 768233 764699 849470 741527 666984 776903
9542 776903 831523 738862 805492 837670 734358 605582 620681 632354 686402 699186 604648
9531 604648 672299 714169 613180 610175 651390 641333 736794 814071 760263 647357 693485
9520 693485 812620 932107 844057 798970 628753 664071 801929 744607 731794 697830 717931
9509 717931 771123 816787 763036 769406 884855 926297 828129 794149 962802 861516 736846
9498 736846 767019 950639 979271 925693 881300 971309 858734 863281 929556 846805 930122
$$ packed form
9576C30356J23185P0655J06407j17698q0300R1079M5887J20281J31552k8894j04215
9565F88295n6888j8937M6981P2770N131k475j24974j72906j8747J39127J50654
9554G08031K0944k7907k0928N533P6654J5011r105l534Q4771j07943p4543J09919
9542G76903N4620r2661O6630L2178j03312j28776J5099J1673N4048J2784r4538
9531F04648O7651M1870j00989l005M1215j0057R5461P7277n3808j12906M6128
9520F93485J19135J19487q8050m5087j70217L5318J37858n7322j2813l3964K0101
9509G17931N3192M5664n3751O370J15449M1442r8168l3980J68653j01286j24670
9498G36846L0173J83620K8632n3578m4393R0009j12575M547O6275q2751Q3317
$$ plain form
9487 930122 981331 932175 891069 868235 1013805 1127812 1015154 992907 983641 834960 738937
9476 738937 845167 851778 1086866 1244407 1124780 1013979 1148576 1206552 1143238 1048362 899498
9465 899498 909618 1048663 1006584 1075097 1164006 1188092 1341189 1342817 1211035 1227113 1265723
9454 1265723 1230094 1160832 1108040 1137000 1190398 1247773 1200488 1163351 1081162 1231128 1161368
9443 1161368 1108435 1308238 1495464 1402697 1323793 1427933 1444864 1377432 1272212 1360690 1336056
9432 1336056 1301297 1213620 1096161 1231225 1430886 1538474 1627331 1638654 1533249 1533276 1520286
9421 1520286 1584653 1624318 1804168 1813035 1756673 1622513 1528076 1504650 1649365 1677733 1649787
9410 1649787 1691359 1747198 1685865 1692687 1807174 1828518 1761721 1657053 1531028 1584859 1641455
$$ packed form
9487I30122N1209m9156m1106k2834J45570J14007j12658k2247r266j48681r6023
9476G38937J06230O611K35088J57541j19627j10801J34597N7976o3314r4876j48864
9465H99498J0120J39045m2079O8513Q8909K4086J53097J628j31782J6078L8610
9454A265723l5629o9262n2792K8960N3398N7375m7285l7137q2189J49966o9760
9443A161368n2933J99803J87226r2767p8904J04140J6931o7432j05220Q8478k4634
9432A336056l4759q7677j17459J35064J99661J07588Q8857J1323j05405K7j2990
9421A520286O4367L9665J79850Q867n6362j34160r4437k3426J44715K8368k7946
9410A649787M1572N5839o1333O822J14487K1344o6797j04668j26025N3831N6596
$$ plain form
9399 1641455 1827121 1958016 1987756 2006627 1974172 1915442 1865088 1746591 1845062 1954536 1975066
9388 1975066 2068235 2110274 2218950 2149313 2053524 2034857 2142547 2250781 2291012 2296061 2284418
9377 2284418 2240722 2333897 2145454 2087374 2089209 2124473 2245004 2232880 2179863 2403300 2515893
9366 2515893 2434330 2428543 2465168 2470194 2568093 2564479 2394494 2286049 2434735 2470676 2476719 2368201
9354 2368201 2349340 2418304 2522002 2535986 2474106 2480582 2519056 2545818 2516173 2475850 2499502
9343 2499502 2674973 2820917 2833804 2803557 2738470 2666842 2554468 2653047 2835983 2912252 2949186
9332 2949186 2927134 2976978 3068916 2985741 2921641 2899255 2967470 3087476 2941455 2774836 2891930
9321 2891930 3038383 3027168 2871367 2861158 2854755 3012397 3016914 3016690 3034581 2903758 2835834
$$ packed form
9399A641455J85666J30895K9740J8871l2455n8730n0354j18497R8471J09474K0530
9388A975066R3169M2039J08676o9637r5789j8667J07690J08234M0231N049j1643
9377B284418m3696R3175j88443n8080J835L5264J20531j2124n3017K23437J12593
9366B515893q1563n787L6625N026R7899l614j69985j08445J48686L5941O043j08518
9354B368201j8861O8964J03698J3984o1880O476L8474K6762k9645m0323K3652
9343B499502J75471J45944J2887l0247o5087p1628j12374R8579J82936P6269L6934
9332B949186k2052M9844R1938q3175o4100k2386O8215J20006j46021j66619J17094
9321B891930J46453j1215j55801j0209o403J57642M517k24J7891j30823o7924
$$ plain form
9310 2835834 2773359 2911935 2978087 2947551 2962331 2831108 2623614 2525147 2476635 2524797 2683221
9299 2683221 2876754 2946023 2854296 2869215 2835250 2889862 2966601 2888170 2965767 3101686 3140347
9288 3140347 2977197 2851333 2778513 2813741 2966410 3000963 2913514 2938493 2914597 2918545 2864943
9277 2864943 2807711 2709958 2701627 2642712 2611871 2614773 2563206 2545041 2532682 2441751 2443761 2529361
9265 2529361 2560874 2691340 2643784 2645079 2696405 2671969 2670232 2735212 2652675 2671144 2621386 2455128
9253 2455128 2361804 2497474 2600146 2450093 2356136 2403621 2394958 2234929 2176670 2185736 2123487
9242 2123487 1990470 2113078 2127481 2101141 2208152 2329469 2328238 2096444 1986100 2122886
9232 2122886 2093681 1976305 1857981 1851260 1985680 2052269 2137280 2105675 2164636 2262476 2374400
$$ packed form
9310B835834o2475J38576O6152l0536J4780j31223k07494r8467m8512M8162J58424
9299B683221J93533O9269r1727J4919l3965N4612P6739p8431P7597J35919L8661
9288C140347j63150j25864p2820L5228J52669L4553q7449K4979k3896L948n3602
9277B864943n7232r7753q331n8915l0841K902n1567j8165j2359r0931K010Q5600
9265B529361L1513J30466m7556J295N1326k4436j737O4980q2537J8469m9758j66258
9253B455128r3324J35670J02672j50053r3957M7485q663j60029n8259R066o2249
9242B123487j33017J22608J4403k6340J07011J21317j231k31794j10344J36786
9232B122886k9205j17376j18324o721J34420O6589Q5011l1605N8961R7840J11924
$$ plain form
9221 2374400 2445040 2482887 2429022 2351420 2230753 2166808 1956504 1921600 1958530 1881336 1931965
9210 1931965 2002575 1958119 1811446 1847537 1891352 1966846 2012291 1948371 1879146 1937043 1886875
9199 1886875 1703097 1793248 1923729 1891157 1839966 1820564 1690302 1590352 1528468 1510742 1446353
9188 1446353 1523809 1590735 1676672 1669144 1697189 1731227 1669606 1624910 1530858 1619152 1632542 1462767
9176 1462767 1492231 1491770 1484046 1469031 1491719 1584259 1450175 1408418 1419704 1550618 1451495 1399648
9164 1399648 1408881 1300997 1351095 1300604 1242702 1333966 1394087 1406283 1407447 1400564 1362206 1283545
9152 1283545 1245588 1243501 1277289 1242591 1292393 1303537 1225233 1181664 1115152 1134677 1123347 1068542
9140 1068542 1165186 1238439 1297710 1269971 1089130 922908 995258 1182621 1199681 1092464 1069502
$$ packed form
9221B374400P0640L7847n3865p7602j20667o3945k10304l4904L6930p7194N0629
9210A931965P0610m4456j46673L6091M3815P5494M5445o3920o9225N7897n0168
9199A886875j83778R0151J30481l2572n1191j9402j30262r9950o1884j7726o4389
9188A446353P7456O6926Q5937p528K8045L4038o1621m4696r4052Q8294J3390j69775
9176A462767K9464m61p724j5015K2688R2540j34084m1757J1286J30914r9123n1847
9164A399648R233j07884N0098n0491n7902R1264O0121J2196J164o883l8358p8661
9152A283545l7957k087L3788l4698M9802J1144p8304m3569o6512J9525j1330n4805
9140A068542R6644P3253N9271k7739j80841j66222P2350J87363J7060j07217k2962
$$ plain form
9129 1069502 1086835 975595 895623 891114 838294 822088 889912 992873 995823 1012885 1035177
9118 1035177 1002406 921999 892230 879938 793021 841744 859291 916867 935457 924462 869436
9107 869436 855949 778318 686230 766546 835670 809897 711338 525378 543206 730713 820881
9096 820881 844999 691051 671054 751008 776525 795992 925176 1092997 1093707 1007973 973195
9085 973195 900411 597627 505643 691470 811691 779575 709947 710899 759337 751779 672105 592887
9073 592887 608732 528867 580704 582710 584475 675435 776236 810485 764547 634536 618844 567806
9061 567806 532894 579467 668505 673461 638685 702344 732776 593047 471092 419954 411425 385251
9049 385251 354862 380322 446676 508515 508108 374953 433426 397216 496082 578078 615127 555756
$$ packed form
9129A069502J7333j11240p9972m509n2820j6206O7824J02961K950J7062K2292
9118A035177l2771q0407k9769j2292q6917M8723J7547N7576J8590j0995n5026
9107H69436j3487p7631r2088Q0316O9124k5773r8559j85960J7828J87507R0168
9096H20881K4118j53948j9997P9954K5517J9467J29184J67821P10q5734l4778
9085I73195p2784l02784r1984J85827J20221l2116o9628R52M8438p558p9674p9218
9073E92887J5845p9865N1837K006J765R0960J00801L4249m5938j30011j5692n1038
9061E67806l4912M6573Q9038M956l4776O3659L0432j39729j21955n1138q529k6174
9049C85251l0389K5460O6354O1839m07j33155N8473l6210R8866Q1996L7049n9371
$$ plain form
9037 555756 400128 516890 550830 564943 655490 651069 593955 683693 680864 717800 689041 706690
9025 706690 631323 579217 679904 684441 542683 449179 492951 463807 421275 371319 372641 301917
9013 301917 354621 388815 499872 547571 536653 575923 425817 344689 379316 331352 349751
9002 349751 554389 521224 493495 387643 420153 412702 423872 330950 352279 419575 384506
8991 384506 507671 550622 474917 471798 528296 675905 626008 436784 366642 338299 386843
8980 386843 295540 220223 367554 489861 400635 389560 419975 566837 510772 308853 160433
8969 160433 86024 139597 344168 264227 240298 363794 438001 409977 328548 212275 309741
8958 309741 413608 447774 488004 526029 443516 355480 397811 288383 180559 238611 283356
$$ packed form
9037E55756j55628J16762L3940J4113R0547m421n7114Q9738k829L6936k8759J7649
9025G06690p5367n2106J00687M537j41758r3504M3772k9144m2532m9956J322p0724
9013C01917N2704L4194J11057M7699j0918L9270j50106q1128L4627m7964J8399
9002C49751K04638l3165k7729j05852L2510p451J1170r2922K1329O7296l5069
8991C84506J23165M2951p5705l119N6498J47609m9897j89224p0142k8343M8544
8980C86843r1303p5317J47331J22307q9226j1075L0415J46862n6065k01919j48420
8969A60433p4409N3573K04571p9941k3929J23496P4207k8024q1429j16273R7466
8958C09741J03867L4166M0230L8025q2513q8036M2331j09428j07824N8052M4745
$$ plain form
8947 283356 186793 78204 163853 254892 352907 170031 137490 224552 300384 329314 261290
8936 261290 284475 284971 384912 392871 270353 129440 209019 237889 182836 171138 132494 14610
8924 14610 -7059 1710 185922 278313 312683 405653 327392 147042 71509 144395 145986 109177
8912 109177 104715 73871 107734 3980 36187 90267 105731 104556 152710 248149 287444 152592
8900 152592 219693 267648 311587 199390 206757 309557 317090 257002 221883 238234 236804 279226
8888 279226 224951 75771 5279 41080 203023 392741 463590 446525 416620 447865 429047
8877 429047 357548 349339 295619 267343 322078 254649 230339 398574 519655 444033 386233
8866 386233 406093 388618 202676 156908 257235 250455 235220 318054 496364 552010 493702
$$ packed form
8947B83356r6563j08589Q5649R1039R8015j82876l2541Q7062P5832K8930o8024
8936B61290K3185M96R9941P959j22518j40913P9579K8870n5053j1698l8644j17884
8924A4610k1669Q769J84212R2391L4370R2970p8261j80350p5533P2886J591l6809
8912A09177m462l0844L3863j03754L2207N4080J5464j175M8154R5439L9295j34852
8900A52592O7101M7955M3939j12197P367J02800P533o0088l5119J6351j430M2422
8888B79226n4275j49180p0492L5801J61943J89718P0849j7065k9905L1245j8818
8877D29047p1499q209n3720k8276N4735o7429k4310J68235J21081p5622n7800
8866C86233J9860j7475j85942m5768J00327o780j5235Q2834J78310N5646n8308
$$ plain form
8855 493702 325517 122577 49052 98029 90365 -31152 32699 108110 120156 77967 134184
8844 134184 293457 311970 306234 318438 239279 178671 116302 -132396 -55730 29872 150720
8833 150720 179978 140462 119300 62185 162371 340471 313948 275691 200319 88465 117871
8822 117871 219049 274390 218397 219076 130730 22562 70944 75233 91965 46662 -1284 -26058
8810 -26058 -22650 -14693 118684 305911 341774 267436 187551 168891 100129 70360 99690 154730
8798 154730 252765 104979 31267 46620 102627 99022 89407 -32412 93987 310308 215420
8787 215420 116429 154837 201330 314070 267388 278558 339781 236388 31115 -104842 -10396
8776 -10396 95811 19068 13601 115767 137428 227413 114805 200347 213316 151847 24065
$$ packed form
8855D93702j68185k02940p3525M8977p664j21517O3851P5411J2046m2189N6217
8844A34184J59273J8513n736J2204p9159o0608o2369k48698P6666Q5602J20848
8833A50720K9258l9516k1162n7115J00186J78100k6523l8257p5372j11854K9406
8822A17871J01178N5341n5993O79q8346j08168M8382M289J6732m5303m7946k4774
8810b6058L408P957J33377J87227L5863p4338p9885j8660o8762k9769K9330N5040
8798A54730R8035j47786p3712J5353N6007l605r615j21819J26399K16321r4888
8787B15420r8991L8408M6493J12740m6682J1170O1223j03393k05273j35957R4446
8776a0396J06207p6743n467J02166K1661Q9985j12608Q5542J2969o1469j27782
$$ plain form
8765 24065 -73811 -128519 -73725 -79662 -109598 10049 131110 167965 175685 72203 -369 18110
8753 18110 91685 146804 168081 282654 252612 194573 138844 110803 -48383 32487 99474
8742 99474 -78974 -143645 2138 81447 129281 313994 322868 195587 101875 140850 133314
8731 133314 209071 283427 175382 130461 232127 324535 124659 115418 165402 232244 262455
8720 262455 170102 252074 271962 281293 191960 153616 173257 223571 165498 177862 239044 183344
8708 183344 114403 159879 243175 185756 169397 62532 -37293 -104213 -64483 -20450 221
8697 221 49526 152712 135499 201707 325247 197767 92593 1368 28991 54453 93034
8686 93034 48262 33192 33677 -64626 26147 41648 125310 74202 91196 52291 143528 88428
$$ packed form
8765B4065r7876n4708N4794n937k9936J19647J21061L6855P720j03482p2572J8479
8753A8110P3575N5119K1277J14573l0042n8039n5729k8041j59186Q0870O6987
8742I9474j78448o4671J45783P9309M7834J84713Q874j27281r3712L8975p536
8731A33314P5757P4356j08045m4921J01666R2408j99876r241M9984O6842L0211
8720B62455r2353Q1972J9888R331q9333l8344J9641N0314n8073J2364O1182n5700
8708A83344o8941M5476Q3296n7419j6359j06865r9825o6920L9730M4033K0671
8697B21M9305J03186j7213O6208J23540j27480j05174r1225K7623K5462L8581
8686I3034m4772j5070M85r8303R0773J5501Q3662n1108J6994l8905R1237n5100
$$ plain form
8674 88428 4191 38611 10493 44561 1907 -4217 24111 150258 136685 64808 90831 39849
8662 39849 119140 140504 57659 29632 56570 110096 6652 -96888 -103417 -72180 -100702 -123661
8650 -123661 20731 188199 105402 38867 -9462 -114848 -93114 -172022 -214542 -149444 -73048
8639 -73048 22803 4269 54113 17665 92401 227597 197513 158625 205006 317427 289271
8628 289271 264320 325950 383340 364929 374604 331437 304801 211380 136297 202236 206445 210375
8616 210375 281135 218982 145622 190322 340185 292832 275980 236789 194600 172037 158079
8605 158079 240445 248681 151169 197881 329264 364836 409507 326063 421946 510928 449040 368812
8593 368812 300169 367590 322307 325018 247983 65372 -22402 -49010 1724 76806 221988
$$ packed form
8674H8428q4237L4420k8118L4068m2654o124K8328J26147j3573p1877K6023n0982
8662C9849P9291K1364q2845k8027K6938N3526j03444j03540o529L1237k8522k2959
8650a23661J44392J67468q2797o6535m8329j05386K1734p8908m2520O5098P6396
8639g3048R5851j8534M9844l6448P4736J35196l0084l8888M6381J12421k8156
8628B89271k4951O1630N7390j8411R675m3167k6636r3421p5083O5939M209L930
8616B10375P0760o2153p3360M4700J49863m7353j6852l9191m2189k2563j3958
8605A58079Q2366Q236r7512M6712J31383L5572M4671q3444R5883Q8982o1888q0228
8593C68812o8643O7421m5283K711p7035j82611q7774k6608N0734P5082J45182
$$ plain form
8582 221988 193188 136565 71725 34227 104317 212759 102442 70102 -5992 37789 24427
8571 24427 -6572 72011 50158 -18609 -140123 -261420 -200452 -236930 -148187 -100103 -6942
8560 -6942 45873 3038 53622 56566 6205 30191 -30408 30601 130771 198242 181270 90249
8548 90249 154029 185214 210914 203195 141299 28262 79431 158903 144153 174544 39737 -29614
8536 -29614 -77049 13597 125683 79880 7460 -72615 -28526 -59772 -71424 -27269 -23129 91062
8524 91062 185663 171920 181018 167525 95909 143938 170314 252012 229019 206571 62791 91729
8512 91729 184739 198324 -57125 -28335 -37732 -52745 -24677 -165920 -228209 -204692 -85183
8501 -85183 19227 50218 -83148 -203391 -242101 -128767 31516 82404 113138 155621 66977
$$ packed form
8582B21988k8800n6623o4840l7498P0090J08442j10317l2340p6094M3781j3362
8571B4427l0999P8583k1853o8767j21514j21297O0968l6478Q8743M8084R3161
8560f942N2815m2835N0584K944n0361K3986o0599O1009J00170O7471j6972r1021
8548I0249O3780L1185K5700p719o1896j13037N1169P9472j4750L0391j34807o9351
8536b9614m7435R0646J12086m5803p2420q0075M4089l1246j1652M4155M140J14191
8524I1062R4601j3743R098j3493p1616M8029K6376Q1698k2993k2448j43780K8938
8512I1729R3010J3585k55449K8790r397j5013K8068j41243o2289K3517J19509
8501h5183J04410L0991j33366j20243l8710J13334J60283N0888L0734M2483q8644
$$ plain form
8490 66977 -50205 -50185 -75595 -125011 -173918 -5811 87011 16157 46181 154714 152419 193457
8478 193457 219290 35903 25693 49922 99069 118376 67252 134078 235906 253053 219986
8467 219986 50613 -138193 -69096 -63027 38574 42274 -15044 -75556 -387 103458 -974
8456 -974 -146817 -164541 -196884 -209339 -181817 -155422 -75121 -53522 -81444 -124580 -4168 93197
8444 93197 -32500 -260690 -191125 -125233 81655 160268 101124 125102 156108 188389 209170
8433 209170 237777 145396 -67767 -120017 -73049 127769 203508 220077 163119 142881 153925
8422 153925 167123 96326 8803 -48271 -48425 -54543 74940 121977 13920 59320 165170 193725
8410 193725 71135 50220 179600 281193 121796 8712 -146574 -191924 -104495 -17820
$$ packed form
8490F6977j17182K0k5410m9416m8907J68107R2822p0854L0024J08533k295M1038
8478A93457K5833j83387j0210K4229M9147J9307n1124O6826J01828J7147l3067
8467B19986j69373j88806O9097O069J01601L700n7318o0512P5169J03845j04432
8456i74j45843j7724l2343j2455K7522K6395Q0301K1599k7922m3136J20412R7365
8444I3197j25697k28190O9565O5892K06888P8613n9144K3978L1006L2281K0781
8433B09170K8607r2381k13163n2250M6968K00818P5739J6569n6958k0238J1044
8422A53925J3198p0797q7523n7074j54o118J29483M7037j08057M5400J05850K8555
8410A93725j22590k0915J29380J01593j59397j13084j55286m5350Q7429Q6675
$$ plain form
8400 -17820 52028 -106755 -223493 -40505 -10218 -44198 22203 7955 -53739 91811 140494
8389 140494 18380 -59861 -80921 -119790 -69115 -126471 -194764 -195958 -147865 -76864 -53824 21632
8377 21632 51976 23182 -63692 -108207 -125862 -250808 -279193 -241630 -255383 -217612 -322439
8366 -322439 -268012 27479 -11905 -40670 -64581 -123288 4480 73796 -37885 -108959 -161091
8355 -161091 -108546 80807 191073 99583 -49100 -57365 -5249 -67505 -84192 -17552 47830
8344 47830 135862 224234 99734 -74841 -77735 -10890 9587 64105 11755 -70309 -122075 68643
8332 68643 148755 162138 37028 -36663 -76376 -49151 8581 -57734 -211161 -203222 -173709 -224570
8320 -224570 -191263 -102072 -36844 105734 74036 71574 65102 -16414 -118110 -155005 -128391 -69313
$$ packed form
8400a7820O9848j58783j16738J82988L0287l3980O6401j4248o1694J45550M8683
8389A40494j22114p8241k1060l8869N0675n7356o8293j194M8093P1001K3040P5456
8377B1632L0344k8794q6874m4515j7655j24946k8385L7563j3753L7771j04827
8366c22439N4427K95491l9384k8765k3911n8707J27768O9316j11681p1074n2132
8355a61091N2545J89353J10266r1490j48683q265N2116o2256j6687O6640O5382
8344D7830Q8032Q8372j24500j74575k894O6845K0477N4518n2350q2064n1766J90718
8332F8643Q0112J3383j25110p3691l9713K7225N7732o6315j53427P939K9513n0861
8320b24570L3307Q9191O5228J42578l1698k462o472q1516j01696l6895K6614N9078
$$ plain form
8308 -69313 -29628 31580 36346 15475 -3377 -31832 -130762 -122927 -85236 -36049 -138251 -144074
8296 -144074 -44329 60881 20377 36568 77897 56947 96586 95866 72352 114092 117719 47621
8284 47621 -9671 -104085 -156553 -144521 -14472 163960 79205 109444 110834 -56155 -161106
8273 -161106 -97826 -69718 -34670 -146225 -156412 -44273 -98749 -171006 -47353 115904 198560
8262 198560 234524 99484 80481 -31813 -88581 8330 60153 -38077 -114187 -33759 24653
8251 24653 105198 42659 -92664 -79349 70447 94361 85596 -20532 -7208 16214 72152
8240 72152 114945 147817 220450 175617 193767 186230 83944 81133 137571 71168 -123085 -195074
8228 -195074 -211049 -123270 -75667 -86232 -23625 38523 60888 11761 38854 38760 86059 -40406
$$ packed form
8308f9313L9685O1208M766k0871j8852k8455r8930P835L7691M9187j02202n823
8296a44074R9745J05210m0504J6191M1329k0950L9639p20k3514M1740L627p0098
8284D7621n7292r4414n2468J2032J30049J78432q4755L0239J390j66989j04951
8273a61106O3280K8108L5048j11555j0187J12139n4476p2257J23653J63257Q2656
8262A98560L5964j35040j9003j12294n6768R6911N1823r8230p6110Q0428N8412
8251B4653Q0545o2539j35323J3315J49796K3914q765j06128J3324K3422N5938
8240G2152M2793L2872P2633m4833J8150p537j02286k811N6438o6403j94253p1989
8228a95074j5975Q7779M7603j0565O2607O2148K2365m9127K7093r4M7299j26465
$$ plain form
8216 -40406 -175558 -74703 -96972 -187437 -104729 -81273 -154925 -168240 -232675 -186008 -99313
8205 -99313 -64429 -27369 -64361 -57014 -80889 -118275 -72518 15304 43432 -67932 -99652 -123352
8193 -123352 -29787 63994 58290 -130060 -264128 -170670 -132748 -131511 26244 110628 15135
8182 15135 -148311 -140147 -97553 -131387 -7760 106195 104023 113599 124700 125545 103122 64005
8170 64005 -59879 -74578 -78995 -8634 -138691 -104177 129 140607 188372 236619 174701
8159 174701 216828 267743 247398 107046 42495 72364 54034 131044 147479 138803 146092 78757
8147 78757 -9579 150443 222798 161837 125885 73972 78252 45952 1857 -87412 -229367 -232892
8135 -232892 -173873 -147602 -160589 -271242 -358578 -302422 -197134 -153095 -166311 -6270 152897
$$ packed form
8216d0406j35152J00855k2269r0465Q2708K3456p3652j3315o4435M6667Q6695
8205i9313L4884L7060l6992P347k3875l7386M5757Q7822K8128j11364l1720k3700
8193a23352R3565R3781n704j88350j34068R3458L7922J237J57755Q4384r5493
8182A5135j63446Q164M2594l3834J23627J13955k172R576J1101Q45k2423l9117
8170F4005j23884j4699m417P0361j30057L4514J04306J40478M7765M8247o1918
8159A74701M2127N0915k0345j40352o4551K9869j8330P7010J6435q676P289o7335
8147G8757q8336J60022P2355o0961l5952n1913M280l2300m4095q9269j41955l525
8135b32892N9019K6271j2987j10653q7336N6156J05288M4039j3216J60041J59167
$$ plain form
8124 152897 195504 111849 26559 35916 28148 105733 110909 50050 -63371 5197 133411 27154
8112 27154 32148 -20381 11122 115836 85045 113902 242405 311243 250889 180744 73230
8101 73230 -18934 22509 68420 94281 96442 -84648 -239058 -262662 -125281 26783 179497
8090 179497 236406 105279 10972 14348 107352 128901 85879 48463 139554 154165 199966 213607
8078 213607 184944 189547 126222 72030 146089 252806 282368 181918 50131 72518 66222
8067 66222 116994 163252 153261 187885 137152 99720 19191 -33388 -54647 123882 55582 -99789
8055 -99789 -4514 192672 229071 132049 53246 48251 42808 85438 121992 156404 149286 52776
8043 52776 -3963 -11672 -75434 3872 52972 170967 166439 38618 -10351 33422 65486 172426
$$ packed form
8124A52897M2607q3655q5290R357p768P7585N176o0859j13421O8568J28214j06257
8112B7154M994n2529L1503J04714l0791K8857J28503O8838o0354p0145j07514
8101G3230r2164M1443M5911K5861K161j81090j54410k3604J37381J52064J52714
8090A79497N6909j31127r4307L376R3004K1549m3022l7416R1091J4611M5801J3641
8078B13607k8663M603o3325n4192P4059J06717K9562j00450j31787K2387o296
8067F6222N0772M6258r991L4624n0733l7432q0529n2579k1259J78529o8300j55371
8055i9789R5275J97186L6399r7022p8803m995n443M2630L6554L4412p118r6510
8043E2776n6739p709o3762P9306M9100J17995m528j27821m8969M3773L2064J06940
$$ plain form
8031 172426 289581 111795 -10564 -86236 -132481 -102175 -7752 35431 7342 142 32147
8020 32147 28718 -54574 -159669 -261192 -156379 -67142 -107789 -167944 -133746 -138640 -171436 62739
8008 62739 115717 119507 193551 159361 17649 54381 193335 251122 247096 145991 121705 30665
7996 30665 -26174 -11412 7288 -5721 -74893 -78362 -15673 23899 -12271 90225 19775 -71377
7984 -71377 60673 143320 117533 62739 -36900 92801 100537 74733 172885 116198 36087 -68737
7972 -68737 -41448 -47448 -23310 62004 91990 174019 -103464 -60614 -48081 23552 41068 119922
7960 119922 194637 194709 133010 49059 53938 159774 191222 118478 -30593 110744 320693 248013
7948 248013 149058 138572 157361 144993 80133 -59557 -64401 -44065 71982 132688 82008
$$ packed form
8031A72426J17155j77786j22359p5672m6245L0306R4423M3183k8089p200L2005
8020C2147l429q3292j05095j01523J04813Q9237m0647o0155L4198m894l2796K34175
8008F2739N2978L790P4044l4190j41712L6732J38954N7787m026j01105k4286r1040
7996C0665n6839J4762J8700j3009o9172l469O2689L9572l6170J02496p0450r1152
7984g1377J32050Q2647k5787n4794r9639J29701P736k5804R8152n6687q0111j04824
7972f8737K7289o000K4138Q5314K9986Q2029k77483M2850J2533P1633J7516P8854
7960A19922P4715P2o1699q3951M879J05836L1448p2744j49071J41337K09949p2680
7948B48013r8955j0486J8789j2368o4860j39690m844K0336J16047O0706n0680
$$ plain form
7937 82008 6450 -6511 66609 103876 -5029 -52844 51354 137279 348 -78601 -127713
7926 -127713 -175920 -62133 -60349 -155388 27839 180640 146465 78616 135498 95284 102394
7915 102394 132191 82111 -32615 -100545 -34865 55144 148911 102261 83826 128656 91845
7904 91845 13621 58962 122288 98333 182880 81351 -75816 -40114 54574 52309 153390
7893 153390 290399 361592 348726 186720 158626 68924 4907 106580 162715 187506 230940
7882 230940 145599 -36510 -5344 4583 16762 34420 69341 142912 137788 48104 -33655 -196288
7870 -196288 -298128 -221793 -98283 74192 -18350 -90865 -198526 -197022 -121320 -110630 -122356
7859 -122356 -87207 -19721 16816 -28008 -131480 -172508 -74953 -64417 -86133 -133885 -21861
$$ packed form
7937H2008p5558j2961P3120L7267j08905m7815J04198Q5925j36931p8949m9112
7926a27713m8207J13787J784r5039J83227J52801l4175o7849N6882m0214P110
7915A02394K9797n0080j14726o7930O5680R0009R3767m6650j8435M4830l6811
7904I1845p8224M5341O3326k3955Q4547j01529j57167L5702R4688k265J01081
7893A53390J37009P1193j2866j62006k8094q9702o4017J01673N6135K4791M3434
7882B30940q5341j82109L1166R927J2179J7658L4921P3571n124q9684q1759j62633
7870a96288j01840P6335J23510J72475r2542p2515j07661J504P5702J0690j1726
7859a22356L5149O7486L6537m4824j03472m1028R7555J0536k1716m7752J12024
$$ plain form
7848 -21861 99686 69164 29373 44191 53918 -16403 -36202 -97425 -142685 -91526 -15226 -1021
7836 -1021 17650 -100232 -143197 -213107 -228570 -119826 -27217 34565 34492 -11601 18254 -31255
7824 -31255 -101846 22798 50254 3349 43049 63932 -84894 -72318 -71057 -85258 -90511 -138366
7812 -138366 -145116 -21859 -43944 -205806 -111008 -125370 -195179 -154329 -69807 -74191 -31511 1649
7800 1649 150005 233758 168070 73883 -38018 -111938 -165501 -12989 -12699 -160296 -155092 -104936
7788 -104936 -40296 -5778 2191 -94164 -69312 -51910 -155543 -132713 -38595 -94956 45638
7777 45638 143869 202201 98722 38701 183049 180962 -30807 -67408 -115911 -80484 -131487
7766 -131487 -171371 -246486 -268587 -237278 -73312 71274 -35698 -31108 -39707 -20392 -94247
$$ packed form
7848b1861J21547l0522l9791J4818R727p0321j9799o1223m5260N1159P6300J4205
7836a021J8671j17882m2965o9910j5463J08744R2609O1782p3m6093K9855m9509
7824c1255p0591J24644K7456m6905L9700K0883j48826J2576J261j4201n253m7855
7812a38366o750J23257k2085j61862R4798j4362o9809M0850Q4522m384M2680L3160
7800A649J48356Q3753o5688r4187j11901p3920n3563J52512K90j47597N204N0156
7788a04936O4640L4518P969r6355K4852J7402j03633K2830R4118n6361J40594
7777D5638R8231N8332j03479o0021J44348k087k11769l6601m8503L5427n1003
7766a31487l9884p5115k2101L1309J63966J44586j06972M590q599J9315p3855
$$ plain form
7755 -94247 -141371 -186108 -202069 -66037 62090 116198 161821 117609 51848 -111131 -161135
7744 -161135 -94043 -68511 -54430 -31563 -29983 -21715 30686 -9424 -43388 32477 30080 87413
7732 87413 41577 -15655 4000 -22023 -37851 -110949 -107063 -281355 -364667 -282869 -284808 -260461
7720 -260461 -107174 -104700 -113606 -150814 -138940 -91708 55316 -316 -73808 -66314 -129046 -128064
7708 -128064 -106893 -87657 73140 103581 80349 36306 36202 -85202 -105481 21528 -64591
7697 -64591 -161861 -81457 -12089 50047 31055 139669 257482 257150 168772 140498 29286 -81442
7685 -81442 -169524 -286613 -278362 -178591 -104695 -7599 86517 53442 98078 56781 57449 6784
7673 6784 -17959 1629 59024 28587 -9464 27088 -20783 -15044 -9481 -34107 -67018 -49711
$$ packed form
7755i4247m7124m4737j5961J36032J28127N4108M5623m4212o5761j62979n0004
7744a61135O7092K5532J4081K2867J580Q268N2401m0110l3964P5865k397N7333
7732H7413m5836n7232J9655k6023j5828p3098L886j74292q3312Q1798j939K4347
7720b60461J53287K474q906l7208J1874M7232J47024n5632p3492P494o2732R82
7708a28064K1171J9236J60797L0441k3232m4043j04j21404k0279J27009q6119
7697f4591r7270Q0404O9368O2136j8992J08614J17813l32q8378k8274j11212j10728
7685h1442q8082j17089Q251R9771P3896R7096R4116l3075M4636m1297O68n0665
7673F784k4743J9588N7395l0437l8051L6552m7871N739N563k4626l2911J7307
$$ plain form
7661 -49711 -39772 -142398 -40353 -53396 -43268 -64959 -96906 -55250 -58445 -186665 -166343 -134984
7649 -134984 59450 236134 109371 -8051 98015 93331 80498 22438 -158237 -82696 -78464
7638 -78464 -180838 -247525 -296210 -252260 -198216 -137475 -103522 23925 93144 190456 266148
7627 266148 262648 100906 17489 -45740 -108815 -106445 -74214 -84221 -28124 -4074 118442 73043
7615 73043 104885 169741 34649 81537 133074 58631 3827 -79625 -91463 -116240 -172219 -108907
7603 -108907 -115643 -251707 -274954 -51764 41595 11935 -53787 -131935 -227640 -311136 -180865
7592 -180865 -120631 -77838 -64174 -166787 -155646 -66938 47739 156017 221784 92847 43183
7581 43183 -29876 -72231 -67277 -45602 -50720 -64898 -139400 -148006 69692 149205 -4795 -92615
$$ packed form
7661d9711R939j02626J02045j3043J0128k1691l1947M1656l195j28220K0322L1359
7649a34984J94434J76684j26763j17422J06066m684j2833n8060j80675P5541M232
7638g8464j02374o6687m8685M3950N4044O0741L3953J27447O9219R7312P5692
7627B66148l500j61742q3417o3229o3075K370L2231j0007N6097K4050J22516m5399
7615G3043L1842O4856j35092M6888N1537p4443n4804q3452j1838k4777n5979O3312
7603a08907o736j36064k3247K23190R3359k9660o5722p8148r5705q3496J30271
7592a80865O0234M2793J3664j02613J1141Q8708J14677J08278O5767j28937m9664
7581D3183p3059m2355M954K1675n118j4178p4502q606K17698P9513j54000q7820
$$ plain form
7569 -92615 -60014 -80975 -22809 39086 -77761 -70633 39598 97895 75169 80776 99833 229314
7557 229314 315492 302845 247164 111062 34851 -38167 -98665 -204671 -170450 -110062 -172837
7546 -172837 -163705 -174649 -96263 -85893 -39141 -32417 2496 -169502 -149964 -136779 -4082 -105183
7534 -105183 -210564 -72851 -86863 -86989 -77681 -44786 62497 68019 57949 31710 40820 46595
7522 46595 16574 40256 151330 24361 33145 -19499 -98888 -116383 -149416 -91135 514 -60224
7510 -60224 -140661 -218638 -195797 -201297 -198689 -133336 -7095 19494 47195 -49116 -70177 -121470
7498 -121470 -88496 -39533 17448 88444 65208 -24912 -7067 69637 161649 209929 4266
7487 4266 -148115 -275743 -217287 -168432 -253674 -191456 114049 176113 117149 55678 -31702
$$ packed form
7569i2615L2601k0961N8166O1895j16847P128J10231N8297k2726N607J9057J29481
7557B29314Q6178j2647n5681j36102p6211p3018o0498j06006L4221O0388o2775
7546a72837R132j0944P8386J0370M6752O724L4913j71998J9538J3185J32697j01101
7534a05183j05381J37713j4012j26R308L2895J07283N522j0070k6239R110N775
7522D6595l0021K3682J11074j26969Q784n2644p9389j7495l3033N8281R1649o0738
7510f0224q0437p7977K2841n500K608O5353J26241K6589K7701r6311k1061n1293
7498a21470L2974M8963N6981P0996k3236r0120J7845P6704R2012M8280k05663
7487D266j52381j27628N8456M8855q5242O2218L05505O2064n8964o1471q7380
$$ plain form
7476 -31702 -121983 -191169 -218174 -284053 -239675 -108002 -121110 -213531 -228542 -171397 -117062 -85399
7464 -85399 17579 55007 121931 58064 -122817 -162527 -16208 112934 187939 84102 14776
7453 14776 -82405 -88727 -71143 -144289 -178366 -71697 29762 111681 32127 75830 181300
7442 181300 137614 -40669 -118614 -44050 17014 79788 65210 143576 87914 102169 45183
7431 45183 -73357 -200510 -109786 -6904 116713 90182 -113744 -152129 -209550 -221111 -111384
7420 -111384 -137556 -116048 -40973 -63618 -134631 -214323 -176914 -104325 -42602 14284 17659 -24544
7408 -24544 -88126 -172800 -105528 -156690 -150889 -126164 -94156 13730 37797 76665 79118 109924
7396 109924 251749 105439 -31338 -84413 -175781 -161061 -45347 40076 131318 98186 9937
$$ packed form
7476c1702r0281o9186k7005o5879M4378J31673j3108r2421j5011N7145N4335L1663
7464h5399J02978L7428O6924o3867j80881l9710J46319J29142P5005j03837o9326
7453A4776r7181o322J7584p3146l4077J06669J01459Q1919p9554M3703J05470
7442A81300m3686j78283p7945P4564O1064O2774j4578P8366n5662J4255n6986
7431D5183j18540j27153R0724J02882J23617k6531k03926l8385n7421j1561J09727
7420a11384k6172K1508P5075k2645p1013p9692L7409P2589O1723N6886L375m2203
7408b4544o3582q4674O7272n1162N801K4725L2008J07886K4067L8868K453L0806
7396A09924J41825j46310j36777n3075r1368J4720J15714Q5423R1242l3132q8249
$$ plain form
7385 9937 -33304 -59909 -97694 15000 18781 89073 -35021 -149726 -308364 -320047 -297702
7374 -297702 -264882 -231272 -52162 1177 -46395 -93324 -97241 -33086 12569 -3142 82024 65222
7362 65222 -54580 -119475 -77281 -30081 -164398 -223448 -204288 -215825 -218462 -123212 -66400 16511
7350 16511 64910 127276 55897 42998 56002 151824 124722 -37337 -118627 -102202 -34948 -68536
7338 -68536 -11611 -58859 -72404 -107652 -109350 21675 -21767 11793 -83942 -211119 -242166 -148307
7326 -148307 -74687 -123446 -260089 -152229 -112511 -62601 46857 68402 -17363 -60448 -3462
7315 -3462 -132915 -35852 97975 -3730 11780 9715 12512 108438 99402 149029 155086 81677
7303 81677 40102 -32625 -68277 -79305 -122578 -6849 -76954 -165636 -284845 -334378 -232477
$$ packed form
7385I937m3241k6605l7785J12694L781P0292j24094j14705j58638j1683K2345
7374b97702L2820L3610J79110N3339m7572m6929l917O4155M5655j5711Q5166j6802
7362F5222j19802o4895M2194M7200j34317n9050J9160j1537k637R5250N6812Q2911
7350A6511M8399O2366p1379j2899J3004R5822k7102j62059q1290J6425O7254l3588
7338f8536N6925m7248j3545l5248j698J31025m3442L3560r5735j27177l1047R3859
7326a48307P3620m8759j36643J07860L9718M9910J09458K1545q5765m3085N6986
7315c462j29453R7063J33827j01705J5510k065K797R5926r036M9627O057p3409
7303H1677m1575p2727l5652j1028m3273J15729p0105q8682j19209m9533J01901
$$ plain form
7292 -232477 -222393 -190784 -126256 -66203 -93498 -50132 -17192 -71384 -117646 -96253 -88600 4285
7280 4285 160848 206838 120131 61385 -12334 -91221 -68732 -23251 76187 90028 132607 196401
7268 196401 58433 28665 -8976 167465 271041 198141 109879 46361 -59777 -65562 42789
7257 42789 59677 8431 -229877 -241547 177306 284928 92923 20400 -25598 -60472 -90803
7246 -90803 -126260 -200792 -260169 -227032 -128126 -166801 -180144 -118342 -102654 -86514 -96375 -134797
7234 -134797 -114127 -73039 -5445 49263 82887 15766 10825 -18429 -102332 7210 139247
7223 139247 66503 19615 -67563 -163853 -77115 13578 49247 89103 96606 61625 -9766 -77112
7211 -77112 -31217 -79717 67040 52002 -48090 -27914 20180 19425 -30512 -10324 -31122 -147098
$$ packed form
7292b32477J0084L1609O4528O0053k7295M3366L2940n4192m6262K1393P653R2885
7280D285J56563M5990q6707n8746p3719p8887K2489M5481R9438J3841M2579O3794
7268A96401j37968k9768l7641J76441J03576p2900q8262o3518j06138n785J08351
7257D2789J6888n1246k38308j1670M18853J07622j92005p2523m5998l4874l0331
7246i0803l5457p4532n9377L3137R8906l8675j3343O1802J5688J6140r861l8422
7234a34797K0670M1088O7594N4708L3624o7121m941k9254q3903J09542J32037
7223A39247p2744m6888q7178r6290Q6738R0693L5669L9856P503l4981p1391o7346
7211g7112M5895m8500J46757j5038j00092K0176M8094p55m9937K0188k0798j15976
$$ plain form
7199 -147098 -114462 2541 -69390 -32393 -44500 -150604 -201155 -147615 -27210 10807 -19353
7188 -19353 52705 131751 131353 172336 76172 -141158 -309673 -240275 -115938 -79344 -82847 -69327
7176 -69327 34479 -7701 -19824 48103 96183 213207 251235 259365 95275 40516 -53982
7165 -53982 -2121 136715 50862 -50271 -85176 -60339 65410 65871 -46685 27289 159402
7154 159402 104863 9986 42567 184252 191262 59867 -124592 -190773 -166220 -148438 -170936
7143 -170936 -172220 -191034 -133227 49628 161403 34149 72992 2424 -54727 -112651 -154569
7132 -154569 -3297 -54632 -68531 -25285 -106355 -105903 -49354 11414 44064 89441 24528 12109
7120 12109 52973 61528 8272 -39401 -34844 54711 3699 -189567 -150649 3148 66689 50792
$$ packed form
7199a47098L2636J17003p1931L6997j2107j06104n0551N3540J20405L8017l0160
7188a9353P2058P9046l98M0983r6164k17330j68515O9398J24337L6594l503J3520
7176f9327J03806m2180j2123O7927M8080J17024L8028Q130j64090n4759r4498
7165e3982N1861J38836q5853j01133l4905K4837J25749M61j12556P3974J32113
7154A59402n4539r4877L2581J41685P010j31395j84459o6181K4553J7782k2498
7143a70936j284j8814N7807J82855J11775j27254L8843p0568n7151n7924m1918
7132a54569J51272n1335j3899M3246q1070M52N6549O0768L2650M5377o4913j2419
7120A2109M0864Q555n3256m7673M557Q9555n1012j93266L8918J53797O3541j5897
$$ plain form
7108 50792 -51043 -124792 -208434 -200046 -67020 -39533 100525 115002 56459 114509 233574
7097 233574 189589 85314 57041 87612 11972 85273 138312 96566 -39064 -183345 -291284
7086 -291284 -131952 -120270 -65777 -18086 9950 56190 102090 -11367 -206967 -243722 -161375
7075 -161375 -204078 -258662 -327876 -197528 -125463 -123842 10154 36863 -38680 -72243 28426
7064 28426 73425 -27605 -49661 -24166 -50659 -135086 -180901 -225417 -156267 -214153 -192653 -176679
7052 -176679 -134824 -90342 -76260 -128770 -163146 -97924 -168207 -115669 35556 57029 102608
7041 102608 35811 -195811 -461863 -369676 -297366 -132666 -14667 55022 5636 -47582 -126615
7030 -126615 -76115 -48785 105870 146824 72622 35838 78423 163306 246698 126189 70103
$$ packed form
7108E0792j01835p3749q3642Q388J33026K7487J40058J4477n8543N8050J19065
7097B33574m3985j04275k8273L0571p5640P3301N3039m1746j35630j44281j07939
7086b91284J59332J1682N4493M7691K8036M6240M5900j13457j95600l6755Q2347
7075a61375m2703n4584o9214J30348P2065J621J33996K6709p5543l3563J00669
7064B8426M4999j01030k2056K5495k6493q4427m5815m4516O9150n7886K1500J5974
7052a76679M1855M4482J4082n2510l4376O5222p0283N2538J51225K1473M5579
7041A02608o6797k31622k66052R2187P2310J64700J17999O9689m9386n3218p9033
7030a26615N0500K7330J54655M0954p4202l6784M2585Q4883Q3392j20509n6086
$$ plain form
7019 70103 194376 199374 55152 -241048 -286068 -251319 -147850 3638 -78057 -92568 -11021
7008 -11021 -93989 49629 -3793 -108838 -217805 -293018 -237836 -87516 -55892 -97536 -85663
6997 -85663 95086 158468 92355 17141 25545 138147 358824 358306 304694 303830 346677 300517
6985 300517 229924 93005 -83088 -115665 -195240 -81743 -53674 -35006 -19684 76374 -54650
6974 -54650 -172800 -107775 -19128 -143944 -256860 -135083 -109814 -61650 39152 89434 419
6963 419 41630 38373 -93700 -93384 -101279 -152720 -84177 8204 214433 340124 303426 145411
6951 145411 -6865 -10307 -117553 -139769 42180 87186 -28592 -6871 -6737 -98119 -67085
6940 -67085 -4870 129038 205610 147297 159585 253304 301396 206694 171024 222075 205499 171110
$$ packed form
7019G0103J24273M998j44222k96200m5020L4749J03469J51488q1695j4511Q1547
7008a1021q2968J43618n3422j05045j08967p5213N5182J50320L1624m1644J1873
6997h5663J80749O3382o6113p5214Q404J12602K20677n18n3612q64M2847m6160
6985C00517p0593j36919j76093l2577p9575J13497K8069J8668J5322R6058j31024
6974e4650j18150O5025Q8647j24816j12916J21777K5269M8164J00802N0282q9015
6963D19M1211l257j32073L16p895n1441O8543R2381K06229J25691l6698j58015
6951A45411j52276l442j07246k2216J81949M5006j15778K1721J34r1382L1034
6940f7085O2215J33908P6572n8313J2288R3719M8092r4702l5670N1051j6576l4389
$$ plain form
6928 171110 106523 10370 70283 60801 -18706 -124963 -95996 -111064 -109961 31967 176684
6917 176684 182448 192641 115525 -367 -30651 17523 -31616 10185 48618 -39613 -79848 -164485
6905 -164485 -177688 -74822 9058 145017 108109 5093 -63557 -91293 -64023 -79843 -85333
6894 -85333 -77392 -49649 -154130 -106314 7084 47912 1767 -194256 -183090 -124546 -72709
6883 -72709 17120 24288 -33415 -117446 -133074 -186817 -153613 -47110 -51127 9284 86130 37734
6871 37734 53779 9181 12490 -14147 180118 263608 280653 168745 94202 74365 -51879
6860 -51879 -91711 -46392 50979 204506 207158 174919 82373 -28559 -42349 9966 86424 9160
6848 9160 -64495 -248058 -205068 -77096 -118320 -112684 -30253 -54823 -88737 -5297 55354 134073
$$ packed form
6928A71110o4587r6153N9913r482p9507j06257K8967j5068J103J41928J44717
6917A76684N764J0193p7116j15892l0284M8174m9139M1801L8433q8231m0235q4637
6905a64485j3203J02866Q3880J35959l6908j03016o8650k7736K7270j5820n490
6894h5333P941K7743j04481M7816J13398M0828m6145j96023J1166N8544N1837
6883g2709Q9829P168n7703q4031j5628n3743L3204J06503m017O0411P6846m8396
6871C7734J6045m4598L309k6637J94265Q3490J7045j11908p4543j9837j26244
6860e1879l9832M5319R7371J53527K652l2239r2546j10932j3790N2315P6458p7264
6848I160p3655j83563M2990J27972m1224N636Q2431k4570l3914Q3440O0651P8719
$$ plain form
6836 134073 124171 65478 47009 34995 109849 -45200 -174663 -294648 -383646 -340079 -292661
6825 -292661 -283535 -286506 -86180 -19694 -122867 -85490 -158561 -298963 -333195 -309396 -260335
6814 -260335 -176580 -51331 49990 32328 29199 -41490 -186982 -224792 -66823 8191 122458
6803 122458 72789 -25658 87415 160885 119458 20630 10454 102227 93081 132812 56340 -16630
6791 -16630 25002 130921 59786 -56237 -61421 -43457 3056 39901 87645 59077 -13884 36890
6779 36890 17735 43536 -42592 -153490 -142539 -152418 -134251 4334 198688 223291 165497
6768 165497 77469 93762 185720 173681 -25925 -174577 -197480 -161842 -95236 9659 111059
6757 111059 160628 122402 39452 82999 154119 130126 109285 115609 26950 -140524 -276862
$$ packed form
6836A34073r902n8693j8469j2014P4854j55049j29463j19985q8998M3567M7418
6825b92661R126k971K00326O6486j03173L7377p3071j40402l4232K3799M9061
6814b60335Q3755J25249J01321j7662l129p0689j45492l7810J57969P5014J14267
6803A22458m9669r8447J13073P3470m1427r8828j0176R1773r146L9731p6472p2970
6791a6630M1632J05919p1135j16023n184J7964M6513L6845M7744k8568p2961N0774
6779C6890j9155K5801q6128j10898J0951r879J8167J38585J94354K4603n7794
6768A65497q8028J6293R1958j2039j99606j48652k2903L5638O6606J04895J01400
6757A11059M9569l8226q2950M3547P1120k3993k0841O324q8659j67474j36338
$$ plain form
6746 -276862 -214909 -150572 -234828 -318884 -394396 -222876 -34448 -54220 -85046 -53983 104572
6735 104572 151967 101170 163506 229855 106477 48005 -22804 205509 163933 153732 157641
6724 157641 110214 -55634 -84679 -70779 26905 -33847 -46681 -64135 37976 221208 322544
6713 322544 306661 229685 215440 114234 -93387 -93828 -43899 -87017 -36444 -17206 -118068
6702 -118068 -200908 -308681 -151807 75799 100185 -54550 -143259 -184229 -124142 -5040 15243
6691 15243 77818 -10816 -103053 -27138 -52186 -40156 25418 4161 -22539 -143342 -79370 -25736
6679 -25736 -88239 -79199 -145425 -180756 -65080 91010 244145 137322 157147 184512 122199
6668 122199 216815 161028 98007 61153 43398 -26768 26806 57673 89974 48231 105086 35416
$$ packed form
6746b76862O1953O4337q4256q4056p5512J71520J88428j9772l0826L1063J58555
6735A04572M7395n0797O2336O6349j23378n8472p0809K28313m1576j0201L909
6724A57641m7427j65848k9045J3900R7684o0752j2834j7454J02111J83232J01336
6713C22544j5883p6976j4245j01206k07621m41M9929m3118N0573J9238j00862
6702a18068q2840j07773J56874K27606K4386j54735q8709m0970O0087J19102K0283
6691A5243O2575q8634r2237P5915k5048J2030O5574k1257k6700j20803O3972N3634
6679b5736o2503R040o6226l5331J15676J56090J53135j06823J9825K7365o2313
6668A22199R4616n5787o3021l6854j7755p0166N3574L0867L2301m1743N6855o9670
$$ plain form
6656 35416 -33970 -51494 -88038 -58103 17589 -94411 -154676 -49401 105861 67820 -23580
6645 -23580 -12166 72371 88926 142940 60062 -19142 -70773 -306067 -496181 -483497 -362344
6634 -362344 -291882 -177543 -46952 -61916 -13390 -77226 -166495 -210824 -268171 -274996 -221076
6623 -221076 -179886 -220268 -218313 -114578 33661 -1337 -42167 -164468 -178121 -83062 20023
6612 20023 67652 51257 81692 143212 52487 -50527 -14784 -36905 -48853 80992 116601
6601 116601 40427 -162484 -169863 30723 24823 -17964 6542 49573 59524 69876 169622 155369
6589 155369 7710 12183 7658 -14336 151930 228094 145906 84698 84006 -53715 -136807 -221686
6577 -221686 -146783 -38050 11918 -72229 -101501 -76384 -133704 -211909 -233595 -92357 -45250
$$ packed form
6656C5416o9386j7524l6544K9935P5692j12000o0265J05275J55262l8041r1400
6645b3580J1414Q4537J6555N4014q2878p9204n1631k35294j90114J2684J21153
6634c62344P0462J14339J30591j4964M8526o3836q9269m4329n7347o825N3920
6623b21076M1190m0382J955J03735J48239l4998m0830j22301j3653R5059J03085
6612B0023M7629j6395L0435O1520r0725j03014L5743k2121j1948J29845L5609
6601A16601p6174k02911p379K00586n900m2787K4506M3031R951J0352R9746j4253
6589A55369j47659M473m525k1994J66266P6164q2188o1208o92j37721q3092q4879
6577b21686P4903J08733M9968q4147k9272K5117n7320p8205k1686J41238M7107
$$ plain form
6566 -45250 6519 24752 -16038 86578 95162 4276 -7161 14335 134339 58980 1102 -15653
6554 -15653 30827 -84916 -195688 -112840 -120062 -225721 -62357 94430 107524 34409 50778
6543 50778 -12767 -136303 -79666 -92361 -164023 -179277 -200455 -151232 -21121 37252 -17039
6532 -17039 -2077 97855 140866 177201 217158 111576 100402 27705 -93798 -147443 -116937
6521 -116937 -112998 -94991 -60260 16819 107699 177006 119490 14368 -50515 -82453 -49610 -115761
6509 -115761 -157202 -155743 -166651 -154203 -134869 -35212 118111 113253 75962 93895 33405 -42070
6497 -42070 23184 -8249 -157941 -200704 -88090 98701 -26169 -54696 90470 159284 44193
6486 44193 -116805 -147710 -24998 148501 176878 80015 -8545 78663 92795 81291 -44145
$$ packed form
6566d5250N1769J8233m0790J02616Q584r0886j1437K1496J20004p5359n7878j6755
6554a5653M6480j15743j10772Q2848p222j05659J63364J56787J3094p3115J6369
6543E0778o3545j23536N6637j2695p1662j5254k1178M9223J30111N8373n4291
6532a7039J4962R9932M3011L6335L9957j05582j1174p2697j21503n3645L0506
6521a16937L939J8007L4731P7079R0880O9307n7516j05122o4883l1938L2843o6151
6509a15761m1441J459j0908J2448J9334R9657J53323m858l7291J7933o0490p5475
6497d2070O5254l1433j49692m2763J12614J86791j24870k8527J45166O8814j15091
6486D4193j60998l0905J22712J73499K8377r6863q8560Q7208J4132j1504j25436
$$ plain form
6475 -44145 -164668 -73803 -14513 63031 111211 55252 31751 104680 68120 -42960 -67390
6464 -67390 -127705 -237420 -325323 -249179 -88090 87502 173229 177640 206342 95795 -57859
6453 -57859 -85153 -51030 -51194 -79347 -56098 -182331 -332928 -303330 -179537 -178833 -144574 -67711
6441 -67711 53319 -1437 -72906 -166573 -205735 -250650 -132057 -28384 -150610 -246729 -224470
6430 -224470 -197005 -194019 -225907 -220611 -110178 -148417 -287644 -238341 -35768 -80487 -163945
6419 -163945 -180575 -20626 71061 -29330 4611 84449 108494 94571 148397 97717 -17898
6408 -17898 -19215 33683 -24588 -133079 -183650 -136818 -121595 -20292 78212 13870 -5194 -67015
6396 -67015 -88336 -77576 -79588 -40990 59208 61912 42650 69514 155662 64381 -25760 740
$$ packed form
6475d4145j20523R0865N9290P7544M8180n5959k3501P2929l6560j11080k4430
6464f7390o0315j09715q7903P6144J61089J75592Q5727M411K8702j10547j53654
6453e7859k7294L4123j64k8153K3249j26233j50597K9598J23793P04L4259P6863
6441f7711J21030n4756p1469r3667l9162m4915J18593J03673j22226r6119K2259
6430b24470K7465K986l1888N296J10433l8239j39227M9303K02573m4719q3458
6419a63945j6630J59949R1687j00391L3941P9838K4045j3923N3826n0680j15615
6408a7898j317N2898n8271j08491n0571M6832J5223J01303R8504o4342j9064o1821
6396f7015k1321J0760k012L8598J00198K704j9262K6864Q6148r1281r0141K6500
$$ plain form
6384 740 -72615 -37440 -66640 -98607 -10322 38012 -76232 -130690 -93326 -153523 -226268 -168967
6372 -168967 -64800 84693 175921 231421 138653 81279 -2728 -101866 -62284 -101430 45301
6361 45301 28384 -67813 -42592 -59602 56770 179901 158659 43956 -126645 -147936 -84210
6350 -84210 -41496 -116319 -150563 -127301 -179118 -86111 4589 -5954 11230 -57662 -99178 -55831
6338 -55831 -22532 75349 263442 344585 232742 181132 -3523 -146335 -100412 -71191 -40474
6327 -40474 1218 152913 85757 38151 26909 30062 56502 -16083 36270 95277 105188 37278
6315 37278 -97242 -199051 -245213 -247732 -275500 -210907 -86112 -60357 -54335 -118980 -232963
6304 -232963 -322606 -192738 -159824 -211474 -313484 -205400 -170681 -242901 -298183 -246541 -98852
$$ packed form
6384G40p3355L5175k9200l1967Q8285M8334j14244n4458L7364o0197p2745N7301
6372a68967J04167J49493R1228N5500r2768n7374q4007r9138L9582l9146J46731
6361D5301j6917r6197K5221j7010J16372J23131k1242j14703j70601k1291O3726
6350h4210M2714p4823l4244K3262n1817R3007R0700j0543J7184o8892m1516M3347
6338e5831L3299R7881J88093Q1143j11843n1610j84655j42812M5923K9221L0717
6327d0474M1692J51695o7156m7606j1242L153K6440p2585N2353N9007R911o7910
6315C7278j34520j01809m6162k519k7768O4593J24795K5755O022o4645j13983
6304b32963q9643J29868L2914n1650j02010J08084L4719p2220n5282N1642J47689
$$ plain form
6293 -98852 -105721 -110626 -37228 -31850 -19088 -28492 -43872 -141666 -184307 -157123 -181879 -82294 -85231
6280 -85231 -132896 -74746 52643 91934 -32222 -69114 52072 121512 55631 -43728 -44294 -16947
6268 -16947 -70362 -155279 -187957 -88245 -80019 -76326 -64335 -72391 -4294 149715 27353 -37639
6256 -37639 17520 24672 -3624 -26281 54039 -23172 55286 32883 -133157 -106528 -170539 -213749
6244 -213749 -185280 -83517 -143166 -196395 -244041 -309286 -293760 -238989 -131981 -179376 -290442
6233 -290442 -306392 -237308 -41423 12689 -21956 -34613 101712 212563 152893 129896 187775
6222 187775 152562 84070 89340 86465 162268 94582 -15781 -119655 -168473 -111769 23277
6211 23277 102230 297412 362028 375059 200688 87036 -29469 -74001 -15720 -1342 -115652
$$ packed form
6293i8852o869m905P3398N378J2762r404j5380r7794m2641K7184k4756R9585k937
6280h5231m7665N8150J27389L9291j24156l6892J21186O9440o5881r9359n66K7347
6268a6947n3415q4917l2678R9712Q226L693J1991q056O8097J54009j22362o4992
6256c7639N5159P152k8296k2657Q0320p7211P8458k2403j66040K6629o4011m3210
6244b13749K8469J01763n9649n3229m7646o5245J5526N4771J07008m7395j11066
6233b90442j5950O9084J95885N4112l4645j2657J36325J10851n9670k2997N7879
6222A87775l5213o8492N270k875P5803o7686j10363j03874m8818N6704J35046
6211B3277P8953J95182O4616J3031j74371j13652j16505m4532N8281J4378j14310
$$ plain form
6200 -115652 -150092 -155766 -51833 -69563 4083 -7506 34858 116639 74608 38720 47333 36103
6188 36103 -22767 -65440 -114524 -70118 -94266 -131895 -99199 -82747 -133253 -125198 -34546 7382
6176 7382 54239 86631 -53449 -76254 -2807 43089 -100175 -237088 -274084 -274752 -240484 -46076
6164 -46076 3154 5766 -86308 -126984 -133796 -226946 -130231 156675 126084 -57379 -223309 -269293
6152 -269293 -163268 -167043 -167934 -246774 -140119 -44022 -169981 -223861 -183915 -1237 22926
6141 22926 -55603 -132397 -182519 -109626 -30653 -71701 -158229 -92206 -82060 34292 156724
6130 156724 12709 6514 -49088 -89625 -72006 68298 134232 283593 133496 12532 32153
6119 32153 5737 -101222 -51052 -52157 43417 34509 -60324 -43193 65208 221654 252775 119806
$$ packed form
6200a15652l4440n674J03933j7730P3646j1589M2364Q1781m2031l5888Q613j1230
6188C6103n8870m2673m9084M4406k4148l7629L2696J6452n0506Q055R0652M1928
6176G382M6857L2392j40080k2805P3447M5896j43264j36913l6996o68L4268J94408
6164d6076M9230K612r2074m0676o812r3150R6715K86906l0591j83463j65930m5984
6152b69293J06025l775q91p8840J06655R6097j25959n3880L9946J82678K4163
6141B2926p8529p6794n0122P2893P8973m1048q6528O6023J0146J16352J22432
6130A56724j44015o195n5602m0537J7619J40304O5934J49361j50097j20964J9621
6119C2153k6416j06959N0170j105R5574q908r4833J7131J08401J56446L1121j32969
$$ plain form
6107 119806 -118045 28687 94564 120667 20070 20748 63703 1799 -177927 -173804 -129021
6096 -129021 -49255 -72384 -79453 -25613 55899 129444 59238 -58515 -100818 -64506 -64072 -131040
6084 -131040 -213081 -263020 -166607 -130519 -154170 -170427 -110730 3384 75489 110154 161365
6073 161365 148589 78786 -72184 -18603 16103 -3314 -158538 -158468 -206633 -151456 -8937 77264
6061 77264 171612 131247 25159 -112127 -287504 -375832 -326835 -225039 -28930 48767 101767
6050 101767 15327 9103 -22116 -160538 -129785 48738 53301 -56503 -122025 -82755 -133730
6039 -133730 -149158 -194792 -161964 -138637 -95166 -166223 -334343 -426592 -366812 -166716 -136750
6028 -136750 -110860 -108727 -3736 85971 96467 26958 12056 7771 -89787 -101579 -54741 -142207
$$ packed form
6107A19806k37851J46732O5877K6103j00597O78M2955o1904j79726M123M4783
6096a29021P9766k3129p069N3840Q1512P3545p0206j17753m2303L6312M34o6968
6084a31040q2041m9939R6413L6088k3651j6257N9697J14114P2105L4665N1211
6073A61365j2776o9803j50970N3581L4706j9417j55224P0m8165N5177J42519Q6201
6061G7264R4348m0365j06088j37286j75377q8328M8997J01796J96109P7697N3000
6050A01767q6440o224l1219j38422L0753J78523M563j09804o5522L9270n0975
6039a33730j5428m5634L2828K3327M3471p1057j68120r2249N9780K00096K9966
6028a36750K5890K133J04991Q9707J0496o9509j4902m285r7558j1792M6838q7466
$$ plain form
6016 -142207 -241943 -153023 -96285 -92308 -16115 -18484 -64778 -54833 8567 5975 123239 82034
6004 82034 20710 -96411 -74002 -162759 -57513 98419 171227 40220 -54292 -52560 7076
5993 7076 -67138 14948 110401 127 -76654 -93167 -33961 -45194 -127970 -236835 -260219 -287121
5981 -287121 -243767 -181020 -116611 -92657 -117245 -49768 -92833 -75797 -35881 -87340 -70728 -129142
5969 -129142 -109273 61229 156233 179556 147647 64029 -62555 -96511 -178880 -121926 -148794
5958 -148794 -132235 -175379 -237720 -320094 -204768 -122229 -92687 -210940 -248901 -119203 -51623
5947 -51623 15035 -57097 -25229 -54938 -114315 -301411 -341079 -284261 -145044 -99254 -160031
5936 -160031 -216468 -311912 -159496 -100700 -89045 -7019 121529 200156 199815 213431 46020
$$ packed form
6016a42207r9736Q8920N6738L977P6193k369m6294R945O3400k592J17264m1205
6004H2034o1324j17121K2409q8757J05246J55932P2808j31007r4512J732N9636
5993G076p4214Q2086R5453j10274p6781j6513N9206j1233q2776j08865k3384k6902
5981b87121M3354O2747O4409K3954k4588O7477m3065J7036L9916n1459J6612n8414
5969a29142J9869J70502R5004K3323l1909q3618j26584l3956q2369N6954k6868
5958a48794J6559m3144o2341q2374J15326Q2539K9542j18253l7961J29698O7580
5947e1623O6658p2132L1868k9709n9377j87096l9668N6818J39217M5790o0777
5936a60031n6437r5444J52416N8796J1655Q2026J28548P8627l41J3616j67411
$$ plain form
5925 46020 -98600 -120745 -37608 103836 115755 9197 -87713 -286020 -348083 -337790 -259681
5914 -259681 -82151 119301 92478 34073 71566 57554 109713 81020 43838 -247399 -214594
5903 -214594 -73431 -10662 -22784 -25518 -5592 78887 273978 341907 264656 157834 275807
5892 275807 433877 267781 -75782 -93066 -175299 -246662 -74988 66065 71789 13846 1690
5881 1690 -29247 -46284 -73951 -92456 -102033 -112422 79187 81917 -251488 -275227 -134616 -52075
5869 -52075 28622 -159155 -344168 -258663 -66344 -14892 -76472 -171117 -215463 -148051 -221349
5858 -221349 -165900 -185105 -203424 -72991 126247 312691 397735 336642 85047 -54275 23277
5847 23277 230623 240967 227160 161498 45999 -70364 -32149 -111142 -69665 -142931 -271991
$$ packed form
5925D6020j44620k2145Q3137J41444J1919j06558r6910j98307o2063J0293P8109
5914b59681J77530K01452k6823n8405L7493j4012N2159k8693l7182k91237L2805
5903b14594J41163O2769j2122k734J9926Q4479J95091O7929p7251j06822J17973
5892B75807J58070j66096l43563j7284q2233p1363J71674J41053N724n7943j2156
5881A690l0937j7037k7667j8505r577j0389J91609K730l33405k3739J40611Q2541
5869e2075Q0697j87777j85013Q5505J92319N1452o1580r4645m4346O7412p3298
5858b21349N5449j9205j8319J30433J99238J86444Q5044o1093k51595j39322P7552
5847B3277K07346J0344j3807o5662j15499j16363L8215p8993M1477p3266j29060
$$ plain form
5836 -271991 -311842 -216800 -167951 -187245 -78350 -26434 67817 109749 160488 98321 76738
5825 76738 -23430 90115 165857 64852 -33831 33582 62506 61861 170828 89815 -4489
5814 -4489 -110965 -124661 -19308 -49556 -39297 -8548 -101288 -69697 25021 -11340 -239142
5803 -239142 -71981 146058 87807 -16170 -21147 -39467 2715 -7060 -125408 -102262 26454
5792 26454 59096 47060 -76556 3299 34711 16983 46346 119190 74698 80855 121317 57710
5780 57710 56812 142207 314788 287332 105763 35721 -150585 -222594 -131899 -39415 25294 148663
5768 148663 150172 180237 141045 41197 38440 49225 101910 113451 -91715 -239257 -219998 -45870
5756 -45870 13074 4012 -12479 -29202 -37179 -52246 -11755 -19596 29251 200017 133366 -31958
$$ packed form
5836b71991l9851R5042M8849j9294J08895N1916R4251M1932N0739o2167k1583
5825G6738j00168J13545P5742j01005r8683O7413K8924o45J08967q1013r4304
5814d489j06476j3696J05353l0248J0259L0749r2740L1591R4718l6361k27802
5803b39142J67161K18039n8251j03977m977j8320M2182r775j18348K3146J28716
5792B6454L2642j2036j23616P9855L1412j7728K9363P2844m4492O157M0462o3607
5780E7710q98Q5395J72581k7456j81569p0042j86306p2009R0695R2484O4709J23369
5768A48663J509L0065l9192r9848k757J0785N2685J1541k05166j47542J9259J74128
5756d5870N8944r062j6491j6723p977j5067M0491p841M8847J70766o6651j65324
$$ plain form
5744 -31958 12650 120826 26516 43712 -34882 -112865 -128151 -224058 -275651 -180008 27365
5733 27365 17690 -45952 -5212 -82483 -116945 -47678 86301 81 105131 89534 12023 -55312
5721 -55312 -53017 -55811 54600 101210 -75042 -212404 -55613 133649 228273 101102 20091
5710 20091 162511 169149 56569 -72793 -228129 -191140 -14599 4504 -131953 -112833 -129564
5699 -129564 -157004 -262751 -370485 -309742 -313865 -260110 -209906 -295891 -435816 -517387 -535195
5688 -535195 -279100 -214053 -213476 -225128 -213592 -176997 -216817 -195781 -91357 -124979 -89211 391
5676 391 -23306 -36842 -102169 -140729 -121485 -93289 -135669 -77489 -94381 -62345 -90937 -106054
5664 -106054 -88715 -125603 -112282 -162951 -137208 -42674 8413 31185 10740 -46446 -189904
$$ packed form
5744c1958M4608J08176r4310J7196p8594p7983j5286r5907n1593R5643K07373
5733B7365r675o3642M0740p7271l4462O9267J33979q6220J05050j5597p7511o7335
5721e5312K295k794J10411M6610j76252j37362J56791J89262R4624j27171q1011
5710B0091J42420O638j12580j29362j55336L6989J76541J9103j36457J9120j6731
5699a29564k7440j05747j07734O0743m123N3755N0204q5985j39925q1571j7808
5688e35195K56095O5047N77j1652J1536L6595l9820K1036J04424l3622L5768Q9602
5676C91k3697j3536o5327l8560J9244K8196m2380N8180j6892L2036k8592j5117
5664a06054J7339l6888J3321n0669K5743R4534N1087K2772k0445n7186j43458
$$ plain form
5653 -189904 -184724 -72047 -17989 -24156 -46390 -36753 115760 124644 7685 23712 24829 -136271
5641 -136271 -280134 -276255 -86451 3503 -64548 -125936 -134144 -82152 -33001 89816 113400
5630 113400 83767 116955 -20095 -18273 7669 49086 187000 133819 98930 178121 155813
5619 155813 136045 144795 95659 26731 -120502 -211854 -165343 -89594 -158197 -255619 -303264 -263493
5607 -263493 -118574 45189 90257 95779 104060 89638 27866 -6716 95975 124641 77240
5596 77240 185831 137084 59291 -59039 -27738 20846 54625 97439 52194 -34812 -52759
5585 -52759 67440 176245 119025 73710 8683 -43829 30769 42713 139712 233687 285388
5574 285388 167383 89850 74500 65219 149130 216878 162777 84828 66339 36966 27376 44948
$$ packed form
5653a89904N180J12677N4058o167k2234R637J52513Q884j16959J6027J117j61100
5641a36271j43863L879J89804Q9954o8051o1388q208N1992M9151J22817K3584
5630A13400k9633L3188j37050J822K5942M1417J37914n3181l4889P9191k2308
5619A55813j9768Q750m9136o8928j47233r1352M6511P5749o8603r7422m7645L9771
5607b63493J44919J63763M5068N522Q281j4422o1772l4582J02691K8666m7401
5596G7240J08591m8747p7793j18330L1301M8584L3779M2814m5245q7006j7947
5585e2759J20199J08805n7220m5315o5027n2512P4598J1944R6999R3975N1701
5574B85388j18005p7533j5350r281Q3911O7748n4101p7949j8489k9373r590J7572
$$ plain form
5562 44948 -16731 -37555 -191483 -162893 20056 95117 62510 -36324 -57169 -79610 23298
5551 23298 128329 121780 -30144 -205954 -211489 -85615 -60225 69778 82202 170524 174302
5540 174302 257944 348555 282255 63146 41602 -48488 -18206 115789 229231 228053 98640
5529 98640 275098 158201 9575 -48158 -62580 -37281 -23313 39091 85651 77502 -44977
5518 -44977 -36995 39998 8470 28084 62086 23418 -39440 40351 116863 218979 151940 67244
$$ packed form
5562D4948o1679k0824j53928K8590J82949P5061l2607r8834k0845k2441J02908
5551B3298J05031o549j51924j75810n535J25874K5390J30003J2424Q8322L778
5540A74302Q3642R0611o6300k19109k1544r0090L0282J33995J13442j178j29413
5529I8640J76458j16897j48626n7733j4422K5299J3968O2404M6560q149j22479
5518d4977P982P6993l1528J9614L4002l8668o2858P9791P6512J02116o7039q4696
$$ [...]
##END NTUPLES=NMR SPECTRUM
##END=
