##TITLE=Analysis number 312342
Compound Code cc 29709
Book Reference 380/107/10
Project Code adrs
Chemist Name ronp
##JCAMPDX= 6.0         $$ Bruker NMR JCAMP-DX V2.0
##DATA TYPE= NMR SPECTRUM
##DATA CLASS= NTUPLES
##ORIGIN= Bruker BioSpin GmbH
##OWNER= NMR
$$ XWIN-NMR		Version 3.5
$$ Tue Aug  2 09:04:33 2005 GMT Daylight Time (UT+1h)  MAYBRIDGE\NMR@NMR_250MHZ
##.OBSERVE FREQUENCY= 250.131544655141
##.OBSERVE NUCLEUS= ^1H
##.ACQUISITION MODE= SIMULTANEOUS (DQD)
##.ACQUISITION SCHEME= undefined
##.AVERAGES= 16
##.DIGITISER RES= 18
##SPECTROMETER/DATA SYSTEM= dpx250
##.PULSE SEQUENCE= zg30
##.SOLVENT NAME= CDCl3
##.SHIFT REFERENCE= (INTERNAL, CDCl3, 0, 16.4429)
##AUDIT TRAIL= $$ (NUMBER, WHEN, WHO, WHERE, WHAT)
$$ ##TITLE= Audit trail, XWIN-NMR		Version 3.5
$$ ##JCAMPDX= 5.01
$$ ##ORIGIN= Bruker BioSpin GmbH
$$ ##OWNER= NMR
$$ C:\u/data/dgb/nmr/ADRS/7000/pdata/1/auditp.txt
$$ ##AUDIT TRAIL=  $$ (NUMBER, WHEN, WHO, WHERE, WHAT)
(   1,<2005-08-02 09:04:13.28 +100>,<MAYBRIDGE\NMR>,<NMR_250MHZ>,
      <created by zg, POWCHK disabled, PULCHK disabled
       configuration hash MD5:
       62 19 C7 07 E1 42 D1 B7 37 6C 3D D0 77 39 F9 E6
       data hash MD5: 64K
       C6 54 31 AD AB BE 74 46 5F BC 55 83 22 D1 98 7F>)
(   2,<2005-08-02 09:04:26.06 +100>,<MAYBRIDGE\NMR>,<NMR_250MHZ>,
      <Start of raw data processing
       ef LB = 0.3 FT_mod = 6 PKNL = 1 SI = 32K 
       data hash MD5: 32K
       1B D1 0E FA 94 31 7E E4 02 F6 8B E6 7D 7E 9E 7E>)
(   3,<2005-08-02 09:04:28.00 +100>,<MAYBRIDGE\NMR>,<NMR_250MHZ>,
      <apk 
       data hash MD5: 32K
       8E E7 2A CA E2 1F 43 48 67 78 5B CD E1 9B 1E DF>)
(   4,<2005-08-02 09:04:28.64 +100>,<MAYBRIDGE\NMR>,<NMR_250MHZ>,
      <abs ABSG = 5 
       data hash MD5: 32K
       25 03 65 A8 40 86 30 19 59 3B E2 66 1C 56 2E F1>)
$$ ##END=
$$ 
$$ hash MD5
$$ AD 24 C8 17 5E BF 6E 96 97 38 4B FD 7E C6 68 BF
##$RELAX= 
##$RELAX= 
##$RELAX= 
##$RELAX= 
##$RELAX= 
##$RELAX= 
##$RELAX= 
$$ Bruker specific parameters
$$ --------------------------
##$DU= <C:\u>
##$EXPNO= 7000
##$NAME= <ADRS>
##$PROCNO= 1
##$TYPE= <nmr>
##$USER= <dgb>
##$AMP= (0..31)
100 100 100 100 100 100 100 100 100 100 100 100 100 100 100 100 100 100 
100 100 100 100 100 100 100 100 100 100 100 100 100 100 
##$AQSEQ= 0
##$AQ_mod= 3
##$AUNM= <au_zg>
##$AUTOPOS= <2 >
##$BF1= 250.13
##$BF2= 250.13
##$BF3= 250.13
##$BF4= 250.13
##$BF5= 500.13
##$BF6= 500.13
##$BF7= 500.13
##$BF8= 500.13
##$BYTORDA= 1
##$CFDGTYP= 0
##$CFRGTYP= 5
##$CHEMSTR= <none>
##$CNST= (0..31)
1 1 145 1 1 1 1 1 1 1 1 1 1 1 1 1 1 1 1 1 1 1 1 1 1 1 1 1 1 1 1 1 
##$CPDPRG= <>
##$CPDPRG1= <>
##$CPDPRG2= <>
##$CPDPRG3= <>
##$CPDPRG4= <mlev>
##$CPDPRG5= <mlev>
##$CPDPRG6= <mlev>
##$CPDPRG7= <mlev>
##$CPDPRG8= <mlev>
##$CPDPRGB= <>
##$CPDPRGT= <>
##$D= (0..31)
0 1 0 0 0 0 0 0 0 0.06 0 0 0 0 0 0 0.0002 0 0 0 0 0 0 0 0 0 0 0 0 0 0 
0 
##$DATE= 1122969852
##$DBL= (0..7)
120 120 120 120 120 120 120 120 
##$DBP= (0..7)
150 150 150 150 150 150 150 150 
##$DBP07= 0
##$DBPNAM0= <>
##$DBPNAM1= <>
$$ [...]
##$SUBNAM7= <"">
##$SUBNAM8= <"">
##$SUBNAM9= <"">
##$SW= 20.6930455092707
##$SWIBOX= (0..15)
0 0 3 0 0 0 0 0 0 0 0 0 0 0 0 0 
##$SW_h= 5175.983436853
##$TD= 65536
##$TD0= 1
##$TE= 295.16
##$TE2= 300
##$TE3= 300
##$TEG= 300
##$TL= (0..7)
0 120 120 120 120 120 120 120 
##$TP= (0..7)
150 150 150 150 150 150 150 150 
##$TP07= 0
##$TPNAME0= <>
##$TPNAME1= <>
##$TPNAME2= <>
##$TPNAME3= <>
##$TPNAME4= <>
##$TPNAME5= <>
##$TPNAME6= <>
##$TPNAME7= <>
##$TPOAL= (0..7)
0.5 0.5 0.5 0.5 0.5 0.5 0.5 0.5 
##$TPOFFS= (0..7)
0 0 0 0 0 0 0 0 
##$TUNHIN= 0
##$TUNHOUT= 0
##$TUNXOUT= 0
##$USERA1= <user>
##$USERA2= <user>
##$USERA3= <user>
##$USERA4= <user>
##$USERA5= <user>
##$V9= 5
##$VALIST= <valist>
##$VCLIST= <CCCCCCCCCCCCCCC>
##$VD= 0
##$VDLIST= <DDDDDDDDDDDDDDD>
##$VPLIST= <PPPPPPPPPPPPPPP>
##$VTLIST= <TTTTTTTTTTTTTTT>
##$WBST= 1024
##$WBSW= 4
##$XGAIN= (0..3)
0 0 0 0 
##$XL= 0
##$YL= 0
##$YMAX_a= 320056
##$YMIN_a= -515644
##$ZGOPTNS= <>
##$ZL1= 120
##$ZL2= 120
##$ZL3= 120
##$ZL4= 120
##$ABSF1= 16.44295
##$ABSF2= -4.250223
##$ABSG= 5
##$ABSL= 3
##$ALPHA= 0
##$AQORDER= 0
##$ASSFAC= 0
##$ASSFACI= 0
##$ASSFACX= 0
##$ASSWID= 0
##$AUNMP= <proc_1d>
##$AZFE= 0.1
##$AZFW= 0.1
##$BCFW= 0
##$BC_mod= 0
##$BYTORDP= 0
##$COROFFS= 0
##$CY= 12.5
##$DATMOD= 1
##$DC= 0
##$DFILT= <>
##$DTYPP= 0
##$F1P= 14.0000005364418
##$F2P= -0.99999901652339
##$FCOR= 0.5
##$FTSIZE= 32768
##$FT_mod= 6
##$GAMMA= 0
##$GB= 0
##$INTBC= 1
##$INTSCL= 1
##$ISEN= 128
##$LB= 0.3
##$LEV0= 0
##$LPBIN= 0
##$MAXI= 10000
##$MC2= 0
##$MEAN= 0
##$ME_mod= 0
##$MI= 0
##$NCOEF= 0
##$NC_proc= -6
##$NLEV= 6
##$NOISF1= 0
##$NOISF2= 0
##$NSP= 0
##$NTH_PI= 0
##$NZP= 0
##$OFFSET= 16.44295
##$PC= 1
##$PHC0= -77.51379
##$PHC1= 1.039951
##$PH_mod= 1
##$PKNL= yes
##$PPARMOD= 0
##$PSCAL= 4
##$PSIGN= 0
##$REVERSE= no
##$SF= 250.130019771383
##$SI= 32768
##$SIGF1= 0
##$SIGF2= 0
##$SINO= 400
##$SIOLD= 32768
##$SREGLST= <1H.CDCl3>
##$SSB= 0
##$STSI= 32768
##$STSR= 0
##$SW_p= 5175.98343685301
##$SYMM= 0
##$S_DEV= 0
##$TDeff= 65536
##$TDoff= 0
##$TI= <Analysis number 999999
Compound Code 99
Book Reference 9
Project Code 9>
##$TILT= no
##$TM1= 0
##$TM2= 0
##$TOPLEV= 0
##$USERP1= <user>
##$USERP2= <user>
##$USERP3= <user>
##$USERP4= <user>
##$USERP5= <user>
##$WDW= 1
##$XDIM= 32768
##$YMAX_p= 423425882
##$YMIN_p= -488145
$$ End of Bruker specific parameters
$$ ---------------------------------
##NTUPLES= NMR SPECTRUM
##VAR_NAME=  FREQUENCY,     SPECTRUM/REAL,   SPECTRUM/IMAG
##SYMBOL=    X,             R,               I
##VAR_TYPE=  INDEPENDENT,   DEPENDENT,       DEPENDENT
##VAR_FORM=  AFFN,          ASDF,            ASDF
##VAR_DIM=   32768,         32768,           32768
##UNITS=     HZ,            ARBITRARY UNITS, ARBITRARY UNITS
##FACTOR=    0.157963299565203, 1,           1
##FIRST=     4112.87523226919, 0,            0
##LAST=      -1063.10820458382, 0,           0
##MIN=       -1063.10820458382, -488145,     0
##MAX=       4112.87523226919, 423425882,    0
$$ Real data points
##PAGE= N=1
##DATA TABLE= (X++(R..R)), XYDATA
$$ [...]
17634A759730n5775J0946K8141K1337j26090n3956p7996o9046M7389k9881J31013
17623A585812Q0280M3455J04969O1951J02330J01470M8568J08318P8285J43987
17613B459425J71528K63815J96151P1545M4711O0733M3903l8544o4883j4580K7833
17602C221637K3057P7608P4271L6971o439j19555j58450j76740j77063j63325
17592B631972m3009l3628o8857K8793k7684m2781m0803k5276j72275n7600k9067
17581B119785l6218K1251r0697o0145J36834L2032R9253O0454k7138M3874J13700
17570B412985J06315Q9766J55937J35501J32590K24499J81264J68260K33401O9612
17560C910130Q7639M6663J0658q4233n8053J09344J35091O4183L4454r8038j74022
$$ y = [1759730, 1703955, 1714901, 1743042, 1764379, 1638289, 1584333, 1506337, 1437291, 1484680, 1454799, 1585812, 1666092, 1709547, 1814516, 1876467, 1978797, 2080267, 2128835, 2237153, 2315438, 2459425, 2630953, 2894768, 3090919, 3162464, 3207175, 3267908, 3311811, 3273267, 3208384, 3193804, 3221637, 3244694, 3322302, 3396573, 3433544, 3427105, 3307550, 3149100, 2972360, 2795297, 2631972, 2588963, 2555335, 2486478, 2515271, 2487587, 2444806, 2404003, 2378727, 2206452, 2148852, 2119785, 2083567, 2104818, 2014121, 1953976, 2090810, 2122842, 2222095, 2282549, 2255411, 2299285, 2412985, 2519300, 2609066, 2765003, 2900504, 3033094, 3257593, 3438857, 3607117, 3840518, 3910130, 3997769, 4044432, 4055090, 3970857, 3912804, 4022148, 4157239, 4221422, 4255876, 4157838, 3983816]
17549C983816j40237o4709k08811j58611j48837o6166p2421o4925K369j15242
17539B946226j60036j8882K5053q628Q5666M85O2136Q382K0741o342O2309J0301
17527C027411M7607R1678R5439J39267O1802J00447L2489R3787Q4829J67819M0165
17516C982740p7132M5258O1243l329n811R431k3220M5255J27768J74265J22178
17505D458646K35402J68681J10214Q3302M2480l848R068Q9541N0165r2891n3357
17494E097403K26n4496j26824Q3196J73115J39100P1320K341K18615J39126P3832
17483E816954K46632K32480J11250J63973J32436J90016K46487K24822K44390
17474G609440L33076L31028K95615M25789O36907O44688N67266P66822R34700
$$ y = [3983816, 3843579, 3778870, 3570059, 3411448, 3262611, 3196445, 3124024, 3059099, 3061468, 2946226, 2786190, 2767308, 2792361, 2783733, 2869399, 2869884, 2932020, 2940402, 2961143, 2954801, 3017110, 3027411, 3075018, 3166696, 3262135, 3401402, 3463204, 3563651, 3596140, 3689927, 3774756, 3942575, 3982740, 3905608, 3950866, 4012109, 4008780, 4002969, 4012400, 3989180, 4034435, 4162203, 4336468, 4458646, 4694048, 4862729, 4972943, 5056245, 5098725, 5094877, 5103945, 5193486, 5243651, 5150760, 5097403, 5097629, 5043133, 4916309, 4999505, 5172620, 5311720, 5383040, 5385381, 5603996, 5743122, 5816954, 6063586, 6296066, 6407316, 6571289, 6703725, 6893741, 7140228, 7365050, 7609440, 7942516, 8273544, 8569159, 8994948, 9631855, 10276543, 10843809, 11610631, 12545331]
17465A2545331J004668J010351J148019J336229J674765K052650K557579L186445
17457B6516037M317276N709381Q074965J1351452J4264788J6238469J6972065
17450A03444433J5667215J1947973P166984K392751j446064l111665j925054J176154
17442A35312727M244777O786257P839918N660554J010340m130723r279753j3876962
17434A33567135j6297479j6795602j6017725j4102315j1630249r381318p157534
17427D2184913n364767m033248k842326k003899j346606q30242j45338N22469
17419B6140956O99074J155665J715416K157143K657371K883700L043960L445342
17411D3898627M310399N546426P450015R943641J3256170J7598203K3024435K8400589
$$ y = [12545331, 13549999, 14560350, 15708369, 17044598, 18719363, 20772013, 23329592, 26516037, 30833313, 36542694, 44617659, 55969111, 70233899, 86472368, 103444433, 119111648, 131059621, 138226605, 140619356, 139173292, 136061627, 134136573, 135312727, 139557504, 146343761, 154183679, 159844233, 160854573, 156723850, 147444097, 133567135, 117269656, 100474054, 84456329, 70354014, 58723765, 49342447, 42184913, 36820146, 32786898, 29944572, 27940673, 26594067, 25763825, 25618487, 26140956, 26840030, 27995695, 29711111, 31868254, 34525625, 37409325, 40453285, 43898627, 48209026, 53755452, 61205467, 71149108, 84405278, 102003481, 125027916, 153428505]
17403A53428505L2246323L3696047K8835970J8199573P512625r53425o699926
17396B66265692o918777j935579N823958J4155979K1198702K1945972J2956406
17389C33492353o49273j3536502k4974671l3219248l6257438l5553864l2723304
17382A56578053k8398718k3205598j8342075j4555060j1175742q431764o120351
17375D6348745m351736k802612j470902n53785J96549Q13364J481520K233296
17367D1894439L147999L516302L699120M053718N082043P161899R647827J1590773
17359H9794120J3475779J7288154K3479072L1660051L8681484L5373891J9243391
17352B68995942L33074j4009464k2783600k4648296k0125405j2716976m219675
$$ y = [153428505, 185674828, 219370875, 248206845, 266406418, 273919043, 272965618, 266265692, 259346915, 257411336, 263235294, 277391273, 298589975, 320535947, 333492353, 332843080, 319306578, 294331907, 261112659, 224855221, 189301357, 156578053, 128179335, 104973737, 86631662, 72076602, 60900860, 52469096, 46348745, 41997009, 39194397, 37723495, 37169710, 37366259, 38179623, 39661143, 41894439, 45042438, 48558740, 52257860, 56311578, 61393621, 68555520, 78203347, 89794120, 103269899, 120558053, 144037125, 175697176, 214378660, 249752551, 268995942, 269329016, 255319552, 232535952, 207887656, 187762251, 175045275, 170825600]
17345A70825600N374309J2715824J1262323J171916j0235980j8590427k3499371
17338A49024194k4192279k1634371j8062193j4842194j1688172q913300o569914
17331D3121771m864483l668868k659850j868686j119277n28279J7345P45929J435296
17322C0610898K238460L772543N307574O042994M882467K791983J177695O8375
17314E6892989M0773J276150L901557P742761J3552142K2062063L1501563L3940282
17306A70910280K3319844O852552o735427j6328640k0647331j8849228j4116566
17299A24405484p585141J053311J0063121J2947772O132083l546650j1154943
17292A32315037j6584278j8480184j7101163j4700972j2581679j0195891p791739
$$ y = [170825600, 176199909, 188915733, 200178056, 201349972, 191113992, 172523565, 149024194, 124831915, 103197544, 85135351, 70293157, 58604985, 49691685, 43121771, 38257288, 34588420, 31928570, 30059884, 28940607, 28412328, 28429673, 29175602, 30610898, 32849358, 36621901, 41929475, 47972469, 52854936, 55646919, 56824614, 56892989, 56933762, 58209912, 62111469, 69854230, 83406372, 105468435, 136969998, 170910280, 194230124, 201082676, 194347249, 178018609, 157371278, 138522050, 124405484, 116820343, 117873654, 127936775, 140884547, 147016630, 143469980, 132315037, 115730759, 97250575, 80149412, 65448440, 52866761, 42670870, 34879131]
17285C4879131n914815m431104l145052k287915j825562j381487j192349r63435
17277A3737412p18961o27102m62805j77107N7847J23117J70245L3260J29304J94182
17267A2459392j70759k56250j71287j47821l16384k39826o5275j62972J513L7607
17257A0967938K67758N11402O02587O24533P37404P71847R25606J078810J180246
17248A7668131J449449J792647K508585L285860M384680O079977Q606331J2640220
17240E8415880J8504318K4701030K5261523J7168678O444151k133618q091343
17233A40270619r668896o787117j865518L981551J1417994K0218556K4592579
17226A82159768J7652344L595491q775973j7604219k1925284k0742690j7047208
$$ y = [34879131, 28964316, 24533212, 21388160, 19100245, 17274683, 15893196, 14700847, 13737412, 13018451, 12391349, 11928544, 11751437, 11809284, 11932401, 12102646, 12135906, 12265210, 12459392, 12288633, 12032383, 11861096, 11713275, 11396891, 11157065, 11091790, 10928818, 10930331, 10967938, 11235696, 11747098, 12349685, 12974218, 13711622, 14483469, 15409075, 16487885, 17668131, 19117580, 20910227, 23418812, 26704672, 31089352, 37169329, 45775660, 58415880, 76920198, 101621228, 126882751, 144051429, 150495580, 148361962, 140270619, 130601723, 123814606, 121949088, 125930639, 137348633, 157567189, 182159768, 199812112, 203407603, 194631630, 177027411, 155102127, 134359437, 117312229]
17219A17312229j4418785j3121274j1958894j0748160r723992q503486o876359
17212D1961279n590318m301803l272614k378478j525932r57519n12809l45326
17204B3076480o2327K79047O66175J111288J449452K182553L031523L992274N340967
17195D1067432P372283J0729549J5756484K2368208K7022017K5527002J8434340
17188A68277315P987185k462163r548611j2326880j1040012o599601R41484J0343907
17180A45572624J8490250K1697765J8046508O754703o247352j5245247j9464274
17173A69604977j9557766j7435102j6036068j5457343j4446544j3119190j1490579
17166F2062385r461195p571294n842847m371654k849006j625837n00381P85234
$$ y = [117312229, 102893444, 89772170, 77813276, 67065116, 57341124, 48837638, 41961279, 36370961, 32069158, 28796544, 26418066, 24892134, 23934615, 23421806, 23076480, 23014153, 23293200, 23959375, 25070663, 26520115, 28702668, 31734191, 35726465, 41067432, 48439715, 59169264, 74925748, 97293956, 124315973, 149842975, 168277315, 176264500, 173802337, 164253726, 151926846, 140886834, 134287233, 135228717, 145572624, 164062874, 185760639, 203807147, 210561850, 204314498, 189069251, 169604977, 150047211, 132612109, 116576041, 101118698, 86672154, 73552964, 62062385, 52601190, 45029896, 39187049, 34815395, 31966389, 30340552, 29840171, 30625405]
17158C0625405K123698L733952M941453N015590M765746M130486K246258P6982
17150E7659570j066563j496998j043460L99259K417570M438408O431257Q566707
17142G6305750Q896280N152839j50981l897027o205982o671089n036099k390609
17134F6003082O66600M133530P632038Q291066M570344j55213l648014n815457
17126H1677976o261482m748592k593156p98443J153610L781744P552226J3349042
17118I3112925K1930225L2373025L8787025L7070878K9265952J4077716l719452
17111B62898294j5373234k0384985k0104060j4029391m814124N731510J4253825
17104B08177835J5810031J0935045P39401j2380991k2264387k6790243k7619669
$$ y = [30625405, 32749103, 36483055, 41424508, 46440098, 51205844, 55336330, 57582588, 57659570, 56593007, 55096009, 54052549, 54451808, 56869378, 61307786, 67739043, 76305750, 85202030, 90354869, 90203888, 86306861, 80100879, 73429790, 68393691, 66003082, 66669682, 70803212, 78435250, 86726316, 91296660, 91141447, 87493433, 81677976, 75416494, 70667902, 68074746, 67276303, 68429913, 72211657, 79763883, 93112925, 115043150, 147416175, 186203200, 223274078, 252540030, 266617746, 262898294, 247525060, 227140075, 207036015, 193006624, 188192500, 193924010, 208177835, 223987866, 234922911, 235662312, 223281321, 201016934, 174226691, 146607022]
17097A46607022k5187620k0679010j6059673j2350778r388948p440925o083146
17090D9416922n512854n012263m365128l823157l074566k401731j738267j048369
17082B2440587m79262j07086J73799N01469Q70791J041651J455544K129423L002896
17073C1029812M410590O635960J0201860J5654806K1937556K5350682K3699982
17066A38921248J9534578J1400130o06293r238015j2918177j3621545j0211561
17059A23260365l081158M693532R844482J0429111P910487R44435q625342j5188322
17051A30187590j8279080j9207331j7916658j5256186j2505338j0046831p660206
17044B9315960n725616m364710l233585k374454j924726j417960j217834j064158
$$ y = [146607022, 121419402, 100740392, 84680719, 72329941, 62940993, 55500068, 49416922, 43904068, 38891805, 34526677, 30703520, 27628954, 25227223, 23488956, 22440587, 21961325, 21854239, 22028038, 22529507, 23400298, 24441949, 25897493, 28026916, 31029812, 35440402, 42076362, 52278222, 67933028, 89870584, 115221266, 138921248, 158455826, 169855956, 169249663, 160011648, 147093471, 133471926, 123260365, 120179207, 124872739, 134717221, 145146332, 153056819, 154001254, 145375912, 130187590, 111908510, 92701179, 74784521, 59528335, 47022997, 36976166, 29315960, 23590344, 19225634, 15992049, 13617595, 11692869, 10274909, 9057075, 7992917]
17036G992917p86628m20565m63985n07893k94067k71825l42242k25593k68323
17027D411796l28173l52946k21131l05720k29724j93219k58561j20648r2845k71563
17017B037266j83792n3832j03715R506m383l4210k6361k1505k0675k4112P7444
17006A651631m7692p1773l6294n8215l5796R98j47656j50052q1601r2205n2647
16995H78698N075k8084J6694K785j17297j10764K6021l065N7344l3639l2510j36100
16983E25158L7861J44435j56612n6661J86670O1253q4639J0065k6250j32572Q77
16972E09585N6411j00653n81p3061j47728n4764k9336J73583Q2725J8462J5539
16961D50182L1700J4883n3546l9372p6351K237R8552L1457q06k3900Q051n4431
$$ y = [7992917, 7206289, 6785724, 6321739, 5813846, 5519779, 5247954, 4905712, 4680119, 4411796, 4083623, 3730677, 3509546, 3203826, 2974102, 2780883, 2522322, 2401674, 2308829, 2037266, 1853474, 1799642, 1695927, 1705433, 1701050, 1666840, 1640479, 1618974, 1598299, 1574187, 1651631, 1603939, 1532166, 1495872, 1437657, 1401861, 1402859, 1255203, 1105151, 1023550, 931345, 878698, 883773, 855689, 872383, 875168, 757871, 647107, 673128, 670063, 727407, 693768, 661258, 525158, 563019, 707454, 550842, 494181, 680851, 742104, 657465, 667530, 641280, 508708, 509585, 565996, 465343, 464762, 391701, 243973, 189209, 159873, 333456, 416181, 434643, 450182, 481882, 496765, 443219, 403847, 327496, 329733, 428285, 459742, 458936, 435036, 443087, 388656]
16949C88656K3212J88870J02448L7911P3560J22162R6129J61322J63784L6230
16939A394284K4757J4641N6584L3542j5927l7941J2592M1015n7849O6323P5192
16928A607213o1140j56381j44677j34419j81982j74037m7432r8211j13244j15363
16918C80327n4864L2814k8095k6618q9213q3058o9406o7762L375l778R9746O5131
16906A58599m7911l1065L7108m6441Q2528J90211Q8571j01083Q0661J96318K3559
16895F31055J8282k5579J27246J47865J16584J52626K9517J1371M0784L9267l861
16884A285157R9746J16051K64712R2448j33173k12433j86661k7642j12177q6658
16874A099370m8534N42l5519m9049j26366j30681j31801k30754j9059l168r3822
$$ y = [388656, 411868, 600738, 703186, 741097, 814657, 936819, 1032948, 1194270, 1358054, 1394284, 1419041, 1433682, 1490266, 1523808, 1507881, 1469940, 1482532, 1523547, 1465698, 1532021, 1607213, 1546073, 1389692, 1245015, 1110596, 928614, 754577, 707145, 608934, 495690, 380327, 325463, 358277, 330182, 303564, 214351, 131293, 61887, -5875, -2500, -6278, 93468, 158599, 110688, 79623, 116731, 70290, 152818, 343029, 431600, 330517, 411178, 607496, 631055, 649337, 623758, 751004, 898869, 1015453, 1168079, 1197596, 1208967, 1249751, 1289018, 1285157, 1384903, 1500954, 1765666, 1858114, 1724941, 1512508, 1325847, 1298205, 1186028, 1099370, 1050836, 1051378, 1015859, 966810, 840444, 709763, 577962, 347208, 328149, 324981, 231159]
16863B31159j66619j40501q8484M7708P6576R930o3231K734J18445L9420l6126
16852C1011l8285o946Q2996Q1436L2508o2059o2139O6511J29587P4005M094j8582
16840C14137J05257J34629N8397n0139P480J01641J03361J06178J45023n7724
16830I68240o6516Q5949q0131p3346J00124m3614q4873n6707p1180j29688j42830
16819D05428j70090j0926l9204j465j29701j45975M0727N9097P8569p0341j47460
16808a31341O1139k6101j08149k038L3933J3337J3493l3788l7718K0571l9904
16797b36566o334K7416J17683R6683k8368o400M1863M1518P9078R0319J0274j18835
16785A08331k1234K7362J28398l310M5379J47162J07819k2798j11125l1789n4670
$$ y = [231159, 64540, -75961, -164445, -116737, -40161, -30231, -93462, -90728, 27717, 67137, 31011, -7274, -14220, 68776, 150212, 182720, 120661, 58522, 125033, 254620, 328625, 332719, 314137, 419394, 554023, 612420, 562281, 569761, 671402, 774763, 880941, 1025964, 968240, 901724, 987673, 907542, 834196, 934320, 890706, 805833, 749126, 677946, 548258, 405428, 235338, 224412, 185208, 183743, 54042, -91933, -51206, 7891, 86460, 16119, -131341, -70202, -96303, -204452, -206490, -172557, -159220, -145727, -179515, -217233, -196662, -236566, -242900, -215484, -97801, -1118, -29486, -35886, 5977, 47495, 126573, 216892, 227166, 108331, 87097, 114459, 242857, 239547, 284926, 432088, 539907, 517109, 405984, 374195, 319525]
16774C19525q6132J2028r2547j38481J3754j50115j52736J18060J07287R708j40316
16763a79965j18213K2202P9120Q107L7753j5766n7375k9469p3396k2397J6439
16752c32960M1017O8151P0232r637K3942k8608r4470j37659q8153M3529r410N4297
16740c99729J26080J44700M3744m6902K5753l0576K2456J15605Q5082L1729J3249
16729A31191L5380J67141k1003p8140L9260R8545J19843J3012J3763p2762k2952
16718D23278j7921m28R691q147q4718J6561k5554j2919j3600q2660k7865l0481
16706A45237j09250j06134O2842n9394j1166K5022j7344o1659n1118m6364P0521
16695a58807J20541k1353L6479n0399R218J09519N7749J0868n0699m3211Q0826
$$ y = [319525, 233393, 245421, 152874, 14393, 28147, -121968, -274704, -156644, -49357, -39649, -179965, -298178, -275976, -196856, -188749, -150996, -166762, -224137, -253606, -327002, -349399, -332960, -291943, -223792, -153560, -163197, -139255, -167863, -262333, -399992, -488145, -444616, -454026, -399729, -273649, -128949, -85205, -132107, -106354, -136930, -114474, 1131, 86213, 117942, 131191, 166571, 333712, 312709, 234569, 273829, 372374, 492217, 505229, 518992, 446230, 423278, 405357, 404929, 414620, 406473, 321755, 338316, 312762, 299843, 286243, 203583, 175718, 145237, 35987, -70147, -7305, -66699, -77865, -52843, -70187, -131846, -182964, -229328, -158807, -38266, -59619, -23140, -73539, -64321, 45198, 102947, 113815, 63116, 19905, 100731]
16684A00731J64431O9746Q7403J33134J41340J09483J24641N9167L02l8649J4812
16673I66541j7590n3823J5591k5221M0555M1120p9548j14549j14153o1303n0630
16662E46990L67p8940k45326j85808K7786N0099N3726J10485P6249j22449j04371
16651A28808l3112o2521j0866k3154k8474J1039k623N3583J2446n1753o8054k2240
16639i6921J6344J11209N4492K0880P1453R6978j10995J20945J48743k3324M3042
16628D52846K9479R416J1814O4922K0108J17255K82246K11578J99635L1600J01546
16617A532445M0504k35047k94581p5811J8213Q7474J13587R9429m8522o7851o5233
16606A104607k1387o3854j82701k08363j51132m8199m0926j15089j34881o4189
$$ y = [100731, 265162, 334908, 422311, 555445, 696785, 806268, 930909, 990076, 990378, 951729, 966541, 948951, 895128, 910719, 885498, 926053, 967173, 887625, 773076, 658923, 597620, 546990, 547357, 468417, 223091, 37283, 65069, 115168, 168894, 279379, 355628, 233179, 128808, 95696, 33175, 22309, -845, -29319, -18280, -20903, 32680, 45126, -6627, -74681, -96921, -80577, 30632, 85124, 106004, 177457, 274435, 163440, 284385, 433128, 409804, 452846, 482325, 491741, 503555, 568477, 588585, 705840, 988086, 1199664, 1399299, 1430899, 1532445, 1572949, 1337902, 1043321, 967510, 985723, 1073197, 1186784, 1286213, 1237691, 1169840, 1104607, 1083220, 1019366, 836665, 628302, 477170, 428971, 388045, 272956, 138075, 73886]
16596G3886j01277J4223n4471K1639L13k4387k5438j24803j44955K7727K6412
16585c11131J33302O9705J4928o0692n8435K4184J01890K8679L8531J13651J7156
16574A11768P0075J05591K65587J44069J06591r743m5706j05487o9461p2737l2852
16563D67695R063P1139J41663K1840j63350j72485l5039r8359j79765j06391J47955
16552A03966K0406j48184r4939k7306L0974r4832J11763P7915N6206J12476l0921
16541A17524o8250j11628L7395k6640L1726O5253k14k5849q370m9762m269k3546
16529f6630j59474k10515J1766J02955P1163Q2155J03198n089j283K1429P8887
16518B8562p1114k6075q5575j05219N9161O0133m1645j0173r8501O278O0509K7781
$$ y = [73886, -27391, -13168, -67639, -46000, -45687, -70074, -95512, -220315, -365270, -337543, -311131, -177829, -108124, -93196, -153888, -212323, -188139, -86249, -57570, -19039, 94612, 111768, 181843, 287434, 553021, 697090, 803681, 793938, 748232, 642745, 573284, 500547, 467695, 476758, 547897, 689560, 711400, 548050, 375565, 340526, 242167, 62402, -43989, 103966, 124372, -23812, -118751, -146057, -115083, -209915, -98152, -20237, 35969, 148445, 117524, 49274, -62354, -24959, -51599, -19873, 45380, 45166, 19317, 10947, -38815, -43084, -66630, -226104, -436619, -424853, -321898, -250735, -168580, -65382, -70471, -71754, -50325, 28562, -42552, -68627, -154202, -259421, -200260, -140127, -181772, -191945, -290446, -284168, -223659, -195878]
16506a95878N8951j04256k8139m8802R8997l040k1470n0785j72595L1950M4522
16495c90545J29883O4043n188l1139q8939K1340J6859j6205J14244M9056J2472
16484a24119K5215l3561j5667o0400j3032J30481N4975K5318l1209K9814j8347
16473c0532q6118K5733M4230J9761K6723J3715l0117o2026J32071L581j45893
16462h8872q3750k7972L1683J21395N5039K9813j5351l3223p7666p1571j4331
16451a74806K9467o6838P9227L60j18422o7097L1568P9772p8834L0853N7264N2512
16439a44974N453n0060j6804N0869l5977O3664j2396o7893J01596O8341m1156
16428g9337j02991p5168l0846O0342m741k4812n0220J25137m5276n5184m4288
$$ y = [-195878, -136927, -241183, -269322, -318124, -219127, -222167, -243637, -294422, -467017, -435067, -390545, -260662, -196619, -201807, -232946, -321885, -300545, -283686, -299891, -185647, -136591, -124119, -98904, -132465, -148132, -208532, -221564, -91083, -36108, -10790, -41999, -12185, -30532, -116650, -90917, -46687, -26926, -203, 13512, -16605, -78631, 53440, 57021, -88872, -172622, -200594, -168911, -47516, 7523, 37336, 21985, -11238, -88904, -160475, -174806, -145339, -212177, -132950, -132590, -251012, -318109, -286541, -206769, -285603, -254750, -197486, -144974, -139521, -189581, -206385, -155516, -191493, -127829, -140225, -208118, -106522, -38181, -79337, -182328, -257496, -288342, -228000, -232741, -257553, -307773, -182636, -227912, -283096, -327384]
16417c27384M982P828Q8036J17144n0722j0289j89J7716L9949J5339J049p1438
16405a67979N2858K3802j54772r9349Q6503L8932J4776P9061j9148N9791J31721
16394D6196j3308j34370r423J02693j22996o9329M6571P0457k453K0100m2543
16383a08405R564k4486l9504j8970k3426R3801j5604j9921r240o2822j9777l3409
16371b72199J0684j6728L3300L5607J9958M9942N4683J0498p3236O3709q884j4610
16359a07276J668N3812j4299J7423j3850k8132O968j01224k6154P6302L7791J15601
16347A8630K634p5841o9721m8834j00259n5706m2641R3248J58142P2413l7199
16336h5134j8566K8584J828o4593m2020l3295P5436J39590k981k989N7770p812
$$ y = [-327384, -322402, -314574, -226538, -109394, -160116, -170405, -170594, -152878, -112929, -97590, -96541, -167979, -115121, -91319, -246091, -345440, -258937, -220005, -205229, -126168, -145316, -85525, 46196, 32888, -101482, -110905, -8212, -131208, -200537, -153966, -83509, -85962, -65862, -108405, -98841, -123327, -162831, -181801, -205227, -111426, -127030, -146951, -156191, -219013, -238790, -272199, -261515, -278243, -244943, -209336, -189378, -139436, -84753, -74255, -147491, -83782, -92666, -107276, -105608, -51796, -66095, -48672, -62522, -90654, -83686, -184910, -211064, -134762, -96971, 18630, 21264, -54577, -124298, -173132, -273391, -329097, -371738, -278490, -120348, -47935, -85134, -103700, -75116, -73288, -137881, -179901, -213196, -137760, 1830, -1151, -4140, 53630, 45818]
16324D5818o6067n5430r0918n0198J62264O734j10844p296l779k6024K3476k1800
16312a94064m5437P1099J70275n9184k4895k7942M5866J5601J3858p1126q2212
16301a88161k8541K9705L977L3481j7309J4662N7595q6583k0328n4077p4432n565
16289c35576J89236M4497n7332j00785r6715O1337P8605Q394k8819O0367J35209
16278d1582j00114K1177J5524p974l8849L0293k7781M456J1421K2935M4943L8877
16266b6674l205q6956n4055m6720K0870J6399j0220J60942L1519j2370J6016p5940
16254g0394n2396r553J01362J08760m8957L0191q6647k7960j7522j14568l9211
16243b26895p084r2884P0534k3532M0848O263N8966O3039o8848j8705J9648M8998
$$ y = [45818, -20249, -75679, -166597, -216795, -54531, -47797, -158641, -165937, -169716, -195740, -172264, -194064, -239501, -168402, 1873, -57311, -82206, -110148, -64282, -48681, -34823, -105949, -188161, -216702, -186997, -183020, -149539, -166848, -152186, -94591, -181174, -201502, -255579, -330011, -335576, -146340, -101843, -159175, -259960, -356675, -295338, -216733, -208339, -237158, -176791, -41582, -141696, -120519, -104995, -112969, -151818, -121525, -149306, -144850, -133429, -110494, -65551, -26674, -29879, -116835, -170890, -217610, -196740, -180341, -190561, -29619, 1900, -10470, 5546, -70394, -122790, -132343, -30981, 77779, 28822, 59013, -27634, -55594, -73116, -187684, -226895, -233979, -326863, -256329, -279861, -239013, -232750, -173784, -110745, -179593, -198298, -178650, -129652]
16231a29652K7819j19276k1680O5018Q936k2432j1592l7956k6324P329L9762K3719
16219a96329J8196j35620l5813P0539J6064p666L4267O8019j4894K7271Q6886
16208f9080o8430J8094n5866k1629J02174L6786m9592p266o4535L5685J77180
16197C3521K749j4852O1468m5632j20713o1546j6716M9639L5727M4792j36238
16186a67801m4174n3681j31525J43735J25444P1465r2121j24944J1560P6299J9961
16175a65782p657j12556L0560J57910j0022p6674o679l8296l553m1696j3219J17070
16163a70594p3188J2731K5771L5831k187p1554L5308P3110o7056M3194N3350m613
16151a09897n7302M4477J35134O8086m3295o2082n2777o708J20948J1643p3802
$$ y = [-129652, -101833, -221109, -242789, -177771, -168835, -191267, -202859, -240815, -267139, -259810, -220048, -196329, -178133, -313753, -349566, -279027, -262963, -270629, -236362, -168343, -183237, -155966, -69080, -137510, -119416, -175282, -196911, -94737, -57951, -107543, -114809, -179344, -143659, 33521, 36270, 21418, 82886, 37254, -83459, -145005, -161721, -112082, -76355, -31563, -167801, -211975, -265656, -397181, -253446, -128002, -56537, -148658, -273602, -262042, -185743, -165782, -173439, -285995, -255435, -97525, -107547, -184221, -190900, -229196, -232749, -274445, -287664, -170594, -243782, -231051, -205280, -169449, -171636, -243190, -207882, -134772, -201828, -158634, -105284, -109897, -167199, -122722, 12412, 80498, 37203, -24879, -77656, -84364, 36584, 48227, -25575]
16140b5575R90j1638o7106p051q2068J06082J25101N9304p1719p8643J570K8474
16128b2279L9571q5800j090q4228r3076P2558Q1915k4199j7462J9491J26580K1854
16116C3835o2543m5849R3349J097l4217r68j6924q0906l9840L8337J1508J749
16104a01372K8913J09948l5689q982K3248o2626Q780r2914j09214J6014J2504
16093b11390L3810O6914O1702l3360n4435L0757K8511K7325q3712p7074L0174
16082a80778j7674N1363k8047n4355J2234R3987k3139Q011p752L1103n0980p3099
16070b39126L9252R5435P5638l5184q7070j9331J05296R0191p81q7458j12342
16059a75480M5779J03760j0229n9452k6412m1326j6065N7415l3239J9915L9436
$$ y = [-25575, -24585, -36223, -103329, -110380, -192448, -86366, 38735, 98039, 26320, -52323, -50753, -22279, 17292, -68508, -69598, -153826, -246902, -174344, -92429, -116628, -134090, -114599, 11981, 33835, -28708, -74557, 18792, 19889, -14328, -15296, -32220, -113126, -152966, -114629, -103121, -101372, -72459, 37489, 1800, -7182, 16066, -46560, -37780, -130694, -239908, -223894, -211390, -177580, -110666, -48964, -82324, -136759, -106002, -77491, -50166, -133878, -210952, -180778, -198452, -147089, -175136, -229491, -217257, -123270, -146409, -138398, -146150, -115047, -166027, -239126, -199874, -104439, -28801, -63985, -151055, -170386, -65090, 25101, 24320, -63138, -175480, -129701, -25941, -36170, -95622, -122034, -163360, -179425, -122010, -155249, -135334, -95898]
16048i5898Q4137N7955k4280k83478p9061J14263R7037M4315p0678n5964K7636
16037a84016Q6321K7402m8412O247k7494j3883N0394l7973p7671K3244J08500
16026h7341L1841m7641l8423o37J5533n7943o7794j0949J9740J5597j6948j4402
16014b59367j9820J28152P9213j378o9274q5798K6250K8640P0703k1599N0275
16003g4003M8419j03710N7404K9513J5306j7982q5028J02055Q0428l8589j4437
15992f24k6838j07820k2702P041L5782L2332R3957j29464J299P5131N7000L3520
15980D8614M4700o6973p0190m4982J0484N2433k1688o6707l573J22274P3530p4152
15968C770k120m7072q9688q4401j2830R0224J29766L6523q7858J870J30231m4546
$$ y = [-95898, -11761, 46194, 21914, -261564, -340625, -226362, -129325, -85010, -155688, -211652, -184016, -97695, -70293, -118705, -112458, -139952, -153835, -103441, -141414, -219085, -195841, -87341, -55500, -103141, -141564, -142201, -126668, -184611, -252405, -263354, -243614, -228017, -244965, -259367, -279187, -151035, -71822, -73200, -142474, -228272, -202022, -173382, -102679, -124278, -74003, -25584, -129294, -71890, -42377, -27071, -45053, -130081, -28026, 52402, 13813, -624, -27462, -135282, -157984, -150943, -115161, -82829, 11128, -118336, -117037, -41906, 15094, 48614, 93314, 26341, -43849, -88831, -78347, -25914, -47602, -114309, -117882, 4392, 77922, 3770, 1650, -45422, -135110, -219511, -232341, -142117, -12351, 24172, -63686, -61816, 68415, 23869]
15956B3869o0555M9799O9668q0313j87699n3429J33750n2889l2930M7804N0613
15945i2312J21342J9463j44478K2272N3520k7949j0933R3140L3524m5972n9822
15934c8205k7667k55N4062l6801l2434M3191O702J3877j18007j19704M6841j14104
15922c22504O8370P0642l3084j3976L7056J1848K0373K5394p0566M0748M7054
15911a18645N6721M0025J290m3024K3416R4944N2635N132r3227k24542j19494
15900c24769J289P5031J70201j1423M0205R172j2009n8911P164l4249O5862R114
15888f3323o721q3584M0611L9827q7233R823Q7861l9919P8033j8763M2598O4659
15876F3869j15721j01410K3287k0268J0751j28642m2413m5870Q21K6026O937J13432
$$ y = [23869, -36686, 13113, 82781, 2468, -185231, -238660, -104910, -157799, -190729, -142925, -92312, 29030, 48493, -95985, -73713, -20193, -48142, -59075, 34065, 67589, 21617, -38205, -65872, -66127, -12065, -48866, -81300, -38109, -31407, -17530, -135537, -255241, -208400, -322504, -254134, -183492, -216576, -230552, -193496, -181648, -161275, -135881, -206447, -165699, -118645, -61924, -21899, -20609, -63633, -40217, 54727, 107362, 112494, 19267, -205275, -324769, -323480, -248449, -78248, -89671, -49466, -40294, -52303, -111214, -104050, -138299, -72437, -63323, -70044, -153628, -113017, -73190, -160423, -150600, -62739, -102658, -24625, -43388, -790, 63869, -51852, -153262, -129975, -150243, -139492, -268134, -310547, -356417, -355596, -329570, -322633, -209201]
15864b09201J09470k4169K8634k9833j48787K8796O9927O885n6863J07046m7717
15853a65812n3670j10499l5191M4099P4458J29627Q6494K0006j0004j97362q9222
15842c07076M4316J29706J60724L9379q6125p8961O8968q3594o0281J3547j7460
15831a76857K3876Q1584J21132J7466q6735q9822J4139J5712m4524L3138K5773
15820f5118p7861o4348J6366P8856Q894R723q193j348L5319o8293q6175P666O0888
15807a53624Q6316M7011n4781n8982p4474N3295M5882l0453M3129O1301l3388
15796f8768Q1226P1960j10682k1399K085K9022p7105n9147L3434J14808J08348
15785A03782p467j2299r7807r2050J7234K4725P2897j31257o8220j2216K16104
$$ y = [-209201, -99731, -123900, -95266, -125099, -273886, -245090, -175163, -168278, -225141, -118095, -165812, -219482, -329981, -365172, -321073, -246615, -116988, -30494, -10488, -20492, -217854, -307076, -262760, -133054, 27670, 67049, -19076, -98037, -29069, -112663, -172944, -159397, -176857, -152981, -71397, 49735, 67201, -19534, -109356, -95217, -79505, -124029, -90891, -65118, -142979, -207327, -190961, -112105, -103211, -93488, -101681, -103029, -67710, -136003, -222178, -214512, -153624, -67308, -20297, -75078, -134060, -208534, -155239, -109357, -139810, -96681, -35380, -68768, 12458, 84418, -26264, -47663, -45578, -16556, -93661, -152808, -119374, -4566, 103782, 96315, 84016, -13791, -105841, -88607, -63882, 9015, -122242, -190462, -202678, 13426]
15774A3426O9910j23705j07381n1118k334N6934N2537M7575K0253j01447m0748
15763a66098Q9674q573R74O2266O7754m1311j09981J589m238n2558j25862p779
15751b94143N9665J46008J19741j4811J1554o1853K5433Q56N3959j25388k16961
15740b95940j18M5879J85311N0468p0933k5408l2725j0261J7948J68219R242Q8277
15728A29959p7969J0724k8673n4882K7862p8954J9957k0046K4474k5902j73314
15717b46764k8412N0506M3539R2981J12285J06485m680r7473L3396J39871P9122
15706B80856l559p0338j5454m0273p0482o2534o1036N8275K5814m6165n4640r0455
15694a49991L0566O3868P3458K7797o152O27r8136j4026j466J7784n4237k1037
$$ y = [13426, 83336, -40369, -147750, -198868, -201202, -144268, -91731, -44156, -23903, -125350, -166098, -76424, -84997, -84023, -21757, 45997, 4686, -105295, -103706, -107944, -160502, -286364, -294143, -234478, -88470, 31271, 16460, 28014, -33839, -8406, -7550, 46409, -78979, -295940, -296058, -250179, -64868, -14400, -85333, -110741, -143466, -153727, -135779, 32440, 41682, 129959, 51990, 62714, 34041, -20841, 7021, -71933, -51976, -72022, -47548, -73450, -246764, -275176, -224670, -181131, -88150, 24135, 130620, 125940, 28467, 61863, 201734, 280856, 277297, 206959, 191505, 151232, 80750, 18216, -42820, 15455, 41269, -4896, -59536, -149991, -119425, -55557, 17901, 45698, 39546, 40173, -57963, -71989, -73455, -55671, -109908, -130945]
15682a30945J5066K1300O6779K2765l6597o8555l4656K9061Q532O7975p661O2773
15670A5837M9454j0972l0163n8265N784L4726K3251m2562j25114K6008K4884j5854
15658a02986J09589j56514l1644N2750K6259L5224R3713J7620M431r7004j2102
15647f0664K3607N2463n6513k6154P8615M7147m2669K0408p5597j04601J6806
15636a27152k5056P4257r759p1965L2143J1975l3894k0665J23125L3474J348o2107
15624g4276j02118j1636R0950Q7052k0661K2143L2367l3399q9723r5526k4156
15613b18983L6769J14612M9153L1062n214q3424j06758K115L7122j18041N3792
15602b07795L3155L8196J11133J1255k9982k9570Q4057L9483M2397o215q9407
$$ y = [-130945, -115879, -94579, -27800, -5035, -41632, -110187, -144843, -115782, -107250, -39275, -46936, 15837, 65291, 54319, 24156, -34109, -28325, 6401, 29652, -12910, -138024, -112016, -87132, -102986, 6603, -149911, -181555, -128805, -102546, -67322, 26391, 44011, 48442, -48562, -60664, -37057, 15406, -41107, -67261, 11354, 58501, 15832, 36240, -39357, -143958, -127152, -152208, -77951, -87710, -159675, -127532, -115557, -149451, -170116, -46991, -13517, -12169, -74276, -176394, -188030, -97080, -10028, -30689, -8546, 23821, -9578, -99301, -194827, -218983, -182214, -67602, -18449, 12613, 7399, -76025, -182783, -180668, -143546, -261587, -207795, -174640, -136444, -25311, -14056, -44038, -73608, 10449, 49932, 92329, 86114, -3293]
15591c293M2488k5557o3376n2055q5656j13279R3142J61690Q8062n7324p7789
15580i2947n337M8404K1435O2460l0399n3676M9189l1006p2612N508J61J631Q28
15567i6361K800O0561L2351k3018n7615n2094j2198N4924J8845R8065M5703N6713
15555A28676J4857K9334n7037j35853l9478n2872R339J29923P3886m4843k5509
15544C0423R2590k6682j31005j5540P6247J03134J13572j38594j72085P130M7393
15533a3417K0437K3380j8989J5764O5103N2243n6292r7156n4134K3730j8452P1802
15521A4019N1534Q997l947p0751m0291k9616J9922M1490M4393P8947r0619o5217
15509d1139P3407P1649p0821m8573P2740q9021k1989L2276J09858K7909o5536
$$ y = [-3293, 39195, 13638, -49738, -101793, -187449, -300728, -207586, -45896, 42166, -15158, -92947, -98284, -49880, -28445, 34015, 3616, -50060, -871, -31877, -104489, -98981, -98820, -97189, -96361, -93561, -33000, -649, -23667, -81282, -133376, -145574, -90650, -71805, 26260, 71963, 128676, 143533, 172867, 115830, -20023, -59501, -112373, -103034, 26889, 100775, 55932, 30423, 123013, 96331, -34674, -50214, 26033, 129167, 242739, 104145, -67940, -60810, -13417, 7020, 30400, 11411, 27175, 92278, 144521, 88229, -8927, -63061, -39331, -57783, 14019, 65553, 74550, 70603, -148, -40439, -70055, -50133, -8643, 35750, 114697, 24078, -41139, 32268, 103917, 33096, -15477, 57263, -31758, -53747, -21471, 88387, 116296, 50760]
15498E0760M7605N1896M0610j44648j69144q1404J10244J16900J10481N8675l0518
15487A61457m6724N0058r0332O0937Q3375r724J6422k2353j59439m5913p5785
15476g8021J978L131N0651O3073J7109j1808O8124j13826j24214M0959J19495
15465C6651r1344k2279n189l6369R1637P54J0518l1733K0491m1940L6091J49539
15453A16827O4360j1425J0805k7349m4025o3820j1718n6815k4032n0888l3915
15442a31995k6690M9376K4988O6953n1932m209n6758l4229N0763P3091r202L5453
15430a4391L604J3132k4739J8098p1388K9213K0013P2786n747O038k2601k8011
15418c993J9464m1331o5320o825O2240N9250M3016j8290J5355l3236q6209n7111
$$ y = [50760, 98365, 150261, 190871, 46223, -122921, -204325, -94081, 22819, 133300, 191975, 161457, 114733, 164791, 74459, 135396, 218771, 209047, 225469, 203116, 43677, -2236, -78021, -76043, -72912, -22261, 40812, 57921, 46113, 114237, 411, -123803, -82844, 36651, -54693, -76972, -82161, -118530, -26893, -26139, -15621, -47354, -26863, -68803, -32712, 116827, 181187, 169762, 180567, 153218, 109193, 45373, 33655, -23160, -47192, -98080, -131995, -158685, -109309, -84321, -17368, -69300, -73509, -130267, -164496, -113733, -40642, -49844, -14391, -10787, 2345, -22394, -4296, -75684, -46471, -26458, 46328, 40581, 46619, 24018, -3993, 15471, -25860, -91180, -98005, -35765, 23485, 66501, 48211, 63566, 30330, -55879, -112990]
15406a12990M0865O3488j01636o9688P5849J39298L7779k1580N5572q2387o3376
15395c8806n7534M8690M6316M4323L2328m0663m0253k2374n4386N1108N577J28583
15383A02909J9905Q55Q2278m8613K7783m3884q2167m1271m5446O1458J05703m7031
15371I2479j52779n5916L1911J19934R3085j5391j52174M501P8701m1209k1140
15360a7998L9758L926l6195K029N7076l67l9897k2034J0059J8897j1902L8650
15348D2002k0976l8057j24235o6019j2973M9261M6455M9679J2309L056j0678J7388
15336e2788R0065N4678Q4137l452j5639o8629n4648o0573n7751m9470m9251l686
15324a87007R9931M5920J58882N2707m8295p1261l4754p0558l3232J01031J0066
$$ y = [-112990, -72125, -8637, -110273, -179961, -104112, 35186, 72965, 51385, 106957, 24570, -38806, -96340, -47650, -1334, 42989, 75317, 34654, -5599, -27973, -82359, -31251, -25674, 102909, 122814, 123669, 205947, 157334, 185117, 141233, 59066, 17795, -27651, 33807, 139510, 92479, -60300, -116216, -84305, 35629, 128714, 113323, -38851, -34350, 44351, 3142, -17998, 21760, 25686, -10509, -8480, 48596, 48229, 8332, -13702, -3643, 15254, 3352, 42002, 21026, -17031, -141266, -207285, -220258, -170997, -124542, -74863, -62554, -59498, -70176, -52788, 37277, 91955, 176092, 172640, 157001, 88372, 33724, -26849, -84600, -134070, -183321, -187007, -87076, -41156, 117726, 170433, 122138, 50877, 16123, -54435, -87667, 13364, 23430]
15313B3430L0219J4102m8323j4467j490K0882m5760j12790O6206K5908j3400j04141
15301a59624j33971M0465K32758N3930Q0927Q1411k1649j26817j23191L2717P7617
15290C4573j09155k3209L9201k7555n4528R7297j6717j5030J39658l0335M8352
15279H2552P3582j3746j00284j60996M6473k0544O167J552K4011q946L2729j3083
15267e0533l660P2136J2033j32149J5586J25532O0689N6325R6262M3761q5076
15256B10906q0392R82j03433m0088L2343P1713K2114p5433k7149j16049q9670
15245a94156P9040K2912J17989M1823o5421j07372m3339L1892N1621M6365m4784
15234f3430j03632J34498P2504L2181J08768l0803j22514p9871J7902M8540L154
$$ y = [23430, 53649, 67751, 19428, 4961, 3471, 24353, -21407, -134197, -67991, -42083, -55483, -159624, -293595, -253130, -20372, 33558, 114485, 195896, 174247, 47430, -75761, -43044, 34573, -74582, -97791, -58590, -86145, -140673, -43376, -60093, -75123, 64535, 34200, 82552, 156134, 142388, 42104, -118892, -72419, -92963, -86796, -85244, -61233, -70179, -37450, -50533, -54193, 17943, 29976, -102173, -86587, 38945, 99634, 155959, 252221, 295982, 210906, 130514, 131496, 28063, -12025, 20318, 92031, 114145, 38712, 11563, -104486, -194156, -115116, -92204, 25785, 67608, 2187, -105185, -148524, -116632, -65011, -18646, -63430, -167062, -32564, 39940, 72121, 180889, 150086, 27572, -52299, -34397, 14143, 17297]
15223A7297l8538M8371K1478n1723r0077J6258K8908j02O1196O2403q166J451
15211F8756q0035K4804L7921p7479k4332p6779j10093j9053O2027J18569K6315
15200d9379K5394J40085k2106n7792M8720K3778M029R1867m6224j17422P9098
15189A20048l0941q1679p7743L4202m5376O267Q7772K3241J18401M5405r1531
15178A08066l4449M1172M9027k0410p9878n1856N8452Q7470O5785O715r3020m3457
15166I3617M1841Q1871m6936j647p7233k0590K1106R5619q3830r1926j058j6980
15154f146N0727q596o8758m3194P9654n7603k5738J5326j684m9569R3883m6758
15142f8456J1161J43005r176j51797m3639J51699N3625k0886o6056J7655R4930
$$ y = [17297, -21241, 27130, 48608, -3115, -93192, -76934, -48026, -48128, 13068, 75471, 67305, 68756, -11279, 13525, 51446, -26033, -50365, -127144, -237237, -256290, -194263, -75694, -49379, -23985, 116100, 93994, 36202, 84922, 108700, 112729, 204596, 158372, 40950, 120048, 89107, 7428, -70315, -36113, -81489, -75222, 12550, 35791, 154192, 199597, 108066, 73617, 114789, 163816, 143406, 63528, 11672, 70124, 157594, 223379, 230094, 137074, 93617, 135458, 217329, 170393, 168746, 91513, 70923, 92029, 187648, 103818, 11892, 10834, -6146, 44581, 35985, -32773, -75967, 3687, -53916, -79654, -64328, -66012, -115581, -21698, -68456, -57295, 85710, 76534, -75263, -118902, 32797, 86422, 65536, -520, 17135, 112065]
15131A12065Q7027m5777q7803m9478N663M5297r2857r0230l598L0976J26934M5012
15119H3231m0714r8737L1127J38628o4381j65898J2365M723k7864n515K8229J09492
15107D686M9297k6852l8459O1212K4377O5591l8538j61184o9134l5279m6536M5663
15095a65156J14591R9945Q082j8126k6054J0249R0367O4215L024k2961O5024m449
15083B18751p3413o176J27305P397p9290j34563m8944m3316K6626J9478L2540
15072D6395J00855j7310k2567n0118K8426j2395R913m8820J6442J14777R460o6746
15060A08312k1618n4935N2923P1499m5104m3499m7968k6595j70987M778J18355
15049e4839J18785L6621n6833j9873J4410m3362q8038L7990L2861J8637O2055
$$ y = [112065, 199092, 153315, 65512, 16034, 21697, 66994, -25863, -116093, -119691, -88715, 38219, 83231, 42517, -56220, -25093, 113535, 49154, -116744, -104379, -99656, -127520, -133035, -104806, 4686, 53983, 27131, -11328, 49884, 74261, 139852, 101314, -59870, -129004, -164283, -210819, -165156, -50565, 49380, 57462, 39336, 13282, 23531, 113898, 178113, 181137, 158176, 223200, 218751, 145338, 139162, 266467, 273864, 194574, 60011, 11067, -32249, -5623, 13855, 46395, 147250, 129940, 107373, 57255, 85681, 73286, 83199, 34379, 50821, 165598, 175058, 108312, 86694, 31759, 84682, 156181, 111077, 67578, 19610, -6985, -177972, -173194, -54839, 63946, 100567, 43734, 23861, 38271, -5091, -93129, -55139, -22278, -3641, 58414]
15038E8414M0323p1438j27038N3436N8244P0536K5444O4923l6130m3311Q173O3005
15026A64581K4110o253p7421j44156q4261Q4310P2460j21257j0821M7907Q4485
15015C3684L0454L9482o4606J490L967q9832P4132K4566J5987L7094P4366j59965
15003B0819k5651O2053L6770O2918J6905k5754k5497r6921n3728J8965P9487L1373
14991A01739n5780p1374L2034J0125k6985M18P2394Q0141j7756j06578m0806Q4691
14979F2263J458m4505q8935l5743k9662j0609J16752J64550j7745Q780J33158
14968B59762J9764n2961p5048j8117q5787P546M255K2476M2858l746J59159L7399
14956C17560j03511K7184j5316j6946k6108L255O4410j0312k3419k0636k2146
$$ y = [58414, 98737, 27299, -99739, -46303, 11941, 82477, 107921, 172844, 136714, 93403, 101576, 164581, 188691, 182438, 105017, -39139, -123400, -39090, 33370, -87887, -98708, -50801, 33684, 64138, 103620, 39014, 40504, 44471, -45361, 28771, 53337, 69324, 106418, 180784, 20819, -4832, 57221, 93991, 156909, 173814, 148060, 122563, 25642, -28086, -9121, 70366, 101739, 45959, -25415, 6619, 16744, -10241, -9823, 62571, 142712, 124956, 18378, -22428, 62263, 63721, 19216, -69719, -105462, -135124, -145733, -28981, 135569, 117824, 126604, 259762, 279526, 226565, 151517, 133400, 47613, 55159, 59414, 81890, 124748, 121002, 280161, 317560, 214049, 241233, 225917, 208971, 182863, 186118, 250528, 240216, 216797, 196161, 174015]
14945A74015l3253M2154n039M5437m2768m7003N5581R7323j00414n3846n0925
14934H1262n755N154k4677k0166J684P3500M4275L7036p4049j12961O552K3775
14922C5630L5178L131j991J2839Q823J2307L2723J95889j9721p6965q96q0126
14910A56821p9873n4066l5526N4882K1054N3542m195M8421j20688j1606j4184
14899A4582p1473J3759J72539L7434p1787p3740k0399L6816M4695R2063j74493
14888dN693K9950j09585r303O3172O8805Q4810L2135L5987o3013j21101p0343
14876e2797R6072P4274o4230o2080L06n2836M866J7167J8720P8195N6279j161
14864A12775O2226R9683m9976r3329k0590K3786R840j09172j3661P5591j1278
$$ y = [174015, 140762, 182916, 177877, 223314, 180546, 133543, 189124, 286447, 186033, 132187, 81262, 75507, 80661, 55984, 35818, 37502, 111002, 155277, 192313, 118264, 5303, 11855, 35630, 70808, 73939, 71948, 84787, 93610, 105917, 138640, 334529, 314808, 237843, 236947, 156821, 76948, 22882, -12644, 42238, 63292, 116834, 112639, 161060, 40372, 28766, 14582, -56891, -43132, 129407, 166841, 95054, 21314, 915, 37731, 82426, 174489, -4, 5689, 35639, -73946, -83249, -20077, 48728, 133538, 165673, 201660, 138647, 17546, -52797, 43275, 117549, 53319, -8761, -8455, -61291, -56425, -39258, -20538, 57657, 113936, 112775, 175001, 274684, 224708, 131379, 110789, 134575, 144415, 35243, 21582, 97173, 85895]
14853H5895K69K0394k9409n0090r4076j8233K1780l9356q8788J42326N0622o1797
14841f0463Q0109M9177L6443J13061m9540j18318l1452J3692O1461K7096o3910
14830E7356L2774M7987R683K0077q2131N8830K1937R038m4515P6448M1775M5953
14818B95212p0586j51321j64535n7166J15309P3926K6328K9883O7372J8024j30401
14807E2045L6992R4418K9367M9580l7535k8053j4677O8303p7482k218k4624l6811
14795A09305J4259L6922p4971q2193J38431k9092j5183J0519r802N5568m3521
14784A10242l4628l0269k8788j15390r0622P3756J66441J47007J5840j6662M606
14773B01533j9899r718j34253l2358l2623j19508Q9359J07492K5083n1191L3871
$$ y = [85895, 86164, 106558, 77149, 27059, -67017, -85250, -63470, -102826, -191614, -49288, 1334, -60463, 19646, 68823, 105266, 218327, 168787, 50469, 19017, 32709, 94170, 121266, 57356, 90130, 138117, 147800, 167877, 85746, 144576, 166513, 175551, 131036, 207484, 249259, 295212, 224626, 73305, -91230, -148396, -33087, 40839, 67167, 97050, 164422, 182446, 52045, 89037, 183455, 212822, 262402, 224867, 196814, 182137, 250440, 172958, 170740, 146116, 109305, 123564, 160486, 85515, 3322, 141753, 112661, 97478, 107997, 98195, 153763, 110242, 75614, 45345, 16557, -98833, -189455, -115699, 50742, 197749, 213589, 196927, 201533, 181634, 171916, 37663, 5305, -27318, -146826, -57467, 50025, 75108, 23917, 57788]
14762E7788J06021P359n9199j44864k08851o5644J40710J20909J0188n072P5170
14751C4515P5634L5858m0094j17784K4745o629Q5613L9803q1092p1139M8237K5071
14739E2738p6545j2115Q363o181n0049J18600J4489k1835l2883O9266J45314K6035
14727B35197j29188j34725J2908J08039j7662p464j1229k787K7428J70958J0289
14716B61764J0774j9239l6016k5053J5382Q2q117p753n6651j02851k145J37161
14704A67338M4165l0764k07453J9893J27188K630r4101n727J43082J0691K4479
14693B01421R0537n5885p1376Q4376P5632L0529P604l0687J9924r0810q590L9180
14681B91855k7618o143N2297R3409l9135j13281j43375m9271r869m518K7118l3653
$$ y = [57788, 163809, 171168, 111969, -32895, -241746, -307390, -166680, -45771, -35583, -40655, 34515, 110149, 146007, 105913, -11871, 12874, 6245, 91858, 131661, 50569, -20570, 27667, 52738, -23807, -35922, -27559, -33740, -83789, 34811, 49300, 27465, -5418, 63848, 209162, 235197, 106009, -28716, -15808, 92231, 74569, 67105, 55876, 53089, 80517, 251475, 261764, 272538, 253299, 217283, 192230, 207612, 207694, 199577, 191824, 135173, 32322, 30177, 167338, 211503, 180739, -26714, -6821, 120367, 122997, 28896, 23169, 166251, 176942, 201421, 291958, 236073, 164697, 249073, 324705, 355234, 362838, 332151, 352075, 261265, 252675, 291855, 264237, 258094, 310391, 403800, 364665, 251384, 108009, 58738, 48869, 44351, 71469, 37816]
14669C7816m3808R771M0034J475J40802O9729k0548l8320R401K3134p3867k8938
14657A26681n4031R3630J09190N534j1673K4595j39831l2938J8409m1509j0628
14646H7429l1083R9273J01561k5408n1085l8679p1036j8520p7804L3446L5422
14635D3516P251N8914R2303L6935N7307J1534k8006j07623j15018o8578o7693
14624g9158R3533j8642m6228O9373Q9134l0597m5573m4304L0372k70M173m541
14612A7272J426J630K4350J28248q607j6973P8289J7812q4593P79N385k0657q5024
14599E9337J8759L2987O9963o542L6344L54n247J19608M7377k6629q5081m4020
14587B17210Q5841l8731j05968j3327P5308M9685Q8963Q4430J5907p5606j72680
$$ y = [37816, -5992, 3779, 43813, 45288, 186090, 255819, 235271, 196951, 206352, 229486, 155619, 126681, 72650, 166280, 275470, 281004, 269331, 293926, 154095, 121157, 139566, 98057, 87429, 56346, 155619, 257180, 231772, 180687, 142008, 70972, 52452, -25352, 8094, 43516, 50767, 109681, 201984, 238919, 296226, 307760, 279754, 172131, 57113, -11465, -79158, 14375, -4267, -50495, 18878, 108012, 77415, 31842, -12462, 17910, 17640, 21813, 17272, 18698, 20328, 44678, 172926, 164319, 147346, 225635, 243447, 158854, 159633, 165018, 144361, 59337, 78096, 111083, 181046, 174504, 210848, 211202, 205955, 325563, 372940, 346311, 261230, 217210, 303051, 264320, 158352, 145025, 220333, 270018, 358981, 443411, 459318, 383712, 211032]
14576B11032j35725l7205k349K9841M7037Q679P2949J05755K8860j40851m1032
14565A46991M5575J5981K9388o0298k6667K1231k0175J4635J4562j45972M1512
14554G6763L9550N7580j45359J3947J15556j7637j197q79K0854P7855J6079P586
14542B60698r3985n8328R618m9381N2820N1185p7080j6056O8885m7039P767J04026
14530B13130O6669k6072p0825L1697J18129L7116m6999p4351o3201q8291r3425
14519C577K8901L9740R1926m2355q6458R8437J25780J5349M9442o5149l5286J49652
14507C73556O9843o1823q3407K8396j2306K797O2126O090m4367M0783K9555K4794
14495D36037l7339n655J8451j5261j72674k7010M7110n4286l568R7704L0196j6018
$$ y = [211032, 75307, 38102, 35753, 65594, 112631, 121310, 194259, 300014, 328874, 188023, 146991, 192566, 208547, 237935, 177637, 150970, 172201, 152026, 166661, 181223, 35251, 76763, 116313, 173893, 28534, 42481, 158037, 140400, 139203, 138324, 159178, 237033, 253112, 260698, 166713, 108385, 118003, 68622, 121442, 172627, 95547, 79491, 148376, 101337, 109104, 213130, 279799, 253727, 182902, 214599, 332728, 369844, 322845, 248494, 185293, 97002, 3577, 32478, 72218, 164144, 121789, 35331, 133768, 259548, 274897, 324339, 259190, 223904, 373556, 443399, 381576, 298169, 326565, 314259, 317056, 379182, 385272, 340905, 381688, 411243, 436037, 398698, 393043, 411494, 396233, 223559, 196549, 243659, 189373, 185805, 283509, 313705, 297687]
14483B97687M8183J4106K8036j15053K0098M169o2990M363N3909L3969j7877j16247
14471A92353q8796L265K1664o1418o602K5354l9723N7753J34360k163L5485N5967
14459C27499J7417o1743l0613n9709P6195k6895n8880J02334K0075k2568j33095
14448A50017j40612N5280J55325J05315m0269m627k7128j04698j253K0500K8380
14437A96230k0156Q49Q7783N1712q6839N6521n1366j50987r8027O2484M5545J1397
14425A05146L980K3715N3967J4560k0127k5215R8976N5024p5728r8503q090M8509
14413A76214q8014O1910P9757Q0858O7457l6302k271n0872p2100P6553K3523j02860
14401B13853r2619j43219P30L6894J27546N1109m8189Q5504K0130K0534K6695
$$ y = [297687, 345870, 359976, 388012, 272959, 293057, 297226, 234236, 238599, 292508, 326477, 308600, 192353, 103557, 106822, 128486, 67068, 60466, 85820, 46097, 103850, 238210, 236047, 271532, 327499, 344916, 283173, 252560, 192851, 269046, 242151, 183271, 285605, 305680, 283112, 150017, 9405, 64685, 220010, 325325, 285056, 280429, 253301, 148603, 147350, 167850, 196230, 176074, 176923, 264706, 316418, 229579, 286100, 234734, 83747, -14280, 48204, 93749, 105146, 109126, 132841, 186808, 201368, 181241, 156026, 255002, 310026, 234298, 135795, 127705, 176214, 88200, 150110, 229867, 310725, 378182, 341880, 339609, 288737, 216637, 293190, 316713, 213853, 121234, -21985, -21255, 15639, 143185, 194294, 146105, 231609, 251739, 272273, 298968]
14390B98968L5274p6290k7523R0220j073j43122m2718J15000P1331k8656L9213
14379C30624L6590R0769m5218q2769L3742P3627j1514j3302o7443o3560l1379
14368B50167K5528L1713K5741q034P064l6465l4181q355r7542o9423M0677J2890
14356A39780K8343k0773o1530J32210J61515M33m7296m3624M3414J363J3462n7702
14344B89595j05211o581N9556k7363j114Q4295M8883o3390k6128O9630N1072K8438
14332D01682n802j19958k383M5048J25185R936K892j26395q9346m0757O7618M3610
14320C11330o3309l3360K4154L3081L4147m1438n3036N820J10907R8231n0420
14309C76107q9107p9684p247K3247R328J00777P1470N7533K9277p4692q6472n3613
$$ y = [298968, 334242, 257952, 230429, 320649, 319576, 176454, 133736, 248736, 320067, 291411, 330624, 367214, 457983, 412765, 329996, 363738, 437365, 425851, 412549, 345106, 281546, 250167, 275695, 307408, 333149, 325115, 332179, 295714, 261533, 253178, 155636, 86213, 126890, 139780, 168123, 147350, 85820, 218030, 379545, 379978, 332682, 289058, 332472, 333835, 347297, 289595, 184384, 177803, 237359, 209996, 208882, 293177, 342060, 278670, 252542, 322172, 373244, 401682, 395880, 275922, 273539, 318587, 443772, 453708, 456600, 330205, 240859, 200102, 267720, 311330, 248021, 214661, 238815, 271896, 306043, 264605, 211569, 217389, 328296, 426527, 376107, 287000, 207316, 200069, 223316, 232644, 333421, 404891, 462424, 491701, 417009, 330537, 276924]
14297B76924L961j3227k916M190J07583k4585n7995K872j067m523k2775L87k448
14284B66381L6079p940j5789L3008m268m6597K8726K3829j42271L6451m555m8642
14272A54412K3197M0853Q2924m1498j8792J1492L9960P2759K6177J29959O8419
14261E89862j21906k06294j0076L946P2588L546Q2161n4385k0581K5801m802o9983
14249B89877j37740l8631O3212j6846J02630M0823k711N1911q5980O5817N459
14238C37821J22144l3681j7848p3448l4397R6651j35908o3397J8387P241m8543
14227A75022j09213j2040J23229L3309N74R3327J1921p0201j65892J9857P7765
14216A77658P2270N6091J0787m8928N5530l2406q9547J0130j3117k3896M3742
$$ y = [276924, 280885, 267658, 264742, 268932, 376515, 351930, 293935, 296807, 295740, 291217, 268442, 268829, 266381, 302460, 294520, 278731, 311739, 307471, 260874, 289600, 313429, 171158, 207609, 203054, 154412, 177609, 218462, 301386, 259888, 241096, 252588, 292548, 365307, 391484, 521443, 589862, 467956, 261662, 251586, 255532, 328120, 331666, 413827, 359442, 338861, 364662, 359860, 289877, 152137, 113506, 176718, 159872, 262502, 303325, 300614, 352525, 266545, 332362, 337821, 459965, 426284, 408436, 334988, 300591, 397242, 261334, 197937, 216324, 223565, 175022, 65809, 53769, 176998, 210307, 210881, 304208, 316129, 245928, 80036, 99893, 177658, 249928, 306019, 316806, 267878, 323408, 291002, 201455, 211585, 198468, 174572, 218314]
14205B18314Q6788K03490k684l8611j6941n9102j7411Q1820K5892R6189N2327
14194F30071l7289m5726j17289m1332O288l6192o0310q0678k3380o705J494M5620
14182B34572J1515O087R2978N5837J2423l6669j6960N1239P926J49O5710R0100
14170E74907j1496m3172j54130m7351m9350l4736l1944k446j5049J28417O746
14159C20396o3578L075n8320k5140q674o5490O1670J57343J07486N5757j01864
14148C82661q9908l0454j8444N0045m1084O5586p6965p0358k6286j9006N784Q9231
14136B20802Q3607M9715L481L2801O3784K1535k6488k6729r185M3688l5716k6383
14124C94912r4648q6116J7334N6618m4561R242J34524m0539r1175J24617J29122
$$ y = [218314, 305102, 508592, 505908, 467297, 450356, 391254, 373843, 455663, 481555, 577744, 630071, 592782, 547056, 429767, 388435, 394723, 358531, 298221, 217543, 194163, 187458, 188952, 234572, 246087, 252174, 345152, 400989, 413412, 376743, 359783, 411022, 418948, 419097, 484807, 574907, 563411, 520239, 366109, 318758, 269408, 234672, 202728, 200282, 185233, 313650, 320396, 256818, 259893, 201573, 176433, 167759, 102269, 163939, 321282, 428768, 484525, 382661, 292753, 262299, 243855, 293900, 252816, 318402, 241437, 171079, 144793, 125787, 131571, 220802, 304409, 354124, 357605, 390406, 454190, 475725, 449237, 422508, 413323, 457011, 421295, 394912, 300264, 214148, 231482, 288100, 243539, 252781, 387305, 346766, 255591, 380208, 509330]
14113E09330K329k8114j03274j09396l3307N4183O626K813L8040K2135J6189K1485
14101C99039O328N569q645M2309m6460R249L2249K2302L741l867p3317l6116J6764
14088C69145J19211n7092l4809r546N1037R452m5650K342K7125K5307m2637j00446
14076C13439R7330o828j5045m0860L4318P3103N6552j4233l0315n8834Q353R98
14064D17978q5352j8321O9048O0108m0138l7322N4200o3617O8803Q4341r6964
14053D12764j12243o950Q3815L8552M4258J5293O761M3795K3257j5969k4759p3679
14041D34895q0072o1386j19898m9049J22987N7306J2307J4209J53217M1829j54770
14030C71575m5046M0266N4459k3186p1017K7547M4124n6696N1712M8483r0641
$$ y = [509330, 511659, 483545, 380271, 270875, 237568, 291751, 298377, 301190, 339230, 361365, 377554, 399039, 405367, 410936, 402291, 444600, 398140, 407389, 439638, 461940, 465681, 461814, 388497, 352381, 369145, 488356, 431264, 396455, 386909, 437946, 447398, 401748, 404090, 431215, 456522, 413885, 313439, 410769, 403941, 388896, 348036, 382354, 455457, 512009, 497776, 467461, 408627, 416980, 417978, 332626, 314305, 383353, 443461, 403323, 366001, 420201, 356584, 425387, 509728, 412764, 300521, 293571, 377386, 415938, 460196, 475489, 482250, 526045, 549302, 533333, 508574, 434895, 354823, 293437, 173539, 124490, 247477, 304783, 317090, 331299, 484516, 526345, 371575, 326529, 366795, 421254, 398068, 327051, 354598, 398722, 342026, 393738, 442221, 351580]
14019C51580l4211P83K65m9825p3516l7314P8517O8239P3903L2634k0410N0906
14007D41551l0395n4324O7537K8724r383P7403J16407r5620k6245l4094J26425
13996F07986P4058m5773m7594p5681l4907J7445m989L8750K8770Q1906m8099o6920
13984E24952J7810Q9929Q3432n1025j19213K7760j7775q6416m7750J1709M7981
13973D81394j6816n4104J7058k5263K7801l6750k8576k3155j8740R6134K7064
13962D46047O6949O5055j01842p5739l8726M9247R0067R2753j5540J0823O8095
13951F57189J31040R3322j16719J3046Q5657p479L8813n386j0753q9864q7441
13940G01425M9522L3450J23889q196o9438m7928j99666q2644L0616l4787k8035
$$ y = [351580, 317369, 318152, 318417, 268592, 195076, 157762, 236279, 304518, 378421, 411055, 390645, 441551, 411156, 356832, 424369, 453093, 443710, 521113, 637520, 541900, 515655, 481561, 607986, 682044, 636271, 588677, 512996, 478089, 495534, 490545, 529295, 558065, 639971, 591872, 524952, 542762, 632691, 716123, 665098, 545885, 573645, 555870, 469454, 421704, 433413, 481394, 464578, 410474, 427532, 402269, 430070, 393320, 364744, 341589, 322849, 418983, 446047, 512996, 578051, 476209, 400470, 361744, 410991, 501058, 593811, 578271, 589094, 657189, 788229, 881551, 764832, 777878, 863535, 856056, 894869, 889483, 878730, 788866, 701425, 750947, 784397, 908286, 900090, 830652, 782724, 583058, 500414, 531030, 496243, 468208]
13929D68208j0024O1357L6083l214O282j88311Q421J38351J71120p0412m6547
13918E71314k5544k86P376n5151k33160K312J63717J16661q8352j21104k7916
13907C09867P7841N3678j804L6591P5514n3773L4887P9165K852j33129p5507K0460
13895D26642J15270p9053n5734J3233J08273J6368j88509j0625K34470k890j50376
13884D27069J5292m0723J34707M0146j20052o1610P0989J20085j08906L415R8683
13873E79095J1547k557j24024P4187J97510P5197n5808K885P3497J0095K0692
13862H62316o969j63113J7224J05215O4700p2788j32025n8588P2388R9508N582
13851G93450J1139p1295k6513m3700J9935J3928O5321J08326N9258l2357k0546
$$ y = [468208, 458184, 519541, 555624, 552410, 558692, 370381, 378802, 517153, 688273, 617861, 571314, 545770, 545484, 552860, 497709, 264549, 266861, 430578, 547239, 458887, 337783, 309867, 387708, 441386, 439582, 476173, 551687, 497914, 532801, 611966, 614818, 481689, 406182, 426642, 541912, 462859, 407125, 420358, 528631, 544999, 356490, 345865, 580335, 577445, 427069, 442361, 401638, 536345, 576491, 456439, 394829, 465818, 585903, 476997, 480412, 579095, 590642, 588085, 464061, 538248, 735758, 810955, 755147, 758032, 831529, 841624, 862316, 855347, 692234, 709458, 814673, 879373, 806585, 674560, 615972, 688360, 787868, 793450, 804589, 733294, 706781, 663081, 683016, 696944, 762265, 870591, 929849, 897492, 876946]
13840H76946j0332K4058M8749p354l2755P7040M1738k7937l2738J2743L8779l5542
13828I73395K3172K1521q306l6593p8282R36Q567Q4795n3556M6942K21951N4813
13816A259355j01713k3130P224m8200l9420J0626k8630R7706P4816K7076k3266
13805A212444R61j9719k2266m4701n9491j082o964p4380l0884l7494j03069O2693
13793H76048K08893R9715Q108j56643m6875K1367O9115J17051M7442k6983P1711
13782A288949J38782k3751k1855q5132p4735p7613j24258l573N0102J7121O918
13771A090955n9939Q8815N6641J5853k0083R1582J2105O230J6380o9436p6302
13760A152801R9747m6592j71816k8506K7838M1530P1379j05834q7023n9189M1943
$$ y = [876946, 866614, 890672, 939421, 932067, 899312, 976352, 1018090, 990153, 957415, 970158, 1008937, 973395, 996567, 1018088, 1009782, 973189, 894907, 895843, 904410, 989205, 935649, 982591, 1204542, 1259355, 1157642, 1134512, 1141736, 1093536, 1054116, 1064742, 1036112, 1133818, 1208634, 1235710, 1212444, 1213405, 1193686, 1171420, 1126719, 1067228, 1066146, 1059182, 984802, 953918, 916424, 813355, 876048, 1084941, 1184656, 1192764, 1036121, 989246, 1010613, 1079728, 1196779, 1244221, 1217238, 1288949, 1427731, 1403980, 1382125, 1296993, 1222258, 1144645, 1020387, 1016814, 1066916, 1084037, 1090955, 1031016, 1119831, 1176472, 1192325, 1172242, 1263824, 1275929, 1282159, 1298539, 1229103, 1152801, 1252548, 1205956, 1034140, 1005634, 1033472, 1075002, 1146381, 1040547, 953524, 894335, 936278]
13749I36278J9519L453j0831j55931p6894R0621m1330k8530l4060R1410J90029
13738I83734J05114k7675j01741k338K1380Q1479j1856m231q3581l6560m9314
13727H74411L0495j65958J7726N6859J305n2513R8018O466j35913Q7244o636p3536
13715G37968l3181m7247K5204n009n2880j2013O3583K4851J928L6624J03483p1842
13703G71469q2523j4450J16187P3801n91L6809n9863L7835K8093R2178L674j4571
13691I88048L3238n6238j09683K384n7901n110N9545K8621O2593J0298p613L6405
13679I84587j9302l2482K927o184r3133Q674P9429n8625l3979N0943p6195r6090
13667G10570n4509O708R0719P885j7466k0942m6038j7775p8452M5274J45936L0826
$$ y = [936278, 955797, 959250, 948419, 792488, 715594, 806215, 764885, 736355, 702295, 793705, 983734, 1088848, 1061173, 959432, 957094, 978474, 1059953, 1048097, 1043866, 960285, 923725, 874411, 904906, 738948, 756674, 813533, 814838, 762325, 860343, 866809, 730896, 818140, 811504, 737968, 704787, 657540, 682744, 677735, 624855, 612842, 676425, 701276, 703204, 739828, 843311, 771469, 688946, 674496, 790683, 864484, 863893, 900702, 840839, 878674, 906767, 998945, 1002619, 988048, 1021286, 965048, 855365, 857749, 799848, 794738, 854283, 882904, 945497, 955795, 948182, 984587, 965285, 932803, 935730, 929546, 836413, 845087, 924516, 865891, 831912, 882855, 806660, 710570, 656061, 662769, 753488, 761373, 743907, 722965, 676927, 659152, 580700, 625974, 771910, 802736]
13655H02736N1842Q7689o4322l4433l2417N5088k4858j28118N9887R5602K4706
13644H93402J3790K0022L7958Q889l8982k7916k6146R0966M1935r1195l5606o8446
13632H18671k3484L3496J07013N6244k3145k7979m1152L3672k2028j33179n847
13621G72282M6964Q1199Q5670o1197n1846N4363J03033l49R9690p4205j60299
13610H95305M2019P8380J4107K9370m3007l784n054k8321r5000q7465m899J17896
13598I09547K9941o2383J05719J22527J21357Q2o3099L1977j2350K109p540r5506
13586A082381p0138j6793k8579n0593J21619J43194j10471j13217P8749O3784
13576A099936l8145n1703K9453M9109R8930J2694N9019J32746K8278j06847r966
$$ y = [802736, 854578, 942267, 877945, 843512, 811095, 866183, 841325, 713207, 773094, 868696, 893402, 907192, 927214, 965172, 974061, 935079, 907163, 881017, 971983, 1013918, 922723, 887117, 818671, 795187, 828683, 935696, 991940, 968795, 940816, 899664, 933336, 911308, 778129, 772282, 819246, 900445, 986115, 924918, 873072, 927435, 1030468, 1030119, 1129809, 1055604, 895305, 937324, 1015704, 1029811, 1059181, 1016174, 1012390, 1007336, 979015, 884015, 796550, 791651, 909547, 939488, 877105, 982824, 1105351, 1226708, 1226790, 1163691, 1195668, 1183318, 1185427, 1177887, 1082381, 1012243, 995450, 966871, 916278, 1037897, 1181091, 1070620, 957403, 1036152, 1099936, 1061791, 1010088, 1039541, 1088650, 1187580, 1200274, 1259293, 1392039, 1420317, 1313470, 1303504]
13565A303504k29j8673j42059j19069R3347J15528j4755q6522L644k7872l5286
13554A071558K8733M2695P1383r849o0921j5153n6294j9062L0534J13105J43475
13543A340204K4108j04965R889Q7097K7072m4267p2683l194Q245J04935Q5570
13532A462011P417n5056o7204K0090p6001P0307J28438J7035p1178k608l1068
13521A402183p2826j20881k0489P9014L3299m1703R354N6219r3821k0536J83776
13510A393589Q1245m2924k5924n7316R9334M6712l6135l4580L6047N0718P7953
13499A588719o0678q482m4055N2242N4676o615o110O8462J45963j4444j47468
13488A622210O3967N6460p327R6746Q3426P613j0653n9159m1516p1258l0141o4027
$$ y = [1303504, 1303275, 1284602, 1142543, 1023474, 1116821, 1232349, 1217594, 1131072, 1134716, 1106844, 1071558, 1100291, 1142986, 1214369, 1204520, 1143599, 1128446, 1072152, 1053090, 1083624, 1196729, 1340204, 1364312, 1259347, 1269236, 1356333, 1383405, 1339138, 1266455, 1263261, 1271506, 1376441, 1462011, 1469428, 1414372, 1347168, 1367258, 1291257, 1361564, 1490002, 1507037, 1435859, 1433251, 1402183, 1329357, 1208476, 1187987, 1267001, 1300300, 1258597, 1267951, 1324170, 1230349, 1209813, 1393589, 1474834, 1431910, 1405986, 1348670, 1448004, 1494716, 1458581, 1424001, 1460048, 1510766, 1588719, 1528041, 1519559, 1475504, 1527746, 1582422, 1575807, 1569697, 1638159, 1784122, 1769678, 1622210, 1686177, 1742637, 1735310, 1832056, 1915482, 1923095, 1912442, 1853283, 1811767, 1740509, 1710368, 1646341]
13476A646341K2693O433P3989J35176J28675N4286l8865L686M3675P9798L5715
13465B191602o1957L8398K9392O7763K2908J13636m7478j41571K0027N6955J12163
13454B401838L5921m28m2292r5983O336O8595J19442J01220k5653r3538m5993
13443B429465n024J0442L323K0624n4960M4843P7398Q9386J03530L8103N6850
13432B813980J15885J92879M60L025K1652M7751J78959J35934J2856P4044J43398
13421C740823K14024J67221R2464Q2784P4524K04606K17864K04854K08809L30358
13411E538331L35753M11475N47975P15453Q04034J168196J587255J961695K678905
13402A5749072L829031M875063N893082N733120L728241J210244j010649k703677
$$ y = [1646341, 1669034, 1675467, 1749456, 1884632, 2013307, 2067593, 2028728, 2032414, 2076089, 2155887, 2191602, 2129645, 2168043, 2197435, 2265198, 2288106, 2401742, 2354264, 2212693, 2232720, 2289675, 2401838, 2437759, 2437331, 2395039, 2299056, 2305392, 2373987, 2493429, 2594649, 2568996, 2475458, 2429465, 2424441, 2434883, 2438206, 2458830, 2403870, 2448713, 2526111, 2615497, 2719027, 2757130, 2813980, 2929865, 3122744, 3123204, 3126229, 3147881, 3195632, 3374591, 3510525, 3523381, 3597425, 3740823, 3954847, 4122068, 4214532, 4297316, 4371840, 4576446, 4794310, 4999164, 5207973, 5538331, 5874084, 6285559, 6833534, 7548987, 8353021, 9521217, 11108472, 13070167, 15749072, 19578103, 24453166, 30346248, 36079368, 39807609, 41017853, 40007204, 37303527]
13394C7303527l479573l655366l273474k690541k154384j393392p57955o9638
13386A9829204N57304J225231K135884L230782M634294N892342O256530N483144
13378D9244715L669380J834592Q16026R00318J821500K767115K780108J491641
13370F5325395M683r35188j150186j39579J628729L101258K998647P65473j534343
13361G0064889l096049l740408l203057j914169K87753L035357O395195R836399
13353G7665910J1314775R052158M448840M3017l167357m149609k932063q81020
13345I1394651R6096o76090j870697k684749k678475j450688P96019K512713L180143
13336H8618923K754884K176540J500666K53196j453305k867987l642147l101984
$$ y = [37303527, 33823954, 30168588, 26895114, 24204573, 22050189, 20656797, 19898842, 19829204, 20386508, 21611739, 23747623, 26978405, 31612699, 37505041, 43761571, 49244715, 52914095, 54748687, 55564713, 56465031, 58286531, 61053646, 63833754, 65325395, 65330078, 64394890, 63244704, 63105125, 64733854, 67835112, 70833759, 71599232, 70064889, 66968840, 63228432, 60025375, 58111206, 58398959, 61434316, 67829511, 77665910, 88980685, 98032843, 102481683, 102524700, 99357343, 95207734, 92275671, 91394651, 91490747, 90814657, 88943960, 86259211, 83580736, 82130048, 82926067, 85438780, 88618923, 91373807, 93550347, 95051013, 95304209, 93850904, 90982917, 87340770, 84238786]
13328H4238786j325535J048664K494465J779379L19362n20397k75334J616670
13320H9376060N279182R016167R519013N248934q10969n932585r196794j0420991
13312I2078017r549716p424465m847680j977687J051411L334880L742270K595941
13304G9002971Q53554l68483n56255M07303K154117L289366K381276p4085k228185
13295H4861579l176685k819368r17791J184251J528926m80064l009519m924989
13287G2246340o039065o328418n765040n039075m517964l918230l241423k621793
13279C4775332k202559j485101m87458O36936K072408L912410N545458N812359
13271D8579785M070126R52742k007558m374803n757387n909493n427180m866508
$$ y = [84238786, 82913251, 83961915, 86456380, 88235759, 88555121, 88034724, 87759390, 89376060, 94655242, 103671409, 113190422, 118439356, 117628387, 111695802, 102499008, 92078017, 82528301, 75103836, 70256156, 68278469, 69329880, 72664760, 76407030, 79002971, 79856525, 79488042, 78931787, 79339090, 81493207, 84782573, 87163849, 87089764, 84861579, 81684894, 78865526, 77947735, 79131986, 80660912, 80180848, 77171329, 72246340, 66207275, 59878857, 54113817, 49074742, 44556778, 40638548, 37397125, 34775332, 32572773, 31087672, 30600214, 31237150, 33309558, 37221968, 42767426, 48579785, 52649911, 53602653, 51595095, 47220292, 41462905, 35553412, 30126232, 25259724]
13263B5259724m140968l609396k852246k263327j605895j289959j065822p90717
13255G641394o05508l05330k54822j36015l2976R5767J84909K06347K66461L09702
13245G369929N29414N79141Q07493J144845J359647J707317K216051K507752K721861
13236B0943450K750137K463021J919681J260905O11726l12965r44118j314124
13228B7377713j668343j698496j564001j385657p70635K8697N41632J014600J382065
13219B3257575J722022J543922J184731Q15434K47938l27580j029445j694575
13211B5720022k088748k376908k374977k131275k181517k040351j601662j330557
13203I594027j099118q64905p43664p02838o64822m41825k97499l37379k48413
$$ y = [25259724, 21118756, 17509360, 14657114, 12393787, 10787892, 9497933, 8432111, 7641394, 7035886, 6730556, 6475734, 6339719, 6306743, 6402510, 6587419, 6793766, 7060227, 7369929, 7899343, 8478484, 9285977, 10430822, 11790469, 13497786, 15713837, 18221589, 20943450, 23693587, 26156608, 28076289, 29337194, 29948920, 29635955, 28691837, 27377713, 25709370, 24010874, 22446873, 21061216, 20290581, 20319278, 20860910, 21875510, 23257575, 24979597, 26523519, 27708250, 28523684, 28771622, 28444042, 27414597, 25720022, 23631274, 21254366, 18879389, 16748114, 14566597, 12526246, 10924584, 9594027, 8494909, 7630004, 6886340, 6183502, 5518680, 5076855, 4779356, 4441977, 4193564]
13194D193564k20084k11939j70403m1064P7980J9254j04712j11586L3745n7884
13184C406871j741L4106j341R2903p5139j25653m7235O8941m3577j71685o298
13173C130152n725M1269L0987P2394N1765k791q018l324J4291J1535J46175J81449
13161C660159J36146J20945J90258J82312J64308L7343J08413Q9807J11010R4187
13151D894888Q970l1766J8928K3695P8964o7207j50574J3849o2860R7667J46599
13140D971153J94968K20777K33441J15645K85882M10260L45511L90341L04390
13131G472368K89272L14812K66269K27249O5330L9315j6271P7699K22059J95858
13121I153960K26019L99550L85786M65050N77985N63930Q21849J081323J453577
$$ y = [4193564, 3973480, 3761541, 3591138, 3550074, 3628054, 3647308, 3542596, 3431010, 3464755, 3406871, 3405130, 3439236, 3437895, 3530798, 3455659, 3330006, 3282771, 3351712, 3308135, 3136450, 3130152, 3124427, 3165696, 3196683, 3269077, 3320842, 3318051, 3310033, 3306709, 3321000, 3332535, 3478710, 3660159, 3796305, 3917250, 4107508, 4289820, 4454128, 4491471, 4599884, 4689691, 4800701, 4894888, 4903858, 4872092, 4891020, 4914715, 4993679, 4926472, 4775898, 4789747, 4726887, 4824554, 4971153, 5166121, 5386898, 5620339, 5735984, 6021866, 6432126, 6777637, 7167978, 7472368, 7761640, 8076452, 8342721, 8569970, 8635300, 8674615, 8658344, 8736043, 8958102, 9153960, 9379979, 9779529, 10165315, 10630365, 11208350, 11772280, 12594129, 13675452, 15129029]
13112A5129029J863484K242549K644410L422511M039232M326005L677267K272858
13104C9617345Q17510p22240k113999k554791k652506k578017k293583j854375
13096B5665344j546380j315344j001740p44579n30128m60728l42680j45952o4075
13087A9513738J38045J41916K42866K73250L35004M06828L89510O54298Q37821
13078B2933276R54129J160295J567218K025466K721343L358720L861497L748516
13070D2330460K885321J307307m08996j916102l054099l583788l678915l588848
13062C0292340l141631k731514k258748j900655j563146j249693r83967q62735
13054A5600251q17668o29300m84732m98011l60820k41761k71902j51840l3478
$$ y = [15129029, 16992513, 19235062, 21879472, 25301983, 29341215, 33667220, 37344487, 39617345, 40434855, 39712615, 37598616, 35043825, 32391319, 29813302, 27519719, 25665344, 24118964, 22803620, 21801880, 21057301, 20527173, 20066445, 19723765, 19577813, 19513738, 19651783, 19793699, 20036565, 20309815, 20644819, 21051647, 21441157, 22095455, 22933276, 23887405, 25047700, 26614918, 28640384, 31361727, 34720447, 38581944, 42330460, 45215781, 46523088, 46114092, 44197990, 41143891, 37560103, 33881188, 30292340, 27150709, 24419195, 22160447, 20259792, 18696646, 17446953, 16462986, 15600251, 14782583, 14153283, 13668551, 13170540, 12809720, 12567959, 12296057, 12144217, 12110739]
13045A2110739J43400K93871M04768P01649J072065J492335J767794J650502J211128
13036B0848251M95423k91711j067007j585830j670413j768514j610260j348616
13028A2001323j074107q74845q17531o84245n32083m25688k25139k38216j25882
13019G003587r8205l9807P206N7504J61694J52142L06776L77449M79663O58491
13009I066500O99898Q43734R50491J352098J702111J964014K010351J555649P92143
13000B0936989k15148j125951j590677j925130k045042j827883j528404j228459
12992I450295j131263r21673q23553n22487l41028l85800m37089k60769k21850
12983D404783l13195j87717r4940n105k2745j43810j74715q839p0599j49262M4156
$$ y = [12110739, 12254139, 12548010, 12952778, 13654427, 14726492, 16218827, 17986621, 19637123, 20848251, 21343674, 21051963, 19984956, 18399126, 16728713, 14960199, 13349939, 12001323, 10927216, 10052371, 9234840, 8550595, 8018512, 7592824, 7367685, 7129469, 7003587, 6905382, 6865575, 6872781, 6930285, 7091979, 7244121, 7550897, 7928346, 8408009, 9066500, 9766398, 10610132, 11560623, 12912721, 14614832, 16578846, 18589197, 20144846, 20936989, 20721841, 19595890, 18005213, 16080083, 14035041, 12207158, 10678754, 9450295, 8319032, 7397359, 6573806, 6051319, 5710291, 5324491, 4887402, 4626633, 4404783, 4091588, 3903871, 3808931, 3803826, 3781081, 3637271, 3462556, 3453717, 3383118, 3233856, 3278012]
12972C278012Q1926n5676K3287O8473L555J2695k7307j35339P181P6489l9066
12961C294230j84427p2787O3411M2175j34531J3513k1519r6238J13035O0186r7416
12950B979632q4478J1504R1466J6522l5374k5510J5137q3588k1563J6037J19850
12939B999635K8521q0610j6094J10824L7175l4608k8781o6234O9735P2967p7901
12928C014629Q7535J68305J23742R6239n2698j73751p0626R1596K0395j03301
12918C202065n3011N6300M7255L6063j7400n0496k6669J5621K6684M8282l0127
12907C254567K3230N7143Q3169N5601O913o6581n7269o3935j27108j01598Q314
12896C072446P4106l063N1061J00657j4066p6483K075J02963Q7469N6878O8827
$$ y = [3278012, 3359938, 3304262, 3327549, 3396022, 3399577, 3412272, 3384965, 3249626, 3256807, 3333296, 3294230, 3109803, 3037016, 3100427, 3142602, 3008071, 3021584, 3000065, 2903827, 3016862, 3077048, 2979632, 2895154, 2906658, 2998124, 3014646, 2979272, 2953762, 2968899, 2885311, 2863748, 2879785, 2999635, 3028156, 2947546, 2931452, 3042276, 3079451, 3044843, 3016062, 2949828, 3019563, 3092530, 3014629, 3102164, 3270469, 3394211, 3490450, 3437752, 3264001, 3193375, 3284971, 3305366, 3202065, 3149054, 3205354, 3252609, 3288672, 3271272, 3220776, 3194107, 3209728, 3236412, 3284694, 3254567, 3277797, 3334940, 3418109, 3473710, 3480623, 3414042, 3356773, 3292838, 3165730, 3064132, 3072446, 3146552, 3143489, 3194550, 3295207, 3281141, 3204658, 3206733, 3309696, 3397165, 3454043, 3522870]
12885C522870l198j0725O2715J08595M3664l132J618o7870m4150p5792q7049r348
12873C438198l6981N3359m9524M9830r5983J5971L2756O444J00549J32029j2390
12862C634258m3731Q6508j6486j7500M2871o1922k6461L2324J30919P3946J33768
12851C968494R0645J12904M2274Q4155J23086J80778p0128n9392P240r518k3904
12840D446634J590J32774J00855J28446L8011Q3996m7284n5231q2074N3927L5837
12829D837481P6318Q4712O628M5543O7811J98594K13346J51128k0230R8877O5558
12818E825766M277P9008J05074J19418J12205J07945J95578P5632J22291K54175
12808G001369J77440K19211J79127K24157K80688J57981Q6402N2667L6436J21131
$$ y = [3522870, 3519672, 3508947, 3571662, 3680257, 3723921, 3720789, 3722407, 3654537, 3610387, 3534595, 3447546, 3438198, 3401217, 3454576, 3405052, 3454882, 3358899, 3374870, 3407626, 3414070, 3514619, 3646648, 3634258, 3590527, 3677035, 3660549, 3643049, 3685920, 3623998, 3597537, 3629861, 3760780, 3834726, 3968494, 4059139, 4172043, 4214317, 4298472, 4421558, 4602336, 4532208, 4472816, 4480056, 4470538, 4446634, 4448224, 4580998, 4681853, 4810299, 4848310, 4932306, 4885022, 4829791, 4747717, 4801644, 4837481, 4913799, 4998511, 5005139, 5050682, 5118493, 5317087, 5530433, 5681561, 5661331, 5760208, 5825766, 5830043, 5909051, 6014125, 6133543, 6245748, 6353693, 6549271, 6624903, 6747194, 7001369, 7178809, 7398020, 7577147, 7801304, 8081992, 8239973, 8326375, 8379042, 8415478, 8536609]
12798H536609K26880K40631L89377L73946L09347M01408O19816P86403R64385
12789A2848802J172495J534754J909092K438129L183257M086288M560688M480365
12781C6213870L558715J575402j74564j647622k875756l421051l414388l185013
12773B6629593k830478k278700j710980j423145q50615o02395l72833r4283K34446
12764A6700610M98514P34813J159919J523570K159729K787467L566018M410991
12756C3541631N030398M731539L329420J306798p88854k418689l363702l881382
12748C7487159l839902l586812l143178k601778k021983j599622j193546q91456
12740A8608882n83299l27667j95087p4581J05628K58503M45524N88308O16449
$$ y = [8536609, 8763489, 9004120, 9393497, 9767443, 10076790, 10478198, 11098014, 11884417, 12848802, 14021297, 15556051, 17465143, 19903272, 23086529, 27172817, 31733505, 36213870, 39772585, 41347987, 41173423, 39525801, 36650045, 33228994, 29814606, 26629593, 23799115, 21520415, 19809435, 18386290, 17535675, 16933280, 16560447, 16466164, 16700610, 17199124, 17933937, 19093856, 20617426, 22777155, 25564622, 29130640, 33541631, 38572029, 43303568, 46632988, 47939786, 47150932, 44732243, 41368541, 37487159, 33647257, 30060445, 26917267, 24315489, 22293506, 20693884, 19500338, 18608882, 18025583, 17697916, 17502829, 17428248, 17533876, 17792379, 18237903, 18826211, 19442660]
12731A9442660P23770Q51246R68972J102276J256424J381223J617836J976908
12723B9321315K312743K609494K928246L437209M070305M600254N468548O354055
12715F1102169P866789R736384J2321644J5604738J9803561K4891865K9414020
12708A80741170L1672521K9043923K0863214R279858k615521j2410985j8759845
12701B37814335k1355910k1074164j9251578j6167118j2587894q793222n049515
12694A33534934j189420K371437O111608J0320206J5377105K1478680K8629936
12687B16634486L6089645M1322663M1687174L6018955K6838488J7188513P645958
12680D23425882k169924j2319461k2133830l0210209l5291916l7192553l6208808
$$ y = [19442660, 20166430, 21017676, 21986648, 23088924, 24345348, 25726571, 27344407, 29321315, 31634058, 34243552, 37171798, 40609007, 44679312, 49279566, 54748114, 61102169, 68968958, 78705342, 91026986, 106631724, 126435285, 151327150, 180741170, 212413691, 241457614, 262320828, 271600686, 268985165, 256574180, 237814335, 216458425, 195384261, 176132683, 159965565, 147377671, 138584449, 133534934, 132345514, 134716951, 140828559, 151148765, 166525870, 188004550, 216634486, 252724131, 294046794, 335733968, 371752923, 398591411, 415779924, 423425882, 421255958, 408936497, 386802667, 356592458, 321300542, 284107989, 247899181]
12673B47899181l3272759k9446030k5312291k1311394j7412837j3944475j0946435
12666I6252960q303911o269607m410830k925475j374861N7564J367505K902125
12658G7295470M663524O894756R536129J3194506J7488568K2555111K7261105
12651A78889169K8584710K4100560J3932013J368668j0215230j8811716k3462865
12644A94385309k4473970k3450676k1446722j8536341j5492165j2591959j0150672
12637F8242804q255349o591983n067504l897527l065167k354683j820285j409184
12629C5781122j327971j178370q03539n17788m8987K73785O40205J019876J544334
12620C5382667J462690J154725J187099J731186K316538K803685L417516M096960
$$ y = [247899181, 214626422, 185180392, 159868101, 138556707, 121143870, 107199395, 96252960, 87949049, 81679442, 77268612, 74343137, 72968276, 73025840, 74393345, 77295470, 81958994, 88853750, 98389879, 111584385, 129072953, 151628064, 178889169, 207473879, 231574439, 245506452, 246875120, 236659890, 217848174, 194385309, 169911339, 146460663, 125013941, 106477600, 90985435, 78393476, 68242804, 59987455, 53395472, 48327968, 44430441, 41365274, 39010591, 37190306, 35781122, 34453151, 33274781, 32471242, 31953454, 31904467, 32178252, 32818457, 33838333, 35382667, 36845357, 38000082, 39187181, 40918367, 43234905, 46038590, 49456106, 53553066]
12612E3553066N035740N638608M968150L517931K073254P62150k41835m98964
12604G4808100j068498j654389j680365j065856K13895K544923N709337R967836
12596H7774983J5167938J5378045Q337335K923686L43233q43971p75670r80780
12588A27324799k583064m114353m524405m151674k841085p04907K035736N032745
12580A15473792P997503R107935Q512775Q241663P904789P228554N727548L462285
12572A73656844K338539L378692N178361N591075L955711J595739p26380j987091
12564A92981490j149994Q63784L045432M889765O415487Q152395R606426J1378682
12556B36183467J4523648K1552739L1695565L4574701K0737703L577174p767489
$$ y = [53553066, 58588806, 64227414, 69195564, 72713495, 74786749, 75548899, 75307064, 74808100, 73739602, 72085213, 70404848, 69338992, 69552887, 72097810, 77807147, 87774983, 102942921, 118320966, 126658301, 129581987, 129925220, 129081249, 128305579, 127324799, 124741735, 120627382, 116102977, 111951303, 109110218, 108405311, 110441047, 115473792, 123471295, 132579230, 141092005, 149333668, 157238457, 164467011, 170194559, 173656844, 175995383, 179374075, 184552436, 190143511, 194099222, 195694961, 194968581, 192981490, 191831496, 192695280, 195740712, 200630477, 207045964, 215198359, 224804785, 236183467, 250707115, 272259854, 303955419, 338530120, 359267823, 362844997, 355077508]
12549C55077508j5824808j8623153j6917023j5519443j4890713j3769950j2032071
12542B47500347j0593756p920049m131090n86863J899712J390462k146580n534911
12534B19877272p303768p893853p812196p681519o937403n738729l917434k565312
12526A70027058k961440m614421o079619p057428o776436n238291l265290j047983
12518A32986150J176351K773866L176869K293410J082744J926176N895459Q745457
12510A60056482M096302l440159q083711j1658267j2697592j0142994p037466
12503A11092595n016409l849039l907111m882450n998083p090779p443548p088902
12495F5816274o231169n262376m242355l072316k241140j880066j759797j531781
$$ y = [355077508, 339252700, 320629547, 303712524, 288193081, 273302368, 259532418, 247500347, 236906591, 228986542, 224855452, 224268589, 226168301, 227558763, 225412183, 219877272, 212573504, 204679651, 196867455, 189185936, 182248533, 176509804, 172592370, 170027058, 167065618, 162451197, 156371578, 149314150, 142537714, 137299423, 134034133, 132986150, 134162501, 136936367, 140113236, 142406646, 143489390, 145415566, 151311025, 160056482, 164152784, 160712625, 152628914, 140970647, 128273055, 118130061, 111092595, 106076186, 102227147, 98320036, 93437586, 87439503, 80348724, 72905176, 65816274, 59585105, 54322729, 50080374, 47008058, 44766918, 42886852, 41127055, 39595274]
12487C9595274j167520q12591o80599n32020m85306n96361n53355l34334q5872
12478C4347316M12682J094293J770924K618876L534078M222400M289694L097617
12470E5387880R89063j087637k930704l986137m527297m535823m053835l588399
12462C1667111l072064k381061j972591j642675j158400q68533p46923n17398
12454A9307466k87790k16606q3760P4280K2076J09032J68321J29651K74549N07475
12444B0004694P61623R29672R77790J102625J113018J043200J381031J619760
12436B8933413K101746K777905K988973K562651J234248k32004j418550k464333
12428C6484049l166607l303580k994797k680430k532059k169499j666899j372474
$$ y = [39595274, 38427754, 37615163, 36934564, 36402544, 35917238, 35320877, 34767522, 34433188, 34347316, 34759998, 35854291, 37625215, 40244091, 43778169, 48000569, 52290263, 55387880, 56376943, 55289306, 52358602, 48372465, 43845168, 39309345, 35255510, 31667111, 28595047, 26213986, 24241395, 22598720, 21440320, 20571787, 19824864, 19307466, 19019676, 18803070, 18719310, 18793590, 18815666, 18924698, 19093019, 19222670, 19497219, 20004694, 20766317, 21695989, 22673779, 23776404, 24889422, 25932622, 27313653, 28933413, 31035159, 33813064, 36802037, 39364688, 40598936, 40366932, 38948382, 36484049, 33317442, 30013862, 27019065, 24338635, 21806576, 19637077, 17970178, 16597704]
12420A6597704j123128p42910m98505n85509o35997l72173k47456k42189k85990
12411A1863847j27470j67906j2666J31895K66946K75148L14647L61818L34949
12402A3241208M40139M47579M50837M96113O58585J050134J298046J748923K578914
12393B2410478L732546M646602N113337M356667K528567K39029j847880l216704
12385C7962642l946465m084555l905361l523255l097011k622466k089122j653610
12377A3040797j363878j067601q48197o19750n05980l57879k04853J87458L89495
12368H649612M05027M52639K36388l5840l03805l26008m75166m92594n35621n42349
12358G032283m41418m95637l34540l71941l13415j31402j34059l5995o136Q6803
$$ y = [16597704, 15474576, 14731666, 14233161, 13647652, 13011655, 12639482, 12392026, 12149837, 11863847, 11736377, 11568471, 11555805, 11687700, 11954646, 12229794, 12544441, 12906259, 13241208, 13681347, 14128926, 14579763, 15075876, 15734461, 16784595, 18082641, 19831564, 22410478, 26143024, 30789626, 35902963, 40259630, 42788197, 43027226, 41179346, 37962642, 34016177, 29931622, 26026261, 22503006, 19405995, 16783529, 14694407, 13040797, 11676919, 10609318, 9761121, 9141371, 8635391, 8277512, 8072659, 8260117, 8649612, 9054639, 9507278, 9743666, 9707826, 9404021, 9078013, 8602847, 8110253, 7574632, 7032283, 6590865, 6095228, 5760688, 5388747, 5075332, 4943930, 4809871, 4773876, 4767740, 4854543]
12348D854543J53190R3066P8639R8145k2198L696Q1606k9326K382j530J09980
12337E422193J62947K58770L11275L40266M61218O53657O72284R94849J318137
12328A0595596J771150K257895K732507L048372K488991J456807J09877j090862
12320B3370333j793585k032902k049272j776130j294089j015296p89958o93836
12312A1925265m60606m40900m59377m11250l22515l60525k11246J07595K34217
12303I600658K77315M70617L78043L80819M70170M80578L24087Q5830j26366k79320
12293A2062431j90774l69919l56182k85533j24316J5366J45461L27313L81020
12284A1604867N58650O91097O23975N03098L62018K20621m3117k82401k75888
$$ y = [4854543, 5007733, 5100799, 5179438, 5277583, 5255385, 5259081, 5340687, 5311361, 5313743, 5312213, 5422193, 5585140, 5843910, 6155185, 6495451, 6956669, 7610326, 8282610, 9277459, 10595596, 12366746, 14624641, 17357148, 20405520, 22894511, 24351318, 24461195, 23370333, 21576748, 19543846, 17494574, 15718444, 14424355, 13409059, 12619101, 11925265, 11464659, 11023759, 10564382, 10153132, 9830617, 9470092, 9258846, 9366441, 9600658, 9877973, 10348590, 10726633, 11107452, 11577622, 12058200, 12382287, 12468117, 12341751, 12062431, 11871657, 11501738, 11145556, 10860023, 10735707, 10751073, 10896534, 11223847, 11604867, 12163517, 12854614, 13478589, 13981687, 14343705, 14564326, 14521209, 14238808, 13962920]
12275A3962920k62486j58131j64564K2277K37626K81932M43189N20696N24333
12266A5407792N08673M66746L83896P9190n3488j99431l23541l55632l10639k38898
12256A5364668k32835j52567K9301O5683J40119J39289K64973J42469J23763L7824
12246A5922687k97758m05497m84375l64166j61365k33203k22702r6138n8352j51668
12236A3447463j06012j01282m5569k8288J59065K69738O4365J07935J14302K1664
12226A3903381j2459p5753j3381o0664j76668k12630k68897l90618n70374m53767
12216A1668170l95607n33676n58805l60476k19756k17498l65512l62796k70112
12207H383932j75460l2996O502l8242q9476l23270l84276k52310l19143k25044
$$ y = [13962920, 13700434, 13542303, 13377739, 13400016, 13637642, 13919574, 14362763, 14883459, 15407792, 15916465, 16383211, 16767107, 16846297, 16792809, 16593378, 16269837, 15914205, 15603566, 15364668, 15131833, 14979266, 15008567, 15074250, 15214369, 15353658, 15618631, 15761100, 15884863, 15922687, 15624929, 15219432, 14735057, 14370891, 14209526, 13976323, 13753621, 13657483, 13599131, 13447463, 13341451, 13240169, 13194600, 13166312, 13325377, 13595115, 13659480, 13767415, 13881717, 13903381, 13890922, 13815169, 13801788, 13741124, 13564456, 13351826, 13082929, 12692311, 12121937, 11668170, 11272563, 10738887, 10180082, 9819606, 9599850, 9382352, 9016840, 8654044, 8383932, 8208472, 8175476, 8181978, 8143736, 8054260, 7730990, 7346714, 7094404, 6775261, 6550217]
12197F550217k35661j95171k22723q6598n3225n6878q7264j29272M2727o8308
12187E457844n4266r3072k67993l04918k58445j69821j36951k09289k06867q5432
12177C670790k17335j98296j49794r2622J25856R3115p4710j44734J0650o227
12167C016693n2633j08953k03115o5773j08029j26164k8339j33707o5372n6082
12157B068526r096j1799j28657p1545p1588O8390L8106o571R2268q41P089O7633
12145B041915O4413o0625p8767Q6543k3965j04029J8162j24442K0031J30542O0950
12134B030728j4192o286Q9294J50535P9844O4720Q89j64074J7780M1408l0325
12123B260321J34175J2960j3713J4309J44013J68550O9197L673P940J1752j6844
$$ y = [6550217, 6314556, 6119385, 5896662, 5810064, 5756839, 5699961, 5612697, 5483425, 5526152, 5457844, 5403578, 5310506, 5042513, 4737595, 4479150, 4309329, 4172378, 3963089, 3756222, 3670790, 3453455, 3255159, 3105365, 3012743, 3138599, 3231714, 3157004, 3012270, 3022920, 3016693, 2964060, 2855107, 2651992, 2586219, 2478190, 2352026, 2323687, 2189980, 2124608, 2068526, 2059430, 2047631, 1918974, 1847429, 1775841, 1844231, 1882337, 1875766, 1968034, 1967193, 1974282, 2041915, 2106328, 2045703, 1966936, 2053479, 2029514, 1925485, 1943647, 1819205, 1839236, 1969778, 2030728, 2016536, 2010250, 2099544, 2250079, 2329923, 2394643, 2395532, 2231458, 2249238, 2290646, 2260321, 2394496, 2407456, 2393743, 2408052, 2552065, 2720615, 2789812, 2793485, 2801425, 2813177, 2796333]
12112B796333l8003L1319N3741L0824O2728j1083J17621J10132j04428k2457J15453
12101C142180J96567Q9205k9407J05343l8287R9593J51792J71822L2318O1303
12091C982429J76533L22670L06866J43894n543N0929Q3721k6995j70985r6080
12081D767439k27692r5092p0609j22354p0528j8291O1077J69285J59422L2998
12071D585655K8019P2153q864J19697J573q5034j2573n9698n3941j4854r856j9509
12059D542768J60969P7529P0862O7887l6655l4063k9912j66878j16037O0469J78307
12048D775246J26879K3088L7711J31562J30927J5819o5666J30586O418J44106
12038E456676L26651K54475K14312K07123L43063M72122M42246N17189P16181
$$ y = [2796333, 2758330, 2789649, 2843390, 2874214, 2936942, 2925859, 3043480, 3153612, 3049184, 3026727, 3142180, 3338747, 3427952, 3398545, 3503888, 3465601, 3565194, 3716986, 3888808, 3921126, 3982429, 4158962, 4481632, 4788498, 4932392, 4926849, 4977778, 5061499, 5034504, 4863519, 4767439, 4539747, 4444655, 4374046, 4251692, 4181164, 4162873, 4223950, 4393235, 4552657, 4585655, 4613674, 4685827, 4676963, 4796660, 4798233, 4713199, 4700626, 4640928, 4586987, 4572133, 4562277, 4542768, 4703737, 4781266, 4852128, 4920015, 4883360, 4849297, 4819385, 4652507, 4536470, 4596939, 4775246, 4902125, 4925213, 4962924, 5094486, 5225413, 5241232, 5175566, 5306152, 5312570, 5456676, 5783327, 6037802, 6252114, 6459237, 6802300, 7274422, 7716668, 8233857, 8950038]
12029H950038R60077J315654J715528K215352K944538L902717M527428M180799
12021C0712131K660290R71109n91392j630541k283477k370316k223269j732293
12013B3512242j014985m97698J68214J023441J884577K853095M159063N991444
12005C8079393P836755Q635280P375737M302350M69426k811741n196004o348279
11997E2342917o306295n807232m974965m124702l145443k136532j113576l59151
11989B4375021M68931J464225K647859L907050M542571L918060J785566n53627
11981D2555656k370113l706964m279743l989150l636362l227515k670202j975426
11973A6700181j255362j015270p29348l32394j59475J32341M78046O51215Q20202
$$ y = [8950038, 9910115, 11225769, 12941297, 15156649, 18101187, 22003904, 26531332, 30712131, 33372421, 34343530, 33752138, 32121597, 29838120, 27467804, 25244535, 23512242, 22497257, 21999559, 22167773, 23191214, 25075791, 27928886, 32087949, 38079393, 45916148, 54551428, 61927165, 66229515, 66698941, 63887200, 58691196, 52342917, 46036622, 40229390, 35254425, 31129723, 27984280, 25847748, 24734172, 24375021, 24843952, 26308177, 28956036, 32863086, 37405657, 41323717, 43109283, 42555656, 40185543, 36478579, 32198836, 28209686, 24573324, 21345809, 18675607, 16700181, 15444819, 14429549, 13700201, 13367807, 13208332, 13340673, 13818719, 14469934, 15290136]
11964A5290136R80051R72677J281034J525590J764830K176864K825085L520108
11956C0336375M429499N691221P495786R844066J3290971J7338565K0446614K0107264
11948A28980361J5037384P372544k89919o415646j0065482j1081053j0242371
11941A13295818q598485o323555l603709o47688K666906O256094J0395534J5526772
11933A28967687K1765118K7774825L0953353K7905117J7981552M812785p563559
11926B52596878j6862137k1800430k2990099k1483368j8451671j4661194j0303979
11919A26044000n944479j338314L589523Q922436J5119937K2100268K7867922
11912A96361293K9431726K4590694J3828775R25393j0555518j8439705k2062984
$$ y = [15290136, 16270187, 17242864, 18523898, 20049488, 21814318, 23991182, 26816267, 30336375, 34765874, 40457095, 47952881, 57796947, 71087918, 88426483, 108873097, 128980361, 144017745, 151390289, 151100370, 144684724, 134619242, 123538189, 113295818, 104697333, 98373778, 94770069, 94122381, 96789287, 103045381, 113440915, 128967687, 150732805, 178507630, 209460983, 237366100, 255347652, 260160437, 252596878, 235734741, 213934311, 190944212, 169460844, 151009173, 136347979, 126044000, 120099521, 118761207, 122350730, 131273166, 146393103, 168493371, 196361293, 225793019, 250383713, 264212488, 265137881, 254582363, 236142658, 214079674]
11905B14079674k1992277j9633478j5715563j0769116n048657O96826N492301
11898A47109710P353694N247209k29545o622647j1753919j5212245j6560963j5933416
11890I3397878j4365094j2586526j0561096q427098o676963n170571l938050l039218
11882B8633262k231903j454838j016230m56588J76720N21145P48156J345818K117527
11873B8383069K823778L793022N129922O941267R456435J2344932J5095420J6330599
11865A00298444J4586497R993010M018799j566619n612342p704418p909274o844821
11857I9259276m785076j868209J575717N340677Q797200J0258470Q390385L414809
11849A30383249k681721q132462j1718303j3170037j2859088j1412629r283093
$$ y = [214079674, 192087397, 172453919, 156738356, 145969240, 140920583, 141617409, 147109710, 154463404, 159710613, 159481068, 152858421, 141104502, 125892257, 109331294, 93397878, 79032784, 66446258, 55885162, 47458064, 40781101, 35610530, 31672480, 28633262, 26401359, 24946521, 23930291, 23473703, 23650423, 24171568, 24919724, 26265542, 28383069, 31206847, 34999869, 40129791, 47071058, 56527493, 68872425, 83967845, 100298444, 114884941, 124877951, 128896750, 127330131, 121717789, 114013371, 106104097, 99259276, 94474200, 92605991, 94181708, 99522385, 108319585, 118578055, 126968440, 130383249, 127701528, 119569066, 107850763, 94680726, 81821638, 70409009, 61125916]
11842F1125916p007415m545233k034109k28295K52528n24207j778603k799899
11834D2460683l429507l620091l440796k824307k172567j332384l01380P26669
11826B6066320J685856K227508K044311R30198m52804j875217k768841l224773
11818B4632558l246880k966284k558641k265884j703112j438179j070697q78010
11810H504871o75380m79863j99394j67550m7526J33217K13813L87864L61384N96213
11800H627649Q13347J026002J427972J814890K420175L510777M687343N404204
11792B9732359N237319M033402J851912k94057j738945k672041k915579k582899
11784C0651471k066026j245926j72002J111943K195433K986384L000488J707503
$$ y = [61125916, 54118501, 49573268, 47539159, 47310864, 47563392, 47039185, 45260582, 42460683, 39031176, 35411085, 31970289, 29145982, 26973415, 25641031, 25339651, 26066320, 27752176, 29979684, 32023995, 32954193, 32501389, 30626172, 27857331, 24632558, 21385678, 18419394, 15860753, 13594869, 11891757, 10453578, 9382881, 8504871, 7829491, 7349628, 7150234, 6982684, 6935158, 7068375, 7282188, 7670052, 8031436, 8627649, 9440996, 10466998, 11894970, 13709860, 16130035, 19640812, 24328155, 29732359, 34969678, 39003080, 40854992, 40560935, 38821990, 36149949, 33234370, 30651471, 28585445, 27339519, 27167517, 28279460, 30474893, 33461277, 36461765, 38169268]
11776C8169268k94993k129411l458938m206629m172298l996980l549643k857010
11768A3503366k357289k002647j471115j057400j012962p21379n48460m90716
11760C841398m80100l20570m12999k50556j88904j81032j74289j78670p8840q4656
11750A490782j0653r020P7035K9854K6550j4495j6774R2670J07197r5853o5710
11739A611583k8441j34835j25303K5682j26219j07930Q6410J5349L0076r41n1521
11728A193910j00140j18958o1782L9029N6365Q2497k9621l7582k3959p3126p5285
11717H51348j89961j12225o0799Q9274M1088m3819o7821j16609j11529P9856R1228
11706D50031M2746M227R5633k7397p5601M976L403m84o0288j03559J0937O7689
$$ y = [38169268, 37874275, 35744864, 32285926, 28079297, 23906999, 19910019, 16360376, 13503366, 11146077, 9143430, 7672315, 6614915, 5601953, 4880574, 4332114, 3841398, 3361298, 3040728, 2627729, 2377173, 2188269, 2007237, 1832948, 1654278, 1575438, 1490782, 1480129, 1471109, 1548144, 1577998, 1604548, 1590053, 1573279, 1665949, 1773146, 1677293, 1611583, 1583142, 1448307, 1323004, 1348686, 1222467, 1114537, 1200947, 1216296, 1246372, 1245431, 1193910, 1093770, 974812, 913030, 952059, 1008424, 1090921, 1061300, 1023718, 999759, 926633, 851348, 661387, 549162, 488363, 577637, 618725, 574906, 507085, 390476, 278947, 358803, 450031, 492777, 497004, 592637, 565240, 489639, 494615, 498018, 497534, 437246, 333687, 344624, 412313]
11694D12313O7827R6466k0348p8647k210Q888m362K6368m2306k3231M0241O3206
11682E44205R8212p7347q9306Q0974l6156P043k07468k27271J18193K17795k6863
11671D02011j97860n6362L1320J3984J10788j4790l0677l2910J08102p4087k9349
11660B30170J34836J2938j52669l6013P5703p6606p1883L1703N7534j21425m6854
11649C7434r0162R0363J6206p3786m3477r033N8333K7149j16478L7602n1559j998
11637a19406j6338r5860K5914o351O4059O253k2721n545J4906k3857l7757J09586
11625a07117J11279K1183l4116L4865o2346N2454j0500l0884m8631m0108K4777
11614h9144M7156K8030o1758k5324Q181k6782l8701P9383J32469L0779k0497r3030
$$ y = [412313, 480140, 576606, 556258, 477611, 475401, 484289, 479927, 506295, 463989, 440758, 480999, 544205, 642417, 565070, 475764, 556738, 520582, 527625, 320157, 92886, 211079, 428874, 402011, 204151, 147789, 179109, 193093, 303881, 289091, 258414, 225504, 333606, 259519, 230170, 365006, 377944, 225275, 189262, 264965, 188359, 116476, 148179, 205713, 84288, 37434, -52728, 37635, 53841, -19945, -63422, -72455, -14122, 13027, -103451, -65849, -117408, -119406, -135744, -231604, -205690, -212041, -147982, -141729, -164450, -169995, -155089, -178946, -216703, -107117, 4162, 25345, -8771, 26094, -36252, 16202, 5702, -25182, -73813, -113921, -89144, -41988, -13958, -75716, -101040, -92859, -119641, -158342, -78959, 53510, 84289, 63792, -29238]
11602b9238m5450j0672m2607L4288k9461p7426p182J06796Q0496j0509L4519O0958
11590F4512j11708n7627K7597p7778j33028j149N7437L7503J53472J46983K4906
11579A31120q1084j76375M9133N3841O5726M175o7567j23362M2147J36623P388
11568D1765r2959M9176J44606j3229k9332P4989L4162p4186j09032m391L2994
11557E4563J4238r8100K1058L2792j3370j19848n292K25j0138K7616m0136l4230
11545a70622J47110J08144m1265q4501k3539J32943l7949j16047o6775p4195O8319
11534a58377J6583Q0954J9496q3225j67240K0233O8289N7698O6194J23848k4401
11523B0052q9366l9769J8074n4891M8239J53406L6549p5790q388J34243R1404
$$ y = [-29238, -74688, -85360, -127967, -93679, -123140, -200566, -207748, -100952, -20456, -30965, 3554, 64512, -47196, -104823, -77226, -155004, -288032, -289181, -231744, -194241, -40769, 106214, 131120, 50036, -126339, -77206, -23365, 42361, 46536, -21031, -144393, -102246, 34377, 41765, -51194, -2018, 142588, 129359, 100027, 175016, 209178, 134992, 25960, 21569, 54563, 68801, -29299, -8241, 24551, 11181, -108667, -113959, -113734, -123872, -96256, -136392, -170622, -23512, 84632, 43367, -41134, -64673, 68270, 30321, -85726, -152501, -226696, -158377, -141794, -60840, -41344, -124569, -291809, -271576, -203287, -145589, -79395, 44453, 20052, -69314, -109083, -91009, -145900, -97661, 55745, 92294, 16504, 8116, 142359, 233763]
11512B33763N6998M4932n4382R6760Q7898n551k9479R8251n6847j13071j9869
11501C39403k8807j4065M3241L1265j10201J3132L8400J09414K08577J87994J93792
11490A012145J30423P4718r5924j30182o9044j29736j91616j59747q8828K8583
11480C80792Q4695M5396p2077k18729P8075K18460R1871K6473J14815P3277O6160
11469H89208N733M470j15186n7714p572q075r0768j30894k4609r73K7200n6265
11457D34555J7150r747j0632l7736J4120n5250L3794j01468q7533J0600l1965
11446A75888j9981j11102j07729r1452j1189k8141l6419K8420M0710j10857P8648
11435a93204J42221N6368J0491j26055j68965J19507N9363J7490J83482N9971
$$ y = [233763, 290761, 335693, 281311, 378071, 465969, 460418, 430939, 529190, 472343, 359272, 339403, 310596, 296531, 339772, 371037, 260836, 273968, 312368, 421782, 630359, 818353, 1012145, 1142568, 1217286, 1121362, 991180, 922136, 792400, 600784, 441037, 352209, 380792, 465487, 510883, 438806, 220077, 298152, 516612, 608483, 634956, 749771, 823048, 889208, 894941, 899411, 784225, 726511, 718939, 710864, 620096, 489202, 464593, 463620, 490820, 434555, 451705, 441958, 431326, 393590, 407710, 352460, 386254, 284786, 197253, 207853, 175888, 155907, 44805, -62924, -154376, -165565, -193706, -230125, -201705, -160995, -271852, -193204, -50983, 5385, 15876, -110179, -279144, -159637, -100274, -82784, 100698, 160669]
11425A60669J2360j17664O5114J35439P7959l4282m3720R6755n5417o31n2225
11414B44357r9318J02300J4404l7335J72698O1727j38187n892J3677o98o6755
11403B60978n8130j6651j01607m6986K0888k9824L7200K7659R0594j4725O4829
11392B34225k7321J7416j41252j60157o8432L3743N9818O2230K7002o6654q8425
11381a17807k6527O9839R9080M5255m0673m3028K9855o3103l1989N3781R583j46329
11369a62063q0296L5219M2182n4015o2138k0328K3598K7984M5644n8315P5117
11358a87411M4807N8006n0616k1375m2921K7932m3414K8841J69117L5677o4985
11347d6342k5261k381J6045r0016m9642O8167N7042l3206M8392N7212J5920L229
$$ y = [160669, 173029, 55365, 120479, 255918, 333877, 299595, 255875, 352630, 297213, 296582, 244357, 145039, 247339, 261743, 224408, 397106, 458833, 320646, 314754, 328431, 327733, 260978, 202848, 186197, 84590, 37604, 58492, 28668, 65868, 93527, 184121, 169396, 234225, 206904, 224320, 83068, -77089, -145521, -111778, -51960, 10270, 37272, -29382, -117807, -144334, -74495, 24585, 69840, 29167, -13861, 15994, -47109, -79098, -25317, -15734, -162063, -242359, -207140, -164958, -218973, -281111, -301439, -277841, -249857, -204213, -262528, -187411, -142604, -84598, -135214, -156589, -199510, -171578, -214992, -186151, -17034, 18643, -46342, -71603, -73984, -57939, -147955, -197597, -129430, -72388, -105594, -57202, 10, 15930, 19159]
11335A9159L6182l0596r2324K6158p0898r7714L5448R6724M5077j7090j6156J1999
11323e4031j05699r13J77015M7934j05585q3020p4446j35266L5681J40813N5975
11312a01542l1460L8209N871n4998j13065Q3441p024o9132k7902o7237K7348L3971
11300b83520k088K9939J20134L0386n7801j28999Q830J03349k7288L7630O9260
11289a00168M6070o5896R9857j0805r2441r1877l4732L441m2573L7097J36503
11278a15524k1727K3320p3465m9175J15341j7307M9527P1852k808J7769P579p6648
11266g1266Q323J5449k9352n2083k5060j2495Q552K3559m7269m9041q6135M9019
11254b67799N6871K5180o8761M8191J50019r670J20403n5017n8639o4644M4917
$$ y = [19159, 55341, 24745, -67579, -41421, -112319, -210033, -174585, -77861, -32784, -49874, -66030, -54031, -159730, -160643, 16372, 64306, -41279, -124299, -198745, -334011, -298330, -157517, -101542, -133002, -94793, -88922, -143920, -256985, -173544, -180568, -249700, -277602, -344839, -317491, -283520, -285608, -255669, -135535, -105149, -162950, -291949, -283119, -179770, -207058, -169428, -100168, -54098, -119994, -20137, -30942, -123383, -215260, -249992, -246551, -289124, -252027, -115524, -137251, -113931, -187396, -236571, -121230, -138537, -89010, -17158, -19966, -2197, 5382, -71266, -62943, -47494, -76846, -128929, -153989, -166484, -157932, -134373, -181642, -230683, -316818, -267799, -210928, -185748, -254509, -206318, -56299, -65969, 54434, -583, -59222, -123866, -78949]
11243g8949J6216l8206j3180n9333J03628L547q2070J6102O6010n990o1884K1803
11231a12306O2298q2307j17658K6316J54333N1097P0283p794k0968l0920n0039
11220e7665J06097m0029j10757j04117P1682J20123J00827k8624j45143p73m3102
11209a31481n939J11357K6958J6935q276o9324j5690O7272j4514q6612k2123O7867
11197f3570J1651Q648l3177r8485M1476J39525Q296o0367j5377k8129l4917p7649
11185b02075o1765j032J67276K20371K3797j5297L1992j7569q5102n1650k1855
11174a2909M2443j6736K6427J7030J17654R0562J58693L22759J98154J8123k2965
11163I39235o5294q6901q9869k09312p8756J8459q4777j39538q5446j7516q9707
$$ y = [-78949, -62733, -100939, -114119, -173452, -69824, -66277, -148347, -132245, -66235, -72225, -134109, -112306, -50008, -132315, -249973, -223657, -69324, -18227, 52056, 44262, 23294, -7626, -57665, 48432, 8403, -102354, -206471, -134789, -14666, 86161, 57537, -87606, -88379, -131481, -137420, -26063, 895, 17830, 9554, -59770, -75460, -8188, -22702, -109314, -131437, -63570, -51919, -43271, -76448, -174933, -133457, 6068, 14364, -46003, -61380, -89509, -124426, -202075, -263840, -264872, -97596, 122775, 146572, 131275, 163267, 145698, 60596, 8946, -12909, 29534, 12798, 39225, 56255, 173909, 264471, 423164, 745923, 944077, 962200, 939235, 873941, 787040, 697171, 487859, 409103, 427562, 342785, 203247, 117801, 100285, 10578]
11152A0578J5000j5260Q053p2193J5236J48813J0033K291l1229n0068r1149m0743
11140i0638l5132J21870O333l4812j3769j5107L9738M2259k6828P5623P186p0687
11128F036l1193p7367p7162n0006l2712J9869L2878L2348o893R3103O6195L6308
11116A1404N3231n0729m5390p161M3477o7885j59671o2154K5830M2975q0589R7312
11104a99350J37893N9676O585M1185L2608q3545r318K2610P5354o2010j24392
11093a02704o9270O2337K11994N0524l9004p0728p5893P629l9387l0403L1479
11082f3426l6441Q6248K2044j5696l9747J61174O2378O790K8646j41584r021K2916
11070H4281L3943j02733N5524Q076l3388j845j0412m5004J5459J26451P2086m514
$$ y = [10578, 25578, 10318, 18371, -53822, -38586, 110227, 120260, 122551, 91322, 41254, -49895, -90638, -125770, -3900, 2433, -32379, -46148, -61255, -21517, 20742, -6086, 69537, 76723, 6036, -25157, -102524, -179686, -229692, -262404, -242535, -209657, -177309, -184202, -91099, -24904, 11404, 64635, 13906, -31484, -38645, 4832, -63053, -222724, -284878, -259048, -216073, -296662, -199350, -61457, -1781, 4804, 45989, 78597, -4948, -14266, 8344, 83698, 21688, -102704, -171974, -109637, 102357, 152881, 113877, 43149, -32744, -25115, -64502, -94905, -63426, -99867, -13619, 8425, -7271, -47018, 114156, 176534, 183324, 211970, 70386, 61365, 84281, 118224, 15491, 71015, 79091, 45703, 43858, 33446, -11558, 3901, 130352, 202438, 197924]
11058A97924p3523p2908o2632l4480M7934J9749K7081L8821J2004L9138O6391
11047B05499k7829r5886n1659k5730N3731M6828j23431o3808N0899l611K2547
11036a2450l2293Q9321o3408n1270l6383l2013J40332L8309n3517j3041k5604
11025e2017J19189P1488L6241L1688l5733q9033J03609K7228k9935o3990p880
11014A10855L0371J02812P2830r2222j2982J3665L9043j8877j2059k2287L232
11003B14381N7098O6706p0462m5817j32696l6711O3776l166j04712m7087J19926
10992H1236O0329j3299M3387j7410M3802k9612q6648J46597K0582j37944j17816
10981f796L0691R8425M3684M3923K8711K4216K3519j05054M5054J50527k2835
$$ y = [197924, 124401, 51493, -11139, -45619, 2315, 22064, 49145, 87966, 99970, 139108, 205499, 177670, 81784, 30125, 4395, 58126, 104954, -18477, -82285, -31386, -34997, -12450, -44743, 44578, -18830, -70100, -106483, -138496, 1836, 40145, -13372, -26413, -52017, 67172, 138660, 174901, 206589, 170856, 81823, 185432, 212660, 182725, 118735, 110855, 141226, 244038, 316868, 224646, 211664, 225329, 264372, 245495, 233436, 211149, 214381, 271479, 338185, 267723, 221906, 89210, 52499, 116275, 113109, 8397, -38690, 81236, 141565, 128266, 171653, 154243, 198045, 168433, 81785, 228382, 248964, 111020, -6796, 23895, 122320, 166004, 209927, 238638, 262854, 286373, 181319, 226373, 376900, 354065]
10970C54065j77517r9988Q856J5179M8175m8221j0204R2485J23389l7952j80111
10959H8156o2433P5987J31941M2359J8130l6099K5632o1452J0163J4523n938p7150
10947A63819j6503l4658k9727J12113m1408k8562q0591j7154O7888P1899J866
10936A68982n4174j4427r703R993L3397m0988J35350J61556j8463M014o7707p7433
10924B30397O3256j3038L251M0586J10467L4469j48731p1620N7764j3749k1500
10913B71552m464L7018J5397l0348q1009l5387R7779p6212q1176N8175O0253R8674
10901C30252M0117j9451L1312l2857j5008J0894k0964N197l3123o3385K3811O4899
10889C21694M1812q541J2337l1663n350M8559m1942L2510J01701L5612m0556k7671
$$ y = [354065, 176548, 76560, 85416, 100595, 148770, 100549, 90345, 182830, 306219, 268267, 88156, 25723, 101710, 233651, 276010, 294140, 258041, 283673, 222221, 232384, 246907, 240969, 163819, 147316, 112658, 82931, 195044, 153636, 125074, 44483, 27329, 95217, 167116, 168982, 114808, 100381, 90678, 100671, 134068, 93080, 228430, 389986, 371523, 375537, 307830, 230397, 293653, 280615, 283866, 324452, 434919, 469388, 320657, 249037, 306801, 293052, 271552, 267088, 304106, 319503, 289155, 208146, 172759, 270538, 194326, 113150, 171325, 231578, 330252, 370369, 350918, 382230, 349373, 334365, 345259, 324295, 329492, 296369, 232984, 256795, 321694, 363506, 354965, 367302, 335639, 330289, 378848, 336906, 369416, 471117, 506729, 466173, 438502]
10877D38502K623j38522l9670n908m1002l0584R0467N1214j8146j16853J5712
10866B07833j322L0914Q9453J6987r090K8243Q9758k9122Q9583j0628m4082J5610
10854D74137J03278n03m6294L9490L8887o5672J1910j5874M6316N9665l9880N9945
10842F65405j8098j10336p8120L6667J04590r205j8636o5072k9303j9661J2144
10831D70375J00699M8620l8528M916k154p5556M5381j9274j700P7203R7786L7898
10819G45666j96616n0773Q9971m1768n9180j0256o3743M9205Q9870q6476k4936
10808D40964L8183P8032R284L7871P9373m361r9606o286L0259J5542J66881j1136
10796G75000N27J14138O1876K66K6907j02100l38N9026q7068J1225j27388j5174
$$ y = [438502, 441125, 302603, 262933, 257025, 216023, 185439, 275906, 327120, 308974, 192121, 207833, 206511, 237425, 326878, 343865, 334775, 363018, 452776, 423654, 513237, 502609, 458527, 474137, 577415, 576912, 530618, 570108, 608995, 543323, 555233, 539359, 585675, 645340, 605460, 665405, 647307, 536971, 458851, 495518, 600108, 590903, 572267, 507195, 477892, 458231, 470375, 571074, 619694, 581166, 586082, 583928, 508372, 553753, 534479, 532779, 609982, 707768, 745666, 549050, 498277, 588248, 546480, 487300, 477044, 413301, 462506, 552376, 465900, 440964, 479147, 557179, 566463, 604334, 683707, 679346, 579740, 573454, 603713, 619255, 786136, 775000, 775527, 889665, 951541, 951807, 978714, 876614, 876276, 935302, 848234, 859459, 732071, 716897]
10784G16897R5695j3854j10574k1470J0213M5557Q9579K3283K8313o0653p1247
10773G31739k6725Q1638p0785m339J09582p6445p3161J6823l7365p028P9875L8178
10761G61987j0615o3733r3750M6663J3536N0048J8885j09749R3825M0335O021
10750G53453Q1523l0461n7023L1108Q2962J03282Q9826q6753m7395p824j2174
10739I00524j09682j20077J60481Q2132l0799J8803P4673J39908l0133j81635
10729I04195o0438L6852N391K9965J01014j3290N0866L6552r879N5082O5559p064
10717A194805j03412n0501M3121o5467j26850p9831J6087M7902J14952M7457j3077
10706A025186j3843Q1497O2840q8052m5749L3325o9717r2277n3318N7672L3582
$$ y = [716897, 812592, 798738, 688164, 666694, 676907, 722464, 812043, 835326, 863639, 802986, 731739, 705014, 786652, 715867, 711528, 821110, 744665, 671504, 688327, 650962, 643934, 723809, 761987, 751372, 687639, 593889, 640552, 654088, 704136, 723021, 613272, 707097, 747432, 753453, 834976, 804515, 747492, 778600, 861562, 964844, 1054670, 967917, 920522, 912698, 900524, 790842, 670765, 831246, 913378, 882579, 901382, 976055, 1115963, 1085830, 904195, 843757, 880609, 886000, 915965, 1016979, 1003689, 1054555, 1091107, 1081228, 1136310, 1201869, 1194805, 1091393, 1040892, 1084013, 1018546, 891696, 811865, 827952, 875854, 990806, 1038263, 1025186, 1011343, 1092840, 1155680, 1067628, 1021879, 1055204, 985487, 893210, 839892, 897564, 931146]
10695I31146J19614l081l0139l9156r3635N6317R8276R8267n1467j10740j0562
10684I64840J06123n2240p038k4407p6550L6317L9062P5160P5500l3838k7207
10673A075722J19479O1327L4145l8457M3129O1898j8356J5343k5239k6721M5375
10662A347645M2338j05623r015N4746M801Q5039j3146j04842k02o0608J7404J1086
10650A269623r632M4747M6487L4420J30710K7391J8354k0314l0087O5634p7782
10639A499551j42831r3433P3718K36783J59265j41501l1910L1358r612L2762N0589
10628A664739M5945L7827O3434l4657r0148K1517K1930O1890r952J07058J02942
10617A992525n2540q5959m7976M9152M771P6320J74818j8937j5088K24067Q0762
$$ y = [931146, 1050760, 1047679, 1017540, 978384, 884749, 941066, 1039342, 1137609, 1086142, 975402, 964840, 1070963, 1018723, 1011685, 987278, 910728, 947045, 986107, 1061267, 1136767, 1102929, 1075722, 1195201, 1256528, 1290673, 1252216, 1295345, 1357243, 1338887, 1354230, 1328991, 1302270, 1347645, 1389983, 1284360, 1275345, 1330091, 1334892, 1419931, 1406785, 1301943, 1301741, 1241133, 1258537, 1269623, 1259991, 1304738, 1351225, 1385645, 1516355, 1543746, 1562100, 1541786, 1511699, 1577333, 1499551, 1356720, 1263287, 1337005, 1573788, 1733053, 1591552, 1559642, 1591000, 1581388, 1614150, 1664739, 1710684, 1748511, 1811945, 1777288, 1687140, 1708657, 1730587, 1792477, 1782525, 1889583, 1992525, 1939985, 1854026, 1806050, 1855202, 1859973, 1936293, 2111111, 2092174, 2077086, 2301153, 2381915]
10606B381915l2759j01782j53733j74969J7430J09023j24152q6622M42J5110o5835
10595A784068l7333Q641O406m0092j170L9100R9717M7681R8491k8556K8376k6324
10583A979005M5248O7945R9361R2902J05746n9668o2028j16594M1134P3853K7236
10572B294140l1567P4002k1584M980K6921Q921L8179l5907n9411l3196J9704Q7558
10560B372740N1349k6224K8262R4861J3384m4490P7196J49039j1536j41297j7326
10549B545958n949K426o212l285O2564J09951m0538p5542m0915J0002J50378K359
10537B711197J30077O1108n8563r553q005M309O0633P0869P7457K3677N7745K7233
10525C148184p4670j02812L6923l530l8814J71826P6754n5584k157L6524K7544
$$ y = [2381915, 2349156, 2247374, 2093641, 1918672, 1936102, 2045125, 1920973, 1834351, 1834793, 1849903, 1784068, 1746735, 1755376, 1761782, 1721690, 1720520, 1759620, 1859337, 1907018, 2005509, 1976953, 2005329, 1979005, 2024253, 2092198, 2191559, 2284461, 2390207, 2330539, 2268511, 2151917, 2193051, 2266904, 2294140, 2262573, 2336575, 2314991, 2319971, 2346892, 2355813, 2393992, 2358085, 2298674, 2265478, 2285182, 2372740, 2424089, 2397865, 2426127, 2520988, 2534372, 2489882, 2567078, 2716117, 2704581, 2563284, 2545958, 2540009, 2542435, 2536223, 2532938, 2595502, 2705453, 2664915, 2589373, 2548458, 2558460, 2708838, 2711197, 2841274, 2902382, 2843819, 2834266, 2826261, 2830570, 2891203, 2962072, 3039529, 3063206, 3120951, 3148184, 3073514, 2970702, 3007625, 3004095, 2965281, 3137107, 3213861, 3158277, 3156120, 3192644, 3220188]
10514C220188Q4974J79433O5658j644K5436N2522L002Q0181M3346l801K4763P695
10502C781753k9655K0588O5587K5779m3791M1786M752P0785k5433O641l3904N2899
10490C937787k465N8549P1461O6141O1597m6685L8489J22307P7083O7520n4986
10479D396798L7598Q4112l2408K6066J319J25376P8928j749J4735r2830J00522
10468D738467K7485k2663N5014Q7645J424n9613q658J10828K11680M4397L5876
10457E221882K4591l201j9662J051O6799K9890J23149Q4874L4489J19898R8637
10446E782397O5502P5530J17039K4073J26534N2604J3130p0477J673J52891K18646
10435F559542J55027N5235R7347k800J3480O4438J75921O0684L9598K4693J03879
$$ y = [3220188, 3305162, 3484595, 3550253, 3548609, 3574045, 3626567, 3629569, 3709750, 3753096, 3749295, 3774058, 3781753, 3752098, 3772686, 3838273, 3864052, 3820261, 3862047, 3866799, 3937584, 3912151, 3918792, 3884888, 3937787, 3935322, 3993871, 4065332, 4131473, 4193070, 4146385, 4184874, 4307181, 4384264, 4451784, 4396798, 4434396, 4518508, 4486100, 4512166, 4513485, 4638861, 4717789, 4716040, 4730775, 4637945, 4738467, 4765952, 4743289, 4798303, 4885948, 4887372, 4827759, 4819101, 4929929, 5141609, 5186006, 5221882, 5246473, 5243272, 5223610, 5224661, 5291460, 5321350, 5444499, 5529373, 5563862, 5683760, 5782397, 5847899, 5923429, 6040468, 6064541, 6191075, 6243679, 6256809, 6186332, 6188005, 6340896, 6559542, 6714569, 6769804, 6867151, 6864351, 6877831, 6942269, 7118190, 7178874, 7218472, 7243165, 7347044]
10424G347044P5593q3281P0835R0663M2959J1459J72221Q5279K1894Q2907N3309
10413G970882J06071J57532J05849N2769N8572P6558J15638J81810k4781J10603
10403H911503J84878N4582N7661J49704O1870O6315J00916J82677J04339J45356
10393A0019801K82065J31420k3148P7708J46104J26824M9202R6202J24177J90242
10383A1220597J78160J30291J59254O1392J31529J53808K57210J91080P0873J98634
10373A2752828J24191J89815J95224R7895J57658K19903L51760K02169J33403
10364A4424846J02226K11515J96897K28368J79962J01142J90771R0913J69239
10355A5895879J76462K77697L15815K57824K85222K08363K18464K28533K85071
$$ y = [7347044, 7422637, 7339356, 7410191, 7500854, 7543813, 7555272, 7727493, 7812772, 7834666, 7917573, 7970882, 8076953, 8234485, 8340334, 8393103, 8451675, 8528233, 8643871, 8825681, 8800900, 8911503, 9096381, 9150963, 9208624, 9358328, 9420198, 9486513, 9587429, 9770106, 9874445, 10019801, 10301866, 10433286, 10410138, 10487846, 10633950, 10760774, 10809976, 10906178, 11030355, 11220597, 11398757, 11529048, 11688302, 11749694, 11881223, 12035031, 12292241, 12483321, 12554194, 12752828, 12877019, 13066834, 13262058, 13359953, 13517611, 13737514, 14089274, 14291443, 14424846, 14527072, 14738587, 14935484, 15163852, 15343814, 15444956, 15635727, 15726640, 15895879, 16072341, 16350038, 16665853, 16923677, 17208899, 17417262, 17635726, 17864259, 18149330]
10346A8149330J70495J44585K19964J95167K28171L18250K61032K15859K66806
10337B0169659K71336L55982K66990L12029J98310L07899L13189L41747K42575
10328B2779716K46274L67398M11781L65343K18969L86541M46165M22426L79013
10319B6023626L85577L73043L19393L86718L96158K70140K14519K58599M20206
10310B9047979M40026M05720L94541M50535M17974L88135L62058K36277M19840
10301C2563085N10965L36128L49230L21845N09510N10814L64667L57146L92405
10292C6215795M74872M81595L39654L37871N34404M43662L61117L34088M01004
10283C9924062M08220M95144L53293K27370L05414L80859M92368L75522K11274
$$ y = [18149330, 18319825, 18464410, 18684374, 18879541, 19107712, 19425962, 19686994, 19902853, 20169659, 20440995, 20796977, 21063967, 21375996, 21574306, 21882205, 22195394, 22537141, 22779716, 23025990, 23393388, 23805169, 24170512, 24389481, 24776022, 25222187, 25644613, 26023626, 26409203, 26782246, 27101639, 27488357, 27884515, 28154655, 28369174, 28627773, 29047979, 29488005, 29893725, 30288266, 30738801, 31156775, 31544910, 31906968, 32143245, 32563085, 33074050, 33410178, 33759408, 34081253, 34590763, 35101577, 35466244, 35823390, 36215795, 36690667, 37172262, 37511916, 37849787, 38384191, 38827853, 39188970, 39523058, 39924062, 40332282, 40827426, 41180719, 41408089, 41713503, 42094362, 42586730, 42962252, 43173526]
10274D3173526K81233L37699M38236L59156L70445L01019J90381K33691K28985
10265D5914371J96029K67052J41781J16207J64403K94073K24686J31736J28223
10256D7578561K19160K00273R7315J8044J04327n062N298p5487j03143J29838
10246D8169124J95267J7599n9912j33961q3703j17787k10022j15361j38213j78368
10236D7344663j81196j63267l43439k27757j72099r7173j66832k93359l46758
10227D5352783l75565l11290k24956j73183j68830k50119k58055l60460l28475
10218D2901850l33928l49598l43239m36440m00965k81568m32130m28225l43582
10209C9552175j97098l75009m36123m40844l71412l42653m21037l64121l63886
$$ y = [43173526, 43454759, 43792458, 44230694, 44589850, 44960295, 45261314, 45451695, 45685386, 45914371, 46110400, 46377452, 46519233, 46635440, 46799843, 47093916, 47318602, 47450338, 47578561, 47797721, 47997994, 48095309, 48113353, 48217680, 48212618, 48217916, 48142429, 48039286, 48169124, 48364391, 48381990, 48322078, 48188117, 48104414, 47986627, 47776605, 47661244, 47523031, 47344663, 47163467, 47000200, 46656761, 46429004, 46256905, 46159732, 45992900, 45699541, 45352783, 44977218, 44665928, 44440972, 44267789, 44098959, 43848840, 43590785, 43230325, 42901850, 42567922, 42218324, 41875085, 41438645, 41037680, 40756112, 40323982, 39895757, 39552175, 39355077, 38980068, 38543945, 38103101, 37731689, 37389036, 36967999, 36603878, 36239992]
10200C6239992l08430m42729m70749l58612k48499m20568l02691l98000l97361
10191C2892353k11873l18981l79367m29259l77993k89565k99417l42748l55406
10182B9887744l95108l81868l39843l18469l48101l25923l48706k78007k54022
10173B6897697k47598k45140l35106l39542j66285j96998k94437k58852l77638
10164B4436101l27397k66104k77682j35881j88378k66329l17495l56770l59851
10155B1940214l35462j51139j77498j32876k85310l66440j46930j66470k32559
10146A9945530k07808k61347j02466j82272k45382j70744j33508j72005j37682
10137A8332316k51659k27206k87961l10179j44223q3314j57423r1967j09234j35160
$$ y = [36239992, 35931562, 35488833, 35018084, 34659472, 34410973, 33990405, 33687714, 33289714, 32892353, 32680480, 32361499, 31982132, 31552873, 31174880, 30885315, 30585898, 30243150, 29887744, 29492636, 29110768, 28770925, 28452456, 28104355, 27778432, 27429726, 27151719, 26897697, 26650099, 26404959, 26069853, 25730311, 25564026, 25367028, 25072591, 24813739, 24436101, 24108704, 23842600, 23564918, 23429037, 23240659, 22974330, 22656835, 22300065, 21940214, 21604752, 21453613, 21276115, 21143239, 20857929, 20491489, 20344559, 20178089, 19945530, 19737722, 19476375, 19373909, 19191637, 18946255, 18775511, 18642003, 18469998, 18332316, 18080657, 17853451, 17565490, 17255311, 17111088, 17027774, 16870351, 16778384, 16669150, 16533990]
10127A6533990r3565k44550k08724L8444j27056j53843k27820k99100j47320j06767
10117A4963689j42142j37827j15886o7019l8521o4228j23740l2634j66183k44188
10107A3831321k63725j19825J0290p8090j84166k26516k26130q2946j24722j72281
10097A2363210m7334j75851j70995p8927j4786J926j32662j27032q5914L6776
10087A1568411n6515K8091j04442r8564k7542l0369j1567j08536q7875N656n089
10076A1071659j33324j38887j05706j06136j68832m4805j14325j21738j52821
10067I985085n9668k3299L9023j37342m219J3144p6631J900K6528j4980M332O8152
10055I822025L9920N8313M6328j81889j92781j55914j08591j18849k57441o1374
$$ y = [16533990, 16440425, 16195875, 15987151, 16025595, 15898539, 15744696, 15516876, 15217776, 15070456, 14963689, 14821547, 14683720, 14567834, 14500815, 14462294, 14398066, 14274326, 14241692, 14075509, 13831321, 13567596, 13447771, 13458061, 13379971, 13195805, 12969289, 12743159, 12660213, 12535491, 12363210, 12315876, 12140025, 11969030, 11890103, 11875317, 11877243, 11744581, 11617549, 11531635, 11568411, 11511896, 11539987, 11435545, 11336981, 11309439, 11279070, 11267503, 11158967, 11071092, 11076748, 11071659, 10938335, 10799448, 10693742, 10587606, 10418774, 10373969, 10259644, 10137906, 9985085, 9925417, 9902118, 9941141, 9803799, 9799580, 9812724, 9736093, 9737993, 9764521, 9749541, 9753873, 9822025, 9861945, 9920258, 9966586, 9784697, 9591916, 9436002, 9327411, 9208562, 8951121, 8889747]
10045H889747J31943K8132n3213K3188n3475q9079m1804j48619j25260J7197J7422
10034H596179j22358j60504j43999k05714K526O7033r2140k9446K2089k7476p0531
10023G835659j7164j2258k1238n9991J5804Q7914J13029J15590J0927L5932K2449
10012H126653j4811l4507j23879j51630m8507j39919k25584j08681N728K116R1650
10001G378629L526m1505j46124j36518j23266L4513J45174M4148p3938j11391
9991F973248k15443n7838q6574j6939k0350m2220m1316o42j01154j23334n7585
9980F209853j13005K7784Q2457R0185J52827J85202R1829J21225M2041P242L0366
9969F928006m0169o0842j6769j09768l0429j36490j34846m2262j9535N3914n4071
$$ y = [8889747, 9021690, 9049822, 8996609, 9019797, 8966322, 8877243, 8835439, 8686820, 8561560, 8578757, 8596179, 8473821, 8313317, 8169318, 7963604, 7966130, 8033163, 7941023, 7911577, 7933666, 7906190, 7835659, 7818495, 7806237, 7784999, 7725008, 7740812, 7828726, 7941755, 8057345, 8068272, 8104204, 8126653, 8111842, 8077335, 7953456, 7801826, 7753319, 7613400, 7387816, 7279135, 7284863, 7286979, 7378629, 7382155, 7340650, 7194526, 7058008, 6934742, 6969255, 7114429, 7158577, 7084639, 6973248, 6757805, 6699967, 6613393, 6596454, 6576104, 6533884, 6492568, 6491926, 6390772, 6267438, 6209853, 6096848, 6124632, 6207089, 6297274, 6450101, 6635303, 6727132, 6848357, 6890398, 6897640, 6928006, 6887837, 6826995, 6810226, 6700458, 6670029, 6533539, 6398693, 6356431, 6336896, 6390810, 6336739]
9958F336739p0763K4191Q1903j89480j35580j35114j56240l9757J1438m7152J948
9947E682133p2072n1812r8027j41796Q4697O0385L0453K1509m9718N2459J15801
9936E634012n0460k23071r6268n6283k6864J41867K20802R2836Q1032M1411q6889
9925E672125l684N2280J71591J63285K3082q2942q9533j28074j01827K8671j15453
9914E589521j08321L8309q4385j52168j68006n4543l8693j2869j3484L140k4410
9903D974091L1547P4320M0468J256j01791N0733K7572N846j31424m3183Q0205
9892E009640R0439L5865M1402N9636J15424N07J6406o0640n1859R2409J7555J09726
9880E476510M8697j18079p5427L7295P263l9763N2297j90967j83415n4795j24440
$$ y = [6336739, 6265976, 6290167, 6372070, 6182590, 6047010, 5911896, 5755656, 5715899, 5727337, 5680185, 5682133, 5610061, 5558249, 5460222, 5318426, 5403123, 5463508, 5493961, 5515470, 5465752, 5518211, 5634012, 5583552, 5360481, 5264213, 5207930, 5181066, 5322933, 5543735, 5636571, 5717603, 5759014, 5672125, 5668441, 5720721, 5892312, 6055597, 6078679, 5995737, 5906204, 5778130, 5676303, 5704974, 5589521, 5481200, 5519509, 5435124, 5282956, 5114950, 5060407, 5021714, 5008845, 4995361, 4998501, 4974091, 5005638, 5079958, 5120426, 5121682, 5019891, 5070624, 5098196, 5104042, 4972618, 4929435, 5009640, 5100079, 5135944, 5177346, 5236982, 5352406, 5352913, 5369319, 5308679, 5256820, 5349229, 5366784, 5476510, 5525207, 5407128, 5331701, 5368996, 5376259, 5336496, 5388793, 5197826, 5014411, 4959616, 4835176]
9869D835176k3496R5200q8550p4446k3796Q2711p0011M7008R8644l3345j0995
9858D834100J5247j22886n3217q3423l1475L1775m4389M1027L1369Q0375K8535
9847D727038m3891o7628R4845M2648O887m9733m5944j49997j889k0615j29330
9836D362391M31M8615p7881q4648J30413J53336L4629k3682p3547l4180p5439
9825D360438K3396M9754n8864n2680r0534k9390O2012j810j66541K6532O5817
9814D188130R3652L6924P77R9318K4937l6488M3407r1921l6175k0369j1491J09535
9802D400236M5312j20421n8590P6269N6856q077k4082M3909m4638j0572r1382
9791D264820N2718O4308q16J2810m4008M9814k1351J8268R581j7107j29277j19852
$$ y = [4835176, 4811680, 4906880, 4818330, 4743884, 4720088, 4802799, 4732788, 4779796, 4878440, 4845095, 4834100, 4849347, 4726461, 4673244, 4589821, 4558346, 4590121, 4545732, 4586759, 4618128, 4698503, 4727038, 4683147, 4615519, 4710364, 4753012, 4759899, 4710166, 4664222, 4514225, 4512336, 4491721, 4362391, 4362822, 4411437, 4333556, 4248908, 4379321, 4532657, 4567286, 4543604, 4470057, 4435877, 4360438, 4383834, 4433588, 4374724, 4322044, 4231510, 4202120, 4264132, 4262322, 4095781, 4122313, 4188130, 4281782, 4318706, 4319483, 4418801, 4443738, 4407250, 4450657, 4358736, 4322561, 4302192, 4290701, 4400236, 4445548, 4325127, 4266537, 4342806, 4399662, 4391585, 4367503, 4411412, 4366774, 4356202, 4264820, 4317538, 4381846, 4381030, 4393840, 4349832, 4399646, 4378295, 4396563, 4406144, 4389037, 4259760, 4139908]
9779D139908l4038K6737K6957Q8898m5355K1432l615p3069k3656K935J46264J16085
9767D389483L5035m3140o2876K9155R6134j5357j244Q4288j44471j88006j27681
9756D051320q0601J17278M5316r747j598L3104P3497J6890k5666M9698O4907j36858
9744D197540L1978l6903r4939N9676L5668k7689j90174j7470K19007l7098l1849
9733D107747J29231N4458K4647M10M4862k3166r4843j6491O6085j0972j28247
9722D153721P4624O400p6200O4344N3142j2119o020O6780J5360p360L2939j1869
9710D353742n5428o7966L8064P8904l5631j62749j4540R3698P8631k6854J1986
9699D291857n4145j24318M4983N9879K3892o1811J9208J14006L8885N0685l9851
$$ y = [4139908, 4105870, 4132607, 4159564, 4248462, 4203107, 4224539, 4220924, 4147855, 4124199, 4127134, 4273398, 4389483, 4424518, 4381378, 4318502, 4347657, 4443791, 4428434, 4427190, 4511478, 4367007, 4179001, 4051320, 3970719, 4087997, 4133313, 4123566, 4121968, 4155072, 4228569, 4245459, 4219793, 4269491, 4334398, 4197540, 4229518, 4192615, 4097676, 4157352, 4193020, 4165331, 3975157, 3957687, 4176694, 4139596, 4107747, 4236978, 4291436, 4316083, 4316493, 4361355, 4338189, 4243346, 4226855, 4292940, 4281968, 4153721, 4228345, 4234745, 4158545, 4222889, 4276031, 4263912, 4257892, 4324672, 4340032, 4332672, 4365611, 4353742, 4298314, 4230348, 4268412, 4347316, 4311685, 4148936, 4134396, 4228094, 4306725, 4279871, 4291857, 4237712, 4113394, 4158377, 4218256, 4242148, 4180337, 4199545, 4313551, 4352436, 4403121, 4363270]
9688D363270o2423O0224J21220L8785M0974J05726K08033J99687O4861K10675
9678E351032K9043j6933K60621K68500J88353J32513J92379J63366P8727R0814
9668F738415J0435K09883L50297L84836L52674J67572R5970K2504j62561k64515
9658G905510k29378k35090r6008j73012k25055Q6979K9023r7009j16081r8186
9648F751693n4425Q6241J61299J59060M09197O28760Q23040J140052J348087J282053
9638A2735057R79549P39179O48180L45258j94212n58156q35211r71290p48519
9629A2139835o11746p90104o69261m94648l14519k39963j80063j12040q9060N0428
9619H688859J50258M26051M70717N46980N78023O16038P01586P37285Q37635R24610
$$ y = [4363270, 4300847, 4361071, 4482291, 4521076, 4562050, 4667776, 4875809, 5075496, 5140357, 5351032, 5380075, 5363142, 5623763, 5892263, 6080616, 6213129, 6405508, 6568874, 6647601, 6738415, 6748850, 6958733, 7309030, 7693866, 8046540, 8214112, 8310082, 8332586, 8170025, 7905510, 7676132, 7441042, 7345034, 7172022, 6946967, 7033946, 7062969, 6965960, 6849879, 6751693, 6697268, 6783509, 6944808, 7103868, 7513065, 8141825, 8964865, 10104917, 11453004, 12735057, 13714606, 14453785, 15101965, 15447223, 15253011, 14694855, 13859644, 12888354, 12139835, 11528089, 10737985, 10068724, 9574076, 9259557, 9019594, 8839531, 8727491, 8638431, 8688859, 8839117, 9265168, 9735885, 10282865, 10860888, 11476926, 12178512, 12915797, 13753432, 14678042]
9609A4678042J250712J826900K696706L549681L441774K807470K309679J794178
9601C4355142J517809J820668K527292L528246N848128J0314481J5728306J6551430
9593I2191502J0161698M385423K34095l636823o357105p589652q484632q827377
9585G2077129q179136o500391m368059j909277J057014M428428O979390Q192150
9577G1777248R112898J0556690J1011212R092227O145426L156130P16712r85061
9569A20583482k201889l111893l817272l745117k991793k207229j938983k389191
9561I8180115k752263j790572L03277L726710Q214271J3306023K0969712L1939150
9553A72096423M3649680M5623628K7477248M284537j3391617k6802207l3151327
$$ y = [14678042, 15928754, 17755654, 20452360, 24002041, 27443815, 30251285, 32560964, 34355142, 35872951, 37693619, 40220911, 43749157, 49597285, 59911766, 75640072, 92191502, 102353200, 106738623, 106972718, 103335895, 96978790, 89389138, 80904506, 72077129, 63897993, 57397602, 53029543, 51120266, 52177280, 56605708, 63585098, 71777248, 80890146, 91446836, 102458048, 111550275, 117695701, 120851831, 121568543, 120583482, 118381593, 115269700, 111452428, 107707311, 104715518, 102508289, 100569306, 98180115, 95427852, 93637280, 93940557, 97667267, 105881538, 119187561, 140157273, 172096423, 215746103, 261369731, 288846979, 293131516, 279739899, 252937692, 219786365]
9546B19786365l1639257k8231437k4321105j8833949j2785316p046457l188187
9539I3740657j643186j330738p41219O72340K297600L451458M090167M694109
9531A05231188M839445M576447L139490K36289k759707n165943p922230j0408186
9523I1766793j1058548j0637760r710238p881236n259600k625963m9925K645315
9515D7188838N025798O274825O784003Q153309J0507310J1321558N850945k544044
9507I8562542p270647j0444104j1935522j0623487q685231o883746n385733l871711
9499C3462361k614097k040472k432628k931238k962544k766832k629402k124203
9491A2960945j772809j475934j068978p57163o02235m95022o54990n90197l20487
$$ y = [219786365, 188147108, 159915671, 135594566, 116760617, 103975301, 96928844, 93740657, 92097471, 90766733, 90025514, 90697854, 92995454, 96446912, 100537079, 105231188, 110070633, 114647080, 117786570, 118022859, 115263152, 110097209, 102174979, 91766793, 80708245, 70070485, 60360247, 52479011, 47219411, 44593448, 44543523, 47188838, 52214636, 58489461, 65273464, 73426773, 83934083, 95255641, 101106586, 98562542, 91291895, 80847791, 68912269, 58288782, 49603551, 42719805, 37334072, 33462361, 30848264, 28807792, 26375164, 23443926, 20481382, 17714550, 15085148, 12960945, 11188136, 9712202, 8643224, 7886061, 7283826, 6788804, 6133814, 5543617, 5223130]
9482E223130k61460l78100j80709m1649m616J75425K38472L10006L43923L43446
9472E767868L46757M56877P51602R27150P78492O86642O20744L56763J8411n03511
9462A0207795q68285j081855j096167j037242r78770o60808n24698m13164k41203
9453C305603j88173o2894n0590M7638N1208n827l6603n1137j8838J69848K17085
9442C377320K49615K82909K82190K11080n496m5603k22321j76037o1761m9087
9432C842809r7805m4455m7441j88238j61294j04473k06814j59429j25123o9465
9422B638272j72407p9623r0890p0427k5460p0128j71760j23460j6527P0414P685
9411A895689N9763O037M6932Q2282L2368k9727K3750o4757q5682N4192P4099Q9735
$$ y = [5223130, 4961670, 4583570, 4402861, 4361212, 4356596, 4532021, 4770493, 5080499, 5424422, 5767868, 6114625, 6571502, 7323104, 8250254, 9028746, 9715388, 10336132, 10692895, 10711306, 10207795, 9339510, 8257655, 7161488, 6124246, 5145476, 4484668, 3959970, 3546806, 3305603, 3117430, 3054536, 3003946, 3051584, 3102792, 3096965, 3060362, 3009225, 2990387, 3160235, 3377320, 3626935, 3909844, 4192034, 4403114, 4397618, 4352015, 4129694, 3953657, 3891896, 3842809, 3745004, 3700549, 3653108, 3464870, 3303576, 3199103, 2992289, 2832860, 2707737, 2638272, 2465865, 2386242, 2295352, 2224925, 2199465, 2129337, 1957577, 1834117, 1817590, 1888004, 1895689, 1955452, 1961489, 2008421, 2090703, 2123071, 2093344, 2117094, 2052337, 1966655, 2020847, 2094946, 2184681]
9399B184681j68508L5959J84825J02520q7777o9439Q7900O4732J0287K6550P048
9388B378778j18989j0483P2959L0799L2818O2805m9262j75533M4288M9332n5908
9377B261604j97381k2512l3333q6008j09410r8224q0862l2071j8555j22541o9429
9366A391278K5032J70921n8391k8322j7661J506r7174p9009N4016o77Q9384K4508
9354A475411p0J61512m2471J6053k0013o2068M5358R7240l3731k5100L017Q9326
9342A704464o5256k1732m8003k1578P425J06040j02506j24669q373P8202J32082
9331A636096k7678m7324j48396N6305J86278P4002J15926J26073L0212K6865J2617
9320B040976L8685J24177J21416R4439K6066J04798J45738K75545K02778J29590
$$ y = [2184681, 2016173, 2052132, 2236957, 2339477, 2251700, 2182261, 2270161, 2334893, 2345180, 2371730, 2378778, 2259789, 2249306, 2322265, 2353064, 2385882, 2448687, 2399425, 2223892, 2268180, 2317512, 2261604, 2064223, 2041711, 2008378, 1922370, 1812960, 1714736, 1633874, 1601803, 1583248, 1460707, 1391278, 1416310, 1587231, 1528840, 1500518, 1482857, 1484363, 1387189, 1308180, 1362196, 1361519, 1450903, 1475411, 1475341, 1636853, 1594382, 1610435, 1590422, 1528354, 1573712, 1670952, 1637221, 1612121, 1615138, 1704464, 1639208, 1617476, 1569473, 1547895, 1555320, 1661360, 1558854, 1434185, 1425812, 1504014, 1636096, 1608418, 1561094, 1412698, 1469003, 1655281, 1729283, 1845209, 1971282, 2001494, 2028359, 2040976, 2079661, 2203838, 2325254, 2419693, 2445759, 2550557, 2696295, 2971840, 3174618, 3304208]
9310C304208J91793J26677K05899K40763K78925M45429L05057K58431J96841m3706
9300E510317r3640k02377k92096j11840j34490k11111j11188p9084O93J34741
9290D409925J81115K42554K54910L02452K48813K78947Q8755R0960r372o5871
9280F023188k6326q7371K758R1560R1533O1848J23668K73991L41932M26176P33923
9269H056880P83211P99914N47056K35157J48458l0781m01763o29823p04974o18594
9259H184741n59696o03335m71992m55250k42374o6943m1028q5243P1221L9065
9249E769166m2058j06103j79034j28624O408n4265j98550l08364l55187l47858
9239D055531j69743j31526j58367m307J31599K07119K49019J83906J81425K23133
$$ y = [3304208, 3496001, 3622678, 3828577, 4069340, 4348265, 4793694, 5098751, 5357182, 5554023, 5510317, 5416677, 5214300, 4922204, 4810364, 4675874, 4464763, 4353575, 4274491, 4275184, 4409925, 4591040, 4833594, 5088504, 5390956, 5639769, 5918716, 6007471, 6098431, 6089059, 6023188, 5996862, 5909491, 5912249, 6003809, 6095342, 6157190, 6280858, 6554849, 6896781, 7322957, 8056880, 8840091, 9640005, 10187061, 10422218, 10570676, 10539895, 10138132, 9508309, 8803335, 8184741, 7625045, 7021710, 6549718, 6094468, 5852094, 5785151, 5744123, 5658880, 5730101, 5769166, 5727108, 5621005, 5441971, 5313347, 5319755, 5265490, 5066940, 4758576, 4403389, 4055531, 3885788, 3754262, 3595895, 3591588, 3723187, 3930306, 4179325, 4363231, 4544656, 4767789]
9229D767789J20196p0128j49963j05435k70273k94432l84443l07820k60787j42826
9219B901878j29497k08231k28815j73101j55555j65189k8154o4532j12649n6241
9209A579914m5381r5334j83290n4026O7290L7309q6417k07519k0030J4301j4653
9198I92164P3497J07172J79706n4456p8093o356Q7989R2174n9356o6345n9309
9187A208787j41631j3201N8085K2803J7290J4211J02388J24270Q5886L4378n7572
9176A455694J62716J85329K4514P2187l0089m4711j05926j4980j05002j06292
9166A493440q317L662p7175j33908n2834j53248j23288O0843k2770J0984P2079
9155A069468r3139p6934J13125K1341r3504O3544J29105L1552l9704j01854r8409
$$ y = [4767789, 4887985, 4817857, 4667894, 4562459, 4292186, 3997754, 3613311, 3305491, 3044704, 2901878, 2772381, 2564150, 2335335, 2162234, 2006679, 1841490, 1813336, 1748804, 1636155, 1579914, 1534533, 1439199, 1255909, 1201883, 1269173, 1306482, 1220065, 1012546, 992516, 1006817, 992164, 1065661, 1172833, 1352539, 1298083, 1219990, 1213634, 1301623, 1393797, 1334441, 1268096, 1208787, 1067156, 1053955, 1112040, 1134843, 1152133, 1166344, 1268732, 1393002, 1478888, 1513266, 1455694, 1618410, 1803739, 1828253, 1900440, 1870351, 1825640, 1719714, 1704734, 1599732, 1493440, 1485123, 1488785, 1411610, 1277702, 1224868, 1071620, 948332, 1009175, 986405, 997389, 1069468, 976329, 899395, 1012520, 1033861, 940357, 1003901, 1133006, 1164558, 1124854, 1023000, 924591]
9144I24591o4863O4190J23825J39052K7469P6200K03831O0397q3583K6929K8088
9133A526126R4446O7817o7046J0231p8630P5995J65693L4076J5095R283n6088
9122A796998j43385j8975l4394k02399j84573l0153M1023o5805k11428j17509
9112H29400K8456J30002J5873l9463p5313l2842o3613L5280j10648j1452j46873
9101E58807J321J12332J34346J59061J15768L5548p2904j39285l0996m6932K1167
9090H48233K4107O376M8735N9863K38270N8568Q497J19153o7477r0195o581Q4797
9078A332346L2033R144m7183j98268q6532n7123j39553k6258L4413o7517k3882
9067G61620o923r2249j0389j5057m966O384L111n5428q7691l1921J29044N6948
$$ y = [924591, 859728, 923918, 1047743, 1186795, 1214264, 1290464, 1494295, 1554692, 1471109, 1498038, 1526126, 1620572, 1688389, 1621343, 1631574, 1552944, 1628939, 1794632, 1828708, 1843803, 1853086, 1796998, 1653613, 1634638, 1600244, 1397845, 1213272, 1183119, 1224142, 1158337, 946909, 829400, 857856, 987858, 1003731, 964268, 888955, 856113, 792500, 827780, 717132, 705680, 558807, 560128, 672460, 806806, 965867, 1081635, 1117183, 1044279, 904994, 873998, 827066, 848233, 872340, 878716, 927451, 987314, 1225584, 1284152, 1292649, 1411802, 1344325, 1254130, 1247549, 1332346, 1364379, 1373523, 1326340, 1128072, 1041540, 984417, 844864, 818606, 853019, 785502, 761620, 754697, 662448, 652059, 637002, 632036, 638420, 641531, 586103, 498412, 466491, 595535, 652483]
9055F52483k7232q7155O9764j5293q6862j23228j8719J60816O6616j03228m6332
9044D41630l1500M9561M0071N3215M0559P209O1788l1593k7420k2142N8296O8493
9032G08167l6598n4871N7290R4716o2729p634M3881J22868J24067N2617J17501
9021A159275O0619k154j82728j18885j54432j19403M5764J1667j48126j11983
9011D39614J44598j00920r178M907n1454j07806j4434K6823n6133o4653l0562
9000A80802m9625J3776O8602O5061j0739J09713J230k9545o1730j5863K4410Q5017
8988C81109J16054L9721k5398l4866k9068j5304n1440J4552p6943J2483M1039
8977C71939L8810O0160J2539o9341P5224j4325q01J052L6378N8603K0716j01936
$$ y = [652483, 625251, 538096, 607860, 592567, 505705, 382477, 363758, 524574, 591190, 487962, 441630, 410130, 459691, 499762, 552977, 593536, 600745, 662533, 630940, 603520, 581378, 639674, 708167, 671569, 616698, 673988, 768704, 705975, 698341, 742222, 865090, 989157, 1041774, 1159275, 1219894, 1217740, 1035012, 916127, 761695, 642292, 688056, 699723, 551597, 439614, 584212, 483292, 474114, 479021, 427567, 319761, 305327, 332150, 276017, 211364, 180802, 131177, 144953, 213555, 278616, 267877, 377590, 378820, 349275, 287545, 271682, 296092, 381109, 497163, 536884, 511486, 476620, 447552, 432248, 380808, 395360, 318417, 330900, 371939, 410749, 470909, 483448, 414107, 489331, 475006, 474205, 475257, 511635, 570238, 590954, 489018]
8965D89018m5018j38236q120P6000k6659M4143K3249O2637M774q3074K996O8969
8953D70679l0440p095o9800R8533J47M0521R0817o1440K7624P8541j81540r3348
8941C63199R7154m8394J8780P3725j1923j7453j17252m655J04789k6280J5210
8930D46900j1585k0988n7336j8964p4420J12240Q2047k4021J7597P1061J9339
8919E41870j28540L0808m3399o8239M0017j2152k5915K8127M1790N4410o6470
8908C92307o6682L3784M7541N9316J1195j0291j35867j55876m5996P4604O1556
8897B65591j397l2834K8786k6128L07j3381J2238J9231m0570L5295p9630K3920
8885A91428K7161O0308J11079P2789K2940m033J24867M4556k2720K2442M4021
$$ y = [489018, 444000, 305764, 297644, 373644, 346985, 391128, 414377, 477014, 481788, 398714, 401710, 470679, 440239, 433144, 363344, 461877, 462024, 502545, 593362, 531922, 559546, 638087, 456547, 363199, 460353, 411959, 430739, 504464, 492541, 475088, 357836, 353181, 457970, 431690, 446900, 435315, 414327, 356991, 338027, 263607, 375847, 457894, 433873, 451470, 522531, 541870, 413330, 444138, 400739, 332500, 372517, 360365, 334450, 362577, 404367, 458777, 392307, 325625, 359409, 406950, 466266, 477461, 467170, 331303, 175427, 129431, 204035, 265591, 264194, 231360, 260146, 234018, 234325, 220944, 233182, 252413, 211843, 247138, 167508, 191428, 218589, 278897, 389976, 462765, 485705, 481672, 606539, 651095, 628375, 650817, 694838]
8874F94838j28976p1315l2292o2362M9253P3861J50481J21871p3783l2004J28997
8863H18569O8230M5547J68862J54324N4077K67920K53740N06047N28566O78484
8853C544366O01566N92050O24401N10225J18228k13338l24728n07839o14097o22158
8843C708676o80809m32645l27938l99686l62370k49440l31886k19703n1473j02527
8833E50199j14982q0159l6169m6007N5833l1838K5505J4905L2635J9741n700j3397
8821C70566K4149l5197n0610M6431Q203r4885j24499o9824J50545J35481k9593
8810C30767J261j9902j5113n1882M524M7368n1634o7017m000M2905O7525m2214
8798B42588J9227j4903M0730J76521J01607M5070N3429O3272l9796j50699o6320
$$ y = [694838, 565862, 494547, 462255, 399893, 449146, 523007, 673488, 795359, 721576, 689572, 818569, 886799, 932346, 1101208, 1255532, 1309609, 1577529, 1831269, 2337316, 2865882, 3544366, 4145932, 4737982, 5362383, 5872608, 5990836, 5777498, 5452770, 4944931, 4330834, 3708676, 3027867, 2595222, 2267284, 1867598, 1505228, 1255788, 923902, 704199, 652726, 550199, 435217, 355058, 318889, 272882, 328715, 296877, 322382, 337287, 369922, 389663, 383963, 370566, 394715, 359518, 308908, 355339, 363542, 268657, 144158, 74334, 224879, 360360, 330767, 332028, 312126, 297013, 245131, 249655, 297023, 245389, 178372, 174372, 217277, 284802, 242588, 261815, 246912, 287642, 464163, 565770, 610840, 664269, 727541, 687745, 537046, 470726]
8787D70726J8216J6359m9148r8454M9266Q5877j7076j10350k3756K7544m8566
8776C20638k437O1188O0425J51612J10466j12651j97383r2117N9080q592M5043
8765C95272M9293J05647l1719o7858p814J6293j7493j6699m5886L059j1997L5207
8753D05305j8658l9852m227m021q4483Q9192L1203Q0287P9634l170N1024J5883
8741E98117N0310N5335k5807j16743O1706K5390k7897L3467k3520R2618J22575
8730H45551j1374j42751j90430p5057o0930N0534P2961M3194O7671N766j34737
8719D70398j32267N439J8301n9774Q556J08259J06303j02565o5860M9380J1899
8708D18069p3369l7541N3309N6950M6323J9375m3466L0200j38642j0392L1507
$$ y = [470726, 488942, 505301, 456153, 357699, 406965, 492842, 475766, 365416, 341660, 369204, 320638, 318201, 379389, 439814, 591426, 701892, 589241, 391858, 299741, 358821, 350229, 395272, 444565, 550212, 518493, 450635, 442821, 459114, 441621, 424922, 379036, 382095, 370098, 405305, 386647, 346795, 342568, 338547, 254064, 343256, 374459, 454746, 534380, 531210, 582234, 598117, 648427, 703762, 677955, 561212, 622918, 648308, 620411, 653878, 630358, 722976, 845551, 834177, 691426, 500996, 425939, 365009, 415543, 488504, 531698, 599369, 605135, 470398, 338131, 343570, 361871, 302097, 310653, 418912, 525215, 422650, 356790, 406170, 418069, 344700, 307159, 360468, 417418, 463741, 483116, 439650, 469850, 331208, 320816, 352323]
8697C52323J2015L1020j495J11954J15577Q0132k25602j12407r912n2854L0611
8686C31362p603k3748N2153l420k2906j11011l4378O5605J30473J5983P8731J2736
8674D83977l296Q7259Q8839K5874o7836K1187O181J1573N7507P0672K8401J16814
8662I27152m4214j32476K6814O6609R1683J44760J86716N3721J66830K82215K46785
8651B016595P1028O7672K6871n7738o0738K1005o6630r941k3131K3034J18120
8640B126147K09789J89293J02954J06780n1155L6660o7837p0844J4123n4464r6212
8629B445234r8677j36971j43915p6136J6127J14833J58481K08793K03439K30544
8619B921752L19491K94247J19925K4436L019N8665J8370M2914L8736P5020M6457
$$ y = [352323, 364338, 395358, 393863, 505817, 621394, 701526, 475924, 363517, 353605, 300751, 331362, 323759, 300011, 352164, 348744, 325838, 214827, 180449, 246054, 376527, 392510, 471241, 483977, 480681, 567940, 656779, 682653, 614817, 636004, 642185, 653758, 711265, 781937, 810338, 927152, 882938, 750462, 777276, 843885, 935568, 1080328, 1267044, 1320765, 1487595, 1769810, 2016595, 2087623, 2155295, 2182166, 2124428, 2063690, 2084695, 2018065, 2008124, 1984993, 2008027, 2126147, 2335936, 2525229, 2628183, 2734963, 2683808, 2720468, 2652631, 2581787, 2595910, 2541446, 2445234, 2346557, 2209586, 2065671, 1989535, 2005662, 2120495, 2278976, 2487769, 2691208, 2921752, 3241243, 3535490, 3655415, 3679851, 3682870, 3741535, 3759905, 3802819, 3841555, 3916575, 3963032]
8608C963032J45761j36231j24938p9865p6588j4994M2194J15410P6514l628J814
8597C908481p2580j71765j99695l59434l24932k71518j75293q6048r3269Q2900
8587B236847L2441N8667K65528L36082N24418O19463O90399N44603L26772K32586
8577E867806R6396K80149N59146O37806M83595K71319j23802j14238j82334l48447
8567G427396m12447m98671m22632m46215n09003n95295n80934n72778n32836l39950
8557B516635k59630k65303j52109p0363j01792n7339q6691l929N3313J9207j4241
8546A577758k5640J85313L96215N53787N24348M47629M21900Q5848n5451k16610
8536C895097l66367m05732m05961k24401M085k7414R9197L3188l4760j60084k97489
$$ y = [3963032, 4108793, 3972562, 3847624, 3767759, 3691171, 3676177, 3718371, 3833781, 3910295, 3906667, 3908481, 3835901, 3664136, 3464441, 3105007, 2780075, 2508557, 2333264, 2247216, 2153947, 2236847, 2269288, 2327955, 2593483, 2929565, 3453983, 4073446, 4763845, 5308448, 5635220, 5867806, 5964202, 6244351, 6803497, 7441303, 7924898, 8196217, 8072415, 7958177, 7775843, 7427396, 7014949, 6516278, 6093646, 5647431, 5138428, 4543133, 3962199, 3389421, 2856585, 2516635, 2257005, 1991702, 1839593, 1769230, 1667438, 1610099, 1523408, 1519479, 1572792, 1591999, 1577758, 1552118, 1737431, 2133646, 2687433, 3211781, 3659410, 4081310, 4167158, 4111707, 3895097, 3528730, 3122998, 2717037, 2492636, 2496721, 2469307, 2568504, 2601692, 2566932, 2406848, 2109359]
8525B109359k26212j52236k82296j57416p3602r7300K2856J52811J02187L7294
8515A435445J35222K9038J8930l3858j27987q9801M7864o590q8020p3158M6841
8504A293926O818r2233j06764p0057K2106J1040j15483j01922j8537q6731m9359
8493F92804l3666m4463m2909j30251j8618j1748r8927m7335J1804J8804m8674
8482B46821K6317M7874N0174r4918J8007j2451K3975R4576J32883J24316n521
8471F52053n887j3538Q2570L6950o2465p6048M1750Q8606k1418m6315j01519j63232
8459D11507p9793L4959n7158l4923o406M19J20172L8883j17878J7641P2695K9885
8447D30003o6997j22536p2155O433n3452k3936L5381Q597l1203M8313j1044K0050
$$ y = [2109359, 1883147, 1730911, 1448615, 1291199, 1217597, 1120297, 1143153, 1295964, 1398151, 1435445, 1570667, 1599705, 1618635, 1584777, 1456790, 1366989, 1414853, 1408263, 1320243, 1247085, 1293926, 1300744, 1208511, 1101747, 1031690, 1053796, 1064836, 949353, 847431, 828894, 742163, 692804, 659138, 614675, 571766, 441515, 422897, 411149, 312222, 264887, 276691, 295495, 246821, 273138, 321012, 371186, 276268, 294275, 281824, 305799, 400375, 533258, 657574, 652053, 646166, 632628, 715198, 752148, 689683, 613635, 655385, 743991, 722573, 676258, 574739, 411507, 331714, 366673, 309515, 274592, 268186, 268605, 388777, 427660, 309782, 327423, 400118, 430003, 363006, 240470, 168315, 174748, 121296, 97360, 132741, 141338, 110135, 158448, 147404, 167454]
8435A67454M7391N9820l5993P7301P63m1903q3021j5185k844K4095P9750J75906
8423D53534M8244j07930j26335k9436N2736m4560o956P9637J2207j5492j60907
8412A54742j23208J23251O8956J24136p3850o4066L8769o0152p9713o0389m4145
8401D331N3259Q2475L2790j361J58695K9459n7564M4811J286j5779q1886j86489
8389F4027l2613J4994m871L5501P0640L8183O3098R79q9620m6377Q523M3210q455
8376A57219r5051o3678j01540p727O2211Q9830P9778m4876p4311j7125J58850
8365A43580M5314j4319j4372M134l7736K2797L8687M9168j044l3915K1412p2456
8353A51250j18910n5738Q6204l847K0960J179q7264M053R5961O4739O6090m4603
$$ y = [167454, 214845, 274665, 238672, 315973, 316736, 274833, 191812, 176627, 173783, 197878, 277628, 453534, 501778, 393848, 267513, 238077, 290813, 246253, 239297, 318934, 331141, 315649, 154742, 31534, 154785, 223741, 347877, 274027, 209961, 248730, 188578, 108865, 48476, 4331, 57590, 140065, 172855, 171494, 330189, 359648, 302084, 346895, 348181, 332402, 250516, 64027, 31414, 46408, 41537, 77038, 147678, 185861, 248959, 249938, 160318, 113941, 122464, 165674, 157219, 62168, -1510, -103050, -110777, -48566, 41264, 121042, 76166, 1855, -15270, 143580, 188894, 174575, 160203, 164337, 126601, 149398, 188085, 237253, 236209, 202294, 223706, 151250, 32340, -23398, 62806, 58959, 79919, 81098, -6166, -2113, 93848, 158587, 224677, 180074]
8341A80074J1095J7739k860p537M1177J01292j6631n146k439l5287j0605j42688
8329A28184N8986L4844N4525q3381n3133j02475K9874J30203J01902M4052j4323
8318C29258o7296J8750m892m4483o4970m7392k2962M5796N3214n0518j484p833
8306A35188Q9871L4723P77l0135n3862R8171J19184l9506j11736j37692l4003
8295G0980L8860M5473R1037Q7465L4087j09817o4614j03477q3431K6003K0935
8284E3501J67537R0641R687j1452N49n8275j5923j5670n079J5766k9322n072P0616
8271B67504Q7479R2806P700q2427r0726j39423p6516R0648M4153q9376l5607O0516
8259A36731N4731M9979n9934j4017j214M9776L9773j18094L631N2217R7411L7631
$$ y = [180074, 191169, 208908, 206048, 198511, 239688, 340980, 324349, 319203, 316764, 281477, 270872, 128184, 187170, 222014, 276539, 193158, 140025, 37550, 67424, 197627, 299529, 343581, 329258, 261962, 280712, 275820, 231337, 166367, 118975, 96013, 141809, 195023, 144505, 143021, 135188, 225059, 259782, 260559, 230424, 176562, 274733, 393917, 354411, 242675, 104983, 70980, 109840, 155313, 246350, 333815, 367902, 258085, 193471, 89994, 6563, 32566, 53501, 221038, 311679, 321366, 309914, 310463, 252188, 236265, 220595, 215516, 231282, 201960, 196888, 267504, 354983, 447789, 455489, 373062, 282336, 142913, 66397, 157045, 201198, 111822, 76215, 136731, 191462, 241441, 181507, 167490, 166276, 216052, 255825, 137731, 141362, 193579, 290990, 328621]
8247C28621O4591K3332p2685j19620r4677J9478J82735L7459r3148n7272j16722
8236A02092P5239J05297q2384K5285O0516Q6176o9354L9278L2573J2287n6747
8225C30258J657p336m5792P6940L0427J0502n594k4395J00433r3353j08589L719
8213B68877r099J3732R0078J0617j2577o731p2678r2386k1411J1375J40547J09482
8201D29826n9349q8581l1675K5392L1707R5726M0615L004J6064n1523K9822m3176
8189C97852q986m9000J24130Q3102j10359l3347J1529j73933j32042J04715O3285
8178B76946n8003K9373R6260N6409N3973Q2888J39029o2893k10752r9058J43129
8167D47301M02j02342L4873J01481J70071J19871n5q283k8149j1954Q5825n7854
$$ y = [328621, 393212, 416544, 343859, 224239, 129562, 149040, 331775, 369234, 276086, 218814, 102092, 177331, 282628, 200244, 225529, 286045, 372221, 302867, 342145, 374718, 387005, 330258, 331915, 324579, 278787, 355727, 386154, 396656, 391062, 366667, 467100, 373747, 265158, 268877, 259778, 273510, 363588, 374205, 361628, 354897, 282219, 189833, 168422, 179797, 320344, 429826, 370477, 281896, 250221, 275613, 307320, 403046, 443661, 446665, 462729, 411206, 441028, 397852, 388866, 339866, 463996, 547098, 436739, 403392, 414921, 240988, 108946, 213661, 276946, 218943, 248316, 344576, 400985, 454958, 537846, 676875, 613982, 403230, 304172, 447301, 447703, 345361, 380234, 481715, 651786, 771657, 771602, 763319, 735170, 723216, 809041, 751187]
8155G51187o5879M5570J87356o247p242p5379m2078q002J10909J47579L4433L9803
8143A112010K436J6657n8532R7224R9634j12718n2365L6858m0850m2982o1387
8132I95985Q7800J01685L3330M6426k3104n6036Q1278p0339L2969J2671K1636
8121A264301Q2794J1717j37925o8056R0012J37395r3635p4394l0341q1141m1757
8110A058970k5926J5323N3652n3211O477R1757P7903K4609k8059M3580O2910L2144
8098A360129J39856K8687l9234N0276j3J33712P8405p7257q4719j22110j46933
8087A320799l2562k6016K5641J41025j06584k08207r605J6757m8697j06135O44
8076I67060k8540J3912O1323M6954l2855r1946K2302J5173K4274n2677Q361N6072
$$ y = [751187, 685308, 730878, 918234, 911987, 904745, 829366, 787288, 779286, 890195, 1037774, 1072207, 1112010, 1114446, 1131103, 1072571, 1169795, 1269429, 1156711, 1104346, 1141204, 1100354, 1057372, 995985, 1083785, 1185470, 1218800, 1265226, 1242122, 1186086, 1267364, 1197025, 1229994, 1242665, 1264301, 1347095, 1358812, 1220887, 1152831, 1242843, 1380238, 1286603, 1212209, 1181868, 1100727, 1058970, 1033044, 1048367, 1102019, 1048808, 1055285, 1147042, 1224945, 1249554, 1221495, 1265075, 1327985, 1360129, 1499985, 1528672, 1489438, 1539714, 1539701, 1673413, 1751818, 1674561, 1589842, 1467732, 1320799, 1288237, 1262221, 1287862, 1428887, 1322303, 1114096, 1104491, 1121248, 1072551, 966416, 967060, 938520, 952432, 1013755, 1060709, 1027854, 935908, 958210, 973383, 997657, 944980, 953341, 1009413]
8064A009413Q7503p074p4496O984R4978O5573J21993P9676J38267R5972J91178
8053A809967O4597M3310J60387K1895P5367J41174p624j13090j64899j05547j33016
8042A792521k75010l14180k41768J6078m1267n2524K6013P2517m9488j37115j07977
8031F87800K8834J5143J00185L0431j28226k4900l1489P9643Q1146k8500J3059
8020H23126J77647J98754J71780L0124J06470J23547N865J31351Q7407N6539m5329
8009A867281m2395p469q8613j86645j04427o2970p3433j41724j27576o7659q7154
7998H77216j02775p1045J3474q7011r0801n2296J3729J01435J1382M3314L05m4869
7986F12058m958K0757p9185p1134R2732J54240o4929j92494p3046J8374R4926
$$ y = [1009413, 1096916, 1089842, 1015346, 1022330, 1117308, 1182881, 1304874, 1384550, 1522817, 1618789, 1809967, 1874564, 1917874, 2078261, 2100156, 2175523, 2316697, 2309073, 2195983, 2031084, 1925537, 1792521, 1517511, 1203331, 961563, 977641, 936374, 883850, 909863, 982380, 932892, 795777, 687800, 716634, 731777, 831962, 862393, 734167, 709267, 677778, 757421, 838567, 810067, 823126, 1000773, 1199527, 1371307, 1401431, 1507901, 1631448, 1637313, 1768664, 1856071, 1912610, 1867281, 1824886, 1817417, 1728804, 1542159, 1437732, 1374762, 1301329, 1159605, 1032029, 964370, 877216, 774441, 703396, 716870, 629859, 539058, 486762, 500491, 601926, 613308, 656622, 656927, 612058, 607100, 627857, 548672, 477538, 570270, 724510, 659581, 467087, 394041, 412415, 507341]
7975E07341J3927l0392m549k6316M3900J38136L8000r2136P9084J2835l2827n8696
7963E88307J05393j8346j27j9115n3585m0985r5431o3689K8991p299l2426Q127
7951C99815M8239R7312o3621j05269l1028J05135P9804j00732o424l5128K9713
7940D17816K4802M600N7818l3962m921l3099L0341J6572j32768j330J8083l6078
7928C27874m7601N5661j8664n4743k3791k6282Q9584p9082m8185O1123N1324p4865
7916B12353M2391o377Q4290L1276M6053q8402m2780L759L3759M254m8846o6899
7904B04831p2267L7077q469l2037j082n6036k706Q2612m480J05181O1207l4142
7892B79689L3927o9286m7515j11935n0160L972K4283M6533N4681m4189P4612p5976
$$ y = [507341, 521268, 490876, 486327, 460011, 503911, 642047, 680047, 587911, 666995, 679830, 647003, 588307, 693700, 675354, 675227, 656112, 602527, 561542, 466111, 402422, 431413, 424114, 391688, 399815, 448054, 545366, 481745, 376476, 345448, 450583, 530387, 429655, 423231, 388103, 417816, 442618, 447218, 505036, 471074, 466153, 433054, 463395, 479967, 347199, 345869, 363952, 327874, 280273, 335934, 317270, 262527, 238736, 212454, 302038, 222956, 174771, 235894, 287218, 212353, 254744, 248367, 332657, 363933, 409986, 321584, 278804, 282563, 316322, 320576, 271730, 204831, 132564, 169641, 161172, 129135, 128053, 72017, 69311, 151923, 147443, 252624, 313831, 279689, 313616, 244330, 196815, 84880, 34720, 38692, 62975, 109508, 164189, 120000, 194612, 118636]
7880A18636k1131J2857K0153o4252R452P4793j5315n4847r8050j5992N274L0491
7868B069k6641N6600J4199p1310r6074M2296J1033J1864l9662N4607q317L772
7856d5564K1804q7892O0417j09062r9172k3809L9207K2067J6537k6036J01884
7845a29619O8881k3657l0136l1626l5002k405r1997j3938Q8731K730P0307r117
7833a36848m8055J0631R9300Q7318M8058j09666j62654j6864M40M9314Q8499L9594
7821e0933L675k3511l1706o8952K9514n4792M5769Q0197j6831M5644n3642k2523
7809a18091J03602m2243k632P0629j30695j58195Q4759P4959k7801o819L7209
7798a15318J6270J09925j09486n5190M9216j8844J37579N985j06244k948J0394
$$ y = [118636, 97505, 110362, 130515, 66263, 75715, 150508, 135193, 80346, -17704, -33696, -28422, 2069, -24572, 32028, 46227, -25083, -121157, -78861, -67828, -55964, -95626, -41019, -49336, -45564, -23760, -111652, -51235, -160297, -259469, -283278, -244071, -222004, -205467, -231503, -129619, -60738, -84395, -114531, -146157, -181159, -183564, -275561, -289499, -200768, -198038, -127731, -136848, -184903, -174272, -74972, 12346, 60404, -49262, -211916, -228780, -228340, -179026, -90527, -50933, -47258, -70769, -102475, -171427, -141913, -196705, -150936, -70739, -87570, -41926, -95568, -118091, -14489, -56732, -59364, 11265, -119430, -277625, -192866, -117907, -145708, -152527, -115318, -99048, 10877, -98609, -153799, -104583, -123427, 14152, 20137, -86107, -89055, -78661]
$$ [...]
##END NTUPLES=NMR SPECTRUM
##END=
