##TITLE=Analysis number 310655
Compound Code cc 30004
Book Reference 378/140/3
Project Code adrs
Chemist Name benw
##JCAMPDX= 6.0         $$ Bruker NMR JCAMP-DX V2.0
##DATA TYPE= NMR SPECTRUM
##DATA CLASS= NTUPLES
##ORIGIN= Bruker BioSpin GmbH
##OWNER= NMR
$$ XWIN-NMR		Version 3.5
$$ Tue Jun 21 15:01:59 2005 GMT Daylight Time (UT+1h)  MAYBRIDGE\NMR@NMR_250MHZ
##.OBSERVE FREQUENCY= 250.131544655141
##.OBSERVE NUCLEUS= ^1H
##.ACQUISITION MODE= SIMULTANEOUS (DQD)
##.ACQUISITION SCHEME= undefined
##.AVERAGES= 16
##.DIGITISER RES= 18
##SPECTROMETER/DATA SYSTEM= dpx250
##.PULSE SEQUENCE= zg30
##.SOLVENT NAME= CDCl3
##.SHIFT REFERENCE= (INTERNAL, CDCl3, 0, 16.522)
##AUDIT TRAIL= $$ (NUMBER, WHEN, WHO, WHERE, WHAT)
$$ ##TITLE= Audit trail, XWIN-NMR		Version 3.5
$$ ##JCAMPDX= 5.01
$$ ##ORIGIN= Bruker BioSpin GmbH
$$ ##OWNER= NMR
$$ C:\u/data/dgb/nmr/ADRS/4470/pdata/1/auditp.txt
$$ ##AUDIT TRAIL=  $$ (NUMBER, WHEN, WHO, WHERE, WHAT)
(   1,<2005-06-21 15:01:34.88 +100>,<MAYBRIDGE\NMR>,<NMR_250MHZ>,
      <created by zg, POWCHK disabled, PULCHK disabled
       configuration hash MD5:
       62 19 C7 07 E1 42 D1 B7 37 6C 3D D0 77 39 F9 E6
       data hash MD5: 64K
       DA 98 29 BC 7F A4 E6 15 4E CD 02 1C 0B 69 85 AF>)
(   2,<2005-06-21 15:01:47.89 +100>,<MAYBRIDGE\NMR>,<NMR_250MHZ>,
      <Start of raw data processing
       ef LB = 0.3 FT_mod = 6 PKNL = 1 SI = 32K 
       data hash MD5: 32K
       24 55 FC C0 C2 30 17 CB 63 B2 AA E5 33 1B 77 AD>)
(   3,<2005-06-21 15:01:49.75 +100>,<MAYBRIDGE\NMR>,<NMR_250MHZ>,
      <apk 
       data hash MD5: 32K
       7B A3 A4 B6 78 CD EB C7 9C 75 6D A9 E7 4E 08 81>)
(   4,<2005-06-21 15:01:50.55 +100>,<MAYBRIDGE\NMR>,<NMR_250MHZ>,
      <abs ABSG = 5 
       data hash MD5: 32K
       F0 E9 B8 AF 1C E5 A2 C0 D5 A2 A4 87 CA 34 88 51>)
$$ ##END=
$$ 
$$ hash MD5
$$ 4D 7B 5C 98 7F 92 E3 EB DE 91 66 5D 1B 5A 25 C3
##$RELAX= 
##$RELAX= 
##$RELAX= 
##$RELAX= 
##$RELAX= 
##$RELAX= 
##$RELAX= 
$$ Bruker specific parameters
$$ --------------------------
##$DU= <C:\u>
##$EXPNO= 4470
##$NAME= <ADRS>
##$PROCNO= 1
##$TYPE= <nmr>
##$USER= <dgb>
##$AMP= (0..31)
100 100 100 100 100 100 100 100 100 100 100 100 100 100 100 100 100 100 
100 100 100 100 100 100 100 100 100 100 100 100 100 100 
##$AQSEQ= 0
##$AQ_mod= 3
##$AUNM= <au_zg>
##$AUTOPOS= <39 >
##$BF1= 250.13
##$BF2= 250.13
##$BF3= 250.13
##$BF4= 250.13
##$BF5= 500.13
##$BF6= 500.13
##$BF7= 500.13
##$BF8= 500.13
##$BYTORDA= 1
##$CFDGTYP= 0
##$CFRGTYP= 5
##$CHEMSTR= <none>
##$CNST= (0..31)
1 1 145 1 1 1 1 1 1 1 1 1 1 1 1 1 1 1 1 1 1 1 1 1 1 1 1 1 1 1 1 1 
##$CPDPRG= <>
##$CPDPRG1= <>
##$CPDPRG2= <>
##$CPDPRG3= <>
##$CPDPRG4= <mlev>
##$CPDPRG5= <mlev>
##$CPDPRG6= <mlev>
##$CPDPRG7= <mlev>
##$CPDPRG8= <mlev>
##$CPDPRGB= <>
##$CPDPRGT= <>
##$D= (0..31)
0 1 0 0 0 0 0 0 0 0.06 0 0 0 0 0 0 0.0002 0 0 0 0 0 0 0 0 0 0 0 0 0 0 
0 
##$DATE= 1119362494
##$DBL= (0..7)
120 120 120 120 120 120 120 120 
##$DBP= (0..7)
150 150 150 150 150 150 150 150 
##$DBP07= 0
##$DBPNAM0= <>
##$DBPNAM1= <>
$$ [...]
##$SUBNAM7= <"">
##$SUBNAM8= <"">
##$SUBNAM9= <"">
##$SW= 20.6930455092707
##$SWIBOX= (0..15)
0 0 3 0 0 0 0 0 0 0 0 0 0 0 0 0 
##$SW_h= 5175.983436853
##$TD= 65536
##$TD0= 1
##$TE= 295.16
##$TE2= 300
##$TE3= 300
##$TEG= 300
##$TL= (0..7)
0 120 120 120 120 120 120 120 
##$TP= (0..7)
150 150 150 150 150 150 150 150 
##$TP07= 0
##$TPNAME0= <>
##$TPNAME1= <>
##$TPNAME2= <>
##$TPNAME3= <>
##$TPNAME4= <>
##$TPNAME5= <>
##$TPNAME6= <>
##$TPNAME7= <>
##$TPOAL= (0..7)
0.5 0.5 0.5 0.5 0.5 0.5 0.5 0.5 
##$TPOFFS= (0..7)
0 0 0 0 0 0 0 0 
##$TUNHIN= 0
##$TUNHOUT= 0
##$TUNXOUT= 0
##$USERA1= <user>
##$USERA2= <user>
##$USERA3= <user>
##$USERA4= <user>
##$USERA5= <user>
##$V9= 5
##$VALIST= <valist>
##$VCLIST= <CCCCCCCCCCCCCCC>
##$VD= 0
##$VDLIST= <DDDDDDDDDDDDDDD>
##$VPLIST= <PPPPPPPPPPPPPPP>
##$VTLIST= <TTTTTTTTTTTTTTT>
##$WBST= 1024
##$WBSW= 4
##$XGAIN= (0..3)
0 0 0 0 
##$XL= 0
##$YL= 0
##$YMAX_a= 286765
##$YMIN_a= -404099
##$ZGOPTNS= <>
##$ZL1= 120
##$ZL2= 120
##$ZL3= 120
##$ZL4= 120
##$ABSF1= 16.522
##$ABSF2= -4.171173
##$ABSG= 5
##$ABSL= 3
##$ALPHA= 0
##$AQORDER= 0
##$ASSFAC= 0
##$ASSFACI= 0
##$ASSFACX= 0
##$ASSWID= 0
##$AUNMP= <proc_1d>
##$AZFE= 0.1
##$AZFW= 0.1
##$BCFW= 0
##$BC_mod= 0
##$BYTORDP= 0
##$COROFFS= 0
##$CY= 12.5
##$DATMOD= 1
##$DC= 0
##$DFILT= <>
##$DTYPP= 0
##$F1P= 14.0000005364418
##$F2P= -0.99999901652339
##$FCOR= 0.5
##$FTSIZE= 32768
##$FT_mod= 6
##$GAMMA= 0
##$GB= 0
##$INTBC= 1
##$INTSCL= 1
##$ISEN= 128
##$LB= 0.3
##$LEV0= 0
##$LPBIN= 0
##$MAXI= 10000
##$MC2= 0
##$MEAN= 0
##$ME_mod= 0
##$MI= 0
##$NCOEF= 0
##$NC_proc= -3
##$NLEV= 6
##$NOISF1= 0
##$NOISF2= 0
##$NSP= 0
##$NTH_PI= 0
##$NZP= 0
##$OFFSET= 16.522
##$PC= 1
##$PHC0= -79.81576
##$PHC1= 6.445069
##$PH_mod= 1
##$PKNL= yes
##$PPARMOD= 0
##$PSCAL= 4
##$PSIGN= 0
##$REVERSE= no
##$SF= 250.13
##$SI= 32768
##$SIGF1= 0
##$SIGF2= 0
##$SINO= 400
##$SIOLD= 32768
##$SREGLST= <1H.CDCl3>
##$SSB= 0
##$STSI= 32768
##$STSR= 0
##$SW_p= 5175.98343685301
##$SYMM= 0
##$S_DEV= 0
##$TDeff= 65536
##$TDoff= 0
##$TI= <Analysis number 999999
Compound Code 99
Book Reference 9
Project Code 9>
##$TILT= no
##$TM1= 0
##$TM2= 0
##$TOPLEV= 0
##$USERP1= <user>
##$USERP2= <user>
##$USERP3= <user>
##$USERP4= <user>
##$USERP5= <user>
##$WDW= 1
##$XDIM= 32768
##$YMAX_p= 434962627
##$YMIN_p= -121612
$$ End of Bruker specific parameters
$$ ---------------------------------
##NTUPLES= NMR SPECTRUM
##VAR_NAME=  FREQUENCY,     SPECTRUM/REAL,   SPECTRUM/IMAG
##SYMBOL=    X,             R,               I
##VAR_TYPE=  INDEPENDENT,   DEPENDENT,       DEPENDENT
##VAR_FORM=  AFFN,          ASDF,            ASDF
##VAR_DIM=   32768,         32768,           32768
##UNITS=     HZ,            ARBITRARY UNITS, ARBITRARY UNITS
##FACTOR=    0.157963299565203, 1,           1
##FIRST=     4132.6476996994, 0,             0
##LAST=      -1043.33573715361, 0,           0
##MIN=       -1043.33573715361, -121612,     0
##MAX=       4132.6476996994, 434962627,     0
$$ Real data points
##PAGE= N=1
##DATA TABLE= (X++(R..R)), XYDATA
$$ [...]
$$ plain form
14801 -12115 -34869 -41124 -8645 -5847 -20819 -19421 -29059 -6530 6927 -7231 -33186 -53585
14789 -53585 -52931 -59523 -69615 -84219 -83531 -53062 -55243 -34955 -15945 5771 -11753 -18794 -242
14776 -242 6645 21666 -4960 8741 43210 34052 14807 -4015 9276 -12892 -24714 3810
14764 3810 29806 28399 32888 -2353 -32653 -24038 -20813 15351 25618 43311 17351 25792 26746
14751 26746 5351 -19339 -1562 15317 30211 53399 26580 -8540 -21835 -19306 -21776 -15168
14739 -15168 -5273 6043 -11854 2476 -5665 -31412 -39514 -21349 -19194 -15463 2311 -3402 -22513
14726 -22513 -12700 10080 46503 53135 49829 49664 38692 25007 27514 22656 32476 293 -31112
14713 -31112 -15796 -9046 -12596 -16053 -10133 -12354 -18787 -6788 16193 23449 29645 5069 1586
$$ packed form
14801a2115k2754o255L2479K798j4972J398r638K2529J3457j4158k5955k0399
14789e3585O54o592j0092j4604O88L0469k181K0288J9010K1716j7524p041J8552
14776b42O887J5021k6626J3701L4469r158j9245j8822J3291k2168j1822K8524
14764C810K5996j407M489l5241l0300Q615L225L6164J0267J7693k5960Q441R54
14751B6746k1395k4690J7777J6879J4894K3188k6819l5120j3295K529k470O608
14739a5168R895J1316j7897J4330q141k5747q102J8165K155L731J7774n713j9111
14726b2513R813K2780L6423O632l306j65j0972j3685K507m858R820l2183l1405
14713c1112J5316O750l550l457N920k221o433J1999K2981P256O196k4576l483
$$ plain form
14700 1586 -3511 -24169 -41231 -13853 5545 6383 3878 -2314 34393 26392 -15744 -3339 10376
14687 10376 31136 43586 57712 54545 55855 3215 -16220 2030 -10498 -27323 -20358 5401
14675 5401 443 -61 -7311 -15000 -54449 -77220 -58078 -52359 -87317 -97750 -52343 5046 4644
14662 4644 -20416 -15081 -4675 5506 -153 23069 40339 38621 32400 29752 36022 20615 10618
14649 10618 43777 52442 36200 8615 -3199 -830 6738 16783 20830 4217 17010 53952
14637 53952 44528 1691 -35072 -13941 35145 37089 14520 31258 20433 -5395 -32823 -51823
14625 -51823 -29923 4676 633 -8441 16034 24745 44356 49582 60075 43634 31766 37744 8536
14612 8536 -41884 -64877 -71822 -58791 -23972 7770 16650 -3965 4549 19953 31655 45019
$$ packed form
14700A586n097k0658j7062K7378J9398Q38k505o192L6707q001m2136J2405J3715
14687A0376K0760J2450J4126l167J310n2640j9435J8250j2528j6825O965K5759
14675E401m958n04p250p689l9449k2771J9142N719l4958j0433M5407N7389m02
14662D644k5060N335J0406J0181n659K3222J7270j718o221k648O270j5407r997
14649A0618L3159Q665j6242k7585j1814K369P568J0045M047j6613J2793L6942
14637E3952r424m2837l6763K1131M9086J944k2569J6738j0825k5828k7428j9000
14625e1823K1900L4599m043r074K4475Q711J9611N226J0493j6441j1868N978k9208
14612H536n0420k2993o945J3031L4819L1742Q880k0615Q514J5404J1702J3364
$$ plain form
14600 45019 73964 40920 22403 14296 -11957 -28256 -2391 -462 -24589 -34644 -23890 -49348
14588 -49348 -32277 -19634 -24496 -14363 -14919 -41955 -44896 -54856 -41528 -6542 -9769 648 14904
14575 14904 2748 -26801 -62233 -73516 -94059 -87395 -59230 -48434 -23192 -16255 -31726 -40388
14563 -40388 -30766 -18810 -410 -13432 -68452 -63516 -39127 -44665 -47038 6213 31974 39892 6070
14550 6070 -36665 -45011 -38723 -12308 4146 31084 35988 16660 30212 51455 39302 43732 26288
14537 26288 32402 11425 -4521 -1159 -10130 14905 24919 69859 76301 57981 22137 -10940
14525 -10940 -22044 -9635 4336 31177 34063 -8201 -32024 -15591 23507 14447 5491 -20449
14513 -20449 -3321 34696 22033 17466 10288 -7095 -26621 -22883 -22133 -34037 -18273 -16752 -41217
$$ packed form
14600D5019K8945l3044j8517q107k6253j6299K5865J929k4127j0055J0754k5458
14588d9348J7071J2643m862J0133n56k7036k941r960J3328L4986l227J0417J4256
14575A4904j2156k9549l5432j1283k0543O664K8165J0796K5242O937j5471q662
14563d0388R622J1956J8400j3022n5020M936K4389n538k373N3251K5761P918l3822
14550F070m2735q346O288K6415J6454K6938M904j9328J3552K1243j2153M430j7444
14537B6288O114k0977j5946L362q971K5035J0014M4940O442j8320l5844l3077
14525a0940j1104J2409J3971K6841K886m2264k3823J6433L9098r060q956k5940
14513b0449J7128L8017j2663m567p178j7383j9526L738P50j1904J5764J521k4465
$$ plain form
14500 -41217 -30615 -76115 -84977 -42112 -10120 -21068 -15002 -3227 -6167 -6952 -16206 -11512 9044
14487 9044 -4607 -14465 -11778 -34952 -17741 -35079 -59882 -19050 -27447 -58335 -24422 -16811 -18755
14474 -18755 -5667 13832 17843 -19012 -8308 -34251 -32462 -32405 -36789 -26316 -11236 -2238 -9712
14461 -9712 -10931 -5508 -31478 5447 43801 33530 -4781 -37599 -58170 -56708 -41965 -33218 -28386
14448 -28386 -25487 -34895 -25119 -1012 50443 65947 60431 39582 -24595 -32229 -28772 -28977 -25503
14435 -25503 5598 34319 13087 48469 66448 47822 27833 19089 5231 -6174 -3309 -7752
14423 -7752 -14255 5952 4199 8238 3322 5737 5349 879 -13264 -32336 -15208 19190 39210
14410 39210 43918 -13197 1167 -1235 -20534 -5861 7851 -4615 -15904 -7867 14587 15094 33252
$$ packed form
14500d1217J0602m5500q862M2865L1992j0948O066J1775k940p85r254M694K0556
14487I044j3651r858K687k3174J7211j7338k4803M0832q397l0888L3913P611j944
14474a8755J3088J9499M011l6855J0704k5943J789N7m384J0473J5080Q998p474
14461i712j219N423k5970L6925L8354j0271l8311l2818k0571J462J4743Q747M832
14448b8386K899r408R776K4107N1455J5504n516k0849o4177p634L457k05L474
14435b5503L1101K8721k1232L5382J7979j8626j9989q744j3858j1405K865m443
14423g752o503K0207j753M039m916K415l88m470j4143j9072J7128L4398K0020
14410C9210M708n7115J4364k402j9299J4673J3712j2466j1289Q037K2454N07J8158
$$ plain form
14397 33252 6518 -12878 856 18525 17807 -5340 9110 36384 69794 54370 54774 47229 15671
14384 15671 14821 754 -41336 -24167 -6924 19894 34097 39386 32773 -5532 -28421 -28290 2617
14371 2617 93 -9407 -28871 -64343 -26616 -33319 -34863 -4104 11996 12952 21249 17952 10400 17484
14357 17484 9902 -16190 2973 10837 12165 -4844 9131 17233 40200 28955 48689 59518
14345 59518 71197 68200 59811 44327 18295 16950 -22663 -46013 -31300 -10623 -18282 -11178 -11312
14332 -11312 -32995 -44138 -9860 -2111 -28687 -19183 -19315 -22116 4226 12445 662 12440 11674
14319 11674 4555 7120 1365 -34539 -58805 -27927 -38095 -41574 -23327 11629 9887 -104 19456
14306 19456 25220 28516 25610 -15766 -29987 -23918 1064 4068 6873 -2920 19059 -8701 -23578
$$ packed form
14397C3252k6734j9396J3734J7669p18k3147J4450K7274L3410j5424M04p545l1558
14384A5671q50j4067m2090J7169J7243K6818J4203N289o613l8305k2889J31L0907
14371B617k524r500j9464l5472L7727o703j544L0759J6100R56Q297l297p552P084
14357A7484p582k6092J9163P864J328j7009J3975Q102K2967j1245J9734J0829
14345E9518J1679k997q389j5484k6032j345l9613k3350J4713K0677p659P104j34
14332a1312k1683j1143L4278P749k6576R504j32k801K6342Q219j1783J1778p66
14319A1674p119K565n755l5904k4266L0878j0168l479J8247L4956j742r991J9560
14306A9456N764L296k906m1376j4221O069K4982L004K805r793K1979k7760j4877
$$ plain form
14293 -23578 -9418 -11396 17454 38013 48526 42490 15038 12878 11007 40303 67195 59238 33550
14280 33550 5453 7469 13896 5676 10270 25430 42481 41373 33646 29549 21987 -9595 -18321
14267 -18321 -22392 -20612 -3613 6433 6834 26450 62071 2930 -29987 3045 -363 -4473 -15781
14254 -15781 -22781 -35718 -74479 -70505 -26876 -11770 -4670 13566 20709 22880 25963 25074 4617
14241 4617 -11096 2516 52956 59714 34916 22786 14521 -28394 -22446 1234 -5427 11279 659
14228 659 -22012 -57792 -64117 -53426 -15816 -5572 -48192 -68015 -80294 -66452 -49439 -76970
14216 -76970 -77474 -59547 -68555 -65792 -47545 -8874 7898 8197 -38128 -40926 -22875 -8961 19495
14203 19495 55491 46280 42937 20975 20555 23907 4573 -13408 -15676 -526 41924 40099 24272
$$ packed form
14293b3578J4160j978K8850K0559J0513o036k7452k160j871K9296K6892p957k5688
14280C3550k8097K016O427q220M594J5160J7051j108p727m097p562l1582q726
14267a8321m071J780J6999J0046M01J9616L5621n9141l2917L3032l408m110j1308
14254a5781p000j2937l8761L974M3629J5106P100J8236P143K171L083q89k0457
14241D617j5713J3612N0440O758k4798j2130q265m2915N948K3680o661J6706j0620
14228F59k2671l5780o325J0691L7610J0244m2620j9823j2279J3842J7013k7531
14216g6970n04J7927r008K763J8247L8671J6772K99m6325k798J8051J3914K8456
14203A9495L5996r211l343k1962m20L352j9334j7981k268J5150M2450j825j5827
$$ plain form
14190 24272 -5093 -2889 17851 -22238 -13265 6313 -3151 5537 13744 16637 25741 1048 -17174
14177 -17174 -17914 -44850 -48206 -30753 -8068 14975 52487 54123 46856 42853 18655 21242 14089
14164 14089 32811 50114 51086 10605 -6220 21345 52760 47668 54583 30300 5391 41244
14152 41244 71374 62628 44215 24777 15258 32833 42988 28488 26046 8798 17904 6764
14140 6764 -15580 -18917 -4343 -2601 5924 43529 33062 11749 8190 -3765 1321 -7598 -12028
14127 -12028 -7142 7387 -10363 -59995 -95594 -55859 427 29330 16723 5745 23991 38053
14115 38053 18846 9987 18401 21886 22498 43899 56379 21829 -31536 -35152 -10718 -294 9105
14102 9105 37818 18777 -17840 -16169 -22707 -23437 -18563 -25453 901 30187 14373 -8001 2385
$$ packed form
14190B4272k9365K204K0740m0089Q973J9578r464Q688Q207K893R104k4693j8222
14177a7174p40k6936l356J7453K2685K3043L7512J636p267m003k4198K587p153
14164A4089J8722J7303R72m0481j6825K7565L1415n092O915k4283k4909L5853
14152D1244L0130q746j8413j9438r519J7575J0155j4500k442j7248R106j1140
14140F764k2344l337J4574J742Q525L7605j0467k1313l559j1955N086q919m430
14127a2028M886J4529j7750m9632l5599L9735N6286K8903j2607j0978J8246J4062
14115C8053j9207q859Q414L485O12K1401J2480l4550n3365l616K4434J0424R399
14102I105K8713j9041l6617J671o538p30M874o890K6354K9286j5814k2374J0386
$$ plain form
14089 2385 11900 3239 -13755 23471 35337 30808 16955 3973 -22552 -29213 -24553 -7306 -3252
14076 -3252 -44572 -55464 -57490 -42253 -37155 -23334 -22888 -11970 26928 45601 64181 45395 4548
14063 4548 19779 -3979 -17824 -8137 15948 35312 19529 13455 -13545 -4747 8249 24966
14051 24966 32265 6059 -1033 -11170 -1672 15111 21733 5399 -22475 -15081 16974 30028 -18015
14038 -18015 -46294 -58476 -32465 -27795 -38479 -40427 -41495 -45774 -3954 36528 47502 16202
14026 16202 2073 -12020 -3421 24018 32867 44076 50046 55094 52654 54523 62003 85413 74132
14013 74132 17054 4930 -18085 -32810 -36267 -51755 -42985 -59472 -22906 -31424 -38779 -28562
14001 -28562 -14764 692 24454 38394 31560 6338 -5809 -900 10447 2930 -6656 -20344
$$ packed form
14089B385R515q661j6994L7226J1866m529j3853j2982k6525o661M660J7247M054
14076c252m1320j0892k026J5237N098J3821M46J0918L8898J8673J8580j8786m0847
14063D548J5231k3758j3845R687K4085J9364j5783o074k7000Q798J2996J6717
14051B4966P299k6206p092j0137R498J6783O622j6334k7874P394L2055J3054m8043
14038a8015k8279j2182K6011M670j0684j948j068m279M1820M0482J0974l1300
14026A6202j4129j4093Q599K7439Q849J1209N970N048k440J869P480K3410j1281
14013G4132n7078j2124k3015j4725l457j5488Q770j6487L6566q518p355J0217
14001b8562J3798J5456K3762J3940o834k5222j2147M909J1347p517r586j3688
$$ plain form
13989 -20344 -16686 -16370 28727 18599 10007 18301 15032 3801 -22926 -40368 -8963 17694 11031
13976 11031 -14543 -59760 -41452 -10129 -7241 -34758 -41375 -43079 -24296 -28441 -44338 -6989
13964 -6989 11432 -10213 -45008 -45536 -48506 -4659 55369 69362 64233 39203 14259 -594 10121
13951 10121 4730 21594 4650 -1720 26375 25341 18364 -17063 -27270 -30121 -12097 -11538 -38889
13938 -38889 -39273 -33470 -36350 -42963 -44895 -17306 -13827 -20684 -13644 34261 29156 2289 35890 59797
13924 59797 -4879 -31437 -37015 -18612 -36896 -47335 -46493 -10442 -20348 -63745 -45405 -43874 -39144
13911 -39144 -33273 -28130 -21649 -12973 -8641 -33583 -52793 -65642 -55950 -67135 -48943 -18776 -20073
13898 -20073 -25437 2171 37288 33706 9229 -99 21522 12985 -8958 -4083 27815 28393 -9196
$$ packed form
13989b0344L658L16M5097j0128q592Q294l269j1231k6727j7442L1405K6657o663
13976A1031k5574m5217J8308L1323K888k7517o617j704J8783m145j5897L7349
13964f989J8421k1645l4795n28k970M3847O0028J3993n129k5030k4944j4853J0715
13951A0121n391J6864j6944o370K8095j034o977l5427j0207k851J8024N59k7351
13938c8889l84N803k880o613j932K7589L479o857P040M7905n105k6867L3601K3907
13924E9797o4676k6558n578J8403j8284j0439Q42L6051r906m3397J8340J531M730
13911c9144N871N143O481Q676M332k4942j9210j2849R692j1185J8192L0167j297
13898b0073n364K7608L5117l582k4477r328K1621q537k1943M875L1898N78l7589
$$ plain form
13885 -9196 7983 19297 -16617 -20587 -6663 23133 39374 30938 10625 -19535 -2716 9626
13873 9626 36253 66990 52851 51248 31410 16456 2493 8150 21621 32205 47207 34702
13861 34702 -86 4323 4152 6166 9128 18226 20338 22303 14863 4016 -4971 -9945 -7398 17659
13847 17659 15880 12171 38254 -5074 -21581 -28302 -41732 -44151 -36288 -4568 -5938 -25347 -23969
13834 -23969 -35478 -19719 -24251 -30801 -30252 -32772 -61470 -54315 -55568 -20714 -7768 -6737 603
13821 603 4345 -16213 -15819 -13079 -28968 -50801 -38700 -35515 -4590 3486 17468 14277 7822 1267
13807 1267 -31174 -29785 -4058 -17800 -48145 -63730 -51635 -67342 -67393 -42284 -40383 -36597 -18803
13794 -18803 5033 10230 -848 -33330 -32454 -35564 -19994 6286 -3072 -15764 -17376 -24102 -24391
$$ packed form
13885i196J7179J1314l5914l970J3924K9796J6241q436k0313l0160J6819J2342
13873I626K6627L0737j4139j603j9838j4954j3963N657J3471J0584J5002j2505
13861C4702l4788M409j71K014K962R098K112J965p440j0847q987m974K547K5057
13847A7659j779l709K6083m3328j6507o721j3430k419P863L1720j370j9409J378
13834b3969j1509J5759m532o550N49k520k8698P155j253L4854J2946J031P340
13821F03L742k0558L94K740j5889k1833J2101L185L0925Q076J3982l191o455o555
13807A267l2441J389K5727j3742l0345j5585J2095j5707n1K5109J901L786J7794
13794a8803K3836N197j1078l2482Q76l110J5570K6280r358j2692j612o726k89
$$ plain form
13781 -24391 -36724 -66080 -48779 -17251 805 -15861 -30287 -52364 -62566 -59043 -68040 -47297
13769 -47297 -10422 -20575 -40679 -27585 -18828 -20166 -24486 -63286 -53216 13302 48750 81014
13757 81014 80033 42897 15710 -8852 -10199 -11042 7498 702 26555 48817 56966 53600 35516
13744 35516 17038 -27665 -43375 -68730 -35240 -3060 32812 12155 -18260 -12343 -37071 -17618
13732 -17618 3715 16614 3487 -3326 -32419 -37548 -42261 -21290 -7926 -9956 4347 18445
13720 18445 17908 26279 37024 22524 -13405 -11305 -28965 -15152 1453 -12562 -28732 -60927
13708 -60927 -66856 -40857 -38034 -4626 -16498 -6850 1110 -12400 -31547 -29061 -22023 -4377 22452
13695 22452 7598 -5072 -12906 -3075 3913 3050 31104 33401 34569 -2307 -28231 -40993 -19591
$$ packed form
13781b4391j2333k9356J7301L1528J8056j6666j4426k2077j0202L523q997K0743
13769d7297L6875j0153k0104J3094Q757j338m320l8800J0070O6518L5448L2264
13757H1014r81l7136k7187k4562j347q43J8540o796K5853K2262Q149l366j8084
13744C5516j8478m4703j5710k5355L3490L2180L5872k0657l0415N917k4728J9453
13732a7618K1333J2899j3127o813k9093n129m713K0971J3364k030J4303J4098
13720A8445n37Q371J0745j4500l5929K100j7660J3813J6605j4015j6170l2195
13708f0927n929K5999K823L3408j1872R648P960j3510j9147K486P038J7646K6829
13695B2452j4854j2670p834R831O988q63K8054K297J168l6876k5924j2762K1402
$$ plain form
13682 -19591 -6642 6929 3846 13675 16348 14395 44375 36937 8951 -7273 24838 17881 21581
13669 21581 18642 -3199 3290 9909 12114 28521 37872 34688 50122 23231 3596 25754 1751
13656 1751 -6958 -15429 -4016 26873 36676 12014 7495 -2369 6394 4823 30448 -23869 -48957
13643 -48957 -51406 -28780 -21899 -17726 -15875 -34536 2272 -9155 -13507 -20735 5601 28014 13232
13630 13232 6001 -9730 -39879 -53550 -55902 -16934 17865 5003 -30604 -44996 -57464 -79340
13618 -79340 -63892 -22668 7617 -14291 -14981 17050 18848 9219 -61492 -103327 -111892 -84314 -42719
13605 -42719 -29736 -62018 -72282 -49115 -30254 433 -2967 -1081 8364 14047 23137 26037 26974
13592 26974 16595 -10329 -11297 -7514 -16287 30720 28559 46689 36567 12275 11776 17439 27779
$$ packed form
13682a9591J2949J3571l083R829K673j953K9980p438k7986j6224L2111o957L700
13669B1581k939k1841O489O619K205J6407R351l184J5434k6891j9635K2158k4003
13656A751q709q471J1413L0889R803k4662m519r864Q763j571K5625n4317k5088
13643d8957k449K2626O881M173J851j8661L6808j1427m352p228K6336K2413j4782
13630A3232p231j5731l0149j3671k352L8968L4799j2862l5607j4392j2468k1876
13618g9340J5448M1224L0285k1908o90L2031J798r629p0711m1835q565K7578M1595
13605d2719J2983l2282j0264K3167J8861L0687l400J886R445N683R090K900R37
13592B6974j0379k6924r68L783q773M7007k161J8130j0122k4292m99N663J0340
$$ plain form
13579 27779 20208 6844 16424 38113 52041 55812 53968 12441 -17851 -13202 -4715 -19748 -12352
13566 -12352 -12868 -6426 -45341 -58203 -28065 -18580 470 6282 -16135 -4590 -15478 -3896 -9023
13553 -9023 -13591 -563 -4518 11092 833 -27910 -32171 -43458 -14279 9979 14264 -10341 -19734
13540 -19734 -38704 -20825 16759 4779 21609 8821 -23142 -43155 -68227 -47321 -3041 26212
13528 26212 27752 26742 15384 39406 52240 28546 -6112 -7946 -16392 -11090 -18292 6306 -6289
13515 -6289 -31016 -34874 -67654 -96698 -79011 -82172 -53835 -23815 5964 49520 20255 -18640
13503 -18640 8897 28729 20454 33707 43558 50789 16728 965 400 -9056 -20264 -5168 -3386
13490 -3386 -15535 -36800 -39331 -208 6128 -23785 -38727 -23599 -54484 -50624 -13177 -11577 -16717
$$ packed form
13579B7779p571j3364R580K1689J3928L771j844m1527l0292M649Q487j5033P396
13566a2352n16O442l8915j2862L0138R485J9050N812k2417J1545j0888J1582n127
13553i023m568J3028l955J5610j0259k8743m261j1287K9179K4258M285k4605r393
13540a9734j8970J7879L7584j1980J6830j2788l1963k0013k5072K0906M4280K9253
13528B6212J540j010j1358K4022J2834k3694l4658j834q446N302p202K4598j2595
13515f289k4727l858l2780k9044J7687l161K8337L0020K9779M3556k9265l8895
13503a8640K7537J9832q275J3253R851P231l4061j5763n65r456j1208J5096J782
13490c386j2149k1265k531L9123O336k9913j4942J5128l0885L860L7447J600n140
$$ plain form
13477 -16717 8756 17586 8420 18016 49532 37911 36239 32789 -7821 -39540 -7185 26218 16484
13464 16484 -11987 -12328 -9250 -4447 -1912 -44 9970 7247 -1234 30112 63324 45698 29397
13451 29397 4102 -5393 21170 21534 -2596 -27447 -54549 -44842 -18694 -32906 -30146 -22681 -10177
13438 -10177 -10891 -12869 -7261 -4864 -1971 -16774 -25426 -2873 -17632 -11561 31595 39376 33577 12684
13424 12684 15765 -9839 -13703 -19338 -21831 -15199 -22395 -55487 -64267 -7798 12203 22021 38168
13411 38168 43076 46736 44660 16711 927 12223 40687 -5163 -29954 -24272 -18732 -22309 -15227
13398 -15227 26192 33840 36488 39257 41966 60884 48568 36480 49799 41630 55328 59984 15628
13385 15628 41732 83749 87107 21166 -340 -8244 519 1263 13401 -8071 -24945 -3720 -12314
$$ packed form
13477a6717K5473Q830r166R596L1516j1621j672l450m0610l1719L2355L3403r734
13464A6484k8471l41L078M803K535J868J0014k723q481L1346L3212j7626j6301
13451B9397k5295r495K6563L64k4130k4851k7102R707K6148j4212K760P465J2504
13438a0177p14j978N608K397K893j4803q652K2553j4759O071M3156P781n799k0893
13424A2684L081k5604l864n635k493O632p196l3092q780N6469K0001R818J6147
13411C8168M908L660k076k7949j5784J1296K8464m5850k4791N682N540l577P082
13398a5227M1419P648K648K769K709J8918j2316j2088J3319q169J3698M656m4356
13385A5628K6104M2017L358o5941k1506p904Q763P44J2138k1472j6874K1225q594
$$ plain form
13372 -12314 9452 -7320 -861 20667 -2658 -32407 -38475 -22389 9879 23115 17466 27239
13360 27239 28069 7498 -36475 -34532 8146 25473 24988 30625 43386 55502 66347 47314 679
13347 679 2425 14288 17346 3942 32365 48431 67453 47834 28314 36882 46083 4886 -9488
13334 -9488 13975 20178 37496 38726 -8556 -46704 -49708 -61257 -50972 -46034 -36336 -36147 -16729
13321 -16729 -8902 29281 50185 -1095 -42658 -54763 -50634 -45656 -14595 9830 23309 14979
13309 14979 -6510 -6815 -16458 -18478 -36953 -54645 -58503 -33333 -15997 -11406 -30358 -31167 4358
13296 4358 11783 -27108 -39527 -26985 -7465 10919 -10031 -27535 -38025 -31411 27220 33818
13284 33818 2929 -8407 10739 13503 -40730 -45689 -27086 -4128 -12681 -21425 -36152 -27657 -6638
$$ packed form
13372a2314K1766j6772O459K1528k3325k9749o068J6086L2268J3236n649R773
13360B7239Q30k0571m3973J943M2678J7327m85N637J2761J2116J0845j9033m6635
13347F79J746J1863L058j3404K8423J6066J9022j9619j9520Q568R201m1197j4374
13334i488K3463O203J7318J230m7282l8148l004j1549J0285M938R698J89J9418
13321a6729P827L8183K0904n1280m1563j2105M129M978L1061K4425J3479q330
13309A4979k1489l05r643k020j8475j7692l858K5170J7336M591j8952q09L5525
13296D358P425l8891j2419J2542J9520J8384k0950j7504j0490O614N8631O598
13284C3818l0889j1336J9146K764n4233m959J8603K2958q553q744j4727Q495K1019
$$ plain form
13271 -6638 -17292 -60 -6144 -35450 -25860 7378 32703 14397 3839 -8263 -20932 -32347
13259 -32347 -6637 9923 11255 16352 -20631 -43439 -24240 16737 18220 1906 21821 51909
13247 51909 87464 78447 46468 47895 40268 21478 1064 4722 36341 57989 19478 -1694
13235 -1694 -53226 -54269 -22336 -31368 -17621 -10881 -22580 -40032 -6839 -8522 -8455 6490 5475
13222 5475 11046 27956 15166 -14678 -30765 -39173 -15029 -2576 -7506 -1240 10648 7201 11901
13209 11901 -465 30166 29378 13861 51418 61624 42835 23760 3696 1259 8329 22091
13197 22091 25908 12221 34297 32162 4344 -18986 -31849 -3174 17770 23727 -11178 -29596
13185 -29596 -37044 -35229 -7389 -8476 18413 22544 11537 8302 -3673 4525 27957 29052 27346
$$ packed form
13271f638j0654J7232o084k9306R590L3238K5325j8306j0558j2102j2669j1415
13259c2347K5710J6560J332N097l6983k2808J9199M0977J483j6314J9915L0088
13247E1909L5555r017l1979J427p627j8790k0414L658L1619K1648l8511k1172
13235a694n1532j043L1933r032J3747O740j1699j7452L3193j683O7J4945j015
13222E475N571J6910j2790k9844j6087q408K4144J2453m930O266J1888l447M700
13209A1901j2366L0631p88j5517L7557J0206j8789j9075k0064k437P070J3762
13197B2091L817j3687K2076k135k7818k3330j2863K8675K0944N957l4905j8418
13185b9596p448J815K7840j087K6889M131j1007l235j1975Q198K3432J095j706
$$ plain form
13172 27346 30304 26964 5385 -1151 17151 44478 52103 -1335 -21750 -2094 -6036 -9500 -221
13159 -221 -28322 -49797 -52336 -66879 -53792 -12120 -3167 -10849 -10475 -16476 -19992 1493 -6491 -23449
13145 -23449 -52551 -53062 -50402 -43576 -37611 -33700 -40963 -60556 -50687 -44471 -51931 -57699 -27417 -18281
13131 -18281 -28036 -47187 -21181 -17382 -16645 -30433 -44625 -10396 22947 33182 -7530 -9381 -7407
13118 -7407 -30356 -17401 7137 4246 -31884 -38492 -33078 -17413 5868 20217 12657 27972 29496
13105 29496 19653 45966 66121 49152 27249 37825 40024 26425 8080 27933 45791 39518
13093 39518 28774 5738 -14818 -14804 6992 39645 29291 28986 -14919 -7832 -1906 22173 58299
13080 58299 59820 52270 31392 -7530 -15777 -23415 -4716 11096 -3548 -13083 -16725 -48169 -38275
$$ packed form
13172B7346K958l340k1579o536J8302K7327P625n3438k0415J9656l942l464R279
13159b21k8101k1475k539j4543J3087M1672Q953p682L74o001l516K1485p984j6958
13145b3449k9102n11K660O826N965L911p263j9593R869O216p460n768L0282R136
13131a8281r755j9151K6006L799P37j3788j4192L4229L3343J0235m0712j851J974
13118g407k2949J2955K4538k891l6130o608N414J5665K3281J4349p560J5315J524
13105B9496r843K6313K0155j6969k1903J0576K199j3599j8345J9853J7858o273
13093C9518j0744k3036k0556J4K1796L2653j0354l05m3905P087N926K4079L6126
13080E8299J521p550k0878l8922q247p638J8699J5812j4644r535l642l1444R894
$$ plain form
13067 -38275 12765 28124 32804 45339 16034 20413 54635 73222 35531 6259 3776 14912
13055 14912 2696 -1963 -15168 -11910 -35952 -53313 -14953 27994 48454 32728 10356 3842
13043 3842 44665 41090 8738 -2321 -18749 -10909 18873 41967 31578 10876 4144 16823
13031 16823 35953 34785 27557 -2008 385 -30021 -39609 -30741 -52477 -29617 -16974 -25795 -23263
13018 -23263 4326 33946 20987 28816 30696 9543 -10421 -339 -11570 -20159 -16211 15245
13006 15245 19432 -24449 -14464 12512 3262 24157 35455 38363 18574 -2124 24654 47057
12994 47057 39781 12204 -2812 -2496 -19644 -14610 -10161 15187 35734 60106 55578 20076 27130
12981 27130 17667 -6166 -55720 -68276 -32499 -31021 -34304 1524 -2241 13028 46302 48039 32534
$$ packed form
13067c8275N1040J5359M680J2535k9305M379L4222J8587l7691k9272k483J1136
13055A4912j2216m659j3205L258k4042j7361L8360M2947K0460j5726k2372o514
13043C842M0823l575l2352j1059j6428P840K9782K3094j0389k0702o732J2679
13031A6823J9130j168p228k9565K393l0406r588Q868k1736K2860J2643q821K532
13018b3263K7589K9620j2959P829J880k1153j9964J0082j1231q589L948L1456
13006A5245M187m3881R985K6976r250K0895J1298K908j9789k0698K6778K2403
12994D7057p276k7577j5016L16j7148N034M449K5348K0547K4372m528l5502P054
12981B7130r463k3833m9554j2556L5777J478l283L5828l765J5269L3274J737j5505
$$ plain form
12968 32534 15250 15654 -13394 23822 55976 65089 66205 42223 27826 43764 75973 60390
12956 60390 427 -15421 12315 36029 46507 38776 20026 -27328 -35597 -12680 37206 55273
12944 55273 -676 -13897 11208 24688 2889 -41182 -61163 -20784 -423 19258 -4346 9514
12932 9514 24623 14252 34232 49475 58533 90344 73777 64747 24547 30090 39119 7188 -11290
12919 -11290 7433 47037 54027 39649 46467 44874 37789 34194 16550 -14006 -44180 -69909 -24311
12906 -24311 29110 22113 -1127 -28553 -26890 -14045 -40790 -26046 -5224 -8567 -10435 12807
12894 12807 67452 81998 53645 56644 30279 -2918 -30958 -19176 -21925 -14707 -1378 -7152
12882 -7152 -18890 -11600 33983 61446 19084 -12018 3760 -821 -25129 -34056 -58812 -37168
$$ packed form
12968C2534j7284M04k9048L7216L2154R113J116k3982j4397J5938L2209j5583
12956F0390n9963j5848K7736K3714J0478p731j8750m7354q269K2917M9886J8067
12944E5273n5949j3221K5105J3480k1799m4071j9981M0379K0361J9681k3604J3860
12932I514J5109j0371J9980J5243R058L1811j6567r030m0200N543R029l1931j8478
12919a1290J8723L9604O990j4378O818j593p085l595j7644l0556l0174k5729M5598
12906b4311N3421o997k3240k7426J663J2845k6745J4744K0822l343j868K3242
12894A2807N4645J4546k8353K999k6365l3197k8040J1782k749P218J3329n774
12882g152j1738P290M5583K7463m2362l1102J5778m581k4308q927k4756K1644
$$ plain form
12870 -37168 -10681 21401 53632 23437 5689 11084 5966 8059 20898 20758 28495 33994 21536
12857 21536 12984 16296 1578 13215 14771 12866 21175 21540 11998 5856 -21761 -24117 -15525 -1407
12843 -1407 8121 13426 43702 33562 4291 13865 23791 11410 45658 47975 39866 42286 35928
12830 35928 53014 65570 65788 31854 -28858 -30258 -36553 -46770 -9603 15212 63301 77335
12818 77335 47736 47342 44798 56897 28889 14281 23676 30600 48545 57596 59313 40542 17779
12805 17779 16899 27116 25177 45699 29452 4103 4439 7886 37111 50886 28559 16088 32720
12792 32720 37648 40820 40386 53502 67909 71367 66677 76955 80852 98653 86807 88975 90590
12779 90590 95029 85624 87653 97470 104001 122075 117855 141987 164589 149974 131271 131582 138080
$$ packed form
12870c7168K6487L2082L2231l0195j7748N395n118K093J2839j40P737N499j2458
12857B1536q552L312j4718J1637J556j905Q309L65r542o142k7617k356Q592J4118
12843a407R528N305L0276j0140k9271R574R926j2381L4248K317q109K420o358
12830C5928J7086J2556K18l3934o0712j400o295j0217L7167K4815M8089J4034
12818G7335k9599l94k544J2099k8008j4608R395O924J7945R051J717j8771k2763
12805A7779q80J0217j939K0522j6247k5349L36L447K9225J3775k2327j2471J6632
12792C2720M928L172m34J3116J4407L458m690J0278L897J7801j1846K168J615
12779I0590M439r405K029R817O531J8074m220K4132K2602j4615j8703L11O498
$$ plain form
12766 138080 126501 125239 117533 120195 104290 74903 88693 93758 72335 35233 35969 76760 94868
12753 94868 87041 130732 127425 163498 170052 209779 242371 230018 192229 181308 195471 178564
12741 178564 211893 221736 224726 236217 209459 188486 169943 198281 217843 201832 172547 171218
12729 171218 202417 214203 210017 199504 182212 172340 150530 117971 107853 121360 103405 75197
12717 75197 66108 102267 143407 156073 165381 172002 183124 192545 199877 190117 166619 151589 159782
12704 159782 162607 135921 137633 172240 137128 92558 73963 50370 56079 43663 50896 70852
12692 70852 99512 91285 41616 29796 27046 19333 35711 76385 107468 112474 74999 44701
12680 44701 40908 32212 43626 41465 8459 15644 34189 62348 63465 51544 74701 59816 46604
$$ packed form
12766A38080j1579j262p706K662j5905k9387J3790N065k1423l7102P36M0791J8108
12753I4868p827M3691l307L6073O554L9727L2592j2353l7789j0921J4163j6907
12741A78564L3329R843K990J1491k6758k0973j8543K8338J9562j6011k9285j329
12729A71218L1199J1786m186j0513j7292r872k1810l2559j0118J3507j7955k8208
12717G5197r089L6159M1140J2666R308O621J1122R421P332r760k3498j5030Q193
12704A59782K825k6686J712L4607l5112m4570j8595k3593N709j2416P233J9956
12692G0852K8660q227m9669j1820k750p713J6378M0674L1083N006l7475l0298
12680D4701l793q696J1414k161l3006P185J8545K8159J117j1921K3157j4885j3212
$$ plain form
12667 46604 41901 42732 73550 57257 13670 3824 16287 8138 -1013 5023 3144 34264 60937
12654 60937 46253 26361 8136 44358 43641 53326 61411 47462 38919 20461 -18013 2990 11877
12641 11877 -10036 -4901 9538 -9742 30512 60202 63931 77900 46978 30002 33196 9462
12629 9462 20705 17331 7717 1240 4741 14733 42058 83413 70259 48138 47242 37345 11211
12616 11211 8620 25811 36179 32823 32614 72004 76403 66054 59944 66420 65151 58383 42694
12603 42694 36058 31212 7238 -21431 3579 41780 54301 78418 91340 74752 43946 42233
12591 42233 86264 98086 87523 36383 41705 87141 79195 52518 41810 36270 51398 60140
12579 60140 92638 84289 62752 55638 72073 87378 110813 113053 108868 76076 45612 68035
$$ packed form
12667D6604m703Q31L0818j6293m3587r846J2463q149r151O036j879L1120K6673
12654F0937j4684j9892j8225L6222p17R685Q085j3949q543j8458l8474K1003Q887
12641A1877k1913N135J4439j9280M0254K9690L729J3969l0922j6976L194k3734
12629I462J1243l374r614o477L501R992K7325M1355j3154k2121q96r897k6134
12616A1211k591J7191J0368l356k09L9390M399j0349o110O476j269o768j5689
12603D2694o636m846k3974k8669K5010L8201J2521K4117J2922j6588l0806j713
12591D2233M4031J1822j0563n1140N322M5436p946k6677j0708n540J5128Q742
12579F0140L2498q349k1537p114J6435J5305K3435K240m185l2792l0464K2423
$$ plain form
12567 68035 89248 73961 50026 30250 41699 49950 60103 82238 68226 53774 94082 142266
12555 142266 142942 139901 108241 96902 89588 96106 119640 151592 130402 107307 90539 118673
12543 118673 122583 122393 121072 105427 120359 119002 120827 117565 135779 120426 62642 54054 89088
12530 89088 102680 86288 98069 120101 122993 126918 141932 138342 148504 135178 149907 148074
12518 148074 127275 109225 127027 114529 123802 78592 64708 71605 54725 65503 73416 107916
12506 107916 114513 83717 109349 149636 139694 134572 132248 125931 118951 146762 139566 122968 129631
12493 129631 116639 91889 91721 100173 144387 153427 118805 134621 132318 116078 144090 177776
12481 177776 196056 197472 178073 173408 208766 199188 195505 178967 167818 170987 188251 179482 193674
$$ packed form
12567F8035K1213j5287k3935j9776J1449Q251J0153K2135j4012j4452M0308M8184
12555A42266O76l041l1660j1339p314O518K3534L1952k1190k3095j6768K8134
12543A18673L910j90j321j5645J4932j357J825l262J8214j5353n7784q588L5034
12530H9088J3592j6392J1781K2032K892L925J5014l590J0162j3326J4729j833
12518A48074k0799j8050J7802j2498R273m5210j3884O897j6880J0778P913L4500
12506A07916O597l0796K5632M0287r942n122k324o317o980K7811p196j6598O663
12493A29631j2992k4750j68Q452M4214R040l4622J5816k303j6240K8012L3686
12481A77776J8280J416j9399m665L5358r578l683j6538j1149L169J7264q769J4192
$$ plain form
12468 193674 218257 199165 189389 165182 157969 212836 250297 241119 238103 246771 255004 269296 266561
12455 266561 244703 214999 217256 208262 208508 179538 184234 186334 212929 226674 252288 271247 246509
12442 246509 237127 245904 293594 289583 261894 219662 228331 273728 313943 306539 306560 298013 288979
12429 288979 286679 293324 308301 331433 377641 383145 381742 360108 378798 397168 390780 412773
12417 412773 455205 457787 463228 477477 483942 467877 482791 484484 478584 459777 450819 462588 493261
12404 493261 560453 575182 579194 557740 565975 568422 561765 591277 625920 657740 672118 653035
12392 653035 662975 703260 754988 776177 748347 741855 753060 778567 829922 847153 871435 877712
12380 877712 882225 944904 1005982 1054277 1111990 1144104 1184832 1188142 1179615 1220937 1296499 1358839
$$ packed form
12468A93674K4583j9092r776k4207p213N4867L7461r178l016Q668Q233J4292k735
12455B66561k1858k9704K257q994K46k8970M696K100K6595J3745K5614J8959k4738
12442B46509r382Q777M7690m011k7689m2232Q669M5397M0215p404K1q547r034
12429B88979k300O645J4977K3132M6208N504j403k1634J8690J8370o388K1993
12417D12773M2432K582N441J4249O465j6065J4914J693n900j8807q958J1769L0673
12404D93261O7192J4729M012k1454Q235K447o657K9512L4643L1820J4378j9083
12392F53035R940M0285N1728K1189k7830o492J1205K5507N1355J7231K4282O277
12380H77712M513O2679O1078M8295N7713L2114M0728L310q527M1322P5562O2340
$$ plain form
12368 1358839 1431678 1503833 1562550 1640113 1751391 1862395 2034220 2245054 2474018 2726544
12358 2726544 3087434 3570684 4149515 4958093 5915015 6758833 7194962 7139034 6806436 6489315
12348 6489315 6299669 6280525 6453981 6842176 7409492 8181514 9143220 10294187 11738550
12339 11738550 13487437 15466158 17588211 19706863 21581794 22965148 23658890 23619558
12331 23619558 22922812 21792124 20355892 18806991 17304323 15973223 14854470 13958371
12323 13958371 13351781 13019356 12905062 13048024 13423901 14001191 14857911 16047353 17500196
12314 17500196 19133140 20951455 22783806 24550502 26325760 28037359 29577655 30981884
12306 30981884 32332263 33625432 34777029 35698117 36202968 36144616 35500402 34334926 32791470
$$ packed form
12368A358839P2839P2155N8717P7563J11278J11004J71825K10834K28964K52526
12358B726544L60890M83250N78831Q08578R56922Q43818M36129n5928l32598l17121
12348F489315j89646j9144J73456L88195N67316P72022R61706J150967J444363
12339A1738550J748887J978721K122053K118652J874931J383354O93742l9332
12331B3619558o96746j130688j436232j548901j502668j331100j118753q96099
12323A3958371o06590l32425j14294J42962L75877N77290Q56720J189442J452843
12314A7500196J632944J818315J832351J766696J775258J711599J540296J404229
12306C0981884J350379J293169J151597R21088N04851n8352o44214j165476j543456
$$ plain form
12297 32791470 31093084 29438450 27920932 26717407 25938299 25532156 25497346 25711974 26000748
12288 26000748 26162780 26062911 25716540 25166184 24363632 23431483 22478953 21524922 20677155
12279 20677155 20025336 19704777 19767232 20230158 21031393 22237795 23881222 25987786 28592414
12270 28592414 31477955 34352626 36875174 38535448 38934874 37954430 35835878 32948381
12262 32948381 29681696 26383537 23278135 20482854 18079537 16034376 14341361 12931700
12254 12931700 11752115 10741228 9888366 9132587 8474274 7913348 7430599 7001849 6623718
12245 6623718 6346447 6090657 5846815 5594705 5354150 5140584 4909670 4704454 4529860
12236 4529860 4389270 4295450 4185425 4080199 3972167 3825106 3700367 3598888 3496534 3364033
$$ packed form
12297C2791470j698386j654634j517518j203525p79108m06143l4810K14628K88774
12288B6000748J62032r9869l46371n50356q02552r32149r52530r54031q47767
12279B0677155o51819l20559O2455M62926Q01235J206402J643427K106564K604628
12270B8592414K885541K874671K522548J660274L99426r80444k118552k887497
12262C2948381l266685l298159l105402k795281k403317k045161j693015j409661
12254A2931700j179585j010887q52862p55779o58313n60926m82749m28750l78131
12245F623718k77271k55790k43842k52110k40555k13566k30914k05216j74594
12236D529860j40590r3820j10025j05226j08032j47061j24739j01479j02354j32501
$$ plain form
12226 3364033 3245010 3120318 2995340 2884472 2779324 2723255 2622886 2492370 2360954 2279220
12216 2279220 2182041 2050420 1966849 1900312 1837502 1758126 1692720 1631430 1597248 1578525 1521968
12205 1521968 1436296 1379062 1308972 1249728 1203380 1167131 1103048 1071273 1042103 1004381 965608
12194 965608 936361 933286 957539 927003 895642 905098 888629 857409 817396 760502 718559 717489
12182 717489 727577 685885 701285 706248 707770 682706 644955 604109 559406 560052 551333 545954 557133
12169 557133 525503 503669 476805 462447 472651 471339 477274 478252 486332 508108 495754 469984
12157 469984 442752 419881 441586 477368 511800 507758 522832 504112 496122 496979 530308 582491
12145 582491 620415 664601 724092 780774 813123 854612 904167 964374 1002206 1005091 1001868 1017032
$$ packed form
12226C364033j19023j24692j24978j10868j05148n6069j00369j30516j31416q1734
12216B279220r7179j31621q3571o6537o2810p9376o5406o1290l4182j8723n6557
12205A521968q5672n7234p0090n9244m6348l6249o4083l1775k9170l7722l8773
12194I65608k9247l075K4253l0536l1361R456j6469l1220m0013n6894m1943j070
12182G17489J0088m1692J5400M963J522k5064l7751m0846m4703O46q719n379J1179
12169E57133l1630k1834k6864j4358J0204j312N935R78Q080K1776j2354k5770
12157D69984k7232k2871K1705L5782L4432m042J5074j8720p990Q57L3329N2183
12145E82491L7924M4186N9491N6682L2349M1489M9555O0207L7832K885l223J5164
$$ plain form
12133 1017032 978119 943885 912293 843237 775749 729521 694743 660126 623716 572401 537991
12122 537991 532726 543462 535979 505320 502771 490183 527267 530618 504905 496681 521039 492685
12110 492685 471353 477329 526288 554545 546890 566967 554355 554109 533745 530079 507770 508888 547867
12097 547867 552186 585848 604164 584451 600231 603086 616999 621280 613356 614243 638406 612456 605742
12084 605742 613864 641228 662545 660771 652166 642059 659549 653667 661114 678097 709571 743941
12072 743941 778156 793330 815402 826924 819297 817447 804766 820412 863397 864208 867216 885668
12060 885668 877983 920774 960179 955861 969362 1015147 1054935 1075422 1119351 1172942 1220640 1250844
12048 1250844 1297055 1355591 1393513 1447894 1492617 1542697 1587023 1628983 1663252 1717001 1786964
$$ packed form
12133A017032l8913l4234l1592o9056o7488m6228l4778l4617l6410n1315l4410
12122E37991n265J0736p483l0659k549j2588L7084L351k5713q224K4358k8354
12110D92685k1332N976M8959K8257p655K0077j2612k46k0364l666k2309J118L8979
12097E47867M319L3662J8316j9713J5780K855J3913M281p924Q87K4163k5950o714
12084F05742Q122K7364K1317j774q605j0107J7490n882P447J6983L1474L4370
12072G43941L4215J5174K2072J1522p627j850j2681J5646M2985Q11L008J8452
12060H85668p685M2791L9405m318J3501M5785L9788K0487M3929N3591M7698L0204
12048A250844M6211N8536L7922N4381M4723N0080M4326M1960L4269N3749O9963
$$ plain form
12037 1786964 1882193 1964311 2026582 2109845 2179682 2283226 2458011 2626715 2775246 2946081
12027 2946081 3179739 3411295 3633417 3907674 4274700 4690994 5170867 5754366 6375897
12018 6375897 7097577 7945627 9017791 10211652 11604413 13257107 15223893 17494994
12010 17494994 20069894 22934067 25885967 28680458 31084272 32817091 33609920 33437554
12002 33437554 32323866 30568223 28421378 26175453 24045976 22214034 20761035 19660855
11994 19660855 18953975 18586725 18543388 18810743 19358111 20111794 21018073 21997804 22985864
11985 22985864 23826744 24468559 24857813 25021302 25044550 24997915 25033759 25269956 25752787 26585255
11975 26585255 27715471 29116942 30749707 32444072 33942612 35111059 35821478 35999000
$$ packed form
12037A786964R5229Q2118O2271Q3263O9837J03544J74785J68704J48531J70835
12027B946081K33658K31556K22122K74257L67026M16294M79873N83499O21531
12018F375897P21680Q48050J072164J193861J392761J652694J966786K271101
12010A7494994K574900K864173K951900K794491K403814J732819P92829j72366
12002C3437554j113688j755643k146845k245925k129477j831942j452999j100180
11994A9660855p06880l67250m3337K67355N47368P53683R06279R79731R88060
11985B2985864Q40880O41815L89254J63489K3248m6635L5844K36197M82831Q32468
11975B6585255J130216J401471J632765J694365J498540J168447P10419J77522
$$ plain form
11967 35999000 35689635 34977888 34094658 33076107 31927981 30636173 29206709 27691082
11959 27691082 26132208 24485121 22861037 21336942 19925934 18688045 17658523 16841096
11951 16841096 16267009 15909630 15793962 15875421 16172688 16720566 17492791 18500166 19655661
11942 19655661 20972277 22329228 23566607 24529427 25116210 25137564 24589892 23507737 21956634
11933 21956634 20186490 18336491 16544364 14909958 13472400 12175096 11016731 10022391
11925 10022391 9187848 8476588 7829916 7270875 6761547 6345126 5982963 5630722 5334556
11916 5334556 5058679 4797952 4581454 4379685 4201480 4010445 3854617 3748348 3624779
11907 3624779 3490605 3397439 3328429 3218356 3096753 3005410 2942391 2862403 2765621 2662421
$$ packed form
11967C5999000l09365p11747q83230j018551j148126j291808j429464j515627
11959B7691082j558874j647087j624084j524095j411008j237889j029522q17427
11951A6841096n74087l57379j15668Q1459K97267N47878P72225J007375J155495
11942A9655661J316616J356951J237379R62820N86783K1354n47672j082155j551103
11933B1956634j770144j849999j792127j634406j437558j297304j158365r94340
11925A0022391q34543p11260o46672n59041n09328m16421l62163l52241k96166
11916E334556k75877k60727k16498k01769j78205j91035j55828j06269j23569
11907C624779j34174r3166o9010j10073j21603r1343o3019p9988r6782j03200
$$ plain form
11897 2662421 2570164 2473686 2376089 2265905 2183110 2093600 2019891 1954627 1919400 1864496 1785316
11886 1785316 1736059 1710550 1679348 1667679 1635197 1567608 1487763 1434742 1376557 1360412 1344972
11875 1344972 1308824 1231785 1165335 1130038 1074082 1041788 1027398 1011049 978827 918785 870713
11864 870713 905763 912276 913435 875714 838147 806099 779775 758327 751846 696424 644380 634510
11852 634510 673670 698002 675673 669486 686720 682837 662690 643502 637374 640564 635937 587490
11840 587490 606389 584461 554581 535811 521892 517400 503714 520158 515997 461448 419397 434207
11828 434207 456549 458700 451930 435267 406164 367231 377715 361489 393542 408204 390199 386309
11816 386309 391308 404681 398746 436429 452237 466986 472031 463960 425968 402999 373595 327366
$$ packed form
11897B662421r2257r6478r7597j10184q2795q9510p3709o5264l5227n4904p9180
11886A785316m9257k5509l1202j1669l2482o7589p9845n3021n8185j6145j5440
11875A344972l6148p7039o6450l5297n5956l2294j4390j6349l2222o0042m8072
11864H70713L5050O513J159l7721l7567l2048k6324k1448o481n5422n2044r870
11852F34510L9160K4332k2329o187J7234l883k0147j9188o128L190m627m8447
11840E87490J8899k1928k9880j8770j3919m492j3686J6444m161n4549m2051J4810
11828D34207K2342K151o770j6663k9103l8933J0484j6226L2053J4662j8005l890
11816C86309M999J3373n935L7683J5808J4749N045q071l7992k2969k9404m6229
$$ plain form
11804 327366 301443 304034 316957 319671 308989 321069 301455 315915 304259 282216 273009 257420
11792 257420 285311 269189 243011 253513 247730 245078 237218 219255 216924 174446 190432 222618
11780 222618 249484 266362 246667 226094 229360 242344 301875 304573 278548 280924 299656 281278
11768 281278 250668 235179 237411 242358 216925 208623 209959 213108 214973 235605 248580 224322 209324
11755 209324 229638 244806 213809 208862 186703 153255 169715 198631 197931 199830 222519 239618
11743 239618 242483 222493 214609 176267 162772 135926 84814 83469 131251 163435 191071 194301
11731 194301 199009 215171 199890 179627 168287 145700 159555 190437 229628 230860 222250 199295
11719 199295 164400 165510 195790 221001 238192 233025 206837 167813 156295 147332 128591 107574
$$ packed form
11804C27366k5923K591J2923K714j0682J2080j9614J4460j1656k2043r207j5589
11792B57420K7891j6122k6178J0502n783k652p860j7963k331m2478J5986L2186
11780B22618K6866J6878j9695k0573L266J2984N9531K698k6025K376J8732j8378
11768B81278l0610j5489K232M947k5433q302J336L149J865K0632J2975k4258j4998
11755B09324K0314J5168l0997m947k2159l3448J6460K8916p00J899K2689J7099
11743B39618K865j9990p884l8342j3495k6846n1112j345M7782L2184K7636L230
11731A94301M708J6162j5281k0263j1340k2587J3855L0882L9191J232q610k2955
11719A99295l4895J110L0280K5211J7191n167k6188l9024j1518q963j8741k1017
$$ plain form
11707 107574 131023 182425 197572 162221 152490 145150 122376 113319 136279 153106 159643 163831
11695 163831 132821 109724 146185 160187 140995 141945 129786 120014 120792 106048 110972 113685 105455
11682 105455 117519 137386 119580 95089 66100 90649 101929 88464 98310 67936 70639 91047
11670 91047 88221 80436 86339 89433 79063 69213 73903 77128 72943 46170 67152 100246 97027
11657 97027 74017 58423 102769 113466 120960 127164 111822 79574 46309 93048 141665 135136
11645 135136 96343 103059 98186 84649 62044 57829 77638 67420 68541 110268 116474 95781
11633 95781 91560 71960 67052 61673 79201 63848 61331 82058 80521 82773 90600 80587 96853
11620 96853 112975 115974 92336 63150 57909 63589 98269 100892 81990 86430 118848 93939 78470
$$ packed form
11707A07574K3449N1402J5147l5351r731p340k2774r057K2960J6827O537M188
11695A63831l1010k3097L6461J4002j9192R50j2159r772P78j4744M924K713q230
11682A05455J2064J9867j7806k4491k8989K4549J1280j3465R846l0374K703K0408
11670I1047k826p785N903L094j0370r850M690L225m185k6773K0982L3094l219
11657I7027k3010j5594M4346J0697P494O204j5342l2248l3265M6739M8617o529
11645A35136l8793O716m873j3537k2605m215J9809j0218J121M1727O206k0693
11633I5781m221j9600m908n379J7528j5353k517K0727j537K252P827j0013J6266
11620I6853J6122K999k3638k9186n241N680L4680K623j8902M440L2418k4909j5469
$$ plain form
11607 78470 104277 103243 92394 87007 88084 92595 83714 96124 92486 85206 84313 34413 51648
11594 51648 90378 65809 56808 116194 165546 180300 152142 130497 120324 135814 147008 151146
11582 151146 134665 124776 143060 148344 142783 154240 189779 180625 211861 206530 170576 172532 190498
11569 190498 180567 187998 212021 219121 205987 217785 214306 170619 165379 212122 229909 205310
11557 205310 189026 148791 103908 67257 113790 156213 160669 171417 149496 134438 159356 164946
11545 164946 176674 198965 228356 244065 230982 216126 225674 226051 229403 210484 216266 235352
11533 235352 237035 207778 178155 180513 189187 187451 161761 159386 156752 155709 142746 153593 152141
11520 152141 160183 186168 214559 207568 176657 155037 127888 107979 113650 141488 148056 135292
$$ packed form
11607G8470K5807j034j0849n387J077M511q881J2410l638p280q93m9900J7235
11594E1648L8730k4569r001N9386M9352J4754k8158k1645j0173J5490J1194M138
11582A51146j6481r889J8284N284n561J1457L5539r154L1236n331l5954J956J7966
11569A90498r931P431K4023P100j3134J1798l479m3687n240M6743J7787k4599
11557B05310j6284m0235m4883l6651M6533M2423M456J0748k1921j5058K4918N590
11545A64946J1728K2291K9391J5709j3083j4856R548L77L352j8919N782J9086
11533B35352J683k9257k9623K358Q674j736k5690k375k634j043j2963J0847j452
11520A52141Q042K5985K8391o991l0911k1620k7149j9909N671K7838O568j2764
$$ plain form
11508 135292 107136 160279 187062 176243 171997 149149 136001 115481 121045 142707 171269 164540
11496 164540 174973 214904 191943 153835 123156 87407 75639 101481 100048 86345 53780 47405
11484 47405 52055 66427 68264 83378 81936 79531 99767 81019 39446 7965 32159 59750
11472 59750 53263 57753 53609 46206 39615 28094 15704 8181 9237 18124 14702 59065 91432
11459 91432 92595 71355 61750 51596 18312 7372 19499 20985 11715 2319 -16407 -25893 -21805
11446 -21805 -16306 4800 26691 3104 -16702 -14938 14175 20085 -17959 -43230 -36029 -6517
11434 -6517 47302 55386 60297 81596 64830 43546 61434 61756 38350 36441 57314 53382 30851
11421 30851 16836 47098 46094 16906 28531 54433 23733 7533 14416 12125 27662 65082
$$ packed form
11508A35292k8156N3143K6783j0819m246k2848j3148k0520N564K1662K8562o729
11496A64540J0433L9931k2961l8108l0679l5749j1768K5842j433j3703l2565o375
11484D7405M650J4372J837J5114j442k405K0236j8748m1573l1481K4194K7591
11472E9750o487M490m144p403o591j1521j2390p523J056Q887l422M4363L2367
11459I1432J163k1240r605j0154l3284j0940J2127J486r270r396j8726r486M088
11446b1805N499K1106K1891k3587j9806J764K9113N910l8044k5271P201K9512
11434f517N3819Q084M911K1299j6766k1284J7888L22k3406j909K0873l932k2531
11421C0851j4015L0262j004k9188J1625K5902l0700j6200O883k291J5537L7420
$$ plain form
11409 65082 85919 101451 112219 111379 108863 116377 112317 111858 88543 55490 78206 92588 105767
11396 105767 94023 68856 46253 42591 30909 16124 5113 37168 46309 42300 24531 30276
11384 30276 46277 73493 64490 55424 28732 27399 15151 24178 32260 24681 52011 32432 5990
11371 5990 -14896 -14609 4960 -10961 -13395 4665 30675 37043 40755 12995 10293 15181 12613
11358 12613 58643 86905 64253 3686 -2852 29531 39237 41413 30026 -3747 -31646 -21548
11346 -21548 -31064 -21537 -9902 -3670 14111 36609 55468 57366 29635 29524 4725 -12671 3649
11333 3649 -18826 -22424 14877 6244 -22261 -25194 -23169 19410 35447 12829 -10655 2245 2333
11320 2333 6872 44839 71682 59708 52151 66025 79961 96109 139139 173071 203796 208003
$$ packed form
11409F5082K0837J5532J0768q40k516P514m060m59k3315l3053K2716J4382J3179
11396A05767j1744k5167k2603l662j1682j4785j1011L2055R141m009j7769N745
11384C0276J6001K7216r003r066k6692j333j2248R027Q082p579K7330j9579k6442
11371E990k0886K87J9569j5921k434J8060K6010O368L712k7760k702M888k568
11358A2613M6030K8262k2652o0567o538L2383R706K176j1387l3773k7899J0098
11346b1548r516R527J1635O232J7781K2498J8859J898k7731j11k4799j7396J6320
11333C649k2475l598L7301q633k8505k933K025M2579J6037k2618k3484J2900Q8
11320B333M539L7967K6843j1974p557J3874J3936J6148M3030L3932L0725M207
$$ plain form
11308 208003 231191 215649 185253 149966 89441 89884 80860 65214 31227 51380 38490 13633
11296 13633 24647 22754 26500 62508 52012 -9002 -14057 40041 53143 38170 39390 60013
11284 60013 34065 16488 23425 19861 28093 10039 -409 11511 -4366 -4416 -18770 -24592 -5704
11271 -5704 -32452 -32187 -18386 -13519 1299 7756 13649 56737 59936 46244 48259 23165 20930
11258 20930 -6058 -31424 -17858 -13694 27609 66537 53750 24531 15098 36441 58267 66979
11246 66979 33836 5233 3739 19441 17606 -3698 -10350 -5372 9570 23435 12021 5432 -30481
11233 -30481 -25146 -1344 32548 29819 61280 94878 57289 36083 65305 63941 59425 35695
11221 35695 34891 60015 50967 43321 -6577 -13081 -29909 -43089 -14340 21987 11794 29635 38593
$$ packed form
11308B08003K3188j5542l0396l5287o0525M43r024j5646l3987K0153j2890k4857
11296A3633J1014j893L746L6008j0496o1014n055N4098J3102j4973J220K0623
11284F0013k5948j7577O937l564Q232j8054j0448J1920j5877n0j4354n822J8888
11271e704k6748K65J3801M867J4818O457N893M3088L199j3692K015k5094k235
11258B0930k6988k5366J3566M164M1303L8928j2787k9219r433K1343K1826Q712
11246F6979l3143k8603j494J5702j835k1304o652M978J4942J3865j1414o589l5913
11233c0481N335K3802L3892k729L1461L3598l7589k1206K9222j364m516k3730
11221C5695q04K5124r048p646m9898o504j6828j3180K8749L6327j0193J7841Q958
$$ plain form
11208 38593 45583 55385 33209 9398 558 -21084 -50712 -81640 -78546 -65527 -48360 -29149
11196 -29149 5594 49859 95902 103284 75141 73281 68582 49148 -23114 -60042 -28195 -39201
11184 -39201 -65215 -39044 -54157 -70036 -68168 -19635 1913 21423 17466 -1459 -8360 -25624
11172 -25624 -74157 -72814 -58932 -58188 -35565 -35895 -12942 15017 -2334 -30295 -28378 9219 33827
11159 33827 22432 31133 33961 11893 -9294 -20764 -56237 -58564 -20410 -7014 -7135 30869 1692
11146 1692 -13869 -24115 -29775 -19498 -23262 -28899 -18624 -30136 -28175 -70506 -88724 -49804 -12531
11133 -12531 14279 34354 53820 62887 17636 -13269 7046 17602 -4105 16881 28716 41496
11121 41496 16668 -6862 -18754 -20312 -9356 5130 6321 -10586 -8704 9541 -10754 -27668
$$ packed form
11208C8593O990R802k2176k3811q840k1642k9628l0928L094J3019J7167J9211
11196b9149L4743M4265M6043P382k8143j860m699j9434p2262l6928L1847j1006
11184c9201k6014K6171j5113j5879J868M8533K1548J9510l957j8925o901j7264
11172b5624m8533J343J3882P44K2623l30K2953K7959j7351k7961J917L7597K4608
11159C3827j1395Q701K828k2068k1187j1470l5473k327L8154J3396j21L8004k9177
11146A692j5561j0246n660J0277l764n637J0275j1512J961m2331j8218L8920L7273
11133a2531K6810K0075J9466R067m5251l0905K0315J0556k1707K0986J1835J2780
11121D1496k4828k3530j1892j558J0956J4486J191j6907J882J8245k0295j6914
$$ plain form
11109 -27668 -9425 25655 41700 11609 -12000 -14470 24291 60738 38396 -66 -15322 7764
11097 7764 29485 25897 -10311 -11349 -2317 9924 369 -42649 -66397 -62151 -10719 27412 29340
11084 29340 29658 10457 15344 25553 27296 24257 170 -29794 -16397 -1427 -12919 -15399 -30651
11071 -30651 -18316 26580 30458 8496 3284 13365 17078 29418 -659 -17983 -10428 2278
11059 2278 -12620 -30038 -33786 -22135 -13224 42220 59826 37342 31267 31578 4613 -4727 8279
11046 8279 15079 25191 14053 11346 18402 2390 -15228 -1605 10161 38676 15394 -22375
11034 -22375 -32951 -24258 -33210 -33563 -25543 755 -10821 -16204 -17492 7612 15388 -1600 11820
11021 11820 2788 -17202 -15848 370 29274 19617 5191 18502 -10634 2931 5513 -8233
$$ packed form
11109b7668J8243L5080J6045l0091k3609k470L8761L6447k2342l8462j5256K3086
11097G764K1721l588l6208j038R032J2241r555m3018k3748M246N1432L8131J928
11084B9340L18j9201M887J0209J743l039k4087k9964J3397J4970j1492k480j5252
11071c0651J2335M4896L878k1962n212J0081L713J2340l0077j7324P555J2706
11059B278j4898j7418l748J1651Q911N5444J7606k2484o075L11k6965r340J3006
11046H279O800J0112j1138k707P056j6012j7618J3623J1766K8515k3282l7769
11034b2375j0576Q693q952l53Q020K6298j1576n383j288K5104P776j6988J3420
11021A1820r032j9990J354J6218K8904r657j4426J3311k9136J3565K582j3746
$$ plain form
11009 -8233 -15578 -15991 -18305 -1127 -5789 -13842 -15876 -157 -15196 -33702 -34813 -2179 -44 -18741
10995 -18741 -37014 -29578 -491 10819 16026 17975 41872 32410 13114 15535 22059 16649 -322
10982 -322 -1260 -11439 -21960 11672 18416 35846 32002 17715 30227 33591 46507 52856 77571
10969 77571 73891 63891 49072 68001 63759 46880 56359 89247 91290 29756 -3741 6494
10957 6494 -13773 24216 12739 -10558 3251 -2352 -6273 -5413 15532 23607 20440 43337 62306
10944 62306 66385 49654 51595 80315 88142 89270 94471 99810 137997 135154 140781 138187 118906
10931 118906 82852 49067 60813 86625 108389 112002 101183 92522 86466 95321 116276 122708
10919 122708 106483 85443 94646 122294 138442 117883 106548 109462 86776 96543 102379 108344
$$ packed form
11009h233p345m13k314J7178m662q053k034J5719j5039j8506j111L2634K135j8697
10995a8741j8273P436K9087J1310N207J949K3897r462j9296K421O524n410j6971
10982c22r38j0179j0521L3632O744J7430l844j4287J2512L364J2916O349K4715
10969G7571l680j0000j4819J8929m242j6879R479L2888K043o1534l3497J0235
10957F494k0267L7989j1477k3297J3809n603l921Q60K0945Q075l167K2897J8969
10944F2306M079j6731J941K8720P827J128N201N339L8187k843N627k594j9281
10931A18906l6054l3785J1746K5812K1764L613j0819q661o056Q855K0955O432
10919A22708j6225k1040R203K7648J6148k0559j1335K914k2686R767N836N965
$$ plain form
10907 108344 115811 114603 119324 113952 104187 97096 137569 225569 322994 364689 378217 356262 325214
10894 325214 297030 240786 192277 174886 170676 159030 108485 122668 137505 154516 159544 158862
10882 158862 157942 162903 173056 193226 219231 272253 265961 248242 235123 221145 238281 303519
10870 303519 331333 345048 327232 309855 295207 287554 253616 268481 292149 331915 328693 316448
10858 316448 291270 262440 234505 234315 216826 191266 185373 197047 179125 190218 160588 164607
10846 164607 194849 202424 181590 165132 140221 147478 141191 150927 177489 203317 197947 156878
10834 156878 123018 110189 153537 172336 168815 132662 115138 154006 171149 179519 159078 146868
10822 146868 148015 157100 177358 173628 162978 161947 151796 153307 121232 158707 174301 105298
$$ packed form
10907A08344P467j208M721n372r765p091M0473Q8000R7425M1695J3528k1955l1048
10894C25214k8184n6244m8509j7391m210j1646n0545J4183J4837J7011N028o82
10882A58862r20M961J0153K0170K6005N3022o292j7719j3119j3978J7136O5238
10870C03519K7814J3715j7816j7377j4648p653l3938J4865K3668L9766l222j2245
10858C16448k5178k8830k7935j90j7489k5560n893J1674j7922J1093k9630M019
10846A64607L0242P575k0834j6458k4911P257o287R736K6562K5828n370m1069
10834A56878l3860j2829M3348J8799l521l6153j7524L8868J7143Q370k0441j2210
10822A46868J147R085K0258l730j0650j031j0151J511l2075L7475J5594o9003
$$ plain form
10810 105298 77739 96527 61328 76441 108339 105216 139302 137579 138407 139838 115981 97373
10798 97373 89030 127158 163726 200944 191625 168003 152694 128864 115072 107467 113676 123886
10786 123886 96532 83303 104150 138489 121924 66173 75493 66967 77197 89290 118780 110227
10774 110227 109756 105556 81230 78416 95752 68360 67174 94219 90191 69090 58886 63197 55850
10761 55850 61854 74603 110668 115193 108754 100627 125286 122477 124675 152315 204908 230875 209546
10748 209546 178857 170287 131203 92641 61068 43879 32850 24196 32351 36692 42545 26807
10736 26807 7610 17749 57138 78192 59284 15479 -923 -29047 -15389 -1015 13676 18281
10724 18281 29008 35033 15682 17905 -10041 -12334 -14129 -101 14410 9397 332 16645 21891
$$ packed form
10810A05298k7559J8788l5199J5113L1898l123L4086j723Q28J431k3857j8608
10798I7373q343L8128L6568L7218r319k3622j5309k3830j3792p605O209J0210
10786A23886k7354j3229K0847L4339j6565n5751R320q526J0230J2093K9490q553
10774A10227m71m200k4326k814J7336k7392j186K7045m028k1101j0204M311p347
10761E5850O004J2749L6065M525o439q127K4659k809K198K7640N2593K5967k1329
10748B09546l0689q570l9084l8562l1573j7189j1029q654Q155M341N853j5738
10736B6807j9197J0139L9389K1054j8908m3805j6402k8124J3658J4374J4691M605
10724A8281J0727O025j9351K223k7946k293j795J4028J4511n013r065J6313N246
$$ plain form
10711 21891 20921 25671 16809 8063 34454 21906 -3159 -21753 1656 28912 51959 13833 10099
10698 10099 16709 3910 8621 26844 29586 8325 -29748 -44736 -31041 -25065 -25350 -13432 -3692
10685 -3692 20308 36821 26721 5008 19132 9526 -18438 -25908 -11950 24310 -668 -9002
10673 -9002 15523 8711 -5341 -15663 -9520 -31809 -3353 11397 3117 3489 41402 48959 46313
10660 46313 7604 514 -37150 -54914 -44180 -41306 -20196 -8068 37403 31637 6438 -7386
10648 -7386 -4679 10352 1977 -5301 -26178 -15058 -10089 -17033 -2746 -8569 -1972 -2117 14233 12470
10634 12470 53475 57500 41585 21674 1565 11728 51608 51156 7853 -16291 -3629 45670
10622 45670 38996 25114 -8288 -19946 6452 -1577 -20195 -21311 -5153 23852 30226 51555
$$ packed form
10711B1891r70M750q862q746K6391j2548k5065j8594K3409K7256K3047l8126l734
10698A0099O610j2799M711J8223K742k1261l8073j4988J3695N976k85J1918R740
10685c692K4000J6513j0100k1713J4124r606k7964p470J3958L6260k4978q334
10673i002K4525o812j4052j0322O143k2289K8456J4750q280L72L7913P557k646
10660D6313l8709p090l7664j7764J0734K874K1110J2128M5471n766k5199j3824
10648g386K707J5031q375p278k0877J1120M969o944J4287n823O597j45J6350j763
10634A2470M1005M025j5915j9911k0109J0163L9880m52m3303k4144J2662M9299
10622D5670o674j3882l3402j1658K6398q029j8618j116J6158K9005O374K1329
$$ plain form
10610 51555 26033 11606 30023 -1169 -67754 -38504 1834 -19923 -10250 27689 40480 36395
10598 36395 32745 974 -43574 -15567 6972 43689 15178 12870 -7144 -25300 -39239 -27306
10586 -27306 -26499 -14129 -400 -11226 11236 12279 -11576 7696 -19971 -2723 -17211 -53953
10574 -53953 -52581 -36042 -28410 -18326 -31 15218 16995 7352 23434 53794 24412 4933
10562 4933 631 9087 32023 45151 34246 22846 34293 24111 46139 45384 77118 69400 74059
10549 74059 85220 78435 67907 97066 120811 120468 91967 97410 69032 44076 59829 107367
10537 107367 149502 104967 59356 37779 61412 95624 112369 113252 122032 107003 105172 90128
10525 90128 65995 75187 109200 99225 65550 32873 67285 76216 72357 105752 144831 135816 97566
$$ packed form
10610E1555k5522j4427J8417l1192o6585K9250M0338k1757R673L7939J2791m085
10598C6395l650l1771m4548K8007K2539L6717k8511k308k0014j8156j3939J1933
10586b7306Q07J2370J3729j0826K2462J043k3855J9272k7667J7248j4488l6742
10574e3953J372J6539P632J0084J8295J5249J777r643J6082L0360k9382j9479
10562D933m302Q456K2936J3128j0905j1400J1447j0182K2028p55L1734p718M659
10549G4059J1161o785j0528K9159K3745l43k8501N443k8378k4956J5753M7538
10537A07367M2135m4535m5611k1577K3633L4212J6745Q83Q780j5029j831j5044
10525I0128k4133R192L4013r975l3675l2677L4412Q931l859L3395L9079r015l8250
$$ plain form
10512 97566 96891 128192 109106 88709 129107 144045 103293 69420 57380 61889 78957 65648
10500 65648 55845 71673 90353 94469 78439 76238 68931 66194 83937 58421 59286 108554 131627
10487 131627 114646 115999 92964 110710 139789 141326 124721 84840 47417 21069 32301 28361
10475 28361 33981 54133 87355 59476 68882 66075 52324 96306 101319 67515 43065 42653 45740
10462 45740 59802 58476 51590 19170 7032 9313 25889 24043 34032 29125 58606 87248 104359
10449 104359 86417 48426 45096 7665 8715 14245 5252 -7765 -33771 -37967 -12206 11401
10437 11401 953 42195 49864 53151 89483 94906 86392 64015 36139 55471 49487 59807 77451
10424 77451 70825 36340 29061 31717 34258 50462 55928 78277 92014 69794 52031 80323 92332
$$ packed form
10512I7566o75L1301j9086k0397M0398J4938m0752l3873j2040M509J7068j3309
10500F5648r803J5828J8680M116j6030k201p307k737J7743k5516Q65M9268K3073
10487A31627j6981J353k3035J7746K9079J537j6605l9881l7423k6348J1232l940
10475B8361N620K0152L3222k7879R406k807j3751M3982N013l3804k4450m12L087
10462D5740J4062j326o886l2420j2138K281J6576j846R989m907K9481K8642J7111
10449A04359j7942l7991l330l7431J050N530q993j3017k6006m196K5761K3607
10437A1401j0448M1242P669L287L6332N423q514k2377k7876J9332n984J0320J7644
10424G7451o626l4485p279K656K541J6204N466K2349J3737k2220j7763K8292J2009
$$ plain form
10411 92332 109539 72210 29142 24781 5738 -22635 -12765 4686 -7569 -11515 17735 47941
10399 47941 41649 27777 39039 70709 65573 33669 56089 44190 27662 9874 6520 32556
10387 32556 24690 28522 62747 75842 75736 67854 41898 18162 -26381 -44132 -17768 -39486 -42226
10374 -42226 -20953 7928 25967 43776 24567 -16206 -20501 -9670 19314 35301 18997 17701
10362 17701 -8824 -16499 -13307 -7050 -15115 -4972 4839 18063 44136 20825 40070 38728 16451
10349 16451 15261 23042 -11183 -27530 -43785 -33972 -18971 -16005 -9596 -10772 -6239 2471 -28463
10336 -28463 -47183 -37286 -21709 13515 40190 11784 15656 26170 5288 -17686 -33028 -24658
10324 -24658 14758 16616 -15938 -737 8486 25881 33629 47923 39203 14975 5208 3647 11751
$$ packed form
10411I2332J7207l7329m3068m361j9043k8373R870J7451j2255l946K9250L0206
10399D7941o292j3872J1262L1670n136l1904K2420j1899j6528j7788l354K6036
10387C2556p866L832L4225J3095j06p882k5956k3736m4543j7751K6364k1718k740
10374d2226K1273K8881J8039J7809j9209m0773m295J0831K8984J5987j6304j296
10362A7701k6525p675L192O257q065J0143R811J3224K6073k3311J9245j342k2277
10349A6451j190P781l4225j6347j6255R813J5001K966O409j176M533Q710l0934
10336b8463j8720R897J5577L5224K6675k8406L872J0514k0882k2974j5342Q370
10324b4658L9416J858l2554J5201R223J7395P748J4294q720k4228r767j561Q104
$$ plain form
10311 11751 32607 32329 31093 26466 27957 25012 3889 11470 23353 31846 25811 31894 32696 14584
10297 14584 -21509 -34884 -23902 -16785 -20306 -7966 -5633 -13116 1950 -13327 -6171 -33124 -3047
10284 -3047 4524 15200 -28838 -61156 -65133 -15689 -2945 19076 30108 4465 -7270 1996
10272 1996 -8086 -13657 -16799 725 8465 27385 15855 21265 -9745 -5245 30270 28894 27660
10259 27660 5284 -15975 1484 12977 8470 3819 -7429 -47531 -41651 -33160 -28757 -21601 -2891
10246 -2891 -3518 18590 40846 2778 -25975 -4660 -23480 -45410 -46846 -21031 708 -1145 -9767
10233 -9767 -27048 -42451 -54978 -21321 16983 44356 36934 42806 29500 11555 16715 26668 29632
10220 29632 25955 -21590 -29343 -19120 -38923 -15413 18639 40207 61287 62112 30885 -9730
$$ packed form
10311A1751K0856k78j236m627J491k945k1123P581J1883Q493o035O083Q02j8112
10297A4584l6093j3375J0982P117l521J2340K333p483J5066j5277P156k6953L0077
10284c047P571J0676m4038l2318l977M9444J2744K2021J1032k5643j1735R266
10272A996j0082n571l142J7524P740J8920j1530N410l1010M500L5515j376j234
10259B7660k2376k1259J7459J1493m507m651j1248m0102N880Q491M403P156J8710
10246b891o27K2108K2256l8068k8753K1315j8820k1930j436K5815K1739j853q622
10233i767j7281j5403j2527L3657L8304K7373p422N872j3306j7945N160R953K964
10220B9632l677m7545p753J0223j9803K3510L4052K1568K1080Q25l1227m0615
$$ plain form
10208 -9730 -36494 -19687 -33480 -31237 -39680 -44862 -42449 -67980 -61756 -49650 -45864 -7329 521
10195 521 6999 -6588 -22354 -18552 -16634 -38303 -29771 -10621 -11926 -15192 19451 -813 -25550
10182 -25550 -17455 -137 -7458 -3286 17669 14711 16234 28837 24451 27063 23867 18923 -12636
10169 -12636 -41821 -61827 -34603 -20245 -7294 -4138 19549 48386 55368 37873 48921 54631
10157 54631 52355 39989 18673 -12965 -24416 -35523 -58392 -25030 -5415 -14830 -30556 -47369
10145 -47369 -38520 -20512 -5067 -26952 -14841 -12281 -34815 -32429 15947 60710 41093 4280
10133 4280 -4886 -25396 -33403 -12052 16313 10499 16795 8730 -6791 -13495 -5683 5147 8164
10120 8164 -347 -933 -3788 24875 24435 30944 52299 72521 39062 11305 -3931 -4237 4137 22361
$$ packed form
10208i730k6764J6807j3793K243q443n182K413k5531O224J2106L786L8535P850
10195E21O478j3587j5766L802J918k1669Q532J9150j305l266L4643k0264k4737
10182b5550Q095J7318p321M172K0955k958J523J2603m386K612l196m944l1559
10169a2636k9185k0006K7224J4358J2951L156K3687K8837O982j7495J1048N710
10157E4631k276j2366k1316l1638j1451j1107k2869L3362J9615r415j5726j6813
10145d7369Q849J8008J5445k1885J2111K560k2534K386M8376M4763j9617l6813
10133D280r166k0510q007K1351K8365n814O296q065j5521o704P812J0830L017
10120H164q511n86k855K8663m40O509K1355K0222l3459k7757j5236l06Q374J8224
$$ plain form
10106 22361 46425 62351 53785 32036 39579 54424 79172 68359 63465 30146 -31098 -32004 -21980
10093 -21980 -28429 -43864 -46873 -58334 -52316 -43491 -34088 -7253 11322 11690 33937 37850 52320
10080 52320 12632 2798 8460 26535 16530 9431 35128 39394 -4371 -24640 -14758 -22534 -49984
10067 -49984 -59952 -27544 -16662 -22111 -26127 -33584 -23524 -11137 -12220 -22867 -25243 4128 29764
10054 29764 9521 5910 7353 15646 27647 45708 27106 -21783 -20797 -29387 -29006 -38660 -26794
10041 -26794 -31853 -7792 -9114 -29606 -5234 16502 25719 -2034 -21033 8212 46310 39499
10029 39499 -10759 -37052 -30102 -9012 6005 10440 16448 13200 37069 26194 5730 -6030
10017 -6030 -6725 -7118 -22491 -34370 -41943 -34499 51 4214 -37581 -42121 -41755 -4437 6467 10824
$$ packed form
10106B2361K4064J5926q566k1749P543J4845K4748j0813m894l3319o1244r06J0024
10093b1980o449j5435l009j1461O018Q825R403K6835J8575L68K2247L913J4470
10080E2320l9688r834N662J8075j0005p099K5697M266m3765k0269R882p776k7450
10067d9984r968L2408J0882n449m016p457J0060J2387j083j0647k376K9371K5636
10054B9764k0243l611J443Q293J2001J8061j8602m8889R86q590L81r654J1866
10041b6794n059K4061j322k0492K4372K1736R217k7753j8999K9245L8098o811
10029C9499n0258k6293O950K1090J5017M435O008l248K3869j0875k0464j1760
10017f030o95l93j5373j1879p573P444L4550M163m1795m540L66L7318J0904M357
$$ plain form
10003 10824 57091 37918 -24248 -27071 -11640 27284 28299 15645 24971 49185 61339 67230
9991 67230 58688 43985 47917 64787 36449 11829 -11149 9959 17556 44687 60172 31250
9979 31250 -5223 -33574 -12869 -2869 -7522 7600 -2055 -34389 -10356 -12015 -28719 -28037 -15898
9966 -15898 3459 -1403 13095 -2041 -37164 -19091 4087 -6165 -15716 -18962 -15916 -5174 -4118
9953 -4118 -1535 -13977 -10996 -26430 -51505 -45862 -40883 -37912 -52889 -38285 -31615 -27864 -22194 -29391
9939 -29391 -45431 -35144 -46895 -21975 -34956 1542 22555 9669 19552 19286 9577 10634 -787
9926 -787 -18532 -6745 -23752 -26691 -19432 -54488 -66338 -24524 13899 19050 -21612 -35860 -18916
9913 -18916 -20609 -27231 -16599 -33085 -44860 -17996 4165 -7721 748 25477 23320 9645 50029
$$ packed form
10003A0824M6267j9173o2166k823J5431L8924J015j2654R326K4214J2154N891
9991F7230q542j4703L932J6870k8338k4620k2978K1108P597K7131J5485k8922
9979C1250l6473k8351K0705J0000m653J5122r655l2334K4033j659j6704O82J2139
9966a5898J9357m862J4498j5136l5123J8073K3178j0252r551l246L046J0742J056
9953d118K583j2442K981j5434k5075N643M979K971j4977J4604O670L751N670p197
9939b9391j6040J0287j1751K4920j2981L6498K1013j2886R883k66r709J057j1421
9926g87j7745J1787j7007k939P259l5056j1850M1814L8423N151m0662j4248J6944
9913a8916j693o622J0632j6486j1775K6864K2161j1886Q469K4729k157j3675M0384
$$ plain form
9900 50029 48735 34670 33109 24023 18046 35723 50112 61824 44419 36078 14939 -3039 96
9887 96 10094 20627 2483 1967 34164 14340 15634 36549 4970 -13848 -17502 20033 -7692
9874 -7692 -36265 -4113 3708 5187 -38259 -29747 -9171 -16951 4459 47231 28043 58043 71421
9861 71421 34849 21938 23780 2472 -7914 -8901 -3294 14582 32351 31818 17672 16023 25417
9848 25417 7627 10734 2689 -30815 -25663 509 16669 46990 48820 40546 30530 13307 3780
9835 3780 -29867 -28415 -16388 -10039 11973 46249 52901 38780 33683 -16932 -47272 -26697 -4479
9822 -4479 -7955 -30386 -15514 2304 31922 22605 -1892 40057 70474 74534 29836 -8317 -4426
9809 -4426 4435 -526 2686 24545 4773 767 22329 44647 20497 35190 61942 60237 67697
$$ packed form
9900E0029j294j4065j561r086n977J7677J4389J1712j7405q341k1139j7978L135
9887I6R998J0533j8144n16L2197j9824J294K0915l1579j8818l654L7535k7725
9874g692k8573L2152P821J479m3446Q512K0576p780K1410M2772j9188L0000J3378
9861G1421l6572j2911J842k1308j0386r87N607J7876J7769n33j4146j649R394
9848B5417j7790L107q045l3504N152K6172J6160L0321J830q274j0016j7223r527
9835C780l3647J452J2027O349K2012L4276O652j4121n097n0615l0340K0575K2218
9822d479l476k2431J4872J7818K9618r317k4497M1949L0417M060m4698l8153L891
9809d426Q861m961L212K1859j9772m006K1562K2318k4150J4693K6752j705P460
$$ plain form
9796 67697 33601 12641 18916 21156 39084 23628 18033 39303 35793 -5795 -6395 13269 18099
9783 18099 830 -7198 -24204 -16320 744 -463 -16020 8684 48960 14831 -7086 -9178 -21588
9770 -21588 -39646 -39920 -34634 -42307 -63298 -45131 -30725 -23856 -36768 -25800 -23849 -6656 33422
9757 33422 27652 54431 51707 34325 19252 12779 1650 11579 7016 7116 4671 -20559 -12769 -192
9743 -192 -9178 -5678 -2170 3896 -29800 -52984 -33303 -21206 -16508 2930 12019 25099 -447
9730 -447 -15236 33610 28555 25077 19022 6287 -13144 384 988 -3830 19534 18025 20633 7858
9716 7858 11410 12994 -3663 6601 14688 6517 -9046 16802 23619 -8190 -21683 -2576 10700
9703 10700 23873 7437 37141 8539 -29985 -25609 -11568 -4299 -9500 -33592 -32041 -29429 -19342
$$ packed form
9796F7697l4096k0960O275K240J7928j5456n595K1270l510m1588o00J9664M830
9783A8099j7269q028j7006P884J7064j207j5557K4704M0276l4129k1917k092j2410
9770b1588j8058k74N286p673k0991J8167J4406O869j2912J0968J951J7193M0078
9757C3422n770K6779k724j7382j5073o473j1129R929m563J00k445k5230P790J2577
9743a92q986L500L508O066l3696k3184J9681J2097M698J9438R089J3080k5546
9730d47j4789M8846n055l478o055j2735j9431J3528O04m818K3364j509K608j2775
9716G858L552J584j6657J0264Q087q171j5563K5848O817l1809j3493J9107J3276
9703A0700J3173j6436K9704k8602l8524M376J4041P269n201k4092J551K612J0087
$$ plain form
9690 -19342 -8061 -17322 -9445 -7984 -76 8358 5182 27239 23787 21094 12038 5653 -238 -9252
9676 -9252 -10253 -13 -3791 -18985 -17094 -1358 24205 14857 3889 -705 -34259 -22844 10928
9663 10928 33285 15135 -39395 -45486 -40673 -56088 -91573 -68881 -39865 -49007 -19776 -18655 -32490
9650 -32490 -26893 -13716 -894 10601 24649 3504 -15922 2026 28153 57751 39905 26136
9638 26136 21972 14585 38662 55804 15715 -7863 -10997 -23722 -25971 -27455 -21436 -20274 -38667
9625 -38667 -81883 -69322 -41770 -32332 10731 15108 153 -12705 -28339 -43204 -15294 11445
9613 11445 -221 -2049 -4847 14491 49664 44945 -9205 -4630 32043 41266 25308 34665 71455
9600 71455 59075 29928 48364 96713 71217 32915 30812 43757 24753 9898 -7886 -14112
$$ packed form
9690a9342J1281r261P877J461P908Q434l176K2057l452k693r056o385n891r014
9676i252j001J0240l778j5194J891J5736K5563r348j0968m594l3554J1415L3772
9663A0928K2357j8150n4530o091M813j5415l5485K2692K9016r142K9231J121j3835
9650c2490N597J3177J2822J1495J4048k1145j9426J7948K6127K9598j7846j3769
9638B6136m164p387K4077J7142m0089k3578l134j2725k249j484O019J162j8393
9625c8667m3216J2561K7552R438M3063M377j4955j2858j5634j4865K7910K6739
9613A1445j1666j828k798J9338L5173m719n4150M575L6673R223j5958R357L6790
9600G1455j2380k9147J8436M8349k5496l8302k103J2945j9004j4855j7784o226
$$ plain form
9588 -14112 -21537 -3836 24250 18360 -1982 -17219 -19147 -15335 -2872 27676 76962 93634 96256
9575 96256 30074 -34965 -55208 -65079 -43645 -10320 -6449 -6998 -915 4848 7550 -31056 -51116
9562 -51116 -8399 6645 20941 39831 72174 60667 66057 42594 29245 37201 50873 45382
9550 45382 51052 46769 51468 69560 54411 18395 27543 41902 -3386 -19667 -15019 5055 34832
9537 34832 61175 42432 20228 60188 80576 70505 29551 20333 44273 50425 68390 71769
9525 71769 86372 58388 35989 11201 -22592 -13766 23363 26735 13921 12139 26300 -7069
9513 -7069 20932 37394 14786 10233 1847 39186 48307 33854 11622 32966 33174 36208 -15831
9500 -15831 -45516 -37241 -57265 -67540 -42909 238 18275 32281 57810 71154 32939 14066
$$ packed form
9588a4112p425J7701K8086n890k0342j5237j928L812J2463L0548M9286J6672K622
9575I6256o6182o5039k0243r871K1434L3325L871n49O083N763K702l8606k0060
9562e1116M2717J5044J4296J8890L2343j1507N390k3463j3349P956J3672n491
9550D5382N670m283M699J8092j5149l6016R148J4359m5288j6281M648K0074K9777
9537C4832K6343j8743k2204L9960K0388j0071m0954r218K3940O152J7965L379
9525G1769J4603k7984k2399k4788l3793Q826L7129L372j2814j782J4161l3369
9513g069K8001J6462k2608m553q386L7339R121j4453k2232K1344K08L034n2039
9500a5831k9685Q275k0024j0275K4631M3147J8037J4006K5529J3344l8215j8873
$$ plain form
9488 14066 -39319 -24221 24813 71202 99190 121122 90929 36545 32994 68599 63218 47902
9476 47902 48502 54107 52173 29346 34592 100032 103664 80084 36320 35985 56287 41238 19523
9463 19523 42640 65805 45642 79010 71242 32495 20358 30698 33300 60433 26642 9319
9451 9319 14002 17419 18299 22671 -8212 -15734 5696 15816 26976 19926 9134 -3762 17000
9438 17000 44947 61201 26182 -22140 -8081 25261 44217 54764 49988 72283 73881 64199
9426 64199 37395 12781 17601 43200 45528 32967 30883 53016 49737 35312 44438 61746 71287
9413 71287 92964 94009 51814 -2828 -19088 30886 46727 11589 3557 26283 52354 61612
9401 61612 51455 47980 58533 23778 3195 44936 88821 129575 132633 106205 110402 103567 96629
$$ packed form
9488A4066n3385J5098M9034M6389K7988K1932l0193n4384l551L5605n381j5316
9476D7902O00N605j934k2827N246O5440L632k3580m3764l35K0302j5049k1715
9463A9523K3117K3165k0163L3368p768l8747j2137J0340K602K7133l3791j7323
9451I319M683L417Q80M372l0883p522K1430J0120J1160p050j0792j2896K0762
9438A7000K7947J6254l5019m8322J4059L3342J8956J0547m776K2295J598r682
9426F4199k6804k4614M820K5599K328j2561k084K2133l279j4425R126J7308R541
9413G1287K1677J045m2195n4642j6260M9974J5841l5138q032K2726K6071R258
9401F1612j0157l475J0553l4755k0583M1741M3885M0754L058k6428M197o835o938
$$ plain form
9388 96629 114359 117632 117053 108180 101358 116240 150455 170732 165884 132621 163067 224385 263365
9375 263365 267027 284423 346119 420457 506899 603847 711302 836540 975607 1119249 1261800
9364 1261800 1369368 1413178 1416606 1408929 1357352 1294987 1202016 1085503 955067 831528 714955
9353 714955 606206 518655 483280 434460 427509 369970 327893 288707 258105 254385 242828 214175
9341 214175 208398 218909 190786 176101 165888 146668 175045 207705 177803 153756 139937 175199
9329 175199 178390 161608 140106 133807 149239 155021 138217 128318 122770 140908 180182 182003 134264
9316 134264 98695 98084 104044 110802 122108 125351 72601 37310 37657 56932 105660 111721 76276
9303 76276 86769 100977 97288 92738 111074 114202 53357 53200 87868 70113 85906 112760 135783
$$ packed form
9388I6629J7730L273n79q873o822J4882L4215K0277m848l3263L0446O1318L8980
9375B63365L662J7396O1696P4338Q6442R6948J07455J25238J39067J43642J42551
9364A261800J07568M3810L428p677n1577o2365r2971j16513j30436j23539j16573
9353G14955j08749q7551l5375m8820o951n7539m2077l9186l0602l720j1557k8653
9341B14175n777J0511k8123j4685j0213j9220K8377L2660k9902k4047j3819L5262
9329A75199L191j6782k1502o299J5432N782j6804r899n548J8138L9274J821m7739
9316A34264l5569o11N960O758J1306L243n2750l5291L47J9275M8728O061l5445
9303G6276J0493J4208l689m550J8336L128o0845j57L4668j7755J5793K6854K3023
$$ plain form
9290 135783 134923 102126 91796 107549 111534 89224 97784 105175 77220 48186 60324 48986 51114
9277 51114 59893 86852 81670 91146 95871 69641 59801 84138 103088 108570 118646 123160 89013
9264 89013 46604 47779 89539 133506 115920 88579 79566 69856 75350 50488 33622 68752 80357
9251 80357 84376 100293 89898 72823 117794 129273 105584 85332 101014 160964 182517 154462
9239 154462 149917 170870 161805 145745 147372 119380 111971 136180 173735 176499 175957 197206 184731
9226 184731 195152 233639 271674 304574 345595 405325 472007 545647 603167 592139 547077 503393
9214 503393 476278 428062 387024 382127 370279 325637 305236 279656 275731 272993 303386 342431
9202 342431 335167 329981 317579 289384 232248 215639 219548 221007 208649 200523 199345 242245 280351
$$ packed form
9290A35783q60l2797j0330J5753L985k2310Q560P391k7955k9034J2138j1338K128
9277E1114Q779K6959n182R476M725k6230r840K4337J8950N482J0076M514l4147
9264H9013m2409J175M1760M3967j7586k7341r013r710N494k4862j6866L5130J1605
9251H0357M019J5917j0395j7075M4971J1479k3689k0252J5682N9950K1553k8055
9239A54462m545K0953r065j6060J627k7992p409K4209L7555K764n42K1249j2475
9226A84731J0421L8487L8035L2900M1021N9730O6682P3640N7520j1028m5062m3684
9214E03393k7115m8216m1038m897j1848m4642k0401k5580l925k738L0393L9045
9202C42431p264n186j2402k8195n7136j6609L909J459j2358q126j178M2900L8106
$$ plain form
9189 280351 268867 228050 223558 246715 284565 329740 320721 345290 382573 400904 434083 437217
9177 437217 426615 445669 444682 454356 467632 528528 559003 557863 550390 546500 579955 638552 715511
9164 715511 757244 805540 895998 962501 1015533 1082342 1185749 1338193 1519408 1732822 1973861
9153 1973861 2257898 2531673 2841132 3228105 3692893 4237990 4913026 5691013 6532658 7419747
9143 7419747 8206535 8742979 8961786 8864394 8383258 7677828 6954612 6215726 5486592 4840096
9133 4840096 4280606 3782229 3372675 3031024 2741002 2498601 2293349 2075604 1894527 1725580
9123 1725580 1615802 1537846 1456121 1404210 1374367 1344940 1322088 1285003 1258538 1210804 1191919
9112 1191919 1172058 1132089 1077367 1032715 1026279 1047346 1029104 992885 952459 984382 993969 1000608
$$ packed form
9189B80351j1484m0817m492K3157L7850M5175r019K4569L7283J8331L3179L134
9177D37217j0602J9054r87R674J3276O0896L0475j140p473l890L3455N8597P6959
9164G15511M1733M8296R0458O6503N3032O6809J03407J52444J81215K13414K41039
9153A973861K84037K73775L09459L86973M64788N45097O75036P77987Q41645Q87089
9143G419747P86788N36444K18807r7392m81136p05430p23216p38886p29134o46496
9133D840096n59490m98377m09554l41651k90022k42401k05252k17745j81077j68947
9123A725580j09778p7956q1725n1911k9843k9427k2852l7085k6465m7734j8885
9112A191919j9861l9969n4722m4652o436K1067j8242l6219m0426L1923R587O639
$$ plain form
9100 1000608 976037 971545 966178 960431 930783 915323 893186 886301 854172 819120 774626 768587
9088 768587 767511 724990 709559 715259 728519 728413 717528 702190 647896 610888 616303 641917 631972
9075 631972 600732 595007 597012 580322 553564 543002 542981 553564 592642 605482 619296 639435 659582
9062 659582 647004 657643 697300 743410 759788 766484 795200 848353 866398 872031 886365 890753
9050 890753 918292 928568 944934 967771 1008898 1051363 1083804 1135822 1174242 1234819 1262885 1262267
9038 1262267 1294053 1327055 1346312 1321775 1323885 1377919 1435448 1452937 1497682 1544722 1562700 1593595
9026 1593595 1658802 1732927 1799560 1848837 1921614 2044568 2084516 2089305 2132871 2191879 2176967
9015 2176967 2182812 2218174 2248725 2344777 2487262 2595738 2659277 2728359 2818378 2898909 3004989
$$ packed form
9100A000608k4571m492n367n747k9648j5460k2137o885l2129l5052m4494o039
9088G68587j076m2521j5431N700J3260j06j0885j5338n4294l7008N415K5614r945
9075F31972l1240n725K005j6690k6758j0562k1J0583L9078J2840J3814K0139K0147
9062F59582j2578J0639L9657M6110J6378O696K8716N3153J8045N633J4334M388
9050H90753K7539J0276J6366K2837M1127M2465L2441N2018L8420O0577K8066o18
9038A262267L1786L3002J9257k4537K110N4034N7529J7489M4745M7040J7978L0895
9026A593595O5207P4125O6633M9277P2777J22954L9948M789M3566N9008j4912
9015B176967N845L5362L0551R6052J42485J08476O3539O9082R0019Q0531J06080
$$ plain form
9004 3004989 3136789 3278930 3477132 3696577 3870792 4002110 4164039 4425236 4700641 4943957
8994 4943957 5174534 5468981 5857695 6313275 6841417 7460198 8189787 9020521 10009113 11147654
8984 11147654 12451873 14001186 15785748 17915111 20519632 23669673 27370489 31821273
8976 31821273 36986709 42892009 50018196 59042456 70654503 85471785 104607032 130778249
8968 130778249 169374405 228055445 310724937 397546103 434962627 402030756 334940607
8961 334940607 266608518 208175151 162438280 128978302 104992953 87584132 74711779
8954 74711779 64979366 57552713 51751461 47098651 43073127 39392757 36090115 33170978
8946 33170978 30648788 28492953 26737304 25290412 24094733 23082695 22263025 21545771
$$ packed form
9004C004989J31800J42141J98202K19445J74215J31318J61929K61197K75405K43316
8994D943957K30577K94447L88714M55580N28142O18781P29589Q30734R88592J138541
8984A1147654J304219J549313J784562K129363K604521L150041L700816M450784
8976C1821273N165436N905300P126187R024260J1612047J4817282J9135247K6171217
8968A30778249L8596156N8681040Q2669492Q6821166L7416524l2931871o7090149
8961C34940607o8332089n8433367m5736871l3459978k3985349j7408821j2872353
8954G4711779r732413p426653n801252m652810m025524l680370l302642k919137
8946C3170978k522190k155835j755649j446892j195679j012038q19670p17254
$$ plain form
8938 21545771 20935709 20411494 19922657 19523913 19216186 18997978 18851800 18863035 19001108 19233786
8928 19233786 19419333 19381158 19050965 18388654 17577314 16698264 15799487 14897810 14066761 13387023
8918 13387023 12755186 12196196 11639667 11034382 10406714 9791924 9245877 8714571 8216091
8909 8216091 7775520 7373723 7014500 6692913 6413184 6150454 5898028 5661320 5434070 5200772
8899 5200772 4982233 4753872 4535152 4328014 4165399 4002232 3827655 3644286 3495547 3381081
8889 3381081 3264462 3138705 3003074 2906106 2808770 2743486 2701012 2668147 2586498 2536539 2489590
8878 2489590 2422285 2382185 2327447 2303149 2363763 2421332 2515065 2679523 2886202 3153944 3508282
8867 3508282 4034631 4903583 6250333 8065234 9701452 9907359 8779689 7274229 5868325
$$ packed form
8938B1545771o10062n24215m88837l98744l07727k18208j46178J1235J38073K32678
8928A9233786J85547l8175l30193o62311q11340q79050q98777r01677q31049o79738
8918A3387023o31837n58990n56529o05285o27668o14790n46047n31306m98480
8909H216091m40571m01797l59223l21587k79729k62730k52426k36708k27250k33298
8899E200772k18539k28361k18720k07138j62615j63167j74577j83369j48739j14466
8889C381081j16619j25757j35631r6968r7336o5284m2474l2865q1649m9959m6949
8878B489590o7305m0100n4738k4298O0614N7569R3733J64458K06679K67742L54338
8867C508282N26349Q68952J346750J814901J636218K05907j127670j505460j405904
$$ plain form
8858 5868325 4711460 3825917 3206817 2779814 2430379 2180826 2013442 1838551 1718055
8849 1718055 1641463 1586622 1523130 1464819 1485148 1533512 1554965 1550749 1557688 1542730 1526870 1548482
8837 1548482 1559334 1542614 1503098 1418905 1324165 1189943 1102688 1065832 978461 905388 847637
8826 847637 810926 790355 760666 761355 740780 708753 672600 630096 607394 608071 564812 504079
8814 504079 500450 495633 486341 471107 482395 481402 477741 495351 511198 521648 514107 510909 519349
8801 519349 526740 535484 516097 482681 478331 495633 531664 559234 566444 546027 501107 516436
8789 516436 504633 487757 502435 530291 541900 552499 572221 548635 554908 537228 519982 490945
8777 490945 441667 397282 402407 395036 387451 404526 396308 427838 453420 449299 456271 450109 430833
$$ packed form
8858E868325j156865q85543o19100m27003l49435k49553j67384j74891j20496
8849A718055p6592n4841o3492n8311K0329M8364K1453m216O939j4958j5860K1612
8837A548482J0852j6720l9516q4193r4740j34222q7255l6856q7371p3073n7751
8826H47637l6711k0571k9689O89k0575l2027l6153m2504k2702O77m3259o0733
8814E04079l629m817r292j5234J1288r93l661J7610J5847J0450p541l198Q440
8801E19349P391Q744j9387l3416m350J7302L6031K7570P210k0417m4920J5329
8789E16436j1803j6876J4678K7856J1609J0599J9722k3586O273j7680j7246k9037
8777D90945m9278m4385N125p371p585J7075q218L1530K5582m121O972o162j9276
$$ plain form
8764 430833 437185 462957 496210 479624 427036 386246 362915 385241 401640 399268 374464 393720
8752 393720 387792 343530 313950 312915 326792 319226 320019 319870 325459 315430 298218 288293 306435
8739 306435 317242 329033 285366 265869 250668 244372 270793 279670 252699 225959 207504 182019
8727 182019 204139 200726 176583 196627 232820 262037 289684 281746 259031 237476 221597 242260
8715 242260 275251 274525 268909 260357 247784 238410 205797 186152 164116 164982 204784 229304 227137
8702 227137 248008 239766 210132 206964 215966 198067 168793 159450 168067 153687 124102 116325 111148
8689 111148 132581 125208 108430 103660 93898 75893 72177 76952 108288 128827 133185 134606 174758
8676 174758 166697 134134 141716 138369 121912 119446 94896 98048 104926 102075 108725 87523 46965
$$ packed form
8764D30833O352K5772L3253j6586n2588m0790k3331K2326J6399k372k4804J9256
8752C93720n928m4262k9580j035J3877p566P93j49N589j0029j7212r925J8142
8739C06435J0807J1791m3667j9497j5201o296K6421Q877k6971k6740j8455k5485
8727A82019K2120l413k4143K0044L6193K9217K7647p938k2715k1555j5879K0663
8715B42260L2991p26n616q552j2573r374l2613j9645k2036Q66L9802K4520k167
8702B27137K0871q242k9634l168R002j7899k9274r343Q617j4380k9585p777n177
8689A11148K1433p373j6778m770r762j8005l716M775L1336K0539M358J421M0152
8676A74758q061l2563P582l347j6457k466k4550L152O878k851O650k1202m0558
$$ plain form
8663 46965 30843 37640 56007 33319 41231 86117 126740 108270 93632 114646 132807 140696
8651 140696 105322 95390 115167 124574 133691 148194 140124 161390 148180 150400 141764 122781 153301
8638 153301 160354 135237 134934 146739 112265 110429 99455 73316 70625 118723 130057 131398 150479
8625 150479 190198 197240 198270 156848 163545 157494 179472 180845 147176 135572 122633 132225 175569
8612 175569 221148 208834 214288 220913 169217 130824 108126 93991 92773 96062 98768 97973 74160
8599 74160 99061 112964 122269 99181 94428 110835 93357 102844 96387 100161 130900 111612 92129
8586 92129 110892 111065 103799 79226 87272 130110 143212 182132 225539 234801 230421 248510 280011
8573 280011 287110 320717 378101 440108 505328 583550 669335 820905 956484 1101710 1200520
$$ packed form
8663D6965j6122O797J8367k2688P912M4886M0623j8470j4638K1014J8161P889
8651A40696l5374r932J9777R407R117J4503q070K1266j3210K220q636j8983L0520
8638A53301P053k5117l03J1805l4474j836j0974k6139k691M8098J1334J341J9081
8625A50479L9719P042J030m1422O697o051K1978J373l3669j1604j2939R592M3344
8612A75569M5579j2314N454O625n1696l8393k2698j4135j218L289K706p95k3813
8599G4160K4901J3903R305k3088m753J6407j7478R487o457L774L0739j9288j9483
8586I2129J8763J73p266k4573Q046M2838J3102L8920M3407R262m380J8089L1501
8573B80011P099L3607N7384O2007O5220P8222Q5785J51570J35579J45226R8810
$$ plain form
8562 1200520 1303220 1412016 1437211 1411818 1353186 1261482 1156822 1032837 907533 767088
8552 767088 656317 587440 521961 446792 396370 356258 324825 301464 273367 246533 209685
8541 209685 202475 234358 235203 212307 191958 143674 133655 156531 165826 185506 196358 204871 213039
8528 213039 179119 143589 133871 153824 159514 117368 96428 130354 145676 138845 139586 143658 149615
8515 149615 143007 148485 118393 102199 114376 90337 73992 77564 82846 81435 107729 106172 63182
8502 63182 31184 47290 70658 98811 95742 69536 97859 90761 66804 26828 40277 61509
8490 61509 74953 94579 67400 36431 52936 86118 89956 87877 78611 88634 80870 65297 85582
8477 85582 106478 97117 80323 72022 69671 74255 81543 71388 78353 103989 152710 160127 139771
$$ packed form
8562A200520J02700J08796K5195k5393n8632r1704j04660j23985j25304j40445
8552G67088j10771o8877o5479p5169n0422m0112l1433k3361k8097k6834l6848
8541B09685p210L1883Q45k2896k0349m8284j0019K2876R295J9680J0852Q513Q168
8528B13039l3920l5530r718J9953N690m2146k0940L3926J5322o831P41M072N957
8515A49615o608N478l0092j6194J2177k4039j6345L572N282j411K6294j557m2990
8502F3182l1998J6106K3368K8153l069k6206K8323p098k3957l9976J3449K1232
8490F1509J3444J9626k7179l0969J6505L3182L838k079r266J0023p764j5573K0285
8477H5582K0896r361j6794q301k351M584P288j0155O965K5636M8721P417k0356
$$ plain form
8464 139771 98163 87431 62011 47390 42430 18040 6497 20053 6023 1171 -4014 -20993
8452 -20993 -22042 13779 16149 12997 34980 38765 37940 22706 4760 11580 14016 -12408 -13815 -7042
8438 -7042 -6629 8226 2549 27280 36236 73337 54075 55396 50124 48554 39873 61680 86754 70589
8424 70589 72443 75714 66765 65888 65859 47819 33068 34192 10986 17967 21045 26085 7287 -1208
8410 -1208 435 1745 27236 28198 22742 46270 13581 -11452 -9540 18909 33002 44018 18353
8397 18353 -44855 -24549 19132 28946 -11983 -15291 -6760 18417 6968 18913 22449 14551 -8991
8384 -8991 -13333 -14595 -5880 -7018 -8101 11472 30544 27674 31021 26018 16175 19593 18060 49504
8370 49504 56704 41021 24373 18617 -12995 24194 53658 59513 47253 42720 24236 21642 6150
$$ packed form
8464A39771m1608j0732k5420j4621m960k4390j1543J3556j4030m852n185j6979
8452b0993j049L5821K370l152K1983L785q25j5234j7946O820K436k6424j407O773
8438g042M13J4855n677K4731Q956L7101j9262J321n272j570q681K1807K5074j6165
8424G0589J854L271q949q77k9j8040j4751J124k3206O981L078N040j8798q495
8410a208J643J310K5491R62n456K3528l2689k5033J912K8449J4093J1016k5665
8397A8353o3208K0306M3681R814m0929l308Q531K5177j1449J1945L536p898k3542
8384h991m342j262Q715j138j083J9573J9072k870L347n003r843L418j533L1444
8370D9504P200j5683j6648n756l1612L7189K9464N855j2260m533j8484k594j5492
$$ plain form
8357 6150 -6147 11767 -3951 -4855 42649 60687 40507 43840 23232 25751 26084 26073 19723 8635
8343 8635 1657 -19529 -23325 -19818 18240 39822 32705 9916 -16653 -4602 -32726 -16924 -22210
8330 -22210 -49245 -60998 -8722 17111 -16300 -23251 22991 53635 48144 41211 16410 20239 -2475
8317 -2475 -16728 -25071 -37137 -68532 -41434 10281 18574 2536 24811 13451 23263 31392 10997
8304 10997 36964 82132 41332 -13023 -14628 4762 18199 45286 43121 41503 17523 19194 39050
8291 39050 47962 41818 31223 18579 4379 -17923 -49222 -76522 -46510 -29911 4045 26047
8279 26047 31104 10762 -45852 -35079 3563 -2090 3083 -3846 -13626 -13182 -3954 3214 -13836 -28699
8265 -28699 -17180 7776 -14304 -9408 9618 -6501 -543 1796 129 14674 -8726 -14532 -2616
$$ packed form
8357F150j2297J7914j5718r04M7504J8038k0180L333k0608K519L33j1o350j1088
8343H635o978k1186l796L507L8058K1582p117k2789k6569J2051k8124J5802n286
8330b2210k7035j1753N2276K5833l3411o951M6242L0644n491o933k4801L829k2714
8317b475j4253q343j2066l1395K7098N1715Q293j6038K2275j1360R812Q129k0395
8304A0997K5967M5168m0800n4355j605J9390J3437K7087k165j618k3980J671J9856
8291C9050Q912o144j0595j2644j4200k2302l1299k7300L0012J6599L3956K2002
8279B6047N057k0342n6614J0773L8642n653N173o929r780M44R228P168j7050j4863
8265b8699J1519K4956k2080M896J9026j6119N958K339j667J4545k3400n806J1916
$$ plain form
8252 -2616 -3388 -4255 -15744 5396 18980 1437 -3059 -2802 -14602 -2470 -2031 15087 28002 48401
8238 48401 41900 39467 -321 -39259 -9432 -4032 14565 38632 23666 30938 15726 4128 26719
8225 26719 28937 40997 27249 -11674 -13369 -13690 -25320 14409 10485 -8045 -7053 -6623 6950 1617
8211 1617 -18245 -33773 -13758 -7722 -40978 -5968 -17808 -17268 -12971 -10360 -6549 -3535 -17378
8198 -17378 -28501 -31230 -13203 8232 46259 -21344 -58653 -19256 27612 43549 32058 12852
8186 12852 15936 -17821 -40943 12225 51930 25863 18937 -13821 -27629 -29341 -50597 -34622
8174 -34622 11477 22838 17681 20662 16231 -2595 43474 68021 40614 12314 24123 28782 15916
8161 15916 18861 6050 -4475 14440 -5814 -5692 2540 1952 7507 -30138 -25126 3123 23938
$$ packed form
8252b616p72q67j1489K1140J3584j7543m496K57j1800J2132M39J7118J2915K0399
8238D8401o501k433l9788l8938K9827N400J8597K4067j4966P272j5212j1598K2591
8225B6719K218J2060j3748l8923j695l21j1630L9729l924j8530R92M30J3573n333
8211A617j9862j5528K0015O036l3256L5010j1840N40M297K611L811L014j3843
8198a7378j1123k729J8027K1435L8027o7603l7309L9397M6868J5937j1491j9206
8186A2852L084l3757k3122N3168L9705k6067o926l2758j3808j712k1256J5975
8174c4622M6099J1361n157K981m431j8826M6069K4547k7407k8300J1809M659j2866
8161A5916K945j2811j0525J8915k0254J22Q232n88N555l7645N012K8249K0815
$$ plain form
8148 23938 528 -6172 1797 14470 24438 15693 -4812 -973 14596 -6134 -18130 4791 -217
8135 -217 -30540 -13227 -12333 -23436 -14745 -6912 -17027 -25466 75 5849 -7698 -2928 -22157 -58140
8121 -58140 -55505 -16228 -1617 -6542 27531 29226 40599 42263 36641 23471 3255 -9879 -9835
8108 -9835 -11923 10258 15031 23302 1063 -10536 167 4533 4388 25695 39981 44217 11350
8095 11350 -13945 -8786 -21429 -21082 240 -599 -695 -5625 -6973 -4515 20267 3868 -10152 24482
8081 24482 69022 69080 33801 40053 43841 36715 27819 -15995 -30674 -20047 -4640 -25839 -23432
8068 -23432 -39124 -38258 -4641 15581 21075 5737 3892 -13597 -42466 -46314 -28799 -20581 26743
8055 26743 20593 -23494 -20454 -30326 -32590 3358 36758 42609 33620 -12655 -28699 -24672 -20393
$$ packed form
8148B3938k3410o700P969J2673R968q745k0505L839J5569k0730j1996K2921n008
8135b17l0323J7313Q94j1103Q691P833j0115q439K5541N774j3547M770j9229l5983
8121e8140K635L9277J4611m925L4073J695J1373J664n622j3170k0216j3134M4
8108i835k088K2181M773Q271k2239j1599J0703M366j45K1307J4286M236l2867
8095A1350k5295N159j2643L47K1322q39r6m930j348K458K4782j6399j4020L4634
8081B4482M4540N8l5279O252L788p126q896m3814j4679J0627J5407k1199K407
8068b3432j5692Q66L3617K0222N494j5338j845j7489k8869l848J7515Q218M7324
8055B6743o150m4087L040r872k264L5948L3400N851q989m6275j6044M027M279
$$ plain form
8042 -20393 -4023 -40782 -62405 -68154 -57477 -51836 -20212 17389 27063 44890 30089 25463 9271
8029 9271 10198 1989 -12762 30502 21269 -23792 -26385 -33660 -36103 -42029 1993 30557 22143 40706
8015 40706 30878 58704 38328 2573 17762 26515 38157 33489 4773 19626 32190 9504
8003 9504 4531 -5003 18105 9394 8844 6639 -12825 1195 -16333 -33780 -25557 -7752 -9011 -13249
7989 -13249 -13826 -22225 -47352 -64893 -46610 -65878 -76135 -74344 -15045 -8729 -45647 -9003 19658
7976 19658 16937 -321 17656 37537 10745 -2162 10343 36229 72973 77021 49521 19779
7964 19779 37614 51708 36822 32923 25113 27854 24312 7402 15981 36405 51187 54673 42039
7951 42039 46503 27843 28904 70449 94409 74465 34635 12752 51380 69201 38551 8215
$$ packed form
8042b0393J6370l6759k1623n749J0677N641L1624L7601R674J7827j4801m626j6192
8029I271R27q209j4751M3264r233m5061k593p275k443n926M4022K8564q414J8563
8015D0706r828K7826k0376l5755J5189Q753J1642m668k8716J4853J2564k2686
8003I504m973r534K3108q711n50k205j9464J4020j7528j7447Q223J7805j259m238
7989a3249n77q399k5127j7541J8283j9268j0257J791N9299O316l6918L6644K8661
7976A9658k721j7258J7977J9881k6792j2907J2505K5886L6744M048k7500k9742
7964A9779J7835J4094j4886l899p810K741l542j6910Q579K0424J4782L486j2634
7951D2039M464j8660J061M1545K3960j9944l9830k1883L8628J7821l0650l0336
$$ plain form
7939 8215 -27255 -52668 -54191 -38311 -21774 -3698 5605 22398 59691 51496 -329 10443 21528
7926 21528 -14809 -40876 -58997 -30952 -17331 -8718 30324 13147 10562 -2359 -25745 -15858
7914 -15858 22333 30656 15465 27855 31999 36049 26815 -21045 -26568 -43021 -40566 -35065 -13328
7901 -13328 6127 6708 5886 -3083 15397 39684 51661 30926 6989 -26515 33809 46298 15292
7888 15292 -1402 18115 18904 13646 14474 22667 3985 -22488 -16425 -37978 -28568 -24255 -18071 2942
7874 2942 36966 53083 56451 37090 7860 -240 -21744 -25697 -11331 -11596 -8565 -15688 -6688 1350
7860 1350 11157 8276 -12169 -1980 -2247 20205 23248 7905 4740 -1094 16311 21992 -7102 -34817
7846 -34817 -63918 -71075 -77403 -43670 -32258 5650 -16080 -23941 -3782 -2944 40898 37255 -9579
$$ packed form
7939H215l5470k5413j523J5880J6537J8076R303J6793L7293q195n1825J0772J1085
7926B1528l6337k6067j8121K8045J3621Q613L9042j7177k585j2921k3386R887
7914a5858L8191Q323j5191J2390M144M050r234m7860n523j6453K455N501K1737
7901a3328J9455N81q22q969J8480K4287J1977k0735k3937l3504O0324J2489l1006
7888A5292j6694J9517P89n258Q28Q193j8682k6473O063k1553R410M313O184K1013
7874B942L4024J6117L368j9361k9230q100k1504l953J4366k65L031p123R000Q038
7860A350R807k881k0445J0189k67K2452L043j5343l165n834J7405N681k9094k7715
7846c4817k9101p157o328L3733J1412L7908k1730p861K0159Q38M3842l643m6834
$$ plain form
7833 -9579 -19415 -47666 -34308 -160 -7750 -31472 -33600 9333 8899 13861 14340 2015 5028 -4142
7819 -4142 6107 -20162 -55066 -64211 -32262 -17898 -9747 -13830 -30240 -54386 -57914 -46726 -22224
7806 -22224 -27732 -25968 7072 33665 61190 67024 35587 45670 38694 32524 18942 25678 41067
7793 41067 34606 7125 -8550 -22957 -25508 -37327 -9091 28895 30301 18583 17892 6493 75
7780 75 12525 2413 11506 29404 28159 10463 25145 24509 1307 -26133 -11430 17383 22922
7767 22922 18105 7975 40257 69721 60009 6152 -16630 -1862 16706 1843 9835 -14911
7755 -14911 -41503 -29908 13702 3126 17338 9413 -4544 -10051 15539 4736 -24292 -22514
7743 -22514 -26263 -17931 -7968 10534 558 1051 22370 -7019 2440 17906 36778 25617 -11615
$$ packed form
7833i579r836k8251J3358L4148p590k3722k128M2933m34M962M79j2325L013r170
7819d142J0249k6269l4904r145L1949J4364Q151m083j6410k4146l528J1188K4502
7806b2224n508J764L3040K6593K7525N834l1437J0083o976o170j3582O736J5389
7793D1067o461k7481j5675j4407k551j1819K8236L7986J406j1718o91j1399o418
7780G5J2450j0112R093J7898j245j7696J4682o36k3202k7440J4703K8813N539
7767B2922m817j0130L2282K9464r712n3857k2782J4768J8568j4863P992k4746
7755a4911k6592J1595M3610j0576J4212p925j3957n507K5590j0803k9028J778
7743b2514l749Q332R963J8502r976M93K1319k9389R459J5466J8872j1161l7232
$$ plain form
7730 -11615 6632 10998 -13622 -19584 -26267 -16603 -13791 17582 17788 -17834 -16231 -37162 -28390 -17431
7716 -17431 -27924 -713 19563 6825 -5248 -6007 5060 -18585 -19274 -1417 865 -1844 -20613
7703 -20613 -44653 -27436 7490 21498 61959 57499 38289 16572 18611 42211 97548 108374
7691 108374 49707 12244 -10797 -10878 -25946 -25164 -3564 14570 -3613 -34198 -33243 -11485 -100
7678 -100 -27097 -59620 -62957 -26839 24770 49692 32077 -1582 -7313 17333 11075 -3090 4203
7665 4203 44788 38133 28642 31727 40649 11051 -14664 13101 46090 57667 33571 26582 24960
7652 24960 19306 15637 8138 19005 19186 8941 22276 21908 -1700 -22095 15052 33765 32855 42976
7638 42976 41789 42385 14880 -13818 -18593 -30665 -41446 -23285 -34670 -23696 -6750 -44266 -67909
$$ packed form
7730a1615J8247M366k4620n962o683R664K812L1373K06l5622J603k0931Q772J0959
7716a7431j0493K7211K0276j2738j2073p59J1067k3645o89J7857K282k709j8769
7703b0613k4040J7217L4926J4008M0461m460j9210k1717K039K3600N5337J0826
7691A08374n8667l7463k3041q1j5068P82K1600J8134j8183l0585R55K1758J1385
7678a00k6997l2523l337L6118N1609K4922j7615l3659n731K4646o258j4165P293
7665D203M0585o655r491L085Q922k9598k5715K7765L2989J1577k4096o989j622
7652B4960n654l669p499J0867J81j0245J3335l68k3608k0395L7147J8713r10J0121
7638D2976j187N96k7505k8698m775j2072j0781J8161j1385J0974J6946l7516k3643
$$ plain form
7625 -67909 -71206 -45915 -39022 -17006 1941 -34299 -48213 -29398 9457 21225 13888 32840
7613 32840 2584 -28696 7454 28079 37950 20620 -10321 1105 16477 -1641 -5296 1131
7601 1131 -35727 -54401 -61759 -30584 -14793 13434 7807 12185 -26372 -46045 -51061 -34749 -57255
7588 -57255 -75614 -72363 -76747 -40651 4598 17716 -9980 -306 22675 15421 262 28252 20259
7575 20259 11005 -7706 -17721 -24454 -22111 -23536 -272 13663 -13354 -50105 -70672 -67295 -19495
7562 -19495 -29 29645 12935 -21926 447 25788 -50321 -79433 -24052 -7917 8930 21646
7550 21646 40907 51867 60479 33957 31228 29384 35646 15205 31180 54867 26871 5305 2186
7537 2186 -2361 160 1545 8884 9911 612 -22301 -19852 3585 -4182 -7329 -28907 -36366 -4853
$$ packed form
7625f7909l297K5291O893K2016J8947l6240j3914J8815L8855J1768p337J8952
7613C2840l0256l1280L6150K0625R871j7330l0941J1426J5372j8118l655O427
7601A131l6858j8674p358L1175J5791K8227n627M378l8557j9673n016J6312k2506
7588e7255j8359L251m384L6096M5249J3118k7696R674K2981p254j5159K7990p993
7575B0259r254j8711j0015o733K343j425K3264J3935k7017l6751k0567L377M7800
7562a9495J9466K9674j6710l4861K2373K5341p6109k9112N5381J6135J6847J2716
7550B1646J9261J0960Q612k6522k729j844O262k0441J5975K3687k7996k1566l119
7537B186m547K521J385P339J027r299k2913K449K3437p767l147k1578p459L1513
$$ plain form
7523 -4853 8582 21044 -477 -3908 12259 8733 2893 1717 22840 11340 -19850 -28876 -20069
7510 -20069 -12695 -10500 -15448 -23135 2553 5619 -3955 98 22730 39409 42831 10434 -1495
7497 -1495 10615 116 10063 39281 47821 41921 16395 -30346 -72318 -69320 -22878 -8567 -22353
7484 -22353 -35871 -44939 -4431 21345 23063 24897 35046 23754 19717 37418 48393 65460 51792
7471 51792 25853 35210 42948 37949 23832 -11506 -15641 -20439 -10078 -27335 -49399 -34399 -17878
7458 -17878 -6086 25536 34656 30319 25524 -6388 -5241 -4200 24273 46982 41918 36984 46077
7445 46077 45620 18121 9698 1679 -1048 6725 2786 5823 -4444 3801 -7807 -7439 6824 12981
7431 12981 -3362 -6801 -15912 5935 -1317 23969 44598 44818 27245 11776 42043 68537 33410
$$ packed form
7523d853J3435J2462k1521l431J6167l526n840j176K1123j1500l1190r026Q807
7510b0069P374K195m948p687K5688L066r574M053K2632J6679L422l2397j1929
7497a495J2110j0499R947K9218Q540n900k5526m6741m1972K998M6442J4311j3786
7484b2353j3518r068M0508K5776J718J834J0149j1292m037J7701J0975J7067j3668
7471E1792k5939R357P738m999j4117l5338m135m798J0361j7257k2064J5000J6521
7458a7878J1792L1622R120m337m795l1912J147J041K8473K2709n064m934R093
7445D6077m57k7499q423q019k727P773l939L037j0267Q245j1608L68J4263O157
7431A2981j6343l439r111K1847p252K5286K0629K20j7573j5469L0267K6494l5127
$$ plain form
7418 33410 -27189 -37794 -55950 -38337 16647 7479 3283 -3682 11476 -16504 1395 13769
7406 13769 -11718 -14575 -15240 -3639 10397 26926 19746 5951 402 -21318 -51680 -68425 -57169
7393 -57169 -24705 14375 18489 -11414 -33413 -41626 -60148 -36240 11181 12476 -26689 -25467 -22679
7380 -22679 -12904 -9829 -8082 -16369 -38430 -42973 -21915 -6423 -3718 24213 18919 13017 -15220
7367 -15220 -7550 25311 3129 -17669 -10025 -13434 -9588 -20779 3812 13958 31847 42104 28511
7354 28511 16432 -4811 -7320 131 -7394 -23769 -55033 -70588 -71230 -58030 -84364 -78645 -52360
7341 -52360 -32655 -14943 -35875 -37615 -34954 -17594 13482 9342 29731 62737 40107 24283
7329 24283 63363 74089 77178 88349 90286 40442 33742 30966 36861 41694 38390 49208 37600
$$ packed form
7418C3410o0599j0605j8156J7613N4984r168m196o965J5158k7980J7899J2374
7406A3769k5487k857o65J1601J4036J6529p180j3795n549k1720l0362j6745J1256
7393e7169L2464L9080M114k9903k1999q213j8522K3908M7421J295l9165J222K788
7380b2679R775L075J747q287k2061m543K1058J5492K705K7931n294n902k8237
7367a5220P670L2861k2182k0798P644l409L846j1191K4591J0146J7889J0257j3593
7354B8511j2079k1243k509P451p525j6375l1264j5555o42J3200k6334N719K6285
7341e2360J9705J7712k0932j740K661J7360L1076m140K0389L3006k2630j5824
7329B4283L9080J0726L089J1171J937m9844o700k776N895M833l304J0818j1608
$$ plain form
7316 37600 30251 26681 40839 47022 24278 3257 -2309 -20095 2018 44737 22206 2293 26593
7303 26593 27449 13880 33426 56008 73831 72886 59334 67577 7244 -30890 -35161 -12963 -39009
7290 -39009 -69923 -14352 24836 54907 53422 39497 6126 -23506 -3011 7844 -20889 -6421
7278 -6421 21259 1198 -1583 -25799 -55073 -39903 -31438 -11054 -47883 -58134 -30879 -33148 -13154
7265 -13154 21350 3329 -15405 -14258 -10160 7499 40287 62524 46491 24456 3403 -3899
7253 -3899 -18357 -26240 -46229 -28311 -16299 -10942 -16387 1929 39261 16214 -6471 -38253 -54721
7240 -54721 -29425 -2967 -5372 -28724 1392 31700 7741 -5388 -14136 -15365 -26415 -39536
7228 -39536 -45506 -77546 -68307 -40153 -68289 -60609 -39869 -36918 -24444 -184 -20155 -42708 -22128
$$ packed form
7316C7600p349l570J4158O183k2744k1021n566j7786K2113M2719k2531j9913K4300
7303B6593Q56j3569J9546K2582J7823r45j3552Q243o0333l8134m271K2198k6046
7290c9009l0914N5571L9188L0071j485j3925l3371k9632K0495J0855k8733J4468
7278f421K7680k0061k781k4216k9274J5170Q465K0384l6829j0251K7255k269J9994
7265a3154L4504j8021j8734J147M098J7659L2788K2237j6033k2035k1053p302
7253c899j4458p883j9989J7918J2012N357n445J8316L7332k3047k2685l1782j6468
7240e4721K5296K6458k405k3352L0116L0308k3959j3129q748j229j1050j3121
7228c9536n970l2040R239K8154k8136P680K0740K951J2474K4260j9971k2553K0580
$$ plain form
7215 -22128 -39441 -71069 -48079 -11946 13872 15142 6617 4624 16733 28601 26898 27606 -26495
7202 -26495 -45668 2664 17655 11641 28584 59195 59777 24117 3938 -22550 -50708 -47259 -52240
7189 -52240 -43963 -41714 -9775 20685 25978 6288 13044 7357 6294 27694 28375 26436 21381 27814
7175 27814 2953 15821 21672 -3627 27626 15030 -14390 3979 -4836 3653 -1976 11675 43916
7162 43916 32030 15073 12824 8459 -1435 10715 23310 32461 37646 -7509 -13750 -5436 -12004
7149 -12004 -36745 -38417 -55286 -59299 -45245 -39270 -35661 -28463 -27548 -24994 -10723 -12254 -2434 20362
7135 20362 20132 -13684 -19834 872 13006 -1754 -42913 -72569 -57185 -13808 -7408 -31877 -20375
7122 -20375 -11128 9886 752 -20660 -25999 -9514 3671 9475 -36124 -39717 -39980 -53904 -67899
$$ packed form
7215b2128j7313l1628K2990L6133K5818J270q525j993J2109J1868j703P08n4101
7202b6495j9173M8332J4991o014J6943L0611N82l5660k0179k6488k8158L449m981
7189e2240Q277K249L1939L0460N293j9690O756n687j063K1400O81j939n055O433
7175B7814k4861J2868N851k5299L1253j2596k9420J8369q815Q489n629J3651L2241
7162D3916j1886j6957k249m365r894J2150J2595R151N185m5155o241Q314o568
7149a2004k4741j672j6869m013J4054N975L609P198R15K554J4271j531R820K2796
7135B0362k30l3816o150K0706J2134j4760m1159k9656J5384M3377O400k4469J1502
7122b0375R247K1014r134k1412n339J6485J3185N804m5599l593k63j3924j3995
$$ plain form
7109 -67899 -43224 -9545 -23600 -38228 -15197 -22121 -23431 -37310 -49364 -37909 -46544 -11715
7097 -11715 19705 3346 -26492 -34121 -38484 -37336 -21106 -28839 -29781 -15954 -18130 -4102 -10521
7084 -10521 -7961 -25783 -55481 -50759 -23459 6702 13978 8125 3271 10845 46610 69477 46397
7071 46397 23568 16774 11662 37701 21880 -5716 -35059 -29118 -15864 2285 17362 -13899
7059 -13899 -17328 1249 11612 19454 24575 29300 9839 -16511 10394 32865 28040 9107 -1290
7046 -1290 23533 26486 -9560 -21216 8041 8969 -37262 -91674 -77022 -68668 -29464 9001 18915
7033 18915 26643 32782 31044 -13377 -22906 17637 33634 30336 65919 95003 89096 64623 14454
7020 14454 -11411 6816 30031 26256 18611 -4053 -19285 -18548 -17966 -26052 -42460 -29490 -9413
$$ packed form
7109f7899K4675L3679j4055j4628K3031o924j310j3879j2054J1455q635L4829
7097a1715L1420j6359k9838p629m363J148J6230p733r42J3827k176J4028o419
7084a0521K560j7822k9698M722K7300L0161P276n853m854P574L5765K2867k3080
7071D6397k2829o794n112K6039j5821k7596k9343N941J3254J8149J5077l1261
7059a3899l429J8577J0363P842N121M725j9461k6350K6905K2471m825j8933j0397
7046a290K4823K953l6046j1656K9257R28m6231n4412J4652Q354L9204L8465R914
7033A8915P728O139j738m4421r529M0543J5997l298L5583K9084n907k4473n0169
7020A4454k5865J8227K3215l775p645k2664j5232P37N82q086j6408J2970K0077
$$ plain form
7007 -9413 -7848 -7265 -16692 -14407 -13868 -26363 -25730 16731 30209 32732 54819 65296 57164 2337
6993 2337 -6534 -15995 -23279 -12853 9365 -1684 -53503 -64936 -61545 -29759 -1762 22325 9384
6980 9384 3511 -14595 -17297 -15697 -2488 7795 197 -8979 -7004 16970 -9534 -32201 -9041
6967 -9041 12296 3876 16264 -6625 -19729 -33170 -23619 -29656 -25118 -3091 25801 17256 29100
6954 29100 50121 19476 712 -22200 -34027 -26706 -18527 -21790 -26986 -6355 -2919 -39735 -67308
6941 -67308 -74343 -49989 -27954 -9104 -8017 -42850 -46579 -13538 -43996 -32036 2906 19344
6929 19344 14981 19633 43056 34423 3317 -2056 -5552 -17026 -46642 -59558 -65208 -47666 -11204
6916 -11204 -9562 -51533 -51029 -44203 -9805 -23786 -38151 4840 37166 22407 -14689 -57998 -27318
$$ packed form
7007i413J565N83r427K285N39j2495O33M2461J3478K523K2087J0477q132n4827
6993B337q871r461p284J0426K2218j1049n1819j1433L391L1786K7997K4087j2941
6980I384n873j8106k702J600J3209J0283p598r176J975K3974k6504k2667K3160
6967i041K1337q420J2388k2889j3104j3441R551o037M538K2027K8892q545J1844
6954B9100K1021l0645j8764k2912j1827P321Q179l263n196K0631L436l6816k7573
6941f7308p035K4354K2035J8850J087l4833l729L3041l0458J1960L4942J6438
6929A9344m363M652K3423q633l1106n373l496j1474k9616j2916n650J7542L6462
6916a1204J642m1971N04O826L4398j3981j4365M2991L2326j4759l7096m3309L0680
$$ plain form
6903 -27318 -11999 -10897 -18770 -6738 -8977 -39234 -54306 -19372 28114 12986 -32861 -60995
6891 -60995 -42271 -21548 -27446 -4200 14769 4486 -21757 -23823 -2516 -30288 -30241 9685 -8705
6878 -8705 -12836 -9744 -7209 -23604 12630 9968 -3611 -35709 -47643 -41580 -50779 -34698 -17914
6865 -17914 9950 24457 39689 37989 13129 -4646 -949 7559 606 987 -6479 1218 -9455
6852 -9455 -26854 -30753 -20379 -21095 -31188 -53307 -47747 -15186 -2842 -5240 46047 58787 14278
6839 14278 -4050 6110 21794 38762 -528 10065 3815 -4397 2645 -13355 -761 9807
6827 9807 6423 -25689 -59536 -32054 -24570 -18062 -9937 -9926 -35684 -28298 -6904 19840 21233 -49150
6813 -49150 -72910 -51635 -42270 -7832 8392 -4037 -17255 -7849 -28100 -8974 11164 16098
$$ packed form
6903b7318J5319J102p873J2032k239l0257j5072L4934M7486j5128m5847k8134
6891f0995J8724K0723n898K3246J8969j0283k6243k066K1307k7772M7L9926j8390
6878h705m131L092K535j6395L6234k662j3579l2098j1934O063r199J6081J6784
6865a7914K7864J4507J5232j700k4860j7775L697Q508o953L81p466P697j0673
6852i455j7399l899J0374p16j0093k2119N560L2561J2344k398N1287J2740m4509
6839A4278j8328J0160J5684J6968l9290J0593o250q212P042j6000J2594J0568
6827I807l384l2112l3847K7482P484O508Q125J1k5758P386K1394K6744J393p0383
6813d9150k3760K1275R365L4438J6224j2429j3218R406k0251J9126K0138M934
$$ plain form
6801 16098 20527 16152 -22421 -32039 -14011 -36439 -15490 13575 18221 -4187 -4274 -9358 -21123
6788 -21123 -41414 -15938 -9919 -34700 -4436 1387 26522 54554 42374 20379 28209 34918 1770
6775 1770 -27819 -65081 -58053 -33143 -30464 -20109 -10989 -10031 -22705 -29366 -48822 -34752 -1702
6762 -1702 -5800 575 -3823 -10410 -23712 -30100 -66069 -25673 -25617 2366 5551 20201 27254 -4692
6748 -4692 -28204 -37987 -21923 18263 30685 66042 69642 50059 50087 23023 -30953 -32272 3962
6735 3962 28712 5021 21173 37618 12659 13886 -3361 3751 -8005 -16064 -26989 -48866 -44961
6722 -44961 -28754 33260 32946 29217 15718 -123 11277 38218 33102 14730 1547 20560 10122
6709 10122 -16491 -22723 -23514 -47022 -37500 -9064 -10099 -40657 -29209 15515 -13724 -30045 -17801
$$ packed form
6801A6098M429m375l8573r618J8028k2428K0949K9065M646k2408q7n084j1765
6788b1123k0291K5476O019k4781L0264N823K5135K8032j2180k1995P830O709l3148
6775A770k9589l7262P028K4910K679J0355R120R58j2674o661j9456J4070L3050
6762a702m098O375m398o587j3302o388l5969M0396N6K7983L185J4650P053l1946
6748d692k3512r783J6064M0186J2422L5357L600j9583K8k7064n3976j319L6234
6735C962K4750k3691J6152J6445k4959J227j7247P112j1756q059j0925k1877L905
6722d4961J6207O2014l14l729j3499j5841J1400K6941n116j8372j3183J9013j0438
6709A0122k6613o232p91k3508R522K8436j035l0558J1448M4724k9239j6321J2244
$$ plain form
6696 -17801 -32171 -33438 -40633 -50501 -24175 -18141 -11288 8523 47132 48320 -11325 -33223 -31085
6683 -31085 -44547 -31877 -24205 -24643 -29013 -66041 -36635 25983 34120 24435 10592 -10109 -37969
6670 -37969 -51164 -42706 -11026 -14133 -18325 -3360 7712 6980 8227 -6374 12765 6173 3067
6657 3067 31327 34552 19167 -15732 -29975 -41474 5370 14425 10027 -4683 3008 10412 10878
6644 10878 11120 2521 -847 5538 14418 5443 18634 16120 -5794 -10933 -19479 -1364 6617 -17412
6630 -17412 -10551 24599 52661 78774 105068 35395 -11830 21095 47899 9034 2855 14773
6618 14773 -12944 20414 30319 -10559 -56749 -81887 -60944 -48854 -45050 -51562 -47155 -36561 -27712
6605 -27712 8901 15660 9191 -4736 7501 22024 26901 26392 15840 33734 28807 -17571 -43746
$$ packed form
6696a7801j4370j267p195r868K6326O034O853J9811L8609J188n9645k1898K138
6683c1085j3462J2670P672m38m370l7028K9406O2618Q137r685j3843k0701k7860
6670c7969j3195Q458L1680l107m192J4965J1072p32J247j4601J9139o592l106
6657C067K8260L225j5385l4899j4243j1499M6844R055m398j4710P691P404M66
6644A0878K42q599l368O385Q880q975J3191k514k1914n139q546J8115P981k4029
6630a7412O861L5150K8062K6113K6294o9673m7225L2925K6804l8865o179J1918
6618A4773k7717L3358R905m0878m6190k5138K0943J2090L804o512M407J0594Q849
6605b7712L6613O759o469j3927J2237J4523M877n09j0552J7894m927m6378k6175
$$ plain form
6592 -43746 -46906 -49644 -56332 -34175 -53013 -73203 -48631 -34497 -6036 -5385 -49573 -53730 -12090
6579 -12090 -6526 -22214 -25752 -41241 -47620 -33335 -21872 -6723 -14169 -24559 -30460 -22525 -766
6566 -766 -15581 -32611 -6282 -1254 -11517 -30984 -34620 -5558 -8513 15859 3168 17527 33273
6553 33273 12250 -15349 -11396 -23682 -49977 -38999 -53196 -53569 -59425 -46506 -17870 11430 -10137
6540 -10137 -26099 -14843 -11422 -30029 -59711 -35493 2974 -11880 -38690 -13365 4798 -10953
6528 -10953 15003 10487 -21768 -41636 -34620 -35252 -21629 29521 34768 9574 -17105 -21263 -37585
6515 -37585 -45526 -21707 -21697 -3157 52615 33882 -10416 -33597 -1152 41669 35558 -3208 -36808
6502 -36808 2890 31778 27814 9077 6179 6127 10902 32570 40270 34997 11189 7718 20123 7005
$$ packed form
6592d3746l160k738o688K2157j8838k0190K4572J4134K8461O51m4188m157M1640
6579a2090N564j5688l538j5489o379J4285J1463J5149p446j0390n901P935K1759
6566g66j4815j7030K6329N028j0263j9467l636K9062k955K4372j2691J4359J5746
6553C3273k1023k7599L953j2286k6295J0978j4197l73n856J2919K8636K9300k1567
6540a0137j5962J1256L421j8607k9682K4218L8467j4854k6810K5325J8163j5751
6528a0953K5956m516l2255j9868P016o32J3623N1150N247k5194k6679m158j6322
6515c7585p941K3819J0J8540N5772j8733m4298k3181L2445M2821o111l8766l3600
6502c6808L9698K8888l964j8737k898n2M775K1668P700n273k3808l471J2405j3118
$$ plain form
6488 7005 -2646 12316 -12778 -20489 -8584 10209 24672 27283 1687 -7772 -10755 5279 -7924
6475 -7924 -32931 -45006 -10637 -18072 -38916 -43973 1912 19992 -14039 -29676 -26389 -12369 -22534
6462 -22534 -2626 -5460 16560 13397 -3647 2339 -12461 17457 24891 22838 37352 19588 11907
6449 11907 -6774 -21310 -34939 -23252 -16764 -18910 -22943 -7139 -8464 -24012 -7504 35138 58866
6436 58866 82483 55521 5661 16738 44877 51481 27064 -7739 -17523 -9852 -28785 8295
6424 8295 23048 7396 -1857 -22362 -11294 41119 28745 9973 -5006 -20895 -12240 7590
6412 7590 -228 -16608 5055 9779 3236 -7199 -576 4981 -5168 -5315 -19613 -12462 3370 1522
6398 1522 10235 46584 39466 16782 12991 364 -26787 -22380 6844 20655 9552 -3895 -11608
$$ packed form
6488G005r651J4962k5094p711J1905J8793J4463K611k5596r459k983J6034j3203
6475g924k5007j2075L4369p435k0844n057M5885J8080l4031j5637L287J4020j0165
6462b2534J9908k834K2020l163j7044N986j4800K9918P434k053J4514j7764p681
6449A1907j8681j4536j3629J1687O488k146m033J5804j325j5548J6508M2642K3728
6436E8866K3617k6962m9860J1077K8139O604k4417l4803r784P671j8933L7080
6424H295J4753j5652r253k0505J1068N2413j2374j8772j4979j5889Q655J9830
6412G590p818j6380K1663M724o543j0435O623N557j0149j47j4298P151J5832j848
6398A522Q713L6349p118k2684l791j2627k7151M407K9224J3811j1103j3447p713
$$ plain form
6385 -11608 -17211 -17883 2628 14688 464 -14101 -9018 -15978 -39843 -52762 -54977 -9460 2510
6372 2510 5455 -7888 882 -8463 -32597 3811 18533 6906 8857 15591 8174 2910 -3679 13478
6358 13478 841 -12647 -17197 -20372 24 14450 -10160 -39272 -35902 -22469 -38174 -34574 -25180
6345 -25180 -42628 -12783 3645 -48348 -72251 -47788 -35674 -38323 -2647 -8351 -21045 -29545
6333 -29545 -28492 -61323 -34806 -26741 -15886 -22057 -8012 -3049 -24830 -47125 -18942 30768 29131
6320 29131 38635 31225 38208 30235 10648 -6073 -30723 -38030 -29300 -49782 -62697 -41757 -35041
6307 -35041 -16421 -13325 6639 25217 25059 -3922 -38110 -47647 -45222 -35673 236 -9433 -4328
6294 -4328 12756 -24522 -36797 -38335 -47968 -27598 -24453 -23200 -37603 -56957 -58968 3894 -5010
$$ packed form
6385a1608n603o72K0511J2060j4224j4565N083o960k3865j2919k215M5517J1970
6372B510K945j3343Q770r345k4134L6408J4722j1627J951O734p417n264o589J7157
6358A3478j2637j3488m550l175K0396J4426k4610k9112L370J3433j5705L600R394
6345b5180j7448K9845J6428n1993k3903K4463J2114k649L5676n704j2694q500
6333b9545J053l2831K6517Q065J0855o171J4045M963k1781k2295K8183M9710j637
6320B9131R504p410O983p973j9587j6721k4650p307Q730k0482j2915K0940O716
6307c5041J8620L096J9964J8578j58k8981l4188r537K425R549L5909r669N105
6294d328J7084l7278j2275j538r633K0370L145J253j4403j9354k011O2862q904
$$ plain form
6281 -5010 -30327 -31566 -38445 -24856 -31916 -17562 13625 33797 12845 -5988 14875 20034 -3290
6268 -3290 -1172 -8955 -23380 -12346 205 -9496 -26486 -41218 -33889 -6021 1276 -23636 -37431
6255 -37431 -48903 -18883 24126 39122 24350 777 10027 45147 29304 49052 38268 34287
6243 34287 50312 39181 11410 11676 -7399 4488 43844 23844 -3066 15628 37431 23904
6231 23904 54687 38839 6449 -10583 2062 8110 13126 7456 -4681 -16436 -48040 -60616
6219 -60616 -24221 -33595 -48488 -36343 -18436 4664 11997 -7176 21834 14010 -26629 -36893
6207 -36893 -38672 -45419 -49188 -59170 -73437 -55167 -39705 -7079 30756 20754 42874 60622 31988
6194 31988 3236 1232 -29166 -44963 -24564 -5649 21720 28406 32307 43678 22560 -13781
$$ packed form
6281e010k5317j239o879J3589p060J4354L1187K0172k0952j8833K0863N159k3324
6268c290K118p783j4425J1034J2551r701j6990j4732P329K7868P297k4912j3795
6255c7431j1472L0020M3009J4996j4772k3573R250L5120j5843J9748j0784l981
6243C4287J6025j1131k7771K66j9075J1887L9356k0000k6910J8694K1803j3527
6231B3904L0783j5848l2390j7032J2645O048N016n670j2137j1755l1604j2576
6219f0616L6395r374j4893J2145J7907K3100P333j9173K9010p824m0639j0264
6207c6893j779o747l769r982j4267J8270J5462L2626L7835j0002K2120J7748k8634
6194C1988k8752k004l0398j5797K0399J8915K7369O686L901J1371k1118l6341
$$ plain form
6182 -13781 -26842 -3365 -15006 -41444 -28575 -27568 -8967 23581 20979 8948 12333 7476 1100
6169 1100 23495 30898 3247 -7475 9318 -12521 -24784 -2294 12426 42269 40093 51050
6157 51050 69617 45055 -968 -7707 5441 6637 2052 15260 14518 25561 41277 52551 49359
6144 49359 31364 44821 962 -25502 -10978 -296 -14652 -19867 -62944 -72234 -50773 -46570
6132 -46570 -47430 -19463 -33336 -81123 -94074 -85534 -88949 -69864 -38606 -36867 -54848 -15509 14215
6119 14215 15438 7403 22929 13797 -8276 19777 36124 -19401 -47134 -20149 -5265 -23098
6107 -23098 -49095 -46754 -34886 10190 16735 868 -21649 -50797 -40909 -29049 -4224 -10465 -41650
6094 -41650 -46072 -48645 -68942 -74255 -62979 -40006 -15823 -7156 -19078 -36719 -35680 -49313 -44720
$$ packed form
6182a3781j3061K3477j1641k6438J2869J007J8601L2548k602j2031L385m857o376
6169A100K2395P403k7651j0722J6793k1839j2263K2490J4720K9843k176J0957
6157E1050J8567k4562m6023o739J3148J196m585J3208p42J1043J5716J1274l192
6144D9359j7995J3457m3859k6464J4524J0682j4356n215m3077r290K1461M203
6132d6570q60K7967j3873m7787j2951Q540l415J9085L1258J739j7981L9339K9724
6119A4215J223q035J5526r132k2073K8053J6347n5525k7733K6985J4884j7833
6107b3098k5997K341J1868M5076O545j5867k2517k9148R888J1860K4825o241l1185
6094d1650m422k573k0297n313J1276K2973K4183Q667j1922j7641J039j3633M593
$$ plain form
6081 -44720 -31395 -25226 -20115 -48016 -37984 -15012 -15332 -19705 -3601 6245 -22194 -17768 10364
6068 10364 15205 -22859 -46541 -29806 8484 2139 22078 23103 24013 4393 -41644 -42726 -39730
6055 -39730 -15087 -14099 15557 47410 22301 -30408 -34958 -2633 52200 41302 18269 -8086
6043 -8086 -32082 -30138 -33900 -47063 -46397 -75356 -90275 -50503 -31338 -11756 1306 -483 -34759
6030 -34759 -37895 -32036 -9538 -28508 -66829 -83805 -65814 -59845 -67048 -61352 7075 36671 11061
6017 11061 -14000 -30529 -11822 -21041 -28820 -18973 -18596 -24606 -854 -5076 -21712 18462 66910
6004 66910 15376 -34287 -83251 -89393 -46807 -15359 16244 25348 12229 -20799 -23324 4365
5992 4365 6846 21336 16009 17965 36990 8613 -5250 10746 -22871 -10799 15145 -1417 -17334
$$ packed form
6081d4720J3325O169N111k7901J0032K2972l20m373J6104R846k8439M426K8132
6068A0364M841l8064k3682J6735L8290o345J9939J025R10j9620m6037j082K996
6055c9730K4643R88K9656L1853k5109n2709m550L2325N4833j0898k3033k6355
6043h086k3996J944l762j3163O66k8959j4919L9772J9165J9582J3062j789l4276
6030c4759l136N859K2498j8970l8321j6976J7991N969p203N696O8427K9596k5610
6017A1061k5061j6529J8707r219p779R847L77o010K3752m222j6636M0174M8448
6004F6910n1534m9663m8964o142M2586L1448L1603R104j3119l3028k525K7689
5992D365K481J4490n327J956J9025k8377j3863J5996l3617J2072K5944j6562j5917
$$ plain form
5979 -17334 -27355 -2793 -15742 -19661 -17740 -6216 -16942 -18140 16628 26014 52740 48440 40502
5966 40502 45800 33661 46657 38556 32650 41890 20074 14453 -12388 -21199 -26315 -9101 -28484
5953 -28484 -19375 -7649 -44499 -37496 5631 32538 43532 65658 62674 62890 42626 19829 14792
5940 14792 8517 -4561 -4748 11852 53250 40076 14598 -1031 -2116 -11210 21795 50145 37750
5927 37750 24823 34064 7564 -5620 39283 50806 65034 76549 58813 30451 49733 41234
5915 41234 39088 36047 22412 -6045 -37847 -18529 25256 14485 -225 -21693 -46265 -38022
5903 -38022 -41348 -49788 -32884 -25643 -7990 4596 18953 3147 10468 21027 25626 45462 47520
5890 47520 51281 85702 125916 107707 44252 16892 2106 13091 -27354 -27291 -20667 -22160 -7681
$$ packed form
5979a7334j0021K4562j2949l919J921J1524j0726j198L4768R386K6726m300p938
5966D0502N298j2139J2996q101n906R240k1816n621k6841q811n116J7214j9383
5953b8484R109J1726l6850P003M3127K6907J0994K2126k984K16k0264k2797n037
5940A4792o275j3078j87J6600M1398j3174k5478j5629j085r094L3005K8350j2395
5927C7750j2927R241k6500j3184M4903J1523J4228J1515j7736k8362J9282q499
5915D1234k146l041j3635k8457l1802J9318M3785j0771j4710k1468k4572Q243
5903c8022l326q440J6904P241J7653J2586J4357j5806P321J0559M599J9836K058
5890D7520L761L4421M0214j8209o3455k7360j4786J0985m0445O3O624j493J4479
$$ plain form
5877 -7681 10544 14360 -15726 -9472 10403 4048 -34204 -12890 10681 -12283 -16818 -8949 -13202
5864 -13202 -14483 -22580 28889 45029 20427 -2903 -11265 -9034 11412 16014 6087 -4618 -16535
5851 -16535 -8368 -26808 -34628 -64466 -19349 -5705 724 -26284 -10047 6523 -9461 -10252 -20789
5838 -20789 -20009 -7740 -10991 -5594 -11870 1257 10825 15948 22193 -9496 -26418 -20694 -45440 -10799
5824 -10799 -225 -7244 -200 6558 5727 11098 -8332 8232 29541 21384 9657 -8769 -3020
5811 -3020 -14683 -43530 13617 23315 25277 30744 23153 -1296 -2317 -4185 989 2119 -4584 -17674
5797 -17674 -30707 -39224 -3945 -2255 -6679 -19025 18037 -3256 -29297 -50074 -34509 -5376
5785 -5376 -21283 -30992 -24640 -31636 -6009 -3679 -2356 -6782 -17911 5839 26506 39629 5826
$$ packed form
5877g681J8225L816l0086O254J9875o355l8252K1314K3571k2964m535P869m253
5864a3202j281q097N1469J6140k4602k3330q362K231K0446M602r927j0705j1917
5851a6535Q167j8440p820k9838M5117J3644O429k7008J6237J6570j5984p91j0537
5838b0789P80J2269l251N397o276J3127R568N123O245l1689j6922N724k4746L4641
5824a0799J0574p019P044O758q31N371j9430J6564K1309q157j1727j8426N749
5811c020j1663k8847N7147R698J962N467p591k4449j021j868N174J130o703j3090
5797a7674j3033q517L5279J690m424j2346L7062k1293k6041k0777J5565K9133
5785e376j5907r709O352o996K5627K330J323m426j1129K3750K0667J3123l3803
$$ plain form
5772 5826 -6610 -3218 2346 25622 52656 39583 -10534 -25572 -15075 4174 -16403 -20787 -1945
5759 -1945 -10722 -2033 -12922 16291 23005 -2539 37911 69383 70532 71000 38743 20278 18154
5746 18154 -3621 -12559 -1736 -27253 -36195 -19488 -16525 -3097 -5455 5882 34641 9630 -28374
5733 -28374 -32861 -37566 -8121 42603 49316 63530 84087 52301 5917 -5143 -28653 -41785
5721 -41785 -42723 -31680 -22536 -13865 -21961 -42027 -29663 -465 22025 23195 13319 30507 -13010
5708 -13010 -23694 -25412 -26617 -24481 -3125 3633 3421 -7415 -6320 18687 8505 -436 -5004 -25527
5694 -25527 -28077 -47485 -58268 -44776 -27288 -29855 -16065 -9180 -14054 -20592 8138 6648 -34456
5681 -34456 -43917 -18495 -11135 -18841 10356 15780 10043 -33866 -38384 -15672 1785 38886 18483
$$ packed form
5772E826j2436L392N564K3276K7034j3073n0117j5038J0497J9249k0577m384J8842
5759a945q777Q689j0889K9213O714k5544M0450L1472J149M68l2257j8465k124
5746A8154k1775q938J0823k5517q942J6707K963J3428k358J1337K8759k5011l8004
5733b8374m487m705K9445N0724O713J4214K0557l1786m6384j1060k3510j3132
5721d1785r38J1043R144Q671q096k0066J2364K9198K2490J170r876J7188m3517
5708a3010j0684j718j205K136K1356O758k12j0836J095K5007j0182q941m568k0523
5694b5527k550j9408j0783J3492J7488k567J3790O885m874o538K8730j490m1104
5681c4456r461K5422P360p706K9197N424n737m3909m518K2712J7457L7101k0403
$$ plain form
5668 18483 -9527 -3200 -2962 -7039 27557 49909 62928 43741 18780 -6358 12520 8373 -3240
5655 -3240 32108 42205 34492 51578 95243 69416 12423 18820 -8106 -43729 -60120 -15501
5643 -15501 28589 44456 43787 31036 41566 35058 31359 36999 19683 -5860 -25382 -13854 9049
5630 9049 6567 29006 35521 45467 33555 -20469 -64915 -59650 -56095 -27896 -1074 -9562 9055
5617 9055 21455 26958 13459 -13887 -13376 -5759 -360 3129 10699 14585 12766 -3556 -9644 -12337
5603 -12337 -21857 -851 -21845 -50245 -34274 2127 18360 42762 28098 -6082 24196 50537
5591 50537 66028 34008 19132 32393 21632 8810 672 2485 50566 38141 13061 17987
5579 17987 3121 7696 37784 41414 29729 39928 45252 48991 65616 46589 19758 -3458 35617
$$ packed form
5668A8483k8010O327K38m077L4596K2352J3019j9187k4961k5138J8878m147j1613
5655c240L5348J0097p713J7086M3665k5827n6993O397k6926l5623j6391M4619
5643a5501M4090J5867o69j2751J0530o508l699N640j7316k5543j9522J1528K2903
5630I049k482K2439O515R946j1912n4024m4446N265L555K8199K6822q488J8617
5617I055J2400N503j3499k7346N11P617N399L489P570L886j819j6322o088k693
5603a2337r520K1006k0994k8400J5971L6401J6233K4402j4664l4180L0278K6341
5591E0537J5491l2020j4876J3261j0761j2822q138J813M8081j2425k5080M926
5579A7987j4866M575L0088L630j1685J0199N324L739J6625j9027k6831k3216L9075
$$ plain form
5566 35617 46402 37159 24422 -10277 -57296 -24920 13640 34838 13941 25030 35490 16661
5554 16661 29153 7203 12651 5250 -16638 -10406 1971 3119 -19565 -59911 -65531 -63351 -40559
5541 -40559 -4154 -383 -34193 -32867 -3414 -15955 -1802 26461 25321 -11800 -22936 -17690 -14787
5528 -14787 -10865 -7160 -37285 -41252 -54431 -27419 -12441 -26994 -39711 -49189 4130 28944 6461
5515 6461 646 14009 23760 20935 35811 53828 12272 8133 -2828 -21732 -3270 11809 18379
5502 18379 36212 37391 36973 39510 -2463 -400 19761 38833 29422 15769 14956 -27936 -38832
5489 -38832 -20539 -25414 -35394 -50994 -71244 -74542 -43411 -30750 7794 42031 23842 -22840
5477 -22840 -53309 -47703 -62588 -43889 -26421 16223 47332 56743 15918 -8374 28499 37214
$$ packed form
5566C5617J0785r243j2737l4699m7019L2376L8560K1198k0897J1089J0460j8829
5554A6661J2492k1950N448p401k1888O232J2377J148k2684m0346n620K180K2792
5541d0559L6405L771l3810J326K9453j2541J4153K8263j140l7121j1136N246K903
5528a4787L922L705l0125l967j3179K7012J4978j4553j2717r478N3319K4814k2483
5515F461n815J3363R751k825J4876J8017m1556m139j0961j8904J8462J5079O570
5502A8379J7833J179m18K537m1973K063K0161J9072r411j3653q13m2892j0896
5489c8832J8293m875r980j5600k0250l298L1131J2661L8544L4237j8189m6682
5477b2840l0469N606j4885J8699J7468M2644L1109R411m0825k4292L6873Q715
$$ plain form
5465 37214 26133 14475 -6158 -50077 -56579 -48150 -46233 -45530 -62249 -39222 -23819 -5976 14690
5452 14690 16541 16546 13385 11638 16010 23357 24847 -4583 -6108 -7537 -24552 -11890 12775 28646
5438 28646 11988 -18234 -30209 -22441 3869 -6492 -1520 27548 31363 11613 -20847 -93
5426 -93 14540 38724 34863 8291 21111 30271 -5238 -21962 13094 37432 67191 89936 77378
5413 77378 43335 40441 43465 19806 33627 -4334 -31256 -45075 -18694 -10780 -19904 -34663 -33002
5400 -33002 -30996 -45647 -28177 -12097 21942 24931 -16419 -34347 -1344 17875 27285 72424
5388 72424 58694 44451 15091 10803 13450 -2681 -28135 -10125 -14002 -28310 -54063 -28636
5376 -28636 -22600 -20973 -19253 -575 9004 19441 36939 -7929 -37046 -29525 13170 35138 9230
$$ packed form
5465C7214j1081j1658k0633m3919o502Q429J917P03j6719K3027J5403J7843K0666
5452A4690J851Nl161j747M372P347J490k9430j525j429j7015J2662K4665J5871
5438B8646j6658l0222j1975P768K6310j0361M972K9068L815j9750l2460K0754
5426i3J4633K4184l861k6572J2820R160l5509j6724L5056K4338K9759K2745j2558
5413G7378l4043k894L024k3659J3821l7961k6922j3819K6381P914r124j4759J661
5400c3002K006j4651J7470J6080L4039K989m1350j7928L3003J9219R410M5139
5388G2424j3730j4243k9360m288K647j6131k5454J8010l877j4308k5753K5427
5376b8636O036J627J720J8678R579J0437J7498m4868k9117P521M2695K1968k5908
$$ plain form
5363 9230 -44089 -45168 -27718 -19616 -42535 -59456 -69100 -91950 -78406 -35751 -45310 -34594 -5031
5350 -5031 -7284 -23647 -15562 -13036 -29021 -4545 -4856 -21284 1896 102 -8221 -25688 -37202
5337 -37202 -31258 -22763 -34569 -36305 -33931 -33586 -17334 -54340 -96878 -78470 -60889 -74877 -54724
5324 -54724 -44713 -8787 10778 2044 5371 -14514 11008 12850 -19188 8054 12643 237 20696
5311 20696 59401 67963 30449 -2992 -37218 -43558 -39068 -26498 -40459 -47023 -44316 -49381 -40762
5298 -40762 -3614 29864 39885 -7987 -45009 -45379 -73521 -80729 -75796 -37970 -22593 -28827 -39474
5285 -39474 -26119 -13672 -12989 -17992 1418 -10325 -3367 -24701 -40252 -2485 1413 -9739 -5596
5272 -5596 28206 37161 10004 -11834 -24159 -12824 -4814 -10360 12339 54732 57120 38516 7027
$$ packed form
5363I230n3319j079J7450Q102k2919j6921r644k2850J3544M2655r559J0716K9563
5350e031k253j6363Q085K526j5985K4476l11j6428K3180j794q323j7467j1514
5337c7202N944Q495j1806j736K374L45J6252l7006m2538J8408J7581j3988K0153
5324e4724J0011L5926J9565q734L327j9885K5522J842l2038K7242M589j2406K0459
5311B0696L8705Q562l7514l3441l4226o340M490J2570j3961o564K707n065Q619
5298d0762L7148L3478J0021m7872l7022l70k8142p208M933L7826J5377o234j0647
5285c9474J3355J2447O83n003J9410j1743O958k1334j5551L7767L898j1152M143
5272e596L3802Q955k7157k1838j2325J1335Q010n546K2699M2393K388j8604l1489
$$ plain form
5259 7027 -16185 -9879 17255 18027 15019 -3692 -14775 1940 -5971 619 -9413 -3792 32310
5246 32310 29573 14959 -6124 -28130 2583 38050 29002 261 -18562 -23128 -28445 -21059 -20896
5233 -20896 -16309 -25199 -36748 -70586 -48255 3138 -25343 -47969 -52265 -26974 -1538 30975
5221 30975 2510 -6821 -8455 6254 17480 35200 20014 14442 5340 13643 42640 39396 -3804
5208 -3804 -31858 -10351 20688 23771 -18691 -30824 -14703 8386 30110 15936 6887 -26979
5196 -26979 -12700 -2520 -24746 -53957 -63432 -25619 -8832 792 15273 28713 46655 24663
5184 24663 12566 17183 20206 -3950 -14625 15864 28221 44231 41774 4517 -28829 -16673
5172 -16673 5946 -57013 -92700 -67426 -22356 -21171 -37257 -23623 -29485 -24513 -11542 -17547 -23027
$$ packed form
5259G027k3212O306K7134P72l008j8711j1083J6715p911O590j0032N621L6102
5246C2310k737j4614k1083k2006L0713L5467r048k8741j8823m566n317P386J63
5233b0896M587q890j1549l3838K2331N1393k8481k2626m296K5291K5436L2513
5221C0975k8465r331j634J4709J1226J7720j5186n572r102Q303K8997l244m3200
5208c804k8054K1507L1039L083m2462j2133J6121K3089K1724j4174r049l3866
5196b6979J4279J0180k2226k9211r475L7813J6787R624J4481J3440J7942k1992
5184B4663j2097M617L023k4156j0675L0489J2357J6010k457l7257l3346J2156
5172a6673K2619o2959l5687K5274M5070J185j6086J3634n862M972J2971o005n480
$$ plain form
5159 -23027 -15006 -14940 -32229 -52288 -38610 -40418 -11909 -4929 -5846 11046 16185 25227 32839 5952
5145 5952 -3316 -2264 -2892 -25524 -28904 -16218 -11771 -29307 -37044 -39057 -46428 -46607 -54415 -52361 -48930
5130 -48930 -30605 -50625 -76536 -35525 14488 24818 15381 49158 49506 12319 907 -22537
5118 -22537 -27938 -4268 7422 4724 -5173 19754 15541 -15742 -26076 -7390 -20485 -30932 -12939
5105 -12939 -1485 -14584 -26620 -21833 24573 27834 8391 29654 37934 52539 74331 39271
5093 39271 6277 5098 38563 66450 23598 -2627 17675 31321 28980 26810 6586 -8573
5081 -8573 -5872 -36734 -60445 -42113 -23949 -33957 -9871 3911 4848 8138 20700 -1744 25344
5068 25344 54472 71802 75780 24462 -4523 7778 32623 26287 23918 -3831 15856 29592
$$ packed form
5159b3027Q021O6j7289k0059J3678j808K8509O980r17J6892N139R042P612k6887
5145E952r268J052o28k2632l380J2686M447j7536p737k013p371j79p808K054L431
5130d8930J8325k0020k5911M1011N0013J0330r437L3777L48l7187j1412k3444
5118b2537n401K3670J1690k698r897K4927m213l1283j0334J8686j3095j0447J7993
5105a2939J1454j3099j2036M787M6406L261j9443K1263Q280J4605K1792l5060
5093C9271l2994j179L3465K7887m2852k6225K0302J3646k341k170k0224j5159
5081h573K701l0862k3711J8332J8164j0008K4086J3782R37L290J2562k2444K7088
5068B5344K9128J7330L978n1318k8985J2301K4845o336k369k7749J9687J3736
$$ plain form
5056 29592 40402 36657 39979 704 15097 -17014 -46780 -26876 10951 32446 41997 24603
5044 24603 -27073 -33163 -20233 -10491 10047 -4752 -40170 -38377 -32342 7509 51574 65142 82068
5031 82068 71199 24384 10835 -14612 -24986 -16906 -27179 -37940 -47718 -45861 -24376 -71
5019 -71 16438 -5145 -28869 -32648 -14966 -21447 -4009 11220 -28656 -69871 -60135 -45148 -34415
5006 -34415 -10695 -34159 -32792 -54646 -34637 -12349 -23418 -61311 -57844 -35713 -61072 -80869
4994 -80869 -48033 -532 22960 22880 14271 17380 -12856 -8312 1460 -13827 -7112 2488 -15669 -13774
4980 -13774 -27667 -25759 -2058 35241 43604 51758 4157 -27040 19709 65159 63663 52372 22227
4967 22227 3562 -26888 -32918 -18245 -23974 -21893 6615 -9030 -19502 -32245 -20780 -6058
$$ packed form
5056B9592J0810l745L322l9275J4393l2111k9766J9904L7827K1495R551j7394
5044B4603n1676o090J2930R742K0538j4799l5418J793O035L9851M4065J3568J6926
5031H2068j0869m6815j3549k5447j0374Q080j0273j0761r778J857K1485K4305
5019g1J6509k1583k3724l779J7682o481J7438J5229l9876m1215R736J4987J0733
5006c4415K3720k3464J367k1854K0009K2288j1069l7893L467K2131k5359j9797
4994h0869L2836M7501K3492q0q609L109l0236M544R772j5287O715R600j8157J895
4980a3774j3893J908K3701L7299Q363Q154m7601l1197M6749M5450j496j1291l0145
4967B2227j8665l0450o030J4673n729K081K8508j5645j0472j2743J1465J4722
$$ plain form
4955 -6058 9656 23679 20402 14932 28231 28374 14865 7994 -31305 -43854 -33597 -33277 -29602 -15161
4941 -15161 14807 -94 -17640 -47922 -56871 -33073 -31369 -3981 -3103 -14782 6358 -94 24485
4928 24485 46304 47028 36553 5743 -5570 2215 -16845 -7404 -397 10266 22149 1711 11792
4915 11792 7682 -16879 -7922 -4798 5242 -8278 13078 43985 38879 30291 -5503 -28687 -5717
4902 -5717 -28650 -33494 -21696 20749 28842 28936 -20006 -35444 -24641 -52514 -72215 -74670 -73709 -44086
4888 -44086 7215 15132 -14163 -22174 -12386 3744 -13953 -24694 -12880 -20820 -46609 -82438 -59507
4875 -59507 -25680 -31483 -3596 -29166 -52116 -34293 -19494 -23852 3894 11451 10927 7218 4066
4862 4066 28145 -7689 -37155 -40740 -14818 30968 41137 19053 32159 10139 13410 25095
$$ packed form
4955f058J5714J4023l277n470J3299J43j3509o871l9299j2549J0257L20L675J4441
4941a5161K9968j4901j7546l0282q949K3798J704K7388Q78j1679K1140o452K4579
4928B4485K1819P24j0475l0810j1313P785j9060R441P007J0663J1883k0438J0081
4915A1792m110k4561Q957L124J0040j3520K1356L0907n106q588l5794k3184K2970
4902e717k2933m844J1798M2445Q093R4m8942j5438J0803k7873j9701k455R61K9623
4888d4086N1301P917k9295q011R788J6130j7697j0741J1814p940k5789l5829K2931
4875e9507L3827n803K7887k5570k2950J7823J4799m358K7746P557n24l709l152
4862D066K4079l5834k9466l585K5922M5786J0169k2084J3106k2020L271J1685
$$ plain form
4850 25095 5647 -20369 -28027 -17595 36604 31967 -19920 -18360 -5860 -9776 4559 11872 1129
4837 1129 8303 17601 30515 -5425 -21738 11360 39363 40069 41081 40287 29391 28914 40701 15624
4823 15624 12023 36052 50163 26770 9431 3895 -21435 -20903 6199 22729 41534 39525 56200
4810 56200 53176 35056 42515 24749 -1234 -13286 -1652 16005 5596 -6727 39411 43037
4798 43037 55753 35390 -11207 -13845 -36163 -25229 13153 7614 9298 6317 -3825 4848 36477
4785 36477 39735 33228 -324 -1662 5060 -18882 -26659 -19565 -6947 7668 -33169 -49918 -30999
4772 -30999 -17423 -17728 -15207 4781 14019 -6283 20470 8902 29156 43265 25619 23399 5331
4759 5331 -34324 -68373 -72060 -39039 -41406 -45149 -26543 -24024 -22371 -25926 -19825 -52787 -44900 -2634
$$ packed form
4850B5095j9448k6016p658J0432N4199m637n1887J560J2500l916J4335P313j0743
4837A129P174R298J2914l5940j6313L3098K8003P06J012p94j0896m77J1787k5077
4823A5624l601K4029J4111k3393j7339n536k5330N32K7102J6530J8805k009J6675
4810E6200l024j8120P459j7766k5983j2052J1634J7657j0409j2323M6138L626
4798D3037J2716k0363m6597k638k2318J0934L8382n539J684k981j0142Q673L1629
4785C6477L258o507l3552j338O722k3942p777P094J2618J4615m0837j6749J8919
4772c0999J3576l05K521J9988R238k0302K6753j1568K0254J4109j7646k220j8068
4759E331l9655l4049l687L3021k367l743J8606K519J653l555O101l2962P887M2266
$$ plain form
4745 -2634 7420 -13961 -49932 -55103 -80258 -41569 15679 4445 -2620 -18586 -34761 -17907
4733 -17907 -27389 -14111 31148 69713 50928 41635 58676 50488 34388 35262 32980 10936 19666
4720 19666 19044 -493 -25195 -67477 -44795 -15569 -1711 16880 50182 34042 8298 -12211
4708 -12211 -398 9354 18289 18656 -1031 -469 -11751 -27298 -32558 -35255 -33758 -71520 -71960 -46277
4694 -46277 -35570 -22905 -23132 -26964 -37565 -11789 1185 -7869 -15206 -16821 14443 19685 15003
4681 15003 40703 43161 21176 30555 35441 36607 31450 -10566 -26684 -30751 -45113 -62654 -54180
4668 -54180 -17924 -27783 -23849 -17245 -21414 2031 -285 -7559 -19918 -35485 -56918 -57492 -62226 -71477
4654 -71477 -59195 -34581 -30028 -25013 -10444 -6934 5557 5272 -16532 -17443 9092 -4096 -15653
$$ packed form
4745b634J0054k1381l5971n171k5155L8689N7248j1234p065j5966j6175J6854
4733a7907r482J3278M5259L8565j8785r293J7041q188j6100Q74k282k2044Q730
4720A9666o22j9537k4702m2282K2682K9226J3858J8591L3302j6140k5744k0509
4708a2211J1813R752Q935L67j9687N62j1282j5547n260k697J497l7762m40K5683
4694d6277J0707J2665k27l832j0601K5776J2974r054p337j615L1264N242m682
4681A5003K5700K458k1985R379M886J166n157m2016j6118m067j4362j7541Q474
4668e4180L6256r859L934O604m169K3445k316p274j2359j5567k1433n74m734r251
4654g1477J2282K4614M553N015J4569L510J2491k85k1804r11K6535j3188j1557
$$ plain form
4641 -15653 -3692 -13224 -386 -25896 -19997 -49672 -54682 -50876 -10388 -28867 -30264 -31583 -40027
4628 -40027 -44673 -21117 -13324 4460 32036 30876 16445 29663 19833 11205 27649 11459 -20059
4615 -20059 14421 4621 -34455 -22878 -5843 -19039 -2355 11115 7449 27280 56785 45425
4603 45425 -1744 3074 48220 58223 18368 -23258 -14197 15433 21834 -22989 -30780 -66660 -89590
4590 -89590 -59908 -8482 2809 31156 35852 12737 18734 32157 9968 13333 -13213 -34982
4578 -34982 -49833 -26624 -2657 22309 56307 75396 68682 41154 7410 -1107 -30098 -49071
4566 -49071 -45622 -34083 -14392 9542 17899 5920 -3344 -392 -3583 -64386 -84381 -77792 -43240
4553 -43240 -21974 -29772 -30813 -36967 -43851 -34780 -13854 -14453 -17791 -28913 -11066 3604 -28594
$$ packed form
4641a5653J1961r532J2838k5510N899k9675n010L806M0488j8479j397j319q444
4628d0027m646K3556P793J7784K7576j160j4431J3218r830q628J6444j6190l1518
4615b0059L4480r800l9076J1577J7035j3196J6684J3470l666J9831K9505j1360
4603D5425m7169M818M5146J0003l9855m1626R061K9630O401m4823p791l5880k2930
4590h9590K9682N1426J1291K8347M696k3115N997J3423k2189L365k6546k1769
4578c4982j4851K3209K3967K4966L3998J9089o714k7528l3744q517k8991j8973
4566d9071L449J1539J9691K3934Q357j1979r264K952l191o0803j9995O589L4552
4553d3240K1266p798j041o154o884R071K0926n99l338j1122J7847J4670l2198
$$ plain form
4540 -28594 -46263 -21933 -21332 6106 24501 25690 -24759 -22135 -13663 -16274 6336 359 8239
4527 8239 45015 40296 13983 43218 20164 3533 4093 -27985 -70951 -52317 -34912 -7595 -42487
4514 -42487 -48317 -330 5385 -12440 -13500 14449 21060 33637 28087 9374 -14771 -27825 -34076
4501 -34076 -20228 -13025 -4155 -11587 -1994 36919 56164 77192 57777 40582 22833 20450 1566
4488 1566 -23106 -22315 6157 -6911 -5962 2262 35036 41393 44910 50422 67091 60230 51435 37085
4474 37085 10228 -12812 -55448 -68724 -49250 -47979 -54032 -56687 -59347 -25901 19490 59047 59281
4461 59281 49581 55602 56237 43360 26944 19023 22867 25474 2378 -12774 -27882 -46876 -55467
4448 -55467 -79518 -79584 -75659 -51583 -30249 -19948 -15337 -15039 -12344 -16718 -20374 -27224 -3595 -2815
$$ packed form
4540b8594j7669K4330O01K7438J8395J189n0449K624Q472k611K2610n977P880
4527H239L6776m719k6313K9235k3054j6631N60l2078m2966J8634J7405K7317l4892
4514d2487n830M7987N715j7825j060K7949O611J2577n550j8713k4145j3054o251
4501c4076J3848P203Q870p432R593L8913J9245K1028j9415j7195j7749k383j8884
4488A566k4672P91K8472j3068R49Q224L2774O357L517N512J6669o861q795j4350
4474C7085k6857k3040m2636j3276J9474J271o053k655k660L3446M5391L9557K34
4461E9281r700O021O35j2877j6416p921L844K607k3096j5152j5108j8994q591
4448e5467k4051o6L925K4076K1334J0301M611K98K695m374l656o850K3629P80
$$ plain form
4434 -2815 -18784 -8328 -32211 -51665 -28204 -12416 -1296 -6539 -8880 -36016 -22866 -4197
4422 -4197 -10906 -12098 -24515 -21183 -37372 -38790 -36874 -42349 -48086 -68764 -59295 -31237 -16902 9674
4408 9674 27255 17246 -15737 -31659 -10241 5518 19196 24792 -13441 -24288 -18931 3773
4396 3773 16082 6724 23721 36471 35602 33136 36422 29911 1785 -16404 -56208 -34190 -1364
4383 -1364 20018 40071 46001 45967 25769 17258 17374 8375 22925 32237 -15695 -23586 14658 43765
4369 43765 36731 10848 19820 31913 20485 12094 359 -8416 1410 -12819 -5639 5186 27918
4356 27918 17797 -34010 -44528 -50603 -20845 -6530 20880 39584 26200 4427 7336 18255
4344 18255 20952 -9731 -13799 11337 48477 46067 35424 46335 30629 44454 40727 46055 26655
$$ packed form
4434b815j5969J0456k3883j9454K3461J5788J1120n243k341k7136J3150J8669
4422d197o709j192j2417L332j6189j418J916n475n737k0678R469K8058J4335K6576
4408I674J7581j0009l2983j5922K1418J5759J3678N596l8233j0847N357K2704
4396C773J2309r358J6997J2750q69k466L286o511k8126j8189l9804K2018L2826
4383a364K1382K0053N930l4k0198q511J16q999J4550R312m7932p891L8244K9107
4369D3765p034k5883Q972J2093j1428q391j1735q775R826j4229P180J0825K2732
4356B7918j0121n1807j0518o075K9758J4315K7410J8704j3384k1773K909J0919
4344A8255K697l0683m068K5136L7140k410j0643J0911j5706J3825l727N328j9400
$$ plain form
4331 26655 23118 -9080 -19036 -10747 -32479 -45581 -19467 11201 -6960 -23778 -19103 -10888 14436
4318 14436 9944 -16519 -16208 -961 13970 21878 25427 8686 -44793 -58174 -2730 44899 50320
4305 50320 30085 25214 7050 20256 18589 25846 28781 22784 36779 54886 52582 38974 14356
4292 14356 8181 13150 16472 15433 27177 30473 -29962 -48421 -38922 -14829 -8526 -45479 -76603
4279 -76603 -58950 -33632 -76064 -47358 -26214 -11127 25718 30963 2448 -6514 -35605 -29493
4267 -29493 -14046 -24223 -19225 -17204 -12126 -30891 -49413 -24171 16436 7285 -10419 -12934 -39964
4254 -39964 -3823 -4499 -4402 -16351 -56000 -52275 -55736 -47299 -31988 -15612 -18316 -5691 -3785 -35865
4240 -35865 -25358 2512 6168 -10466 -28345 -27912 -28492 -23852 -5167 -11989 -61152 -29630 -1745
$$ packed form
4331B6655l537l2198r956Q289k1732j3102K6114L0668j8161j6818M675Q215K5324
4318A4436m492k6463L11J5247J4931P908L549j6741n3479j3381N5444M7629N421
4305E0320k0235m871j8164J3206j667P257K935n997J3995J8107k304j3608k4618
4292A4356o175M969L322j039J1744L296o0435j8459R499K4093O303l6953l1124
4279g6603J7653K5318m2432K8706K1144J5087L6845N245k8515q962k9091O112
4267b9493J5447j0177M998K021N078j8765j8522K5242M0607r151j7704k515k7030
4254c9964L6141o76R7j1949l9649L725l461Q437J5311J6376k704J2625J906l2080
4240c5865J0507K7870L656j6634j7879M33n80M640J8685o822m9163L1522K7885
$$ plain form
4227 -1745 -19902 -54691 -27880 657 -5380 -553 -7811 -9637 -484 4284 18552 27906 32532 24866
4213 24866 -10740 -319 32210 32417 -9654 -6017 14953 22942 11364 7153 7190 3528 -7677 -23186
4199 -23186 -25454 -23288 -18903 1865 52671 75473 83787 53198 40795 35483 27974 29437 47708
4186 47708 34805 33793 -190 -19033 -46970 -44647 -28439 3310 43396 53777 49966 15623
4174 15623 -27796 -48389 -55888 -57102 -33320 -35592 -56645 -43921 -5874 28350 46948 11489
4162 11489 9739 24650 3421 14362 18760 18751 12849 8884 8065 -21033 -24166 88 23509 10324
4148 10324 187 -2831 3927 -19291 31801 54458 36291 17295 -1108 -9558 -11347 -24185 -21658
4135 -21658 -29263 -39028 -57042 -82998 -56916 -33818 -2522 16308 8605 5198 5206 12237 1569 4957
$$ packed form
4227a745j8157l4789K6811K8537o037M827p258j826R153M768J4268R354M626p666
4213B4866l5606J0421L2529K07m2071L637K0970P989j1578m211L7l662j1205j5509
4199b3186k268K166M385K0768N0806K2802Q314l0589j2403n312p509J463J8271
4186D7708j2903j012l3983j8843k7937K323J6208L1749M0086J0381l811l4343
4174A5623m3419k0593p499j214K3782k272k1053J2724L8047L4224J8598l5459
4162A1489j750J4911k1229J0941M398rn902l965q19k9098l133K4254K3421j3185
4148A0324j0137l018O758k3218N1092K2657j8167j8996j8403q450j789j2838K527
4135b1658p605r765j8014k5956K6082K3098L1296J8830p703l407QP031j0668L388
$$ plain form
4121 4957 16417 -10632 -10543 13602 65319 77731 69790 46662 13338 -46421 -53325 -39725 3425
4108 3425 14311 -17759 -45641 -45476 -35714 -34676 -32898 -44610 -61850 -71674 -43459 -2347 -17596
4095 -17596 -21353 -8447 29022 3106 -8298 11551 32053 39213 30713 15262 9402 -7953 -25761
4082 -25761 -15989 21787 11608 1140 -19083 -21635 -44162 -33676 -19025 -23736 -47162 -78006
4070 -78006 -40681 -19397 -38253 -33447 -45201 -31911 -36020 3742 4454 8531 47568 62264 48651
4057 48651 37962 28191 -8363 2336 -15135 -44048 -49405 -47977 -51617 -32552 -38090 -20318 7791
4044 7791 1785 -7794 -14010 -42675 -35983 -16847 -2658 26229 23088 1381 -6002 30383 31024 6995
4030 6995 61 10787 8529 -23264 -31811 -16122 -13654 -14544 9869 4182 1792 24982 35352 19569
$$ packed form
4121D957J1460k7049Q9K4145N1717J2412p941k3128l3324n9759o904J3600M3150
4108C425J0886l2070k7882J65R762J038J778j1712j7240r824K8215M1112j5249
4095a7596l757J2906L7469k5916j1404J9849K0502P160q500j5451n860j7355j7808
4082b5761R772L7776j0179j0468k0223k552k2527J0486J4651m711k3426l0844
4070g8006L7325K1284j8856M806j1754J3290m109L9762P12M077L9037J4696j3613
4057D8651j0689r771l6554J0699j7471k8913n357J428l640J9065n538J7772K8109
4044G791o006r579o216k8665O692J9136J4189K8887l141k1707p383L6385O41k4029
4030F995o934J0726k258l1793q547J5689K468q90K4413n687k390K3190J0370j5783
$$ plain form
4016 19569 -2825 -10227 -24507 8998 -10716 -24700 -7153 -14667 -524 14045 24999 29881
4004 29881 -3831 -36275 -50048 -40077 -48041 -33447 -33732 -36893 -10976 2755 14244 53363 76702
3991 76702 30604 22523 24205 34639 49771 11206 -3139 4386 12439 6283 1377 -26856 -18713
3978 -18713 -18216 3815 41809 22108 -2367 -953 -16736 -18517 1419 19222 9813 16421 -5274
3965 -5274 -24257 -6115 40011 50463 19082 13069 -6453 -47294 -47151 -41818 -13684 53655 74214
3952 74214 65176 41649 33675 -761 4471 9574 13083 4417 -13049 -29648 -19083 1459 -693
3939 -693 -18667 -54591 -48711 9785 -4037 -24951 -7473 -1482 -4841 7285 3372 15014 32585
3926 32585 12680 -18390 -41810 -33435 -32174 -59797 -29648 -10358 -10711 -36169 -28366 -46269 -48818
$$ packed form
4016A9569k2394p402j4280L3505j9714j3984J7547p514J4143J4569J0954M882
4004B9881l3712l2444j3773R971p964J4594k85l161K5917J3731J1489L9119K3339
3991G6702m6098q081J682J0434J5132l8565j4345P525Q053o156m906k8233Q143
3978a8713M97K2031L7994j9701k4475J414j5783j781J9936J7803r409O608k1695
3965e274j8983J8142M6126J0452l1381o013j9522m0841J43N333K8134O7339K0559
3952G4214r038k3527p974l4436N232N103L509q666j7466j6599J0565K0542k152
3939f93j7974l5924N880N8496j3822k0914J7478N991l359J2126l913J1642J7571
3926C2585j9905l1070k3420Q375J261k7623L0149J9290l53k5458P803j7903k549
$$ plain form
3913 -48818 -61363 -49686 7019 1639 -24801 -55164 -79452 -81087 -29006 -17629 -40560 -52392
3901 -52392 -52919 -33649 -8940 8474 36694 23566 2164 -30462 -24989 -51122 -49561 -54790 -45634
3888 -45634 -23079 -269 -21068 1163 14938 26606 17586 25761 38574 43951 53142 76036 73737
3875 73737 49064 23072 7668 -40642 -50914 -26884 -13446 21199 -10035 -28802 -35417 -31036
3863 -31036 -24022 -39271 -54796 -26352 4596 -299 9149 -3744 -12535 -28710 -52463 -44965 -31862
3850 -31862 -60140 -42488 -15469 -4189 15554 37060 41137 47955 53258 29285 4311 32438
3838 32438 49236 62908 35933 -273 -14503 -4821 7016 -3180 -7651 5941 15245 18575 -1228
3825 -1228 19739 32184 22423 20006 -16935 -41255 -31539 15747 44267 84421 17221 3025 17197
$$ packed form
3913d8818j2545J1677N6705n380k6440l0363k4288j635N2081J1377k2931j1832
3901e2392n27J9270K4709J7414K8220j3128k1402l2626N473k6133J561n229R156
3888d5634K2555K2810k0799K2231J3775J1668r020Q175J2813N377R191K2894k299
3875G3737k4673k5992j5404m8310j0272K4030J3438L4645l1234j8767o615M381
3863c1036P014j5249j5525K8444L0948m895R448j2893q791j6175k3753P498J3103
3850c1862k8278J7652K7019J1280J9743K1506M077O818N303k3973k4974K8127
3838C2438J6798J3672k6975l6206j4230R682J1837j0196m471J3592R304L330j9803
3825a228K0967J2445r761k417l6941k4320R716M7286K8520M0154o7200j4196J4172
$$ plain form
3812 17197 26105 39104 16508 17125 28347 36554 37856 54102 41355 27659 40189 57860 73681
3799 73681 49532 32252 45106 36270 27378 28287 40403 44570 49535 29839 29110 3128 -11628
3786 -11628 -19081 -33297 -36793 -40899 -37413 -29679 -15814 -13636 383 5159 26 -4098 34207 71386
3772 71386 70790 75114 77300 57509 48910 16371 -19996 -33396 -31054 -18287 2176 11285 14475
3759 14475 -11060 -5999 5957 -15506 -9166 3865 4612 14288 -17905 -32937 12097 31149 20055
3746 20055 -6331 -19204 -45343 -35326 18017 32610 8259 -32672 -20468 13157 40149 63292
3734 63292 49477 56558 58829 65741 61622 73442 70130 61964 55626 25496 -5763 -32217 -28491
3721 -28491 10861 22669 26578 -2623 -36917 -4783 22154 24620 -19831 -46603 -37230 -18216
$$ packed form
3812A7197Q908J2999k2596O17J1222Q207J302J6246j2747j3696J2530J7671J5821
3799G3681k4149j7280J2854q836q892R09J2116M167M965j9696p29k5982j4756
3786a1628p453j4216l496m106L486P734J3865K178J4019M776n133m124L8305L7179
3772G1386n96M324K186j9791q599l2539l6367j3400K342J2767K0463R109L190
3759A4475k5535N061J1956k1463O340J3031P47R676l2193j5032M5034J9052j1094
3746B0055k6386j2873k6139J0017N3343J4593k4351m0931J2204L3625K6992K3143
3734F3292j3815P081K271O912m119J1820l312q166o338l0130l1259k6454L726
3721b8491L9352J1808L909k9201l4294L2134K6937K466m4451k6772R373J9014
$$ plain form
3709 -18216 13511 -1728 -10900 -36986 -10398 -2762 -35732 -19861 -20528 -26650 -716 10114 27533
3696 27533 14846 38181 34534 19111 32622 39112 22574 3594 -6463 -16926 -19925 -11631 -2625
3683 -2625 1677 1976 7258 9038 11480 -17739 -53255 -50391 -46869 -57293 -40548 -6738 -321 -18863
3669 -18863 -3481 15389 -17891 -30974 -24076 5492 43127 21189 65 -18127 -16364 -27002
3657 -27002 791 40814 51505 44819 22396 15927 11902 25863 27972 32474 39367 19253 3929
3644 3929 -38592 -31978 -34085 -13189 -1729 19387 19325 -7318 -4871 18590 13664 -5864 -31690
3631 -31690 -54876 -50571 -47332 -58052 -60818 -48326 -40212 -33305 -29205 -4595 13520 19375 29668
3618 29668 -202 12067 38827 35920 -16609 -6659 -17224 -11888 3601 35349 33787 24644 39899
$$ packed form
3709a8216L1727j5239r172k6086K6588P636l2970J5871o67o122K5934J0830J7419
3696B7533j2687K3335l647j5423J3511O490j6538j8980j0057j0463k999Q294R006
3683b625M302K99N282J780K442k9219l5516K864L522j0424J6745L3810O417j8542
3669a8863J5382J8870l3280j3083O898K9568L7635k1938k1124j8192J763j0638
3657b7002K7793M0023J0691o686k2423o469m025J3961K109M502O893k0114j5324
3644C929m2521O614k107K0896J1460K1116o2k6643K447K3461m926j9528k5826
3631c1690k3186M305L239j0720k766J2492Q114O907M100K4610J8115N855J0293
3618B9668k9870J2269K6760k907n2529R950j0565N336J5489L1748j562r143J5255
$$ plain form
3605 39899 36851 43964 35055 35969 57859 45937 61320 80599 56202 17976 -26946 -42976 -28676
3592 -28676 -3072 1053 -28267 -42605 -7444 -8659 -32935 3925 26287 12546 -22877 -19328
3580 -19328 -6301 -17734 -24711 -35437 -33092 -40490 -27275 -20941 23846 60368 23758 6420 -905
3567 -905 -23851 -6051 -17550 -3749 23511 63742 46226 -5700 -21148 -9210 -15035 -36979
3555 -36979 -41276 -18802 -11043 -37651 -34303 -36839 -14260 -9220 -673 7820 11120 6986 -13935 -22022
3541 -22022 -28160 -31268 -4480 10140 39003 13272 -13804 -42460 -43629 -31661 -3584 -12616 -28235
3528 -28235 -29526 -48434 -60182 -32468 -33640 -52963 -39609 -27782 -30133 -17888 -41327 -53753
3516 -53753 -44417 -30640 -12194 -19293 -28556 -37969 -17969 -22113 809 23184 -10397 -20421 -20161
$$ packed form
3605C9899l048P113q909R14K1890j1922J5383J9279k4397l8226m4922j6030J4300
3592b8676K5604M125k9320j4338L5161j215k4276L6860K2362j3741l5423L549
3580a9328J3027j1433o977j0726K345p398J3215O334M4787L6522l6610j7338p325
3567i05k2946J7800j1499J3801K7260M0231j7516n1926j5448J1938n825k1944
3555c6979m297K2474P759k6608L348k536K2579N040Q547Q493L300m134k0921q087
3541b2022o138l108K6788J4620K8863k5731k7076k8656j169J1968K8077r032j5619
3528b8235j291j8908j1748K7714j172j9323J3354J1827k351J2245k3439j2426
3516e3753R336J3777J8446p099r263r413K0000m144K2922K2375l3581j0024K60
$$ plain form
3503 -20161 -12689 18252 -17580 -25908 7071 3673 -27085 -8381 -4813 -7299 7030 7949 24154
3490 24154 19198 -13468 -14982 -2598 21105 29423 27393 10962 14 9341 -4615 -17487 -28371
3477 -28371 -38271 -29254 22108 21441 12832 30384 63008 53571 45715 11876 6833 34474 39022 18934
3463 18934 4280 16319 18252 9448 -26049 -45908 -26286 -30277 -18878 579 -8100 -27107 -13188
3450 -13188 -12666 -11559 1029 15538 8666 11699 41148 35740 11525 -3669 -23751 -27452 -26864 -10365
3436 -10365 36498 44319 51948 49494 25449 -19048 -10406 -8148 -8667 -10667 9822 -12231 -29703
3423 -29703 -37084 -10252 1344 15053 22746 4030 -14257 7610 6469 10675 -28969 -53392 -20885
3410 -20885 2639 8285 5973 10079 32778 74375 91023 41128 -879 -36281 -35763 -35092 -16098
$$ packed form
3503b0161P472L0941l5832q328L2979l398l0758J8704L568k486J4329R19J6205
3490B4154m956l2666j514J2384K3703Q318k030j6431j0948R327j3956j2872j0884
3477b8371r900R017N1362o67q609J7552L2624r437p856l3839n043K7641M548k0088
3463A8934j4654J2039J933q804l5497j9859J9622l991J1399J9457q679j9007J3919
3450a3188N22J107J2588J4509o872L033K9449n408k4215j5194k0082l701N88J6499
3436a0365M6863P821P629k454k4045m4497Q642K258n19k000K0489k2053j7472
3423b9703p381K6832J1596J3709P693j8716j8287K1867j141M206l9644k4423L2507
3410b0885K3524N646k312M106K2699M1597J6648m9895m2007l5402N18O71J8994
$$ plain form
3397 -16098 9367 19239 -18476 -6470 26048 24753 44190 33996 12118 -20982 -32842 -30576
3385 -30576 1294 15725 8091 6258 4422 8773 5462 1689 1441 -5751 -31667 -21344 -24399 14027
3371 14027 53960 42545 26052 13648 -5415 -11478 -10359 -11234 -33494 -4155 -16999 -29939 -39943
3358 -39943 -49557 -40232 -10535 25173 44712 40826 32537 29990 15500 6423 -5883 5457 24629
3345 24629 29515 10524 9636 26623 424 -13768 -20132 7580 21820 -1671 5318 47836 39109
3332 39109 2642 4779 -10576 -5894 -14764 -23248 -15878 -26927 -10061 -10864 -2504 14914 9011 10151
3318 10151 1642 17714 1110 3840 13207 24250 29987 25172 37879 52371 15404 7320 41796
3305 41796 49621 10528 532 -9622 -1018 2414 41164 57280 28528 -5291 20333 51670 39576
$$ packed form
3397a6098K5465R872l7715J2006L2518j295J9437j0194k1878l3100j1860K266
3385c0576L1870J4431p634j833j836M351l311l773k48p192k5916J0323l055L8426
3371A4027L9933j1415j6493j2404j9063o063J119q75k2260K9339j2844j2940j0004
3358c9943r614R325K9697L5708J9539l886q289k547j4490r077j2306J1340J9172
3345B4629M886j8991q88J6987k6199j4192o364K7712J4240k3491O989M2518q727
3332C9109l6467K137j5355M682q870q484P370j1049J6866q03Q360J7418n903J140
3318A0151q509J6072j6604K730R367J1043N737m815J2707J4492l6967q084L4476
3305D1796P825l9093r996j0154Q604L432L8750J6116k8752l3819K5624L1337j2094
$$ plain form
3292 39576 5511 -30121 -3457 5088 -3216 11296 7017 -14189 -22399 18768 -4044 -37169 -10027
3279 -10027 -30271 -46642 -57031 -28191 -20979 -14594 -22295 -41479 -14568 -7682 -18435 -29993 -27676
3266 -27676 -34132 -22297 -7596 2412 1329 -8893 -6912 7324 3825 -13251 -33175 -40930 -7661
3253 -7661 26995 46157 -3361 5332 32501 27733 -11926 -26865 -33581 -1202 33314 11014 -3083
3240 -3083 5319 17204 35789 24426 10772 -6061 -18970 -12244 7062 -2776 -5548 -23433 -19581
3227 -19581 -792 15933 67084 56688 24139 26905 36214 40811 37874 6822 -24972 -38155 -45180
3214 -45180 -25329 -2382 5654 -10168 -27524 -5716 -2110 -36596 -11668 14278 -1665 -3847
3202 -3847 4766 3275 30525 46364 55928 57972 35455 7758 -2662 3623 33679 45181 21390
$$ packed form
3292C9576l4065l5632K6664Q545q304J4512m279k1206q210M1167k2812l3125K7142
3279a0027k0244j6371j0389K8840P212O385p701j9184K6911O886j0753j1558K317
3266b7676o456J1835J4701J0008j083j0222J981J4236l499j7076j9924p755L3269
3253g661L4656J9162m9518Q693K7169m768l9659j4939o716L2379L4516k2300j4097
3240c083Q402J1885J8585j1363j3654j6833j2909O726J9306r838k772j7885L852
3227a9581J8789J6725N1151j0396l2549K766R309M597k937l1052l1794j3183p025
3214d5180J9851K2947Q036j5822j7356K1808L606l4486K4928K5946j5943k182
3202c847Q613j491K7250J5839R564K044k2517k7697j0420O285L0056J1502k3791
$$ plain form
3189 21390 -7688 -13007 2306 4727 7131 16743 24097 11277 15034 7389 -22414 -38808 -14068
3176 -14068 -20418 -23304 -23464 -14788 -17412 12955 31113 21958 -1491 -17259 -30729 6851 -1208
3163 -1208 -12583 19009 55981 53137 45025 27449 -6383 -32874 -33737 -27344 -33455 -36032 -18966
3150 -18966 11664 21163 4418 -13530 -18561 5202 22756 19086 12564 24919 16742 3019 26769
3137 26769 7936 8166 26992 42174 13085 7441 14538 -10260 -15108 11778 23899 27112 26794
3124 26794 29277 12576 -11451 -6063 -792 -14386 -15459 -19919 -24366 -23421 -11331 -13706 -526 22675
3110 22675 33606 54167 40433 35504 61325 91874 70962 30219 8480 35221 20316 6900
3098 6900 2561 6170 27622 26583 16643 32351 40630 48643 30876 33596 44973 35095 11439 11115
$$ packed form
3189B1390k9078n319J5313K421K404R612P354j2820L757p645k9803j6394K4740
3176a4068o350k886j60Q676k624L0367J8158r155k3449j5768j3470L7580q059
3163a208j1375L1592L6972k844q112j7576l3832k6491q63O393o111k577J7066
3150a8966L0630R499j6745j7948n031K3763J7554l670o522J2355q177j3723K3750
3137B6769j8833K30J8826J5182k9089n644P097k4798m848K6886J2121L213l18
3124B6794K483j6701k4027N388N271j3594j073m460m447R45J2090k375J3180K3201
3110B2675J0931K0561j3734m929K5821L0549k0912m0743k1739K6741j4905j3416
3098F900m339L609K1452j039r940J5708Q279Q013j7767K720J1377r878k3656l24
$$ plain form
3084 11115 18693 6746 303 -12773 -18049 -12042 -3299 2559 3721 8266 4755 -7904 9815 1839
3070 1839 -24129 -23931 5591 -5949 -10162 31272 57468 45719 20252 -23567 -1376 5113 14790
3057 14790 39339 48425 24814 13908 8326 -13784 -21523 -23039 -3412 -6420 -358 -2910 -22658
3044 -22658 -41516 -42859 -45239 -37217 -10919 -7673 -10121 -29300 -31614 4479 -14517 -33393 -46327
3031 -46327 -51068 -6486 12316 8986 10094 22145 13909 -2409 10076 -12858 -28382 3738 27804
3018 27804 37615 28376 32856 34161 6512 -6509 13116 25924 9635 9482 27185 8819 -19694
3005 -19694 -2682 18610 32581 57118 76689 64356 60037 55254 74314 81110 52604 35940
2993 35940 3890 -22356 -4703 15235 22604 11190 26884 37325 49136 40724 25203 11943
$$ packed form
3084A1115P578j1947o443j3076n276O007Q743N858J162M545l511j2659J7719p976
3070A839k5968J98K9522j1540m213M1434K6196j1749k5467m3819K2191O489R677
3057A4790K4549R086k3611j0906n582k2110p739j516J9627l008O062k552j9748
3044b2658j8858j343k380Q022K6298L246k448j9179k314L6093j8996j8876j2934
3031d6327m741M4582J8802l330J108J2051q236j6318J2485k2934j5524L2120K4066
3018B7804R811r239M480J305k7649j3021J9625J2808j6289j53J7703j8366k8513
3005a9694J7012K1292J3971K4537J9571j2333m319m783J9060O796k8506j6664
2993C5940l2050k6246J7653J9938P369j1414J5694J0441J1811q412j5521j3260
$$ plain form
2981 11943 21634 2497 -23114 -7614 1577 -25301 -42651 15042 29226 13773 -1519 -45317
2969 -45317 -51273 -35546 -12937 -11406 -30746 2180 35482 17663 6106 21740 4316 -17874
2957 -17874 -1141 -15862 -8428 24554 32838 14958 -10258 -41075 -45999 -56817 -65958 -51505 559
2944 559 7453 -8087 -31710 -14617 16623 -9666 -8859 21822 14888 17744 6908 -7978 -13487
2931 -13487 -22195 -60558 -46584 -20562 6889 40584 40409 24673 -11571 -36771 -39722 -25851 -48330
2918 -48330 -54774 -31184 -11171 -6297 5642 14417 19948 19667 -1865 -15967 10824 23415 528
2905 528 -18887 15454 39387 58198 41871 14781 -11800 -15639 -7080 -15959 -16722 -30367 -29645 -5494
2891 -5494 23406 40208 14561 -9115 9416 13303 40214 53052 41869 5102 -53378 -79113
$$ packed form
2981A1943R691j9137k5611J5500R191k6878j7350N7693J4184j5453j5292m3798
2969d5317n956J5727K2609J531j9340L2926L3302j7819j1557J5634j7424k2190
2957a7874J6733j4721P434L2982Q284j7880k5216l0817m924j0818r141J4453N2064
2944E59O894j5540k3623J7093L1240k6289Q07L0681o934K856j0836j4886n509
2931a3487q708l8363J3974K6022K7451L3695j75j5736l6244k5200k951J3871k2479
2918d8330o444K3590K0013M874J1939Q775N531k81k1532j4102K6791J2591k2887
2905E28j9415L4341K3933J8811j6327k7090k6581l839Q559q879p63j3645P22K4151
2891e494K8900J6802k5647k3676J8531L887K6911J2838j1183l6767n8480k5735
$$ plain form
2879 -79113 -77280 -39115 -28965 -53619 -64285 -38358 -22089 -37171 -7615 -13481 -23408 -34882
2867 -34882 -45785 -43750 -24538 -25977 -22658 -825 8494 -1391 -42159 -26025 346 -12815 -35131
2854 -35131 -8730 -19720 -9369 -10209 -1513 -2506 -19538 -46564 -48461 -21380 10356 44896 50664
2841 50664 41534 -3430 -29612 -26183 -16957 -12569 -26017 -25423 -20502 2474 24962 36273 52835
$$ packed form
2879g9113J833L8165J0150k4654j0666K5927J6269j5082K9556n866r927j1474
2867c4882j0903K035J9212j439L319K1833R319r885m0768J6134K6371j3161k2316
2854c5131K6401j0990J0351q40Q696r93j7032k7026j897K7081L1736L4540N768
2841E0664r130m4964k6182L429R226M388j3448N94M921K2976K2488J1311J6562
$$ [...]
##END NTUPLES=NMR SPECTRUM
##END=
