##TITLE=Analysis number 312174
Compound Code cc 30046
Book Reference 378/152/7
Project Code adrs
Chemist Name benw
##JCAMPDX= 6.0         $$ Bruker NMR JCAMP-DX V2.0
##DATA TYPE= NMR SPECTRUM
##DATA CLASS= NTUPLES
##ORIGIN= Bruker BioSpin GmbH
##OWNER= NMR
$$ XWIN-NMR		Version 3.5
$$ Tue Jul 26 15:52:37 2005 GMT Daylight Time (UT+1h)  MAYBRIDGE\NMR@NMR_250MHZ
##.OBSERVE FREQUENCY= 250.131544655141
##.OBSERVE NUCLEUS= ^1H
##.ACQUISITION MODE= SIMULTANEOUS (DQD)
##.ACQUISITION SCHEME= undefined
##.AVERAGES= 16
##.DIGITISER RES= 18
##SPECTROMETER/DATA SYSTEM= dpx250
##.PULSE SEQUENCE= zg30
##.SOLVENT NAME= CDCl3
##.SHIFT REFERENCE= (INTERNAL, CDCl3, 0, 16.4519)
##AUDIT TRAIL= $$ (NUMBER, WHEN, WHO, WHERE, WHAT)
$$ ##TITLE= Audit trail, XWIN-NMR		Version 3.5
$$ ##JCAMPDX= 5.01
$$ ##ORIGIN= Bruker BioSpin GmbH
$$ ##OWNER= NMR
$$ C:\u/data/dgb/nmr/ADRS/6660/pdata/1/auditp.txt
$$ ##AUDIT TRAIL=  $$ (NUMBER, WHEN, WHO, WHERE, WHAT)
(   1,<2005-07-26 15:52:04.43 +100>,<MAYBRIDGE\NMR>,<NMR_250MHZ>,
      <created by zg, POWCHK disabled, PULCHK disabled
       configuration hash MD5:
       62 19 C7 07 E1 42 D1 B7 37 6C 3D D0 77 39 F9 E6
       data hash MD5: 64K
       E5 A0 73 60 6A 0D 17 99 79 0E 4D 02 7E F9 71 53>)
(   2,<2005-07-26 15:52:21.05 +100>,<MAYBRIDGE\NMR>,<NMR_250MHZ>,
      <Start of raw data processing
       ef LB = 0.3 FT_mod = 6 PKNL = 1 SI = 32K 
       data hash MD5: 32K
       D3 C4 F2 E3 88 37 00 E4 50 62 2A F1 47 2F 75 4C>)
(   3,<2005-07-26 15:52:23.21 +100>,<MAYBRIDGE\NMR>,<NMR_250MHZ>,
      <apk 
       data hash MD5: 32K
       CE 12 30 B8 5C 37 9D 90 F2 AE FE DA 87 B3 2B 63>)
(   4,<2005-07-26 15:52:24.14 +100>,<MAYBRIDGE\NMR>,<NMR_250MHZ>,
      <abs ABSG = 5 
       data hash MD5: 32K
       32 5E 0B EF D1 17 2A C3 03 6A E9 72 70 CD 1B E8>)
$$ ##END=
$$ 
$$ hash MD5
$$ 39 89 9D C6 1F 95 9E 5F 57 1B B1 CA 37 0B 24 74
##$RELAX= 
##$RELAX= 
##$RELAX= 
##$RELAX= 
##$RELAX= 
##$RELAX= 
##$RELAX= 
$$ Bruker specific parameters
$$ --------------------------
##$DU= <C:\u>
##$EXPNO= 6660
##$NAME= <ADRS>
##$PROCNO= 1
##$TYPE= <nmr>
##$USER= <dgb>
##$AMP= (0..31)
100 100 100 100 100 100 100 100 100 100 100 100 100 100 100 100 100 100 
100 100 100 100 100 100 100 100 100 100 100 100 100 100 
##$AQSEQ= 0
##$AQ_mod= 3
##$AUNM= <au_zg>
##$AUTOPOS= <54 >
##$BF1= 250.13
##$BF2= 250.13
##$BF3= 250.13
##$BF4= 250.13
##$BF5= 500.13
##$BF6= 500.13
##$BF7= 500.13
##$BF8= 500.13
##$BYTORDA= 1
##$CFDGTYP= 0
##$CFRGTYP= 5
##$CHEMSTR= <none>
##$CNST= (0..31)
1 1 145 1 1 1 1 1 1 1 1 1 1 1 1 1 1 1 1 1 1 1 1 1 1 1 1 1 1 1 1 1 
##$CPDPRG= <>
##$CPDPRG1= <>
##$CPDPRG2= <>
##$CPDPRG3= <>
##$CPDPRG4= <mlev>
##$CPDPRG5= <mlev>
##$CPDPRG6= <mlev>
##$CPDPRG7= <mlev>
##$CPDPRG8= <mlev>
##$CPDPRGB= <>
##$CPDPRGT= <>
##$D= (0..31)
0 1 0 0 0 0 0 0 0 0.06 0 0 0 0 0 0 0.0002 0 0 0 0 0 0 0 0 0 0 0 0 0 0 
0 
##$DATE= 1122389523
##$DBL= (0..7)
120 120 120 120 120 120 120 120 
##$DBP= (0..7)
150 150 150 150 150 150 150 150 
##$DBP07= 0
##$DBPNAM0= <>
##$DBPNAM1= <>
$$ [...]
##$SUBNAM7= <"">
##$SUBNAM8= <"">
##$SUBNAM9= <"">
##$SW= 20.6930455092707
##$SWIBOX= (0..15)
0 0 3 0 0 0 0 0 0 0 0 0 0 0 0 0 
##$SW_h= 5175.983436853
##$TD= 65536
##$TD0= 1
##$TE= 296.16
##$TE2= 300
##$TE3= 300
##$TEG= 300
##$TL= (0..7)
0 120 120 120 120 120 120 120 
##$TP= (0..7)
150 150 150 150 150 150 150 150 
##$TP07= 0
##$TPNAME0= <>
##$TPNAME1= <>
##$TPNAME2= <>
##$TPNAME3= <>
##$TPNAME4= <>
##$TPNAME5= <>
##$TPNAME6= <>
##$TPNAME7= <>
##$TPOAL= (0..7)
0.5 0.5 0.5 0.5 0.5 0.5 0.5 0.5 
##$TPOFFS= (0..7)
0 0 0 0 0 0 0 0 
##$TUNHIN= 0
##$TUNHOUT= 0
##$TUNXOUT= 0
##$USERA1= <user>
##$USERA2= <user>
##$USERA3= <user>
##$USERA4= <user>
##$USERA5= <user>
##$V9= 5
##$VALIST= <valist>
##$VCLIST= <CCCCCCCCCCCCCCC>
##$VD= 0
##$VDLIST= <DDDDDDDDDDDDDDD>
##$VPLIST= <PPPPPPPPPPPPPPP>
##$VTLIST= <TTTTTTTTTTTTTTT>
##$WBST= 1024
##$WBSW= 4
##$XGAIN= (0..3)
0 0 0 0 
##$XL= 0
##$YL= 0
##$YMAX_a= 398764
##$YMIN_a= -556692
##$ZGOPTNS= <>
##$ZL1= 120
##$ZL2= 120
##$ZL3= 120
##$ZL4= 120
##$ABSF1= 16.45189
##$ABSF2= -4.241282
##$ABSG= 5
##$ABSL= 3
##$ALPHA= 0
##$AQORDER= 0
##$ASSFAC= 0
##$ASSFACI= 0
##$ASSFACX= 0
##$ASSWID= 0
##$AUNMP= <proc_1d>
##$AZFE= 0.1
##$AZFW= 0.1
##$BCFW= 0
##$BC_mod= 0
##$BYTORDP= 0
##$COROFFS= 0
##$CY= 12.5
##$DATMOD= 1
##$DC= 0
##$DFILT= <>
##$DTYPP= 0
##$F1P= 14.0000005364418
##$F2P= -0.99999901652339
##$FCOR= 0.5
##$FTSIZE= 32768
##$FT_mod= 6
##$GAMMA= 0
##$GB= 0
##$INTBC= 1
##$INTSCL= 1
##$ISEN= 128
##$LB= 0.3
##$LEV0= 0
##$LPBIN= 0
##$MAXI= 10000
##$MC2= 0
##$MEAN= 0
##$ME_mod= 0
##$MI= 0
##$NCOEF= 0
##$NC_proc= -3
##$NLEV= 6
##$NOISF1= 0
##$NOISF2= 0
##$NSP= 0
##$NTH_PI= 0
##$NZP= 0
##$OFFSET= 16.45189
##$PC= 1
##$PHC0= -80.30001
##$PHC1= 6.377651
##$PH_mod= 1
##$PKNL= yes
##$PPARMOD= 0
##$PSCAL= 4
##$PSIGN= 0
##$REVERSE= no
##$SF= 250.130017534357
##$SI= 32768
##$SIGF1= 0
##$SIGF2= 0
##$SINO= 400
##$SIOLD= 32768
##$SREGLST= <1H.CDCl3>
##$SSB= 0
##$STSI= 32768
##$STSR= 0
##$SW_p= 5175.98343685301
##$SYMM= 0
##$S_DEV= 0
##$TDeff= 65536
##$TDoff= 0
##$TI= <Analysis number 999999
Compound Code 99
Book Reference 9
Project Code 9>
##$TILT= no
##$TM1= 0
##$TM2= 0
##$TOPLEV= 0
##$USERP1= <user>
##$USERP2= <user>
##$USERP3= <user>
##$USERP4= <user>
##$USERP5= <user>
##$WDW= 1
##$XDIM= 32768
##$YMAX_p= 530210148
##$YMIN_p= -83057
$$ End of Bruker specific parameters
$$ ---------------------------------
##NTUPLES= NMR SPECTRUM
##VAR_NAME=  FREQUENCY,     SPECTRUM/REAL,   SPECTRUM/IMAG
##SYMBOL=    X,             R,               I
##VAR_TYPE=  INDEPENDENT,   DEPENDENT,       DEPENDENT
##VAR_FORM=  AFFN,          ASDF,            ASDF
##VAR_DIM=   32768,         32768,           32768
##UNITS=     HZ,            ARBITRARY UNITS, ARBITRARY UNITS
##FACTOR=    0.157963299565203, 1,           1
##FIRST=     4115.11177065488, 0,            0
##LAST=      -1060.87166619813, 0,           0
##MIN=       -1060.87166619813, -83057,      0
##MAX=       4115.11177065488, 530210148,    0
$$ Real data points
##PAGE= N=1
##DATA TABLE= (X++(R..R)), XYDATA
$$ [...]
14733C6439j6021q363p899k1048K0463K1735k0943L669Q104q732J4700R311m612
$$ 36439 20418 12055 4156 -16892 3571 25306 4363 8032 16136 7404 22104 31415 26803
14720B6803k4163j2194N491j9514p111N596j0419m263n395K816L760n30J3872
$$ 26803 2640 -9554 -4063 -23577 -30688 -25092 -35511 -39774 -45169 -42353 -38593 -39123 -25251
14707b5251J1670m55p071J3383P80k735J057L1516M546J0774k3704j8809J842
$$ -25251 -13581 -14036 -21107 -7724 -6944 -9679 -8622 22894 27440 38214 14510 -4299 -2457
14694b457q275r439J711q404l409R570M895k330P08n617P549J2550M35j0276l058
$$ -2457 -10732 -20171 -18460 -26864 -30273 -20703 -15808 -18138 -17430 -23047 -15498 -2948 -2513 -12789 -15847
14679a5847N607n929k1000K297J3369N900j78q47j1578j1117J0769N083J8405
$$ -15847 -10240 -16169 -37169 -34872 -21503 -15603 -15781 -16628 -28206 -39323 -28554 -23471 -5066
14666e066o818k906J1640J7977k2658j3690m81j4811K4798K0530j1282K522J0472
$$ -5066 -11884 -14790 -3150 14827 -7831 -21521 -22002 -36813 -12015 8515 -2767 -245 10227
14653A0227l908Q650K56J8102K05R320n761p122j5282J0684m856p589k5515j9401
$$ 10227 6319 14969 15225 33327 33532 42852 37091 29969 14687 25371 20515 12926 -12589 -31990
14639c1990m642K7349K1814n201P473M342R493p54k0712P155J824j8293j7194
$$ -31990 -36632 -9283 12531 7330 14803 19145 28638 27884 7172 14327 16151 -2142 -19336
14626a9336M004J8602n200j108P317j8589R361N390j574k2092q412J0189m019
$$ -19336 -15332 3270 -1930 -3038 4279 -14310 -4949 441 -1133 -23225 -31637 -21448 -25467
14613b5467q567J0138o64R829O680J5203L0240J2972k1007j2999j446L317j4035
$$ -25467 -34034 -23896 -24560 -14731 -8051 7152 37392 50364 29357 16358 14912 18229 4194
14600D194M81j6608K433P64R005k0388o920K4604K2096j857N991J243j7042j8776
$$ 4194 4675 -11933 -9500 -8736 269 -20119 -27039 -2435 19661 17804 23795 25038 7996 -10780
14586a0780o603P047K813j4805n768J7799L7667j4622j641l6420j8913L3956N507
$$ -10780 -17383 -10336 -7523 -22328 -28096 -10297 27370 12748 11107 -25313 -44226 -10270 -4763
14573d763j1330j9235j7511K0853J109O850J7141J6917J3130j5486Q0n308k066
$$ -4763 -16093 -35328 -52839 -31986 -30877 -24027 -6886 10031 23161 7675 7755 2447 381
14560C81J2658m857J0448M529Q249j2429n1158J4286p157J2827R700L354J2269
$$ 381 13039 8182 18630 23159 31408 18979 -32179 -17893 -25050 -12223 -2523 831 13100
14547A3100j7900k8476j5948O587Q969J3965J6415J3391K432j6510m0096j0697
$$ 13100 -4800 -33276 -49224 -42637 -33668 -19703 -3288 10103 12535 -3975 -44071 -54768
14535e4768j6925Q996o256L081K2194L5749K2719r380q719j791l377j317j2764
$$ -54768 -71693 -62697 -68953 -65872 -43678 -7929 14790 5410 -3309 -5100 -8477 -9794 -22558
14522b2558j0081K7406O287J0053N976j5474j7344n396m138q936P09R844L5587
$$ -22558 -32639 -5233 1054 11107 17083 1609 -15735 -21131 -25269 -34205 -33496 -23652 11935
14509A1935M684P3k446J2059j5105L080R829j7655R190m645M416N737k5998k241
$$ 11935 16619 16692 14246 26305 11200 14280 24109 6454 15644 10999 15415 21152 -4846 -7087
14495g087l436L0893j7757j5403J6297m613j8256J7116K526j8079l3188j0988
$$ -7087 -10523 20370 2613 -12790 3507 -1106 -19362 -2246 280 -17799 -50987 -61975
14483f1975K581K6455K9457o334n879o199J6282L851l367q735o397r259j6704
$$ -61975 -59394 -32939 -3482 -9816 -15695 -21894 -5612 -1761 -5128 -13863 -20260 -29519 -46223
14470d6223J8137J0281k3454L165K8852L475m839K8496R688l1403k2289J100m453
$$ -46223 -28086 -17805 -41259 -38094 -9242 -5767 -10606 17890 27578 -3825 -26114 -25014 -29467
14457b9467m488j2431m467K3954K2525R004q358j6090M501K145k0815k785K2434
$$ -29467 -33955 -46386 -50853 -26899 -4374 4630 -3728 -19818 -15317 -13172 -33987 -36772 -14338
14444a4338K2845Q138R55L898j0251m863p953j1791O132L029j4467L2807J0287
$$ -14338 8507 16645 17600 21498 11247 6384 -1569 -13360 -7228 -4199 -18666 14141 24428
14431B4428k746Q498j6513k2281p163m584j950L935K721O009K2835R293j1751
$$ 24428 21682 30180 13667 -8614 -15777 -20361 -22311 -18376 -15655 -9646 13189 22482 10731
14418A0731K27J493Q121j1087J7496p3j3392j1160j0770K950j3664N315M2826
$$ 10731 10958 12451 20572 9485 26981 26908 13516 2356 -8414 -5464 -19128 -13813 29013
14405B9013k175n947o237k5351k4340O608j18k0192N283L7741J2449k584P929
$$ 29013 26838 20891 14654 -10697 -35037 -28429 -28547 -48739 -43456 -5715 6734 4150 12079
14392A2079j0415j1299m853p658J4007r297n983r903R994J0859J8545M115k5911
$$ 12079 1664 -9635 -14488 -22146 -8139 -17436 -23419 -33322 -23328 -12469 6076 10191 -15720
14379a5720J8400J3776j2253p881k8686m361K4792L0790K323j0143J3044K494
$$ -15720 2680 16456 4203 -3678 -32364 -36725 -11933 18857 21180 11037 24081 26575
14367B6575J3578m839m090L230J606j0586m47k9347k3187J2190L9584k8181k2141
$$ 26575 40153 35314 31224 34454 36060 25474 25027 -4320 -27507 -15317 24267 -3914 -26055
14354b6055K8642J5998l743j0837l041p231K138J4468j6800k1359n774p42J9523
$$ -26055 2587 18585 14842 4005 964 -6267 -4129 10339 -6461 -27820 -33594 -34336 -14813
14341a4813j7973J9595Q921j3859n368J9335J2599j1942N550O394J9177k0507
$$ -14813 -32786 -13191 -4270 -18129 -23497 -4162 8437 -3505 2045 8439 27616 7109
14329G109j2376k9585j4676k45J1462J4007J8634k3983j0490J5892N500N602K1607
$$ 7109 -5267 -34852 -49528 -49773 -38311 -24304 -5670 -29653 -40143 -24251 -18751 -13149 8458
14316H458J0439L144L636k0803J837o621o06J2711j731P353l568J308j9511l3808
$$ 8458 18897 22041 25677 4874 6711 90 -516 12195 10464 17817 14249 15557 -3954 -37762
14302c7762J1711K7552P202j7216j6102r063R817k683L25m583n188R677J8657
$$ -37762 -26051 1501 8703 -8513 -24615 -33678 -23861 -26544 -26219 -30802 -35990 -26313 -7656
14289g656J6706m227L656N423q337k2197K396J2022K913J8367J7581R226k0047
$$ -7656 9050 4823 8479 13902 5565 -16632 -14236 -2214 699 19066 36647 45873 25826
14276B5826O06j2958k7505k4998j0865J1429Q314J0948K1769Q575J5631N651n242
$$ 25826 26432 13474 -14031 -39029 -49894 -38465 -30151 -19203 2566 11141 26772 32423 27181
14263B7181n190j5833o954r370j9214J290M078M388O786L107L334p488m730j0211
$$ 27181 21991 6158 -796 -10166 -29380 -28090 -24012 -19624 -12838 -9731 -6397 -13885 -18615 -28826
14249b8826K0264J436J0872m168r284j9330o708J5902K3580J592j0142J9585J1036
$$ -28826 -8562 -7126 3746 -422 -9706 -29036 -35744 -19842 3738 5330 -4812 14773 25809
14236B5809P462j6032k2697J7584m839p033K0368l109M048J9854O533o052j7721
$$ 25809 33271 17239 -5458 12126 7287 254 20622 17513 21561 41415 47948 41896 24175
14223B4175r510r749k251k53j2086J1194K9275L344N799l0981R781P363J0752
$$ 24175 14665 4916 2665 2412 -9674 1520 30795 34139 39938 8957 18738 26101 36853
14210C6853k386k4697k033J019j3282K142J772L930l685q38j5264K782m938Q915
$$ 36853 34467 9770 7737 8756 -4526 -2384 -612 3318 -367 -1205 -16469 -13687 -18625 -9710
14196i710j6898J3047p866Q500K32K0084R59k5135J2971J124j4492R414J4945
$$ -9710 -26608 -13561 -21427 -12927 -12695 7389 8348 -16787 -3816 -2692 -17184 -7770 7175
14183G175j5689j5069J3307K3894K188J8551k787m978r161j2815O069P776j5500
$$ 7175 -8514 -23583 -10276 13618 15806 34357 31570 26592 17431 4616 10685 18461 2961
14170B961j6326k893j1036k8932K2743J9440K1806q295P131K2420q830j0454J7193
$$ 2961 -13365 -16258 -27294 -56226 -33483 -14043 7763 -532 6599 29019 20189 9735 26928
14157B6928K347r513n06j6774J102J4038l100l365m618m274j1364m169L14l142
$$ 26928 29275 19762 19256 2482 3584 17622 14522 11157 6539 2265 -9099 -13268 -12954 -16096
14143a6096r40K1380P128l432o091K303N8K994r699K6082J7302l5130k7295J1922
$$ -16096 -17036 4344 11472 8040 1949 4252 4310 7304 -2395 23687 40989 5859 -21436 -9514
14129i514J8496J0815k162k4784M834O038k1769J603k652R201J1452M675L466
$$ -9514 8982 19797 17635 -7149 -2315 3723 -18046 -16443 -19095 -9894 1558 6233 9699
14116I699K7825J4614l1258m416o81J1071j1896j3255j9278l707n691j1730l017
$$ 9699 37524 52138 20880 16464 15783 26854 14958 1703 -17575 -21282 -26973 -38703 -41720
14103d1720J352J9920K2236R100n659P036K107n45k752N579K623J4271M668m981
$$ -41720 -40368 -20448 1788 10888 5229 12265 14372 13827 11075 16654 19277 33548 38216 33235
14089C3235k1717l5782n438L752R484J4191L598J1344l493j0674o672R327j455
$$ 33235 11518 -24264 -29702 -25950 -16466 -2275 1323 12667 9174 -1500 -8172 1155 -300
14076c00o233j1421K083J1752o739Q085M400J597J3939r3k0162m387R790l529
$$ -300 -6533 -17954 -15871 -4119 -10858 -2773 1627 3224 17163 17070 -3092 -7479 2311 -1218
14062a218j2262j4016r170J4231J2853J6192P93q191j1677J2690J1321J523j7032
$$ -1218 -13480 -27496 -36666 -22435 -9582 6610 7403 -788 -12465 225 11546 13069 -3963
14049c963J0557o487J169r92R5J8207R851j3318J8293K30j8357k311K618J4042
$$ -3963 6594 107 1276 284 379 18586 28437 15119 33412 33642 15285 12974 15592 29634
14035B9634j9424j185n931j0818k9473j2373K0770L2334j2791j6442j6878J2445
$$ 29634 10210 9025 3094 -7724 -37197 -49570 -28800 3534 -9257 -25699 -42577 -30132
14023c0132J5112j5334r187l751j0335j924K1027K7345j2238L455k864n489k5910
$$ -30132 -15020 -30354 -39541 -43292 -53627 -55551 -34524 -7179 -19417 -15962 -18826 -24315 -50225
14010e0225P82K2951N169O101l79P395K7285O622o995j5751m179K875K8274l894
$$ -50225 -49443 -26492 -21323 -15222 -15601 -8206 19079 25701 18706 2955 -1224 1651 29925 26031
13996B6031j5955j5808j0881r55K2980K00j0624J0078n599j8144j8212o743J0370
$$ 26031 10076 -5732 -16613 -17568 5412 5612 -5012 5066 -533 -18677 -36889 -43632 -33262
13983c3262K1300M916J1981p827J411j4757J8394R56j9267J1003q109j4497N660
$$ -33262 -11962 -7046 4935 -2892 -1481 -16238 2156 3112 -16155 -5152 -13261 -27758 -22098
13970b2098J0766L362L220j006q139O804J7291j1257k1526J746J6783J8275J7611
$$ -22098 -11332 -7970 -4750 -5756 -13895 -7091 10200 -1057 -22583 -20837 -4054 14221 31832
13957C1832j6858j6124J6565j36l655j2716j2371j314M121J7080r841o584j7155
$$ 31832 14974 -1150 15415 15279 11624 -1092 -13463 -14777 -10656 6424 -3417 -10001 -27156
13944b7156J4111J1976k2239n223k260J2864J1461j1691L25K0436J7324J1131
$$ -27156 -13045 -1069 -23308 -28531 -30791 -17927 -6466 -18157 -17832 2604 19928 31059
13932C1059j5677n142M377J278R265m596P400q344p246L150j157J2028Q91j2365
$$ 31059 15382 10240 14617 15895 25160 20564 27964 19620 12374 15524 14367 26395 27286 14921
13918A4921n221j9257J0209J4808P824k2749j9861K3190K6157O367K4597M650
$$ 14921 9700 -9557 652 15460 23284 535 -19326 3864 30021 36388 60985 65635
13906F5635k9780l6422L388J5623L06R673N084K853N568M047J9767J9236K9458
$$ 65635 35855 -567 2821 18444 18750 28423 33507 36360 41928 45975 65742 84978 114436
13893A14436M5059L5122M5248N478J7103M408j1296k8189m972j5676k5357j9562
$$ 114436 159495 194617 239865 245343 262446 266854 255558 227369 222397 206721 181364 161802
13881A61802j6860m5452m6325j6268j8821L133p236j7697P372J4448m301P94L266
$$ 161802 144942 99490 53165 36897 18076 21209 13973 -3724 3648 18096 13795 14589 17855
13868A7855O664j0960k7937K342m070J5001J8588P110n93k125J2132J6616j3114
$$ 17855 24519 13559 -14378 -12036 -16106 -1105 17483 24593 24000 21875 34007 50623 37509
13855C7509j2360j1378N85J0754J7971J445k9540j3606p362r145M024J9330n921
$$ 37509 25149 13771 14356 25110 43081 44526 14986 1380 -5982 -15127 -11103 8227 2306
13842B306j8311j2536N302j7765J6456R184P666k2724P082Q310K1186J6079j969
$$ 2306 -16005 -28541 -23239 -41004 -24548 -15364 -7698 -30422 -23340 -15030 6156 22235 20266
13829B0266J448O449n464l394P517r153j3176k7186L734L901p469k8344K4634
$$ 20266 21714 28163 22699 19305 26822 17669 4493 -22693 -18959 -15058 -22527 -50871 -26237
13816b6237K9249Q123p432O131J0529j3997j7371j6509K8298R668N867K792j3601
$$ -26237 3012 11135 3703 9834 20363 6366 -11005 -27514 784 10452 16319 19111 5510
13803E510k105q766m484J2020Q494k3734q817J0896J1032j433L866J8219J9233
$$ 5510 3405 -5361 -9845 2175 10669 -13065 -21882 -10986 46 -1387 2479 20698 39931
13790C9931j9989j1189J1998J399K6531L2665j4587j5508j7573n607j2481M154
$$ 39931 19942 8753 20751 22150 48681 81346 66759 51251 33678 28071 15590 19744
13778A9744M928J2037l947k3868O019L723k9038l5373p901M5073J9704o581j3136
$$ 19744 24672 36709 32762 8894 14913 18636 -10402 -45775 -53676 -8603 11101 4520 -8616
13765h616j0820R4J5142J9732j137K957l760l6891o541K3859R665l48K722Q999
$$ -8616 -19436 -19342 -4200 15532 14395 17352 13592 -23299 -29840 -5981 3684 3336 6058 15057
13751A5057q953N466j3869j739J625j9299j3411K277J0991J6536R0n756K740K704
$$ 15057 6104 11570 -2299 -4038 -2413 -21712 -35123 -32846 -21855 -5319 -5229 -10985 -8245 -5541
13737e541K0382J3372j6830p335j6311Q69J1926r105q251J7960l288j1469j1818
$$ -5541 14841 28213 11383 4048 -12263 -11394 532 -8573 -16824 1136 -2152 -13621 -25439
13724b5439J2254K0989p409n931J2940K8735j1521m5080j8157K9365J2061M607
$$ -25439 -13185 7804 395 -5536 7404 36139 24618 -20462 -38619 -9254 2807 7414
13712G414Q367n831m057J0286R801q348l2638k3802K1545K3980k196r214p907
$$ 7414 15781 9950 5893 16179 25980 17632 -15006 -38808 -17263 6717 4521 -4693 -12600
13699a2600r110P185J6475J7461Q503J8770p248l9209M784o952j4571J3019j161
$$ -12600 -21710 -14525 1950 19411 27914 46684 39436 227 5011 -1941 -16512 -3493 -4654
13686d654O768j9198J474l214J8282l45j1515j1330L562Q936P514J7696J9153
$$ -4654 2114 -17084 -15610 -18824 -542 -887 -12402 -23732 -20170 -11234 -3720 13976 33129
13673C3129k580M31o195K270R43j2087N060L656J4628j0873L941K6220r1j3728
$$ 33129 30549 30980 24785 27055 27998 15911 20971 24627 39255 28382 32323 58543 58452 44724
13659D4724j0149J0403k565k9693j9152n243j1261P032m011N302r27K1241K6283
$$ 44724 34575 44978 42413 12720 -6432 -11675 -22936 -15904 -19915 -14613 -15540 5701 31984
13646C1984M738k380J23J2903p657k2619l722j2780j8722m03r945j2557M337O022
$$ 31984 36722 34342 34465 47368 39711 17092 13370 590 -18132 -18535 -28480 -41037 -36700 -30678
13632c0678L1534L0222m479K908K4839k843m492M579k2731l7165J5045M3582N344
$$ -30678 856 31078 26599 29507 54346 51503 47011 51590 28859 -8306 6739 50321 55665
13619E5665j7450l303L838r438k7872o878J6021J9079J5402O378j065r197k3136
$$ 55665 38215 34912 38750 29312 1440 -5438 10583 29662 45064 51442 50377 41180 18044
13606A8044j2057k1151k343J0470L348J0801Q61k042J2395P455J867j5866o61
$$ 18044 5987 -15164 -17507 -7037 -3689 7112 7973 5931 18326 25781 27648 11782 11121
13593A1121q71N054O722O263N602K108l778q501M268M980j9263l786J1635J2132
$$ 11121 10250 15304 22026 28289 33891 35999 32221 23720 27988 32968 13705 9919 21554 33686
13579C3686P667j3075k3018l046n525j977N606Q288M651k5611P280L8242J4779
$$ 33686 41353 28278 5260 2214 -3311 -5288 318 8606 13257 -12354 -5074 33168 47947
13566D7947j7439K621j608r905j2999l628q802K3697r659J7632j9572j639J8687
$$ 47947 30508 33129 31521 21616 8617 4989 -3813 19884 10225 27857 8285 6646 25333
13553B5333J8351j823k704j6405j1865k884j880J9381q338j0446L980J1807k3135
$$ 25333 43684 41861 39157 22752 10887 8003 6123 25504 17166 6720 10700 22507 -628
13540f28o930R269l377O944m452m584j0639J3988K7446J0606J370k3909J3815
$$ -628 -7558 1711 -1666 5278 826 -3758 -14397 -409 27037 37643 39013 15104 28919
13527B8919O04k2541n571j3674j9201O219L782Q431m431r243M595Q144m557O75
$$ 28919 29523 6982 1411 -12263 -31464 -25245 -21463 -13032 -17463 -26706 -22111 -13967 -18524 -17849
13513a7849j6818l864J7174O345j9882J4836K1916k778m387q382l605J0978r913
$$ -17849 -34667 -38531 -21357 -15012 -34894 -20058 1858 -920 -5307 -13689 -17294 -6316 -16229
13500a6229j2577M685J2092J7565J6278r109p144J2753J1523k0030r949j3653
$$ -16229 -28806 -24121 -12029 5536 21814 12705 5561 18314 29837 9807 -142 -13795
13488a3795J0825O18j0724J7452J0163j1636J0251k336L401L3306l319l209j0708
$$ -13795 -2970 -2352 -13076 4376 14539 2903 13154 10818 14219 47525 44206 40997 30289
13475C0289j9623M66q71R636r443r399o252N46R109r02j291K7213K6741n922l3168
$$ 30289 10666 11132 10261 19897 10454 1055 -5197 -4651 4458 3556 2265 29478 56219 50297 17129
13460A7129p609o464k1154M373K1238j2509k652p81l942R164J897k98J8468L1442
$$ 17129 9520 3056 -18098 -13725 7513 -4996 -7648 -8429 -12371 -3207 -1310 -1608 16860 48302
13446D8302P01r750l4085j9510m224J9103K4704j7646k786O448J0009J2583M962
$$ 48302 49003 39253 5168 -14342 -18566 537 25241 7595 4809 11257 21266 33849 38811
13433C8811K647q339j3638m186j4677j272J6857j116J1841R448R028r487k9407
$$ 38811 41458 33119 19481 15295 618 -654 16203 15087 26928 36376 45404 35917 6510
13420F510L293J1244K973Q652j2819l2785j3813J2685M669J3687r412N074M657
$$ 6510 9803 21047 24020 32672 19853 -12932 -26745 -14060 -9391 4296 -5116 -42 4615
13407D615j700P661o004j4688q403n24n581K9799K0520J39k0671J2634K4310R772
$$ 4615 2915 10576 4572 -10116 -18519 -19043 -24624 5175 25695 25834 5163 17797 42107 51879
13393E1879J3280k2088m4662l168J2016K7711p400R061J6548r021o667j9073j1694
$$ 51879 65159 43071 -1591 -4759 7257 34968 27568 36629 53177 44156 37489 18416 6722
13380F722K720L672J6938k604J930j7857k7746r570K0604M2751M763k423l862
$$ 6722 9442 13114 30052 27448 29378 11521 -16225 -25795 -5191 37560 42323 39900 36038
13367C6038k770M08m752k2092k6292K3153L1377p262j0516o620J0346J5266L291
$$ 36038 33268 33676 28924 6832 -19460 3693 35070 27808 17292 10672 21018 36284 39575
13354C9575m111k0804k5859k802J1749L4903j0601j3702j0918J050J59P752o259
$$ 39575 35464 14660 -11199 -14001 -2252 32651 22050 8348 -2570 -1520 -1361 6391 132
13341A32J9815J7858K711j7334j3622K509J8473n627l282j562k1471k3395j2608
$$ 132 19947 37805 40516 23182 9560 12069 30542 24915 21633 20071 -1400 -24795 -37403
13328c7403j0085J6623K8396O444J102m844j4704J1858K2230j3522N983o98m332
$$ -37403 -47488 -30865 -2469 3975 5077 233 -14471 -2613 19617 6095 12078 11380 7048
13315G048l921N805J1717p210M478J2960j7267N030j1914k5397j7691Q045M8696
$$ 7048 3127 8932 20649 13439 17917 30877 13610 18640 6726 -18671 -36362 -28317 20379
13302B0379K8753k3227j2156J0907L03j6615j8684p997J0771r246L426K3464K20
$$ 20379 49132 25905 13749 24656 24959 8344 -10340 -18337 -7566 -16812 -13386 10078 10298
13289A0298L533j3064J2643J0542q825o141m47J0095k0409n225J8041N909L969
$$ 10298 13831 767 13410 23952 15127 8986 8539 18634 -1775 -7000 11041 16950 20919
13276B0919m777J8776J972j6276J217M330J1285j2699q648p959J1885n169k7196
$$ 20919 16142 34918 36890 20614 21831 26161 37446 24747 16099 8140 20025 14856 -12340
13263a2340O547Q757m902j238M787j4534J3021K6473m495j6392K2327J7211j6112
$$ -12340 -5793 2964 -1938 -3176 1611 -12923 98 26571 22076 5684 28011 45222 29110
13250B9110j6278q401n072J238K0263O454j4855j8020j742J6166K0391J5064J726
$$ 29110 12832 4431 -641 597 20860 27314 12459 -5561 -7303 8863 29254 44318 46044
13237D6044p228j1792j3464L129J6837r159k4023j5678l495P551J43J8703L8088
$$ 46044 38816 27024 13560 16689 33526 24367 344 -15334 -18829 -11278 -11135 7568 45656
13224D5656n607j5020J4191J1111q80J2507j1972j5966n691j4067j3278J0820
$$ 45656 40049 25029 39220 50331 49451 61958 49986 34020 28329 14262 984 11804
13212A1804J7363q768j3001j0979M356L968j5220Q629L0695L960j3437K955J2692
$$ 11804 29167 20399 7398 -3581 775 4743 -10477 -1848 28847 32807 19370 22325 35017
13199C5017O642J3570n994k6475k7084o03n358Q818p714j1357m281K5319J7095
$$ 35017 41659 55229 49235 22760 -4324 -4927 -10285 -1467 -9181 -20538 -24819 500 17595
13186A7595J5441P104l585L386L05p464l8106l672o943K1369K2268L737k1861
$$ 17595 33036 40140 36555 39941 40246 32782 -5324 -8996 -15939 5430 27698 31435 9574
13173I574k0673j3898o571J7362L5460J024j4929M702O010J925K3595J584P205
$$ 9574 -11099 -24997 -31568 -14206 21254 22278 7349 12051 18061 19986 43581 45165 52370
13160E2370k285j6528n129j4493n351J0840O295N722r275Q502Q220K8533j0272
$$ 52370 50085 33557 28428 13935 8584 19424 25719 31441 22166 30668 38888 67421 57149
13147E7149k7893J3625o514l1430K117K38k137k886n319L236R758R613O658L643
$$ 57149 29256 42881 36367 4937 7054 7292 5155 2269 -3050 186 9944 19557 26215 29858
13133B9858l000p121j2043n734J1716n882j1772J6962J7951q97j1321r855j198
$$ 29858 26858 19737 7694 1960 13676 7794 -3978 12984 30935 30038 18717 8862 7664
13120G664j3314O51k965J2172r942K4702r00j7824j8103J5368J2209N129K1468
$$ 7664 -5650 -4999 -7964 4208 -5734 18968 18068 244 -17859 -2491 9718 14847 36315
13107C6315r093r740j8515o261J6360J6598k458R654m340j0186j1315j5785j045
$$ 36315 27222 17482 -1033 -7294 9066 25664 23206 32860 28520 18334 7019 -8766 -9811
13094i811J1343M520R377J9763m060m265q515j4877j7902K2319J3035J865J4483
$$ -9811 1532 6052 15429 35192 31132 26867 18352 3475 -14427 7892 20927 22792 37275
13081C7275J3979j381k7441k3551J4298J8655o959l158l015Q157J4098J5671j309
$$ 37275 51254 49873 22432 -1119 13179 31834 24875 21717 18702 26859 40957 56628 55319
13068E5319l5284j8475p869K6299L9071k3759j1095L212K400J5412l382j2758
$$ 55319 20035 1560 -6309 19990 59061 35302 24207 27419 29819 45231 41849 29091
13056B9091k9703J0161k192l46R85J8193K4671o415j0772j0062k2326j2938j650
$$ 29091 -612 9549 7357 7011 7996 26189 50860 44445 33673 23611 1285 -11653 -13303
13043a3303J4254r60K3469J3458m335j5706J898p292R843J5177K0248J3550J714
$$ -13303 951 -9 23460 36918 32583 16877 18775 11483 21326 36503 56751 70301 72015
13030G2015m286j6749k1464K0217k203j8729j6060l792p421J1344K3620p776J70
$$ 72015 67729 50980 29516 49733 47530 28801 12741 8949 1528 12872 36492 28716 28886
13017B8886n454J2453J5852N043j1269k2964J480J2006j4427N821K233j6723j2633
$$ 28886 23432 35885 51737 56780 45511 22547 24027 36033 21606 27427 29660 12937 304
13004C04J0263Q721J542J3100J2064k7001l18O72J7122k1103n316Q623K1064p237
$$ 304 10567 19288 20830 33930 45994 18993 18675 19347 36469 15366 10050 18673 39737 32500
12990C2500R464J338j1962J0551j3859j7614R958M121q301k3142O367N774K7974
$$ 32500 41964 43302 31340 41891 28032 10418 20376 24497 16196 -6946 -579 5195 33169
12977C3169J5570P638k2154p1J2830k2835k5744Q278K9308Q196M461r791j4374
$$ 33169 48739 56377 34223 34152 46982 24147 -1597 6681 35989 44185 48646 38855 24481
12964B4481j2591k801J7988J6175k5930n489M378o272m458M983j1778O476J4999
$$ 24481 11890 9089 27077 43252 17322 11833 16211 9939 5481 10464 -1314 5162 20161
12951B0161m863K0066m365j546l548J3520J7310j9767k3216o730j1398J408j723
$$ 20161 15298 35364 30999 29453 25905 39425 56735 36968 13752 7022 -4376 -2968 -4691
12938d691J5535J6497l816J2650O727j1598m215J8296K3877o628J5919j7725k9737
$$ -4691 10844 27341 23525 36175 42902 31304 27089 45385 69262 62634 78553 60828 31091
12925C1091J1609J1231j427K760l0845j6712L416r99J972j2649k6998K381L0052
$$ 31091 42700 53931 52504 55264 24419 7707 11123 10124 12096 -553 -27551 -25170 4882
12912D882K3463j2696O785J549L525K448j267j2666M013O532l495k653n197k2107
$$ 4882 28345 15649 22434 23983 27508 29956 28689 16023 20036 26568 23073 20420 15223 -6884
12898f884j90K5616L6225k8218k7424K1452L1172m894p433j7207R298J9650Q789
$$ -6884 -7074 18542 54767 26549 -875 20577 51749 46855 39422 22215 31513 51163 59952
12885E9952J3253K205l7558j6410J0426K6307J541j2107k1406n274O739K540J0814
$$ 59952 73205 75410 37852 21442 31868 58175 59716 47609 26203 20929 27668 30208 41022
12872D1022J1747M454K5696r291k7535k0886l1099j4286K234K6083J1985P330
$$ 41022 52769 57223 82919 73628 46093 25207 -5892 -20178 -17944 8139 20124 27454
12860B7454m009j5306Q96J1546J9343o147J949J0278j5993j971J0636L0732J9134
$$ 27454 23445 8139 9035 20581 39924 33777 35726 46004 30011 28040 38676 69408 88542
12847H8542K0400L0958J8326J0229Q046J9218K3162J3053K6954L2970M4818J253
$$ 88542 108942 139900 158226 168455 176501 195719 218881 231934 258888 291858 336676 337929
12835C37929Q652j4992j9652k0513m5921l9032l4827l7889k3891j1720j339J4467
$$ 337929 346581 331589 311937 291424 245503 206471 171644 133755 109864 98144 96805 111272
12823A11272K504k2750q338l2934p415M94J4544n133j6011J0504L5311K8968j2878
$$ 111272 113776 91026 82688 49754 42339 42833 57377 52244 36233 46737 82048 111016 98138
12810I8138k3437j244J1194j3812l295N292J372K7592j7542k6947k7943J4351
$$ 98138 74701 73457 84651 70839 67544 72836 74208 101800 84258 57311 29368 43719
12798D3719L6058J5037r109k632j420p240j629k2064j7516O041P035J476j330
$$ 43719 79777 94814 85705 83073 81653 74413 72784 50720 33204 39245 46280 47756 46426
12785D6426Q890k8039J2341M488L77j338o556O39p264k979R644L8951J2030R013
$$ 46426 55316 27277 39618 44106 44483 43145 36589 37228 29964 26985 36629 75580 87610 96623
12771I6623j9689j4156P506j0314p590j217J286P732J1984J1545J711n409J176
$$ 96623 76934 62778 70284 59970 52380 51163 52449 60181 72165 83710 85421 80012 81188
12758H1188j1504k4287l44J0038k3094K0980J3486k280Q277J9340K3385J9808
$$ 81188 69684 45397 45053 55091 31997 52977 66463 64183 72460 91800 115185 134993
12746A34993J6312j8507r968L2252K7601J7189K5378J0313j765k7075K582r767
$$ 134993 151305 132798 122830 155082 182683 199872 225250 235563 233798 206723 209305 199538
12734A99538j0670j3891k462N827K027j0951p070R750j3922O88K4689J4263K585
$$ 199538 188868 174977 172515 178342 180369 169418 162348 172098 158176 158864 183553 197816 200401
12721B00401q62K0041M837k0681n839j6696R261J5588M1017J2344j2664j6308
$$ 200401 199539 219580 224417 203736 197897 181201 190462 206050 247067 259411 246747 230439
12709B30439J720K8399M2257J5696k674l4879r535M391l604J4048P412p167k4429
$$ 230439 232159 260558 302815 318511 315837 280958 271423 275814 272210 286258 293670 286503 262074
12696B62074l5685m393J1163m237j6878O075J9562j2490k2671M944J389J7528
$$ 262074 226389 221996 233159 228922 212044 218119 237681 225191 202520 207464 208853 226381
12684B26381o783j8678j062L863j990J1550K1180K0445K7618K375K0806K2960
$$ 226381 219598 200920 199858 203721 201731 213281 234461 254906 282524 284899 305705 328665
12672C28665J0439q430l5046l1530k737n28k0311k7953k5394l2491k268j1656
$$ 328665 339104 330674 295628 264098 261361 260833 240522 212569 187175 154684 152416 140760
12660A40760k3035J6386j953p377J592k45Q327j8278k4282O815J520r817o403
$$ 140760 117725 134111 132158 124781 126373 126128 134455 116177 91895 98710 100230 90413 84010
12647H4010j2217J9173J0735n27k6448O845L215o548Q384J1274m444K90M288j7769
$$ 84010 71793 90966 101701 101174 74726 81571 84786 78238 86622 97896 93452 93742 98030 80261
12633H0261o43J1335R438m87M027L2709P275N673k018j246j1480o879m40q024
$$ 80261 79618 90953 100391 99904 103931 136640 143915 149588 147570 146324 134844 127965 127525 119501
12619A19501J2851K730j1249k2288j9126p169k9525N58L6637L747l689o193k016
$$ 119501 132352 135082 123833 101545 82419 75250 45725 46283 82920 86667 82978 76785 74769
12606G4769K9774J9601J674p740o946q343p740q380q107n409K687K2788J5101
$$ 74769 104543 124144 125818 118078 111132 102789 95049 86669 78562 73153 75840 98628 113729
12593A13729J5671j8554q938R64J7478J4471j4397k7489J099R1N29K0722J1514
$$ 113729 129400 110846 101908 102872 120350 134821 120424 92935 94034 94125 94654 115376 126890
12580A26890J2245M792Q16j6202j3997k472o905J679k989K361N841L503k667j2369
$$ 126890 139135 143927 144743 128541 114544 112072 105167 106846 103857 106218 112059 115562 112895 100526
12566A00526K1656J3983P519N619j14j1648J3471J2694L5105K1401M3826M1432
$$ 100526 122182 136165 143684 149303 149189 137541 151012 163706 198811 220212 264038 305470
12554C05470N294r603J395j5319j6836N343N263P994n633K1481K2675K2367R984
$$ 305470 310764 301161 302556 287237 270401 275744 281007 289001 283368 304849 327524 349891 359875
12541C59875j8576j3558j4476Q70J5671K9670n547k446L2354J8871L002J0552
$$ 359875 341299 327741 313265 314135 329806 359476 353929 351483 383837 402708 405710 416262
12529D16262l2450k3233q442J082O15n107k1638j1971n164L532P309M160M691
$$ 416262 383812 360579 352137 353219 353834 348727 327089 315118 309954 313486 320795 324955 329646
12516C29646L9363L2993J0409R809L2712j981k9764p490J7053k182j618R876K6706
$$ 329646 369009 402002 412411 422220 454932 452951 423187 415697 432750 430568 428950 438826 465532
12503D65532Q731J8370K310L0960K5252L9163K9457K4941J133J0815K0611q187
$$ 465532 474263 492633 494943 525903 551155 590318 619775 644716 645849 656664 677275 669088
12491F69088m3369k9930J6801J0622l8423j7806j9547q98O343J6347p841j0191
$$ 669088 625719 595789 612590 623212 584789 566983 547436 546538 552881 569228 561387 551196
12479E51196k498J1623M484q79M877J5264K2066L2158L6266J3726R935K1249J0974
$$ 551196 548698 560321 564805 563926 568803 584067 606133 638291 674557 688283 698218 719467 730441
12466G30441L68r87M4606L5204K6535L1972K6731K0869K7461M1934L4673M5149
$$ 730441 730809 729822 774428 809632 836167 868139 894870 915739 943200 985134 1019807 1064956
12454A064956L6142M5729P4419O2153P8183Q8938Q8786J18135J37605J48318J99332
$$ 1064956 1101098 1146827 1221246 1283399 1361582 1450520 1539306 1657441 1795046 1943364 2142696
12443B142696J86057K13357K73306L09748L55597M32592N09863N61454O12732
$$ 2142696 2328753 2542110 2815416 3125164 3480761 3913353 4423216 4984670 5597402
12434E597402O85284P70890Q58957R82657J166655J451434J901339K517210L355528
$$ 5597402 6282686 7053576 7912533 8895190 10061845 11513279 13414618 15931828 19287356
12425A9287356M404239N545886O557412P215310P314858O727160N322822L228260
$$ 19287356 23691595 29237481 35794893 43010203 50325061 57052221 62375043 65603303
12417F5603303O98299j924268m231943n984029p051005p377345o984027o137663
$$ 65603303 66301602 64377334 60145391 54161362 47110357 39733012 32748985 26611322
12409B6611322n105680m028415l053943k298474j711194j326228j064959r09983
$$ 26611322 21505642 17477227 14423284 12124810 10413616 9087388 8022429 7112446
12401G112446p53899o98443o36862n73069m93533m30072l63856k64497k49943
$$ 7112446 6358547 5660104 5023242 4450173 3956640 3526568 3162712 2898215 2648272
12392B648272k19967j72552j50741j55492j32916j10038p4253n1927m0715n1021
$$ 2648272 2428305 2255753 2105012 1949520 1816604 1706566 1632313 1580386 1539671 1488650
12382A488650l6667m8044n4943m0567o3273m9246n0289m7837l7042j9319k2910
$$ 1488650 1451983 1403939 1348996 1308429 1245156 1195910 1145621 1097784 1060742 1041423 1018513
12371A018513j9156P714k9352j3342P457o311j0417k9151M223J6863j2935K5176
$$ 1018513 999357 1007071 977719 964377 971834 965523 955106 925955 930178 947041 934106 959282
12359I59282L525M211L4682K9283J2461k204Q885K3871J4267M629R893J3366M605
$$ 959282 962807 967018 1001700 1030983 1043444 1041240 1050125 1073996 1088263 1092892 1102785 1116151 1120756
12346A120756k606J199M7288L3182M1839L1651L3082K7057L0003M9584M0256N0940
$$ 1120756 1118150 1119349 1166637 1199819 1241658 1273309 1306391 1333448 1363451 1413035 1453291 1504231
12334A504231N7428M7290O0390R3571O1803P5981J05920J17896J37546J45445
$$ 1504231 1561659 1608949 1669339 1762910 1824713 1900694 2006614 2124510 2262056 2407501
12324B407501J57768J97142K24503K57174K68530K87551L58644M21804N06482
$$ 2407501 2565269 2762411 2986914 3244088 3512618 3800169 4158813 4580617 5087099
12315E087099N88668O74353P99121R29813J071566J284856J542434J846905K178090
$$ 5087099 5675767 6350120 7149241 8079054 9150620 10435476 11977910 13824815 16002905
12306A6002905K592436K965446L213661L207452K805550K010985R47994k05098
$$ 16002905 18595341 21560787 24774448 27981900 30787450 32798435 33746429 33541331
12298C3541331j248117j988633k380673k453586k237435j892885j473634j074526
$$ 33541331 32293214 30304581 27923908 25470322 23232887 21340002 19866368 18791842
12290A8791842o69926k83622R3760M05668O65817Q84290J013805J075031J139369
$$ 18791842 18121916 17838294 17932054 18337722 19003539 19887829 20901634 21976665 23116034
12281B3116034J260997J439901J606276J760964J879481J920264J907081J873964
$$ 23116034 24377031 25816932 27423208 29184172 31063653 32983917 34890998 36764962
12273C6764962J847803J786599J638330J359145Q93319K36071n08624j191047
$$ 36764962 38612765 40399364 42037694 43396839 44290158 44526229 44017605 42826558
12265D2826558j673897j913296j915304j717854j423064j194889j034265r72235
$$ 42826558 41152661 39239365 37324061 35606207 34183143 32988254 31953989 30981754
12257C0981754j034977j126896j186929j183033j096485j003735q70369p55636
$$ 30981754 29946777 28819881 27632952 26449919 25353434 24349699 23479330 22723694
12249B2723694o74132n86619m71530k44700M5294M31834Q26471J302194J854929
$$ 22723694 22049562 21462943 20991413 20746713 20792007 21223841 22050312 23352506 25207435
12240B5207435K386229K842841L095159K959850K409892J381467J9308j379855
$$ 25207435 27593664 30436505 33531664 36491514 38901406 40282873 40302181 38922326
12232C8922326k568827l358610l690837l671730l396768k991907k544767k124876
$$ 38922326 36353499 32994889 29304052 25632322 22235554 19243647 16698880 14574004
12224A4574004j725310j400132j089502q51789o78495m74677k81007j15626M5077
$$ 14574004 12848694 11448562 10359060 9507271 8828776 8354099 8073092 7957466 8002543
12215H002543J44778K44935L24966L69465L47478K47181J28164M0003j61630l56762
$$ 8002543 8147321 8392256 8717222 9086687 9434165 9681346 9809510 9849513 9687883 9331121
12205I331121m94897n96778o52008p04939o88509o77654o08004n30061m49345
$$ 9331121 8836224 8239446 7587438 6882499 6193990 5516336 4908332 4378271 3928926
12196C928926m05871l33503k85039k50821k17507j87758j59557j64912j53752
$$ 3928926 3523055 3189552 2904513 2653692 2436185 2248427 2088870 1923958 1770206
12187A770206j13585q0969j06248q5347p7622r2326o8232n7208n3023j6537l5663
$$ 1770206 1656621 1575652 1469404 1384057 1306435 1214109 1145877 1088669 1035646 1019109 983446
12176I83446l1464k3009l9149l0579l1869o0269k0122m476k6213j8627l0072m3069
$$ 983446 951982 928973 889824 859245 827376 767107 746985 742509 716296 697669 667597 624528
12164F24528k4168K087k6737m283j3501j5579q483p103j7112P171n939r289M312
$$ 624528 600360 602447 575710 571427 557926 542347 533864 526761 509649 516820 510881 501592 505904
12151E05904M769Q377Q328J72K4164K5669J5666j2818k8467Q562j155k1393m3823
$$ 505904 510673 519050 527378 527550 551714 577383 593049 580231 551764 560326 559171 537778 493955
12138D93955j1373L984n337p713k2068l1287m7365j6556R068k175J3586p592l2553
$$ 493955 482582 486566 481229 473516 451448 420161 372796 356240 365308 363133 376719 369127 336574
12125C36574l5978j1952r307J0692K0551J4613M187n667k6652j473J9149J3831
$$ 336574 300596 288644 279337 290029 310580 325193 329380 323713 297061 295588 314737 328568
12113C28568K7016L8734R832J7229J1730k901j3876k6344j3322j9870j8820k2988
$$ 328568 355584 394318 404150 421379 433109 430208 416332 389988 376666 356796 337976 314988
12101C14988j3752k2833l3280l4076K0340K2561Q407L352j5383j215r07R23j1205
$$ 314988 301236 278403 245123 211047 231387 253948 262355 265707 250324 249109 248202 249125 237920
12088B37920q645J7298m659l03k217l5568k6038j265L1013N7767J428k6223j6856
$$ 237920 229275 246573 241914 241611 239394 203826 177788 176523 207536 265303 266731 240508 223652
12075B23652q173j6525k78J4747J9933J0173o930R05o315n214J4118p058P557
$$ 223652 215479 198954 198676 213423 233356 243529 236599 237504 231189 225975 240093 233035 240592
12062B40592q932J1017O188J2808Mj138K1057J552k0549j0543J9676L358k009
$$ 240592 231660 242677 248865 261673 261677 260539 281596 283148 262599 252056 271732 275090 273081
12049B73081J5745J1974O087l664L1160K3337k4345K0293j52k6852J4710K2782
$$ 273081 288826 300800 306887 303223 334383 357720 333375 353668 353516 326664 341374 364156
12037C64156J9025K3883K5824J8757K0013K2178L1831L2753J2498M0545N0063
$$ 364156 383181 407064 432888 451645 471658 493836 525667 558420 570918 611463 661526
12026F61526N8982Q5061L3683N2377O8365N7123M0267J7613j25k3244j5537m0249
$$ 661526 720508 805569 839252 891629 959994 1017117 1057384 1074997 1074872 1051628 1036091 995842
12014I95842o3729n6154n4998n4107o1184l8942j8843m840J3498j8822k1162J1610
$$ 995842 932113 875959 820961 766854 705670 666728 647885 643045 656543 637721 616559 628169
12002F28169K4740P79J2053J2972K1556M975L775L8132M7853M4145Q033k6139
$$ 628169 652909 653688 665741 678713 700269 705244 709019 747151 795004 839149 847182 821043
11990H21043j7167m2167o1152l6679j3359k8038l9993o0151l6470k0875q005o755
$$ 821043 803876 761709 700557 663878 650519 622481 582488 522337 485867 464992 456987 450232
11978D50232o173k0527K8646K9132q126n432Q08j3648J2085o353j2863r747k1168
$$ 450232 444059 423532 452178 481310 473184 467752 468560 454912 466997 460644 447781 438034 416866
11965D16866K370J3632O710p349j7637J955q316j5811l595r02K677K037j226k0595
$$ 416866 419236 432868 439578 432229 414592 416547 408231 392420 388825 387923 390600 392637 391411 370816
11951C70816J451j445j0772j8407j4758p070O419q846j1371O91J5294M4459M0423
$$ 370816 372267 370822 360050 341643 326885 319815 326234 317388 306017 306708 322002 366461 406884
11938D06884J8767J2325k0546k4647j4611k2016l0617m3217k2160l987j770J5680
$$ 406884 425651 437976 417430 392783 378172 356156 325539 282322 260162 256175 254405 270085
11926B70085O184k1364p796L651p088O342K8150J0334m8562j2648K8394J9777
$$ 270085 276269 254905 247109 250760 243672 250014 278164 288498 239936 227288 255682 275459
11914B75459q027j096K0445N2949K9705J0791J786J2971K6969M4381P4328J05892
$$ 275459 267432 266336 286781 339730 369435 380226 382012 394983 421952 466333 540661 646553
11902F46553J56958J85317J73197J55893J50415J24923O4811L095m8724j00681
$$ 646553 803511 988828 1162025 1317918 1468333 1593256 1658067 1661162 1612438 1511757
11892A511757j27363j59046j87594j67977j15744j24945q0917m9333n7732l0422
$$ 1511757 1384394 1225348 1037754 869777 754033 629088 548171 498838 441106 410684
11882D10684n3042l8979L6021n840n984q757k859p187J6766L8648J7263J8602
$$ 410684 357642 318663 354684 348844 342860 334103 331244 324057 340823 379471 396734 415336
11870D15336K0045N627K160J265l4073m4863l1893J11K7732l184m0041L240l55
$$ 415336 435381 441008 443168 444433 410360 365497 333604 333715 361447 358263 318222 321462 321107
11857C21107j8294l0430L977R040j7391k1662j2928l660l6075j8403j442K316
$$ 321107 302813 272383 276360 285400 268009 246347 233419 229759 193684 175281 173839 176155
11845A76155J4168J7599N526p952m263J4402J9040p43j6017N926L4379K5016K6312
$$ 176155 190323 207922 213448 205496 201233 215635 234675 233932 217915 223841 258220 283236 309548
11832C09548J6567L939J3388J237j4316j5936J0029q979l315J077M75O25j2323
$$ 309548 326115 330054 343442 344679 330363 314427 324456 315477 312162 313239 313714 314339 302016
11819C02016P408K18k7770l0286k022J0562j2380K5555p282k0541k3737L702J4057
$$ 302016 309424 309642 281872 251586 249564 260126 247746 273301 266019 245478 221741 225443 239500
11806B39500J421j1912J9360J3033M427J0784J4616J345j1631K1104L8906M5088
$$ 239500 240921 229009 248369 261402 265829 276613 291229 292574 280943 302047 340953 386041
11794C86041O363N132J045j5473j2304k5343j2493L938P629j6168k3762n691j6251
$$ 386041 392404 397536 398581 383108 370804 345461 332968 336906 344535 328367 304605 298914 282663
11781B82663m0978k7420m977Q393j6093l3316n793J9838r77j0175k8377J6647
$$ 282663 241685 214265 209288 217681 201588 168272 162479 182317 181340 171165 142788 159435
11769A59435o330o393J0265k91O098K3454l558J4503p02K5289J5971o278j6157
$$ 159435 153105 146712 156977 156686 162784 186238 182680 197183 196481 221770 237741 231463 215306
11756B15306o168J206J2247L136N285P004k6575l2140K441L1526K2056j2933n262
$$ 215306 209138 210344 222591 225727 231012 238016 211441 179301 181742 213268 235324 222391 217129
11743B17129J3728j1938j0343m867P357K425q816j0357Q11J2312k5941q566L0422
$$ 217129 230857 218919 208576 203709 211066 213491 204675 194318 195129 207441 181500 172934 203356
11730B03356J4185n101q589n807K3636J9605K540n881Q271K493j2830j5380J1213
$$ 203356 217541 212440 203851 198044 221680 241285 243825 237944 246215 248708 235878 220498 231711
11717B31711K0379J1950j6608l5061Q054L2227J8442J8340K0757j8736m998J074
$$ 231711 252090 264040 247432 212371 220425 252652 271094 289434 310191 291455 286457 287531
11705B87531p987K6463L4335K192Q930j601N166K0136K7237Q782J7212K2801m376
$$ 287531 279544 306007 340342 342534 351464 349863 355029 375165 402402 411184 428396 451197 446821
11692D46821Q056J1920o467K0551L0315Q930l789q534p002j6756k8575j422K5623
$$ 446821 454877 466797 460330 480881 511196 520126 516337 507803 500801 484045 455470 454048 479671
11679D79671K1814L6181j6835k4504l339J0377k0966k0756L3203N981J4991j0003
$$ 479671 501485 537666 520831 496327 492988 503365 482399 461643 494846 500827 515818 505815
11667E05815j9229q145q43J5267L761J5513J6773M028j2998k936K0675K1767N134
$$ 505815 486586 478441 477598 492865 496626 512139 528912 532940 519942 517006 537681 559448 564582
11654E64582p576N163P74J0503J4241M462k278O460m527J5995o31M214O856J7896
$$ 564582 557006 562169 562943 573446 587687 592149 589871 596331 591804 607799 607168 611382 618238 636134
11640F36134L2806K5075J9049m434r950M717J3290K425J9314O179O673L0419L2229
$$ 636134 668940 694015 713064 708630 698680 703397 716687 719112 738426 744605 751278 781697 813926
11627H13926p557K2226M2068L5009L854K7225K0319m197J2032K9530K6535L4799
$$ 813926 806369 828595 870663 905672 909526 936751 957070 952873 964905 994435 1020970 1055769
11615A055769L1313M650M4281L8105K9487M5301M8331O7682M3927O2156N4450
$$ 1055769 1087082 1091732 1136013 1174118 1203605 1248906 1297237 1364919 1408846 1471002 1525452
11604A525452N2402O9828O5107Q3550O7425O5269R6748J22725Q4696J18676J43017
$$ 1525452 1577854 1647682 1712789 1796339 1863764 1929033 2025781 2148506 2233202 2351878 2494895
11593B494895J22088J43904J66400J89747J98809K17945K50363K52102L01171
$$ 2494895 2616983 2760887 2927287 3117034 3315843 3533788 3784151 4036253 4337424
11584D337424L63580L97889M67260N18783N65110O64803P94036R14556J031502
$$ 4337424 4701004 5098893 5566153 6084936 6650046 7314849 8108885 9023441 10054943
11575A0054943J164437J324399J538597J780361K011072K225591K404410K516340
$$ 10054943 11219380 12543779 14082376 15862737 17873809 20099400 22503810 25020150
11567B5020150K490270K271882J846126J241642N36464j96925q21103j238667
$$ 25020150 27510420 29782302 31628428 32870070 33406534 33209609 32388506 31149839
11559C1149839j500543j584250j527456j340514j126217q72608o26735l37523
$$ 31149839 29649296 28065046 26537590 25197076 24070859 23198251 22571516 22233993
11551B2233993q6114J16573L08432M75149N94750P00681Q22654R09873R44867
$$ 22233993 22147879 22264452 22572884 23048033 23642783 24343464 25166118 26075991 27020858
11542B7020858R70759R40934R11031Q95212R05222R60579J078917J209032J315816
$$ 27020858 27991617 28932551 29843582 30738794 31644016 32604595 33683512 34892544 36208360
11533C6208360J268726J086803P93292M22807R945m08815p19719r59472j117068
$$ 36208360 37477086 38563889 39357181 39779988 39789933 39381118 38661399 37701927 36584859
11524C6584859j254018j351940j437307j493903j499548j457967j396471j311810
$$ 36584859 35330841 33978901 32541594 31047691 29548143 28090176 26693705 25381895
11516B5381895j212120j114706j015752r07165p69240n80287l88016j82941M9343
$$ 25381895 24169775 23055069 22039317 21132152 20362912 19782625 19394609 19211668 19261011
11507A9261011K89666N70068Q70614J124169J309531J412830J350472J115484
$$ 19261011 19550677 20120745 20991359 22115528 23425059 24837889 26188361 27303845
11499B7303845P08460J46216m52408j021738j450940j765691j939647j953315
$$ 27303845 28012305 28158521 27706113 26684375 25233435 23467744 21528097 19574782
11491A9574782j918051j844903j694990j531745j375953j237527j087627r31073
$$ 19574782 17656731 15811828 14116838 12585093 11209140 9971613 8883986 7952913
11483G952913q15816p24407o38711n47084m77893l85845l75798l09167k58940
$$ 7952913 7137097 6412690 5773979 5226895 4749002 4363157 3987359 3678192 3419252
11474C419252k45377k18407k01013j79675j75638j54128j34015j37709j00415
$$ 3419252 3173875 2955468 2754455 2574780 2399142 2245014 2110999 1973290 1872875
11465A872875p8491p7153r7799j05430m3319o4901o8587k8402k5659m7264n8154
$$ 1872875 1794384 1717231 1619432 1514002 1470683 1405782 1337195 1308793 1283134 1235870 1177716
11454A177716n1797k6065l0391k5581k9128m5150m4720j4814N569k1729l6907
$$ 1177716 1125919 1099854 1069463 1043882 1014754 969604 924884 910070 915639 893910 857003
11443H57003n0573m265l986m722j5350r990q448j7701j0579j6300l7061k4563
$$ 857003 806430 802165 798179 793457 778107 768117 759669 741968 731389 715089 678028 653465
11431F53465j0257j4994r469l1669l0061j068k575p977m044l2929J112j6967j5192
$$ 653465 643208 628214 618745 587076 557015 555947 553372 545395 541351 508422 509534 492567 477375
11418D77375m016J2585k0608j851J9375l146m343J892l3094k3298l743q645n905
$$ 477375 473359 485944 465336 463485 482860 479714 475371 477263 444169 420871 417128 408483 402578
11405D02578J6324l83r948r107N954J3046P120p79l065J534m887j1677k4653k733
$$ 402578 418902 418519 408571 399464 405418 418464 425584 424805 421740 423274 418387 406710 382057 379324
11391C79324N200k7660p669p101k358J337m433R412L147o346J2384J855j1542
$$ 379324 384524 356864 349195 342094 339736 341073 336640 346052 349199 342853 355237 357092 345550
11378C45550J8412n590J2520N088J5868m471J8949n499J4270N783j4838o20J6373
$$ 345550 363962 358372 370892 375980 391848 387377 406326 400827 415097 420880 406042 405422 421795
11365D21795J3138p673o698K0179K6682O003Q532j6039K234P964j2154j7131K9797
$$ 421795 434933 427260 420562 440741 467423 473426 481958 465919 468153 476117 463963 446832 476629
11352D76629K3863Q65J4039J7326L0474K0685K7250N4910N7556N4239M6479P6795
$$ 476629 500492 501357 515396 532722 563196 583881 611131 666041 723597 777836 824315 901110
11340I01110J15205J08951J10708J26474J49475K06453K56558K85958L51377M10188
$$ 901110 1016315 1125266 1235974 1362448 1511923 1718376 1974934 2260892 2612269 3022457
11330C022457M44168M46316L55697K28573O9174j42432l20510m10604m50072m32939
$$ 3022457 3466625 3912941 4268638 4497211 4566385 4423953 4103443 3692839 3242767 2809828
11320B809828l80689l26871k93730k21269j89883j45437j35170j30428j01484
$$ 2809828 2429139 2102268 1808538 1587269 1397386 1251949 1116779 986351 884867
11311H84867o8615q7695q4643p2713m0792m1312k7561k2322j1950l949m5125m4818
$$ 884867 816252 728557 643914 571201 530409 489097 461536 439214 427264 423315 378190 333372
11299C33372m3975j7800n867j2567o494N183R864n730j6417j6116r274q306j0887
$$ 333372 289397 271597 265730 253163 246669 251852 261716 255986 239569 223453 214179 205873 194986
11286A94986l461k79l3174k1945J5604m554q892J4754J1225j4037k4209P268L670
$$ 194986 191525 191246 158072 136127 151731 147177 138285 153039 164264 150227 126018 133286 136956
11273A36956K1346R582p777k2919j0816J1846L0964k430J0501J3731R786k8120
$$ 136956 158302 167884 160107 137188 126372 138218 169182 166752 177253 190984 200770 172650
11261A72650j0158J3349R232J7783K8175L8588L0172j3056n728L5557L055j8833
$$ 172650 162492 175841 185073 202856 231031 269619 299791 286735 281007 316564 319619 300786
11249C00786k5167l0946l1108j4617p197o160o541j6248p668J5407L003l2016
$$ 300786 275619 244673 213565 198948 191751 185591 179050 162802 155134 170541 173544 141528
11237A41528m9390l1769P338K4453K528o491J338K0620K304l0730j8522m076j0152
$$ 141528 92138 60369 67707 92160 94688 88197 89535 110155 112459 81729 63207 59131 48979
11224D8979O365k70l641K459M103R018j309o054l512l89K6126J8131m044l1138
$$ 48979 55344 55074 51433 53892 57995 67013 65704 59650 56138 55749 81875 100006 95962 64824
11210F4824k8726J8741J5596r686j0509M141J2004R173j463L002j1136N284Q358
$$ 64824 36098 54839 70435 60749 50240 54381 66385 75558 74095 77097 65961 71245 79603
11197G9603n626k0251J4067K2833J2388j2881k7284j3367K9886R336K726j439
$$ 79603 73977 53726 67793 90626 103014 90133 62849 49482 79368 88704 91430 89991
11185H9991k2493N490J4167L473j187j3423L889k000o077q126K435Q381J3909
$$ 89991 67498 72988 87155 90628 89441 76018 79907 77907 71830 63704 66139 74520 88429
11172H8429k537N759o052l1117O724m46J4018j19J2866J7596l449r751j4116J3222
$$ 88429 85892 91651 85599 54482 61206 60760 74778 74659 87525 105121 101672 91921 77805 91027
11158I1027K4531N093k2384j6428R699L0709J5096L204k0286k1053L214j0235
$$ 91027 115558 120651 98267 81839 91538 122247 137343 140547 120261 99208 102422 92187
11146I2187n404R504j1061J2090k1602j7167K9176M5777J574J764L0506L1825
$$ 92187 86783 96287 85226 97316 75714 58547 87723 133500 135074 136838 167344 199169
11134A99169N25k808m531j658K3981J0260j5938r196p002J378j4995j4368r086
$$ 199169 199694 196886 192355 190697 214678 224938 209000 199804 192802 194180 179185 164817 155731
11121A55731J3099O843j5931j6466J4164J9258J5964N57q530J0895l245L853O139
$$ 155731 168830 175673 159742 143276 157440 176698 192662 193219 184689 195584 192339 196192 202331
11108B02331J0655J0366q240L526K9233L451J3197k2949J744N787J4481o669k7227
$$ 202331 212986 223352 215112 218638 247871 251322 264519 241570 243314 249101 263582 256913 229686
11095B29686n049p587J5893Q151L8315J8561k1396J3717J3703j0647p81m943n192
$$ 229686 224637 217050 232943 241094 279409 297970 276574 290291 303994 293347 292566 287623 282431
11082B82431J0933k235k0871k7305n577j6966r218N264J5707o74L589J7376L376
$$ 282431 293364 291129 270258 242953 237376 220410 211192 216456 232163 231489 235078 252454 255830
11069B55830q509J4791m006L701J2072l868p654K1934J174j9084k6898q90N242
$$ 255830 247321 262112 258106 261807 273879 270011 262357 284291 285465 266381 239483 238593 243835
11056B43835q862j8501M306J0002q302j1019L846N892N205j2097M040k1298k1471
$$ 243835 234973 216472 220778 230780 222478 211459 215305 221197 226402 214305 218345 197047 175576
11043A75576p456j6143J1417L4988j0068j1023J5849j4812j2396k1813j6804n032
$$ 175576 168120 151977 163394 198382 188314 177291 193140 178328 165932 144119 127315 122283
11031A22283n789r813j1592n399j0717n057K865K5431p049L6265L7413n757k1969
$$ 122283 116494 106681 95089 89690 78973 73916 76781 102212 95163 131428 168841 163084 141115
11018A41115L962J7775J026m618j0710J665k1357l7165j4026N127j275k3190k6922
$$ 141115 145077 162852 163878 159260 148550 150215 128858 91693 77667 82794 81519 58329 31407
11005C1407k3903N299R317J0922J4713K0094p511l1366J1012J1088o589J674k5086
$$ 31407 7504 12803 22120 33042 47755 67849 60338 28972 39984 51072 44483 46157 21071
10992B1071j555L973K2112j1267k6142k593J8255Q538J3430j0919m421K4027j2731
$$ 21071 19516 23489 45601 34334 8192 5599 23854 32392 45822 34903 30482 54509 41778
10979D1778k4466j5304R864O005J0563K0680q136m463k8033j4219K8155N64j1544
$$ 41778 17312 2008 11872 17877 28440 49120 40984 36521 8488 -5731 22424 22988 11444
10966A1444j6173N787J2312J0569J9110J3227k4223k0911K710L016N904q962J7772
$$ 11444 -4729 1058 13370 23939 43049 56276 32053 11142 13852 16868 22772 13810 31582
10953C1582R382K5618J0294j4303j3276J769o97j3271J3466J4358J2949j5256
$$ 31582 40964 66582 76876 62573 49297 51066 50369 37098 50564 64922 77871 62615
10941F2615j8029K0998N953K1925L658p573p705J1647k4816q236o510j2047J4959
$$ 62615 44586 65584 71537 93462 97120 89547 81842 93489 68673 60437 53927 41880 56839
10928E6839j1m982J0821L4906L4316j578J6106J045j1495j324j2627j5098k1951
$$ 56839 56828 51846 62667 97573 131889 130311 146417 147462 135967 134643 122016 106918 84967
10915H4967P886J7379J765o964L4696K9719n482m472K7759R756o145J9349K1904
$$ 84967 92853 110232 111997 105033 139729 169448 163966 159494 187253 197009 190864 210213 232117
10902B32117K6520M2056M9120O7559J01712J23051J14890M2139R435k5716m6744
$$ 232117 258637 300693 349813 417372 519084 642135 757025 799164 808599 782883 736139
10891G36139j7055M2326R8210J22928N6811k5087o6908r1447j48887j51350j14233
$$ 736139 719084 761410 859620 982548 1039359 1014272 947364 855917 707030 555680 441447
10880D41447n2663m9440l9350l7760j7180N466k0760Q864K3887K2271K0860M6312
$$ 441447 388784 339344 299994 262234 245054 250520 229760 238624 262511 284782 305642 351954
10868C51954L1041O2561O1082K9783n272p0154m5875m5764n9978k8146j0165l045
$$ 351954 382995 445556 506638 536421 531149 460995 415120 369356 309378 281232 271067 268022
10856B68022j5173j6390k2098l3708j2893j0860k3955j497L5436M0192l7838l0980
$$ 268022 252849 236459 214361 180653 167760 156900 132945 131448 166884 207076 169238 138258
10844A38258o640o435L3758M8521J3553J7602M2753J7653K667j2473l6305n9934
$$ 138258 131618 125183 158941 207462 221015 238617 281370 299023 301690 289217 252912 192978
10832A92978l5653j4471k0330j3251j3106j673J5610k698k9649j2177K1048K1150
$$ 192978 157325 142854 122524 109273 96167 94494 110104 107406 77757 65580 86628 107778
10820A07778m1k7154q689K4417r44J56m450l207N056k6002L383M135o809j1091
$$ 107778 107737 80583 71894 96311 95367 95523 91073 87866 92922 66920 70303 74438 67629 56538
10806E6538j1560l0023J7079K2333o520M63p753N510J1945N005O439J704j1994
$$ 56538 44978 14955 32034 54367 47847 48310 40557 46067 58012 63017 69456 71160 59166
10793E9166l5213k9466J853K984K4579j931O992K0860N527j3792j8159j802J1681
$$ 59166 23953 -5513 -3660 -676 23903 21972 28964 49824 55351 41559 23400 21598 33279
10780C3279L852j2095k2639m58J7659J0731K0955K3015K1921j7596l1286l3951
$$ 33279 37131 25036 2397 1939 19598 30329 51284 74299 96220 78624 47338 13387
10768A3387j7774K8128K1777l0445j8017o128l465J5150J0636l121K3156R819
$$ 13387 -4387 23741 45518 15073 -2944 -9072 -12537 2613 13249 10128 33284 43103
10756D3103N883N42K726J7634O58k2945p857L4877K9849j9459p823j0416k3718
$$ 43103 48986 49528 52254 69888 70546 47601 39744 74621 104470 85011 77188 66772 43054
10743D3054j8703P966L2310J5843k278j9705n710J8128J6695M620m254m093j1719
$$ 43054 24351 32317 64627 80470 78192 58487 52777 70905 87600 92220 87966 83873 72154
10730G2154j0556K5205l850J4973K0031k77L5971K3337j291j5347q584p219k408
$$ 72154 61598 86803 82953 97926 117957 117680 153651 176988 175697 160350 151766 144547 142139
10717A42139l3948j7794k1429L776m432L092J8339o820K339j1191p222j6373j0748
$$ 142139 108191 90397 68968 72744 68312 71404 89743 82923 85262 74071 66849 50476 39728
10704C9728J0941j72k2037p960J1404P857j704j1570J1879P530P435J451m226
$$ 39728 50669 50497 28460 20500 31904 39761 38057 26487 38366 45896 53331 54782 50556
10691E0556N941N869j1560j290J0044K2631J6831N488k0773k5507K5074k326k1225
$$ 50556 56497 62366 50806 49516 59560 82191 99022 104510 83737 58230 83304 80978 59753
10678E9753j2080R157K1458J1773q757j1808K4375J275j8297P26J53l699j3318
$$ 59753 47673 56830 78288 90061 81304 69496 93871 95146 76849 77575 77728 74029 60711
10665F0711J6241N963k7114j3586K5153J5656L916J6083p31Q385J3607L322m900
$$ 60711 76952 82915 55801 42215 67368 83024 86940 103023 102292 110677 124284 127606 122706
10652A22706j4682J2105j7105K659J2001m223k4310P24L3054J3167J290k810J0749
$$ 122706 108024 120129 103024 105683 117684 113461 89151 89875 122929 136096 137386 134576 145325
10639A45325k57k9286m252J5922K713L3190J8003l5612q451j4070k5271o965L352
$$ 145325 145068 115782 111530 127452 130165 163355 181358 145746 137295 123225 97954 90989 94341
10626I4341p774J1311J5026R056m032k7076o436J8278K4376K3293J8575J3341
$$ 94341 86567 97878 112904 121960 117928 90852 84416 102694 127070 150363 168938 182279
10614A82279k267K1188M168k9478J7143L6257J8845J2198P935J3409K8094J8636
$$ 182279 180012 201200 205368 175890 193033 229290 248135 260333 268268 281677 309771 328407
10602C28407o752R612K9916K3382L7535J1117R837j1397k2104j2528n179k2329
$$ 328407 321655 331267 361183 384565 422100 433217 443054 431657 409553 397025 391846 369517
10590C69517l4410l7178l6515j9502R023L2081q705j8565P817p826k0719J8486
$$ 369517 335107 297929 261414 241912 250935 283016 274311 255746 263563 255737 235018 253504
10578B53504J2096P318P365k3597M092j7466k3242P643N196p952R409L863J9958
$$ 253504 265600 272918 280283 256686 260778 243312 220070 227713 232909 224957 234366 238229 258187
10565B58187j75q584Q086M955O950Q689J7231O497J4985K4685P539j2197K275
$$ 258187 258012 249428 257514 262469 269419 278108 295339 301836 316821 341506 349045 336848 339123
10552C39123K3134j183l0222n061O060J6254J4480J0442K7373K9127Q886J5863
$$ 339123 362257 361074 330852 325791 331851 348105 362585 373027 400400 429527 438413 454276
10540D54276oj3629J4161N449j9040J4109L2540L4872M0138M5618L8270L7371
$$ 454276 454270 440641 454802 460251 441211 455320 487860 522732 562870 608488 646758 684129
10528F84129N0904L5389K4832M785J4370K3730J4204K3237K9528L9980K4851M7000
$$ 684129 735033 770422 795254 800039 814409 838139 852343 875580 905108 945088 969939 1016939
10516A016939N2613L7163L7677N6401O9134P8877Q1679J05289J11610R9438O3644
$$ 1016939 1069552 1106715 1144392 1200793 1269927 1348804 1430483 1535772 1647382 1746820 1810464
10505A810464K2328Q144P241L6452K9336O1124P0164J04225J32454J59840K05584
$$ 1810464 1832792 1840936 1848177 1884629 1913965 1975089 2045253 2149478 2281932 2441772 2647356
10494B647356K18737K56759L14870L59997L91284M67964N32759N75423O01956
$$ 2647356 2866093 3122852 3437722 3797719 4189003 4656967 5189726 5765149 6367105
10485F367105O53819P30188Q62377J078820J306616J606324J982904K503202L258254
$$ 6367105 7020924 7751112 8613489 9692309 10998925 12605249 14588153 17091355 20349609
10476B0349609M393410O174888Q929503J3068042J8627200K4061444K5209002
$$ 20349609 24743019 30917907 39847410 52915452 71542652 95604096 120813098
10469A20813098J7970675M142948r738833j9343584k3053345k1329836j7097732
$$ 120813098 138783773 142926721 133187888 113844304 90790959 69461123 52363391
10462E2363391j2698602r131391o545578m755838l528173k671722k007143j566312
$$ 52363391 39664789 30533398 23987820 19231982 15703809 13032087 11024944 9458632
10454I458632j207563r14787p50412o22017n63390n20134m87862m74909m17909
$$ 9458632 8251069 7336282 6585870 5963853 5400463 4880329 4392467 3917558 3499649
10445C499649l38037k80345k20686j96090j97414j73570j50037j75593j22320
$$ 3499649 3161612 2881267 2660581 2464491 2267077 2093507 1943470 1767877 1645557
10436A645557r3788p8027q6211r2387q0300o7613p1384p9545n1972m1270j3699
$$ 1645557 1551769 1473742 1387531 1295144 1214844 1147231 1075847 996302 944330 903060 889361
10425H89361l4575m2729m1021j8836m2639m7530k2262k3628j7467m4687k8042
$$ 889361 854786 812057 771036 752200 709561 662031 639769 616141 598674 553987 525945
10414E25945j3949j721j0607n679j2871j1059k5337j1152Q827N413j1384K9262
$$ 525945 511996 510275 499668 493989 481118 470059 444722 433570 442397 447810 436426 465688
10402D65688k011k575l5964m5738j7804k9889o4451k6430j1301L022O443L527
$$ 465688 463677 461102 425138 379400 361596 331707 267256 240826 229525 232547 238990 242517
10390B42517J654K2177j3022m602j2528J4786k864j5419M404M599k1123l7025
$$ 242517 244171 266348 253326 248724 236196 250982 248118 232699 237103 241702 220579 183554
10378A83554r174K9591r779jm578m211L441j6240r456J4057N915p305M507N371
$$ 183554 174380 203971 194192 194191 189613 185402 188843 172603 163147 177204 183119 175814 180321 185692
10364A85692j2922j7710k0263r746O366L059Q681r493n458J6656O193j9313j8183
$$ 185692 172770 155060 134797 125051 131417 134476 143157 133664 128206 144862 151055 131742 113559
10351A13559j1047K2412J8416o058J6147R551q264K0283P901Q001l37k3682N473
$$ 113559 102512 124924 143340 137282 153429 162980 154716 174999 182900 190901 190564 166882 172355
10338A72355l519n17k8486j7892M432K2837J0230p801p157j1213j0891K2327J5011
$$ 172355 168836 168319 139833 121941 126373 149210 159440 151639 144482 133269 122378 144705 159716
10325A59716n755j8122p555J603J7419N235j3136j9800k0358J6209n257p789q540
$$ 159716 153961 135839 128284 129887 147306 152541 139405 119605 99247 115456 110199 102410 93870
10312I3870J8080J5027q989j4713k8341p916j291k592P431J575k5414J4991K5665
$$ 93870 111950 126977 117988 103275 74934 67018 65727 63135 70566 72141 46727 61718 87383
10299H7383l229l6169p377J1230J4101J8339R247j1888j1747O787l956J0813k3055
$$ 87383 84154 47985 40608 51838 65939 84278 93525 81637 69890 76677 72721 83534 60479
10286F0479j0441j891K576p338J302l866J7308J297K2838K6117N630P162K363
$$ 60479 50038 48147 50723 43385 44687 40821 58129 59426 82264 108381 114011 121173 123536
10273A23536j7424K443O721j27j6323q124J2037n890l039N143j3899k1424n756
$$ 123536 106112 108555 115276 115149 98826 90702 102739 96849 93810 98953 85054 63630 57874
10260E7874J7046r208o928r245J8846j636m29m951K1483J4631O568k9652j5759
$$ 57874 74920 65712 58784 49539 68385 66749 66320 61369 82852 97483 104051 74399 58640
10247E8640K38J3050J912J827j0585J3994J9543J8644J392q619N178L876L864
$$ 58640 58878 71928 73840 75667 65082 79076 98619 117263 118655 110036 115214 119090 122954
10234A22954p808K937J2236n078n196j729j9479j5837m236Q31n263K2188P821
$$ 122954 115146 118083 130319 125241 120045 118316 98837 83000 78764 79595 74332 96520 104341
10221A04341p126l984q769o486m23J5737R150k232j1978o730j7391m347k118k0792
$$ 104341 97215 93231 84462 77976 77553 93290 102440 100208 88230 81500 64109 59762 57644 36852
10207C6852K0360K3269J4327M778m430J451K1722J751m234m0141k0001K145K6047
$$ 36852 57212 80481 94808 99586 95156 96607 118329 120080 115846 75705 55704 57849 83896
10194H3896K5531M948j8214k972j9445R770J8356o198j8545j7102r059n529K0987
$$ 83896 109427 114375 96161 93189 73744 83514 101870 95672 77127 60025 50966 45437 66424
10181F6424j0106O922K0548l734r62J0673K645J2577J7467l376o122N179j1851
$$ 66424 56318 63240 83788 80054 79092 89765 92410 104987 122454 119078 112956 118135 106284
10168A06284j6308L08J8705J8310K820K2619K4669J1747j1182M275m674p080N319
$$ 106284 89976 90284 108989 127299 130119 152738 177407 189154 177972 182247 177573 170493 175812
10155A75812J9534l638L408l85k05o557j0944k867J2597K2952K3344J860j6653
$$ 175812 195346 191708 195116 194731 194526 187969 177025 174158 186755 209707 233051 234911 218258
10142B18258m816J8022J4023L1243K6041L1766K9382J8230K6751N4760O4146N9459
$$ 218258 213442 231464 245487 276730 302771 334537 363919 382149 408900 463660 527806 587265
10130E87265M6383M7133P9043N4601R5979J10568J47338K21219K78863L81125
$$ 587265 633648 680781 759824 814425 910404 1020972 1168310 1389529 1668392 2049517
10120B049517N52082P86218J004630J093289Q95584L78822k23182o81423r32157
$$ 2049517 2601599 3387817 4392447 5485736 6381320 6760142 6536960 5855537 4923380
10111D923380r35937q11453o09573m35669k73300j81452j38416q2834j0390j439
$$ 4923380 3987443 3175990 2566417 2130748 1857448 1675996 1537580 1454746 1444356 1442917
10101A442917J2323K6954L6194P4683Q8688Q7712P0187R2771J04716J87795K22669
$$ 1442917 1455240 1482194 1518388 1593071 1681759 1769471 1839658 1932429 2037145 2224940 2447609
10090B447609K39940L34750M03999N20299O24311Q27051J066008J325798J613576
$$ 2447609 2687549 3022299 3426298 3946597 4570908 5397959 6463967 7789765 9403341
10081I403341J846244J950827J694217J060597J99044o96054j404053j773399
$$ 9403341 11249585 13200412 14894629 15955226 16154270 15458216 14054163 12280764
10073A2280764j833229j712961j480932j198835r49135p66189n97325m65961l70046
$$ 12280764 10447535 8734574 7253642 6054807 5105672 4339483 3742158 3276197 2906151
10064B906151l24214l03543k63502k33992k02299j59122j31103j23612j04897
$$ 2906151 2581937 2278394 2014892 1780900 1578601 1419479 1288376 1164764 1059867
10055A059867p7208p6917n4955l8141k6068q644J5775M0528J02767J00676P4851
$$ 1059867 982659 905742 850787 812646 786578 777934 793709 834237 937004 1037680 1112531
10044A112531K1078m0816r8095j24135j21083j06398p0401p9148o9196m6595l1283
$$ 1112531 1133609 1092793 994698 870563 749480 643082 572681 493533 424337 377742 346459
10033C46459n260r092k4648m3179l7637l3591N949k95R387K1021k311l210K397
$$ 346459 341199 332107 307459 264280 226643 193052 199001 198706 208093 229114 226803 223593 225990
10020B25990k7991o161K6059k1823J1376L102l078J193M975L0622J6563L744q226
$$ 225990 197999 191838 217897 196074 207450 210552 207474 208667 213642 244264 260827 264571 256345
10007B56345J8118K7555N465k921P999M1162M0527O6410M8788N4188P1014O7844
$$ 256345 274463 302018 307483 304562 312561 353723 394250 460660 509448 563636 634650 702494
9995G02494P8785J9170J7308p452n8972p6519p3577o1421p9466q9070o0872l1434
$$ 702494 781279 800449 817757 810305 751333 674814 601237 539816 460350 371280 310408 278974
9983B78974k9722l9330k2795r109j9880k2385r470q247R523l583k1586j1718O383
$$ 278974 249252 209922 187127 178018 158138 135753 126283 118036 127559 123976 102390 90672 97055
9970I7055O031k7648m066J8288J4981L37j2308p241j5626l330j0032O598Q050
$$ 97055 103086 75438 71372 89660 104641 104978 92670 85429 69803 66473 56441 63039 71089
9957G1089j3469j2953K6852K0749l2079k2951K9099J419j5945j2665M857k394
$$ 71089 57620 44667 71519 92268 60189 37238 66337 67756 51811 39146 44003 41609
9945D1609k678q313J370o245M595R733j6140K03l465K52J9437J129k881j1132
$$ 41609 38931 30618 31988 25743 30338 40071 23931 24134 20669 20921 40358 41487 38606 27474
9931B7474j0825O852J3233J0368J9214j1382J758q000j0405p94J4199J1572m992
$$ 27474 16649 23501 36734 47102 66316 54934 56692 48692 38287 37493 51692 63264 58272
9918E8272k0531j0250K4958O634J1065k1148p584M081l040Q854L156M920p15m73
$$ 58272 37741 27491 52449 59083 70148 49000 41416 45497 42457 51311 54467 59387 58672 58199
9904E8199k6289j6600K5474j559k6783j1271l625J6019K0086J632P942O209j0162
$$ 58199 31910 15310 40784 39225 12442 1171 -2454 13565 33651 35283 43225 49434 39272
9891C9272j6532j0339L977O153J0738J2212J0959J3417j448j2780o787J774R668
$$ 39272 22740 12401 16378 22531 33269 45481 56440 69857 68409 55629 48842 50616 60284
9878F0284r183J4373Q205P118j5643K270P985l616j3369R645Q454j241R619N592
$$ 60284 51101 65474 73679 80797 65154 67424 75409 71793 58424 68069 76523 75282 84901 90493
9864I0493k5047j8468m63j2120J492K854J7791l446k8081k4920N838K922L6153
$$ 90493 65446 46978 46515 34395 35887 38741 56532 53086 25005 85 5923 8845 44998
9851D4998K1274k0138j1947J2742K0224k184l1115k1042o450R157J0565j7593
$$ 44998 66272 46134 34187 46929 67153 64969 33854 12812 6362 15519 26084 8491
9839H491L300K5817J8020J970J442m872j1537J5224r875M816l1263k1695O497
$$ 8491 11791 37608 55628 57598 59040 54168 42631 57855 47980 52796 21533 -162 6335
9826F335O630J3016j0176k951L222K0104j5126q417L252l801N128J7447j147q750
$$ 6335 12965 25981 15805 12854 16076 36180 21054 12637 15889 12088 17216 34663 33516 24766
9812B4766q758j1022j1566P892j430l063j2822L5816K0361k4750k2198J8052J2786
$$ 24766 16008 4986 -6580 1312 -118 -3181 -16003 19813 40174 15424 -6774 11278 24064
9799B4064m233M10J0286q239j564L2738J8989M901j0524j7025k505k1335k834
$$ 24064 19831 20241 30527 22288 20724 53462 72451 77352 66828 49803 47298 25963 23129
9786B3129p362j9817L736k408P387L7996Q702p385R117o927Q715j5025m588m974
$$ 23129 15767 -4050 -314 -2722 4665 42661 51363 43978 53095 46168 54883 39858 35270 30296
9772C0296j5069K622l692P231J6039N243j8174M086o15k0918K834J5860M384Q836
$$ 30296 15227 17849 14157 21388 37427 42670 24496 28582 27967 7049 9883 25743 30127 38963
9758C8963R438k72P901J3849N057o484q737k0125k8826r692R781K1320N121P930
$$ 38963 48401 48129 56030 69879 74936 68452 59715 39590 10764 1072 10853 32173 37294 45224
9744D5224j459m158L15n793K0372J381M010J0773r422J1872J0458j3428l4547
$$ 45224 43765 39607 39922 34129 54501 55882 59892 70665 61243 73115 83573 70145 35598
9731C5598o423p158k0867k3179J2380J6596J5087P90R503K0414R789K926K868
$$ 35598 29175 22017 1150 -22029 -9649 6947 22034 22824 32327 52741 62530 65456 68324
9718F8324k3286j4847k760P216l1544l955K6579Q642k607L22r934J2833J9593
$$ 68324 45038 30191 27431 34647 3103 -852 25727 34369 31762 32084 22150 34983 54576
9705E4576L015J656p477R772j4497q654j6477k273K1785K2495j6219k428J2224
$$ 54576 57591 59247 51770 61542 47045 38391 21914 19641 41426 63921 47702 45274 57498
9692E7498K3745J3803k0719K573l3067j1645K5604J1180J871j8018m4146r613
$$ 57498 81243 95046 74327 76900 43833 32188 57792 68972 70843 52825 8679 -934
9680i34J1335K2907L660o415K3154j2413j5073k4736j1640K551j0824L8302N7507
$$ -934 10401 33308 36968 30553 53707 41294 26221 1485 -10155 -7604 -18428 19874 77381
9667G7381K7466l930l4483j0453K3076J3509p311O079J4888r931J1391J2592M76
$$ 77381 104847 100917 66434 55981 79057 92566 85255 91334 106222 96291 107682 120274 120750
9654A20750K746l733j3379j1036j2489k580l697j2074n915M847j849j0221M097
$$ 120750 123496 119763 106384 95348 82859 80279 76582 64508 58593 63440 61591 51370 55467
9641E5467J1130O920k0226j4769j588J8315O96M231L352o597l092J072k980l984
$$ 55467 66597 73517 53291 38522 36934 55249 55945 60176 63528 56931 53839 54911 51931 47947
9627D7947k7917j6012R368L1602j0895L333J3458p730M13J7146J64r280o552J9673
$$ 47947 20030 4018 13386 44988 34093 37426 50884 43154 43567 60713 60877 51597 45045 64718
9613F4718l3342q254J0398J8328K3185K839j6723k2357J4646N677K101q16L206
$$ 64718 31376 23122 33520 51848 75033 77872 61149 38792 53438 59115 61216 60400 63606
9600F3606k805j2893j3775j7616K2903J5321q817k0436k0006Q000K566p952M331
$$ 63606 60801 47908 34133 16517 39420 54741 45924 25488 5482 13482 16048 8096 12427
9587A2427K4716K8152k4903o325O041J3145N539J124j1081q297R651J1383R978
$$ 12427 37143 65295 40392 34067 40108 53253 58792 59916 48835 40538 50189 61572 71550
9574G1550k777k7257k5589J2863O577O125N181K0268O769o857K4825N107m0653
$$ 71550 68773 41516 15927 28790 35367 41492 46673 66941 73710 66853 91678 96785 56132
9561E6132k5733k1646K7959L1390J7962j0149p079j3993j0704j260J7901q047
$$ 56132 30399 8753 36712 68102 86064 75915 68836 54843 44139 42879 60780 52733
9549E2733l33q164L652J2274J0550o832j0719L291J0299J9942j4860k1473R121
$$ 52733 52400 44236 47888 60162 70712 63880 53161 56452 66751 86693 71833 50360 59481
9536E9481P468j2498M56J7810L599J2418j1905r968K311k2313n609K30q13l43
$$ 59481 66949 54451 54907 72717 76316 88734 76829 66861 69172 46859 41250 41480 40667 40324
9522D0324n645P246k5937p099K8485K9562J711k319j901J8838O987j9683J6129
$$ 40324 34679 41925 15988 8889 37374 66936 68647 66328 64427 83265 90252 70569 86698
9509H6698J1302k284P041k4001j8996K50q823j7373K353o859J4097o28k6428o678
$$ 86698 98000 95716 102757 78756 59760 60010 51187 33814 36167 29308 43405 42777 16349 9671
9495I671J8617J1301j6733j8585j50J1363L5622K5760p31P956k483L059r444l4576
$$ 9671 28288 39589 22856 4271 4121 15484 51106 76866 76135 84091 81608 84667 75223 40647
9481D0647m462J1181p852j3636L1487J3967l8294J0945K5046L1942K1318K39R00
$$ 40647 36185 47366 39514 25878 57365 71332 33038 43983 69029 100971 122289 122528 123428
9468A23428k3065k4382q562K699L1018K5811J192j4926l840K3949k1061k5559
$$ 123428 100363 75981 67419 70118 101136 126947 128139 113213 109373 133322 112261 86702
9456H6702q211k0476k789J3798J0248J3176J7691J279j541P06j7931L977k1748
$$ 86702 78491 58015 55226 69024 79272 92448 110139 111418 109877 110583 92652 96629 74881
9443G4881l0100P011L3427Q281q294J2052J5030l6706m0203J2200J4369P419P298
$$ 74881 44781 51792 85219 93500 85206 97258 112288 75582 35379 47579 61948 69367 76665
9430G6665J8475J305k7924J5060J1418k770J3055Q216J1650K1474O166O449q407
$$ 76665 95140 96445 68521 83581 94999 92229 105284 113500 125150 146624 152790 159239 150832
9417A50832m5064k8651n894j220Q293j0052K3636O783l6029k7399k0117K5462
$$ 150832 105768 77117 71223 70003 78296 68244 91880 98663 62634 35235 15118 40580
9405D0580J8053m397O682J7489n127P790P207L567k7669j9118J4123J4482M563
$$ 40580 58633 54236 60918 78407 73280 81070 88277 91844 64175 45057 59180 73662 78225
9392G8225R084L632K999N601o187r581p82R200J7247J2204o708J8674n452k130
$$ 78225 87309 90941 93940 99541 93354 83773 82991 92191 109438 121642 114934 133608 128156 126026
9378A26026Q965K1729j6712K856j0911j6505R688K5066L8391L6588J8695L1919
$$ 126026 134991 156720 140008 142864 131953 115448 125136 150202 188593 225181 243876 275795
9366B75795R219L0325L6804N2603N0815O9081Q8270R4730J37812J51911J72609
$$ 275795 285014 315339 352143 404746 455561 524642 612912 707642 845454 997365 1169974
9355A169974J92191J76617J42097J27654R5228K1323k9922p4495j32318j62609
$$ 1169974 1362165 1538782 1680879 1808533 1903761 1925084 1895162 1820667 1688349 1525740
9345A525740k08790k03905j79243j39841j18776o7246q3475p6975n4204l9087
$$ 1525740 1316950 1113045 933802 793961 675185 607939 524464 447489 393285 354198
9335C54198n6488l5550n335j1374j8568k3725l2249p646k534p391q099j0891j4001
$$ 354198 297710 262160 256825 245451 226883 203158 170909 163263 160729 153338 145239 134348 120347
9322A20347r363J9455K3081m324M196j640j3732k8539K141L1488N685N475j1760
$$ 120347 110984 130439 153520 149196 153392 151752 138020 109481 111622 143110 148795 154270 142510
9309A42510k5329L429Q948R604L185K6463l100l4612J1973M982p57k1959o429
$$ 142510 117181 120610 129558 139162 142347 168810 165710 131098 143071 148053 147296 125337 118908
9296A18908r904j2666r347N419K2853J87n997K1455M987j5289p409o377J9446
$$ 118908 109004 96338 86991 92410 115263 115450 109453 130908 135895 120606 113197 106820 126266
9283A26266J3037k7650l9408J223K4239J1684k858j3722O278K9755J6586k919
$$ 126266 139303 111653 72245 73468 97707 109391 106533 92811 99089 128844 145430 142511
9271A42511j9911k2796k0457k2592j7251J4294m979j4004l4533M752K6944K9268
$$ 142511 122600 99804 79347 56755 39504 53798 48819 34815 282 5034 31978 61246
9259F1246M5469M3487J4386j7485j9970q377j6131l808k146K7667L9496K4827
$$ 61246 106715 150202 164588 147103 127133 118756 102625 98817 96671 124338 163834 188661
9247A88661j2098k1154k1470m975P546m953J1449J9460R800k6563j0607J1833
$$ 188661 176563 155409 133939 128964 136510 131557 143006 162466 172266 145703 135096 146929
9235A46929o209K425r42J5154K5193K57R779J3463j2169j9113R992K459M90p050
$$ 146929 140720 143145 142203 157357 182550 182807 192586 206049 193880 174767 184759 187218 187708 180658
9221A80658R119K5452J5090n808J5630J3898J4179l291K1900J9710K6466Q1805
$$ 180658 189777 215229 230319 224511 240141 254039 268218 264927 286827 306537 333003 414808
9209D14808P8136N6090M4117J327m0109o1239p7832o3174m2668k1810L264j6280
$$ 414808 492944 549034 593151 594478 554369 493130 415298 352124 309456 287646 290910 274630
9197B74630k1436j2806j5969k7904O819p697J2574j2281k1723j4294N707J8000
$$ 274630 253194 240388 224419 196515 203334 195637 208211 195930 174207 159913 165620 183620
9185A83620K14q86K1210J9619M080j4729k70K6426K1851P319J871P920J6725Q06
$$ 183620 183834 182948 204158 223777 227857 213128 212858 239284 261135 268454 270325 278245 294970 295776
9171B95776j5793k9349J1536L1815o515j630o292l7207m7782j1140m1366k0442
$$ 295776 279983 250634 262170 293985 287470 285840 279548 242341 194559 183419 142053 121611
9159A21611K6083K0162J2914l337q152L5545K2198o079l560O133M284n512q533
$$ 121611 147694 167856 180770 177433 169281 204826 227024 220945 217385 223518 227802 222290 213757
9146B13757M792j614J6151J19K7491M2245L3026J2117j0403R519N06L757j235
$$ 213757 218549 216935 233086 233205 260696 302941 335967 348084 337681 347200 347706 351463 350228
9133C50228n451J3766j8848j7547J9349O096j6119K626K7168j1222k7576j0770
$$ 350228 344777 358543 339695 322148 341497 347593 331474 334100 361268 350046 322470 311700
9121C11700q183l24N399J7924j1010O729K5972J2047n760j8913l6275n105M1873
$$ 311700 303517 303193 308592 326516 315506 322235 348207 360254 354494 335581 299306 294201 336074
9108C36074L1731K849J0417J9317J4601J4521j9490O676J5576L0166L0649J2263
$$ 336074 367805 370654 381071 400388 414989 429510 410020 416696 432272 462438 493087 505350
9096E05350L0334M7485K402K5387K9758L6750J9364K0402J0937K2839Q5671J33970
$$ 505350 535684 583169 585571 610958 640716 677466 696830 717232 728169 751008 836679 970649
9084I70649J80752K07918J22771p053m000j5248n3743q4316j16151j32799j22647
$$ 970649 1151401 1359319 1482090 1475037 1471037 1455789 1402046 1317730 1201579 1068780 946133
9073I46133r6024m3391J6864j7123j3270j962n186Q66l038J1310J3886j9554m924
$$ 946133 850109 806718 823582 806459 793189 791227 786041 786907 783869 795179 809065 789511 784587
9060G84587j6812o109J136j86K8783L2627K2954K2364J4738P2K4863m779J0594
$$ 784587 767775 761666 762802 762616 791399 824026 846980 869344 884082 884154 909017 904238 914832
9047I14832M3698Q266O558J4043J6857J2739K6951K6816L2334J5095k426n54L1935
$$ 914832 958530 966796 973354 987397 1004254 1016993 1043944 1070760 1103094 1118189 1115763 1115209 1147144
9034A147144J8111L1689K8343L5920M7569M7297M9140K6829L1401j0754l9300
$$ 1147144 1165255 1196944 1225287 1261207 1308776 1356073 1405213 1432042 1463443 1452689 1413389
9023A413389o811j2624P975J7197M5601P1994N1988Q1062Q4015R4840P8558L9624
$$ 1413389 1406578 1393954 1401929 1419126 1464727 1536721 1588709 1669771 1753786 1848626 1927184 1966808
9011A966808K5990N7000R2759R1957J08879R2600Q1002R6088R3969R5671R3450
$$ 1966808 1992798 2049798 2142557 2234514 2343393 2435993 2516995 2613083 2707052 2802723 2896173
9000B896173R3563J08174J16636J00482J30518J41415J49599J88691K28791J79812
$$ 2896173 2989736 3097910 3214546 3315028 3445546 3586961 3736560 3925251 4154042 4333854
8990D333854J99298K02867K47114K88565K72604K95835L47322M03082M34527M94296
$$ 4333854 4533152 4736019 4983133 5271698 5544302 5840137 6187459 6590541 7025068 7519364
8980G519364N89226P10801Q18351R71619J102696J263368J409949J600457J928193
$$ 7519364 8108590 8819391 9637742 10609361 11712057 12975425 14385374 15985831 17914024
8971A7914024K245319K628739L084173L642123M308614N023726N605473O106116
$$ 17914024 20159343 22788082 25872255 29514378 33822992 38846718 44452191 50558307
8963E0558307O895606Q470263J1139217J5413415K2112418L2738796M9298122
$$ 50558307 57453913 65924176 77063393 92476808 114589226 147328022 196626144
8956A96626144P2369535R5406180R8462201O3083125M262963m7422664q0499627
$$ 196626144 268995679 364401859 462864060 525947185 530210148 482787484 402287857
8949D02287857q9546711p8048560n9474208m2515724k9700363k0789180j4792956
$$ 402287857 312741146 234692586 175218378 132702654 103002291 82213111 67420155
8942F7420155j0669098p818686n946824m826507m317358m017608l697677l269636
$$ 67420155 56751057 48932371 42985547 38159040 33841682 29824074 26126397 22856761
8934B2856761k742060k217650j799930j486202j165979q95734p29821n66780l64219
$$ 22856761 20114701 17897051 16097121 14610919 13444940 12549206 11819385 11252605 10888386
8925A0888386j53214k1580n6362k77136n04991n81621n48051m21835k66489k10171
$$ 10888386 10735172 10713592 10657230 10380094 9875103 9293482 8745431 8323596 8057107 7846936
8915G846936k71983l50519l96960m02686l36836k52044k07354j68142j26462j00158
$$ 7846936 7574953 7224434 6827474 6424788 6087952 5835908 5628554 5460412 5333950 5233792
8905E233792j16986j04716o7356m6799m9955m04R783L3616K2351M2831M4604K7691
$$ 5233792 5116806 5012090 4944734 4897935 4847980 4847576 4857359 4890975 4913326 4956157 5000761 5028452
8893E028452M4668J00031J09480J18735J44818J47389J12989J09093J21144J19896
$$ 5028452 5073120 5173151 5282631 5401366 5546184 5693573 5806562 5915655 6036799 6156695
8883F156695P5884Q6290Q6245M4199Q7847J19923J33433J32462J74661J99881
$$ 6156695 6232579 6318869 6405114 6449313 6537160 6657083 6790516 6922978 7097639 7297520
8873G297520J82565J56879J42026J34624J22154J49461J46926J57819J65545J16610
$$ 7297520 7480085 7636964 7778990 7913614 8035768 8185229 8332155 8489974 8655519 8772129
8863H772129O1661K9060L4455O860r643K738j1846n1543m6529p2352q9093q6524
$$ 8772129 8833790 8862850 8897305 8904165 8894522 8897260 8885414 8833871 8787342 8714990 8625897 8539373
8851H539373r1981j26591j43366j47754j32665j52285j54583k00417j96659j59988
$$ 8539373 8447392 8320801 8177435 8029681 7897016 7744731 7590148 7389731 7193072 7033084
8841G033084j43287j75578j78554j92076j73626j68638j65839j65772j67416j58035
$$ 7033084 6889797 6714219 6535665 6343589 6169963 6001325 5835486 5669714 5502298 5344263
8831E344263j31589j36496j34581j26671j14512j17509j84154k21684j99121j57269
$$ 5344263 5212674 5076178 4941597 4814926 4700414 4582905 4398751 4177067 3977946 3820677
8821C820677j31645j10292p5941j06071j06393j12059r6928j02550p6047q0927
$$ 3820677 3689032 3578740 3502799 3396728 3290335 3178276 3081348 2978798 2902751 2821824
8811B821824j01975p6060p4069q4282m5532m8629m8920o1485p6199p3558o1021
$$ 2821824 2719849 2643789 2569720 2485438 2439906 2391277 2342357 2280872 2204673 2131115 2070094
8800B070094n1754o0081m1593k4408j5750j6718m4818n7634m7054n9398o4856
$$ 2070094 2018340 1958259 1916666 1892258 1876508 1859790 1814972 1757338 1710284 1650886 1586030
8789A586030k8484l008j9815l8987l6096k7752k6746j6579n0112m2974j8643l8871
$$ 1586030 1557546 1554538 1534723 1495736 1459640 1431888 1405142 1388563 1338451 1295477 1276834 1237963
8777A237963k5067k6029k6910m9713m6934m1884n1654k219Q866k4500l9365n494
$$ 1237963 1212896 1186867 1159957 1110244 1063310 1021426 969772 967553 976419 951919 912554 907060
8765I07060j8293k0435j183J1549J4777j3211j1047l4436n363P361l5494J4957
$$ 907060 888767 868332 867149 878698 893475 880264 869217 834781 829418 836779 801285 816242
8753H16242J6233j2123l836j8376l1129j0264l160j0633N644m591j9765l0457
$$ 816242 832475 820352 816516 798140 767011 756747 753587 742954 748598 744007 724242 693785
8741F93785o338j3094k185k0078l6829j7591j248k1367k7769j7657M046O420k1861
$$ 693785 687447 674353 672168 652090 615261 597670 596422 575055 547286 529629 533675 540095 518234
8728E18234p033J9650K8523j0364k1481j6972K4224q154O988N272P594k732j5433
$$ 518234 511201 530851 559374 549010 527529 510557 534781 526627 533615 538887 546481 543749 528316
8715E28316q251o466r394Q913m002j6925k8516k5480N026O908o309j8986j3524
$$ 528316 520065 513599 504205 513118 509116 492191 463675 438195 443221 450129 443820 424834 411310
8702D11310j9913m02j2955p906j8783j9967k178L322L393K294L729j3567j7641
$$ 411310 391397 390995 378040 370134 351351 331384 329206 332528 335921 338215 341944 328377 310736
8689C10736J452P369J4220J2779k3119J190J7258k2354k4803l264J9789J7079
$$ 310736 312188 319557 333777 346556 323437 324627 341885 319531 294728 291464 311253 328332
8677C28332o687j3455p803j0328m618j2532j5585Q966K0380J1090m759r423m36
$$ 328332 321645 308190 300387 290059 285441 272909 257324 266290 286670 297760 293001 283578 283142
8664B83142J8889m431L12J8369R424m053l652l0971l484j2090J7734J4945j4346
$$ 283142 302031 297600 297912 316281 325705 321652 318000 287029 283545 271455 289189 304134 289788
8651B89788k4507n394j9293K304L3026J4561R044K1482K6464J0843q685N051p469
$$ 289788 265281 259887 240594 242898 275924 290485 299529 321011 347475 358318 349633 354684 347215
8638C47215j2886m857j5415m03j2576l0462l5704o394J7702j472K8Q925j278o031
$$ 347215 334329 329472 314057 313654 301078 270616 234912 228518 246220 244748 244776 253701 252423 246392
8624B46392j2310K5466L205J1190K363n267j4796K3640K6567k4128j5666q494
$$ 246392 234082 259548 262753 273943 276306 271039 256243 279883 306450 282322 266656 258162
8612B58162K3730J8820K3245q205l4001j1231P751L867l0873l7320J3297P804
$$ 258162 281892 300712 323957 315752 281751 270520 278271 282138 251265 213945 227242 235046
8600B35046Q736K1602J1431P995l041O316l639j3884j9200L636j0695L215o036
$$ 235046 243782 265384 276815 284810 281769 288085 284446 270562 251362 254998 244303 247518 241482
8587B41482n764P692L508O177J2344k586R061J1434J7762J5414k3629l0298j6225
$$ 241482 235718 243410 246918 253095 265439 262853 271914 283348 301110 316524 292895 262597 246372
8574B46372j2625m024O031J2084K1087k174k0532j0393J4596M2538L7306K7075
$$ 246372 233747 229723 235754 247838 268925 266751 246219 235826 250422 292960 330266 357341
8562C57341L9646N7701O9628O8495P2749R0906J40578J64567J70001J79634J61327
$$ 357341 396987 454688 524316 592811 665560 756466 897044 1061611 1231612 1411246 1572573
8551A572573J57298J33253O2779K070l9523r5545j89167j99136j72974j78976
$$ 1572573 1729871 1863124 1925903 1927973 1888450 1792905 1603738 1404602 1231628 1052652
8541A052652j62018j06452r7717r8760p9070m8838l9523n0793o4228k8215J1568
$$ 1052652 890634 784182 686465 587705 508635 459797 420274 369481 305253 277038 288606
8530B88606k6481k1847j5185j4452j5061J099j7205j9366J800J9085M234j7117
$$ 288606 262125 240278 225093 210641 195580 196679 179474 160108 161908 180993 185227 168110
8518A68110l0081m721O46L76j6044L93n217j004k5461k4684j9976J337K9479K106
$$ 168110 138029 133308 133954 134330 118286 118679 113462 112458 86997 62313 42337 43674 73153 75259
8504G5259J4261J617J374M574J2307k1982r891J2468N004K0593M979j1231J548
$$ 75259 89520 91137 92511 97085 109392 87410 77519 89987 94991 115584 120563 109332 110880
8491A10880l6084k4376J2382J472l4140J4254k0331k7983j305M3569K002j9110
$$ 110880 74796 50420 62802 64274 30134 44388 24057 -3926 -5231 38338 40340 21230
8479B1230R078J5891r21k692q009J3761r181m285j059J3662n299J0996k6033j965
$$ 21230 30308 46199 45278 42586 34577 48338 39157 34872 33813 47475 42176 53172 27139 25174
8465B5174P791K9184J333q104K183r258r730l018j914J363k673J5191p0Q165O749
$$ 25174 32965 62149 63482 55378 57561 48303 38573 35555 33641 35004 32331 47522 47452 55617 62366
8450F2366k817k3889o403K303l8m591J0375l279J441R569J7230j1692j1884q423
$$ 62366 59549 35660 29257 31560 31522 26931 37306 34027 35468 45037 62267 50575 38691 30268
8436C0268J7164J0354l319O613k0279r300J1200n807J286R162q926l839L2009
$$ 30268 47432 57786 54467 61080 40801 31501 42701 36894 38180 47342 38416 34577 66586
8423F6586Q80j6138k0649P303l728K7614k71p275j8749J4061J4931O23Q364j5089
$$ 66586 67466 51328 30679 37982 34254 61868 61597 54322 35573 49634 64565 65188 73552 58463
8409E8463k295R985J1562j5932j773j402q267m809P75l4481j6421K4516K823j2252
$$ 58463 56168 66153 77715 61783 60010 58608 50341 45532 46307 11826 -4595 19921 22744 10492
8395A0492k907j0730J0464L3374K1902N051n166l1652J3474o340j5639j2810m687
$$ 10492 7585 -3145 7319 40693 62595 67646 62480 30828 44302 37962 22323 9513 4826
8382D826J5379n120J4760J0461K1237l060L699J0372k020o909p598j3788o777
$$ 4826 20205 15085 29845 40306 61543 58483 62182 72554 70534 63625 56027 42239 35462
8369C5462q374O188J4988O870k5684j6774m017l083J13P842J3045J1934n134k2318
$$ 35462 27088 33276 48264 55134 29450 12676 8659 5576 5689 13531 26576 38510 33376 11058
8355A1058K1358J4943J7912J4700n573l814Q345O90r024O334J2114j0478k9568
$$ 11058 32416 47359 65271 79971 74398 70584 78929 79619 70595 76929 89043 78565 48997
8342D8997Q712k2372k4557q65N325J1446K5643j7508j9479L3221K6090j7309l0656
$$ 48997 57709 35337 10780 9915 15240 26686 52329 34821 15342 48563 74653 57344 26688
8329B6688J610K2998K7475j8277j7797q41R000J0286j1896J2218j1265l1104P78
$$ 26688 28298 51296 78771 60494 42697 41856 50856 61142 49246 61464 50199 19095 19873
8316A9873o259j460J4335J1657J516j492r787j9586k4848k9965J7072K4427n542
$$ 19873 13614 12154 26489 38146 39662 38170 28383 8797 -16051 -46016 -28944 -4517 -10059
8303a0059M328J695K6652K56r487N89Q368r827n441m44J9959K3512o451l3396
$$ -10059 -5731 -4036 22616 22872 13385 13974 22342 12515 7074 6630 26589 50101 43650 10254
8289A0254O015k117J1630N490P157L446O428K140L73M552k8244m5168j8460L0356
$$ 10254 16269 14152 25782 31272 38429 41875 48303 50443 50816 55368 27124 -18044 -36504 -6148
8275f148J4692N252N665N649M031n491K946o273o333J94Q725j543j994k0741J1356
$$ -6148 8544 13796 19461 25110 29141 23650 26596 20323 13990 14184 22909 21366 19372 -1369 9987
8260I987K0606l1152j3230J7091N191k568o943j9583j6297J9477L463N008k845
$$ 9987 30593 -559 -13789 3302 8493 5925 -1018 -20601 -36898 -17421 -13958 -8950 -11795
8247a1795j441J2568K975K568R602j2948j9531j5255l798J9498K4335K8147J2842
$$ -11795 -13236 -668 2307 4875 14477 1529 -18002 -33257 -37055 -17557 6778 34925 47767
8234D7767J9127l16k4832m134j0618j7669j0863K874j857j8002J1919k3312o037
$$ 47767 66894 66578 41746 37612 26994 9325 -1538 1336 -521 -18523 -6604 -29916 -35953
8221c5953K5017K2701r40M974N757j6419m13J7664p832P885Q196R15j7838L134
$$ -35953 -10936 11765 10825 15799 21556 5137 4724 22388 14556 22441 30637 31552 13714 16848
8207A6848J186K3795J5537j2131k6871o668r459N579J1005q348k8109J0583J8968
$$ 16848 18034 41829 57366 45235 18364 11696 2237 7816 18821 10473 -17636 -7053 11915
8194A1915R453j9054r899P930j325j6597j2933L264J9333j254j8253K5438j078
$$ 11915 21368 2314 -7585 345 -980 -17577 -30510 -27246 -7913 -9167 -27420 -1982 -3060
8181c060j1904j2838N375N877k351Q177J9778J0968k6176J818J3843J362m609
$$ -3060 -14964 -27802 -22427 -16550 -18901 -10724 9054 20022 -6154 -4336 9507 10869 6260
8168F260K6887K3639k2681k2793p252m214k4051j635J4577J6954L771K3950L2675
$$ 6260 33147 56786 34105 11312 4060 -154 -24205 -25840 -11263 5691 9462 33412 66087
8155F6087L1810J8310m7623m8731j0750K4324J5877k5443j9370k131j9161J2786
$$ 66087 97897 116207 68584 19853 9103 33427 49304 23861 4491 2360 -16801 -4015
8143d015L3747j121l4578k7186j7860k017J2878J2492K8636j9108j6816q264K240
$$ -4015 29732 28611 -5967 -33153 -51013 -53030 -40152 -27660 976 -18132 -34948 -43212 -40972
8130d0972K3453j836R977N363j9069M426m905O461l667K4503K5396L6928K6827
$$ -40972 -17519 -19355 -9378 -4015 -23084 -18658 -23563 -17102 -20769 3734 29130 66058 92885
8117I2885M435k1167k2936j6955J5707j2146k4903J160J2520J0788j1629l2412
$$ 92885 97320 76153 53217 36262 51969 39823 14920 16080 28600 39388 27759 -4653
8105d653J8337J9613J0904k7687L771J9700n926k0727j4556o710P96K2077K936
$$ -4653 13684 33297 44201 16514 20285 39985 34059 13332 -1224 -7934 -7138 14939 17875
8092A7875r180j2903j7970J2337K3083J0547J0222P704j1781l744q391J1680k0856
$$ 17875 8695 -4208 -22178 -9841 13242 23789 34011 41715 29934 26190 17799 29479 8623
8079H623k7928M553J4158L76J0545j6598l855O649j1077j1300n858L597L927K1593
$$ 8623 -19305 -14752 -594 -218 10327 -6271 -10126 -3477 -14554 -25854 -31712 -28115 -24188 -2595
8065b595K5972N962n906j5733M189j2791n128q93n104j3431L9631K4490j2878
$$ -2595 23377 29339 23433 7700 11889 -902 -6030 -6923 -12027 -25458 14173 38663 25785
8052B5785j2785Q347k550n135J9500J3823J5272J3743j6144o770J1368J8568p949
$$ 25785 13000 21347 18797 13662 33162 46985 62257 76000 59856 53086 64454 83022 75073
8039G5073k8165k449m565j0768j2311R091J8491J3446m983j2936J6197K4482m646
$$ 75073 46908 44459 39894 29126 16815 25906 44397 57843 52860 39924 56121 80603 75957
8026G5957k0550J2437J933n130k8655Q301P437N211O647J754K752J0829k7973
$$ 75957 55407 67844 69777 64647 35992 44293 51730 56941 63588 65342 68094 78923 50950
8013E0950j2098J0809J2802J8648K6220J647J8643L2898L5100R088j9208j0805
$$ 50950 38852 49661 62463 81111 107331 108978 127621 160519 195619 204707 185499 174694
8001A74694o408k2992k8104j1930l170k7803k1541K7600M9415J1781k1301m2360
$$ 174694 168286 145294 117190 105260 102090 74287 52746 80346 129761 141542 120241 77881
7989G7881j4518j13j1662j7549k2370M286L4697J2087l962O473l236j450J3616
$$ 77881 63363 63250 51588 34039 11669 15955 50652 62739 58777 65250 62014 60564 74180
7976G4180l3356k9673J352L4753L1816J1151k66m740q301q331j6928J2119L208
$$ 74180 40824 11151 12503 47256 79072 90223 89957 85217 76916 68585 51657 63776 66984
7963F6984Q094R083L6363N665r77n439n291j9222j8419j5027K0465J3315k722
$$ 66984 75078 84161 120524 126189 125212 119773 114482 95260 76841 61814 82279 95594 92872
7950I2872j6080P064o55j9040j4106l842k4252k1249q086Q877K6394K0158k5314
$$ 92872 76792 83856 83201 64161 50055 46213 21961 712 -7374 1503 27897 48055 22741
7937B2741j2659N053p17J627J8263k84p035p017K0655J3316L757p400n262R775
$$ 22741 10082 15135 14418 16045 34308 34024 26989 19972 40627 53943 57700 50300 45038 54813
7923E4813J3092o700j1977j7200N527Q29k2902P128J4269m514k279o379O429J4304
$$ 54813 67905 61205 49228 32028 37555 38384 15482 22610 36879 32365 30086 23707 30136 44440
7909D4440K402l4078J529L1964J8966j0611j1163j0350k6389Q900j3345J727J7010
$$ 44440 46842 12764 14293 46257 65223 54612 43449 33099 6710 15610 2265 3992 21002
7896B1002k0783M073L3031K0160l1829q983J4k6443m442J207n703K9822M3986
$$ 21002 219 4292 37323 57483 25654 16671 16685 -9758 -14200 -12993 -18696 11126 55112
7883E5112K553P438k507o951j1516k1718k7502j3719J0297j4898l245J0907R712
$$ 55112 57665 65103 62596 55645 44129 22411 -5091 -18810 -8513 -23411 -26656 -15749 -6037
7870f037Q046k501j5544p18M803n410J2724N282j5146r746k664P119j2314j8914
$$ -6037 2009 -492 -16036 -16754 -11951 -17361 -4637 645 -14501 -24247 -26911 -19792 -32106 -51020
7856e1020l498K3838M0466K4173j2151m0848m110J2806J0921J950n017q342k5796
$$ -51020 -54518 -30680 9786 33959 21808 -19040 -23150 -10344 577 2527 -2490 -10832 -36628
7843c6628j2694J8125J6064J2383j4983M076J7712j2504P527Q212N950O232J1952
$$ -36628 -49322 -31197 -15133 -2750 -17733 -13657 4055 -8449 -922 7290 13240 19472 31424
7830C1424J9398J025k3004j2718p504m126P584p979J167j3799J660m185o437J439
$$ 31424 50822 51847 28843 16125 8621 4495 12079 4100 5267 -8532 -6872 -11057 -17494 -16055
7816a6055O178p603P027K8743n139J570k410L267Q803j532n586L550j0651M033
$$ -16055 -9877 -17480 -10453 18290 13151 14721 12311 15578 24381 22849 17263 20813 10162 14195
7802A4195q050k6256P33O648M038j2613j2722O807j808J590K3024J6832r189n151
$$ 14195 6145 -20111 -19378 -12730 -8692 -21305 -34027 -27220 -29028 -27438 -4414 12418 3229 -1922
7788a922k47O334j1723j1740K689O815J4985J2062n593j1786q914l277r886j241
$$ -1922 -2169 4165 -7558 -19298 -16609 -9794 5191 17253 11660 -126 -9040 -12317 -22203 -23444
7774b3444J0630J5041L583r318R407J1106j0855O861j4498o828J1930p816l2671
$$ -23444 -12814 2227 5810 -3508 5899 17005 6150 13011 -1487 -8315 3615 -4201 -36872
7761c6872K877J5192J2253J3826p167p400J4878k123l8856k477K1733Q97J3343
$$ -36872 -33995 -18803 -6550 7276 109 -7291 7587 5464 -33392 -35869 -14136 -13239 104
7748A04j7547j1543K8225L1407R022j2881j4091n909k1813J6503J350R185K0646
$$ 104 -17443 -28986 -761 30646 39668 26787 12696 6787 -15026 1477 2827 12012 32658
7735C2658r142j3792J5096r940k4724k2303J2898O044j094k1703j1371N753K7545
$$ 32658 23516 9724 24820 14880 -9844 -32147 -19249 -13205 -14299 -36002 -47373 -41620 -14075
7722a4075J0961r154j4071J6979J3275j4809j0638J1915K0263O905K910j4597
$$ -14075 -3114 -12268 -26339 -9360 3915 -10894 -21532 -9617 10646 17551 20461 5864
7710E864n864N560N533P12N84m9m827p002q376k438J6581R882r183r415n083K519
$$ 5864 0 5560 11093 11805 12389 12340 7513 511 -7865 -10303 6278 16160 6977 -2438 -7521 -5002
7694e002J6418J1626j409q063q828J4698j7747l0086J552K5211P591j0676N987
$$ -5002 11416 23042 21633 13570 4742 19440 1693 -28393 -26841 -1630 5961 -4715 1272
7681A272M1020J1065m3047j2103O110J8393J2017j3070m052p75j3667j7047k7347
$$ 1272 42292 53357 10310 -1793 4317 22710 34727 21657 17605 16830 3163 -13884 -41231
7668d1231o851K0133J6803K0704J8832q295m923j1414n968M593K7046n51k1761
$$ -41231 -48082 -27949 -11146 9558 28390 20095 15172 3758 -2210 2383 29429 28878 7117
7655G117p383n309N745N614m174r198o887m072j1236l149J0332j5216j245P226
$$ 7117 -266 -5575 170 5784 1610 -7588 -14475 -18547 -29783 -32932 -22600 -37816 -39061 -31835
7641c1835J1612o702K776N860J5977L0833L274L0412R282k2520o827q817k9924
$$ -31835 -20223 -26925 -24149 -18289 -2312 28521 31795 62207 71489 48969 42142 33325 3401
7628C401n205m825K387K1369M381j8937k4432n849K2640N630M397j3677M204K0187
$$ 3401 -1804 -6629 -4242 17127 21508 2571 -21861 -27710 -5070 560 4957 -8720 -4516 15671
7614A5671l416q788q358n374N049J7298L749j9522j6319R555K736J6454r071l668
$$ 15671 12255 3467 -4891 -10265 -5216 12082 15831 -3691 -20010 -10455 -7719 8735 -336 -4004
7600d004J3000J5262O493o23n124j5064J187o775j6276L966J4936N734K5492R143
$$ -4004 8996 24258 30751 30128 25004 9940 11127 4352 -11924 -7958 6978 12712 38204 47347
7586D7347l4617q026N321j0449m714j0522K140J9513l237j9991J9819K1341p347
$$ 47347 12730 4704 10025 -424 -5138 -15660 -13520 5993 2756 -17235 2584 23925 16578
7573A6578J2665p608o415m528n979N29K3563M82K958J750r820k906k7779l2626
$$ 16578 29243 21635 15220 10692 4713 5242 28805 29287 32245 33995 24175 21269 -6510 -39136
7559c9136K012K8689J2269P91p336M64J0704K423o312p196j920J3514j2067O27
$$ -39136 -37124 -8435 3834 4625 -2711 -2247 8457 10880 4568 -2628 -4548 8966 -3101 -2474
7545b474J5584l875l821j1656l445J4029j2385j9372K2633K3985q513q371j6939
$$ -2474 13110 9235 5414 -6242 -9687 4342 -8043 -27415 -4782 19203 10690 2319 -14620
7532a4620k0852j07K916P65J7588J7476P599O047j1307J3339J7672K818p786j9677
$$ -14620 -35472 -35579 -32663 -31898 -14310 3166 10765 16812 5505 18844 36516 39334 31548 11871
7518A1871k1832p906Q193j2001O18K090J6023P22p250J7591l930j9782J3767J7636
$$ 11871 -9961 -17867 -9674 -21675 -21057 -18967 -2944 -2222 -9472 8119 4189 -15593 -1826 15810
7504A5810j4385n341K0118J9139R350j4181l6962n432k448J1474J6581j9574j0368
$$ 15810 1425 -3916 16202 35341 44691 30510 -6452 -11884 -14332 -2858 13723 -5851 -16219
7491a6219L0410m413k78J410l548r711k2272k1331m448K8583L971O93r689L0265
$$ -16219 14191 9778 9500 10910 7362 -2349 -24621 -45952 -50400 -21817 -17846 -17153 -26842 3423
7477C423L895o728K310j2907k6412j0806Q420J0422J398J966J519j8158P99K5957
$$ 3423 7318 590 2900 -10007 -36419 -47225 -38805 -28383 -26985 -25019 -23500 -41658 -40859 -14902
7463a4902k2101J351Q120M3556K7891k487k1599j621J5545o629k3874j7686N017
$$ -14902 -37003 -35652 -27532 16024 43915 41428 19829 18208 33753 27124 3250 -14436 -9419
7450i419j0082j303N436j732J8593L6002j8354k0294n558J985Q946J9268K5878
$$ -9419 -19501 -20804 -15368 -17100 1493 37495 19141 -1153 -6711 -4726 4220 23488 49366
7437D9366o506j2342l7720q696L4367K234k7379k3575K5715K1166j0187o665j4429
$$ 49366 42860 30518 -7202 -15898 18469 20703 -6676 -30251 -4536 16630 6443 -222 -14651
7424a4651K0491n295L802j1253P851m27o191K498n523k8694j5442J0118J0660
$$ -14651 5840 545 4347 -6906 945 518 -5673 -3175 -8698 -37392 -52834 -42716 -32056
7411c2056N178J0985R172j1287j5526J4022J2784R925J9489j067J3000R390P945
$$ -32056 -26878 -15893 -6721 -18008 -33534 -19512 -6728 3197 22686 21619 34619 44009 51954
7398E1954K333l2339j2874J6883J853j1685j9780m724j8904K901K2119j6012m623
$$ 51954 54287 21948 9074 25957 27810 16125 -3655 -8379 -27283 -24382 -2263 -18275 -22898
7385b2898J3271n797l392K0361Q64j7889J1692p202L936o090k3753N530K2067
$$ -22898 -9627 -15424 -18816 1545 2409 -15480 -3788 -10990 -7054 -13144 -36897 -31367 -9300
7372i300O199O908M432J3782k4258Q262q891j3351m519J7841J9138k896J5328
$$ -9300 -3101 3807 8239 22021 -2237 6025 -2866 -16217 -20736 -2895 16243 13347 28675
7359B8675o211j3349J630L066j0971r050J6379m359P081j0863j7439j1026l637
$$ 28675 22464 9115 10745 13811 2840 -6210 10169 5810 12891 2028 -15411 -26437 -30074
7346c0074J333K416M851j4768l381J6382J6838J9549J5490n616k3236j2463j0540
$$ -30074 -28741 -26325 -21474 -36242 -39623 -23241 -6403 13146 28636 23020 -216 -12679 -23219
7333b3219O134K047M243J4363j9716j4417r88o48K3912M005j7370J787J003M114
$$ -23219 -17085 -15038 -10795 3568 -16148 -30565 -31553 -32201 -8289 -4284 -21654 -19867 -18864 -14750
7319a4750q350M468P993m544j1775m842Q245j073J1395K1099J1364j5295l752
$$ -14750 -23100 -18632 -10639 -15183 -26958 -31800 -23555 -24628 -13233 7866 19230 3935 183
7306A83k771o355J3776r897j175P619j779j2884m452J3520J1717k4566j6725J6193
$$ 183 -2588 -8943 4833 -5064 -6239 1380 -399 -13283 -17735 -4215 7502 -17064 -33789 -17596
7292a7596j4679j5894K9645R16m122J8440p469J0067Q574r64J1408l2p897P439
$$ -17596 -32275 -48169 -18524 -17608 -21730 -3290 -10759 -692 7882 6918 18326 18294 10397 17836
7278A7836j7975K140R000Q112k43R805o466l400p654k027m468p961J3585J1074
$$ 17836 -139 2001 11001 19113 18870 28675 22209 18809 11155 9128 4660 -3301 10284 21358
7264B1358p603M8q799o910K4056J5494r021M792l967m771j285q911j1547j6686
$$ 21358 13755 13803 5004 -1906 22150 37644 28623 33415 29448 24677 23392 14481 2934 -13752
7250a3752J4895j1314q673O473j0637m152K0898J0008j8871M12N234N165J0886
$$ -13752 1143 -10171 -18844 -12371 -23008 -27160 -6262 3746 -15125 -14713 -9479 -4314 6572
7237F572K9211j9448q46k303M498j6440o126r405j4134J665k086R306L036R420
$$ 6572 35783 16335 15489 13186 17684 1244 -4882 -14287 -28421 -26756 -28842 -19536 -16500 -7080
7223g080j4849K5865L0023j4799L966J1256j73M669k494n651n344k0151k3046
$$ -7080 -21929 3936 33959 19160 23126 34382 34209 38878 36384 30733 25389 5238 -17808
7210a7808L988L8024J5649N354k153J4015J4754j3473l4575K003k998k2610j6991
$$ -17808 -13820 24204 39853 45207 43054 57069 71823 58350 23775 25778 22780 170 -16821
7197a6821j4811J4794j4887j2946K2468J7240m445M944M279l737J1533r019m931
$$ -16821 -31632 -16838 -31725 -44671 -22203 -4963 -9408 -4464 -185 -3922 7611 -1408 -6339
7184f339L570j7291J0625J1538K8000P060k753p177O779O045k6549k7646K458
$$ -6339 -2769 -20060 -9435 2103 30103 37163 34410 27233 34012 40057 13508 -14138 -11680
7171a1680J6726l910L612O324j8453N478o618j2455j1385J0042o548J0219m638
$$ -11680 5046 1136 4748 11072 -7381 -1903 -8521 -20976 -32361 -22319 -28867 -18648 -23286
7158b3286j1754P072k44j8085r246J5149J1500O804k8720J6123L2935J1824m198
$$ -23286 -35040 -27968 -28212 -46297 -55543 -40394 -28894 -22090 -50810 -34687 -1752 10072 5874
7145E874k2864k8951j3177J4253K2764P969N526o33J3200l51j066p815j2788N188
$$ 5874 -16990 -45941 -59118 -44865 -22101 -14132 -8606 -9239 3961 3610 2544 -5271 -18059 -12871
7131a2871J6530o671l096P423m8876k0722J5373M2838J8507r517m484M957q638
$$ -12871 3659 -3012 -6108 1315 -47561 -68283 -52910 -10072 8435 -1082 -5566 -609 -9247
7118i247K3355j4608k258Q659j1346j0540r217k348L0901J6603k940J107q885
$$ -9247 14108 -500 -2758 5901 -5445 -15985 -25202 -27550 3351 19954 17014 18121 9236
7105I236Q957m050q699k2431J40Q03P150p1M844j3619k1404K6474J4124J7384
$$ 9236 18193 14143 5444 -16987 -16847 -16044 -8894 -8965 -4121 -17740 -39144 -12670 1454 18838
7091A8838L566k2959j7064R390J2295j2312m3232j0069M5373L875k5570j3527
$$ 18838 22404 -555 -17619 -8229 4066 -8246 -51478 -61547 -16174 -12299 -37869 -51396
7079e1396r120J7367J9574J5046m044M616j1685J8627K6414k1620j5881J0160
$$ -51396 -60516 -43149 -23575 -8529 -12573 -7957 -19642 -1015 25399 3779 -12102 -1942
7067a942j4665j1277J014o117m697L0968J2576K0165k317n092l1869j1572l633
$$ -1942 -16607 -27884 -26870 -32987 -37684 -6716 5860 26025 23708 18616 -13253 -24825 -28458
7054b8458M304J5771J1079n689J76j1047J5619J1402O614j748Q874o436r447j0668
$$ -28458 -24154 -8383 2696 -2993 -2817 -13864 1755 13157 19771 18023 26897 20461 11014 346
7040C46n942P320J5331j3387J716l882n376n9q654L3289n343j8488K33K725j7133
$$ 346 -5596 1724 17055 3668 5384 1502 -3874 -3933 -12587 20702 15359 -3129 -2896 -171 -17304
7025a7304o001O630P60m83j0143r343k6715K8270J3734n575k0332J2665N856P122
$$ -17304 -23305 -16675 -15915 -16398 -26541 -35884 -62599 -34329 -20595 -26170 -46502 -33837 -27981 -20859
7011b0859J7531j94R105m517Q571Q362j7196j0458p164n304J1217j0021m985N115
$$ -20859 -3328 -3522 5583 1066 9637 17999 803 -9655 -16819 -22123 -10906 -20927 -25912 -20797
6997b0797p654L3658L241k4505m089J6172J1420Q347p889K751M759r433N17o058
$$ -20797 -28451 5207 8448 -16057 -20146 -3974 7446 15793 7904 10655 15414 5981 6498 440
6983D40p292J542N748J1006j9504j5577O437K720J6669J6688k2355j9558P530
$$ 440 -6852 -5310 438 11444 -8060 -23637 -17200 -14480 2189 18877 -3478 -23036 -15506
6970a5506K5398j4427m0325J975K3922L282R370J7884L196R75k7059N20J5444
$$ -15506 9892 -4535 -44860 -42885 -18963 -15681 -6311 11573 14769 15744 -11315 -10795 4649
6957D649p358J6623q706m068j1629J8777Q660N330l5292k4497m153J2588L1758
$$ 4649 -2709 13914 5208 1140 -10489 8288 16948 22278 -13014 -37511 -41664 -29076 2682
6944B682J7099k308N097N259j6157j6472L162L898K279l39n423J3484J8316k777
$$ 2682 19781 17473 22570 27829 11672 -4800 -1638 2260 4539 4200 -1223 12261 30577 27800
6930B7800K117M531J946k8135k7589K7160k232j8952K043J5663m4144o454O62
$$ 27800 29917 34448 36394 8259 -19330 7830 5598 -13354 -11311 4352 -39792 -46246 -45584
6917d5584j65N834k981P523j272J6246K5351j3615j7456l604J8962J6695R754
$$ -45584 -45749 -39915 -42896 -35373 -36645 -20399 4952 -8663 -26119 -29723 -10761 5934 15688
6904A5688j7132l4289j5732P165R82m046O751P490N068L555Q763J0118m471j8835
$$ 15688 -1444 -35733 -51465 -44300 -43318 -47364 -40613 -33123 -28055 -24500 -15737 -5619 -10090 -28925
6890b8925M771K6888J1162J0645k445j3407j9135l542P883J4963R355n839N452
$$ -28925 -24154 2734 13896 24541 22096 8689 -10446 -13988 -6105 8858 18213 12374 17826
6877A7826N240K261j7108j3817N125p402K353J6309J2352k9354p841R940J2342
$$ 17826 23066 25327 8219 -5598 -473 -7875 -5522 10787 23139 -6215 -14056 -4116 8226
6864H226L934k122j69K3767M993k1649j8593J1368K3946l3649k1423j4454J6866
$$ 8226 12160 10038 9869 33636 38629 16980 -1613 9755 33701 52 -21371 -35825 -18959
6851a8959O989j4176O640j411K3992J9666k2638j2295m807L150J7001j2491J726
$$ -18959 -11970 -26146 -19506 -20917 3075 22741 103 -12192 -16999 -13849 3152 -9339 -7613
6838g613K216O820K2722n968j7278j1549J534N305j0254k501J6064p936M790q975
$$ -7613 -5397 1423 24145 18177 899 -10650 -9116 -3811 -14065 -16566 -502 -8438 -3648 -12623
6824a2623N161M702j4242m473J3332n256R862J4353Rk0592j1152N593J9269r063
$$ -12623 -7462 -2760 -17002 -21475 -8143 -13399 -3537 10816 10825 -9767 -20919 -15326 3943 -5120
6810e120k9227j3644l271J1661M0223J5783j478j662P815J32n387n133p342k617
$$ -5120 -34347 -47991 -51262 -39601 622 16405 14927 13265 21080 21212 15825 10692 3350 733
6796G33J6209K9593q350l9425M0187K4041j9320j7917k7780m595K77J7025q855
$$ 733 16942 46535 38185 -1240 38947 62988 43668 25751 -2029 -6624 -6347 10678 1823
6783A823p93j5068q302J6412J0241J842j0105o5M371P547J3154K669r983p305
$$ 1823 1030 -14038 -22340 -5928 4313 6155 -3950 -4015 356 7903 21057 23726 13743 6438
6769F438P211N327l249j2293n116l0534j3840q718L6862L9452n751n641l397O472
$$ 6438 13649 18976 15727 3434 -1682 -32216 -46056 -54774 -17912 21540 15789 10148 6751 13223
6755A3223r486Q889P087n224k258M115N039L439j5997j0461J0003O798J1251Q274
$$ 13223 3737 12626 19713 14489 12231 16346 21385 24824 8827 -1634 8369 15167 26418 34692
6741C4692j5204J4691J4791R016P4j9740j5795M227J7165J5592J4206o408j7887
$$ 34692 19488 34179 48970 57986 58060 38320 22525 26752 43917 59509 73715 67307 49420
6728D9420R287K7462J5939J2646M7321O1139M3799R8580J68299K07674K53700
$$ 49420 58707 86169 102108 114754 162075 223214 267013 365593 533892 741566 995266
6717I95266K10209O4912j14640k19706k49245j90898j40909q5288p1879n1505
$$ 995266 1205475 1270387 1155747 936041 686796 495898 354989 269701 197822 146317
6707A46317m4503l5720j3970j4987l18r228j2764n496j0780J4337J3121j7591
$$ 146317 101814 66094 52124 37137 36819 27591 14827 9331 -1449 12888 26009 8418
6695H418R078K5162k540l4626Q55R684J9647J7276m620k7159j0613J048O554R915
$$ 8418 17496 42658 40118 5492 6347 16031 35678 52954 48334 21175 10562 11610 18164 28079
6681B8079o044n696J2051o125j9554k5701k5258N260K8776K072k694Q082J4501
$$ 28079 22035 16339 28390 22265 2711 -22990 -48248 -42988 -14212 -12140 -14834 -6752 7749
6668G749J3982j4006q909n57j951J0784O347j8928k3478Q396O316M247J3272j1758
$$ 7749 21731 7725 -1184 -1741 -3692 7092 13439 -5489 -28967 -20571 -14255 -10008 3264 -8494
6654h494k7154j197J562L2595N965j645j8435M43K8393j943j4724j4321r066q80
$$ -8494 -35648 -36845 -35283 -2688 3277 1632 -16803 -16360 12033 10090 -4634 -18955 -28021 -28901
6640b8901K0813k504P255J8700O272N336p728o32M63j9148J4757K0585L678k8115
$$ -28901 -8088 -10592 -3337 15363 21635 26971 19243 18611 19074 -74 14683 35268 38946 10831
6626A0831p195j1765j1750m492o849p247J037k40P841K6944J0521N588q096j2756
$$ 10831 3636 -8129 -19879 -24371 -31220 -38467 -37430 -37670 -29829 -2885 7636 13224 5128 -7628
6612g628k8268m644R720r00J1319R365j1147l188q011L1791o039j5664K586K7390
$$ -7628 -35896 -40540 -30820 -31720 -20401 -11036 -22183 -25371 -33382 -1591 -7630 -23294 -20708 6682
6598F682J9360m779k642J983r20j0337r620k8418r198J6680K4551O666L6924O307
$$ 6682 26042 21263 18621 20604 19684 9347 -273 -28691 -37889 -21209 3342 10008 46932 53239
6584E3239k8279l2985k4410K889J0427L0181o277n035J2128J189j2545j8183K0825
$$ 53239 24960 -8025 -32435 -29546 -19119 11062 4785 -250 11878 13067 522 -17661 3164
6571C164K7197O741k1503j3452m876j0748j2484J4070J5404j2690P130J2506o971
$$ 3164 30361 37102 15599 2147 -2729 -13477 -25961 -11891 3513 -9177 -2047 10459 3488
6558C488j9369Q236j294P761K1353L171j442L537K015k7742q905N893o008k685
$$ 3488 -15881 -7645 -8939 -1178 20175 23346 21904 25441 27456 -286 -9191 -3298 -9306 -11991
6544a1991J2912j1014J9203P166j5677l8720m712j4143O03K9K7366K2145R485
$$ -11991 921 -10093 9110 16276 599 -38121 -42833 -56976 -56373 -56344 -28978 -6833 2652
6531B652pj096J689L362o107n127p161k0481K2912K2331M220q702j2683J0551
$$ 2652 2645 1549 3238 6600 493 -4634 -11795 -32276 -9364 12967 17187 8485 -4198 6353
6517F353K3935k0884j307j1658j4717q471k726K8139K4584J165l5181m1246P501
$$ 6353 30288 9404 8097 -3561 -18278 -26749 -29475 -1336 23248 24413 -10768 -52014 -44513
6504d4513j5377j686K5373L0394q615k0741k746K0417N749j6442N835K094L4237
$$ -44513 -59890 -61576 -36203 -5809 -14424 -35165 -37911 -17494 -11745 -28187 -22352 -20258 13979
6491A3979J5224j6764k602j6720J354k817Q850j3972q253j679K0455n724M219
$$ 13979 29203 12439 9837 -6883 -5529 -8346 504 -13468 -21721 -23400 -2945 -8669 -4450
6478d450j3834L759K0679O883k4610p148j2571K8033K9244K6135q96l4386r575
$$ -4450 -18284 -14525 6154 13037 -11573 -18721 -31292 -3259 25985 52120 51224 16838 7263
6465G263L942N260j7637R76j3748J2866J0670m187J2848l581l5038j5047J0470
$$ 7263 11205 16465 -1172 -196 -13944 -1078 9592 5405 18253 14672 -20366 -35413 -24943
6452b4943K1718J9859J4244k1349j3754J7836L7471j7304k5503L881l459k8388
$$ -24943 -3225 16634 30878 9529 -4225 13611 51082 33778 8275 12156 8697 -19691
6440a9691O988k7j0792J6510N405r567L7358K1468k9216K016n76l0213j3012p619
$$ -19691 -12703 -12730 -23522 -7012 -1607 -11174 26184 47652 18436 20452 19876 -10337 -23349 -30968
6426c0968K4745j053k2303M709M856k914L188J538k9208J0712Q587J9459R615
$$ -30968 -6223 -7276 -29579 -24870 -20014 -22928 -19740 -18202 -47410 -36698 -28111 -8652 963
6413I63n272N164L640j0659J5151P630p676P690r566p09P417k1920Q292K0303
$$ 963 -4309 855 4495 -6164 8987 16617 8941 16631 7065 6356 13773 -8147 145 20448
6399B0448j3693j4126J4091M959r732o08J885o747l1026k2005J8317K1963N718
$$ 20448 6755 -7371 6720 11679 1947 1339 3224 -3523 -34549 -56554 -38237 -16274 -10556
6386a0556P3K7120L536M266n838l0321P602J3665J246n979R33r670j805j9814
$$ -10556 -10483 16637 20173 24439 18601 -11720 -4118 9547 10793 4814 5747 -3923 -5728 -25542
6372b5542M504Q77Q661P948j4862q707J214q654K9195K961j2956j0627k2145J6671
$$ -25542 -21038 -20161 -11500 -3552 -18414 -27121 -25907 -34561 -5366 -2405 -15361 -25988 -48133 -31462
6358c1462J7751K597J2749k0978R77o143j418k0842j8984J0390N315j5111K0769
$$ -31462 -13711 -11114 1635 -19343 -18366 -24509 -25927 -46769 -65753 -55363 -50048 -65159 -44390
6345d4390O545J1340N985j1334J0813K367n98K2898J2122m714M046l111j4505
$$ -44390 -37845 -26505 -20520 -31854 -21041 -18674 -19272 3626 15748 11034 15080 11969 -2536
6332b536k2038M220J1169J1822j6204J2328P709p571o29p912j4874J0895K0187
$$ -2536 -24574 -20354 -9185 2637 -13567 -1239 6470 -1101 -1730 -9642 -24516 -13621 6566
6319F566j3078j1130j659L680p035k0772j1147Q090J3653j4264L833J5113J9074
$$ 6566 -6512 -17642 -19301 -15621 -22656 -43428 -54575 -46485 -32832 -47096 -43263 -28150 -9076
6306i076j5739j4811J4464J7302J9490O048o790k0191j6849j3826Q352r908p883
$$ -9076 -24815 -39626 -25162 -7860 11630 17678 10888 -9303 -26152 -39978 -31626 -41534 -49417
6293d9417L668l07j7092R445R521j9772N899J7276K572J7309J2527j989j273l852
$$ -49417 -45749 -46056 -63148 -53703 -44182 -63954 -58055 -40779 -38207 -20898 -8371 -10360 -11633 -15485
6279a5485k5912r111K0443n022K0765L0179j716J1882J9998p03P069k7355l5680
$$ -15485 -41397 -50508 -30065 -35087 -14322 15857 14141 26023 46021 45318 52387 25032 -10648
6266a0648M070j8244k1087K7368L1342j3843j5280l785p39J3557K969J3456J616
$$ -10648 -6578 -24822 -45909 -18541 12801 -1042 -16322 -20107 -20846 -7289 -4320 9136 10752
6253A0752j8895k4368J2391L883o248n572p159N983m982L729J1291j6029N843
$$ 10752 -8143 -32511 -20120 -16237 -22485 -28057 -35216 -29233 -34215 -30486 -19195 -35224 -29381
6240b9381K4888o978m2649k1864J5486K5658J1278j6529n487N239J3412p853r648
$$ -29381 -4493 -11471 -54120 -75984 -60498 -34840 -23562 -40091 -45578 -40339 -26927 -34780 -44428
6227d4428J9315R24q957J8128j2747k7927k2191l134J9011K2183J1277M0297L3246
$$ -44428 -25113 -24189 -33146 -15018 -27765 -55692 -77883 -81017 -62006 -39823 -28546 11751 44997
6214D4997m148m0592l4738l138K3551J4965R781j5134J235R698k3734R061r0r238
$$ 44997 40849 257 -34481 -37619 -14068 897 10678 -4456 -3221 6477 -17257 -8196 -8286 -17524
6200a7524k1062j08O078J5173j1924j3768l112J056l096K3319K2032P526N93r698
$$ -17524 -38586 -38694 -32616 -17443 -29367 -43135 -46247 -45191 -48287 -24968 -2936 4590 5183 -4515
6186d515j9221L902J025p787j9399j1098J0009K4576m188k4253M948K1075j58
$$ -4515 -23736 -19834 -18809 -26596 -45995 -57093 -47084 -22508 -26696 -50949 -46001 -24926 -25084
6173b5084P682J6569r09k256j9860k0314J5756J4341k923K9553J74K744o415L796
$$ -25084 -17402 -833 -1742 -3998 -23858 -44172 -28416 -14075 -16998 12555 12729 15473 9058 12854
6159A2854J023P868j6303Q426L198q703j0789m0284J3395M2586K8834p479o320
$$ 12854 13877 21745 5442 13868 17066 8363 -2426 -42710 -29315 13271 42105 34626 28306
6146B8306j9208p792R334Q983J3250J965k5176j7775P076M695j931j4439p3j087
$$ 28306 9098 1306 10640 19623 32873 34838 9662 -8113 -1037 3658 1727 -12712 -12785 -13872
6132a3872r269k367k070P632J9949J7136J1705r213j2691r092p721O288M03j4870
$$ -13872 -23141 -25508 -27578 -19946 3 17139 28844 19631 6940 -2152 -9873 -3585 -3182 -18052
6118a8052k644J37J0130J2447j119l490k639k1540J256J9765Q34R14O382L0940
$$ -18052 -20696 -20559 -10429 2018 899 -2591 -5230 -26770 -25514 -5749 -4915 -4001 2381 33321
6104C3321J5949J1272J5545j3986l7801j0227o912j254j2338q118K723K6256J5163
$$ 33321 49270 60542 76087 62101 24300 14073 7161 5907 -6431 -14549 -11826 14430 29593
6091B9593J4809L354q888k690j858j5986j0402J589J7273j9810j6754K9947o511
$$ 29593 44402 47756 38868 36178 34320 18334 7932 9521 26794 6984 -9770 20177 13666
6078A3666m766O993J6259j1134o413J801l5028j4355O600j2633J3314R576p63
$$ 13666 8900 15893 32152 21018 14605 16406 -18622 -32977 -26377 -39010 -25696 -16120 -16883
6065a6883P279O183J1213m251J8319j5418m937J3374Q1j1779n583j189O514J2055
$$ -16883 -9604 -3421 7792 3541 21860 6442 1505 14879 14960 3181 -2402 -3591 2923 14978
6051A4978o769j2249j4979j852K6532K1301J1563k8871k1696r780K4082J1306
$$ 14978 8209 -4040 -19019 -20871 5661 26962 38525 9654 -12042 -21822 2260 13566
6039A3566N365o047j4718J4618J49j845J4r802R263K619k007p827M244K9865P731
$$ 13566 18931 12884 -1834 12784 12933 11088 11102 1300 10563 13182 11175 3348 7592 37457 45188
6024D5188O612j6071m3312j4616j2626n8J2400P564K1086J8688j2187j2628j203
$$ 45188 51800 35729 -7583 -22199 -34825 -34883 -22483 -14919 6167 24855 12668 40 -1163
6011a163k2996N400K2950j8013M33K903R054J1048o281m3754J3468J7001l335
$$ -1163 -24159 -18759 4191 -13822 -13389 -10486 -1432 9616 3335 -40419 -26951 -9950 -13285
5998a3285l6303q314J1294K3633J8644J423j4050j6717K6193j0602p491R8J9712
$$ -13285 -49588 -57902 -46608 -22975 -4331 -2908 -16958 -33675 -7482 -18084 -25575 -25477 -5765
5985e765K2459J1213j2789N674M485j3651j2529J7644r640J995J7393o369l3245
$$ -5765 16694 27907 15118 20792 25277 11626 -903 16741 7101 9096 26489 20120 -13125
5972a3125l0294J831J0778R221M581J6014N301m323j6542p411r752J4614J8116
$$ -13125 -43419 -41588 -30810 -21589 -17008 -994 4307 -16 -16558 -23969 -33721 -19107 -991
5959i91J2294M905J896l831R931j6798n560k070n405L1060k030k4401m320R717
$$ -991 11303 16208 18104 14273 24204 7406 1846 -224 -5629 25431 23401 -1000 -5320 4397
5945D397m322r717J5812j2000r760j9255P422J6665J9772J977j0410K1771j1726
$$ 4397 75 -9642 6170 -5830 -15590 -34845 -27423 -10758 9014 10991 581 22352 10626
5932A0626k7581j7216l887J5369K3067Q712k6824Q86K2830J1890J118k5237j2185
$$ 10626 -16955 -34171 -38058 -22689 378 9090 -17734 -16848 5982 17872 18990 -6247 -18432
5919a8432q83j509j0793K3351Q430J220l975J0105j6206j417l405J6789K246J3452
$$ -18432 -19315 -20824 -31617 -8266 164 1384 -2591 7514 -8692 -10109 -13514 3275 5521 18973
5905A8973Q441l5243j7108O605m782J063o141k727K635P674L838K1896J5304j7192
$$ 18973 27414 -7829 -24937 -18332 -23114 -22051 -28192 -30919 -28284 -20610 -16772 5124 20428 3236
5891C236k211q489J3574K983j0009l843J514M98j2173j7928m90L0357L1828K998
$$ 3236 1025 -7464 6110 9093 -916 -4759 -3245 -2747 -14920 -32848 -33338 -2981 28847 31845
5877C1845j1496O608M775o894q960l4197l459R052k616J2614n955q13k0534k374
$$ 31845 20349 26957 31732 24838 15878 -18319 -21778 -12726 -15342 -2728 -8683 -9496 -30030 -32404
5863c2404j282N724O481K9452K5955j4050M611k041j429k5967m3010R044L3274
$$ -32404 -33686 -27962 -21481 7971 33926 19876 24487 22446 21017 -4950 -47960 -38916 -5642
5850e642N639m331r139k0648M885R551L884j4363R836L3601K1303j0670k1494
$$ -5642 -3 -4334 -13473 -34121 -29236 -19685 -15801 -30164 -20328 13273 34576 23906 2412
5837B412K343k660r932M261q949o455J0070K2394k36j9774n555j1520p765P051
$$ 2412 4755 2095 -7837 -3576 -12525 -18980 -8910 13484 13248 -6526 -12081 -23601 -31366 -24315
5823b4315N850Q76P872O629m852J2190q43R368j6928P99J1096M653j243j0793
$$ -24315 -18465 -17589 -9717 -3088 -7940 4250 3407 12775 -4153 -3354 7742 12395 11152 359
5809C59l056k276j426j0999j0827K5420O174J5696o21K836J3205o247l3996j0133
$$ 359 -2697 -4973 -6399 -17398 -28225 -2805 3369 19065 18444 21280 34485 28238 -5758 -15891
5795a5891l535l156p82j6672j634J4754J0417j5584l382J0271J3034J3023Q111
$$ -15891 -19426 -22582 -23364 -40036 -41670 -26916 -16499 -32083 -35465 -25194 -12160 863 8974
5782H974j9057j818j9738l984K3854J0642n141O675N187P076K0200m74k0677o454
$$ 8974 -10083 -11901 -31639 -35623 -11769 -1127 -6268 407 5594 12670 32870 32396 11719 5265
5768E265k2479R034J9411o830k3162J5704O843j6301k4893K4148J8177j5149k8033
$$ 5265 -17214 -8180 11231 4401 -18761 -3057 3786 -12515 -37408 -13260 4917 -10232 -38265
5755c8265j0916J7934J1890j1315l82R318K0714L019k630R987j2216k121O591
$$ -38265 -49181 -31247 -19357 -30672 -31054 -21736 -1022 1997 -633 9354 -2862 -4983 1608
5742A608j4860M975J0424O342R821m696j934J2183j433r616o608k2084L301J4747
$$ 1608 -13252 -8277 2147 8489 18310 13614 11680 23863 22430 12814 6206 -15878 -12577 2170
5728B170j465j352j0123j1586j306n822r50M277J0845k482j2192J810J8447J089
$$ 2170 705 -647 -10770 -22356 -23662 -29484 -30434 -26157 -15312 -17794 -29986 -28176 -9729 -8640
5714h640j4606L145L93j0719M991K4576q494j2992o879J2510k991L568j0954r383
$$ -8640 -23246 -20101 -19708 -30427 -25436 -860 -9354 -22346 -29225 -16715 -19706 -16138 -27092 -36475
5700c6475L109J2869K4862K0259J9871k3637j1279K3828P661k2067j5360L487
$$ -36475 -33366 -20497 4365 24624 44495 20858 9579 33407 41068 19001 3641 7128
5688G128P35Q340k162j3184k2211O057K1648J3370L585o925Q534N369N482O466
$$ 7128 7863 16203 14041 857 -21354 -15297 6351 19721 23306 16381 24915 30284 35766 42232
5674D2232k0362j7635j4351P79J0629Q21K559J1559P51N868n431j597O118n874
$$ 42232 21870 4235 -10116 -9337 1292 2113 4672 16231 16982 22850 17419 15822 21940 16066
5660A6066o149j2301K3815K0539Q260j2858j0796n799q201j1526j234J10p048
$$ 16066 9917 -2384 21431 41970 50230 37372 26576 20777 12576 1050 -184 -74 -7122
5647g122J2021k321k6936J0874L556o803M103K7628J9313k5780N354N588j6629
$$ -7122 4899 2578 -24358 -13484 -9928 -16731 -12628 15000 34313 8533 13887 19475 2846
5634B846K077K2674K0310r218j6828k4178P814J4606j5983k1743k1081L770n912
$$ 2846 4923 27597 47907 38689 21861 -2317 5497 20103 4120 -17623 -38704 -34934 -40846
5621d0846Q046N41j5393j9681o147K0234K7470M835j8240j3178q22K690J165J4357
$$ -40846 -32800 -32259 -47652 -67333 -73480 -53246 -25776 -20941 -39181 -52359 -53181 -50491 -49326 -34969
5607c4969l672L341K4599l671L932P608k5800j2701j181K1739L914j7003J2563
$$ -34969 -38641 -35300 -10701 -14372 -10440 -2832 -28632 -41333 -42514 -20775 -16861 -33864 -21301
5594b1301L6029J5197J06L04O810o321k745o319P8L767j3012k1468k7849j030
$$ -21301 14728 29925 30031 30335 37145 30824 28079 21760 21838 25605 12593 -8875 -36724 -37754
5580c7754J1650L16K2437M7904L1959J1469l0916m3222j7784M743j0253R26O776
$$ -37754 -26104 -25788 -3351 44553 76512 87981 57065 13843 -3941 802 -9451 -8525 -1749
5567a749j0468K7998N862j9955m049K036j3359k4464M399J1279R678j9504q674
$$ -1749 -12217 15781 21643 1688 -2361 -325 -13684 -38148 -33749 -22470 -12792 -32296 -40970
5554d0970J6222q068J6334P50j6980o162P522J9653R60j1782m182O724J8834N994
$$ -40970 -24748 -32816 -16482 -15732 -32712 -38874 -31352 -11699 -10739 -22521 -26703 -19979 -1145 4849
5540D849O080N92L260r1J1465q775o141K254q551m728Q54J1095p39k6378l4851
$$ 4849 10929 11521 14781 14690 26155 17380 11239 13493 4942 214 1068 12163 11424 -14954 -49805
5525d9805p212L2855K7346J4122L659j0100j9538k0366k6046K756O802O165K2829
$$ -49805 -57017 -24162 3184 17306 20965 10865 -8673 -29039 -55085 -52329 -45527 -39362 -16533
5512a6533L2601K3538J1246r9j7276r546K718k6043j8135j4046j700M2620J7318
$$ -16533 16068 39606 50852 50753 33477 23931 26649 606 -17529 -31575 -33275 9345 26663
5499B6663k104P604k3708j9614K5335j45o708p832p64k255l51j3014J0208K8585
$$ 26663 24559 32163 8455 -11159 14176 14031 7323 -509 -1273 -3528 -3879 -16893 -6685 21900
5485B1900M495m236j160l1346k9329k1900M640K3426k379j976K7104K0892j3509
$$ 21900 26395 22159 20999 -10347 -39676 -61576 -56936 -33510 -35889 -37865 -10761 10131 -3378
5472c378k3772j6038K1035K0641N6J1618j073r288M209l979J0535k2003j2560
$$ -3378 -27150 -43188 -22153 -1512 -1456 10162 9089 -199 4010 31 10566 -11437 -23997
5459b3997K0599Q871j1593M360q816L230J435o689J617J0057J769j1141R210J0842
$$ -23997 -3398 5473 -6120 -1760 -10576 -7346 -5911 -12600 -10983 -926 843 -10298 -1088 9754
5445I754k0889k0912M976J7008J3863Q347j0735J1919K617n491r220k5657J2995
$$ 9754 -11135 -32047 -27071 -10063 3800 12147 1412 13331 15948 10457 1237 -24420 -11425
5432a1425P006J824q43j3936L019k365Q730O594k0602k0212M191M068K4157p865
$$ -11425 -4419 -2595 -3438 -17374 -14355 -16720 -7990 -1396 -21998 -42210 -38019 -33951 -9794 -17659
5418a7659r281J260R175J1379K268j9236j4397L279J787L0127P284P303R7l0816
$$ -17659 -26940 -25680 -16505 -5126 -2858 -22094 -36491 -33212 -31425 -1298 5986 13289 13386 -17430
5404a7430j2685J2071M89L671M981L881j1023K814m395J3882M426l663j2057L560
$$ -17430 -30115 -18044 -17555 -13884 -8903 -5022 -16045 -13231 -17626 -3744 682 -2981 -15038 -11478
5390a1478L692m019k0811m022J5880K360J113j386j0997K7566K1032j3118K448
$$ -11478 -7786 -11805 -32616 -36638 -20758 -18398 -17285 -18671 -29668 -2102 18930 5812 8260
5377H260r558k5463j2309N625O431O602K563J9088J380l363q598L559J7173k2420
$$ 8260 -1298 -26761 -39070 -33445 -27014 -20412 -17849 1239 2619 -744 -9342 -5783 11390 -11030
5363a1030j8944J0030q225J5581Q060J705L290j5167l779K222p765n310L706K2532
$$ -11030 -29974 -19944 -28169 -12588 -4528 -2823 467 -14700 -18479 -16257 -24022 -29332 -25626 -3094
5349c094O179j9033R07J0409L737L995O500J8201O489k014o69j7194j6361o771
$$ -3094 3085 -15948 -15041 -4632 -895 3100 9600 27801 34290 32276 31607 14413 -1948 -8719
5335h719J2526L520L004J9582K961o992l1145j3711P722q957K2342L259O282p179
$$ -8719 3807 7327 10331 29913 32874 25882 -5263 -18974 -11252 -20209 2133 5392 11674 4495
5321D495L819J2225R863K387j2894j2244M50r235l117J5955O382j5163P139Q123
$$ 4495 8314 20539 30402 32789 19895 7651 8101 -1134 -4251 11704 18086 2923 10062 18185
5307A8185j4749j6590k3372q307J2568J5897K2934l94j3495L691m49L973k3435
$$ 18185 3436 -13154 -36526 -44833 -32265 -16368 6566 6172 -7323 -3632 -4081 -108 -23543
5294b3543L515M208K3354j1248l0432L267K527J4131j2292J4529N155m808P807
$$ -23543 -20028 -15820 7534 -3714 -34146 -30879 -28352 -14221 -26513 -11984 -6829 -11637 -3830
5281c830K7670K8671r356p368m695N295o921k7607J1619r867M761l199J0710J1538
$$ -3830 23840 52511 43155 35787 31092 36387 29466 1859 13478 3611 8372 5173 15883 27421
5267B7421k5658j5131K646N979m021j2878K0996J9456n347j2838j3464O395K3833
$$ 27421 1763 -13368 -10722 -4743 -8764 -21642 -646 18810 13463 625 -12839 -6444 17389
5254A7389J9459k0210k2187k4122L745Q092k404j0331K2041K1558j5185k395j2508
$$ 17389 36848 16638 -5549 -29671 -25926 -17834 -20238 -30569 -8528 13030 -2155 -4550 -17058
5241a7058J0314K2161P500L961o294m380p958L264k0234j140K4297k034l799o990
$$ -17058 -6744 15417 22917 26878 20584 16204 8246 11510 -8724 -9864 14433 12399 8600 1610
5227A610j4676r589J3474K6900o659j0187k9612K994J3099K9548k577o609j6283
$$ 1610 -13066 -22655 -9181 17719 11060 873 -28739 -25745 -12646 16902 14325 7716 -8567
5214h567j5810O876m743j7307r83k29J1788p153j2505J2025J8473R084N390l3417
$$ -8567 -24377 -17501 -22244 -39551 -40534 -40763 -28975 -36128 -48633 -36608 -18135 -9051 -3661 -37078
5200c7078J1142L8434J8902k0145J4367K955k0601M093R244j3667n074J922R790
$$ -37078 -25936 12498 31400 11255 25622 28577 7976 12069 21313 7646 2572 4494 14284
5187A4284K5426N6j2032l7499j2461K339O552K1846J0845q392p566J1007j6482
$$ 14284 39710 39766 27734 -9765 -22226 -19887 -13335 8511 19356 10964 3398 14405 -2077
5174b077J0979J0119m462j4741n648M813j759j8494L889j63K782M4767k952m379
$$ -2077 8902 19021 14559 -182 -5830 -1017 -2776 -21270 -17381 -17544 -14762 30005 27053 22674
5160B2674j9966j2714R452L025J1020K028j1734J2892q406j8009q344J0622N248
$$ 22674 2708 -10006 -554 2471 13491 15519 3785 16677 8271 -9738 -18082 -7460 -2212
5147b212r667J793J3267O749j0353M746K0568l982q839o693j5073N016r480j5291
$$ -2212 -11879 -10086 3181 9930 -423 4323 24891 20909 12070 5377 -9696 -4680 -14160 -29451
5133b9451L179K7308q871j1010N303m033k298Q201j255K1847J2916j4032J9833
$$ -29451 -26272 1036 -7835 -18845 -13542 -17575 -19873 -11672 -12927 8920 21836 7804 27637
5120B7637k739j1609k6360p01p495j0086J5779n332R210J2789R765N99M097m973
$$ 27637 24898 13289 -13071 -13772 -21267 -31353 -15574 -20906 -11696 1093 10858 11457 15554 10581
5106A0581L259j3899m029Q18k919j8987J2208J1707J118j4333j8956J1844P175
$$ 10581 13840 -59 -4088 -3270 -6189 -25176 -12968 -1261 -143 -14476 -33432 -21588 -14413
5093a4413r754q713k4300m978J9546K7498R180o944N696L5183J4168J636J4339
$$ -14413 -24167 -32880 -57180 -62158 -42612 -15114 -5934 -12878 -7182 28001 42169 43805 58144
5080E8144k5306k5627k0118j8446Q220K1140p330l2453J250L9811L1478m051k5369
$$ 58144 32838 7211 -12907 -31353 -23133 -1993 -9323 -41776 -40526 -715 30763 26712 1343
5067A343j3588J1541j6511K244J7533P984K4560k1378j3436M066O222O349Q160
$$ 1343 -12245 -704 -17215 -14971 2562 10546 35106 13728 292 4358 10580 16929 25089
5054B5089j0555O39j0578R013k2223m151K4430q650j7071O473j526l40J1849K0340
$$ 25089 14534 15173 4595 13608 -8615 -12766 11664 3014 -14057 -7584 -9110 -9450 2399 22739
5040B2739R139k3167j9109K899J1652L6731P136m169j2388j3080N561j8428j4373
$$ 22739 31878 8711 -10398 -7499 4153 40884 48020 43851 31463 18383 23944 5516 -8857
5027h857M059K6868j0666j5139j0015J8772J3647R754k555N194j1796M250q474
$$ -8857 -4798 22070 11404 -3735 -13750 5022 18669 28423 25868 31062 19266 23516 15042
5014A5042m5579k9046K4934J7299K8847j4616m495J7579j5525j7184j6224k1353
$$ 15042 -30537 -59583 -34649 -17350 11497 -3119 -7614 9965 -5560 -22744 -38968 -60321
5002f0321J063N615J3115K4004J1393J0830M881j7187n055n861r450K8753Q680
$$ -60321 -59258 -53643 -40528 -16524 -5131 5699 10580 -6607 -11662 -17523 -26973 1780 10460
4989A0460j8018r893K6500R886k1504j5324n700J6335J5892q082j7386J722J7861
$$ 10460 -7558 -17451 9049 18935 -2569 -17893 -23593 -7258 8634 552 -16834 -15112 2749
4976B749j1840j6209L433K4114P909j582m028M81N044j8679j3143k491j240J9727
$$ 2749 -9091 -25300 -21867 2247 10156 8574 4546 5027 10071 -8608 -21751 -24242 -25482 -5755
4962e755j675j1597j9553o114M338J9079q910o964k2610k100K2308K2272J057
$$ -5755 -7430 -19027 -38580 -44694 -40356 -21277 -30187 -37151 -59761 -61861 -39553 -17281 -16224
4949a6224L2986J1670l4799N168j855M046N063j658r726K956J5034P495j1978
$$ -16224 16762 28432 -6367 -1199 -3054 992 6055 4397 -5329 -2373 12661 20156 8178
4936H178L731j746j5770O48J2429K812R33O194j8428k3139J7K4628K313j2215
$$ 8178 11909 10163 -5607 -4959 7470 10282 11215 17409 -1019 -24158 -24141 487 2800 -9415
4922i415j0931J3936J80J935j3725n505R344K4112n662k3751J3129K4639J1463
$$ -9415 -20346 -6410 -6230 -4295 -18020 -23525 -14181 9931 4269 -19482 -6353 18286 29749
4909B9749P977k4847k4544m862J4714j1818j0203J3805R371J0362J2260O705J723
$$ 29749 37726 12879 -11665 -16527 -1813 -13631 -23834 -10029 -658 9704 21964 28669 30392
4896C0392N64j1567j2516j1845K0916M348L696j286n480j519J8416K167j848n175
$$ 30392 30956 19389 6873 -4972 15944 20292 23988 22702 17222 15703 34119 36286 34438 29263
4882B9263j7148j5091j7743j6590J1342J2852R075j1426K877J7704J3470J551
$$ 29263 12115 -2976 -20719 -37309 -25967 -13115 -4040 -15466 -12589 5115 18585 20136
4870B0136m354j3830l167J4305j1113k3526J6143p718q090L027l128J5638N733
$$ 20136 15782 1952 -1215 13090 1977 -21549 -5406 -13124 -21214 -18187 -21315 -5677 56
4857E6p849o756j1680p027N346Q502J8447L36j1081m13K7798o053k2002r642j395
$$ 56 -7793 -14549 -26229 -33256 -27910 -19408 -961 -625 -11706 -12119 15679 9626 -12376 -22018 -23413
4842b3413J1070J7264o989r189r849j0611J5278J2856P674L979M849p917j3609
$$ -23413 -12343 4921 -2068 -11257 -21106 -31717 -16439 -3583 4091 8070 12919 5002 -8607
4829h607M832J1082J8412j9705o430J2692J7741R970j0489j2593q370N074j3349
$$ -8607 -3775 7307 25719 6014 -416 12276 30017 39987 29498 16905 8535 13609 260
4816B60j3740N603m772Q498p97j2492k6821J4315K6263J4662K077n833R26J2599
$$ 260 -13480 -7877 -12649 -4151 -4948 -17440 -44261 -29946 -3683 10979 13056 7223 8149 20748
4802B0748J9764j7272k568l029k3476k2764P585J3588J0659J3291r401J5705J6409
$$ 20748 40512 23240 20672 17643 -5833 -28597 -21012 -7424 3235 16526 7125 22830 39239
4789C9239L883k9454k3118j6983j3808N74L617l583O106J3649J0653K770J9721
$$ 39239 43122 13668 -9450 -26433 -40241 -39667 -36050 -39633 -33527 -19878 -9225 -6455 13266
4776A3266o636k1441k2510j615L8079M397Q369k131J104j025q93l7644M084P314
$$ 13266 6630 -14811 -37321 -38936 -857 3540 11909 9778 10882 9857 8964 -28680 -24596 -17282
4762a7282l968J7538j1701o128Q899O326M779r034k1308n477J5753K1587K089
$$ -17282 -21250 -3712 -15413 -21541 -12642 -6316 -1537 -10571 -31879 -37356 -21603 -16 2073
4749B073l9353k2090J9952K7304O018R195j4921n664o271j6696J6402J991J8033
$$ 2073 -37280 -59370 -39418 -12114 -6096 3099 -11822 -17486 -23757 -40453 -24051 -22060 -4027
4736d027m412m383J5864q310Q927O341L601j0562L142N578P604m999j0089R938
$$ -4027 -8439 -12822 3042 -5268 3659 10000 13601 3039 6181 11759 19363 14364 4275 14213
4722A4213R969p382k3711k810N976K1918J4028M681Q180k0606j1262q435Q209
$$ 14213 24182 16800 -6911 -9721 -3745 18173 32201 36882 45062 24456 13194 4759 12968
4709A2968j30j7624m67j820j944j1237K037J33m391n23j3064P292J9359m096o863
$$ 12968 12838 -4786 -5253 -7073 -9017 -20254 -18217 -18084 -22475 -22998 -36062 -28770 -9411 -13507 -20370
4694b0370N921J5998j6432l7263j6397L78J3114L3535Q334L604j0487O884o036
$$ -20370 -14449 1549 -14883 -52146 -68543 -68165 -55051 -21516 -13182 -9578 -20065 -13181 -19217
4681a9217o198J9716j3904j0748j97L698r016J0005n254N975J0797Q91q708J5044
$$ -19217 -25415 -5699 -19603 -30351 -30548 -26850 -35866 -25861 -31115 -25140 -14343 -13452 -22160 -7116
4667g116K0099R497m567M623N840n409J2451n757k0123N867p197j2141J1160j2178
$$ -7116 12983 22480 17913 22536 28376 22967 35418 29661 9538 15405 8208 -3933 7227 -4951
4653d951j7764j1797k6115l848Q998J6810K3181n811P929L0019K8767J1394K751
$$ -4951 -22715 -34512 -60627 -64475 -55477 -38667 -15486 -21297 -13368 16651 45418 56812 59563
4640E9563j1648k2355l0959j6021L671N650Q810q124n012k7303k290J0036J6582
$$ 59563 47915 25560 -5399 -21420 -17749 -12099 -3289 -11413 -16425 -43728 -46018 -35982 -19400
4627a9400K0915j1806q99K8971P583j624j7275P841P631n568j6544J9884M434
$$ -19400 1515 -10291 -11190 17781 25364 23740 6465 14306 21937 16369 -175 19709 24143
4614B4143q468j1986j184k0548K08P283P870r095n96n715K1720L2109k0709m56
$$ 24143 15675 3689 2505 -18043 -17835 -10552 -2682 -11777 -12373 -18088 3632 35741 15032 14576
4600A4576P750P732o074q724j5202k6777n410M884k5994K388L6825K6865J4019
$$ 14576 22326 30058 23984 15260 58 -26719 -32129 -27245 -53239 -50851 -14026 12839 26858
4587B6858m975k6158N206J0133K506Q303Q132r953k4863k292J2039K0045J295
$$ 26858 21883 -4275 931 11064 13570 21873 30005 20052 -4811 -7103 4936 24981 26276
4574B6276j7614j877j6486Q95R335k400p389l988K271J3557j0087k864k1966J863
$$ 26276 8662 6785 -9701 -8806 529 -1871 -9260 -13248 -10977 2580 -7507 -10371 -32337 -30474
4560c0474Q758n560j0563K921O870n253l375N617M011j8768P240j5291N638R062
$$ -30474 -21716 -27276 -37839 -34918 -28048 -33301 -36676 -31059 -27048 -45816 -38576 -53867 -48229 -39167
4546c9167N024K1677J4899O832j4268j4111J5713K3294J3606m683j6094j1685
$$ -39167 -34143 -12466 2433 9265 -5003 -19114 -3401 19893 33499 28816 12722 1037
4534A037J6109J9827O018M944k3816j0962j3647j1720K3590J7070j414j7769j0039
$$ 1037 17146 36973 42991 47935 24119 13157 -490 -12210 11380 28450 27036 9267 -772
4521g72j1958l897J195K4241n501k0407j0298P023J6315J2375R889L697J0295
$$ -772 -12730 -16627 -15432 8809 3308 -17099 -27397 -20374 -4059 8316 18205 21902 32197
4508C2197k6983j0848N695o791J0607j0513j6495p352l668R144R696j968J8296
$$ 32197 5214 -5634 61 -6730 3877 -6636 -23131 -30483 -34151 -25007 -15311 -17279 1017
4495A017L980k447n095L437j7600l457l162j2994J1137J3736k3679m166K4193
$$ 1017 4997 2550 -2545 892 -16708 -20165 -23327 -36321 -25184 -11448 -35127 -39293 -15100
4482a5100L7094j472n595J4215J0958q504o590P137j671k1716m742o888L493J9139
$$ -15100 21994 20522 14927 29142 40100 31596 25006 32143 30472 8756 4014 -2874 619 19758
4468A9758l569n754j5992j4741k0513J0901R947k39Q726J420K5180P809r516k6662
$$ 19758 16189 10435 -5557 -20298 -40811 -29910 -19963 -20202 -11476 -10056 15124 22933 13417 -13245
4454a3245p490Q521r917j1279J2992q549K4091J7260l7984l304L3742K689j4194
$$ -13245 -20735 -12214 -22131 -33410 -20418 -28967 -4876 12384 -25600 -28904 4838 7527 -6667
4441f667j111J4008j3286R616n873J5438m942O203k478k530R653k525K4479k8451
$$ -6667 -7778 6230 -7056 2560 -3313 12125 7183 13386 10908 8378 18031 15506 39985 11534
4427A1534l9468j2150L2917K050j0025L513j159L34K7537m217k8780k150K9037
$$ 11534 -27934 -40084 -7167 -5117 -15142 -11629 -12788 -12454 15083 10866 -17914 -20064 8973
4414H973J3269P999o077j0286m634K121j1101j5896j7685o642K2646R245N924
$$ 8973 22242 30241 24164 13878 9244 11365 264 -15632 -33317 -39959 -17313 -8068 -2144
4401b144J3125j9130m787K1560J0707K7388K5k2429k4595J2861M803k7776r125
$$ -2144 10981 -8149 -12936 8624 19331 46719 46744 24315 -280 12581 17384 -10392 -19517
4388a9517J567L04K418j3458p499J0300R912r730K3197O228k418J68J2998j8819
$$ -19517 -17950 -17646 -15228 -28686 -36185 -25885 -15973 -25703 -2506 3722 1304 1472 14470 -4349
4374d349k5890q423m354L0195K9056j084j973k5880n49P535J4991j5j0529k047
$$ -4349 -30239 -38662 -43016 -12821 16235 15151 13178 -12702 -13251 -5716 9275 9260 -1269 -3316
4360c316Q221O454N378K6827J2773j8710k9036j3157R181K7558k8908j9417L206
$$ -3316 4905 11359 16737 43564 56337 37627 8591 -4566 4615 32173 3265 -16152 -12946
4347a2946J1297k001j8861J3288P270q623Q492o876p801K559N565R8p67p746N43
$$ -12946 -1649 -3650 -22511 -9223 -1953 -10576 -2084 -8960 -16761 -14202 -8637 -8539 -9306 -17052 -16509
4332a6509K4086m192j8484R763K615J2284K2387j006j2077o053J1243r914L6k0531
$$ -16509 7577 3385 -15099 -5336 -2721 9563 31950 30944 18867 12814 24057 14143 14179 -6352
4318f352j6810J7863K5677m058q353k0062j8668J0260J6743Q542K4763K8302N804
$$ -6352 -23162 -5299 20378 16320 7967 -12095 -30763 -20503 -3760 4782 29545 57847 63651
4305F3651J1189J4201j8588k4141j1060k7109j8206j446L666j903K2089N397q290
$$ 63651 74840 89041 70453 46312 35252 8143 -10063 -11509 -7843 -9746 12343 17740 9450
4292I450J0143J4977J2897m599r103r331k6421j260N997m00m468J7768k8762r855
$$ 9450 19593 34570 47467 42868 33765 24434 -1987 -3247 2750 2350 -2118 15650 -13112 -22967
4278b2967J4316M74K474j3327R217L045j7402J4641J0226J7684K0514n296k563
$$ -22967 -8651 -8177 -5703 -19030 -9813 -6768 -24170 -9529 697 18381 38895 33599 31036
4265C1036j5405j8505j6796j582K2911k392j5816K244J7796J9072j6150m1274
$$ 31036 15631 -2874 -19670 -21252 1659 -733 -16549 -14305 3491 22563 6413 -34861
4253c4861J5277J8451J3328j9166j2697J6298K5728L3706L741j3155j5856l6652
$$ -34861 -19584 -1133 12195 -6971 -19668 -3370 22358 56064 59805 46650 30794 -5858
4241e858l2094Q400K4139J0978j7568j9667J4457J0667P753P0J201j9854j8655
$$ -5858 -37952 -29552 -5413 5565 -12003 -31670 -17213 -6546 1207 1277 2478 -17376 -36031
4228c6031K5711J6901n83p987l441q557q864q876k826K871K567K2515J4234Q49
$$ -36031 -10320 6581 5998 -1989 -5430 -13987 -22851 -31727 -34553 -31682 -29115 -6600 7634 8483
4214H483j4641j741r907K946l709J4160K199o494j8586K912K7968n753k563L111
$$ 8483 -6158 -7899 -17806 -14860 -18569 -4409 -2210 -8704 -27290 -24378 3590 -2163 -4726 -1615
4200a615K5487j1367k8813P309J2197q57p678J215q524j964m535J8617L6295R023
$$ -1615 23872 12505 -16308 -8999 3198 2341 -5337 -4122 -12646 -14610 -19145 -528 35767 44790
4186D4790r565k3160j7782p138J0075K9366j1101k6629k308P1l647k0797J0565
$$ 44790 35225 12065 -5717 -12855 -2780 26586 15485 -11144 -13452 -13381 -17028 -37825 -27260
4173b7260K8040j4155q364J3788J6819K4087K7579l4343k7983j3430m294k1986
$$ -27260 780 -13375 -21739 -7951 8868 32955 60534 26191 -1792 -15222 -19516 -41502
4161d1502N098N220K5794Q920M988J5169J538k4153J000L788O730l903K2185J4922
$$ -41502 -36404 -31184 -5390 3530 8518 23687 25225 1072 2072 5860 12590 8687 30872 45794
4147D5794j5217l7002j5061M651J8341N977j699m5j56J1143m203j5984k1834K3275
$$ 45794 30577 -6425 -21486 -16835 1506 7483 5784 5739 5583 16726 12523 -3461 -25295 -2020
4133b020L646O200o557J0555J776J8r566L897J3693q385o598J036P626K3977r745
$$ -2020 1626 7826 1269 11824 13600 13618 4052 7949 21642 13257 6659 7695 15321 39298 29553
4118B9553j0805j8854R018m51j2729K267Q144j0078O193n096j5387P111J4038
$$ 29553 18748 -106 8912 8461 -4268 -2001 6143 -3935 2258 -2838 -18225 -11114 2924
4105B924p391k709p18K0814J6043P552j619o974r085j7520j2418J6918N433m558
$$ 2924 -4467 -7176 -7894 12920 28963 36515 34896 27922 18837 1317 -11101 5817 11250 6692
4091F692j7570Q924K9023J1693j7017k0037j0701J242m386m885Q487J0658J3422
$$ 6692 -10878 -1954 27069 38762 21745 1708 -8993 -7751 -12137 -17022 -8535 2123 15545
4078A5545k7453k3711J112L6505J1105j963k3339K0937J3831J456L715l2157j6221
$$ 15545 -11908 -35619 -34507 1998 13103 11140 -12199 8738 22569 24025 27740 -4417 -20638
4065b0638N196P053J2151j29j1414J544j7919J6274J5946p592r200R895j0156
$$ -20638 -15442 -8389 3762 3633 -7781 -6237 -24156 -7882 8064 472 -8728 1167 -8989
4052h989j6862k6605l541L8274K3733j1872j334r659J0092j977J0048L189q257
$$ -8989 -25851 -52456 -55997 -17723 6010 -5862 -7196 -16855 -6763 -8740 1308 4497 -3760
4039c760J3353J4524j1491m424J9046J500j2489P037O151j5393j119R77k60j1382
$$ -3760 9593 24117 12626 8202 27248 28748 16259 23296 29447 14054 12935 13912 13652 2270
4025B270j5987O71J7265m914O613Q637j289j5512n943J3945M1556P639j5487j7939
$$ 2270 -13717 -13046 4219 -695 5918 14555 13266 -2246 -8189 5756 47312 54951 39464 21525
4011B1525l267L382k568j6956j1894n624j331j8673o947L0802m133k6210r839
$$ 21525 18258 21640 19072 2116 -9778 -15402 -16733 -35406 -42353 -11551 -15684 -41894 -51733
3998e1733K3684L4264R206j0793J800J0077J1527j438k0405j5351m621j1647J7757
$$ -51733 -28049 6215 15421 4628 6428 16505 28032 26594 6189 -9162 -13783 -25430 -7673
3985g673M840n023j1785p743K469o444j4057K3892J9666K1368O591n238l0291
$$ -7673 -2833 -7856 -19641 -27384 -24915 -31359 -45416 -21524 -1858 19510 26101 20863 -9428
3972i428r19l855l813R272K1139l433l1326k378J3004q979K3152J1686j7487J938
$$ -9428 -10347 -14202 -18015 -8743 12396 8963 -22363 -24741 -11737 -20716 2436 14122 -3365 -1427
3958a427k3431Q74j929J4714K7240k397k3548k7909K5431L1916K4875j799j2047
$$ -1427 -24858 -23984 -25913 -11199 16041 13644 -9904 -37813 -12382 19534 44409 42610 30563
3945C0563k1898M69j647J5752J0291n066j9155r493j0064l2119l615M5280J1597
$$ 30563 8665 9134 7487 23239 33530 28464 9309 -184 -10248 -42367 -45982 -702 10895
3932A0895n449o860J494P203J6840j0464k038k3101J3350O680j177K6821P494
$$ 10895 5446 -1414 80 7283 24123 13659 11621 -11480 1870 8550 7373 34194 41688
3919D1688l728r22j5822j2604p814J0898M372K2435j4204k3289J1291k9122j4475
$$ 41688 37960 37038 21216 8612 798 11696 16068 38503 24299 1010 12301 -16821 -31296
3906c1296K131K664K722J9868J6551K747j1391o510k1495k5906J355k80l345K4553
$$ -31296 -29165 -26501 -23779 -3911 12640 15387 3996 -2514 -24009 -49915 -48560 -48840 -52185 -27632
3892b7632R305k386J106J8553q230j9307J0972k451L860R916k547P35Q796q156
$$ -27632 -18327 -20713 -19607 -1054 -9284 -28591 -17619 -20070 -16210 -6294 -8841 -8106 690 -7466
3878g466J387M9164J0019j6061k6237k4215m201L1330K4305j3184J2063l4883
$$ -7466 -6079 43085 53104 37043 10806 -13409 -17610 13720 38025 24841 36904 2021
3866B021j3587j0919L789N928L0189J2122j4825j1391J9085J4492J2783L968j0874
$$ 2021 -11566 -22485 -18696 -12768 17421 29543 14718 3327 22412 36904 49687 53655 42781
3853D2781j6735J2609q11j0906O854l553q802j8662J0283J6490j597j8719M219
$$ 42781 26046 38655 37844 26938 33792 30239 21437 2775 13058 29548 27951 9232 13451
3840A3451K452k7541n679K2270J4341R927j4729J4246J0575N72j459l1607n00
$$ 13451 15903 -11638 -17317 4953 19294 29221 14492 28738 39313 39885 38426 6819 6319
3827F319r602o655L003J2315j2942m007J4911r218Q912J3607j4246M909o669l8742
$$ 6319 -3283 -9938 -6935 5380 -7562 -11569 3342 -5876 3036 16643 2397 7306 637 -38105
3813c8105k11K1522J2220m098j5153M275k020K695O310L298j0158j9214k810J5512
$$ -38105 -38316 -16794 -4574 -8672 -23825 -19550 -21570 -18875 -12565 -9267 -19425 -38639 -41449 -25937
3799b5937M394n796K0821K1845R755o332j6340j5086j0774O566P843K1592j301
$$ -25937 -21543 -27339 -6518 15327 25082 18750 2410 -12676 -23450 -16884 -9041 12551 11250
3786A1250L733J8950m998J1889j8251j3752N852J1165o967k2563o141K930J0068
$$ 11250 14983 33933 28935 40824 22573 8821 14673 25838 18871 -3692 -9833 -6903 3165
3773C165R430J4872K0020m323k0623r590j2326k1420J3324J2277P980n645j5709
$$ 3165 12595 27467 47487 43164 22541 12951 625 -20795 -7471 4806 12786 7141 -8568
3760h568j2893J8173Q032j0723l036l955J8970K6781Q116j6743o440O76r371j115
$$ -8568 -21461 -3288 4744 -5979 -9015 -12970 6000 32781 40897 24154 17714 18390 9019 7904
3746G904J0126k7719j983J0834J1344J1898M248r674l475r011q004k0693N85J0557
$$ 7904 18030 -9689 -11672 -838 10506 22404 26652 16978 13503 4492 -3512 -24205 -23620 -13063
3732a3063j1056J6633J0833q967J641J8662j3014k8195M853K0531j4414j5110
$$ -13063 -24119 -7486 3347 -5620 -3979 14683 1669 -26526 -21673 -1142 -15556 -30666
3720c0666M536m82K8749P059k4958l899J208p971O175J0009R082R811j2466j9014
$$ -30666 -26130 -26612 2137 9196 -15762 -19661 -18453 -26424 -20249 -10240 -1158 8653 -3813 -22827
3706b2827l305k126j0123J9509K5977Q649j8423l1609P073K152n678J2888l471
$$ -22827 -26132 -28258 -38381 -18872 7105 15754 -2669 -34278 -27205 -25053 -30731 -17843 -21314
3693b1314J3746o437J3926J6189n388p241k924l3931j5234K9209J3163p193R11
$$ -21314 -7568 -14005 -79 16110 10722 3481 557 -33374 -48608 -19399 -6236 -13429 -12518
3680a2518L832M911J0704K6867k0082k0440K2817n610k9806n635J6130K1131K6462
$$ -12518 -8686 -3775 6929 33796 13714 -6726 16091 10481 -19325 -24960 -8830 12301 38763
3667C8763l735j5592J569q012j8366n912j363o531M127k342O890q62j5772j2287
$$ 38763 35028 19436 21005 12993 -5373 -11285 -12648 -19179 -15052 -17394 -10504 -11366 -27138 -39425
3653c9425q598K412J6731K3348Q046L191R964j752o488J212q648R270Q852K4815
$$ -39425 -48023 -45611 -28880 -5532 2514 5705 15669 13917 7429 8641 -7 9263 18115 42930
3639D2930L320n735j0464k6762k098j7696Q062K848m073j1486O043R346K7731
$$ 42930 46250 40515 30051 3289 1191 -16505 -8443 -5595 -9668 -21154 -15111 -5765 21966
3626B1966J2417j0715k2801L435j2694j7888j0544L710L0518J9399l501p664R577
$$ 21966 34383 23668 867 4302 -8392 -26280 -36824 -33114 -2596 16803 13302 5638 15215
3613A5215J668k4006K0796J1008m504k1281K151L457j168r693L715k550O541j0964
$$ 15215 16883 -7123 13673 24681 20177 -1104 1047 4504 3336 -6357 -2642 -5192 1349 -9615
3599i615k03J9812r761j6522r937Q174K4901J1717j2064r961r703J5177p914k375
$$ -9615 -9818 9994 233 -16289 -26226 -18052 6849 18566 6502 -3459 -13162 2015 -5899 -8274
3585h274O273K748J3621M275J2941K989M412l287k1890j170Q33j8900J3255l90
$$ -8274 -2001 747 14368 18643 31584 34573 38985 35698 13808 12638 13471 -5429 7826 7436
3571G436R68J9099J865j4584M491N117j3012o764J2413J9358l9065k6488j0199
$$ 7436 8404 27503 29368 14784 19275 24392 11380 4616 17029 36387 -2678 -29166 -39365
3558c9365r967J6878J6181R989j0975j4732k478r07K0900K0985n939j0273O143
$$ -39365 -49332 -32454 -16273 -6284 -17259 -31991 -34469 -35376 -14476 6509 570 -9703 -3560
3545c560j8154k4877l831j2328K7624R858J2350K7909L925p698J8044K393k4806
$$ -3560 -21714 -46591 -50422 -62750 -35126 -25268 -12918 14991 18916 11218 29262 31655 6849
3532F849j5539j156l809N98j9414p125M35j151J5042K5595K3080p739p182n673
$$ 6849 -8690 -9846 -13655 -13057 -32471 -39596 -39161 -40312 -25270 325 23405 15666 8484 2811
3518B811k8887j0828N562J6963q589L8075K1389j5897j255M416l329P412l466
$$ 2811 -26076 -36904 -31342 -14379 -22968 15107 36496 20599 19344 23760 20431 27843 24377
3505B4377j3599r369o920k376k5533j1152N601R585O576n749j067J8208J0006
$$ 24377 10778 1409 -5511 -7887 -33420 -44572 -38971 -29386 -22810 -28559 -29626 -11418 -1412
3492a412J9129k595K364K292j5357j5697k848j243j8593K943J0124J863j4015
$$ -1412 17717 15122 17486 19778 4421 -11276 -14124 -15367 -33960 -31017 -20893 -19030 -33045
3479c3045m669j1734m28J9225O797n889j069P660j9126M588L548j017J7659Q914
$$ -33045 -37714 -49448 -49876 -30651 -23854 -29743 -30812 -23152 -42278 -37690 -34142 -35159 -17500 -8586
3465h586q506m88P106K4329J9215J0676J556j7362j1536J0308p112l5366n960
$$ -8586 -17092 -17580 -10474 13855 33070 43746 45302 27940 16404 26712 19600 -15766 -21726
3452b1726L1559P670k0357k8766J1699J9824k1894K242K8731J579r750J0757J7316
$$ -21726 9833 17503 -2854 -31620 -19921 -97 -21991 -19749 8982 10561 811 11568 28884
3439B8884J3473l6810k0075j3862k0221K223L1027J8529P503J2093J726R422R944
$$ 28884 42357 5547 -14528 -28390 -48611 -46388 -15361 3168 10671 22764 24490 33912 43856
3426D3856o516r145j7754j1863R817J0087q14l236m634O125j1096q393J1979Q673
$$ 43856 37340 28195 10441 -1422 8395 18482 17668 14432 9798 15923 4827 -3566 8413 17086
3412A7086j337K008J6327j3692r989j1996L3793j0458K612K8417k3372j6622j007
$$ 17086 15749 17757 34084 20392 10403 -1593 32200 21742 24354 52771 29399 12777 11770
3399A1770k247j8583l115J1609l0844j2919K9811k7568P375J5103P242J6517l249
$$ 11770 9523 -9060 -12175 -566 -31410 -44329 -14518 -42086 -34711 -19608 -12366 4151 902
3386I02J4867M381k1929M858j3289l279K616q080k2428j5400o379J8529J9108
$$ 902 15769 20150 -1779 3079 -10210 -13489 -10873 -18953 -41381 -56781 -63160 -44631 -25523
3373b5523J6168J5870j0629J0118J8652N219n315j4798k0182M281K2201k201j8546
$$ -25523 -9355 6515 -4114 6004 24656 29875 24560 9762 -10420 -6139 16062 13861 -4685
3360d685j4358J8427K6249k4691k0150L747J2672j4455M873k261j0882P686J890
$$ -4685 -19043 -616 25633 942 -19208 -15461 -2789 -17244 -12371 -14632 -25514 -17828 -15938
3347a5938n624m041J8010J2232J7812K6148J4678l6377k0610O569J0231Q897Q610
$$ -15938 -21562 -25603 -7593 4639 22451 48599 63277 26900 6290 12859 23090 31987 40597
3334D0597l6191j4052J1960r63L0226J1517j1887O075m537J3964q064j4315j6932
$$ 40597 4406 -9646 2314 1351 31577 43094 31207 37282 32745 46709 38645 24330 7398
3321G398l6110Q424K5700k367K5391J2935k5583l466O864n819k271k2411O222
$$ 7398 -28712 -20288 5412 3045 28436 41371 15788 12322 19186 13367 11096 -11315 -5093
3308e093J9079j0457j5759k408n503K0653K3619j3127j4435J512J0769P35p33
$$ -5093 13986 3529 -12230 -14638 -20141 512 24131 11004 -3431 -1919 8850 9585 8852
3295H852n044j1069L643j1602k3160L508K2012J4768L091q915k4534j0710J2510
$$ 8852 3808 -7261 -3618 -15220 -38380 -34872 -12860 1908 4999 -3916 -28450 -39160 -26650
3282b6650o465k559k56j903o520O254L1879K2008M777j5611O308K112j1592k632
$$ -26650 -33115 -35674 -35930 -37833 -44353 -38099 -6220 15788 20565 4954 11262 13374 1782 -850
3268h50p501J4352M998m596j7498q362J2969q832J6117K719J7072J1548j9604
$$ -850 -8351 6001 10999 6403 -11095 -19457 -6488 -15320 797 3516 20588 32136 12532
3255A2532r331j574n017k091J2789J2786J6241m627j4791q413n887o745k627j9934
$$ 12532 3201 1627 -3390 -5481 7308 20094 36335 31708 16917 8504 2617 -4128 -6755 -26689
3241b6689q711j8470O630J9387q251J9500r511k5806K0803K1084K686l974m69
$$ -26689 -35400 -53870 -47240 -27853 -36104 -16604 -26115 -51921 -31118 -10034 -7348 -11322 -11791
3228a1791k0296K5489J6315j8273r662J0611L1144Q717l051m532r377R390k215
$$ -11791 -32087 -6598 9717 -8556 -18218 -7607 23537 32254 29203 24671 15294 24684 22469
3215B2469l0517j807J8251r837m492n870J6347j7094l066J7405k0754j9947l617
$$ 22469 -8048 -9855 8396 -1441 -5933 -11803 4544 -12550 -15616 1789 -18965 -38912 -42529
3202d2529R992L379m512O279J0998j5822l686K3477L7547J7496j2571j2803k0135
$$ -42529 -32537 -29158 -33670 -27391 -16393 -32215 -35901 -12424 25123 42619 30048 17245 -2890
3189b890j3902j014m602q723n360o719J854J4725J1437J2665J9226j8062l169
$$ -2890 -16792 -17806 -22408 -31131 -36491 -43210 -41356 -26631 -15194 -2529 16697 -1365 -4534
3176d534R77j4228j433J9302j1199m844L2014N148j8737K1792R353n108k7106
$$ -4534 -3557 -17785 -19218 84 -11115 -15959 16055 21203 2466 24258 33611 28503 1397
3163A397m55J5021o410N112Q081M421j4524k5338o944n897J8207J7057K829k1051
$$ 1397 942 15963 9553 14665 22746 27167 12643 -12695 -19639 -25536 -7329 9728 12557 -8494
3149h494k5421R617Q210P290j5912J0382R922p099L737N603o503J376J1666J2199
$$ -8494 -33915 -24298 -16088 -8798 -24710 -14328 -4406 -11505 -7768 -2165 -8668 -7292 4374 16573
3135A6573j8083K537L506M444J7310K035l9266j1718n601j3477K4568L922K126
$$ 16573 -1510 1027 4533 8977 26287 28322 -10944 -22662 -28263 -41740 -17172 -13250 -11124
3122a1124p664j1304O697L7100J1835J5853r366k2565j0828l75j9192j4236p510
$$ -11124 -18788 -30092 -23395 13705 25540 41393 32027 9462 -1366 -1741 -20933 -35169 -42679
3109d2679J1282P84J0659J7548N79k588J326n454j5069K8842K2939O455j8249
$$ -42679 -31397 -30613 -19954 -2406 -1827 -4415 -3089 -8543 -23612 5230 28169 34624 16375
3096A6375M407L7186j0392j8710k2608m5017p731l501J9244K0070K2548n029P705
$$ 16375 20782 57968 47576 28866 6258 -38759 -46490 -49991 -30747 -10677 11871 6842 14547
3083A4547j8492p64N942r12m915o757j7386J4880K3330p069k8386J0074j953L0670
$$ 14547 -3945 -4709 1233 321 -4594 -11351 -28737 -13857 9473 2404 -25982 -15908 -17861 12809
3069A2809r624j1736L147P803P941J858m188k2451m17O749l113P703K4103J3419
$$ 12809 3185 -8551 -5404 2399 10340 12198 8010 -14441 -14858 -8109 -11222 -3519 20584 34003
3055C4003J4925k1053J0537J2431j8764j9042j9468q899r875J542j4570O963J8094
$$ 34003 48928 27875 38412 50843 32079 13037 -6431 -15330 -25205 -23663 -38233 -31270 -13176
3042a3176K3771n4p309p385J3735O34j9079j72J7581j6114j88L707M782Q43j8345
$$ -13176 10595 10541 3232 -4153 9582 10216 -8863 -9035 8546 -7568 -7756 -4049 733 1576 -16769
3027a6769J6812L789O544K150o999m70l482J1760M232J0985O492J2775N377l5665
$$ -16769 43 3832 10376 12526 5527 5057 1575 13335 17567 28552 35044 47819 53196 17531
3013A7531k6960k8068L62N570K2216J5094j2201J0573N065j5314J3226p188p659
$$ 17531 -9429 -37497 -37135 -31565 -9349 5745 -6456 4117 9182 -6132 7094 -94 -7753
3000g753j4508j2516j5J4416L3109P590j7500k691m286L699j12L665j3873j5197
$$ -7753 -22261 -34777 -34792 -20376 12733 20323 2823 132 -4154 -455 -567 3098 -10775 -25972
2986b5972P373J1301O105R670J3732J1835l283P621m097J613j89k9048m00J6043
$$ -25972 -18599 -7298 -1193 8477 22209 34044 30761 38382 34285 35898 35709 6661 6261 22304
2972B2304q584q056M39n093j9527R122K2092J4957J589R241j1365k6686m099j4694
$$ 22304 13720 5664 6103 1010 -18517 -9395 12697 27654 29243 38484 27119 433 -3666 -18360
2958a8360n806J1822J7641j9713o945n391L7847K6283j6376j8297n988j054N172
$$ -18360 -24166 -12344 5297 -14416 -21361 -26752 11095 37378 21002 2705 -3283 -4337 835
2945H35J9584J3255J5360o667k3665j9264j1232J2334K9490R096k5156j5842k31
$$ 835 20419 33674 49034 42367 18702 -562 -11794 540 30030 39126 13970 -1872 -2103
2932b103p208J4374M652P64j2750j7589L343J0421l279J3635J3525p584M902n033
$$ -2103 -9311 5063 9715 10479 -2271 -19860 -16517 -6096 -9375 4260 17785 10201 15103 10070
2918A0070K158J00k648J8806N762K3267J1042l4362j6487J1048j898k4165J7531
$$ 10070 12228 12328 9680 28486 34248 57515 68557 34195 17708 28756 26858 2693 20224
2905B0224J7880o011l2690k9164K239K3942K075j0362j4456J4210r133m045R486
$$ 20224 38104 32093 -597 -29761 -27522 -3580 -1505 -11867 -26323 -12113 -21246 -25291 -15805
2892a5805j2593o644J1701J4734J1239r433j0929J810M17R085R418k5731k1778
$$ -15805 -28398 -35042 -23341 -8607 2632 -6801 -17730 -15920 -15503 -6418 3000 -22731 -44509
2879d4509P739L508J1228J2917K0520M285J279j2048k8184k5533J5548J3102J0617
$$ -44509 -36770 -33262 -22034 -9117 11403 15688 16967 4919 -23265 -48798 -33250 -20148 -9531
2866i531R086m701k0877P617P448M508p766J0458J4364j6188j1459L9806K995
$$ -9531 -445 -5146 -26023 -18406 -10958 -6450 -14216 -3758 10606 -5582 -17041 22765 25760
2853B5760j5188j7297M443J289N385K5942r632K601p243P454j1639k5936k3546
$$ 25760 10572 -6725 -2282 -993 4392 30334 20702 23303 16060 23514 11875 -14061 -37607
2840c7607L46j0972M1667J5955j1270J2113P107R560M763j400l0282J0617L725
$$ -37607 -37261 -48233 -6566 9389 -1881 10232 17339 26899 31662 30262 -20 10597 14322
2827A4322L075j5747j5778J7249j019K200q253l853O314M879R447l152k037n69
$$ 14322 17397 1650 -14128 3121 2102 4302 -3951 -7804 -1490 3389 12836 9684 7647 7078
2813G078o535n558R216P400p404j746J0111n61l006j0126J609k0058j4434j2744
$$ 7078 543 -5015 4201 11601 4197 2451 12562 12001 8995 -1131 478 -19580 -34014 -46758
2799d6758K049N1367N5258J5886j1359j5270o670k0063j4602J89j8811j8120k5084
$$ -46758 -44709 6658 61916 77802 66443 51173 44503 24440 9838 10027 -8784 -26904 -51988
2786e1988L028J4912J3314O756J4440J2966R191M162J0537J0512O877j705l994
$$ -51988 -48960 -34048 -20734 -13978 462 13428 22619 26781 37318 47830 54707 53002 49008
2773D9008O454j0044j4879j909j8722k2145N584K6226Q030o772N848k8502l1549
$$ 49008 55462 45418 30539 28630 9908 -12237 -6653 19573 27603 20831 26679 -1823 -33372
2760c3372j131J6946K2025r909p730k1697j3503K665j016m576K7222K1981K107
$$ -33372 -34503 -17557 4468 -5441 -13171 -34868 -48371 -45706 -46722 -51298 -24076 -2095 12
2747A2j2471J2560k526o94J901K4196J4717r192l3862q028j0946J9509J6826j4530
$$ 12 -12459 101 -2425 -3119 -1218 22978 37695 28503 -5359 -13387 -24333 -4824 12002 -2528
2733b528k9023r242J9114K3758K2565N68l846j3457o464P751r478j5007q729O407
$$ -2528 -31551 -40793 -21679 2079 24644 25212 21366 7909 1445 9196 -282 -15289 -24018 -17611
2719a7611J0167j4694L795N530j732J0290M562k272m791J1099J0228j432j0787
$$ -17611 -7444 -22138 -18343 -12813 -14545 -4255 307 -1965 -6756 4343 14571 13139 2352
2706B352N142j831k0456M003j9829j2837J3817J155J5416O871J102o986J5839
$$ 2352 7494 5663 -14793 -10790 -30619 -43456 -29639 -28484 -13068 -6197 -5095 -12081 3758
$$ [...]
##END NTUPLES=NMR SPECTRUM
##END=
