##TITLE=Analysis number 310766
Compound Code cc 30502
Book Reference 393/196
Project Code adrs
Chemist Name roba
##JCAMPDX= 6.0         $$ Bruker NMR JCAMP-DX V2.0
##DATA TYPE= NMR SPECTRUM
##DATA CLASS= NTUPLES
##ORIGIN= Bruker BioSpin GmbH
##OWNER= NMR
$$ XWIN-NMR		Version 3.5
$$ Thu Jun 23 11:51:14 2005 GMT Daylight Time (UT+1h)  MAYBRIDGE\NMR@NMR_250MHZ
##.OBSERVE FREQUENCY= 250.131544655141
##.OBSERVE NUCLEUS= ^1H
##.ACQUISITION MODE= SIMULTANEOUS (DQD)
##.ACQUISITION SCHEME= undefined
##.AVERAGES= 16
##.DIGITISER RES= 18
##SPECTROMETER/DATA SYSTEM= dpx250
##.PULSE SEQUENCE= zg30
##.SOLVENT NAME= CDCl3
##.SHIFT REFERENCE= (INTERNAL, CDCl3, 0, 16.522)
##AUDIT TRAIL= $$ (NUMBER, WHEN, WHO, WHERE, WHAT)
$$ ##TITLE= Audit trail, XWIN-NMR		Version 3.5
$$ ##JCAMPDX= 5.01
$$ ##ORIGIN= Bruker BioSpin GmbH
$$ ##OWNER= NMR
$$ C:\u/data/dgb/nmr/ADRS/4650/pdata/1/auditp.txt
$$ ##AUDIT TRAIL=  $$ (NUMBER, WHEN, WHO, WHERE, WHAT)
(   1,<2005-06-23 11:50:43.25 +100>,<MAYBRIDGE\NMR>,<NMR_250MHZ>,
      <created by zg, POWCHK disabled, PULCHK disabled
       configuration hash MD5:
       62 19 C7 07 E1 42 D1 B7 37 6C 3D D0 77 39 F9 E6
       data hash MD5: 64K
       1B 72 B4 8B 06 5C C1 8D E9 1F C3 5F 24 E3 93 75>)
(   2,<2005-06-23 11:51:00.50 +100>,<MAYBRIDGE\NMR>,<NMR_250MHZ>,
      <Start of raw data processing
       ef LB = 0.3 FT_mod = 6 PKNL = 1 SI = 32K 
       data hash MD5: 32K
       BE D5 1C 10 C8 97 6A AF 6B 2E 73 B0 9C 27 B6 C8>)
(   3,<2005-06-23 11:51:02.96 +100>,<MAYBRIDGE\NMR>,<NMR_250MHZ>,
      <apk 
       data hash MD5: 32K
       56 1A 1F 11 FC 36 BF 63 43 C0 30 41 99 6A 21 E3>)
(   4,<2005-06-23 11:51:03.68 +100>,<MAYBRIDGE\NMR>,<NMR_250MHZ>,
      <abs ABSG = 5 
       data hash MD5: 32K
       9C AC 45 B4 28 8D A4 E4 A6 9B 47 8A 5A 41 B2 C1>)
$$ ##END=
$$ 
$$ hash MD5
$$ 0D 63 A8 33 76 9B 8F DF 65 4F 93 FF CB DC 50 62
##$RELAX= 
##$RELAX= 
##$RELAX= 
##$RELAX= 
##$RELAX= 
##$RELAX= 
##$RELAX= 
$$ Bruker specific parameters
$$ --------------------------
##$DU= <C:\u>
##$EXPNO= 4650
##$NAME= <ADRS>
##$PROCNO= 1
##$TYPE= <nmr>
##$USER= <dgb>
##$AMP= (0..31)
100 100 100 100 100 100 100 100 100 100 100 100 100 100 100 100 100 100 
100 100 100 100 100 100 100 100 100 100 100 100 100 100 
##$AQSEQ= 0
##$AQ_mod= 3
##$AUNM= <au_zg>
##$AUTOPOS= <11 >
##$BF1= 250.13
##$BF2= 250.13
##$BF3= 250.13
##$BF4= 250.13
##$BF5= 500.13
##$BF6= 500.13
##$BF7= 500.13
##$BF8= 500.13
##$BYTORDA= 1
##$CFDGTYP= 0
##$CFRGTYP= 5
##$CHEMSTR= <none>
##$CNST= (0..31)
1 1 145 1 1 1 1 1 1 1 1 1 1 1 1 1 1 1 1 1 1 1 1 1 1 1 1 1 1 1 1 1 
##$CPDPRG= <>
##$CPDPRG1= <>
##$CPDPRG2= <>
##$CPDPRG3= <>
##$CPDPRG4= <mlev>
##$CPDPRG5= <mlev>
##$CPDPRG6= <mlev>
##$CPDPRG7= <mlev>
##$CPDPRG8= <mlev>
##$CPDPRGB= <>
##$CPDPRGT= <>
##$D= (0..31)
0 1 0 0 0 0 0 0 0 0.06 0 0 0 0 0 0 0.0002 0 0 0 0 0 0 0 0 0 0 0 0 0 0 
0 
##$DATE= 1119523842
##$DBL= (0..7)
120 120 120 120 120 120 120 120 
##$DBP= (0..7)
150 150 150 150 150 150 150 150 
##$DBP07= 0
##$DBPNAM0= <>
##$DBPNAM1= <>
$$ [...]
##$SUBNAM7= <"">
##$SUBNAM8= <"">
##$SUBNAM9= <"">
##$SW= 20.6930455092707
##$SWIBOX= (0..15)
0 0 3 0 0 0 0 0 0 0 0 0 0 0 0 0 
##$SW_h= 5175.983436853
##$TD= 65536
##$TD0= 1
##$TE= 295.16
##$TE2= 300
##$TE3= 300
##$TEG= 300
##$TL= (0..7)
0 120 120 120 120 120 120 120 
##$TP= (0..7)
150 150 150 150 150 150 150 150 
##$TP07= 0
##$TPNAME0= <>
##$TPNAME1= <>
##$TPNAME2= <>
##$TPNAME3= <>
##$TPNAME4= <>
##$TPNAME5= <>
##$TPNAME6= <>
##$TPNAME7= <>
##$TPOAL= (0..7)
0.5 0.5 0.5 0.5 0.5 0.5 0.5 0.5 
##$TPOFFS= (0..7)
0 0 0 0 0 0 0 0 
##$TUNHIN= 0
##$TUNHOUT= 0
##$TUNXOUT= 0
##$USERA1= <user>
##$USERA2= <user>
##$USERA3= <user>
##$USERA4= <user>
##$USERA5= <user>
##$V9= 5
##$VALIST= <valist>
##$VCLIST= <CCCCCCCCCCCCCCC>
##$VD= 0
##$VDLIST= <DDDDDDDDDDDDDDD>
##$VPLIST= <PPPPPPPPPPPPPPP>
##$VTLIST= <TTTTTTTTTTTTTTT>
##$WBST= 1024
##$WBSW= 4
##$XGAIN= (0..3)
0 0 0 0 
##$XL= 0
##$YL= 0
##$YMAX_a= 397993
##$YMIN_a= -327111
##$ZGOPTNS= <>
##$ZL1= 120
##$ZL2= 120
##$ZL3= 120
##$ZL4= 120
##$ABSF1= 16.522
##$ABSF2= -4.171173
##$ABSG= 5
##$ABSL= 3
##$ALPHA= 0
##$AQORDER= 0
##$ASSFAC= 0
##$ASSFACI= 0
##$ASSFACX= 0
##$ASSWID= 0
##$AUNMP= <proc_1d>
##$AZFE= 0.1
##$AZFW= 0.1
##$BCFW= 0
##$BC_mod= 0
##$BYTORDP= 0
##$COROFFS= 0
##$CY= 12.5
##$DATMOD= 1
##$DC= 0
##$DFILT= <>
##$DTYPP= 0
##$F1P= 14.0000005364418
##$F2P= -0.99999901652339
##$FCOR= 0.5
##$FTSIZE= 32768
##$FT_mod= 6
##$GAMMA= 0
##$GB= 0
##$INTBC= 1
##$INTSCL= 1
##$ISEN= 128
##$LB= 0.3
##$LEV0= 0
##$LPBIN= 0
##$MAXI= 10000
##$MC2= 0
##$MEAN= 0
##$ME_mod= 0
##$MI= 0
##$NCOEF= 0
##$NC_proc= -5
##$NLEV= 6
##$NOISF1= 0
##$NOISF2= 0
##$NSP= 0
##$NTH_PI= 0
##$NZP= 0
##$OFFSET= 16.522
##$PC= 1
##$PHC0= -72.53497
##$PHC1= 4.285794
##$PH_mod= 1
##$PKNL= yes
##$PPARMOD= 0
##$PSCAL= 4
##$PSIGN= 0
##$REVERSE= no
##$SF= 250.13
##$SI= 32768
##$SIGF1= 0
##$SIGF2= 0
##$SINO= 400
##$SIOLD= 32768
##$SREGLST= <1H.CDCl3>
##$SSB= 0
##$STSI= 32768
##$STSR= 0
##$SW_p= 5175.98343685301
##$SYMM= 0
##$S_DEV= 0
##$TDeff= 65536
##$TDoff= 0
##$TI= <Analysis number 999999
Compound Code 99
Book Reference 9
Project Code 9>
##$TILT= no
##$TM1= 0
##$TM2= 0
##$TOPLEV= 0
##$USERP1= <user>
##$USERP2= <user>
##$USERP3= <user>
##$USERP4= <user>
##$USERP5= <user>
##$WDW= 1
##$XDIM= 32768
##$YMAX_p= 472270954
##$YMIN_p= -716010
$$ End of Bruker specific parameters
$$ ---------------------------------
##NTUPLES= NMR SPECTRUM
##VAR_NAME=  FREQUENCY,     SPECTRUM/REAL,   SPECTRUM/IMAG
##SYMBOL=    X,             R,               I
##VAR_TYPE=  INDEPENDENT,   DEPENDENT,       DEPENDENT
##VAR_FORM=  AFFN,          ASDF,            ASDF
##VAR_DIM=   32768,         32768,           32768
##UNITS=     HZ,            ARBITRARY UNITS, ARBITRARY UNITS
##FACTOR=    0.157963299565203, 1,           1
##FIRST=     4132.6476996994, 0,             0
##LAST=      -1043.33573715361, 0,           0
##MIN=       -1043.33573715361, -716010,     0
##MAX=       4132.6476996994, 472270954,     0
$$ Real data points
##PAGE= N=1
##DATA TABLE= (X++(R..R)), XYDATA
$$ [...]
22710B04186r1564j53206K40r3614j29185J04071K6415m9151q7879N6032O3902
$$ 204186 112622 -40584 -40344 -133958 -263143 -159072 -132657 -181808 -269687 -213655 -149753
22699a49753J55994j7153M3417L9760p0818o9380n91K1605j47050j96857j68342
$$ -149753 6241 -10912 32505 72265 1447 -67933 -68524 -46919 -193969 -390826 -559168
22688e59168O2548K13390K40918J08822P3139r0033Q420J02348J720j34385n8607
$$ -559168 -496620 -283230 -42312 66510 139649 49616 58036 160384 162104 27719 -30888
22677c0888p3774J4912J68335q4532j87401J6868r3703j35605p6440J89797P5268
$$ -30888 -104662 -89750 78585 -5947 -193348 -176480 -270183 -405788 -482228 -292431 -217163
22666b17163N3492L9932O1432o4339l6028Q9634j02750J6513M4926Q9445O9980
$$ -217163 -163671 -123739 -62307 -126646 -162674 -73040 -175790 -159277 -114351 -24906 45074
22655D5074k36299q1532l9735L2507J98825N5575J33462N4342o8354J31759k0283
$$ 45074 -191225 -272757 -312492 -279985 -81160 -25585 107877 162219 93865 225624 205341
22644B05341j98454r4413p197J32387J07270M8506J3331j07992j22027k4578M744
$$ 205341 6887 -87526 -94723 37664 144934 193440 206771 98779 -23248 -47826 -43082
22633d3082M5896Q1569Q9888j2592O1988k17750j99477M4913j35887N3036J61745
$$ -43082 2814 84383 174271 161679 223667 5917 -193560 -148647 -284534 -231498 -69753
22622f9753Q9654N7087Q7147j70141p6058j2994j50840P5938K45718r8420M2490
$$ -69753 19901 76988 164135 -6006 -82064 -95058 -245898 -169960 75758 -22662 19828
22611A9828j6946r3973R665r2143j00388K1385k8600J08557n7302j3396O8279
$$ 19828 2882 -91091 -81426 -173569 -273957 -252572 -281172 -172615 -229917 -243313 -175034
22600a75034J52488j870j41205J67885N5757j04947j8793J4734J28562J50954
$$ -175034 -22546 -24416 -165621 2264 58021 -46926 -65719 -50985 77577 228531
22590B28531J7001K9715J7129j06870j16695L2101q8154J0662M0794j68964k13805
$$ 228531 245532 275247 292376 185506 68811 100912 12758 23420 64214 -104750 -318555
22579c18555n2396J13956O3846j78683j03667L2987J19974L588k3722M8492M2411
$$ -318555 -370951 -256995 -193149 -371832 -475499 -442512 -322538 -318950 -342672 -294180 -251769
22568b51769P8752J7783J01096N0001l6920j39431k69937N1937J08718J80734
$$ -251769 -173017 -155234 -54138 -4137 -41057 -180488 -450425 -398488 -289770 -109036
22558a09036P4881n8601J00083R7536j50716n4558R0394N0457j01895j25216K4966
$$ -109036 -34155 -92756 7327 104863 -45853 -100411 -10017 40440 -61455 -186671 -161705
22547a61705L3422j35845n6793K1935K3901k5136O7556n7245j14615R9696Q2982
$$ -161705 -128283 -264128 -320921 -298986 -275085 -300221 -232665 -289910 -404525 -304829 -221847
22536b21847J52320O991J6049K1254o8570p9760M4683R2652K03064L7710M1041
$$ -221847 -69527 -62536 -46487 -25233 -93803 -173563 -128880 -36228 166836 204546 245587
22525B45587q9827q4685j10599J45844p2511q0356K0598R8878J9266o0960l3151
$$ 245587 155760 71075 -39524 106320 33809 -46547 -25949 72929 92195 31235 -1916
22514a916L5568m9673j87890k4606J28520J66584o473K9089P2832n034J11342
$$ -1916 33652 -16021 -203911 -228517 -99997 66587 60114 89203 162035 157001 268343
22503B68343R0246j73542J49908M5736j6104m6550j40538n0735j1433j07452j78149
$$ 268343 358589 185047 334955 380691 364587 318037 177499 126764 115331 7879 -170270
22492a70270j06526J4630q946k0935J91574K72551K5087k43140M8727K9056r2993
$$ -170270 -276796 -262166 -271112 -292047 -100473 172078 197165 -45975 2752 31808 -61185
22481f1185l5721j0373l0693l2105O342m663M2415L070J93511P2674j42633j16869
$$ -61185 -96906 -107279 -137972 -170077 -163735 -168398 -125983 -122913 70598 143272 639 -116230
22469a16230K17140M8200j35977j70869j07058J19799J14394O2139L2052p5184
$$ -116230 100910 149110 13133 -157736 -264794 -144995 -30601 31538 63590 -11594
22459a1594k26896Q7290J57813l2744j32838J35996M5189J2719k1604n1305P2180
$$ -11594 -238490 -151200 6613 -26131 -158969 -22973 22216 34935 13331 -37974 34206
22448C4206k039P4192N3723j58545p70K13887N6895k4014r3668n0221r691r2293
$$ 34206 32167 106359 160082 1537 767 214654 271549 247535 153867 103646 93955 1662
22436A662J04956J7065j03597k46089j2274p130K09492O3369j2908l9328j34879
$$ 1662 106618 123683 20086 -226003 -238277 -245407 -35915 27454 14546 -24782 -159661
22425a59661p5720O0971N4273J58553Q0824M5943O0108N8139o2129j21625q4876
$$ -159661 -235381 -174410 -120137 38416 119240 165183 225291 283430 221301 99676 14800
22414A4800p1253M0246m0735j1581l6884o8395o050p2662J15621l6467l6719M1066
$$ 14800 -56453 -16207 -56942 -68523 -105407 -173802 -179852 -252514 -136893 -173360 -210079 -169013
22402a69013O1587Q6551P2805r028r1347j35805j58613k1022M3195R5727J70242
$$ -169013 -107426 -20875 51930 42902 -48445 -184250 -342863 -363885 -320690 -224963 -54721
22391e4721j6161k45584P1435L02979j1534j71717l2733N5032O4023j5976N1772
$$ -54721 -70882 -316466 -245031 57948 46414 -125303 -158036 -103004 -38981 -54957 -3185
22380c185J00091j4230j29880j1354K4083k8354j79450j35839J36317M1820n087
$$ -3185 96906 82676 -47204 -58558 -34475 -62829 -242279 -378118 -241801 -199981 -205068
22369b05068N73O5327L171o6634j47026R1067J51741j08809j21108J41341J78477
$$ -205068 -204495 -139168 -135997 -202631 -349657 -258590 -106849 -215658 -336766 -195425 -16948
22358a6948k2954q7128J1169K5498Q9485Q5703j9341L0122m7950M9056j27576
$$ -16948 -39902 -127030 -115861 -90363 -878 84825 65484 95606 47656 96712 -30864
22347c0864J6262k1877j11927Q2869q7564P0566K7880J9350J15539j70345j96588
$$ -30864 -14602 -36479 -148406 -65537 -153101 -82535 -54655 -35305 80234 -90111 -286699
22336b86699j16713J16654J60566l5565o1798J02257P0887J63734m511j24887
$$ -286699 -403412 -286758 -126192 -161757 -223555 -121298 -50411 113323 108812 -16075
22326a6075j86721o5118J52665k8548p7694J71550J7417j71484J05767P4390J24771
$$ -16075 -202796 -267914 -115249 -143797 -221491 -49941 -32524 -204008 -98241 -23851 100920
22315A00920j6370K7041j83623j02170o2945O2760J43190m236l0300K27567k4143
$$ 100920 84550 111591 -72032 -174202 -237147 -174387 -31197 -35433 -65733 161834 137691
22304A37691M807O1117j48174k10733j74139K52818K49128l8522j70778N1255
$$ 137691 142498 203615 55441 -155292 -329431 -76613 172515 133993 -36785 14470
22294A4470o1699Q600O2746j58064P3281J87087J04498j12636m1982o1086j20686
$$ 14470 -47229 -38629 24117 -133947 -60666 126421 230919 118283 76301 15215 -105471
22283a05471r1500M4375R2900J39906J04076j94838j6678p9050k5091M9352K39666
$$ -105471 -196971 -152596 -59696 80210 184286 -10552 -27230 -106280 -131371 -82019 157647
22272A57647j1377J361J30908J15235J20088j12000k80274j42883l0711O5136
$$ 157647 146270 147631 278539 393774 513862 401862 121588 -21295 -52006 13130
22262A3130L3878j43317j1605J22435r030p6479q6671j35653k2163n344K8963
$$ 13130 47008 -96309 -107914 14521 5491 -70988 -157659 -293312 -315475 -320819 -291856
22251b91856N0676q0623P2989J13112J58254J42095J63361J7768J14652j84319
$$ -291856 -241180 -321803 -248814 -135702 22552 164647 328008 345776 460428 276109
22241B76109r2030J01457m5705k26464p619k6181L1747K26856j6883r6024q0637
$$ 276109 184079 285536 239831 13367 5748 -20433 11314 238170 221287 125263 44626
22230D4626J3949O009P5812P0024k0023j4008m4352j71085n1842r1174j24176
$$ 44626 58575 64584 140396 210420 190397 176389 132037 -39048 -90890 -182064 -306240
22219c06240N3821J22321M9392N2177j45257j5000P8971O7722l5965j5657l9568
$$ -306240 -252419 -130098 -80706 -28529 -173786 -188786 -109815 -42093 -78058 -93715 -133283
22208a33283j9865o9041Q8887O0282M1718j46507l29355j22895K14436K14422
$$ -133283 -153148 -222189 -133302 -73020 -31302 -177809 -507164 -630059 -415623 -201201
22198b01201n6947p4780J0454J71410J9886m0040Q9169J99147M3287k29930j20086
$$ -201201 -258148 -332928 -322474 -151064 -131178 -171218 -82049 117098 160385 -69545 -189631
22187a89631K32486Q0307j69354l0986m6764M2590J58496J49579l7527j1944L9911
$$ -189631 42855 123162 -46192 -77178 -123942 -81352 77144 226723 189196 177252 217163
22176B17163P2321o9651p0381n1861L2458M4829Q6341J05052l03j01217j06580
$$ 217163 289484 219833 149452 97591 130049 174878 261219 366271 365968 264751 158171
22165A58171L3348K1878r8071r7511j0685j1413R8430j22287n0932R9368K19722
$$ 158171 191519 213397 115326 17815 7130 -4283 94147 -28140 -79072 20296 240018
22154B40018l0420p2225j42863R1919P4269r775p8661j19097q9549r4683J3663
$$ 240018 209598 137373 -5490 86429 160698 150923 72262 -46835 -136384 -231067 -217404
22143b17404Q4614L1370m6947O1477Q2639j03614R8068Q8311J4742n6142J13048
$$ -217404 -132790 -101420 -148367 -86890 -4251 -107865 -9797 78514 93256 37114 150162
22132A50162q2244K3091K1483j3015j11261J7217J67931j33309m0471p5552n1647
$$ 150162 67918 91009 112492 99477 -11784 5433 173364 40055 -416 -75968 -127615
22121a27615J46442N3642Q8970M9099J4313r5730o5094K2324q851J14222J30339
$$ -127615 18827 72469 161439 210538 224851 129121 64027 86351 77500 191722 322061
22110C22061j36417j64174o2804L8625P7773J15168o176j38440r3167J33024n0824
$$ 322061 185644 21470 -41334 -2709 75064 190232 184056 45616 -47551 85473 34649
22099C4649p3763j03106L461Q9279J3141j66038j81435J07715J54421J3095J1315
$$ 34649 -39114 -142220 -138759 -49480 -36339 -202377 -383812 -276097 -121676 -108581 -97266
22088i7266P3988N6170R9601j5043j44911k6992p2800j32851J16079J55315n2101
$$ -97266 -23278 32892 132493 117450 -27461 -54453 -127253 -260104 -144025 11290 -40811
22077d0811j51126n3513J4965J29070m7558q7554J84687N2389k0827n7817m549
$$ -40811 -191937 -245450 -230485 -101415 -148973 -236527 -51840 549 -20278 -78095 -82644
22066h2644M8577Q474K60702J940l0056r2724k73050j08165J15505P3344J25902
$$ -82644 -34067 -25593 235109 237049 206993 114269 -158781 -266946 -151441 -78097 47805
22055D7805j26515j00218K5230o2760m2522J84475L9991L4772n7706p1420R832
$$ 47805 -78710 -178928 -153698 -216458 -258980 -74505 -34514 258 -57448 -128868 -119036
22044a19036J7291P408O2596m6260n7362n911l6475J13308O9685Q7149J15849
$$ -119036 -101745 -94337 -31741 -78001 -135363 -141274 -177749 -64441 5244 92393 208242
22033B08242l9312j48454P3090R0250J16605j34504j49772Q4535N8495L8855j34782
$$ 208242 168930 20476 93566 183816 300421 165917 16145 100680 159175 198030 63248
22022F3248j79883K29324J74359j4086q0424j54868r7402J74663K3645J0429J7404
$$ 63248 -116635 112689 287048 272962 192538 37670 -59732 114931 138576 149005 166409
22011A66409m6945k33710o8344R4183Q4261J89388j1696j15660M5367O0151p0891
$$ 166409 119464 -114246 -182590 -88407 -4146 185242 173546 57886 103253 163404 92513
22000I2513j13144J32019j6065k09860l1564N440r3460O1195J4147J47130q4795
$$ 92513 -20631 111388 95323 -114537 -146101 -140661 -234121 -172926 -158779 -11649 -96444
21989i6444n1667K9814L9688O2694L6385R5717p1250j12345j03895J24404J1072
$$ -96444 -148111 -118297 -78609 -15915 20470 116187 44937 -67408 -171303 -46899 -35827
21978c5827j49684J79208L88780q5840k41602j66619o2888O0498J37889l7983
$$ -35827 -185511 -6303 382477 296637 55035 -111584 -174472 -113974 23915 -14068
21968a4068j09897R8108o5996j07719N7881j53336j1067J75538P2766p0655m8628
$$ -14068 -123965 -25857 -91853 -199572 -141691 -295027 -306094 -130556 -57790 -128445 -177073
21957a77073J05008K93592j09662l04664j794K8828m3853N5769M4995J01137n5241
$$ -177073 -72065 221527 111865 -192799 -194593 -165765 -209618 -153849 -108854 -7717 -62958
21946f2958J6981J590r4027K0671P9487J2597K9664K5098n8139j45950j43510
$$ -62958 -45977 -44387 -138414 -117743 -38256 -25659 4005 29103 -29036 -174986 -318496
21935c18496k2964J1573O5372J23918J4070J02561J94384j5416K3963Q9327m6151
$$ -318496 -341460 -329887 -264515 -140597 -126527 -23966 170418 155002 178965 268292 222141
21924B22141j6200k00756j44913n365M7751j11187m9275k20878Q1559K46855K58851
$$ 222141 205941 5185 -139728 -145093 -97342 -208529 -257804 -478682 -397123 -150268 108583
21913A08583P177m7857j9404R4823j15825p5693M0294L5276K8946N9438j8362
$$ 108583 115760 67903 48499 143322 27497 -48196 -7902 27374 56320 115758 97396
21902I7396j05944j60311o2499M6472l0933O5554K46590l2123p1529R8120n9855
$$ 97396 -8548 -168859 -231358 -184886 -215819 -150265 96325 64202 -7327 90793 30938
21891C0938k73871m0589J28206K43434P403n7184J01792k7131r4327j44865j53201
$$ 30938 -242933 -283522 -155316 88118 95521 38337 140129 112998 18671 -126194 -279395
21880b79395o0761J56978J64215k0710k53502j04941J61392J20479K2054J46244
$$ -279395 -340156 -183178 -18963 -39673 -293175 -398116 -236724 -116245 -94191 52053
21870E2053J50349k68039j36356J2234R8535P6063n4955l607J40263J05497o057
$$ 52053 202402 -65637 -201993 -189759 -91224 -15161 -70116 -73723 66540 172037 165980
21859A65980p4808r9001j4974k5419P9326j14599K5361l3932K3767J83073J5149
$$ 165980 91172 -7829 -22803 -48222 31104 -83495 -58134 -92066 -68299 114774 129923
21848A29923j49573m7991L8443O8180K9709o3913n0343J8059K5890p9592n6130
$$ 129923 -19650 -67641 -29198 38982 68691 4778 -45565 -27506 -1616 -81208 -137338
21837a37338J34265m4673j24661Q9501p133N0223J36962Q2070k03876l27677k702
$$ -137338 -3073 -47746 -172407 -82906 -90039 -39816 97146 179216 -24660 -352337 -355039
21826c55039J12446q1775j8345P5323J83070K40540Q6414P9351P1319j45848j36806
$$ -355039 -242593 -324368 -342713 -267390 -84320 156220 242634 321985 393304 247456 110650
21815A10650M9555j32203p7440r1009j55618J34177K32412k4096p0869R944r427
$$ 110650 160205 28002 -49438 -140447 -296065 -161888 70524 46428 -24441 -14497 -23924
21804b3924j25236L426Q9924K6275J80287R0918m9100p1552L36k5464K6961r6630
$$ -23924 -149160 -145734 -55810 -29535 150752 241670 192570 121018 121354 95890 122851 26221
21792B6221j1300M9888L1379m0639O3062N448k4222r2236j61571J91691J32209
$$ 26221 14921 64809 96188 55549 118611 124059 99837 7601 -153970 37721 169930
21781A69930N108r5652j54528r0440O7436M4315k8090k4117n4869j3253J07774
$$ 169930 175038 79386 -75142 -165582 -98146 -53831 -81921 -106038 -160907 -174160 -66386
21770f6386L2104o0883o813n0836m379j33178o3713J60185J20239n9500J6507
$$ -66386 -34282 -95165 -101978 -152814 -157193 -290371 -354084 -193899 -73660 -133160 -116653
21759a16653P5252J88479K4323j45504j63426q055Q6430j1568l0027J57738L1787
$$ -116653 -41401 147078 171401 25897 -137529 -145584 -59154 -70722 -100749 56989 88776
21748H8776J954K1005o8007K3830r1691j32731J5746j6048M6526j8593M7380M6208
$$ 88776 90730 111735 43728 67558 -24133 -156864 -141118 -157166 -110640 -129233 -81853 -35645
21736c5645N1709J97490R304k79862r2781O5792l3026o3181J65272N0283j79014
$$ -35645 16064 213554 222858 -57004 -149785 -83993 -117019 -180200 -14928 35355 -143659
21725a43659j7694j5182P7044K2831q2858P7094R1516j83523o8840Q9736Q7283
$$ -143659 -161353 -176535 -99491 -76660 -159518 -82424 9092 -174431 -243271 -153535 -66252
21714f6252K3129j87376j73307R8472P5252p9667K77807J09358n1981j43848J1336
$$ -66252 -43123 -230499 -403806 -305334 -230082 -309749 -31942 77416 25435 -118413 -107077
21703a07077R5248N4375l2960Q6192l7855j39049m8783r7154m2529J34702J31337
$$ -107077 -11829 42546 9586 95778 57923 -81126 -129909 -227063 -269592 -134890 -3553
21692c553N8263n0016j2274l8409J98795J22678q0913o234m4835O2846q2169j639
$$ -3553 54710 4694 -7580 -45989 152806 275484 194571 188337 143502 206348 124179 122540
21680A22540j9359k7247N2770L0893j78164o9011L3902l9827J77369l9345p2158
$$ 122540 103181 75934 128704 159597 -18567 -87578 -53676 -93503 83866 44521 -27637
21669b7637J31011J54028n2288k613l287n2974Q0243j2272m2221M9469j73466
$$ -27637 103374 257402 205114 202501 199214 146240 226483 214211 171990 221459 47993
21658D7993j18476L2161r7868l6732J25113J39384p0076k77632j86017J28819
$$ 47993 -70483 -38322 -136190 -172922 -47809 91575 21499 -256133 -442150 -313331
21648c13331K42105J87919R3513m7595j1360n5793K8895J0050j51444k39071m054
$$ -313331 -71226 116693 210206 162611 151251 95458 124353 134403 -17041 -256112 -260166
21637b60166n0565Q5365K9495k08173j3859J95453J4377j58994r291M4603J4713
$$ -260166 -310731 -225366 -195871 -404044 -417903 -222450 -208073 -367067 -376358 -331755 -317042
21626c17042P0249J07699M9347m2174j78220r0161N4725K63411K30324q788m0545
$$ -317042 -246793 -139094 -89747 -131921 -310141 -400302 -345577 -82166 148158 139370 98825
21615I8825m6923j8138j9143N4990J7016P0789O6910Q5928j81823j79543O7772
$$ 98825 51902 33764 14621 69611 86627 157416 224326 310254 128431 -51112 16660
21604A6660O9157n1360L6621L2184K38245O7305k67860p3594K02424L3807R5439
$$ 16660 85817 34457 71078 103262 341507 408812 140952 67358 269782 303589 399028
21593C99028o247j35497n608O2855k96026j30854J19325L8374j27330J1468j25591
$$ 399028 392781 257284 251676 314531 18505 -112349 6976 45350 -81980 -70512 -196103
21582a96103M8171Q7369P7050j69245j61117J17557L3409l1070J11418M2859K3360
$$ -196103 -147932 -60563 16487 -152758 -313875 -196318 -162909 -193979 -82561 -39702 -16342
21571a6342L9646Q4150O9346J10625j6133j07966j57701n625K3945q5789k4384
$$ -16342 23304 107454 176800 287425 271292 163326 5625 0 23945 -61844 -86228
21560h6228o5615N6523J39771o1043J9784J6988k7366O0536J01664j7355p308
$$ -86228 -151843 -95320 44451 -16592 3192 20180 -7186 53350 155014 137659 130351
21549A30351J5623o9805l2946K0273L9029J7071p517n3532J2693p0932k6410j19980
$$ 130351 145974 76169 43223 63496 102525 119596 112079 58547 71240 308 -26102 -146082
21537a46082O5710J0543p9018j82042p982Q5353P2387j2595p2782K88624K01545
$$ -146082 -80372 -69829 -148847 -330889 -338871 -253518 -181131 -193726 -266508 22116 223661
21526B23661n3310j02260j20737j7291n2633N184L5911p0643M3907J34837j20197
$$ 223661 170351 68091 -52646 -69937 -122570 -117386 -81475 -152118 -108211 26626 -93571
21515i3571j39164J22448J27353J51297l0363q2483R5471K507J51906j3049j13545
$$ -93571 -232735 -110287 17066 168363 138000 55517 150988 153495 305401 292352 178807
21504A78807j65391k02101J6125J27341M4264J62697Q9994N568n7415j43096j58092
$$ 178807 13416 -188685 -172560 -45219 -955 161742 251736 257304 199889 56793 -101299
21493a01299o580P9668K66071R8517j12486q3286N760r2634r9978O410L7431K34564
$$ -101299 -107879 -28211 237860 336377 223891 140605 146365 53731 -46247 -39837 -2406 232158
21481B32158O0063m0284j822J1863R6483p6490k8721l6867l3561P083j3304n2989
$$ 232158 292221 251937 250115 261978 358461 281971 253250 216383 182822 189905 176601 123612
21469A23612N1875j8450R636k5210O6738r3810j093j46959k15327r0934n08J40442
$$ 123612 175487 157037 166673 141463 208201 114391 113298 -33661 -248988 -339922 -340430 -199988
21457a99988K46618j24204n1372k1654P5929J6802M9194O1147j6291J25351n5762
$$ -199988 46630 -77574 -128946 -150600 -74671 -57869 -8675 52472 36181 161532 105770
21446A05770j20373K0832o5555n0087m3325r9659J28803M0842r296J20033J4423
$$ 105770 -14603 6229 -59326 -109413 -152738 -252397 -123594 -82752 -92048 27985 42408
21435D2408p1272j82138L6062K06983O3705M2276q9551j41179j574N5311L6904
$$ 42408 -28864 -211002 -174940 32043 95748 138024 48473 -92706 -94280 -38969 -2065
21424b065J72215q3544j53204j0388J27894J07353N9462J28587o8016k04991j54117
$$ -2065 170150 86606 -66598 -76986 50908 158261 217723 346310 278294 73303 -80814
21413h0814L3903o5676o4002J22327L6373J27187J07797o6469l2074j35432K0074
$$ -80814 -46911 -112587 -176589 -54262 -17889 109298 217095 150626 118552 -16880 3194
21402C194P3526J38604l875j29455R334m7261M5861n7395j10386o7986J59814
$$ 3194 76720 215324 211449 81994 91328 44067 89928 32533 -77853 -145839 13975
21391A3975J3845l0551l2950K1267L892j09748l5103K14462L78k2807l3835J58413
$$ 13975 27820 -2731 -35681 -14414 -10522 -120270 -155373 59089 59467 36660 2825 161238
21379A61238k5100q9724j12640p5101N8188M9985o5724Q2626J33586q3562m7884
$$ 161238 136138 46414 -66226 -141327 -83139 -33154 -98878 -16252 117334 33772 -14112
21368a4112R2070p1180q8777J73658P9906j04510m1916J61440J31056K073j55444
$$ -14112 77958 6778 -81999 91659 171565 67055 25139 186579 317635 319708 164264
21357A64264j08453l2707k14112k9474J23935J03673r9692P371q826L1987K5344
$$ 164264 55811 23104 -191008 -220482 -96547 7126 -92566 -85195 -94021 -62034 -36690
21346c6690J01411j2604J335m224O515M2722n3145N9248J08866j05389n1459J5234
$$ -36690 64721 52117 53452 49228 55743 98465 45320 104568 213434 108045 56586 71820
21334G1820P6301j1522j24619l7982p7955N306J59711K826M1816j62617L2681
$$ 71820 148121 136599 11980 -26002 -103957 -98651 61060 63886 105702 -56915 -24234
21323b4234M4937m2835j3089J04614J12694p3748r8721l3701J3347l7435N102
$$ -24234 20703 -22132 -35221 69393 182087 108339 9618 -24083 -10736 -48171 -43069
21312d3069J71424k7579o8205j26060M7004K60565j09527k46349J6053J16094
$$ -43069 128355 100776 32571 -93489 -46485 214080 104553 -141796 -125743 -9649
21302i649o079L6068J20993m7748o4679q4395l9961J11217l0162j16635J2425
$$ -9649 -15728 20340 141333 93585 28906 -55489 -95450 15767 -14395 -131030 -118605
21291a18605J29p6976O9971J02294J00669J23389j39299m1867l9810k56989l7620
$$ -118605 -118476 -195452 -125481 -23187 77482 200871 61572 19705 -20105 -277094 -314714
21280c14714J13951K48179n060q2900R6307M4750k20505k1724O4441J6674j0131
$$ -314714 -200763 47416 42356 -40544 55763 100513 -119992 -141716 -77275 -60601 -70732
21269g0732k8357k1517R7320L4098l3391J3435m4592q9317k05509o4774J22710
$$ -70732 -99089 -120606 -23286 10812 -22579 -9144 -53736 -143053 -348562 -413336 -290626
21258b90626m66J0801R9687k4684k66405j03800K26553J37358o830M5008o4469
$$ -290626 -291092 -280291 -180604 -205288 -471693 -575493 -348940 -211582 -218412 -173404 -237873
21247b37873J00786J15219r0771o5150j1039J33948m225m8878P9189q9894q8627
$$ -237873 -137087 -21868 -112639 -177789 -188828 -54880 -59105 -107983 -28794 -118688 -207315
21236b07315o1365m8651O4481j2247J055Q3357O3891k6393j8093j17014l1557
$$ -207315 -268680 -317331 -252850 -265097 -264042 -180685 -116794 -143187 -161280 -278294 -309851
21225c09851J96835P8638L7591n6411j28492r3836R3454O6375j27421P6172N0401
$$ -309851 -113016 -34378 3213 -53198 -181690 -275526 -182072 -115697 -243118 -166946 -116545
21214a16545j2599m0029Q0296J40895N3364q1131n2593J36700K2903j97839j23346
$$ -116545 -129144 -169173 -88877 52018 105382 24251 -28342 108358 131261 -66578 -189924
21203a89924l1581J62253J9567K5726M8374J14002J8304j09647j44412N2124Q3734
$$ -189924 -221505 -59252 -39685 -13959 34415 148417 166721 57074 -87338 -35214 48520
21192D8520J30160P5288o2309k01578n7773m5780n3723O2443J30166N0936L0235
$$ 48520 178680 253968 191659 -9919 -67692 -113472 -167195 -104752 25414 76350 106585
21181A06585N9890p5580K4764J77267j2375j08927k3844j36293p7997n7630n0463
$$ 106585 166475 90895 115659 292926 280551 171624 147780 11487 -66510 -124140 -174603
21170a74603J15584J48034P3823l6595p1203j09831r4364L5508J14713J53240
$$ -174603 -59019 89015 162838 126243 55040 -54791 -149155 -113647 1066 154306
21160A54306M9549P512o2789m3220K4742j75608q0264K55657Q408o2501l9750
$$ 154306 203855 211367 148578 105358 130100 -45508 -125772 129885 138293 75792 36042
21149C6042O3630j27537j29313J12611J31451k9627J7189j54176j20133p5253
$$ 36042 99672 -27865 -157178 -44567 86884 57257 74446 -79730 -199863 -275116
21139b75116K53846J46275R7142l9010o3630J7089L5556J2490Q778j06897k19279
$$ -275116 -21270 125005 222147 183137 119507 136596 172152 184642 193420 86523 -132756
21128a32756j25366k9697J48899J81831J02863k1781j97767j47389R3512O4528
$$ -132756 -258122 -287819 -138920 42911 145774 123993 -73774 -221163 -127651 -63123
21118f3123o2281j02675R57K979J43812J18991j06782k43940l4671L02292M7668
$$ -63123 -125404 -228079 -227122 -224143 -80331 38660 -68122 -312062 -346733 -44441 3227
21107C227l717m707k3610L125Q5867r5265j78262k1014L9455J55075r9930p0289
$$ 3227 -490 -5197 -28807 -25682 60185 -35080 -213342 -234356 -194901 -39826 -139756 -210045
21095b10045M486J17540M057m2599J08405K34364j2468j41026K1668N3314K3502
$$ -210045 -205559 -88019 -83962 -126561 -18156 216208 203740 62714 84382 137696 161198
21084A61198J23748p035k1007k36330j54773N1786l1992j65449R0641m9286n9957
$$ 161198 284946 277911 256904 20574 -134199 -82413 -114405 -279854 -189213 -238499 -298456
21073b98456O2820M7514q6596p4280N9068N5550K0958R5757J09809l1850k5898
$$ -298456 -235636 -188122 -274718 -348998 -289930 -234380 -213422 -117665 -7856 -39706 -65604
21062f5604L3038M5020k2717q1615o8886q8469k5389K32254j0928j8970L0311
$$ -65604 -32566 12454 -10263 -91878 -160764 -249233 -274622 -42368 -53296 -72266 -41955
21051d1955n4569k4593N920O6314R8060q3323L7228M2262K3712o5675L4905j9062
$$ -41955 -96524 -121117 -115197 -48883 49177 -34146 3082 45344 69056 3381 38286 19224
21039A9224m1302j43202m1349m4162j29760J18705J59295K07355J82395r5453
$$ 19224 -22078 -165280 -206629 -250791 -380551 -261846 -102551 104804 287199 191746
21029A91746j7862p8257L1048J74117k3734j30594j16089o1272J20167J33694
$$ 191746 173884 95627 126675 300792 277058 146464 30375 -30897 89270 222964
21019B22964j76412m8055J5000j34315J38878P2481k0835n7401O5786o9345J26188
$$ 222964 46552 -1503 13497 -120818 18060 90541 69706 12305 78091 8746 134934
21008A34934R2036K7582M2375j24614j66593k0631k03090J3896J48262J53923
$$ 134934 226970 254552 296927 172313 5720 -14911 -218001 -204105 -55843 98080
20998I8080N7609N2776r646j34974o7279q9270J86536K6135j25185n8784N8246
$$ 98080 155689 208465 198819 63845 -3434 -92704 93832 119967 -5218 -64002 -5756
20987e756k1538m2618N7653J4101j03315N0455o4545j6913Q3238j8260k082J50663
$$ -5756 -27294 -69912 -12259 1842 -101473 -51018 -115563 -132476 -49238 -67498 -69580 81083
20975H1083K06105O258j12050j46841r8538j0546J79917j5637K134J34149K0885
$$ 81083 287188 293446 181396 34555 -63983 -74529 105388 89751 91885 226034 246919
20964B46919l15458j82805J35926J68124l2202o4406J02792j88181p8327K2998
$$ 246919 -68539 -251344 -115418 52706 20504 -43902 58890 -129291 -207618 -184620
20954a84620P7851r1579J31103M6502N7500J8347p5571n17l994j36672p3304J8877
$$ -184620 -106769 -198348 -67245 -20743 36757 55104 -20467 -20984 -24978 -161650 -234954 -216077
20942b16077j6446Q0820J56733J09437j35057j44525J30718k8313q7374P1362
$$ -216077 -232523 -151703 5030 114467 -20590 -165115 -34397 -62710 -150084 -78722
20932g8722J97266R3237k5638J56909J98290J7241j59953k28409j31003K3532
$$ -78722 118544 211781 186143 343052 541342 558583 398630 170221 39218 62750
20922F2750k882O3836J02469O7401j09359k73351j34174J02846L7560J56914m3032
$$ 62750 59868 123704 226173 293574 184215 -89136 -223310 -120464 -82904 74010 30978
20911C0978o9391J00659j2834P969j7726k72227P16K0253n8469J90655J76560
$$ 30978 -38413 62246 49412 57381 39655 -232572 -231856 -211603 -270072 -79417 97143
20900I7143q4338j2380m4593N8567J08766J21862J09334j02898Q061L5297p9768
$$ 97143 12805 425 -44168 14399 123165 245027 354361 251463 259524 294821 215053
20889B15053k27429n8056q6364q135J37549K4359J36860K4553o2616j33854n251
$$ 215053 -12376 -70432 -156796 -164931 -27382 -3023 133837 158390 95774 -38080 -43331
20878d3331j71911j6727L3969J19486R7192J28880M2178o2327m7894j3775m2960
$$ -43331 -215242 -231969 -198000 -78514 18678 147558 189736 127409 79515 65740 22780
20867B2780M1875P2218N4454J72765K7429j38581K1675J3035n8280l8426k6401
$$ 22780 64655 136873 191327 364092 391521 252940 274615 287650 229370 190944 164543
20856A64543j7321p0078k10299o8448N4122J44867r6412J0318L7954j4922P1790
$$ 164543 147222 77144 -133155 -201603 -147481 -2614 -99026 -88708 -50754 -65676 6114
20845F114r9665o2197q4047J31793K15527P6705j19248j03854l2670N1934k1749
$$ 6114 -93551 -155748 -239795 -108002 107525 184230 64982 -38872 -71542 -19608 -41357
20834d1357m462J05662k2805O1943R4051l7266q6075M8887K2416j0707j10714
$$ -41357 -45819 59843 37038 98981 193032 155766 69691 118578 140994 130287 19573
20823A9573N4981L5786P647k4954J9138K5889j20603K938m3197L2143m5417p2348
$$ 19573 74554 110340 117987 93033 112171 138060 17457 20395 -22802 9341 -36076 -108424
20811a08424j02143o980M1757N4642m0705N6262J26437K3572j57029J15544p3798
$$ -108424 -210567 -217547 -175790 -121148 -161853 -105591 20846 44418 -112611 2933 -70865
20800g0865j9797j06160M1400M5558j09142J09526J65654N440J38234K0358j06797
$$ -70865 -90662 -196822 -155422 -109864 -219006 -109480 56174 61614 199848 220206 113409
20789A13409P964o6551j8818j8841J24979P239n7549J10340P0229J83200r7399
$$ 113409 121373 54822 36004 17163 142142 149381 91832 202172 272401 455601 358202
20778C58202k20419j05545L2642k2431M2171M3357L7392M0746l9927j23411O5287
$$ 358202 137783 32238 64880 42449 84620 127977 165369 206115 166188 42777 108064
20767A08064p8750p5075N4517M4282r6370m933J27636J31030R931p3786k23894
$$ 108064 29314 -45761 8756 53038 -43332 -48265 79371 210401 220332 146546 -77348
20756g7348R4983J39733j0824j19458j47163J33386J10627j1043j05353j14942
$$ -77348 17635 157368 146544 27086 -120077 13309 123936 112893 7540 -107402
20746a07402j01064k0823J83279L9232q7788j22325K2391m8739n291L4577J21691
$$ -107402 -208466 -229289 -46010 -6778 -94566 -216891 -194500 -243239 -248530 -213953 -92262
20735i2262N4219l2917q3278P6951P1509J17059k8357j51580j58739p8820N4572
$$ -92262 -38043 -70960 -154238 -77287 -5778 111281 82924 -68656 -227395 -306215 -251643
20724b51643k6457J3017K0757R8708j12392j23313p3961O5485P9740O4807M8538
$$ -251643 -278100 -265083 -244326 -145618 -258010 -381323 -455284 -389799 -310059 -245252 -196714
20713a96714K07202J37300k7608o6849o4181J9428q111J45511j39630K5685J32583
$$ -196714 10488 147788 120180 53331 -10850 8578 467 145978 6348 32033 164616
20702A64616q4993j80635l8678k5521j6125N5790j70487L1633P1573L0066K6955
$$ 164616 79623 -101012 -139690 -165211 -181336 -125546 -296033 -264400 -192827 -162761 -135806
20691a35806o338K10337Q1302L9746j80580o6078j34489j775J43997k5099j31534
$$ -135806 -142144 68193 149495 189241 8661 -57417 -191906 -193681 -49684 -74783 -206317
20680b06317k4656J0261J77147K8696J3574k1046P0386p1337P0642M3298R634
$$ -206317 -230973 -220712 -43565 -14869 -1295 -22341 48045 -23292 47350 90648 100282
20669A00282j20636p1375k2006m3564n3276j37294P2297J32635J22001j00531
$$ 100282 -20354 -91729 -113735 -157299 -210575 -347869 -275572 -142937 -20936 -121467
20659a21467L5520N1154j32136r6550Q7968K32220Q8154J16280K1532o2174q5850
$$ -121467 -85947 -34793 -166929 -263479 -175511 56709 144863 261143 282675 220501 134651
20648A34651m3739P2390j7789k20815o2278M6036N626n1148l0765J03276J29332
$$ 134651 90912 163302 145513 -75302 -137580 -91544 -85918 -137066 -167831 -64555 64777
20637F4777N9530m9913J34240j64068p3498R5777K024j00934j45257J27769q7980
$$ 64777 124307 74394 208634 44566 -28932 66845 68869 -32065 -177322 -49553 -137533
20626a37533r4116J4440n0655R1522R3271L8401q758K9229Q3740J24540k4988
$$ -137533 -231649 -217209 -267864 -176342 -83071 -44670 -53428 -24199 59541 184081 159093
20615A59093k3548j03870l16113N7923K44725O7232j45501n8192J57528R4503
$$ 159093 135545 31675 -284438 -226515 18210 85442 -60059 -118251 39277 133780
20605A33780q5411J03070O0085M4955l2396k12848m4188K3150n2406J0886l1900
$$ 133780 48369 151439 211524 256479 224083 11235 -32953 -9803 -62209 -51323 -83223
20594h3223k7612J5387L7555l9309k5009J2696q6041J02206k4300J0573O0712
$$ -83223 -110835 -95448 -57893 -97202 -122211 -109515 -195556 -93350 -117650 -107077 -46365
20583d6365k8771R0102k1740n9066K1833j1100k3804K7527Q5250N2667q101J13749
$$ -46365 -75136 14966 -6774 -65840 -44007 -55107 -78911 -51384 33866 86533 78432 192181
20571A92181L2537j46621p6284K18891J99189O8436j90601p4199K2005q6373j43754
$$ 192181 224718 78097 1813 220704 419893 488329 297728 223529 245534 159161 15407
20560A5407q8981O2291k0257l1363K12651k6982j57335o547J4897J12328L1793
$$ 15407 -73574 -11283 -31540 -62903 149748 122766 -34569 -41116 -26219 86109 117902
20549A17902M2953k3122m6506r2091k03173O4095O3024J80592p7661j41572O82
$$ 117902 160855 137733 91227 -864 -204037 -139942 -76918 103674 26013 -115559 -114877
20538a14877m0043R1090j1555k3234k4064O1286n8740R6049J02070k1124n573
$$ -114877 -154920 -63830 -75385 -98619 -122683 -61397 -120137 -24088 77982 56858 51285
20527E1285q2094o3546q8936o8862J04053J35133j37873k8204J1654J4340k1361
$$ 51285 -30809 -94355 -183291 -252153 -148100 -12967 -150840 -179044 -167390 -153050 -174411
20516a74411N9432l894J09641K07875l0338j32467j49519R165R8400j48644n7244
$$ -174411 -114979 -118873 -9232 198643 168305 35838 -113681 -104516 -6116 -154760 -212004
20505b12004M9481J73244L0322J5439o4835J03663j02077N6642P7983q9572L3550
$$ -212004 -162523 10721 41043 56482 -8353 95310 -6767 49875 127858 38286 71836
20494G1836L8528R8993M9020p0848j30091J67228J09398n9145k43241n5702j43479
$$ 71836 110364 209357 258377 187529 57438 224666 334064 274919 31678 -24024 -167503
20483a67503J0508Q8281J53481J06054j09280j13283N6243k4298p5694N7031J83121
$$ -167503 -156995 -68714 84767 190821 81541 -31742 24501 203 -75491 -18460 164661
20472A64661n8852q0888j39115K1246m1243J5739K0930J18038L7426O230k44547
$$ 164661 105809 24921 -114194 -92948 -134191 -118452 -97522 20516 57942 64172 -180375
20461a80375o5903K6854k9445J48620K34930J59467N8381j53336l6234p3943R6994
$$ -180375 -246278 -219424 -248869 -100249 134681 294148 352529 199193 162959 89016 186010
20450A86010m8968k15048r1457K3682J8009O0811j9572J3480m8208J5551R3544
$$ 186010 137042 -78006 -169463 -145781 -127772 -66961 -86533 -73053 -121261 -105710 -12166
20439a2166o5001j16885j8460N842P8583R51k26585n8319K05860R9431J60812
$$ -12166 -77167 -194052 -212512 -206670 -128087 -127136 -353721 -412040 -206180 -106749 54063
20428E4063j06347J23719L5855j78541q1140J05288P637q3893J80916k8949q8048
$$ 54063 -52284 71435 107290 -71251 -152391 -47103 -39466 -123359 57557 28608 -59440
20417e9440J02157r1636k6865m6358o6021J64237J35976K0933K7280r6156k49787
$$ -59440 42717 -48919 -75784 -122142 -188163 -23926 112050 132983 160263 64107 -185680
20406a85680j320O7711M944J10760k0397O979j46436k5120P7228K46468L5479
$$ -185680 -187000 -119289 -114345 -3585 -23982 -17003 -163439 -188559 -111331 135137 170616
20395A70616j41865k40454p2201J07337J56230R3557O245k3357k41300j5507P1167
$$ 170616 28751 -211703 -283904 -176567 -20337 73220 79465 56108 -185192 -200699 -129532
20384a29532O754j64538j9432J60521J16521K5872J99575L4318j37513j57303
$$ -129532 -122778 -287316 -306748 -146227 -29706 -3834 195741 230059 92546 -64757
20374f4757n3570J04354N4566o9924O8355n9667k0686M8841J34042q4193m7681
$$ -64757 -118327 -13973 40593 -29331 39024 -20643 -41329 7512 141554 57361 9680
20363I680j9259j10680R1602J73274o5901j00073p6071M100j01053P535K51888
$$ 9680 -9579 -120259 -28657 144617 78716 -21357 -97428 -93328 -194381 -186846 65042
20352F5042J07268p5979l5099Q2387Q9920q0081j94783l2720K06695o2228j08965
$$ 65042 172310 96331 61232 143619 233539 153458 -41325 -74045 132650 70422 -38543
20341c8543J5129Q263j4966K4772k06823R310R5159k09096m4741J48028J00048
$$ -38543 -23414 -15151 -30117 -5345 -212168 -202858 -107699 -316795 -361536 -213508 -113460
20330a13460M8548L0307j27454k9238Q4259J44164m6793j38496J26757M701Q496
$$ -113460 -64912 -34605 -162059 -191297 -107038 37126 -9667 -148163 -21406 -16705 -8209
20319h209p4757n8241p317M2582l7971p754L3915m7282O9983r882j0194q0850
$$ -8209 -82966 -141207 -148524 -105942 -143913 -151667 -117752 -165034 -95051 -104933 -115127 -195977
20307a95977r8099K16351J11406j8j64805L0511L00473k8977k06102j3896q0209
$$ -195977 -294076 -77725 33681 33663 -131142 -100631 199842 170865 -35237 -49133 -129342
20296a29342L0547M573P4194R724p9404m7781K0016m2707Q301j16629O6328K01918
$$ -129342 -98795 -94222 -20028 -10304 -89708 -137489 -117473 -160180 -151879 -268508 -202180 -262
20284b62Q8308r0310R8207k1728J2135l3149j1761M5732J42304L0307j43175k7281
$$ -262 88046 -2264 95943 74215 86350 53201 41440 87172 229476 259783 116608 89327
20272H9327j721p6501j17765J73625P7049j54330o1624L9095p5439j00627j0774
$$ 89327 87606 11105 -106660 66965 144014 -10316 -71940 -32845 -108284 -208911 -219685
20261b19685J22928J4629o6963P2341O0679J37178o9693j36244J13732q714J40582
$$ -219685 -96757 -82128 -149091 -76750 -16071 121107 51414 -84830 28902 20188 160770
20250A60770J50841j57110l3298M6308o3376j27839j58197J6265J13428j01334
$$ 160770 311611 154501 121203 167511 104135 -23704 -181901 -165636 -52208 -153542
20240a53542k6305J71161O522j11963N8923j4484M4092R8189j6013n9931K6502
$$ -153542 -179847 -8686 -2164 -114127 -55204 -69688 -25596 72593 56580 -3351 23151
20229B3151l1433p3969J9441O3755j64379k851Q0443J16311N1006m7450K76J7081
$$ 23151 -8282 -82251 -62810 945 -163434 -166285 -85842 30469 81475 34025 34301 51382
20217E1382Q8963J77079l0647p5312o1995k6531n6609r5098J6321K75065P8329
$$ 51382 140345 317424 286777 211465 149470 122939 66330 -28768 -12447 262618 340947
20206C40947j84049j48596K20454L11962j73088j79995j1763j13589j84122J87357
$$ 340947 156898 8302 228756 540718 367630 187635 175872 62283 -121839 65518
20196F5518Q3628o6915j04385j06594l4793J6631J38297J00977r222K1799k19705
$$ 65518 149146 82231 -22154 -128748 -163541 -146910 -8613 92364 83142 104941 -114764
20185a14764j46151J66639K39658K60709J10688J0106o9075j76699j85801j69681
$$ -114764 -260915 -94276 145382 406091 516779 526885 457810 281111 95310 -74371
20175g4371r4067N4198J2713m5973o3658J50846Q0609n0300N1127k7393P448O489
$$ -74371 -168438 -114240 -101527 -147500 -211158 -60312 20297 -30003 21124 -6269 1179 7668
20163G668L0178o8263J38616J16058j41892j46969M9014Q3066M396K0870l2340
$$ 7668 37846 -30417 108199 224257 82365 -64604 -15590 67476 71872 92742 60402
20152F0402n2599J15207N6206m6241j15800k02593r0709K3168m0490L303K28199
$$ 60402 7803 123010 179216 132975 17175 -185418 -276127 -252959 -293449 -290146 -61947
20141f1947Q6022M8786L6525o6040r2465m4101K51P5079R6222j28156q8650k715
$$ -61947 24075 72861 109386 43346 -49119 -93220 -92969 -17890 78332 -49824 -138474 -141189
20129a41189J17767K1243O7256N2778L2020k9560p2449P532O4733P8707O7004
$$ -141189 -23422 -2179 65077 117855 149875 120315 47866 55398 120131 198838 265842
20118B65842j33608l460J19018n13n5256k4676q9577k74172O9538j8419p3226
$$ 265842 132234 128774 247792 247279 192023 167347 77770 -196402 -126864 -145283 -218509
20107b18509K30908K35203p1448k664q6903k41868K9452Q4176j53576j271J10609
$$ -218509 12399 247602 176154 173490 86587 -155281 -125829 -41653 -195229 -196500 -85891
20096h5891m1461o8570n4088k4611l233J22074M1059K9178L467n3987k3929J60491
$$ -85891 -127352 -195922 -250010 -274621 -277854 -155780 -114721 -85543 -82076 -136063 -159992 499
20084D99J08976O9877k2697q2948j6048j25042o5970j6240N0181P4340Q2847o4080
$$ 499 109475 179352 156655 73707 57659 -67383 -133353 -149593 -99412 -25072 57775 -6305
20072f305p5310l3731k8643l0757L0329K6491p4475J275J18267J6189j56606J3118
$$ -6305 -81615 -115346 -143989 -174746 -144417 -117926 -192401 -191126 -72859 -56670 -213276 -200158
20060b00158K55744R5534j31846J47478L4038j25424J23487J14010r8287m2246
$$ -200158 55586 151120 19274 166752 200790 75366 198853 312863 214576 172330
20050A72330j173p4382j02911n0690J34153J48655L7298j38695k66538R9822J8436
$$ 172330 171157 96775 -6136 -56826 77327 225982 263280 124585 -141953 -42131 -23695
20039b3695P5306q556m085O1824J2645k8244L272r2810K2729J14118M0621M2220
$$ -23695 51611 43055 38970 100794 113439 85195 88467 -4343 18386 132504 173125 215345
20027B15345r3790j78953P8042n3266J5859P812O805Q0860j1197q3023P0166N0952
$$ 215345 121555 -57398 20644 -32622 -16763 -8951 -2146 78714 67517 -15506 54660 105612
20015A05612q4177N7174P2444k52458j93359M4388Q8035K1776j00529k8224J92833
$$ 105612 21435 78609 151053 -101405 -294764 -250376 -162341 -140565 -241094 -269318 -76485
20004g6485K30108J07570j74155j13408l8551k1922K499N1573l6601L531N3643
$$ -76485 153623 261193 87038 -26370 -64921 -86843 -84344 -32771 -69372 -65841 -12198
19993a2198N9072J26246J1725o2966j02735p1873j49657J15251J40747r0760M3868
$$ -12198 46874 173120 184845 121879 19144 -52729 -202386 -87135 53612 -37148 6720
19982F720P7008J03875r3644j43698N944P6364r9509o4543m766O7082J60229j00930
$$ 6720 83728 187603 93959 -49739 -43795 32569 -66940 -131483 -136249 -69167 91062 -9868
19970i868r8187l3849N2415p427k6495N4680P8392N3832K1716n1588j09550k48315
$$ -9868 -108055 -141904 -89489 -96916 -123411 -68731 9661 63493 85209 33621 -75929 -324244
19958c24244J6783K05552J57255J88620L4100K0505J63065j8010q759q5217q8769
$$ -324244 -307461 -101909 55346 243966 278066 298571 461636 443626 434867 349650 260881
19947B60881j15338o3577m6882M8629k3663M1621K0761n7909o6334K7099n3997
$$ 260881 145543 81966 35084 83713 60050 101671 122432 64523 -1811 25288 -28709
19936b8709k02054J16147J02717K4281j34670M4144J95951L9580j67051j37579
$$ -28709 -230763 -114616 -11899 12382 -122288 -78144 117807 157387 -9664 -147243
19926a47243m0090j4867k9018J74540o2954q3681K9645K3808J1074J47398P2489
$$ -147243 -187333 -202200 -231218 -56678 -119632 -203313 -173668 -149860 -138786 8612 81101
19915H1101O749O1157J4384l5546k40137j22981M638l3196R8027K9551J28883
$$ 81101 87850 149007 163391 127845 -112292 -235273 -230635 -263831 -165804 -136253 -7370
19904g370j06344o2137L6061N4376J71229J90982k8301j29499m3403O2646M263
$$ -7370 -113714 -175851 -139790 -85414 85815 276797 248496 118997 75594 138240 142503
19893A42503k5090l488k6196j14426K584j20566m8944j8629N1288K08576j47650
$$ 142503 117413 113925 87729 -26697 -24113 -144679 -193623 -212252 -160964 47612 -100038
19882a00038k05334q6896m1398k9511J3083J30836J19972N6046m9127q3835L2910
$$ -100038 -305372 -392268 -433666 -463177 -450094 -319258 -199286 -143240 -192367 -276202 -243292
19871b43292J0570J03681O5704M9503n0917J65397Q0019j8374j92780l4374J32503
$$ -243292 -232722 -129041 -63337 -13834 -64751 100646 180665 162291 -30489 -64863 67640
19860F7640P7561P1373r6529J06569M9267j08810j10190j48191j16765Q4715L6140
$$ 67640 145201 216574 120045 226614 275881 167071 56881 -91310 -208075 -123360 -87220
19849h7220j335M0762J27458J00303L4447O5790k18524k02392J75567K9152M7091
$$ -87220 -88555 -47793 79665 179968 214415 280205 61681 -140711 34856 64008 111099
19838A11099O8247M5143L075p3864J9459N5255j58030l6822M4365o024k2455O7470
$$ 111099 179346 224489 227564 153700 173159 228414 70384 33562 77927 71903 49448 116918
19826A16918J24693N2771l8977j25598j42695p3463l835O8449J15900j60q5640
$$ 116918 241611 294382 255405 129807 -12888 -86351 -90186 -21737 94163 94003 8363
19815H363o6899j10975k68432J0855K57654N5483Q4822o0395L7911J27056q2020
$$ 8363 -58536 -169511 -437943 -427088 -169434 -113951 -29129 -89524 -51613 75443 -6577
19804f577M309J90913J93996k25012j02008o6630J5368n764o7126j21817N3011
$$ -6577 -2268 188645 382641 157629 55621 -11009 4359 -1405 -68531 -190348 -137337
19793a37337J01365Q0827j14589p888N7943k8826m730p487j38349J9168K45237
$$ -137337 -35972 44855 -69734 -77622 -19679 -48505 -53235 -60722 -199071 -179903 65334
19782F5334J06171K00265J10673j05385j79964k13825o9750j3694j06132O7150
$$ 65334 171505 371770 482443 377058 197094 -16731 -86481 -100175 -206307 -139157
19772a39157J62812R4452m3256o0361p4082K6627L9331k7286L2788l7233K2640
$$ -139157 23655 118107 74851 14490 -59592 -32965 6366 -20920 11868 -25365 -2725
19761b725o3787j1679n8616n2230Q6193J38471j10861J2722J71346j32637j08121
$$ -2725 -66512 -78191 -136807 -189037 -102844 35627 -75234 -62512 108834 -23803 -131924
19750a31924J6840Q8318o7475P1669m8998j24693L0875K04497K28570J33144j40679
$$ -131924 -115084 -26766 -94241 -22572 -71570 -196263 -165388 39109 267679 400823 260144
19739B60144l2073J13670N3504O0188p9539j05539j28402j00055j5708o7547P9042
$$ 260144 228071 341741 395245 455433 375894 270355 141953 41898 26190 -41357 37685
19728C7685m3055m6552m1177J38670O3923K3835J18597j9934p6142p3817J49852
$$ 37685 -5370 -51922 -93099 45571 109494 133329 251926 231992 155850 82033 231885
19717B31885J31376k5410Q7913L7424M8272p4781j18097r5892j49607P3569n6250
$$ 231885 363261 337851 425764 463188 511460 436679 318582 222690 73083 146652 90402
19706I0402k6093m9998o960l4962J21149K13850O9515p8371j68777q5724j18656
$$ 90402 64309 14311 7351 -27611 93538 307388 376903 298532 129755 44031 -74625
19695g4625o7960J86191J57023J16728l7596K0849N9905r0907j06679n6137j4056
$$ -74625 -142585 43606 200629 317357 279761 300610 360515 269608 162929 106792 92736
19684I2736p3310q924p0954N5027J42641O0380J30732m646j11390J2520J15579
$$ 92736 19426 10502 -60452 -5425 137216 197596 328328 323682 212292 224812 340391
19673C40391r1177J7795j2255M3465K0036O507P0227J17146k2833k07379j05624
$$ 340391 249214 267009 254754 298219 318255 324762 394989 512135 489302 281923 176299
19662A76299N5101P8756L7854k6645k31348l3767O8927K6050j26081J5903r1075
$$ 176299 231400 310156 348010 321365 90017 56250 125177 151227 25146 41049 -50026
19651e0026m2777K1988J7681J9713L9771k3848o9031q1827J27244L5608J4322
$$ -50026 -92803 -70815 -53134 -33421 6350 -17498 -86529 -168356 -41112 -5504 8818
19640H818q4569k8450J59643L4237k69531q5085J10472O8549K8225K03279J06212
$$ 8818 -75751 -104201 55442 89679 -179852 -264937 -154465 -85916 -57691 145588 251800
19629B51800k30422o0225p1719L5690J43489N5516J62218j29697r1788r447l6383
$$ 251800 21378 -38847 -110566 -74876 68613 124129 286347 156650 64862 55415 19032
19618A9032M8776Q1697N5336J39114r3619M3703J9276l0038o1375m2274J05107
$$ 19032 67808 149505 204841 343955 250336 294039 313315 283277 221902 179628 284735
19607B84735j10522k0381Q0137j61279j69367Q2126L5561k2945J11768L8639K9477
$$ 284735 174213 153832 233969 72690 -96677 -14551 21010 -1935 109833 148472 177949
19596A77949m0316n5137L5315J1990j14225P9527J72414N8143K0324O885l1712
$$ 177949 137633 82496 117811 129801 15576 95103 267517 325660 345984 352869 321157
19585C21157P9227R4350j69252j16772m7219j36742J7135j19622Q1719J55974
$$ 321157 400384 494734 325482 208710 161491 24749 41884 -77738 3981 159955
19575A59955P8704j75252j25138J51310O1543j0585n0606M3709J96790L9845j39558
$$ 159955 238659 63407 -61731 89579 151122 140537 89931 133640 330430 370275 230717
19564B30717j30795j7192K5321k53083q3454J40704O05j18507K72844L24145P0129
$$ 230717 99922 82730 108051 -145032 -228486 -87782 -87177 -205684 67160 391305 461434
19553D61434k1626j34204j71366K3560O6151j0768J35099M2395J71248p5521j35091
$$ 461434 439808 305604 134238 157798 223949 213181 348280 390675 561923 486402 351311
19542C51311L250J00388n1088J32236R8639j17821P6011L5481J6285K3880J17121
$$ 351311 354561 454949 403861 536097 634736 516915 592926 628407 644692 668572 785693
19531G85693q9584R2519J48140N4957N6894l289j89136j53207j02862J11526J19937
$$ 785693 696109 788628 936768 991725 1048619 1045330 856194 702987 600125 711651 831588
19520H31588q2560j19316J99445R5437q8637J30198L5187j7144P3325j1404l6340
$$ 831588 749028 629712 829157 924594 835957 966155 1001342 984198 1057523 1046119 1009779
19509A009779p7407l1832q477K3100M5511o1518J17813L9473L919O4342m5182
$$ 1009779 932372 900540 892063 915163 960674 899156 1016969 1056442 1060361 1124703 1079521
19498A079521P9980j9746k74677j59798K09076j34561K54L41571P4022k34419
$$ 1079521 1159501 1139755 865078 705280 914356 779795 780049 1121620 1195642 961223
19488I61223N7644N4282m1822j20763L2106J83863L4744m104K1390k59562r8229
$$ 961223 1018867 1073149 1031327 910564 942670 1126533 1161277 1157173 1178563 919001 820772
19477H20772O4347p3843O7450q3922P0197n9488L4527J03711J75482L9280R4887
$$ 820772 885119 811276 878726 794804 865001 805513 840040 943751 1119233 1158513 1253400
19466A253400K5421l295j38983P5847k4931o3704n8439j88049j00560M3572M9758
$$ 1253400 1278821 1275526 1136543 1212390 1187459 1123755 1065316 877267 776707 820279 870037
19455H70037L0990k28383j82845L5644J6871o6886J29319o1891p2287R3003Q129
$$ 870037 901027 672644 489799 525443 542314 475428 604747 542856 470569 563572 571701
19444E71701M2240j07721j0207j3663r191q936L5457M8777p3679o9008n5255R689
$$ 571701 613941 506220 496013 482350 473159 464223 499680 548457 474778 405770 350515 360204
19432C60204j3558n6090L0686J04563p0998Q9010K6984o603P6425n1890n2803
$$ 360204 346646 290556 321242 425805 354807 443817 470801 464198 540623 488733 435930
19421D35930Q7708n2799K8477L2684j93656J01510p1930j70574k4536n8187O9883
$$ 435930 523638 470839 499316 532000 338344 439854 367924 197350 172814 114627 184510
19410A84510M4371J3725K6305J98575r8923J1680J91158p3232j27502k01954k3972
$$ 184510 228881 242606 268911 467486 368563 380243 571401 498169 370667 168713 144741
19399A44741J61560J86008J2802j27517n594J51032O1761J4451J0832r1602k55356
$$ 144741 306301 492309 505111 377594 372000 523032 584793 599244 610076 518474 263118
19388B63118n4538P6278N8767L7590j20390L6081J5778J17887J55854J7704j04229
$$ 263118 208580 284858 343625 381215 260825 296906 312684 430571 586425 604129 499900
19377D99900j62509j7806n0452O2933J03108N3621j12763j3945Q7026J47379k63005
$$ 499900 337391 319585 269133 332066 435174 488795 376032 362087 449113 596492 333487
19366C33487j91122J61636K49800K7167j63350j54507j4360O1280Q4593j5632
$$ 333487 142365 304001 553801 580968 417618 263111 248751 310031 394624 378992
19356C78992m6136q499L2492K5470k4902j90676m0425p634q1139l4655J00561
$$ 378992 332856 324357 356849 382319 357417 166741 126316 118682 37543 2888 103449
19345A03449J66657N5180l4604K3907Q2709M3317j92469o0955K6364n292k8877
$$ 103449 270106 325286 290682 314589 397298 440615 248146 187191 213555 208263 179386
19334A79386N0793k8471O2443J10854J20618k201J2627K87r8274O1512N7444j20858
$$ 179386 230179 201708 264151 375005 495623 493422 506049 506336 408062 469574 527018 406160
19322D06160o4245m5823q517R3745K0901j6162K8767L9386L536K4470j37741m6293
$$ 406160 341915 296092 287575 381320 402221 386059 414826 454212 457748 482218 344477 298184
19310B98184K8362k4385K58599J41526j40771J29205J5281j33425Q8329O4071
$$ 298184 326546 302161 560760 702286 561515 690720 706001 572576 660905 724976
19300G24976j62442L4536j03189O8831N6364M1254K0454L4982J09369J37263R0952
$$ 724976 562534 597070 493881 562712 619076 660330 680784 715766 825135 962398 1053350
19289A053350q1387j69184j82026q7964J27934R5934R6033N6173j5859k69858
$$ 1053350 971963 802779 620753 532789 660723 756657 852690 908863 893004 623146
19279F23146n8247K36829J96989O2155L2066j42103k11260L9171j39080R3274
$$ 623146 564899 801728 998717 1060872 1092938 950835 739575 778746 639666 732940
19269G32940J15820P681N7089O279j343J20305r5412l1306l7111p1571j4061K09854
$$ 732940 848760 856441 913530 919809 918466 1038771 943359 912053 874942 803371 789310 999164
19257I99164j557K8034l0118N0546Q4278J67807j90080R507j09596j29851J13289
$$ 999164 997607 1025641 995523 1046069 1130347 1298154 1108074 1117581 1007985 878134 991423
19246I91423N8244j89647j6250M8250j8839Q7304P4095K6947j45895j55860L2350
$$ 991423 1049667 860020 843770 892020 873181 960485 1034580 1061527 915632 759772 792122
19235G92122k3885j93232j16436J03294O0376J89216J64327k03645j40139O6670
$$ 792122 768237 575005 458569 561863 622239 811455 975782 772137 631998 698668
19225F98668K677r8875k9866r7902L4060n7568J2431P6174M540j1113j5675q3776
$$ 698668 701345 602470 572604 474702 508762 451194 463625 539799 544339 533226 517551 433775
19213D33775K9731k3243r6446j9346P9479J3219J92081J81979O5276j27666k13161
$$ 433775 463506 440263 343817 324471 403950 417169 609250 791229 856505 728839 515678
19202E15678j51724N4916J83249J67373Q7245J68294j88205j50438R1989R197
$$ 515678 363954 418870 602119 769492 856737 1025031 836826 686388 778377 787574
19192G87574j92974k0335R8104L1846p4062o7716R3904j0974j92083M1250J37946
$$ 787574 594600 574265 672369 704215 630153 562437 656341 645367 453284 494534 632480
19181F32480j7805q2278Q3308J9177N2131q2990j32611r2195j79683J1384K32854
$$ 632480 614675 532397 615705 634882 687013 604023 471412 379217 199534 210918 443772
19170D43772Q0385N9887L7001J80998J49744j99030M4709O1212o579R2848j19496
$$ 443772 524157 584044 621045 802043 951787 752757 797466 858678 852099 944947 825451
19159H25451N1314M5957O1570l4675n294q640N1617P9694M6930n1841r6583O0796
$$ 825451 876765 922722 984292 949617 944323 935683 987300 1066994 1113924 1062083 965500 1026296
19147A026296M7601J36320K54905m6615L063n3120j72860J17343O1523m3120n875
$$ 1026296 1073897 1210217 1465122 1418507 1421570 1368450 1195590 1312933 1374456 1331336 1325461
19136A325461M2546l4440L5777j3253j5828o8742j26800J07777K8600R8635l5538
$$ 1325461 1368007 1333567 1369344 1356091 1340263 1271521 1144721 1252498 1281098 1379733 1344195
19125A344195o5933J3919J39871k4349m4563J87957O4107m962J33562J36988J53596
$$ 1344195 1278262 1292181 1432052 1407703 1363140 1551097 1615204 1610242 1743804 1880792 2034388
19114B034388J22757N9420Q9961L2982R1640l0713L8411K38238J01654K1350M0473
$$ 2034388 2157145 2216565 2306526 2339508 2431148 2400435 2438846 2677084 2778738 2800088 2840561
19103B840561J05623O4839l4124K4744L6799O5594K58931L08725K41394M4169
$$ 2840561 2946184 3011023 2976899 3001643 3038442 3104036 3362967 3671692 3913086 3957255
19093C957255J90181O1169j9999O1348q2712Q8212o8529J98795L16070K00546
$$ 3957255 4147436 4208605 4188606 4249954 4167242 4255454 4186925 4385720 4701790 4902336
19083D902336K45414J68282K12435K70080L08288K42367J81783K48058K16123
$$ 4902336 5147750 5316032 5528467 5798547 6106835 6349202 6530985 6779043 6995166
19074F995166L49508N17391L76401O04547Q47938O12886L07763K82343K00849
$$ 6995166 7344674 7862065 8238466 8843013 9690951 10303837 10611600 10893943 11094792
19065A1094792L68664O61768M13703M78915N98883N00201N05325O64910R73137
$$ 11094792 11463456 12125224 12538927 13017842 13616725 14116926 14622251 15287161 16260298
19056A6260298J224731J282847J004250R27392J049545J434094J523171J118414
$$ 16260298 17485029 18767876 19772126 20699518 21749063 23183157 24706328 25824742
19048B5824742M73830K54934J31833M46354Q56475J205962J537857J713822J529192
$$ 25824742 26298572 26553506 26685339 27131693 27988168 29194130 30731987 32445809 33975001
19039C3975001J214846Q82790L78652P66418J355150J951792K817824M171553
$$ 33975001 35189847 36072637 36451289 37217707 38572857 40524649 43342473 47514026
19031D7514026N904403P918103R853391J1170612J2548848J5633608J8388120
$$ 47514026 53418429 61336532 71189923 82360535 94909383 110542991 128931111
19024A28931111J4217557J670333r145800j2596531j1069063o766643k395986
$$ 128931111 143148668 144819001 135673201 123076670 112007607 105240964 102844978
19017A02844978J710083N824059Q474404O725153K734023K107578M524293O740039
$$ 102844978 104555061 110379120 118853524 125578677 128312700 130420278 134944571 141684610
19009A41684610O436725N867262P060141O302004J73472o749456q956006p508068
$$ 141684610 148121335 153988597 161048738 167350742 167524214 160774758 151818752 144310684
19001A44310684m058688L64795N241324Q875718Q052792J307342n697589p475225
$$ 144310684 140251996 140616791 145858115 154733833 162786625 164093967 158396378 150921153
18993A50921153m933096n01615M338601R208237J2518149J0481161K803487k720301
$$ 150921153 145988057 145486442 149825043 159033280 171551429 182032590 184836077 182115776
18985A82115776j551521L406828P735987O049014j022966p018061p243453m392167
$$ 182115776 180564255 183971083 191707070 197756084 196733118 189715057 182471604 178079437
18977A78079437l039014m598478n633233l703932j3726L129001K107539k453591
$$ 178079437 175040423 170441945 164808712 161104780 161091054 164220055 166327594 163874003
18969A63874003m102551j537466K717576P333219J0936263J4652488J6156152
$$ 163874003 159771452 158233986 160951562 168284781 179221044 193873532 210029684
18962B10029684P042197r796405j9236240j8947939j4433817r873591p855761
$$ 210029684 217071881 207275476 188039236 169091297 154657480 144783889 136928128
18955A36928128p931589p553400o036536m462836m144316m955083n761317n492146
$$ 136928128 128996539 121443139 115406603 110943767 106799451 101844368 96083051 90590905
18947I0590905m844389m095951l236089k760305k138275j494383q51998p6972
$$ 90590905 85746516 81650565 78414476 75654171 73515896 72021513 71169515 71092543
18939G1092543J93874R6939j9320p02291k121303l467859l787785l303563k722762
$$ 71092543 71286417 71383356 71364036 70661745 68540442 65072583 61284798 57981235 55258473
18930E5258473k035454j689002j660432j857944j994309j670039j590592j597978
$$ 55258473 53223019 51534017 49873585 48015641 46021332 44351293 42760701 41162723
18922D1162723j909126k175628k015478j888041j679060j424272j579863j400690
$$ 41162723 39253597 37077969 35062491 33174450 31495390 30071118 28491255 27090565
18914B7090565j164088j120821j186537r44425j094251r88350p95666q17629q86526
$$ 27090565 25926477 24805656 23619119 22674694 21580443 20592093 19796427 18978798 18092272
18905A8092272p29602o19167n61858n88060n44042n96458p20869n92418m87664
$$ 18092272 17362670 16743503 16181645 15593585 15049543 14453085 13732216 13139798 12652134
18896A2652134n33959l77630l68349n13607n68707n72308l08902m57192m40162
$$ 12652134 12118175 11740545 11372196 10858589 10289882 9717574 9408672 8951480 8511318
18887H511318l63881j79407k30208l17307l84772l03656l48385j98438j58426
$$ 8511318 8147437 7968030 7737822 7420515 7035743 6732087 6383702 6185264 6026838
18878F026838j74954k99818l58227l22099j61777j1956j94797r0876j09624k17627
$$ 6026838 5851884 5552066 5193839 4871740 4709963 4698007 4503210 4412334 4302710 4085083
18868D085083K461r1260p3880J7649q1545k70919k30598r146j61034j09582l4898
$$ 4085083 4087544 3996284 3922404 3940053 3858508 3587589 3356991 3347845 3186811 3077229 3042331
18857C042331K9573K8844J1592p4531p2577j50987o0571J4739q0452o3685P5106
$$ 3042331 3071904 3100748 3112340 3037809 2965232 2814245 2753674 2768413 2687961 2624276 2699382
18846B699382K72489l9004j92536p5255n5421j53927M0501O9269P0819j16825
$$ 2699382 2971871 2932867 2740331 2665076 2609655 2455728 2496229 2565498 2636317 2519492
18836B519492O7364J24424j6263R2780P9375m338q7936j14877K2339J30568q3801
$$ 2519492 2586856 2711280 2695017 2787797 2867172 2862834 2774898 2660021 2682360 2812928 2729127
18825B729127K2945j600j56158r5529J38286K84427j7532P7213L1175o3029j07594
$$ 2729127 2752072 2750472 2594314 2498785 2637071 2921498 2903966 2981179 3012354 2949325 2841731
18814B841731k0066n9445j060o2095k05808J06347J8876L9317Q2987K7492k22667
$$ 2841731 2821665 2762220 2761160 2699065 2493257 2599604 2618480 2657797 2740784 2768276 2545609
18803B545609p8294J40127J03724K8221J8326j88779j20261R4031J76472R5592
$$ 2545609 2467315 2607442 2711166 2739387 2757713 2568934 2448673 2542704 2719176 2814768
18793B814768p0955P4462J32684o1386r0189o113j96994k5841J37108R5294J39185
$$ 2814768 2743813 2818275 2950959 2889573 2799384 2793271 2596277 2570436 2707544 2802838 2942023
18782B942023n2260j49672m9583O6767k5452O1369J81462j50428j34843j23132
$$ 2942023 2889763 2740091 2690508 2757275 2731823 2793192 2974654 2824226 2689383 2566251
18772B566251L7189K10042L3287J9914P1946J16010J12890j37447k68696l3953
$$ 2566251 2603440 2813482 2846769 2866683 2938629 3054639 3167529 3030082 2761386 2727433
18762B727433q0936p0017j33964N2529q3466r2617j05863q560L0611j09882n0968
$$ 2727433 2646497 2576480 2442516 2495045 2411579 2318962 2213099 2204539 2235150 2125268 2074300
18751B074300l9234L6109o0517O1483J03757p1539o5209j7335j6135j19368j73696
$$ 2074300 2035066 2071175 2010658 2072141 2175898 2104359 2039150 2021815 2005680 1886312 1712616
18740A712616J24198P4519R1610j11442j29693r990J37593N4730p0935J47697
$$ 1712616 1836814 1911333 2002943 1891501 1761808 1751818 1889411 1944141 1873206 2020903
18730B020903o7033k47161j51397K1115M7428N3330k9895q0440J3285m901M4059
$$ 2020903 1953870 1706709 1555312 1576427 1623855 1677185 1647290 1566850 1580135 1575234 1619293
18719A619293j00224j05022J35029J19973o3994o1608N7505J10271n2966L3512
$$ 1619293 1519069 1414047 1549076 1669049 1605055 1543447 1600952 1711223 1658257 1691769
18709A691769m9398K7010k44095n5763N8168n0121O4317R2420l5918K20243q2074
$$ 1691769 1642371 1669381 1425286 1369523 1427691 1377570 1441887 1534307 1498389 1718632 1636558
18698A636558o6769q8138Q3019M658R211m1274O1692j3635K2228M272M0936O3840
$$ 1636558 1569789 1481651 1564670 1569328 1578539 1537265 1598957 1585322 1607550 1611822 1652758 1716598
18686A716598k4991q1377k577O5376N7453r09J3617J25803j6589j2648J6429j28450
$$ 1716598 1691607 1610230 1607653 1673029 1730482 1729573 1743190 1868993 1852404 1839756 1856185 1727735
18674A727735O001Q9237m4308J151m1960K12009P0625l4561j38557J20009J01891
$$ 1727735 1733736 1822973 1778665 1779816 1737856 1949865 2020490 1985929 1847372 1967381 2069272
18663B069272j63440J28440J39222j22262P6243p773K3110J29844K17910O3608
$$ 2069272 1905832 2034272 2173494 2051232 2127475 2119702 2142812 2272656 2490566 2554174
18653B554174j04480N4096J66232j07213r4345K19039K06134J37258M3389P1693
$$ 2554174 2449694 2503790 2670022 2562809 2468464 2687503 2893637 3030895 3074284 3145977
18643C145977O5721K2415J04652K97273J63912o961m0630P0964o4177k3257J49595
$$ 3145977 3211698 3234113 3338765 3636038 3799950 3792989 3752359 3823323 3759146 3735889 3885484
18632C885484L94304J22968M8926M8297J89194J52274K65707J27942L6428Q3270
$$ 3885484 4279788 4402756 4451682 4499979 4689173 4841447 5107154 5235096 5271524 5354794
18622E354794J74958P97K09507J91383J14012J88995K33135L92769L59938L52161
$$ 5354794 5529752 5530549 5740056 5931439 6045451 6234446 6467581 6860350 7220288 7572449
18612G572449L65785M10506K18537J26256j63897k08504o8665K82411L31918K07776
$$ 7572449 7938234 8348740 8567277 8693533 8529636 8321132 8252467 8534878 8866796 9074572
18602I074572R5128J29901K09782m7924j17787J47050J58770J32497K74635J64830
$$ 9074572 9169700 9299601 9509383 9461459 9343672 9490722 9649492 9781989 10056624 10221454
18592A0221454K11106L68150L83511M83992N68624O21892N77974P74019R32698
$$ 10221454 10432560 10800710 11184221 11668213 12236837 12858729 13436703 14210722 15143420
18583A5143420R83456Q49886N68918P99917J112357J354172J751215J892030J888298
$$ 15143420 16126876 16976762 17545680 18345597 19457954 20812126 22563341 24455371 26343669
18574B6343669K090423K330496K731195L774971N133283N090427L384352J054668
$$ 26343669 28434092 30764588 33495783 37270754 42404037 47494464 50878816 51933484
18566E1933484n18041n11710N5921P9865O52725J870492L189432M840439O706054
$$ 51933484 51415443 50903733 50959654 51039519 51692244 53562736 56752168 61592607 68298661
18557F8298661R343559J2443597J4397959J4406599J2282182R482061P828153
$$ 68298661 77642220 90085817 104483776 118890375 131172557 140654618 148482771
18550A48482771P283908R202627J5319210K4885940L6649810M7241424M3699286
$$ 148482771 155766679 164969306 180288516 205174456 241824266 289065690 332764976
18543C32764976J8301145j3569602l3246000l4530071k5643520j3785975k862660
$$ 332764976 351066121 337496519 304250519 269720448 244076928 230290953 227428293
18536B27428293O236664J2569604J1268268M027042P92142L671258Q279336Q987774
$$ 227428293 233664957 246234561 257502829 261529871 262322013 265993271 274272607 283260381
18528B83260381P547019J1312567J9909273K9115319K7649720P198281j3874378
$$ 283260381 290807400 302119967 322029240 351144559 378794279 385992560 372118182
18521C72118182k1629489k2223227j7204514j0114807n312830k461459l068202
$$ 372118182 350488693 328265466 311060952 300946145 295633315 293171856 290103654
18514B90103654o782692p251508l843606p22292k319591m197764j271854M678747
$$ 290103654 283320962 276069454 272225848 271503556 269183965 264986201 263714347 268393094
18506B68393094J2478891K1447943K8377996K6832754J5252001p999373l0904475
$$ 268393094 280871985 302319928 330697924 357530678 372782679 364783306 333878831
18499C33878831l6693805l1796898k3465869j5809516j0321593p554872p469634
$$ 333878831 297185026 265388128 241922259 226112743 215791150 208236278 200766644
18492B00766644o570315m724687l575590l560858l378655m295389o892635q393591
$$ 200766644 194196329 189471642 185896052 182335194 178956539 174661150 167768515 159374924
18484A59374924p959691p347184o673587n644693m420406l255591k579722k497158
$$ 159374924 151415233 144068049 137394462 131749769 127329363 124073772 121494050 118996892
18476A18996892l033853m159367m838797m497768l816371l472813l436558l657252
$$ 118996892 115963039 111803672 106964875 102467107 98650736 95177923 91741365 88084113
18468H8084113l603749l523634l334400l162271l251137l023030k975817k700569
$$ 88084113 84480364 80956730 77622330 74460059 71208922 68185892 65210075 62509506
18460F2509506k665838k621853k391621k230284k235663k069430j903683k096335
$$ 62509506 59843668 57221815 54830194 52599910 50364247 48294817 46391134 44294799
18452D4294799j970433j520396j429062j295913j234629j306621j191994j065258
$$ 44294799 42324366 40803970 39374908 38078995 36844366 35537745 34345751 33280493
18444C3280493j231726j218012r80872o63547l08572j23405k12518p39310j596499
$$ 33280493 32048767 30830755 29849883 29186336 28877764 28754359 28541841 27802531 26206032
18435B6206032j862667j779050j497463j253785j137234r31072q88805q73217
$$ 26206032 24343365 22564315 21066852 19813067 18675833 17744761 16855956 15982739
18427A5982739p47865p16394o65300m31784m47590n69562m01148n88994m81930
$$ 15982739 15234874 14518480 13853180 13421396 12973806 12404244 12003096 11414102 10932172
18418A0932172n59273l86477l17729l44138k76656j26142k50698k76807j54383
$$ 10932172 10372899 9986422 9668693 9324555 9047899 8921757 8671059 8394252 8239869
18409H239869l23385k64897j59204l97784l41898k74551l32858k73274j43335
$$ 8239869 7916484 7651587 7492383 7094599 6752701 6478150 6145292 5872018 5728683
18400E728683l6013l5322k16019k75898r4850O0439j71826k47519j9224R5670
$$ 5728683 5692670 5657348 5441329 5165431 5070581 5131020 4959194 4711675 4692451 4788121
18390D788121j79130K0828j9932j54889n8075k89155k44810j03144n0124j3878
$$ 4788121 4608991 4629819 4609887 4454998 4396923 4107768 3862958 3759814 3709690 3695812
18380C695812j0839J81489n6598j52666K716L5898p3772r0856k44925p63M4545
$$ 3695812 3684973 3866462 3809864 3657198 3659914 3695812 3622040 3531184 3286259 3285496 3330041
18369C330041r399P3750k1603Q7985J92020Q2826j31939k16485j41640l249J43042
$$ 3330041 3320642 3394392 3372789 3460774 3652794 3735620 3603681 3387196 3245556 3242307 3385349
18358C385349J34079J34695n1541k13480j85273m71P6994p2530M9090N3560j63308
$$ 3385349 3519428 3654123 3602582 3389102 3203829 3203358 3280352 3207822 3256912 3310472 3147164
18347C147164J04088K24149m5777j21376Q0219P0143p9176o5342L4731q2333L7735
$$ 3147164 3251252 3475401 3429624 3308248 3388467 3458610 3379434 3314092 3348823 3266490 3304225
18336C304225J620L9107o0102Q961P2100R2075N764l3801M6027J17946p9837J8536
$$ 3304225 3305845 3344952 3284850 3293811 3365911 3457986 3463750 3429949 3475976 3593922 3514085 3532621
18324C532621j7834k72890m1883O3149l4875j37912J142K42271o4262j89976P8061
$$ 3532621 3514787 3241897 3200014 3263163 3228288 3090376 3091518 3333789 3269527 3079551 3157612
18313C157612Q303m065m0073K2024J1687J7196k32033j45055M1497N906l6881
$$ 3157612 3165915 3161850 3121777 3143801 3155488 3172684 2940651 2795596 2837093 2842999 2806118
18302B806118j17580j61351J51278P6628L051k0537P9165j95864k48500k1341
$$ 2806118 2688538 2527187 2678465 2755093 2758144 2737607 2816772 2620908 2372408 2351067
18292B351067m185k9144P0445n0981N3474N27j14645J23728j22720j94192j16212
$$ 2351067 2346882 2317738 2388183 2337202 2390676 2391203 2276558 2400286 2277566 2083374 1967162
18281A967162N750l4255o7649j09916L3439M4163Q6931K07931K0934L6132o4460
$$ 1967162 1972912 1938657 1871008 1761092 1794531 1838694 1925625 2133556 2154490 2190622 2126162
18270B126162j01502m8831j20141j792Q553n0983L7190m4220k64731r1013Q4015
$$ 2126162 2024660 1975829 1855688 1853896 1862449 1811466 1848656 1804436 1539705 1448692 1532707
18259A532707R169K4557k6777j02470P8268O8135j38260M6299K80109j381j2335
$$ 1532707 1541876 1566433 1539656 1437186 1515454 1583589 1445329 1491628 1771737 1770356 1758021
18248A758021O263J08192P401L8096J21835K59816M25747N62099M44380p399k22145
$$ 1758021 1764284 1872476 1879877 1917973 2039808 2299624 2725371 3287470 3731850 3724451 3502306
18237C502306m45628n26110k88974l31047k13300j13693K9733P567k2307k7324
$$ 3502306 3056678 2530568 2241594 1910547 1697247 1583554 1613287 1620854 1598547 1571223
18227A571223p6926j63604n8308J54087r85n0060Q3560j63038j53291P5780P8079
$$ 1571223 1494297 1330693 1272385 1426472 1425487 1375427 1458987 1295949 1142658 1218438 1296517
18216A296517M1816M4674o918J8342J07014k6100j15953j0790J6216o7997O3987
$$ 1296517 1338333 1383007 1376089 1394431 1501445 1475345 1359392 1348602 1364818 1296821 1360808
18205A360808R9810m4479J04133j10635o4381K3043m4527K2261R6545J57619N1849
$$ 1360808 1460618 1416139 1520272 1409637 1345256 1368299 1323772 1346033 1442578 1600197 1652046
18194A652046L0025L1334j04292l5216r5732l5001N1549P6768R6019J92477K09117
$$ 1652046 1682071 1713405 1609113 1573897 1478165 1443164 1494713 1571481 1667500 1859977 2069094
18183B069094j79400j24999j41950j76561N8677J40531N9477J29819J81247j21963
$$ 2069094 1889694 1764695 1622745 1446184 1504861 1645392 1704869 1834688 2015935 1893972
18173A893972j34427j31129j42795j05603L4477J96088K55793j49969k54251q6863
$$ 1893972 1759545 1628416 1485621 1380018 1414495 1610583 1866376 1716407 1462156 1375293
18163A375293J73066Q7407L0577l0591K7327k3121J7357K9942o3120j8991J59791
$$ 1375293 1548359 1635766 1666343 1635752 1663079 1639958 1657315 1687257 1624137 1605146 1764937
18152A764937K99341K10140K1671l3413n0186M172j7805J10536J60147J74419
$$ 1764937 2064278 2274418 2296089 2262676 2212490 2216662 2198857 2309393 2469540 2643959
18142B643959K638l498j10281j73292N6270L32291K15056J4492J98994K41106
$$ 2643959 2646597 2643099 2532818 2359526 2415796 2748087 2963143 2977635 3176629 3417735
18132C417735L59070J61881J39128L42555L06746L49664J89745L63370O44037
$$ 3417735 3776805 3938686 4077814 4420369 4727115 5076779 5266524 5629894 6273931
18123F273931R87591J018812J004351J573053K100516K532165L336270M486567
$$ 6273931 7261522 8280334 9284685 10857738 12958254 15490419 18826689 23313256
18115B3313256N913684Q151358J0951982J4808627K0837130K8618310L6078442
$$ 23313256 29226940 37378298 48330280 63138907 83976037 112594347 148672789
18108A48672789K1224641j4219957k9329986k7862232k1162252j4135107r642309
$$ 148672789 169897430 155677473 126347487 98485255 77323003 63187896 53545587
18101E3545587o821988n061539l874156l282141k616062k221775j809226j667853
$$ 53545587 46723599 41662060 37787904 34505763 31889701 29667926 27858700 26190847
18093B6190847j415656j272616j086331j021182n67039l85368l84263n29029m43773
$$ 26190847 24775191 23502575 22416244 21395062 20828023 20442655 20058392 19529363 19085590
18084A9085590m80086m44839l22986q4475n0234j15189m7054L87067L97592j326
$$ 19085590 18605504 18160665 17837679 17753204 17702970 17587781 17540727 17927794 18325386 18324060
18074A8324060m10611o47908l57916j72340n39324o07431n91103p80741n48222
$$ 18324060 17913449 17265541 16907625 16735285 16195961 15588530 14997427 14216686 13668464
18065A3668464m43302n04593m81365m92290n85828n12774m72998l87082l61108
$$ 13668464 13225162 12720569 12239204 11746914 11161086 10648312 10175314 9788232 9427124
18056I427124k64800k81720n21257m96388m37221l69680j67065k79685m11442
$$ 9427124 9162324 8880604 8359347 7862959 7425738 7056058 6888993 6609308 6197866
18047F197866l51405l14694j56730k47103j40264j53946r4075j47478l06625k44554
$$ 6197866 5846461 5531767 5375037 5127934 4987670 4833724 4739649 4592171 4285546 4040992
18037D040992j82237r5330M5762P8304j38657j55782q8484q9710q2160j86765
$$ 4040992 3858755 3763425 3809187 3887491 3748834 3593052 3504568 3414858 3332698 3145933
18027C145933k25872j56477j03430j16665K047J17029l0335M3344M2228J8560
$$ 3145933 2920061 2763584 2660154 2543489 2545536 2662565 2632230 2675574 2717802 2736362
18017B736362P429q7193J28782O7851l4349l740j14133r6237K32772J31784o3524
$$ 2736362 2743791 2656598 2785380 2853231 2818882 2815142 2701009 2604772 2837544 2969328 2905804
18006B905804q963J93042k04860k17743j24067Q6114J83481N2859l6105Q8051
$$ 2905804 2896841 3089883 2885023 2667280 2543213 2629327 2812808 2865667 2829562 2917613
17996B917613J5885j62263j2089J0570J21048M5037R7701N9509j45078k24362
$$ 2917613 2933498 2771235 2759146 2769716 2890764 2935801 3033502 3093011 2947933 2723571
17986B723571j34007Q87m4048l41901j82423L4098Q6845k1335j18213m8682n1359
$$ 2723571 2589564 2590451 2546403 2204502 2022079 2056177 2143022 2121687 2003474 1954792 1903433
17975A903433n1643J08806j22684q578q859O9920J56741P999r5257n3641q2932
$$ 1903433 1851790 1960596 1837912 1829334 1820475 1890395 2047136 2055135 1959878 1906237 1823305
17964A823305j640J28190J4379j02043j36180J4455j1747l9278p1603n8619P1476
$$ 1823305 1821665 1949855 1964234 1862191 1726011 1740466 1728719 1689441 1617838 1559219 1630695
17953A630695M6010l9546J24772J09099J42086J10730k19689L513l7134J04913
$$ 1630695 1676705 1637159 1761931 1871030 2013116 2123846 1904157 1907670 1870536 1975449
17943A975449M8566j06542j27408o3525n184O5777L8797l1590j54745J2824P8278
$$ 1975449 2024015 1917473 1790065 1726540 1721356 1787133 1825930 1794340 1639595 1652419 1730697
17932A730697P1074j09431k64271j3962J21985J21743r9621j30168N02k59430
$$ 1730697 1801771 1692340 1428069 1414107 1536092 1657835 1558214 1428046 1428548 1169118
17922A169118j03371k4040Q2364K21066P0660L6953P5216q7260k11891J6405M472
$$ 1169118 1065747 1041707 1124071 1345137 1415797 1452750 1527966 1440706 1228815 1245220 1249692
17911A249692j6387M5712p6984j59036j21027j18671k1892J05628R5458l0766
$$ 1249692 1233305 1279017 1202033 1042997 921970 803299 781407 887035 982493 951727
17901I51727j6131K3271j8274j53444J370P1742O4257q72J16684J39388j08550
$$ 951727 935596 958867 940593 787149 788519 860261 924518 923646 1040330 1179718 1071168
17890A071168m7274r382j38231m9941L8976m4690J7811r3728o633J58498m2693
$$ 1071168 1023894 1014512 876281 826340 865316 820626 838437 744709 738076 896574 853881
17879H53881j41344o5715P8688Q2039J44614Q8016r6187k1575K8421K6077m6328
$$ 853881 712537 646822 725510 807549 952163 1040179 943992 922417 950838 976915 930587
17868I30587j51619m1879M9086j9107j65146J56833k6644J32354K40996L759p8857
$$ 930587 778968 737089 786175 767068 601922 758755 732111 864465 1105461 1109220 1030363
17857A030363J67705J23169J46098J65048N0514N4898L03223J94366M64415M79704
$$ 1030363 1198068 1321237 1467335 1632383 1682897 1737795 2041018 2235384 2699799 3179503
17847C179503O04694Q36588J146318J582848K207947K717575K229853K49648j785822
$$ 3179503 3784197 4620785 5767103 7349951 9557898 12275473 14505326 14754974 12969152
17838A2969152k435261k125641j609645j172781o94905n80409m71012k53887k37814
$$ 12969152 10533891 8408250 6798605 5625824 4930919 4350510 3879498 3625611 3387797
17829C387797j62113l1171J20281j56835k95586l15939j71585k4702J31856Q2090
$$ 3387797 3225684 3194513 3314794 3157959 2862373 2546434 2374849 2350147 2482003 2564093
17819B564093J8044j93899k28261k14610P9483P285j03887P5431q0793j45245
$$ 2564093 2582137 2388238 2159977 1945367 2024850 2032135 1928248 2003679 1922886 1777641
17809A777641J26819L07163m1397o4535k2059m7766j63169p4496j07655J9247
$$ 1777641 1904460 2211623 2170226 2105691 2083632 2035866 1872697 1798201 1690546 1709793
17799A709793j64528j09845O7158O5921J46410J60687Q9735q2271j25837j70830
$$ 1709793 1545265 1435420 1502578 1568499 1714909 1875596 1965331 1883060 1757223 1586393
17789A586393j44753M0600r1955j64025j02341n2729L0757k7111q9190l6378n737
$$ 1586393 1441640 1482240 1390285 1226260 1123919 1071190 1101947 1074836 985646 949268 943531
17778I43531O1491R6445J68734q5080n7920o0080j17827k7196K0921j21044j48923
$$ 943531 1005022 1101467 1270201 1185121 1127201 1067121 949294 922098 943019 821975 673052
17767F73052K7904N0366j7486M6398J14098m4460O8296J15888K66032M7849p0778
$$ 673052 700956 751322 733836 780234 894332 849872 918168 1034056 1300088 1347937 1277159
17756A277159j9060k7561P3620j03643Q632K30451L48606L6770J5377P8584J95396
$$ 1277159 1258099 1230538 1304158 1200515 1209147 1439598 1788204 1824974 1840351 1918935 2114331
17745B114331R8431l72j6800J12811L1044k7875P4441R5985M3180j90193j12948
$$ 2114331 2212762 2212390 2195590 2308401 2339445 2311570 2386011 2481996 2525176 2334983 2222035
17734B222035O0799Q126j06260O8890J60309J83443N1867o349o4571l1368j98948
$$ 2222035 2282834 2290960 2184700 2253590 2413899 2597342 2649209 2642860 2578289 2546921 2347973
17723B347973n5585j9261j49830R1125L26625Q8324O0475J93664l8716m2954P9298
$$ 2347973 2292388 2273127 2123297 2214422 2541047 2629371 2689846 2883510 2844794 2801840 2881138
17712B881138j22220j0917J86756P7571J13294M3979k4490j43728R3968L1830
$$ 2881138 2758918 2748001 2934757 3012328 3125622 3169601 3145111 3001383 3095351 3127181
17702C127181N9562r213J96439M03309J79895p8425J24868J19734Q0118J91710
$$ 3127181 3186743 3177530 3373969 3777278 3957173 3878748 4003616 4123350 4203468 4395178
17692D395178K21280L23760K58666Q1031J14457L11709M24730O02199M47317M58547
$$ 4395178 4616458 4940218 5198884 5279915 5394372 5706081 6130811 6733010 7180327 7638874
17682G638874Q26249J019440M64586K9540n7406M3999J90566M44763O48927N79385
$$ 7638874 8465123 9484563 9949149 9978689 9921283 9965282 10155848 10600611 11249538 11828923
17672A1828923R74252J153608J472278J754893K000831K375979K886298L789319
$$ 11828923 12803175 13956783 15429061 17183954 19184785 21560764 24447062 28236381
17664B8236381M822650N770550O728437Q484144J0895982J4627874J9312297K5903801
$$ 28236381 33059031 38829581 45558018 54042162 64938144 79566018 98878315 124782116
17656A24782116L5094993M8835325O7562660Q8496009Q5257710K2242141n3272265
$$ 124782116 159877109 208712434 276275094 364771103 450028813 472270954 418998689
17649D18998689q0074803p2647709n3911955l7110556k6010098j8533675j3607488
$$ 418998689 338923886 266276177 212364222 175253666 149243568 130709893 117102405
17642A17102405j0255230q312012o762066n639312m917584m718719l992902l503132
$$ 117102405 106847175 98535163 91773097 86133785 81216201 76497482 72504580 69001448
17634F9001448l066352k688917k363834j958382j579621j415337j254003j025377
$$ 69001448 65935096 63246179 60882345 58923963 57344342 55929005 54675002 53649625
17626E3649625q98215o09806m13957L9943M66467J057155J100622R6228j213519
$$ 53649625 52751410 52141604 51727647 51767590 52234057 53291212 54391834 54488062 53274543
17617E3274543j807116j774945j569764j434603j404962j666677j757750k095205
$$ 53274543 51467427 49692482 48122718 46688115 45283153 43616476 41858726 39763521
17609C9763521k169831k112885k147526k017852j787938j658715j581784j459872
$$ 39763521 37593690 35480805 33333279 31315427 29527489 27868774 26286990 24827118
17601B4827118j299507j355992j134986j019192j009684j046313q63173p70911
$$ 24827118 23527611 22171619 21036633 20017441 19007757 17961444 17098271 16327360
17593A6327360q96707r16646p37085n86002m47426o19714n09764o14938m72661
$$ 16327360 15430653 14514007 13776922 13190920 12743494 12123780 11614016 10999078 10526417
17584A0526417n00250n12293l50207m34450n75275m49991m80044k43411l67505
$$ 10526417 10026167 9513874 9163667 8729217 8153942 7703951 7223907 6980496 6612991
17575F612991l42878j22262k35299k48036l45926k47177k24326j93266k52626
$$ 6612991 6270113 6147851 5912552 5664516 5318590 5071413 4847087 4653821 4401195
17566D401195m24159j31253j69552k18122r5855j97016j53605P3439j44468n9087
$$ 4401195 3977036 3845783 3676231 3458109 3362254 3165238 3011633 3085072 2940604 2881517
17556B881517K087l38424j43428J41650j10055o183j65328L6656q3941r6635j60378
$$ 2881517 2883604 2545180 2401752 2543402 2433347 2427164 2261836 2298492 2214551 2117916 1957538
17545A957538j63449k01345P2839K4556o5365l17825q0228p3256o1602J19527
$$ 1957538 1794089 1592744 1665583 1690139 1624774 1306949 1226721 1153465 1091863 1211390
17535A211390J0653K5698J8999J0271j20611n5378K6991o6596j83188m1731N3660
$$ 1211390 1222043 1247741 1266740 1277011 1156400 1101022 1128013 1061417 878229 836498 890158
17524H90158J14442J2549J74333o7404j59926j96903O8740J53739J02781J05985
$$ 890158 1004600 1017149 1191482 1124078 964152 767249 835989 989728 1092509 1198494
17514A198494J3492J9055k2258q5114k17128j40364Q4199J83673j27701J6604
$$ 1198494 1211986 1231041 1208783 1123669 906541 766177 850376 1034049 906348 922952
17504I22952O7907o9397O0985m4512j94104L8610P5828k9719o5997j26257J94273
$$ 922952 990859 921462 982447 937935 743831 782441 858269 828550 762553 636296 830569
17493H30569M368K07869L5860j10044k3481p6515j85628p7974j6149j41418j3387
$$ 830569 834937 1042806 1078666 968622 945141 868626 682998 605024 588875 447457 434070
17482D34070J40400J46043r644k0826J50217O9422P2693J62508P3327R2224M2640
$$ 434070 574470 720513 710869 690043 840260 909682 982375 1144883 1218210 1310434 1353074
17471A353074o2198j6025n4591J20428j09193J1289o6179q2032m4857Q615J4172
$$ 1353074 1290876 1274851 1220260 1340688 1231495 1242784 1176605 1094573 1049716 1058331 1072503
17460A072503J6371K0321K49670M5406p7370k1498J07444j52647k83264K2563
$$ 1072503 1088874 1109195 1358865 1404271 1326901 1305403 1412847 1260200 976936 999499
17450I99499J5161K7433J7110Q1259J10808L7354R6935J52155L36715P1788l91552
$$ 999499 1014660 1042093 1059203 1140462 1251270 1288624 1385559 1537714 1874429 1946217 1554665
17439A554665l64072j65934o0448j30801j89823J08346O917P7842N8186P2674
$$ 1554665 1190593 1024659 964211 833410 643587 751933 758850 836692 894878 967552
17429I67552L0862j46717J18217P3431n2270j86937r5009O127Q0541p5458o0966
$$ 967552 998414 851697 969914 1043345 991075 804138 709129 715256 795797 720339 659373
17418F59373J45592R214k11278M8704O4771j10966j80036k8851P5586j1262K9833
$$ 659373 804965 814179 602901 651605 716376 605410 425374 396523 472109 460847 490680
17407D90680J6585J73728J7650o9669P24m1081K477R4747j01074l1301p3787j32409
$$ 490680 507265 680993 698643 628974 629698 588617 591094 685841 584767 553466 479679 347270
17395C47270J4394N8553J04121l7460m0110n8549J6917J1162J37161n0336k39060
$$ 347270 361664 420217 524338 486878 446768 388219 405136 416298 553459 503123 264063
17384B64063L4516J69596Q4373q6133j05992p7757o9616j3253o5604j0903L2882
$$ 264063 298579 468175 552548 466415 360423 282666 213050 199797 134193 123290 156172
17373A56172N2914J46823n8378o808M4227r5414N6971P6575r1220L6990P5468
$$ 156172 209086 355909 297531 290723 334950 239536 296507 373082 281862 318852 394320
17362C94320j10352j89598j04997J1148J28956o532q578J48417Q3399N2527j1015
$$ 394320 283968 94370 -10627 521 129477 122945 114367 262784 346183 398710 387695
17351C87695l14905Q4961P2544Q6239K9028l675N5310j21798j61877o1471J47534
$$ 387695 72790 157751 230295 316534 345562 341887 397197 275399 113522 52051 199585
17340A99585J13511n5276j81816l3314J32951N2128n0357j24475j41788J96181
$$ 199585 313096 257820 76004 42690 175641 227769 177412 52937 -88851 107330
17330A07330J35332J45345n9137j97996l6376J25440J40501j15147r8030j26025
$$ 107330 242662 388007 328870 130874 94498 219938 360439 245292 147262 21237
17320B1237j11089J43534l0913r984j13211J66816j6422j41598Q143j06971J71206
$$ 21237 -89852 53682 22769 12785 -100426 66390 49968 -91630 -83487 -190458 -19252
17309a9252P6492P6068P4861o8859n3826J35996O6064j01175j71106N8101J22999
$$ -19252 57240 133308 208169 139310 85484 221480 287544 186369 15263 73364 196363
17298A96363J25077J6166n4475n3732J76403J83027q1780k38597k24665l3741
$$ 196363 321440 337606 283131 229399 405802 588829 507049 268452 43787 10046
17288A0046N1726j0366J75050J36883k9836j17307N9312m6286j09588L8318P4838
$$ 10046 61772 51406 226456 363339 333503 216196 275508 229222 119634 157952 232790
17277B32790L2560M2084p8294j20224j0781r9643p2945Q2854k04809M2590J92636
$$ 232790 265350 307434 229140 108916 98135 -1508 -74453 8401 -196408 -153818 38818
17266C8818Q5024N9060j50224j0867J80410k5640p2175o2059l5957J53231j01738
$$ 38818 123842 182902 32678 21811 202221 176581 104406 42347 6390 159621 57883
17255E7883o0705R4637J26568O2956j52364l4981J99219O6163m7736j99835j13519
$$ 57883 -2822 91815 218383 281339 128975 93994 293213 359376 311640 111805 -1714
17244a714K1137L7091l327R9773J47750R7961J1972o7470j48358j45235q6509
$$ -1714 19423 56514 53187 152960 300710 398671 410643 343173 194815 49580 -36929
17233c6929n7652l9015J42685j03525q1356k6481R1549N9321j405J01475J24936
$$ -36929 -94581 -133596 9089 -94436 -175792 -202273 -110724 -51403 -52808 48667 173603
17222A73603J9698p6887l8724J2139J77613o5526m5221J50523j7041n2052l7041
$$ 173603 193301 116414 77690 89829 267442 201916 156695 307218 290177 238125 201084
17211B01084l6402n9029j35406P9727P2776K2624k0293O3691J8909M2399M3468
$$ 201084 164682 105653 -29753 49974 122750 145374 125081 188772 207681 250080 293548
17200B93548n5241j23300Q0927J2516j0552Q6532p8680j27779q5591j9930K7417
$$ 293548 238307 115007 195934 208450 197898 284430 205750 77971 -7620 -27550 -133
17189a33Q5015Q1050J28522N1149Q0047o4257p0310n4325J44807m6321q7115k4702
$$ -133 84882 165932 294454 345603 425650 361393 291083 236758 381565 335244 248129 223427
17177B23427p0705j19831r0561l308k7920k9681J47112J21594k08400j26604J6819
$$ 223427 152722 32891 -57670 -60978 -88898 -118579 28533 150127 -58273 -184877 -168058
17166a68058K38540P7357N1291j07770L7881m8228r761j73779L911N1893O7201
$$ -168058 70482 147839 199130 91360 129241 81013 71252 -102527 -98616 -46723 20478
17155B0478M3298m7050j46036J85206K27888j07320j42849J8583N9792j0661L0289
$$ 20478 63776 16726 -129310 55896 283784 176464 33615 52198 111990 101329 131618
17144A31618j02520p4585r3772j15053j4660J11516N534k2849J59472N1121O4576
$$ 131618 29098 -45487 -139259 -254312 -268972 -157456 -151922 -174771 -15299 35822 100398
17133A00398K0526J11453j47914o2618J37670K2094m3897r3730k09364J02229
$$ 100398 120924 232377 84463 21845 159515 181609 137712 43982 -165382 -63153
17123f3153J85115J44569p7770q9445J4141j15335N3750J7803n9989K8493K2019
$$ -63153 121962 266531 188761 99316 113457 -1878 51872 69675 9686 38179 60198
17112F0198J01289j64394j72384J20718J61788N894j56008k33206J9379J17268
$$ 60198 161487 -2907 -175291 -54573 107215 113109 -42899 -276105 -256726 -139458
17102a39458M7504o6935j55679K13754M0791J02615J99386K6799r6090k6930j10788
$$ -139458 -91954 -158889 -314568 -100814 -60023 42592 241978 268777 172687 145757 34969
17091C4969j78283N7239K03043K3486j26195J2117L4373N637o2619J02092P047
$$ 34969 -143314 -86075 116968 140454 14259 26376 60749 66386 3767 105859 112906
17080A12906L8239J26818N1799K0109M4300j21813P4746J31686k3957J7711P4749
$$ 112906 151145 277963 329762 349871 394171 272358 347104 478790 454833 472544 547293
17069E47293j21709m4851Q2663M5166J73691J21173J17999r164R9818M00783L40198
$$ 547293 425584 380733 463396 508562 682253 803426 921425 912261 1012079 1412862 1753060
17058A753060M13598M47054n4503o47177m13307k32597k62999k81367n0658j3239
$$ 1753060 2166658 2613712 2559209 1912032 1498725 1266128 1003129 721762 671104 657865
17048F57865P8461k5242j43646q1424P3020q5226p5943l0709L3229L1232N1977
$$ 657865 736326 711084 567438 486014 559034 473808 397865 367156 400385 431617 483594
17037D83594k5921J0114P7712q8743j40931J37716K0256j23733j50025J37919
$$ 483594 457673 467787 545499 456756 315825 453541 473797 350064 200039 337958
17027C37958K4547J44606L0373N4479k22141j48667j2334J1396j9096J7910j67235
$$ 337958 362505 507111 537484 591963 369822 221155 208821 220217 201121 219031 51796
17016E1796j12836Q2052m8287m2484K3014J51043L4156K009n1933J59598K04333
$$ 51796 -61040 21012 -27275 -69759 -46745 104298 138454 140463 88530 248128 452461
17005D52461j02007j36439p8412m2441L9273P1424j00586j08902j45762r4414
$$ 452461 350454 214015 135603 93162 132435 203859 103273 -5629 -151391 -245805
16995b45805J44559J1865P1710R6375j01431k3502r5264L6519R4116j05067q5260
$$ -245805 -101246 -89381 -17671 78704 -22727 -46229 -141493 -104974 -10858 -115925 -201185
16984b01185k1958J99117J29410j01545m6243N8520M9457p5196M2449k8945J25949
$$ -201185 -223143 -24026 105384 3839 -42404 16116 65573 -9623 32826 3881 129830
16973A29830j35273M2252K5536J53599J85161j9963j34533r8398o3956J23043
$$ 129830 -5443 36809 62345 215944 401105 381142 246609 148211 84255 207298
16963B07298J3139P3302P5895o4506j88623r54o9705p6786J54334N5048J4167
$$ 207298 220437 293739 369634 305128 116505 115551 45846 -30940 123394 178442 192609
16952A92609k19000n9365L4259M2170N7727P437Q7643L17j6669m2406n0965m9518
$$ 192609 -26391 -85756 -51497 -9327 48400 55837 143480 143797 127128 84722 33757 -15761
16940a5761J42853N1186k9439j30848N0139j9510j03255j20669m4580J09189q3179
$$ -15761 127092 178278 148839 17991 68130 48620 -54635 -175304 -219884 -110695 -193874
16929a93874j35741K35512O1449M2175k0214j13593Q8145P3202j05093j65376
$$ -193874 -329615 -94103 -32654 9521 -10693 -124286 -36141 37061 -68032 -233408
16919b33408J42953J58472k4413j49929j9123N8224J23813P0113J2393j84431
$$ -233408 -90455 68017 43604 -106325 -125448 -67224 56589 126702 139095 -45336
16909d5336o5815o1084K1066j51896k9826R7482J52315K13949J98733j30397k12613
$$ -45336 -111151 -172235 -151169 -303065 -332891 -235409 -83094 130855 329588 199191 -13422
16898a3422q7460N2610O1272R4149K4015o9578p6859N3362r2613j6055P0542j41085
$$ -13422 -100882 -48272 13000 107149 131164 61586 -15273 38089 -54524 -70579 -37 -141122
16886a41122j22427J67673l2635L8877l255l1464K894j16121J49373J64906M5969
$$ -141122 -263549 -95876 -128511 -89634 -92889 -124353 -121459 -237580 -88207 76699 122668
16875A22668q403o6408p7093O574q0765L4402P084j52326K2871J84047q5030l5007
$$ 122668 114265 47857 -29236 -22662 -103427 -69025 -61941 -214267 -191396 -7349 -92379 -127386
16863a27386q5657L6039N5547M9727l9870n3506P5455L16347J86861J64707j42602
$$ -127386 -213043 -177004 -121457 -71730 -111600 -165106 -89651 226696 413557 578264 435662
16852D35662k51116j10100p7236n4777Q279M0367M6218m6895J226O2016M1472
$$ 435662 184546 74446 -2790 -57567 -49288 -8921 37297 -9598 -8372 53644 95116
16841I5116j8123k653M0577K09807Q4125j68687l06430N2134M8228k6077l08263
$$ 95116 76993 74340 114917 324724 408849 240162 -66268 -14134 34094 8017 -300246
16830c00246j49005J37380J45649J95277m9872j72567O6246J39372n4990m7472
$$ -300246 -449251 -311871 -166222 29055 -20817 -193384 -127138 12234 -42756 -90228
16820i0228J7058J73659J67019N2069j76413o0526n1023n2632N314J41121j6998
$$ -90228 -73170 100489 267508 319577 143164 82638 31615 -21017 -15703 125418 108420
16809A08420N852O8270p1924k969p8181j23904j26148k6912O1945K16286J33704
$$ 108420 114272 182542 110618 107649 29468 -94436 -220584 -247496 -185551 30735 164439
16798A64439o0572j08295k73652M662Q9006P8077J0583l5222o4953j41171J22715
$$ 164439 103867 -4428 -278080 -273418 -184412 -106335 -95752 -130974 -195927 -337098 -214383
16787b14383R9540J28332J89641J43302J25406j9551j71051q8270N3108K4247
$$ -214383 -114843 13489 203130 346432 471838 452287 281236 192966 246074 270321
16777B70321l9998k4212q6915k03730j81179j83554K4453J54191K70697q4768
$$ 270321 230323 206111 119196 -84534 -265713 -449267 -424814 -270623 74 -84694
16767h4694r3566O1118p30k0088R6612Q085J69473Q5495r6039l3291j14283j40404
$$ -84694 -178260 -117142 -117872 -137960 -41348 -33263 136210 221705 125666 92375 -21908 -162312
16755a62312j07725K4376J91279N4425o6283j556k9576K5456Q7909J2599j10647
$$ -162312 -270037 -245661 -54382 43 -66240 -67796 -97372 -71916 15993 28592 -82055
16744h2055r8405k7318P0587j15104j18740j21535N8710N3355L8457R8454J1307
$$ -82055 -180460 -207778 -137191 -252295 -371035 -492570 -433860 -380505 -342048 -243594 -232287
16733b32287P7074J81456L6053j11049j27353M8536K5322L1592J89155J12368
$$ -232287 -155213 26243 62296 -48753 -176106 -127570 -102248 -70656 118499 230867
16723B30867o6373k61257q6863J13055n0618j45174K58162Q8853M2166j39020
$$ 230867 164494 -96763 -183626 -70571 -121189 -266363 -8201 80652 122818 -16202
16713a6202m2693P582j5111j27153N0309J09746J32296j4214q7844J548O1748
$$ -16202 -58895 -51313 -66424 -193577 -143268 -33522 98774 84560 -3284 -1736 60012
16702F0012q1653L1166K19417j01680j29331o1939P6821j34769j51057J26439
$$ 60012 -21641 9525 228942 127262 -2069 -64008 12813 -121956 -273013 -146574
16692a46574O8430k2845k4426N6004J2000J087O9929p4015L8654L5321q199j34999
$$ -146574 -78144 -100989 -125415 -69411 -57411 -56324 13605 -60410 -21756 13565 5366 -129633
16680a29633R1495J87651p1322J8130l4864j65578o2087J14496J09558P8459J0625
$$ -129633 -38138 149513 78191 96321 61457 -104121 -166208 -51712 57846 136305 146930
16669A46930r937o6844j29476O1276J40985r4306j53190M1114Q4400R0884J25496
$$ 146930 136993 70149 -59327 1949 142934 48628 -104562 -63448 20952 111836 237332
16658B37332p025j81439j12449N859m4882n4756J2850J21056J8016j6964j17010
$$ 237332 230307 48868 -63581 -57722 -102604 -157360 -144510 -23454 -5438 -22402 -139412
16647a39412K9903k9552L9959L3311n976m7573k2855l146K2285J39709J36383
$$ -139412 -109509 -139061 -99102 -65791 -71767 -119340 -142195 -145341 -123056 16653 153036
16636A53036r9516j65615j87163O7981R7065O991j12191J60612L94128R6839o2296
$$ 153036 53520 -112095 -299258 -231277 -134212 -127221 -239412 -78800 315328 412167 349871
16625C49871q2071m7822j33658m1344N210n933l0352N6281P2749j21270p0690
$$ 349871 267800 219978 86320 44976 50186 44253 13901 70182 142931 21661 -49029
16614d9029j10537j46346j95912J57659K22943K06361P8596k32432k09754k2856
$$ -49029 -159566 -305912 -501824 -344165 -121222 85139 163735 -68697 -278451 -301307
16604c01307K22103l6482r328K5763K0688J30580J34592M3253K9582l9605k56910
$$ -301307 -79204 -115686 -125014 -99251 -78563 52017 186609 229862 259444 219839 -37071
16593c7071k9953N6312j012j48720L3837O7103J73075l91p8276n6456M5546p8373
$$ -37071 -67024 -10712 -11724 -160444 -126607 -59504 113571 113180 34904 -21552 23994 -54379
16581e4379n3431M540m4750o4922k5572J20952L5341j03076l2810L3647o206K2777
$$ -54379 -107810 -103270 -148020 -212942 -238514 -117562 -82221 -185297 -218107 -184460 -190666 -167889
16569a67889K278K5931M8920L6948N610P3676q0553L2612L3616k4717k0123k35584
$$ -167889 -165611 -139680 -90760 -53812 -48202 25474 -55079 -22467 11149 -13568 -33691 -269275
16557b69275m4999L6305P7389J76083K19525l7380j62600l4167J12139J1974N1572
$$ -269275 -314274 -277969 -200580 -24497 195028 157648 -4952 -39119 73020 84994 136566
16546A36566Q4597k24310p4490J26030R9899K16218N6397l21753p6683J22655
$$ 136566 221163 -3147 -77637 48393 148292 364510 420907 99154 22471 145126
16536A45126L816r7713J36623p76j58265j19198K16553J17708o4945j24147j21312
$$ 145126 148942 51229 187852 187076 28811 -90387 126166 243874 178929 54782 -66530
16525f6530K4469P8734J94349J08905r7786j67762o8650j7275K16215J25509Q1810
$$ -66530 -42061 36673 231022 339927 242141 74379 5729 -11546 204669 330178 411988
16514D11988j60199j80263K9814P1180J2578k2273j8604J10985n9254j20388q8925
$$ 411988 251789 71526 101340 172520 185098 162825 144221 255206 195952 75564 -13361
16503a3361K8620J1401j5203j61020N8372J66095K18671M5196m3236l2157j82193
$$ -13361 15259 26660 11457 -149563 -91191 74904 293575 338771 295535 263378 81185
16492H1185k91504P7955J50557Q926j02092K11O6426N298j03397O4647K7678o4540
$$ 81185 -210319 -132364 18193 27119 -74973 -74762 -8336 -3038 -106435 -41788 -14110 -78650
16480g8650n30p2752P4311K07757j6451L4482R0529J25982j66644k19034j34053
$$ -78650 -79180 -151932 -77621 130136 113685 148167 238696 364678 198034 -21000 -155053
16469a55053O1718o7883o9315J4604j00209P500K08122j7744n9246J73374R4400
$$ -155053 -93335 -161218 -230533 -215929 -316138 -308638 -100516 -118260 -177506 -4132 90268
16458I0268p5003o0157k8889j06326j44989j9892J9009J09296P3416j6474J65287
$$ 90268 15265 -44892 -73781 -180107 -325096 -344988 -325979 -216683 -143267 -159741 5546
16447E546O9402Q940j1500o6336k8966J24113J85614J8707q1287q8109j27928
$$ 5546 74948 83888 72388 6052 -22914 101199 286813 305520 224233 136124 8196
16436H196J9007O1852J3487q464P094N5298p2509j46033N6381J17753J15532r9804
$$ 8196 27203 89055 102542 94078 101172 156470 83961 -62072 -5691 112062 227594 127790
16424A27790o5985n8009j40660J46670Q1806R6742m585j00960J4028j61925j24344
$$ 127790 61805 3796 -136864 9806 91612 188354 183769 82809 96837 -65088 -189432
16413a89432J34515O1704k7477l9827P4008l4460q328o6490L0751J45172K4255
$$ -189432 -54917 6787 -20690 -60517 13491 -20969 -29297 -95787 -65036 80136 104391
16402A04391k7502k6249l0372n4760k21857J1107p9445J11225R4242R1523m9339
$$ 104391 76889 50640 20268 -34492 -256349 -245242 -324687 -213462 -119220 -27697 -77036
16391g7036J51363q2835L4837l5766k1133P190J29558m6571k03958m1776J42776
$$ -77036 74327 -8508 26329 -9437 -30570 -23380 106178 59607 -144351 -186127 -43351
16380d3351j5353m349M3464P4941O7248J45957J34894l5476p3593j11414j63407
$$ -43351 -58704 -63053 -19589 55352 122600 268557 403451 367975 294382 182968 19561
16369A9561r9452Q084K2156K8541K7253J71573P2428j7393j36131J6203j5312
$$ 19561 -79891 -71807 -49651 -21110 6143 177716 250144 232751 96620 112823 97511
16358I7511j985j34016M1709N8342L0433J9719K6609r0438j19204O132J38682
$$ 97511 95526 -38490 3219 61561 91994 111713 138322 47884 -71320 -65188 73494
16347G3494p3257n8089p4659j02597K76752Q0638j4213j7802j22580k9773O2606
$$ 73494 237 -57852 -132511 -235108 41644 122282 108069 90267 -32313 -62086 520
16336E20J56111k7647j34531j10373j44776J11883M28322J31806j05640j17935
$$ 520 156631 128984 -5547 -115920 -260696 -148813 279509 411315 305675 187740
16326A87740j57089k9606p8579J45888j7655j37571l9316J60945J71110j61210
$$ 187740 30651 1045 -77534 68354 50699 -86872 -126188 34757 205867 44657
16316D4657m7736m2182J42742J27778j22834l1650O3351k341j78149j12640j23404
$$ 44657 -3079 -45261 97481 225259 102425 70775 134126 131785 -46364 -159004 -282408
16305b82408J4222P6155R6733J0650q9750K4178J04280J19704l0758j04813L4107
$$ -282408 -268186 -192031 -95298 -84648 -174398 -150220 -45940 73764 43006 -61807 -27700
16294b7700J26058o6509N4115k4971n7996L0637M8877k3506j1346P6412q9269
$$ -27700 98358 31849 85964 60993 2997 33634 82511 59005 47659 124071 34802
16283C4802j99776j95528Q6530P1142J69468J25484q1272R2504q7180q7597J1243
$$ 34802 -164974 -360502 -273972 -202830 -33362 92122 10850 103354 16174 -71423 -60180
16272f0180J3782r4004O3823J70733L0450k19601k01497J20578J57217R7340l0223
$$ -60180 -46398 -140402 -76579 94154 124604 -94997 -296494 -175916 -18699 78641 48418
16261D8418l5830J18j25990J46948P7414p0853n9600J61538J30183j43904M0996
$$ 48418 12588 12706 -113284 33664 111078 40225 -19375 142163 272346 128442 169438
16250A69438J07800j85802j77782J6242n5857l3852M8616J54939M7950j17904
$$ 169438 277238 91436 -86346 -70104 -125961 -159813 -111197 43742 91692 -26212
16240b6212m0154j7049j8208K6460J53313J58717p0846j24265J40297m8553P2280
$$ -26212 -66366 -83415 -101623 -75163 78150 236867 166021 41756 182053 133500 205780
16229B05780L6442j21502j88309j7492j5654L2488J2495j41178O6770J47767J14536
$$ 205780 242222 120720 -67589 -85081 -100735 -68247 -55752 -196930 -130160 17607 132143
16218A32143O3541j40946q8659n7219l9634O7614Q9352n2146j56101j7109L68070
$$ 132143 195684 54738 -33921 -91140 -130774 -63160 26192 -25954 -182055 -199164 168906
16207A68906N0717j09194l4226j07707O0408r303j6918O0979N5714p7114k00102
$$ 168906 219623 110429 76203 -31504 28904 19601 2683 63662 119376 42262 -157840
16196a57840j43273J5763J52762L0375q519N5221j30362Q158J70531O0103J856
$$ -157840 -301113 -285350 -132588 -102213 -110732 -55511 -185873 -177715 -7184 52919 54775
16185E4775K5043m7648j52027J6537l2858P985M0583p9928Q3631J07330L4516
$$ 54775 79818 32170 -119857 -103320 -136178 -128193 -87610 -167538 -83907 23423 57939
16174E7939l6085L3022k7820o9473J2363r039r6804M2574J41740l9475j20792
$$ 57939 21854 54876 27056 -42417 -30054 -39093 -135897 -93323 48417 8942 -111850
16163a11850Q7911J14066j67552O8179L2459J1520J694R2073J70098Q0770j88151
$$ -111850 -23939 90127 -77425 -9246 23213 34733 36427 128500 298598 379368 191217
16152A91217j44704M7249j12985m455J50203k7749j30439r2835R753Q7721R5k27
$$ 191217 46513 93762 -19223 -23678 126525 98776 -31663 -124498 -114745 -27024 -26929 -27156
16140b7156N0348o0227l3635O6327q0679O5292P7727m4824k9717p1143N3990P0361
$$ -27156 23192 -37035 -70670 -4343 -85022 -19730 57997 13173 -16544 -87687 -33697 36664
16128C6664K7781J51924L3327j31382j35740K524N3533p9784J08274P4747n1829
$$ 36664 64445 216369 249696 118314 -17426 -14902 38631 -41153 67121 141868 90039
16117I0039n5428O4759m3169p0939O7115j04844J06577J11387j49671o4597M7341
$$ 90039 34611 99370 56201 -14738 52377 -52467 54110 165497 15826 -48771 -1430
16106a430J27787J31249q7336n5780o2162j88277Q6934L6848J29870J16259Q3338
$$ -1430 126357 257606 170270 114490 52328 -135949 -49015 -12167 117703 233962 317300
16095C17300j02375k65044j27156Q1157O2571J29199p7780j56514k3871J4422
$$ 317300 214925 -50119 -177275 -96118 -33547 95652 17872 -138642 -162513 -148091
16085a48091j61536L1488Q8713j0912n097J49390L7086l478p816O1163j11232
$$ -148091 -309627 -278139 -189426 -200338 -205435 -56045 -18959 -22437 -30253 30910 -80322
16074h0322l6061K1683N5399j929m7229N0677O2082n2121K2158j8246O4316M7667
$$ -80322 -116383 -94700 -39301 -41230 -88459 -37782 24300 -27821 -5663 -23909 40407 88074
16062H8074J20714q972m241J7531J13145j3925j04864j58249k91342m7082J73430
$$ 88074 208788 199816 195575 213106 326251 312326 207462 49213 -242129 -289211 -115781
16051a15781J25414n8043p4465O6167m0974l8973l354R4444J56239L641N6942
$$ -115781 9633 -48410 -122875 -56708 -97682 -136655 -140009 -45565 110674 114315 171257
16040A71257N870j86294q0596o1367j32743J22373K59465p1204j02625N7398j68242
$$ 171257 177127 -9167 -89763 -151130 -283873 -161500 97965 26761 -75864 -18466 -186708
16029a86708r2908p273M2628J3045k9054J65724N4904r9713N0861K1200j07656
$$ -186708 -279616 -286889 -244261 -231216 -260270 -94546 -39642 -139355 -88494 -67294 -174950
16018a74950l0138P960k12126P6809R0850J49209N4570P813O4269m873J90455
$$ -174950 -205088 -197128 -409254 -332445 -241595 -92386 -37816 -30003 34266 29393 219848
16007B19848P1716j87706n5221R9077J09365p4618m0866Q4705J10022j27213j69084
$$ 219848 291564 103858 48637 147714 257079 182461 141595 226300 336322 209109 40025
15996D0025j16217k02962Q0543J37028l7507J8209P7491J47385n1292O5455Q5457
$$ 40025 -76192 -279154 -198611 -61583 -99090 -80881 -3390 143995 92703 158158 243615
15985B43615q4373k05202q0751k4627M8028j10195O375L1182k0622J42150J05786
$$ 243615 159242 -45960 -126711 -151338 -103310 -213505 -207130 -175948 -196570 -54420 51366
15974E1366K18927M5656k4377r3339l6342J6978k12830l6227K6784r0781K010
$$ 51366 270293 315949 291572 198233 161891 178869 -33961 -70188 -43404 -134185 -132175
15963a32175J87265J64674J54286L4223k3781r5069j71149j14448M793l150j9414
$$ -132175 55090 219764 374050 408273 384492 289423 118274 3826 8619 5469 -13945
15952a3945j23630R7865Q1023p0920n8744Q8278L5700k2998m9262N7156k2236
$$ -13945 -137575 -39710 41313 -29607 -88351 -73 35627 12629 -36633 20523 -1713
15941a713p7249j60421Q690J31805P4408j01095p7150r272K55968J50814L1353
$$ -1713 -78962 -239383 -230693 -98888 -24480 -125575 -202725 -211997 43971 194785 226138
15930B26138j1420M1546J7173k14763q5183J24798J20419j32923j89901P5797
$$ 226138 214718 256264 273437 58674 -26509 98289 218708 85785 -104116 -28319
15920b8319J4818r1795p0856N878N3006m4047j70981j47188K0135J83566O1887
$$ -28319 -13501 -105296 -176152 -170274 -117268 -161315 -332296 -479484 -459349 -275783 -213896
15909b13896J58040n5878J07228K03428M5686j28244j33352j51866J8952R2067
$$ -213896 -55856 -111734 -4506 198922 244608 116364 -16988 -168854 -149902 -57835
15899e7835k3920M580j99980k0884J49514n932J09215N8637l8238R9921j2186
$$ -57835 -81755 -77175 -277155 -298039 -148525 -154457 -45242 13395 -24843 75078 62892
15888F2892j11603P5983M2262l9452J099j5403p2010L7055R9566j5946j62309
$$ 62892 -48711 27272 69534 30082 31181 15778 -56232 -19177 80389 64443 -97866
15877i7866n2144p0731O4523J40026L7191k657P4374K9318m0337K431j08690j62377
$$ -97866 -150010 -220741 -156218 -16192 20999 18342 92716 122034 81697 84128 -24562 -186939
15865a86939Q6298K26503J7047o6144j92957o1042J16630Q3734L0869J10323l2735
$$ -186939 -100641 125862 142909 76765 -116192 -177234 -60604 23130 53999 164322 131587
15854A31587k9347J5028j17325J45693m7888m4404J71N4959O6060k0541k1454
$$ 131587 102240 117268 -57 145636 97748 53344 53515 108474 174534 153993 132539
15843A32539j22890j82831n4561R6453J04130K07044k8509p0306Q5614l9992q5021
$$ 132539 9649 -173182 -227743 -131290 -27160 179884 151375 81069 166683 126691 41670
15832D1670j87028q0414J1542M939l8560j46610J13776N7953n00q4454j27543
$$ 41670 -145358 -225772 -214230 -209291 -247851 -394461 -280685 -222732 -223232 -307686 -435229
15821d35229K16391J67321p2619p0643J28742k1301N7589n6742J1870m8572q6612
$$ -435229 -218838 -51517 -124136 -194779 -66037 -87338 -29749 -86491 -74621 -123193 -209805
15810b09805L8200J90736J4795j50808n8059L1579n5224Q9305J20095O6759n3858
$$ -209805 -171605 19131 33926 -116882 -174941 -143362 -198586 -109281 10814 77573 23715
15799B3715j5271n9594j22530M7147P2601k8897M6032K8088o9896N5988M6830
$$ 23715 8444 -51150 -173680 -126533 -53932 -82829 -36797 -8709 -78605 -22617 24213
15788B4213O0879k6831p2847p765Q8464j20046J8179L6919N8364k30527J1310
$$ 24213 85092 58261 -14586 -22351 66113 -53933 -35754 1165 59529 -170998 -159688
15777a59688o1757k4176m5368j9891Q4479J18243o2844o7845k0768O9651R3677
$$ -159688 -221445 -245621 -290989 -310880 -226401 -108158 -171002 -238847 -259615 -189964 -96287
15766i6287P6796k3714L5272m1531L6636l8502J56627R1716p9671j55782p1093
$$ -96287 -19491 -43205 -7933 -49464 -12828 -51330 105297 197013 117342 -38440 -109533
15755a09533o2250J43505R6700p9463q242J78329R4209j05199k36951M1341Q2688
$$ -109533 -171783 -28278 68422 -11041 -19283 159046 253255 148056 -88895 -47554 35134
15744C5134n1418j2370N8728q0990K9018l7916j04078N4510J10977J26001o6615
$$ 35134 -16284 -28654 30074 -50916 -21898 -59814 -163892 -109382 1595 127596 60981
15733F0981k06620j02110J44746j8233O716J54136J33542N7766k46699k47870
$$ 60981 -145639 -247749 -103003 -121236 -114520 39616 173158 230924 -15775 -263645
15723b63645j36820M4198K35503J53052J37679K9141n3793K5860l6359n2675M842
$$ -263645 -400465 -356267 -120764 32288 169967 199108 145315 171175 134816 82141 86983
15712H6983r3803n8089J61274M1189k2780j87099q8095k2054Q4254p0995M4648
$$ 86983 -6820 -64909 96365 137554 114774 -72325 -160420 -182474 -98220 -169215 -124567
15701a24567J49572L1093J01733M2725j32376r6912j7194J0175O418K3396n1227
$$ -124567 25005 56098 157831 200556 68180 -28732 -45926 -35751 -29333 -5937 -57164
15690e7164p92m781L510J26459q4240O2971J14686M590R567k5663l5183l9729
$$ -57164 -57956 -62737 -59227 67232 -17008 45963 160649 165239 174806 149143 113960 74231
15678G4231J7731m4403p9344J29020N0440J19701q6948J7510p0929l9207p1545
$$ 74231 91962 47559 -31785 97235 147675 267376 180428 197938 127009 87802 16257
15667A6257k20892j02893J63474L5303K2847O0634r2755q1142o7885Q7674p2618
$$ 16257 -204635 -307528 -144054 -108751 -85904 -25270 -118025 -199167 -267052 -179378 -251996
15656b51996o9367J13214j0133o8042J65836J46373l1913j90907o5565L670N8589
$$ -251996 -321363 -208149 -218282 -286324 -120488 25885 -6028 -196935 -262500 -258830 -200241
15645b00241K35007j55173m0705j04512L6292J88269l8539m7853J0785p9920j9616
$$ -200241 34766 -120407 -161112 -265624 -229332 -41063 -79602 -127455 -116670 -196590 -216206
15634b16206K62885R6625j77717q1844n0235K13983o0712j05603O6521J28098
$$ -216206 46679 143304 -34413 -116257 -166492 47491 -13221 -118824 -52303 75795
15624G5795J9737L9454L295j4191p7570r2335K8020K01337L1479o8135j37512
$$ 75795 95532 134986 138281 124090 46520 -45815 -17795 183542 215021 146886 9374
15613I374p1003R5270J32288q5219j2751J5920l3152r0487j20326j540l7086j35085
$$ 9374 -61629 33641 165929 80710 67959 83879 50727 -39760 -160086 -161626 -198712 -333797
15601c33797J39456J55716K6741p5027J0168j16513q3840Q871j830J3424n3771
$$ -333797 -194341 -38625 -11884 -86911 -76743 -193256 -277096 -268225 -270055 -256631 -310402
15590c10402j6745R4434R8548J9979n3354j82253l8296M358L8159J05192N2487
$$ -310402 -327147 -232713 -134165 -114186 -167540 -349793 -388089 -383731 -345572 -240380 -187893
15579a87893j8517j93435r767J32552K20836J35301j07780j87891l9337n6878
$$ -187893 -206410 -399845 -409612 -277060 -56224 79077 -28703 -216594 -255931 -312809
15569c12809N4364J41410L15172R2018k9936l0717j51265r4618J768K3034J40398
$$ -312809 -258445 -117035 198137 290155 260219 229502 78237 -16381 -14613 8421 148819
15558A48819M8012q9423j73138Q8089K7173r2125J13516J84792K6521r9148N200
$$ 148819 196831 107408 -65730 22359 49532 -42593 70923 255715 282236 183088 188288
15547A88288J12327j75334l0011Q6379j54135m9942k8995J47839J63453o4766
$$ 188288 300615 125281 95270 181649 27514 -22428 -51423 96416 259869 195103
15537A95103j51155l2929n7029n7228L6893Q4981J27696J30142r1993j45935j20722
$$ 195103 43948 11019 -46010 -103238 -66345 18636 146332 276474 184481 38546 -82176
15526h2176p198m2110O4287J0042j96649K1572O8562O8831m2606J70521K32715
$$ -82176 -89374 -131484 -67197 -57155 -253804 -232232 -163670 -94839 -137445 33076 265791
15515B65791j65873q8913m3565N3275m0317J26097n2097j49364p8483L2219J49076
$$ 265791 99918 11005 -32560 20715 -19602 106495 54398 -94966 -173449 -141230 7846
15504G846L3622j29441j08987J01513M5736P3529j10025M299L0457P4200J18548
$$ 7846 41468 -87973 -196960 -95447 -49711 23818 -86207 -81908 -51451 22749 141297
15493A41297J1492j86098j7573J0654K01861J61449J6940q3845j73921j50862
$$ 141297 152789 -33309 -50882 -40228 161633 323082 340022 256177 82256 -68606
15483f8606q3496Q105Q8230J5270o3413J42821N2082J09829k4421J40068k17283
$$ -68606 -152102 -143997 -55767 -40497 -103910 38911 90993 200822 176401 316469 99186
15472I9186j41509Q8947M5280j3321k60856j08920M1751J24066j27094J66335
$$ 99186 -42323 46624 91904 78583 -182273 -291193 -249442 -125376 -252470 -86135
15462h6135o087j87200o673J79061J52455k3152l9400q1779q2046J2310L3506
$$ -86135 -92222 -279422 -286095 -107034 45421 22269 -17131 -98910 -180956 -168646 -135140
15451a35140j17910J14176K09288J56946J32744q2265k02677p2843J26649n2376
$$ -135140 -253050 -138874 70414 227360 360104 277839 75162 2319 128968 76592
15441G6592M4582J01889r6591k6212j6281M5054N4050q212n7516j33791q8643
$$ 76592 121174 223063 126472 100260 83979 129033 183083 174871 117355 -16436 -105079
15430a05079j2188J29776K00400k9082q5295j65290O9436R8440l0715L1956n8297
$$ -105079 -117267 12509 212909 183827 98532 -66758 2678 101118 70403 102359 44062
15419D4062j46405j52577j00454J27018J51948J11532J80104Q3714O5508j50456
$$ 44062 -102343 -254920 -355374 -228356 -76408 35124 215228 298942 364450 213994
15409B13994J13448l0375j0337p1800k723J14479p5956N0960j10910j26162m9957
$$ 213994 327442 297067 286730 214930 212207 326686 250730 301690 190780 64618 14661
15398A4661K9272l0771N1053J4549q4226j14017L157J31783J60465J508j77136
$$ 14661 43933 13162 64215 78764 -5462 -119479 -116322 15461 175926 177434 298
15387B98j02302k2977k3346o5795o1752M4456L7570L9692P9892L2450k0024j31098
$$ 298 -102004 -124981 -148327 -214122 -275874 -231418 -193848 -154156 -74264 -41814 -61838 -192936
15375a92936m4681J01719J19149J11939l2571o0206j89601j52372J72127J18283
$$ -192936 -237617 -135898 -16749 95190 62619 2413 -187188 -339560 -167433 -49150
15365d9150J6383J18199m9079Q5823J31056m9588j2984K6473k04085k8443R0697
$$ -49150 -32767 85432 36353 122176 253232 203644 190660 217133 13048 -15395 75302
15354G5302q3779k02182r1457J33874J47136k7447j27004q0349Q3370Q8131R3396
$$ 75302 -8477 -210659 -302116 -168242 -21106 -48553 -175557 -255906 -172536 -84405 8991
15343H991J01050m1820K9965j18730r0453j48793o8860J61237J46543J01236q4089
$$ 8991 110041 68221 98186 -20544 -110997 -259790 -328650 -167413 -20870 80366 -3723
15332c723J0903P5100p2714m7360K4338P859m3180j0976L0821K12812N7510r6387
$$ -3723 7180 82280 9566 -37794 -13456 -5597 -48777 -59753 -28932 183880 241390 145003
15320A45003j94394O5292N4038p2354m7083R0754R8084o2391k171M9754J9209
$$ 145003 -49391 15901 69939 -2415 -49498 41256 139340 76949 74778 124532 143741
15309A43741j99058l5657J69243j8253o0878j7615N9216j2317q1547J4266J22234
$$ 143741 -55317 -90974 78269 60016 -862 -18477 40739 28422 -53125 -38859 83375
15298H3375j4349m5371L2680J06920j29438p3670R1979o730k1584N2177J36797
$$ 83375 69026 23655 56335 163255 33817 -39853 52126 45396 23812 75989 212786
15287B12786J08655j18749j06401K8082j06582j2787L3434k5555m9260o8402j79686
$$ 212786 321441 202692 96291 124373 17791 5004 38438 12883 -36377 -104779 -284465
15276b84465J02279N316Q7810J23186r784j14146O6691P8307J11290M8233j21120
$$ -284465 -182186 -176870 -89060 34126 24342 -89804 -23113 55194 166484 214717 93597
15265I3597j3439P8812n0122j53455P9861j37300l1129Q3153J38421J41800N810
$$ 93597 80158 158970 108848 -44607 35254 -102046 -133175 -50022 88399 230199 236009
15254B36009J59471J35832k08494j47635J6834j983j03839O8296K7865j35284
$$ 236009 395480 531312 322818 175183 192017 190034 86195 154491 182356 47072
15244D7072j27482K413J4175M5219j85301J2432J23938Q251j31867R49m3942N3103
$$ 47072 -80410 -77997 -63822 -18603 -203904 -191472 -67534 -59283 -191150 -190201 -234143 -181040
15232a81040p9738J21785Q3948o366j5306l1831J01534m3657j52402j382P1834
$$ -181040 -260778 -138993 -55045 -61411 -76717 -108548 -7014 -50671 -203073 -204455 -132621
15221a32621P025M1268M4285Q8576r630k5141k9967l8103p252r1204Q0955L0336
$$ -132621 -125596 -84328 -40043 48533 38903 13762 -16205 -54308 -61560 -152764 -71809 -41473
15209d1473J1241J40112j971j72032m3489p6685q7873J61237K69155O6399P5481
$$ -41473 -30232 109880 107909 -64123 -107612 -184297 -272170 -110933 158222 224621 300102
15198C00102n1665j18672r0165l9041M9046j38699l5689M5453o1407J37435N9356
$$ 300102 248437 129765 39600 559 49605 -89094 -124783 -79330 -140737 -3302 56054
15187E6054k36534q9152K7761L4411m2913L5771Q8617r2756l0630P1728K23048
$$ 56054 -180480 -269632 -241871 -207460 -250373 -214602 -125985 -218741 -249371 -177643 45405
15176D5405J11766Q1581k8530k5714k8699j02455j95980k8994n7343L8080l5999
$$ 45405 157171 238752 210222 184508 155809 53354 -142626 -171620 -228963 -190883 -226882
15165b26882J57223Q0430j29185p682J06747J8714P8035p5995J00260J27943j67315
$$ -226882 -69659 10771 -118414 -126096 -19349 -635 77400 1405 101665 229608 62293
15154F2293j69576P7381J88691l1624q4199j91040l706K5541l4668O7945O5700
$$ 62293 -107283 -29902 158789 127165 42966 -148074 -151780 -126239 -160907 -92962 -27262
15143b7262k7769n5511j08738J06558j37709J13130M4364J16605j9890j79347
$$ -27262 -55031 -110542 -219280 -112722 -250431 -137301 -92937 23668 3778 -175569
15133a75569J8625L464M8941J40066J01059N7096j5157J5128r3694N9664P8804
$$ -175569 -156944 -153480 -104539 35527 136586 193682 178525 193653 99959 159623 238427
15122B38427m535J0881j1343m6321J2327j32491j86050P230M9053L9732j37323
$$ 238427 233892 244773 233430 187109 199436 66945 -119105 -111875 -62822 -23090 -160413
15111a60413O4843K6081P4187k600M0736Q6941n719j53345o8164K36296J24004
$$ -160413 -95570 -69489 4698 2098 42834 129775 124056 -29289 -97453 138843 262847
15100B62847l9627m9730o8086k12558j76113K1786J34139R4975n7101K9946J06078
$$ 262847 223220 173490 105404 -107154 -283267 -261481 -127342 -32367 -89468 -59522 46556
15089D6556o1726j95907l2956N0722J94630J68832R8380j97447l2592R2899o4568
$$ 46556 -15170 -211077 -244033 -193311 1319 170151 268531 71084 38492 131391 66823
15078F6823j20033k3560Q7219J10903n0642J1361n5571j09549Q6505k4015j0227
$$ 66823 -53210 -76770 10449 121352 70710 82071 26500 -83049 3456 -20559 -30786
15067c0786K2835P5615O7994j7563N9526m4556j40161j30464N2692K18046K9585
$$ -30786 -7951 67664 135658 118095 177621 133065 -7096 -137560 -84868 133178 162763
15056A62763j86557j98485M9693J56638J61707J3305m4713j57956j15602R7228
$$ 162763 -23794 -222279 -172586 -15948 145759 159064 114351 -43605 -159207 -61979
15046f1979K6916m2845J17280O7402j33402N6775Q0871j04477R6820j08703j85312
$$ -61979 -35063 -77908 39372 106774 -26628 30147 111018 6541 103361 -5342 -190654
15035a90654L2342P0784K26595p4440k7065j0559O2726J97959N4055j63095q3113
$$ -190654 -158312 -87528 139067 64627 37562 27003 89729 287688 341743 178648 95535
15024I5535O6414J25221N3525j34436o5774n2870k06314m0754J47942r0512K5309
$$ 95535 161949 287170 340695 206259 140485 87615 -118699 -159453 -11511 -102023 -76714
15013g6714J4195R088P5404P501o404K07446J73083l7979j67018j02279j52406
$$ -76714 -62519 -53431 21973 29474 23070 230516 403599 365620 198602 96323 -56083
15002e6083R7172n4001j93701R1515J28064p7205j11130L8522l7149R618J27253
$$ -56083 41089 -12912 -206613 -115098 12966 -64239 -175369 -136847 -173996 -164378 -37125
14991c7125R7739m6574K5722K29835N028p5678p6615j9175q5567O8566j31694
$$ -37125 60614 14040 39762 269597 274625 198947 122332 103157 17590 86156 -45538
14980d5538j03040J29232M625k9943J67111m1230j51897r7965J55304p5227j23320
$$ -45538 -148578 -19346 -14721 -44664 122447 81217 -70680 -168645 -13341 -88568 -211888
14969b11888n9637K7991Q7268N1375J3508O7166J04106J1217o3428j6483l7561
$$ -211888 -271525 -243534 -156266 -104891 -91383 -24217 79889 91106 27678 11195 -26366
14958b6366j32301L8545n1269j17565n3712r05J14347J89492P7617j60357m9590
$$ -26366 -158667 -120122 -171391 -288956 -342668 -343573 -229226 -39734 37883 -122474 -172064
14947a72064N8988j32392l580q593N3585J05099J32979J16259j62717j43795j18138
$$ -172064 -113076 -245468 -249048 -257641 -204056 -98957 34022 150281 -12436 -156231 -274369
14936b74369k73n1108Q275Q8866M8827J16632l4593o892J21415L1559p8503O5133
$$ -274369 -274642 -325750 -317475 -228609 -179782 -63150 -97743 -104635 16780 48339 -30164 34969
14924C4969O0912Q7714Q7729j7449r4301r0689p0680Q690J7445O9633R382j19602
$$ 34969 95881 183595 271324 253875 159574 68885 -1795 6895 24340 93973 103355 -16247
14912a6247J08236K63454K0757j57040n2561m3164q9013O046R6046m097q0270
$$ -16247 91989 355443 376200 219160 166599 123435 34422 40468 136514 132417 52147
14901E2147L1178k5633j721j10795P6473j92576J1808J72721P0976r1148R3097
$$ 52147 83325 57692 55971 -54824 21649 -170927 -159119 13602 84578 -6570 86527
14890H6527N1649q8016O8619r563k02524m192J3065o5164O0337k9984l7022j60885
$$ 86527 138176 50160 118779 109216 -93308 -97500 -84435 -149599 -89262 -119246 -156268 -317153
14878c17153J21216J33259R2725j1048k8965q6785J2810J66687K09556N283o6689
$$ -317153 -195937 -62678 30047 18999 -9966 -96751 -83941 82746 292302 297585 230896
14867B30896j35024P8186k9885k7020j10967j15631Q665O1336R6582J66478J0235
$$ 230896 95872 174058 144173 117153 6186 -109445 -100780 -39444 57138 223616 233851
14856B33851o2214j06359j27003L867j8367j48533J1461M5904R1961N7602K7399
$$ 233851 171637 65278 -61725 -57858 -76225 -224758 -213297 -167393 -75432 -17830 9569
14845I569K6922j4575j24657j05158J01488J44282M1361j0585m4782J20772J14960
$$ 9569 36491 21916 -102741 -207899 -106411 37871 79232 68647 23865 144637 259597
14834B59597q2487j15918j72615L4596k1285j9247R7760J2808j89422P9112j88733
$$ 259597 177110 61192 -111423 -76827 -98112 -117359 -19599 -6791 -196213 -117101 -305834
14823c05834J1505J75093J04809J88393p6834Q0300k6882m6296l9725O609P4391
$$ -305834 -294329 -119236 -14427 173966 97132 177432 150550 104254 64529 71138 145529
14812A45529r4372o3678O3280l0379j14597k5705m5254j3694K64769O9158N5412
$$ 145529 51157 -12521 50759 20380 -94217 -119922 -165176 -178870 85899 155057 210469
14801B10469n4719j02062j62907R6870K5687O211L349J2135n8980J4917N9618
$$ 210469 155750 53688 -109219 -12349 13338 19549 22898 35033 -23947 -9030 50588
14790E0588m930k3666j9682n4022Q0799p7105J61562M9781N1515j16232k42801
$$ 50588 45658 21992 2310 -51712 29087 -48018 113544 163325 214840 98608 -144193
14779a44193O8351J05730l4697j12709O0343Q5790j6622p1499n19l1477L2936
$$ -144193 -75842 29888 -4809 -117518 -57175 28615 11993 -59506 -60025 -91502 -58566
14768e8566n5525M9376R9135K1698R418J5880k7538j08086j09397K1217K72982
$$ -58566 -114091 -64715 34420 56118 65536 81416 53878 -54208 -163605 -142388 130594
14757A30594J45031k35077j51031q0075K5465J19464q3542n4754O1533N7298N4828
$$ 130594 275625 40548 -110483 -190558 -165093 -45629 -129171 -183925 -122392 -65094 -10266
14746a0266J55299K5875j04033j62034K7611Q1507q543n8512L5474K01664N2766
$$ -10266 145033 170908 66875 -95159 -67548 13959 5416 -53096 -17622 184042 236808
14735B36808O299M236k43811j69054p0811J56587O3684P4990J58220J27857j30994
$$ 236808 243107 247343 3532 -165522 -236333 -79746 -16062 58928 217148 345005 214011
14724B14011n0341K6118k9602m4200r0936o3748Q8552j27016j98683N7106O2454
$$ 214011 163670 189788 160186 115986 25050 -38698 49854 -77162 -275845 -218739 -156285
14713a56285m8600m5185J05234P9333m9624k6581r1378Q7827J96643P7072m9102
$$ -156285 -204885 -250070 -144836 -65503 -115127 -141708 -233086 -145259 51384 128456 79354
14702G9354j99498j18229Q0516P0036Q0995J71132J28151k619J81942P031k70587
$$ 79354 -120144 -238373 -157857 -87821 -6826 164306 292457 289838 471780 478811 208224
14691B08224l8140j6118O2456j12288j55827R7695J55226K2077M4134P6916r6483
$$ 208224 170084 153966 216422 104134 -51693 46002 201228 223305 267439 344355 247872
14680B47872J3077o7423n6290K4316K9917P8565J14654j64948r2317L6898J41091
$$ 247872 260949 193526 137236 161552 191469 270034 384688 219740 127423 164321 305412
14669C05412m5483j31367j36720K1350J01925k3378M3083N832o0394j40854R5449
$$ 305412 259929 128562 -8158 13192 115117 91739 134822 140654 80260 -60594 34855
14658C4855R0422R8014J3304O608j32251n5123P2925P7238k6071k9799l3269m5157
$$ 34855 125277 223291 236595 243203 110952 55829 128754 205992 179921 150122 116853 71696
14646G1696l2918j17129O6179J98627l2562p3937p0391N9338J4612R5497q5948
$$ 71696 38778 -78351 -12172 186455 153893 79956 9565 68903 83515 179012 93064
14635I3064q3612K3320Q567J10940n8711P2336J46389j04086J16961J86668j66347
$$ 93064 9452 32772 41339 152279 93568 165904 312293 208207 325168 511836 345489
14624C45489p0091L0825j86029j55837o3371J7739L7688r4244M6143O8855l5845
$$ 345489 275398 306223 120194 -35643 -99014 -81275 -43587 -137831 -91688 -22833 -58678
14613e8678R5901J96153Q6540j17217r1975l9577j02037j10440L0324p8239J33598
$$ -58678 37223 233376 319916 202699 110724 71147 -30890 -141330 -111006 -189245 -55647
14602e5647q056K0204J46648p7887m8966J71787j21397k44336j857J05216K56140
$$ -55647 -63703 -43499 103149 25262 -23704 148083 26686 -217650 -219507 -114291 141849
14591A41849m7475M7124j4301j2573j9868q8822o4437k5198L1865J02898n8334
$$ 141849 94374 141498 127197 114624 94756 5934 -58503 -83701 -51836 51062 -7272
14580g272j89574r1284J10624K12379J51721j9989P744j42361P0513j7202j80146
$$ -7272 -196846 -288130 -177506 34873 186594 166605 174349 31988 102501 85299 -94847
14569i4847l5644J71126M4593j16364J7616l8970l500P0605q6710r7352j899j44707
$$ -94847 -130491 40635 85228 -31136 -13520 -52490 -55990 14615 -72095 -169447 -171346 -316053
14557c16053n4509M9030J02880M8161J09356K9719j58130o6028L32735J66020
$$ -316053 -370562 -321532 -218652 -170491 -61135 -31416 -189546 -255574 77161 243181
14547B43181N490J28797j768q9479j87751n70j81266o75K40110P3522j72559O5928
$$ 243181 248671 377468 375700 286221 98470 97900 -83366 -84041 156069 229591 57032 122960
14535A22960N5936p1558k856p0885K5199P3022l9585r8682q4884j621j84812l4264
$$ 122960 178896 107338 104482 33597 58796 131818 92233 -6449 -91333 -92954 -277766 -312030
14523c12030L459M6496K0308J6646k1414Q4157J55477N6000j4942n5903J21397
$$ -312030 -308571 -262075 -241767 -225121 -246535 -162378 -6901 49099 34157 -21746 99651
14512I9651Q3539n7042o6654p6678q0362k2244N4912J32588K7845r6048m4730
$$ 99651 183190 126148 59494 -17184 -97546 -119790 -64878 67710 95555 -493 -45223
14501d5223M2970R8649J469j11791J8522Q2715j05769K0642j51808M3418Q8664
$$ -45223 -2253 96396 97865 -13926 4596 87311 -18458 2184 -149624 -106206 -17542
14490a7542K794N8077J823J55734j5431K5662L4508k31709j66535l906j068J49962
$$ -17542 -14748 43329 45152 200886 185455 211117 245625 13916 -152619 -156525 -157593 -7631
14478g631N0708N9735j9289j17360J9647o360j5695k62769j47911N8616R6975
$$ -7631 43077 102812 83523 -33837 -14190 -20550 -36245 -299014 -446925 -388309 -291334
14467b91334k9330l7557N1465J86660J58131l5931m0554Q0585K002k5591J37441
$$ -291334 -320664 -358221 -306756 -120096 38035 2104 -38450 42135 44137 18546 155987
14456A55987m2186J1776m3214j39320j59182R1805J42143k7985P5067Q9808Q9654
$$ 155987 113801 125577 82363 -56957 -216139 -124334 17809 -10176 64891 154699 244353
14445B44353K7005j22189l3949n4229j59833q9105K472J30954N1222m2350n0761
$$ 244353 271358 149169 115220 60991 -98842 -187947 -185475 -54521 -3299 -45649 -96410
14434i6410p5059q3658K75799J44507l8554k4546o0765r369L9778J26506q0684
$$ -96410 -171469 -255127 20672 165179 126625 102079 41314 31945 71723 198229 117545
14423A17545m9877J00313n1836j23586o3312o9772Q2411M2865J31972N871K9440
$$ 117545 67668 167981 116145 -7441 -70753 -140525 -58114 -15249 116723 122594 152034
14412A52034j58259n3664R2366p0058J35416K23779K2776J7295Q722j50208k42417
$$ 152034 -6225 -59889 32477 -37581 97835 321614 344390 361685 370407 220199 -22218
14401b2218j73648k2205J16074J04006r7813n3129k9527j02915M1789K15957p1408
$$ -22218 -195866 -218071 -101997 2009 -95804 -148933 -178460 -281375 -239586 -23629 -95037
14390i5037k16257J40460Q3268L5502L609J2571J99736J31990j82525j16802J07806
$$ -95037 -311294 -170834 -87566 -52064 -48455 -35884 163852 295842 113317 -3485 104321
14379A04321J60013Q2033l3002n3381k38950L9533O04p8769q44J01584m0851j25566
$$ 104321 264334 346367 313365 259984 21034 60567 61171 -17598 -18442 83142 42291 -83275
14367h3275K852O0256O6433j12829Q0694J36266l7406N0627j46163k28453K9183
$$ -83275 -80423 -20167 46266 -66563 14131 150397 112991 163618 17455 -210998 -181815
14356a81815L42930k7455o96l1731j04975j44056R2956j12509q5954R617J17190
$$ -181815 161115 133660 132964 101233 -3742 -147798 -54842 -167351 -253305 -243688 -126498
14345a26498J86670p1138p4408l0099M491K3193Q7230l111K909p1710j25056n9840
$$ -126498 60172 -10966 -85374 -115473 -110982 -87789 -559 -3670 -761 -72471 -197527 -257367
14333b57367j22907O6520J90854o242k7486J40938P2733N9881J36799k4589j09734
$$ -257367 -380274 -313754 -122900 -129142 -156628 -15690 57043 116924 253723 229134 119400
14322A19400r3431M3166J31080j0386j39124k7264K4155j3680m5311j10017J5364
$$ 119400 25969 69135 200215 189829 50705 23441 47596 33916 -11395 -121412 -106048
14311a06048R0902k5741J09772k11771r9030K46262J27733l3307j23271L2138
$$ -106048 -15146 -40887 68885 -142886 -241916 4346 132079 98772 -24499 7639
14301G639O9150N6308M5210m4325J7322r2645M6878K4701M8793p7989r8331n4593
$$ 7639 76789 133097 178307 133982 151304 58659 105537 130238 179031 101042 2711 -51882
14289e1882m0835P4887p9921J044N0957l2287j71274J37732O9570O162K6505p3186
$$ -51882 -92717 -17830 -97751 -96707 -45750 -78037 -249311 -111579 -42009 -35847 -9342 -82528
14277h2528q5390K33241P2857j30069j50885M0627K42798M9193l2479k7022l3954
$$ -82528 -167918 65323 138180 8111 -142774 -102147 140651 189844 157365 130343 96389
14266I6389q0337Q3064m7458L2842O8764J0965j3322n3772l0044m3070O0594R1634
$$ 96389 16052 99116 51658 84500 153264 164229 150907 97135 67091 24021 84615 176249
14254A76249j04651j95191k0759l8125p5424K7285K9005L041k169o843l930J01033
$$ 176249 71598 -123593 -144352 -182477 -257901 -230616 -201611 -198570 -200739 -207582 -211512 -110479
14242a10479j42427o4569k4085P2530O6400r9432j7745J64922J80951N1944O1352
$$ -110479 -252906 -317475 -341560 -269030 -202630 -302062 -319807 -154885 26066 78010 139362
14231A39362l9992R8391j62950r9099l1065O1928J4803m2470O2565j3406j32970
$$ 139362 99370 197761 34811 -64288 -95353 -33425 -18622 -61092 1473 -11933 -144903
14220a44903J6360R469P0928O7310R6806p7956j31715R9462J255q7521k1449L3063
$$ -144903 -128543 -119074 -48146 19164 115970 38014 -93701 5761 7016 -80505 -101954 -68891
14208f8891q376p0517R7216J25129L2533J04758J28921j08270p0233J21813l8647
$$ -68891 -77267 -147784 -50568 74561 107094 211852 340773 232503 162270 284083 245436
14197B45436j21113o5459j03082o1570j0610o7334m2438O6915j8304R6602J53959
$$ 245436 124323 58864 -44218 -105788 -116398 -183732 -226170 -159255 -177559 -80957 73002
14186G3002j00354p2844l5284O3221j0334n0041L0212R1490j2303p4538r5198
$$ 73002 -27352 -100196 -135480 -72259 -82593 -132634 -102422 -10932 -23235 -97773 -192971
14175a92971J8157l8746O2871O1868J39966J9847j6720j35672j44014R285J61512
$$ -192971 -174814 -213560 -150689 -88821 51145 70992 54272 -81400 -225414 -216129 -54617
14164e4617Q3639j06482J2579k6141j4289J47980M3786r6352n9598J56853j21662
$$ -54617 29022 -77460 -64881 -91022 -105311 42669 86455 -9897 -69495 87358 -34304
14153c4304o2172K33587K36961j35601k83241j35096P9807J07128Q0546J4699
$$ -34304 -96476 137111 374072 238471 -44770 -179866 -100059 7069 87615 102314
14143A02314J1879k19731j13340j6881J13454j30119K8887Q0472q1009J69727
$$ 102314 114193 -105538 -218878 -235759 -122305 -252424 -223537 -143065 -224074 -54347
14133e4347L004k5454k59001p2194J21807J13660J27166j9493M4799R6360q5007
$$ -54347 -51343 -76797 -335798 -407992 -286185 -172525 -45359 -64852 -20053 76307 -8700
14122h700o9577O5179J37603n7494j07935J9618J04765J07818M0223L953j27242
$$ -8700 -78277 -13098 124505 67011 -40924 -21306 83459 191277 231500 235453 108211
14111A08211r7640J1094J32588j8426l3774o1950l7773Q6056j59849J73239n0425
$$ 108211 10571 21665 154253 135827 102053 40103 2330 88386 -71463 101776 51351
14100E1351m778N8519n8865j02935n4142N75K5546K4223L9893J55331n1822o6692
$$ 51351 46573 105092 46227 -56708 -110850 -110275 -84729 -60506 -20613 134718 82896 16204
14088A6204L3524j00678k81812J07901N8315N6987Q7461M0486J89876n5007J08158
$$ 16204 49728 -50950 -332762 -224861 -166546 -109559 -22098 18388 208264 153257 261415
14077B61415n7714q6247P2754j16494k21980j79416O6029J23573L8093k2358k3372
$$ 261415 203701 117454 190208 73714 -148266 -327682 -261653 -138080 -99987 -122345 -145717
14066a45717K22020J24851K5407P931j6365k34525l9146K11935p0147M5108K3208
$$ -145717 76303 201154 226561 234492 218127 -16398 -55544 156391 86244 131352 154560
14055A54560j37065l40245o2959q334J94593L0790o7876j25591j34634K7201J07095
$$ 154560 17495 -322750 -385709 -394043 -199450 -168660 -236536 -362127 -496761 -469560 -362465
14044c62465K78911J12928J0139M1611m4447p6559j84431Q227K10914O2252k11425
$$ -362465 -83554 29374 39513 81124 36677 -39882 -224313 -216086 -5172 57080 -154345
14033a54345q5429q843K02281l4790R6699K275m3137K24343J07511l2863r9025
$$ -154345 -239774 -248617 -46336 -81126 15573 17848 -25289 199054 306565 273702 174677
14022A74677j21653r9631Q7069L6486j92193k57243j3699J10665P1684O9214J50294
$$ 174677 53024 -46607 40462 76948 -115245 -372488 -386187 -275522 -203838 -134624 15670
14011A5670J99870P4895k20451p6102J52357K7325j64175J1914J0117o9778j18264
$$ 15670 215540 290435 69984 -6118 146239 173564 9389 21303 31420 -38358 -156622
14000a56622j3330J42383p9267M8544j16024l839J57936L7838k22015K4122j0878
$$ -156622 -169952 -27569 -106836 -58292 -174316 -178155 -20219 17619 -204396 -180274 -191152
13989a91152j866N3979N8381O8719K472K7047j59877r2581J90608L7220M6150
$$ -191152 -193018 -139039 -80658 -11939 -9467 17580 -142297 -234878 -44270 -7050 39100
13978C9100k4403Q9052j7715N2359k3745q7828k01519p3764K7605J06081J3078
$$ 39100 14697 103749 86034 138393 114648 26820 -174699 -248463 -220858 -114777 -101699
13967a01699J01379r5416l1399q0070L432J15955j6143o2994L6693N4744J26927
$$ -101699 -320 -95736 -127135 -207205 -203773 -87818 -103961 -166955 -130262 -75518 51409
13956E1409R4431K8727j5398j71218o3324j73633j06054O5220R7339J26826o4893
$$ 51409 145840 174567 159169 -12049 -75373 -249006 -355060 -289840 -192501 -65675 -130568
13945a30568j0972K5079m9929j14407J16650R4567O86K29117O3800p8781j40290
$$ -130568 -141540 -116461 -166390 -280797 -164147 -69580 -68894 160223 224023 145242 4952
13934D952j85746l129J64715Q1823M1646N2974j18642m9739n1915K701K1757n6669
$$ 4952 -180794 -183923 -19208 62615 104261 157235 38593 -11146 -63061 -60360 -38603 -95272
13922i5272j79431R287P4352K44664J20301r3882m0138M9093R4589q5926M8000
$$ -95272 -274703 -265416 -191064 53600 173901 80019 39881 88974 183563 97637 145637
13911A45637Q473j04666j54544m0793Q8051r095M5513k2936M0027P5851M6609
$$ 145637 154110 49444 -105100 -145893 -57842 -66937 -21424 -44360 -4333 71518 118127
13900A18127P0993J07312N2144J9886o2088O3955k14609j70536o2200O6498J42064
$$ 118127 189120 296432 348576 368462 306374 370329 155720 -14816 -77016 -10518 131546
13889A31546K3253j66964j78034l3446q8073j8463L5161J84582J57487j26766
$$ 131546 154799 -12165 -190199 -223645 -311718 -330181 -295020 -110438 47049 -79717
13879g9717l1838P3047P5197M149r725K8182Q2978k1679J6796j62863n4642K2881
$$ -79717 -111555 -38508 36689 40838 31113 59295 142273 120594 137390 -25473 -80115 -57234
13867e7234J18743m0256m4730R2536q2292j45407j36142k593J45091J4433l7572
$$ -57234 61509 21253 -23477 69059 -13233 -158640 -294782 -297375 -152284 -137851 -175423
13856a75423J21320J538P4688J38978Q3107j01264j97990J22153K83870n3080
$$ -175423 -54103 -52565 22123 161101 244208 142944 -55046 67107 350977 297897
13846B97897J39908j97964k69868m4969M5477q1456m5394M2003j01533j19057
$$ 297897 437805 239841 -30027 -74996 -29519 -110975 -156369 -114366 -215899 -334956
13836c34956K13186L7286r1711n10n0205J02361Q9688m4529J25013J0042q0987
$$ -334956 -121770 -84484 -176195 -176705 -226910 -124549 -34861 -79390 45623 55665 -25322
13825b5322k7330J45041p3991l8985j13330O8084O1278N8942j2091N909r5886
$$ -25322 -52652 92389 18398 -20587 -133917 -65833 -4555 54387 42296 48205 -47681
13814d7681o750j16143n438K08257O1908p5119j45984j7985j5978p0809m295O5672
$$ -47681 -54431 -170574 -176012 32245 94153 19034 -126950 -144935 -160913 -231722 -236017 -170345
13802a70345p445m2463J55965R0265l8239j56543n2733K29049Q540k31411O1087
$$ -170345 -177790 -220253 -64288 25977 -12262 -168805 -221538 7511 16051 -215360 -154273
13791a54273K35493J32277n6798k50768j50631J19595K34070J71590j15584k26490
$$ -154273 81220 213497 156699 -94069 -244700 -125105 108965 280555 164971 -61519
13781f1519J49745J06255j60110l6880P223O0477M1105p5425m2785l1102J52854
$$ -61519 88226 194481 34371 -2509 4714 65191 106296 30871 -11914 -43016 109838
13770A09838L6141K8111Q453k4935l3117o8037n2196j57065m2469N0914N2699
$$ 109838 145979 174090 182543 157608 124491 56454 4258 -152807 -195276 -144362 -91663
13759i1663m2808K3945K677O26L5283P9793P1895k10756p4096p7364K0164j204
$$ -91663 -134471 -110526 -107849 -107223 -71940 7853 79748 -131008 -205104 -282468 -262304 -263508
13747b63508O0865J21115J01427j8044k0727k1861K5931j02365n3520j02294p5798
$$ -263508 -202643 -81528 19899 1855 -18872 -40733 -14802 -117167 -170687 -272981 -348779
13736c48779j46P3349O3440J04452N3426P6994J88302N1561r0317o7376k8991
$$ -348779 -348925 -275576 -212136 -107684 -54258 22736 211038 262599 172282 104906 75915
13725G5915N7654j8832j14950o3600M1161k2258O9473Q9512j8402p4861j3221
$$ 75915 133569 114737 -213 -63813 -22652 -44910 24563 114075 95673 20812 7591
13714G591J9034R2482N392j01778K6433K7301o5230J23567O9480j68412l6927
$$ 7591 26625 119107 124499 22721 49154 76455 11225 134792 204272 35860 -1067
13703a067K02149p4723j74419Q5541J0224J5793J06872M4848o9734M3832p1642
$$ -1067 201082 126359 -48060 37481 47705 63498 170370 215218 145484 189316 117674
13692A17674r1219M3741Q0905r4097o7787J56720J01966k848k94246j48430r2699
$$ 117674 26455 70196 151101 57004 -10783 145937 247903 245055 -49191 -197621 -290320
13681b90320O187p6777Q4474Q1319Q1401K32851K58615q2910k16602j4653J49602
$$ -290320 -284133 -360910 -276436 -195117 -113716 119135 377750 294840 78238 63585 213187
13670B13187J42194m0088j65507o9005o8145j14598J3087k3342o485R5899K9777
$$ 213187 355381 315293 149786 80781 12636 -101962 -88875 -112217 -118702 -22803 6974
13659F974J9338J48724J15291n8050l9655o7364n9348j85926r1236K147K50227
$$ 6974 26312 175036 290327 232277 192622 125258 65910 -120016 -211252 -209105 41122
13648D1122J09834k42671p588l6385o1013J94736J4057j13176j40421M6109J2849
$$ 41122 150956 -91715 -99303 -135688 -196701 -1965 12092 -101084 -241505 -195396 -182547
13637a82547n4581J17766R2430j7579n7613J25181K964r3171j33944J31514J05890
$$ -182547 -237128 -119362 -26932 -44511 -102124 23057 26021 -67150 -201094 -69580 36310
13626C6310l2766P800J3880j2030j54689K3013O507r043j09290p7211l3232K01607
$$ 36310 3544 11344 25224 13194 -141495 -118482 -111975 -121018 -230308 -307519 -340751 -139144
13614a39144J19202q4671O8540J53501J8004j27636K552k1782M65j05849J0099
$$ -139144 -19942 -104613 -36073 117428 135432 7796 10348 -11434 -10969 -116818 -106719
13603a06719J66416o4204j07002K1633L8703J7256M4827R6184O1556j19945j22475
$$ -106719 59697 -4507 -111509 -89876 -51173 -33917 10910 107094 168650 48705 -73770
13592g3770o7544o7817K00347O1722n2823M691K3510J06985J82342N2180j19966
$$ -73770 -141314 -209131 -8784 52938 115 4806 28316 135301 317643 369823 249857
13581B49857p6899j57224l1684M9846k7624J03261J8976q8567j02192K5013m4101
$$ 249857 172958 15734 -15950 33896 6272 109533 128509 39942 -62250 -37237 -81338
13570h1338j7611Q4537k88906Q8150K8012R4324J19049J6243J12564n6954L1428
$$ -81338 -98949 -14412 -303318 -215168 -187156 -92832 26217 42460 155024 98070 129498
13559A29498o9965j71101j5993J47996m2025Q3461j31689m0617N677k45394K1004
$$ 129498 59533 -111568 -127561 20435 -21590 61871 -69818 -110435 -104758 -350152 -329148
13548c29148M3561J76479k1290j4934n1165k6961J70806K5531O782l112n2908
$$ -329148 -285587 -109108 -130398 -145332 -196497 -223458 -52652 -27121 -20339 -23451 -76359
13537g6359J41253N1876j13450k5047N2110J56296o8410k1512m2301k06520M4971
$$ -76359 64894 116770 3320 -21727 30383 186679 118269 96757 54456 -152064 -107093
13526a07093P3429K39975j8740j98896j02603o7249J9514Q1785J12038P1511o5006
$$ -107093 -33664 206311 187571 -11325 -113928 -181177 -161663 -79878 32160 103671 38665
13515C8665j58643m9535J87751J2254o9360r7260O8622P3536J71831K7390q1861
$$ 38665 -119978 -169513 18238 30492 -38868 -136128 -67506 6030 177861 205251 123390
13504A23390j18208j18492r7173j4776J16032J4074L0285q6625l5458P2355R4408
$$ 123390 5182 -113310 -210483 -225259 -109227 -95153 -64868 -151493 -186951 -114596 -20188
13493b0188j1933n9227m7930L7251P193o7897N5613L6875J44329K5171r8566l3406
$$ -20188 -32121 -91348 -139278 -102027 -94834 -162731 -107118 -70243 74086 99257 691 -32715
13481c2715J20621K0016j30711j14915L2954Q5771j7903R6270J44510K6915m0291
$$ -32715 87906 107922 -22789 -137704 -104750 -18979 -36882 59388 203898 230813 190522
13470A90522j1068N5931j57297o684P2369j56038l707J534P0896R6371Q3640j10173
$$ 190522 179454 235385 78088 71404 143773 -12265 -15972 -14438 56458 152829 236469 126296
13458A26296o0280q8483j80213L9025J93888J32298N9741o7363j08818M0225R0154
$$ 126296 66016 -22467 -202680 -163655 30233 162531 222272 154909 46091 86316 176470
13447A76470j79589j7347L17855O6770j90595l9077K0605M4739k30969k28324
$$ 176470 -3119 -20466 297389 364159 173564 134487 155092 199831 -31138 -259462
13437b59462J53702L12122J03921k8889q6096J8008j55006r4909j1723O2178R317
$$ -259462 -105760 206362 310283 281394 195298 213306 58300 -36609 -48332 13846 23163
13426B3163j33832n1184K4178J83498J36450L1004j91752j92132j656l771P2601
$$ 23163 -110669 -161853 -137675 45823 182273 213277 21525 -170607 -172263 -176034 -103433
13415a03433J45478O8818j91164k54383J5854N6528m5410O8911Q9577l1726l5806
$$ -103433 42045 110863 -80301 -334684 -318830 -262302 -307712 -238801 -149224 -180950 -216756
13404b16756R2561N248J6585J7857J54283O9743Q9368N396j13290k3230j26324
$$ -216756 -124195 -118947 -102362 -84505 69778 139521 228889 234285 120995 97765 -28559
13393b8559L6297R1884q8048k5753N3411J77330J49313k75576j74508J1149J24821
$$ -28559 7738 99622 11574 -14179 39232 216562 365875 90299 -84209 -73060 51761
13382E1761j12648r8628k3637M8168l3635l2799m0944M7166J18138N4382M3703
$$ 51761 -60887 -159515 -183152 -134984 -168619 -201418 -242362 -195196 -77058 -22676 21027
13371B1027n8399J8732J03255Q044L5033q1252j20078j25648k6392K12886K81858
$$ 21027 -37372 -18640 84615 92659 127692 46440 -73638 -199286 -225678 -12792 269066
13360B69066k01323q8014l7009j7647K19317J77285r4327j56702N716J33215O8713
$$ 269066 67743 -20271 -57280 -74927 144390 321675 227348 70646 76362 209577 278290
13349B78290p9718J6020l0528O1890J4304J17375j61131o3161N5046j0502q5145
$$ 278290 198572 214592 184064 245954 260258 377633 216502 153341 208387 197885 112740
13338A12740m7920p196r2279J47481L5417K7767j53373k3408J1269r0419J56511
$$ 112740 64820 57624 -34655 112826 148243 176010 22637 -771 10498 -79921 76590
13327G6590J51246L1935j47014k11642j0396K5326J34820L6952q5963R8958q9262
$$ 76590 227836 259771 112757 -98885 -109281 -83955 50865 87817 1854 100812 11550
13316A1550j03134j031L2981j8599M6161L2793L4388p1104m8655J97757j16878
$$ 11550 -91584 -92615 -59634 -78233 -32072 721 35109 -35995 -84650 113107 -3771
13305c771l32964O6022K27143n7740m3873J0988j11301k2901O3293M7682J94159
$$ -3771 -336735 -270713 -43570 -101310 -145183 -134195 -245496 -268397 -205104 -157422 36737
13294C6737N0427j60430n4534J42805M5959j45094J5039J7733O4540J16039j29546
$$ 36737 87164 -73266 -127800 15005 60964 -84130 -69091 -51358 13182 129221 -325
13283c25k33994j6329n623n4150J49378J56418J06130l4169M1930m4808M2290
$$ -325 -234319 -250648 -256271 -310421 -161043 -4625 101505 67336 109266 64458 106748
13272A06748j3019L276j5657J9619p0531o5323K0419O8614N3166l1814j22137
$$ 106748 93729 97005 81348 100967 30436 -34887 -14468 54146 107312 75498 -46639
13261d6639k40812R5331j8060n8658J23848J66567Q3929p6087j39909j36295J21918
$$ -46639 -287451 -192120 -210180 -268838 -144990 21577 105506 29419 -110490 -246785 -124867
13250a24867J74609P3160J16487j78632j80354M7817L1380K1505k0051k01565
$$ -124867 49742 122902 239389 60757 -119597 -71780 -40400 -18895 -38946 -240511
13240b40511O5026J4554O8739J04833J5654j888J57388L1581k7731r1588j0607
$$ -240511 -175485 -160931 -92192 12641 28295 26407 183795 215376 187645 96057 85450
13229H5450m9995O4114j26720j91555r8358O1528N3776R3307R9314q1988j41364
$$ 85450 35455 99569 -27151 -218706 -317064 -255536 -201760 -108453 -9139 -91127 -232491
13218b32491L9483J4223J15978Q5086O056k6228N2002j48731J8771L0867l8486
$$ -232491 -193008 -178785 -62807 22279 28335 2107 54109 -94622 -75851 -44984 -83470
13207h3470j953K3353j29461k9888k4352M5292j08244M8228R8872r8062m3548
$$ -83470 -85423 -62070 -191531 -221419 -245771 -200479 -308723 -260495 -161623 -259685 -303233
13196c03233Q5350J11897L7446o9243J467n7120K0272n9471M4894J07161P8747
$$ -303233 -217883 -105986 -68540 -137783 -136316 -193436 -173164 -232635 -187741 -80580 -1833
13185a833j3474L0156P8229j06944j99191j65540Q9985O8203J08448K3786p7202
$$ -1833 -15307 14849 93078 -13866 -213057 -378597 -288612 -220409 -111961 -88175 -165377
13174a65377J13986P0127j07563P1210k2091l3956K1200N0563O6045J98170j91287
$$ -165377 -51391 18736 -88827 -17617 -39708 -73664 -52464 -1901 64144 262314 71027
13163G1027j38087o3507J2059J00869k8521j4520m2323j16425J8318r9283O4224
$$ 71027 -67060 -130567 -118508 -17639 -46160 -60680 -103003 -219428 -201110 -300393 -236169
13152b36169R5227J55072K4164k4626j60155m3149J3078k2244o1825J50221J11316
$$ -236169 -140942 14130 38294 13668 -146487 -189636 -176558 -198802 -260627 -110406 910
13141I10p9545l8142M5607j38126K9212o8045J18305J32718J17741L0055j468
$$ 910 -78635 -116777 -71170 -209296 -180084 -248129 -129824 2894 120635 150690 149222
13130A49222r1929j04609j04835j1583K6911m1593L0337R7666K9753k3326Q226
$$ 149222 57293 -47316 -152151 -163734 -136823 -178416 -148079 -50413 -20660 -43986 -35760
13119c5760p7253O787K53044K33694j92295j88225m6541l0304L6578k300L3407
$$ -35760 -113013 -106226 146818 380512 188217 -8 -46549 -76853 -40275 -42575 -9168
13108i168o0959J1937J02688j50239j42400J23089N5453q6085M2902P8332K1967
$$ -9168 -70127 -58190 44498 -105741 -248141 -125052 -69599 -155684 -112782 -34450 -12483
13097a2483j4771l9251J29023K2097m8489M8285l9144j17367o046l4784Q6519
$$ -12483 -27254 -66505 62518 84615 36126 84411 45267 -72100 -78146 -112930 -26411
13086b6411M2527j07128m4690J46776J60905N7391j05882q3725K0065J9337J33861
$$ -26411 16116 -91012 -135702 11074 171979 229370 123488 39763 59828 79165 213026
13075B13026N8267K5485J6459n2389k02524Q612J26852L1244k31022j43040J11125
$$ 213026 271293 296778 313237 260848 58324 66936 193788 225032 -5990 -149030 -37905
13064c7905M4185q002r6810o4146M6868J20762K32095j62691j67661j60075K7494
$$ -37905 6280 -1722 -98532 -162678 -115810 4952 237047 74356 -93305 -253380 -225886
13053b25886J57479o8065p8062J44120K68689j1511r9602r0147O4569P1567j08003
$$ -225886 -68407 -136472 -214534 -70414 198275 186764 87162 -2985 61584 133151 25148
13042B5148p3553K7389J39678J03595k5159L6433r0713j06268k2389o402J0289
$$ 25148 -48405 -21016 118662 222257 197098 233531 142818 36550 14161 7759 18048
13031A8048q7233j8103Q3002N4157K6477O8422L5942L2529l0967J02465j5834
$$ 18048 -69185 -87288 -4286 49871 76348 144770 180712 213241 182274 284739 268905
13020B68905k30948j02336l7605J91053l9279r4726P8355O0536j7935q0161j85917
$$ 268905 37957 -64379 -101984 89069 49790 -44936 33419 93955 76020 -4141 -190058
13009a90058J29413K0856q8991m1898J57003J2514Q8159M5994p2726J22511l5888
$$ -190058 -60645 -39789 -128780 -170678 -13675 -1161 86998 132992 60266 182777 146889
12998A46889n6626j7412n7327n9995l4726J9442q2865m7888J83709P4468j12065
$$ 146889 90263 72851 15524 -44471 -79197 -59755 -142620 -190508 -6799 67669 -44396
12987d4396j18425Q172J63655M1633L4927M3835p0007p9353n4879J27534K03255
$$ -44396 -162821 -154649 9006 50639 85566 129401 59394 -19959 -74838 52696 255951
12976B55951j5175j17634q4906L7299O8146j45281k3583L2310j35689m5902O3883
$$ 255951 240776 123142 38236 75535 143681 -1600 -25183 7127 -128562 -174464 -110581
12965a10581J90716Q176k21531r1107J02224J56116O1905j40743K1580L1699j91608
$$ -110581 80135 88311 -133220 -224327 -122103 34013 95918 -44825 -23245 8454 -183154
12954a83154r1524P2159M3221K56688J88673J3629j61295k78167j32331J06049
$$ -183154 -274678 -202519 -159298 97390 286063 299692 138397 -139770 -272101 -166052
12944a66052Q9953K01357R8063N9976p1711p4567J31258k7742m3073j83967m5158
$$ -166052 -76099 125258 223321 283297 211586 137019 268277 240535 197462 13495 -31663
12933c1663r1178j10452K1189Q0686N1745J06742j9220L6213K01539o2666k27893
$$ -31663 -122841 -233293 -212104 -131418 -79673 27069 7849 44062 245601 182935 -44958
12922d4958J50394j77100j04384J79067R453q1128q6502P9758N7603L9479j18411
$$ -44958 105436 -71664 -176048 3019 12472 -68656 -155158 -75400 -17797 21682 -96729
12911i6729j00774k1635Q558K06606J03184k5855o1603J36815J14324L9585j56101
$$ -96729 -197503 -219138 -210580 -3974 99210 73355 11752 148567 262891 302476 146375
12900A46375j23131L9989L9787J09801O3432j57683r4742j09753n0474J16760
$$ 146375 23244 63233 103020 212821 276253 118570 23828 -85925 -136399 -19639
12890a9639o7426j18195m1004j4507P4972J03186M5889N0883o6515m4738J82452
$$ -19639 -87065 -205260 -246264 -260771 -185799 -82613 -36724 14159 -52356 -97094 85358
12879H5358o2703q730L8992K5895o8184N8697j4916l9547k2242j55616q0073n0533
$$ 85358 22655 13925 52917 78812 10628 69325 54409 14862 -7380 -162996 -243069 -293602
12867b93602R5011k9528k19054J97415J38239J39026j1917k2320j7056M5217J10537
$$ -293602 -198591 -228119 -447173 -249758 -111519 27507 15590 -6730 -23786 21431 131968
12856A31968J5298r6408m4866k6175r277q7144O6832m5135K0065N6287p7470j12594
$$ 131968 147266 50858 5992 -20183 -29460 -116604 -49772 -94907 -74842 -18555 -96025 -208619
12844b08619j46261j28324l421K76933J25195J39475l0931P3093o397o2098j32380
$$ -208619 -354880 -483204 -486625 -209692 -84497 54978 24047 97140 90743 28645 -103735
12833a03735j45086J46508K53034J67596P9127k38228q2492R406K01420p2561
$$ -103735 -248821 -102313 150721 318317 397444 159216 76724 86130 287550 214989
12823B14989p9535L2554j0366j32364j01296J06170N7121p7750J18123J04054
$$ 214989 135454 168008 157642 25278 -76018 30152 87273 9523 127646 231700
12813B31700j94790p2144O2467J8777m7314j280j64353j32036J00584R9057j8521
$$ 231700 36910 -35234 27233 46010 -1304 -2584 -166937 -298973 -198389 -99332 -117853
12802a17853j04320M1924K50216j36917j46389Q0201J8302O6399j44806K0227
$$ -117853 -222173 -180249 69967 -66950 -213339 -133138 -114836 -48437 -193243 -173016
12792a73016J6569Q6991P1820j13511K0096O2536j14913j07093k6783O1453J78486
$$ -173016 -156447 -69456 2364 -111147 -91051 -28515 -143428 -250521 -277304 -215851 -37365
12781c7365J41685R177P274q3505j37095p1150r1799R1663P7976K3469l4834m3967
$$ -37365 104320 113497 120771 37266 -99829 -170979 -262778 -171115 -93139 -69670 -104504 -148471
12769a48471Q0880l735j02805J02121J20110J10606j68155j44579k4533P4571
$$ -148471 -67591 -71326 -174131 -72010 48100 158706 -9449 -154028 -178561 -103990
12759a03990J30681J88173n8949r3979j63464P4153R1556j4350n0177L2112p6787
$$ -103990 26691 214864 155915 61936 -101528 -27375 64181 49831 -346 31766 -45021
12748d5021O0681J58929r0945k16170N4424l4406o6743Q8560R6494O1688N2967
$$ -45021 15660 174589 83644 -132526 -78102 -112508 -179251 -90691 5803 67491 120458
12737A20458K9801j14411k7892j75098j3071P9467M5233M7916j03802O397j8773
$$ 120458 150259 35848 7956 -167142 -180213 -100746 -55513 -7597 -111399 -105002 -123775
12726a23775K6298M3982r0067J8146J92527J1909j54318L046K7191k6790k8623
$$ -123775 -97477 -53495 -143562 -125416 67111 79020 -75298 -72252 -45061 -71851 -100474
12715a00474p4295K8404J95795N1046j2975j30742j52125M1090J47077J1206O5507
$$ -100474 -174769 -146365 49430 100476 87501 -43241 -195366 -154276 -7199 4007 69514
12704F9514J65187l9298o7856R7330J8883n9457j46012P685k534n5748j8464J08360
$$ 69514 234701 195403 127547 224877 243760 184303 38291 45976 43442 -12306 -30770 77590
12692G7590j16931q2804N9157J00892M2133M5113J81818J20961p5979j15831M6568
$$ 77590 -39341 -122145 -62988 37904 80037 125150 306968 427929 351950 236119 282687
12681B82687Q0422N9102l9432j91068k18361R380P6139j55984p3477O810R3541
$$ 282687 363109 422211 382779 191711 -26650 -17270 58869 -97115 -170592 -163782 -70241
12670g0241J08664q6558j48021J54055N4852O9559m6881O3522J1918J30953j87625
$$ -70241 38423 -48135 -196156 -42101 12751 82310 35429 98951 110869 241822 54197
12659E4197j05074j30273j64767p2370J27400K03196P5606J05001n1431M2866
$$ 54197 -50877 -181150 -345917 -418287 -290887 -87691 -12085 92916 41485 84351
12649H4351l5069L101J35607j63233q1378k3369J20240J2278J30377J53757q1955
$$ 84351 49282 52383 187990 24757 -56621 -79990 40250 52528 182905 336662 254707
12638B54707j12533j7730r7397m428j28891j59314j9445J98316k1409p9307m3868
$$ 254707 142174 124444 27047 22619 -106272 -265586 -285031 -86715 -108124 -187431 -231299
12627b31299L3742o2643K4312p6956p522K92336J13518j16949j50470L5611K29229
$$ -231299 -197557 -260200 -235888 -312844 -320366 -28030 85488 -31461 -181931 -146320 82909
12616H2909l5280j82053L1307J57295N0172j6373J01548J07514n5771p4850j39896
$$ 82909 47629 -134424 -103117 54178 104350 87977 189525 297039 241268 166418 26522
12605B6522J9181R2267r829m3297J280M6655k2474j32233Q911K34678o931l2344
$$ 26522 45703 137970 128141 84844 86124 132779 110305 -21928 -13017 221661 214730 182386
12593A82386j07100k1753j78814j57173J4180j2212O0255j2040j3999K35965M9856
$$ 182386 75286 53533 -125281 -282454 -268274 -280486 -220231 -232271 -246270 -10305 39551
12582C9551L4389l5734p8086o2377J66051o628j89392O0817N3839q0353L4822
$$ 39551 73940 38206 -39880 -102257 63794 57166 -132226 -71409 -17570 -97923 -63101
12571f3101K12722j9791J3088p843p717O597k1225r0354r6143m2413R6707J02641
$$ -63101 149621 129830 142918 135075 127358 133955 112730 22376 -73767 -116180 -19473 83168
12559H3168p382J01592l607j94782n1052j1714p4123O9722K3115K4264K0320M9756
$$ 83168 75786 177378 173771 -21011 -72063 -83777 -157900 -88178 -65063 -40799 -20479 29277
12547B9277O7419j20438j16629k0192O7614M1961N1718j13827l1539O8536Q4383
$$ 29277 96696 -23742 -140371 -160563 -92949 -50988 730 -113097 -144636 -76100 8283
12536H283Q3025k5233j71764n5481j07557R0075J08626q9442q896J9253l0428
$$ 8283 91308 66075 -105689 -161170 -268727 -178652 -70026 -159468 -168364 -149111 -179539
12525a79539Q9754J21172K3052m4231l9480J02259J0752K1413j74840p861L3913
$$ -179539 -89785 31387 54439 10208 -29272 72987 83739 105152 -69688 -77549 -43636
12514d3636K30642L1763k6174m5587l4891j3785j6938j56533j14832N2552M8920
$$ -43636 187006 218769 192595 147008 112117 98332 81394 -75139 -189971 -137419 -88499
12503h8499n0697Q3780L6750j06749q9287K00021J72331j2343O9120o2506m1274
$$ -88499 -139196 -55416 -18666 -125415 -214702 -14681 157650 145307 214427 151921 110647
12492A10647r7440j9013L1955L6515J17162k651j55110q1301N396K8082k9174
$$ 110647 13207 -5806 26149 62664 179826 177175 22065 -59236 -53840 -25758 -54932
12481e4932O5624j09538J07883K36345p7270j93367p0214J44759n5952o2137j30557
$$ -54932 10692 -98846 9037 245382 168112 -25255 -95469 49290 -6662 -68799 -199356
12470a99356n0645j44749r0117J37367m458J16361r823K4555P949O062K24169
$$ -199356 -250001 -394750 -484867 -347500 -351958 -235597 -245420 -220865 -212916 -206854 17315
12459A7315M7972q6668J50374N5993p3510O8078J71662r8208l331j43766j71452
$$ 17315 65287 -21381 128993 184986 111476 179554 351216 253008 249677 105911 -65541
12448f5541q4092R4657R0326K4603r4650o7429j9404M3420o1105K3455O1819K7062
$$ -65541 -149633 -54976 35350 59953 -34697 -102126 -121530 -78110 -139215 -115760 -53941 -26879
12436b6879M557J343J6521m635J25731r7152j32429l9722K397l4895N8574k5517
$$ -26879 -22322 -20979 -4458 -9093 116638 19486 -112943 -152665 -150268 -185163 -126589 -152106
12424a52106o287p320K5975o9452O962q2895J4085k6629J03455l2623N8711n0170
$$ -152106 -158393 -165713 -139738 -209190 -202228 -285123 -271038 -297667 -194212 -226835 -168124 -218294
12412b18294O3728J64716M8018j94957K2090L4540j05526k684J14479Q4386K3665
$$ -218294 -154566 10150 58168 -136789 -114699 -80159 -185685 -188369 -73890 10496 34161
12401C4161L8336J26065Q1384o3521j28284Q287R471m6925P4989J21005L3274
$$ 34161 72497 198562 279946 216425 88141 96428 105899 58974 133963 254968 288242
12390B88242M0278j40176j9592l9723J50477Q7305j24092p7549P4662k11699k5936
$$ 288242 328520 188344 168752 129029 279506 366811 242719 165170 239832 28133 2197
$$ [...]
##END NTUPLES=NMR SPECTRUM
##END=
