##TITLE=Analysis number 310544
Compound Code cc 30509
Book Reference 393/192
Project Code adrs
Chemist Name roba
##JCAMPDX= 6.0         $$ Bruker NMR JCAMP-DX V2.0
##DATA TYPE= NMR SPECTRUM
##DATA CLASS= NTUPLES
##ORIGIN= Bruker BioSpin GmbH
##OWNER= NMR
$$ XWIN-NMR		Version 3.5
$$ Tue Jun 21 11:19:47 2005 GMT Daylight Time (UT+1h)  MAYBRIDGE\NMR@NMR_250MHZ
##.OBSERVE FREQUENCY= 250.131544655141
##.OBSERVE NUCLEUS= ^1H
##.ACQUISITION MODE= SIMULTANEOUS (DQD)
##.ACQUISITION SCHEME= undefined
##.AVERAGES= 16
##.DIGITISER RES= 18
##SPECTROMETER/DATA SYSTEM= dpx250
##.PULSE SEQUENCE= zg30
##.SOLVENT NAME= CDCl3
##.SHIFT REFERENCE= (INTERNAL, CDCl3, 0, 16.4494)
##AUDIT TRAIL= $$ (NUMBER, WHEN, WHO, WHERE, WHAT)
$$ ##TITLE= Audit trail, XWIN-NMR		Version 3.5
$$ ##JCAMPDX= 5.01
$$ ##ORIGIN= Bruker BioSpin GmbH
$$ ##OWNER= NMR
$$ C:\u/data/dgb/nmr/ADRS/4360/pdata/1/auditp.txt
$$ ##AUDIT TRAIL=  $$ (NUMBER, WHEN, WHO, WHERE, WHAT)
(   1,<2005-06-21 11:19:25.94 +100>,<MAYBRIDGE\NMR>,<NMR_250MHZ>,
      <created by zg, POWCHK disabled, PULCHK disabled
       configuration hash MD5:
       62 19 C7 07 E1 42 D1 B7 37 6C 3D D0 77 39 F9 E6
       data hash MD5: 64K
       33 41 4A F1 72 DD 64 A5 E1 A6 78 09 52 99 98 A8>)
(   2,<2005-06-21 11:19:38.54 +100>,<MAYBRIDGE\NMR>,<NMR_250MHZ>,
      <Start of raw data processing
       ef LB = 0.3 FT_mod = 6 PKNL = 1 SI = 32K 
       data hash MD5: 32K
       2F 63 DE BD CE E6 7A 05 44 EE 1F 27 F6 00 B9 D4>)
(   3,<2005-06-21 11:19:40.41 +100>,<MAYBRIDGE\NMR>,<NMR_250MHZ>,
      <apk 
       data hash MD5: 32K
       78 73 FE 20 5D E2 C4 C0 E9 DD 47 92 B5 78 C4 78>)
(   4,<2005-06-21 11:19:41.14 +100>,<MAYBRIDGE\NMR>,<NMR_250MHZ>,
      <abs ABSG = 5 
       data hash MD5: 32K
       B3 FA 06 4A 3E 42 18 ED 8F DB D9 BC 11 B8 48 DA>)
$$ ##END=
$$ 
$$ hash MD5
$$ 0A 8B 48 C9 34 A8 A2 EA 6E B9 F5 8F 34 33 B1 95
##$RELAX= 
##$RELAX= 
##$RELAX= 
##$RELAX= 
##$RELAX= 
##$RELAX= 
##$RELAX= 
$$ Bruker specific parameters
$$ --------------------------
##$DU= <C:\u>
##$EXPNO= 4360
##$NAME= <ADRS>
##$PROCNO= 1
##$TYPE= <nmr>
##$USER= <dgb>
##$AMP= (0..31)
100 100 100 100 100 100 100 100 100 100 100 100 100 100 100 100 100 100 
100 100 100 100 100 100 100 100 100 100 100 100 100 100 
##$AQSEQ= 0
##$AQ_mod= 3
##$AUNM= <au_zg>
##$AUTOPOS= <14 >
##$BF1= 250.13
##$BF2= 250.13
##$BF3= 250.13
##$BF4= 250.13
##$BF5= 500.13
##$BF6= 500.13
##$BF7= 500.13
##$BF8= 500.13
##$BYTORDA= 1
##$CFDGTYP= 0
##$CFRGTYP= 5
##$CHEMSTR= <none>
##$CNST= (0..31)
1 1 145 1 1 1 1 1 1 1 1 1 1 1 1 1 1 1 1 1 1 1 1 1 1 1 1 1 1 1 1 1 
##$CPDPRG= <>
##$CPDPRG1= <>
##$CPDPRG2= <>
##$CPDPRG3= <>
##$CPDPRG4= <mlev>
##$CPDPRG5= <mlev>
##$CPDPRG6= <mlev>
##$CPDPRG7= <mlev>
##$CPDPRG8= <mlev>
##$CPDPRGB= <>
##$CPDPRGT= <>
##$D= (0..31)
0 1 0 0 0 0 0 0 0 0.06 0 0 0 0 0 0 0.0002 0 0 0 0 0 0 0 0 0 0 0 0 0 0 
0 
##$DATE= 1119349165
##$DBL= (0..7)
120 120 120 120 120 120 120 120 
##$DBP= (0..7)
150 150 150 150 150 150 150 150 
##$DBP07= 0
##$DBPNAM0= <>
##$DBPNAM1= <>
$$ [...]
##$SUBNAM7= <"">
##$SUBNAM8= <"">
##$SUBNAM9= <"">
##$SW= 20.6930455092707
##$SWIBOX= (0..15)
0 0 3 0 0 0 0 0 0 0 0 0 0 0 0 0 
##$SW_h= 5175.983436853
##$TD= 65536
##$TD0= 1
##$TE= 295.16
##$TE2= 300
##$TE3= 300
##$TEG= 300
##$TL= (0..7)
0 120 120 120 120 120 120 120 
##$TP= (0..7)
150 150 150 150 150 150 150 150 
##$TP07= 0
##$TPNAME0= <>
##$TPNAME1= <>
##$TPNAME2= <>
##$TPNAME3= <>
##$TPNAME4= <>
##$TPNAME5= <>
##$TPNAME6= <>
##$TPNAME7= <>
##$TPOAL= (0..7)
0.5 0.5 0.5 0.5 0.5 0.5 0.5 0.5 
##$TPOFFS= (0..7)
0 0 0 0 0 0 0 0 
##$TUNHIN= 0
##$TUNHOUT= 0
##$TUNXOUT= 0
##$USERA1= <user>
##$USERA2= <user>
##$USERA3= <user>
##$USERA4= <user>
##$USERA5= <user>
##$V9= 5
##$VALIST= <valist>
##$VCLIST= <CCCCCCCCCCCCCCC>
##$VD= 0
##$VDLIST= <DDDDDDDDDDDDDDD>
##$VPLIST= <PPPPPPPPPPPPPPP>
##$VTLIST= <TTTTTTTTTTTTTTT>
##$WBST= 1024
##$WBSW= 4
##$XGAIN= (0..3)
0 0 0 0 
##$XL= 0
##$YL= 0
##$YMAX_a= 311341
##$YMIN_a= -260338
##$ZGOPTNS= <>
##$ZL1= 120
##$ZL2= 120
##$ZL3= 120
##$ZL4= 120
##$ABSF1= 16.44935
##$ABSF2= -4.243822
##$ABSG= 5
##$ABSL= 3
##$ALPHA= 0
##$AQORDER= 0
##$ASSFAC= 0
##$ASSFACI= 0
##$ASSFACX= 0
##$ASSWID= 0
##$AUNMP= <proc_1d>
##$AZFE= 0.1
##$AZFW= 0.1
##$BCFW= 0
##$BC_mod= 0
##$BYTORDP= 0
##$COROFFS= 0
##$CY= 12.5
##$DATMOD= 1
##$DC= 0
##$DFILT= <>
##$DTYPP= 0
##$F1P= 14.0000005364418
##$F2P= -0.99999901652339
##$FCOR= 0.5
##$FTSIZE= 32768
##$FT_mod= 6
##$GAMMA= 0
##$GB= 0
##$INTBC= 1
##$INTSCL= 1
##$ISEN= 128
##$LB= 0.3
##$LEV0= 0
##$LPBIN= 0
##$MAXI= 10000
##$MC2= 0
##$MEAN= 0
##$ME_mod= 0
##$MI= 0
##$NCOEF= 0
##$NC_proc= -5
##$NLEV= 6
##$NOISF1= 0
##$NOISF2= 0
##$NSP= 0
##$NTH_PI= 0
##$NZP= 0
##$OFFSET= 16.44935
##$PC= 1
##$PHC0= -75.02676
##$PHC1= 9.652317
##$PH_mod= 1
##$PKNL= yes
##$PPARMOD= 0
##$PSCAL= 4
##$PSIGN= 0
##$REVERSE= no
##$SF= 250.130018171128
##$SI= 32768
##$SIGF1= 0
##$SIGF2= 0
##$SINO= 400
##$SIOLD= 32768
##$SREGLST= <1H.CDCl3>
##$SSB= 0
##$STSI= 32768
##$STSR= 0
##$SW_p= 5175.98343685301
##$SYMM= 0
##$S_DEV= 0
##$TDeff= 65536
##$TDoff= 0
##$TI= <Analysis number 999999
Compound Code 99
Book Reference 9
Project Code 9>
##$TILT= no
##$TM1= 0
##$TM2= 0
##$TOPLEV= 0
##$USERP1= <user>
##$USERP2= <user>
##$USERP3= <user>
##$USERP4= <user>
##$USERP5= <user>
##$WDW= 1
##$XDIM= 32768
##$YMAX_p= 387353918
##$YMIN_p= -821846
$$ End of Bruker specific parameters
$$ ---------------------------------
##NTUPLES= NMR SPECTRUM
##VAR_NAME=  FREQUENCY,     SPECTRUM/REAL,   SPECTRUM/IMAG
##SYMBOL=    X,             R,               I
##VAR_TYPE=  INDEPENDENT,   DEPENDENT,       DEPENDENT
##VAR_FORM=  AFFN,          ASDF,            ASDF
##VAR_DIM=   32768,         32768,           32768
##UNITS=     HZ,            ARBITRARY UNITS, ARBITRARY UNITS
##FACTOR=    0.157963299565203, 1,           1
##FIRST=     4114.47630371358, 0,            0
##LAST=      -1061.50713313943, 0,           0
##MIN=       -1061.50713313943, -821846,     0
##MAX=       4114.47630371358, 387353918,    0
$$ Real data points
##PAGE= N=1
##DATA TABLE= (X++(R..R)), XYDATA
$$ [...]
$$ plain form
22154 241535 141577 150427 261420 167583 67472 142628 53333 -35535 -10438 114442 177146
22143 177146 306640 373114 193120 -86398 -249081 -119645 118400 73120 -186060 -117101
22133 -117101 65969 125550 24396 75272 25574 -19156 -100017 -77887 35640 24157 -146355
22122 -146355 -110330 100652 -103348 -298148 -166191 45837 32152 -38599 45989 187958
22112 187958 204787 134006 -37222 -58775 63056 188159 176142 -26763 10647 -223 -85598
22101 -85598 -42161 -41559 -43054 -8360 5230 -110918 -213705 -77068 69959 100958 -30567
22090 -30567 23612 142700 175234 184435 209036 130252 -463 94491 144008 47194 -153310
22079 -153310 -245180 -100531 -35960 -50978 5747 48525 33513 -12264 63653 66627 108693
$$ packed form
22154B41535r9958Q850J10993r3837j00111P5156q9295q8868K5097J24880O2704
22143A77146J29494O6474j79994k79518j62683J29436K38045m5280k59180O8959
22133a17101J83070N9581j01154N0876m9698m4730q0861K2130J13527j1483j70512
22122a46355L6025K10982k04000j94800J31957K12028j3685p0751Q4588J41969
22112A87958J6829p0781j71228k1553J21831J25103j2017k02905L7410j0870q5375
22101h5598M3437O02j495L4694J3590j16148j02787J36637J47027L0999j31525
22090c0567N4179J19088L2534R201K4601p8784j30715R4954M9517r6814k00504
22079a53310r1870J44649O4571j5018N6725M2778j5012m5777P5917K974M2066
$$ plain form
22068 108693 248365 314247 344127 296239 104663 -148671 -177596 -107591 -161276 -81919 64183
22057 64183 -57931 -23572 -9895 -64148 -68600 -34726 -276889 -388646 -286113 -157758 -6688
22046 -6688 129778 46245 119818 142640 167191 102679 4718 -95473 -216417 -137799 40497
22035 40497 -36876 -32714 -30709 3246 -65305 -126259 -139886 -77364 -76466 -205974 -135726 -172424
22023 -172424 -253700 -121611 -169735 -317951 -284747 -302471 -172619 -84906 -71436 15267 26766
22012 26766 16704 14541 -36705 17844 -33990 -166401 -140900 -188948 -285887 -309743 -293562 -298152
22000 -298152 -279907 -323645 -359099 -239597 -67471 -33972 -82992 10288 -124438 -124197 -125619
21989 -125619 -98530 1169 128648 55249 -27357 97654 -25134 -164476 -211046 -149161 -133854
$$ packed form
22068A08693J39672O5882K9880m7888j91576k53334k8925P0005n3685P9357J46102
22057F4183j22114L4359J3677n4253m452L3874k42163j11757J02533J28355J51070
22046f688J36466q3533P3573K2822K4551o4512r7961j00191j20944P8618J78296
22035D0497p7373M162K005L3955o8551o0954j3627O2522Q98j29508P0248l6698
22023a72424q1276J32089m8124j48216L3204j7724J29852Q7713J3470Q6703J1499
22012B6766j0062k163n1246N4549n1834j32411K5501m8048r6939k3856J6181m590
22000b98152J8245m3738l5454J19502J72126L3499m9020R3280j34726K41j422
21989a25619K7089R9699J27479p3399q2606J25011j22788j39342m6570O1885J5307
$$ plain form
21978 -133854 -17398 41719 53164 -21947 -58865 -21027 -11880 24384 -115074 -243021 -195046
21967 -195046 -193608 -218865 -109663 49345 116381 324694 311322 271803 176515 1072 -11861
21956 -11861 -53841 -8539 63241 86924 94838 -23022 -31101 -13042 -63003 -157477 -69768 -48406
21944 -48406 9650 -76776 16463 85839 70570 78916 45547 18254 93228 68750 44021 225568
21932 225568 246496 102496 -150729 -241856 -144986 -171617 -116542 -133249 -208567 -257181 -240037
21921 -240037 -154726 -7430 -8041 -10357 74503 68236 20982 -91359 -136057 -11117 14361 -76422
21909 -76422 -78819 65643 -3965 -126203 -71328 -137746 -250454 -143272 29259 -7968 -64553
21898 -64553 -73923 -109938 -49922 146712 137726 106132 116423 87911 177536 111703 22639 56803
$$ packed form
21978a33854J16456N9117J1445p5111l6918L7838R147L6264j39458j27947M7975
21967a95046J438k5257J09202J59008O7036K08313j3372l9519r5288j75443j2933
21956a1861m1980M5302P1780K3683P914j17860q079J8059m9961r4474Q7709K1362
21944d8406N8056q6426R3239O9376j5269Q346l3369k7293P4974k4478k4729J81547
21932B25568K0928j44000k53225r1127R6870k6631N5075j6707p5318m8614J7144
21921b40037Q5311J47296o11k316Q4860o267m7254j12341m4698J24940K5478r0783
21909g6422k397J44462o9608j22238N4875o6418j12708J07182J72531l7227n6585
21898f4553r370l6015O0016J96634q986l1594J0291k8512Q9625o5833q9064L4164
$$ plain form
21886 56803 -140455 -342194 -253266 -153841 -139845 -68409 54157 -9196 -154014 -302421 -176888
21875 -176888 -118462 -62984 10745 560 -80156 -117217 -209137 6428 76182 -11876 -87905
21864 -87905 98329 141153 -10816 -1012 31707 93011 40003 -96757 11243 -62717 -99016
21853 -99016 69996 62993 -10592 -66632 -49810 20368 -341 -29848 -73160 -81965 -182595 -183632
21841 -183632 -124587 -87760 57341 66748 140675 89507 49088 4797 -240104 -364527 -340744
21830 -340744 -115786 -56270 -145193 -193668 -20480 20640 -95318 -242280 -131889 -171129
21820 -171129 -125613 -88695 56424 22916 1290 -98252 -125750 -140814 -171754 -51001 30634
21809 30634 20989 123748 40472 -49493 -8168 61111 7487 -16475 88590 135028 131773 -3429
$$ packed form
21886E6803j97258k01739Q8928R9425J3996P1436J22566o3353j44818j48407J25533
21875a76888N8426N5478P3729j0185q0716l7061r1920K15565O9754q8058p6029
21864h7905J86234M2824j51969R804L2719O1304n3008j36760J08000p3960l6299
21853i9016J69012p003p3585n6040J6822P0178k0709k9507m3312q805j00630j037
21841a83632N9045L6827J45101R407P3927n1168m0419m4291k44901j24423K3783
21830c40744K24958N9516q8923m8475J73188M1120j15958j46962J10391l9240
21820a71129M5516L6918J45119l3508k1626r9542k7498j5064l0940J20753Q1635
21809C0634r645J02759q3276q9965M1325O9279n3624k3962J05065M6438l255j35202
$$ plain form
21797 -3429 57807 169622 248022 252492 147240 -34952 122057 119222 135486 139611 8646
21786 8646 112791 59482 4175 39225 68836 -27467 65206 70281 44283 43799 -11770 -151528
21774 -151528 -137625 -143145 -180668 -57626 -14813 50119 -20121 30916 90643 144293 175079
21763 175079 132485 -24110 -8557 7865 -216963 -177004 -206909 -62947 123379 142699 81332
21752 81332 79755 49372 -53206 -205236 -236312 -159403 -117978 -26984 77885 -2473 -191047
21741 -191047 -175400 -35266 -87138 -92510 16866 -65013 -73333 20102 108599 201418 41483
21730 41483 -169411 -175662 -102608 -189786 -190026 5321 16016 -16012 -98436 -181630 -213076 -133635
21718 -133635 -197457 -156021 -65304 -83805 -127935 -240404 -165324 -189199 -109471 -135185 -59295
$$ packed form
21797c429O1236J11815P8400M470j05252j82192J57009k835J6264M125j30965
21786H646J04145n3309n5307L5050K9611r6303R2673N075k5998m84n5569j39758
21774a51528J3903n520l7523J23042M2813O4932p0240N1037N9727N3650L0786
21763A75079m2594j56595J5553J6422k24828L9959k9905J43962J86326J9320o1367
21752H1332j577l0383j02578j52030l1076P6909M1425R0994J04869q0358j88574
21741a91047J5647J40134n1872n372J09376q1879q320R3435Q8497R2819j59935
21730D1483k10894o251P3054q7178k40J95347J0695l2028q2424q3194l1446P9441
21718a33635o3822M1436R0717j8501m4130j12469P5080k3875P9728k5714P5890
$$ plain form
21707 -59295 -26667 5754 103573 40830 -38538 -90528 -26132 112355 51933 72639 162974
21696 162974 157118 164545 179305 104683 184354 158739 -19263 20178 187630 121774 165526
21685 165526 43122 -5408 -3762 83828 69996 223656 48953 -204322 -205379 -284465 -188589
21674 -188589 -16759 11337 199316 182058 -26600 -73077 16427 16868 117417 180498 98928
21663 98928 -60431 -92646 -137957 -71759 -56854 32734 45170 -75211 -164896 -107338 45890
21652 45890 207480 180458 130348 -1776 -139203 -119212 -23027 186452 105966 58219 -91042
21641 -91042 -23892 7502 -54390 -69740 -147215 -17398 81967 73682 -24903 -269338 -185891
21630 -185891 -135418 -4338 -59753 -46920 125492 203013 -12133 -58153 -3125 71843 -5176
$$ packed form
21707e9295L2628L2421R7819o2743p9368n1990O4396J38487o0422K0706R0335
21696A62974n856P427J4760p4622P9671k5615j78002L9441J67452o5856M3752
21685A65526j22404m8530J646Q7590j3832J53660j74703k53275j057p9086R5876
21674a88589J71830K8096J87979j7258k08658m6477Q9504M41J00549O3081q1570
21663I8928j59359l2215m5311O6198J4905Q9588J2436j20381q9685N7558J53228
21652D5890J61590k7022n0110j32124j37427J9991R6185K09479q0486m7747j49261
21641i1042O7150L1394o1892j5350p7475J29817R9365q285r8585k44435Q3447
21630a85891N0473J31080n5415J2833J72412P7521k15146m6020N5028P4968p7019
$$ plain form
21619 -5176 -63033 8554 13358 46942 30840 6934 20561 14720 -124224 -65013 -78721 -47938
21607 -47938 -193911 -250273 -306461 -168477 -89735 -33186 -22554 19115 24952 -38800 -96816
21596 -96816 51263 92337 -15792 -166714 -79736 124338 99799 101099 -7527 18586 -107828
21585 -107828 -201424 -200821 -195575 -82894 -19440 54831 118007 136657 199397 209816 112002 -8883
21573 -8883 -5781 -37924 -4366 156867 27625 50474 56772 299072 277104 114901 167372
21562 167372 163950 171481 146824 -5861 -23802 45704 -20565 47347 71236 23246 80930 149146
21550 149146 202293 259264 214521 160542 153054 233242 185788 107958 115075 165746 142680 254666
21538 254666 284765 170178 36981 88231 99290 192443 220447 32958 20287 119177 257152
$$ packed form
21619e176n7857P1587M804L3584j6102k3906J3627n841j38944N9211j3708L0783
21607d7938j45973n6362n6188J37984P8742N6549J0632M1669N837o3752n8016
21596i6816J48079M1074j08129j50922Q6978K04074k4539J300j08626K6113j26414
21585a07828r3596O03N246J12681O3454P4271O3176J8650O2740J0419r7814j20885
21573h883L102l2143L3558J61233j29242K2849O298K42300k1968j62203N2471
21562A67372l422P531k4657j52685j7941O9506o6269O7912K3889m7990N7684O8216
21550A49146N3147N6971m4743n3979p488Q0188m7454p7830P117N0671k3066J11986
21538B54666L0099j14587j33197N1250J1059R3153K8004j87489j2671R8890J37975
$$ plain form
21527 257152 135991 105586 135901 -135853 -293217 -287205 -236484 -92934 54101 83177 134582
21516 134582 116566 51315 1871 94766 221945 158115 61459 92618 135389 102569 -46225
21505 -46225 -75759 -69493 47871 102591 95962 24774 -92482 -77124 -106079 -116416 -175694 -73115
21493 -73115 -148905 -134341 48522 -23589 -58721 -71939 -109473 -147535 -121785 -265063 -337598
21482 -337598 -192888 40551 -60092 -9281 45578 -182358 -222675 -175943 -129685 -22643
21472 -22643 91451 95271 89371 186362 142270 40741 -78716 -92112 -74615 -27975 10374
21461 10374 64303 279303 254424 225124 267278 148205 104278 129430 90384 227814 331300
21450 331300 372781 427700 305913 228653 199498 295805 94582 -158982 -99711 8654 -142659
$$ packed form
21527B57152j21161l0405L0315k71754j57364O012N0721J43550J47035K9076N1405
21516A34582j8016o5251m9444R2895J27179o3830r6656L1159M2771l2820j48794
21505d6225k9534O266J17364N4720o629p1188j17256J5358k8955j0337n9278J02579
21493g3115p5790J4564J82863p2111l5132j3218l7534l8062K5750j43278p2535
21482c37598J44710K33439j00643N0811N4859k27936m0317M6732M6258J07042
21472b2643J14094L820n900R6991m4092j01529j19457j3396J7497M6640L8349
21461A0374N3929K15000k4879k9300M2154j19073m3927K5152l9046J37430J03486
21450C31300M1481N4919j21787p7260k9155R6307k01223k53564N9271J08365j51313
$$ plain form
21439 -142659 -119542 60976 225083 208521 184065 139077 70944 -68745 -84193 -85860 24527
21428 24527 63840 86275 -10413 -157943 -145568 -175929 -153272 -200305 -203038 -98974 -211192
21417 -211192 -347102 -228904 -233700 -204011 -121742 -79108 -121334 -125966 -61960 7820 97720
21406 97720 160506 162002 129291 136941 164083 -50543 -99107 -38893 -59177 -7436 49140 57377
21394 57377 -69931 -148894 -226739 -331437 -385946 -174302 -142243 -268814 -123262 1049
21384 1049 102380 83643 63388 -135524 -195886 -127182 -139434 -143791 -170520 -104729 131171
21373 131171 273104 24880 -143238 -256888 -149817 -137010 -192267 -119240 -10488 -131328
21363 -131328 -291348 -412879 -369520 -270691 -255166 -325741 -248423 -258396 -299392 -88369 -11325
$$ packed form
21439a42659K3117J80518J64107j6562k4456m4988o8133j39689j5448j667J10387
21428B4527L9313K2435r6688j47530J2375l0361K2657m7033k733J04064j12218
21417b11192j35910J18198m796K9689Q2269M2634m2226m632O4006O9780Q9900
21406I7720O2786J496l2711P650K7142k14626m8564O0214k0284N1741N6576Q237
21394E7377j27308p8963p7845j04698n4509K11644L2059j26571J45552J24311
21384A049J01331j8737k0255j98912o0362O8704j2252m357k6729O5791K35900
21373A31171J41933k48224j68118j13650J07071J2807n5257P3027J08752j20840
21363a31328j60020j21531M3359R8829J5525p0575P7318r973m0996K11023P7044
$$ plain form
21352 -11325 -138198 -230901 -102101 131261 16033 -25431 87593 256922 253066 234193 119259
21341 119259 146608 270521 249387 121761 34207 53400 99856 245586 63168 -83443
21331 -83443 -140564 -204378 -252610 -120303 -105194 -188393 -222988 -204353 -190218 -248878 -197446
21320 -197446 50168 -31471 -135860 -80135 103019 90739 115837 12340 69278 7452 -77812
21309 -77812 -212972 -44035 114669 102406 36473 -30722 152969 174395 127783 134274 44998
21298 44998 -150726 -207044 -229840 -217609 -29575 215175 267988 351983 227645 -91146 -128342
21287 -128342 -116162 -212242 -281224 -188683 -182329 -215177 -222812 -231152 -241699 -71995 18963 -12532
21275 -12532 -250459 -325957 -361165 -102912 116127 112544 48710 105040 77865 17616 103025
$$ packed form
21352a1325j26873r2703J28800K33362j15228m1464J13024J69329l856j8873j14934
21341A19259K7349J23913k1134j27626q7554J9193M6456J45730j82418j46611
21331h3443n7121o3814m8232J32307J5109q3199l4595J8635J4135n8660N1432
21320a97446K47614q1639j04389N5725J83154j2280K5098j03497N6938o1826q5264
21309g7812j35160J68937J58704j2263o5933o7195J83691K1426m6612O491q9276
21298D4998j95724n6318k2796J2231J88034K44750N2813Q3995j24338l18791l7196
21287a28342J2180r6080o8982R2541O354l2848p635q340j0547J69704R0958l1495
21275a2532k37927p5498l5208K58253K19039l583o3834N6330k7175o0249Q5409
$$ plain form
21264 103025 203473 221162 166298 108358 -126345 -82958 -996 -149648 -109323 -54970 47841
21253 47841 -26430 -204758 -234367 -46428 94370 190253 -64293 -249317 -94919 120857
21243 120857 258529 162935 62746 44799 14968 -24123 49883 102957 236136 153038 26001
21232 26001 -12756 -87315 -178967 -76326 60552 3001 31697 69203 72242 -49864 -83735
21221 -83735 -75252 -79706 -70042 -25625 23588 51368 -153738 -333527 -200327 -218015 -193600 -140468
21209 -140468 -161663 -118380 -141241 -357043 -489023 -516864 -421362 -291569 -204987 -170162 -85910
21198 -85910 106903 133246 -105918 -146146 42631 -215653 -206289 -114699 -137140 -163480 -265351
21187 -265351 -234210 -47140 6498 59225 -98141 -165904 109306 161322 55374 -34036 -38604
$$ packed form
21264A03025J00448J7689n4864n7940k34703M3387Q1962j48652M0325N4353J02811
21253D7841p4271j78328k9609J87939J40798R5883k54546j85024J54398K15776
21243A20857J37672r5594j00189j7947k9831l9091P4006N3074J33179q3098j27037
21232B6001l8757p4559r1652J02641J36878n7551K8696L7506L039j22106l3871
21221h3735Q483m454R664M4417M9213K7780k05106j79789J33200j7688K4415N3132
21209a40468k1195M3283k2861k15802j31980k7841R5502J29793Q6582L4825Q4252
21198h5910J92813K6343k39164m0228J88777k58284R364R1590k2441k6340j01871
21187b65351L1141J87070N3638N2727j57366o7763K75210N2016j05948q9410m568
$$ plain form
21176 -38604 -33761 -198269 -158000 19113 15092 -20197 17147 -66510 -283395 -286245 -85655
21165 -85655 -89726 41913 81147 27198 -184734 -156623 -186405 -274654 -183556 -104879 -39037
21154 -39037 111471 174600 91874 -12861 32808 -109257 -182662 -145474 -105968 11072 62124
21143 62124 37183 -16617 -175578 -227337 -88259 -61188 -34093 -69908 -15791 -110311 164554
21132 164554 173281 -16368 -22184 88656 128070 126282 190337 417301 388933 285057 70920
21121 70920 97629 -43173 -297210 -426211 -326681 -184323 14580 203528 269438 203192
21111 203192 196968 36001 -160119 -265052 -420556 -538686 -271333 15437 52812 -37984
21101 -37984 -37516 114999 71487 -141108 -82746 117232 300378 96165 14327 77753 -25274
$$ packed form
21176c8604M843j64508M0269J77113m021l5289L7344q3657k16885k850K00590
21165h5655m071J31639L9234n3949k11932K8111k9782q8249R1098P8677O5842
21154c9037J50508O3129q2726j04735M5669j42065p3405L7188L9506J17040N1052
21143F2124k4941n3800j58961n1759J39078K7071K7095l5815N4117r4520K74865
21132A64554Q727j89649n816J10840L9414j788O4055K26964k8368j03876k14137
21121G0920K6709j40802k54037j29001R9530J42358J98903J88948O5910o6246
21111B03192o224j60967j96120j04933j55504j18130K67353K86770L7375r0796
21101c7984M68J52515m3512k12595N8362J99978J83146k04213q1838O3426j03027
$$ plain form
21090 -25274 -157580 -44685 -30134 -190755 -226690 -227311 -198213 -12494 -16956 43000 44806 -113397
21078 -113397 -94163 -99110 -28323 -20011 223915 327793 222361 163425 172156 232575 335258
21067 335258 258314 216216 290815 211797 225977 271669 94560 45295 87671 12244 48939
21056 48939 266851 189397 170682 41546 -11382 -168010 -324769 -95335 103967 183752
21046 183752 203843 161707 97969 72718 186224 201917 18871 -98284 -172475 -208484 -261101
21035 -261101 -226956 -287590 -179211 -108539 -131627 12880 138392 43903 -219830 -329805
21025 -329805 -170958 -142463 -231773 -94445 36416 13602 -35123 -70875 -39608 -55605 24044
21014 24044 183095 105 -257909 -352274 -258495 -247074 -253614 -202780 -234066 -281699 -222248
$$ packed form
21090b5274j32306J12895J4551j60621l5935o21K9098J85719m462N9956J806j58203
21078a13397J9234m947P0787Q312K43926J03878j05432n8936Q731O0419J02683
21067C35258p6944m2098P4599p9018J4180M5692j77109m9265M2376p5427L6695
21056D8939K17912p7454j8715j29136n2928j56628j56759K29434J99302P9785
21046A83752K0091m2136o3738k5251J13506J5693j83046j17155p4191l6009n2617
21035b61101L4145o0634J08379P0672k3088J44507J25512r4489k63733j09975
21025c29805J58847K8495q9310J37328J30861k2814m8725l5752L1267j5997P9649
21014B4044J59051j82990k58014r4365R3779J1421o540N0834l1286m7633N9451
$$ plain form
21003 -222248 -176768 -244182 -333156 -196761 -196233 -159238 -31492 208729 80842 104840 115471
20992 115471 -6735 -135527 -182128 -270180 -302377 -236512 -2774 71804 11188 93550 12171
20981 12171 -116822 -165905 -103339 -47746 -19938 -47313 -123213 -215233 -105742 -58898 184250
20970 184250 256018 193794 28270 -27666 19566 -87542 -178565 2071 -18731 -75894 -67189
20959 -67189 -101886 -125888 -56851 34701 111772 146663 -5872 -89965 -173860 -202858 -157060
20948 -157060 -22308 -9916 -54127 -40521 -131370 -116605 -318735 -415702 -206562 -200710 -291235
20937 -291235 -311887 -182480 -110911 3597 190292 277723 220451 110403 160424 171818 163094
20926 163094 197224 292539 376813 428344 460825 373587 279937 181984 188510 100709 -144646
$$ packed form
21003b22248M5480o7414q8974J36395N28L6995J27746K40221j27887K3998J0631
20992A15471j22206j28792m6601q8052l2197O5865K33738P4578o0616Q2362q1379
20981A2171j28993m9083O2566N5593K7808k7375p5900r2020J09491M6844K43148
20970A84250P1768o2224j65524n5936M7232j07108r1023J80636k0802n7163Q705
20959f7189l4697k4002O9037R1552P7071L4891j52535q4093q3895k8998M5798
20948a57060J34752J2392m4211J3606r0849J4765k02130r6967K09140N852r0525
20937b91235k0652J29407P1569J14508J86695Q7431n7272j10048N0021J1394q724
20926A63094L4130R5315Q4274N1531L2481q7238r3650r7953O526q7801k45355
$$ plain form
20915 -144646 -90712 -35308 -1388 -26649 108358 138999 -5643 -184376 -107791 -164667 -8989
20904 -8989 225340 110065 -130325 -245449 -212421 -107472 -80799 -141642 -224874 -144189 30208
20893 30208 256383 220592 159008 -97724 -297298 -352136 -299079 -226732 -244685 -50928 -55191
20882 -55191 34717 185662 261624 95398 173216 218238 218258 193998 184742 196860 194909 198991
20870 198991 128595 -83240 -29788 6086 -16419 -101299 -239941 -255698 -132191 -37768 26506
20859 26506 65323 30466 -100752 -86921 -129773 12994 -94488 -309184 -345436 -126265 237512
20848 237512 295772 115871 21836 -112088 -205658 -356411 -306429 -146580 -11387 -18505 -169356
20837 -169356 -86723 38112 -4365 -125574 -282686 -233865 -233791 -258383 -245320 -216510 -141814
$$ packed form
20915a44646N3934N5404L3920k5261J35007L0641j44642j78733P6585n6876J55678
20904h989K34329j15275k40390j15124L3028J04949K6673o0843q3232Q0685J74397
20893C0208K26175l5791o1584k56732j99574n4838N3057P2347j7953J93757m263
20882e5191Q9908J50945P5962j66226P7818M5022K0k4260r256J2118j951M082
20870A98991p0396k11835N3452L5874k2505q4880j38642j5757J23507R4423O4274
20859B6506L8817l4857j31218J3831m2852J42767j07482k14696l6252K19171L63777
20848B37512N8260j79901r4035j33924r3570j50753M9982J59849J35193p118j50851
20837a69356Q2633J24835m2477j21209j57112M8821P4k4592J3063K8810P4696
$$ plain form
20826 -141814 -25744 -259596 -298626 -372092 -295581 -287626 -214064 -221316 -193937 -167513 -60825
20815 -60825 -11807 25267 63606 -110056 -84329 -46014 -98601 83118 190316 257403 172722
20804 172722 50459 -57418 -17911 -145327 -183823 -119728 -86403 -66673 70978 302928
20794 302928 128830 -84243 -71769 -65824 164166 296346 222328 157096 125729 40623 3193
20783 3193 -119603 -53592 48930 107114 -79389 -268998 -83343 108931 67350 26894 81259
20772 81259 72332 -1366 -86550 -189744 -116067 -162089 -173852 66606 42568 -77395 14546
20761 14546 -118512 -264396 -121292 -9665 47829 -91567 -106277 -37107 -44409 -54180 -90609
20750 -90609 -44619 -57971 -160295 -153680 -201318 26462 -17255 41870 156540 -19423 -34954
$$ packed form
20826a41814J16070k33852l9030p3466P6511P955P3562p252K7379K6424J06688
20815f0825M9018L7074L8339j73662K5727L8315n2587J81719J07198O7087q4681
20804A72722j22263j07877L9507j27416l8496O4095L3325J9730J37651K31950
20794C02928j74098k13073J2474N945K29990J32180p4018o5232l1367q5106l7430
20783C193j22796O6011J02522N8184j86503j89609J85655J92274m1581m0456N4365
20772H1259q927p3698q5184j03194P3677m6022j1763K40458k4038j19963R1941
20761A4546j33058j45884J43104J11627N7494j39396j4710O9170p302r771l6429
20750i0609M5990j3352j02324O615m7638K27780m3717N9125J14670j75963j5531
$$ plain form
20739 -34954 103181 154548 302682 279773 342544 325407 233924 160508 231093 186082 186274 140828
20727 140828 171219 195438 216224 -38710 -353591 -313925 -54581 -48479 -218613 -387669 -239562
20716 -239562 -174157 -135318 -134184 -222214 -76088 119089 129278 147218 88335 14545 -90326
20705 -90326 -140603 -123989 -149410 -347554 -252700 -123119 -106841 -231687 -72478 -86919 -171526
20694 -171526 -75023 77672 121448 102129 275154 405968 338613 329947 364453 340488 401839
20683 401839 416505 370729 382434 195600 56729 281051 401888 418186 275564 -31061
20673 -31061 -40898 13645 -48136 -6696 -49187 66562 127260 102563 106807 105163 165541 134492
20661 134492 139055 108504 -17747 51036 132622 167491 99430 104082 110170 75710 134594 211409
$$ packed form
20739c4954J38135N1367J48134k2909O2771j7137r1483p3416P0585m5011J92m5446
20727A40828L0391K4219K0786k54934l14881L9666K59344O102j70134j69056J48107
20716b39562O5405L8839J134q8030J46126J95177J0189J7940n8883p3790j04871
20705i0326n0277J6614k5421j98144R4854J29581J6278j24846J59209j4441q4607
20694a71526R6503J52695M3776j9319J73025J30814o7355q666L4506k3965O1351
20683D01839J4666m5776J1705j86834j38871K24322J20837J6298j42622l06625
20673c1061r837N4543o1781M1440m2491J15749O0698k4697M244j644O0378l1049
20661A34492M563l0551j26251O8783Q1586L4869o8061M652O088l4460N8884P6815
$$ plain form
20649 211409 184669 134835 214730 43709 -121149 -150235 38812 35909 7277 62477 48236
20638 48236 71422 131667 231398 116539 102840 37828 -8296 25514 17494 22613 -171044 -292230
20626 -292230 -322971 -171930 -47645 -136090 -215894 -106580 39659 93476 60381 44802 38705
20615 38705 65002 47172 79178 12828 -27156 -95305 -73947 62886 230352 259073 213613
20604 213613 210550 179248 138408 155734 123148 59659 93008 44819 43662 -8809 -98939 -62275
20592 -62275 9936 169996 -44381 -197883 -123553 -98196 -92272 -141926 -108072 -77390 75703
20581 75703 120684 -45498 -48768 54581 -20827 -3234 109692 102009 80513 -25029 -144410
20570 -144410 -313339 -274176 -325437 -383039 -327436 -215682 -195417 -192512 -225993 -209092 -141970
$$ packed form
20649B11409k6740m9834P9895j71021j64858k9086J89047k903k8632N5200j4241
20638D8236K3186O0245R9731j14859j3699o5012m6124L3810q020N119j93657j21186
20626b92230l0741J51041J24285q8445p9804J09314J46239N3817l3095j5579o097
20615C8705K6297j7830L2006o6350l9984o8149K1358J36833J67466K8721m5460
20604B13613l063l1302m0840J7326l2586o3489L3349m8189j157n2471r0130L6664
20592f2275P2211J60060k14377j53502P4330K5357N924m9654L3854L0682J53093
20581G5703M4981j66182l270J03349p5408J7593J12926p683k1496j05542j19381
20570a44410j68929L9163n1261n7602N5603J11754K0265K905l3481J6901O7122
$$ plain form
20559 -141970 -237934 -233791 -85198 7111 101610 283118 441783 477332 433523 290314 131344
20548 131344 5584 -65468 -28604 -89156 124645 334296 169681 116927 135180 38638 -53307
20537 -53307 -124071 42199 229601 212402 63066 -45522 -61088 130492 107075 99432 18506
20526 18506 -63181 -211774 -298147 -215203 -277823 -173470 47667 202079 107018 20594 171448
20515 171448 99332 6944 2248 -77790 -62075 60345 95600 60042 31114 -61338 -91889
20504 -91889 -88938 69974 182384 59850 24780 24838 -6038 150484 369695 127526 -203035
20493 -203035 -351366 -204726 -115510 -130376 -3002 99634 -11758 17158 3857 50998
20483 50998 25287 49743 141238 153382 162971 208069 72826 13944 83756 100382 98955 131956
$$ packed form
20559a41970r5964M143J48593R2309R4499J81508J58665L5549m3809j43209j58970
20548A31344j25760p1052L6864o0552K13801K09651j64615n2754J8253r6542r1945
20537e3307p0764J66270J87402j7199j49336j08588j5566J91580k3417p643q0926
20526A8506q1687j48593q6373Q2944o2620J04353K21137J54412r5061q6424J50854
20515A71448p2116r2388m696q0038J5715J22420L5255l5558k8928r2452l0551
20504i1889K951J58912J12410j22534l5070N8l0876J56522K19211k42169l30561
20493b03035j48331J46640Q9216j4866J27374J02636j11392K8916j3301M7141
20483E0998k5711K4456R1495J2144R589M5098j35243n8882O9812J6626j427L3001
$$ plain form
20471 131956 131756 123608 226266 206545 140563 -15061 -79945 22659 130421 132245 128647 77302
20459 77302 -50672 -78227 -29351 115936 163208 72854 47992 108910 51281 86088 -46384
20448 -46384 -260470 -408986 -140254 71969 37722 -10015 169157 164151 159937 172048 244917
20437 244917 234137 244767 140623 41760 161309 210388 253246 274213 90065 -67089 -201529
20426 -201529 -242470 -268813 -256479 -268820 -134170 -227805 -198273 -91391 -25672 -753 24373
20415 24373 194594 155670 24674 66622 124117 -2739 -210788 -327564 -233589 -12208
20405 -12208 78862 -46073 -28629 -135322 -123119 -236881 -252011 -110375 20038 137072
20395 137072 258369 230124 185051 212467 364512 262397 121976 88551 -64342 -169137
$$ packed form
20471A31956k00q148J02658j9721o5982j55624o4884J02604J07762J824l598n1345
20459G7302j27974k7555M8876J45287M7272r0354k4862O0918n7629L4807j32472
20448d6384k14086j48516K68732K12223l4247m7737J79172n006m214J2111P2869
20437B44917j0780J0630j04144r8863J19549M9079M2858K0967j84148j57154j34440
20426b01529m0941k6343J2334j2341J34650r3635K9532J06882O5719K4919K5126
20415B4373J70221l8924j30996M1948N7495j26856k08049j16776R3975K21381
20405a2208R1070j24935J7444j06693J2203j13762j5130J41636J30413J17034
20395A37072J21297k8245m5073K7416J52045j02115j40421l3425j52893j04795
$$ plain form
20385 -169137 -203575 -245003 -210749 -171297 61347 260330 240597 173320 221042 203922 43457
20374 43457 -71302 -127888 -3043 13369 74717 238202 250348 279462 253259 95789 16780
20363 16780 -2731 78134 235633 196916 108463 92675 -26833 -12196 84809 68185 114655
20352 114655 54138 16483 20063 93713 129345 -31634 -202416 -180417 -49398 19065 110569
20341 110569 298110 177358 235985 116565 -101526 -79168 173561 268254 188715 53518
20331 53518 8291 -50674 -98059 -11730 79192 161966 197352 159416 171504 135152 30708
20320 30708 152287 287716 165812 56955 72896 95493 264160 183081 38697 -44523
20310 -44523 -58773 -169277 -89560 -43561 -70648 -78811 -76195 7436 90274 219676 159820 -76033
$$ packed form
20385a69137l4438m1428L4254L9452K32644J98983j9733o7277M7722j7120j60465
20374D3457j14759n6586J24845J6412O1348J63485J2146K9114k6203j57470p9009
20363A6780j9511Q0865J57499l8717q8453j5788j19508J4637R7005j6624M6470
20352A14655o0517l7655L580P3650L5632j60979j70782K1999J31019O8463R1504
20341A10569J87541j20752N8627j19420k18091K2358K52729R4693p9539j35197
20331E3518m5227n8965m7385Q6329R0922Q2774L5386l7936J2088l6352j04444
20320C0708J21579J35429j21904j08857J5941K2597J68667q1079j44384q3220
20310d4523j4250j10504P9717M5999k7087q163K616Q3631Q2838J29402n9856k35853
$$ plain form
20298 -76033 -37705 307138 554429 627827 592663 481885 302078 175590 118851 187320 27108
20287 27108 -116268 -260719 -188772 -233043 -277174 -131307 -7633 -181646 -223479 -159686 -80809
20276 -80809 -22859 117281 108492 130814 145865 14174 -46328 -10342 -186333 -177924 -144207
20265 -144207 -196133 -385192 -356038 -77674 213067 284229 138948 81455 102733 82303 -217591
20254 -217591 -406110 -340014 -202852 -172495 -280649 -218003 -103602 -139470 -335865 -449060
20244 -449060 -307380 -268604 -214869 56928 131114 95884 -62904 -77699 78472 -3253 -165013
20233 -165013 -53912 114992 187826 159150 152839 265823 254617 145458 -7134 -67386 -27971
20222 -27971 12057 171171 206877 179557 80878 67472 203112 251360 122654 6467 -23620
$$ packed form
20298g6033L8328L44843K47291P3398l5164j10778j79807j26488n6739O8469j60212
20287B7108j43376j44451P1947m4271m4131J45867J23674j74013m1833O3793P8877
20276h0809N7950J40140q789K2322J5051j31691o0502L5986j75991Q409L3717
20265a44207n1926j89059K9154K78364K90741P1162j45281n7493K1278k0430k99894
20254b17591j88519O6096J37162L0357j08154O2646J14401l5868j96395j13195
20244d49060J41680L8776N3735K71797P4186l5230j58788j4795J56171q1725j61760
20233a65013J11101J68904P2834k8676o311J12984j1206j09159j52592o0252L9415
20222b7971M0028J59114L5706k7320r8679j3406J35640M8248j28706j16187l0087
$$ plain form
20211 -23620 -66303 -86016 -178244 -158604 -54065 33828 19252 -15369 47728 100751 113768
20200 113768 26581 -63821 -135614 -251203 -326661 -323754 -164467 42450 86053 145603 117123
20189 117123 54967 112342 244979 171391 -14374 33010 121124 193158 66732 -3507 59315
20178 59315 43701 4722 69468 134399 273656 287572 263794 82437 98093 196986 138131
20167 138131 192291 314202 406256 366198 266115 170001 142489 182559 178254 189099 45255
20156 45255 -166058 -119949 -149134 -14146 153249 69682 -52097 115084 183857 126175 141455
20145 141455 151155 131110 45570 -5803 -1453 12300 -64943 -3390 -67217 -369873 -346995 -244390
20133 -244390 -227344 -157777 -88308 -113081 -42468 98706 88485 58714 35206 -98175 48661
$$ packed form
20211b3620m2683j9713r2228J9640J04539Q7893j4576l4621O3097N3023J3017
20200A13768q7187r0402p1793j15589p5458K907J59287K06917M3603N9550k8480
20189A17123o2156N7375J32637p3588j85765M7384Q8114P2034j26426p0239O2822
20178E9315j5614l8979O4746O4931J39257J3916k3778j81357J5656R8893n8855
20167A38131N4160J21911R2054m0058j00083r6114k7512M0070m305J0845j43844
20156D5255k11313M6109k9185J34988J67395q3567j21779J67181O8773n7682J5280
20145A41455R700k0045q5540n1373M350J3753p7243O1553o3827l02656K2878J02605
20133b44390J7046O9567O9469k4773P0613J41174j0221k9771k3508j33381J46836
$$ plain form
20122 48661 117750 124590 165899 67832 56138 63106 71497 173773 122727 62339 45598 43300
20110 43300 27374 87114 95344 161839 150203 158068 74361 -9299 -101998 -134302 -34307 -71835
20098 -71835 -120387 58688 110598 175939 166066 49514 91687 151529 110808 -33804 -4322
20087 -4322 -10817 -145944 -238271 -191655 -163993 -164600 169379 461122 347136 309582 290149 333934
20075 333934 221241 -1349 -132856 -158567 -23351 90707 75960 106953 -31239 15950
20065 15950 -57947 -36444 -44114 2843 -28072 -34659 -156628 -223249 -157984 -65856 48438 -22082
20053 -22082 -151294 -27727 9502 56955 31400 37728 7962 84131 97105 -13349 51414
20042 51414 54743 -27563 80461 161740 137943 71802 -129841 -265354 -153133 64858 144971
$$ packed form
20122D8661O9089O840M1309r8067j1694O968Q391J02276n1046o0388j6741k298
20110D3300j5926N9740Q230O6495j1636P865q3707q3660r2699l2304R9995l7528
20098g1835m8552J79075N1910O5341r873j16552M2173N9842m0721j44612K9482
20087d322o495j35127r2327M6616K7662o07L33979K91743j13986l7554j9433M3785
20075C33934j12693k22590j31507k5711J35216J14058j4747L0993j38192M7189
20065A5950p3897K1503p670M6957l0915o587j21969o6621O5265R2128J14294p0520
20053b2082j29212J23567L7229M7453k5555O328k9766P6169J2974j10454O4763
20042E1414L329q2306J08024Q1279k3797o6141k01643j35513J12221K17991Q0113
$$ plain form
20031 144971 316152 269746 176812 214840 356521 249394 191121 273188 263826 242495 225010
20020 225010 228412 222793 241016 295269 321274 395845 374509 217335 101968 -20141 -123744
20009 -123744 -102162 -22721 94688 46726 -53202 -103990 -64955 -124572 -39001 34166 113614
19998 113614 88158 110698 -10456 10233 78441 95796 283794 411076 462347 430456 351532
19987 351532 57229 -122512 -256437 -25916 168721 270761 269684 119410 -39206 -154722
19977 -154722 61482 243896 49260 -78216 33969 246197 366847 308881 243624 -208
19967 -208 -84793 -206849 -276530 -145249 -41431 -14048 -164646 -235782 -207444 -203739 -269494
19956 -269494 -162613 -13463 66924 54496 177243 193685 151703 73100 -62083 17924 877
$$ packed form
20031A44971J71181m6406r2934L8028J41681j07127n8273Q2067r362k1331j7485
20020B25010L402n619J8223N4253K6005P4571k1336j57174j15367j22109j03603
20009a23744K1582P9441J17409m7962r9928n0788L9035n9617Q5571P3167P9448
19998A13614k5456K2540j21154K0689O8208J7355J87998J27282N1271l1891p8924
19987C51532k94303j79741j33925K30521J94637J02040j077j50274j58616j15516
19977a54722K16204J82414j94636j27476J12185K12228J20650n7966o5257k43832
19967b08q4585j22056o9681J31281J03818K7383j50598p1136K8338L705o5755
19956b69494J06881J49150Q0387j2428J22747J6442m1982p8603j35183Q0007j7047
$$ plain form
19945 877 -163062 -208764 -266156 -181042 123665 150661 42803 -70935 -47780 -92396 -133829
19934 -133829 -56451 3666 -31441 -55361 -33489 -29681 120399 222242 151357 68299 151615
19923 151615 116400 78014 48026 91319 51525 125941 174361 119072 28572 -28323 68145
19912 68145 123394 32519 32320 138127 105509 42450 -128581 -30691 75632 27806 53150
19901 53150 133268 130553 150500 178813 122139 31480 116219 91720 73675 70522 90598 165147
19889 165147 74866 41895 156874 174415 100871 142174 137761 40334 -40759 -250409 -135926
19878 -135926 -81830 -108692 -83433 200020 251776 217982 324257 185711 70345 110972 155478
19867 155478 160876 119125 105058 108041 128976 168300 27462 15064 34472 260978 273473
$$ packed form
19945H77j63939m5702n7392Q5114L04707K6996j07858j13738K3155m4616m1433
19934a33829P7378O0117l5107k3920K1872L808J50080J01843p0885q3058Q3316
19923A51615l5215l8386k9988M3293l9794P4416M8420n5289r0500n6895R6468
19912F8145N5249r0875j99J05807l2618o3059j71031R7890J06323m7826K5344
19901E3150Q0118k715J9947K8313n6674r0659Q4739k4499j8045l153K0076P4549
19889A65147r0281l2971J14979J7541p3544M1303m413r7427q1093k09650J14483
19878a35926N4096k6862K5259K83453N1756l3794J06275j38546j15366M0627M4506
19867A55478N398m1751j4067K983K0935L9324j40838j2398J9408K26506J2495
$$ plain form
19856 273473 264115 217926 27670 -28706 -56572 -58565 -11157 254060 296661 112322 147023
19845 147023 291662 431851 493180 553862 391467 254803 119102 -12583 -17173 -69937
19835 -69937 -234005 -80117 220197 166850 31087 69802 99338 150182 220562 217735 211122
19824 211122 273558 251144 270797 336656 284409 362607 489876 494376 339039 257181 199735
19813 199735 170203 189297 201888 158353 229557 187745 52124 -15691 -114467 -37625 47982
19802 47982 -59329 -10548 190939 180592 196467 367305 207695 4545 22525 -43241 -103425
19791 -103425 -112724 27411 173840 202590 276129 158431 92948 148081 171100 177359 188453
19780 188453 274271 253016 235819 165793 276096 240246 300817 252900 110802 229819 363772
$$ packed form
19856B73473r358m6189j90256n6376k7866j993M7408K65217M2601j84339L4701
19845A47023J44639J40189O1329O0682j62395j36664j35701j31685m590n2764
19835f9937j64068J53888L00314n3347j35763L8715K9536N0844P0380k827o613
19824B11122O2436k2414J9653O5859n2247P8198J27269M500j55337q1858n7446
19813A99735k9532J9094J2591m3535P1204m1812j35621o7815r8776P6842Q5607
19802D7982j07311M8781K01487j0347J5875J70838j59610k03150J7980o5766o0184
19791a03425r299J40135J46429K8750P3539j17698o5483N5133K3019O259J1094
19780A88453Q5818k1255j7197p0026J10303l5850O0571m7917j42098J19017J33953
$$ plain form
19769 363772 220043 24329 14965 22626 -17089 29756 43347 190656 331004 390137 399108
19758 399108 212530 -2006 -92219 -248409 -221631 -207205 -16508 235697 163480 138796
19748 138796 33864 131354 186215 161812 218890 17075 -134508 143011 346532 213712
19738 213712 73810 96615 -16655 -28466 -23377 101742 135626 35385 130135 206009 280280
19727 280280 168280 193882 281330 337246 117551 5767 -30311 -10010 167631 205904 185278
19716 185278 174623 39631 -190246 -189026 -187881 42620 305595 259556 233122 110642 67091
19705 67091 104485 233564 357074 421004 366133 316275 309878 221308 313435 368654 353625
19694 353625 421129 341598 47304 -20268 38228 -67633 -59055 182506 206383 163018 34056
$$ packed form
19769C63772j43729j95714r364P661l9715M6845J3591J47309J40348N9133Q971
19758C99108j86578k14536r0213j56190K6778J4426J90697K52205p2217k4684
19748A38796j04932R7490N4861k4403N7078k01815j51583K77519K03521j32820
19738B13712j39902K2805j13270j1811N089J25119L3884j00241R4750P5874P4271
19727B80280j12000K5602Q7448N5916k19695j11784l6078K0301J77641L8273k0626
19716A85278j0655j34992k29877J220J145K30501K62975m6039k6434j22480m3551
19705F7091L7394J29079J23510O3930n4871m9858o397q8570R2127N5219j5029
19694C53625O7504p9531k94294o7572N8496j05861Q578K41561K3877m3365j28962
$$ plain form
19683 34056 -19886 13802 -64062 -77037 -41655 71810 63404 -1183 -111968 -140257 -9081
19672 -9081 113216 -18089 -137021 -119106 19615 169974 309276 363632 266935 248061 176405
19661 176405 104802 219138 245278 201664 205385 74680 72871 16616 72861 114091 170711
19650 170711 37485 19527 21060 62786 134411 238151 -935 -70657 -96483 -33007 78433
19639 78433 126439 151732 160366 46497 12509 58801 50001 178728 242185 84714 54193
19628 54193 169689 152216 142471 102972 26248 231581 212092 50616 -87890 122091 120465
19617 120465 161338 218995 296605 233350 -51163 -210709 -138900 -91829 -15693 14742 113998
19606 113998 246741 136795 -31570 -30797 -94631 37642 20147 -112503 -5215 160031
$$ packed form
19683C4056n3942L3688p7864j2975L5382J13465q406o4587j10785k8289J31176
19672i081J22297j31305j18932J7915J38721J50359J39302N4356r6697j8874p1656
19661A76405p1603J14336K6140m3614L721j30705j809n6255N6245M1230N6620
19650A70711j33226j7958J533M1726P1625J03740k39086o9722k5826O3476J11440
19639G8433M8006K5293Q634j13869l3988M6292q800J28727O3457j57471l0521
19628E4193J15496j7473r745l9499p6724K05333j9489j61476j38506K09981j626
19617A20465M0873N7657P7610o3255k84513j59546P1809M7071P6136L0435R9256
19606A13998J32743j09946j68365P73o3834J32273j7495j32650J07288J65246
$$ plain form
19596 160031 218765 161457 4632 2735 -62680 -27165 -88034 -131785 -129525 -102888 29285
19585 29285 209120 317477 277648 168541 23414 -147278 -46257 57773 31835 164425
19575 164425 348871 397069 203655 263951 260776 256849 379267 412431 381527 268017 260552
19564 260552 220495 335110 394808 403643 375171 261628 41483 121348 424383 369953 221818
19553 221818 431921 449741 443364 529943 363341 244022 171905 106727 77081 135021 97800
19542 97800 105732 229916 466996 472858 336364 203498 122860 -107495 -243981 -141741 -54057
19531 -54057 92478 216996 311721 284916 268625 177340 313116 300283 109745 66301 62269
19520 62269 242935 444098 493721 354797 27421 -94451 -90468 50538 146799 59145 40175
$$ packed form
19596A60031N8734n7308j56825j897o5415L5515o0869m3751K260K6637J32173
19585B9285J79835J08357l9829j09107j45127j70692J01021J04030k5938J32590
19575A64425J84446M8198j93414O0296l175l927J22418L3164l0904j13510p465
19564B60552m0057J14615N9698Q835k8472j13543k20145P9865L03035n4430j48135
19553B21818K10103J7820o377Q6579j66602j19319p2117o5178k9646N7940l7221
19542I7800P932J24184K37080N862j36494j32866q0638k30355j36486J02240Q7684
19531e4057J46535J24518R4725k6805j6291r1285J35776j2833j90538m3444m032
19520F2269J80666K01163M9623j38924l27376j21872L983J41006R6261q7654j8970
$$ plain form
19509 40175 206969 191870 122842 217728 302036 260488 191725 91152 19949 -20442 -137844
19498 -137844 -130016 -33963 175409 293695 198220 110121 124999 339701 257063 191123 152770
19487 152770 171915 -7339 24197 -3076 79628 310835 223021 122883 207956 314199 383976
19476 383976 512672 574557 623910 593348 528257 492847 508939 408379 548560 826208 735105
19465 735105 591125 549379 478371 393601 385285 432446 564200 633511 696840 598090 373479
19454 373479 330239 481186 690551 689721 668217 824591 581875 569321 749698 628465 673792
19443 673792 696400 663694 676303 633953 691543 679177 638573 709287 852408 819818 745229
19432 745229 722601 861478 997815 1091429 1117535 1128928 1226220 1179369 948227 1015972 975960
$$ packed form
19509D0175J66794j5099o9028R4886Q4308m1548o8763j00573p1203m0391j17402
19498a37844P828R6053K09372J18286r5475q8099J4878K14702q2638o5940l8353
19487A52770J9145j79254L1536k7273Q2704K31207q7814j00138Q5073J06243O9777
19476C83976J28696O1885M9353l0562o5091l5410J6092j00560J40181K77648r1103
19465G35105j43980m1746p1008q4770q316M7161J31754O9311O3329r8750k24611
19454C73479m3240J50947K09365q30k1504J56374k42716j2554J80377j21233M5327
19443F73792K2608l2706J2609m2350N7590j2366m0604P0714J43121l2590p4589
19432G45229k2628J38877J36337R3614K6106J1393R7292m6851k31142O7745m0012
$$ plain form
19421 975960 875192 868734 786250 662430 517778 560808 600692 528981 625680 906077 822026
19410 822026 838619 953777 985601 1129660 1206924 1183632 1138661 1032520 937514 935626 939420
19399 939420 1051832 970590 933991 939769 946090 1076688 960352 691052 626389 381076 110333
19388 110333 28595 143634 9454 -12007 148531 275870 177480 229707 386173 400216
19378 400216 397908 448772 514202 588987 358284 282515 282796 303055 293975 346797 391023 457711
19366 457711 392990 224132 125909 315426 360648 240810 142994 234644 416187 436104 445851
19355 445851 419852 466355 473865 179915 201403 336451 352895 349678 254345 331875 425104
19344 425104 556824 608843 740134 782641 610019 452177 389999 536672 502381 332355
$$ packed form
19421I75960j00768o458q2484j23820j44652M3030L9884p1711R6699K80397q4051
19410H22026J6593J15158L1824J44059P7264k3292m4971j06141r5006j888L794
19399I39420J12412q1242l6599N778O321J30598j16336k69300o4663k45313k70743
19388A10333q1738J15039j34180k1461J60538J27339r8390N2227J56466J4043
19378D00216k308N0864O5430P4785k30703p5769K81K0259r080N2822M4226O6688
19366D57711o4721j68858r8223J89517M5222j19838r7816R1650J81543J9917R747
19355D45851k5999M6503P510k93950K1488J35048J6444l217r5333P7530R3229
19344D25104J31720N2019J31291M2507j72622j57842o2178J46673l4291j70026
$$ plain form
19334 332355 49817 124431 220778 179262 221054 154935 153452 286155 237154 223323 326821
19323 326821 362436 307950 461414 447583 433141 312881 353176 501976 554191 491315 466626
19312 466626 473316 512823 454340 447569 416526 338668 259540 406790 558294 633910 447881
19301 447881 274858 239267 233558 140254 325151 428263 509476 515740 539398 487749 463129
19290 463129 421452 300335 250531 350683 470978 411660 415511 493010 556368 574767 565226
19279 565226 530145 343727 406293 380304 292785 260527 464604 491898 470184 454895 511266
19268 511266 585518 549482 599837 741080 809416 870539 866907 711652 700866 652680 491204
19257 491204 376389 400378 588037 642825 591997 561593 567268 482549 549432 611431 631026
$$ packed form
19334C32355k82538P4614R6347m1516M1792o6119j483J32703m9001j3831J03498
19323C26821L5615n4486J53464j3831j4442j20260M0295J48800N2215o2876k4689
19312D66626O690L9507n8483o771l1043p7858p9128J47250J51504P5616j86029
19301D47881j73023l5591n709r3304J84897J03112Q1213O264K3658n1649k4620
19290D63129m1677j21117m9804J00152J20295n9318L851P7499O3358J8399r541
19279E65226l5081j86418O2566k5989q7519l2258K04077K7294k1714j5289N6371
19268E11266P4252l6036N0355J41243O8336O1123l632j55255j0786m8186j61476
19257D91204j14815K3989J87659N4788n0828l0404N675q4719O6883O1999J9595
$$ plain form
19246 631026 648753 794463 801675 785855 753625 692822 824507 819120 920680 728430 700717
19235 700717 703973 790519 764551 700694 636152 552904 441476 415811 448278 574064 553446
19224 553446 464519 332046 253473 383593 407224 568615 640387 750273 827908 772736 852332
19213 852332 1056414 1029273 1004770 1002189 1065374 1063042 1014367 933246 826017 736695 742344 897040
19201 897040 862251 796229 794700 815955 805166 829719 878288 968330 1042864 944348 846778 931387
19189 931387 842835 846041 951104 951175 787334 639165 594365 692648 735345 816940 787045 822776
19177 822776 937635 839737 807630 836965 769060 655175 663662 559916 714605 885565 818320
19166 818320 739059 887918 942475 925417 931556 807019 766338 682779 680015 718052 712654 762005
$$ packed form
19246F31026J7727J45710P212j5820l2230o0803J31685n387J01560j92250k7713
19235G00717L256Q6546k5968o3857o4542q3248j11428k5665L2467J25786k0618
19224E53446q8927j32473p8573J30120K3631J61391P1772J09886P7635n5172P9596
19213H52332K04082k7141k4503k581O3185k332m8675q1121j07229q9322N649J54696
19201H97040l4789o6022j529K1255j0789K4553M8569R0042P4534r8516r7570Q4609
19189I31387q8552L206J05063P1j63841j48169m4800R8283M2697Q1595k9895L5731
19177H22776J14859r7898l2107K9335o7905j13885Q487j03746J54689J70960o7245
19166H18320p9261J48859N4557j7058O139j24537m0681q3559k764L8037n398M9351
$$ plain form
19154 762005 823766 880906 960799 937836 922233 957592 865509 810473 888312 865523 677016
19143 677016 536447 612134 729294 792093 855634 866591 689592 647513 686418 704358 761607
19132 761607 786661 701097 720976 658353 692057 626347 511041 658996 929825 1036952 894241
19121 894241 859193 700359 662430 578812 642054 873227 796578 693425 805972 685944
19111 685944 682940 754981 659587 630111 417442 459053 569619 744775 945832 929605 849047
19100 849047 911552 909681 810459 997493 1309145 1278139 1379356 1275322 1172403 1242074 1302586
19089 1302586 1268273 1267954 1461231 1599005 1526764 1540630 1574223 1411790 1400087 1292916 1163458
19078 1163458 1059289 1139155 1274599 1249609 1256922 1348178 1301416 1135280 939471 985120 1026740
$$ packed form
19154G62005O1761N7140P9893k2963j5603L5359r2083n5036P7839k2789j88507
19143F77016j40569P5687J17160O2799O3541J0957j76999m2079L8905J7940N7249
19132G61607K5054q5564J9879o2623L3704o5710j15306J47955K70829J07127j42711
19121H94241l5048j58834l7929q3618O3242K31173p6649j03153J12547j20028
19111F85944l004P2041r5394k9476k12669M1611J10566J75156K01057j6227q0558
19100H49047O2505j871r9222J87034L11652l1006J01217j04034j02919O9671O0512
19089A302586l4313l19J93277J37774p2241J3866L3593j62433j1703j07171j29458
19078A163458j04169P9866J35444k4990P313R1256m6762j66136j95809M5649M1620
$$ plain form
19067 1026740 1040368 1164184 1271573 1198342 1432447 1522307 1384658 1404422 1467535 1404783
19057 1404783 1259864 1339685 1383885 1381702 1433528 1572578 1630561 1568016 1373479 1489022 1500358
19046 1500358 1480280 1502576 1489469 1364452 1455353 1767844 1985603 2043810 1984943 2083886 2048964
19035 2048964 2061313 2131951 2087187 2016433 2032877 2223465 2369977 2347090 2343472 2277975 2289167
19024 2289167 2474005 2434253 2419082 2294138 2365354 2383589 2338021 2315830 2429799 2525886 2614677
19013 2614677 2733177 2794488 2874784 3151672 3350990 3594644 3830108 3934187 3878309 3815102
19003 3815102 4010758 4184838 4360623 4434650 4414095 4594793 4922522 5142879 5280659 5638140
18993 5638140 6115159 6891395 7468283 7687018 7655468 7546770 7261588 6998881 6727554 6628879
$$ packed form
19067A026740J3628J23816J07389p3231K34105Q9860j37649J9764O3113o2752
19057A404783j44919P9821M4200k183N1826J39050N7983o2545j94537J15543J1336
19046A500358k0078K2296j3107j25017R0901L12491K17759N8207n8867R8943l4922
19035B048964J2349P0638m4764p0754J6444J90588J46512k2887l618o5497J1192
19024B289167J84838l9752j5171j24944P1216J8235m5568k2191J13969R6087Q8791
19013B614677J18500O1311Q0296K76888J99318K43654K35464J04079n5878o3207
19003C815102J95656J74080J75785P4027k0555J80698L27729K20357J37780L57481
18993E638140M77019P76236N76888K18735l1550j08698k85182k62707k71327r8675
$$ plain form
18983 6628879 6686626 6868015 7280630 7715313 8366826 9024460 9968871 11357325 13266607
18974 13266607 15775145 18808688 22105241 24836562 26011136 26175924 26206447 26959060 28915939
18965 28915939 32199293 37051895 43595774 52629664 65259455 81965141 101551066 119896136
18957 119896136 130877245 130201168 122543462 114208267 107662990 103063877 98258437 92282271
18949 92282271 86409059 81762304 79690689 80889175 85203668 90774945 94846463 97676693
18941 97676693 101441087 106646591 112319096 116181261 117149734 115364663 112344518 111424382
18933 111424382 113980982 118896835 124376671 130986671 137766028 140766732 137756998 130512964
18925 130512964 120596313 108253236 95468596 85066874 77596959 73377135 72207051
$$ packed form
18983F628879N7747J81389M12615M34683O51513O57634R44411J388454J909282
18974A3266607K508538L033543L296553K731321J174574J64788L0523P52613J956879
18965B8915939L283354M852602O543879R033890J2629791J6705686J9585925J8345070
18957A19896136J0981109o76077p657706q335195o545277m599113m805440n976166
18949I2282271n873212m646755k071615J198486M314493N571277M071518K830230
18941I7676693L764394N205504N672505L862165R68473j785071l020145r20136
18933A11424382K556600M915853N479836O610000O779357L000704l009734p244034
18925A30512964r916651j2343077j2784640j0401722p469915m219824j170084
$$ plain form
18918 72207051 72830283 73740243 74464386 76608239 81473673 89895815 103170692 121103613
18910 121103613 142412104 164095065 182665187 192019761 189269484 176166455 155926741
18903 155926741 135190929 118134637 106873690 103031603 107925794 121521523 142103613
18896 142103613 163064280 173780515 168880602 154359596 135767660 117068006 100437167
18889 100437167 86538364 74370769 63933499 55328956 48318721 42631149 38379795
18882 38379795 35560146 33625953 32300277 31594055 31390133 31960656 32778163 33532744 33508882
18873 33508882 32326333 30591653 28708196 26854339 25081063 23810175 23107825 22594929
18865 22594929 22290865 22127556 21773897 20950047 20146830 19637054 19295898 18813822 18000648
$$ packed form
18918G2207051O23232R09960P24143K143853M865434Q422142J3274877J7932921
18910A21103613K1308491K1682961J8570122R354574k750277j3103029k0239714
18903A55926741k0735812j7056292j1260947l842087M894191J3595729K0582090
18896A42103613K0960667J0716235m899913j4521006j8591936j8699654j6630839
18889A00437167j3898803j2167595j0437270q604543p010235n687572m251354
18882C8379795k819649j934193j325676p06222k03922N70523Q17507P54581k3862
18873C3508882j182549j734680j883457j853857j773276j270888p02350n12896
18865B2594929l04064j63309l53659q23850q03217n09776l41156m82076q13174
$$ plain form
18856 18000648 16845690 15672776 14459302 13308837 12272744 11520568 11001515 10470455
18848 10470455 9897665 9728691 9367908 9074572 8550863 7988988 7518615 7142956 6841055
18839 6841055 6413465 5996792 5739931 5527776 5426203 5226473 4986585 4803081 4452095
18830 4452095 4081158 3732823 3636363 3504319 3357447 3149547 2983235 2900389 2819658 2616891
18820 2616891 2604996 2676875 2335511 2217047 2218658 2100777 2070720 2140460 2040455 1797414
18810 1797414 1792593 1782975 1479997 1441661 1542196 1582622 1432835 1310382 1289345 1201152 1126932
18799 1126932 1048860 983515 830410 951697 1201731 1165884 1145126 1019512 789224 910219
18789 910219 1112783 1202880 1201008 1195468 1109497 1141433 1256678 1331467 1142940 1149574 1295369
$$ packed form
18856A8000648j154958j172914j213474j150465j036093p52176n19053n31060
18848A0470455n72790j68974l60783k93336n23709n61875m70373l75659l01901
18839F841055m27590m16673k56861k12155j01573j99730k39888j83504l50986
18830D452095l70937l48335r6460j32044j46872k07900j66312q2846q0731k02767
18820B616891j1895P1879l41364j18464J611j17881l0057O9740j00005k43041
18810A797414m821r618l02978l8336J00535M0426j49787j22453k1037q8193p4220
18799A126932p8072o5345j53105J21287K50034l5847k0758j25614k30288J20995
18789I10219K02564R0097j872n540q5971L1936J15245P4789j88527O634J45795
$$ plain form
18778 1295369 1249529 1142655 1073092 959427 867764 981153 1211578 1328667 1306031 1437946
18768 1437946 1652482 1778019 1899303 1871017 1990612 1924306 1709450 1387094 1250630 1135439
18758 1135439 1049138 998590 822368 676537 809293 886465 807804 852637 928259 809862
18748 809862 780730 676819 545966 570078 862072 1068909 965964 814800 689898 753930
18738 753930 754760 564209 570773 781842 991528 1012500 1044607 971397 839549 795974 758846
18727 758846 773314 743072 826352 745169 743167 824138 835033 869250 803731 826769 718642
18716 718642 615878 737186 959885 1052736 873585 793591 647769 653552 784598 975308
18706 975308 1050502 1098868 1070019 1045868 971381 1059216 1081889 997306 1003084 1063216 1054829 999490
$$ packed form
18778A295369m5840j06874o9563j13665r1663J13389K30425J17089k2636J31915
18768A437946K14536J25537J21284k8286J19595o6306k14856l22356j36464j15191
18758A135439q6301n0548j76222j45831J32756P7172p8661M4833P5622j18397
18748H09862k9132j03911j30853K4112K91994K06837j02945j51164j24902O4032
18738G53930Q30j90551O564K11069K09686K0972L2107p3210j31848m3575l7128
18727G58846J4468l0242Q3280q1183k002Q0971J0895L4217o5519K3038j08127
18716G18642j02764J21308K22699R2851j79151p9994j45822N783J31046J90710
18706I75308P5194M8366k8849k4151p4487Q7835K2673q4583N778O0132q387n5339
$$ plain form
18694 999490 918950 1024171 1075913 964663 1068709 1212116 1104206 1082264 967940 951236
18684 951236 1102153 1175384 1064299 962642 971100 901598 835598 733232 820886 788032 866740
18673 866740 971468 1178054 1098889 882954 857225 882637 943118 1169260 1218060 1305679 1337006
18662 1337006 1256339 1249163 1180986 1053495 1042354 896058 966366 1009664 974963 1173130 1295423
18651 1295423 1168815 974947 1070352 914468 987548 1003095 939455 778820 748109 797785
18641 797785 927194 993290 798177 634770 499670 641973 662901 762201 864099 733871
18631 733871 609691 618563 702831 649815 662900 714518 747697 859072 973537 1022351 987599
18620 987599 921069 934449 1044918 943112 942089 1028388 956151 973226 963957 909775 972558
$$ packed form
18694I99490q0540J05221N1742j11250J04046J43407j07910k1942j14324j6704
18684I51236J50917P3231j11085j01657Q458o9502o6000j02366Q7654l2854P8708
18673H66740J04728K06586p9165k15935k5729K5412O0481K26142M8800Q7619L1327
18662A337006q0667p176o8177j27491j1141j46296P0308M3298l4701J98167J22293
18651A295423j26608j93868R5405j55884P3080J5547o3640j60635l0711M9676
18641G97785J29409O6096j95113j63407j35100J42303K0928R9300J01898j30228
18631G33871j24180Q872Q4268n3016J3085N1618L3179J11375J14465M8814l4752
18620I87599o6530J3380J10469j01806j023Q6299p2237J7075r269n4182O2783
$$ plain form
18609 972558 1058596 1051709 1056720 1098181 1040924 1073755 1158917 1077975 1106760 1051828 1005890 1082302
18597 1082302 1240484 1233161 1118271 1101021 1375921 1401503 1380601 1349483 1153924 1154048 1190824
18586 1190824 1118487 1208563 1341120 1324732 1279781 1277145 1342694 1281499 1189122 1190330 1151432
18575 1151432 1168919 1280218 1356822 1505011 1486320 1429180 1422041 1356622 1320383 1166010 1123249
18564 1123249 1257348 1414122 1550706 1653059 1751044 1830338 1786984 1786998 1664147 1617739 1518171
18553 1518171 1568696 1568989 1700713 1775180 1805888 1919855 2034064 2249502 2365164 2423762 2605563
18542 2605563 2585970 2496907 2461677 2395832 2389165 2407964 2316772 2250545 2242625 2323003 2396169 2464195
18530 2464195 2567604 2557354 2465667 2560581 2666659 2725817 2750105 2943520 3225670 3498164
$$ packed form
18609I72558Q6038o887N011M1461n7257L2831Q5162q0942K8785n4932m5938P6412
18597A082302J58182p323j14890j7250K74900K5582k0902l1118j95559J24L6776
18586A190824p2337R0076J32557j6388m4951k636O5549o1195r2377J208l8898
18575A151432J7487J11299P6604J48189j8691n7140p139o5419l6239j54373m2761
18564A123249J34099J56774J36584J02353R7985P9294m3354J4j22851m6408r9568
18553A518171N0525K93J31724P4467L0708J13967J14209K15438J15662N8598J81801
18542B605563j9593q9063l5230o5845o667J8799r1192o6227p920Q0378P3166O8026
18530B464195J03409j0250r1687R4914J06078N9158K4288J93415K82150K72494
$$ plain form
18520 3498164 3738302 4063455 4400245 4790532 5153139 5462074 5615210 5549850 5781934 6118271
18510 6118271 6482195 7327998 8563630 10429960 13011172 15690611 17720054 18196657 18039647
18501 18039647 18033437 17892505 17714821 17336845 16406618 15698605 15617134 15836155 16307945 16473422
18491 16473422 15750791 14757362 13559792 12520744 11765876 11298341 11122508 11433487 12159958
18482 12159958 13362336 14879284 16815941 19562737 23005149 26704425 30183073 34021560
18474 34021560 39534296 46778585 53380044 56464003 55652680 53582067 50254609 46308801
18466 46308801 43117159 41360765 41155815 42029441 43108861 42604897 41234594 40022382
18458 40022382 39887793 41351796 44974601 50538768 56632863 62527712 69383349 78883613
$$ packed form
18520C498164K40138L25153L36790L90287L62607L08935J53136o5360K32084L36337
18510F118271L63924Q45803J235632J866330K581212K679439K029443M76603j57010
18501A8039647o210j40932j77684l77976r30227p08013q1471K19021M71790J65477
18491A6473422p22631r93429j197570j039048p54868m67535j75833L10979P26471
18482A2159958J202378J516948J936657K746796L442412L699276L478648L838487
18474C4021560N512736P244289O601459L083959q11323k070613l327458l945808
18466D6308801l191642j756394k04950Q73626J079420n03964j370303j212212
18458D0022382j34589J464003L622805N564167O094095N894849O855637R500264
$$ plain form
18450 78883613 92276208 110572073 132732494 154950413 171617815 183810421 191891625
18443 191891625 191221109 181559348 171006685 162991284 156680030 150168168 145304081 145708325
18435 145708325 152036680 163774440 177994248 190369993 193853765 185491916 169221686
18428 169221686 150385096 131216622 114037972 100976905 92450235 88072174 87849429
18421 87849429 91869570 100486122 114889386 135956026 164639836 199565169 236539609
18414 236539609 269649517 297566592 319193409 327840714 319469375 297510532 272294961
18407 272294961 246383153 222805914 204978453 197366555 202777824 223661424 259508546
18400 259508546 298842818 320221825 305809348 276759624 242089982 204551827 169877553
$$ packed form
18450G8883613J3392595J8295865K2160421K2217919J6667402J2192606Q081204
18443A91891625o70516r661761j0552663q015401o311254o511862m864087M04244
18435A45708325O328355J1737760J4219808J2375745L483772q361849j6270230
18428A69221686j8836590j9168474j7178650j3061067q526670m378061k22745
18421H7849429M020141Q616552J4403264K1066640K8683810L4925333L6974440
18414B36539609L3109908K7917075K1626817Q647305q371339k1958843k5215571
18407B72294961k5911808k3577239j7827461p611898N411269K0883600L5847122
18400B59508546L9334272K1379007j4412477k9049724l4669642l7538155l4674274
$$ plain form
18393 169877553 143956299 126659301 114979118 105500146 96124799 87675194 80678190
18386 80678190 75563112 72690084 72370480 72887264 72468386 70719994 68945491 67078216
18378 67078216 64703343 61253949 57964556 55646387 54480961 54268327 54100492 52801294
18370 52801294 50192281 46662278 42800600 39011658 35619706 32905633 30734560 29003912
18362 29003912 27848151 26804915 25556013 24414687 23011727 21840182 20842048 19983157
18354 19983157 19210539 18412199 17691247 17078342 16735935 16684838 16830204 17207089 17242122 16831178
18344 16831178 16142108 15211744 14077908 13033982 12200832 11416316 11050139 10822893 11043778
18335 11043778 11286360 11546694 11745686 11351279 10485023 9644840 8813618 8125959 7612359
$$ packed form
18393A69877553k5921254j7296998j1680183r478972r375347q449605o997004
18386H0678190n115078k873028l19604N16784m18878j748392j774503j867275
18378F7078216k374873l449394l289393k318169j165426k12634j67835j299198
18370E2801294k609013l530003l861678l788942l391952k714073k171073j730648
18362B9003912j155761j043236j248902j141326j402960j171545r98134q58891
18354A9983157p72618p98340p20952o12905l42407n1097J45366L76885L5033m10944
18344A6831178o89070r30364j133836j043926q33150p84516l66177k27246K20885
18335A1043778K42582K60334J98992l94407q66256q40183q31222o87659n13600
$$ plain form
18326 7612359 7340522 7116856 6924572 6597740 6263883 5851371 5429322 5104471 4766635
18317 4766635 4544844 4230660 3993041 3827928 3758006 3768145 3568641 3216389 2831476 2876340
18307 2876340 2898439 2883320 2647786 2539032 2413665 2418139 2452573 2290564 2247601 2101575
18297 2101575 2076400 2082332 1903464 1790705 1860015 2045258 2206563 2180429 2172116 2150603 2141757
18286 2141757 1993191 1819941 1738061 1576587 1477544 1456439 1487331 1516407 1627661 1638327
18276 1638327 1562293 1571504 1605293 1465113 1372050 1259621 1248765 1178500 1046948 1119369 1320129
18265 1320129 1305065 1334771 1434989 1478991 1409922 1213656 1069605 1059984 983487 940649 885394
18254 885394 928417 998686 1124127 1066698 927086 943890 1043060 1112540 1015476 1001064 1079136
$$ packed form
18326G612359k71837k23666j92284l26832l33857m12512m22049l24851l37836
18317D766635k21791l14184k37619j65113o9922J0139j99504l52252l84913M4864
18307B876340K2099j5119k35534j08754j25367M474L4434j62009m2963j46026
18297B101575k5175N932j78868j12759O9310J85243J61305k6134q313k1513q846
18286B141757j48566j73250q1880j61474r9043k1105L0892K9076J11254J0666
18276A638327p6034R211L3789j40180r3063j12429j0856p0265j31552P2421K00760
18265A320129j5064K9706J00218M4002o9069j96266j44051r621p6497m2838n5255
18254H85394M3023P0269J25441n7429j39612J6804R9170O9480r7064j4412P8072
$$ plain form
18243 1079136 1151718 1171483 1007138 1018361 1113412 1119321 1129754 1249231 1233146 1210038 1120124
18232 1120124 993599 893040 879631 1163118 1357704 1284390 1217777 1230882 1193255 1163849
18222 1163849 1222811 1132343 996347 1028326 1107492 1128449 1036614 1044564 1133325 1078937 1230142
18211 1230142 1372025 1146172 1147755 1137336 1261480 1205401 919078 831948 1046188 1208710
18201 1208710 1127597 1126727 1004595 939110 956678 1004710 957817 961097 1112021 1147259 1180168
18190 1180168 1062274 1093449 1128731 1160052 1213847 1282530 1316176 1327739 1317799 1179662 1111258
18179 1111258 1249968 1113476 1016035 902340 794599 795803 1020958 979550 968312 887941
18169 887941 804693 802667 958535 1088360 1112423 1276600 1438434 1392495 1254921 1308468 1409094
$$ packed form
18243A079136P2582J9765j64345J1223R5051N909J0433J19477j6085k3108q9914
18232A120124j26525j00559j3409K83487J94586p3314o6613J3105l7627k9406
18222A163849N8962r0468j35996L1979P9166K0957r1835P950Q8761n4388J51205
18211A230142J41883k25853J583j0419J24144n6079k86323q7130K14240J62522
18201A208710q1113q70j22132o5485J7568M8032m6893L280J50924L5238L2909
18190A180168j17894L1175L5282L1321N3795O8683L3646J1563r940j38137o8404
18179A111258J38710j36492r7441j13695j07741J204K25155m1408j1238q0371
18169H87941q3248k026J55868J29825K4063J64177J61834m5939j37574N3547J00626
$$ plain form
18158 1409094 1445654 1408942 1329199 1282908 1192983 1180114 1323655 1440894 1312569 1315561 1325755
18147 1325755 1280526 1446706 1503198 1552554 1571396 1628350 1610725 1545862 1682520 1750656 1909588
18136 1909588 2190858 2388030 2402802 2515594 2614283 2785171 2984639 3229077 3513882 3751785
18126 3751785 4093716 4379464 4746625 5262310 6133379 7219563 8727497 10735678 13353859
18117 13353859 16800939 21465952 27969913 37214139 51466113 73232658 105196925 151376813
18109 151376813 202975125 239690095 230088017 198443806 162277919 124856631 91108527
18102 91108527 65993495 49459909 38501915 31261817 26359767 22675285 19776155 17416351
18094 17416351 15558605 14251165 13224175 12191297 11348385 10629695 10125309 9579200 9261286
$$ packed form
18158A409094L6560l6712p9743m6291q9925j2869J43541J17239j28325K992J0194
18147A325755m5229J66180N6492M9356J8842N6954j7625o4863J36658O8136J58932
18136A909588K81270J97172J4772J12792R8689J70888J99468K44438K84805K37903
18126C751785L41931K85748L67161N15685Q71069J086184J507934K008181K618181
18117A3353859L447080M665013O503961R244226J4251974K1766545L1964267M6179888
18109A51376813N1598312L6714970r602078l1644211l6165887l7421288l3748104
18102I1108527k5115032j6533586j0957994p240098m902050l684482k899130k359804
18094A7416351j857746j307440j026990j032878q42912p18690n04386n46109l17914
$$ plain form
18085 9261286 8921278 8738963 8587946 8244403 7927283 7907037 7754955 7512170 7419599 7458523
18075 7458523 7414420 7481379 7680470 7934153 8242561 8155515 7972009 7677269 7134700 6659708
18065 6659708 6308253 6012646 5720420 5368350 5118560 4854780 4648666 4319009 3957254
18056 3957254 3767231 3593833 3470866 3315444 3080187 2873738 2757722 2727301 2484392 2304288
18046 2304288 2286215 2154477 1958332 1878373 1624799 1508849 1395341 1203874 1204194 1232579
18036 1232579 1257315 1217430 1111036 1142028 1123703 973501 965926 932395 890399 804059 741613
18025 741613 859261 889403 693478 492640 556628 545773 412992 364381 374179 333865 443045
18014 443045 400774 449283 362349 450504 470074 261995 -33738 -130133 -134119 54142 251730
$$ packed form
18085I261286l40008j82315j51017l43543l17120k0246j52082k42785r2571L8924
18075G458523m4103O6959J99091K53683L08408q7046j83506k94740n42569m74992
18065F659708l51455k95607k92226l52070k49790k63780k06114l29657l61755
18056C957254j90023j73398j22967j55422k35257k06449j16016l0421k42909j80104
18046B304288j8073j31738j96145p9959k53574j15950j13508j91467L20K8385
18036A232579K4736l9885j06394L0992j8325j50202p575l3531m1996q6340o2446
18025G41613J17648L0142j95925k00838O3988j0855j32781m8611R798m0314J09180
18014D43045m2271M8509q6934Q8155J9570k08079k95733r6395l986J88261J97588
$$ plain form
18003 251730 321902 360873 273943 136799 180157 281006 415530 396064 236040 187285 -63470
17992 -63470 -48430 159713 212347 242891 182119 115463 213862 264141 431283 562544 384850
17981 384850 258081 276193 266056 251890 234998 288585 182120 244159 477661 501563 353731
17970 353731 474246 501691 472392 403852 448953 405596 468396 493856 370180 293967 365442
17959 365442 436812 480544 507211 500925 491680 498804 433628 186144 124378 73930 143573 524836
17947 524836 639339 575659 527856 530678 450683 398892 370910 358425 360422 539016 522701
17936 522701 525147 620231 725224 778051 899507 1034366 874239 675522 580947 617809 575058
17925 575058 589800 801396 989806 1162831 1243907 1239196 1138209 1095488 1099847 1039401 841927
$$ packed form
18003B51730P0172L8971q6930j37144M3358J00849J34524j9466j60024m8755k50755
17992f3470J5040K08143N2634L0544o0772o6656R8399N0279J67142J31261j77694
17981C84850j26769J8112j0137j4166j6892N3587j06465O2039K33502K3902j47832
17970C53731J20515K7445k9299o8540M5101m3357O2800K5460j23676p6213P1475
17959C65442P1370M3732K6667o286r245P124o5176k47484o1766n0448O9643L81263
17947E24836J14503o3680m7803K822p9995n1791k7982j2485J997J78594j6315
17936E22701K446R5084J04993N2827J21456J34859j60127j98717r4575L6862m2751
17925E75058J4742K11596J88410J73025Q1076m711j00987m2721M359o0446j97474
$$ plain form
17914 841927 619423 739111 951059 1066410 985877 676600 372959 309500 361681 383612
17904 383612 492318 588428 515757 543402 643426 712283 571537 523105 625492 859744
17894 859744 911075 763359 631221 700224 758579 808439 962100 864110 796967 1028295 1051253
17883 1051253 906065 847624 747926 748291 968384 1039416 846059 678503 654471 536469 466099
17872 466099 380586 375995 417807 321792 87683 167034 525082 531661 423172 339410 444454
17861 444454 529033 401635 222211 197273 244230 177829 231223 238144 100595 60089 -73282
17850 -73282 101910 224178 270663 179447 84582 99650 232067 303636 203209 194216 160793
17839 160793 81890 -23124 -43563 95954 187964 189580 54482 -36852 -60104 -573 154916
$$ packed form
17914H41927k22504J19688K11948J15351q0533l09277l03641o3459N2181K1931
17904C83612J08706R6110p2671K7645J00024O8857j40746m8432J02387K34252
17894H59744N1331j47716j32138O9003N8355M9860J53661r7990o7143K31328K2958
17883A051253j45188n8441r9698L65K20093P1032j93357j67556k4032j18002p0370
17872D66099q5513m591M1812r6015k34109P9351L58048O579j08489q3762J05044
17861D44454Q4579j27398j79424k4938M6957o6401N3394O921j37549m0506j33371
17850g3282J75192J22268M6485r1216r4865J5068J32417P1569j00427q993l3423
17839A60793p8903j05014k0439J39517R2010J616j35098r1334k3252N9531J55489
$$ plain form
17828 154916 6700 -38510 -76715 -48090 78762 275149 183525 -29347 19272 -37358 27170
17817 27170 119471 44599 -3850 88234 258063 178720 -18044 -74560 -214131 -247102 -110273
17806 -110273 -37049 23692 -32233 -25951 56898 48568 9387 -211403 -221067 -123557 -1936 261758
17794 261758 183215 -495 -29135 -7726 -40236 -46122 -119177 -50456 -102834 -93759 3254 83243
17782 83243 94970 82925 121360 70427 43920 -86098 -232105 -334204 -288424 -200991 -33143
17771 -33143 -34246 -38518 15203 -82124 -53596 -105967 -311064 -268382 -192910 -322235 -263599 -50736
17759 -50736 -268036 -376337 -269986 -213375 -220966 -137665 -40812 -27515 23888 58667 31628
17748 31628 -233610 -256660 -106479 -127416 -310562 -416970 -242017 -165949 -208462 -237561 -178022
$$ packed form
17828A54916j48216m5210l8205K8625J26852J96387r1624k12872M8619n6630O4528
17817B7170R2301p4872m8449R2084J69829p9343j96764n6516j39571l2971J36829
17806a10273P3224O0741n5925O282Q2849q330l9181k20790r664R7510J21621K63694
17794B61758p8543j83710k8640K1409l2510n886p3055O8721n2378R075R7013P9989
17782H3243J1727j2045L8435n0933k6507j30018j46007j02099M5780Q7433J67848
17771c3143j103m272N3721r7327K8528n2371k05097M2682P5472j29325N8636K12863
17759e0736k17300j08301J06351N6611p591Q3301R6853J3297N1403L4779k7039
17748C1628k65238k3050J50181k0937j83146j06408J74953P6068m2513k9099N9539
$$ plain form
17737 -178022 -37271 -35913 -126806 -4079 120353 -1613 -28705 -75745 -260329 -208966 -134073
17726 -134073 -44753 -28067 -173019 -37168 -36172 -28911 33495 44354 -18294 -146194 -180502
17715 -180502 -306078 -329542 -252082 -152629 -77447 -39605 -44147 59580 3246 -69971 -79652
17704 -79652 -46465 -176054 -328246 -403034 -347210 -170759 -93910 -139570 -33558 87629 116351
17693 116351 -26693 -82286 -168926 -181861 -93933 -116042 -95123 -38033 -107770 25052 19218
17682 19218 -174865 -174895 -135285 -254542 -324435 -251753 -164005 -101805 -154081 -54107 -95515 -245091
17670 -245091 -295153 -223601 -179577 -286254 -346408 -140263 23595 4476 8404 135779 73797
17659 73797 12170 -208406 -178204 -19947 136288 259235 209559 147163 66454 107793 98102
$$ packed form
17737a78022J40751J358r0893J22727J24432j21966k7092m7040j84584N1363P4893
17726a34073Q9320J6686j44952J35851R96P261O2406J0859o2648j27900l4308
17715a80502j25576k3464P7460R9453P5182L7842m542J03727n6334p3217r681
17704g9652L3187j29589j52192p4788N5824J76451P6849m5660J06012J21187K8722
17693A16351j43044n5593q6640j2935Q7928k2109K0919N7090o9737J32822n834
17682A9218j94083l0L9610j19257o9893P2682Q7748O2200n2276R9974m1408j49576
17670b45091n0062P1552M4024j06677o0154K06145J63858j9119L928J27375o1982
17659G3797o1627k20576L0202J58257J56235J22947m9676o2396q0709M1339r691
$$ plain form
17648 98102 185497 166977 77802 70115 55662 -1624 20348 105927 19862 -207415 -105964
17637 -105964 81584 91552 176234 239548 228958 111890 1233 10187 -3257 68999 67226
17626 67226 148754 114833 34254 128552 313794 284181 432343 829341 1077678 1562229 1863944
17615 1863944 2028656 2119035 1869659 1616437 1284713 978465 753024 593262 555579 449252
17605 449252 286627 201576 150372 109892 152582 98395 43547 132358 91178 227477 202602
17594 202602 112963 226324 255312 112397 84219 161878 274646 171919 362195 413493
17584 413493 449246 291897 177554 248708 195226 -134449 -100262 92275 46300 42201 -60897
17573 -60897 -93977 2718 65405 83959 -54558 -23701 17776 11 -4156 -107312 -205722
$$ packed form
17648I8102Q7395j8520q9175p687j4453n7286K1972Q5579q6065k27277J01451
17637a05964J87548R968Q4682O3314j0590j17068j10657Q954j3444P2256j773
17626F7226Q1528l3921q0579R4298J85242k9613J48162L96998K48337M84551L01715
17615A863944J64712R0379k49376k53222l31724l06248k25441j59762l7683j06327
17605D49252j62625q5051n1204m0480M2690n4187n4848Q8811m1180J36299k4875
17594B02602q9639J13361K8988j42915k8178P7659J12768j02727J90276N1298
17584D13493L5753j57349j14343P1154n3482l29675L4187J92537m5975m099j03098
17573f0897l3080R6695O2687J8554j38517L0857M1477j7765m167j03156r8410
$$ plain form
17562 -205722 -221326 -263086 -180842 -119908 22950 -18456 -82476 17734 -39522 -87176 -166404
17551 -166404 -163191 -170920 -125487 -52211 -48239 -61644 -54265 -134201 -1990 -151985 -70761 18392
17539 18392 -43377 81913 47797 -63147 -95032 -181602 -241067 -259437 -293487 -213568 -211402
17528 -211402 -333038 -201897 -56615 -41347 -19571 259 -34443 -21130 -49557 -143168 -92309
17517 -92309 -105897 -219041 -307065 -340331 -94219 25941 -66029 -84831 -248413 -291043 -197882
17506 -197882 -194707 -179471 -55742 -200227 -163731 24473 110737 1450 -48818 45016 -31391
17495 -31391 -47116 -143243 -158214 -167126 -79102 40000 -42836 -29682 98722 33717 -178880
17484 -178880 -340333 -354109 -350026 -359094 -338512 -277840 -430327 -491681 -300842 -260580 -307957
$$ packed form
17562b05722j5604m1760Q2244O0934J42858m1406o4020J00210n7256m7654p9228
17551a66404L213p729M5433P3276L972j3405P379p9936J32211j49995Q1224Q9153
17539A8392o1769J25290l4116j10944l1885q6570n9465j8370l4050P9919K166
17528b11402j21636J31141J45282J5268K1776J9830l4702J3313k8427r3611N0859
17517i2309j3588j13144q8024l3266K46112J20160r1970j8802j63582m2630R3161
17506a97882L175J5236J23729j44485L6496J88204Q6264j09287n0268R3834p6407
17495c1391j5725r6127j4971q912Q8024J19102q2836J3154J28404o5005k12597
17484a78880j61453j3776M083r068K0582O0672j52487o1354J90839M0262m7377
$$ plain form
17473 -307957 -12736 6934 71692 159264 156970 105061 83794 -2888 -57492 -52878 -78244 -94084
17461 -94084 147250 278649 163752 -43351 -194946 -301067 -232328 -136408 -47818 -62755
17451 -62755 -114295 -205612 -108700 68055 183954 302531 496513 874138 1164528 1347918
17441 1347918 1350938 1048594 876417 642162 392105 248983 127088 99698 -51538 -144788
17431 -144788 13765 172465 195142 165473 -87821 -145036 102575 295091 302004 84072
17421 84072 -124747 -235706 -206520 -137162 -251532 -299689 -292815 -256529 -193359 -191846 -150065
17410 -150065 -157050 -293847 -193790 -103463 -362688 -433132 -486234 -308849 -174364 -322483
17400 -322483 -526404 -517278 -287316 -70940 -181792 -313548 -326462 -319888 -384958 -217844 124630
$$ packed form
17473c07957K95221J9670O4758Q7572k294n1909k1267q6682n4604M614k5366j5840
17461i4084K41334J31399j14897k07103j51595j06121O8739R5920Q8590j4937
17451f2755n1540r1317R6912J76755J15899J18577J93982L77625K90390J83390
17441A347918L020l02344j72177k34255k50057j43122j21895k7390j51236r3250
17431a44788J58553J58700K2677k9669k53294n7215K47611J92516O913k17932
17421H4072k08819j10959K9186O9358j14370m8157O874L6286O3170J513M1781
17410a50065o985j36797J00057R0327k59225p0444n3102J77385J34485j48119
17400c22483k03921R126K29962K16376j10852j31756j2914O574o5070J67114L42474
$$ plain form
17389 124630 52401 -241952 -296419 -349700 -196715 -41275 82498 19899 -66542 -90051 -141705
17378 -141705 -173406 -217471 -251857 -91334 -41485 -103160 -109299 -120805 -114869 38872 144442
17367 144442 137239 -21816 -133931 -110455 -43281 -62945 -69735 -185572 -274471 -265463 -308321
17356 -308321 -345850 -249038 -259835 -221901 -60037 193711 186196 227657 207006 202182 293840
17345 293840 266031 199028 53552 146944 257749 227464 258596 227655 300868 294209 240155
17334 240155 225993 233148 159204 224589 115520 72351 80703 47742 -62874 -18947 -43786
17323 -43786 9170 -41719 -126256 -216254 -247319 -147501 -92138 -5493 -31945 -150439 -184993
17312 -184993 19199 126591 280532 298806 28976 1087 103726 257509 410927 438516
$$ packed form
17389A24630p2229k94353n4467n3281J52985J55440J23773o2599q6441k3509n1654
17378a41705l1701m4065l4386J60523M9849o1675o139j1506N936J53741J05570
17367A44442p203j59055j12115K3476O7174j9664o790j15837q8899R008m2858
17356c08321l7529R6812j0797L7934J61864K53748p515M1461k0651m824R1658
17345B93840k7809o7003j45476R3392J10805l0285L1132l0941P3213o659n4054
17334B40155j4162P155p3944O5385j09069m3169Q352l2961j10616M3927k4839
17323d3786N2956n0889q4537q9998l1065R9818N5363Q6645k6452j18494l4554
17312a84993K04192J07392J53941J8274k69830k7889J02639J53783J53418K7589
$$ plain form
17302 438516 456818 477040 614448 689713 822408 913855 834422 703431 588221 517741 254099
17291 254099 196163 164718 167647 283682 302994 129031 -36249 -107879 -117956 -124716 -13144
17280 -13144 101672 120753 120158 -39837 -192104 -70364 84598 -66546 -75432 35995 69903
17269 69903 -23033 -75221 66198 -152622 -213704 -139075 -59073 136005 160445 159347 280992
17258 280992 170444 47735 113528 -5494 -254810 -110732 -113068 -132602 -216539 -129060 -18816
17247 -18816 17669 62979 43595 61257 54094 -5732 -49463 42544 41265 55084 199662 125616
17235 125616 -49778 3146 153847 -12395 -82873 80205 211839 182587 126519 186348
17225 186348 64080 40010 24596 -179237 -320226 -194624 22157 131396 161835 -9013
$$ packed form
17302D38516J8302K0222J37408P5265J32695R1447p9433j30991j15210p0480k63642
17291B54099n7936l1445K929J16035J9312j73963j65280p1630j0077o760J11572
17280a3144J14816J9081n95j59995j52267J21740J54962j51144q886J11427L3908
17269F9903r2936n2188J41419k18820o1082P4629Q0002J95078K4440j098J21645
17258B80992j10548j22709O5793j19022k49316J44078k336j9534q3937Q7479J10244
17247a8816L6485M5310j9384J7662p163n9826m3731R2007j279J3819J44578p4046
17235A25616j75394N2924J50701j66242p0478J63078J31634k9252n6068N9829
17225A86348j22268k4070j5414k03833j40989J25602K16781J09239L0439j70848
$$ plain form
17215 -9013 25389 72292 -7256 -155402 -126144 -162998 -77194 -226334 -212440 -115178 -108319 -186073
17203 -186073 -121733 -218996 -289111 -228582 -58195 94190 71149 151191 207184 325300 52574
17192 52574 83474 311220 341714 226738 94974 131013 148629 84782 -15583 -8862 130441
17181 130441 73394 140577 317767 250327 268357 247017 167204 68263 143361 228924 222535
17170 222535 246936 260297 221329 110889 187224 153886 97555 104594 113730 180135 434768
17159 434768 478368 393596 427241 511211 359149 319921 203305 205179 254102 366330 306094
17148 306094 273068 299587 338662 250128 236304 350976 452102 357597 399497 329930 304182
17137 304182 375466 467437 719901 970034 886458 679855 686725 774369 882612 903775 960732
$$ packed form
17215i013L4402M6903p9548j48146K9258l6854Q5804j49140J3894R7262O859p7754
17203a86073O4340r7263p0115O0529J70387J52385k3041Q0042N5993J18116k72726
17192E2574L0900K27746L0494j14976j31764L6039J7616o3847j00365O721J39303
17181A30441n7047O7183J77190o7440J8030k1340p9813r8941P5098Q5563o389
17170B22535K4401J3361l8968j10440P6335l3338n6331P039R136O6405K54633
17159D34768M3600q4772L3645Q3970j52062l9228j16616J874M8923J12228o0236
17148C06094l3026K6519L9075q8534j3824J14672J01126r4505M1900o9567k5748
17137C04182P1284R1971K52464K50133q3576k06603O870Q7644J08243K1163N6957
$$ plain form
17126 960732 1014930 1025115 994381 1027710 995119 1060403 1063007 1165929 1114645 1134213 1282165
17115 1282165 1382523 1300279 1194698 1055524 1090733 1092659 941570 1027342 1148937 1089555
17105 1089555 1105873 983757 1037099 1365915 1626663 1551073 1493149 1416855 1538680 1802723
17095 1802723 1960309 1821877 1845789 1999112 2024715 2048177 2147162 2098641 2107184 2180812 2261992
17084 2261992 2451950 2707903 2998111 3175241 3357497 3485516 3942511 4700669 5213309
17075 5213309 5539455 5687968 5730748 5891961 5810915 5801375 5973316 6377180 6933460 7343515
17065 7343515 7844058 8731087 10002384 11586568 13254859 15140892 17488864 20457971
17057 20457971 24465718 30105467 37842798 48607294 64606059 88190564 122169817
$$ packed form
17126I60732N4198J0185l0734L3329l2591O5284K604J02922n1284J9568J47952
17115A282165J00358q2244j05581j39174L5209J926j51089Q5772J21595n9382
17105A089555J6318j22116N3342L28816K60748p5590n7924p6294J21825K64043
17095A802723J57586j38432K3912J53323K5603K3462R8985m8521Q543P3628Q1180
17084B261992J89958K55953K90208J77130J82256J28019M56995P58158N12640
17075E213309L26146J48513M2780J61213q1046r540J71941M03864N56280M10055
17065G343515N00543Q87029J271297J584184J668291J886033K347972K969107
17057B0457971M007747N639749P737331J0764496J5998765K3584505L3979253
$$ plain form
17050 122169817 169514630 228898685 293167875 349582595 385166852 387353918 360263592
17043 360263592 312930875 255262831 199576418 152361683 115763255 89115915 70403624
17036 70403624 57660784 48737831 42257998 37547047 34072017 31287101 28855309 26838190
17028 26838190 25040098 23427261 22037130 20795843 19684093 18748375 18035537 17518516
17020 17518516 17170494 17027457 16996468 16975245 16944890 17046736 17183684 17054345 16830018 16826278
17010 16826278 16760492 16507560 16109687 15721751 15184010 14436608 13550422 12564972 11533660
17001 11533660 10849132 10255374 9699378 9161006 8552112 8364194 7930112 7495089 7027696
16992 7027696 6453559 6192060 5899652 5579912 5304724 5080153 4687834 4385165 4254929
$$ packed form
17050A22169817M7344813N9384055O4269190N6414720L5584257K187066k7090326
17043C60263592m7332717n7668044n5686413m7214735l6598428k6647340j8712291
17036G0403624j2742840q922953o479833m710951l475030k784916k431792k017119
17028B6838190j798092j612837j390131j241287j111750r35718p12838n17021
17020A7518516l48022j43037l0989k1223l0355J01846J36948j29339k24327l740
17010A6826278o5786k52932l97873l87936n37741p47402q86186r85450j031312
17001A1533660o84528n93758n55996n38372o08894j87918m34082m35023m67393
16992G027696n74137k61499k92408l19740k75188k24571l92319l02669j30236
$$ plain form
16983 4254929 3896636 3755513 3749420 3680803 3543060 3311792 3106332 2912023 2848386 2515338
16973 2515338 2468143 2374621 2278141 2024917 1740851 1604891 1711985 1522064 1534832 1407000
16963 1407000 1227741 1249545 1282106 1159128 1167184 976840 936511 878599 767637 671966 579340
16952 579340 399027 308501 341117 358975 582420 737071 591096 504876 395747 372560
16942 372560 325724 268346 339144 433098 293449 247559 235225 144621 90713 279434 484315
16931 484315 500121 466415 705749 725435 783716 855389 773420 751221 562321 423023 364311
16920 364311 363447 383936 331351 150163 153136 286254 357179 262085 166333 78328 -12692 -215457
16908 -215457 -263758 -100202 -74825 -118239 -86080 -37612 -22273 -107970 -72860 -57052 -100111
$$ packed form
16983D254929l58293j41123o093o8617j37743k31268k05460j94309o3637l33048
16973B515338m7195r3522r6480k53224k84066j35960J07094j89921J2768j27832
16963A407000j79259K1804L2561j22978Q056j90344m0329n7912j10962r5671r2626
16952E79340j80313r0526L2616J7858K23445J54651j45975q6220j09129k3187
16942C72560m6836n7378P0798R3954j39649m5890j2334r0604n3908J88721K04881
16931D84315J5806l3706K39334J9686N8281P1673q1969k2199j88900j39298n8712
16920C64311q64K0489n2585j81188K973J33118P0925r5094r5752q8005r1020k02765
16908b15457m8301J63556K5377m3414L2159M8468J5339q5697L5110J5808m3059
$$ plain form
16897 -100111 -201682 -223071 -239734 -237476 -158567 56599 -70482 -79372 72911 -6229 23649
16886 23649 -134467 -155974 -26461 22353 83869 121521 195820 355730 325490 265562 244207
16875 244207 113532 255762 414678 358154 292502 311612 247650 313655 356365 500227 500521
16864 500521 261793 12500 -89463 -118825 -3893 -11284 -64139 -26936 -74729 37547 17919
16853 17919 -24202 -111466 -22670 25146 2442 -20001 -78224 -115078 -86538 66183 137431
16842 137431 302893 362370 293120 243041 233377 174722 146651 122594 53744 68264 122544
16831 122544 104587 22343 -167126 -221710 -206441 -214700 -136584 -4781 -34893 -7235 15937
16820 15937 13038 -19647 40025 212461 124382 -57741 38733 -67247 -2697 58010 -20710
$$ packed form
16897a00111j01571k1389j6663K258P8909K15166j27081q890J52283p9140K9878
16886B3649j58116k1507J29513M8814O1516L7652P4299J59910l0240n9928k1355
16875B44207j30675J42230J58916n6524o5652J9110o3962O6005M2710J43862K94
16864E00521k38728k49293j01963k9362J14932p391n2855L7203m7793J12276j9628
16853A7919m2121q7264Q8796M7816k2704k2443n8223l6854K8540J52721P1248
16842A37431J65462N9477o9250n0079r664n8655k8071k4057o8850J4520N4280
16831A22544j7957q2244j89469n4584J5269q259P8116J31803l0112K7658K3172
16820A5937k899l2685N9672J72436q8079j82123R6474j05980O4550O0707p8720
$$ plain form
16809 -20710 -66211 -270853 -102048 -186490 -67628 -127905 -176489 -70861 -165317 -288968 -340915
16798 -340915 -353838 -407817 -331636 -118546 2370 -86943 -155921 -241742 -390861 -342846 -132661
16787 -132661 -38499 -113680 25476 65001 -39377 -226366 -263854 -94111 -1206 -53554 41716
16776 41716 -3734 -157510 -292093 -342341 -372855 -327232 -213990 -340744 -443759 -432280 -456567
16765 -456567 -476650 -344885 -430335 -483988 -452617 -382766 -346023 -179615 -2394 -63628 -154717
16754 -154717 -171088 -203401 -167360 -217001 -144838 86381 121730 15008 -75687 -64577 3649
16743 3649 -13939 47338 140871 -34956 -3562 -133682 -258263 -194482 -62236 -114467 -263913
16732 -263913 -164899 -69652 -86777 -39077 -146516 -277424 -282541 -317828 -196447 -86226 -136008
$$ packed form
16809b0710m5501k04642J68805q4442J18862o0277m8584J05628r4456j23651n1947
16798c40915j2923n3979P6181K13090J20916q9313o8978q5821j49119M8015K10185
16787a32661R4162p5181J39156L9525j04378j86989l7488J69743R2905n2348R5270
16776D1716m5450j53776j34583n0248l0514M5623J13242j26754j03015J1479k4287
16765d56567k0083J31765q5450n3653L1371O9851L6743J66408J77221o1234r1089
16754a54717j6371l2313L6041m9641P2163K31219L5349j06722r0695J1110O8226
16743C649j7588O1277R3533j75827L1394j30120j24581O3781J32246n2231j49446
16732b63913R9014R5247j7125M7700j07439j30908n117l5287J21381J10221m9782
$$ plain form
16721 -136008 -25866 149354 122513 95390 9584 -32229 -85209 -26597 75288 166319 85576
16710 85576 23807 -221419 -194176 -237888 -178621 -28317 122016 10788 44076 178947 173623
16699 173623 160653 104650 47245 75996 -13225 -134338 -192546 -341512 -319090 -228582 -93094
16688 -93094 -55564 -19558 -18507 -90760 -117122 -10119 27930 53013 83239 71278 47214 29182
16676 29182 -25782 38470 -88297 -242110 -286516 -324879 -284011 -210479 -413449 -423786 -226411
16665 -226411 -414643 -366939 -139528 -136629 -165844 -132432 7961 -2006 -47720 -24487 -225
16654 -225 -54821 -21603 -9101 -88041 -203349 -233262 -117615 114398 274555 148970 7086
16643 7086 -180110 -315435 -115288 -16868 23433 -22165 -190485 -52845 69882 150982 92363
$$ packed form
16721a36008J10142J75220k6841k7123q5806m1813n2980N8612J01885R1031q0743
16710H5576o1769k45226K7243m3712N9267J50304J50333j11228L3288J34871n324
16699A73623j2970n6003n7405K8751q9221j21113n8208j48966K2422R0508J35488
16688i3094L7530L6006J051p2253k6362J07003L8049K5083L0226j1961k4064j8032
16676B9182n4964O4252j26767j53813m4406l8363M0868P3532k02970j0337J97375
16665b26411j88232M7704K27411K899k9215L3412J40393r967m5714K3233K4262
16654b25n4596L3218J2502p8940j15308k9913J15647K32013J60157j25585j41884
16643G086j87196j35325K00147R8420M0301m5598j68320J37640J22727Q1100n8619
$$ plain form
16632 92363 67036 -114183 -317841 -395657 -313777 -265210 -135163 -192441 -63668 6341 3298
16621 3298 -74984 -88050 -130697 -232296 -294168 -135355 -4802 102726 86112 33943 -112519
16610 -112519 -167651 -173713 -133740 -59990 -100772 -5793 -18141 -55655 -5366 166899 188149
16599 188149 44130 -44521 -207841 -192909 -181810 -111474 -83504 -94025 -157817 -327299 -252864
16588 -252864 -83726 67458 22412 10 -115392 -255717 -382180 -325274 -308306 -353383
16578 -353383 -307592 -351687 -359622 -298212 -56362 -47462 -265729 -223547 -8205 -16674 -30145
16567 -30145 -13614 -13716 -113176 -75415 -148449 -157451 -89875 -151852 -194110 -300981 -325459 -381721
16555 -381721 -315827 -298453 -229839 -232043 -224793 -175927 78733 163777 74980 599 -120396
$$ packed form
16632I2363k5327j81219k03658p7816Q1880M8567J30047n7278J28773P0009l043
16621C298p8282j3066m2647j01599o1872J58813J30553J07528j6614n2169j46462
16610a12519n5132o062L9973P3750m0782R4979j2348l7514N0289J72265K1250
16599A88149j44019q8651j63320J4932J1099P0336K7970j0521o3792j69482P4435
16588b52864J69138J51184m5046k2402j15402j40325j26463N6906J6968m5077
16578c53383M5791m4095p935O1410K41850Q900k18267M2182K15342q469j3471
16567c0145J6531j02r9460L7761p3034r002O7576o1977m2258j06871k4478n6262
16555c81721O5894J7374O8614k204P250M8866K54660Q5044q8797p4381j20995
$$ plain form
16544 -120396 -199275 -168418 -306463 -363467 -467022 -398251 -310894 -283084 -227427 -84797 -213417
16533 -213417 -362905 -249377 -180567 -58768 -28727 35078 27830 8737 -128909 -240771 -134478
16522 -134478 -68624 -118001 -179092 -194901 -158028 -127025 -208537 -320646 -421862 -348213 -113144
16511 -113144 -97993 -199008 -161526 -141439 -121656 -59345 -78021 -191403 -277911 -177218 -203925
16500 -203925 -351294 -356266 -141547 -81492 -127918 -61882 -180637 -71009 34919 -30618 -46288
16489 -46288 -49896 2156 53009 15015 -36667 -48364 -172679 -24591 206446 225729 135462
16478 135462 240790 264810 361591 498085 757694 1107473 1644289 1948017 2059296 2127243
16468 2127243 2071396 1859326 1540548 1064298 730480 412798 375386 253314 129191 112590
$$ packed form
16544a20396p8879L0857j38045n7004j03555O8771Q7357K7810N5657J42630j28620
16533b13417j49488J13528O8810J21799L0041O3805p248j9093j37646j11862J06293
16522a34478O5854m9377o1091j5809L6873L1003q1512j12109j01216P3649K35069
16511a13144J5151j01015L7482K0087J9783O2311j8676j13382q6508J00693k6707
16500b03925j47369m972K14719O0055m6426O6036j18755J09628J05928o5537j5670
16489d6288l608N2052N0853l7994n1682j1697j24315J48088K31037J9283r0267
16478A35462J05328K4020R6781J36494K59609L49779N36816L03728J11279O7947
16468B127243n5847k12070l18778m76250l33818l17682l7412j22072j24123j6601
$$ plain form
16458 112590 187702 232911 185977 35383 -17738 -5041 -5867 -43268 -77018 -253110 -347070
16447 -347070 -183679 -88189 2601 123812 113770 166373 68848 21194 33636 59797 17858
16436 17858 -97228 -129179 -94169 14882 -126203 -72624 85151 118132 102003 28682 17395
16425 17395 -13835 -23903 -220953 -272156 -153281 -225238 -211818 -174516 18985 66297 76629
16414 76629 114822 58339 -65298 -121612 -69722 -74674 -59347 -26925 -48616 -49584 -60550 -18468
16402 -18468 -241578 -354354 -246388 -183317 -69466 -121855 -77893 -85065 -144277 -127531 -185890
16391 -185890 -100355 -130492 -120050 -131223 -199293 -315856 -332266 -348521 -308024 -165909 -295330
16380 -295330 -252205 -144399 -26440 -6196 96092 390178 292433 57050 -116715 -97355
$$ packed form
16458A12590P5112M5209m6934j50594n3121J2697q26l7401l3750j76092r3960
16447c47070J63391R5490R0790J21211j0042N2603r7525m7654J2442K6161m1939
16436A7858j15086l1951L5010J09051j41085N3579J57775L2981j6129p3321j1287
16425A7395l1230j0068j97050n1203J18875p1957J3420L7302J93501M7312J0332
16414G6629L8193n6483j23637n6314N1890m952J5327L2422k1691r68j0966M2082
16402a8468k23110j12776J07966O3071J13851n2389M3962p172n9212J6746n8359
16391a85890Q5535l0137J0442j1173o8070j16563j6410j6255M0497J42115j29421
16380b95330M3125J07806J17959K0244J02288K94086r7745k35383j73765J9360
$$ plain form
16370 -97355 -123876 -116809 -105078 -201381 -118871 52058 25823 46322 60537 -231573 -243639
16359 -243639 -85591 -92085 -84879 5612 169102 190913 67214 -114779 -199353 -134353 -22718
16348 -22718 134829 -28355 -45829 -40653 -23067 -58983 60118 111520 66172 -51004 -164114
16337 -164114 -275634 -162560 44636 -38154 -183260 -234498 -310569 -386829 -317125 -399830 -248458
16326 -248458 -361163 -407163 -425748 -536588 -514348 -369428 -252197 -105698 -90920 -37317
16316 -37317 110464 122327 75244 -14443 53572 -84261 -33158 88744 59491 -13177 -1125
16305 -1125 153435 95727 89375 12375 -35026 -169294 -280722 -276229 -285006 -404005 -412360 -305057
16293 -305057 -446889 -381724 -302968 -469887 -543190 -383259 -307105 -336626 -231067 -234936 -141484
$$ packed form
16370i7355k6521P067J1731r6303Q2510J70929k6235K0499J4215k92110j2066
16359b43639J58048o494P206R0491J63490K1811j23699j81993q4574O5000J11635
16348b2718J57547j63184j7474N176J7586l5916J19101N1402m5348j17176j13110
16337a64114j11520J13074K07196q2790j45106n1238p6071p6260O9704q2705J51372
16326b48458j12705m6000j8585j10840K2240J44920J17231J46499J4778N3603
16316c7317J47781J1863m7083q9687O8015j37833N1103J21902k9253p2668J2052
16305a125J54560n7708o352p7000m7401j34268j11428M493q777j18999q355J07303
16293c05057j41832O5165P8756j66919p3303J59931P6154k9521J05559l869R3452
$$ plain form
16282 -141484 -58044 82686 51686 -60269 -71922 -195670 -303696 -346755 -212068 -54919
16272 -54919 91001 263630 212546 217343 366633 325639 195534 -40581 -270259 -325778 -269904
16261 -269904 -373310 -398363 -209149 31535 13894 -58968 -218532 -437087 -393065 -278172
16251 -278172 -207058 -72890 60583 134807 40308 -13385 21547 -80848 -169901 -206292 -62352
16240 -62352 34782 -38250 107340 210766 23521 -20852 -65657 -56541 -45703 -20068 82857
16229 82857 11095 2652 92583 101138 -99893 -175450 -266307 -349394 -352519 -260274 -206204 -62952
16217 -62952 -33123 -16313 83372 -9931 30850 -9901 58806 30225 -9040 -75934 -122010 -165426
16205 -165426 -262774 -284551 -234943 -185153 -139467 -98050 -114095 -182440 -186689 -82558 -25682
$$ packed form
16282a41484Q3440J40730l1000j11955j1653j23748j08026m3059J34687J57149
16272e4919J45920J72629n1084M797J49290m0994j30105k36115k29678n5519N5874
16261b69904j03406k5053J89214K40684j7641p2862j59564k18555M4022J14893
16251b78172P1114J34168J33473P4224r4499n3693L4932j02395q9053l6391J43940
16240f2352R7134p3032J45590J03426j87245m4373m4805R116J0838K5635J02925
16229H2857p1762q443Q9931Q555k01031p5557r0857q3087l125R2245N4070J43252
16217f2952K9829J6810R9685r3303M0781m0751O8707k8581l9265o6894m6076m3416
16205a65426r7348k1777M9608M9790M5686M1417j6045o8345m249J04131N6876
$$ plain form
16194 -25682 -99980 -101103 -257973 -382916 -402074 -403739 -211522 -115667 -45838 -99093 -207835
16183 -207835 -74474 9952 48460 -30127 -239277 -1113 -73415 -20941 146748 150471 91865
16172 91865 164278 243629 93672 -144368 -119169 17750 -92073 -44929 -42526 -27178 -64230
16161 -64230 -128726 -290631 -273284 -28710 91679 -31947 13734 -105762 -246471 -198317
16151 -198317 -167498 -87899 -181468 -188874 -82411 80281 63364 -143830 -192728 -150145 152636
16140 152636 304670 369021 278656 116406 -68272 -46374 -25105 -4442 43124 -28758 -19616
16129 -19616 167120 254698 203271 88162 -82023 -112994 -16590 -118090 -252872 -201609 -212109
16118 -212109 -157726 8464 83408 -91151 -208537 -201858 -201723 -178059 -175592 -131246 -36493 -46994
$$ packed form
16194b5682p4298j123j56870j24943j9158j665J92217R5855O9829n3255j08742
16183b07835J33361Q4426L8508p8587k09150K38164p2302N2474J67689L723n8606
16172I1865P2413P9351j49957k38040K5199J36919j09823M7144K403J5348l7052
16161f4230o4496j61905J7347K44574J20389j23626M5681j19496j40709M8154
16151a98317L0819P9599r3569p406J06463J62692j6917k07194m8898M2583L02781
16140A52636J52034O4351r0365j62250j84678K1898K1269K0663M7566p1882R142
16129a9616J86736Q7578n1427j15109j70185l0971R6404j01500j34782N1263j0500
16118b12109N4383J66190P4944j74559j17386O679J35K3664K467M4346R4753j0501
$$ plain form
16106 -46994 -241417 -275267 -47258 -49774 -45423 87425 159904 68785 32968 18456 -185778
16095 -185778 -275126 -283170 -76430 -53171 -49056 -154126 -135018 -230376 -320529 -322831 -445258
16084 -445258 -568804 -485632 -321895 -390321 -388103 -238671 -184085 -226434 -230227 -130388 -167162
16073 -167162 -58206 -10933 4621 45441 115582 140522 26052 -63490 -153701 -362627 -359353
16062 -359353 -218444 -174039 -225346 -194680 -298948 -312253 -196013 -36663 -48794 -204271
16052 -204271 -271754 -265825 -234945 -178582 98820 -4821 -135062 -183052 -149972 -68116 -91109
16041 -91109 -54056 8311 -132503 -197769 -255032 -276903 -318035 -266599 -247372 -222969 -191716
16030 -191716 -260310 -95132 -54911 -260409 -281448 -165893 83200 102517 7836 51469 -27351
$$ packed form
16106d6994j94423l3850K28009k516M351J32848P2479r1119l5817j4512k04234
16095a85778q9348q044K06740K3259M115j05070J9108r5358r0153k302j22427
16084d45258j23546Q3172J63737o8426K218J49432N4586m2349l793R9839l6774
16073a67162J08956M7273J5554M0820P0141K4940j14470q9542r0211k08926L274
16062c59353J40909M4405n1307L0666j04268j3305J16240J59350j2131j55477
16052b04271o7483N929L0880N6363K77402j03641j30241m7990L3080Q1856k2993
16041i1109L7053O2367j40814o5266n7263k1871m1132N1436J9227K4403L1253
16030a91716o8594J65178M0221k05498k1039J15555K49093J9317r4681M3633p8820
$$ plain form
16019 -27351 -162120 -327415 -199307 -91537 9398 -149129 -178238 43028 182337 85086
16009 85086 26818 68423 78804 155829 191773 74894 -7603 -100659 42755 114820 75819
15998 75819 -49702 105669 130760 -27509 -208618 -169653 -59431 -76487 -122696 -231503
15988 -231503 -183983 -127713 -48179 -82210 -70384 73968 98450 -112522 -197540 -357210 -466240
15977 -466240 -254250 -153565 -216627 -165572 -25004 149937 -632 2064 205066 134647
15967 134647 101871 135759 84995 63410 60158 -44818 84435 149223 141717 -48752 -5271
15956 -5271 -115360 -228485 -394905 -329481 -251264 -103787 -38195 -21177 94457 -53737 -142382
15945 -142382 -84177 4500 -82987 -146747 -97360 46502 192578 237283 140472 90081 128007
$$ packed form
16019b7351j34769j65295J28108J07770J00935j58527k9109K21266J39309r7251
16009H5086n8268M1605J0381P7025L5944j16879q2497r3056J43414P2065l9001
15998G5819j25521J55371K5091j58269j81109L8965J10222j7056m6209j08807
15988b31503M7520N6270P9534l4031J1826J44352K4482k10972q5018j59670j09030
15977d66240K11990J00685o3062N1055J40568J74941j50569K696K03002p0419
15967A34647l2776L3888n0764k1585l252j04976J29253O4788p506j90469M3481
15956e271j10089j13125j66420O5424P8217J47477O5592J7018J15634j48194q8645
15945a42382N8205Q8677q7487o3760M9387J43862J46076M4705r6811n0391L7926
$$ plain form
15934 128007 142641 28333 -56880 17490 9480 -31762 39640 -81144 -212167 -145853 -12666
15923 -12666 12653 66793 273656 215489 215383 294539 423270 235284 138702 87858 55761
15912 55761 -14947 -175024 -277034 -383230 -459808 -418754 -346310 -358031 -339037 -245367 -37817
15901 -37817 144606 223505 75547 645 -74966 -146310 -143756 40686 69217 74098 -19787
15890 -19787 -143015 -243117 -175890 -97211 -85221 -88310 -178527 -167780 -118713 -105385 -240572
15879 -240572 -318723 -367391 -324680 -203512 -134141 -386209 -429348 -451964 -481470 -254868 25790
15868 25790 237831 241015 187188 82955 100364 -28419 -159193 -73049 -22149 -81437 -193364
15857 -193364 -185646 -88553 68914 18333 -35518 166770 252026 14554 -149063 -119541 -142063
$$ packed form
15934A28007J4634j14308q5213P4370q010m1242P1402j20784j31023O6314J33187
15923a2666K5319N4140K06863n8167j06P9156J28731j87986r6582n0844l2097
15912E5761p0708j60077j02010j06196p6578M1054P2444j1721J8994R3670K07550
15901c7817J82423P8899j47958p4902p5611p1344K554J84442K8531M881r3885
15890a9787j23228j00102O7227P8679J1990l089r0217J0747M9067J3328j35187
15879b40572p8151m8668M2711J21168O9371k52068m3139k2616k9506K26602K80658
15868B5790K12041L184n3827j04233J7409j28783j30774Q6144N0900n9288j11927
15857a93364P718R7093J57467n0581n3851K02288Q5256k37472j63617K9522k2522
$$ plain form
15846 -142063 -161042 -152505 -200496 -125084 -189986 -259559 -255740 -214596 -262680 -134335 -26056
15835 -26056 18773 94146 139382 53339 37256 24478 -12236 -78652 30558 136713 333514
15824 333514 275397 56418 102264 202011 33959 139370 198477 133055 90381 85510 141429
15813 141429 167425 151168 21885 -2204 -136885 -164079 -98922 -5314 28731 72776 50178
15802 50178 110343 153710 19778 13936 62525 134894 22875 -100193 -157834 -211506 -241066
15791 -241066 -146837 -123426 8620 46478 84134 -36782 -193111 -122085 -4552 -110012
15781 -110012 -158861 -140071 -97791 -116983 -150771 -58054 21792 -25280 -108826 -47027 93762
15770 93762 129199 58382 99994 250720 243583 39899 128398 49378 -58944 -135404 25001
$$ packed form
15846a42063j8979Q537m7991P5412o4902o9573L819M1144m8084J28345J08279
15835b6056M4829P5373M5236q6043j6083j2778l6714o6416J09210J06155J96801
15824C33514n8117k18979M5846R9747j68052J05411N9107o5422m2674m871N5919
15813A41429K5996j6257j29283k4089j34681k7194O5157R3608L4045M4045k2598
15802E0178O0165M3367j33932n842M8589P2369j12019j23068n7641n3672k9560
15791b41066R4229K3411J32046L7858L7656j20916j56329P1026J17533j05460
15781a10012m8849J8790M2280j9192l3788R2717P9846m7072q3546O1799J40789
15770I3762L5437p0817M1612J50726p137k03684Q8499p9020j08322p6460J60405
$$ plain form
15759 25001 103736 63306 -66851 -87274 -113871 -242392 -97845 36657 50131 -30302 -81734
15748 -81734 103224 220461 197325 257936 303171 166164 111111 99429 198677 79845 -14799
15737 -14799 -51083 -122001 -217976 -106539 34962 160574 -1807 -42658 30662 82634 10072
15726 10072 -133575 -232302 -129783 26579 -22830 -50185 -196376 -230426 -168515 -184220 -244011
15715 -244011 -131821 -171074 -181231 -161789 -150697 -188730 -241910 -203962 -225985 -127625 -69975
15704 -69975 -87148 -88024 54250 50735 -112460 -226600 -244637 -285018 -250540 -24981 129215
15693 129215 63204 -39761 -114931 -102670 -72060 -65545 -18580 5820 -118858 -181629 -331613
15682 -331613 -324034 -156082 -128690 -215169 -40435 325258 210148 -5525 -59498 -199123
$$ packed form
15759B5001P8735m0430j30157k0423k6597j28521J44547J34502J3474q0433n1432
15748h1734J84958J17237k3136O0611M5235j37007n5053j1682R9248j18832r4644
15737a4799l6284p0918r5975J11437J41501J25612j62381m0851P3320N1972p2562
15726A0072j43647r8727J02519J56362m9409k7355j46191l4050O1911j5705n9791
15715b44011J12190l9253j0157J9442J1092l8033n3180L7948k2023R8360N7650
15704f9975j7173q76J42274l515j63195j14140j8037m0381L4478K25559J54196
15693A29215o6011j02965p5170J2261L0610O515M6965K4400j24678o2771j49984
15682c31613P579J67952K7392q6479J74734L65693j15110k15673n3973j39625
$$ plain form
15672 -199123 -76364 -40742 -81973 -1256 -7480 -142564 -183129 -124058 -99943 -120767 -160901
15661 -160901 -129967 -180391 -256246 -306857 -163078 -84444 -184370 -281486 -202866 -139086 -7919
15650 -7919 51035 41687 -33560 140860 420430 489640 426255 329457 174985 189344 213865
15639 213865 252845 424641 352876 178039 259291 160292 126356 53929 122960 135083 60810
15628 60810 162784 280143 321574 162454 152153 148993 239589 270840 189317 168798 146491
15617 146491 40178 56377 142966 213938 115947 212901 13741 -66471 -51908 -164696 -119428
15606 -119428 -175965 -175766 -67237 40710 -35628 -166528 -287476 -347819 -208891 -92004 -150221
15595 -150221 -132264 -57103 -27568 -117099 50877 146020 115059 20472 17812 -98068 -272108
$$ packed form
15672a99123J22759L5622m1231Q0717o224j35084m0565N9071K4115k0824m0134
15661a60901L0934n0424p5855n0611J43779P8634r9926r7116P8620O3780J31167
15650g919N8954r348p5247J74420K79570O9210o3385r6798j54472J4359K4521
15639B13865L8980J71796p1765j74837Q1252r8999l3936p2427O9031J2123p4273
15628F0810J01974J17359M1431j59120j0301l160R0596L1251q1523k0519k2307
15617A46491j06313J6199Q6589P0972r7991R6954j99160q0212J4563j12788M5268
15606a19428n6537J99J08529J07947p6338j30900j20948o0343J38928J16887n8217
15595a50221J7957P5161K9535q9531J67976R5143l0961r4587k660j15880j74040
$$ plain form
15584 -272108 -361342 -268731 -74020 34229 86543 -95628 -202622 -223368 -214107 -77430 -88642
15573 -88642 -80121 -47236 -128007 -43382 -68198 -69514 -103650 -58107 -1340 55842 -38100 5722
15561 5722 75302 -12549 -165577 -78369 -70043 -32781 -68295 -80717 -77010 -88304 -38749 101420
15549 101420 312008 178304 53925 123255 85965 210939 231466 406751 361019 221296
15539 221296 94837 -28951 -160909 -183770 -61382 -58568 -89191 59462 132600 156805 29746
15528 29746 -77853 -82039 -80531 -183453 -281262 -352601 -308605 -236759 -186122 -7056 271372
15517 271372 222678 25307 -63314 -59556 41697 63832 113593 65186 245309 232657 291731
15506 291731 312941 370233 340259 154605 91416 64525 11182 -12265 -43431 -69665 -142833
$$ packed form
15584b72108q9234R2611J94711J08249N2314j82171j06994k0746R261J36677j1212
15573h8642Q521L2885q0771Q4625k4816j316l4136M5543N6767N7182r3942M3822
15561E722O9580q7851j53028Q7208Q326L7262l5514j2422L707j1294M9555J40169
15549A01420K10588j33704j24379O9330l7290J24974K0527J75285m5732j39723
15539B21296j26459j23788j31958k2861J22388K814l0623J48653P3138K4205j27059
15528B9746j07599m186J508j02922r7809p1339M3996P1846N0637J79066K78428
15517B71372m8694j97371q8621L758J01253K2135M9761m8407J80123j2652N9074
15506B91731K1210N7292k9974j85654o3189k6891n3343k3447l1166k6234p3168
$$ plain form
15495 -142833 34787 129208 90152 -131901 -209806 -347529 -336686 -334161 -329495 -193932 -192469
15484 -192469 -230410 -112646 -75131 -175711 -65345 29496 -137863 -293772 -279847 -301591
15474 -301591 -294805 -125452 -207708 -219421 -74685 -9750 -176526 -244192 -185638 -190741 -315442
15463 -315442 -184289 -129739 -87329 -83734 -83129 108766 169641 -61728 26563 87163 69260
15452 69260 50981 28996 85776 124076 7223 -108880 -118534 -70720 -28434 14260 -79568
15441 -79568 -115298 11130 19150 56712 -62391 -74674 114770 160164 175734 219336 171423
15430 171423 214774 186756 -64808 -78597 -45504 -56304 58622 111007 -84071 -80506 -64648
15419 -64648 -189021 -110776 -136927 -150722 -105677 -135927 -129966 -90061 -72473 -227515 -129334
$$ packed form
15495a42833J77620R4421l9056k22053p7905j37723J0843K525M666J35563J463
15484a92469l7941J17764L7515j00580J10366R4841j67359j55909J3925k1744
15474c01591O786J69353q2256j1713J44736O4935j66776o7666N8554n103j24701
15463c15442J31153N4550M2410L595O05J91895O0875k31369Q8291O0600j7903
15452F9260j8279k1985N6780L8300j16853j16103r654M7814M2286M2694r3828
15441g9568l5730J26428Q020L7562j19103j2283J89444M5394J5570M3602m7913
15430A71423M3351k8018k51564j3789L3093j0800J14926N2385j95078L565J5858
15419f4648j24373P8245k6151j3795M5045l0250N961L9905J7588j55042R8181
$$ plain form
15408 -129334 -996 48754 -188716 -405042 -272046 -70215 -24427 95429 32870 -845
15398 -845 18083 98364 175698 153171 159258 135980 -77407 -173733 -145947 -13630 203268 218143
15386 218143 150694 136121 79192 -146734 -139992 -72904 -56875 -70825 -136854 64718 29613
15375 29613 -52140 -90266 -60567 -66191 -38480 -42492 -180346 -113552 34578 25802 -96655 -142862
15363 -142862 -87228 -40876 -63696 -209901 -318777 -318743 -282997 -122442 134905 165220 -82022
15352 -82022 -200699 -228869 -305610 -189343 -49754 -123195 -183434 -65283 59491 -50545
15342 -50545 -45903 26106 -29422 -90921 -60403 -60241 8920 -24930 15826 -19502 -114172 -32885
15330 -32885 64231 103341 85996 -61850 -105149 -89864 -110294 -97891 77238 58039 -44026
$$ packed form
15408a29334J28338M9750k37470k16326J32996K01831M5788J19856o2559l3715
15398h45J8928Q0281P7334k2527O087k3278k13387r6326K7786J32317K16898J4875
15386B18143o7449j4573n6929k25926O742O7088J6029j3950o6029K01572l5105
15375B9613q1753l8126K9699n624K7711m012j37854O6794J48130q776j22457m6207
15363a42862N5634M6352k2820j46205j08876L4L5746J60555K57347L0315k47242
15352h2022j18677k8170p6741J16267J39589p3441o0239J18151J24774j10036
15342e0545M642P2009n5528o1499L0518J62O9161l3850M0756l5328r4670Q1287
15330c2885R7116L9110j7345j47846m3299J5285k0430J2403J75129j9199j02065
$$ plain form
15319 -44026 -89433 -123173 -181440 -74520 146560 -5514 -120369 -184281 -177029 -68890 32735
15308 32735 46431 57829 -65512 120734 147511 63318 3712 -8197 14270 107362 269876
15297 269876 224797 14205 14309 178054 168984 114732 84989 12750 -95484 -108894 -187534
15286 -187534 -250941 -74445 37677 119425 -182825 -367083 -174242 -153039 -203552 -227609
15276 -227609 -202417 -60915 -28084 -143465 -150663 -180889 -348821 -438367 -375019 -346740 -372786
15265 -372786 -196520 43270 29698 -32833 -23538 32563 78536 -70031 -177256 -190778 -241672
15254 -241672 -265402 -251952 -192921 -99717 85967 -554 -25406 108861 225512 211495 46599
15243 46599 -757 24812 233283 239150 193976 194421 80329 -156404 1982 317806 351912
$$ packed form
15319d4026m5407l3740n8267J06920K21080j52074j14855o3912P252J08139J01625
15308C2735J3696J1398j23341J86246K6777q4193n9606j1909K2467R3092J62514
15297B69876m5079k10592J04J63745r070n4252k9743p2239j08234j3410p8640
15286a87534o3407J76496J12122Q1748l02250j84258J92841K1203n0513k4057
15276b27609K5192J41502L2831j15381p198l0226j67932q9546O3348K8279k6046
15265c72786J76266K39790j3572o2531R295N6101M5973j48567j07225j3522n0894
15254b41672k3730J3450N9031R3204J85684q6521k4852J34267J16651j4017j64896
15243D6599m7356K5569K08471N867m5174M45j14092k36733J58386L15824L4106
$$ plain form
15232 351912 82276 -36466 -93592 -164611 -216834 -265020 -172500 -150897 -101250 -205093 -183635
15221 -183635 42639 116099 -85646 -149668 -88272 -43911 -39418 -18216 12848 -87108 -275295
15210 -275295 -261100 -147962 39412 -13762 -83399 -36806 -94083 -28739 81816 -113437 -206231
15199 -206231 -203342 -221574 -333659 -382223 -379491 -308372 -75628 116302 149399 233143 79362
15188 79362 -154570 -90918 -40873 -110175 -110261 -74713 -113005 -118497 -101819 -182528 -313778 -215499
15176 -215499 43118 161470 118481 -54399 -47072 31622 141619 142999 -52148 -113920 19063
15165 19063 112815 96908 121367 53388 -161545 -208280 -219123 -146663 -44444 -101239 -76218
15154 -76218 18428 -7216 20308 50070 -22472 31884 84352 108329 130866 92936 294787
$$ packed form
15232C51912k69636j18742n7126p1019n2223m8186R2520K1603M9647j03843K1458
15221a83635K26274P3460k01745o4022O1396M4361M493K1202L1064r9956j88187
15210b75295J4195J13138J87374n3174o9637M6593n7277O5344J10555j95253r2794
15199b06231K889j8232j12085m8564K732P1119K32744J91930L3097Q3744j53781
15188G9362k33932O3652N0045o9302q6L5548l8292n492J6678q0709j31250R8279
15176b15499K58617J18352m2989j72880P327P8694J09997J380j95147o1772J32983
15165A9063R3752j5907K4459o7979k14933m6735j0843P2460J02219n6795K5021
15154g6218R4646k5644K7524K9762p2542N4356N2468K3977K2537l7930K01851
$$ plain form
15143 294787 248507 133342 238123 198401 134772 104638 133141 97174 -57938 -46774 72853
15132 72853 123383 150489 156173 35011 -71522 -386695 -327811 -196762 -221859 -284963 -127648
15121 -127648 161805 166479 -19307 -67903 8493 -41480 -22543 190484 229068 120465 -61420
15110 -61420 151086 232743 73200 -140895 -156938 -80271 -43958 44556 -181132 -180874 40075
15099 40075 -77993 -236300 -141916 -12441 -52727 -37486 71459 12121 106166 299176 254602
15088 254602 160372 32721 69702 38212 5237 -123015 -61968 115473 81300 -74786 -174058
15077 -174058 -96083 -162717 -217388 -44175 97646 116229 18395 -46166 -86346 -5549 -46292
15066 -46292 -145399 -172436 -278003 -352306 -243987 -121783 -95583 -16372 -23607 -13057 83808
$$ packed form
15143B94787m6280j15165J04781l9722o3629l0134K8503l5967j55112J1164J19627
15132G2853N0530K7106N684j21162j06533l15173N8884J31049k5097o3104J57315
15121a27648K89453M674j85786m8596P6396m9973J8937K13027L8584j08603j81885
15110f1420K12506Q1657j59543k14095j6043P6667L6313Q8514k25688K58K20949
15099D0075j18068j58307R4384J29475m0286J5241J08945n9338R4045J93010m4574
15088B54602r4230j27651L6981l1490l2975j28252O1047J77441l4173j56086r9272
15077a74058P7975o6634n4671J73213J41821J8583r7834o4561m0180Q0797m0743
15066d6292r9107k7037j05567p4303J08319J22204K6200P9211p235J0550R6865
$$ plain form
15055 83808 144189 4574 -170690 -219190 -198131 -199588 -308688 -230116 4401 42126 -137735
15044 -137735 -242310 -212153 -85164 -134583 -296016 -344945 -408009 -331084 -207950 -38258
15034 -38258 -21821 -94250 -226402 -258027 -51924 -21853 -25371 47886 71835 154582 146751 101738
15022 101738 214069 117028 -99006 -117854 67765 106398 -29110 -46053 -122113 -92390 -71068
15011 -71068 -113906 -180770 -264841 -296245 -145304 42267 8051 -81097 90307 233148 155862
15000 155862 78318 98813 -35465 -141446 -134771 -251884 -352440 -339745 -45806 -63670 -135598
14989 -135598 -23832 -124215 -72343 -40987 -21232 -15641 54381 70609 138346 9334 -89707
14978 -89707 -183444 -253845 -319465 -191170 -71953 -117363 -101332 -137303 -262743 -299232 -114948
$$ packed form
15055H3808O0381j39615j75264m8500K1059j457j09100P8572K34517L7725j79861
15044a37735j04575L0157J26989m9419j61433m8929o3064P6925J23134J69692
15034c8258J6437p2429j32152l1625K06103L0071l518P3257K3949Q2747p831m5013
15022A01738J12331r7041k16034j8848J85619L8633j35508j6943p6060K9723K1322
15011g1068m2838o6864q4071l1404J50941J87571l4216q9148J71404J42841p7286
15000A55862p7544K0495j34278j05981O675j17113j00556J2695K93939j7864p1928
14989a35598J11766j00383N1872L1356J9755N591P0022J6228O7737j29012r9041
14978h9707r3737p0401o5620J28295J19217m5410J6031l5971j25440l6489J84284
$$ plain form
14967 -114948 78038 128853 175870 174466 109764 18123 77635 320975 236186 94259 -40476
14956 -40476 -141460 -212433 -299464 -327642 -268144 -32129 -111460 17205 43032 -36381 -101908
14945 -101908 -159444 -156433 -52506 89531 91910 79848 177621 131847 -67844 -71853 -1032
14934 -1032 -38779 -77593 -163208 -16849 100669 152559 189627 141622 111719 201512 214473
14923 214473 52519 -185939 -81830 40083 -26035 -1056 53111 -18709 -80380 -7691 -159941
14912 -159941 -200321 -111600 9905 61268 125427 245580 139024 107329 125133 -10924 -26967
14901 -26967 51577 -45699 -93285 -88285 11255 5195 -109842 -228080 -146816 -73783 -170401 -133217
14889 -133217 63 -75937 -44058 -14405 15360 -1758 -21935 -162388 -217510 -55038 -15280
$$ packed form
14967a14948J92986N0815M7017j404o4702r1641N9512K43340q4789j41927j34735
14956d0476j00984p0973q7031k8178N9498K36015p9331J28665K5827p9413o5527
14945a01908n7536L011J03927J42037K379j2062R7773m5774j99691m009P0821
14934a032l7747l8814q5615J46359J17518N1890L7068m8005k9903Q9793J2961
14923B14473j61954k38458J04109J21913o6118K4979N4167p1820o1671P2689j52250
14912a59941m0380Q8721J21505N1363O4159J20153j06556l1695J7804j36057j6043
14901b6967P8544r7276m7586N000R9540o060j15037j18238Q1264P3033r6618L7184
14889a33217J33280p6000L1879K9653K9765j7118k0177j40453n5122J62472L9758
$$ plain form
14878 -15280 -138249 -278415 -106798 -42642 -21136 -180738 -102201 70138 198699 233120
14868 233120 219736 289217 105795 -222568 -23868 -53624 -174673 -178153 -80191 -34908 44010
14857 44010 35711 -27143 -137483 -83249 -145203 -59790 34045 150568 13967 24523 131293
14846 131293 104743 28069 -57443 -49029 28752 -66166 -121528 -52503 -178500 -162261 -7878
14835 -7878 18251 -18115 -179097 -52521 58895 -13330 -37124 -23197 -66068 -160177 -149568
14824 -149568 -207088 -166576 -188092 -192851 -291700 -155413 86291 20896 -2236 37129 -8364
14813 -8364 17242 78427 1717 -186497 -271233 -232272 -71581 -16791 -201434 -102015 -42182
14802 -42182 -50808 -133462 -222781 -272172 -265812 -123834 -149360 -47072 174841 319792 122610
$$ packed form
14878a5280j22969j40166J71617O4156K1506j59602P8537J72339J28561L4421
14868B33120j3384O9481j83422l28363J98700k9756j21049l480R7962M5283P8918
14857D4010q299o2854j10340N4234o1954Q5413R3835J16523j36601J0556J06770
14846A31293k6550p6674q5512Q414P7781r4918n5362O9025j25997J6239J54383
14835g878K6129l6366j60982J26576J11416p2225k3794J3927m2871r4109J0609
14824a49568n7520M0512k1516m759r8849J36287K41704o5395k3132L9365m5493
14813h364K5606O1185p6710j88214q4736L8961J60691N4790j84643R9419N9833
14802d2182q626q2654q9319m9391O360J41978k5526J02288K21913J44951j97182
$$ plain form
14791 122610 633 53998 33282 -2028 52136 19771 -199435 -195132 -71681 -75990 -47969
14780 -47969 -17214 -82667 -258041 -250423 -28591 132481 104074 -124013 -107456 -77970 -70741
14769 -70741 -121978 -61140 -124494 -58811 -16576 -10371 -116350 -135561 -64348 -36910 -122280 -181105
14757 -181105 -115734 -151383 79874 239052 150668 47735 -45801 -147063 -15896 3846
14747 3846 139526 222673 178988 105123 12636 -130869 -106322 -16010 -122920 7916 170310
14736 170310 206062 255179 250021 266812 240613 319750 231994 39878 113403 203791 280215
14725 280215 358559 496137 598480 653792 868628 988333 837174 839741 917371 988849 820706
14714 820706 930987 1123488 1038956 926255 903659 930345 1032860 1006664 1042912 1086460 1123094
$$ packed form
14791A22610j21977N3365k0716l5310N4164l2365k19206M303J23451m309K8021
14780d7969L0755o5453j75374P618K21832J61072k8407k28087J6557K9486P229
14769g0741n1237O0838o3354O5683M2235O205j05979j9211P1213K7438q5370n8825
14757a81105O5371l5649K31257J59178q8384j02933r3536j01262J31167J9742
14747C846J35680Q3147m3685p3865r2487j43505K4547R0312j06910J30836J62394
14736A70310L5752M9117n158J6791k6199P9137q7756j92116P3525R0388P6424
14725B80215P8344J37578J02343N5312K14836J19705j51159K567P7630P1478j68143
14714H20706J10281J92501q4532j12701k2596K6686J02515k6196L6248M3548L6634
$$ plain form
14703 1123094 1163418 1124211 910990 774619 906463 852990 741647 795693 976477 1060785
14693 1060785 917733 952413 1192294 1266102 1318209 1209600 1092262 1092891 910594 839278 833813
14682 833813 734983 914267 1060167 940025 820171 563794 467368 508104 559339 618346
14672 618346 710905 486096 351992 429655 579724 569517 401615 236839 85824 -4656
14662 -4656 71888 84118 56633 -57527 -217966 -107192 24005 76877 204190 348036 463610
14651 463610 341379 119549 5965 190183 380245 534157 488780 284689 280687 107430
14641 107430 116932 32637 136322 260661 228806 140639 155872 256725 359873 301618 162241
14630 162241 167684 127138 92854 224638 233988 297014 349814 327397 241973 -47339 -92782
$$ packed form
14703A123094M0324l9207k13221j36371J31844n3473j11343N4046J80784Q4308
14693A060785j43052L4680K39881P3808N2107j08609j17338O29j82297p1316n465
14682H33813r8830J79284J45900j20142j19854k56377r6426M0736N1235N9007
14672F18346R2559k24809j34104P7663J50069j0207j67902j64776j51015r0480
14662d656P6544J2230k7485j14160j60439J10774J31197N2872J27313J43846J15574
14651D63610j22231k21830j13584J84218J90062J53912m5377k04091m002j73257
14641A07430R502q4295J03685J24339l1855q8167J5233J00853J03148n8255j39377
14630A62241N443m0546l4284J31784R350O3026N2800k2417q5424k89312m5443
$$ plain form
14619 -92782 138985 246908 181749 4588 -41147 49013 37581 -75794 -68363 -26576 -87127
14608 -87127 -80827 30183 24157 72994 174835 301873 430971 416965 280243 180128 194033
14597 194033 118768 187085 436088 179834 288 -98736 -38839 67709 -114775 -230420
14587 -230420 -152615 -69976 -66525 -212522 -208653 -326431 -234798 -41269 77847 -20513 9121
14576 9121 137112 110851 54714 23549 34859 20705 115315 238706 55943 -69387 -24710
14565 -24710 -18000 48041 31557 -32992 276472 436101 347373 330606 261210 112410 25950
14554 25950 15688 14544 43526 153019 241126 219319 384587 403198 399922 170030 101327
14543 101327 31190 208616 13873 -100358 -191022 -281836 -154589 -1227 150256 289782
$$ packed form
14619i2782K31767J07923o5159j77161m5735R0160j1432j13375P431M1787o0551
14608h7127O300J11010o026M8837J01841J27038J29098j4006j36722j00115J3905
14597A94033p5265O8317K49003k56254j79546r9024N9897J06548j82484j15645
14587b30420P7805Q2639L451j45997L869j17778R1633J93529J19116r8360K9634
14576I121J27991k6261n6137l1165J1310j4154R4610J23391j82763j25330M4677
14565b4710O710O6041j6484o4549L09464J59629q8728j6767o9396j48800q6460
14554B5950j0262j144K8982J09493Q8107k1807J65268J8611l276k29892o8703
14543A01327p0137J77426j94743j14231r0664r0814J27247J53362J51483J39526
$$ plain form
14533 289782 237011 324401 399696 373252 282692 166933 131031 92229 116616 101021 129536
14522 129536 170086 193721 142303 129834 206723 200305 209781 278957 346161 413671 601360 562384
14510 562384 484434 459160 552724 544081 693516 641861 563989 590798 617398 374269 138252
14499 138252 103216 166254 179761 271517 308717 227448 268786 444706 552786 552780 454117 296225
14487 296225 276209 332932 391370 414546 467040 296165 199838 303097 319964 368348 418650
14476 418650 424144 381992 286412 268694 304309 402903 442277 360130 275718 231415 343892
14465 343892 462060 411560 356379 394018 295812 232806 261194 276999 354374 317658 51909
14454 51909 140835 281059 522755 566913 528196 320560 229033 213539 111368 142321 32264
$$ packed form
14533B89782n2771Q7390P5295k6444r0560j15759l5902l8802K4387j5595K8515
14522A29536M0550K3635n1418j2469P6889o418R476O9176O7204O7510J87689l8976
14510E62384p7950k5274R3564q643J49435n1655p7872K6809K6600k43129k36017
14499A38252l5036O3038J3507R1756L7200q1269M1338J75920J08080or8663j57892
14487B96225k0016N6723N8438K3176N2494j70875r6327J03259J6867M8384N0302
14476D18650N494m2152r5580j7718L5615R8594L9374q2147q4412m4303J12477
14465C43892J18168n0500n5181L7639r8206o3006K8388J5805P7375l6716k65749
14454E1909Q8926J40224K41696M4158l8717k07636r1527j5494j02171L0953j10057
$$ plain form
14443 32264 237930 401758 400818 471694 562946 504833 408985 472233 560094 302982 130874
14432 130874 220603 160066 191185 191853 125946 177272 255446 333340 350722 219518 70828
14421 70828 104063 257884 431992 377548 316696 358986 284593 206988 224953 184827 294856
14410 294856 503471 598013 618296 341336 282672 338156 533476 492742 400184 351775 452617
14399 452617 481936 462195 555543 470987 487413 380197 247521 393568 503970 516761 678270
14388 678270 762613 846729 815012 742624 662264 640462 746273 744803 724813 802817 793578 874280
14376 874280 780008 705331 729091 593352 767010 905954 983599 998102 1062857 998951 936350
14365 936350 743748 532483 516750 764147 826747 1001651 1054049 988504 975388 955374 971234
$$ packed form
14443C2264K05666J63828r40P0876R1252n8113r5848O3248Q7861k57112j72108
14432A30874Q9729o0537L1119O68o5907N1326P8174P7894J7382j31204j48690
14421G0828L3235J53821J74108n4444o0852M2290p4393p7605J7965m0126J10029
14410B94856K08615R4542K0283k76960n8664N5484J95320m0734r2558m8409J00842
14399D52617K9319j9741R3348q4556J6426j07216j32676J46047J10402J2791J61509
14388F78270Q4343Q4116l1717p2388q0360k1802J05811j470j9990P8004r239Q0702
14376H74280r4272p4677K3760j35739J73658J38944P7645J4503O4755o3906o2601
14365I36350j92602k11265j5733K47397O2600J74904N2398o5545j3116k0014J5860
$$ plain form
14354 971234 1103204 1115768 1048291 1015674 1015734 1093060 1083141 1222315 1202798 1099888 1080119 1243703
14342 1243703 1472191 1607237 1628621 1531615 1604961 1691605 1647468 1703331 1708928 1818533 1837506
14331 1837506 1939322 1988593 2148995 2262702 2092777 2055322 2220894 2453603 2439085 2507287
14321 2507287 2537245 2751919 2782034 2687812 2669318 2958535 3132837 3158252 3242649 3365522
14311 3365522 3375995 3499172 3638259 3792351 3997106 4169359 4434855 4612664 4704567 4876910
14301 4876910 5042110 5157371 5406713 5853668 6215582 6571672 7017564 7704717 8165357
14292 8165357 8677936 9262193 9918898 10709751 11580997 12494784 13403322 14324898 15596171
14283 15596171 17069853 18458791 20017915 22019485 24365028 26743562 29377043 32258987
$$ packed form
14354I71234J31970J2564o7477l2617O0P7326r919J39174j9517j02910j9769J63584
14342A243703K28488J35046K1384r7006P3346Q6644m4137N5863N597J09605J8973
14331A837506J01816M9271J60402J13707j69925l7455J65572K32709j4518O8202
14321B507287K9958K14674L0115r4222j8494K89217J74302K5415Q4397J22873
14311C365522J0473J23177J39087J54092K04755J72253K65496J77809R1903J72343
14301D876910J65200J15261K49342M46955L61914L56090M45892O87153M60640
14292H165357N12579N84257O56705P90853Q71246R13787R08538R21576J271273
14283A5596171J473682J388938J559124K001570K345543K378534K633481K881944
$$ plain form
14275 32258987 35750290 39759722 44257621 49231714 54709375 60957930 68031418 75491051
14267 75491051 83561469 92043057 100930997 110065032 119381304 128291768 136642720 144042091
14259 144042091 150548624 155860128 160077013 163183645 165005715 165667995 165658002 165247275 164497772
14250 164497772 163450256 162086670 160767007 159611459 158654165 157994925 157693944 157881235
14242 157881235 158369625 159365074 160845230 162406157 164306846 166658205 169181997 171415639
14234 171415639 173713567 175946682 177770142 178823506 178899629 178005827 175939398 172784735
14226 172784735 168248734 162390970 155522239 147983599 139624873 131143260 122489069 114004054
14218 114004054 105724153 97870520 90597737 83756290 77565818 72035878 66890418 62173695
$$ packed form
14275C2258987L491303M009432M497899M974093N477661O248555P073488P459633
14267G5491051Q070418Q481588Q887940R134035R316272Q910464Q350952P399371
14259A44042091O506533N311504M216885L106632J822070O62280r993m10727p49503
14250A64497772j047516j363586j319663j155548r57294o59240l00981J87291
14242A57881235M88390R95449J480156J560927J900689K351359K523792K233642
14234A71415639K297928K233115J823460J053364P6123q93802k066429l154663
14226A72784735m536001n857764o868731p538640q358726q481613q654191q485015
14218A14004054q279901p853633p272783o841447o190472n529940n145460m716723
$$ plain form
14210 62173695 57931278 54000305 50436792 47439910 44748252 42093242 39673430 37558908
14202 37558908 35661769 33893308 32134982 30559913 29339062 28224617 26966133 25943143
14194 25943143 24927498 23936536 23039098 22249829 21395285 20481239 19756420 19003351 18269426
14185 18269426 17443366 16586194 15874988 15187770 14579908 13996372 13382478 12675081 12102584
14176 12102584 11547484 11165561 10615665 10092285 9655553 9026725 8517267 8130163 7728273
14167 7728273 7369289 7128783 6913833 6608167 6232931 6000463 5758769 5518899 5314059
14158 5314059 4951619 4734195 4544188 4370625 4085050 4100821 3964838 3551818 3463768 3307837
14148 3307837 3185879 3195492 3218443 3061146 2864359 2780714 2645624 2576185 2609575 2315349
$$ packed form
14210F2173695m242417l930973l563513k996882k691658k655010k419812k114522
14202C7558908j897139j768461j758326j575069j220851j114445j258484j022990
14194B5943143j015645r90962q97438p89269q54544r14046p24819p53069p33925
14185A8269426q26060q57172p11206o87218o07862n83536o13894p07397n72497
14176A2102584n55100l81923n49896n23380m36732o28828n09458l87104m01890
14167G728273l58984k40506k14950l05666l75236k32468k41694k39870k04840
14158E314059l62440k17424j90007j73563k85575J5771j35983m13020q8050j55931
14148C307837j21958R613K2951j57297j96787q3645j35090o9439L3390k94226
$$ plain form
14138 2315349 2057787 2011635 1903158 1936130 1940314 1970147 1802078 1862802 1802014 1736977 1786289
14127 1786289 1572668 1370887 1236883 1081810 1205786 1243535 1264189 1346550 1102631 959339
14117 959339 951018 1176617 1280931 1211565 1176356 1108098 917961 985623 876312 892435 863812
14106 863812 849063 996739 965159 1038770 852563 522273 389938 527955 656280 664629
14096 664629 718012 779928 688523 668899 611854 676760 666136 756574 616019 424790 347224
14085 347224 498858 627247 670762 619229 596644 548698 539366 558951 583776 515117 462782
14074 462782 446380 441065 409338 550303 603844 584735 554507 528193 626225 672027 658730
14063 658730 640543 518364 371016 321545 465340 670965 712869 686666 674609 659087 755172
$$ packed form
14138B315349k57562m6152j08477L2972M184K9833j68069O0724o0788o5037M9312
14127A786289k13621k01781j34004j55073J23976L7749K0654Q2361k43919j43292
14117I59339q321K25599J04314o9366l5209o8258j90137O7662j09311J6123k8623
14106H63812j4749J47676l1580P3611j86207l30290j32335J38017J28325Q349
14096F64629N3383O1916r1405j9624n7045O4906j0624R0438j40555j91229p7566
14085C47224J51634J28389M3515n1533k2585m7946r332J9585K4825o8659n2335
14074D62782j6402n315l1727J40965N3541j9109l0228k6314R8032M5802j3297
14063F58730j8187j22179j47348m9471J43795K05625M1904k6203j2057j5522R6085
$$ plain form
14052 755172 837550 671844 424603 327310 264355 307891 421926 352001 488050 674924
14042 674924 704838 662482 755060 628861 421639 318871 412246 488620 503606 392220 279248
14031 279248 299178 432944 466114 403156 487824 492187 603911 777115 705764 617827 492745
14020 492745 478969 418610 349554 320362 296576 345660 316416 294361 208222 319314 261047
14009 261047 144712 52233 126385 201540 303833 278036 237166 308284 413012 405175 305331
13998 305331 191265 -38725 84589 -36721 1037 190215 376216 272741 57978 -67730
13988 -67730 -228350 -147334 -53684 -13863 -65711 -22660 -107332 -287221 -345174 -216469 -24618
13977 -24618 -69237 -172912 -47229 207492 223429 196961 131858 137051 146580 24004 -40277
$$ packed form
14052G55172Q2378j65706k47241r7293o2955M3536J14035o9925J36049J86874
14042F74924K9914m2356R2578j26199k07222j02768R3375P6374J4986j11386j12972
14031B79248J9930J33766L3170o2958Q4668M363J11724J73204p1351q7937j25082
14020D92745j3776o0359o9056k9192k3786M9084k9244k2055q6139J11092n8267
14009B61047j16335r2479P4152P5155J02293k5797m0870P1118J04728p837r9844
13998C05331j14066k29990J23314j21310L7758J89178J86001j03475k14763j25708
13988f7730j60620Q1016R3650L9821n1848M3051q4672j79889n7953J28705J91851
13977b4618m4619j03675J25683K54721J5937k6468o5103N193R529j22576o4281
$$ plain form
13966 -40277 68028 170403 200933 8418 -103677 56256 89425 211774 288979 129232
13956 129232 173 -9780 129576 149979 117097 59147 -44095 2893 107847 78706 -20876
13945 -20876 45730 179068 318095 302499 168207 -85719 -161872 -78352 -71793 5266 141836
13934 141836 162390 81336 79567 114874 117448 195934 194831 155692 37898 -104554 -216671
13923 -216671 -141893 -205928 -260193 -141080 -33941 154504 250842 232205 91784 -65861
13913 -65861 183672 365532 267520 114389 135389 152907 90207 42987 -56416 -223972 -118483
13902 -118483 6214 -74836 -322082 -329628 -315743 -240073 -191355 -181861 -172213 35443 122667
13891 122667 98303 56630 25051 -20726 136320 123617 108233 125011 145446 38742 -97812
$$ packed form
13966d0277J08305J02375L0530j92515j12095J59933L3169J22349P7205j59747
13956A29232j29059r953J39356K0403l2882n7950j03242M6988J04954k9141r9582
13945b0876O6606J33338J39027j5596j34292k53926p6153Q3520O559P7059J36570
13934A41836K0554q1054j769L5307K574P8486j103l9139j17794j42452j12117
13923b16671P4778o4035n4265J19113J07139J88445R6338j8637j40421j57645
13913f5861K49533J81860r8012j53131K1000J7518o2700m7220r9403j67556J05489
13902a18483J24697q1050k47246p546J3885P5670M8718R494R648K07656Q7224
13891A22667k4364m1673l1579m5777J57046j2703j5384J6778K0435j06704j36554
$$ plain form
13880 -97812 -186063 -125062 -55348 26859 180765 187277 95287 17136 193592 183916 139563 155961
13868 155961 -16674 -168462 -153856 -48969 -93406 -132601 -196829 -153491 -46053 -34041 34514
13857 34514 16108 74889 79470 108598 -98903 -184054 -211486 -211421 -212446 -38476 134084 245487
13845 245487 178407 143072 136039 188374 129081 -26486 -12911 101118 96345 -78048 -254506
13834 -254506 -369902 -335130 -340851 -224176 -138649 -139785 -103876 -88874 -173642 -233789 -187855
13823 -187855 -117384 -143150 -55454 55709 201727 182230 150440 179318 172986 345543 411096
13812 411096 213914 57151 193526 295548 234385 54436 -44921 71252 307326 493902
13802 493902 669807 869903 950640 1052284 1050020 1046117 969797 899565 830954 822664 950638
$$ packed form
13880i7812q8251O1001O9714Q2207J53906O512r1990p8151J76456r676m4353J6398
13868A55961j72635j51788J4606J04887m4437l9195o4228M3338J07438J2012O8555
13857C4514j8406N8781M581K9128k07501q5151k7432O5j025J73970J72560J11403
13845B45487o7080l5335p033N2335n9293j55567J3575J14029m773j74393j76458
13834b54506j15396L4772n721J16675Q5527j136L5909J5002q4768o0147M5934
13823a87855P0471k5766Q7696J11163J46018j9497l1790K8878o332J72557O5553
13812D11096j97182j56763J36375J02022o1163j79949r9357J16173K36074J86576
13802D93902J75905K00096Q0737J01644k264l903p6320p0232o8611q290J27974
$$ plain form
13791 950638 999020 899643 856070 894252 868785 999968 989443 966644 987513 928768 749259
13780 749259 880835 1020943 982815 814181 890836 1067538 978518 901149 870051 869402 1023878
13769 1023878 1170934 1062205 768574 628171 731389 931770 996156 936147 901303 882333
13759 882333 856712 950563 941666 764355 800734 755050 521383 504915 414168 248519 97040
13748 97040 122709 266264 372781 329484 190137 150601 135455 34076 -6770 104209 79599
13737 79599 108499 144565 299116 207554 196758 125476 169076 -20096 -134886 -100982 -32781
13726 -32781 25733 203322 226482 159630 266408 220061 109906 -51975 -23469 27992 -15719
13715 -15719 -114294 -137103 -56046 8759 102944 291116 312263 52817 31850 120137 14909
$$ packed form
13791I50638M8382r9377m3573L8182k5467J31183j0525k2799K0869n8745j79509
13780G49259J31576J40108l8128j68634P6655J76702q9020p7369l1098o49J54476
13769A023878J47056j08729k93631j40403J03218K00381O4386o0009l4844j8970
13759H82333k5621R3851q897j77311L6379m5684k33667j6468r0747j65649j51479
13748I7040K5669J43555J06517m3297j39347l9536j5146j01379m0846J10979k4610
13737G9599K8900L6066J54551r1562j0796p1282M3600j89172j14790L3904O8201
13726c2781N8514J77589K3160o6852J06778m6347j10155j61881K8506N1461m3711
13715a5719r8575k2809Q1057O4805R4185J88172K1147k59446k0967Q8287j05228
$$ plain form
13704 14909 120093 159945 67774 9325 -82691 -43246 -57127 -67178 -14205 250876 228982
13693 228982 128073 141592 -22984 -52435 -155493 -358532 -317611 -178850 -43515 93305
13683 93305 54134 34155 127464 94205 21567 76881 29621 -24523 -109968 -194607 -61886
13672 -61886 -144912 -231497 -137467 -50594 -69654 -233348 -274120 -211228 -73504 13493 60269
13661 60269 89846 134096 23608 30047 15928 43195 -15175 -99755 9430 9992 -22184 2172
13649 2172 -122561 -248075 -67776 -12951 -81353 -143023 -212103 -268067 -7815 191745 122466
13638 122466 121504 35791 56261 45388 11914 101124 102366 85172 60866 6791 -16738 -127069
13626 -127069 -169560 -67188 37726 196579 169826 13079 -36830 -61435 -251484 -348547
$$ packed form
13704A4909J05184L9852r2171n8449r2016L9445j3881j0051N2973K65081k1894
13693B28982j00909J3519j64576k9451j03058k03039M0921J38761J35335J36820
13683I3305l9171j9979R3309l3259p2638N5314m7260n4144q5445q4639J32721
13672f1886q3026q6585R4030Q6873j9060j63694m0772O2892J37724Q6997M6776
13661F0269K9577M4250j10488O439j4119K7267n8370q4580J09185N62l2176K4356
13649B172j24733j25514J80299N4825o8402o1670o9080n5964K60252J99560o9279
13638A22466r62q5713K0470j0873l3474Q9210J242j7194k4306n4075k3529j10331
13626a27069m2491J02372J04914J58853k6753j56747m9909k4605j90049r7063
$$ plain form
13616 -348547 -207617 -52150 -79060 64213 331279 383026 255436 172516 364232 357015
13606 357015 277075 194508 329638 455391 381748 390553 354056 348753 420146 447377 306946
13595 306946 508990 635591 644579 712057 797446 646292 514617 548221 513971 371155 369927
13584 369927 401526 486079 398537 342230 422822 349835 270555 266650 276102 211277 248049 265495
13572 265495 342904 352460 319740 223353 190144 59066 -47008 -25762 179699 195064 60120
13561 60120 -144651 -300593 -238341 -97854 26764 61106 125387 70322 -35544 59693 215535
13550 215535 385159 330470 114980 -112801 -10854 133235 17981 20281 -9319 -92767
13540 -92767 -108232 -93035 -33222 169478 -8050 -35918 41480 70004 66546 64405 -8304 -100428
$$ packed form
13616c48547J40930J55467k6910J43273K67066N1747j27590q2920J91716p217
13606C57015p9940q2567J35130J25753p3643Q805l6497n303P1393K7231j40431
13595C06946K02044J26601Q988O7478Q5389j51154j31675L3604l4250j42816j228
13584C69927L1599Q4553q7542n6307Q0592p2987p9280l905R452o4825L6772J7446
13572B65495P7409R556l2720r6387l3209j31078j06074K1246K05461J5365j34944
13561F0120k04771j55942O2252J40487J24618L4342O4281n5065j05866R5237J55842
13550B15535J69624n4689k15490k27781J01947J44089j15254K300k9600q3448
13540i2767j5465J5197N9813K02700j77528k7868P7398K8524l458k141p2709r2124
$$ plain form
13528 -100428 -7191 40125 94354 92943 82609 119414 132823 71897 -24643 -109821 -140712 -163276
13516 -163276 39129 181351 80317 19224 -69564 -5857 1795 71825 8344 18698 111487
13505 111487 135872 189077 119875 13900 15629 -66518 -171525 -156295 -177007 -217532 42105
13494 42105 103007 32805 -94367 -240056 -131894 43180 107274 184982 156060 262713 314771
13483 314771 114399 -38315 -42090 67874 142362 51216 -153019 -178658 -137117 -161815 -202713
13472 -202713 -191119 -75398 -145252 -159128 -219199 -164002 -8648 -15514 -53993 -44872 46035
13461 46035 -145542 -184038 -87323 97142 -14091 -103895 -86605 -95757 -174259 -66456 100668
13450 100668 -108581 -185852 -84276 -27057 11489 -283645 -470159 -265203 -170817 -211030
$$ packed form
13528a00428R3237M7316N4229j411j0334L6805J3409o0926r6540q5178l0891k2564
13516a63276K02405J42222j01034o1093q8788O3707P652P0030o3481J0354R2789
13505A11487K4385N3205o9202j05975J729q2147j05007J5230k0712m0525K59637
13494D2105O0902p0202j27172j45689J08162J75074O4094P7708k8922J06653N2058
13483C14771k00372j52714l775J09964P4488r1146k04235k5639M1541k4698m0898
13472b02713J1594J15721o9854j3876o0071N5197J55354o866l8479R121R0907
13461D6035j91577l8496R6715J84465j11233q9804J7290r152p8502J07803J67124
13450A00668k09249p7271J01576N7219L8546k95134j86514K04956R4386m0213
$$ plain form
13440 -211030 -194105 -147565 -86798 52204 54296 -101819 -44920 -16213 -43933 -65365 -93870
13429 -93870 -49782 -28693 -39049 19237 55038 16071 -107519 -130955 1589 48919 92722
13418 92722 150636 149874 130740 69702 -41076 69919 135710 142213 -537 -194393 -76308
13407 -76308 -116698 -244477 -191072 -57811 31894 78078 130669 111056 191683 150771 67520
13396 67520 299210 198015 -7990 -5321 87395 170553 176655 276897 151803 12786 -106282
13385 -106282 -7607 -84053 -251272 -75621 -98596 -23295 -93068 -217421 -163680 -48603 -148845
13374 -148845 51992 214715 134129 -66777 -99439 50657 -48286 -157771 -213560 -262634
13364 -262634 -246595 -235440 -160408 -72953 62063 174920 259485 252557 243912 119258 232370
$$ packed form
13440b11030J6925M6540O0767J39002K092j56115N6899K8707k7720k1432k8505
13429i3870M4088K1089j0356N8286L5801l8967j23590k3436J32544M7330M3803
13418I2722N7914p62j9134o1038j10778J10995O5791O503j42750j93856J18085
13407g6308m0390j27779N3405J33261Q9705M6184N2591j9613Q0627m0912q3251
13396F7520K31690j01195k06005K669R2716Q3158O102J00242j25094j39017j19068
13385a06282R8675p6446j67219J75651k2975P5301o9773j24353N3741J15077j00242
13374a48845K00837J62723q0586k00906l2662J50096r8943j09485n5789m9074
13364b62634J6039J1155P5032Q7455J35016J12857Q4565o928q645j24654J13112
$$ plain form
13353 232370 167163 8992 -79965 -175997 -260907 -214177 -145483 93276 232718 211548 146829
13342 146829 69834 24874 -52458 -25592 -153908 -240653 -61914 218455 271263 154875 126540
13331 126540 78331 43807 139536 67502 -17213 125297 108659 -33953 -165053 -258692 -272047
13320 -272047 -105987 89085 40092 -65439 -274602 -304537 -74910 4553 60166 -31220
13310 -31220 -2111 82178 81437 144597 158505 224600 259891 314289 364006 238326 86368 109055
13298 109055 140778 175431 27495 178149 278022 229573 427121 365885 178237 81806 18962
13287 18962 -23318 -22706 -7315 -41353 -18339 157895 126713 -8149 -28156 -50441 -142137 -257160
13275 -257160 -85744 -49540 -99284 56425 204153 230541 145619 40663 103312 202278 129045
$$ packed form
13353B32370o5207j58171q8957r6032q4910M6730O8694K38759J39442k1170o4719
13342A46829p6995m4960p7332K6866j28316q6745J78739K80369N2808j16388k8335
13331A26540m8209l4524R5729p2034q4715J42510j6638j42612j31100r3639j3355
13320b72047J66060J95072m8993j05531k09163k9935K29627P9463N5613r1386
13310c1220K9109Q4289p41O3160J3908O6095L5291N4398M9717j25680j51958K2687
13298A09055L1723L4653j47936J50654R9873m8449J97548o1236j87648r6431o2844
13287A8962m2280O12J5391l4038K3014J76234l1182j34862k0007k2285r1696j15023
13275b57160J71416L6204m9744J55709J47728K6388q4922j04956O2649R8966p3233
$$ plain form
13264 129045 57569 -43764 -34269 59167 41458 85626 123053 19960 -136094 -103418 -122475
13253 -122475 -169882 -29136 -44721 -117995 -233448 -290136 -198159 -174084 -142989 36003 122109
13242 122109 -71717 -51468 13216 -148214 -137705 -164148 -140919 -200562 -251005 -215624 -253981
13231 -253981 -404901 -339278 -365984 -326294 -184738 -83351 50501 -60034 -109553 28756
13221 28756 17913 13332 13748 -82750 -216845 -177382 -88852 -230170 -490061 -522951 -382786
13210 -382786 -301853 -113999 -193422 -274678 -125380 14680 48321 229288 220097 229557 362152
13199 362152 413213 298996 289468 234848 229960 233899 204856 180715 221427 110140 -58606
13188 -58606 -91779 -212798 -20102 -17680 87933 180994 132117 67520 71517 206964 208083
$$ packed form
13264A29045p1476j01333R495R3436j7709M4168L7427j03093j56054L2676j9057
13253a22475m7407J40746j5585p3274j15453n6688R1977K4075L1095J78992Q6106
13242A22109j93826K0249O4684j61430J0509k6443K3229n9643n0443L5381l8357
13231b53981j50920O5623k6706L9690J41556J01387J33852j10535m9519J38309
13221B8756j0843m581M16r6498j34095L9463Q8530j41318k59891l2890J40165
13210c82786Q0933J87854p9423q1256J49298J40060L3641J80967r191R460J32595
13199C62152N1061j14217r528n4620m888L939k9043k4141M0712j11287j68746
13188e8606l3173j21019J92696K422J05613R3061m8877o4597L997J35447J119
$$ plain form
13177 208083 78257 -82298 19637 89864 67954 -142071 -100727 -75652 -134549 -100092 105494
13166 105494 171008 96169 195684 287590 219342 184961 289031 245530 251639 408323 615487
13155 615487 604405 563532 510557 556032 426386 260769 208116 176352 170657 155016 89904
13144 89904 -39529 -86764 -438 1501 -25733 -51674 -141232 -47253 124516 214407 246073
13133 246073 271150 217555 6190 13199 79170 47342 4077 -51126 -223516 -142291 -94679
13122 -94679 59150 102737 -153701 -288621 -161429 -50606 -7108 205221 309386 392132
13112 392132 437562 496737 481969 461588 473783 404748 183443 59725 97649 72591 107512
13101 107512 158074 103755 85733 56020 -62812 -263471 -195739 -49738 78805 178498 51257
$$ packed form
13177B08083j29826j60555J01935P0227k1910k10025M1344K5075n8897L4457K05586
13166A05494O5514p4839R9515R1906o8248l4381J04070m3501O109J56684K07164
13155F15487j1082m0873n2975M5475j29646j65617n2653l1764n695j5641o5112
13144H9904j29433m7235Q6326J939k7234k5941q9558R3979J71769Q9891L1666
13133B46073K5077n3595k11365P009O5971l1828m3265n5203j72390Q1225M7612
13122i4679J53829M3587k56438j34920J27192J10823M3498K12329J04165Q2746
13112C92132M5430N9175j4768k0381J2195o9035k21305j23718L7924k5058L4921
13101A07512N0562n4319j8022k9713j18832k00659O7732J46001J28543R9693j27241
$$ plain form
13090 51257 -81026 -60953 54599 239912 217190 220124 359168 244648 240891 59245 -25708
13079 -25708 -11271 26997 -158688 -181914 -136935 -41929 -79753 -120160 -66145 20334 117558
13068 117558 103018 8157 72560 71603 98386 208793 179455 57720 44234 -103929 -131419
13057 -131419 -98165 55073 172300 156213 -25124 -137407 -149274 -346692 -185116 -39343
13047 -39343 55626 76353 86294 -85259 -73539 178419 17670 -231904 -137199 -73383 -156659
13036 -156659 -23203 -20306 42550 120854 90298 -67761 -20486 119810 -33844 -174989 -99916
13025 -99916 -52771 -58478 -120930 -195748 -148205 -147417 -139690 -75247 -29592 27919 16262 -51194
13013 -51194 -168417 -124784 -69986 -224114 -129264 -96978 9652 51729 -8129 -219349 -243264
$$ packed form
13090E1257j32283K0073J15552J85313k2722K934J39044j14520l757j81646q4953
13079b5708J4437L8268j85685k3226M4979R5006l7824m0407N4015Q6479R7224
13068A17558j4540r4861O4403r57K6783J10407k9338j21735j3486j48163k7490
13057a31419L3254J53238J17227j6087j81337j12283j1867j97418J61576J45773
13047c9343R4969K0727R941j71553J1720K51958j60749k49574R4705O3816q3276
13036a56659J33456K897O2856P8304l0556j58059M7275J40296j53654j41145P5073
13025i9916M7145n707o2452p4818M7543P88P727O4443M5655N7511j1657o7456
13013e1194j17223M3633N4798j54128R4850L2286J06630M2077n9858k11220k3915
$$ plain form
13002 -243264 -94622 -82121 -82608 -39119 -93770 -130709 9610 79830 123686 160516 -44325
12991 -44325 -105230 -153181 -193629 -131430 -186389 -165217 -254639 -292888 12234 111363 45990
12980 45990 -81950 -208782 -214530 -167937 -103198 -229975 -237326 80567 208267 31551 -112381
12969 -112381 -84334 -48425 -122434 -108703 -155734 -201958 -127689 86678 77085 64567 840
12958 840 39121 -37572 -34195 48429 148314 85426 12230 -103573 -282220 -173006 -26822
12947 -26822 61720 137100 -19323 -174889 -229564 -163280 -234182 -331129 -325416 -259970 -281773
12936 -281773 -204600 -140533 -190059 -202737 -84342 8554 -16145 70240 103720 -27110 -241434
12925 -241434 -277872 -274096 -264060 -333756 -244117 -279938 -351196 -321734 -201889 64324 69583
$$ packed form
13002b43264J48642J2501m87M3489n4651l6939J40319P0220M3856L6830k04841
12991d4325o0905m7951m0448O2199n4959K1172q9422l8249L05122R9129o5373
12980D5990j27940j26832n748M6593O4739j26777p351L17893J27700j76716j43932
12969a12381K8047L5909p4009J3731m7031m6224P4269K14367r593j2518o3727
12958H40L8281p6693L377Q2624R9885o2888p3196j15803j78647J09214J46184
12947b6822Q8542P5380j56423j55566n4675O6284p0902r6947N713O5446k1803
12936b81773P7173O4067m9526j2678J18395R2896k4699Q6385L3480j30830k14324
12925b41434l6438L776J0036o9696Q9639l5821p1258K9462J19845K66213N259
$$ plain form
12914 69583 52936 -47479 19920 33122 69 -35341 -14589 -61136 -25802 1010 183875
12903 183875 113898 -189445 -219251 -291174 -134705 -43879 -18845 97418 849 99382 252961
12892 252961 202121 226423 146459 165626 135968 85636 27817 196632 177851 105419 20095
12881 20095 -67174 -208004 -364497 -279904 -223562 -246401 -252197 -373003 -338563 -186379 -21222
12870 -21222 15036 -135389 29489 -22998 24908 120872 68017 125088 54097 -97314 -27772
12859 -27772 -11729 -24550 -70845 -701 70718 88085 155249 138199 216966 267501 253586 117268
12847 117268 -81851 -16501 196031 320871 236179 163579 56853 95898 311367 276786
12837 276786 214221 -33083 -62685 -122086 -171992 -143995 -128519 -107276 -64433 -141468 -92180
$$ packed form
12914F9583j6647j00415O7399J3202l3053l5410K0752m6547L5334K6812J82865
12903A83875o9977l03343k9806p1923J56469R0826K5034J16263r6569R8533J53579
12892B52961n0840K4302p9964J9167k9658n0332n7819J68815j8781p2432q5324
12881B0095q7269j40830j56493Q4593N6342k2839n796j20806L4440J52184J65157
12870b1222L6258j50425J64878n2487M7906R5964n2855N7071p0991j51411O9542
12859b7772J6043j2821m6295P0144P1419J7367O7164j7050P8767N0535j3915j36318
12847A17268j99119O5350K12532J24840q4692p2600j06726L9045K15469l4581
12837B76786o2565k47304k9602n9401m9906K7997J5476K1243M2843p7035M9288
$$ plain form
12826 -92180 -110848 -288014 -243413 -148729 -159334 -125598 124259 322776 427063 308787 278655
12815 278655 240446 79609 -10739 152622 268812 273739 149653 25709 -67445 -186279
12805 -186279 -21633 115758 236745 270425 181372 199300 134646 -96285 -237547 -75070
12795 -75070 111048 2268 -20064 -168341 -45097 228860 223689 56149 -77948 -210481
12785 -210481 14197 294675 378798 328160 284457 223496 51160 -74405 -185319 -211701
12775 -211701 -206565 -51134 104014 63524 -60736 -120033 41018 -99126 -120379 -165503 -163257
12764 -163257 -197176 -123599 -106161 -46562 -159615 -97767 -27236 -46808 -53695 104833 210605
12753 210605 128054 34872 -35020 -258815 -287787 -191606 9629 9287 -127158 -33981 13162
$$ packed form
12826i2180j8668j77166M4601R4684j0605L3736K49857J98517J04287j18276l0132
12815B78655l8209j60837r0348J63361J16190M927j24086j23944r3154j18834
12805a86279J64646J37391J20987L3680q9053J7928o4654k30931j41262J62477
12795g5070J86118j08780k2332j48277J23244K73957n171j67540j34097j32533
12785b10481K24678K80478Q4123n0638m3703o0961j72336j25565j10914k6382
12775b11701N136J55431J55148m0490j24260n9297J61051j40144k1253m5124K246
12764a63257l3919P3577J7438N9599j13053O1848P0531j9572o887J58528J05772
12753B10605q2551r3182o9892k23795k8972R6181K01235l42j36445R3177M7143
$$ plain form
12742 13162 6216 -73112 -3594 155295 49726 317155 490248 482176 295775 59050 96976
12731 96976 71859 99102 94443 66702 165737 231194 111751 43209 59451 -41551 107606
12720 107606 140389 189513 241935 176729 10857 -16988 40187 49650 38219 -52487 10193
12709 10193 118188 115946 245585 232094 284067 208049 139526 200213 209850 134729 -96100
12698 -96100 -286434 -148939 58005 319969 352832 208868 147561 220023 144224 -9569
12688 -9569 -86808 113949 281538 330817 265992 175951 19063 -31645 69463 98799 112388
12677 112388 133225 229768 213356 77112 26997 89107 63377 30945 64478 67968 130960
12666 130960 215417 142004 4810 8121 -145429 -59421 30264 55146 124980 296531 432590
$$ packed form
12742A3162o946p9328O9518J58889j05569K67429J73093q072j86401k36725L7926
12731I6976k5117K7243m659k7741R9035O5457j19443o8542J6242j01002J49157
12720A07606L2783M9124N2422o5206j65872k7845N7175R463j1431r0706O2680
12709A0193J07995k242J29639j3491N1973p6018o8523O0687R637p5121k30829
12698i6100j90334J37495K06944K61964L2863j43964o1307P2462p5799j53793
12688i569p7239K00757J67589M9279o4825r0041j56888n0708J01108K9336J3589
12677A12388K0837R6543j6412j36244n0115O2110k5730l2432L3533L490O2992
12666A30960Q4457p3413j37194L311j53550Q6008Q9685K4882O9834J71551J36059
$$ plain form
12655 432590 235078 111636 93532 119453 288848 300595 293563 107637 83355 162005 31840
12644 31840 -73494 -140645 -182122 -8317 194197 127846 68080 -108059 -115449 -103577 -53024
12633 -53024 -47105 50637 150914 55704 88681 -24006 -60802 -139500 -59533 -49752 36799 195495
12621 195495 174976 -22384 -266980 -255099 69200 152233 73311 73765 84074 83838 57743 -178266
12609 -178266 -187126 -83848 -30812 -85012 -69062 -32073 27699 -21972 -40759 -16916 -66158
12598 -66158 -108038 113613 323843 248286 181854 218727 153877 144386 197587 182069 138162
12587 138162 80450 -122814 -314082 -183871 -46163 94262 229354 226974 43111 89668
12577 89668 89391 141219 -9379 -210889 -270206 -88084 -182696 -122742 -27691 -78029 -186071
$$ packed form
12655D32590j97512j23442j8104K5921J69395J1747p032j85926k4282P8650j30165
12644C1840j05334o7151m1477J73805K02514o6351n9766j76139p390J1872N0553
12633e3024N919R7742J00277r5210L2977j12687l6796p8698P9967R781Q6551J58696
12621A95495k0519j97360k44596J1881L24299Q3033p8922M54J0309k36k6095k36009
12609a78266q860J03278N3036n4200J5950L6989N9772m9671j8787K3843m9242
12598f6158m1880K21651K10230p5557o6432L6873o4850r491N3201j5518m3907
12587A38162n7712k03264j91268J30211J37708J40425J35092k380j83863M6557
12577H9668k77N1828j50598k01510n9317J82122r4612N9954R5051n0338j08042
$$ plain form
12566 -186071 -82589 -16297 49628 203896 223564 241945 243450 350669 64881 -83596 -64032
12555 -64032 -134930 -58184 -90022 -14071 -9115 -59507 -128832 -56400 58798 152486 68996 28975
12543 28975 12204 -41268 -53467 6523 93418 216206 163977 49127 19484 -2576 -71348
12532 -71348 -19316 8951 -64784 -64589 -84962 -208384 -199086 -88007 77975 189428 87830
12521 87830 -241506 -317392 -155191 -31372 -69296 -196070 -132459 140800 307424 305793 189731
12510 189731 159317 185439 213884 130313 137202 101826 -187253 -264201 -129962 -33429 94421
12499 94421 177472 154474 202851 178414 81194 66901 -106926 -220965 -156169 1251 76154
12488 76154 96507 23963 10115 119801 189998 170864 247340 232700 198641 223586 114257
$$ packed form
12566a86071J03482O6292O5925J54268J9668J8381J505J07219k85788j48477J9564
12555f4032p0898P6746l1838P5951M956n0392o9325P2432J15198R3688q3490m0021
12543B8975j6771n3472j2199N9990Q6895J22788n2229j14850k9643k2060o8772
12532g1348N2032K8267p3735J95k0373j23422R298J11079J65982J11453j01598
12521H7830l29336p5886J62201J23819l7924j26774O3611K73259J66624j631j16062
12510A89731l0414K6122K8445q3571O889l5376k89079p6948J34239R6533J27850
12499I4421Q3051k2998M8377k4437r7220j4293j73827j14039O4796J57420P4903
12488G6154K0353p2544j3848J09686P0197j9134P6476j4640l4059K4945j09329
$$ plain form
12477 114257 77847 47618 40562 124975 -38727 68047 64330 56377 21129 -207349 -216596 -301482
12465 -301482 -207105 -10334 48706 64105 59156 114963 93930 -9958 -161587 -209656 -47374
12454 -47374 90277 82812 -28804 -100732 -143493 -66619 -137094 -115028 -178791 -79548 131436
12443 131436 255865 162354 18998 100823 197257 213402 124809 -34790 -54775 -19881 19875
12432 19875 80526 -39176 -201732 -251693 -69363 70512 80113 187699 210037 284949 337058
12421 337058 364352 368120 318958 236777 172181 116983 157980 135759 363987 292619 187739
12410 187739 259052 184925 169490 201865 -27480 -99573 -199612 -134961 -84640 -9438 34285
12399 34285 112681 28915 60428 15428 100851 160205 336 -36235 4864 -99747 -127547
$$ packed form
12477A14257l6410l0229p056Q4413j63702J06774l717p953l5248k28478r247q4886
12465c01482R4377J96771N9040J5399m949N5807k1033j03888j51629m8069J62282
12454d7374J37651p465j11616p1928m2761P6874p0475K2066o3763R9243K10984
12443A31436J24429r3511j43356Q1825R6434J6145q8593j59599j9985L4894L9756
12432A9875O0651j19702j62556m9961J82330J39875R601J07586K2338P4912N2109
12421C37058K7294L768m9162q2181o4596n5198M0997k2221K28228p1368j04880
12410A87739P1313p4127j5435L2375k29345p2093j00039O4651N0321P5202M3723
12399C4285P8396q3766L1513m5000Q5423N9354j59869l6571M1099j04611k7800
$$ plain form
12388 -127547 -92874 -39922 74898 202290 139585 5082 -26797 31494 83081 164662 67781
12377 67781 -24256 88841 152895 355939 208170 111793 98131 214277 218968 266361 327509
12366 327509 459920 371975 210947 73895 134907 150270 190881 131267 221710 376066 413399
12355 413399 235235 29741 60288 91696 16749 -107028 -89305 -131029 -163782 -231733 -144765
12344 -144765 -23571 -48954 -209637 -193972 -118537 23633 147087 88800 11708 13777 76448
12333 76448 41336 47229 35564 191700 255176 196547 228864 85289 -149805 -182257 -234765
12322 -234765 -89880 -126812 -24119 -61371 21732 101973 92037 254839 357729 358823 427717
12311 427717 489721 329586 210456 196472 23882 70835 143852 20423 6144 68246 100315
$$ packed form
12388a27547L4673N2952J14820J27392o2705j34503l1879N8291N1587Q1581r6881
12377F7781r2037J13097O4054K03044j47769r6377j3662J16146M691M7393O1148
12366C27509J32411q7945j61028j37052O1012J5363M0611n9614R0443J54356L7333
12355D13399j78164k05494L0547L1408p4947j23777J7723m1724l2753o7951Q6968
12344a44765J21194k5383j60683J5665P5435J42170J23454n8287p7092K069O2671
12333G6448l5112N893j1665J56136O3476n8629L2317j43575k35094l2452n2508
12322b34765J44885l6932J02693l7252Q3103Q0241r936J62802J02890J094O8894
12311D27717O2004j60135j19130j3984j72590M6953P3017j23429j4279O2102L2069
$$ plain form
12300 100315 72849 222067 156752 26223 -76466 -123254 -280909 -197605 100012 125880
12290 125880 124647 286318 200629 91200 -22733 62253 138024 133718 171546 174165 134161
12279 134161 32347 76260 158107 119316 -14709 31610 211767 276038 297972 276423 271021
12268 271021 152475 192002 267310 154556 -13783 -80728 -163099 -78071 -41396 95524 158259
12257 158259 201147 311985 309474 210291 243510 270283 30322 -131555 -199408 -155934 43129
12246 43129 124543 6968 -92894 -3608 59118 151247 70411 64825 167442 199399 134003
12235 134003 48826 -26640 30417 35763 82515 157816 116794 51799 15582 -23750 -126976
12224 -126976 -167374 -253835 -215175 -42871 -7824 52766 46509 -41835 -40434 11770 61867 -38630
$$ packed form
12300A00315k7466J49218o5315j30529j02689m6788j57655Q3304K97617K5868
12290A25880j233J61671q5689j09429j13933Q4986P5771m306L7828K619m0004
12279A34161j01814M3913Q1847l8791j34025M6319J80157O4271K1934k1549n402
12268B71021j18546L9527P5308j12754j68339o6945q2371Q5028L6675J36920O2735
12257A58259M2888J10838k511r9183L3219K6773k39961j61877o7853M3474J99063
12246D3129Q1414j17575r9862Q9286O2726R2129q0836n586J02617L1957o5396
12235A34003q5177p5466N7057N346M6752P5301m1022o4995l6217l9332j03226
12224a26976m0398q6461L8660J72304L5047O0590o257q8344J401N2204N0097j00497
$$ plain form
12212 -38630 -162047 -228137 -61969 -10777 127905 40125 81749 217614 181698 146845 166007
12201 166007 149182 68358 189219 229541 312821 278211 224542 241060 176789 84310 83734 121214
12189 121214 97374 -27910 45405 349965 309559 240415 60294 91119 -9644 -41696 54767
12178 54767 161613 238518 244982 167191 135176 174102 221194 117067 175029 207861 170318
12167 170318 78975 166071 216060 176875 125824 153388 133458 14572 -108026 -41757 -82883
12156 -82883 -43817 58132 -127104 -122670 12099 -2754 -21231 -88224 -123971 -132030 -53644
12145 -53644 166367 316926 178760 78341 68122 89808 -16325 16330 -12281 -39019 57646
12134 57646 107076 146047 82321 -82308 -259687 -229415 -49669 -113284 -343068 -444233 -330201
$$ packed form
12212c8630j23417o6090J66168N1192J38682q7780M1624J35865l5916l4853J9162
12201A66007j6825q0824J20861M0322Q3280l4610n3669J6518o4271r2479n76L7480
12189A21214k3840j25284P3315L04560m0406o9144j80121L0825j00763l2052R6463
12178E4767J06846P6905O464p7791l2015L8926M7092j04127N7962L2832l7543
12167A70318r1343Q7096M9989l9185n1051K7564j9930j18886j22598O6269m1126
12156h2883L9066J01949j85236M434J34769j4853j8477o6993l5747q059P8386
12145e3644K20011J50559j38166j00419j0219K1686j06133L2655k8611k6738R6665
12134E7646M9430L8971o3726j64629j77379L0272J79746o3615k29784j01165J14032
$$ plain form
12123 -330201 -269109 -105459 -7350 -31257 33598 69055 -56435 -134497 -125017 -121586 -195219
12112 -195219 -234370 -66801 -113372 17710 179384 223753 122206 -83364 -95032 -63789
12102 -63789 112032 236988 310834 21335 -5489 87675 120892 112031 141625 318105 319090
12091 319090 361750 296073 159664 225411 319584 226794 335045 326881 109251 115848 262839
12080 262839 171392 -101748 -212462 -161294 -112462 1101 -46269 -38247 -22777 121129 147262
12069 147262 -9663 -244091 -278732 -259615 -181283 -258475 -255188 -227620 -125514 -184734 -197982
12058 -197982 -249710 -215324 -131887 36670 220527 306245 278001 248255 259471 256388 113296
12047 113296 -119303 -120494 -118548 -7491 70613 -831 -53308 -197174 -186129 -127286 -162513
$$ packed form
12123c30201O1092J63650R8109k3907O4855L5457j25490p8062R480L431p3633
12112a95219l9151J67569m6571J31082J61674M4369j01547k05570j1668L1243
12102f3789J75821J24956P3846k89499k6824R3164L3217q861K9594J76480R85
12091C19090M2660o5677j36409O5747R4173r2790J08251q164k17630O597J46991
12080B62839r1447k73140j10714N1168M8832J13563m7370Q022J5470J43906K6133
12069A47262j56925k34428l4641J9117P8332p7192L287K7568J02106n9220j3248
12058a97982n1728L4386Q3437J68557J83857Q5718k8244k9746J1216l083j43092
12047A13296k32599j191J946J11057P8104p1444n2477j43866J1045N8843l5227
$$ plain form
12036 -162513 -222895 -90915 -26439 -27568 67972 114028 83844 55115 214963 320216 234364
12025 234364 38723 -17079 139079 147383 135201 -4019 9646 91454 125781 -35494 73423
12014 73423 132573 281045 371578 300665 276708 132802 22975 9786 36153 41433 42213 145257
12002 145257 170877 160748 120405 183788 154271 -6631 -106694 -26739 4028 -62521 -113902
11991 -113902 -59441 229098 318648 378830 439986 394807 321980 365422 213589 2673 -114664
11980 -114664 -175231 -108830 -60926 -160070 -219401 -159449 -55924 214692 168510 115088 295934
11969 295934 315379 180437 332793 276169 178521 185834 161802 232069 146771 -12503 -96800
11958 -96800 20303 106265 201519 219079 382640 507844 384985 240104 215628 271731 221257
$$ packed form
12036a62513o0382J31980O4476j129R5540M6056l0184k8729J59848J05253q5852
12025B34364j95641n5802J56158Q304j2182j39220J3665Q1808L4327j61275J08917
12014G3423N9150J48472R0533p0913k3957j43906j09827j3189K6367N280P80J03044
12002A45257K5620j0129m0343O3383k9517j60902j00063P9955L0767o6549n1381
11991a13902N4461K88539Q9550O0182O1156m5179p2827M3442j51833k10916j17337
11980a14664o0567O6401M7904r9144n9331N9952J03525K70616m6182n3422J80846
11969B95934J9445j34942J52356n6624r7648P313k4032P0267q5298j59274q4297
11958i6800J17103Q5962R5254J7560J63561J25204j22859j44881k4476N6103n0474
$$ plain form
11947 221257 273336 377790 274054 113833 -56970 -110269 -87952 140486 161743 77313
11937 77313 102925 113845 129480 129243 153581 161616 258719 243233 228157 221080 225489 244038 90419
11924 90419 -52013 -81829 -5584 -18996 -113954 -89661 -105050 -98203 -52539 -48812 -41884 -53531
11912 -53531 135485 150093 16227 121252 138698 110734 -3110 -199010 -316707 -343682
11902 -343682 -335360 -257061 -361433 -208924 30263 62873 -19094 -123187 -343894 -474927
11892 -474927 -538590 -422466 -401134 -271175 -91951 51490 -19886 49292 91184 -160057
11882 -160057 -332746 -232544 -228100 -181472 -99932 -50826 -175656 -178449 -124874 19625 54620
11871 54620 -12563 93758 131393 -60438 -185224 -180994 -201715 -140871 -179202 -159583 -51597
$$ packed form
11947B21257N2079J04454j03736j60221j70803n3299K2317K28438K1257q4430
11937G7313K5612J0920J5635k37K4338Q035R7103j5486j5076p077M409J8549j53619
11924I0419j42432k9816P6245j3412r4958K4293j5389O847M5664L727O928j1647
11912e3531J89016J4608j33866J05025J7446k7964j13844j95900j17697k6975
11902c43682Q322P8299j04372J52509K39187L2610q1967j04093k20707j31033
11892d74927o3663J16124K1332J29959J79224J43441p1376O9178M1892k51241
11882a60057j72689J00202M444M6628Q1540M9106j24830k793N3575J44499L4995
11871E4620o7183J06321L7635j91831j24786M230k0721O0844l8331J9619J07986
$$ plain form
11860 -51597 -108995 -143382 -132457 -189529 -113455 -109310 -38924 -82036 -5403 -20510 -41187 -166544
11848 -166544 -205789 -3493 -39399 -166935 -128830 -84946 -77394 -179880 -219926 -183244 -54709
11837 -54709 21767 7444 -52327 -9718 94483 115437 675 -76904 -137946 -104698 -86576
11826 -86576 -39692 96214 93850 -62296 -89019 -65261 90266 124542 80912 77124 6965
$$ packed form
11860e1597n7398l4387J0925n7072P6074M145P0386m3112P6633j5107k0677j25357
11848a66544l9245K02296l5906j27536L8105M3884P552j02486m0046L6682J28535
11837e4709P6476j4323n9771M2609J04201K0954j14762p7579o1042L3248J8122
11826h6576M6884J35906k364j56146k6723K3758J55527L4276m3630l788p0159
$$ [...]
##END NTUPLES=NMR SPECTRUM
##END=
