##TITLE=Analysis number 312405
Compound Code cc 31001
Book Reference 397/70/4
Project Code adrs
Chemist Name brucer
##JCAMPDX= 6.0         $$ Bruker NMR JCAMP-DX V2.0
##DATA TYPE= NMR SPECTRUM
##DATA CLASS= NTUPLES
##ORIGIN= Bruker BioSpin GmbH
##OWNER= NMR
$$ XWIN-NMR		Version 3.5
$$ Wed Aug  3 11:33:45 2005 GMT Daylight Time (UT+1h)  MAYBRIDGE\NMR@NMR_250MHZ
##.OBSERVE FREQUENCY= 250.131544655141
##.OBSERVE NUCLEUS= ^1H
##.ACQUISITION MODE= SIMULTANEOUS (DQD)
##.ACQUISITION SCHEME= undefined
##.AVERAGES= 16
##.DIGITISER RES= 18
##SPECTROMETER/DATA SYSTEM= dpx250
##.PULSE SEQUENCE= zg30
##.SOLVENT NAME= DMSO
##.SHIFT REFERENCE= (INTERNAL, DMSO, 0, 16.522)
##AUDIT TRAIL= $$ (NUMBER, WHEN, WHO, WHERE, WHAT)
$$ ##TITLE= Audit trail, XWIN-NMR		Version 3.5
$$ ##JCAMPDX= 5.01
$$ ##ORIGIN= Bruker BioSpin GmbH
$$ ##OWNER= NMR
$$ C:\u/data/dgb/nmr/ADRS/7090/pdata/1/auditp.txt
$$ ##AUDIT TRAIL=  $$ (NUMBER, WHEN, WHO, WHERE, WHAT)
(   1,<2005-08-03 11:33:26.23 +100>,<MAYBRIDGE\NMR>,<NMR_250MHZ>,
      <created by zg, POWCHK disabled, PULCHK disabled
       configuration hash MD5:
       62 19 C7 07 E1 42 D1 B7 37 6C 3D D0 77 39 F9 E6
       data hash MD5: 64K
       9E 43 43 FD 67 9D 0B E2 5B 90 EA 5A A2 0C 39 30>)
(   2,<2005-08-03 11:33:37.20 +100>,<MAYBRIDGE\NMR>,<NMR_250MHZ>,
      <Start of raw data processing
       ef LB = 0.3 FT_mod = 6 PKNL = 1 SI = 32K 
       data hash MD5: 32K
       AE CE 8C 34 68 DC 7C 24 EF E4 8C D2 A0 29 A1 63>)
(   3,<2005-08-03 11:33:39.31 +100>,<MAYBRIDGE\NMR>,<NMR_250MHZ>,
      <apk 
       data hash MD5: 32K
       F8 74 67 3D F3 A7 75 3D BD 49 17 B2 14 C5 F1 58>)
(   4,<2005-08-03 11:33:40.03 +100>,<MAYBRIDGE\NMR>,<NMR_250MHZ>,
      <abs ABSG = 5 
       data hash MD5: 32K
       34 E1 60 7E 9B DB E8 66 18 60 40 CB 54 E7 6D 81>)
$$ ##END=
$$ 
$$ hash MD5
$$ 61 64 98 62 3A DE 3C 62 74 D1 54 76 2B 05 B8 60
##$RELAX= 
##$RELAX= 
##$RELAX= 
##$RELAX= 
##$RELAX= 
##$RELAX= 
##$RELAX= 
$$ Bruker specific parameters
$$ --------------------------
##$DU= <C:\u>
##$EXPNO= 7090
##$NAME= <ADRS>
##$PROCNO= 1
##$TYPE= <nmr>
##$USER= <dgb>
##$AMP= (0..31)
100 100 100 100 100 100 100 100 100 100 100 100 100 100 100 100 100 100 
100 100 100 100 100 100 100 100 100 100 100 100 100 100 
##$AQSEQ= 0
##$AQ_mod= 3
##$AUNM= <au_zg>
##$AUTOPOS= <15 >
##$BF1= 250.13
##$BF2= 250.13
##$BF3= 250.13
##$BF4= 250.13
##$BF5= 500.13
##$BF6= 500.13
##$BF7= 500.13
##$BF8= 500.13
##$BYTORDA= 1
##$CFDGTYP= 0
##$CFRGTYP= 5
##$CHEMSTR= <none>
##$CNST= (0..31)
1 1 145 1 1 1 1 1 1 1 1 1 1 1 1 1 1 1 1 1 1 1 1 1 1 1 1 1 1 1 1 1 
##$CPDPRG= <>
##$CPDPRG1= <>
##$CPDPRG2= <>
##$CPDPRG3= <>
##$CPDPRG4= <mlev>
##$CPDPRG5= <mlev>
##$CPDPRG6= <mlev>
##$CPDPRG7= <mlev>
##$CPDPRG8= <mlev>
##$CPDPRGB= <>
##$CPDPRGT= <>
##$D= (0..31)
0 1 0 0 0 0 0 0 0 0.06 0 0 0 0 0 0 0.0002 0 0 0 0 0 0 0 0 0 0 0 0 0 0 
0 
##$DATE= 1123065205
##$DBL= (0..7)
120 120 120 120 120 120 120 120 
##$DBP= (0..7)
150 150 150 150 150 150 150 150 
##$DBP07= 0
##$DBPNAM0= <>
##$DBPNAM1= <>
$$ [...]
##$SUBNAM7= <"">
##$SUBNAM8= <"">
##$SUBNAM9= <"">
##$SW= 20.6930455092707
##$SWIBOX= (0..15)
0 0 3 0 0 0 0 0 0 0 0 0 0 0 0 0 
##$SW_h= 5175.983436853
##$TD= 65536
##$TD0= 1
##$TE= 295.16
##$TE2= 300
##$TE3= 300
##$TEG= 300
##$TL= (0..7)
0 120 120 120 120 120 120 120 
##$TP= (0..7)
150 150 150 150 150 150 150 150 
##$TP07= 0
##$TPNAME0= <>
##$TPNAME1= <>
##$TPNAME2= <>
##$TPNAME3= <>
##$TPNAME4= <>
##$TPNAME5= <>
##$TPNAME6= <>
##$TPNAME7= <>
##$TPOAL= (0..7)
0.5 0.5 0.5 0.5 0.5 0.5 0.5 0.5 
##$TPOFFS= (0..7)
0 0 0 0 0 0 0 0 
##$TUNHIN= 0
##$TUNHOUT= 0
##$TUNXOUT= 0
##$USERA1= <user>
##$USERA2= <user>
##$USERA3= <user>
##$USERA4= <user>
##$USERA5= <user>
##$V9= 5
##$VALIST= <valist>
##$VCLIST= <CCCCCCCCCCCCCCC>
##$VD= 0
##$VDLIST= <DDDDDDDDDDDDDDD>
##$VPLIST= <PPPPPPPPPPPPPPP>
##$VTLIST= <TTTTTTTTTTTTTTT>
##$WBST= 1024
##$WBSW= 4
##$XGAIN= (0..3)
0 0 0 0 
##$XL= 0
##$YL= 0
##$YMAX_a= 311151
##$YMIN_a= -487379
##$ZGOPTNS= <>
##$ZL1= 120
##$ZL2= 120
##$ZL3= 120
##$ZL4= 120
##$ABSF1= 16.522
##$ABSF2= -4.171173
##$ABSG= 5
##$ABSL= 3
##$ALPHA= 0
##$AQORDER= 0
##$ASSFAC= 0
##$ASSFACI= 0
##$ASSFACX= 0
##$ASSWID= 0
##$AUNMP= <proc_1d>
##$AZFE= 0.1
##$AZFW= 0.1
##$BCFW= 0
##$BC_mod= 0
##$BYTORDP= 0
##$COROFFS= 0
##$CY= 12.5
##$DATMOD= 1
##$DC= 0
##$DFILT= <>
##$DTYPP= 0
##$F1P= 14.0000005364418
##$F2P= -0.99999901652339
##$FCOR= 0.5
##$FTSIZE= 32768
##$FT_mod= 6
##$GAMMA= 0
##$GB= 0
##$INTBC= 1
##$INTSCL= 1
##$ISEN= 128
##$LB= 0.3
##$LEV0= 0
##$LPBIN= 0
##$MAXI= 10000
##$MC2= 0
##$MEAN= 0
##$ME_mod= 0
##$MI= 0
##$NCOEF= 0
##$NC_proc= -3
##$NLEV= 6
##$NOISF1= 0
##$NOISF2= 0
##$NSP= 0
##$NTH_PI= 0
##$NZP= 0
##$OFFSET= 16.522
##$PC= 1
##$PHC0= -52.05304
##$PHC1= -41.72023
##$PH_mod= 1
##$PKNL= yes
##$PPARMOD= 0
##$PSCAL= 4
##$PSIGN= 0
##$REVERSE= no
##$SF= 250.13
##$SI= 32768
##$SIGF1= 0
##$SIGF2= 0
##$SINO= 400
##$SIOLD= 32768
##$SREGLST= <1H.DMSO>
##$SSB= 0
##$STSI= 32768
##$STSR= 0
##$SW_p= 5175.98343685301
##$SYMM= 0
##$S_DEV= 0
##$TDeff= 65536
##$TDoff= 0
##$TI= <Analysis number 999999
Compound Code 99
Book Reference 9
Project Code 9>
##$TILT= no
##$TM1= 0
##$TM2= 0
##$TOPLEV= 0
##$USERP1= <user>
##$USERP2= <user>
##$USERP3= <user>
##$USERP4= <user>
##$USERP5= <user>
##$WDW= 1
##$XDIM= 32768
##$YMAX_p= 426319969
##$YMIN_p= -1120752
$$ End of Bruker specific parameters
$$ ---------------------------------
##NTUPLES= NMR SPECTRUM
##VAR_NAME=  FREQUENCY,     SPECTRUM/REAL,   SPECTRUM/IMAG
##SYMBOL=    X,             R,               I
##VAR_TYPE=  INDEPENDENT,   DEPENDENT,       DEPENDENT
##VAR_FORM=  AFFN,          ASDF,            ASDF
##VAR_DIM=   32768,         32768,           32768
##UNITS=     HZ,            ARBITRARY UNITS, ARBITRARY UNITS
##FACTOR=    0.157963299565203, 1,           1
##FIRST=     4132.6476996994, 0,             0
##LAST=      -1043.33573715361, 0,           0
##MIN=       -1043.33573715361, -1120752,    0
##MAX=       4132.6476996994, 426319969,     0
$$ Real data points
##PAGE= N=1
##DATA TABLE= (X++(R..R)), XYDATA
$$ [...]
14339E8291m3710k5665K0267o177o064l158M564k708k5215m0522N6695r712n7297
$$ 58291 14581 -11084 9183 3006 -3058 -6216 -1652 -4360 -29575 -70097 -13402 -23114 -80411
14326h0411J9916J6158K0415r893p99j9323J4968J7693K9998r549M1180J2028
$$ -80411 -60495 -44337 -23922 -33815 -34614 -53937 -38969 -21276 8722 -827 40353 52381
14314E2381J7347k8105o6014m0231L0676N2797M99l5631j8285L0366L5192p089
$$ 52381 69728 41623 -24391 -64622 -33946 18851 19350 -16281 -34566 -4200 30992 23903
14302B3903m4475j6183K3779J6573K5780P542O722k3643m0513J185j498K581J0522
$$ 23903 -20572 -36755 -12976 3597 29377 36919 43641 19998 -20515 -19330 -20828 -18247 -7725
14289g725k6249j7095M0476L2083l4091j6117k445k2976j4512L0191j2498j9855
$$ -7725 -33974 -51069 -10593 21490 -12601 -28718 -31163 -54139 -68651 -38460 -50958 -70813
14277g0813J847K6229J1078j2816J067J6240K445M8157j4649K5892L8494K0191
$$ -70813 -68966 -42737 -31659 -44475 -43408 -27168 -24723 23434 8785 34677 73171 93362
14265I3362l1704k7037o127l607J7741J6535j8396l4615L1189M687k8188N929
$$ 93362 61658 34621 28494 24887 42628 59163 40767 6152 37341 42028 13840 19769
14253A9769K1722m020k9066n2082j7235M5242K5932K1632O984k2591k1280j7734
$$ 19769 41491 37471 8405 -43677 -60912 -15670 10262 31894 38878 16287 -4993 -22727
14241b2727K6346K4865J2154J8609j6329Q804m085k9676j3661N148j2380K8415
$$ -22727 3619 28484 40638 59247 42918 51722 47637 17961 4300 9448 -2932 25483
14229B5483K2656J514J5704l9683j4760k0733k3479O463J3459k5885k5952Q063
$$ 25483 48139 49653 65357 25674 10914 -9819 -33298 -26835 -13376 -39261 -65213 -57150
14217e7150J9601m4881k3586M1157L1890K4581r098p3j3150K223J5253L2710K8937
$$ -57150 -37549 -82430 -106016 -64859 -32969 -8388 -17486 -17559 -30709 -28486 -13233 19477 48414
14204D8414m7047m5818K2405J6716p621J4502L735j8203j5724O331m866J5297
$$ 48414 1367 -44451 -22046 -5330 -12951 1551 5286 -12917 -28641 -22310 -27176 -11879
14192a1879m1486l5189N8221J419j2728J8248O594J7536L1048k0494m5913Q896
$$ -11879 -53365 -88554 -30333 -28914 -41642 -23394 -16800 736 31784 11290 -34623 -25727
14180b5727k474j8665j9915n249P275L734K7387N1352j2204r710R05o627K4684
$$ -25727 -28201 -46866 -66781 -72030 -64755 -61021 -33634 17718 5514 -4196 -3291 -9918 14766
14167A4766r36k1905n7316K4259M5410p894J865J3258K707j7557L2824J8970m7782
$$ 14766 13830 -8075 -65391 -41132 4278 -3616 -1751 11507 14214 -3343 29481 48451 669
14154F69l1107K0769J7918K2798k751l6495j4819O184J2843r547j559R092N565
$$ 669 -30438 -9669 8249 31047 28296 -8199 -23018 -16834 -3991 -13538 -15097 -6005 -440
14141d40Q499k5941k0152K9987M8424o015j230k8725j1244j3599K0720N1385J9221
$$ -440 8059 -17882 -38034 -8047 40377 34362 33132 4407 -6837 -20436 284 51669 70890
14128G0890N289j769l1784j1591R556R911j7479l40j635J1833r533L7541l4306
$$ 70890 76179 74410 42626 31035 40591 50502 33023 32683 31048 42881 33348 70889 36583
14115C6583n3394K6147q110m5411o40l5939O218J2934J2277K8800R323M673N990
$$ 36583 -16811 9336 1226 -44185 -44825 -80764 -74546 -61612 -49335 -20535 -11212 -6539 -549
14102e49M259J4052j6353k8413r839K2052K4635k4702j0943J0552K9396j4247
$$ -549 3710 17762 1409 -27004 -36843 -14791 9844 -14858 -25801 -15249 14147 -100
14090a00M939k5213l6861m428N023J6647L3280Q959n652l0296r275L4890J2405
$$ -100 4839 -20374 -57235 -61663 -56640 -39993 -6713 2246 -3406 -33702 -42977 -8087 4318
14077D318J8392M6520l4225l1927Q06L0544m902J4383R761l9820m384j4937k7359
$$ 4318 22710 69230 35005 3078 3884 34428 29526 43909 53670 13850 9466 -5471 -32830
14064c2830M982j1424k2217j1968K9899J0025L0664l897K2880K0810l0620K0429
$$ -32830 -27848 -39272 -61489 -73457 -43558 -33533 -2869 -6766 16114 36924 6304 26733
14052B6733j2739l1501j2687L4893Q408Q602J8086m260m938m652k7107K3009l3630
$$ 26733 13994 -17507 -30194 4699 13107 21709 39795 35535 30597 25945 -1162 21847 -11783
14039a1783K555K2184J9482l5948k1819j0672l929J1145M4259J5918l4289m4100
$$ -11783 -9228 12956 32438 -3510 -25329 -36001 -39930 -28785 15474 31392 -2897 -46997
14027d6997R309L4068M10J5623J7920m5370r439j0546N475n047L8366K8345M5350
$$ -46997 -37688 -3620 -3210 12413 30333 -15037 -24476 -35022 -29547 -34594 3772 32117 77467
14014G7467j5266k1064k7574j0298n213R46m7030K0821K0117q0010j0619J4041
$$ 77467 62201 41137 13563 3265 -1948 -1002 -48032 -27211 -7094 -87104 -97723 -83682
14002h3682j0825r175K3982O6664K894K1438N7535L973k4078k7320l277l0305
$$ -83682 -94507 -103682 -79700 -13036 -10142 11296 68831 72804 48726 21406 18129 -12176
13990a2176r582M1119K2339o2864m3167n928Q611L2619M1016j0073l5526N130
$$ -12176 -21758 19361 41700 -21164 -64331 -70259 -61648 -29029 11987 1914 -33612 -28482
13978b8482r432J8608L6528L3774K345k0650M78J2017j4143j720N092M316l984
$$ -28482 -37914 -19306 17222 50996 53341 32691 33169 45186 31043 29323 34415 38731 34747
13965C4747n1218m211p799L2781L6018J138m2358j1135K2506j5228K3555j1452
$$ 34747 -16471 -20682 -28481 4300 40318 41456 -902 -12037 10469 -4759 18796 7344
13953G344P84J0069q00k8137o271L7895L144m6163j4606N706P40J4891j6206J8863
$$ 7344 8128 18197 17397 -10740 -17011 20884 24028 -22135 -36741 -31035 -30295 -15404 -31610 -12747
13939a2747l073j5165N756L7021K9557o988m4818O35N8178J0197L505J3579j1919
$$ -12747 -15820 -30985 -25229 11792 41349 34361 -10457 -9822 48356 58553 62058 75637 63718
13926F3718K009k091m491k9760l7863m3494O556L9901K9502j3590l7796m936j3343
$$ 63718 65727 63636 59145 29385 -8478 -51972 -45416 -5515 23987 10397 -27399 -32335 -45678
13913d5678k4750L0404J0919J2331K8441J0864j1520O446K4602J0329l728j5705
$$ -45678 -70428 -40024 -29105 -16774 11667 22531 11011 17457 42059 52388 48660 32955
13901C2955M765l5464l2660M3883L7063k6622l2798k500j4972l2740L0340L8402
$$ 32955 37720 2256 -30404 13479 50542 23920 -8878 -11378 -26350 -59090 -28750 9652
13889I652K6599m1603j0153n512L4859K2035l195J8607K035L868n012k3977k1493
$$ 9652 36251 -5352 -15505 -21017 13842 35877 32682 51289 53324 57192 52180 28203 6710
13876F710p403j2494J2534L2466q019k2479R112k3230P269J2816j418j4854q124
$$ 6710 -693 -13187 -653 31813 23794 1315 10427 -12803 -5534 7282 5864 -8990 -17114
13863a7114k0494Q766J7950K5118N885O767K4910K3118L5407o943p320R042m5123
$$ -17114 -37608 -28842 -10892 14226 20111 26878 51788 74906 110313 103370 96050 105092 59969
13850E9969m5964N77R84k3207K9092J7343K8006L1550j9466M0003k9614r2582
$$ 59969 14005 14582 15566 -7641 21451 38794 66800 98350 78884 118887 89273 -3309
13838c309j5179J9523j3964K8785K2018m25m328L233R72p129p222k2245k1477
$$ -3309 -18488 1035 -12929 15856 37874 37449 33121 36354 37326 30197 22975 730 -20747
13825b0747K6151J6355R21J9658K7195l2257o5490J2165k070P200K8889k6155
$$ -20747 5404 21759 22680 42338 69533 37276 -28214 -16049 -18119 -10919 17970 -8185
13813h185K7159K4039q861R905L4869m961n4108j3848J1187M65l366p981j0291
$$ -8185 18974 43013 34152 44057 78926 73965 19857 6009 17196 17661 14295 6314 -3977
13800c977p096r925l6091L1697N9716J2321L2240k027k8766l2465K6705K2299
$$ -3977 -11073 -20998 -57089 -25392 34324 46645 78885 76858 48092 15627 42332 64631
13788F4631J3461l4708K347K9462k5502k2074j0749K2680Q084K104J9417m147
$$ 64631 78092 43384 45731 75193 49691 27617 16868 39548 47632 49736 69153 65006
13776F5006p944j1547L242l9325k9200L3886q178J0590K814k6036J9813L1401
$$ 65006 57062 45515 48757 9432 -19768 14118 5940 16530 19344 -6692 13121 44522
13764D4522l8753m2535m0610J2841R034N3660K9706N474p88J7718O02q265n270
$$ 44522 5769 -36766 -77376 -64535 -55501 -1841 27865 33339 32551 50269 50871 42606 37336
13751C7336K8177O085m2581j1919N277l592j0415j2701l4641K1556q000k0386
$$ 37336 65513 71598 29017 17098 22375 18783 8368 -4333 -38974 -17418 -25418 -45804
13739d5804N7336K6869J178L8604K4049m3286m2542l2069j8795K9919J6421l7326
$$ -45804 11532 38401 39579 78183 102232 58946 16404 -15665 -34460 -4541 11880 -25446
13727b5446P141N2207L7354P42J7404n702K4176l0027k975J8530J676l7298k8881
$$ -25446 -18305 33902 71256 71998 89402 83700 107876 77849 74874 93404 95080 57782 28901
13714B8901J8625k0446l3338m362N608m44l459j4877k537n368L2810L0267k6963
$$ 28901 47526 27080 -6258 -10620 -5012 -5456 -8915 -23792 -26329 -31697 1113 31380 4417
13701D417j4704L8300o701k6932j8629L6888L3702j1459N762L9238k092p003j7662
$$ 4417 -10287 28013 21312 -5620 -24249 12639 46341 34882 40644 79882 77790 70787 53125
13688E3125J6489N2703k3755m7060m5910J0854J7038K054m592L1544j1893k5276
$$ 53125 69614 122317 98562 51502 5592 16446 33484 35538 30946 62490 50597 25321
13676B5321j9605j9446j4554J9485J8701K2331r945J5365L1842N8145j1437n7760
$$ 25321 5716 -13730 -28284 -8799 9902 32233 22288 37653 69495 127640 116203 58443
13664E8443k7646J0364l8880K4985P53o2460Q668m187k0511K1743L1453K1960
$$ 58443 30797 41161 2281 27266 28019 -34441 -25773 -29960 -50471 -28728 2725 24685
13652B4685j3761n512k6035M3364L0298J5355k1963n397K8810J0175j4560j584
$$ 24685 10924 5412 -20623 22741 53039 68394 46431 41034 69844 80019 65459 63875
13640F3875K2829J0338k7259Q664m842J5710J0782j117q47k0261k4031j0482K9494
$$ 63875 86704 97042 69783 78447 73605 89315 100097 98980 98133 77872 53841 43359 72853
13627G2853L5369l2377k8919J8548l897k8005k0833M3589n1342o1967P155L6382
$$ 72853 108222 75845 46926 65474 61577 33572 12739 56328 4986 -56981 -49826 -13444
13615a3444L857J7311Q343n221J0241K6589K5032j2015l3119L0764K711J9867
$$ -13444 -9587 7724 16067 10846 21087 47676 72708 60693 27574 58338 61049 80916
13603H0916p014n8031j6392M9323o728l1093p37j2082k2269J952K8609k7481m3025
$$ 80916 73902 15871 -521 48802 42074 10981 10244 -1838 -24107 -22155 6454 -21027 -64052
13590f4052l162M6921O4321K7073k8884l8744K2221J1219j9002Q908P44K4471
$$ -64052 -67214 -20293 44028 71101 42217 3473 25694 36913 17911 26819 27563 52034
13578E2034k0335l2077j0691J9926K0514J1070J3474K1079P458Q835j4752j3330
$$ 52034 31699 -378 -11069 8857 29371 40441 53915 74994 82452 91287 76535 63205
13566F3205k7253m439J1802j7221k6763n880r919J5393M3821J9390j7180m924
$$ 63205 35952 31513 43315 26094 -669 -6549 -16468 -1075 42746 62136 44956 40032
13554D0032J3326j9759j4722K6366K2420l1217l102o328J950l341M3921K4529
$$ 40032 53358 33599 18877 45243 67663 36446 33344 27016 28966 25625 69546 94075
13542I4075j728o119n4860m7600j070K2756o110K6488K5814J5942o1786j7349
$$ 94075 92347 86228 31368 -16232 -17302 5454 -656 25832 51646 67588 5802 -11547
13530a1547L8013K4310l716j5406k750j4287J7741J4350M397n7019l7230K6293
$$ -11547 26466 50776 47060 31654 28904 14617 32358 46708 51105 -5914 -43144 -16851
13518a6851J0684L0258l254l861J0164K5990J8890N2562J0951n1731o7759k9476
$$ -16851 -6167 24091 20837 16976 27140 53130 72020 124582 135533 83802 16043 -13433
13506a3433Q344L6665k8854m8115M260L3342M9154J7823L9103J6024q091j8530
$$ -13433 -5089 31576 2722 -45393 -41133 -7791 41363 59186 98289 114313 106222 87692
13494H7692k9518K303j7153Q102P349m0965J8290K2209j3809l336k6540o113K4528
$$ 87692 58174 60477 43324 51426 58775 17810 36100 58309 44500 41164 14624 8511 33039
13481C3039l4568j2375O939N614R4927N9675K055j0264n0291m969J7347k0752
$$ 33039 -1529 -13904 -6965 -1351 93576 153251 155306 145042 94751 89782 107129 86377
13469H6377l713j2265K8723J1717k0516j4809q814j7593l049J9853o742J7368
$$ 86377 82664 70399 99122 110839 90323 75514 66700 49107 46058 65911 59169 76537
13457G6537N1090J2588l4355k1698R580J7201j0517k2039K3013K0610j639k7648
$$ 76537 127627 140215 105860 84162 93742 110943 100426 78387 101400 122010 120371 92723
13445I2723k4109j7964R01J2886M1460j6591j0558L172N123j4182n9655j607L1569
$$ 92723 68614 50650 51551 64437 105897 89306 78748 81920 87043 72861 13206 11599 43168
13432D3168K0688n849J3687K4522j5193k9204k8552q443J7868p270m75M0596L3335
$$ 43168 63856 58007 71694 96216 81023 51819 23267 14824 32692 25422 24947 65543 98878
13419I8878J02J6697k4802K847p764J4988K5928k0975l9339O876m898j8873j9591
$$ 98878 98980 115677 90875 93722 85958 100946 126874 105899 66560 73436 68538 49665 30074
13406C0074K4722Q096J0P595J8873o127j0362M1851j3459r053Q086l1381K8743
$$ 30074 54796 62892 62902 70497 89370 83243 72881 114732 101273 92220 100306 68925 97668
13393I7668K9800K986k3628j86k1457M44k4281P836K1674K7920J3265n641j9505
$$ 97668 127468 130454 106826 106640 85183 85627 61346 69182 90856 118776 132041 126400 106895
13380A06895p660k2278N42J9935J1078K0799o897m4771R253j6430p467J0658j2685
$$ 106895 99235 76957 77499 97434 108512 129311 122414 77643 86896 70466 62999 73657 60972
13367F0972J2505K6642J4928o320K3687j5251j3496l7080n2130L02J3027L9489
$$ 60972 73477 100119 115047 108727 132414 117163 103667 66587 14457 14759 27786 67275
13355F7275K0788l1378n1191J2150J8335J1111N5368K1732k1806l6448k7120l0678
$$ 67275 88063 56685 5494 17644 35979 47090 102458 124190 102384 65936 38816 8138
13343H138O743K3309J0753M4650O850l2671o406J5746N782j5747J0460O989j2577
$$ 8138 14881 38190 48943 93593 100443 67772 61366 77112 82894 67147 77607 84596 72019
13330G2019M714j2685K189R980k7654j6168q33L9921K8102N879L6289J1517n1257
$$ 72019 76733 64048 66237 76217 48563 32395 31562 71483 99585 105464 141753 153270 102013
13317A02013m2921k9213j7174k5922K4542J5423m797j0326J1190J0139k4925p956
$$ 102013 59092 29879 12705 -13217 11325 26748 21951 11625 22815 32954 8029 73
13305G3K7932J097N223L8912j0017l8891L142K6854j4381k414j4115j4543K6922
$$ 73 28005 29102 34325 73237 63220 24329 27471 54325 39944 37530 23415 8872 35794
13292C5794K318l7744K0938R003L4849M7960J1736J2110o3696l6203K948L4084
$$ 35794 38112 368 21306 30309 65158 113118 124854 136964 73268 37065 40013 74097
13280G4097r691N398L5747q195l0364k9139k576j946M290J8589k1280O674M5589
$$ 74097 64406 69804 105551 97356 66992 37853 35277 33331 37621 56210 34930 41604 87193
13267H7193m732k7735j2825L4101p366j3319K6289k0985m2515M7184o351k4057
$$ 87193 82461 54726 41901 76002 68636 55317 81606 60621 18106 65290 58939 34882
13255C4882K6992J0202m226J3760l1994k1831R243K6276N3055J2533l8312m8019
$$ 34882 61874 72076 67850 81610 49616 27785 37028 63304 116359 128892 90580 42561
13243D2561l2996J1444K4100M697K1621m993l1499n1511K6306L9295p146J1671
$$ 42561 9565 21009 45109 49806 71427 66434 34935 -16576 9730 49025 41879 53550
13231E3550K5899K580N7668j3841l6084j6688J8398j6752j4016K7389L961K4019
$$ 53550 79449 82029 139697 125856 89772 73084 91482 74730 60714 88103 92064 116083
13219A16083R237q206N65l8521p136L640L301l5309O035k5787p272K2578L0720
$$ 116083 125320 117114 117679 79158 72022 75662 78963 43654 49689 23902 16630 39208 69928
13206F9928L1967K5647l1262J189q266k5498j2685j6428L4461N1530k299k5452
$$ 69928 101895 127542 96280 97469 89203 63705 51020 34592 69053 120583 118284 92832
13194I2832j716J2436j0560k764k7530J9618Q42J267L4304j1876k3505K59J0163
$$ 92832 91116 103552 92992 90228 62698 82316 83158 84425 118729 106853 83348 83607 93770
13181I3770R65J6444k1862k4883l297K2735j117l4782j5442Q087K1004O105O51
$$ 93770 94735 111179 89317 64434 61137 83872 82755 47973 32531 40618 61622 67727 68378
13168F8378M9554l3404m8888J8913J1849L7283K6485n7440p028J4996k052k3400
$$ 68378 117932 84528 35640 54553 66402 103685 130170 72730 65702 80698 78646 55246
13156E5246q037M5329p520J6408j7439k0649J4720M2785K20K6312K9490N969j9805
$$ 55246 47209 92538 85018 101426 83987 63338 78058 120843 121063 147375 176865 182834 163029
13143A63029m2316m7083n602K2080j0607J0528K6066K1566J8172J1811j979j6690
$$ 163029 120713 73630 68028 90108 79501 90029 116095 137661 155833 167644 165665 148975
13131A48975L611q494m1295k0282R433M6124N7891j0284l235K9940m634k6174
$$ 148975 152586 144092 102797 82515 91948 138072 195963 185679 182444 212384 207750 181576
13119A81576N780p651Q746j4552j5714K2524j1142j086P949L7788M1275j6922
$$ 181576 187356 179705 188451 173899 158185 180709 169567 168481 176430 214218 255493 238571
13107B38571k0820M8402R325O586L588L766K26L9105L0753o830j0376L3751N4213
$$ 238571 217751 266153 275478 282064 285652 289418 289644 328749 359502 352672 342296 376047 430260
13094D30260J517n57r171j1834P510K8007j2912r912j4228J1351M2382L2188j6653
$$ 430260 431777 431220 422049 410215 417725 445732 432820 422908 408680 420031 462413 494601 477948
13081D77948K5743P270M508O1511N0235K0884J6187L0038K3576M8308N5040O4995
$$ 477948 503691 510961 515469 576980 627215 648099 664286 694324 717900 766208 821248 886243
13069H86243M376q984N8122L8782K9711P4838R0623J09174Q8332J01061J11136
$$ 886243 890619 881635 939757 978539 1008250 1083088 1173711 1282885 1371217 1472278 1583414
13058A583414P9046J01115J32639J43304J55355J25764J20202J64676J90178J58870
$$ 1583414 1662460 1763575 1896214 2039518 2194873 2320637 2440839 2605515 2795693 2954563
13048B954563K16415K03220K02316K14490J81548J59105K43158K02824J84664
$$ 2954563 3170978 3374198 3576514 3791004 3972552 4131657 4374815 4577639 4762303
13039D762303J79809J96176K16130K06071K00764J93778J64774K11628K15064
$$ 4762303 4942112 5138288 5354418 5560489 5761253 5955031 6119805 6331433 6546497
13030F546497K17572K28132K10920J75650J26922J32552J49753J98688J69339
$$ 6546497 6764069 6992201 7203121 7378771 7505693 7638245 7787998 7986686 8156025
13021H156025J32689J46146J40832Q9910O2758J12541P8556J8164n421l3542p4438
$$ 8156025 8288714 8434860 8575692 8665602 8728360 8840901 8919457 8937621 8932200 8898658 8824220
13010H824220o4777n5686q0325r2993r7712j03718j00016j15146j24445j28145
$$ 8824220 8759443 8703757 8623432 8530439 8432727 8329009 8228993 8113847 7989402 7861257
13000G861257j10399q4402p3597r0657r6555j33513j39364j52706j37068j53918
$$ 7861257 7750858 7666456 7592859 7502202 7405647 7272134 7132770 6980064 6842996 6689078
12990F689078j06053j21432j50073j95280j56630j71213j59793j18382q1975j29684
$$ 6689078 6583025 6461593 6311520 6116240 5959610 5788397 5628604 5510222 5428247 5298563
12980E298563j64810j70762j79921j29210j07665n3130k4263k0300J511l702L2023
$$ 5298563 5133753 4962991 4783070 4653860 4546195 4493065 4468802 4448502 4450013 4446311 4478334
12969D478334O7162Q4361R5118J09810J43096J64691J30433J08325J74492K35918
$$ 4478334 4545496 4629857 4724975 4834785 4977881 5142572 5273005 5381330 5555822 5791740
12959E791740K17017K01889K40738K00342J57488J55243J78890J88735J99360
$$ 5791740 6008757 6210646 6451384 6651726 6809214 6964457 7143347 7332082 7531442
12950G531442J88688J39669J12608J60904J79573J63881J32950R6628J48608J93399
$$ 7531442 7720130 7859799 7972407 8133311 8312884 8476765 8609715 8706343 8854951 9048350
12940I048350J67809J87728J23951J81055J77434J14296M4967M0813J00252L2695
$$ 9048350 9216159 9403887 9527838 9708893 9886327 10000623 10045590 10086403 10186655 10219350
12930A0219350L782Q097m3179r2771q5685r6372j21492j33494j61529j57500j34181
$$ 10219350 10223132 10231229 10188050 10095279 10009594 9913222 9791730 9658236 9496707 9339207 9205026
12919I205026j37104j86453j82215j68264j56129j84172k13904j82605k01548
$$ 9205026 9067922 8881469 8699254 8530990 8374861 8190689 7976785 7794180 7592632
12910G592632j64506j95604k14250j99704k08314j83973j75660j71814k40931
$$ 7592632 7428126 7232522 7018272 6818568 6610254 6426281 6250621 6078807 5837876
12901E837876k56128k02196k15031k70423j97905k25660j66190j21703k10485
$$ 5837876 5581748 5379552 5164521 4894098 4696193 4470533 4304343 4182640 3972155
12892C972155j82226j55375j49511j69656j49664k06555j16857q4041q3847l3601
$$ 3972155 3789929 3634554 3485043 3315387 3165723 2959168 2842311 2758270 2674423 2640822
12882B640822o3223r4737j04916p3924m9952o0892n1168p5945n8240o4091n2755
$$ 2640822 2577599 2482862 2377946 2304022 2254070 2193178 2142010 2066065 2007825 1943734 1890979
12871A890979l5459l3556n4647o8959n1726j0685m7981k1225j8766o3724j1942
$$ 1890979 1855520 1821964 1767317 1698358 1646632 1635947 1587966 1566741 1547975 1484251 1472309
12860A472309Q96m6152m3799l865k1402n9152o598L3682l9999k2662p999k3153
$$ 1472309 1473205 1427053 1383254 1379389 1357987 1298835 1292237 1325919 1285920 1263258 1255259 1232106
12848A232106k7230l051J401j4130J1656o5508q2568N321K5421r977j6559j4962
$$ 1232106 1204876 1201825 1203226 1189096 1200752 1135244 1052676 1057997 1083418 1073441 1056882 1041920
12836A041920m7403j0820o242r902M1044o4386o0461l7892K531o173K4748M6944
$$ 1041920 994517 983697 977455 967553 1008597 944211 883750 845858 848389 842216 866964 913908
12824I13908P890J7076O084q0675k2625R834O3512M9678k880n2877n8346p492
$$ 913908 921798 938874 944958 864283 841658 851492 915004 964682 961802 908925 850579 843087
12812H43087K098j5210m1410j3250L7188L5950p826j720P894j7422J9642M757
$$ 843087 845185 829975 788565 775315 812503 848453 840627 838907 846801 829379 849021 853778
12800H53778l352l915j5026j490J6094J2370k4583j8296J8603l725R455J7847
$$ 853778 850426 846511 831485 829995 846089 858459 833876 815580 834183 830458 839913 857760
12788H57760j7458o329k4923p276K6304k8260K954J3926L885K4894k2580l4652
$$ 857760 840302 833973 809050 801774 828078 799818 802772 816698 820583 845477 822897 788245
12776G88245j2778l6221l5785J6446P219J0437L0123K7211j040o669m1207j4371
$$ 788245 775467 739246 703461 719907 727126 737563 767686 794897 793857 787188 745981 731610
12764G31610m0181m744L607K3045L5235m6047m0576k1987K4775K2811l2149j0479
$$ 731610 691429 686685 690292 713337 748572 702525 661949 639962 664737 687548 655399 644920
12752F44920J4131J827O093m054L1120l8810k8832l1884p4321l461M732k691R304
$$ 644920 659051 660878 666971 662917 694037 655227 626395 594511 520190 516729 521461 518770 528074
12739E28074L9043M6200n1691n2446K3203N1798K1964k9467k0020j3629J9511
$$ 528074 567117 613317 561626 509180 532383 584181 606145 576678 556658 543029 562540
12728E62540J3336k5502k2484j7422M0139M390Q497K4076O206q721l9334O416
$$ 562540 575876 550374 527890 510468 550607 554997 563494 587570 593776 585055 545721 552137
12716E52137M2647J1933m0133m2886j2679l3005K0227L7819N473J5955J3515q381
$$ 552137 594784 606717 566584 523698 511019 478014 498241 536060 541533 557488 571003 562622
12704E62622p626J9474l0780l490L273q088k8676m7862l042O2103M1810j8673
$$ 562622 554996 574470 543690 540200 543473 535385 506709 458847 455805 517908 559718 541045
12692E41045m700j7108k3130l1687K729K5425K8955k5036J1222j6792j9256r306
$$ 541045 536345 519237 496107 464420 467149 492574 521529 496493 507715 490923 471667 462361
12680D62361K9563k9055k2989J6232M4294M9058O2020L9410m1639m1398J647j4227
$$ 462361 491924 462869 439880 456112 500406 549464 611484 650894 609255 567857 569504 555277
12668E55277l4997j9212k5578K8869o778o217K6885J2443M6060L3536l1338q561
$$ 555277 520280 501068 475490 504359 497581 491364 518249 530692 576752 610288 578950 570389
12656E70389k4962K3108L208n2132J085L8268k0573l2977Q630R454J1636j281
$$ 570389 545427 568535 571743 519611 520696 558964 538391 505414 514044 523498 535134 533853
12644E33853Q881l1682m3249k9720M370L4897N632n060M246j2003J1260K9466
$$ 533853 542734 511052 467803 438083 442453 477350 482982 477922 482168 470165 481425 510891
12632E10891j686j1637K9082j6810n8667m396K3388J8377j3280R927K1110m597
$$ 510891 509205 497568 526650 509840 451173 446777 470165 488542 475262 485189 506299 501702
12620E01702m1633o193l808J5K4063L7595K3436k9130p383K703J4043k6841j8286
$$ 501702 460069 453876 450068 450083 474146 511741 535177 506047 498664 501367 515410 488569 470283
12607D70283k6600m139J5854R890J1908K8184L1268k5354m9608J6785M6344K338
$$ 470283 443683 439544 455398 465288 477196 505380 536648 511294 461686 478471 524815 527153
12595E27153r437K4842K5905k3400j4925K984K2782k8678j2895J4907R528n82
$$ 527153 517716 542558 568463 545063 530138 533122 555904 527226 514331 529238 538766 538184
12583E38184q154j6463l8753J7684L1077M371j3039j8554J3037L7575J5921O012
$$ 538184 530030 513567 474814 492498 523575 527946 514907 496353 509390 546965 562886 568898
12571E68898j6236R997J9099J6947M626j4213n0779j5266P90K1058L5963q774
$$ 568898 552662 562659 581758 598705 603331 589118 538339 523073 523863 544921 580884 572110
12559E72110m957L8267j0944l2911k4633Q156j1114j2321k006K2672M6449k1734
$$ 572110 567153 605420 594476 561565 536932 545088 533974 521653 519647 542319 588768 567034
12547E67034Q796M525j9019l8208j8024L1327K893J319N1998j2188j7629m057
$$ 567034 575830 580355 561336 523128 505104 536431 539324 540643 592641 580453 562824 558767
12535E58767k8024j5031N3425r780j8731L240n790K8334L0448M036J771K2317
$$ 558767 530743 515712 569137 559357 540626 543866 538076 566410 596858 600894 602665 624982
12523F24982J6222k1632L8278Q110j8367j9237L0929O1997O6575j6921j9517m2490
$$ 624982 641204 619572 657850 665960 647593 628356 659285 721282 787857 770936 751419 708929
12511G08929J1162L1504j0756n3334j7087m1705p1146J9135M0640O861R83r609
$$ 708929 720091 751595 740839 687505 670418 628713 557567 576702 617342 624203 625186 615577
12499F15577L336J6700J2292J1860j9237J3585J7616J0283L4187r574l8700j1027
$$ 615577 618913 635613 647905 659765 640528 654113 671729 682012 716199 706625 667925 656898
12487F56898J4532k7919l7213j0913K0579L5104J9473O9068J8282l5921N342M3245
$$ 656898 671430 643511 606298 595385 615964 651068 670541 739609 757891 721970 727312 770557
12475G70557J5549j6726k9592J4071O057j7743l5644o4432k3207L0535j135J1047
$$ 770557 786106 769380 739788 753859 759916 742173 706529 642097 618890 649425 648290 659337
12463F59337k6299J0699N46K592k8057j0301K1526J4169l4026p833K3795N9648
$$ 659337 633038 643737 644283 646875 618818 608517 630043 644212 610186 602353 626148 685796
12451F85796Q807o240J1324j8913l6576P02O2270L8092k1308j3767k8871l1474
$$ 685796 694603 688363 699687 680774 644198 644900 707170 745262 723954 710187 681316 649842
12439F49842r75K6778j0632J0393N38J0190J0995k6386j8781n5394L8889M7224
$$ 649842 648867 675645 665013 675406 675944 686134 697129 670743 651962 596568 635457 682681
12427F82681J4714p64j5584K024K303K861m6911l2072P647K6724M6562j4241l0390
$$ 682681 697395 696631 681047 683071 685374 688235 641324 609252 616899 643623 690185 675944 645554
12414F45554r788J2332J5076J058N380l0831n445J0649n194L1319N010M4061K5917
$$ 645554 635766 648098 663174 664232 669612 638781 633336 643985 638791 670110 675120 719181 745098
12401G45098l6703j2292k9853J4484K9690M0710l0694l1839N1935K0411k6291
$$ 745098 708395 696103 666250 680734 710424 751134 720440 688601 740536 760947 734656
12390G34656J9183k5883r807P631O201N155M8647j1696l6602J0949L1358N719
$$ 734656 753839 727956 718149 725780 731981 737136 785783 774087 737485 748434 779792 785511
12378G85511o220n2577j3431Q449L4589L1761j5197j0990j7174q839j9309J0640
$$ 785511 779291 726714 713283 721732 756321 788082 772885 761895 744721 735882 716573 727213
12366G27213K3383K0694j7535j0024l4105j7800P0474J6048K2322L2858j0646
$$ 727213 750596 771290 753755 743731 709626 691826 762300 778348 800670 833528 822882
12355H22882O37j3551k6154J9702j9710m848J755j3203k672j6759j7832J0706
$$ 822882 823519 809968 783814 803516 783806 778958 780713 767510 764838 748079 730247 740953
12343G40953J8146K8959L8604K0030o042l7313J8774R333K3224O032l832J2381
$$ 740953 759099 788058 826662 846692 840650 803337 822111 831444 854668 860700 856868 869249
12331H69249L141J3614j5138m4678k2927q292N3393N6908j524j9102k6907p232
$$ 869249 872390 886004 870866 826188 803261 794969 848362 905270 903746 884644 857737 850505
12319H50505l151M9141L0623J4268k5791m0537J0700M1494K0348j0909K5995J6929
$$ 850505 847354 896495 927118 941386 915595 875058 885758 927252 947600 936691 962686 979615
12307I79615K7865L1773K128m8506j9413J0420L3959r50k4034o609l106J5619
$$ 979615 1007480 1039253 1041381 992875 973462 983882 1017841 1016891 992857 986248 983142 998761
12295I98761L254K1562K998j6792p81K3437K6257K087j1588l3889l5127l584M4448
$$ 998761 1002015 1023577 1026575 1009783 1009002 1032439 1058696 1060783 1049195 1015306 980179 976595 1021043
12282A021043L5874j6966m8022K119j209n754M6348k2563O585J6513L588J4027
$$ 1021043 1056917 1039951 991929 994048 992839 987085 1033433 1010870 1017455 1033968 1037556 1051583
12270A051583m645R994J0344j2042K194P993r9l6801j9040N3241K1724j0688K4202
$$ 1051583 1046938 1056932 1067276 1055234 1057428 1065421 1065322 1028521 1009481 1062722 1084446 1073758 1097960
12257A097960J2375l0101l5085k308O0862j5532l4909M0251L0359k0457n762J058
$$ 1097960 1110335 1080234 1045149 1042841 1103703 1088171 1053262 1093513 1123872 1103415 1097653 1098711
12245A098711K7760K9782n7417j2836N0798J7097j2385J3794j1129J0974L015
$$ 1098711 1126471 1156253 1098836 1086000 1136798 1153895 1141510 1155304 1144175 1155149 1158164
12234A158164n809m4001l5601K2847M4557l4953O691J2578M513K7137N4183K4758
$$ 1158164 1152355 1108354 1072753 1095600 1140157 1105204 1111895 1124473 1128986 1156123 1210306 1235064
12222A235064J2368r754J6084J7547M463J7525P679k9414n1184j5385L4174N438
$$ 1235064 1247432 1237678 1253762 1271309 1275772 1293297 1300976 1271562 1220378 1204993 1239167 1244605
12210A244605j7679P132K0765K8859j0940j6016l3904j2023J6092j148J8441j0648
$$ 1244605 1226926 1234058 1254823 1283682 1272742 1256726 1222822 1210799 1226891 1225743 1244184 1233536
12198A233536J3333P81J0546L6034L4154K7050M1873l4679J7581K2229K5824l985
$$ 1233536 1246869 1247650 1258196 1294230 1328384 1355434 1397307 1362628 1380209 1402438 1428262 1424277
12186A424277K6507r747j6852k373k5976J6008J3402j6286M472K8553k8763r991
$$ 1424277 1450784 1441037 1424185 1421812 1395836 1411844 1425246 1408960 1413432 1441985 1413222 1403231
12174A403231P778L2283L2653J486n7882l1J8073J8228K8032Q74Q248J3999J8261
$$ 1403231 1411009 1443292 1475945 1477431 1419549 1419518 1437591 1455819 1483851 1484725 1492973 1506972 1525233
12161A525233o0672k0844J131n854P782J5611L7193M0787n284p7155J4339N6033
$$ 1525233 1464561 1443717 1444848 1438994 1446776 1462387 1499580 1540367 1535083 1457928 1472267 1528300
12149A528300J1966l8419K0789N5860K1182n874K116l0312k8053j5608M0602R511
$$ 1528300 1540266 1501847 1522636 1578496 1599678 1593804 1595920 1565608 1537555 1521947 1562549 1572060
12137A572060J5556M2707l1479K4111J4205j5450L2898M3112k2914l5628m9157
$$ 1572060 1587616 1630323 1598844 1622955 1637160 1621710 1654608 1697720 1674806 1639178 1590021
12126A590021j8471O186J3220K2326J2486P785O96M8940n80l3750k5685l640M8500
$$ 1590021 1571550 1577736 1590956 1613282 1625768 1633553 1634249 1683189 1682609 1648859 1623174 1619534 1668034
12113A668034N645k8606q407J7417P3277K2296l9725J7641r575k2355J5741l6240
$$ 1668034 1673679 1645073 1636666 1654083 1727360 1749656 1709931 1727572 1717997 1695642 1711383 1675143
12101A675143p523N6145M679K1962N3878l1012l6022m0037M6860O6841J5083j5616
$$ 1675143 1667620 1723765 1728444 1750406 1804284 1773272 1737250 1697213 1744073 1810914 1825997 1810381
12089A810381l639J808m5726j2723o865K1624M9475K3010m957M2356M2316k2731
$$ 1810381 1806742 1808550 1762824 1750101 1743236 1764860 1814335 1837345 1832388 1874744 1917060 1894329
12077A894329j8646n910j1660j6362K0876K9308K5260j472J3055J8979r438k9749
$$ 1894329 1875683 1869773 1858113 1841751 1862627 1891935 1917195 1915723 1928778 1947757 1938319 1908570
12065A908570m731k377K0492L828R711J3642K3145Q523j9498j445Q342l208m942
$$ 1908570 1903839 1901462 1921954 1925782 1935493 1949135 1972280 1980803 1961305 1959860 1968202 1964994 1960052
12052A960052n226J7263K6710Q447k5942p099N32j3074L7495J1688J9204j0600
$$ 1960052 1954826 1972089 1998799 2007246 1981304 1974205 1974737 1961663 1999158 2010846 2030050 2019450
12040B019450N8080K3274j3895m8494k4332K2577J2185N408J4898L0416K4834
$$ 2019450 2077530 2100804 2086909 2038415 2014083 2036660 2048845 2054253 2069151 2099567 2124401
12029B124401J2590l597n354J7037L6062j4698k7336k0778J8733j0962O599R637
$$ 2124401 2136991 2133394 2128040 2145077 2181139 2166441 2139105 2118327 2137060 2126098 2132697 2142334
12017B142334L6596j3744j261J0020N764K1139j258K1190n1732j1242L7604L6355
$$ 2142334 2178930 2165186 2163925 2173945 2179709 2200848 2199590 2220780 2169048 2157806 2195410 2231765
12005B231765l012J4641P893J3550L3616M2652k9918m5470N493J2708m57K2288
$$ 2231765 2228753 2243394 2251287 2264837 2298453 2341105 2311187 2265717 2271210 2283918 2283461 2305749
11993B305749J939J420J4289k5413k5479M203M6869N8074Q111j8750j9220L0603
$$ 2305749 2307688 2309108 2323397 2297984 2272505 2276708 2323577 2381651 2389762 2371012 2351792 2382395
11981B382395K0642J0307R811j2457k0286q69k4043O574k0705L4447J3014P959
$$ 2382395 2403037 2413344 2423155 2410698 2390412 2389543 2365500 2372074 2351369 2385816 2398830 2406789
11969B406789J9994R925n5919j4677j496j971L9738J2458J0107j8390l0040j9415
$$ 2406789 2426783 2436708 2380789 2366112 2364616 2362645 2402383 2414841 2424948 2406558 2376518 2357103
11957B357103j001J3900N3310J2378m4168q048J0785J5140j3481l2015K1940R40
$$ 2357103 2356102 2370002 2423312 2435690 2391522 2383474 2394259 2409399 2395918 2363903 2385843 2386783
11945B386783j9601K449K83l5656J122r039J1709L4997k589m625m903l3166j0528
$$ 2386783 2367182 2369631 2369914 2334258 2335380 2326341 2338050 2373047 2370458 2365833 2360930 2327764 2317236
11932B317236j7803J9198K999L4796L0475M9418k7829l6370R923J311j3779j4698
$$ 2317236 2299433 2318631 2321630 2356426 2386901 2436319 2408490 2372120 2382043 2383354 2369575 2354877
11920B354877K0872N6712N4491J065K3861o031n4447l9281Q400j0825O88J5853
$$ 2354877 2375749 2432461 2486952 2488017 2511878 2505847 2451400 2412119 2420519 2409694 2410382 2426235
11908B426235P874k6951J5396K7920k0978j3768L1199K8751K233l2310j7390J4078
$$ 2426235 2434109 2407158 2422554 2450474 2429496 2415728 2446927 2475678 2477911 2445601 2428211 2442289
11896B442289p000j0466Q811J0569M722q2306o2211L173l133J559L8585M4665
$$ 2442289 2435289 2424823 2433634 2444203 2448925 2366619 2304408 2307581 2304448 2306007 2344592 2389257
11884B389257J5849m1979k0981j612J7746k9977n9950N4478J8619l2004j2865
$$ 2389257 2405106 2363127 2342146 2340534 2358280 2328303 2268353 2322831 2341450 2309446 2296581
11873B296581R234J4572J9756K8387l745N931P419k4438k6176k3224j3165l0071
$$ 2296581 2305815 2320387 2340143 2368530 2364785 2370716 2378135 2353697 2327521 2304297 2291132 2261061
11861B261061K0342k8989n558K8638J6216J7720R647K6430J8748k9634l0645k595
$$ 2261061 2281403 2252414 2246856 2275494 2291710 2309430 2319077 2345507 2364255 2334621 2303976 2301381
11849B301381J1021J5183L4914O2842J6674J1337K4640O5132M4958P3038J10244
$$ 2301381 2312402 2327585 2362499 2425341 2442015 2453352 2477992 2543124 2588082 2661120 2771364
11838B771364Q9732Q3502J13304J07135J43455J97442J24633J18970J09885p631
$$ 2771364 2861096 2944598 3057902 3165037 3308492 3505934 3630567 3749537 3859422 3851791
11828C851791l8968m1283r1119p9667m0781q4788n9032q5983k3839J8634L7442
$$ 3851791 3812823 3771540 3680421 3600754 3559973 3475185 3416153 3330170 3306331 3324965 3362407
11817C362407O3111Q8374J22594J54179K14760K62086L75681L37456L07770K22360
$$ 3362407 3425518 3513892 3636486 3790665 4005425 4267511 4643192 4980648 5288418 5510778
11807E510778J54734L5735l0858j34840k08639k42791k97782k63690k18344k35642
$$ 5510778 5665512 5701247 5670389 5535549 5326910 5084119 4786337 4522647 4304303 4068661
11797D068661j75544j43571j38307q6754r822N3418j1827L0591P5990J21419J44822
$$ 4068661 3893117 3749546 3611239 3524485 3514663 3568081 3556254 3586845 3662835 3784254 3929076
11786C929076J74611J19543M1290L9133J3778m0129q2333j23815j52686j54284
$$ 3929076 4103687 4223230 4264520 4303653 4317431 4277302 4194969 4071154 3918468 3764184
11776C764184j20076j57548j62016j03534p4671j9184N322Q0621P3377P0263J63784
$$ 3764184 3644108 3486560 3324544 3221010 3146339 3127155 3132477 3213098 3286475 3356738 3520522
11765C520522K02177K21831K60984L36516L53818L93191L21019J95509J56960
$$ 3520522 3722699 3944530 4205514 4542030 4895848 5289039 5610058 5805567 5962527
11756E962527M1283m7742j56845k32185k41786j74399j54420j73662j22013o7294
$$ 5962527 6003810 5956068 5799223 5567038 5325252 5150853 4996433 4822771 4700758 4633464
11746D633464k6065L8887J38704J61009K21215L76872N09862N59438O70904P68955
$$ 4633464 4607399 4646286 4784990 4945999 5167214 5544086 6053948 6613386 7284290 8053245
11736H053245O66756N79706L94182J81559m8901k71138m28151n75644o15860o03653
$$ 8053245 8720001 9299707 9693889 9875448 9826547 9555409 9127258 8551614 7935754 7332101
11726G332101n44789n04003m84768l69961l03168k17562j06041l8741L7729Q2076
$$ 7332101 6787312 6283309 5798541 5428580 5125412 4907850 4801809 4763068 4800797 4882873
11716D882873J33539J61014K15434K60320K06090J61197O4851L929j12830j94789
$$ 4882873 5016412 5177426 5392860 5653180 5859270 6020467 6085318 6089247 5976417 5781628
11706E781628k53501l18172l08714l31854l49969l02745k49490j68310j63477
$$ 5781628 5528127 5209955 4901241 4569387 4219418 3916673 3667183 3498873 3335396
11697C335396j39875j22644l0951K7837r586L4607J05839J49381J76786J54923
$$ 3335396 3195521 3072877 3041926 3069763 3060177 3094784 3200623 3350004 3526790 3681713
11687C681713J83300J79779J53535P2121p613o9956j24859j05887j44251j84709
$$ 3681713 3865013 4044792 4198327 4270448 4262835 4192879 4068020 3962133 3817882 3633173
11677C633173j35701j20084r6846p0453j9283Q918K2694O6283J00088J49198K91646
$$ 3633173 3497472 3377388 3280542 3210089 3190806 3199724 3222418 3288701 3388789 3537987 3829633
11666C829633L20021L30186L33443L33481K94660K18111J20711k0493j63961k26504
$$ 3829633 4149654 4479840 4813283 5146764 5441424 5659535 5780246 5759753 5595792 5369288
11656E369288k90692l48999l31702l47882k89322k12914j60277j52406j48694
$$ 5369288 5078596 4729597 4397895 4050013 3760691 3547777 3387500 3235094 3086400
11647C086400o2939R117j1778o379O4690R7651N1719R2199P3190K6552J9699K8774
$$ 3086400 3023461 3032578 3020800 3014421 3079111 3176762 3228481 3320680 3393870 3420422 3440121 3468895
11635C468895j7735p6894j49114j81930j81150j62277j63673j89341j22048j10125
$$ 3468895 3451160 3374266 3225152 3043222 2862072 2699795 2536122 2346781 2224733 2114608
11625B114608j03022p9735r1042n6640j1305l4091n5139n9973n4242j8659j7250
$$ 2114608 2011586 1931851 1840809 1784169 1772864 1738773 1683634 1623661 1569419 1550760 1533510
11614A533510o0063j5931o367n1749L5871P580l4619o840J2219l9209l1883J460
$$ 1533510 1473447 1457516 1451149 1399400 1435271 1442851 1408232 1401392 1413611 1374402 1342519 1343979
11602A343979N7j3030M057r646m3058q857K3351p132m899M1791n2338l8603l2269
$$ 1343979 1344036 1331006 1335063 1325417 1282359 1273502 1296853 1289721 1284822 1326613 1274275 1235672 1203403
11589A203403J9019M853q265K158J0936l1410M475Q822j6770j7149o101l3373
$$ 1203403 1222422 1227275 1219010 1221168 1232104 1200694 1205169 1213991 1197221 1180072 1173971 1140598
11577A140598q454k791J5068K8041M202j5835o5918m0455q46j1565k3376m38L5654
$$ 1140598 1132144 1129353 1144421 1172462 1176664 1160829 1094911 1054456 1053610 1042045 1018669 1018231 1053885
11564A053885K2574K2868o952l047K8647J3962j1525O111j1461j1449k0462m5855
$$ 1053885 1076459 1099327 1092375 1089328 1117975 1131937 1120412 1126523 1115062 1103613 1083151 1037296
11552A037296k0284K3950M8078o760m9375j2889R014k0640K7186L3883K0579l7
$$ 1037296 1017012 1040962 1089040 1082280 1032905 1020016 1029030 1008390 1035576 1069459 1090038 1090001
11540A090001m5414l6580k1266j1075q852L4918J8170J719j0816J0998J3920j4888
$$ 1090001 1044587 1008007 986741 975666 966814 1001732 1019902 1021621 1010805 1021803 1035723 1020835
11528A020835o149m7735P88K7506j8313k1605j31J2801l7540L6514O161n5509
$$ 1020835 1014686 966951 967739 995245 976932 955327 955196 967997 930457 966971 973132 917623
11516I17623k5623K4959L1775p335l616j3991K3004L267j3408j4633j7943K7869
$$ 917623 892000 916959 948734 941399 937783 923792 946796 950063 936655 922022 904079 931948
11504I31948l661M178K503n80j3235k6725L2029N586J1453P065L3031j3439M964
$$ 931948 928287 932465 934968 934388 921153 894428 926457 932043 943496 950561 983592 970153 975117
11491I75117j8251R855J1989l6195j8585L4271L1288k8004J5695L9118m1240l0729
$$ 975117 956866 966721 978710 942515 923930 958201 989489 961485 977180 1016298 975058 944329
11479I44329O69j8787L818K370J1466l824j929J8767J390K9561p182l3037l4533
$$ 944329 944998 926211 930029 932399 943865 940041 938112 956879 958269 987830 980648 947611 913078
11466I13078l1117L0400K3113k4218m003M4920J5246J6924O151j8960J329n1219
$$ 913078 881961 912361 935474 911256 907253 952173 967419 984343 990494 971534 972863 921644
11454I21644k0020o035l1947j5197m0206n425n494Q639K4102K2933J9464k555
$$ 921644 901624 895589 863642 848445 808239 802814 797320 805959 830061 852994 872458 869903
11442H69903m2304j3742K9122M2137l9526o38q464m2320Q595K7409j949L7949
$$ 869903 827599 813857 842979 885116 845590 844952 836488 794168 802763 830172 828223 866172
11430H66172O1477j2871J4209j7521Q436J0305j6485K831K8881j0018q294K9550
$$ 866172 927649 914778 928987 911466 919902 930207 913722 916553 945434 935416 927122 956672
11418I56672K2013J5578j0480k4336L1698J0791J7965r063l7331k2268L3874L7761
$$ 956672 978685 994263 983783 959447 991145 1001936 1019901 1010838 973507 951239 985113 1022874
11406A022874o383M869M8869k7763L859K1226j462k0116M049K5472J4036K694
$$ 1022874 1016491 1021360 1070229 1042466 1046325 1067551 1066089 1045973 1050022 1075494 1089530 1092224
11394A092224p1228j655K4686J8500K1234J8112Q096J9212n143n879q763J1523
$$ 1092224 1020996 1019341 1044027 1062527 1083761 1101873 1109969 1129181 1124038 1118159 1109396 1120919
11382A120919L3291N969m5550j056j4757j5813J4399L3875M7287K1152N653j022
$$ 1120919 1154210 1160179 1114629 1113573 1098816 1083003 1097402 1131277 1178564 1199716 1205369 1204347
11370A204347q009k0764j5449k1384k6018N7458L8354L1898M947p941Q795k6447
$$ 1204347 1196338 1175574 1160125 1138741 1112723 1170181 1208535 1240433 1245380 1237439 1246234 1219787
11358A219787j0849J1371O06k5403O934J8710L9983P6174L1697K5885L3196K471
$$ 1219787 1208938 1220309 1220915 1195512 1202446 1221156 1261139 1337313 1369010 1394895 1428091 1430562
11346A430562m2328p926k488J3176K198K1295L9690K1051J2066N8584M1054K3045
$$ 1430562 1388234 1380308 1377820 1390996 1393194 1414489 1454179 1475230 1487296 1545880 1586934 1609979
11334A609979j3071M2898N8396o678M0688K2264M7081N3369M8623Q731K715N4549
$$ 1609979 1596908 1639806 1698202 1691524 1732212 1754476 1801557 1854926 1903549 1912280 1914995 1969544
11322A969544P3469O9266M0327o224O007J0903M2294O8345O0388L4575J7282K8427
$$ 1969544 2043013 2112279 2152606 2146382 2152389 2163292 2205586 2273931 2334319 2368894 2386176 2414603
11310B414603N6010L7716L3771N0789P7304K5381M7156O1627J6593P0358J20616
$$ 2414603 2470613 2508329 2542100 2592889 2670193 2695574 2742730 2804357 2820950 2891308 3011924
11299C011924O3411L2322P1669Q0120O3336L0947M4064N3843K8112L9693K9526
$$ 3011924 3075335 3107657 3179326 3259446 3322782 3353729 3397793 3451636 3479748 3519441 3548967
11288C548967Q7302J06383L6308J9515K7663K5098O0085M6801L9462M0333K8336
$$ 3548967 3636269 3742652 3778960 3798475 3826138 3851236 3911321 3958122 3997584 4037917 4066253
11277D066253L6021J5689O1976P0731J0469J9308P961O4456L2410p998P348L1032
$$ 4066253 4102274 4117963 4179939 4250670 4261139 4280447 4288408 4352864 4385274 4377276 4384624 4415656
11265D415656L6736K2093M93k9873m112M0542j664n794J0202J0147L101m134J0839
$$ 4415656 4452392 4474485 4474978 4445105 4440993 4481535 4479871 4474077 4484279 4494426 4497527 4493393 4504232
11252D504232K439J7601Q104J7775j711K176J2818j1508J9399N4277J2225M1666
$$ 4504232 4506671 4524272 4532376 4550151 4548440 4550616 4563434 4551926 4571325 4625602 4637827 4679493
11240D679493K6568o002J3786j4124R750N8202N3344L0408K5993M1589N1581Q1266
$$ 4679493 4706061 4700059 4713845 4699721 4709471 4767673 4821017 4851425 4877418 4919007 4970588 5051854
11228E051854O3079P5138j0642J9201N3225O6325J11661R4574N2998O7651K5162
$$ 5051854 5114933 5190071 5179429 5198630 5251855 5318180 5429841 5524415 5577413 5645064 5670226
11217E670226K5923N3059O5735J06901O2751N5424Q6111M9327Q4004P3401O7956
$$ 5670226 5696149 5749208 5814943 5921844 5984595 6040019 6126130 6175457 6259461 6332862 6400818
11206F400818O3875R397M5324J6272O037P2016N8849Q5705L3972K2185L2191J8572
$$ 6400818 6464693 6474090 6519414 6535686 6541723 6613739 6672588 6758293 6792265 6814450 6846641 6865213
11194F865213k8282j8719K6647r283J0220j9713n3499m2409P767r921q3166o9048
$$ 6865213 6836931 6818212 6844859 6835576 6845796 6826083 6772584 6730175 6737942 6728021 6644855 6575807
11182F575807k4350p573l3366l5713n0734p5813n4269n4278p0400p6993p9783
$$ 6575807 6551457 6543884 6510518 6474805 6424071 6348258 6293989 6239711 6169311 6092318 6012535
11171F012535p2583l4527o3424p6036q3314n6903l1895n6372m3903k7693j01886
$$ 6012535 5939952 5905425 5842001 5765965 5682651 5625748 5593853 5537481 5493578 5465885 5363999
11160E363999j13366k8512m8540n0417j2321l3475j00917n6804l5525l4586l2169
$$ 5363999 5250633 5222121 5173581 5123164 5110843 5077368 4976451 4919647 4884122 4849536 4817367
11149D817367j8405j9169k5123n7840k3546k9326k4146k3015k882J2268O640k6050
$$ 4817367 4798962 4779793 4754670 4696830 4673284 4643958 4619812 4596797 4593915 4606183 4612823 4586773
11137D586773l9323m4833j165K3074M2520O5405j4182m4868j1728j3375j8530
$$ 4586773 4547450 4502617 4501452 4524526 4567046 4632451 4618269 4573401 4561673 4548298 4529768
11126D529768n158M3524k678j0133m402j9291o230j5608m3726k3269j7922k1036
$$ 4529768 4524610 4568134 4565456 4555323 4550921 4531630 4525400 4509792 4466066 4442797 4424875 4403839
11114D403839l4913l411j7189k0398n2388m7730l6946l2302l4869j3407l1420
$$ 4403839 4368926 4365515 4348326 4327928 4275540 4227810 4190864 4158562 4123693 4110286 4078866
11103D078866k8743m1742m3321n7457q7013p2828m3811o6661n3290p306j531j8008
$$ 4078866 4050123 4008381 3965060 3907603 3820590 3747762 3703951 3637290 3584000 3576694 3575163 3557155
11091C557155l9530j06692o2350m3913p0320p9367k8746n3309p8528n6096o4327
$$ 3557155 3517625 3410933 3348583 3304670 3234350 3154983 3126237 3072928 2994400 2938304 2873977
11080B873977n7771n3819o3840n5486p7767m5621k3429m6390o5049l5423k3802
$$ 2873977 2816206 2762387 2698547 2643061 2565294 2519673 2496244 2449854 2384805 2349382 2325580
11069B325580O702N256k8341n1698o1314m9121n9988o6483k5808l1736k8410j5328
$$ 2325580 2332282 2337538 2309197 2257499 2196185 2147064 2087076 2020593 1994785 1963049 1934639 1919311
11057A919311k7348k6210m4417n7821o33K5772J9969k5127l6313J1787m2413j8405
$$ 1919311 1891963 1865753 1821336 1763515 1762882 1788654 1808623 1783496 1747183 1758970 1716557 1698152
11045A698152j3797o8662k1117J091j8936o314O696k7996k3928J00L309o560p875
$$ 1698152 1684355 1615693 1594576 1595667 1576731 1570417 1577113 1549117 1525189 1525289 1528598 1522038 1514163
11032A514163J3007M4852n5669m0591m1554n1933J7788K7477q104P765q98Q149
$$ 1514163 1527170 1572022 1516353 1475762 1434208 1382275 1400063 1427540 1419436 1427201 1426303 1434452
11020A434452m3024K6699k4265q6384j3639k1787q009k3491J5592p245n161M1427
$$ 1434452 1391428 1418127 1393862 1307478 1293839 1272052 1264043 1240552 1256144 1248899 1243738 1285165
11008A285165j2006l1181m4571m2484k8655n7683m2847j7410Q212j6308L3140
$$ 1285165 1273159 1241978 1197407 1154923 1126268 1068585 1025738 1008328 1016540 1000232 1033372
10997A033372k0497k9792K2803J681k5665k5010l3194j1731L6687l4338j7365
$$ 1033372 1012875 983083 1005886 1007567 981902 956892 923698 911967 948654 914316 896951
10986H96951k2720m1591j7030J62L331J7182l4363m765M8235K6200M8443k9840
$$ 896951 874231 832640 815610 815772 819103 836285 801922 797157 845392 871592 920035 890195
10974H90195o0084l9584l3425j5051m5946k6489M7053M7000j082m2982j7104J4464
$$ 890195 830111 790527 757102 742051 696105 669616 716669 763669 762587 719605 702501 716965
10962G16965K7500N718j093o569k8652j8183k0852r165J6227J8368p367j8628
$$ 716965 744465 750183 749090 742521 713869 695686 674834 665669 681896 700264 692897 674269
10950F74269Q762K4962q503M862K1438K2508m4783l7235l5983J2373O877M1098
$$ 674269 683031 707993 699490 704352 725790 748298 703515 666280 630297 642670 649547 690645
10938F90645j3900m3534j0099j969l5185k5492J6464J4290j0897L241J6672L6638
$$ 690645 676745 633211 623112 621143 585958 560466 576930 591220 580323 583564 600236 636874
10926F36874J3854M821j4233k4814j4227K029j001o6626m8677J8282O473J539
$$ 636874 650728 655549 641316 616502 602275 604304 603303 536677 488000 506282 512755 514294
10914E14294o897j7181L5481J1760K626k7328J8165L3681L0764J4166l5637k4318
$$ 514294 507397 490216 525697 537457 540083 512755 530920 564601 595365 609531 573894 549576
10902E49576l566P757j8440K6283n717j6951M034m949k9566L5340J8926j7077
$$ 549576 546010 553767 535327 561610 555893 538942 542976 538027 508461 543801 562727 545650
10890E45650k0686k9874J5497m05k7631L0320L4991o052j5236J5925J8668J398
$$ 545650 524964 495090 510587 510182 482551 512871 547862 541810 526574 542499 561167 562565
10878E62565p3378k6061k6312n8149J8028Q179K6800K3923L1910J1049n766l4254
$$ 562565 489187 463126 436814 378665 396693 404872 431672 455595 487505 498554 492788 458534
10866D58534j7371k0022n277J8575K7141L9527L4695J5492j8779j2611m7029m6353
$$ 458534 441163 421141 415864 434439 461580 501107 535802 551294 532515 519904 472875 426522
10854D26522k8758K4387J9015J2648j1635l842L4046j4431l9386n068R930J3641
$$ 426522 397764 422151 441166 453814 442179 438337 472383 457952 418566 413498 423428 437069
10842D37069J5251m957J3825J37k9732J6975K8868k995q913J3587m241l5653j2574
$$ 437069 452320 447363 461188 461325 431593 448568 477436 474441 465528 479115 474874 439221 426647
10829D26647o631k8896L4447r003L4792N3053l7296j2530j6363p3129l6542K4051
$$ 426647 420016 391120 425567 416564 451356 504409 467113 454583 438220 365091 328549 352600
10817C52600K0641L9352L2054l0105m475k1526J2876j3461k2821L2668P104k4423
$$ 352600 373241 412593 444647 414542 410067 388541 401417 387956 365135 397803 404907 380484
10805C80484J2654j3207k4158k2099L5319K7111j4736j3354R548J2839M808M8589
$$ 380484 393138 379931 355773 333674 368993 396104 381368 368014 377562 390401 395209 443798
10793D43798k2322l1596p914K1840J4614k9974K2599j603n62M2062j8198o1298
$$ 443798 421476 389880 381966 403806 418420 388446 411045 409442 408880 450942 432744 371446
10781C71446m7851R289K1130M520p301k3979k0917M6344o034j2469R603j187k5111
$$ 371446 323595 332884 354014 358534 351233 327254 306337 352681 346647 334178 343781 342594 317483
10768C17483m855L5618L8289J4183J0994J9850J928k2535l9203m983Q1n357m209
$$ 317483 312628 348246 386535 400718 411712 431562 433490 410955 371752 366769 366850 361493 357284
10755C57284k2895l6230K2404K7385j9840j8491P948J7414j9263k0418J2124n075
$$ 357284 334389 298159 320563 347948 328108 309617 317565 334979 315716 295298 307422 302347
10743C02347j6091l257O040j7399J455M4054L8779k9872l7516J3003K332p757
$$ 302347 286256 282999 289039 271640 273095 317149 355928 326056 288540 301543 303875 296118
10731B96118K2469j4544k3072K6399K1738j3310l8981n6541J0372L6094K3851
$$ 296118 318587 304043 280971 307370 329108 315798 276817 220276 230648 266742 290593
10720B90593M3511p792k3311j1195j1239N0605n872l6570m812m486k51J4718n281
$$ 290593 334104 326312 303001 291806 280567 331172 325300 288730 283918 279432 279181 293899 288618
10707B88618j658J9988r00J7533J7691j3593m5813k8036o317J6949L6518r508
$$ 288618 286960 306948 306048 323581 341272 327679 281866 253830 247513 264462 300980 291472
10695B91472j3957L8153L4786m6960k1475J9653K4217P594K531k3501l5873l3836
$$ 291472 277515 315668 350454 303494 282019 301672 325889 333483 336014 312513 276640 242804
10683B42804O312O83l040p137m475P822J8384j4303j32K145k7880r916j1392j2279
$$ 242804 249116 249799 246759 239622 235147 242969 261353 247050 246918 249063 221183 211267 199875 187596
10669A87596l825J0905M3821O8971j6444l1066j5332l712k9651m900K5824K5124
$$ 187596 183771 194676 238497 307468 291024 259958 244626 240914 211263 206363 232187 257311
10657B57311L4545J155n0244L0691O324J8249q456l5145K3804M5283L2737l5933
$$ 257311 291856 293011 242767 273458 279782 298031 289575 254430 278234 323517 356254 320321
10645C20321j7206J0107J444K3037O9725L2642N6041N4793K1458K3804N7049L8807
$$ 320321 303115 313222 314666 337703 407428 440070 496111 550904 572362 596166 653215 692022
10633F92022K6196Q7311J00403J08999L7612P7392J29678J35182J73069J98527
$$ 692022 718218 805529 905932 1014931 1052543 1129935 1259613 1394795 1567864 1766391
10623A766391K72440L79982N75080P75100J041428J416575J897208K348259K530045
$$ 1766391 2038831 2418813 2993893 3768993 4810421 6226996 8124204 10472463 13002508
10614A3002508K229710J578502Q25038J23034k16299k12173J43032Q82083J943291
$$ 13002508 15232218 16810720 17635758 17758792 17542493 17330320 17473352 18355435 20298726
10605B0298726L263161M387481M785847L970720K223134K92960j212331k055207
$$ 20298726 23561887 27949368 32735215 36705935 38929069 39222029 38009698 35954491
10597C5954491k009196j208366J53116J911729L905811N506648N778025M132071
$$ 35954491 33945295 32736929 32890045 34801774 38707585 44214233 49992258 54124329
10589E4124329J273881j477345l566606m689800m704331l780985k330058o07697
$$ 54124329 55398210 53920865 50354259 45664459 40960128 37179143 34849085 34241388
10581C4241388J102367K266113K399731J307383n47468k338786l604431m142034
$$ 34241388 35343755 37609868 40009599 41316982 40769514 38430728 34826297 30684263
10573C0684263l945731l232542k232380j278502l49694J73092K60015j94124r54017
$$ 30684263 26738532 23505990 21273610 19995108 19645414 19818506 20078521 19884397 18930380
10564A8930380j605155k070374k266174k193197j915660j646647j287983r75435
$$ 18930380 17325225 15254851 12988677 10795480 8879820 7233173 5945190 4969755
10556D969755q09608n79949m88845l92892k96365k01782k02733j53664j47921
$$ 4969755 4160147 3580198 3091353 2698461 2402096 2200314 1997581 1843917 1695996
10547A695996j15370r6727j09658r3390p9661p7466n4499n4578m6018m15N856
$$ 1695996 1580626 1483899 1374241 1280851 1201190 1123724 1069225 1014647 968629 968214 974070
10536I74070r017j2907K909l212l4154o5348k2306N3266j8824p4246K06n3413
$$ 974070 965053 952146 955055 951843 917689 852341 830035 883301 864477 790231 790437 737024
10524G37024o8899q897K0618j2210r492P225K7139J9581J0689m6394n5434r59
$$ 737024 668125 659228 679846 667636 658144 665369 692508 712089 722778 676384 620950 619991
10512F19991L2314L2288l5241n5620m0782j7618K452J680k2526J2443M196m370
$$ 619991 652305 684593 649352 593732 552950 535332 537784 539464 516938 529381 533577 529207
10500E29207j0662j3498L5383K2896J0352k2676l4943K5629J9989l7577r726J6758
$$ 529207 518545 505047 540430 563326 573678 551002 516059 541688 561677 524100 514374 531132
10488E31132l6237l4116j1561P16Q793o362M1665r036j2465J6852K4403J0653
$$ 531132 494895 460779 449218 449934 458727 452365 494030 484994 472529 489381 513784 524437
10476E24437r669L5824J1993r182j0738j9742m496k260k440j4620k1016J4160
$$ 524437 514768 550592 562585 553403 542665 522923 518427 516167 513727 499107 478091 492251
10464D92251k37j4958J1454j6526j6552k0926l638l0986k3100N3255L7331L1789
$$ 492251 492014 477056 488510 471984 455432 434506 430868 399882 376782 430037 467368 499157
10452D99157R153J775j7429J4338m4696l0850P786j5641l2756p512j2378o035
$$ 499157 508310 510085 492656 506994 462298 431448 439234 423593 390837 383325 370947 364912
10440C64912M054M3256J2756k8210K1091K7115K8092j5465j7360k8544j1152j6641
$$ 364912 368966 412222 424978 396768 417859 444974 473066 457601 440241 411697 400545 383904
10428C83904j5173m765n7366M589P7216K5823l8465k3297j7352j5145J542l3587
$$ 383904 368731 363966 306600 311189 388405 414228 375763 352466 335114 319969 321511 287924
10416B87924m2853j7035Q721M8949M2162n964k7541k8825n5445K0508O2837j1018
$$ 287924 245071 228036 236757 285706 327868 321904 294363 265538 210093 230601 293438 282420
10404B82420J670j0410j3939L9717o654l5171j5327K2618K8228r485j6605k8311
$$ 282420 284090 273680 259741 299458 292804 257633 242306 264924 293152 283667 267062 238751
10392B38751j4827J1860j5361l0749J2188O300Q397j2889J8588J9518J5101Q181
$$ 238751 223924 235784 220423 189674 201862 208162 216559 203670 222258 241776 256877 265058
10380B65058P464p413q123m8968j6720J698P419j7842o549L9263M1154j0276K1598
$$ 265058 272522 265109 256986 208018 191298 192996 200415 182573 176024 215287 256441 246165 267763
10367B67763j6961j4663j3664m003K3017J2118L0054J3044Q695L669l9050j9126
$$ 267763 250802 236139 222475 218472 241489 253607 283661 296705 305400 309069 270019 250893
10355B50893M1099J7189r123j9951L5051L6205L54m8830m1061N521k831J06J4188
$$ 250893 291992 309181 300058 280107 315158 351363 351717 302887 261826 267347 264516 264622 278810
10342B78810L966L88q050j152j5734j093K1581k1856l050K1429k0512k2503k5079
$$ 278810 282776 283164 275114 273962 258228 257135 278716 256860 253810 275239 254727 232224 207145
10329B07145J0336L902J453J1491K9971J9564Q768J7058J1924l9072j7621J0849
$$ 207145 217481 221383 222836 234327 264298 283862 292630 309688 321612 282540 264919 275768
10317B75768K5409m5468m3768L3242p374k2832O1053K2011o977j5739J0142O744
$$ 275768 301177 255709 211941 245183 237809 214977 276030 298041 291064 275325 285467 292211
10305B92211j7302l7231k1287L6404K7120K9986M39k7687k1908q151K293j0181
$$ 292211 274909 237678 216391 252795 279915 309901 310340 282653 260745 252594 254887 244706
10293B44706N013J7374j5362K2116K5561p968J4050J517l22o858l2176M535L5681
$$ 244706 249719 267093 251731 273847 299408 291440 305490 307007 306685 299827 267651 272186 307867
10280C07867J2680M402K0214k9971K283K6477m1960j9695M9415K6789r040K400
$$ 307867 320547 324949 345163 315192 317475 343952 301992 282297 331712 358501 349461 351861
10268C51861l5478m2729k4543l20j6141J5083K502Q439J3667k8478K52M0516M8759
$$ 351861 316383 273654 249111 248791 232650 247733 250235 258674 272341 243863 244115 284631 333390
10255C33390j993p3763p813M1692j7936o446Q493P582l2789m1790O470Q31j8483
$$ 333390 331397 257634 249821 291513 273577 267131 275624 283206 250417 208627 215097 215928 197445
10242A97445K343P103j5575L4422M6232K9046J5222j0448N6102P509k5264p155
$$ 197445 199788 206891 191316 225738 271970 301016 316238 305790 361892 369401 344137 336982
10230C36982n3232j8126J4613M3243L99n5881n7779J0401J5803j3681K218N852
$$ 336982 283750 265624 280237 323480 323879 267998 210219 220620 236423 222742 224960 230812
10218B30812K8873M1734L0284L51J4508K820j3870l75k11j1086m5940k7057r564
$$ 230812 259685 301419 331703 332054 346562 349382 335512 335137 334926 323840 277900 250843 241279
10205B41279k2639K1107J9485K0031J7745k2744J9825q060J1703J0346k5638k5779
$$ 241279 218640 239747 259232 279263 297008 274264 294089 286029 297732 308078 282440 256661
10193B56661j9696J1932L4419j1036j6974R223L4158K6991J2381o990K0148J2666
$$ 256661 236965 248897 283316 272280 255306 264529 298687 325678 338059 331069 351217 363883
10181C63883J2639K6623j6949Q356K4567J2876r31k6254j7836m0357L4751J8591
$$ 363883 376522 403145 386196 394552 419119 431995 431064 404810 386974 346617 381368 399959
10169C99959J8998j3882q901O2772O1209J8430j1114o009j4375O001K1023q225
$$ 399959 418957 405075 396174 458946 520155 538585 527471 521462 507087 513088 534111 525886
10157E25886r895N9752Q0363P934m9899j3913k0056m1206j9743l3084m7953m974
$$ 525886 515991 575743 656106 664040 614141 600228 580172 538966 519223 486139 438186 433212
10145D33212L5561K4525L9741L071l1157K8587r061n3611n9543q042l123k3475
$$ 433212 468773 493298 533039 536110 504953 533540 524479 470868 411325 403283 400160 376685
10133C76685Q4639Q016k9439J5313K5820p650k1415k4307j395j8478J6203j4994
$$ 376685 461324 469340 439901 455214 481034 473384 451969 427662 426267 407789 423992 408998
10121D08998l0022m8497m4588K5753M9493k1894M481L0789j6885Q311J0083k4849
$$ 408998 378976 330479 285891 311644 361137 339243 343724 374513 357628 365939 376022 351173
10109C51173j7071L2532k2001m8235K5163M1537l0680q346j3463R49k3581j7213
$$ 351173 334102 366634 344633 296398 321561 363098 332418 324072 310609 311558 287977 270764
10097B70764L7418L9192L382J8627K0093k1587k3045K6595N416k9318j299J7948
$$ 270764 308182 347374 350756 369383 389476 367889 344844 371439 376855 347537 346238 364186
10085C64186k8718l4168o869O542L448K6714q768J3141J7769l3551l6257k2468
$$ 364186 335468 301300 294431 300973 304421 331135 322367 335508 353277 319726 283469 261001
10073B61001J3520N791L0846J9070J5316j2303K8170L4361r791o0640L6165l562
$$ 261001 274521 280312 311158 330228 345544 333241 361411 395772 385981 325341 361506 357944
10061C57944j126R980Q072k3275M018p450J6107O9070o593m7759j4044o817J3502
$$ 357944 356818 366798 374870 351595 355613 348163 364270 433340 426747 378988 364944 358127 371629
10048C71629L948r460J832k116j7669J6707J7619p024R454l0700o0330j9548j841
$$ 371629 375577 366117 367949 365833 348164 364871 382490 375466 384920 354220 293890 274342 272501
10035B72501K6225K6735K1191k3408j012O1800L8920k6910j8941j325p087J2738
$$ 272501 298726 325461 346652 323244 322232 384032 422952 396042 377101 375776 368689 381427
10023C81427L6006k0970J0374r070m942m2530k9809n309O0612K4100Q11j5772
$$ 381427 417433 396463 406837 397767 392825 350295 320486 315177 375789 399889 400700 384928
10011C84928n9998n8097k1863L4430p094o963M41J3119Q299Q791l1740J3984K324
$$ 384928 324930 266833 244970 279400 272306 265343 265784 278903 287202 295993 264253 278237 280561
9998B80561L2292L2280k2826m0546J8671J0640N125M610o57j5288p398J228J687
$$ 280561 312853 345133 322307 281761 300432 311072 316197 320807 320150 304862 297464 298692 300379
9985C00379o380N204J5146K139K502M693r219o832P490O993l619K063L8424J2115
$$ 300379 293999 299203 314349 316488 318990 323683 314464 307632 315122 322115 318496 320559 358983 371098
9971C71098m5452M770L178L0982L8723k2629r437j560O221K3533l3712l6811j6729
$$ 371098 325646 330416 333594 364576 403299 380670 371233 369673 375894 399427 365715 328904 312175
9958C12175j0833p986N3546N3626K1808J33j108P904k6110k7846l816J2856P516
$$ 312175 301342 293356 346902 400528 422336 422469 421361 429265 403155 375309 371493 384349 391865
9945C91865l3350L827L1323p122R287N6177k9119J852j0908M4279J0498K4786
$$ 391865 358515 362342 393665 386543 395830 452007 422888 424740 413832 458111 468609 493395
9933D93395L4086P052J9912J8236j7059P027M9439J4003K0237M9278N1767M2541
$$ 493395 527481 534533 554445 572681 555622 562649 612088 626091 646328 695606 747373 789914
9921G89914M4825P6444P7317M7101L2933N9873Q4130J18550J56513J61810J78081
$$ 789914 834739 911183 988500 1035601 1068534 1128407 1212537 1331087 1487600 1649410 1827491
9910A827491J37832J19839K31753K38660J92566J54451J91318K03635J94224J80875
$$ 1827491 1965323 2085162 2316915 2555575 2748141 2902592 3093910 3297545 3491769 3672644
9900C672644J91291J93386K10434K30861K41460K53765K86463L01131K90691L39978
$$ 3672644 3863935 4057321 4267755 4498616 4740076 4993841 5280304 5581435 5872126 6212104
9890F212104M02213M09065L93629M01393L11032K95914J96993K07124J58735J35108
$$ 6212104 6614317 7023382 7417011 7818404 8129436 8425350 8622343 8829467 8988202 9123310
9880I123310Q1382N8776O1756L9477N0898n2760n3420k7279l7673m2695k2523
$$ 9123310 9204692 9263468 9325224 9364701 9415599 9362839 9309419 9282140 9244467 9201772 9179249
9869I179249L6277Q9609P6692R3885N8776P5276K4218J6700j4777n3676o4458
$$ 9179249 9215526 9305135 9381827 9475712 9534488 9609764 9633982 9650682 9635905 9582229 9517771
9858I517771k11831k42191k23244l03841k72039l06141l22251l06336k93384k91227
$$ 9517771 9305940 9063749 8840505 8536664 8264625 7958484 7636233 7329897 7036513 6745286
9848F745286k61098k66728k17889k60096k28246j90313j71558j81965j94912j41753
$$ 6745286 6484188 6217460 5999571 5739475 5511229 5320916 5149358 4967393 4772481 4630728
9838D630728j13125j20681j22188l5162o0661r4209l5489L083k921M9663R9257
$$ 4630728 4517603 4396922 4274734 4239572 4178911 4084702 4049213 4052296 4049375 4099038 4198295
9827D198295J16474J38810R2972R0813R2704O3340J48348J85214J89157J92660
$$ 4198295 4314769 4453579 4546551 4637364 4730068 4793408 4941756 5126970 5316127 5508787
9817E508787K08417K79473L12763L43398L11670K86078L02295L78718L53346L27895
$$ 5508787 5717204 5996677 6309440 6652838 6964508 7250586 7552881 7931599 8284945 8612840
9807H612840L36556L54894L34720L58829L76782L56496K69319K55966K14761J52599
$$ 8612840 8949396 9304290 9639010 9997839 10374621 10731117 11000436 11256402 11471163 11623762
9797A1623762J12951O3673j2821j8456j9904q7610j14810o5620q4719k9984N792
$$ 11623762 11736713 11800386 11787565 11769109 11749205 11661595 11546785 11481165 11396446 11366462 11372254
9786A1372254M9537j1869L3248K1650J3270j0358L1616L4617M2686L0966m9141
$$ 11372254 11421791 11409922 11443170 11464820 11478090 11467732 11499348 11533965 11576651 11607617 11558476
9775A1558476k17555k97941l63333m42206m45298m26001m71340n06159m78024
$$ 11558476 11340921 11042980 10679647 10237441 9792143 9366142 8894802 8388643 7910619
9766G910619m62346m13091l83843l38634l34579l57180k85966k61259k77949k38908
$$ 7910619 7448273 7035182 6651339 6312705 5978126 5620946 5334980 5073721 4795772 4556864
9756D556864j85255j85627k16198k53311k30600k18959k14303k14963k26188j90619
$$ 4556864 4371609 4185982 3969784 3716473 3485873 3266914 3052611 2837648 2611460 2420841
9746B420841k02598j98314j82555j64245j63038j25183j21200q7382m0556m7773
$$ 2420841 2218243 2019929 1837374 1673129 1510091 1384908 1263708 1176326 1135770 1087997
9736A087997n9244p3104j8264m8382m3905k8187k2176m3294l3669j6224j9572
$$ 1087997 1028753 955649 937385 889003 845098 816911 794735 751441 717772 701548 681976
9725F81976j7280M27J0285n1554m5398j445m609J0095l803k101J0027l136n3856
$$ 681976 664696 665123 675408 623854 578456 577011 572402 582497 578694 576593 586620 583484 529628
9712E29628n3854k4371M532J4988j1582j8666J953k268k0883j406K6490k2379
$$ 529628 475774 451403 455935 470923 459341 440675 442628 440360 419477 418071 444561 422182
9700D22182n340m717j2141M835K1210J8045J8033l2468o3832j4805J4397L7832
$$ 422182 416842 412125 399984 404819 426029 444074 462107 429639 365807 351002 365399 403231
9688D03231j4089l2334o510L6074L5452p575m144J8328L415j3181l0955j6502
$$ 403231 389142 356808 350298 386372 421824 414249 410105 428433 431848 418667 387712 371210
9676C71210m718M4766M6188J3054k489n4463k9079k4129M2678K4171K593j1860
$$ 371210 366492 411258 457446 470500 468011 413548 384469 360340 403018 427189 429782 417922
9664D17922p564K4648l055J4698k0064k1935O1314R7181P8636J21179K41098M36002
$$ 417922 410358 435006 431951 446649 426585 404650 465964 563145 641781 762960 1004058 1440060
9652A440060O67941R07997O51253q462k19671m30963o27157n61151l88338k89826
$$ 1440060 2108001 3015998 3667251 3658789 3439118 3008155 2380998 1819847 1431509 1141683
9642A141683k40331j87742j28084p6192m6644k9745l8815m4921k4513J1237L034
$$ 1141683 901352 713610 585526 509334 462690 432945 394130 349209 324696 335933 338967
9631C38967J1184K9295Q802k0726K189k0066L703J6877j7923k513m1596j543M120
$$ 338967 350151 379446 388248 367522 369711 349645 353348 370225 352302 349789 308193 306650 310770
9618C10770J842L5238n0324Q847K6646m320J0768N45r715J4958K0437k9756j9553
$$ 310770 312612 347850 297526 306373 333019 328699 339467 340012 330297 345255 365692 335936 316383
9605C16383l0834K7812L6060K4700K7318p585m8387l8010k5359k6205J2925K7463
$$ 316383 285549 313361 349421 374121 401439 393854 345467 307457 282098 255893 268818 296281
9593B96281j1681o191M961O139j3282J9349j9902J204O568J4676M725j6086l0948
$$ 296281 284600 278409 283370 289509 276227 295576 275674 276878 283446 298122 302847 286761 255813
9580B55813l6743L362L0405J5229k0403k470N1234J9475l1453p064J4993j9785
$$ 255813 219070 222432 252837 268066 247663 245193 296427 315902 284449 277385 292378 272593
9568B72593P949L5286j5636k9642J2797k0889k6618k5976l2888K4637J9294m388
$$ 272593 280542 315828 300192 270550 283347 262458 235840 209864 176976 201613 220907 216519
9556B16519j482K2450k3307K7755J9621K2513o507J2458J1834l1273l2502J1538
$$ 216519 215037 237487 214180 241935 261556 284069 277562 290020 301854 270581 238079 249617
9544B49617J4237M638L2247N117L8832J1368j2605k8212k7043j388P2633L0123
$$ 249617 263854 268492 300739 305856 344688 356056 343451 315239 288196 286808 359441 389564
9532C89564p2956j3313L3489R521L5786k4436p4804j5457M6209J0131k116j0564
$$ 389564 316608 303295 336784 346305 382091 357655 282851 267394 313603 323734 321618 311054
9520C11054j820j4172M1313K4203k0397j4866P175k6766L476R974k232N450L0182
$$ 311054 309234 295062 336375 360578 340181 325315 332490 305724 309200 319174 316942 322392 352574
9507C52574K4923j179q30J9431j8528j3358L040l7514K6667M3311L6962k1340
$$ 352574 377497 376318 375488 394919 376391 363033 366073 328559 355226 398537 435499 414159
9495D14159l6995k4842J3581K3227p13m1221q018K6206j8785P109k7055L3176
$$ 414159 377164 352322 365903 389130 388417 347196 339178 365384 346599 353708 326653 359829
9483C59829N9511k2356m2467l1290L1381L6420m547k718L5433J0441L561Q469
$$ 359829 419340 396984 354517 323227 354608 391028 386481 383763 419196 429637 433198 441667
9471D41667k3844n8255j5516L9233l183m794j0681k7213l620m8395j1619M6947
$$ 441667 417823 359568 344052 383285 380102 375308 364627 337414 333794 285399 273780 320727
9459C20727N0014L0099j2114N378k664l0669R428L480k6566o803j4492r628N5789
$$ 320727 370741 400840 388726 394104 391440 360771 370199 373679 347113 340310 325818 316190 371979
9446C71979K3245o090l4928l3399l462o655r186J9066L3015K9280M054m1113M81
$$ 371979 395224 389134 354206 320807 317345 310690 301504 320570 353585 382865 386919 345806 346287
9433C46287N1084Q280j1662J4651J828j3108k4414K6024M2782k1980n864O935
$$ 346287 397371 405651 393989 408640 410468 397360 372946 398970 441752 419772 413908 420843
9421D20843j4604n999j4751L4512N19J2752M0809J314m8812j9812J6331K3862
$$ 420843 406239 400240 385489 420001 420520 433272 474081 475395 426583 406771 423102 446964
9409D46964O264m6357m1600J6773k83K1561K26L5240K7602j1833j7219l5053J7907
$$ 446964 453228 406871 365271 382044 381761 403322 403548 438788 466390 454557 437338 402285 420192
9396D20192j2304J5489K0423l0440J5717K1607j061L1219K4833l2640N227q712
$$ 420192 407888 423377 443800 413360 429077 450684 449623 480842 505675 473035 478262 469550
9384D69550j9563r005L0325N5713M488l3788j2894L1851J0717l1278n648J527
$$ 469550 449987 440982 471307 527020 531508 497720 484826 516677 527394 496116 490468 491995
9372D91995k0936M3136K5496l637k1269k0511L141J6295l2245j5914M258k4242
$$ 491995 471059 514195 539691 536054 514785 494274 497415 513710 481465 465551 469809 445567
9360D45567L4316L5147k5638j5469J0434K3364m4019o8264j1788j6956q354M2213
$$ 445567 479883 515030 489392 473923 484357 507721 463702 395438 383650 366694 358340 400553
9348D00553j391k1952l573M1671K5641j9200n8682k1213J4986L711L0283Q867
$$ 400553 399162 377210 373637 415308 440949 421749 363067 341854 356840 360551 390834 399701
9336C99701Q266K1277J715l9046j0633K1064j516k3635m8891r800K6641Q0274
$$ 399701 407967 429244 430959 391913 381280 402344 400828 377193 328302 318502 345143 425417
9324D25417L2157Q055J0883M4794O5952J3965k2452q880R854J4128k2009j5805
$$ 425417 457574 465629 476512 521306 587258 601223 578771 569891 579745 593873 571864 556059
9312E56059l7497J5175L2272L5145j0696j1230r509l4618M230R604j6026R063
$$ 556059 518562 533737 566009 601154 590458 579228 569719 535101 539331 548935 532909 541972
9300E41972J9565J9847J1804j6179J2354K1636m0212L774M6031L0075o991M2987
$$ 541972 561537 581384 593188 577009 589363 610999 570787 574561 620592 650667 643676 686663
9288F86663L1615l5149o329L311L5629m91p3161n093M664K5727J9099J7814k7
$$ 686663 718278 683129 676800 680111 715740 715249 642088 636995 641659 667386 686485 704299 704272
9275G04272q699p143k0076K537N4940N0544L2461J1091L4309J8427L8267O9731
$$ 704272 695573 688430 668354 670891 725831 776375 808836 819927 854236 872663 910930 980661
9263I80661P1351P2023J16491J47335J29367J35325J51894J00788J08131N6132
$$ 980661 1052012 1124035 1240526 1387861 1517228 1652553 1804447 1905235 2013366 2069498
9253B069498R5058K0216q3197r5556j32003j49091j40884j42132q4409p8426o9095
$$ 2069498 2164556 2184772 2101575 2006019 1874016 1724925 1584041 1441909 1357500 1279074 1209979
9242A209979r9955o9290l6293j7596n1254m2567k3028k3420m8217j2036J3207
$$ 1209979 1110024 1040734 1004441 986845 935591 893024 869996 846576 798359 786323 799530
9231G99530O9980L4656j1275J031J6213l940j6404k7095O1767M2521M6579N8268
$$ 799530 869510 904166 892891 893922 910135 906195 889791 862696 924463 966984 1013563 1071831
9219A071831K8078M1314L0124J1836M9688P2944L0180P1267R5326J34892J13743
$$ 1071831 1099909 1141223 1171347 1183183 1232871 1305815 1335995 1407262 1502588 1637480 1751223
9208A751223J40015J46703J09923J65153K04751K72259K95860K99095L06192K75619
$$ 1751223 1891238 2037941 2147864 2313017 2517768 2790027 3085887 3384982 3691174 3966793
9198C966793K02210J62840J34550M1786l3579j44095k02372k61016j94482j75325
$$ 3966793 4169003 4331843 4466393 4508179 4474600 4330505 4128133 3867117 3672635 3497310
9188C497310j71680j09985j08920j26065m5874m0774l0731M0255L8979O3576J26663
$$ 3497310 3325630 3215645 3106725 2980660 2934786 2894012 2863281 2903536 2942515 3006091 3132754
9177C132754J09408J53927K74573K98984K71288K75647K44722J10800P5076n1698
$$ 3132754 3242162 3396089 3670662 3969646 4240934 4516581 4761303 4872103 4947179 4895481
9167D895481j67465j80187k37730k54267k56174j97174k05022k17789k30027k50589
$$ 4895481 4728016 4547829 4310099 4055832 3799658 3602484 3397462 3179673 2949646 2699057
9157B699057k06858j59371j21852q3478q0533j00780n5149l8778j118j9697M6233
$$ 2699057 2492199 2332828 2210976 2127498 2046965 1946185 1891036 1852258 1851140 1831443 1877676
9146A877676J0128j4727J4010N1093R5001J17716J05267P0367R6780J43568J57666
$$ 1877676 1887804 1873077 1887087 1938180 2033181 2150897 2256164 2326531 2423311 2566879 2724545
9135B724545K20965K47696K58165L48527L79138L87189M87750N51290N45039N53492
$$ 2724545 2945510 3193206 3451371 3799898 4179036 4566225 5053975 5605265 6150304 6703796
9125F703796O21881O06520N46055M39893L74432L03207K01765P1374N616j3122
$$ 6703796 7325677 7932197 8478252 8918145 9292577 9595784 9797549 9868923 9874539 9861417
9115I861417j2646j01252k40862l01836l31991l61452l65028l19113l38499k23856
$$ 9861417 9848771 9747519 9506657 9204821 8872830 8511378 8146350 7827237 7488738 7264882
9105G264882q0858q833O3061K19292L17506L88132M53856M90748M78821M13684
$$ 7264882 7184024 7175191 7238252 7457544 7775050 8163182 8617038 9107786 9586607 10000291
9095A0000291K97054K06125R9970m8147j45846k38256l51196m02401m06246m80009
$$ 10000291 10297345 10503470 10603440 10555293 10409447 10171191 9819995 9417594 9011348 8531339
9085H531339n65583n55284n53050n13227m79769n04993m42729l94136l16707k86543
$$ 8531339 7965756 7410472 6857422 6344195 5864426 5359433 4916704 4522568 4205861 3919318
9075C919318k92340k45106j62933j34757q7213j04684p2352o9796q2337k1761
$$ 3919318 3626978 3381872 3218939 3084182 2996969 2892285 2819933 2750137 2667800 2646039
9065B646039L1502J5309N6802N6192N3076O6843J02428K05155J93418K21456K87340
$$ 2646039 2677541 2692850 2749652 2805844 2858920 2925763 3028191 3233346 3426764 3648220 3935560
9054C935560L57733L62141M15891M45563M71741M75416M96400M62062L82320L43775
$$ 3935560 4293293 4655434 5071325 5516888 5988629 6464045 6960445 7422507 7804827 8148602
9044H148602L07027L41493L44579K63149K06506Q3519l8943j63723k77114l79990
$$ 8148602 8455629 8797122 9141701 9404850 9611356 9694875 9655932 9492209 9215095 8835105
9034H835105l98758m30564m31753l09290k93515k56209j14533n8762M4294J44989
$$ 8835105 8436347 8005783 7574030 7264740 6971225 6715016 6600483 6541721 6586015 6731004
9024F731004K73388L66919L72505L86339L90885L28055K39940K08815J50136M4450
$$ 6731004 7004392 7371311 7743816 8130155 8521040 8849095 9089035 9297850 9447986 9492436
9014I492436j11980k19998l83339m52740n17362n49774o31261o17830n19341m64258
$$ 9492436 9380456 9160458 8777119 8324379 7807017 7257243 6625982 6008152 5488811 5024553
9004E024553m18914l83137l69475l43579k83192k24860j92897k25710j62359j21316
$$ 5024553 4605639 4222502 3853027 3509448 3226256 3001396 2808499 2582789 2420430 2299114
8994B299114j16443p6339o4009m5476j2434L1905J24381J37776J76809J68297
$$ 2299114 2182671 2106332 2042323 1996847 1984413 2016318 2140699 2278475 2455284 2623581
8984B623581O2527k1553m2410k0298k7695q6847n8056N896K4964J3292L9246J02761
$$ 2623581 2686108 2664555 2622145 2601847 2574152 2487305 2429249 2435145 2460109 2473401 2512647 2615408
8972B615408J30261J18335J61355J71331K43687K37036K17776J54484J50325J06219
$$ 2615408 2745669 2864004 3025359 3196690 3440377 3677413 3895189 4049673 4199998 4306217
8962D306217m622o9475j26471j54405j58261j88535j78193j68043j73419j28878
$$ 4306217 4301595 4232120 4105649 3951244 3792983 3604448 3426255 3258212 3084793 2955915
8952B955915p5153j0644j1581k7454O500P7816P0923Q4722J36148J79154J35188
$$ 2955915 2880762 2870118 2858537 2831083 2837583 2915399 2986322 3071044 3207192 3386346 3521534
8941C521534J49779K20398J72470J23050Q8115K6014q844n1468q3116j63378k03956
$$ 3521534 3671313 3891711 4064181 4187231 4275346 4301360 4292516 4241048 4157932 3994554 3790598
8930C790598j70973j95124j67649j83238q9915o1505o3118l6929M6839M2014m1399
$$ 3790598 3619625 3424501 3256852 3073614 2983699 2922194 2859076 2822147 2868986 2911000 2869601
8919B869601j6815p247Q576o951O024M5071J3891K5569K7425N0866L0104P7407
$$ 2869601 2852786 2845539 2854115 2847164 2853188 2898259 2912150 2937719 2965144 3016010 3046114 3123521
8907C123521Q3854P8781J08857J26940J11206J04179J12484J31553J54329J67509
$$ 3123521 3207375 3286156 3395013 3521953 3633159 3737338 3849822 3981375 4135704 4303213
8897D303213J76153J93114K13990K34746K06736K79159L14763K79313L09696L64968
$$ 4303213 4479366 4672480 4886470 5121216 5327952 5607111 5921874 6201187 6510883 6875851
8887F875851L83710M20446M61399N08766N54972N92318O61811P77517R30093J087615
$$ 6875851 7259561 7680007 8141406 8650172 9205144 9797462 10459273 11236790 12166883 13254498
8877A3254498J268023J454953J736089K026749K358748K776257L285181L794868
$$ 13254498 14522521 15977474 17713563 19740312 22099060 24875317 28160498 31955366
8869C1955366M322272M964278N825441P193239R304126J2600864J7625854K5058264
$$ 31955366 36277638 41241916 47067357 54260596 63564722 76165586 93791440 118849704
8861A18849704L5787534N0008848O4892696P1506415N8445627K6829145o790832
$$ 118849704 154637238 204646086 269538782 341045197 399490824 426319969 419529137
8854D19529137l3532101n1968625n8426951n4704700m6008646l6118057k7405967
$$ 419529137 385997036 334028411 275601460 220896760 174888114 138770057 111364090
8847A11364090k0566833j5481566j1810543r166979p227226n902195m902944m111130
$$ 111364090 90797257 75315691 63505148 54338169 47110943 41208748 36305804 32194674
8839C2194674l500126k915788k395596j901693j431893j015723o22320l03417
$$ 32194674 28694548 25778760 23383164 21481471 20049578 19033855 18411535 18108118
8831A8108118j06888q0617j87454k87966m85059p41084r61251j189979j371058
$$ 18108118 18001230 17920613 17733159 17445193 16960134 16219050 15257799 14067820 12696762
8822A2696762j359347j274010j150812j045721r01269o71886n47527m84563m23019
$$ 12696762 11337415 10063405 8912593 7866872 6965603 6293717 5746190 5261627 4838608
8813D838608l79559l49578l16540k78932k34331j91356j51473j60487j16110r0811
$$ 4838608 4459049 4109471 3792931 3513999 3279668 3088312 2936839 2776352 2660242 2569431
8803B569431p9070m5931j09111r8864m9703o5327r3081j19049j16129o9055p9014
$$ 2569431 2490361 2444430 2335319 2236455 2186752 2121425 2028344 1909295 1793166 1724111 1645097
8792A645097n2060n4263o1283n2649k8550p6259m9084l8018j8674m7964l0068
$$ 1645097 1593037 1538774 1477491 1424842 1396292 1320033 1270949 1232931 1214257 1166293 1136225
8781A136225n6776p7674o1417l128j4852m8702n8658L733L0374k8765l9907k7010
$$ 1136225 1079449 1001775 940358 937230 922378 873676 815018 818751 849125 820360 780453 753443
8769G53443k193J1923p850j5965l0742n20o399l2914m0557j1458L681j4810m9513
$$ 753443 751250 763173 755323 739358 708616 708096 701697 668783 628226 616768 620449 605639 556126
8756E56126j5543k7126r707n223o6175J3954N1505M3278J817m623K606k357R52
$$ 556126 540583 513457 503750 498527 432352 446306 497811 541089 542906 538283 540889 538532 539484
8743E39484K2999j7911R415M275l376n612k5598K9803M9736J7275O720Q886j2306
$$ 539484 562483 544572 553987 558262 554886 549274 523676 553479 603215 620490 627210 636096 623790
8730F23790P43J9081m4079q0526l3019J4348K6424r119k095k3023l4993K1550
$$ 623790 624533 643614 599535 519009 485990 500338 526762 517643 515548 492525 457532 479082
8718D79082L4392o157j4502l5165k6660O1174L6202L8893L1674M5013O1509N6663
$$ 479082 513474 507317 492815 457650 430990 492164 528366 567259 598933 643946 705455 762118
8706G62118O7705K8362K5791J3489n9047j78375k19699k65123j70198j09783q9074
$$ 762118 829823 858185 883976 897465 838418 660043 440344 175221 5023 -104760 -193834
8695a93834o9829j8575j0054J1371M2533N5215K0956L7720M808j9612M888k10
$$ -193834 -263663 -282238 -292292 -280921 -238388 -183173 -162217 -124497 -119689 -139301 -134413 -134623
8683a34623K1806O2768K3897J1057J5023j7528J1057J8459L8469J0167j7148J7166
$$ -134623 -112817 -50049 -26152 -15095 -72 -17600 -6543 11916 50385 60552 43404 60570
8671F0570r934m4414o3749j8080J5456k5061p4607m8239K1849L7662L9555J9438
$$ 60570 50636 6222 -57527 -75607 -60151 -85212 -159819 -208058 -186209 -148547 -108992 -89554
8659h9554l7393p459O402J2187J4616k541j4092K7422L3092L5082j881j2384l4383
$$ -89554 -126947 -134406 -128004 -115817 -101201 -103742 -117834 -90412 -57320 -22238 -24119 -36503 -70886
8646g0886j6422q21K979K0652j8738k6477K336L3628n770r707K2702J7030L2771
$$ -70886 -87308 -88129 -85150 -64498 -83236 -109713 -107377 -73749 -79519 -89226 -66524 -49494 -16723
8633a6723J2352l8032j683K6259n359M179l1462n5453j3970m480K4162L6377K7939
$$ -16723 -4371 -42403 -44086 -17827 -23186 -19007 -50469 -105922 -119892 -124372 -100210 -63833 -35894
8620c5894J1266J9874Q949n767K754k143L4296J71l3968k2044m496m24M5948J4106
$$ -35894 -24628 -4754 4195 -1572 1182 -961 33335 33506 -462 -22506 -27002 -27426 18522 32628
8606C2628K3247o764Q610k0638l1907j68P252J69K0849J2897L0366J4343l3435
$$ 32628 55875 49111 57721 37083 5176 5008 12260 12429 33278 46175 76541 90884 57449
8593E7449m3446n1927k959J1656J4117K9669L0616N6470O4043L2250l6186K5823
$$ 57449 14003 -37924 -40883 -29227 -15110 14559 45175 101645 165688 197938 161752 187575
8581A87575O237l3438l1911j8876j6241M539K5955k9510k7503K4938j8844m1651
$$ 187575 193812 160374 128463 109587 93346 97885 123840 94330 66827 91765 72921 31270
8569C1270l6977L3832J8670k4104m987k5940j3159l276J7654j7007j2662K3764
$$ 31270 -5707 28125 46795 22691 17704 -8236 -21395 -24671 -7017 -24024 -36686 -12922
8557a2922J4942k1275N175J5510k161K0468k5743m1788p324R172L4712k593k1531
$$ -12922 2020 -19255 -14080 1430 -731 19737 -6006 -47794 -55118 -45946 -11234 -13827 -35358
8544c5358R371J4855l0142J3137l793j703K2090J4785M8985K6202k217j7458n108
$$ -35358 -25987 -11132 -41274 -28137 -31930 -33633 -11543 3242 52227 78429 76212 58754 53646
8531E3646p121k498p568j0403k9398j7822K6534L6531q071l0816j9230K8073k5010
$$ 53646 46525 44027 36459 26056 -3342 -21164 5370 41901 33830 3014 -16216 11857 -13153
8518a3153k3276j0125K9776j989n794n342N4524N0620L0465j7227m0817m5018
$$ -13153 -36429 -46554 -16778 -18767 -24561 -29903 24621 75241 105706 88479 47662 2644
8506B644j5800J7749k4983J9008N237k5611l8867J7661m303J8599k1448k051O8904
$$ 2644 -13156 4593 -20390 -1382 3855 -21756 -60623 -42962 -47265 -28666 -50114 -52165 16739
8493A6739N9136O414j6016J1063K1737M1881P4808Q6593M0580L3947m832p8580
$$ 16739 75875 82289 66273 77336 99073 140954 215762 302355 342935 376882 372050 293470
8481B93470o6014m5554l4245M391k7628P660p803j7261M5920N9646M757j1149
$$ 293470 227456 181902 147657 152048 124420 132080 124277 107016 152936 212582 217339 206190
8469B06190N1546J3285K5081N2750P5650K2714M5007R5268Q3383R2578P4189R9810
$$ 206190 257736 271021 296102 348852 424502 447216 492223 587491 670874 763452 837641 937451
8457I37451J34259J29945J38158J32814P8855L0105k1695o5778j26056j27124
$$ 937451 1071710 1201655 1339813 1472627 1551482 1581587 1559892 1494114 1368058 1240934
8447A240934r4535q2266j54301j38511o0634m7924q1912r7308l8056l4417n9805
$$ 1240934 1146399 1064133 909832 771321 710687 662763 580851 483543 445487 411070 351265
8436C51265n2731m5479p1905m4876j8871J8365K714r500j1542O920k9255j6305
$$ 351265 298534 253055 181150 136274 117403 135768 138482 128982 117440 124360 95105 78800
8424G8800o410l7107l976j5619q813j941J1237L096k0990k2003m6511k3431O0912
$$ 78800 72390 35283 31307 15688 6875 4934 16171 19267 -1723 -23726 -70237 -93668 -32756
8411c2756J0957j1078j8634q121j3811k3458k780K5091K5644n0071k6727K5673
$$ -32756 -21799 -32877 -51511 -59632 -73443 -96901 -99681 -74590 -48946 -99017 -125744 -100071
8399a00071L1552j3563R454l6611k7280j3823J0843M4388K6487m341N4989M6600
$$ -100071 -68519 -82082 -72628 -109239 -136519 -150342 -139499 -95111 -68624 -72965 -17976 28624
8387B8624M450L785K9441M1523j0146L558l1714n3257m2074l411L4317M141L4538
$$ 28624 33074 36859 66300 107823 97677 101235 69521 16264 -25810 -29221 5096 9237 43775
8374D3775M3178j4609n793J0688n591j1560j1500o7300l4000J3630L7581j015
$$ 43775 86953 72344 66551 77239 71648 60088 48588 -18712 -52712 -39082 -1501 -2516
8362b516j0005L3827j4613n9401K7857J4421M767J8236J9891J3331J9081n5238
$$ -2516 -12521 21306 6693 -52708 -24851 -10430 -5663 12573 32464 45795 64876 9638
8350I638j5130O774j290j105J0482j4317J7978j5445j3514K8158k0326j9727j0130
$$ 9638 -5492 1282 -8 -1113 9369 -4948 13030 -2415 -15929 12229 -8097 -27824 -37954
8337c7954o56o00l7267j7673P63R496K1945J9363k163R69k309j8401j1538J4190
$$ -37954 -38610 -39210 -76477 -94150 -93387 -83891 -61946 -42583 -44746 -43777 -46086 -64487 -76025 -61835
8323f1835R308J1429M0644k36j7078M886k1043j1233L3281J7815n088p625j2169
$$ -61835 -52527 -41098 -454 -690 -17768 -12882 -33925 -45158 -11877 5938 850 -6775 -18944
8310a8944j5479L3779k1126J272J3241N872j3113L486J0927L621Q857l1571r178
$$ -18944 -34423 -644 -21770 -20498 -7257 -1385 -14498 -11012 -85 3536 12393 -19178 -28356
8297b8356J6089J1393k4344j6576j8050n707j1975m4155K5526O7138M807j6678
$$ -28356 -12267 -874 -25218 -41794 -59844 -65551 -77526 -121681 -96155 -29017 -24210 -40888
8285d0888k7196K3083j5412l199L5036J8788j5546l261j7814m6664J6245M7368
$$ -40888 -68084 -45001 -60413 -63612 -28576 -9788 -25334 -28595 -46409 -93073 -76828 -29460
8273b9460K9501k6055k268o594k0581j4060K4008L3186J2915k1604K4793L414
$$ -29460 41 -26014 -28282 -34876 -55457 -69517 -45509 -12323 592 -21012 3781 7195
8261G195j6378l0705J1841J4300J3309K5390l2068m6261r08L723M4136K5514k5667
$$ 7195 -9183 -39888 -28047 -13747 -438 24952 -7116 -53377 -54285 -50562 -6426 19088 -6579
8248f579K6063j2853J0025j5477l9833l0645K221J8642L4811J2843k5316J7544
$$ -6579 19484 6631 16656 1179 -38654 -69299 -67078 -48436 -13625 -782 -26098 -8554
8236h554J4405l895Q357j456l2987Q067l6355p549K5797m6606k0090N0358K0008
$$ -8554 5851 1956 10313 8857 -24130 -16063 -52418 -59967 -34170 -80776 -100866 -50508 -30500
8223c0500j7083j4571j5092L2624N2602M30m2775l376J4047j3243l426J495j5069
$$ -30500 -47583 -62154 -77246 -44622 7980 8410 -34365 -37741 -23694 -36937 -40363 -38868 -53937
8210e3937R051K940Q669K8939j6886o1212m3710L9085J7273K6125K4569L9864
$$ -53937 -44886 -41946 -33277 -4338 -21224 -82436 -126146 -87061 -69788 -43663 -19094 20770
8198B0770K6421j1723P591n5659k9930m3782k590M0812K5073K947j7122j149K8760
$$ 20770 47191 35468 43059 -12600 -42530 -86312 -88902 -48090 -23017 -20070 -37192 -38341 -9581
8185i581P254L3716j5099k7563k566L8387K7819l1059m1616l4242K9802j1389
$$ -9581 -2327 31389 16290 -11273 -13839 24548 52367 21308 -20308 -54550 -24748 -36137
8173c6137j2286m763k8817J9765L1132K9817N980L126N961J9511m1232k1109j8585
$$ -36137 -48423 -53186 -82003 -62238 -31106 -1289 4691 7817 13778 33289 -7943 -29052 -47637
8160d7637j4930j7510J0744N730K5744J2151k4798J0266K4975O936L7657k7853
$$ -47637 -62567 -80077 -69333 -63603 -37859 -25708 -50506 -40240 -15265 -8329 29328 1475
8148A475j5609J869k8624J4365K2427j3061Q19R521M112j336L204k6774R581r705
$$ 1475 -14134 -12265 -40889 -26524 -4097 -17158 -16339 -6818 -2706 -4042 -838 -27612 -18031 -27736
8134b7736k2636K7762L1675m3921R704M7630l341m298J9291j5539j3162l2776
$$ -27736 -50372 -22610 9065 -34856 -25152 22478 19137 14839 34130 18591 5429 -27347
8122b7347k9986m994j4289M095L8234L3495k8175p261P888K0361n70L0843J5293
$$ -27347 -57333 -62327 -76616 -72521 -34287 -792 -28967 -36228 -28340 -7979 -8549 22294 37587
8109C7587l8925M952j5147J1491q94j1094k0713M352k1688l5645j3252k400M8914
$$ 37587 -1338 3614 -11533 -42 -936 -12030 -32743 -28391 -50079 -85724 -98976 -101376 -52462
8096e2462l0150j2637M8587J0747J3602J3987K043M287O664k489m607J458J5422
$$ -52462 -82612 -95249 -46662 -35915 -22313 -8326 -6283 -1996 4668 2179 -2428 -970 14452
8083A4452n1007Q123J2048J3577o8247m4419K5035N1173J031j3383J4311L133
$$ 14452 -36555 -28432 -16384 -2807 -71054 -115473 -90438 -39265 -38234 -51617 -37306 -34173
8071c4173k2335l874k9525j8842K2784J6294j8921j450q343N4216o864n3483K0148
$$ -34173 -56508 -60382 -89907 -108749 -85965 -69671 -88592 -90042 -98385 -44169 -51033 -104516 -84368
8058h4368J6088R127k1705r43L1707P166J5116j6170m570M39J5060K5263N649
$$ -84368 -68280 -59153 -80858 -81801 -50094 -42928 -27812 -43982 -48552 -48113 -33053 -7790 -2141
8045b141J9829K220j282q619P282l8271j6763K7335j5566j3575J0603j1959J4582
$$ -2141 17688 19908 18626 10007 17289 -20982 -37745 -10410 -25976 -39551 -28948 -40907 -26325
8032b6325J8175K6365l8716l7219N700N072M706m02M0712J9480k8345L2938O908
$$ -26325 -8150 18215 -20501 -57720 -52020 -46948 -42242 -42644 -1932 17548 -10797 22141 29049
8019B9049q510j1285m6431l2916J8704K8433R551K7994k7299l6668K6563O2268
$$ 29049 20539 9254 -37177 -70093 -51389 -22956 -13405 14589 -12710 -49378 -22815 39453
8007C9453j4865k1753l6479N79K2189J0405K3357j4646l1076Q951N1889p73j7016
$$ 39453 24588 2835 -33644 -33065 -10876 -471 22886 8240 -22836 -13885 38004 37231 20215
7994B0215l1563N815l0169J7603q156K161k8326k3727L0835K212J4227n763P702
$$ 20215 -11348 -5533 -35702 -18099 -26255 -24094 -52420 -76147 -45312 -43100 -28873 -34636 -26934
7981b6934l388l382Q551l267p402k56L3739O946m1354l983Q381N901l217k3092
$$ -26934 -30322 -33704 -25153 -28420 -35822 -36078 -2339 4607 -36747 -40730 -32349 -26448 -29665 -52757
7967e2757j3510J394l593J3297J1218l643L3042K4680K8602k3241o763J7997l8998
$$ -52757 -66267 -64873 -68466 -55169 -43951 -47594 -14552 10128 38730 15489 8726 26723 -12275
7954a2275P802k6769j5289p148l6224K6988O737Q079q683k0701j3394L5633J1355
$$ -12275 -4473 -31242 -46531 -53679 -89903 -62915 -56178 -48099 -56782 -77483 -90877 -55244 -43889
7941d3889q028Q230k418k5352j1548J631M3192k3943m1022j0241M7912L2068j1080
$$ -43889 -51917 -43687 -46105 -71457 -83005 -81374 -38182 -62125 -103147 -113388 -65476 -33408 -44488
7928d4488n162K0013K6619r692N096J8793J6309j8593k5721J0869P389k3211J2733
$$ -44488 -49650 -29637 -3018 -12710 -7614 11179 27488 8895 -16826 -5957 1432 -21779 -9046
7915i046l3007k6562j2074M0910K8629J3492J1152K5246K0648k7617l4714k3399
$$ -9046 -42053 -68615 -80689 -39779 -11150 2342 13494 38740 59388 31771 -2943 -26342
7903b6342j9577J3088j4713m0856j6862J7079L5586K3533l515j7135J1617R066
$$ -26342 -45919 -32831 -47544 -88400 -105262 -88183 -52597 -29064 -32579 -49714 -38097 -29031
7891b9031l7434P898O1063k171k0806j1674k754M271J328l525N501Q509k0767
$$ -29031 -66465 -58567 2496 325 -20481 -32155 -34909 -30638 -29310 -32835 -27334 -18825 -39592
7878c9592R462j8227n057l4586r479N3961N2376l0468o2765m8044L8425K9877
$$ -39592 -30130 -48357 -53414 -88000 -97479 -43518 8858 -21610 -84375 -132419 -93994 -64117
7866f4117o4880j1287n398N5477L7009K9012M8709N785K0k0735L5535P538n3747
$$ -64117 -128997 -140284 -145682 -90205 -53196 -24184 24525 30310 30330 9595 45130 52668 -1079
7853a079j1701K4340k3374k4244N547R36j351l256j4206J6286J6487K024J2920
$$ -1079 -12780 11560 -11814 -36058 -30511 -29575 -30926 -34182 -48388 -32102 -15615 -13591 -671
7840f71N5184l827l4115k1150l5947J4856K6527M4532J9639k1810o3310M194K9044
$$ -671 54513 50686 16571 -4579 -40526 -25670 857 45389 65028 43218 -20092 -15898 13146
7827A3146o3032n0951J8804M1561L319k367k5681l559J9813J296m6576j6625J2346
$$ 13146 -49886 -100837 -82033 -40472 -37153 -39520 -65201 -68760 -48947 -47651 -94227 -110852 -98506
7814i8506N1885L2780J4260m7665m3308K6535J9635l606m369J0784k402K1483
$$ -98506 -46621 -13841 419 -47246 -90554 -64019 -44384 -47990 -52359 -41575 -43977 -22494
7802b2494n750K3808k342m0786J3893K4322J0284l928L849O561k2423j7402j5551
$$ -22494 -28244 -4436 -6778 -47564 -33671 -9349 935 -2993 856 7417 -15006 -32408 -47959
7789d7959Q571L025j2701M5221L954k8823q586j8152O261Q881P69m220l2771l9513
$$ -47959 -39388 -36363 -49064 -3843 111 -28712 -37298 -55450 -49189 -40308 -39539 -43759 -76530 -116043
7775a16043J2702M9786L433l6060J2868K6226J8313J8362M4726J2403k9764l1768
$$ -116043 -103341 -53555 -50122 -86182 -73314 -47088 -28775 -10413 34313 46716 16952 -14816
7763a4816m767m842K9711K0630R153l625j1966k9915r048M0379l0699n0314j4735
$$ -14816 -19583 -24425 5286 25916 35069 31444 19478 -10437 -19485 20894 -9805 -60119 -74854
7750g4854K2655M6648J596n5744k3171j4164O135P313M6546k5496L2659K7768
$$ -74854 -52199 -5551 -3955 -59699 -82870 -97034 -90899 -83586 -37040 -62536 -29877 -2109
7738b109j9178n3709k4124O4143N5331j6416R139K0591J1429l8059j8906l6429
$$ -2109 -21287 -74996 -99120 -34977 20354 3938 13077 33668 45097 7038 -11868 -48297
7726d8297J3475j0254j3100K5587L0561J118k536R509K7131k1834k0289l9392
$$ -48297 -34822 -45076 -58176 -32589 -2028 -910 -3446 6063 33194 11360 -8929 -48321
7714d8321o413j6454Q872j7449M1987M3255j2888R918l3073l1354J1101k0195
$$ -48321 -54734 -71188 -62316 -79765 -37778 5477 -7411 2507 -30566 -61920 -50819 -71014
7702g1014O090K8684K6019j3207p563J4399O754J6102k9812l8378J6719j0059
$$ -71014 -64924 -36240 -10221 -23428 -30991 -16592 -9838 6264 -23548 -61926 -45207 -55266
7690e5266l6049k1723J367L7493J8421j5675K5458K8020m0117l10K856j7239K4691
$$ -55266 -91315 -113038 -111671 -74178 -55757 -71432 -45974 -17954 -58071 -58381 -55525 -72764 -48073
7677d8073M0423j665J417N684r613L1872k3029j3414J872p682j8894j438p07p098
$$ -48073 -7650 -9315 -7898 -2214 -11827 20045 -2984 -16398 -14526 -22208 -41102 -42540 -43247 -50345
7663e0345p158N397L1054J0414J0854q475j714J7846k530l339j3701J8081j9119
$$ -50345 -57503 -52106 -21052 -10638 216 -8259 -9973 7873 5343 2004 -11697 6384 -12735
7650a2735J0933K6935j9695j2592j8419l9713n721L2589m184K0849j2541o1958
$$ -12735 -1802 25133 5438 -7154 -25573 -65286 -71007 -38418 -42602 -21753 -34294 -96252
7638i6252J7744M8315N8534M5280L532n0307l2008r061J7008l5180j8119j945
$$ -96252 -78508 -30193 28341 73621 77153 26846 -5162 -14223 2785 -32395 -50514 -52459
7626e2459L007N1416P049J8693m6947l2740n0759K467J1395L4864K0664L0832
$$ -52459 -49452 1964 9013 27706 -19241 -51981 -102740 -100273 -88878 -54014 -33350 -2518
7614b518M0537l0826o4169j0997K4275M9480k1089J3597J8400k343m5956M0029
$$ -2518 38019 7193 -56976 -67973 -43698 5782 -15307 -1710 16690 14347 -31609 8420
7602H420N305l7934k2663K948N0073J2052l5089M399N5623k1244m9627j0603q242
$$ 8420 13725 -24209 -46872 -43924 6149 18201 -16888 -12489 43134 21890 -27737 -38340 -46582
7589d6582j2762n446J9102J3825R501Q475M6433k5670l2541K0724M35k6577J8252
$$ -46582 -59344 -64790 -45688 -31863 -22362 -13887 32546 6876 -25665 -4941 -4506 -31083 -12831
7576a2831K5326K6627J1011m5615n2760l0512M9164P7507j475o798m8221k9879
$$ -12831 12495 39122 50133 4518 -48242 -78754 -29590 47917 46442 39644 -8577 -38456
7564c8456o132J2084J3235k352p9l590Q581J31K8281j344k0422J990k2544j9470
$$ -38456 -44588 -32504 -19269 -21621 -21700 -25290 -16709 -16578 11703 10359 -10063 -8073 -30617 -50087
7550e0087L452L3078J8384l0818J2590L951l5372m0018L9916p50o362K670j9655
$$ -50087 -46635 -13557 4827 -25991 -13401 -9450 -44822 -84840 -44924 -45674 -52036 -49366 -69021
7537f9021J7735j001J4786M2690J8511M425l765l2025l0970M2473M0429k6102
$$ -69021 -51286 -52287 -37501 5189 23700 28125 24360 -7665 -38635 3838 44267 18165
7525A8165m8543j0828J2744J2974j1566J4494j1801N498M8439J5836k0987L887
$$ 18165 -30378 -41206 -28462 -15488 -27054 -12560 -24361 -18863 29576 45412 24425 28312
7513B8312L3189j134j2944l1348j0795L0919J3999k4301q775l5275L2617R359
$$ 28312 61501 60367 47423 16075 5280 36199 50198 25897 17122 -18153 14464 23823
7501B3823l992K1532K6282j8071k7161p401K977k8783j6735K4320o360J8112R454
$$ 23823 19831 41363 67645 49574 22413 15012 17989 -10794 -27529 -3209 -9569 8543 17997
7488A7997k6820l7560M952J4989j3237j3247K0766L1577k2831k9683m6763l4709
$$ 17997 -8823 -46383 -41431 -26442 -39679 -52926 -32160 -583 -23414 -53097 -99860 -134569
7476a34569N6296L2478K832m165r892P64J0035o966p724M3099M8281l8842J955
$$ -134569 -78273 -45795 -42963 -47128 -57020 -56256 -46221 -53187 -60911 -17812 30469 -8373 -6418
7463f418r429l390k6219K8166n135l798K4277j9041k9135n24J6771K1869J3721
$$ -6418 -15847 -19237 -45456 -17290 -22425 -26223 -1946 -20987 -50122 -50646 -33875 -12006 1715
7450A715K6019J0395r861m057k5245j5646L1210L7894K4205m16l9667k9071l0573
$$ 1715 27734 38129 28268 24211 -1034 -16680 14530 52424 76629 76213 36546 7475 -23098
7437b3098J3768j475J0126k1090n04k6155o6927l3966N6811M3653K3090O647M4448
$$ -23098 -9330 -10805 -679 -21769 -22273 -48428 -115355 -149321 -92510 -48857 -25767 -19120 25328
7424B5328K0265J2813k1879M5904j0246l9301l2200k4606K9179J0238k3493l1859
$$ 25328 45593 58406 36527 82431 72185 32884 684 -23922 5257 15495 -7998 -39857
7412c9857J0676R807K4505k2968O738J7190l3408K5919L0314m5225r38P269R807
$$ -39857 -29181 -19374 5131 -17837 -11099 6091 -27317 -1398 28916 -16309 -17247 -9978 -171
7399a71j7326l9432M544k995k260O109j888J7156N027j8030M7682J2007j6609
$$ -171 -17497 -56929 -52385 -55380 -57640 -51531 -53419 -36263 -31236 -49266 -1584 10423 -6186
7386f186M0956K6013O201o1778j3227L811J0995K6241j3542m5599l2399l886p637
$$ -6186 34770 60783 66984 5206 -8021 -4210 6785 33026 19484 -26115 -58514 -62400 -70037
7373g0037K3763M923r00q053k0479L6997j197J3743N7394j2869J3721l7353l9701
$$ -70037 -46274 -41351 -42251 -50304 -70783 -33786 -34983 -21240 36154 23285 37006 -347 -40048
7360d0048K1160K3911P489o612J7947j8932m2413Q933n168n230K2410L6247J725
$$ -40048 -18888 5023 12512 5900 23847 4915 -37498 -28565 -33733 -38963 -16553 19694 21419
7347B1419J032k4010j5703M055L8731m730K5002k0403J275k4208j9270K5542K5676
$$ 21419 22451 -1559 -17262 -13207 25524 20794 45796 25393 26668 2460 -16810 8732 34408
7334C4408J9315K3375k0562m9568k8690k300n418l3427k4069J0007J0151L3663
$$ 34408 53723 77098 56536 6968 -21722 -24022 -29440 -62867 -86936 -76929 -66778 -33115
7322c3115N4503J6251l605R137N796k9931n5034m5637K2688M1512L1621j4362
$$ -33115 21388 37639 34034 43171 48967 19036 -35998 -81635 -58947 -17435 14186 -176
7310a76J1964K54k9000J4398P993p247j8576l017J7589m0411L0646J1372Q054
$$ -176 11788 12042 -16958 -2560 5433 -1814 -20390 -23407 -5818 -46229 -15583 -4211 3843
7297C843J5272m0636m0315P81k6239J6613Q697K1839M2475j3814k0507k3451J3721
$$ 3843 19115 -21521 -61836 -61055 -87294 -70681 -61984 -40145 2330 -11484 -31991 -55442 -41721
7284d1721K5461K3520j4633k320k3481m0179m1055M7408M0785m568K0779K2078
$$ -41721 -16260 7260 -7373 -9693 -33174 -73353 -114408 -67000 -26215 -30783 -10004 12074
7272A2074j3897j4948K0273L6179R68j2648k1343N383k6748k2233L1567o279j4478
$$ 12074 -1823 -16771 3502 39681 40649 28001 6658 12041 -14707 -36940 -5373 -11652 -26130
7259b6130L0773j0274k8384J672j4343k0859r619L0776J8794K3697K3285m1953
$$ -26130 4643 -5631 -34015 -32343 -46686 -67545 -77164 -46388 -27594 -3897 19388 -22565
7247b2565j7074K7208L5148K6660O925m7015l388L4453j2902o728J8127l733j6327
$$ -22565 -39639 -12431 22717 49377 56302 9287 5899 40352 27450 20722 38849 35116 18789
7234A8789o3184m4696J9255J4836K7618l1260J1194N1639K0422k3282Q049J4671
$$ 18789 -44395 -89091 -69836 -55000 -27382 -58642 -47448 4191 24613 1331 9380 24051
7222B4051j0455J6640m303R761l0509m4734n9384k9965j804L2586K4333L4838
$$ 24051 13596 30236 25933 35694 5185 -39549 -98933 -128898 -130702 -98116 -73783 -38945
7210c8945K0205J2346j7545j5422l2816J5394k4833j1529K8762K5251J9238K500
$$ -38945 -18740 -6394 -23939 -39361 -72177 -56783 -81616 -93145 -64383 -39132 -19894 -17394
7198a7394O1456j4430J3719k2093J720p313j7148K5034j8493K243L3894j0334
$$ -17394 44062 29632 43351 21258 22978 15665 -1483 23551 5058 7301 41195 30861
7186C0861l3035l469l0393l5760K5541L3431O0450r252m5433k1379k4606k4366
$$ 30861 -2174 -5643 -36036 -71796 -46255 -12824 47626 38374 -7059 -28438 -53044 -77410
7174g7410N1541J7940K4723n065k1891J7999m3473j7049J0350M991J0046K3331
$$ -77410 -25869 -7929 16794 11729 -10162 7837 -35636 -52685 -42335 -37344 -27298 -3967
7162c967n916Q421l7393k6691L1452n174n688K2885N0446P692l4794q225K3724
$$ -3967 -9883 -1462 -38855 -65546 -34094 -39268 -44956 -22071 28375 36067 1273 -6952 16772
7149A6772M270r438J0470l2860l8400J3126r118j646k1586j5776p137p997L6965
$$ 16772 21042 11604 22074 -10786 -49186 -36060 -45178 -46824 -68410 -84186 -91323 -99320 -62355
7136f2355L0818M4633M4026J4309j2565l2470j9187K616L9094q961n3579l6433
$$ -62355 -31537 13096 57122 71431 58866 26396 7209 9825 48919 39958 -13621 -50054
7124e0054N4864M1808J1287j8631l4044l4745O1965K6171m9124l7946k0006L0290
$$ -50054 4810 46618 57905 39274 5230 -29515 32450 58621 9497 -28449 -48455 -18165
7112a8165M7926j8624k3949k1319J6895K6951q939l9633P554K3964J2281J8417
$$ -18165 29761 11137 -12812 -34131 -17236 9715 776 -38857 -31303 -7339 4942 23359
7100B3359K3950K271j7784n66l2036m3809k3416L047J3548M9599K407j9166j3100
$$ 23359 47309 49580 31796 31230 -806 -44615 -68031 -64984 -51436 -1837 570 -18596 -31696
7087c1696K8674K8762j1806k3320n314k8923j4360K2109N2142K9764l6494j874
$$ -31696 -3022 25740 13934 -9386 -14700 -43623 -57983 -35874 16268 46032 9538 7664
7075G664K0627Q453j5923J1901K2934O622N583l2651k1347M644k0143n510m48
$$ 7664 28291 36744 20821 32722 55656 62278 67861 35210 13863 18507 -1636 -7146 -7594
7062g594r136R791K5063k5581j2684J9669J5224M0599J3621K702k1106j7177k4063
$$ -7594 -16730 -6939 18124 -7457 -20141 -472 14752 55351 68972 71674 50568 33391 9328
7049I328k6368K9368N4945j0720m9056m4743k5947J2443l910l613J4327M54q200
$$ 9328 -17040 12328 67273 56553 7497 -37246 -63193 -50750 -54660 -58273 -43946 -43492 -51692
7036e1692k8314K0776j909P761J6770L051k7435l107N5858N9215m199o7713l4831
$$ -51692 -80006 -59230 -61139 -53378 -36608 -33557 -60992 -64099 -8241 50974 46775 -20938 -55769
7023e5769J934N2260M1082p214k4767k6456J003J8352J379J7261n3450p136j3530
$$ -55769 -53835 -1575 39507 32293 7526 -18930 -17927 425 1804 19065 -34385 -41521 -55051
7010e5051J3506P598J3813N115P475Q58j2599k0981R224K8895J0427j8838k8317
$$ -55051 -41545 -33947 -20134 -15019 -7544 -6686 -19285 -40266 -31042 -2147 8280 -10558 -38875
6997c8875Q258M9418o431p035j3448k4853J6375P2030L1647j1990n801j6626k9881
$$ -38875 -30617 18801 12370 5335 -8113 -32966 -16591 55439 87086 75096 69295 52669 22788
6984B2788o9797n209L6404m749L2239k766j303L0775M9119J0797n8217j15773
$$ 22788 -47009 -52218 -15814 -20563 11676 8910 7607 38382 87501 98298 40081 -75692
6972g5692m8909O5086O3296O728m2812J431L6316L2501p0983n5692J8365J9432
$$ -75692 -124601 -59515 3781 10509 -32303 -30872 5444 37945 -33038 -88730 -70365 -50933
6960e0933K936M7186P390j8823m237n866k373j9408j7619K6479L2984k1269P346
$$ -50933 -47997 -811 6579 -12244 -16481 -22347 -24720 -44128 -61747 -35268 -2284 -23553 -16207
6947a6207K2524K1558l6027j1428L631k0316L0149K3275n609j5088l750J0024
$$ -16207 6317 27875 -8152 -19580 -15949 -36265 -6116 17159 11550 -3538 -7288 2736
6935B736K8939L1072k603J345j6235n327k3716K305J6680n962r801J1671J7756
$$ 2736 31675 62747 60144 61489 45254 39927 16211 18516 35196 29234 19433 31104 48860
6922D8860j0684m5219M4253J7938o720j6388k0502j0189m7311m1857j5789J9436
$$ 48860 38176 -7043 37210 55148 48428 32040 11538 1349 -45962 -87819 -103608 -84172
6910h4172P90O3392J2595M5038K7125L016J406j1706J1807k0214J9380j0281l4376
$$ -84172 -83382 -19990 -7395 37643 64768 67784 69190 57484 69291 49077 68457 58176 23800
6897B3800J2732Q291m6981j5820k1619j0126K8935k3607j5042j9275N098L5511
$$ 23800 36532 44823 -2158 -17978 -39597 -49723 -20788 -44395 -59437 -78712 -73614 -38103
6885c8103J0780k7001k7557K5617L4408P54P663J4472K6424j927k6144k0900k2379
$$ -38103 -27323 -54324 -81881 -56264 -21856 -21102 -13439 1033 27457 25530 -614 -21514 -43893
6872d3893l267M3647L8223j4688l8367M290J1071N2366M286n352j2144J481k0773
$$ -43893 -47160 -3513 34710 20022 -18345 -14055 -2984 49382 53668 48316 36172 37653 16880
6859A6880m4180k3508J2443M6173J3727m4067n0506M343J3365J0403J0318r192
$$ 16880 -27300 -50808 -38365 7808 21535 -22532 -73038 -68695 -55330 -44927 -34609 -43801
6847d3801J62L1408L1763L9278p077l9256l2169j0317J7760n109J7131J1283N727
$$ -43801 -43639 -12231 19532 58810 51733 12477 -19692 -30009 -12249 -17358 -227 11056 16783
6834A6783k2247j8525J3328L928J497R480jj106K970k168J251K8672L0944k3213
$$ 16783 -5464 -23989 -10661 -6733 -5236 4244 4243 3137 6107 3939 5190 33862 64806 41593
6820D1593n52l1497j6888N395q198K2347K7794J1501j028k2565P283r233j0872
$$ 41593 41041 9544 -7344 -1949 -10147 12200 39994 51495 50467 27902 35185 25952 15080
6807A5080K0876M526j7353J2421k0966j8765k392j532K6203J6169l7190r718J5020
$$ 15080 35956 40482 23129 35550 14584 -4181 -6573 -8105 18098 34267 -2923 -12641 2379
6794B379j7749n9167p135J8464M9669K8855L0905M5209n2790n3699j2322K8076
$$ 2379 -15370 -74537 -81672 -63208 -13539 15316 46221 91430 38640 -15059 -27381 695
6782F95j0454M096j492k0316R786J8467J2209J829M1367k8296l8247o8341r267
$$ 695 -9759 -5663 -7155 -27471 -17685 782 12991 14820 56187 27891 -10356 -78697 -87964
6769h7964N3061M1316L4186J0281j7902j8290J3618K6761j4998l2833O387M6921
$$ -87964 -34903 6413 40599 50880 32978 14688 28306 55067 40069 7236 13623 60544
6757F0544K3026j9465j8093m7310m0020J0761L7691K5842k5484o8180K831L8399
$$ 60544 83570 64105 46012 -1298 -41318 -30557 7134 32976 7492 -60688 -57857 -19458
6745a9458l650K2479m285j0432k305k8259j176p979p503M9735L0200J0448k8829
$$ -19458 -23108 -629 -4914 -15346 -17651 -45910 -47086 -55065 -62568 -12833 17367 27815 -1014
6732a014l1289M6611j6528j6100k5519r267K7043k274K2509K4102Q620J6140k7991
$$ -1014 -32303 14308 -2220 -18320 -43839 -53106 -26063 -28337 -5828 18274 26894 43034 15043
6719A5043j0383m2781k3725K4782J8754J1299m471k7844J5248K5807L1739J9407
$$ 15043 4660 -38121 -61846 -37064 -18310 -7011 -11482 -39326 -24078 1729 33468 52875
6707E2875k5694j941J8883m5007l7324L3585K6615J9203l9917k3258J3038l733
$$ 52875 27181 25240 44123 -884 -38208 -4623 21992 41195 1278 -21980 -8942 -12675
6695a2675j8283j3531L710J9111l9245N788L6729j3297L2624L6680k3222m044
$$ -12675 -30958 -44489 -40779 -21668 -60913 -55125 -18396 -31693 931 37611 14389 10345
6683A0345M503k228J6537O327R729n4994j2106N650K4651K2962k738k2919k3451
$$ 10345 14848 12620 29157 35484 45213 -9781 -21887 -16237 8414 31376 28638 5719 -17732
6670a7732n342m841L1218o961o423j2638N651j9379j4474k5546K6810L0451J4949
$$ -17732 -23074 -27915 3303 -3658 -10081 -22719 -17068 -36447 -50921 -76467 -49657 -19206 -4257
6657d257J1966J6504j2810m511L1832O478J5773J5484k1938k4268j772k0530m87
$$ -4257 7709 24213 11403 6892 38724 45202 60975 76459 54521 30253 28481 7951 7464
6644G464r756l766J0506J8815J2625J7014r094n5481p644M1682r365M279j739
$$ 7464 -2292 -6058 4448 23263 35888 52902 43808 -11673 -19317 22365 13000 17279 15540
6631A5540j3994p766J0744j5169j1906L3479j9052J4613L282R180o922K1098L0850
$$ 15540 1546 -6220 4524 -10645 -22551 10928 -8124 6489 9771 18951 12029 33127 63977
6618F3977j5672k8238J5541l2299j9409K0154J996l7486L8307M7309j226j5513
$$ 63977 48305 20067 35608 3309 -16100 4054 6050 -31436 6871 54180 52954 37441
6606C7441q687K226L577O14K399j4863j9889j3524Q953L4482L1599L4945l3803
$$ 37441 28754 30980 34557 35171 37570 22707 2818 -10706 -1753 32729 64328 99273 65470
6593F5470O485N94m2379k4631L2176j1225j3405j3093M415l7714K4748O773m6388
$$ 65470 71955 72549 30170 5539 37715 26490 13085 -8 4407 -33307 -8559 -1786 -48174
6580d8174j9375L2300k401k8001n222K9843j8354N9247L2816l464J0364k5533
$$ -48174 -67549 -35249 -37650 -65651 -70873 -41030 -59384 -137 32679 29215 39579 14046
6568A4046j0637K1131n0833k3988M3800K1904J3580q012k8457r019J0804L3353
$$ 14046 3409 24540 -26293 -50281 -6481 15423 29003 20991 -7466 -16485 -5681 27672
6556B7672J792J7931k6432k1771J2578M3372m1522j1423n17K0573L9540K1662
$$ 27672 29464 47395 20963 -808 11770 55142 13620 2197 1680 22253 61793 83455
6544H3455J6845L0916o470k4520j588j0667J260K8137j038J6624k1528P60N2557
$$ 83455 100300 131216 124746 100226 98638 87971 89231 117368 116330 132954 111426 112186 164743
6531A64743r577J1057M2104N7937K727l5266j4073K1504Q270L5021J8789k9616
$$ 164743 155166 166223 208327 266264 268991 233725 219652 241156 249426 284447 303236 273620
6519B73620m8155J1194N908j17303o5012Q744K9066K1249J6369k2213k8174L2360
$$ 273620 225465 236659 242567 125264 60252 68996 98062 119311 135680 113467 85293 117653
6507A17653K1007k5960j2869l2784N07m7491J3292q290m1056J790L4150p512m5327
$$ 117653 138660 112700 99831 67047 67554 20063 33355 25065 -15991 -14201 19949 12437 -32890
6494c2890l2167J0597N075j0781L0134M2021K0352K8796n84l5070j6145o617n244
$$ -32890 -65057 -54460 -49385 -60166 -30032 11989 32341 61137 60553 25483 9338 2721 -2523
6481b523J0704k3983l0706k7361L4418K0910J399n404J8134k9820K16K5978L2334
$$ -2523 8181 -15802 -46508 -73869 -39451 -18541 -17142 -22546 -4412 -34232 -34016 -8038 24296
6468B4296m447k6201J8161J6860l4148l6912r717K3777J6131R53N80r936O689
$$ 24296 19849 -6352 11809 28669 -5479 -42391 -52108 -28331 -12200 -11247 -10667 -20603 -13914
6455a3914l7942l8420K7472K5076M0528J6441q054m7554l331Q342k2013O648M5452
$$ -13914 -51856 -90276 -62804 -37728 2800 19241 11187 -36367 -39698 -31356 -53369 -46721 -1269
6442a269j1547k9392l9279P81J0116q056M5685L8404J2953J6458j621O957K5770
$$ -1269 -12816 -42208 -81487 -80706 -70590 -78646 -32961 5443 18396 34854 33233 40190 65960
6429F5960l159k2606l0392j8971m1498n1856Q854M6673K8620J3827m0322K3471
$$ 65960 62801 40195 9803 -9168 -50666 -102522 -93668 -46995 -18375 -4548 -44870 -21399
6417b1399N7071l7869m2939j5203J4613L1259j209N036K4854J9416l5833n891
$$ -21399 35672 -2197 -45136 -60339 -45726 -14467 -15676 -10640 14214 33630 -2203 -8094
6405h094k291K6127L5150m453o303j3146j8948r457k831j6689k3730n436J444
$$ -8094 -10385 15742 50892 46439 40136 26990 8042 -1415 -4246 -20935 -44665 -50101 -48657
6392d8657L088k359N83K7783J3135l588J2984j2638Q378k09l0999J5161R923j2157
$$ -48657 -45569 -47928 -47345 -19562 -6427 -10015 2969 -9669 -1291 -1500 -32499 -17338 -7415 -19572
6378a9572o005J1254K392O768J9295J196k0123l903Q211J9436J363j0044R361
$$ -19572 -25577 -14323 -11931 -5163 14132 15328 -4795 -8698 -487 18949 20312 10268 19629
6365A9629J6079J6234l1129l0894Q569j9641N700K7644j4018j1075K3165o01j9218
$$ 19629 35708 51942 20813 -10081 -1512 -21153 -15453 12191 -1827 -12902 10263 9662 -9556
6352i556l1254K073K937L9528K628r062J6295l834p220N03l094p409j6671N757
$$ -9556 -40810 -38737 -35800 3728 6356 -2706 13589 9755 2535 3038 -56 -7465 -24136 -18379
6338a8379J4147J0010n4555l2757j3787J3697L4593K0385K0728K6600k1724l4027
$$ -18379 -4232 5778 -48777 -81534 -95321 -81624 -47031 -26646 -5918 20682 -1042 -35069
6326c5069l5690J2514P0K0812l689k15J058M6484K4446L837m366k8853j4503m6586
$$ -35069 -70759 -58245 -58175 -37363 -41052 -41267 -40209 6275 30721 34558 30192 1339 -13164 -59750
6312e9750j3397M9083L4901J6730l3890m0732l5033K6151j2914K748K2177J5265
$$ -59750 -73147 -24064 10837 27567 -6323 -47055 -82088 -55937 -68851 -66103 -43926 -28661
6300b8661M2688k6562n4741J8278j8141n739q744K3777J8218r844o063L798j7716
$$ -28661 14027 -12535 -67276 -48998 -67139 -72878 -81622 -57845 -39627 -49471 -55534 -51736 -69452
6287f9452l7538K1063K4628K8243L1942K1148k7799l0599M2187J6797m566m8028
$$ -69452 -106990 -85927 -61299 -33056 -1114 20034 -7765 -38364 3823 20620 16054 -31974
6275c1974j2538Q750J1142j7158j204L2451l024p39K3046K4479R783M702m8807
$$ -31974 -44512 -35762 -24620 -41778 -42982 -10531 -13555 -14294 8752 33231 43014 47716 -1091
6262a091l9117j3846j508L9195N8850j0018n0712n85J6282l1336N799P86j7356
$$ -1091 -40208 -54054 -55562 -16367 42483 32465 -18247 -18832 -2550 -33886 -28087 -27301 -44657
6249d4657L246j915k8268L9748J0404j4559l0765j3250J1593L6129K9597j3667
$$ -44657 -41411 -43326 -71594 -31846 -21442 -36001 -66766 -80016 -68423 -32294 -2697 -16364
6237a6364J2621J7692M3279K4315n7928m7676k6704o322M414M5433K5341K3060
$$ -16364 -3743 13949 57228 81543 23615 -24061 -50765 -57087 -52673 -7240 18101 41161
6225D1161j5707m0949l3203K6539L696J0046R244j4029j4810K9206K0800k4482
$$ 41161 25454 -15495 -48698 -22159 -18463 -8417 827 -13202 -28012 1194 21994 -2488
6213b488K739l447j6468J5942N061J4577j0878l5191o59M8353P235L557J1153
$$ -2488 251 -3196 -19664 -3722 1339 15916 5038 -30153 -30812 17541 24776 28333 39486
6200C9486o494m5635j9810j6908J1981J837L9357J8298k3824j5997l7461M546
$$ 39486 32992 -12643 -32453 -49361 -37380 -35543 3814 22112 -1712 -17709 -55170 -50624
6188e0624N8873N8993q346l0276l7255q93l7279n010R362L8552J9530J333J9178
$$ -50624 8249 67242 58896 28620 -8635 -9528 -46807 -51817 -42455 -3903 15627 16960 36138
6175C6138M480l2223l9645L3534L9048n8562k9337k8636J210R9878L8433k4594
$$ 36138 40618 8395 -31250 2284 41332 -17230 -46567 -75203 -73993 25885 64318 39724
6163C9724l2493k6128m1864J842M2787O4936j074J5182k7184k4522k3518m954
$$ 39724 7231 -18897 -60761 -58919 -16132 48804 47730 62912 35728 11206 -12312 -17266
6151a7266k3853J9699L6690R335j9093q3j7601J6362J7203L3172K5364m1300l7283
$$ -17266 -41119 -21420 15270 24605 5512 5429 -12172 4190 21393 54565 79929 38629 1346
6138A346j8586L1571J841J9173N91Q55m3094j6423L113J492k5128K7762L5111
$$ 1346 -17240 14331 16172 35345 35936 36791 -6303 -22726 -19613 -18121 -43249 -15487 19624
6125A9624J5187k4042k6244r431J9705k8649n750J1970k5845M707j4967j1102
$$ 19624 34811 10769 -15475 -24906 -5201 -33850 -39600 -27630 -53475 -48768 -63735 -74837
6113g4837k5583M965n566Q88M1920L6646K730M4268M353P840n7125k7605K207
$$ -74837 -100420 -95455 -101021 -100133 -58213 -21567 -18837 25431 29784 37624 -19501 -47106 -44899
6100d4899Q551P764K5839M6428j236j1305j8450M958j7691o922N3695o093l865
$$ -44899 -36348 -28584 -2745 43683 42447 31142 12692 17650 -41 -6963 46732 40639 36774
6087C6774n2130r174M7372L3096Q052m3257R555J5826n663k9680o1102l7182P62
$$ 36774 -15356 -24530 22842 55938 63990 20733 30288 46114 40451 10771 -50331 -87513 -86751
6074h6751M991N2609O8625k2714m0218M1436j7114k1042M842N1158L9850k3473
$$ -86751 -81760 -29151 39474 16760 -23458 17978 864 -20178 -15336 35822 75672 52199
6062E2199r707K3173J2236k2985n46l3840m3643m265j3383q516K9565J7136O36
$$ 52199 42492 65665 77901 54916 54370 20530 -23113 -27378 -40761 -49277 -19712 -2576 -1940
6049a940K4164J8906K3867L816J1207j6555J0075M083n24j630o0359n0641K083
$$ -1940 22224 41130 64997 68813 80020 63465 73540 77623 77099 75469 15110 -35531 -33448
6036c3448j3661j8966k3025J528J8287N6942L2177r715k6208k4790j1531K1344
$$ -33448 -47109 -66075 -89100 -87572 -69285 -12343 19834 10119 -16089 -40879 -52410 -31066
6024c1066K7470j6043j0409j2239j7959J5547J4384Q72L0196m6936j7909k6256
$$ -31066 -3596 -19639 -30048 -42287 -60246 -44699 -30315 -29443 753 -46183 -64092 -90348
6012i0348M210J4511J0383N1585J586J1465j6867J6685K7515M845K4139m234k3662
$$ -90348 -86138 -71627 -61244 -9659 -8073 3392 -13475 3210 30725 35570 59709 55475 31813
5999C1813j7686j5026J0303K9131Q316n4760k0767K1778n5J8418j562l6757J6988
$$ 31813 14127 -899 9404 38535 46851 -7909 -28676 -6898 -6953 11465 9903 -26854 -9866
5986i866L8266k6719N80J9384J4600k086J391k0580k796J1303N906N644j3406
$$ -9866 28400 1681 2261 21645 36245 34159 35550 14970 12174 23477 29383 35027 21621
5973B1621l509k6978k3402J0892J5076P773J3944L925M747j1473L4356o996l7257
$$ 21621 18112 -8866 -32268 -21376 -6300 1473 15417 19342 24089 12616 46972 39976 2719
5960B719J2184l1444J6520j703j0732J7023j2578J215m957m261j9837l899l2032
$$ 2719 14903 -16541 -21 -1724 -12456 4567 -8011 -6796 -11753 -16014 -35851 -39750 -71782
5947g1782J6082J3677j3616M0770O519j437j903j3364J9701K0656k1440l1396
$$ -71782 -55700 -42023 -55639 -14869 -8350 -9787 -11690 -25054 -5353 15303 -6137 -37533
5935c7533K732K1231M790L674q964K16J0149L8518P163k1629m9183j5924l4320
$$ -37533 -34801 -13570 -8780 -5106 -14070 -13854 -3705 34813 41976 20347 -28836 -44760 -79080
5922g9080j2555J7221N6834K1283J1568K4877j2511j0393M4327l0580j7728K4361
$$ -79080 -91635 -74414 -17580 3703 15271 40148 27637 17244 61571 30991 13263 37624
5910C7624J9963K7376K0630l8422o8552K664J1658N318q818j086J4645j2378j6234
$$ 37624 57587 84963 105593 67171 -1381 1283 12941 18259 9441 8355 23000 10622 -5612
5897e612K2734L7646p671m2497K3657L89P040j619l2661j337l4119P137j9569
$$ -5612 17122 54768 47097 4600 28257 28646 35686 34067 1406 69 -34050 -26913 -46482
5884d6482o472L9305N3690r029J893j8611J8940k3946Q676o223j7996P165m3844
$$ -46482 -52954 -13649 40041 31012 32905 14294 33234 9288 17964 11741 -6255 910 -42934
5871d2934j6067L3204J8594m3l1735K972k778p261j7643L6975M9891L6467j7635
$$ -42934 -59001 -25797 -7203 -7246 -38981 -36009 -38787 -46048 -63691 -26716 23175 59642 42007
5858D2007J3599j5678j3690J4538k9030K208L9350j6602k0179k2686j3227N488
$$ 42007 55606 39928 26238 40776 11746 13954 53304 36702 16523 -6163 -19390 -13902
5846a3902N706j4343k4182k7125K1837L5764K3430r991k8291j1842l68L2648J7306
$$ -13902 -8196 -22539 -46721 -73846 -52009 -16245 7185 -2806 -31097 -42939 -43307 -10659 6647
5833F647J8476l583p588p587K0676j4041l2145K3967j1665j6611N0899k6609k3036
$$ 6647 25123 21540 13952 6365 27041 13000 -19145 4822 -6843 -23454 27445 836 -22200
5820b2200O744L6238M5638J9814k1451m7280j2514o526L5277k1757q830M1195
$$ -22200 -15456 20782 66420 86234 64783 17503 4989 -1537 33740 11983 3153 44348
5808D4348m2371j8986L0282P979p217j203o714m1173m982J0466k5956P14j5770
$$ 44348 1977 -17009 13273 21252 14035 12832 6118 -35055 -40037 -29571 -55527 -54813 -70583
5795g0583m874M1170J5921m2160k2624J9147M1361K2626p030L7564l066j8400
$$ -70583 -75457 -34287 -18366 -60526 -83150 -64003 -22642 -16 -7046 30518 27452 9052
5783I052L9704j7822l3263O325n260j4560J8381j1555K9718k2040j0836n943J3767
$$ 9052 48756 30934 -2329 3996 -1264 -15824 2557 -8998 20720 -1320 -12156 -18099 -4332
5770d332j4591M072K1909M191K4390J92r689q217j7632L7056K2552J1112M0241
$$ -4332 -18923 -14851 7058 11249 35639 35831 26142 17925 293 37349 59901 71013 111254
5757A11254k0508o3455l5077J7646N7794J7306j7262m5595m610k0448l4329k8920
$$ 111254 90746 27291 -7786 9860 67654 84960 67698 22103 17493 -2955 -37284 -66204
5745f6204O142L8353L7079J8973J8192o2287n4005K2788L0157l0772R673M4843
$$ -66204 -60062 -21709 15370 34343 52535 -9752 -63757 -40969 -10812 -41584 -31911 12932
5733A2932J2266k3011l8541J517R514L305J2102J5126J4042j0632j7977j2J3746
$$ 12932 25198 2187 -36354 -34837 -25323 -22018 -9916 5210 19252 8620 -9357 -9369 4377
5720D377L0449j7901m1434n2093j2040J5257L7617J4761J4639N386k0666l2072
$$ 4377 34826 16925 -24509 -76602 -88642 -73385 -35768 -21007 -6368 -982 -21648 -53720
5708e3720j3270J345L1163p846Q102J9370J0341j3686j5495O691q39L5470K8416
$$ -53720 -66990 -65645 -34482 -42328 -34226 -14856 -4515 -18201 -33696 -27005 -27844 7626 36042
5695C6042R55l6134l158J9840K1610k2543J3878J566K2108m4580l1361J2814R419
$$ 36042 36997 863 -2295 17545 39155 16612 30490 32056 54164 9584 -21777 -8963 456
5682D56n720j0435k0566j6876K6277k771n526m620R957k6684O761J9406k1870
$$ 456 -5264 -15699 -36265 -53141 -26864 -29635 -35161 -39781 -29824 -56508 -49747 -30341 -52211
5669e2211q209K823k5629n3335K0080L1839N2604M1294m0230M219J8881k1298
$$ -52211 -60420 -57597 -83226 -136561 -116481 -84642 -32038 9256 -30974 -26755 -7874 -29172
5657b9172N861p161M8478K595k0658j0941m984j7035n4L19L4734Q64l3336J3375
$$ -29172 -23311 -30472 18006 20601 -57 -10998 -15982 -33017 -33071 -32752 1982 2846 -30490 -17115
5643a7115q01M384j6876J9333L3114l0352J5806j2051j9713K975o656n360J4799
$$ -17115 -17916 -13532 -30408 -11075 22039 -8313 7493 -4558 -24271 -21296 -27952 -33312 -18513
5630a8513J1003J4670J1510K2747r489K393l5274Q304j5822k5494J7673N766m9470
$$ -18513 -7510 7160 18670 41417 31928 34321 -953 7351 -8471 -33965 -16292 -10526 -59996
5617e9996L4296R103l0346m637K8479J6557j7671l7977k53j6018K5027K1871p163
$$ -59996 -25700 -16597 -46943 -51580 -23101 -6544 -24215 -62192 -62445 -78463 -53436 -31565 -38728
5604c8728n9204J2964L4364J8981J9718l9394L318M2368p709k0025N950L6291
$$ -38728 -97932 -84968 -50604 -31623 -11905 -51299 -47981 -5613 -13322 -33347 -27397 8894
5592H894J5392J1297j0358K7724N398k0316o370n767j8795J5878j6700m1414n317
$$ 8894 24286 35583 25225 52949 58347 38031 31661 25894 7099 22977 6277 -35137 -40454
5579d0454M425N2599J7597p831M4476J1017l6076k6365j4361m4868J909J6936
$$ -40454 -36029 16570 34167 26336 70812 81829 45753 19388 5027 -39841 -37932 -20996
5567b0996M5321k0564k687j9304k7451N492R248Q800k5221R884J2239J3711j3732
$$ -20996 24325 3761 1074 -18230 -45681 -40189 -30941 -22141 -47362 -37478 -25239 -11528 -25260
5554b5260M575K902J7722j1585k3961q474R34M0608M2234R216k3964j7316k6139
$$ -25260 -20685 -17783 -61 -11646 -35607 -44081 -43147 -2539 39695 48911 24947 7631 -18508
5541a8508l1043Q520J0544l4739L5098M9024J2334l937j4804j3699L1873M4386
$$ -18508 -49551 -41031 -30487 -65226 -30128 18896 31230 27293 12489 -1210 30663 75049
5529G5049P115m7569l6255k1877k6795J6888O793K0062j1633N254J467J804j400
$$ 75049 82164 34595 -1660 -23537 -50332 -33444 -26651 -6589 -18222 -12968 -11501 -9697 -11097
5516a1097R81r810o627M70K0887k1207k6218M944M598K9174J9357L188j9378p863
$$ -11097 -10116 -19926 -26553 -26083 -5196 -26403 -52621 -47677 -43079 -13905 5452 8640 -10738 -18601
5502a8601J5714l887l8402K3397J5939j0923k8591K1281K6160j0077K7321J7259
$$ -18601 -2887 -6774 -45176 -21779 -5840 -16763 -45354 -24073 2087 -7990 19331 36590
5490C6590L6266m820l264l5367j0999l8706j6587K0458r42J3316m6050K418M1255
$$ 36590 72856 68036 64772 29405 18406 -20300 -36887 -16429 -17371 -4055 -50105 -47687 -6432
5477f432J9659k4198J0153o38l9379K3156J4473l3843n021R051K7908j1922l819
$$ -6432 13227 -10971 -818 -1456 -40835 -17679 -3206 -37049 -42070 -33019 -5111 -17033 -20852
5464b0852j591r8j7141j8520j475M43L8479N7867j9286k727N619J2506L4493j9183
$$ -20852 -22443 -22541 -39682 -58202 -59677 -59234 -20755 37112 17826 15099 20718 33224 67717 48534
5450D8534L103K2961m8333k4456k804J2493l6043j7475N2066n353j1573k1452
$$ 48534 51637 74598 26265 1809 -995 11498 -24545 -42020 10046 4693 -6880 -28332
5438b8332L7141j108l5236q496K7334K0412n2356j6415M2105J4914L064k702l1213
$$ -28332 8809 7701 -27535 -36031 -8697 11715 -40641 -57056 -14951 -37 3027 325 -30888
5425c0888L6151K1691L081J697k5327J1575K4999J7149j9625k8335j2650j5057
$$ -30888 5263 26954 30035 31732 6405 17980 42979 60128 40503 12168 -482 -15539
5413a5539L146k7288J2514K7108L4045M6097j4699o0071m995K0786N0214l2502
$$ -15539 -12393 -39681 -27167 -59 33986 80083 65384 5313 318 21104 71318 38816
5401C8816l8535L3539L7598N345o7698k1544l278M5563P581k8668k1304K1555
$$ 38816 281 33820 71418 76763 9065 -12479 -15757 29806 37387 8719 -12585 8970
5389H970k6103J331j7108p207K8926j328L0773K2259L45k2317M01j7600m8997
$$ 8970 -17133 -15802 -32910 -40117 -11191 -12519 18254 40513 40858 18541 18942 1342 -47655
5376d7655J5638K0174L265L1927l2424j0557k6648P007N864j6231J8884J1262
$$ -47655 -32017 -11843 -8578 23349 -9075 -19632 -46280 -39273 -33409 -49640 -30756 -19494
5364a9494R652R059j8260k5602l4075j3153p90M423j2859L7678r830K4518N7989
$$ -19494 -9842 -783 -19043 -44645 -78720 -91873 -92663 -88240 -101099 -63421 -73251 -48733 9256
5351I256k637k8556k829j051J9606M4692j3501j4636l7322J0022J4742l8708k1857
$$ 9256 6619 -21937 -24766 -25817 -6211 38481 24980 10344 -26978 -16956 -2214 -40922 -62779
5338f2779K6625L657q034J4506L5384K7994r215j2052L6074J3333l5311l5106
$$ -62779 -36154 -32497 -40531 -26025 9359 37353 28138 16086 52160 65493 30182 -4924
5326d924P517O7478J4537P002j2965k8621j4702r187J8744N1820o410p7835m9554
$$ -4924 2593 70071 84608 91610 78645 50024 35322 26135 44879 96699 90289 12454 -37100
5313c7100J5739j5417K0544J6522j0189l1723J3781J5941P873N1392M1209r262
$$ -37100 -21361 -36778 -16234 288 -9901 -41624 -27843 -11902 -4029 47363 88572 79310
5301G9310q189l0838l7707m2004R783L679j3385J7327J674l6181m430p815L5146
$$ 79310 71121 40283 2576 -39428 -29645 -25966 -39351 -22024 -20350 -56531 -60961 -68776 -33630
5288c3630L6955l2641j5152Q782J1412K3028K1912L5903J6582n54j5285k7231
$$ -33630 3325 -29316 -44468 -35686 -24274 -1246 20666 56569 73151 72597 57312 30081
5276C0081K013j9300L2026N861R181J693k8951k9847m6706q102P054R348l162
$$ 30081 32094 12794 44820 50681 59862 61555 32604 2757 -43949 -52051 -44997 -35649 -38811
5263c8811k1381M1890P799j4129M8608P704L544L3224l0272k8486M7511j2092
$$ -38811 -60192 -18302 -10503 -24632 23976 31680 35224 68448 38176 9690 57201 45109
5251D5109m0441J3929j0555m5154m181J2693j8687o51L7187P070j809j6589k6143
$$ 45109 4668 18597 8042 -37112 -41293 -28600 -47287 -47938 -10751 -3681 -5490 -22079 -48222
5238d8222J4774k386k773K6671K2617K2593K250J2653j3485m4622o057J685n080
$$ -48222 -33448 -35834 -38607 -11936 10681 33274 35524 48177 34692 -9930 -15987 -14302 -19382
5225a9382K9163M9194J9708k3888m5495l0262N183K203Q641M8535J2437l1164
$$ -19382 9781 58975 78683 54795 9300 -20962 -15779 -13576 -4935 43600 56037 24873
5213B4873m5179P104L0433J7798J8161J2733J7770K1640J1487n848l0888n4778
$$ 24873 -20306 -13202 17231 35029 53190 65923 83693 105333 116820 110972 80084 25306
5201B5306M615K1102m3283l9773j5088R939O5333J5655k8453l3396l239M1227
$$ 25306 29921 51023 7740 -32033 -47121 -37182 28151 43806 15353 -18043 -21282 19945
5189A9945K2020l1225j7622k7779J227K8687J0110k8526J3736M3306K1378J441
$$ 19945 41965 10740 -6882 -34661 -33434 -4747 5363 -23163 -9427 33879 55257 56698
5177E6698j5637k5116j1604J2613j412K5069k0295k7791m745m730J1796L1583
$$ 56698 41061 15945 4341 16954 15542 40611 20316 -7475 -12220 -16950 -5154 26429
5165B6429j0546k2805l483J7113j847j4922l2188p9772K993N7911l58k8792J650
$$ 26429 15883 -6922 -10405 6708 4861 -10061 -42249 -122021 -119028 -61117 -61475 -90267 -88617
5152h8617N6466n00J3549l554k2042k6186k5107Q229M2118N4207J5314J1347j732
$$ -88617 -32151 -32651 -19102 -22656 -44698 -70884 -95991 -87762 -45644 8563 23877 35224 33492
5139C3492j5812k7947l7193Q848M1270K0178L9467m904J2776j1362n3290k3163
$$ 33492 17680 -10267 -47460 -38612 2658 22836 62303 57399 70175 58813 5523 -17640
5127a7640J887K2914j0500m4142j2010L8095k2156k5176J5782j0177j0331M8213
$$ -17640 -15753 7161 -3339 -47481 -59491 -21396 -43552 -68728 -52946 -63123 -73454 -25241
5115b5241J8848r925k4036j3962J270P901J5990M3845J2860j7237j5440j6213
$$ -25241 -6393 -16318 -40354 -54316 -53046 -45145 -29155 14690 27550 10313 -5127 -21340
5103b1340J58o097J7288K6451L1216k4694k9882J0659R910K6796k35l7536k9442
$$ -21340 -21182 -27279 -9991 16460 47676 22982 -6900 3759 13669 40465 40230 2694 -26748
5090b6748J8981L5459J3314R032J831r706r483j1688k4308O539J2444K513k4746
$$ -26748 -7767 27692 41006 50038 51869 42163 32680 20992 -3316 3223 15667 18180 -6566
5077f566P022J9068l4744m042J7279R963L7594j3308n50o673k3986j5725k5520
$$ -6566 456 19524 -15220 -19262 -1983 7980 45574 32266 31716 25043 1057 -14668 -40188
5064d0188J5896l3136L7861J0091l5244O608J2444k0612j2296O62J6985j0389
$$ -40188 -24292 -57428 -19567 -9476 -44720 -38112 -25668 -46280 -58576 -57914 -40929 -51318
5052e1318o186K298J4144L916J2419M4775m161k2501j6304Q9K836J1877Q901j1905
$$ -51318 -57504 -55206 -41062 -37146 -24727 20048 15887 -6614 -22918 -22829 -19993 -8116 785 -11120
5038a1120k0908K1855J46l7204j684L8943J0923k8767J2773J9620L0075J8395
$$ -11120 -32028 -10173 -10027 -47231 -48915 -9972 951 -27816 -15043 4577 34652 53047
5026E3047j465P204q135k2024J5998m987l0175p2119q80P229R008K5415l1561
$$ 53047 51582 58786 50651 28627 44625 39638 9463 -62656 -63536 -56307 -47299 -21884 -53445
5013e3445J0791J7183K8336M3081r304m9780j4452K0306P1585M6365k8607p1859
$$ -53445 -42654 -25471 2865 45946 36642 -13138 -27590 -7284 64301 110666 82059 10200
5001A0200m3906p11J7054J6072K5996N111j4966k7433q261N971n585k4217M1961
$$ 10200 -33706 -34417 -17363 -1291 24705 29816 14850 -12583 -20844 -14873 -20458 -44675 -2714
4988b714p085l3988j1157p363n291m318K6271L1048J3987k9037L6374k8742Q584
$$ -2714 -9799 -43787 -54944 -62307 -67598 -71916 -45645 -14597 -610 -29647 6727 -22015 -13431
4975a3431L6396K138j0346k1855O823j0369R430j0335k166O187p841J031o272
$$ -13431 22965 25103 14757 -7098 -275 -10644 -1214 -11549 -13715 -7528 -15369 -14338 -20610
4962b0610o756q957N2551L9644l0271J0214O850l2508k5997l1202J8388K328M6262
$$ -20610 -27366 -36323 16228 55872 25601 35815 42665 10157 -15840 -47042 -28654 -26326 19936
4949A9936K2058J4041l4043o3274l1168N8826J4562k428K487K1592r526l3417
$$ 19936 41994 56035 21992 -41282 -72450 -13624 938 -1490 997 22589 13063 -20354
4937b0354L0382L6657M7124k5220k4123N985j3934j8837q693k4073k0928K7660
$$ -20354 10028 46685 93809 68589 44466 50451 36517 17680 8987 -15086 -36014 -8354
4925h354K5637n91k8011m1436j4306M1854J4728j289M5492K3217J5033j3513j2248
$$ -8354 17283 16692 -11319 -52755 -67061 -25207 -10479 -11768 33724 56941 71974 58461 46213
4912D6213r400j731Q406m0621k80L833j0440l9013k7973j36N1321K1270J4873
$$ 46213 36813 35082 43488 2867 2587 6420 -4020 -43033 -71006 -71142 -19821 1449 16322
4899A6322l84m0128j6526p480j6061K2666L6427K0846o863K0517m486L077L0194
$$ 16322 15938 -24190 -40716 -48196 -64257 -41591 -5164 15682 8819 29336 24850 27927 58121
4886E8121p85J5703j9280j6885q639o0748p444N0470J6432J5251l5652k6795k8494
$$ 58121 57336 73039 53759 36874 28235 -32513 -39957 10513 26945 42196 6544 -20251 -48745
4873d8745j0780n440L7987R302L3814j0144m0626q54M7336K1721j6376l8981J3766
$$ -48745 -59525 -64965 -26978 -17676 16138 5994 -34632 -35486 11850 33571 17195 -21786 -8020
4860h020J1568l2452K0311O839j8117k5628O370L5626k421L2515O037K4090q506
$$ -8020 3548 -28904 -8593 -1754 -19871 -45499 -39129 -3503 -5924 26591 32628 56718 48212
4847D8212j8584m4145n6305J5477R4105J3638m2517J2374K1604j0301j4215k1072
$$ 48212 29628 -14517 -70822 -55345 38760 52398 9881 22255 43859 33558 19343 -1729
4835a729N327l3857j3497K3664K8348j5372k972N264l5445l5352K811K8246j561
$$ -1729 3598 -30259 -43756 -20092 8256 -7116 -10088 -4824 -40269 -75621 -72810 -44564 -46125
4822d6125K8701L9671j7695L6666l2863j3474K1309K6322L4946K3618J1745j2513
$$ -46125 -17424 22247 4552 41218 8355 -5119 16190 42512 77458 101076 112821 100308
4810A00308n6683j7652N326k0577j8259J3481J8584j2261K9941P186o591j9208
$$ 100308 43625 25973 31299 10722 -7537 5944 24528 12267 42208 49394 42803 23595
4798B3595j7692q813J4637n031k9873M553p182j901p255n32J1315J840l585j4147
$$ 23595 5903 -2910 11727 6696 -23177 -18624 -25806 -27707 -34962 -35494 -24179 -22339 -25924 -40071
4784d0071J3611j1338J2422M068K9176J395J831j3380p292J8156p533l9087j9431
$$ -40071 -26460 -37798 -25376 -21308 7868 9263 11094 -2286 -9578 8578 1045 -38042 -57473
4771e7473q129L1393J6907K1225J8465j1074K2264k0645n1354O121K5089k8630
$$ -57473 -65602 -34209 -17302 3923 22388 11314 33578 12933 -38421 -32300 -7211 -35841
4759c5841m176l565N409J5755N2215l3764n3974M182j167P706J0857j0365k9708
$$ -35841 -40017 -43582 -38173 -22418 29797 -3967 -57941 -53759 -54926 -47220 -36363 -46728 -76436
4746g6436o54L9370K8582M6958J8194L180N063p0363m1382J0577N3712K6458J1405
$$ -76436 -77090 -37720 -9138 37820 56014 59194 64257 -6106 -47488 -36911 16801 43259 54664
4733E4664R474n9907k6081l3864M3295L0796r900k5865q546j5338R301m538J2177
$$ 54664 64138 4231 -21850 -55714 -12419 18377 8477 -17388 -25934 -41272 -31971 -36509 -24332
4720b4332k6231K0905J7105L864J6781Q204k8942L0927k040K1001l451k0192l5335
$$ -24332 -50563 -29658 -12553 -8689 8092 16296 -12646 18281 16241 37242 33791 13599 -21736
4707b1736J0281L2075L7300j0082n2751J346O0857K9907j263J3969k3927l9919
$$ -21736 -11455 20620 57920 47838 -4913 -3567 57290 87197 85934 99903 75976 36057
4695C6057k6751o569l9279l6021J7529k773M7845J3793J563j5299l9873m447N4062
$$ 36057 9306 2737 -36542 -72563 -55034 -57807 -9962 3831 5394 -9905 -49778 -54225 -163
4682a63L4651j9642k4769N041J8611J3067O667l2560n7246k8436J4076m257K7131
$$ -163 34488 14846 -9923 -4882 13729 26796 33463 903 -56343 -84779 -70703 -74960 -47829
4669d7829J1471N072K4280Q632m816P078j6775j1886O2598K8009j9847l2745m7710
$$ -47829 -36358 -31286 -7006 1626 -3190 3888 -12887 -24773 37825 65834 45987 13242 -34468
4656c4468n3578K6542L4682J5111M7023K466m2065j5945k104n6981J3781M9243
$$ -34468 -88046 -61504 -26822 -11711 35312 37778 -4287 -20232 -22336 -79317 -65536 -16293
4644a6293k8422m8822P016K0733J1973K5738j1560j6829O5258J8719k7990Q120
$$ -16293 -44715 -93537 -86521 -65788 -53815 -28077 -39637 -56466 8792 27511 -479 7641
4632G641j9395N992j8154m1665K9658L0767K5628J8420j992m6310m9792J5607
$$ 7641 -11754 -5762 -23916 -65581 -35923 -5156 20472 38892 36900 -9410 -59202 -43595
4620d3595J2074r025j4874M0960O4755J0511n9910n3615J1940o726j5949M262
$$ -43595 -31521 -40546 -55420 -14460 50295 60806 896 -52719 -40779 -47505 -63454 -59192
4608e9192M8998J1794k3122J4899J3406Q343M421K3753J3184l9368k6182j0668
$$ -59192 -10194 1600 -21522 -6623 6783 15126 19547 43300 56484 17116 -9066 -19734
4596a9734j6919J2669L0400j7758j402P393k6631J6535r45J2597N837l1751j855
$$ -19734 -36653 -23984 6416 -11342 -12744 -5351 -31982 -15447 -16392 -3795 2042 -29709 -31564
4583c1564J1945o261J6242Q162j4809J0659j4154J3780K5651k4272m6962J7088
$$ -31564 -19619 -25880 -9638 -1476 -16285 -5626 -19780 -6000 19651 -4621 -51583 -34495
4571c4495P765J1254j2562n861K7882J822q126j4024m2895K9474p273K1006J7349
$$ -34495 -26730 -15476 -28038 -33899 -6017 -4195 -12321 -26345 -69240 -39766 -47039 -26033 -8684
4558h684l9033l4669L2518K6371j0150j1994P565O562k372o518M748P114k4600
$$ -8684 -47717 -82386 -49868 -23497 -33647 -45641 -38076 -31514 -33886 -40404 -35656 -28542 -53142
4545e3142j4831L8995M0858l0720j3558l732M8816J6736J9375J8790l6619m6683
$$ -53142 -67973 -28978 11880 -18840 -32398 -36130 12686 29422 48797 67587 30968 -15715
4533a5715j7043k1461n820K9122P565N1083k9644r416J6316M86J787K6720K6449
$$ -15715 -32758 -54219 -60039 -30917 -23352 27731 -1913 -11329 4987 5473 7260 33980 60429
4520F0429l2437j8056j2838j2952J5994K0659N0296r750l2054j3302j1351J1569
$$ 60429 27992 9936 -2902 -15854 140 20799 71095 61345 29291 15989 4638 16207
4508A6207K6236K283m4117Q916o426l1772K2638J5749j1085j7702k0399L0823
$$ 16207 42443 44726 609 9525 3099 -28673 -6035 9714 -1371 -19073 -39472 -8649
4496h649M3274k2601l0674l0310N627L4078O201N948k4788l9101j5105N547L9863
$$ -8649 34625 12024 -18650 -48960 -43333 -9255 -3054 2894 -21894 -60995 -76100 -70553 -30690
4483c0690M024m4882k9565J2088O442J1800M0652N2438l1315j9477N3192l2030
$$ -30690 -26666 -71548 -101113 -89025 -82583 -70783 -30131 22307 -9008 -28485 24707 -7323
4471g323j464J9000k801N781k3289o5J0200k6592m19K8981L458j8458K4893o818
$$ -7323 -8787 10213 7412 13193 -10096 -10161 39 -26553 -26972 2009 5467 -12991 11902 5084
4457E084l1267l614K1378O5266r251l5449j5431J9266j1513m3613K0183K5478
$$ 5084 -26183 -29797 -8419 56847 47596 12147 -3284 15982 4469 -39144 -18961 6517
4445F517k3842q826j0247j9491K1410M4878P509m57k9595n352k4783l706j1360
$$ 6517 -17325 -26151 -36398 -55889 -34479 10399 17908 17451 -12144 -17496 -42279 -45985 -57345
4432e7345j3901K8533J3938J408K3991N964N1890K0141p354j3592j25l3691l2606
$$ -57345 -71246 -42713 -28775 -27367 -3376 2588 54478 74619 67265 53673 53548 19857 -12749
4419a2749K64K3849j251K6921L669l6894l3863L6685N4274k3686j5260J4626r446
$$ -12749 -12485 11364 10113 37034 40703 3809 -30054 6631 60905 37219 21959 36585 27139
4406B7139J2198j8827k6242O973k8152J4787K8048M7968L5157k229n5847k3273
$$ 27139 39337 20510 -5732 1241 -26911 -12124 15924 63892 99049 96820 40973 17700
4394A7700k7476p652K3081j5562l3982P150M7085L4518M135P495R3r684j3341
$$ 17700 -9776 -17428 5653 -9909 -43891 -36741 10344 44862 48997 56492 56585 46901 33560
4381C3560r16k9335j4219M2126L001j2698L5569K3055j2584k1798k3609l9072
$$ 33560 32644 3309 -10910 31216 34217 21519 57088 80143 67559 45761 22152 -16920
4369a6920j4504K1828M1316R450p656k0780k0741k7352j2279L9147J9223n251
$$ -16920 -31424 -9596 31720 41170 33514 12734 -8007 -35359 -47638 -8491 10732 5481
4357E481J8557l7262P796j0347j1401O281L747l701J3608j6846l4028K2212L4538
$$ 5481 24038 -13224 -5428 -15775 -27176 -20895 -17148 -20849 -7241 -24087 -58115 -35903 -1365
4344a365k8900j8045J6697K6303l587l325J3768M8395K2649J0479o39j4470j5640
$$ -1365 -30265 -48310 -31613 -5310 -8897 -12222 1546 49941 72590 83069 82430 67960 52320
4331E2320p892j6567j5773n060O248L5971J1709J134k400J5227P59k7462l7496
$$ 52320 44428 27861 12088 7028 13276 49247 60956 62090 59690 74917 75676 48214 10718
4318A0718m82L79L0074P938j5900k2501J163J296N88J8655j851J5725j9209j8998
$$ 10718 10236 10615 40689 48627 32727 10226 11389 12685 13273 31928 30077 45802 26593 7595
4304G595J050J0313J5646P838N817M884k3330k4477l6895O512P6216J2795k6973
$$ 7595 8645 18958 34604 42442 48259 53143 29813 5336 -31559 -25047 51169 63964 36991
4291C6991J1258l8040k4873j39m812r199K5353R112J1417k2888k0821O260j3857
$$ 36991 48249 10209 -14664 -14803 -19615 -28814 -3461 5651 17068 -5820 -26641 -20381 -34238
4278c4238k2062L028P876M1951J0891k284P362o31R475j1740k7069K075J990N084
$$ -34238 -56300 -53272 -45396 -3445 7446 5162 12524 11893 21368 9628 -17441 -15366 -13376 -8292
4264h292J4322j8747n3549j3036q506j0170N0756M3945N1841m970k3384L238J2883
$$ -8292 6030 -12717 -66266 -79302 -87808 -97978 -47222 -3277 48564 43594 20210 23448 36331
4251C6331q85k7545j9386l4705k2932P960N6858J3419l474L751j4476k034k82
$$ 36331 35446 7901 -11485 -46190 -69122 -61162 -4304 9115 5641 9392 -5084 -7118 -7400
4238g400K159J4522J6010P571M1351k3855k4355p296j5665O448j6704n898J6739
$$ -7400 -5241 9281 25291 32862 74213 50358 26003 18707 3042 9490 -7214 -13112 3627
4225C627L3012L5703l0204j9596J9178j6891M034K8866k071n058L7795j0136l2200
$$ 3627 36639 72342 42138 22542 41720 24829 28863 57729 55658 50600 88395 78259 46059
4212D6059l47K2361j7010k4150j5469l3427j7325J1648q745K0585O1277n035k1882
$$ 46059 45712 68073 51063 26913 11444 -21983 -39308 -27660 -36405 -15820 45457 40422 18540
4199A8540j637j1473m965K2831K0222m5520k4036q009K5195K5601o544q622J5173
$$ 18540 16903 5430 465 23296 43518 -2002 -26038 -34047 -8852 16749 10205 1583 16756
4186A6756K4993P900k3493k0969L4307j7857k9244J6455K0170j5594L818p32l8519
$$ 16756 41749 49649 26156 5187 39494 21637 -7607 8848 29018 13424 17242 16510 -22009
4173b2009k8658J1129K7812k4239J6343L6758O686K0167J0693m0607NK3543r600
$$ -22009 -50667 -39538 -11726 -35965 -19622 17136 23822 43989 54682 14075 14080 37623 28023
4160B8023J3897J5893l0702k9020j6087N673Q306o268k7293l0815J8075L4020
$$ 28023 41920 57813 27111 -1909 -17996 -12323 -4017 -10285 -37578 -68393 -50318 -16298
4148a6298J550l759j8944j4704K9903M1476j0315j0017k5733K2279m973j8031
$$ -16298 -14748 -18507 -37451 -52155 -22252 19224 8909 -1108 -26841 -4562 -9535 -27566
4136b7566M218K4404Q377l0787J8168J6439L1258N130n5822l7882j4374Q20K1356
$$ -27566 -23348 1056 9433 -21354 -3186 13253 44511 49641 -6181 -44063 -58437 -57617 -36261
4123c6261J5836N319k0961M2756O1013J5598j8601n6466n8708K6254L0244O92
$$ -36261 -20425 -15106 -36067 6689 67702 83300 64699 8233 -50475 -24221 6023 6715
4111F715j8921j1045J2402Q565l894l2513l962M160k1637o931P775M4142K7274
$$ 6715 -12206 -23251 -10849 -2284 -6178 -38691 -42653 -38493 -60130 -67061 -59286 -15144 12130
4098A2130k2791r369q620N8608K230K0851J0812n7128k0218m500J514K0395m5947
$$ 12130 -10661 -20030 -28650 29958 32188 53039 63851 6723 -13495 -17995 -16481 3914 -42033
4085d2033k5412N0316M9026P516K71n763K1740k7510l5236r041R594J4848M2289
$$ -42033 -67445 -17129 31897 39413 39684 33921 55661 28151 -7085 -16126 -6532 8316 50605
4072E0605Q464r602l9853l6403L5670k4628k2198k3441J5603M0172R802J5741
$$ 50605 59069 49467 9614 -26789 8881 -15747 -37945 -61386 -45783 -5611 4191 19932
4060A9932q587K7209M992J1149p716k8750j4631l1919K6169J9487J9033J9634
$$ 19932 11345 38554 43546 54695 46979 18229 3598 -28321 -2152 17335 36368 56002
4048E6002j5589o309L242k246p57M637L3988P866j5582k9725K0652K1506k0279
$$ 56002 40413 34104 37346 35100 34343 38980 72968 80834 65252 35527 56179 77685 57406
4035E7406l0509j0705o185m6384k3002R921L1658J0702J0410L0862l1463l0269
$$ 57406 26897 16192 10007 -36377 -59379 -49458 -17800 -7098 3312 34174 2711 -27558
4023b7558Q262L1839k411N341m6311J6627J5676Q947O188j073l9749j1057j7277
$$ -27558 -19296 12543 10132 15473 -30838 -14211 1465 10412 16600 15527 -24222 -35279 -52556
4010e2556K5146K9807o036j7989J608M6063r869J1203K2379L6744k1809p347j3727
$$ -52556 -27410 2397 -3639 -21628 -20020 26043 16174 27377 49756 86500 64691 57344 43617
3997D3617L391p022m6180J2643j6860J9173m576k0753k8975k449M8656K3697l6416
$$ 43617 47008 39986 -6194 6449 -10411 8762 4186 -16567 -45542 -47991 665 24362 -12054
3984a2054k5191n149K8363l6189k4327J2599J9567m706M3219J2878M354J9410
$$ -12054 -37245 -42394 -14031 -50220 -74547 -61948 -42381 -47087 -3868 9010 13364 32774
3972C2774N4252k2869l4680l1402K011q012j879K6545j5280J201k2718N135M0114
$$ 32774 87026 64157 29477 -1925 86 -7926 -9805 16740 1460 2661 -20057 -14922 25192
3959B5192J9490m542k4089j9217k5287j2998K6000J6295r379j6336l0715L1310
$$ 25192 44682 40140 16051 -3166 -28453 -41451 -15451 844 -8535 -24871 -55586 -24276
3947b4276o482j1059J3199J6515J5400J478J0485J6755K5038q419m8673m7197
$$ -24276 -30758 -41817 -28618 -12103 3297 4775 15260 32015 57053 48634 -39 -47236
3935d7236J5915J5390j9299L180k3210l808J2729J9918l7103Q624O434N9507L8814
$$ -47236 -31321 -15931 -35230 -32050 -55260 -59068 -46339 -26421 -63524 -54900 -48466 11041 49855
3922D9855j058n0267K042l4134m09J4498J4043K9255J7447j0994J8382K1144K12
$$ 49855 48797 -1470 572 -33562 -33971 -19473 -5430 23825 41272 30278 48660 69804 70016
3909G0016m2657J1347j4128L233P884m6809j9230L759L3762l256n5439r658R855
$$ 70016 27359 38706 24578 27811 35695 -11114 -30344 -26585 7177 3921 -51518 -61176 -51321
3896e1321L423j2452K0648N7159N2448j6601l2889m2025j5764K4305L8319o223
$$ -51321 -47898 -60350 -39702 17457 69905 53304 20415 -21610 -37374 -13069 25250 19027
3884A9027k6256j3338j880j1537M780M3761q654K2234k647l7290m433M3729J5083
$$ 19027 -7229 -20567 -22447 -33984 -29204 14557 5903 28137 25490 -11800 -16233 27496 42579
3871D2579o431n483l4361K147J1615p651j0669k4769J2671r708k4765J7799L1372
$$ 42579 36148 30665 -3696 -1549 10066 2415 -8254 -33023 -20352 -30060 -54825 -37026 -5654
3858e654L5716R160P709K9953l540k240m628R177l7416o679K9816o875k1413n1050
$$ -5654 30062 39222 46931 76884 73344 71104 66476 75653 38237 31558 61374 54499 33086 -17964
3844a7964J8924K3374j086j2014k5748j3186O923J9987j6894K5250N406k9247
$$ -17964 960 24334 23248 11234 -14514 -27700 -20777 -790 -17684 7566 12972 -16275
3832a6275n631k5532J4808L169Q373J7785K5255J8566N773j3696l270l3827J525
$$ -16275 -21906 -47438 -32630 -29461 -21088 -3303 21952 40518 46291 32595 29325 -4502 -2977
3819b977P789j1128j6760K6321k444n712p610l4553o358l3430l285N5963K4921
$$ -2977 4812 -6316 -23076 3245 801 -4911 -12521 -47074 -53432 -86862 -90147 -34184 -9263
3806i263k1208r765L8419N4580J9116o620L403q508j3283m1827l0208j1458K0765
$$ -9263 -30471 -40236 -1817 52763 71879 65259 68662 60154 46871 5044 -25164 -36622 -15857
3793a5857j0630k1229J3586q779n921L868L8300q747k8252l0967K1504O7534J7290
$$ -15857 -26487 -47716 -34130 -42909 -48830 -44962 -6662 -15409 -43661 -74628 -53124 14410 31700
3780C1700j0288M665L1398M910m6911m2781m989L0484M4728P148K0252r588k7973
$$ 31700 21412 26077 57475 62385 15474 -27307 -32296 -1812 42916 50064 70316 60728 32755
3767C2755K1419L337n2190J3960J0110j9869k3454r157K5430n67K099k8546j4118
$$ 32755 54174 57511 5321 19281 29391 9522 -13932 -23089 2341 1774 3873 -24673 -38791
3754c8791L2128J2461K3265K0188k1512l1765k8770K3148J7720r396j47k1246
$$ -38791 -6663 5798 29063 49251 27739 -4026 -32796 -9648 8072 -1324 -1471 -22717
3742b2717j4582J548L5006L9242M044j2517M2497J0769j5331k0402j1856n8005
$$ -22717 -37299 -35751 -745 38497 42541 30024 72521 83290 67959 47557 35701 -22304
3730b2304m8998J3679L8306L0141m141J3343M800p356j9203m100M735K1396j4780
$$ -22304 -71302 -57623 -19317 10824 6683 20026 24826 17470 -1733 -5833 -1098 20298 5518
3717E518p25M1119R314l5314l8833j1703R983O259j1464K382o454j928O79j1760
$$ 5518 4793 45912 55226 19912 -18921 -30624 -20641 -14382 -25846 -23464 -29918 -31846 -31167 -42927
3703d2927K4253J7850M5755k3197j8525J1474J912J2947J8550J1490j0349k2976
$$ -42927 -18674 -824 44931 21734 3209 14683 16595 29542 48092 59582 49233 26257
3691B6257j463J1255m669P864m351o617n2804k1935J2470J6575L2006k2957J8254
$$ 26257 24794 36049 31380 39244 34893 28276 -24528 -46463 -33993 -17418 14588 -8369 9885
3678I885k9336l2990L4764Q140R350j7826n093m296p373j9159J3497M6740J0718
$$ 9885 -19451 -52441 -17677 -9537 -187 -18013 -23106 -27402 -34775 -53934 -40437 6303 17021
3665A7021l092q441k0741J441L673k1327L4786M7k5470j8892o4595J3412K5810
$$ 17021 13929 5488 -15253 -13812 -10139 -31466 3320 3367 -22103 -40995 -105590 -92178 -66368
3652f6368M6348L2511j7789m5139l2657J7488N4896k6499J3507J2154j0431n983
$$ -66368 -20020 12491 -5298 -50437 -83094 -65606 -10710 -37209 -23702 -11548 -21979 -27962
3640b7962k4357l5358M3887J1086j5958J558L1543j3110m5476j1545M6360K0064
$$ -27962 -52319 -87677 -43790 -32704 -48662 -47104 -15561 -28671 -74147 -85692 -39332 -19268
3628a9268J6698R304j7179N108J9067L0926L2426k4449J7820k7353m3579j1169
$$ -19268 -2570 6734 -10445 -5337 13730 44656 77082 52633 70453 43100 -479 -11648
3616a1648O83J4814K8584K4836l307m3150q8527l1179p726K0486P2793L8503j627
$$ -11648 -10965 3849 32433 57269 53962 10812 -77715 -108894 -116620 -96134 -23341 15162 13535
3603A3535j5558r591J0091N9192J7194k2215Q01k4249J5458l2223r768J6859q324
$$ 13535 -2023 -11614 -1523 57669 74863 52648 53449 29200 44658 12435 2667 19526 11202
3590A1202j4123J787j3096j2182J0353m258j560j6938k2525J5017q792M8408M7645
$$ 11202 -2921 -1134 -14230 -26412 -16059 -20317 -21877 -38815 -61340 -46323 -55115 -6707 40938
3577D0938L4312k5050m6111j6763J2068J0409J5595K3185L7861J1984r970k8977
$$ 40938 75250 50200 4089 -12674 -606 9803 25398 48583 86444 98428 88458 59481
3565E9481k1792m0598l4572O779L5024R813L9607N808l158j312k4885J002P530
$$ 59481 37689 -2909 -37481 -30702 4322 14135 53742 59550 56392 55080 30195 31197 38727
3552C8727P61l3671j6838r554J1589J8464j4937K0905j1058k3578K5828n746m6213
$$ 38727 39488 5817 -11021 -20575 -8986 9478 -5459 15446 4388 -19190 6638 892 -45321
3539d5321o904L9252J9180P125j1548j3993O056J2933O534r278K067m964L5142
$$ -45321 -52225 -12973 6207 13332 1784 -12209 -6153 6780 13314 4036 6103 1139 36281
3526C6281O0111O329k144j402K983l1035m0084m0401k4025n848l623J4804K3879
$$ 36281 96392 102721 100577 99175 102158 71123 31039 -9362 -33387 -39235 -42858 -28054 -4175
3513d175L0637l1475r861J4714J2484L7m685N808k471j8652m3859k02N1916j3957
$$ -4175 26462 -5013 -14874 -160 12324 12361 7676 13484 11013 -7639 -51498 -51700 216 -13741
3499a3741K1062R828k691O340K0558J3866j2448L443o919j9856p860n924J2890
$$ -13741 7321 17149 14458 20798 41356 55222 42774 46217 39298 19442 11582 5658 18548
3486A8548K2087m5854q552j3586k5463J2640L4540j6739j3979O815M389N418J9153
$$ 18548 40635 -5219 -13771 -27357 -52820 -40180 -5640 -22379 -36358 -29543 -25154 -19736 -583
3473e83r108J0483K8173l7408Q005K3294j5885m585K0391k79k9901M8098L6833
$$ -583 -9691 792 28965 -8443 -438 22856 6971 2386 22777 22498 -7403 40695 77528
3460G7528K2851p359m5244j8715J0282k9726m9857o829L793K6956J5978J3565
$$ 77528 100379 93020 47776 29061 39343 9617 -40240 -47069 -43276 -16320 -342 13223
3448A3223l4348m8854M6826J2120J1334k6493j5016o852L0100o624j0635K173
$$ 13223 -21125 -69979 -23153 -11033 301 -26192 -41208 -48060 -17960 -24584 -35219 -33046
3436c3046Q802K8703N407M0850J1975m376P11j7557J1042J5406L741k2624k3257
$$ -33046 -24244 4459 9866 50716 62691 58315 59026 41469 52511 67917 71658 49034 25777
3423B5777j4083J0529L8833j8979k2557J7199j4672K7728K7623k1106l3331l7897
$$ 25777 11694 22223 61056 42077 19520 36719 22047 49775 77398 56292 22961 -14936
3411a4936o416L3439k4523o380K5023K1656L2052p353j5170j5081J0407L7582
$$ -14936 -21352 12087 -12436 -18816 6207 27863 59915 52562 37392 22311 32718 70300
3399G0300N166m1242n8216K385L8871l968o203P874j5977K0504m459J0473P728
$$ 70300 75466 34224 -23992 -21607 17264 13296 7093 14967 -1010 19494 15035 25508 33236
3386C3236r367j3127m2369J3407J2190O241m5295M2617M357k1216j0361Q175j9635
$$ 33236 23869 10742 -31627 -18220 -6030 211 -45084 -2467 1890 -19326 -29687 -21512 -41147
3373d1147J6577M7493O479j1259m318k3055m7724M1009K6356j7750k059J0902
$$ -41147 -24570 22923 29402 18143 13825 -9230 -56954 -15945 10411 -7339 -9398 1504
3361A504N999M1367K9520r722n340m488j6518m3529k8556j3593j3043J9420o793
$$ 1504 7503 48870 78390 68668 63328 58840 42322 -1207 -29763 -43356 -56399 -36979 -43772
3348d3772K5241K9910l7689R20M1269j2463k2106J8676J6622m5137j4874K0789
$$ -43772 -18531 11379 -26310 -25390 15879 3416 -18690 -14 16608 -28529 -43403 -22614
3336b2614L1852J7071K1105j7864k3815q181J2939k2883J6185L4589j6301r705
$$ -22614 9238 26309 47414 29550 5735 -2446 10493 -12390 3795 38384 22083 12378
3324A2378K1789k7293k0172p239l15J1864j7539j8632j2343L2325L5156J3645
$$ 12378 34167 6874 -13298 -20537 -20852 -8988 -26527 -45159 -57502 -25177 9979 23624
3312B3624k8196J38M990j6983p543j1427p488J5413R492L0953K4786l2376j3000
$$ 23624 -4572 -4434 556 -16427 -23970 -35397 -42885 -27472 -17980 12973 37759 5383 -7617
3299g617Q628O191j3955n606r041k46j3367m6323j650N1329O8518J6936k1462
$$ -7617 1011 7202 -6753 -12359 -21400 -21646 -35013 -81336 -82986 -31657 36861 53797 32335
3286C2335o3650J1144J8703k9391P711J7291j294J774O354k1928l5774K6545R988
$$ 32335 -31315 -20171 -1468 -30859 -23148 -5857 -7151 -5377 977 -20951 -56725 -30180 -20192
3273b0192m111M4101k3891n803j2557p120M0246K4224j8258q10M0656L3206k351
$$ -20192 -24303 19798 -4093 -9896 -22453 -29573 10673 34897 16639 15829 56485 89691 87340
3260H7340n5917n9582Q630k6791L5089N2543J3452M0121j2861n577k675O480k2092
$$ 87340 31423 -28159 -19529 -46320 -11231 41312 54764 94885 82024 76447 73772 80252 58160
3247E8160j3197n665l5414m2187j6141J7134P4993M3836k73k74j0742l4845k2565
$$ 58160 44963 39298 3884 -38303 -54444 -37310 37683 81519 81246 80972 70230 35385 12820
3234A2820k1907J5314O581K8518J327N158M597k3839q718J5184k4624l125J8493
$$ 12820 -9087 6227 12808 41326 42653 47811 52408 28569 19851 35035 10411 7286 25779
3221B5779l2503m6542l431K4204L802j7042J3684J1663M3346K3880J0134K347
$$ 25779 -6724 -53266 -56697 -32493 -28691 -45733 -32049 -20386 22960 46840 56974 59321
3209E9321n366l0464m004j3197j0925k2288m839K7872K9677K5059j0215j1045
$$ 59321 53955 23491 19487 6290 -4635 -26923 -31762 -3890 25787 50846 40631 29586
3197B9586q62r330J4508N037j1025k182l5588j3934N556P548n342L90m562j2212
$$ 29586 28724 19394 33902 38939 27914 25732 -9856 -23790 -18234 -10686 -16028 -15638 -20200 -32412
3183c2412L9299k481M805q741o092l686j4401L1536N45m973J2045j818j989R913
$$ -32412 6887 4406 9211 470 -5622 -9308 -23709 7827 8372 3399 15444 13626 11637 21550
3169B1550k1509r706k4739K86N783L823j3922M1954J6449k988j1658J6626l177
$$ 21550 41 -9665 -34404 -34118 -28335 -24512 -38434 3520 19969 16981 5323 21949 18772
3156A8772n45p551l3797k1817k5857L8951L9315k227j6681j0290J4570m070R407
$$ 18772 18227 10676 -23121 -44938 -70795 -31844 7471 5244 -11437 -21727 -7157 -11227 -1820
3143a820R099r791k9221J5496l277j5106j5820L4898n178k8537J2908N941K9552
$$ -1820 7279 -2512 -31733 -16237 -19514 -34620 -50440 -15542 -20720 -49257 -36349 -30408 -856
3130h56r042K6699p461r769Q02J5716j2760k7883k0887L4443m6108n047L0000
$$ -856 -9898 16801 9340 -429 373 16089 3329 -24554 -45441 -10998 -57106 -62153 -32153
3117c2153j165K7563L7649j4968K5073r044l0783l8875j2612j3264L7070L1987
$$ -32153 -33318 -5755 31894 16926 41999 32955 2172 -36703 -49315 -62579 -25509 6478
3105F478M739N267j6465K6588J7958J2789M345j8866j2679K882l7398j8346J7144
$$ 6478 11217 16484 19 26607 44565 57354 61699 42833 30154 33036 -4362 -22708 -5564
3092e564K4260L160l1363m6647l0269j5003J288K5852r029M3858N6333Q614N010
$$ -5564 18696 21856 -9507 -56154 -86423 -101426 -100138 -74286 -83315 -39457 16876 25490 30500
3079C0500n723l4525l0294P601j5229K5997K0237J1406L3348J9409l7607k1140
$$ 30500 24777 -9748 -40042 -32441 -47670 -21673 -1436 9970 43318 62727 25120 3980
3067C980J1292J9849M392j5137J0567J3656q197o946K769K9009J5877m6801j3936
$$ 3980 15272 35121 39513 24376 34943 48599 40402 33456 36225 65234 81111 34310 20374
3054B0374k6579k991J8855P623p185O363J9024j5798k3092j5103j0755L4563o172
$$ 20374 -6205 -9196 9659 17282 10097 16460 35484 19686 -3406 -18509 -29264 5299 -873
3041h73N194K8999J6611j3332j0298l7603k6674j0232q912M7446J322J7301Q383
$$ -873 4321 33320 49931 36599 26301 -11302 -37976 -48208 -57120 -9674 -8352 8949 17332
3028A7332l1580K7011O8339j5298m6049J6966K8256M962m1758l7846k3817L4032
$$ 17332 -14248 12763 81102 65804 19755 36721 64977 69939 28181 -9665 -33482 550
3016E50L1712n7740j7717L7322J9070J2867j7451j5487q655J3633L070m2419n262
$$ 550 32262 -25478 -43195 -5873 13197 26064 8613 -6874 -15529 -1896 1174 -41245 -46507
3003d6507l264K1516J4082k5545L3220K4765K1275m664J2503k3065l125Q606J1970
$$ -46507 -49771 -28255 -14173 -39718 -6498 18267 39542 34878 47381 24316 21191 29797 41767
2990D1767j4095R884K1132k3300j7792m1427J6115l7908K4290J2266J2501L2978
$$ 41767 27672 37556 58688 35388 17596 -23831 -7716 -45624 -21334 -9068 3433 36411
2978C6411O40k1488O963j847N38k6328k2772J6573L050J8141r645J3800L9015
$$ 36411 37051 15563 22526 20679 21217 -5111 -27883 -11310 -8260 9881 236 14036 53051
2965E3051p20m6624l2275j3335J2868L1399L1104n3402l4218M0389P0260N355
$$ 53051 52331 5707 -26568 -39903 -27035 4364 35468 -17934 -52152 -11763 58497 63852
2953F3852l1110n427Q098j5329l1062P955j4504o849k0961L6869K4690m5832j4740
$$ 63852 32742 27315 35413 20084 -10978 -3023 -17527 -24376 -45337 -8468 16222 -29610 -44350
2940d4350o441q024k030N723J7946K3695K1165l742j0022j2553l210M564N969
$$ -44350 -50791 -58815 -60845 -55122 -37176 -13481 7684 3942 -6080 -18633 -21843 -17279 -11310
$$ [...]
##END NTUPLES=NMR SPECTRUM
##END=
