##TITLE=Analysis number 308578
Compound Code cc 31123
Book Reference 397/42/1
Project Code adrs
Chemist Name brucer
##JCAMPDX= 6.0         $$ Bruker NMR JCAMP-DX V2.0
##DATA TYPE= NMR SPECTRUM
##DATA CLASS= NTUPLES
##ORIGIN= Bruker BioSpin GmbH
##OWNER= NMR
$$ XWIN-NMR		Version 3.5
$$ Tue May 24 13:53:16 2005 GMT Daylight Time (UT+1h)  MAYBRIDGE\NMR@NMR_250MHZ
##.OBSERVE FREQUENCY= 250.131544655141
##.OBSERVE NUCLEUS= ^1H
##.ACQUISITION MODE= SIMULTANEOUS (DQD)
##.ACQUISITION SCHEME= undefined
##.AVERAGES= 16
##.DIGITISER RES= 18
##SPECTROMETER/DATA SYSTEM= dpx250
##.PULSE SEQUENCE= zg30
##.SOLVENT NAME= CDCl3
##.SHIFT REFERENCE= (INTERNAL, CDCl3, 0, 16.4808)
##AUDIT TRAIL= $$ (NUMBER, WHEN, WHO, WHERE, WHAT)
$$ ##TITLE= Audit trail, XWIN-NMR		Version 3.5
$$ ##JCAMPDX= 5.01
$$ ##ORIGIN= Bruker BioSpin GmbH
$$ ##OWNER= NMR
$$ C:\u/data/dgb/nmr/ADRS/3480/pdata/1/auditp.txt
$$ ##AUDIT TRAIL=  $$ (NUMBER, WHEN, WHO, WHERE, WHAT)
(   1,<2005-05-24 13:52:51.38 +100>,<MAYBRIDGE\NMR>,<NMR_250MHZ>,
      <created by zg, POWCHK disabled, PULCHK disabled
       configuration hash MD5:
       62 19 C7 07 E1 42 D1 B7 37 6C 3D D0 77 39 F9 E6
       data hash MD5: 64K
       8B 23 52 79 11 6A FE 39 81 0F 88 23 8A F3 58 62>)
(   2,<2005-05-24 13:53:05.88 +100>,<MAYBRIDGE\NMR>,<NMR_250MHZ>,
      <Start of raw data processing
       ef LB = 0.3 FT_mod = 6 PKNL = 1 SI = 32K 
       data hash MD5: 32K
       4A CA 2C D7 41 97 99 45 62 A0 7F C2 46 20 0E 1A>)
(   3,<2005-05-24 13:53:08.31 +100>,<MAYBRIDGE\NMR>,<NMR_250MHZ>,
      <apk 
       data hash MD5: 32K
       6F 46 3D 80 53 77 B9 FA 6C 96 18 F5 4C AD 7A 05>)
(   4,<2005-05-24 13:53:09.26 +100>,<MAYBRIDGE\NMR>,<NMR_250MHZ>,
      <abs ABSG = 5 
       data hash MD5: 32K
       A9 3A 6F D1 E9 D3 4E EE 88 AE 22 84 31 79 C1 C2>)
$$ ##END=
$$ 
$$ hash MD5
$$ FB 45 22 24 BE 88 06 AE 3C 9D 57 F0 FE 8A AF EC
##$RELAX= 
##$RELAX= 
##$RELAX= 
##$RELAX= 
##$RELAX= 
##$RELAX= 
##$RELAX= 
$$ Bruker specific parameters
$$ --------------------------
##$DU= <C:\u>
##$EXPNO= 3480
##$NAME= <ADRS>
##$PROCNO= 1
##$TYPE= <nmr>
##$USER= <dgb>
##$AMP= (0..31)
100 100 100 100 100 100 100 100 100 100 100 100 100 100 100 100 100 100 
100 100 100 100 100 100 100 100 100 100 100 100 100 100 
##$AQSEQ= 0
##$AQ_mod= 3
##$AUNM= <au_zg>
##$AUTOPOS= <36 >
##$BF1= 250.13
##$BF2= 250.13
##$BF3= 250.13
##$BF4= 250.13
##$BF5= 500.13
##$BF6= 500.13
##$BF7= 500.13
##$BF8= 500.13
##$BYTORDA= 1
##$CFDGTYP= 0
##$CFRGTYP= 5
##$CHEMSTR= <none>
##$CNST= (0..31)
1 1 145 1 1 1 1 1 1 1 1 1 1 1 1 1 1 1 1 1 1 1 1 1 1 1 1 1 1 1 1 1 
##$CPDPRG= <>
##$CPDPRG1= <>
##$CPDPRG2= <>
##$CPDPRG3= <>
##$CPDPRG4= <mlev>
##$CPDPRG5= <mlev>
##$CPDPRG6= <mlev>
##$CPDPRG7= <mlev>
##$CPDPRG8= <mlev>
##$CPDPRGB= <>
##$CPDPRGT= <>
##$D= (0..31)
0 1 0 0 0 0 0 0 0 0.06 0 0 0 0 0 0 0.0002 0 0 0 0 0 0 0 0 0 0 0 0 0 0 
0 
##$DATE= 1116939170
##$DBL= (0..7)
120 120 120 120 120 120 120 120 
##$DBP= (0..7)
150 150 150 150 150 150 150 150 
##$DBP07= 0
##$DBPNAM0= <>
##$DBPNAM1= <>
$$ [...]
##$SUBNAM7= <"">
##$SUBNAM8= <"">
##$SUBNAM9= <"">
##$SW= 20.6930455092707
##$SWIBOX= (0..15)
0 0 3 0 0 0 0 0 0 0 0 0 0 0 0 0 
##$SW_h= 5175.983436853
##$TD= 65536
##$TD0= 1
##$TE= 295.16
##$TE2= 300
##$TE3= 300
##$TEG= 300
##$TL= (0..7)
0 120 120 120 120 120 120 120 
##$TP= (0..7)
150 150 150 150 150 150 150 150 
##$TP07= 0
##$TPNAME0= <>
##$TPNAME1= <>
##$TPNAME2= <>
##$TPNAME3= <>
##$TPNAME4= <>
##$TPNAME5= <>
##$TPNAME6= <>
##$TPNAME7= <>
##$TPOAL= (0..7)
0.5 0.5 0.5 0.5 0.5 0.5 0.5 0.5 
##$TPOFFS= (0..7)
0 0 0 0 0 0 0 0 
##$TUNHIN= 0
##$TUNHOUT= 0
##$TUNXOUT= 0
##$USERA1= <user>
##$USERA2= <user>
##$USERA3= <user>
##$USERA4= <user>
##$USERA5= <user>
##$V9= 5
##$VALIST= <valist>
##$VCLIST= <CCCCCCCCCCCCCCC>
##$VD= 0
##$VDLIST= <DDDDDDDDDDDDDDD>
##$VPLIST= <PPPPPPPPPPPPPPP>
##$VTLIST= <TTTTTTTTTTTTTTT>
##$WBST= 1024
##$WBSW= 4
##$XGAIN= (0..3)
0 0 0 0 
##$XL= 0
##$YL= 0
##$YMAX_a= 469097
##$YMIN_a= -285208
##$ZGOPTNS= <>
##$ZL1= 120
##$ZL2= 120
##$ZL3= 120
##$ZL4= 120
##$ABSF1= 16.48083
##$ABSF2= -4.212343
##$ABSG= 5
##$ABSL= 3
##$ALPHA= 0
##$AQORDER= 0
##$ASSFAC= 0
##$ASSFACI= 0
##$ASSFACX= 0
##$ASSWID= 0
##$AUNMP= <proc_1d>
##$AZFE= 0.1
##$AZFW= 0.1
##$BCFW= 0
##$BC_mod= 0
##$BYTORDP= 0
##$COROFFS= 0
##$CY= 12.5
##$DATMOD= 1
##$DC= 0
##$DFILT= <>
##$DTYPP= 0
##$F1P= 14.0000005364418
##$F2P= -0.99999901652339
##$FCOR= 0.5
##$FTSIZE= 32768
##$FT_mod= 6
##$GAMMA= 0
##$GB= 0
##$INTBC= 1
##$INTSCL= 1
##$ISEN= 128
##$LB= 0.3
##$LEV0= 0
##$LPBIN= 0
##$MAXI= 10000
##$MC2= 0
##$MEAN= 0
##$ME_mod= 0
##$MI= 0
##$NCOEF= 0
##$NC_proc= -3
##$NLEV= 6
##$NOISF1= 0
##$NOISF2= 0
##$NSP= 0
##$NTH_PI= 0
##$NZP= 0
##$OFFSET= 16.48083
##$PC= 1
##$PHC0= 144.7148
##$PHC1= -9.43713
##$PH_mod= 1
##$PKNL= yes
##$PPARMOD= 0
##$PSCAL= 4
##$PSIGN= 0
##$REVERSE= no
##$SF= 250.130010295416
##$SI= 32768
##$SIGF1= 0
##$SIGF2= 0
##$SINO= 400
##$SIOLD= 32768
##$SREGLST= <1H.CDCl3>
##$SSB= 0
##$STSI= 32768
##$STSR= 0
##$SW_p= 5175.98343685301
##$SYMM= 0
##$S_DEV= 0
##$TDeff= 65536
##$TDoff= 0
##$TI= <Analysis number 999999
Compound Code 99
Book Reference 9
Project Code 9>
##$TILT= no
##$TM1= 0
##$TM2= 0
##$TOPLEV= 0
##$USERP1= <user>
##$USERP2= <user>
##$USERP3= <user>
##$USERP4= <user>
##$USERP5= <user>
##$WDW= 1
##$XDIM= 32768
##$YMAX_p= 467592295
##$YMIN_p= -180593
$$ End of Bruker specific parameters
$$ ---------------------------------
##NTUPLES= NMR SPECTRUM
##VAR_NAME=  FREQUENCY,     SPECTRUM/REAL,   SPECTRUM/IMAG
##SYMBOL=    X,             R,               I
##VAR_TYPE=  INDEPENDENT,   DEPENDENT,       DEPENDENT
##VAR_FORM=  AFFN,          ASDF,            ASDF
##VAR_DIM=   32768,         32768,           32768
##UNITS=     HZ,            ARBITRARY UNITS, ARBITRARY UNITS
##FACTOR=    0.157963299565203, 1,           1
##FIRST=     4122.34998720095, 0,            0
##LAST=      -1053.63344965206, 0,           0
##MIN=       -1053.63344965206, -180593,     0
##MAX=       4122.34998720095, 467592295,    0
$$ Real data points
##PAGE= N=1
##DATA TABLE= (X++(R..R)), XYDATA
$$ [...]
14568b1534J024N01N530M528k681R8l315J600M646Q182J563n711n693q87K491
14553i658k07n086l916M611P287L187M79l222L133K110n046l790L339M870J350
14538e59K131P988R682J3487J6829K1452J9664P386n038j1052j5676j8031r042
14525C9221j1837j3885k445o37l501p546o665j075n2n05K247l267p9K410M978
14510b638j626Q02m69n265l620j156J507P63k41J259M41N01l557k499n12N70N404
14493a0336L552o57o506m245J645L574J66l191K669K211k265M935j385o597J20
14478a6310k660j637K665M351M886j444m406j018M300k20m232j496q34K51J887
14463a5917J704j774K402R56M756J128K333J684L740j117j726j585l557K256K076
$$ y = [-21534, -20510, -20009, -14479, -9951, -12632, -12534, -15849, -14249, -9603, -1421, 142, -5569, -11262, -12149, -9658, -9865, -14951, -18867, -14256, -6969, -3782, -3303, -6525, -3392, -1282, -6328, -10118, -6779, -1909, -559, 1572, 9560, 19242, 32729, 49558, 71010, 90674, 98060, 93022, 81970, 66294, 48263, 39221, 27384, 13499, 11054, 10417, 6916, -630, -7295, -8370, -8422, -8927, -6680, -9947, -10026, -7616, -2638, -4264, -3462, -3931, -9196, -12816, -13972, -12465, -11702, -11943, -10684, -10243, -9742, -13299, -15798, -16310, -15740, -10336, -6784, -7441, -13947, -18192, -16547, -12973, -12807, -15998, -13329, -11118, -13383, -8448, -9833, -16430, -16310, -18970, -20607, -17942, -13591, -8705, -10149, -14555, -15573, -11273, -11493, -15725, -17221, -18055, -17804, -15917, -14213, -15987, -13585, -12629, -7873, -6745, -4412, -2728, 1012, -105, -1831, -3416, -6973, -4717, -2641]
14448b641J899O007R124R147J2372K3400L3341K9553K4181K6367M8396O7474L8490
14435C27110p634j3371J3150K4883j7237n9147n4580l1759l0044l3344l1868k6389
14423E9770j7101r085q060j0482n530l866N3j867m73k745j69j059j082K768N81
14408A653k338J003k876j329n117J540r18l052N16m10n769j691N574N335N345
14393b534j37n885J402J650M230m62j957J203k885j899N55m007n618j458K81J544
14377a5977O961M23k336J085J791M114M19J73j617m869P95p45j873k71M207J415
14361f305k736j502m838m777k400J660M214o16O48K321J573J935m439o240n297
14346b6799l048m79L009M292O944l783l470j65J0026Q537j131k270l878rK120
$$ y = [-2641, -742, 5265, 14389, 23536, 35908, 59308, 92649, 122202, 146383, 172750, 221146, 288620, 327110, 319476, 306105, 319255, 344138, 326901, 267754, 213174, 181415, 151371, 118027, 86159, 59770, 42669, 33584, 25524, 15042, 9512, 5646, 5699, 3832, 3359, 614, 445, -614, -1696, 1072, 1653, -685, 318, -2558, -3887, -9004, -7464, -8382, -11434, -10918, -11328, -17097, -18788, -13214, -7879, -2534, -2671, -8556, -7154, -5504, -1274, -1736, -3693, -2490, -5375, -7274, -6719, -10726, -16344, -17802, -17521, -15977, -9016, -8593, -10929, -9844, -8053, -3939, -3520, -3347, -4964, -9833, -9038, -9783, -11656, -11927, -7720, -6305, -9041, -10543, -15381, -20158, -22558, -20898, -16684, -17300, -16652, -14331, -12758, -10823, -15262, -21502, -26799, -29847, -30326, -27317, -23025, -16081, -19864, -23334, -23499, -13473, -4936, -6067, -8337, -12215, -12224, -10104]
14331a0104M784L393n826l700n224k128k96m077J359N585m006q831J703N186K479
14316a9703K173J230j58J159j910K867L728k608k990K933L770k799l955l332N164
14301a4431J290J249L911j03J121j693n605L457K567l239M554J790k241j503k443
14286a1319L923n83m581k150n650M79N32K709j288Q48K357m99M554J795k163l953
14270a4989k238Q38L087j735k317J06j029k365M43L395K630r59k621j667j032
14255b0453K616k438J931M545M880P39P12j515k333r62N963J199j593j596j706
14240a0011l238J84k364J882j724q425M040N444j305p85K206l441K327J859M462
14225h889L206k469l087m080J020k153K145k363M195j917j714m927j889N189k491
$$ y = [-10104, -5320, -1927, -7753, -11453, -16677, -18805, -19101, -23178, -21819, -16234, -20240, -29071, -27368, -22182, -19703, -17530, -16300, -16458, -15299, -17209, -14342, -10614, -13222, -16212, -13279, -9509, -12308, -16263, -19595, -14431, -13141, -11892, -7981, -8084, -6963, -8656, -14261, -10804, -8237, -11476, -6922, -5132, -7373, -8876, -11319, -7396, -7979, -12560, -14710, -20360, -19881, -19349, -16640, -17928, -17080, -14723, -15222, -10668, -8873, -11036, -14989, -17227, -16389, -13302, -15037, -17354, -17248, -18277, -20642, -20199, -16804, -14174, -15133, -17754, -19421, -20453, -17837, -20275, -18344, -13799, -8919, -8180, -7468, -8983, -11316, -12278, -6315, -5116, -6709, -8305, -10011, -13249, -13065, -15429, -13547, -15271, -23696, -19656, -14212, -15517, -16302, -14096, -17537, -15210, -13351, -8889, -5683, -8152, -11239, -15319, -14299, -16452, -14307, -16670, -12475, -14392, -16106, -21033, -22922, -17733, -20224]
14210b0224k720N936L429J963K031l237q70J605q30J03R91j225J433J57K996m11
14194h873n200l40l50j179J466q95N621M492j203r99L25l23p488n973J674K47
14178a8998K777P40n51l157L462R06r66L156R50J281j831k262j032J362k804K924
14162a4043K773K109K521M327K965M456L827j394k364l379l853j361m493pk164
14147a0080j746o997M107j938J409J642j082J35l27l026Q65N374K279l441q53
14132a3679M186P09m574j203L595k032o980J782K164J03k77L403O543P330O142
14117G212K715L650J0618J3604J0878K034n172q218j0448j4687j3132j222L478
14104A310K241l684o372Q31L232K377k149k744k168J379L731M302J194l642k277
$$ y = [-20224, -22944, -17008, -13579, -11616, -9585, -12822, -13692, -12087, -12917, -12814, -11823, -13048, -11615, -11458, -8462, -8873, -14073, -14413, -14763, -15942, -14476, -15371, -9750, -5258, -6461, -7460, -7135, -7458, -14946, -20919, -19245, -18998, -16221, -15481, -16032, -19189, -15727, -14821, -15787, -12631, -11681, -10400, -12231, -14493, -15525, -14163, -16967, -14043, -11270, -9161, -6640, -2313, 652, 5108, 8935, 7541, 5177, 1798, -2055, -3416, -7909, -7916, -10080, -11826, -18823, -14716, -16654, -15245, -13603, -14685, -14550, -14877, -17903, -17038, -11664, -9385, -12826, -13679, -9493, -8784, -13358, -14561, -10966, -12998, -19978, -18196, -16032, -15929, -16206, -12803, -6260, 1070, 7212, 9927, 13577, 24195, 37799, 48677, 50711, 45539, 37321, 26873, 12186, -946, -2168, 1310, 3551, -133, -6505, -5674, -2442, -65, -2214, -4958, -7126, -5747, -2016, 2286, 3480, -162, -2439]
14089b439K148K363K542K719L064l870n38l41l828p672J031j448K18%J023o333
14073a1361j994R17N091L455K152K830J703k527k929p35L734j862P7j633K64m626
14057g444j101P91L643L430L853P425j704M35K28p873p874n168n83q03K385L283
14041g077l3J614K005L263R369L355J183O375J775k579p729j0015q14j050k366
14026b724K794j702m272k778l930L960M882M432J078J526j980n438o307l893O2
14011a4290M057N797n127M74J93l233n503L752N298L060k22K650k789k757m439
13996a3079M891R650Q43p140m059J364K411O04R42j476k225j392j328q25l086
13981a3905J708J335K728M593Q58k044o279l101l079J137K797j226m135N73J263
$$ y = [-2439, -291, 2072, 4614, 7333, 10397, 6527, 5989, 5648, 1820, -5852, -4821, -6269, -6051, -6051, -5028, -11361, -13355, -12438, -7347, -3892, -1740, 1090, 2793, 266, -2663, -3398, 336, -1526, -1449, -3082, -2818, -7444, -8545, -7754, -4111, -681, 3172, 10597, 8893, 9328, 9556, 1683, -6191, -11359, -11942, -12745, -10360, -7077, -7110, -5496, -3491, -228, 9141, 12496, 13679, 20054, 21829, 19250, 11521, 1506, 692, -358, -2724, 70, -1632, -5904, -8682, -12612, -8652, -3770, 662, 1740, 3266, 1286, -4152, -10459, -14352, -14290, -10233, -4436, -9563, -9089, -8896, -12129, -17632, -13880, -8582, -5522, -5744, -3094, -5883, -8640, -13079, -8188, 1462, 2305, -4835, -8894, -7530, -5119, -4515, -3573, -5049, -7274, -8666, -9994, -10819, -13905, -12197, -10862, -8134, -3541, -2683, -4727, -11006, -14107, -17186, -16049, -13252, -14478, -18613, -18040, -16777]
13966a6777n766J385J895J39J31K613j42K604J831k022k472K062n538j655M372
13951a7340L321M116K60n711K351P180m19L28l990m247O12K511q4j08M040L979
13935c201l748j318N072L531J2634R876J1492O875N472N371L873o192j4706j4263
13921B0768k560l592m07k473j462n920l177l777j552O208Q8j0345m099J094J6
13906a1190O99K763p38j981n353L863J959L528N950J109K162N62n261J83L979
13891B234N398P53N470L131J1803J6216J7240K8563L7822M0099L1668j335k9109
13878A69953l1981l7956k8214k1012j6052j1115k995k109k289n181l548l214p58
13865C529k324J718Q72j0112m864J134K047R00l862j499k95L799L415J959j249
$$ y = [-16777, -22543, -21158, -19263, -19124, -18993, -16380, -16522, -13918, -12087, -14109, -16581, -14519, -20057, -21712, -17340, -14019, -9903, -9643, -15354, -13003, -5823, -6242, -5914, -9904, -14151, -13539, -11028, -11112, -11220, -7180, -3201, -6949, -8267, -3195, 336, 12970, 22846, 34338, 41213, 46685, 52056, 55929, 49737, 35031, 20768, 18208, 14616, 14209, 11736, 10274, 4354, 1177, -2600, -4152, 2056, 2144, -8201, -12300, -11206, -11190, -10491, -7728, -8466, -10447, -15800, -11937, -9978, -6450, -500, 609, 2771, 3333, -1928, -1745, 2234, 7632, 8385, 13855, 16986, 28789, 45005, 62245, 90808, 128630, 168729, 200397, 199062, 169953, 137972, 100016, 71802, 50790, 34738, 23623, 20628, 18519, 16230, 11049, 7501, 4287, 3529, 1205, 2923, 3795, -6317, -11181, -10047, -8000, -7100, -10962, -12461, -12756, -8957, -5542, -3583, -4832]
13850d832J014M921N333k421J042O371J0809N314O726J0712K2452K5459L1646
13837A24546L9324L6771N922l3501l9709l4170k8348j9579j4166j1119k687k703
13825B0581l490m622m996j966l449m308k0j606K389m18j335m02k647Q64K128j072
13809d369J206K248M79R14M050q80l271k473N5L520M263M157O88N834J1768P868
13793C6057O483Q983O347N298l939q668j7248j4231p275n043n522n155O70L232
13779a1l124K617N11J932M17K985MK15j137k22l479q14K154m02j227P378L357
13762A1154j469r04k821k674p78J328K760K695L91K68N381N406K25l965m48j579
13746A4970n336l354K316J288l962L831q3k085k484N58M259J497j658O54N264
$$ y = [-4832, -3818, 1103, 6436, 4015, 5057, 11428, 22237, 27551, 34277, 44989, 67441, 92900, 124546, 163870, 200641, 206563, 173062, 133353, 99183, 70835, 51256, 37090, 25971, 23284, 20581, 17091, 12469, 7473, 5507, 2058, -2250, -2270, -3876, -1487, -1905, -3240, -3642, -6289, -5425, -3297, -4369, -3163, -915, -436, 478, 4528, 3648, 377, -2096, -2041, 1479, 5742, 9899, 10587, 16421, 28189, 36057, 42540, 51523, 57870, 63168, 59229, 50561, 33313, 19082, 11807, 6764, 1242, -3913, -3243, -11, -3135, -518, -7, 1925, 2342, 5327, 5331, 5546, 4409, 4187, 708, -106, 2048, 1646, 419, 7797, 11154, 9685, 8781, 5960, 3286, 2508, 3836, 6596, 9291, 9682, 9950, 15331, 20737, 20962, 16997, 16549, 14970, 9634, 6280, 8596, 9884, 5922, 9753, 9670, 7585, 5101, 5659, 9918, 11415, 9757, 10411, 15675]
13731A5675N594L7L841P476l01j991j063m662R58L006M00j235k456J143k438m058
13715A9926l593J900M87J973K560k766K73P656Q490q80l974J624N865N055K271
13700D6867m603m499q689j464k019k483M881m271q117M055K873q28P44k484q2
13685A9881O699O145N662L507K267K57k194l698J469l373m507J809K755K835j77
13670C9337p83R46K523J441m451j982k430j586L987J30k35j871M31J1191J0123
13655E6771k232m170p671l625N332k048m830p33m00M121j227n265J760K046j471
13640C6358p31M065O589Q143P820J314P110M963M048L734K043J954M155M755R174
13625A05494R967J4198J4250K2813K6677M4336O4861J00233J31175J56499J81463
$$ y = [15675, 21269, 21306, 25147, 32623, 32322, 30331, 29268, 24606, 25564, 28570, 28970, 27735, 25279, 26422, 23984, 19926, 16333, 18233, 18720, 20693, 23253, 20487, 20760, 28416, 36906, 36026, 32052, 33676, 39541, 44596, 46867, 42264, 37765, 29076, 27612, 25593, 23110, 27991, 23720, 15603, 19658, 22531, 21703, 22447, 19963, 19881, 26580, 32725, 38387, 41894, 44161, 44418, 42224, 38526, 39995, 36622, 32115, 33924, 36679, 39514, 39337, 38554, 39500, 42023, 43464, 39013, 37031, 34601, 33015, 37002, 37132, 36897, 35026, 35457, 46648, 56771, 54539, 50369, 42698, 39073, 44405, 42357, 37527, 36794, 36394, 40515, 39288, 34023, 35783, 37829, 36358, 35627, 39692, 46281, 54424, 62244, 63558, 70668, 75631, 79679, 83413, 85456, 87410, 91565, 96320, 105494, 115461, 129659, 143909, 166722, 193399, 237735, 302596, 402829, 534004, 690503, 871966]
13614H71966K07293J97785J37598P1746J3990o0279j38853j90296j94972j75650
13604G40328j57515j35104j01981p3048n3723l6014k8495k0025j4974j1357q994
13593I9098j53Q838N382R85k290n656o657o913n072k104j716K807j423o981o029
13578G2116m698m761r6K252J3022J3152N885l145j394K972K986N216M161l507
13564A04161n588q555j3257j2575m893j184j301j357p78j66M16L61n494j004J83
13549D8969O139J1344J6909J5513J8671K6686J3098R35j193o492m536O36K017
13536A48696p70N012J8399K7647L2791K6954J5744r442k5220k1504j5416j7665
13524A85226j8581j2387j0778j1336m647j002l918l95K801o03o81L317K456J297
$$ y = [871966, 1079259, 1277044, 1414642, 1486388, 1500378, 1440099, 1301246, 1110950, 915978, 740328, 582813, 447709, 345728, 272680, 218957, 182943, 154448, 134423, 119449, 108092, 99098, 98945, 107783, 113165, 114150, 111860, 106204, 99547, 92634, 87562, 85458, 83742, 86549, 85126, 78145, 72116, 67418, 62657, 62561, 64813, 77835, 90987, 96872, 93727, 92333, 95305, 98291, 103507, 107668, 104161, 98573, 90018, 76761, 64186, 59293, 58109, 56808, 55451, 54673, 54507, 54923, 55284, 49790, 48786, 48969, 55108, 66452, 83361, 98874, 117545, 144231, 157329, 158264, 157071, 150579, 146043, 146679, 148696, 147926, 152938, 171337, 198984, 231775, 258729, 274473, 265031, 239811, 218307, 202891, 185226, 166645, 154258, 143480, 132144, 127497, 126495, 122577, 122182, 124983, 124380, 123699, 127016, 129472, 130769]
13510A30769l195n269k198K797l2L032J2850K0199J9175K5180L0493K7588K9673
13497B91062J7904J1845J6764K3840L8708M7760M5790N319l2167l2411j1896J3862
13485D36380K4479J9094J7495J7236J3386J0385J6849K7420L8205N6107Q2737
13474G59773J11071J47795J91345K36471L03759M11486N91383Q86087J344662
13465D983832J963578K562354K593199J436704n38433k038860k429152k060443
13457F472779j505105j043855p28280n02094l53900k55189j84218j33319p4497
13448A692322L780R0345J17331K861j36451j64878r9553k5054L0509M9048M0856
13437A601116L4093K8112J5340L0466O4968J12435J67929K24912L06622M09208
$$ y = [130769, 127574, 122305, 120107, 122904, 122872, 125904, 138754, 158953, 178128, 203308, 233801, 261389, 291062, 308966, 320811, 337575, 361415, 400123, 447883, 493673, 498992, 466825, 434414, 422518, 436380, 460859, 479953, 497448, 514684, 528070, 538455, 555304, 582724, 620929, 677036, 759773, 870844, 1018639, 1209984, 1446455, 1750214, 2161700, 2753083, 3639170, 4983832, 6947410, 9509764, 12102963, 13539667, 13001234, 10962374, 8533222, 6472779, 4967674, 3923819, 3195539, 2693445, 2339545, 2084356, 1900138, 1766819, 1692322, 1696102, 1786447, 1903778, 1906639, 1770188, 1605310, 1505757, 1480703, 1511212, 1560260, 1601116, 1635209, 1663321, 1678661, 1709127, 1774095, 1886530, 2054459, 2279371, 2585993, 2995201]
13427B995201N20090O67361Q54840J144482J632773K462558L835450N849198Q156953
13418B8118906R202319O165564r26146o964781q631667p214472n140429l488910
13410A1120384k365121j619821j129446q14330o33238n19401m05336k65947j19633
13401C248111k2644p4495j98911k47062j85893r6570k3135J7050K7419K6981Q279
13390B479130r648k47L8385Q7060J42521K06860K86148L88093N04747O40014Q30062
13379E593125J105439J576287K372247L670352N609925P948184R359603P012594
13371D4247756J13120o526655q857090p689738n564875l792993k567140j749249
13363G613136j206786q67167o70036n59666m78619l73530k61022j76077j43576
$$ y = [2995201, 3515291, 4182652, 5037492, 6181974, 7814747, 10277305, 14112755, 19961953, 28118906, 37321225, 43486789, 42560643, 35595862, 26964195, 19749723, 14609294, 11120384, 8755263, 7135442, 6005996, 5191666, 4558428, 4039027, 3633691, 3367744, 3248111, 3225467, 3150972, 2952061, 2704999, 2519106, 2422536, 2399401, 2416451, 2443870, 2470851, 2479130, 2469482, 2469235, 2507620, 2594680, 2737201, 2944061, 3230209, 3618302, 4123049, 4763063, 5593125, 6698564, 8274851, 10647098, 14317450, 19927375, 27875559, 37235162, 44247756, 44360876, 37834221, 28977131, 21287393, 15722518, 11929525, 9362385, 7613136, 6406350, 5539183, 4869147, 4309481, 3830862, 3457332, 3196310, 3020233, 2876657]
13354B876657j45251j43479j13835p4778l3716P515M0336N5181K7410k6399n5449
13343B414192m3323j3737J8605N0972Q6731J26385J68698K24443K92394L86896
13333C712256N42919Q04529J211259J788300K457748K824408K159021K82094j672021
13324A4110513k569303k425100j869578j320506r00632o00821l94909k59426j70956
13315C599282j23290r4179r8550j06587r2324o2085l2080j894K2804M9689P5468
13304C136254J16720J73995K19759J92824P5309n0806q8686n9305j9769J4968
13294C711263L6860N7123P8930Q1597Q4648R0969J04075J27281J59629J98284
13284D730659K48879K68292K26640J13291j1407q0340p8114n4928j2709K2576
$$ y = [2876657, 2731406, 2587927, 2474092, 2399314, 2365598, 2373113, 2413449, 2468630, 2496040, 2469641, 2414192, 2370869, 2357132, 2375737, 2426709, 2513440, 2639825, 2808523, 3032966, 3325360, 3712256, 4255175, 5059704, 6270963, 8059263, 10517011, 13341419, 15500440, 15782534, 14110513, 11541210, 9116110, 7246532, 5926026, 5025394, 4424573, 4029664, 3770238, 3599282, 3475992, 3381813, 3283263, 3176676, 3084352, 3022267, 2990187, 2988293, 3011097, 3060786, 3136254, 3252974, 3426969, 3646728, 3839552, 3914861, 3864055, 3775369, 3716064, 3696295, 3711263, 3748123, 3805246, 3884176, 3965773, 4050421, 4141390, 4245465, 4372746, 4532375, 4730659, 4979538, 5247830, 5474470, 5587761, 5576354, 5496014, 5417900, 5362972, 5350263, 5372839]
13274E372839N5328R0884J23059J54358J95983J96083J08165l4983j07598j00296
13264F053822n9241k2319n88K5163N7591R1406J37194J71062J63696P4128o6836
13253F625078j38589j26554q2853l6356l788K6287L8187L3040R327N129K6194
13242F375102Q1407J69828K89588M29016N31577M69852J23901l38359n93675n72471
13232F965766m25496k85427j87151j14624n3933j903M3746R1560J01321K7494
13222F161353r5156j76486j63780j23802p9180m7842k1958N803K4884M0642O2359
13211E586837P3887N5979J5482n807J2720L8924P7234J27681J76004J96545J41168
13200F496654N0128k382O159O3884J67642L01376M50907N67466N54975K73464
$$ y = [5372839, 5428167, 5519051, 5642110, 5796468, 5992451, 6188534, 6296699, 6261716, 6154118, 6053822, 5994581, 5972262, 5971674, 5996837, 6054428, 6145834, 6283028, 6454090, 6617786, 6691914, 6625078, 6486489, 6359935, 6277082, 6240726, 6236938, 6263225, 6301412, 6334452, 6343779, 6348908, 6375102, 6456509, 6626337, 6915925, 7344941, 7876518, 8346370, 8470271, 8131912, 7538237, 6965766, 6540270, 6254843, 6067692, 5953068, 5899135, 5897232, 5940978, 6032538, 6133859, 6161353, 6066197, 5889711, 5725931, 5602129, 5522949, 5475107, 5453149, 5458952, 5483836, 5524478, 5586837, 5660724, 5716703, 5732185, 5726378, 5739098, 5778022, 5855256, 5982937, 6158941, 6355486, 6496654, 6546782, 6544400, 6550559, 6614443, 6782085, 7083461, 7534368, 8101834, 8656809, 8930273]
13190H930273k02209n27924n47557m03091k56843j45473p9697l0176P030L2283
13180F776616M1261K9088j1372o2061q6521q7045o3889n6532m5573l6707l7046
13169F360219l7522l9442l9813l7430l7096m0318l4756l2697k9776J098L3645
13158F066112O7631P7069J8315r1290j65928j77496j45955r7688m8666K503N9523
13147E564130P8327P127j40063k60305k83020k37039j81695j42753j18024q7659
13137D199026n5483k1585k1872p4108j34559j69389j70758j48892j22739j05470
13127C174171r2502q9981p7861p2518p1602o9234o2174n6989n2059n3792m6657
13116B428802l3051k7503k4039j4437l015k2232n2320p2011p8018p0664n6165
$$ y = [8930273, 8728064, 8200140, 7652583, 7249492, 6992649, 6847176, 6767479, 6737303, 6744333, 6776616, 6817877, 6846965, 6835593, 6773532, 6687011, 6599966, 6536077, 6479545, 6433972, 6397265, 6360219, 6322697, 6283255, 6243442, 6206012, 6168916, 6128598, 6093842, 6061145, 6031369, 6032467, 6066112, 6133743, 6210812, 6229127, 6137837, 5971909, 5794413, 5648458, 5550770, 5502104, 5504607, 5564130, 5642457, 5649584, 5509521, 5249216, 4966196, 4729157, 4547462, 4404709, 4286685, 4199026, 4143543, 4121958, 4100086, 4025978, 3891419, 3722030, 3551272, 3402380, 3279641, 3174171, 3081669, 2991688, 2913827, 2841309, 2769707, 2700473, 2638299, 2581310, 2529251, 2475459, 2428802, 2395751, 2368248, 2344209, 2329772, 2326757, 2304525, 2252205, 2180194, 2102176, 2031512, 1975347]
13105A975347n8074n2557m7812m0933l2008k6337k5459k3337k2660j5226p671
13094A623273o632M185K7503M7422N4398Q730n6030j01164j03785q2180o7709
13083A348011n3691l9589k4796k4576k6196j9909j9292k2296j8085j5836j4645
13072A069100j4181j8199j8946j9621j5257j4014r113q681j0481q197o016j8964
13060I07430k0994j2924j4244j8349j3724l688p420j1156j3713j1604k966o45
13048G76003m465N406J1050J3804k83k2186l4275l5949k7959k4427k3271j6450
13036F16998j2073o773m237j118m588p279j836l492p078r713o343j2732j2783
13023E26953n432m157j0562q994n844n256o641l839n638j43p2m466j844m883l919
$$ y = [1975347, 1917273, 1864716, 1816904, 1775971, 1743963, 1717626, 1692167, 1668830, 1646170, 1630944, 1623273, 1616641, 1620826, 1648329, 1695751, 1750149, 1758879, 1702849, 1601685, 1497900, 1415720, 1348011, 1294320, 1254731, 1229935, 1205359, 1179163, 1159254, 1139962, 1117666, 1099581, 1083745, 1069100, 1054919, 1036720, 1017774, 998153, 982896, 968882, 959769, 951088, 940607, 932410, 926394, 907430, 886436, 873512, 859268, 840919, 827195, 823507, 816087, 804931, 791218, 779614, 776648, 776003, 771538, 776944, 787994, 801798, 801515, 779329, 745054, 709105, 681146, 656719, 633448, 616998, 604925, 598152, 593915, 592797, 588209, 580930, 579094, 575602, 568524, 558811, 552468, 539736, 526953, 521521, 517364, 506802, 497808, 491964, 486708, 480067, 476228, 470590, 470447, 470375, 465909, 464065, 459182, 455263]
13008D55263j612M52q849j3905o678K351K332M366o12n257m642o180k006O905
12994D21928N340P858J6123K0209L6889M8851L8843P297k9171n0194n1830l7224
12982D34919k5272j5921j1197l863l94p662n230k065K663J892m888m783j182n749
12968C51268k839j165l168l474n969j570Lj2J959L01o133r79L836N459o148l226
12952C28143K848N443J0999K0396K0036L0969L5857L2601J2678j7303l5146m5461
12940D02060l8244k3057j2048j3090j0036j5663r387l116n43l185n464O76k993
12927B65910o134j724K488M267M615m812p011m179l519l190P66m60k649j84N70
12912B44754J725P434L882J080l935L918Q311J2880J3091J9039L0029M0567L9530
$$ y = [455263, 453651, 454103, 445254, 431349, 424671, 427022, 429354, 433720, 433108, 427851, 423209, 417029, 415023, 421928, 427268, 435126, 451249, 471458, 508347, 557198, 596041, 603338, 574167, 523973, 472143, 434919, 409647, 393726, 382529, 378666, 378272, 370610, 365380, 363315, 365978, 367870, 362982, 358199, 357017, 351268, 348429, 347264, 344096, 340622, 334653, 333083, 333086, 333074, 335033, 335334, 329201, 328222, 332058, 337517, 331369, 328143, 330991, 336434, 347433, 367829, 387865, 418834, 454691, 487292, 499970, 482667, 447521, 402060, 363816, 340759, 328711, 315621, 305585, 289922, 280535, 277419, 276876, 273691, 268227, 268903, 265910, 259776, 258052, 260540, 264807, 269422, 264610, 257599, 253420, 249901, 246711, 247477, 247017, 244368, 244184, 244754, 246479, 253913, 257795, 258875, 254940, 258858, 267169, 280049, 293140, 312179, 342208, 382775, 422305]
12899D22305K1523j1546l4163m1344l9667k7102j9499j1402q308q59p406q657
12887B33875k6K473m608o542n695J382K356j572l95K853K857K94l748j940O11
12872B22175K411L01k880m072O77J998n725p109M012n70k657q99J1105N077o00
12857B23244R245J1548J3827J0015l639j2174j5247j6177j1012q229l564m874
12845A92963q186m550l742m676j631l876j597P066L48K29k882o096l965K54N518
12830A65177L897j422k530J302J867K292k231m089m650k325Ml286l369K862K597
12815A56096L396n710o118K519K595P39R75j721K212K628j054l804N36o142l041
12800A44106P591M811k407m910l485L184k960l947L036l53l127k62K137j644o682
$$ y = [422305, 443828, 432282, 398119, 356775, 317108, 290006, 270507, 259105, 250797, 249938, 242532, 233875, 233849, 236322, 231714, 225172, 219477, 220859, 223215, 221643, 221248, 224101, 226958, 227252, 223504, 221564, 222175, 224586, 224887, 222007, 217935, 218612, 220610, 214885, 207776, 211788, 211218, 208561, 207662, 218767, 223844, 223244, 232489, 244037, 257864, 267879, 264240, 252066, 236819, 220642, 209630, 201401, 197837, 192963, 184777, 180227, 176485, 171809, 170178, 166302, 164705, 171771, 172119, 172348, 169466, 163370, 159405, 159659, 165177, 169074, 167652, 165122, 166424, 168291, 170583, 168352, 164263, 159613, 157288, 157292, 154006, 150637, 153499, 156096, 159492, 153782, 147664, 150183, 152778, 153517, 154492, 152771, 154983, 157611, 156557, 152753, 153289, 147147, 144106, 151697, 156508, 154101, 149191, 145706, 148890, 145930, 141983, 145019, 144666, 141539, 141277, 143414, 141770, 135088]
12785A35088j344R312J3954K512r212j1165J04R509N565J600J049n813q096o691
12771A36372o608q04K877Q334R26p231k390O953O850L65K245k687n42L2J331K727
12755A48750k876J558j4M947J0108J0123R336J112j2544j3568j3246j0594o083
12742A27009M81M199P0l336k045K782N451M584K329N235L050j254K747q97j080
12727A49325k772j982n266j124k511J017K13P016N206r336o676J966J31j102j198
12712A32907j872L365j803n95m72o181o259n846m633J495k55K563L957m004l37
12697A12030n90j303J3J308o307l251N452K455M663M564J41k127k008j379j199
12682A12462k871o740l523l748k501K90k451P16j185j497K74J636M906M382N315
$$ y = [135088, 133744, 143056, 157010, 159522, 150310, 139145, 139249, 148758, 154323, 155923, 156972, 151159, 143063, 136372, 129764, 128960, 131837, 140171, 141097, 133866, 131476, 138429, 145279, 145644, 147889, 145202, 144660, 144692, 146023, 148750, 145874, 147432, 147418, 152365, 162473, 172596, 181932, 183044, 170500, 156932, 143686, 133092, 127009, 127490, 131689, 131759, 128423, 126378, 129160, 134611, 139195, 141524, 146759, 149809, 148555, 151302, 150405, 149325, 146553, 144571, 139305, 138181, 135670, 136687, 136900, 143916, 149122, 139786, 133110, 135076, 135207, 134105, 132907, 131035, 134400, 132597, 132002, 131530, 125349, 119090, 113244, 108611, 110106, 109851, 112414, 116371, 112367, 112030, 111440, 110137, 110150, 111458, 105151, 101900, 107352, 109807, 114470, 119034, 119175, 117048, 115040, 113661, 112462, 109591, 102851, 99328, 95580, 93079, 93369, 90918, 91634, 90449, 88952, 89226, 90862, 95768, 100150, 105465]
12667A05465K615N852J1971O793K669K690m517j6367j1368j0911n138k64L106
12654I2596R20K793n716o898L531J818K826O131M280L438J001m781m366p329k836
12639H7408n015o084n152K698K289m283l116L370J911m402m930K006L648N663
12625G6011L556k791R61J44k272l17n4K297m402m947j511N621K910m590j770m922
12609F3924J322k01J768n6q338k508J879P8L477l863K091O562J825L233r105l408
12593E8680k068K558M633k855j0648M597M911j902r65O48M791L940p12o36m160
12578F0812J283K297o13N565O760l038k588l918J782o11j639n502l058r67M794
12563F1359O929m943o054m532PP45o747l221J070K242N252M366k581o388l385
$$ y = [105465, 108080, 113932, 125903, 132696, 135365, 138055, 133538, 117171, 105803, 94892, 89754, 89490, 92596, 93516, 96309, 90593, 83695, 87226, 89044, 91870, 98001, 102281, 105719, 106720, 101939, 97573, 90244, 87408, 82393, 76309, 71157, 73855, 76144, 71861, 68745, 72115, 74026, 69624, 64694, 66700, 70348, 76011, 79567, 76776, 77737, 77881, 75609, 75292, 75238, 77535, 73133, 68186, 66675, 72296, 75206, 70616, 68846, 63924, 65246, 65045, 66813, 66757, 58419, 55911, 57790, 57868, 61345, 57482, 59573, 66135, 67960, 71193, 62088, 58680, 56612, 59170, 63803, 60948, 50300, 54897, 59808, 57906, 56941, 57589, 62380, 66320, 65608, 64972, 60812, 62095, 64392, 63779, 69344, 76104, 73066, 70478, 66560, 68342, 67731, 66092, 60590, 57532, 56565, 61359, 68288, 63345, 57291, 52759, 52766, 53511, 46764, 43543, 44613, 46855, 52107, 56473, 53892, 47504, 44119]
12548D4119N472K865k65K455q6k004l85J230M687l854m79K840K290M345J157m386
12532F0001J299j77l122J584K011Q959N878j758k320l286j140P31N135j007j484
12517G1304p843m464K92N77q30j393K083K429L66p19j177M361L112l686j350K62
12501F3324n79J841K112K812j026P4M238m178j307K096r93m608L265M778L41K36
12485G2426L217O355O456R044p77j6123q632l532j02J49m254j507K616k162m210
12470E8964J395K809L723K158l482L33K96j031Q6L532K892k134j6j292o49k804
12454F4780k987O85k209O61l048J819M183p94J735O747O405L045L707K487R985
12439I7201J3308P749L252P356J0952J0586J2464J6635J3677p62q014j1041j1719
$$ y = [44119, 49591, 52456, 52191, 54646, 54560, 52556, 52171, 53401, 58088, 54234, 53755, 56595, 58885, 63230, 64387, 60001, 61300, 61123, 58001, 59585, 61596, 70555, 76433, 74675, 72355, 69069, 67929, 68660, 73795, 72788, 71304, 63461, 58997, 59289, 59866, 59036, 57643, 59726, 62155, 62521, 61802, 60625, 64986, 68098, 64412, 63062, 63324, 62745, 64586, 66698, 69510, 68484, 68558, 72796, 68618, 67311, 69407, 68414, 63806, 67071, 71849, 72190, 72426, 75643, 81998, 88454, 97498, 96721, 80598, 71966, 68434, 68332, 68481, 64227, 62720, 65336, 63174, 58964, 60359, 63168, 66891, 69049, 65567, 65900, 66196, 65165, 65251, 68783, 71675, 69541, 69525, 68233, 67584, 64780, 61793, 62478, 60269, 60930, 57882, 59701, 63884, 63090, 64825, 71572, 77977, 81022, 84729, 87216, 97201, 110509, 118258, 121510, 128866, 139818, 150404, 162868, 179503, 193180, 192418, 184404, 173363, 161644]
12426A61644j8425r584j0477q715m727p954q655j590J118P149P280Q91J488l70
12412A09073N998R501R574J1608J0909J1430P381L236q375j0835q678q899p548
12399A34375l683r456q158n442j873j086P821J0696R016N687Q920J1021M793n64
12385A62067M035m028m261j0016p768j1159j5730o178n394m104m366q12O360M617
12371A03263j547m603N102J1150R428J4176J2535O975L794J633N057Q018L048
12358A78029o37l805q002j0807j5826r674l098M457J0346Q104N253J4171J5793
12345A84304J0686R409N603j244j936k324j4191j9206j5748j2802r179r094p310
12332A16968k555J706m491kK701O212N400Q264N742Q393J4727J9459J2623O934
$$ y = [161644, 143219, 133635, 123158, 114443, 109716, 101762, 93107, 91517, 92635, 99784, 107064, 107955, 109443, 109073, 115071, 124572, 134146, 145754, 156663, 168093, 175474, 178710, 170335, 159500, 150822, 141923, 134375, 130692, 121236, 113078, 107636, 105763, 104677, 112498, 123194, 132210, 137897, 146817, 157838, 162631, 162067, 166102, 162074, 157813, 147797, 140029, 128870, 113140, 106962, 101568, 97464, 93098, 92286, 98646, 103263, 101716, 97113, 102215, 113365, 122793, 136969, 149504, 156479, 160273, 161906, 166963, 174981, 178029, 177392, 173587, 165585, 154778, 138952, 129278, 126180, 130637, 140983, 149087, 154340, 168511, 184304, 194990, 204399, 210002, 208758, 206822, 204498, 190307, 171101, 155353, 142551, 133372, 124278, 116968, 114413, 116119, 111628, 111626, 114327, 120539, 125939, 134203, 139945, 148338, 163065, 182524, 195147, 202081]
12318B02081R746O716p06p698q374p680l514l609m285k258o574o477j946O019
12304A71441Q351J1453J0600J4128Q807O965P679k191K007J655N23p05j6686k4241
12290A99786k6249j8889j2791q393j0357q620K755O386j451J0111J1323R392J9355
12277A72358J6787J3341R076P793N267k009r588j3160j0525o084j0598p641j598
12264A63419J984o190q935j0636r514j1399r45O851J9595K0541K5525M4590O3632
12251B98518P6792P1932M6296J959m7030o1602m7696k8329n17K4626K7143J7621
12239C79713M041q143j9127k7478m2924m8121m0030l0347k2482j5747r439n735
12227A14181j3963k998L040P538N319N903Q678J4234J0377K039n012K484K018
$$ y = [202081, 211827, 218543, 217837, 210139, 201765, 194085, 190571, 186962, 182677, 180419, 173845, 167368, 165422, 171441, 179792, 191245, 201845, 215973, 224780, 231745, 239424, 237233, 239240, 240895, 241418, 240713, 224027, 199786, 173537, 154648, 141857, 133464, 123107, 114487, 117242, 123628, 122177, 132288, 143611, 153003, 172358, 189145, 202486, 211562, 219355, 224622, 222613, 213025, 199865, 189340, 183256, 172658, 165017, 163419, 165403, 159213, 150278, 139642, 130128, 118729, 117784, 124635, 144230, 164771, 190296, 234886, 298518, 375310, 447242, 493538, 495497, 448467, 386865, 339169, 310840, 310323, 334949, 362092, 379713, 383754, 375611, 356484, 329006, 286082, 237961, 197931, 167584, 145102, 129355, 119916, 114181, 100218, 97220, 100260, 107798, 113117, 119020, 127698, 141932, 152309, 154348, 149336, 151820, 153838]
12214A53838R202J4207J8453L9959N4719Q2093J26952J68263J88123J32479K2398
12203A010686p1589j14292j02412m9466R797P6696J20434R8538K4903l8376m6531
12192I18388l1095o4227j18573j35463j22848r2875o3342m4841l0128k0013j1078
12181A83905j6354j0780m834m335j887J79K483k585k153j400K468J0922J2328
12168A67957J9650K5562L3733N2639P7732J17400J61061J59016R5427j7001q9285
12157H03891r1174n7248n173N8516J09165J22045N7961k4447o1352l8962j0438
12146H62784m1458r7395j23067j05291p1824l8922j1859l426j3059k9245l9776
12135B87462m8025l7611k1374j6064j2857j0454l244p313o562l100n00O78K041
$$ y = [153838, 163040, 177247, 195700, 235659, 290378, 372471, 499423, 667686, 855809, 988288, 1010686, 939097, 824805, 722393, 672927, 682724, 759420, 879854, 978392, 1003295, 964919, 918388, 887293, 823066, 704493, 569030, 446182, 353307, 289965, 245124, 214996, 194983, 183905, 167551, 156771, 151937, 147602, 145715, 145894, 148377, 145792, 143639, 142239, 144707, 155629, 167957, 187607, 213169, 246902, 299541, 377273, 494673, 655734, 814750, 910177, 893176, 803891, 712717, 655469, 650296, 708812, 817977, 940022, 997983, 973536, 912184, 873222, 862784, 821326, 723931, 600864, 495573, 423749, 384827, 372968, 369542, 356483, 327238, 287462, 239437, 201826, 180452, 164388, 151531, 141077, 137833, 130520, 123958, 120858, 120358, 121036, 123077]
12122A23077P197J2444J8905K6112L2970M4915M5581K4971q190k5656k8945q594
12110B64787J5273L2524L9453K2719j74j8259j2854K419Q957J659q916j243K3003
12097C69348N2885P7839Q3489M7318k1517q4882j03415r4115o7111m4914k6084
12086A88841j7520p952J376L430o249m617q073j0413j6193j4332r730m169l292
12073I1107k536k196j886J841L83n949r00M516J605l05L235L957O415J0057N083
12058A14427J0314J6172K0686L3147N2964P3512R6238J06682P7316J2674n5230
12047E58902q5157q2719n8457l0593p898O516J9051L2282M1577L6428Q480j1986
12035D26426k4267j2857R276L3232P0134J39277K39367L77029N34563O76194P70080
$$ y = [123077, 130274, 142718, 161623, 187735, 220705, 265620, 311201, 336172, 327982, 302326, 273381, 264787, 280060, 312584, 352037, 374756, 374582, 356323, 343469, 345888, 354845, 356504, 347588, 346345, 369348, 422233, 500072, 583561, 630879, 609362, 524480, 421065, 326950, 259839, 214925, 188841, 171321, 163369, 164745, 168175, 161926, 157309, 149236, 138823, 122630, 108298, 98568, 94399, 91107, 88571, 86375, 84489, 86330, 86713, 80764, 79864, 84380, 85985, 85680, 88915, 92872, 99287, 109344, 114427, 124741, 140913, 161599, 194746, 247710, 321222, 417460, 524142, 601458, 614132, 558902, 473745, 391026, 332569, 301976, 294078, 300594, 319645, 351927, 393504, 429932, 438412, 426426, 402159, 389302, 398578, 431810, 501944, 641221, 880588, 1257617, 1792180, 2468374, 3238454]
12024C238454P93691O14313L07236J0071l32877o36688p60538p44183o56269n16257
12014A316953l60109k35461j51821r6072o2655l3530q166N393Q462o542k5105
12003C51347k9117k4113k2529j3631n012k212M952J6169K8500L0581J1293j7368
11991C28860m4801n3671m6352l0926k4136j6053o426o474q653n649m809k997q57
11978G7056k541k327q56L51P71K910K325m969m203j741l75j856M629K517M99j793
11962G0397m178m124J317N557K691n147K316N686K363P507J4244J6046J5359J1023
11948A41057J285m433j2090j6385j0978q437m449k759o251j403N056K360l44j432
11934H0797K209L462Q743J0845J7002J4059J7990K3467K7985L0807K0749N885
$$ y = [3238454, 4032145, 4646458, 4953694, 4963765, 4630888, 3994200, 3233662, 2489479, 1833210, 1316953, 956844, 721383, 569562, 473490, 410835, 377305, 369139, 374532, 382994, 376452, 351347, 322230, 298117, 275588, 261957, 256945, 254733, 259685, 275854, 304354, 334935, 346228, 328860, 284059, 230388, 184036, 153110, 128974, 112921, 106495, 100021, 91368, 85719, 80910, 77913, 77056, 74515, 72188, 71332, 71683, 72454, 75364, 77689, 72720, 68517, 66776, 66401, 64545, 69174, 71691, 72190, 70397, 66219, 62095, 63412, 68969, 71660, 66513, 68829, 74515, 76878, 84385, 98629, 114675, 130034, 141057, 142342, 137909, 125819, 109434, 98456, 90019, 85570, 82811, 76560, 75157, 80213, 82573, 82229, 80797, 83006, 86468, 95211, 106056, 123058, 137117, 155107, 178574, 206559, 237366, 258115, 264000]
11922B64000l350j3131k2309k7415k3635j5310j7020j4520r882m865m678o909
11910A00976l052K350P247J649L756J5707K0770K4575L2653K8819K1694J2886
11898B70030N641q078j7942k4798k9734k2293j3613j4509j3348q017p79m798j882
11885A15880O672Q140Q145J9999K0162K2483K3687K3096K0265J1267M14m146m531
11872B71533j8465k6183k6814k7358j7844j2318r236r795k273j487L451P309Q994
11859A39514N052J6049K1033K3370J7175K0139K3816K5532J5870K329o671j3986
11847B89222k0637k1509k0860k0693j5324r379J281L210O775N676O897P888L021
11834B15568o886q285j7786j5413j5284r608q398m226m259R7m5k97R47j317L71
$$ y = [264000, 260650, 247519, 225210, 197795, 174160, 158850, 141830, 127310, 117428, 112563, 107885, 100976, 97924, 100274, 107521, 109170, 112926, 128633, 149403, 173978, 206631, 235450, 257144, 270030, 275671, 267593, 249651, 224853, 195119, 172826, 159213, 144704, 131356, 123339, 122560, 117762, 115880, 122552, 130692, 138837, 158836, 178998, 201481, 225168, 248264, 268529, 279796, 280210, 276064, 271533, 253068, 226885, 200071, 172713, 154869, 142551, 133315, 123520, 121247, 119760, 123211, 130520, 139514, 144566, 160615, 181648, 205018, 222193, 242332, 266148, 291680, 307550, 309879, 303208, 289222, 268585, 247076, 226216, 205523, 190199, 180820, 182101, 185311, 192086, 197762, 204659, 212547, 215568, 208682, 200397, 182611, 167198, 151914, 142306, 133908, 129682, 125423, 125520, 125475, 125178, 126125, 124808, 125179]
11819A25179O259j052N610J9989J8444J4266J2844R136L498l302j2554j7268j7877
11806A63172j7680r365r127o857o730l715r20k28p20N615M394J303M910Q134J5187
11791A47373J9557K0494J6598J0965N621M5j3787k3114j2275j7533j0449r218
11779A34277p186l12O569N381J395K111O101N957L324O882J709J1393J8711J1432
11765B07744Q446J1639N620n092j8396j8002k2589j8212r903m129k826k776j032
11752A30492K947L77M103O685R885O616L789k947j1834j4995j2152p723m971o100
11738A04172n734o752m784n996n770q47J54O046M127j249Q362R748M684L042L944
11723A13147N536J533l084n594m874o368m208j391k821m983l968l965j32N860
$$ y = [125179, 131438, 130386, 135996, 155985, 174429, 188695, 201539, 210675, 214173, 210871, 198317, 181049, 163172, 145492, 136127, 127000, 120143, 113413, 109698, 108778, 108550, 107830, 113445, 117839, 119142, 124052, 132186, 147373, 166930, 187424, 204022, 214987, 220608, 220653, 206866, 183752, 171477, 153944, 143495, 134277, 127091, 126779, 133348, 138729, 140124, 142235, 148336, 154293, 157617, 164499, 166208, 177601, 196312, 207744, 216190, 227829, 233449, 228357, 209961, 191959, 169370, 151158, 141255, 137126, 134300, 131524, 130492, 133439, 133816, 137919, 144604, 154489, 161105, 164894, 161947, 150113, 135118, 122966, 115243, 110272, 104172, 98438, 91686, 86902, 80906, 75136, 74289, 74443, 80489, 84616, 83367, 91729, 101477, 106161, 109203, 113147, 118683, 120216, 117132, 111538, 106664, 100296, 96088, 94697, 91876, 86893, 82925, 78960, 78828, 84688]
11709H4688J180Q09K710M274L825L919P349J3841J3096J3726P590M800L17J330
11695A63454q804j1230n463o848r681j3629n995q36K725K428k173N043P192R210
11681A25393P240J1590J8126K1571J8758K0137J6676R607N271k348j8389k7205
11669B06427k2552j7731j1563j5576j0485j0303r544m267k604K223J517O234o68
11656A11108J052P568J4396Q140Q755J2271R158L026m746o586q857j3911j4036
11643A27338o803m730q656k214J787n003n867n13m131O198J401k347j419O475
11629A01516J3185J1580P300M507R3j3L527k135m558l628o231j548k043k477m1
11614A19034l437L587L304N584J0156J2981J0445N514J0110J3817J4826J7282
$$ y = [84688, 85868, 86677, 89387, 93661, 97486, 101405, 108754, 122595, 135691, 149417, 157007, 161807, 162124, 163454, 154650, 143420, 137957, 131109, 121428, 107799, 101804, 100968, 103693, 106121, 103948, 108991, 116183, 125393, 132633, 144223, 162349, 183920, 202678, 222815, 239491, 249098, 254369, 252021, 233632, 206427, 183875, 166144, 154581, 139005, 128520, 118217, 108673, 104406, 101802, 104025, 105542, 111776, 111108, 112160, 119728, 134124, 142264, 151019, 163290, 172448, 175474, 170728, 164142, 155285, 141374, 127338, 120535, 115805, 107149, 104935, 106722, 101719, 95852, 95339, 91208, 97406, 98807, 96460, 95041, 101516, 114701, 126281, 133581, 138088, 138181, 138168, 141695, 139560, 135002, 131374, 125143, 123595, 121552, 119075, 119034, 115597, 119184, 122488, 128072, 138228, 151209, 161654, 167168, 177278, 191095, 205921, 223203]
11602B23203J0063L764j224k401k652m480p548r572k203j859l953r832j1819n635
11588A73852n023q83K175j306P78M05O517M183J692M569Q919J0881J3665R486
11574B29910M195M158P841R360O437Q363N539j262n017j672m119n446o774P44
11560B52257M881J0487J5086J6049K1619K3297L0879L9266M9023O6460Q6108J06115
11548G21527J31760J62413J87763K13705K18269K02998J65278R0686P701p6985
11538B025115j27038j53324j62503j55118j30784r2120n9312k9131M164K8178
11528A148127O0214J01339J38282J90768K51263L18529L86597M43406M61214M23467
11518C923206L10493J38879o1902k45789l79361m43440m40952l93514l25816k57699
$$ y = [223203, 233266, 237030, 235806, 233405, 230753, 226273, 218725, 209153, 206950, 205091, 201138, 191306, 179487, 173852, 168829, 167946, 170121, 168815, 169593, 169998, 176515, 180698, 182390, 186959, 195878, 206759, 220424, 229910, 234105, 238263, 246104, 255464, 261901, 270264, 275803, 274541, 269524, 267852, 263733, 258287, 251513, 252257, 257138, 267625, 282711, 298760, 320379, 343676, 374555, 413821, 462844, 529304, 615412, 721527, 853287, 1015700, 1203463, 1417168, 1635437, 1838435, 2003713, 2094399, 2102100, 2025115, 1898077, 1744753, 1582250, 1427132, 1296348, 1204228, 1144916, 1115785, 1119949, 1148127, 1208341, 1309680, 1447962, 1638730, 1889993, 2208522, 2595119, 3038525, 3499739, 3923206, 4233699, 4372578, 4310676, 4064887, 3685526, 3242086, 2801134, 2407620, 2081804, 1824105]
11508A824105j92332j44566j00802n6086k5102J2506M8177Q4983J25588J60785
11498A737256J94781K26209K32122K06161J39463L3550q3262j77741k43322k65697
11488A999520k57335k23319j73785j23087q2581m7028k0761K351K1285N0911Q1105
11477A227276J14784J54133K02406K70843L45839M21645M92453N31005N02138
11468D262522L82134J89669l4433k36559l79533m40602m33920l77874k96497k12146
11458B422761j40008o9537n803N3953J23410K03400K93876L98899N29101O87821
11448D497873Q58609R99047J050107R58731O87428K67488k09341o30469r06376
11439G573097j014450r72564q54626p07197n51055m14926l02205k02040j31560
$$ y = [1824105, 1631773, 1487207, 1386405, 1330319, 1305217, 1317723, 1365900, 1450883, 1576471, 1737256, 1932037, 2158246, 2390368, 2596529, 2735992, 2769542, 2686280, 2508539, 2265217, 1999520, 1742185, 1518866, 1345081, 1221994, 1139413, 1092385, 1071624, 1073975, 1095260, 1146171, 1227276, 1342060, 1496193, 1698599, 1969442, 2315281, 2736926, 3229379, 3760384, 4262522, 4644656, 4834325, 4799892, 4563333, 4183800, 3743198, 3309278, 2931404, 2634907, 2422761, 2282753, 2213216, 2207413, 2261366, 2384776, 2588176, 2882052, 3280951, 3810052, 4497873, 5356482, 6355529, 7405636, 8364367, 9051795, 9319283, 9109942, 8479473, 7573097, 6558647, 5586083, 4731457, 4024260, 3473205, 3058279, 2756074, 2554034, 2422474]
11430B422474n9911J2260Q0628J48353K15760K91137L72463M33097M39416L84503
11420D740180K48223N2917j71325l58170m83066n29361n09062m47535l66238k97889
11410A878674k31108j72111j27361r2561n7050l2519q286J8151M8172P3249J12673
11399A409923J71825K30528K84864L09784K89240K12857Q9542n3913j76981k55238
11389B512431k87900k71755k29274j76030j24134p6162l6721p954L0297O7944
11379A400742J05415J52441K18940K94809L81177M65866N43787N61053N01743
11370D625973L43476J07803j48611l62837n03972n53620n20978m53401l73001
11361B160832k91878k14230j54809j07078o5277l0502K754L9065P0538J12587
$$ y = [2422474, 2362563, 2374823, 2455451, 2603804, 2819564, 3110701, 3483164, 3916261, 4355677, 4740180, 4988403, 5041320, 4869995, 4511825, 4028759, 3499398, 2990336, 2542801, 2176563, 1878674, 1647566, 1475455, 1348094, 1255533, 1198483, 1165964, 1157678, 1175829, 1224001, 1297250, 1409923, 1581748, 1812276, 2097140, 2406924, 2696164, 2909021, 2998563, 2944650, 2767669, 2512431, 2224531, 1952776, 1723502, 1547472, 1423338, 1347176, 1310455, 1302501, 1332798, 1400742, 1506157, 1658598, 1877538, 2172347, 2553524, 3019390, 3563177, 4124230, 4625973, 4969449, 5077252, 4928641, 4565804, 4061832, 3508212, 2987234, 2533833, 2160832, 1868954, 1654724, 1499915, 1392837, 1327560, 1297058, 1299812, 1338877, 1409415, 1522002]
11351A522002J57919J90313K10791K13016J71071R7092k150j10302j89693k42583
11341B017476k60546k43957k22898j89069j49978j17780r6312q1319p3987m9150
11331E32480l7606l2372k8697k3424k1407j6639j6517j1085j2865j2486j6420
11320C02962j4067j1094o586q499l803j48p95m167p378p164n124n37o33M97J67
11305B33631J518P843P053o661j1143o683J998K818K345J031P158L059k135l896
11291B37936K253K507L893O125M187M078R433N103p0l281K566O58K418P853N350
11276B91009M425J0293J5291O104K062k112J529R497Q131P586N914Q811J4075
11263C82615Q715J0890J1183Q816R518J0284Q194J1100Q978J3184J7063J0543
$$ y = [1522002, 1679921, 1870234, 2081025, 2294041, 2465112, 2562204, 2560054, 2449752, 2260059, 2017476, 1756930, 1512973, 1290075, 1101006, 951028, 833248, 736936, 655617, 581630, 532480, 494874, 462502, 433805, 410381, 388974, 372335, 355818, 344733, 331868, 319382, 302962, 288895, 277801, 271215, 262716, 258913, 258765, 257970, 253803, 246425, 239261, 234137, 233600, 232967, 233464, 233631, 235149, 242992, 250045, 243384, 232241, 225558, 227556, 230374, 232719, 233750, 240908, 243967, 241832, 237936, 240189, 242696, 246589, 252714, 256901, 260979, 270412, 275515, 275445, 272164, 274730, 275388, 277806, 285659, 291009, 295434, 305727, 321018, 327122, 329184, 327072, 328601, 338098, 346229, 353815, 359729, 368540, 382615, 391330, 402220, 413403, 422219, 431737, 442021, 450215, 461315, 470293, 483477, 500540, 511083]
11251E11083O557N899J1774J9374J4303K4910K4596J8013K1150K7127L2474M4713
11239G61973P3182J02898J51281K09707K26999J24784m9579j77318j96242j54709
11229A072976j01514o2362m2046k4670j6951m009L627K59k823K968P606J1107
11217H44168J5946J8554J7559J5496K0422K0404K1201K5631K8074J8779K5607
11206A071841L7436L9884M1308M2462M6138M8057M9127N5719N8040O9110P1942
11195A631064P4539Q1333Q7340R5003R9720J12697J19594J20428J29539J38489
11185B689746J41918J44935J50132J61930J61979J66242J63649J63715J57277
11176D101523J57005J54278J44182J26812J08616J01167R4622P6401O3113N6940
$$ y = [511083, 517640, 523539, 535313, 554687, 568990, 593900, 618496, 636509, 657659, 684786, 717260, 761973, 835155, 938053, 1089334, 1299041, 1526040, 1650824, 1601245, 1423927, 1227685, 1072976, 971462, 909100, 867054, 842384, 825433, 821424, 825051, 825310, 822487, 825455, 833061, 844168, 860114, 878668, 896227, 911723, 932145, 952549, 973750, 999381, 1027455, 1046234, 1071841, 1109277, 1149161, 1190469, 1232931, 1279069, 1327126, 1376253, 1431972, 1490012, 1559122, 1631064, 1705603, 1786936, 1874276, 1969279, 2068999, 2181696, 2301290, 2421718, 2551257, 2689746, 2831664, 2976599, 3126731, 3288661, 3450640, 3616882, 3780531, 3944246, 4101523, 4258528, 4412806, 4556988, 4683800, 4792416, 4893583, 4988205, 5064606, 5127719, 5184659]
11166E184659M9069M6009L9954L5902K9617K1327J6207M481j2208k9167m3884
11155E341966n4883p5350r5286j00878j12705j30353j36283j41279j35981j36572
11145D222396j38033j38179j26813j14786j08735r8901q6370q2387p9820p1084
11135C177288o4301n8205n2220l8337l1814k4515j0375n957k908M231J6291J9063
11123B928241L4580M0181N0584O6132O9697P8687R2745J02684J21166J31772J39944
11112C856413J57596J70077J82283J87460K00972K23232K32028K36401K45705
11103E692167K53974K57052K63916K65022K65576K60169K50804K42122K35962
11094G986764K22259K11010J97644J77970J61667J51046J40916J08567P1511N9056
$$ y = [5184659, 5233728, 5279737, 5319691, 5355593, 5385210, 5406537, 5422744, 5427225, 5415017, 5385850, 5341966, 5287083, 5211733, 5116447, 5015569, 4902864, 4772511, 4636228, 4494949, 4358968, 4222396, 4084363, 3946184, 3819371, 3704585, 3595850, 3496949, 3410579, 3328192, 3248372, 3177288, 3112987, 3054782, 3002562, 2964225, 2932411, 2907896, 2897521, 2891564, 2888656, 2892887, 2909178, 2928241, 2962821, 3003002, 3053586, 3119718, 3189415, 3268102, 3360847, 3463531, 3584697, 3716469, 3856413, 4014009, 4184086, 4366369, 4553829, 4754801, 4978033, 5210061, 5446462, 5692167, 5946141, 6203193, 6467109, 6732131, 6997707, 7257876, 7508680, 7750802, 7986764, 8209023, 8420033, 8617677, 8795647, 8957314, 9108360, 9249276, 9357843, 9429354, 9488410]
11084I488410N1803L9278J5241p099k1171n0548q8928j22943j37718j46321j64450
11073H855554j85367k02939k14872k28673k36457k44742k46686k52372k58610
11064F784836k62710k53765k41962k38765k40036k35247k25714k09846j90214
11055D686577j82866j73926j66257j62268j52174j34803j29952j23322j09541
11046C351468r1964p4038p1794o5526n1207m0213j9446j2777j0503k974P093J2752
11034B930871J6122K0569K4908L4454L4159M6135N7697N8217O0813P5433Q6353
11023C445731R3123J04615J21240J23942J28959J30265J32175J36724J34317J28885
11013D679976J18689J12372J07683J01164Q5414O5561M5303L0300K4947K0133
$$ y = [9488410, 9540213, 9579491, 9594732, 9587633, 9566462, 9515914, 9426986, 9304043, 9166325, 9020004, 8855554, 8670187, 8467248, 8252376, 8023703, 7787246, 7542504, 7295818, 7043446, 6784836, 6522126, 6268361, 6026399, 5787634, 5547598, 5312351, 5086637, 4876791, 4686577, 4503711, 4329785, 4163528, 4001260, 3849086, 3714283, 3584331, 3461009, 3351468, 3259504, 3185466, 3113672, 3048146, 2996939, 2956726, 2937280, 2924503, 2914000, 2911026, 2918119, 2930871, 2946993, 2967562, 2992470, 3026924, 3061083, 3107218, 3164915, 3223132, 3283945, 3359378, 3445731, 3538854, 3643469, 3764709, 3888651, 4017610, 4147875, 4280050, 4416774, 4551091, 4679976, 4798665, 4911037, 5018720, 5119884, 5205298, 5270859, 5316162, 5346462, 5371409, 5391542]
11003E391542k105l1841n0462o1909p1505o8217o5993o2693o2520o8766q9687
10992D755844j06220j07503j17038j26261j32699j38255j28873j15685r9781j08531
10982C574998j28263j50969j60180j60475j58982j49603j38010j26650j15283
10973B286583j08033j06493j06071j00598r0432q1218p3000o2998n2972n6209
10963A448559n7564m3566k9435j3920J248J2902L3647N1836M1554M649m1838o2599
10951A345473o2674o3261o3341o2342n5149m3231l1023k7844k2908j8112j2652
10940H82936q767r753j3302j6459j4285j2056j2899j6234j4548r052p767j1638
10928G36176q979j3637j4272j9351j5726r982j7025j4326j3718j0502j375p025
$$ y = [5391542, 5389437, 5357596, 5307134, 5245225, 5173720, 5105503, 5039510, 4976817, 4914297, 4845531, 4755844, 4649624, 4542121, 4425083, 4298822, 4166123, 4027868, 3898995, 3783310, 3683529, 3574998, 3446735, 3295766, 3135586, 2975111, 2816129, 2666526, 2528516, 2401866, 2286583, 2178550, 2072057, 1965986, 1865388, 1774956, 1693738, 1620738, 1557740, 1504768, 1448559, 1390995, 1347429, 1317994, 1304074, 1305322, 1318224, 1351871, 1403707, 1445261, 1449910, 1408072, 1345473, 1282799, 1219538, 1156197, 1093855, 1038706, 995475, 964452, 936608, 913700, 895588, 882936, 874169, 864416, 851114, 834655, 820370, 808314, 795415, 779181, 764633, 755581, 747814, 736176, 727197, 713560, 699288, 679937, 664211, 654229, 637204, 622878, 609160, 598658, 597283, 590258]
10916E90258k655J717J8k547l072n032m573R52P894P254P586K416j197J508n049
10901E95478r091p86J458J2609J6105J3995J0756L494k317n519q113q029l008
10888F17032o902l870j3184l692P298J3309K5130L1932K6893K0014J6879J5533
10876G46372K0498L1657K1214J2950O291J954J4142L7325M0959N1633N8668N7712
10864A101375N7759N2901M4994L8597L7222M8381Q2665J11607J27470J30115J48825
10853A981911K02800K85846L77157M00426K98197J38597P3231J44060K83519M37936
10843D623680N85845P49665R44035J157461J360396J625313K114257K882319M082500
10834B0125471O142893R637294J5481575K4586224L5880376M2021978K9313797
$$ y = [590258, 587603, 589320, 589338, 586791, 583719, 578687, 574114, 575066, 582960, 590214, 597800, 600216, 599019, 600527, 595478, 586387, 585601, 587059, 599668, 615773, 629768, 640524, 644018, 641701, 636182, 628069, 620040, 617032, 610130, 606260, 593076, 589384, 596682, 609991, 635121, 667053, 693946, 713960, 730839, 746372, 766870, 798527, 819741, 832691, 838982, 840936, 855078, 892403, 933362, 984995, 1043663, 1101375, 1159134, 1212035, 1257029, 1295626, 1332848, 1381229, 1463894, 1575501, 1702971, 1833086, 1981911, 2184711, 2470557, 2847714, 3248140, 3546337, 3684934, 3758165, 3902225, 4185744, 4623680, 5209525, 5959190, 6903225, 8060686, 9421082, 11046395, 13160652, 16042971, 20125471, 26268364, 35905658, 51387233, 75973457, 111853833, 153875811, 183189608]
10827A83189608k018678l0022255l9000384l3180063k3505232j5636040j0311975
10820B9514981o844561m594567l160997k269462j813143j608543j419201j166625
10812F637882q97446o62532m79985l43494k25392j17195o2296j17330k62308l68522
10802C101382l77889l28656k58174j86579j34875j08614j03508r3761r2943q8003
10792A328380p6169n7556m3614l1802k8775k8304k0080k5594l2422l9365l9649
10781I05050l7997l3934k5559k5812k3194k3356j9928j6256j282l607k616q758
10769F82751j8223k3789j8541k2045k6931k2483k1097k7661k6150j2396q321m167
10757D50947O222Ln312o854j1330p465k564l294j824n695j154j79o42j289n503
$$ y = [183189608, 181170930, 151148675, 112148291, 78968228, 55462996, 39826956, 29514981, 22670420, 18075853, 14914856, 12645394, 10832251, 9223708, 7804507, 6637882, 5740436, 5077904, 4597919, 4254425, 4029033, 3911838, 3849542, 3732212, 3469904, 3101382, 2723493, 2394837, 2136663, 1950084, 1815209, 1706595, 1603087, 1509326, 1416383, 1328380, 1252211, 1194655, 1151041, 1119239, 1090464, 1062160, 1042080, 1016486, 984064, 944699, 905050, 867053, 833119, 807560, 781748, 758554, 735198, 715270, 699014, 697732, 694125, 691509, 682751, 664528, 640739, 622198, 600153, 573222, 550739, 529642, 501981, 475831, 463435, 455114, 450947, 457169, 457172, 451860, 445006, 433676, 426211, 423647, 420353, 418529, 412834, 411680, 411501, 410859, 409570, 404067]
10742D04067p205l537j0031r907p971K102n799q769r833j1311j1574j3188r904
10729B97140j1295r789n843j949o6M554q220j3993j4317j0660m819m011l608m628
10715B08496p16J432K896M433M571N713K223J1383K4600M0419K9483r614l8076
10702B87243m4494l2607k3268j5337k000P02j263J1289J2830Q073N921p1M79p73
10688B06724j080K410j618m506o218q215l908j31o243r882j5353k1112k5537k7828
10674G7503k8707j1657J7449L6709L7528K8471J7070J4780L565p142m526N710
10662A86753Q159n584j1487k596J1600J3147N072j213q317j1413m712n474J431
10649A75366J0973R906r19q467j0689o347M921N348k134K543O97m759m649R54
$$ y = [404067, 396862, 393325, 383294, 373387, 365416, 367518, 361719, 352950, 343117, 331806, 320232, 307044, 297140, 285845, 276056, 270213, 268264, 268198, 272752, 264532, 250539, 236222, 225562, 220743, 216732, 213124, 208496, 207780, 209212, 212108, 216541, 221112, 226825, 229048, 240431, 265031, 305450, 334933, 325319, 287243, 242749, 210142, 186874, 171537, 169537, 170239, 168976, 180265, 193095, 201168, 207089, 207018, 207497, 206724, 205644, 208054, 206436, 201930, 195712, 187497, 183589, 183458, 177215, 167333, 151980, 130868, 105331, 77503, 48796, 37139, 54588, 91297, 128825, 157296, 174366, 189146, 192711, 185569, 181043, 186753, 194912, 189328, 177841, 175245, 186845, 199992, 205064, 203851, 195534, 184121, 179409, 173935, 175366, 186339, 196245, 195326, 186859, 176170, 169823, 174744, 180092, 177958, 180501, 181198, 176439, 171790, 172744]
10635A72744j92k529K934M630O529m455o563k989j556N843k752q141l496o287
10621A53720o727k269p725J759K363P22N689K369L551O240P419R52o58J759j215
10606A67949k319k465J969J5797J9145J1669r059j5634j6157j0582p539j496k293
10593A48985N129Q083P169M30j198J541R101K528M396pr134q972o026Q99L326
10578A66250L3M98N039O53m35m771p692m460K142J688O015J3047M161N827O36
10563A88631O98M988j717j693m551j2310j1420o953k401j796o84l477l846k038
10549A41431l752N16M111J670J154m379k185k577K567K915L684M38N97O077K550
10534A54817J252q20L2k567m851p055L1o148n620J959N438P510P775O035K008
$$ y = [172744, 172552, 170023, 172957, 177587, 184116, 179661, 173098, 170109, 168553, 174396, 171644, 163503, 160007, 153720, 146993, 144724, 136999, 138758, 141121, 141843, 147532, 149901, 153452, 159692, 167111, 168063, 167405, 169164, 167949, 165630, 163165, 165134, 180931, 200076, 211745, 202686, 187052, 170895, 160313, 152774, 151278, 148985, 154114, 162197, 169366, 169796, 168598, 170139, 179240, 181768, 186164, 186157, 177023, 168051, 162025, 162924, 166250, 166283, 166781, 171820, 172473, 172038, 167267, 159575, 155115, 157257, 158945, 164960, 178007, 182168, 187995, 188631, 189329, 194317, 192600, 190907, 186356, 174046, 162626, 155673, 153272, 151476, 150792, 147315, 143469, 141431, 137679, 138195, 142306, 143976, 145130, 140751, 138566, 135989, 138556, 141471, 145155, 145593, 146190, 152267, 154817, 156069, 155249, 155281, 152714, 147863, 140808, 140839, 134691, 129071, 131030, 136468, 143978, 151753, 157788, 159796]
10519A59796J0800K7549M1675N7195M4390L07k9895m3936m2099k3516j1301j1019
10507A79946j1007o703l515N465N05m949j081J556k750j335j016P904J2739J8601
10493A94360K5358L6085O1807P0427L5543r23j3316j61K8682K9779j2210m8854
10481D06577m6479k9369k1484j4823j0306j3374j5326r499j767J1426J0987J46
10469B66709r040p485j838l591j2941j4551j3142o852p673o778k627m780o014
10456A69397k525L832O573J5399P746k283m01P030J710K259l542j137M600J0919
10442B19577J3153N738n787n064J530R35k68J92k45R198J1169N726R343R665J4582
10427B89444K6374K8229K5525K3038K1183K9283N8219Q9634J37623J94105K09053
$$ y = [159796, 170596, 198145, 239820, 297015, 341405, 341712, 311817, 267881, 225782, 202266, 190965, 179946, 168939, 162236, 158721, 164186, 164691, 159742, 158661, 160217, 157467, 156132, 155116, 163020, 175759, 194360, 219718, 255803, 317610, 388037, 423580, 422657, 409341, 409180, 437862, 467641, 455431, 406577, 360098, 330729, 309245, 294422, 284116, 270742, 255416, 245917, 244150, 255576, 266563, 266709, 257669, 250184, 248346, 244755, 231814, 217263, 204121, 197269, 189596, 182818, 180191, 175411, 169397, 166872, 170704, 177277, 192676, 200422, 198139, 197738, 204768, 206478, 208737, 205195, 204058, 208658, 219577, 232730, 238468, 232681, 227617, 229147, 230082, 229814, 230006, 229761, 238959, 250128, 255854, 265197, 274862, 289444, 315818, 344047, 369572, 392610, 413793, 443076, 501295, 590929, 728552, 922657, 1131710]
10416A131710J32073k3229j58195j84127j35413o9784k4109r887j4224k7249k7114
10405E90452l2657n1705p1157p0678n9018m6458l0933k0466o520l347o221p222
10393A84070q401p580m360m129l707N841K371L056Q95K494N816Q039K063l544
10379A82924m290j1787k947J712M41N714J475k645J514L322O792L928J0024Q941
10365B05118Q602J6987K1733L1080L7942M6165O4777J16880K13988L62947N33370
10354A659589M46170m0916m38447m86103l41610k10961j28585p8316m3861j1038
10344C25922K0347L9650L3628M111k7611m7778m6195k8273j5008q105j4395j1130
10332B25163j1734j1810r046k223M428Q065J5466K9147L3611K4622Q754l144r12
$$ y = [1131710, 1263783, 1240554, 1082359, 898232, 762819, 693035, 668926, 659039, 644815, 617566, 590452, 557795, 506090, 434933, 364255, 305237, 258779, 227846, 207380, 200860, 197513, 191292, 184070, 175669, 168089, 163729, 159600, 155893, 161734, 164105, 167161, 168056, 170550, 176366, 184405, 186468, 182924, 178634, 166847, 163900, 165612, 166053, 171767, 173242, 170597, 172111, 175433, 182225, 186153, 196177, 205118, 213720, 230707, 252440, 283520, 321462, 367627, 432404, 549284, 763272, 1126219, 1659589, 2105759, 2064843, 1626396, 1140293, 798683, 587722, 459137, 380821, 336960, 325922, 346269, 385919, 419547, 423658, 396047, 348269, 302074, 273801, 258793, 250688, 236293, 225163, 213429, 201619, 192573, 190350, 194778, 202843, 218309, 247456, 281067, 305689, 314443, 311299, 310387]
10319C10387O488K279j3246k0471k0335j7889r077l065n570l102l645m913p998
10306B09843j3640k159Q322N486L550N192J1608J6805K0116K0855J9478K8732
10294C34188M1300O4157J15483J90432L10979M43770M25458J05146k85238m37844
10284A307831l63250k40113j56067j00721o2805m5090l1309k0895j2726j4859
10274B59996j5565j0511j4265j4519n540j1276o616J739k062R39N698L343m296
10261A87065n860r015k771N165p554r858l170j100r99M220M782N284K334O033
10247A74556J7089K1896L0445K8780L149j3811j8726j0079L90J0327K7353K5974
10235B97343J2713K995l791n444j5187j3938O87J1315M389n154j6460j6070j1758
$$ y = [310387, 316875, 319154, 305908, 285437, 265102, 247213, 238136, 235071, 229501, 226399, 222754, 217841, 209843, 196203, 194044, 202366, 207852, 211402, 216594, 228202, 245007, 265123, 285978, 305456, 334188, 375488, 439645, 555128, 745560, 1056539, 1500309, 1925767, 2030913, 1745675, 1307831, 944581, 704468, 548401, 447680, 384875, 339785, 308476, 287581, 274855, 259996, 244431, 233920, 219655, 205136, 199596, 188320, 181704, 183443, 181381, 182320, 188018, 191361, 187065, 181205, 172190, 169419, 174584, 167030, 157172, 154002, 152902, 151903, 156123, 160905, 166189, 168523, 174556, 191645, 213541, 243986, 272766, 275915, 262104, 243378, 233299, 233689, 244016, 271369, 297343, 310056, 313051, 309260, 303816, 288629, 274691, 275378, 286693, 291082, 285928, 269468, 253398, 241640]
10222B41640j1466o615q80O26j003k950J43r25J862k300q44j716K526N863J009
10207B24970P4k778k474k698K505L661Q202P523J1367R844m943j4300q320k237
10193B30396J249M264J104q32K551Q339J1333J3560J8367J9439K4198M4684O6862
10180D45514Q7841Q1252L0367k6942m3299l7507j2953J2778L0466M2791O3173
10169F73481J04200J70132K67033M47978P47634J174066J489257J421286J364568
10160G859635J010566m5376q04161j181622j504140j498972j134903p33961m56572
10151A510494k89205j77674j14087r5064r3188p9925o6809n3050n5639n3456l6577
10140C95820k5629k2592k3886j7621j9105j2236j3045p291r63K036J0402J9801
$$ y = [241640, 230174, 223559, 222679, 223305, 222302, 219352, 219495, 218570, 220432, 218132, 217288, 215572, 218098, 223961, 224970, 225044, 222266, 219792, 217094, 219599, 223260, 231462, 238985, 250352, 260196, 255253, 240953, 232633, 230396, 231645, 235909, 237013, 236181, 238732, 247071, 258404, 271964, 290331, 309770, 333968, 378652, 445514, 533355, 614607, 644974, 618032, 574733, 537226, 524273, 537051, 567517, 610308, 673481, 777681, 947813, 1214846, 1662824, 2410458, 3584524, 5073781, 6495067, 7859635, 8870201, 8824825, 8020664, 6839042, 5334902, 3835930, 2701027, 1967066, 1510494, 1221289, 1043615, 929528, 834464, 741276, 661351, 594542, 541492, 485853, 432397, 395820, 370191, 347599, 323713, 306092, 286987, 274751, 261706, 254415, 253452, 255488, 265890, 285691]
10128B85691R067j1233k3195k2305j6019j4941n522n474n277k243k264k919o243
10115A77123p356q472k010j881K318j119o001k546k915M3L04J795K766k309j978
10100A47762M928J175o681k196N59j685J298O67k092m119m118M306j152J311L794
10085A43757M277N869L644n778n012j034O490J374j981L482K839n45k290k345
10071A52747j508O354L446j099k182J71p38L448N45k554j792k732l526K498j608
10056A51470M549J238N183J380K94K69r99l391j328n89o92j035k91m5r50K969
10040A58032O404N451k68M494N5m266m299j196k79n29N36o24O401q03J353R908
10024A80370R780L500J326N23p6K409Q478Q627R950O861n427l656N008N445o441
$$ y = [285691, 294758, 283525, 260330, 238025, 222006, 207065, 201543, 196069, 190792, 188549, 186285, 183366, 177123, 169767, 161295, 159285, 157404, 159722, 158603, 152602, 150056, 147141, 147184, 147488, 149283, 152049, 149740, 147762, 152690, 153865, 147184, 144988, 145547, 143862, 145160, 145827, 143735, 139616, 135498, 139804, 138652, 139963, 143757, 148034, 153903, 157547, 151769, 146757, 145723, 152213, 153587, 151606, 155088, 157927, 157382, 155092, 152747, 151239, 157593, 161039, 159940, 157758, 157929, 157191, 160639, 161184, 158630, 156838, 154106, 150580, 153078, 151470, 156019, 157257, 162440, 163820, 164114, 164383, 163384, 159993, 158665, 158076, 157384, 156349, 156058, 156013, 155063, 158032, 164436, 169887, 169619, 174113, 174168, 169902, 165603, 164407, 164128, 163599, 164135, 163511, 169912, 169109, 170462, 180370, 190150, 193650, 194976, 195499, 195423, 197832, 206310, 214937, 224887, 231748, 226321, 222665, 227673, 233118, 226677]
10009B26677r946j2467n777n09L78K422L979M307L421N962J3934J4730K8134M0905
9995C16150M2983Q542k8266l6892k6970n544L579l714O62J132J945L084K445j026
9981B78110J634K567N700M776N424N465K743Q087P652Q409J1326P806J0978J2090
9967C72767O976J0986Q472K043P561J2302R638R272K959L150Q623O704O01P404
9953D69458J0569L198P214J3997J8660J5091J4872K3693K0166J1343J5980K1706
9941F45947J4062M848j993J110R312J4269J8504K0844K3582K7220K5410L6564
9929H39679M9043N5740O8116Q3400R8881J21149J33774J55088J75876J86661J81576
9918B148983J78544J68832J51822J39875J32575J35198J50913J66539J83580K06090
$$ y = [226677, 216731, 204264, 198487, 197978, 198356, 200778, 204757, 209064, 212485, 218447, 232381, 247111, 275245, 316150, 359133, 367675, 339409, 302517, 275547, 270003, 273582, 269868, 270530, 271662, 273607, 276691, 279136, 278110, 279744, 282311, 288011, 292787, 298211, 303676, 306419, 314506, 322158, 330567, 341893, 349699, 360677, 372767, 379743, 390729, 399201, 401244, 408805, 421107, 430745, 440017, 442976, 446126, 454749, 461453, 462054, 469458, 480027, 483225, 490439, 504436, 523096, 538187, 553059, 576752, 596918, 608261, 624241, 645947, 660009, 664857, 662864, 663974, 673286, 687555, 706059, 726903, 750485, 777705, 803115, 839679, 888722, 944462, 1012578, 1095978, 1194859, 1316008, 1449782, 1604870, 1780746, 1967407, 2148983, 2327527, 2496359, 2648181, 2788056, 2920631, 3055829, 3206742, 3373281, 3556861, 3762951]
9908C762951K16826K22577K17342K15094K37135K70217L10534L56094L78753L64213
9898F551736L30295K87319K41721J94594J48432J19031J02129J08671J26762J37241
9888H347931J20421P5021J1475l4463n5825m7159k9444m666J8785M4098N8729
9877H504903O5253P0266N3214J7068j6918n0180p5587r4875j23871j57782j85176
9866H006315k00715k13708k28620k58534k95668l14722l14345k96525k56862k26448
9856E400168k14517k18152k21198k21066k06118j73477j47331j11931p7117m0628
9846C768633j4370r484j5672l0428m2099k6076J6003O7399J34417J92988K26053
9835D267364K35710J82529N6597m0892m0170K1060R6721J66271K23280K70483
$$ y = [3762951, 3979777, 4202354, 4419696, 4634790, 4871925, 5142142, 5452676, 5808770, 6187523, 6551736, 6882031, 7169350, 7411071, 7605665, 7754097, 7873128, 7975257, 8083928, 8210690, 8347931, 8468352, 8543373, 8554848, 8520385, 8464560, 8417401, 8387957, 8383291, 8402076, 8446174, 8504903, 8570156, 8640422, 8693636, 8710704, 8693786, 8643606, 8568019, 8473144, 8349273, 8191491, 8006315, 7805600, 7591892, 7363272, 7104738, 6809070, 6494348, 6180003, 5883478, 5626616, 5400168, 5185651, 4967499, 4746301, 4525235, 4319117, 4145640, 3998309, 3886378, 3809261, 3768633, 3754263, 3744779, 3729107, 3698679, 3656580, 3630504, 3646507, 3713906, 3848323, 4041311, 4267364, 4503074, 4685603, 4742200, 4701308, 4661138, 4682198, 4778919, 4945190, 5168470, 5438953]
9825E438953K95460L06031K97727K88340L01291L31892L81193M13081M14911L80823
9815H849702L28130K90053K72634K65794K53169K32438J96657J59327J26165Q6444
9805A1060513N0061M571n1659q6748q6567p0439n0691k5635N655K9697N3777P2933
9793A0905468O3857Q284q3167j62098j93071j72747j38030j14443j31369j70946
9783I811738k19629k75581l36151l93932m40933m60024m58161m30668l82069l38874
9773F075716l17752l04165k94018k83430k62778k41008k17513j98802j81218j76120
9763C598912j78788j89552k04981k22946k41672k45418k33807k10879j83014j51977
9753A535878j34343j25243j03555q5095p7955p1130o7422n9356n7622m1225l5862
$$ y = [5438953, 5734413, 6040444, 6338171, 6626511, 6927802, 7259694, 7640887, 8053968, 8468879, 8849702, 9177832, 9467885, 9740519, 10006313, 10259482, 10491920, 10688577, 10847904, 10974069, 11060513, 11110574, 11115145, 11063486, 10976738, 10890171, 10819732, 10769041, 10743406, 10749061, 10778758, 10832535, 10905468, 10969325, 10977609, 10894442, 10732344, 10539273, 10366526, 10228496, 10114053, 9982684, 9811738, 9592109, 9316528, 8980377, 8586445, 8145512, 7685488, 7227327, 6796659, 6414590, 6075716, 5757964, 5453799, 5159781, 4876351, 4613573, 4372565, 4155052, 3956250, 3775032, 3598912, 3420124, 3230572, 3025591, 2802645, 2560973, 2315555, 2081748, 1870869, 1687855, 1535878, 1401535, 1276292, 1172737, 1087642, 1009687, 938557, 871135, 811779, 754157, 712932, 677070]
9742F77070l5219l3445k8174k2328k1797k5230k2303j4584m158j416j4423k3525
9730D30468k7108j7234j7288r462o374j0401j2180r816m214m046p474l326o774
9717B94771p455M92k672o102k517R47Q22k629m983k310j451K899N952N681J832
9702B83277J074J903p633j217l418p430o295l236j310j008r278o774m321k786
9688B31548j955L135m834p394k730J112l896M139Q305K967L432O786K212N362
9674B48189J268L502K714J948m64O44q31n815k228P727L438j73j017N789J4811
9659B79502K0925K9885M7335Q3312J33321J70619J57922J00781P9585J37446J76859
9648A417492O8852j03413j57715j02982p6353j20879j62060j48360j15956p3763
$$ y = [677070, 641851, 608406, 580232, 557904, 536107, 510877, 488574, 473990, 469832, 468416, 453993, 430468, 403360, 386126, 368838, 359376, 353002, 342601, 330421, 320605, 316391, 312345, 304871, 301545, 294771, 287316, 287808, 285136, 279034, 276517, 277464, 278286, 275657, 270674, 268364, 266913, 269812, 275764, 281445, 283277, 284351, 286254, 278621, 277404, 273986, 266556, 260261, 257025, 255715, 254707, 245429, 238655, 234334, 231548, 229593, 232728, 227894, 220500, 217770, 218882, 214986, 219125, 227430, 230397, 233829, 240615, 242827, 248189, 249457, 252959, 255673, 257621, 257157, 257801, 256970, 251155, 248927, 256654, 260092, 259919, 258902, 264691, 279502, 300427, 330312, 377647, 460959, 594280, 764899, 922821, 1023602, 1103187, 1240633, 1417492, 1486344, 1382931, 1225216, 1122234, 1045881, 925002, 762942, 614582, 498626, 424863]
9638D24863m6320k9293j7047j1909j1663q482m985o559k136K87J571K42N869L490
9624B97928P297K816l51j505L146O242J2597R740O221M636R436J0272J829n575
9610C64729j806k878j61o048o598o123J329J412O888J310J099K310P544R077R311
9595C81395N795N805M442N579P631L511L432K389L123J849l993j258n950l416
9581D10334n17J251O380O297O172K491N41k481j479j031J872M880M527L633N131
9566D48001Q202P982J0917N887R825M828L73N77o160l569P16j053R1K606K173
9551D91396O78K206k540K301J948q117k215P867J1954J1126R072J0255J5104J8338
9537E69373K0695K1590K1546J5882R531P520O631J0687O552j378n291l595j0744
$$ y = [424863, 378543, 349250, 332203, 320294, 308631, 300149, 295164, 288605, 286469, 286756, 288327, 288569, 294438, 297928, 305225, 308041, 307690, 306185, 309331, 315573, 328170, 337910, 344131, 348767, 358203, 368475, 370304, 364729, 362923, 360045, 359884, 353836, 347238, 341115, 342444, 343856, 350744, 352054, 353153, 355463, 363007, 372084, 381395, 387190, 392995, 397437, 403016, 410647, 414158, 417590, 419979, 423102, 424951, 420958, 419700, 413750, 410334, 409817, 411068, 417448, 423745, 429917, 432408, 432949, 430468, 428989, 427958, 429830, 434710, 439237, 442870, 448001, 456203, 464185, 475102, 480989, 490814, 495642, 496015, 496592, 490432, 486863, 487579, 486526, 486617, 489223, 491396, 492074, 494280, 491740, 494041, 495989, 487872, 485657, 493524, 505478, 516604, 525676, 535931, 551035, 569373, 590068, 611658, 633204, 649086, 658617, 666137, 672768, 683455, 690007, 688629, 683338, 679743, 668999]
9524F68999j4731j5168j8391j4575j0395p066k388j621M52L522Q711J2344N531
9511F15224Q095J3163J3787R543O662K074O574M717Q201R321J2070J8689J4436
9498G42556J0808J0078J6068K4299L2268M0889N2633N0589M3712M1281K8500J2091
9486A105772r73j8650l3245l9619l6104l4744l4754k6490k6038k8321k8642k6748
9474G71444k7487k4892j9185j6577r150J0201J4489K3544L1427L0567K7454K1206
9462H33041R755Q829K864r381j4218j7702j6684j3282q290p513q042n261p56m626
9448G48734p752q416o609q839r939o883O097L383m778o077j5749k4915l3861l4195
9434E90201k8092k5165k0143j7792j1081J153Q417O471J3071J8148J6958J9574
$$ y = [668999, 654268, 639100, 620709, 606134, 595739, 588673, 586285, 584664, 585116, 588638, 597349, 609693, 615224, 623319, 636482, 650269, 659812, 666474, 668548, 675122, 679839, 688040, 697361, 709431, 728120, 742556, 753364, 763442, 779510, 803809, 836077, 876966, 929599, 980188, 1023900, 1065181, 1093681, 1105772, 1104799, 1086149, 1052904, 1013285, 977181, 942437, 907683, 881193, 855155, 826834, 798192, 771444, 743957, 719065, 699880, 683303, 674153, 684354, 698843, 722387, 753814, 784381, 811835, 833041, 842796, 851625, 854489, 845108, 830890, 813188, 796504, 783222, 774932, 767419, 759377, 754116, 753360, 748734, 740982, 732566, 725957, 717118, 707179, 700296, 706393, 709776, 704998, 698921, 683172, 658257, 624396, 590201, 562109, 536944, 516801, 499009, 487928, 489081, 497498, 503969, 517040, 535188, 552146, 571720]
9422E71720K5865K9238L5342L8664M5410M9283L6689K2439K037j4699k0719k2427
9410G98842j6280j2929q876J964P328P988O158J4266J1480N418L579j2L205L168
9396H25299J0486J8374K8930L2893M4182N0155N1771M7826M6100L9788M2891N2026
9384A290721O0671P5686R4332J20138J52475J87812K22048K59483K97109L43858
9374C104333L85891M12644M03666L46797K36446R0095o2489j98017k85400l23085
9364D110881l28917l14107k79840k37950j99652j62989j26541q9825m8460r846
9354B312754K7104O1638R9088J46773J88230K30782K85481L40070L86427M11225
9344D489572L96753L05401J47732l6965k05950l20370l75284l67351l42246l10639
$$ y = [571720, 597585, 626823, 662165, 700829, 746239, 795522, 832211, 854650, 856687, 841988, 821269, 798842, 782562, 769633, 760757, 762721, 770049, 778037, 784195, 798461, 809941, 815359, 818938, 818926, 822131, 825299, 835785, 854159, 883089, 915982, 960164, 1010319, 1062090, 1109916, 1156016, 1195804, 1238695, 1290721, 1351392, 1427078, 1521410, 1641548, 1794023, 1981835, 2203883, 2463366, 2760475, 3104333, 3490224, 3902868, 4306534, 4653331, 4889777, 4979872, 4917383, 4719366, 4433966, 4110881, 3781964, 3467857, 3188017, 2950067, 2750415, 2587426, 2460885, 2371060, 2322600, 2312754, 2339858, 2401496, 2500584, 2647357, 2835587, 3066369, 3351850, 3691920, 4078347, 4489572, 4886325, 5191726, 5339458, 5302493, 5096543, 4776173, 4400889, 4033538, 3691292, 3380653]
9334C380653k73878k39320k20183j99205j75335j52980j37669j20883r0883p2868
9324A697449n3990l7641k2455m621Q373J6624K8281L6827M6467N9833O6203P2264
9312A913614Q8548R8578J15414J48982J74873K08676K47112K87156L39421M11203
9302D033577M89972N74210O57098P22060P66256P76739P31618O19152M44531K26996
9292A0042209J9034j28948j92839j82690j37041j15226j42157k05785k82589l33738
9282H340230l32183k93741k30926j62792j05142n1571J0143Q4697J76596K78100
9272G713411M03622N22747O08020O23510N45343L79303J57261p3510k81172m19478
9262A0179057m76203m76843m59274m56707m83412n38678n97904o15135o04428
$$ y = [3380653, 3106775, 2867455, 2647272, 2448067, 2272732, 2119752, 1982083, 1861200, 1770317, 1697449, 1643459, 1605818, 1583363, 1578742, 1587115, 1603739, 1632020, 1668847, 1715314, 1775147, 1841350, 1913614, 2002162, 2100740, 2216154, 2365136, 2540009, 2748685, 2995797, 3282953, 3622374, 4033577, 4523549, 5097759, 5754857, 6476917, 7243173, 8019912, 8751530, 9370682, 9815213, 10042209, 10061243, 9932295, 9739456, 9556766, 9419725, 9304499, 9162342, 8956557, 8673968, 8340230, 8008047, 7714306, 7483380, 7320588, 7215446, 7163875, 7174018, 7258715, 7435311, 7713411, 8117033, 8639780, 9247800, 9871310, 10416653, 10795956, 10953217, 10879707, 10598535, 10179057, 9702854, 9226011, 8766737, 8310030, 7826618, 7287940, 6690036, 6074901, 5470473]
9253E470473n55815m93862m29773l66096l06768k54120k06579j76096j49786j18174
9243B413404r6303p8220n9476m1589k5000j2073J353J4378L2132N4369P9752J03266
9231B385993J21686J49323J78877K20884K64522L02296L52662M09341M69475N17536
9221E372595N35408N10110M46124L59639K82602K48396K56814K85305K94969K50919
9211H842881J36829m3931k49516m34879n60184o11843n94695n19379m20225l18535
9201E226523k13289j11718k3329Q0039J90586L04561M05774M85905N16478M87123
9191G348653L78916K33451J08979M2999M2886P2400P4239J4769j15987k88725
9181G912580m53978n73296o41412o56522o30370n86088n28989m50934l81483l21189
$$ y = [5470473, 4914658, 4420796, 3991023, 3624927, 3318159, 3064039, 2857460, 2681364, 2531578, 2413404, 2317101, 2238881, 2179405, 2137816, 2112816, 2100743, 2102096, 2116474, 2148606, 2202975, 2282727, 2385993, 2507679, 2657002, 2835879, 3056763, 3321285, 3623581, 3976243, 4385584, 4855059, 5372595, 5908003, 6418113, 6864237, 7223876, 7506478, 7754874, 8011688, 8296993, 8591962, 8842881, 8979710, 8935779, 8686263, 8251384, 7691200, 7079357, 6484662, 5965283, 5545058, 5226523, 5013234, 4901516, 4878187, 4958226, 5148812, 5453373, 5859147, 6345052, 6861530, 7348653, 7727569, 7961020, 8069999, 8112998, 8155884, 8228284, 8302523, 8317292, 8201305, 7912580, 7458602, 6885306, 6243894, 5587372, 4957002, 4370914, 3841925, 3390991, 3009508, 2688319]
9171B688319k68709k13788j73912j44978j18991r6422q2083p1272o0130n2566
9161A405468m2729l0817j2537l866P837J8601L7726N5233O0391M1657J7739m45
9149A554258J751J5163L1761N7144R4630J28310J54545J83149K03087K22493K31206
9138B877497K44046K62495K47061J63089L7139r6845k11172k80931l01165k81004
9128B660210k38412j97246j63910j38759j11318q1653n2610k8564N33K8746O1618
9117A738635J01407J39656J76610K17170K48058K83500L01564K99059K74082K02960
9107C982701N3297j37921k99187l65847l64664l37343k94328k51021k20837j90963
9097A573887j60218j32080j02702p2241n3626m4294l7396m2895m2530m3928l4279
$$ y = [2688319, 2419610, 2205822, 2031910, 1886932, 1767941, 1671519, 1589436, 1518164, 1458034, 1405468, 1362739, 1331922, 1319385, 1315519, 1323356, 1341957, 1379683, 1434916, 1495307, 1536964, 1554703, 1554258, 1556009, 1571172, 1602933, 1660077, 1754707, 1883017, 2037562, 2220711, 2423798, 2646291, 2877497, 3121543, 3384038, 3631099, 3794188, 3831327, 3734482, 3523310, 3242379, 2941214, 2660210, 2421798, 2224552, 2060642, 1921883, 1810565, 1728912, 1676302, 1647738, 1648271, 1677017, 1738635, 1840042, 1979698, 2156308, 2373478, 2621536, 2905036, 3206600, 3505659, 3779741, 3982701, 4035998, 3898077, 3598890, 3233043, 2868379, 2531036, 2236708, 1985687, 1764850, 1573887, 1413669, 1281589, 1178887, 1106646, 1053020, 1008726, 971330, 928435, 885905, 841977, 807698]
9086H07698l0652k6220j7932k0120p158m419N76K776k5m318m084J521l938J23
9072F93828L895j831o673m504J0718K1171L8489L9997M6442N0680K9269p859m9381
9059H64241n4827l3497m461o95p384k2012l0022k7130k8611k3372o458J1006O504
9046F43282j056N305Q089J2648J7559J1859K1602L7919O4958R3468Q8963L5863
9034A040459j1582l6185m8841m8167l0193j9340j7733k0488j6512p210k66j745
9022G82197P67L705L426P827Q176L647K886R053L1290O7394J15095J58264K18299
9009A412026K69236K89006K81030K75861L37896N14313P17558Q15957O49292L10030
8999E872205O3320r9961m09221p50294q60743p25040n17706l39785k29423j48164
$$ y = [807698, 777046, 750826, 732894, 712774, 705616, 701197, 701773, 704549, 704524, 700206, 696122, 697643, 693705, 693828, 697723, 695892, 689219, 684715, 695433, 716604, 755093, 795090, 841532, 892212, 921481, 913622, 864241, 809414, 775917, 771456, 770761, 763377, 741365, 711343, 684213, 655602, 632230, 625772, 636778, 643282, 642226, 647531, 655620, 668268, 685827, 697686, 719288, 757207, 822165, 915633, 1004596, 1040459, 1028877, 992692, 943851, 895684, 865491, 846151, 828418, 807930, 791418, 784208, 783942, 782197, 782964, 786669, 790095, 797922, 806098, 809745, 812631, 821684, 852974, 920368, 1035463, 1193727, 1412026, 1681262, 1970268, 2251298, 2527159, 2865055, 3379368, 4096926, 4912883, 5562175, 5872205, 5935525, 5835564, 5426343, 4676049, 3815306, 3090266, 2572560, 2232775, 2003352, 1855188]
8989A855188j01086o1814l1565r600R864K2660J1543k5713o1313p9920p8251n8346
8977A391647m2262l2228k4655j6776j0099j587j670o261j1746j8193j7438q252
8965A200480n492Q056K2817L2069L3107M7222M6230M1193L3509L3346L1009L2176
8953A555722K7563L3236M5258N7605O1379N3822L6339J7869L649m709o849J661
8941A882545J4718J7911K6045M3029O4809Q9715J17752J19133J07829R1346Q7594
8930B662426Q8739R6092J03894J06763J07093R8294Q4938R9107J24960J54360
8920C726666J87453K04672K18811K29134K32960K28254K36086K52888K93668L59803
8910F170395M30111M79300N06561N26198N73703O63968P74347Q84325J028822
$$ y = [1855188, 1754102, 1692288, 1660723, 1651123, 1660987, 1683647, 1695190, 1669477, 1608164, 1528244, 1449993, 1391647, 1349385, 1317157, 1292502, 1275726, 1265627, 1264040, 1262370, 1256109, 1244363, 1226170, 1208732, 1200480, 1194988, 1203044, 1225861, 1257930, 1291037, 1338259, 1384489, 1425682, 1459191, 1492537, 1523546, 1555722, 1583285, 1616521, 1661779, 1719384, 1780763, 1834585, 1870924, 1888793, 1892442, 1887733, 1880884, 1882545, 1897263, 1915174, 1941219, 1984248, 2049057, 2138772, 2256524, 2375657, 2483486, 2574832, 2662426, 2751165, 2847257, 2951151, 3057914, 3165007, 3263301, 3348239, 3447346, 3572306, 3726666, 3914119, 4118791, 4337602, 4566736, 4799696, 5027950, 5264036, 5516924, 5810592, 6170395, 6600506, 7079806, 7586367, 8112565, 8686268, 9350236, 10124583, 11008908, 12037730]
8901A2037730J219683J464849J773743K154413K578172L020995L499885M007826
8893C1757296M536324N055827N776119P207512R702159J3522648J9259711K7857062
8885A24674658M0610889N8243722P7618673Q7079914O6910451J2453988m5847299
8878D21744996p7614290p9369469o5315133m8556012l4598562k4268959j6837532
8871G5185039j1469298p496209m512290k582886k430851l715519m510210l932786
8863C4534990k801666k180423k123772k106315k198100k550468k740770k525241
8855A5308235k062024j585810j197525r36809q01218p41709o91071o35914n76199
8846F079956n12285m47121l86892l29326k71127k21675j79359j55393j44207j44213
$$ y = [12037730, 13257413, 14722262, 16496005, 18650418, 21228590, 24249585, 27749470, 31757296, 36293620, 41349447, 47125566, 54333078, 64035237, 77557885, 96817596, 124674658, 165285547, 223529269, 301147942, 388227856, 455138307, 467592295, 421744996, 344130706, 264761237, 199446104, 150890092, 116291530, 92022571, 75185039, 63715741, 56219532, 51707242, 49124356, 46693505, 42977986, 38467776, 34534990, 31733324, 29552901, 27429129, 25322814, 23124714, 20574246, 17833476, 15308235, 13246211, 11660401, 10462876, 9526067, 8724849, 7983140, 7292069, 6656155, 6079956, 5567671, 5120550, 4733658, 4404332, 4133205, 3911530, 3732171, 3576778, 3432571, 3288358]
8836C288358j37535j17565r6172r9516j01063q6973o9904o4803n5794k4383J1109
8825B445759L5824N7647R1207J56333K72304M19289M99897L41993q1399m17361
8815C821493m69071l30669j45203K8005J94543L90286O61932J067670J663757
8806F882743K343764K554671J361059q27873k285862k415134j865672j285918
8798D461778q71170o03937m25082l05105k14164j55264j08373p8265m9678l8047
8788A612693l8468l9357m9726m7781m0323k7006r240N663J3441K0498K3857K6604
8776A450855L6745M7292N5601N2346M0989M4739P2686J16119J70383K18394K41059
8765B547208K60795K96967L81878N40194P59685J053216J474904K170549L318327
$$ y = [3288358, 3150823, 3033258, 2937086, 2837570, 2736507, 2649534, 2579630, 2514827, 2459033, 2434650, 2445759, 2481583, 2539230, 2630437, 2786770, 3059074, 3478363, 3978260, 4320253, 4238854, 3821493, 3352422, 3021753, 2876550, 2904555, 3099098, 3489384, 4151316, 5218986, 6882743, 9226507, 11781178, 13142237, 12314364, 10028502, 7613368, 5747696, 4461778, 3590608, 2986671, 2561589, 2256484, 2042320, 1887056, 1778683, 1700418, 1650740, 1612693, 1574225, 1534868, 1485142, 1437361, 1397038, 1370032, 1360792, 1366455, 1379896, 1400394, 1424251, 1450855, 1487600, 1534892, 1590493, 1642839, 1683828, 1728567, 1801253, 1917372, 2087755, 2306149, 2547208, 2808003, 3104970, 3486848, 4027042, 4786727, 5839943, 7314847, 9485396, 12803723]
8756A2803723N158787P660817R823573Q738983K359040n248557q887955q401557
8748B4006854o407485m519021l110602k124807j452536j002463p04661n14447
8740D170832m02481l11248k22494j50449j07963q5938q5382r8512q3950m8258
8730B574157j3056J5309J7411K5645P0282J68253K98912M04771M70670N09109
8720D541463N00527N24178O60813R51407J372834J912731K704909L975705O127895
8711B3272462R771715J5219233K1044595K0549427O543877j1274533j9615194
8704F5511582j8135202j3479931r360146o375114m323049k954382k049349j435240
8696G399169j035352p67049n74859m29073l45230l22533l00400k65323k19717
$$ y = [12803723, 17962510, 25623327, 35446900, 44185883, 46544923, 41296366, 32408411, 24006854, 17599369, 13080348, 9969746, 7844939, 6392403, 5389940, 4685279, 4170832, 3768351, 3457103, 3234609, 3084160, 2976197, 2890259, 2804877, 2706365, 2622415, 2574157, 2561101, 2576410, 2593821, 2619466, 2689748, 2858001, 3156913, 3561684, 4032354, 4541463, 5041990, 5566168, 6226981, 7178388, 8551222, 10463953, 13168862, 17144567, 23272462, 33044177, 48263410, 69308005, 89857432, 96401309, 85126776, 65511582, 47376380, 33896449, 24536303, 18161189, 13838140, 10883758, 8834409, 7399169, 6363817, 5596768, 5021909, 4592836, 4247606, 3925073, 3624673, 3359350, 3139633]
8687C139633j69819j10033n5867k2553k0999k3597j5478N818O0690J27376J75525
8676C090696K06225K24391K46767L12945M55716O79948R79790J403634K032805
8667I632917L037974M620237O755712Q859519Q853751L998610l584961q305955
8659C3867804q558327o637697m565737k947446j916583j506109j371697j167624
8651E196584q77435o21835m40819l26366k47995j90309j20692l4623N9803J65439
8641B561752K73447L89862N33810N86575K19617l98856p13510o06069l36686j55374
8631B354568j36771j76837j98136j89162j46142r5506m2817L443M0646O8463R5492
8620A577241P8399O742m6675m7683k335O3917J53317L03411N39262Q15070Q51964
$$ y = [3139633, 2969814, 2859781, 2803914, 2781361, 2760362, 2736765, 2721287, 2727105, 2787795, 2915171, 3090696, 3296921, 3521312, 3768079, 4081024, 4536740, 5216688, 6196478, 7600112, 9632917, 12670891, 17291128, 24046840, 32906359, 41760110, 45758720, 42173759, 33867804, 25309477, 18671780, 14106043, 11158597, 9242014, 7735905, 6364208, 5196584, 4319149, 3697314, 3256495, 2930129, 2682134, 2491825, 2371133, 2336510, 2396313, 2561752, 2835199, 3225061, 3758871, 4345446, 4565063, 4166207, 3452697, 2846628, 2509942, 2354568, 2217797, 2040960, 1842824, 1653662, 1507520, 1412014, 1369197, 1372640, 1413286, 1481749, 1577241, 1655640, 1662382, 1615707, 1568024, 1565689, 1629606, 1782923, 2086334, 2625596, 3440666, 4292630]
8609D292630K60635n03115q11449o81267m39179k66597j58866p9036q009P2655
8599A678402J71563L05423M83551O62552Q15025J082960J387177Q99530l74612
8590G111571j166535j080831o51107l83992l96325m79840m53666l44480k36855
8581A917940j63761j14979p9859m2127j4708M782J8576M2912P6291R0165R8652
8570A833884J18530J62497K36761L31008M50234M79130K68793p0388k61190k43690
8560C305569j49394p7483m5248l1362j9111p58K6232P7062J59526K50470L23649
8549C819152M40120O07940N35703K3569m16305m34947l14723k96713l57822l92473
8539C213501l50595k57200j82759j41894j44209j52850j48222j30007j16347q9308
$$ y = [4292630, 4553265, 4050150, 3238701, 2557434, 2118255, 1851658, 1692792, 1613756, 1605747, 1678402, 1849965, 2155388, 2638939, 3301491, 4116516, 5199476, 6586653, 7486183, 7111571, 5945036, 4864205, 4213098, 3829106, 3432781, 2952941, 2499275, 2154795, 1917940, 1754179, 1639200, 1559341, 1517214, 1502506, 1507288, 1525864, 1568776, 1645067, 1735232, 1833884, 1952414, 2114911, 2351672, 2682680, 3132914, 3612044, 3880837, 3810449, 3549259, 3305569, 3156175, 3078692, 3033444, 3002082, 2982971, 2982213, 3008445, 3085507, 3245033, 3495503, 3819152, 4259272, 4867212, 5402915, 5426484, 5010179, 4575232, 4260509, 3963796, 3605974, 3213501, 2862906, 2605706, 2422947, 2281053, 2136844, 1983994, 1835772, 1705765, 1589418, 1500110]
8529A500110n2228j6478m131l1662m9330k3065N3927J44084K45237K75382J45755
8518B187601j03625k86590l23019k66390j88666j32634j02936q3882n8642m0714
8508F00503l1240j7626O74J5651K7266L3096M7950N3967O4489O9717M0148k6481
8496H78114p8744q4599n6713k5530L463J5681K0599L3814M6166N5650Q1159J25640
8484A014700J73579K20268K52578K68221K91076L36671M28780N61634O66453N57874
8474D771834Q6853m93294q00792p79176o16218m59024l36115k48772j83133j39996
8464H02167j04062q2495o1649m7432l9970l4101k7287k3340k1475k3999k2123
8453C14234j6603j0323j1368j3052l909k952l927j511l797J550J1140J1815J4412
$$ y = [1500110, 1447882, 1431404, 1427273, 1395611, 1346281, 1323216, 1377143, 1521227, 1766464, 2041846, 2187601, 2083976, 1797386, 1474367, 1207977, 1019311, 886677, 783741, 699859, 641217, 600503, 569263, 551637, 552311, 567962, 595228, 628324, 676274, 730241, 794730, 864447, 904595, 878114, 799370, 714771, 658058, 632528, 635991, 651672, 672271, 706085, 752251, 807901, 889060, 1014700, 1188279, 1408547, 1661125, 1929346, 2220422, 2557093, 2985873, 3547507, 4213960, 4771834, 4858687, 4365393, 3564601, 2785425, 2169207, 1710183, 1374068, 1125296, 942163, 802167, 698105, 615610, 553961, 506529, 466559, 432458, 405171, 381831, 360356, 336357, 314234, 297631, 287308, 275940, 262888, 258979, 256027, 252100, 250589, 246792, 248342, 259482, 271297, 285709]
8440B85709J2912K1264K8281L2646N0943Q6243J27732J90030K68647L14618K46762
8429A665787M6317j56601k25423j65107m1866R2599K23902K72612J43815j08777
8419A747258k95433l29970k69931j90681j25871q5944o1571m8770l7908k6661
8409B74518j5982j7829j4666j0785j2618o986K549n36n417n228m697l498j86J0603
8395A89242R017M480J583K325Q698J3360J7038J9410K1301K9431M2253N9895R8003
8382E16036J46901K22009L51638N34904P18562O68957J81104m04443o79697o35014
8372A620957m55845l07215k07102j41453r2255n6258m0713l0699k4618j9570k0717
8361B24512r229m325k315o368k220j345l331J466P237J0718K1631L4557M6763
$$ y = [285709, 298621, 319885, 348166, 380812, 431755, 517998, 645730, 835760, 1104407, 1419025, 1665787, 1712104, 1555503, 1330080, 1164973, 1123107, 1215706, 1439608, 1712220, 1856035, 1747258, 1451825, 1121855, 851924, 661243, 535372, 449428, 387857, 339087, 301179, 274518, 258536, 240707, 226041, 215256, 202638, 195652, 198201, 197665, 192248, 187020, 182323, 178825, 178639, 189242, 198259, 202739, 204322, 206647, 215345, 228705, 245743, 265153, 286454, 315885, 358138, 418033, 516036, 662937, 884946, 1236584, 1771488, 2490050, 3159007, 3340111, 2935668, 2255971, 1620957, 1165112, 857897, 650795, 509342, 417087, 360829, 320116, 289417, 264799, 245229, 224512, 215283, 210958, 208643, 202275, 200055, 198710, 195379, 196845, 204082, 214800, 236431, 270988, 317751]
8348C17751M8235K4633j2309l1970l5183k5052j3295o414J0154K7690N1021P8375
8336D33636J21161J85448K67862L19656K40801Q059k24375l10333k70747j89977
8326E81191j28860q6763m7211l2268k4144j5244j5888j9571k1424j5290o463J023
8314A69088k02L210k93m94N923J0707K1147K6323L6028O6401R5386J03021N8965
8301E95210k5205q8453j02662q3302n4402m4371l7985k2633r233l88L292L511
8289A33379K080m315o06N388l80m566m785J603O857L595R396K860N180L716J298
8274A60700N510L131L219Q351N962O822L741k624p606r577p140o84M993K1462
8260A96260L2118M4474M7350K7204o229l4896m3917l5469k3089j4818j5932j2534
$$ y = [317751, 365986, 390619, 378310, 346340, 311157, 286105, 272810, 266396, 276550, 304240, 355261, 433636, 554797, 740245, 1008107, 1327763, 1568564, 1576623, 1352248, 1041915, 771168, 581191, 452331, 365568, 318357, 286089, 261945, 246701, 230813, 211242, 189818, 174528, 168065, 169088, 168886, 172096, 171803, 171309, 177232, 187939, 209086, 235409, 271437, 337838, 433224, 536245, 595210, 570005, 481552, 378890, 295588, 241186, 196815, 158830, 136197, 126964, 126576, 129868, 133379, 135459, 131144, 130538, 135926, 135546, 130980, 126195, 127798, 134655, 138250, 147646, 150506, 155686, 159402, 160700, 166210, 169341, 172560, 180911, 186873, 193695, 197436, 194812, 187206, 177629, 170489, 169805, 174798, 196260, 228378, 272852, 320202, 347406, 341177, 306281, 262364, 226895, 203806, 188988, 173056, 160522]
8248A60522p881n521k882N43L58o067k932K476P833L353M176J1449J0087J2309
8234A87823J3511J167o077j0587j0408m857n857o30l585K547Q40p888j4011n420
8220A36568K037l958K631K394M712K906p99r44J565K878M41l40O31r621p165k723
8204A31213l597K319n82J310M390R324R358J1186k4k179l58o187q310n129p303
8189A35431L313M638J0628J2889J609r480m964n909p003m768j663j766l618p49
8175A28588M950K270o093n102K772r79k598K927J340n339j1360r748n123N775
8161A02280J1553P423J508M777R91k023q719p566k514k982L493N540K608N89O836
8146A23794M868P853J608m217l058q929j1937j4055n923p793j1951l294K313k118
$$ y = [160522, 152641, 147120, 144238, 144781, 145139, 139072, 136140, 138616, 146449, 149802, 153978, 165427, 175514, 187823, 201334, 202501, 196424, 185837, 175429, 170572, 164715, 164085, 160500, 163047, 163887, 155999, 141988, 136568, 138605, 134647, 137278, 139672, 144384, 147290, 146491, 145547, 147112, 149990, 150431, 150091, 150722, 141101, 133936, 131213, 127616, 129935, 129353, 130663, 135053, 144377, 153735, 164921, 164897, 162718, 162360, 156173, 147863, 142734, 135431, 138744, 143382, 154010, 166899, 168508, 159028, 154064, 148155, 141152, 136384, 134721, 132955, 129337, 128588, 133538, 135808, 129715, 124613, 127385, 126406, 123808, 126735, 128075, 122736, 111376, 101628, 96505, 102280, 113833, 121256, 122764, 127541, 128532, 126509, 117790, 110224, 107710, 104728, 108221, 113761, 116369, 116958, 123794, 128662, 136515, 138123, 133906, 130848, 121919, 109982, 95927, 90004, 82211, 70260, 66966, 69279, 67161]
8132F7161O86L372j225n82K885P890L602J487p82L085L254m204n989j496r65J591
8116G9770M626P817M027O908J0114R125P427J1210Q953N185J2545K6146L7369
8103B31222O2097R7944J66637K80383M31846M66607K01896k08244m25301l98777
8093I06310k81135j76470j12131p2274m6999l0185k4741j8372j5037k637k05j116
8081A25008l002p884o975m484P605J586K281M067N471J0783R095K534L724P053
8067A56862O471J0351J8462K6745M5730O6169J02543J68281K43967L21406L21103
8056A488090J68216r9625l05612l49253k72543j82992j16309o7228l8248k5698
8046A98798k1982r624p282j4992j0366k629j920n047p054j1404p001K217L236
$$ y = [67161, 67847, 71219, 69994, 69412, 72297, 80187, 83789, 85276, 84494, 87579, 90833, 86629, 80640, 79144, 78179, 79770, 84396, 92213, 96240, 103148, 113262, 122387, 129814, 141024, 149977, 155162, 167707, 193853, 231222, 293319, 391263, 557900, 838283, 1270129, 1736736, 1938632, 1730388, 1305087, 906310, 625175, 448705, 336574, 264300, 217301, 187116, 162375, 144003, 128966, 126329, 126124, 125008, 122006, 114122, 107147, 102663, 110268, 111854, 114135, 118202, 123673, 134456, 143551, 146085, 149809, 156862, 163333, 173684, 192146, 218891, 264621, 330790, 433333, 601614, 845581, 1166987, 1488090, 1656306, 1556681, 1251069, 901816, 629273, 446281, 329972, 262744, 224496, 198798, 176816, 167192, 159910, 144918, 134552, 131923, 130003, 124956, 117902, 106498, 99497, 101714, 104950]
8033A04950k930m367P67l72J952L78O466J088j153j887k321K305J267P182J0045
8018A23370P809M320Q687J1145R189O104O943P358N281P635J0773J2137J1938
8005B32689J1858J2282K1084K1596K8039L3838K4037K4900K5661L1748M0763N2108
7993E60603O0397P4966P8467P1080N3210L4263Q128p142k1386k0436j1836m253
7981H76061j207k292j1139p510p502j2755k0068j9484k0141j8048j5909j1354
7969G28652n662J578N887L850J582L203O151j017M481R533J9209L4297M2372N4523
7955I08639Q0568J06274J40838J88518K48520L55344M82782N53493L83836j3598
7945C435214l62166m84891m40972l49101k57354j77866j05827m4440L584M1046
$$ y = [104950, 102020, 97653, 98420, 98048, 100000, 100378, 106844, 107932, 106779, 104892, 102571, 104876, 106143, 113325, 123370, 131179, 135499, 144186, 155331, 164520, 170624, 177567, 184925, 190206, 197841, 208614, 220751, 232689, 244547, 256829, 277913, 299509, 327548, 361386, 385423, 410323, 435984, 467732, 508495, 560603, 621000, 695966, 774433, 845513, 898723, 932986, 941114, 933972, 912586, 892150, 880314, 876061, 874854, 872562, 861423, 853913, 846411, 833656, 813588, 794104, 773963, 755915, 740006, 728652, 722990, 724568, 730455, 734305, 735887, 739090, 745241, 744224, 748705, 758238, 777447, 811744, 854116, 908639, 989207, 1095481, 1236319, 1424837, 1673357, 2028701, 2511483, 3064976, 3448812, 3435214, 3073048, 2588157, 2147185, 1798084, 1540730, 1362864, 1257037, 1212597, 1216181, 1257227]
7935A257227N0520j0286j10655j60354j49097j08087p7713o0737l9607k5064j3132
7924E53015p822n318K060J0820K4529L6999O0677R2944J14964Q4193R982m5632
7912I31411m4456r930K1063N7313R4326J24413J60297J85834J76865J26122M5969
7901A869227m3286j25508j68059j70815j43422r4893m0125n079j0265n8981j12165
7890H96629j33775j12279q2422o1671n2584m2587l2754k3045k3834k1069j1610
7879B98999k691L095J2270K2612L7062M1152K0010k0178m1983l9092k0423j650
7867C09183P010K0053L4371N0302O4037O0643L7323O98k7938l9832m6069m4967
7855D24814n0455m4597k5509j6787j8817j8385k8776k8216j9570j4503k1296j9279
$$ y = [1257227, 1307747, 1297461, 1186806, 1026452, 877355, 769268, 691555, 630818, 591211, 566147, 553015, 545193, 539875, 541935, 552755, 577284, 614283, 674960, 767904, 882868, 967061, 977043, 931411, 886955, 877025, 898088, 955401, 1049727, 1174140, 1334437, 1520271, 1697136, 1823258, 1869227, 1825941, 1700433, 1532374, 1361559, 1218137, 1123244, 1083119, 1078040, 1067775, 1008794, 896629, 762854, 650575, 568153, 506482, 453898, 411311, 378557, 355512, 331678, 310609, 298999, 296308, 299403, 311673, 334285, 371347, 412499, 432509, 412331, 370348, 331256, 310833, 309183, 316193, 336246, 370617, 420919, 484956, 545599, 582922, 583620, 555682, 515850, 469781, 424814, 374359, 329762, 304253, 287466, 268649, 250264, 221488, 193272, 173702, 159199, 137903, 118624]
7843A18624j2617n955k152m552q138o174n005l809K315n74n075J54k566O616J519
7828G2611k219m564o136p423k936P21j664p438n529O57L301j08J84L632J023q44
7812D3268M10K338n42k880m255q813K854K225j242l43L131l864n944j270l109
7797B1964j178k355O201n803m73k398j806j303j430j852j341O438P660N57l450
7782A9431l106n160L7p56m506q38K940j503l003J700K773M057q68p607l568K216
7766B239l429j974K88m284k023m319O631j257L98k84K626K951M783l031j100O81
7750a104k904r48k224j758K499R009O688O09l611j688l969k494l362j385J226
7735e416k432k044L411j694M507l89J925k708j899K849k647m16j523j234J491
$$ y = [118624, 106007, 100052, 97900, 93348, 85210, 79036, 74031, 70222, 72537, 71963, 66888, 67042, 64476, 71092, 72611, 70392, 65828, 59692, 52269, 49333, 50054, 48390, 40952, 35423, 36080, 39381, 39273, 39457, 43089, 44112, 43268, 43678, 46016, 45474, 42594, 38339, 29526, 32380, 34605, 33363, 33020, 36151, 32287, 26343, 25073, 21964, 20786, 18431, 24632, 18829, 18356, 15958, 14152, 12849, 11419, 9567, 8226, 14664, 22324, 22881, 19431, 16325, 11165, 11202, 10446, 5940, 5102, 8042, 6539, 3536, 5236, 8009, 12066, 11198, 3591, 23, 2239, -1190, -3164, -2876, -7160, -9183, -13502, -6871, -8128, -7730, -8014, -5388, -2437, 2346, -685, -1785, -1104, -4008, -4956, -7180, -8938, -6439, 2570, 9258, 9867, 6256, 4568, 599, -1895, -5257, -6642, -5416, -7848, -9892, -6481, -8175, -3668, -4057, -2132, -4840, -6739, -3890, -6537, -6953, -8476, -9710, -8219]
7720h219N694m224k723M958L517j005Q10O47r75N27M632J12m075j576J243J524
7704H67K320K414p59j601j727m306j741K297j575j193O90K208n34q41K984m45
7688i42n673j999R69J760M091p88m704k195K067K9j39J173M61k949n75l640J26
7671a2928N567J89O67L614J067k731k319k480J597L230j7J662L614J566J443o03
7655C138n354m971J366L381N0j753O49j355j01J471M21j068l612J591K476K285
7639a386q62j885J68m383J008J077m554m763M706K060M25k03k172J819O111k488
7623e322l107J074O861R08m242k253m314n359j070N468Q84L030K033j187n827
7608a2423m120j305P87M001L634K290J709k998J052L333K205O98j024m414K275
$$ y = [-8219, -2525, -6749, -9472, -4514, -997, -2002, -1192, -545, -1520, -993, 3639, 3751, -324, -1900, -657, 867, 3187, 5601, 4842, 3241, 1514, -2792, -4533, -2236, -3811, -5004, -4314, -2106, -2640, -3481, -497, -942, -6615, -8614, -7645, -5885, -1794, -2582, -7286, -9481, -7414, -7385, -7524, -6351, -5890, -8839, -9414, -13054, -12928, -7361, -7172, -6505, -2891, -1824, -4555, -6874, -9354, -7757, -4527, -4544, -2882, 732, 2298, 3741, 3138, -2216, -7187, -5821, -2440, -2390, -4143, -3494, -4849, -4950, -3479, -3058, -4126, -7738, -6147, -3671, -1386, -2248, -4133, -3965, -8348, -7340, -6263, -10817, -15580, -10874, -8814, -8389, -8592, -10764, -8945, -2834, -5322, -8429, -7355, -494, 414, -3828, -6081, -10395, -15754, -16824, -11356, -10472, -7442, -5409, -6596, -12423, -16543, -17848, -17061, -13060, -9426, -7136, -5427, -8425, -7373, -4040, -1835, -1137, -2161, -6575, -4300]
7593d300N875J142o162L057M189j526l935n682j549j167p0k259k683l680k765
7578b1515N328N555m70J855N556n021K425j280J341J532N86k268L238n43p41j388
7562e810L395j898J801J340m08k046l008j504M370K736P3L860p70N14k641m928
7546d924J085K752j940Q07L041O31n005M394R8l300j660j020K721r2K892N23m742
7529c739K540j277m715L335P01J132M251m24k801l86n312j911O108L519P61J663
7513C445L74Q23L74n587K07k709L458R081K248r096n798m578L651K998r84L699
7497A606K601l443n07m811o185j022J955j985q54P67j272k970L276N764K500j822
7481f402J186J035l989l611L112p69m459P78J658j390L554K02j008K310J259J532
$$ y = [-4300, 1575, 2717, -3445, -388, 3801, 2275, -1660, -7342, -8891, -10058, -10128, -12387, -15070, -18750, -21515, -16187, -10632, -11102, -9247, -3691, -8712, -6287, -7567, -6226, -4694, -4108, -6376, -3138, -3681, -4422, -5810, -2415, -4313, -2512, -1172, -1580, -3626, -6634, -8138, -3768, -1032, -959, 2901, 2131, 2645, 4, -4924, -3839, -1087, -3027, -2220, 821, 1452, -3553, 841, 939, -2361, -4021, -5041, -2320, -2412, 480, 1003, -3739, -1199, -2476, -7191, -3856, -3155, -2023, 2228, 1804, -997, -1383, -6695, -8606, -2498, 1021, 1782, 3445, 3819, 4642, 5016, -571, -364, -3073, 385, 9466, 11714, 2618, -3180, -7758, -4107, -1109, -2093, 1606, 4207, 764, 257, -4554, -10739, -11761, -9806, -11791, -12645, -11878, -13150, -16120, -12844, -7080, -4580, -6402, -5216, -4181, -8170, -11781, -8669, -9438, -13897, -13119, -11461, -12851, -9297, -9095, -10103, -7793, -6534, -5002]
7465e002M0l35K914Q43l820J435K676N309L437n695p215j152k874j336K58L724
7449f793l274L009P911K530j946n083k796k57p39J553J422J50l090o106q156O87
7433b0978n51J607k03L649J3595P128l941j306n018o886j079O662K940j407J615
7418d173M315J89j967J936K10l700j428L984k931n046j812K991K265k704L6J888
7402e947K837k575Q52l81k006J64m26L461J47J296l34l718k018L920M110n468
7386f086m227j878L158l26N44N60l391P295o49j766L330J671N67q93L684K783
7370D376R78m904n046k843K763J385l483J540r17j733l67N154q16j822K622K012
7354a101m34m374p67J871K419l004j345Q53l745p34k90M290m124k31k940j047
$$ y = [-5002, -4962, -5297, -2383, -1540, -5360, -3925, -1249, 4060, 7497, 1802, -5413, -6565, -9439, -10775, -10517, -6793, -10067, -7058, 853, 3383, 1437, -3646, -6442, -6699, -7438, -5885, -4463, -4313, -7403, -13509, -21665, -20978, -21529, -19922, -20125, -16476, -2881, 4247, 306, -1000, -6018, -12904, -13983, -7321, -4381, -5788, -4173, 142, 331, -1636, 300, 510, -3190, -4618, -634, -3565, -8611, -10423, -7432, -5167, -7871, -7835, -5947, -3110, -5685, -4833, -5214, -7220, -7056, -7482, -4021, -3874, -2578, -2912, -6630, -8648, -4728, -618, -6086, -10313, -12191, -9033, -9359, -8815, -8255, -11646, -4351, -5000, -6766, -3436, -1765, -1198, -2091, 1593, 4376, 5354, 450, -4596, -7439, -4676, -3291, -6774, -5234, -6151, -7884, -8251, -3097, -3913, -5735, -3113, -1101, -1535, -5909, -6676, -4805, -2386, -5390, -6735, -5882, -9627, -10361, -10651, -6361, -10485, -10716, -13656, -14703]
7338a4703O22m472N16N884N037M083P39m984K400O513L264O81j151q930p104N101
7322f504J532l429j767l74M156J497j664L164O73K191J586K415k070l410m405
7307f409m636j391k054M272O484K31n652j507P296M222l633l336l46k19k228n39
7291i445K589J183K370k728k965P38R22k795O63M731L741K377Q99M493j805m414
7275E54k955m120l27J294J180P67m603L63K734J588j348M296M417m46n385k120
7259d111L687j212N4J983j469k143p33L688K847k625k587l628M77N43p09J86K894
7242b858J086J632J346j745k226J148l854k506R01J730M0j020j719j505J131k545
7226a0964j902K672K949l392j536K074r88R52k59j53K240j061K708K3p086J777
$$ y = [-14703, -14081, -18553, -18037, -12153, -7116, -3033, -2294, -7278, -4878, 1635, 4899, 5580, 4429, -4501, -11605, -6504, -4972, -8401, -10168, -10542, -6386, -4889, -6553, -3389, -2716, -525, 1061, 3476, 1406, -2004, -6409, -11045, -12436, -14490, -10218, -3734, -3503, -9155, -10662, -3366, 856, -2777, -6113, -6459, -6678, -8906, -9445, -6856, -5673, -3303, -6031, -8996, -8258, -7336, -10131, -9468, -4737, -996, 1381, 2280, 6773, 4968, 554, -2401, -6521, -6848, -5554, -4374, -3607, -8210, -7847, -5113, -3525, -4873, -577, 3840, 3394, -1991, -4111, -424, -1636, -1582, 401, -1068, -3211, -3944, -256, 2591, -34, -2621, -6249, -5772, -5229, -5938, -5752, -2858, -1772, -140, 1206, -539, -2765, -1617, -5471, -7977, -7076, -5346, -5306, -6326, -8045, -9550, -8419, -10964, -12866, -10194, -7245, -10637, -12173, -10099, -11087, -10135, -10394, -10547, -8307, -9368, -6660, -6637, -13723, -11946]
7210a1946j050k146J370p27M019n50l145L116N538M720p13l976L687J148l410
7195d065m659l486n093j357q93K715J744P69J43n67j088O408N177O198n28n200
7179c782n458K296J92k65k588J628o81j90L252N127J530M19m065q55O023N298
7163G881J345o328J256j236l244J249p56R30m981l472N45N259k299p556j930N306
7147h031N766K897N93J301j985K57J905l258p279l627K328L032K276M782l332
7132b375l101K340L239L941J308p26m617m689l415k722K82K578M975j68L543m392
7116c999q927l029P256Q771M980m784j1028l990R9l297o95L580R842R144K738
7101F661M030L69n791o455J319L078l940j035o238n081j017K360L847N815L910
$$ y = [-11946, -12996, -15142, -13772, -14499, -10480, -11030, -14175, -11059, -5521, -801, -1514, -5490, -1803, -655, -4065, -8724, -12210, -17303, -18660, -19553, -16838, -15094, -14325, -14182, -14749, -15837, -9429, -4252, 1946, 1418, -3782, -9240, -6944, -6752, -7017, -9605, -7977, -8658, -8848, -5596, -469, 1061, 1480, -2585, -3440, 2583, 7881, 9226, 2898, 4154, 2918, -326, 923, 167, 1097, -3884, -7356, -6811, -1552, -3851, -11407, -13337, -8031, -2265, 632, 1225, 2526, 541, 798, 2703, -555, -7834, -11461, -9133, -6101, -3825, 957, -2375, -5476, -3136, 103, 4044, 5352, 4626, 9, -4680, -8095, -10817, -10535, -7957, -2982, -3150, 393, -3999, -12926, -15955, -8699, 72, 5052, 268, -10760, -14750, -14651, -17948, -18643, -15063, -5221, 3923, 6661, 10691, 11060, 5269, -1186, 133, 3211, -729, -1764, -8002, -13083, -14100, -11740, -7893, -2078, 1832]
7086A832k035J004O98n164J008Mo596q63J011J587j0n570P94L383L159J02j031
7069f687q09J972P48l032l81O21m291l824M208Q336K994k653j350j421R83J730
7053b856J690K305k48l327k940K002K577J759L357J879n99l917L665j329r955
7038e937m56M219K541j370j539k435o069n10L813L375L820J854k823j105L312
7023F90l663J17q37O171K763K975L240o764l727l01o972n040j897L307L316M031
7007b591P11j591J398Q50k185l110l190K302r8O35J952j761j509J53j936J477
6991h493N711P023P63l285Q97N536J786j634l748q407k117o37J636j431k097K538
6975e959J432K462J760m822m355J81l312Q003M365l386k852j667j390L150L725
$$ y = [1832, -203, 801, 1499, -3665, -2657, -2653, -9249, -10112, -9101, -7514, -7524, -13094, -12300, -8917, -5758, -5656, -6687, -7496, -5524, -4776, -7808, -8189, -7568, -11859, -15683, -11475, -3139, -145, -2798, -4148, -5569, -4586, -2856, -1166, 1139, 891, -2436, -5376, -3374, -797, 962, 4319, 6198, 5599, 1682, 5347, 4018, -5937, -6393, -2174, 367, -1003, -2542, -4977, -11046, -11556, -7743, -4368, -548, 1306, -1517, -2622, 690, -2973, -2856, -3693, 2478, 5241, 8216, 11456, 4692, 965, 664, -6308, -11348, -13245, -9938, -6622, -2591, -1880, -3471, -2073, -1223, -3408, -6518, -9708, -7406, -7504, -6869, -4917, -6678, -8187, -8034, -9970, -8493, -2782, 4241, 5004, 1719, 2616, 8152, 9938, 8304, 4556, -3851, -5968, -6605, -4969, -6400, -8497, -5959, -4527, -2065, -305, -5127, -9482, -9301, -12613, -4610, -245, -3631, -6483, -8150, -9540, -6390, -2665]
6960b665J640J531R17k207j97q15k705K808Q01N39n493k579K35J1913J197n866
6944i46m415P493J1076q28j7155j2878L849K1481K7205K5391J8399J485j0533
6931F9624k6753l3853k2669p418Q197J1712L537k528j428J810M351O91o726j655
6917c108P61m465k625L863K138o534k062M02L347K167K883M020r00q600k229M031
6901f911L990K246m919p842l302J803O148J650n24j638M216M63m914K339M23J382
6885e390K381K353K29n68r960m71R709J440j506J905k457J324K60p095K555N213
6869g8K507l275k375K114m958J977N200N021m489m202J277k332k054L828O692
6854D853j630l134n513j02N934J509k854l761k76o74L613n70k14Q48k617L95O57
$$ y = [-2665, -1025, 506, 1423, -784, -981, -1796, -4501, -1693, -892, -353, -5846, -8425, -8190, 3723, 4920, -946, -5361, 2132, 13208, 12380, -4775, -17653, -13804, 7677, 34882, 60273, 78672, 80157, 69624, 42871, 9018, -13651, -21069, -12872, -1160, 2377, -151, -1579, 231, 4582, 5273, -1453, -3108, -2347, -6812, -9437, -5574, -3436, -9970, -12032, -11630, -8283, -6116, -3233, 787, -113, -8713, -10942, -6911, -2921, -675, -5594, -13436, -16738, -14935, -8787, -7137, -7661, -9299, -5083, -4620, -9534, -7195, -6772, -5390, -3009, -656, -427, -995, -10955, -11426, -1717, -277, -1783, 122, -2335, -1011, -751, -7846, -5291, -78, 2429, -846, -3221, -1107, -6065, -4088, 1112, 6133, 1644, -2558, -1281, -3613, -5667, -1839, 4853, 3223, 89, -5424, -5526, 408, 1917, -937, -4698, -4974, -5648, -2035, -2605, -2819, -1971, -4588, -4193, -3536]
6837c536J527M323J521m116n63l9K13j48m414r29L207N358M543m070j498k122
6821g43l583L045M828j294n623l302L795M416N497m618q145n274r06J0410Q619
6806G122K955N758N150r37r303o681k661n38J385k85j303L945L177k089j270K838
6790G263q57k796j048M2M867M224p45o785l036J38J691N221K051o34k398M22K723
6773A0343M855n679j2212j832J3119R313l495j0689j1607l861J3042J3280L240
6760A7817M007K627l869j4193j2954J977J2772L916p961n873j634O890M694l297
6746D919j673N801K985L955l560m752K840P36k974l560o407L605N948l44k833
6731D686p45J851M193K084M2J250p23j386J064J423n403n793K003K413J012K346
$$ y = [-3536, -2009, 2314, 3835, -281, -844, -883, -670, -818, -5232, -6161, -2954, 2404, 6947, 2877, 1379, -743, -4326, -1281, 3547, 2253, -3370, -6672, -2877, 1539, 7036, 2418, -5727, -11001, -11907, -1497, 7122, 10077, 15835, 20985, 20048, 10745, 4064, 1403, 865, 2250, 1965, 662, 4607, 7784, 5695, 4425, 7263, 6406, 3610, 2562, 2604, 7471, 11695, 10950, 4165, 1129, 1267, 2958, 8179, 10230, 9596, 7198, 7620, 10343, 15198, 9519, -2693, -4525, 8594, 17907, 14412, 3723, -7884, -11745, 1297, 14577, 17817, 21824, 24451, 20582, 6389, -6565, -4588, 8184, 12100, 4139, -1734, -3368, 3522, 8216, 4919, 3246, 9047, 12032, 15987, 12427, 7675, 10515, 11251, 8277, 4717, -1690, 1915, 7863, 7519, 4686, 3941, 5792, 9985, 12069, 12111, 13361, 12638, 11252, 12316, 13739, 8336, 2543, 4546, 6959, 7971, 10317]
6715A0317N00L378K538m038j565K590J392O073N981L251l77R52O797M830L288
6700D5907K967o41J2627J5612K5048K7579J8351O47j5754j6898j7486r575j181
6687H7203J174O724Q228J0826J6916J6615K1896L5054M2295O0081R0802J38070
6675E35884K02303L03093M28608N38099M82186R2124l92721n84969n00912l50883
6665G52812k24714j53490j00835o4013n0347l5052k1970j9916j3826j4677m768
6654D9204J186J158J959q21k647J0932J3647M151n246j0202j3765q973q520o351
6640B5712l567m1l566m171j185l28l317Q25L51R073Q342N32k953l576l27k459
6624A9345j776k677m550l022r11O18J003k217l82M249l953n780m729L971j708
$$ y = [10317, 10817, 14195, 16733, 12695, 11130, 13720, 15112, 21185, 27166, 30417, 30040, 30992, 37789, 42619, 45907, 48874, 48233, 60860, 76472, 101520, 129099, 147450, 148097, 132343, 115445, 97959, 88384, 87203, 88377, 95101, 103329, 114155, 131071, 147686, 169582, 204636, 246931, 307012, 397814, 535884, 738187, 1041280, 1469888, 2007987, 2490173, 2582297, 2189576, 1604607, 1103695, 752812, 528098, 374608, 273773, 209760, 159413, 124361, 102391, 82475, 68649, 53972, 49204, 50390, 51548, 53507, 52686, 50039, 60971, 74618, 78769, 73523, 63321, 49556, 40583, 32063, 25712, 22145, 22104, 18538, 14367, 13182, 12854, 9537, 10362, 10713, 19786, 28128, 28660, 25707, 22131, 21804, 19345, 17569, 14892, 10342, 7320, 6409, 7027, 8030, 5813, 5431, 9680, 5727, -53, -4782, -811, -2519]
6609b519m309L079M657J35l572R60l594N82J507j63J745J674M73l633l909M019
6593b868l793l23K088j513J257K407M564R53J939K005q90j656k816m857k138j534
6577g175k393n40N478R22O13J97r07L301K266K869k29K132m259j677n78J717j06
6560A631o96j810j756k420M304M180l181j306P22q06O89O768k2o211m930k261
6544g105j506j388N786J387J224K247J989j013N651n803r277k450j595J238K548
6529h067q38j174J66M549J137l253p99O83M361m39n765j929K185N160L665J23
6513b35m558p699K053M487l14m964J718J0679K168j342j166k214j513n019j280
6498i199R760J316l404n863k516L264k088K993N368j417m745M459L823m944l865
$$ y = [-2519, -6828, -3749, 908, 1043, -2529, -1569, -5163, -4581, -3074, -3237, -1492, 182, 655, -2978, -6887, -2868, -6661, -6984, -4896, -6409, -5152, -2745, 1819, 2772, 4711, 6716, 5826, 4170, 1354, -3503, -5641, -7175, -9568, -10108, -4630, -3708, -3095, -2898, -3805, -504, 1762, 4631, 4402, 6534, 2275, 598, 20, 1737, 1631, 935, -875, -2631, -5051, -747, 3433, 252, -1054, -332, -1138, -449, 6319, 6297, 86, -4844, -7105, -8611, -9999, -4213, -2826, -1602, 645, 2634, 1621, 7272, 1469, -7808, -10258, -11853, -10615, -8067, -8905, -10079, -9913, -5364, -4227, -7480, -8279, -7596, -3235, -3674, -9439, -11368, -9183, -4023, -358, -235, -4793, -12492, -10439, -5952, -6266, -11230, -9512, 1167, 3335, 1993, 827, -1387, -2900, -7919, -9199, 561, 1877, -1527, -7390, -9906, -6642, -8730, -5737, -369, -1786, -6531, -2072, 1751, -3193, -7058]
6483g058K588p1j729K747N872l467j707L926M576l364j660o007J722J209r13l702
6467g038l111K460K080M60l208k731M817M524p83k996K172K407J480M245j231
6452C547j598J322J97l394l98n5k513K150j153K17q22L750k072k486K807R71n796
6435e326l335N172K737J722k172l651J682L614M489M534n32p400m753k092R23
6420d388N91j795k42k104n97O313R35K349k126k765o53J657j478N6P62j438k948
6403g871l437J155M097R14L7M237j49k115M272J711k351K652j489k831P87p624
6387h005j872r62L487K718J354m767j770L504J706J269j965J25K955k197k630
6372g050k379J305J494L377j659m95R86M131L272n465q181r49J804m061k252M462
$$ y = [-7058, -4470, -4541, -6270, -3523, 2349, -1118, -2825, 1101, 5677, 2313, 653, -5354, -3632, -2423, -3336, -7038, -10149, -7689, -5609, -5149, -8357, -11088, -6271, -1747, -2530, -5526, -3354, -947, 533, 4778, 3547, 1949, 3271, 3468, 74, -324, -379, -2892, -742, -1895, -1678, -2500, 1250, -822, -3308, -501, 470, -5326, -8661, -3489, -752, 970, -1202, -4853, -3171, 443, 4932, 9466, 8934, 1534, -3219, -5311, -4388, -3797, -5592, -5834, -7938, -8535, -2222, -1287, 1062, -1064, -3829, -4482, -2825, -4303, -4247, -3485, -4923, -7871, -11308, -10153, -6056, -5142, -5105, -868, -1017, -3132, 1140, 2851, 500, 3152, 1663, -1168, -381, -8005, -9877, -10839, -7352, -4634, -3280, -8047, -9817, -6313, -4607, -3338, -5303, -5178, -2223, -4420, -7050, -9429, -8124, -6630, -3253, -4912, -5407, -4421, -290, 2982, -2483, -10664, -11613, -9809, -13870, -16122, -11660]
6356a1660M670L135M3K49N96n452J532L455j456j529O95J721K431l235J637L315
6340A47j817J116P068l96l084P25o074j0003J798K347J851j399k452m48j079m056
6324a5756k628L678M564N128O251K038l600m955J218K438K067J893L987N77R6
6309F996l15o366k165K463M838l839j1854n489N278L871K964j416m694K974P152
6294C98N668l137J592Q560K32q096r210l515K516M722J445o073k218Q4K432J848
6278b752K715K157k905j1438j027K345P58O697M513P5n154j242J059M695J651
6263B147j394l407k794j769l693L761P069K09l02j24J000j287J349L471m229l061
6247c054Q97M15k86j242K085N32l379j902L535K122K961j113k063J331m3J314
$$ y = [-11660, -6990, -3855, -3812, -3563, -2967, -8419, -6887, -3432, -4888, -6417, -5722, -4001, -1570, -4805, -3168, 147, -1670, -554, 6514, 6118, 3034, 3759, -2315, -12318, -10520, -8173, -6322, -7721, -10173, -10621, -11700, -15756, -18384, -14706, -10142, -5014, 1237, 3275, -325, -5280, -4062, -1624, 443, 2336, 6323, 6900, 6996, 6681, 315, -1850, 613, 5451, 1612, -10242, -15731, -10453, -6582, -3618, -5034, -9728, -6754, 398, 6066, 2929, 4521, 13081, 13313, 5217, -3993, -7508, -4992, -270, 1175, -4898, -7116, -7032, -4600, -2752, -37, 2120, -785, -12223, -13250, -10905, -10147, -3450, 1063, 1138, -4016, -5258, -4199, 496, 2147, 753, -2654, -5448, -7217, -10910, -7149, -80, 129, -173, -297, 703, -584, 765, 4236, 7, -3054, -2157, -1742, -2028, -3270, -1185, -653, -4032, -5934, -2399, -277, 2684, 1571, -492, 839, 796, 2110]
6231B110K958m268p628l760o35L810J688j462j570O540J86l162l67p2J832P266
6215C466O255l762q166L87J721M876n056m604n636N440L912K058M825L350j313
6200G753J218k294J144n082k213L442J377l033l990M27j921k244j434M076L179
6185D05l51l440O265k806m596k395l400o700M566O292J383r18J005M845P545J206
6169H906o701q62J754J752J232o302n544O44K381m522N288O998j618p102L18M103
6153G25j641J528L223L172l095l221M675K549n808n088k461Q01N652O605j220
6138F396l647o254N077M500K271j325n779q509J132K467K275N062N28J683o261
6123c84q590j137P357M091l96j769J440M5j857K035J33K54K388l870p592L665
$$ y = [2110, 5068, 800, -6828, -10588, -11223, -7413, -5725, -7187, -8757, -2217, -2031, -5193, -5560, -5632, -3800, 3466, 9721, 5959, -2207, -1820, -99, 4777, -279, -4883, -10519, -5079, -1167, 891, 5716, 9066, 7753, 8971, 6677, 7821, 2739, 526, 3968, 5345, 2312, -1678, -1251, -3172, -5416, -6850, -2774, 405, 54, -3386, 2879, 73, -4523, -6918, -10318, -17018, -12452, -6160, -4777, -5695, -4690, 155, 7700, 8906, 2205, 1343, 3097, 4849, 6081, -221, -5765, -5121, -2740, -7262, -1974, 5024, 3406, -3696, -3378, 725, -916, 612, 3835, 7007, 3912, 691, 5366, 7915, 2107, -2981, -5442, -4641, 1011, 7616, 6396, 2749, -3505, 1572, 6072, 8343, 7018, 1239, -7270, -6138, -3671, -1396, 3666, 4194, 5877, -384, -8974, -10111, -2754, 1337, 941, -828, 612, 657, -1200, 835, 968, 1222, 3610, -260, -7852, -4187]
6107d187O349K32j664M52j319J633J630J299k814l994J080k396l187l768J530
6092i124N463N25p8K867m064K030O16m363K326J334j296L457k98l43N841R24k470
6075C347L14q16p31m137m757J322J1129O461k637J20j334k948l149r03K756J428
6059E465m91K412l728r46K83o70k162R81K11k406m098J231O74j927l361k161J84
6042a0509k0J731K608j736k871J005M661L854J373k840l842j343l78O700M412
6027B805j913r011M49J069L505J113R24M99J608J659l206m359Q02k088J018J121
6011d005k420j220N35J683K007M225L387j085l039l406J971M905K391j797q72
5996C260j886N25M53k811j508K382K041j558Q22J238J648K421n049j59N805J221
$$ y = [-4187, 2162, 2394, 730, 1182, -137, 1496, 3126, 4425, 1611, -2383, -1303, -3699, -6886, -10654, -9124, -3661, -3136, -3214, -347, -4411, -2381, -1765, -6128, -3802, -2468, -3764, -307, -605, -948, 4893, 5817, 3347, 3661, 2845, 2114, -2023, -6780, -5458, 5671, 12132, 9495, 9615, 8281, 5333, 2184, 1281, 4037, 5465, 4974, 7386, 3658, 2712, 2995, 2325, 163, 1144, 1355, -1051, -5149, -3918, -3244, -5171, -8532, -10693, -10509, -10529, -8798, -6190, -7926, -10797, -9792, -5131, -1277, 96, -2744, -6586, -7929, -8307, -1607, 2805, 892, -8119, -7670, -6601, -3096, -1983, -1059, -560, 1048, 2707, -499, -4858, -4056, -6144, -5126, -4005, -6425, -7645, -7110, -5427, -3420, 805, 4192, 3107, 68, -3338, -1367, 3538, 5929, 4132, 3260, 1374, 1899, 2352, -459, -1967, 415, 2456, 898, 1720, 2958, 4606, 7027, 1978, 1819, 7624, 8845]
5980H845n53j544k176l198K49O31m481n556P50O565P414j307l159n262j88J280
5964a690L814K365j805k92m070j673l190O888Q669l081J43j986p75J45J395K404
5948G261j887l610M53k032k260n49k067P13M31j076n124k530K09O979j963L765
5932c287q10L536K015J26n651l44K491K511O39k30j997j239r81R3p0q60M56J830
5914a772L942J517l475J656L313l032j316j118k680J359l70J91m63p7L35M377
5898B387j082J671K520K261J937J483o650l512o047k677L262P11K591L543o25
5883A773l21M78J827j926k835l43L463m70l029L436n5k093K492o49j233J614M551
5866F680p38L68J057p55k826n443o046N272J914K635L144M685K409l538J791k333
$$ y = [8845, 8292, 6748, 4572, 1374, 1623, 2254, -2227, -7783, -7033, -468, 6946, 5639, 2480, -2782, -2970, -1690, 2124, 4489, 2684, 2392, -1678, -3351, -6541, 347, 9016, 5935, 6078, 4092, 3317, 3462, 4857, 7261, 5374, 1764, 2217, 185, -2075, -2624, -4691, -3978, -3547, -4623, -9747, -12277, -12068, -5089, -7052, -3287, -4097, -561, 1454, 1580, -4071, -4415, -1924, 587, 1226, 996, -1001, -2240, -3221, -3128, -3198, -4058, -3602, -1772, 2170, 3687, 212, 1868, 5181, 2149, 833, -285, -2965, -1606, -1976, -1785, -2248, -2325, -1990, 2387, 1305, 2976, 5496, 7757, 9694, 11177, 4527, 1015, -5032, -7709, -4447, -3736, -1145, 2398, 1773, 1452, 1930, 3757, 1831, -1004, -1347, 2116, 1646, -1383, 2053, 1998, -95, 2397, 1748, 515, 2129, 6680, 5942, 6310, 7367, 6612, 3786, -1657, -7703, -2431, -517, 2118, 5262, 9947, 12356, 8818, 10609, 8276]
5850H276m589m202m761K534K995M172J089j01o57l776m547J362J027r43j766m067
5834g954J172M632J067r05O48J633L909M753O0k327q34o466k2l89J002N49p049
5817f521j45L248l795o22Q58K778K576K427P075K637n739k739k164j739J825j276
5801a316j559n442l348K519K225k43k669Q241J387j340M588K310k02L562J368
5786A0081j758k114k817o304L935M829M91K722j809l649j818K596M744n53l860
5771D716k850J391J020r04J02l907m129L087r39j639J923J718k309K980N926K15
5755F401j911m185k538L323K012l148l960JO182r21k4L740n72n729K87k080j410
5738d532K236N447r499j603M364J003P37L592n13l877j700L565j757j886n022
$$ y = [8276, 3687, -515, -5276, -2742, 253, 4425, 5514, 5413, 4756, 980, -3567, -2205, -1178, -2121, -3887, -7954, -6782, -2150, -1083, -1988, -1340, 293, 4202, 8955, 9015, 6688, 5854, -612, -634, -1023, -21, 528, -6521, -6666, -3418, -7213, -7835, -6977, -4199, -1623, 804, 7879, 10516, 4777, 2038, -126, -1865, -40, -1316, -2875, -8317, -11665, -9146, -6921, -7164, -9833, -1592, -205, -1545, 3043, 5353, 5151, 8713, 10081, 8323, 6209, 3392, -2912, 1023, 5852, 6343, 9065, 7256, 3607, 1789, 4385, 9129, 8576, 4716, 1866, 3257, 4277, 3373, 3475, -432, -4561, -1474, -2413, -4052, -2129, -411, -2720, 260, 6186, 6401, 4490, 305, -2233, 1090, 3102, -46, -4006, -4005, 2177, 1256, 1232, 4972, 4400, -1329, -1042, -3122, -4532, -2296, 3151, -6348, -7951, -3587, -2584, -1847, 1745, 1232, -2645, -4345, -780, -2537, -4423, -9445]
5723i445n350K489O979N078K763Q82j123j733j568q17l994k575O668m175n302
5708a1223N246M222N498L847L423m246o765O308M525J713k358l082l39j527q42
5693D400m424m447l795J457N565K168q15L060m966j906R64l78K583O020N31K303
5677H320n221n232l261j401N67N046J06M37j250j26N867m5l5o18j501n21K811
5660C943K001O28l153k10L59j076q05j208m9K514Q53J584k653J503q98l326l74
5643c67m249n431L317L616l745K857J685q41K549K26J97J286p17K990J041j114
5627C300n831k880j646k963O171M110M625j72K283l040p555M48J71J148P079j79
5611E069m545o050L48L757R36j12J159J171J696K789j543k966j328L89l189k978
$$ y = [-9445, -14795, -12306, -5327, -249, 2514, 3396, 2273, 540, -1028, -1845, -5839, -8414, -1746, -5921, -11223, -5977, -1755, 3743, 7590, 11013, 6767, 2, 6310, 10835, 12548, 10190, 7108, 6769, 5242, 4400, -24, -4471, -8266, -6809, -1244, 924, 109, 3169, -1797, -3703, -2739, -3117, -534, 5486, 6017, 8320, 3099, -2133, -5394, -6795, -6228, -1182, -1076, -639, -1889, -2015, 3852, 3807, 3772, 3154, 1653, 1132, 3943, 5944, 6572, 3419, 3209, 3568, 2492, 1687, 479, 430, 2944, 3797, 5381, 2728, 4231, 3333, 7, -367, -4616, -10047, -6730, -3114, -6859, -4002, -2317, -3158, -609, -383, -186, 1100, 383, 3373, 4414, 3300, -2531, -5411, -7057, -10020, -3849, 261, 4886, 4714, 6997, 3957, -3598, -3150, -2979, -1831, 5248, 5069, 524, -5526, -5178, -1421, -485, -597, 562, 1733, 3429, 6218, 4675, 1709, 381, 770, -2419, -5397]
5595e397j212k68L738L669L040L964k489k085k568J267K580k075L915l5j508o870
5579b334k359K555L589j992j495K284O439L675o049m203J67k147K74K40N16j631
5563b471m575p43M730j700K37K283K005J016K409l98J162m05r92j204J227p389
5547d808r50j452j572k76K325M749j287n859m94K957M919N080m24j522k490Q6
5531a018L052k67P57M944K205J05j316q554j641M753o58k833J821L396k923n262
5515c439k424n650j524O287N715O19r75p74k791j910L395M829P406J252o629k186
5499A201J956l547P40m9L44j461J193o037Q62n66n240r3J455N341L332k581J130
5482b020K925J759K521l444k305k749q52j114k790L179N386R117J529n010k316
$$ y = [-5397, -6609, -6877, -3139, 530, 3570, 7534, 5045, 2960, 392, 1659, 4239, 2164, 6079, 6044, 4536, -2334, -4693, -2138, 1451, -541, -2036, 248, 6687, 10362, 4313, 110, 277, -1870, -1596, -1356, -840, -2471, -7046, -7789, -3059, -4759, -4522, -2239, -234, 782, 3191, 2793, 3955, 3550, 2558, 1354, 2581, -4808, -5758, -7210, -8782, -9058, -6733, -1984, -3271, -9130, -9624, -6667, -1748, 3332, 2908, 1386, -1104, -1018, 2034, 1767, 2524, 7468, 9673, 9778, 8462, -92, -1733, 3020, 2362, -471, 1350, 4746, 1823, -3439, -5863, -11513, -13037, -6750, -1035, -416, -1391, -2165, -4956, -6866, -3471, 1358, 8764, 10016, 3387, 1201, 3157, -390, 350, 301, 645, -816, 377, -5660, -4798, -5364, -10604, -10697, -9242, -3901, -569, -3150, -2020, 905, 2664, 5185, 1741, -564, -3313, -4165, -5279, -8069, -4890, 496, 9613, 11142, 6132, 3816]
5467C816n44l321n341J86L921L817j791J174K16N12J951q96j71p54l345j488K553
5450D95K809k098l606N401M577l320L45M9j835K333M315J145mK585k063k451k086
5433F591O0o185j074q51J326M204j570m382J909L802L488p29m640j04p44K535
5417C636N971K386k087L135j842j666K269K253M92o792k48J958j595J377n80k263
5401F404j137l176K462R12j506L972J755J631k13N86l104j193j461k6q38K499
5385G567k192j07j877q984J264J3277k7n960k32n68j232J58j15O165o41k999m970
5368a473n781N633M306K892J449k264m90K312R57R16l387k118r50J998L57l2N50
5351D875j607P18R1K32K400M294k035o229j241Q37O35K812M13Q84m331j973m312
$$ y = [3816, 3272, -49, -5390, -5204, -1283, 2534, 743, 1917, 2133, 2645, 4596, 3700, 3529, 2775, -570, -2058, 495, 3304, 1206, -2400, 3001, 7578, 4258, 4603, 4652, 2817, 5150, 9465, 10610, 10606, 13191, 11128, 8677, 6591, 6651, 466, -608, -1459, -133, 4071, 2501, -1881, 28, 3830, 7318, 6589, 1949, 1845, 1101, 3636, 9607, 11993, 9906, 13041, 11199, 9533, 11802, 14055, 14547, 7755, 7507, 9465, 7870, 9247, 8667, 6404, 5267, 2091, 4553, 5465, 3959, 7931, 9686, 11317, 11104, 11690, 8586, 7393, 5932, 5906, 5068, 7567, 5375, 5268, 3391, -5593, -4329, 8948, 8921, 2961, 2729, 2161, 929, 1087, 972, 7137, 6496, 3497, -1473, -7254, -1621, 2685, 5577, 7026, 4762, 4272, 6584, 7541, 8457, 5070, 2952, 2002, 4000, 4357, 4325, 4875, 3268, 3986, 4077, 4309, 6709, 11003, 8968, 2739, 1498, 2335, 2970, 5782, 6195, 7079, 2748, 775, -3537]
5334c537L589K656j643K342J094K44k23l880K837N617k879j628J781K634p14j14
5318H176k621l561j107K36J105K550K244p498j739l02k056L757J303q54N00L258
5302C391j747o27K266J920K386m759m201J157O14m09n335l899J816n15P164L087
5286B309J481K139j505m38j059J026j310q06L481j284K686K525k812m266p806
5271e639N64K306J969J284N18k141M225J457k922n338L698N266m241M42L751j425
5255C774j52k216L721l018l531j70K827o82J99Q99L625K112r0m767n934p80N514
5238A331j648q21l087k394J159R95j81Q3J508K434J589K232J439j797L375j18
5222F099j040m100r93K020L045j288L761L66o387n656J099L901J305q62M08L03
$$ y = [-3537, 52, 2708, 1065, 3407, 4501, 4745, 4522, 642, 3479, 9096, 6217, 4589, 6370, 9004, 8290, 8176, 5555, 1994, 887, 1123, 2228, 4778, 7022, -476, -2215, -2517, -4573, -816, 487, -367, 133, 3391, 1644, 1017, 3283, 5203, 7589, 2830, -1371, -214, 400, -9, -5344, -9243, -7427, -7942, -778, 2309, 3790, 5929, 4424, 3986, 2927, 3953, 2643, 1837, 5318, 4034, 6720, 9245, 6433, 2167, -5639, -5075, -2769, -800, 484, 1002, -1139, 3086, 4543, 1621, -3717, -19, 5247, 1006, 1448, 5199, 3774, 3622, 1406, 5127, 2109, -1422, -1592, 1235, 553, 752, 1651, 5276, 7388, 7298, 2531, -3403, -4183, 1331, -317, -1138, -4225, -6619, -5460, -4465, -4646, -4563, -3055, -621, 968, 3200, 4639, 2842, 6217, 6099, 5059, 959, -34, 1986, 5031, 3743, 7504, 7870, 1483, -4173, -3074, 827, 2132, 1270, 1678, 1981]
5206A981J100J445L977J906k356j769R7o189j153N545K419j609J428j383k726
5191B713l812k935M51J2n111k229N445N938M625k06q68M997n06l845p53Q69J058
5174E843j529n298J462n15L551M464l943n334K154j214K114N975K223L32m783
5159E502l415j380j23k63L316l274o171l57K983L720P11n80k40l181J211n16N586
5142C529L045J282m277q695L85m85n102r84K414L111K140q4N915L479j092J598
5126F179L364j181n634j501L572J611L30K582m027j923j545K88Kn582n244J723
5110f986n1o89P371J797J390Q34m343n235K682J622K598L823K199j837j240m32
5094C503M62J29k507J806J738R52n583l105l128L75O889L145j344k200K270k260
$$ y = [1981, 3081, 4526, 8503, 10409, 8053, 6284, 6381, 192, -961, 4584, 7003, 5394, 6822, 5439, 2713, -1099, -4034, -3583, -3571, -8682, -10911, -5466, 472, 5097, 4891, 4023, 9020, 8514, 4669, 3916, 4785, 5843, 4314, -984, 478, -37, 3514, 7978, 4035, -1299, 855, -359, 1755, 7730, 9953, 10285, 5502, 2087, 707, 584, 321, 3637, 363, -5808, -6165, -3182, 538, 1249, 669, 429, -2752, -1541, -2057, 3529, 6574, 7856, 3579, -5116, -4731, -5216, -10318, -11302, -8888, -5777, -3637, -3721, 2194, 5673, 4581, 6179, 9543, 8362, 2728, 1227, 4799, 6410, 6740, 9322, 5295, 3372, 1827, 2115, 2117, -3465, -8709, -6986, -7037, -7726, -355, 1442, 2832, 3666, -677, -5912, -3230, -1608, 990, 4813, 7012, 5175, 3935, 3503, 3965, 4094, 1587, 3393, 5131, 6083, 500, -2605, -5733, -5358, 1531, 4676, 3332, 1132, 3402, 1142]
5078A142k663j508N470K641m76n839O65k404M25k638j84J83j899R1J539L112m77
5061b820l054N660l58M487l817l128k776l53L634L814O088K90p50j357p02q92
5045C966J193l847q765k44M940M791k985j420N58K133j829N13k109M972L912k506
5029C273K928j738p128p272J735K474L289O290j325J190j570n413L744O753J650
5014H880k976k386k47l850N3J632m328j515j77L686K074m060n324J964J0720Q170
4998A2316L498r036j1393k469M752N988O771o798q343l266n637p788j056L398
4984a9063J929P975J3517J0802j847m097l278k295L166K055K485r42j610J177
4970I974k517l731k682k659K572J259k270J545l174j712J853K492K73J392J136
$$ y = [1142, -1521, -3029, 2441, 5082, 4606, -1233, -568, -2972, -2547, -5185, -5369, -5186, -7085, -6994, -5455, -2343, -2820, -5874, -214, -572, 3915, 98, -3030, -5806, -6159, -2525, 1289, 7377, 7667, 6917, 5560, 4858, 3966, 5159, 1312, -7453, -7697, -2757, 2034, -951, -2371, -1813, 320, -1509, -996, -3105, 1867, 5779, 3273, 6201, 4463, -2665, -9937, -8202, -5728, -2439, 3851, 2526, 3716, 2146, -3267, 477, 7230, 8880, 5904, 3518, 3271, -579, -526, 1106, -3222, -4737, -4914, -1228, 846, -3214, -8538, -6574, 4146, 12316, 15814, 6778, -4615, -7084, -2332, 3656, 10427, 3629, -4714, -7980, -13617, -21405, -22461, -19063, -17134, -9159, 4358, 15160, 13313, 9216, 5938, 3643, 6809, 8864, 11349, 10407, 8797, 9974, 7457, 3726, 1044, -1615, 957, 2216, -54, 1491, -1683, -3395, -1542, 950, 1223, 2615, 3751]
4955C751j494m644N056Q288N93l17m139k553o569r21L640K346M911N81k087J825
4939H267j064k995k011j286L527J125J048M574j415j0731n821K721L892l639q1
4924c889L165M221J390k336K061k532r72K521J765j250K134j103l783m897J24
4909c381j449M65L346j269j984n569J229K551L834M192K492J60k686K535K083
4894F549q04J501j994m711k30m625k12J756j056K176j513p18j292k786j813n75
4878a0347J709J418L080M388O1k405j067Q97K857O229k2k348o00n512J648M127
4862D113J234J224j112m78l714j385m334n308K627J1969N260k450n58J012m152
4847C948J495K314L333J939k448m650k661n825k675K864L617N462j249m923j0333
$$ y = [3751, 2257, -2387, 2669, 10957, 11550, 11233, 7094, 4541, -2028, -2949, 691, 3037, 7948, 8529, 6442, 8267, 7203, 4208, 2197, 911, 4438, 5563, 6611, 11185, 9770, -961, -6782, -4061, -169, -3808, -3889, -724, 3497, 4887, 2551, 4612, 2080, 1108, 3629, 5394, 4144, 6278, 5175, 1392, -3505, -3381, -4830, -4365, -1019, -2288, -4272, -9841, -8612, -6061, -2227, 1965, 4457, 4617, 1931, 4466, 6549, 5745, 7246, 5252, 541, 311, -4314, -4526, -2770, -3826, -1650, -3163, -3881, -5173, -7959, -9772, -10347, -8638, -7220, -4140, 248, 309, -2096, -3163, -2266, 591, 6820, 6798, 4450, 3850, -1662, -14, 4113, 5347, 6571, 5459, 4981, 1267, -118, -4452, -9760, -7133, 4836, 10096, 7646, 7088, 8100, 3948, 5443, 7757, 11090, 13029, 10581, 5931, 3270, -2555, -5230, -2366, 1251, 6713, 5464, 541, -9792]
4832i792M081M654L558J260P01o045M161R012j515k862l714j821O808P352k055
4817A3783p725r088p070m462L749k970L681O903O878M397j379o722n176J91P273
4802B263L115j319j323j248J188j273K098j870M329j413m342p38n49j987l185
4787f254L675n15j640n43J950K266L998k298Q31l64K356o86J839K325l40j106
4771E494j697k13K160K769L02J363q5o351j904k114R58K761o047l636O272M65
4755D97J399l059k469k021L197J010j850K935L511k73l446p292J506J200K552
4740b603j497o267M09P463K143j029k900r18j232O81R8K394M676J798P79K82K492
4723F769l713k382m39k888j055j673l450l270O068P457N244Q65j49q69q48k907
$$ y = [-9792, -5711, -1057, 2501, 3761, 4462, -1583, 2578, 11590, 10075, 7213, 3499, 1678, 8486, 15838, 13783, 6058, -3030, -10100, -14562, -10813, -13783, -10102, -3199, 3679, 8076, 6697, -25, -5201, -5010, 2263, 5378, 4059, 2736, 1488, 2676, 1403, 3501, 1631, 5960, 4547, 205, -533, -1082, -3069, -6254, -2579, -3094, -4734, -5277, -3327, -1061, 2937, 639, 1470, 1106, 3462, 2776, 4615, 6940, 6600, 5494, 3797, 3584, 5744, 8513, 8815, 10178, 10093, 3742, 1838, -276, 682, 3443, -2604, -6240, 32, 497, 1896, -1163, -3632, -5653, -2456, -1446, -3296, -361, 3150, 2877, -569, -7861, -6355, -5155, -2603, -4100, -10367, -9958, -2495, -352, -1381, -4281, -5199, -6431, -5750, -5652, -3258, 1418, 3216, 3995, 4277, 6769, 3056, 674, 235, -2653, -3708, -5381, -8831, -12101, -6033, 1424, 6668, 7533, 7384, 6515, 5667, 2760]
4707B760k604p15J711K725k955q27k606L714K390j645q00m49n267q54p81L290
4691b913N120J73j3j768j932L97J487P58K441k808k631O021K371n721n234j286
4675e538N390N105k897l078J494M673M23p07k344j971Q77m68Q5J39j628P41K733
4658C029j174j611n157o85r39M127K837N741K151m060n31K986L236m81N200n70
4642A4099j0453k874l28k131K986n40j378J795r88l894k760K746L189r97J939
4627D11J895L763k392m121k432j037M672P654K397m180L03k585o164j841L594
4612f3J68L31O69L320P914J26n445J45j31J16l147m277k705K546K739j836J235
4595A705L354J504K405l035N38j164o795M6M884L826n154n227o57L805M885N261
$$ y = [2760, 156, -559, 1152, 3877, 922, 95, -2511, 1203, 3593, 1948, 1148, 699, -4568, -5422, -6203, -2913, 2207, 2380, 2367, 599, -1333, -936, 551, 1309, 3750, 942, -1689, 4332, 6703, 982, -4252, -5538, -148, 4957, 2060, -1018, 476, 5149, 5572, 4865, 2521, 550, 1427, 959, 1044, 1183, -445, 296, 3029, 1855, 244, -4913, -5598, -6537, -2410, 427, 6168, 8319, 4259, 3728, 6714, 9950, 9469, 14669, 14099, 3646, 772, 444, -1687, 1299, 759, -619, 1176, 188, -3706, -6466, -3720, -531, -1528, 411, 2306, 6069, 3677, -444, -2876, -3913, 759, 8413, 10810, 6630, 6933, 4348, -1816, -3657, -63, 105, 436, 1105, 4425, 12339, 12465, 7020, 7165, 7034, 7150, 4003, -274, -2979, -433, 2306, 470, 1705, 5059, 6563, 8968, 5933, 6471, 5307, -1488, -1442, 3442, 7268, 2114, -3113, -3770, 35, 4920, 10181]
4579A0181l892n00o94l627k6K276l359j392k046K12J413m6J792k87k445l159l621
4562i220J673j31J063K144j798L413Q658L283m174p36K95o27O56j530p14k20J48
4545B183n8r26j799J331J067q83M69m007K172l04j00K742r61O263L132k501k12
4528G608l250L164K839k68k763m367N62J715l940O28j738O379O543j182o693m875
4512C62J246K353j924n23k629L70l580j375N082L299K492q14j762j418J401j783
4496G97k376M436Q525k158o429r77K458L199m207L286L052m000l006j874q07Q81
4480H00q30J800O26J176L962K735j225m53n06K71k335J791J293l640l192n321
4464c048o70K826J628k85O206k480j769N05Q07l70o03K557l720N18M148l508R57
$$ y = [10181, 6289, 5789, 5095, 1468, 1442, 3718, 359, -1033, -3079, -2867, -1454, -1500, 292, 5, -2440, -5599, -9220, -7547, -7678, -6615, -4471, -6269, -2856, 5802, 9085, 4911, 4175, 4470, 3843, 4499, 2969, 2255, 2035, 2183, 2125, 1199, -600, 731, 1798, 915, 1384, -2623, -451, -755, -855, 1887, 926, 7189, 10321, 7820, 7608, 4358, 7522, 10361, 10093, 7330, 2963, 3525, 5240, 1300, 1928, 190, 6569, 13112, 11930, 5237, 362, 1608, 3961, 2037, 1514, -1115, -745, -4325, -5700, -618, 2681, 5173, 4359, 2597, 1179, 2580, 797, -1579, 2857, 11382, 9224, 2795, 1818, 4276, 7475, 3268, 6554, 9606, 5606, 2600, 726, -81, 800, -30, 1770, 2396, 3572, 7534, 10269, 9044, 8591, 8085, 8356, 6021, 7812, 9105, 5465, 2273, -3048, -3718, -892, 736, 451, 6657, 4177, 2408, 2913, 3720, 3350, 2747, 5304, 1584, 2102, 6250, 2742, 3699]
4447C699K660m63q17L66k716k29l347j403O2L282J0062M166j877m054j200k705
4431E486j913j224j806n249j875K32O7K836L341J182L213m44n690L260k63j153
4415@k325K291J053J417j379j815l168r24K175N07O444O677Lj951m047n375L006
4398B589K123N45P77n040N2M034M651J540J397K604K399o481o406j131k695O61
4382A619J109l226n869q99L479M162j334j433J974j963l441k269Q63M421J023
4367a784j969j790l833M550O667L105N85n260j558J862n34K932j197R29K597j387
4351C915j547l163M89K126L354P059M204K721n63p448o955p38j386m159r1L11
4335a871o771L548J0130J996n534L397J160J104j857l11N25O46m204n53O5l375
$$ y = [3699, 6359, 5896, 5079, 5445, 2729, 2500, -847, -2250, -2188, 1094, 11156, 15322, 13445, 9391, 8191, 5486, 3573, 2349, 543, -4706, -6581, -6349, -6282, -3446, -105, 1077, 4290, 3846, -1844, 1416, 1153, 0, -2325, -34, 1019, 2436, 1057, -758, -3926, -4850, -2675, -2168, 4276, 10953, 10956, 9005, 4958, -417, 2589, 4712, 5257, 6034, 994, 1046, 5080, 9731, 11271, 12668, 15272, 17671, 11190, 4784, 3653, 958, 1619, 2728, -498, -6367, -7266, -3787, 375, -959, -2392, -418, -2381, -5822, -8091, -7228, -2807, -1784, -3753, -5543, -9376, -4826, 1841, 4946, 5531, 271, -1287, 575, 41, 2973, 1776, 2705, 5302, 3915, 2368, -795, -306, 1820, 5174, 12233, 16437, 19158, 18595, 11147, 4192, 3454, 2068, -2091, -2182, -1871, -8642, -5094, 5036, 7032, 1498, 4895, 6055, 7159, 5302, 4991, 5516, 6162, 1958, 1405, 1470, -1905]
4319a905k556M416L345K348l097J330j63O51m373j151O447q83j68L79N003j721
4303G902k860j075P22K7r75k052l570k406L096j280K570M557O613J778m723n060
4287C264k471R93q196k691O696M279j410m16j154K898J53j057m00j728Q71Q52
4271D83K955J088o45L197N26k244J458L279j094l897J591o41k473J710K136L487
4255A0916n09l987J7k137m25L07l102k465k626L282L403j171k94K82Q49o5q32
4238A443l937k94K744r1l35J17L995J347l377n875k19K371L715P219j510j191
4222F122k765n522J39O003M614K330j344j229N23n852p069J223J436K312J926
4207B847J182o61k061m171j344M54q53m499K541Q047M527m746O75k836j081j872
$$ y = [-1905, -4461, -45, 3300, 5648, 2551, 3881, 3718, 4369, -4, -1155, 5292, 4409, 4241, 4620, 9623, 7902, 5042, 3967, 4689, 4716, 3741, 1689, -1881, -4287, -1191, -2471, 99, 4656, 11269, 13047, 8324, 3264, 793, 1786, -6410, -9101, -2405, 1874, 464, 48, -1106, 1792, 1945, 888, 488, -1240, -369, 483, 3438, 4526, 3881, 7078, 7604, 5360, 6818, 10097, 9003, 5106, 6697, 6056, 3583, 5293, 7429, 10916, 10407, 6420, 6437, 4300, 3875, 4182, 1080, -1385, -4011, -729, 2674, 1503, 1209, 1491, 2340, 2275, 1443, -2494, -2788, -44, -135, -470, -353, 3642, 4989, 1612, -4263, -4482, -2111, 1604, 8823, 7313, 6122, 3357, -2165, -2026, 3977, 8591, 10921, 9577, 8348, 8871, 3019, -4050, -2827, -1391, 921, 2847, 4029, 3368, 1307, -2864, -4208, -3754, -4607, -9106, -6565, 1482, 6009, 1263, 1938, -898, -1979, -3851]
4191c851J914L045j887L471L967q35M261k972q652j30j034N393N077J445m806
4176D406m917J516N41J610M579K664J964L32l685m069n84N019L004p119m470J566
4160B357K844k929L632j471l096J865j765L826J719m798m33Q28J428n079N62L143
4144B633j734K570K158m578J705K781k860j452J012M155m14m499m163k212k18
4129e116j346K148J341n709L582K306k820K393M415k98O90K009k92l270k663Q76
4113a754N809j058J465J109k927M847J381k993K662k245k742J201o89J492J564
4098G122j307j620j672m187o215J186k748n4L365O867M265r27m160K71J001k107
4082i20J77K078j885J970L173m6j903j03J544m62j249l115J006L278L145J344
$$ y = [-3851, -1937, 1108, -779, 2692, 6659, 5824, 10085, 7113, -1539, -1669, -2703, 2690, 7767, 9212, 4406, -511, 1005, 1546, 3156, 7735, 10399, 12363, 12695, 9010, 4941, 4357, 9376, 12380, 5261, 791, 2357, 5201, 2272, 5904, 4433, 1337, 3202, 1437, 5263, 6982, 2184, 1751, 2579, 4007, -1072, -510, 2633, 899, 3469, 5627, 1049, 2754, 5535, 2675, 1223, 2235, 6390, 5976, 1477, -2686, -4898, -5116, -6462, -4314, -2973, -8682, -5100, -2794, -5614, -3221, 1194, 896, 1586, 3595, 3303, 33, -2630, -1754, 4055, 2997, 4462, 5571, 2644, 7491, 8872, 5879, 8541, 6296, 3554, 4755, 4066, 5558, 7122, 5815, 4195, 2523, -1664, -7879, -6693, -9441, -9495, -6130, 737, 5002, 4075, -85, 186, 1187, -920, -743, 1335, -550, 1420, 4593, 4547, 2644, 2541, 4085, 3623, 2374, -741, 265, 3543, 6688, 8032]
4066H032J955q54p039n272k474n0J759Q009P82J006L04m275r511q03J018J683
4050e730K533J138k15m007j103K387N10K779N355N000j65j907l682l692J687N519
4034F407j626l952o39L787J06k496j69n02m574R131L567n811k619K210L01j2N74
4017C683R99k990R19O860J426p58o88k364m944K819m6m032M09L491L497n026j214
4000B041L99k676j45j548J511K363l194K524M552p34n607M852k304l438K030J791
3984B417k930n342J204n39L324j026j275L61K589L683k857q932K598N517L889
3969B681j268N096K402l739r47p39K339k656n546L762N872m25j274j866L555J510
3953H757m050l811Q30R89m370J231L212k533k46o78k937j184N95K131J183k301
$$ y = [8032, 9987, 9133, 2094, -3178, -5652, -5702, -3943, 4066, 4848, 5854, 6158, 1883, -7628, -8431, -7413, -5730, -3197, -2059, -2274, -6281, -7384, -4997, -4487, -1708, 3647, 8647, 8482, 6575, 2893, -799, 888, 6407, 4781, 829, 190, 3977, 4083, 1587, 1418, 916, -3658, 5473, 9040, 3229, 610, 2820, 3121, 3109, 3683, 4682, 1692, 2611, 9471, 10897, 10139, 9451, 7087, 2143, 4962, 4916, 884, 1293, 4784, 8281, 3255, 2041, 2440, -236, -381, -1929, -418, 1945, -1249, 1275, 5827, 5093, -514, 4338, 2034, -1404, 626, 2417, -513, -5855, -4651, -5190, -1866, -2892, -4167, -3806, -1217, 2466, -391, -9323, -6725, -1208, 2681, 1413, 6509, 8911, 5172, 4225, 3486, 5825, 3169, -2377, 1385, 7257, 6832, 5558, 3692, 7247, 8757, 4707, 896, 1726, 2715, -1655, -424, 2788, 255, 9, -669, -3606, -4790, -4195, -2064, -881, -3182]
3937c182L311L279K218j734J175o37m191n58j182K952J88j951O34L359P12n89
3921C804m45K280K918l915p774j167j764k420J570J880K797L566m947m735j212
3906i564N725R43l859L367K301J630J17J874K813J889N53k026j853j430j993m05
3890H2j881O320Q34k183k737J15k719L699K207K488j067j001j665K491j196J786
3874E573r62M81l731j352k075K385r75L331N155R82k511J312M06M08k715m22k390
3857B900J488k685J299K150K658j42O44K217k653j625j255j681j018N198N178
3842A2673k471m834q91o543m708L683M791J043r90M966l098l21L8p64l998j920
3826c344K189K522M688Q89J05M648K358p32m447j345m367q31J143l369P23j170
$$ y = [-3182, 129, 3408, 5626, 3892, 5067, 4430, 239, -319, -1501, 1451, 1639, -312, 322, 3681, 4393, 3804, 3359, 5639, 8557, 4642, -3132, -4299, -6063, -8483, -6913, -5033, -2236, 1330, -3617, -8352, -9564, -3839, -2896, -6755, -3388, -1087, 543, 660, 2534, 5347, 7236, 7789, 5763, 3910, 2480, 487, 82, -1799, 4521, 5355, 3172, 435, 550, -2169, 1530, 3737, 6225, 5158, 4157, 2492, 4983, 3787, 5573, 4611, 5092, 1361, 9, -2066, 319, -656, 2675, 7830, 8812, 6301, 7613, 8019, 8427, 5712, 5290, 2900, 4388, 1703, 3002, 5152, 7810, 7668, 8312, 10529, 7876, 6251, 4996, 3315, 2297, 7495, 12673, 10202, 5368, 4477, -2066, -6774, -3091, 1700, 2743, 1753, 6719, 3621, 3300, 3338, 2574, -1424, -3344, -1155, 1367, 6055, 6944, 7049, 11697, 14055, 13323, 8876, 7531, 3164, 2333, 3476, 107, 830, -340]
3810c40l127N807K782j137L770K62m507k308L272P34j221K219m53K02j483K744
3794G216j065m938k485J468m688k64j59L15K1j87N544L220J849j981l507r94N80
3777e5k257N110R64k25K195r31l234J541O91k356M83R05l733k295J316K975L38
3760A432p06M338m27M674M93l939m244J411J988k590k241k194K199N39K789M451
3744G973K101J748K30n172l860l528K608L811j352R15N67j960j960j017K226k276
3728A054J965K561L298j536m189k310k231Q98L07k333M25L968L009l992o116K247
3712b975J457j509J534J63m480j658K52P836R66l040O34J7k383K905M443j859
3696B303k622k636L712Q41j948m74L040J663q185k308M334j545L720J763j226
$$ y = [-340, -3467, 2340, 5122, 3985, 7755, 8017, 3510, 1202, 4474, 5208, 3987, 6206, 5753, 5955, 4472, 7216, 6151, 1213, -1272, 196, -4492, -4756, -4915, -4600, -4579, -4766, 778, 3998, 5847, 3866, 359, -635, -55, -2312, 2798, 3762, 3537, 5732, 4801, 1567, 3108, 3799, 1443, 1926, 2831, -902, -3197, -1881, 1094, 1432, 726, 5064, 4637, 9311, 9804, 5865, 1621, 3032, 5020, 2430, 189, -2005, 194, 733, 3522, 7973, 10074, 11822, 12052, 6880, 3020, -508, 2100, 5911, 4559, 5474, 6041, 4081, 2121, 1104, 3330, 1054, 3019, 5580, 8878, 7342, 3153, 843, -1388, -490, -183, -2516, -2091, 1877, 4886, 894, -5222, -2975, -1518, -3027, -1493, -1330, -5810, -7468, -7216, 620, 1586, -1454, -820, -803, -3186, -281, 4162, 2303, -319, -2955, 757, 1598, -350, -824, 2216, 3879, -4306, -6614, -2280, -3825, -105, 1658, 432]
3681D32J89K078K517k214n612n925k050N491l425J960M626J979J855k541m366
3666e006m843L329L457m11j06O111J38J646L047k144l757m659l639O13N105Q04
3650c15N33k925j661L871J711n515J700J651q71K257R54L151P14q14q34J016K65
3633D888m608k180L035j491l286K019P87j236K757J402J556n433m415M6J617J715
3617b827M160N570k430o380J197L893J617l983K715J815R97p010l819L897J42
3602d46k88M112R37K542j994k829J951L306j072m212m186M485J226J072k213o69
3586A722L664k664o707N85K700K739R49o32O660n57j20R25k365M477P15n839l071
3569C181k302l084J543j986j022l77j15q20N896M671j706n64p497n34L599l928
$$ y = [432, 621, 2699, 5216, 3002, -2610, -8535, -10585, -5094, -8519, -6559, -1933, 46, 1901, -640, -5006, -9849, -6520, -3063, -3474, -3580, 2531, 2669, 4315, 7362, 5218, 1461, -3198, -6837, -6224, -1119, -315, 218, -2707, -4368, -497, 1214, -4301, -2601, -950, -1821, 436, 1390, 4541, 5255, 4441, 3607, 4623, 4888, 280, -1900, 1135, -356, -3642, -1623, -836, -2072, 685, 2087, 3643, -1790, -6205, -6159, -4542, -2827, 1333, 6903, 4473, -1907, -710, 3183, 4800, 817, 3532, 5347, 6344, -666, -4485, -588, -446, -734, 3378, 4315, 6857, 4863, 2034, 3985, 7291, 6219, 2007, -2179, 2306, 3532, 4604, 2391, 1722, 5386, 2722, -3985, -3400, -700, 2039, 2988, 2356, 9016, 8459, 8339, 9264, 6899, 11376, 12091, 6252, 3181, 879, -2205, -662, -2648, -3670, -4047, -4162, -4982, 914, 5585, 3879, 3315, -4182, -4716, -1117, -5045]
3553e045k888K152O066k675J198M755k956o489J489J964L382J799n31n585N88
3538b776M314r50l35L76k601n08K105P96J471O639p89n2l461k738l818k962J435
3521c854L856N060Q66N50L417o600n870j289J66q76K680j560L997O271O56j542
3505E928P45K140J147l353n8l022Q24K122j181M091P528o7q542n704K876J577
3489G051k686l602M626J393j0343L510J210K982k189m763k674L271J055M418J292
3474D551j483K826p11m3m398l443k201J39J889K251L679K216K269L91K13l81l09
3457G455J961k555m941P807J362p681l509M048L83k185K100O33o21n79l612K52
3441C18L305j050l88K435o556k586M064O936Q598k075k882m389j349j023q08k797
$$ y = [-5045, -7933, -5781, 285, -2390, -1192, 3563, 607, -5882, -4393, -2429, 953, 2752, 2221, -3364, -2776, 1538, 588, 253, 629, -1972, -2480, -375, 421, 1892, 8531, 7742, 7690, 4229, 1491, -2327, -5289, -3854, 2, 5062, 5928, 6478, 9895, 3295, -2575, -3864, -3698, -4574, -1894, -3454, 543, 6814, 7470, 5928, 6673, 8813, 9960, 6607, 6549, 3527, 4351, 6473, 5292, 9383, 16911, 16844, 8302, 2598, 5474, 7051, 4365, 763, 5389, 6782, -3561, -51, 1159, 4141, 1952, -2811, -5485, -2214, -1159, 3259, 4551, 3068, 5894, 5183, 5140, 742, -2701, -4902, -4763, -2874, -623, 3056, 5272, 7541, 7932, 8145, 7764, 7455, 9416, 6861, 1920, 9727, 11089, 3408, -101, 3947, 4330, 2145, 4245, 4878, 4257, 3678, 66, 318, 3623, 2573, 2185, 4620, -1936, -4522, -458, 6478, 15076, 13001, 10119, 5730, 4381, 3358, 2550, -247]
3425b47m483K227K119l386K29k721M572P281J639L46j054L132L26m857l747j041
3409C35M95L008J929j129m775m301K041L684K80l437L159K594m62J321j000m288
3393e46j629O163L276n065l926N30J254O1J169k817q59K228J736M833n00P72j637
3376E043J282L057l626n984r89r97L44k490K490O811K263l493k42K96R24j079
3360C610m715m81k328M57j081L897J747k291n444J211O145k874l3N142j196j457
3344C09J900K239r80j085K713n56n957l624Q49Q044J014k679n25m669l27L276
3328e8O64r53K124M040l923j975K576M166k364l712k6o86J817n73k514n276J157
3311e516K061K361l44l108n87K222K790L029Q96P41K462j369M10k721j822j938
$$ y = [-247, -4730, -2503, -384, -3770, -3541, -6262, -1690, 5591, 7230, 7576, 6522, 9654, 9980, 5123, 1376, 335, 830, 3838, 5767, 4638, -137, -4438, -2397, 1287, 1567, -1870, 1289, 3883, 3421, 4742, 3742, -546, -2175, 3988, 7264, 2199, -1727, -1197, 57, 118, 1287, -1530, -2389, -161, 1575, 6408, 5908, 6680, 5043, 6325, 9382, 5756, -228, -1217, -2214, -1870, -4360, -1870, 4941, 7204, 3711, 3469, 3765, 4689, 3610, -1105, -1586, -3914, -3457, -4538, -641, 1106, -1185, -6629, -5418, 727, -2147, -2180, 2962, 1766, 309, 2209, 4448, 3468, 2383, 5096, 4540, -1417, -5041, -4192, 3852, 4866, 2187, 1662, -3007, -3334, -58, 606, -347, 1777, 5817, 1894, -81, 2495, 6661, 4297, 585, 559, -127, 1690, 1117, -1397, -6673, -5516, -3455, -1094, -1438, -4546, -5133, -2911, -121, 2908, 3804, 4545, 7007, 5638, 6048, 3327, 1505, -433]
3295d33K34p67L265L573l73K34N42m98l218J127l422m593K844K947K603K351m016
3278B400O30L275j734k86M08k067l764l474J864N956j963R93j071l025m86L587
3262A243N528L722o966o15k293n795m92M116M184P32L458N36l494M835J912n697
3246D914m756O88p4O092N082J475J813k404n880l632k642l442p4J974l352n54
3230d772K088L351K837j517o88L419K143o376n077M153O48N99J060J220J018n598
3214a492m182L333M285L68m584K047R25O89K548j390p074j853J087L174K586k424
3198a957j799K690M007k078n88L422j869n149m563j270K572M574N000J55R38j640
3182B445J175K284K366O9j818l40r50j061j780j254j995j77j995j892j811J647
$$ y = [-433, -199, -966, 2299, 5872, 5499, 5733, 6275, 5777, 2559, 3686, 264, -4329, -1485, 1462, 4065, 6416, 2400, 3030, 6305, 4571, 4285, 4693, 2626, -1138, -4612, -2748, 3208, 1245, 2238, 1167, -1858, -2344, 1243, 6771, 10493, 3527, 2912, 619, -5176, -5668, -1552, 2632, 3364, 6822, 7358, 3864, 8699, 10611, 4914, 158, 846, 772, 6864, 11946, 13421, 15234, 12830, 6950, 3318, 676, -2766, -2840, -866, -4218, -4772, -2684, 667, 3504, 1987, 1299, 4718, 6861, 485, -4592, -439, 209, 808, 1868, 3088, 4106, -1492, -5674, -2341, 1944, 2312, -2272, -225, 700, 1389, 3937, 2547, -4527, -6380, -5293, -2119, 467, -1957, -3756, -1066, 2941, 863, 275, 3697, 1828, -3321, -7884, -9154, -6582, -2008, 2992, 3147, 4085, 2445, 3620, 5904, 8270, 8339, 6521, 6181, 5231, 4170, 2390, 1136, -859, -1036, -3031, -4923, -6734, -5087]
3166e087M081L323k649o90J923j374K443N015J258m549l845p25k379k770K680
3151c345J977k93j752N722n65O74L516j246J55n180m722k091jk838r29L977K778
3134d163J773j132m12L798M752M231O26m066k245L72k639p65N81N88j237k671
3118b609l057l1M640M168J87J007n90n11K072P24k973l801J218j658J019J745
3102A550N84l28k018l19J999K921k696m315R17J785p58j315N782K37m623j562
3086b159k392l46J077M076n22n773k267O883N423k582j740j875P10J219m08m919
3070e595J852J493J559J056k800J863M479j339j865j489J820J536J865j194j342
3055A899J356l022k487Q60l2J730K633j833k377J429M17M86L429K333j283M471
$$ y = [-5087, -1006, 2317, -332, -1022, 901, -473, 1970, 6985, 8243, 3694, -151, -876, -3255, -6025, -3345, -1368, -1661, -3413, 2309, 1744, 2418, 5934, 4688, 4843, -337, -5059, -7150, -7151, -9989, -10918, -6941, -4163, -2390, -3522, -3934, -136, 4616, 8847, 9473, 5407, 3162, 3534, 895, 130, 711, 1299, 62, -2609, -5666, -5697, -1057, 3111, 3298, 4305, 3715, 3204, 5276, 6000, 3027, -774, 444, -1214, -195, 1550, 2134, 1806, -212, -531, 1468, 4389, 1693, -2622, -1705, 80, -678, -1993, 3789, 4026, -597, -2159, -4551, -4897, -3820, 256, -266, -6039, -8306, -1423, 4000, 1418, -322, -2197, -1487, -268, -676, -5595, -3743, -2250, -691, 365, -2435, -572, 3907, 2568, 703, -786, 1034, 2570, 4435, 3241, 1899, 3255, 233, -2254, -1394, -1426, 304, 2937, 1104, -1273, 156, 573, 1059, 4488, 6821, 5538, 10009]
3039A0009j176K98k674n788m620J819m346J100J145J013j933r18K229L100J171
3024D29N41K030J215J934j635J588P42k14K373N59r535m242j488K168P430L80
3008D275j124k02k737J784J460L674M864n879J218l639m497n493r78K400L895
2993i79N975L83j917J276N324J589l177n840l584l84r97K904L370m16L584o90
2977F421l249J935N380P15k542k136J030J780o384j34j555L966J228l539m45J875
2961D346K563Q91o31n820j227R84K666k254P33k834j443j312l09K878R58m97J315
2944A007k256l072j578L995P060l715l86J770k362l67l612k057M075L648M21J355
2928C926O39j811o19k041k84j327M271k941N01N221j990J547J035q85l630k528
$$ y = [10009, 8833, 9131, 6457, 669, -3951, -2132, -6478, -5378, -4233, -3220, -5153, -6071, -3842, -742, 429, 970, 3000, 4215, 6149, 4514, 6102, 6844, 6630, 9003, 9562, 27, -4215, -5703, -3535, 3895, 4275, 3151, 2949, 212, 1996, 3456, 7130, 11994, 6115, 7333, 3694, -803, -6296, -7274, -4874, -979, 4996, 5379, 3462, 4738, 10062, 11651, 8474, 2634, -950, -1334, -2331, 573, 3943, 3527, 7111, 6421, 3172, 5107, 10487, 11202, 8660, 6524, 7554, 9334, 2950, 2816, 1261, 5227, 6455, 2916, 2471, 4346, 6909, 7800, 7169, 1349, 122, 1106, 3772, 1518, 2251, -583, -2026, -3338, -3647, -769, 189, -308, 1007, -1249, -4321, -5899, -1904, 5156, 1441, 1055, 2825, 463, 96, -3516, -5573, -1498, 2150, 2571, 3926, 4565, 2754, 2135, 94, -190, -1517, 2754, -187, 314, 5535, 3545, 5092, 6127, 5242, 1612, -916]
2912i16j032L27J337l420L119K507K313l323j961R52j809m182K760J695j616K468
2896g81K222k66N246P62R78J062J61k824N99K127N29j032o695l909M337L893l674
2879B735m885o893L53N052L416K469k274j804R38J559L554L85J12k835p45j259
2863a22K970n67K179J959l252l281m85R42m251kL323J312L37J431r18m625l179
2846f229N395r61n770K38L124M737j068k145R21j028M13j74m68M844N348M309
2830A1486m197n639R91n22n119k268N127K616n852J92O505q86k626j351M251J152
2814C860m37K507L710m077l546m102K314M829J047l521R92j4q01L174L651O32
2798A0218m895k217P99K702n318p521m591j51K619J987J307L122K941L501K623
$$ y = [-916, -1948, -1621, -284, -3704, -585, 1922, 4235, 912, -1049, -97, -1906, -6088, -3328, -1633, -3249, -781, 1441, 1175, 6421, 7183, 8161, 9223, 9384, 6560, 7159, 9286, 9815, 8783, 2088, -1821, 2516, 6409, 2735, -2150, -9043, -8690, -3638, -222, 2247, -27, -1831, -893, 666, 4220, 4605, 4717, 1882, 1137, -122, 2848, 2281, 4460, 6419, 3167, -114, -599, 343, -3908, -3910, -587, 725, 1062, 2493, 1575, -3050, -6229, -834, -1795, -7565, -7327, -4203, 534, -534, -2679, -1758, -2786, -2373, -2547, -3015, 1829, 7177, 11486, 7289, 1650, 2641, 2119, -3000, -5268, -141, 2475, -3377, -3185, 3320, 2434, -192, -1543, 2708, 3860, 3423, 5930, 9640, 5563, 2017, -2085, 229, 5058, 6105, 2584, 3576, 3562, 2761, 5935, 9586, 10218, 5323, 3106, 3905, 6607, 1289, -6232, -10823, -10974, -8355, -6368, -5061, -1939, 1002, 4503, 7126]
2783G126J851L341o000l397%n28K88J011M046n012o366k22j715J743N706J558
2767C430k98l767l621L41j16K983M50j53jM03n14L020m789r37K913l188j877j824
2749g545r81J424J653j600L547O058J55l347k552J411m30O10m627M907J244L594
2733C521J965l585L92J454L908J081n154k327n491L788O625K404p10j996l707
2718B168k178R03N5J605J228J192K946n830l765R94p70K54J280j71l598J847K088
2701B48M215j324K96K187J388k828l908J31k311j436N297K038J334L418l03k612
2685E830k656N77p15Q21M60M196k620q654o68j243J275J030k274q14K192N325
2669B062J759j639J147m690L9j404J368N225J136J002K49m940K06q99K91L479
$$ y = [7126, 8977, 12318, 6318, 2921, 2921, 2393, 2681, 3692, 7738, 2726, -3640, -3862, -5577, -3834, 1872, 3430, 3132, -635, -4256, -3915, -4031, -1048, -598, -751, -752, -349, -863, 2157, -2632, -3569, -656, -3844, -5721, -7545, -8526, -7102, -5449, -7049, -3502, 2556, 2711, -636, -3188, -1777, -2207, -1597, -6224, -1317, -73, 3521, 5486, 1901, 2293, 3747, 7655, 8736, 3582, 1255, -4236, -448, 6177, 8581, 7871, 5875, 2168, -10, 893, 948, 2553, 3781, 4973, 7919, 2089, -1676, -682, -1452, -1198, 82, -89, -3687, -1840, 248, 4463, 3139, 3435, 5622, 7010, 4182, 274, 405, -1906, -3342, 1955, 3993, 5327, 8745, 8442, 5830, 3174, 3751, 3036, 3857, 4317, 8513, 5893, -2761, -3429, -4672, -3397, -2367, -4641, -5455, -3263, 2062, 3821, 2182, 3329, -1361, -1322, -2726, -1358, 3867, 5003, 6005, 6254, 1314, 1520, 621, 912, 4391]
2653D391o82r08n55k580J550K138j098l21k34k023J83K99M63P58J670m688n608
2636g245m76k364M026M646M730J613j040L62m945J201Q65L322J816J179l698r371
2620e379n006K939P860N118j42o37J031l317j869l34J91l526l814r04L996J108
2604b685J688o57K473Q79l982M579P16m974O45j223O86M368j782j510r719j957
2588a2455L726j639M583Q393J417j458q03J130l781j107k859o100K334K367K929
2573c323O152M171l567m042p82j137j680k465j995K015p63K409N777l126l37J303
2557a390j962n155j856K352M654J456o12l43K210K249M093N21l458m413J126m43
2541i71k015K508N63n651N42L344P1O35l61n946o43K125j256j803J088N189K663
$$ y = [4391, 3709, 2801, 2246, -334, 1216, 3354, 2256, 1935, 1701, -322, -139, 160, 623, 1381, 3051, -1637, -7245, -7721, -10085, -6059, -1413, 3317, 4930, 3890, 4252, -693, 508, 1373, 4695, 6511, 7690, 3992, -5379, -10385, -7446, 414, 5532, 5390, 4753, 5784, 2467, 598, 264, 455, -3071, -6885, -7789, -3793, -2685, -997, -1654, 819, 1698, -2284, 2295, 3011, -1963, -1318, -2541, -1855, 2513, 731, -779, -10498, -12455, -8729, -10368, -5785, 2608, 4025, 2567, 1764, 2894, -887, -1994, -4853, -10953, -8619, -6252, -3323, 2829, 7000, 3433, -609, -1391, -2528, -4208, -6673, -8668, -6653, -7416, -5007, 770, -2356, -2693, -1390, -3352, -8507, -10363, -8011, -3357, -1901, -2513, -2856, -646, 1603, 5696, 6217, 2759, -1654, -528, -971, -2986, -478, 85, -5566, -5024, -1680, -1609, -974, -1335, -7281, -7924, -5799, -7055, -8858, -7770, -2581, 82]
2524H2M523j833l664j313k855O852N302j640n974l235M566J867l27j69N49k139
2508E92L416J640O71P11k512j802K4O77n43r13K260k51l611j163M957J235R94
2491F382k015p50lP93n657m579M287J816J613j493l688K335J957m62n283K54N807
2474A314J169p65J202l267k863N797p60J711p29p85Q60r55k788j855n294j970
2458i978L318J688r72L159M903Q03m651k869K476K874J652n166k178l402J583
2443f760j551m05M674n97M65j77j461K957k67l305N635K992J08j702L0K569M65
2426C670n741M773K32m890m467P68N885K376q31r28J254k696R90M492p75N99k784
2409A927m5J613N850k290m525J494L119k329l683m694j67l419l81l22k311Q233
$$ y = [82, 4605, 2772, -892, -2205, -5060, 1792, 7094, 5454, -520, -3755, 811, 2678, 2351, 2182, 2731, 592, 4008, 5648, 6319, 7030, 4518, 2716, 2740, 3417, 2874, 1961, 4221, 3970, 359, -804, 4153, 5388, 6382, 4367, 3617, 3614, 4407, -1250, -5829, -1542, 274, 1887, 394, -3294, -959, 998, 536, -4747, -4493, 1314, 2483, 1718, 2920, -347, -3210, 2587, 1827, 3538, 2809, 2024, 2884, 1929, -859, -2714, -8008, -9978, -6660, -4972, -5944, -2785, 2118, 2921, -1730, -4599, -2123, 751, 2403, -2763, -4941, -8343, -6760, -8311, -8716, -4042, -4639, -4174, -4351, -5812, -2855, -3122, -6427, -792, 2200, 2308, 606, 636, 3205, 3670, -2071, 2702, 2934, -1956, -6423, -5655, 230, 2606, 1775, 847, 2101, -595, 395, 4887, 4112, 4711, 1927, 1882, 3495, 9345, 7055, 2530, 4024, 7143, 4814, 1131, -3563, -3730, -7149, -7530, -7852, -10163, -1930]
2393a930L517J516k925m061M253J586P89m259l720L158L0J262j534J617J375j084
2377d10j214K154n93r54J537L646q20l35Q83k937J098k236l245N543J559k018
2361A658l892j541l900j079J066J473J203M511M783j23k967j743O673J038j426
2346E734l435l653j421j303o92N125J857L76l505R38K145K164j398j165J440K330
2330E537J78n135o340k507L83N38K03R42K539j022m294m53M200K049J510o887
2314h559J111M259K036Q51o003J693N230L432j26n794O61K174L905O698J997m88
2298A3077m737k684l947k493K530J683M937J214q425j690L29k500K743n64m740
2283e267N197R435k445o120m4K322K465l158m361k27J179l529q58N62J683k281
$$ y = [-1930, 1587, 3103, 178, -3883, 370, 1956, 2745, -1514, -5234, -2076, -2046, -784, -2318, -701, 674, -410, -1624, 530, -63, -1017, 520, 4166, 3346, 3011, 3894, 957, 2055, -181, -3426, 2117, 3676, 1658, -2234, -3775, -7675, -8754, -7688, -6215, -5012, -501, 4282, 4159, 1192, -551, 6122, 7160, 5734, 2299, -1354, -2775, -4078, -4770, 355, 2212, 2588, -917, 21, 2166, 4330, 2932, 1767, 3207, 5537, 5715, 580, -5760, -8267, -7884, -7346, -7143, -6201, -3662, -4684, -8978, -9431, -5231, -3182, -1672, -8559, -7448, -3189, -1153, -302, -6305, -4612, 618, 4050, 3924, -1870, -1209, 965, 4870, 11568, 13565, 13077, 8340, 5656, 1709, -784, 1746, 3429, 8366, 9580, 1155, -535, -206, -2706, 37, -527, -5267, -70, 9365, 6920, 800, 756, 3078, 5543, 2385, -1976, -2203, -1024, -4553, -5411, -4849, -3166, -5447]
2267e447j544O535L017r29k454l399j841K404k116O270M712k767j020j57j067
2252A97j565M269K491l417J239q77j379N65m100K850O068M894l31n403k881K650
2236E270l103m476L442N320K046P68k62k478l115m036j004N208k170m503M03J462
2220a228J123J802N55j040k814m714l093P730N646J784L096j64p394l586K930
2205F33M541J619K727k441o019l659r97K022j525m32N907L674p306L53K076n653
2189d480l465M90L606K305K793m14L688L971Q94L291j474o177j857N044K536Q30
2173A1581k877l689n758j919j198K05J841j59J810L567R49n415n541q92P231K284
2157B020J008J734K275j207k394n533q06K736k229K046O703j675J317K356J645
$$ y = [-5447, -6991, -456, 2561, 1632, -822, -4221, -6062, -3658, -5774, 496, 5208, 2441, 1421, 1264, 197, -1368, 2901, 5392, 1975, 3214, 2337, 958, 1523, -2577, 273, 6341, 11235, 10904, 5501, 2620, 5270, 2167, -2309, 1133, 6453, 8499, 9267, 9005, 6527, 3412, -624, -1628, 3580, 1410, -3093, -2690, -1228, -105, 1697, 2252, 1212, -1602, -6316, -9409, -1679, 3967, 5751, 8847, 8683, 1289, -2297, 633, 5174, 6793, 9520, 7079, 1060, -2599, -3596, -1574, -3099, -3531, 2376, 6050, -1256, -903, 1173, -4480, -7945, -7455, -3849, -1544, 1249, 835, 4523, 8494, 9388, 12679, 11205, 5028, 3171, 8215, 10751, 11581, 8704, 5015, -743, -2662, -3860, -3655, -1814, -1973, -163, 3404, 4353, -1062, -6603, -7495, -264, 2020, 3028, 4762, 7037, 5830, 3436, -2097, -2903, -167, -2396, -350, 6353, 4678, 5995, 8351, 9996]
2142I996K877k63q787o694M32j691N59n587k848K125L956M390J117j044j28n66
2126b156K910j74k526k554k19J117j065M912K955K3m637k234K156j264k372L664
2110a464j892n504K457O373J012o14k380n71k070J617K936J024J234m924j015
2095c781K851j584K598J466K11L494k547o094J987K656R0k098j589K555L498j334
2079B379K155O45k041l25L754K022k860l62Q7k794jK177j730L28k007K463P549
2062A1439K261l540l158J231j155l158r27j389P71J272o07R72L16J875n55j048
2046D600l091R45K542Q82l273p8k39j704k094L231k87R78j700J597k29m521l786
2029f227J382O849K263m579l032J767L834j115p85l48O45M39M918k80n007J167
$$ y = [9996, 12873, 12610, 3823, -2871, -2439, -4130, -3571, -9158, -12006, -9881, -5925, -1535, -418, -1462, -1590, -2156, 754, 580, -1946, -4500, -4719, -3602, -4667, 245, 3200, 3223, -1414, -3648, -1492, -2756, -5128, -1464, -3356, -8860, -6403, -30, 982, 368, -2012, -2583, -4653, -3036, -100, 924, 2158, -2766, -3781, -930, -2514, 84, 1550, 1761, 5255, 2708, -3386, -1399, 1257, 1347, -751, -2340, 215, 3713, 2379, 4534, 5179, 3138, 2813, 6567, 8589, 5729, 5367, 5454, 2660, 2659, 4836, 3106, 3434, 1427, 3890, 11439, 13700, 10160, 7002, 8233, 7078, 3920, 2993, 1604, 2375, 3647, 3040, 4012, 4328, 6203, 5648, 4600, 1509, 2454, 4996, 5878, 2605, 2527, 2288, 584, -1510, 1721, 1434, 2412, 712, 2309, 2080, -2441, -6227, -4845, 2004, 4267, -312, -3344, -1577, 2257, 1142, 357, 9, 654, 1093, 6011, 5731, 724, 1891]
$$ [...]
##END NTUPLES=NMR SPECTRUM
##END=
