##TITLE=Analysis number 308054
Compound Code cc 33101
Book Reference 414/78
Project Code adrs
Chemist Name mattw
##JCAMPDX= 6.0         $$ Bruker NMR JCAMP-DX V2.0
##DATA TYPE= NMR SPECTRUM
##DATA CLASS= NTUPLES
##ORIGIN= Bruker BioSpin GmbH
##OWNER= NMR
$$ XWIN-NMR		Version 3.5
$$ Thu May 19 14:50:10 2005 GMT Daylight Time (UT+1h)  MAYBRIDGE\NMR@NMR_250MHZ
##.OBSERVE FREQUENCY= 250.131544655141
##.OBSERVE NUCLEUS= ^1H
##.ACQUISITION MODE= SIMULTANEOUS (DQD)
##.ACQUISITION SCHEME= undefined
##.AVERAGES= 16
##.DIGITISER RES= 18
##SPECTROMETER/DATA SYSTEM= dpx250
##.PULSE SEQUENCE= zg30
##.SOLVENT NAME= DMSO
##.SHIFT REFERENCE= (INTERNAL, DMSO, 0, 16.522)
##AUDIT TRAIL= $$ (NUMBER, WHEN, WHO, WHERE, WHAT)
$$ ##TITLE= Audit trail, XWIN-NMR		Version 3.5
$$ ##JCAMPDX= 5.01
$$ ##ORIGIN= Bruker BioSpin GmbH
$$ ##OWNER= NMR
$$ C:\u/data/dgb/nmr/ADRS/3200/pdata/1/auditp.txt
$$ ##AUDIT TRAIL=  $$ (NUMBER, WHEN, WHO, WHERE, WHAT)
(   1,<2005-05-19 14:49:50.09 +100>,<MAYBRIDGE\NMR>,<NMR_250MHZ>,
      <created by zg, POWCHK disabled, PULCHK disabled
       configuration hash MD5:
       62 19 C7 07 E1 42 D1 B7 37 6C 3D D0 77 39 F9 E6
       data hash MD5: 64K
       A5 E1 6E B8 EA AD A5 28 E3 69 02 49 4C 18 C9 71>)
(   2,<2005-05-19 14:50:01.99 +100>,<MAYBRIDGE\NMR>,<NMR_250MHZ>,
      <Start of raw data processing
       ef LB = 0.3 FT_mod = 6 PKNL = 1 SI = 32K 
       data hash MD5: 32K
       7A 9A 71 C2 DB F1 A8 E3 90 BD BF ED 40 EE 06 74>)
(   3,<2005-05-19 14:50:03.82 +100>,<MAYBRIDGE\NMR>,<NMR_250MHZ>,
      <apk 
       data hash MD5: 32K
       E1 20 A4 7D 87 02 FB 66 66 60 F2 E7 88 09 0E D3>)
(   4,<2005-05-19 14:50:04.49 +100>,<MAYBRIDGE\NMR>,<NMR_250MHZ>,
      <abs ABSG = 5 
       data hash MD5: 32K
       84 1C 24 82 D4 73 EE 9B C6 D0 D6 26 93 4C A0 BD>)
$$ ##END=
$$ 
$$ hash MD5
$$ E8 18 9E 72 9A E1 4F E7 4E 94 0E 14 02 46 AB 5D
##$RELAX= 
##$RELAX= 
##$RELAX= 
##$RELAX= 
##$RELAX= 
##$RELAX= 
##$RELAX= 
$$ Bruker specific parameters
$$ --------------------------
##$DU= <C:\u>
##$EXPNO= 3200
##$NAME= <ADRS>
##$PROCNO= 1
##$TYPE= <nmr>
##$USER= <dgb>
##$AMP= (0..31)
100 100 100 100 100 100 100 100 100 100 100 100 100 100 100 100 100 100 
100 100 100 100 100 100 100 100 100 100 100 100 100 100 
##$AQSEQ= 0
##$AQ_mod= 3
##$AUNM= <au_zg>
##$AUTOPOS= <53 >
##$BF1= 250.13
##$BF2= 250.13
##$BF3= 250.13
##$BF4= 250.13
##$BF5= 500.13
##$BF6= 500.13
##$BF7= 500.13
##$BF8= 500.13
##$BYTORDA= 1
##$CFDGTYP= 0
##$CFRGTYP= 5
##$CHEMSTR= <none>
##$CNST= (0..31)
1 1 145 1 1 1 1 1 1 1 1 1 1 1 1 1 1 1 1 1 1 1 1 1 1 1 1 1 1 1 1 1 
##$CPDPRG= <>
##$CPDPRG1= <>
##$CPDPRG2= <>
##$CPDPRG3= <>
##$CPDPRG4= <mlev>
##$CPDPRG5= <mlev>
##$CPDPRG6= <mlev>
##$CPDPRG7= <mlev>
##$CPDPRG8= <mlev>
##$CPDPRGB= <>
##$CPDPRGT= <>
##$D= (0..31)
0 1 0 0 0 0 0 0 0 0.06 0 0 0 0 0 0 0.0002 0 0 0 0 0 0 0 0 0 0 0 0 0 0 
0 
##$DATE= 1116510589
##$DBL= (0..7)
120 120 120 120 120 120 120 120 
##$DBP= (0..7)
150 150 150 150 150 150 150 150 
##$DBP07= 0
##$DBPNAM0= <>
##$DBPNAM1= <>
$$ [...]
##$SUBNAM7= <"">
##$SUBNAM8= <"">
##$SUBNAM9= <"">
##$SW= 20.6930455092707
##$SWIBOX= (0..15)
0 0 3 0 0 0 0 0 0 0 0 0 0 0 0 0 
##$SW_h= 5175.983436853
##$TD= 65536
##$TD0= 1
##$TE= 295.16
##$TE2= 300
##$TE3= 300
##$TEG= 300
##$TL= (0..7)
0 120 120 120 120 120 120 120 
##$TP= (0..7)
150 150 150 150 150 150 150 150 
##$TP07= 0
##$TPNAME0= <>
##$TPNAME1= <>
##$TPNAME2= <>
##$TPNAME3= <>
##$TPNAME4= <>
##$TPNAME5= <>
##$TPNAME6= <>
##$TPNAME7= <>
##$TPOAL= (0..7)
0.5 0.5 0.5 0.5 0.5 0.5 0.5 0.5 
##$TPOFFS= (0..7)
0 0 0 0 0 0 0 0 
##$TUNHIN= 0
##$TUNHOUT= 0
##$TUNXOUT= 0
##$USERA1= <user>
##$USERA2= <user>
##$USERA3= <user>
##$USERA4= <user>
##$USERA5= <user>
##$V9= 5
##$VALIST= <valist>
##$VCLIST= <CCCCCCCCCCCCCCC>
##$VD= 0
##$VDLIST= <DDDDDDDDDDDDDDD>
##$VPLIST= <PPPPPPPPPPPPPPP>
##$VTLIST= <TTTTTTTTTTTTTTT>
##$WBST= 1024
##$WBSW= 4
##$XGAIN= (0..3)
0 0 0 0 
##$XL= 0
##$YL= 0
##$YMAX_a= 237351
##$YMIN_a= -229406
##$ZGOPTNS= <>
##$ZL1= 120
##$ZL2= 120
##$ZL3= 120
##$ZL4= 120
##$ABSF1= 16.522
##$ABSF2= -4.171173
##$ABSG= 5
##$ABSL= 3
##$ALPHA= 0
##$AQORDER= 0
##$ASSFAC= 0
##$ASSFACI= 0
##$ASSFACX= 0
##$ASSWID= 0
##$AUNMP= <proc_1d>
##$AZFE= 0.1
##$AZFW= 0.1
##$BCFW= 0
##$BC_mod= 0
##$BYTORDP= 0
##$COROFFS= 0
##$CY= 12.5
##$DATMOD= 1
##$DC= 0
##$DFILT= <>
##$DTYPP= 0
##$F1P= 14.0000005364418
##$F2P= -0.99999901652339
##$FCOR= 0.5
##$FTSIZE= 32768
##$FT_mod= 6
##$GAMMA= 0
##$GB= 0
##$INTBC= 1
##$INTSCL= 1
##$ISEN= 128
##$LB= 0.3
##$LEV0= 0
##$LPBIN= 0
##$MAXI= 10000
##$MC2= 0
##$MEAN= 0
##$ME_mod= 0
##$MI= 0
##$NCOEF= 0
##$NC_proc= -5
##$NLEV= 6
##$NOISF1= 0
##$NOISF2= 0
##$NSP= 0
##$NTH_PI= 0
##$NZP= 0
##$OFFSET= 16.522
##$PC= 1
##$PHC0= -72.12876
##$PHC1= -13.47053
##$PH_mod= 1
##$PKNL= yes
##$PPARMOD= 0
##$PSCAL= 4
##$PSIGN= 0
##$REVERSE= no
##$SF= 250.13
##$SI= 32768
##$SIGF1= 0
##$SIGF2= 0
##$SINO= 400
##$SIOLD= 32768
##$SREGLST= <1H.DMSO>
##$SSB= 0
##$STSI= 32768
##$STSR= 0
##$SW_p= 5175.98343685301
##$SYMM= 0
##$S_DEV= 0
##$TDeff= 65536
##$TDoff= 0
##$TI= <Analysis number 999999
Compound Code 99
Book Reference 9
Project Code 9>
##$TILT= no
##$TM1= 0
##$TM2= 0
##$TOPLEV= 0
##$USERP1= <user>
##$USERP2= <user>
##$USERP3= <user>
##$USERP4= <user>
##$USERP5= <user>
##$WDW= 1
##$XDIM= 32768
##$YMAX_p= 392558443
##$YMIN_p= -2303386
$$ End of Bruker specific parameters
$$ ---------------------------------
##NTUPLES= NMR SPECTRUM
##VAR_NAME=  FREQUENCY,     SPECTRUM/REAL,   SPECTRUM/IMAG
##SYMBOL=    X,             R,               I
##VAR_TYPE=  INDEPENDENT,   DEPENDENT,       DEPENDENT
##VAR_FORM=  AFFN,          ASDF,            ASDF
##VAR_DIM=   32768,         32768,           32768
##UNITS=     HZ,            ARBITRARY UNITS, ARBITRARY UNITS
##FACTOR=    0.157963299565203, 1,           1
##FIRST=     4132.6476996994, 0,             0
##LAST=      -1043.33573715361, 0,           0
##MIN=       -1043.33573715361, -2303386,    0
##MAX=       4132.6476996994, 392558443,     0
$$ Real data points
##PAGE= N=1
##DATA TABLE= (X++(R..R)), XYDATA
$$ [...]
19476 1488705 1627828 1988841 2182013 2462716 2675353 2966907 3193957 3632904 3807826
19467 3807826 3797350 4207275 4557982 4773938 5292466 5642536 5953458 6164718 6894275 7664730
19457 7664730 8677957 9939422 11598720 13534872 16011363 19387282 24001857 31299424
19449 31299424 42550089 60174958 85577930 115028535 143113768 164898014 178257440
19442 178257440 186202313 189954549 190088918 188810642 190232412 193980946 197743980 196959166
19434 196959166 191965892 181805788 164779853 139505797 110090552 82543594 60851667
19427 60851667 45557318 34868545 27613486 22531868 18918894 16362895 14370656 12557182
19419 12557182 11312714 10367800 9566808 8743823 8052625 7505915 7005476 6645146 6304246
19410 6304246 5824829 5631146 5286284 4987009 4579532 4223799 3928290 3905214 3736766 3598640
19400 3598640 3483102 3459203 3194844 2873000 2287129 2134287 2088625 1921431 1765439 1687356
19390 1687356 1805580 1846798 1777051 1412620 1286282 1466064 1662437 1699261 1664009 1610897
19380 1610897 1387770 1227430 1222460 1112005 867391 857255 678884 709026 935473 892494
19370 892494 682565 270824 216077 299043 658400 868831 749500 574412 656201 816410
19360 816410 934556 888517 988220 1110430 1409878 1752891 1786121 1657137 1687465 1688867 1732248
19349 1732248 1802675 1540060 1293792 1213207 1224662 1261971 1221802 1099840 1015651 938838 1108187
19338 1108187 1118843 732810 414927 419465 355950 312121 332561 208724 349088 371164 572299
19327 572299 612248 619888 615775 518562 639391 634912 358975 495998 495022 390611 513406
19316 513406 640181 524936 371258 378496 482620 536816 404305 80228 -149547 58087
19306 58087 121794 -95132 -230531 -173688 64133 227932 304605 -9862 -310723 -492810
19296 -492810 -448713 -184643 -96824 -130025 -67275 -21491 32097 162787 215215 192561 290721
19285 290721 169528 -177796 -176184 -49132 173414 252783 237867 246901 187677 125091 102126
19274 102126 -26307 -185065 -311910 -457942 -231664 168593 355854 349885 448671 224418
19264 224418 83879 167711 -44815 -11562 307741 445839 183380 -6344 60041 241190
19254 241190 485737 680725 564672 145928 200273 283650 6308 -26268 52186 221701
19244 221701 446295 713860 823591 586028 467540 486235 554248 354803 202870 124301
19234 124301 219498 217745 298480 185521 348876 334425 324111 309683 319667 341675 197039
19223 197039 192872 -115633 -283944 -105715 -480 8943 -48823 16714 243254 451403 462534
19212 462534 297449 155603 147425 231638 104732 178334 584890 753321 828031 815643 724863
19201 724863 651714 591423 412198 161379 245855 546481 376051 438336 679374 599529
19191 599529 328135 217853 383669 392182 299822 497972 670217 850248 717503 633477
19181 633477 513418 311412 279127 134406 105790 130948 110515 74033 133405 6246 -113300
19170 -113300 8088 -75491 130025 298051 368440 166944 46649 171250 120869 -149340
19160 -149340 -294342 -279890 -138355 63614 189523 32590 -29803 219965 531115 612909
19150 612909 660346 871399 1098257 1160008 1024819 997315 922530 912356 783141 594248
19140 594248 555463 454035 257545 166434 192003 308063 415831 374113 288833 495715
19130 495715 305613 235524 299614 103267 -157168 49835 270388 367288 307461 95742
19120 95742 -228335 -264090 -57117 -67864 36215 26229 177104 -145637 -133385 -184342 -91218
19109 -91218 -72044 -160174 -61658 228315 225326 7853 698 115658 241563 156610 -30067
19098 -30067 -189723 -287901 -362180 -359639 -227169 -47186 17190 -62110 -53842 51059 33585
19087 33585 177567 218152 151290 160445 109584 185996 240348 384877 300058 -13171 -100893
19076 -100893 -177821 -41152 -129181 -208114 -150004 -197805 -40111 74625 170198 186458 275961
19065 275961 333336 269567 46452 229624 203064 113748 297045 355585 385609 656634 489877
19054 489877 130883 127511 -34509 -84626 -164770 -23905 -156388 -130193 -252898 -357943
19044 -357943 -196842 -66332 -115332 -41290 1077 -29165 -88312 -420333 -552640 -539362 -498080
19033 -498080 -233009 -258013 -229875 -47958 12646 438881 299647 -16313 126244 64134
19023 64134 113554 436902 485609 409471 472549 623430 531654 472246 325823 380497 238818
19012 238818 279918 371619 273033 108886 225929 378269 250130 216536 329560 379789
19002 379789 414450 277693 103876 -97577 -227471 11719 142469 266998 32497 -328610
18992 -328610 -381937 -193480 15993 138974 94266 212696 239896 291384 179023 276352
18982 276352 245294 251742 207109 -1809 60581 71180 186144 61343 -187713 22479 228436
18971 228436 -91261 -391268 -447243 -305699 -82958 -87697 -228978 -109683 -80900 -102748
18961 -102748 -184976 -198683 -71591 -163084 -108203 -17985 -85922 -121887 -332712 -134340 100276
18950 100276 308112 414136 546604 515955 282873 186230 251154 325661 410419 396410 241385
18939 241385 164424 90127 116449 277461 201732 138408 132509 192818 252948 277002 23577
18928 23577 -131368 -150315 148056 250876 243565 161224 140528 200290 248578 244061 342301
18917 342301 312363 307003 135195 39561 140610 56289 213952 193008 12957 -80475 -304381
18906 -304381 -210349 36456 186880 38285 129427 96943 82565 59600 26631 -146632 -91725
18895 -91725 -60714 -131310 103026 344582 412434 584717 752425 765106 550893 580729 347378
18884 347378 175839 253498 114079 187380 250804 255234 306184 152773 -149351 -443149 -512328
18873 -512328 -299461 55139 290499 325753 195335 17602 -5323 41449 79335 -60035
18863 -60035 42276 -152039 -200780 -47704 233960 517377 724179 545214 260203 57519
18853 57519 24144 93874 38366 -47182 172368 360198 221543 233774 227270 210504 376361
18842 376361 263340 144320 72235 10502 168303 553644 488326 625547 643836 553716
18832 553716 559340 726785 644224 646324 469662 286820 539715 667246 751610 1041687 1210224
18821 1210224 1520022 1624813 1778095 1867557 2204368 2633629 2585354 2458922 2515932 2711049
18811 2711049 3016692 3067802 2880276 2826564 2797939 2739413 2794491 2554247 2412852 2369600
18801 2369600 2236473 2291012 2431926 2813549 3027346 3094213 3190202 3344914 3363353 3579861
18791 3579861 3834799 4215264 4190914 4266546 4505854 4651026 4677048 4664479 4693091 4782788
18781 4782788 4989460 5320768 5640187 5676962 5943648 6650197 7694957 9007662 10181430
18772 10181430 11651476 13568750 16025712 19043671 23491468 29934929 39464203 54761083
18764 54761083 79926405 120157017 176373344 227703878 243783086 223925958 188080433
18757 188080433 156770585 144026896 155476112 190834325 232491382 246376726 222485845
18750 222485845 176696658 128881207 91544133 66360010 49976452 39641660 33651319
18743 33651319 30671003 30714035 33357742 36825643 38536125 36768691 32180428 27007369
18735 27007369 22590289 19728589 18487473 19723417 22681520 25988993 28066879 27518820
18727 27518820 24649608 20673717 16961167 14298695 12259140 10483192 9032881 8095297
18719 8095297 7257484 7039307 7150476 7224770 6961857 6733286 6700853 6751679 6714949 6651936
18709 6651936 6801047 7051843 7067337 7041067 6867686 6669163 6627093 6647574 7067682 7624726
18699 7624726 8118720 8892035 9515301 9975585 10204296 10939736 11871222 12851624 13997028
18690 13997028 15991800 18654845 22102316 26369564 32196857 40971053 54303298 75426575
18682 75426575 107506175 147796666 184295329 202513976 195947381 171701349 143753755
18675 143753755 122642899 113741413 119576409 141562035 176099839 210031508 229858286
18668 229858286 228829628 213002275 198114725 194385320 196732755 196668873 196306627 201013771
18660 201013771 208956989 213164277 215549217 215276298 207027027 194017215 183164235 173414796
18652 173414796 156814938 131596407 103343006 78029547 58714002 45431382 36495015
18645 36495015 30117340 25729516 22447496 19951838 18002364 16160858 14530989 13181652
18637 13181652 12235699 11690802 10803390 9890830 8727533 7963108 7770359 7501966 6846761
18628 6846761 6303178 5949207 5731519 5390735 5184904 4878012 4656365 4675293 4639343 4609350
18618 4609350 4601031 4809518 5061392 5330580 5158889 5238981 5402216 5844431 6300415 6748622
18608 6748622 7827607 9557389 12489740 16219754 19446580 21002611 22173549 24114878
18600 24114878 25827570 26275681 26285967 25538251 23879367 22033184 21252259 20532614 18328416
18591 18328416 14871642 11367398 8451453 6534677 5168941 4338201 3724783 3372097
18583 3372097 3161598 2937999 2804938 2482117 2380036 2273622 2381954 2250791 2157917 1922385
18573 1922385 1728302 1529583 1348493 1383912 1393060 1370256 1423806 1345051 1389133 1349868 1193910
18562 1193910 1152393 1295503 1416188 1252442 954606 908291 1022172 1258968 1323698 1402183
18552 1402183 1148727 1055867 1060233 1132687 1190069 1178898 867139 704556 881229 985742
18542 985742 1038339 891198 831548 769550 697272 663254 685729 830967 629337 343160 195752
18531 195752 269103 388052 331161 88579 220500 122248 175 335833 591209 649702
18521 649702 514511 304262 366133 273320 261429 351016 343978 395678 509940 637127 538032
18510 538032 450276 588217 613158 621994 476154 451736 537117 574385 337820 64920 105418
18499 105418 60714 -240591 -260734 -261153 -156529 167621 316244 234338 200025 190261 233119
18488 233119 383730 179742 226417 142953 202032 322386 263997 497610 582699 547711 264107
18477 264107 204533 193752 131607 243635 450969 496837 522552 367238 168065 89004 212270
18466 212270 287546 142270 112753 106802 347991 320266 255077 346844 110565 -7056 -54716
18455 -54716 54319 342854 382084 522694 409939 140760 23330 212797 312471 281662
18445 281662 252030 305474 528875 397183 171972 193346 256020 336137 463153 209094
18435 209094 -35777 -132670 -87342 -119113 17435 151867 60179 -111929 -136701 -41009 -169338
18424 -169338 -269265 -213114 -136393 -231220 -7883 -66201 -11779 145521 232897 270694 395832
18413 395832 171144 149661 213043 287197 308532 302169 108264 176787 422439 566571 436955
18402 436955 252279 116329 19556 257167 458602 397944 313945 107164 205087 306391
18392 306391 309181 212206 134253 84862 45036 114352 389484 676490 606864 392550 250316
18381 250316 136911 -138626 -255711 -59280 47695 -77978 -164362 -259379 -143822 -14961
18371 -14961 59262 61365 250694 236220 -83752 42017 315408 293465 11827 114928 256352
18360 256352 175353 196122 420694 533212 335985 122968 186265 101465 -77172 -51197
18350 -51197 321786 449025 289348 347067 424000 59719 -174909 -291779 -140415 -217676
18340 -217676 -35826 72783 119857 -8686 26021 152085 294799 208035 -86627 -112103
18330 -112103 -172586 -162864 -153994 31608 54236 141074 5800 -275046 -422472 -471452 -355876
18319 -355876 -326693 -278856 -241339 -253110 -410049 -403734 -303749 -43393 117107 85639 111431
18308 111431 78699 22954 -126318 43099 200895 272656 295193 269464 139967 -69991
18298 -69991 24567 20327 -42940 34440 273390 426382 427006 539579 469302 242021 169286
18287 169286 196285 145404 148968 147117 -87936 -282043 -385164 -300418 -196145 22059 71972
18276 71972 135198 50006 -8778 -46733 94844 39417 40532 143764 79961 -6220 -190784
18265 -190784 -385507 -432691 -434907 -105412 178287 201746 -1563 -62044 134276 260985
18255 260985 437497 613994 408472 169165 -32365 -153248 41268 186972 221753 126217
18245 126217 187892 307860 506288 465365 402120 274026 122148 114558 74500 445369 519776
18234 519776 419710 646903 488300 243259 221847 292042 317181 414329 392241 123281
18224 123281 164401 77659 399522 675720 304305 71291 187999 264845 300004 440449
18214 440449 492188 390325 89447 -1261 -144754 -57943 164715 282159 92314 -61591
18204 -61591 33461 105123 145772 359582 214258 165568 268410 427435 404684 406225 148962
18193 148962 228459 496866 617987 646664 700536 794800 919689 709231 569387 504367
18183 504367 579425 715911 977845 1073789 914057 628340 635950 648013 386508 470156 575188
18172 575188 641827 474444 306913 246057 298024 378278 415074 664830 742039 710574 823250
18161 823250 814143 938552 1005767 901136 1126418 1291755 1083283 1101855 1086920 967548
18151 967548 1001261 947883 921721 820549 918987 928581 930654 727149 597179 461511 433126
18140 433126 522063 699006 730278 804629 1062106 1348796 1309507 1421516 1545880 1266982
18130 1266982 1234450 1318525 1169652 966034 757869 769122 784433 810426 804139 726354 726521
18119 726521 575696 630803 528150 399662 529879 328153 226864 445048 465031 170643
18109 170643 231443 356376 408767 377636 179754 146883 144506 79157 9700 177746 199275
18098 199275 124846 62736 157084 295558 467801 564963 274184 -40229 -69773 55952
18088 55952 55618 -52392 31456 131627 210428 258028 430185 607512 551827 442459 419434
18077 419434 401421 516845 449121 233051 355109 416452 149595 256908 344592 206195
18067 206195 33882 19145 -48740 -20796 -24307 -94325 -79307 -323771 -210460 -16601 -33709
18056 -33709 -7314 -4943 36390 69569 195055 279624 143642 -47171 87587 161862 -62624
18045 -62624 -121184 -303178 -241996 -124980 -81107 -2975 -142317 -173608 30519 -36175 83480
18034 83480 160645 189441 177265 27888 4125 -151940 -102717 10517 -4045 -165256 -315710
18023 -315710 -275521 -90478 5434 -130786 -192237 -54894 66292 -48867 21410 201203
18013 201203 300339 311040 183379 205340 78865 -157650 -255210 -93995 26225 136813
18003 136813 433973 426241 282823 20185 -211358 -222106 69373 289832 136369 24823
17993 24823 -235466 -475838 -374016 -94548 144950 194653 -49891 -160410 -116551 169197
17983 169197 98633 21302 81668 -257117 -146671 -9858 -13833 -33237 114961 63678 182928
17972 182928 92628 -246410 -118780 79970 -154718 -239313 -200481 -136745 122864 238283
17962 238283 74434 -31610 247543 389174 450550 275155 -14845 -147897 -228757 -68248
17952 -68248 -102682 -151403 -135901 59660 97185 136504 119738 -153392 -176500 -83682 -171019
17941 -171019 -189550 -309895 -847 190386 67599 57199 149214 211269 27256 -171661
17931 -171661 -229616 -178959 -108845 -88590 -76319 -63845 59349 107728 78582 -136311 -26352
17920 -26352 12418 -108648 166696 427442 118711 7720 -38417 170803 305925 154708
17910 154708 -109014 -107141 89779 -16083 -102756 -57325 -184790 -53714 -59924 -1527 174535
17899 174535 137416 -76065 -204376 120947 176863 159104 184197 122328 -44508 -141886 -30340
17888 -30340 4827 60806 72208 -186799 -125841 41389 -96857 -185523 -68852 67320 114222
17877 114222 16470 -38044 -35440 22765 9761 -39505 123644 -25397 80408 63918 -97752
17866 -97752 -2393 41123 30549 -144405 -152373 -200472 -222744 -227250 -60405 -52785 -255993 -351356
17854 -351356 -74742 -217532 -162832 22454 -88178 -171190 -305202 -109802 182155 246136
17844 246136 120345 -17588 -69533 22888 90239 -1561 108806 129956 256914 193461 191907
17833 191907 288264 417221 378846 224151 -9219 -302456 -212303 -60281 58004 57028 -33686
17822 -33686 -53681 41788 17500 -125145 -20464 -33483 -93236 -57438 46847 -139392 -333031
17811 -333031 -391245 -259292 -221104 120357 91845 135766 -53182 -267012 -240434 -151238 -222850
17800 -222850 -132495 -144460 -182910 -255380 -382614 -288939 -344015 -155633 33738 29776 47945
17789 47945 265646 365550 337307 321603 246647 191704 133344 130159 115381 120327 270589 489461
17777 489461 482320 515928 621328 514760 452950 338707 107121 195954 365173 366082 402272
17766 402272 521171 489112 449800 328147 99024 46178 -52638 -116772 -99597 -115841 -30040
17755 -30040 -75524 19697 101605 101144 15441 -281320 -377183 -461135 -373802 -341277 -28247 168920
17743 168920 121373 134455 40792 3875 -96057 -142457 -273927 -174073 -117321 -7766 -95220
17732 -95220 -78936 -127039 -118991 -196191 -128166 -113057 -87477 -45634 -114655 -25679 57024 118197
17720 118197 -216710 -259093 -26277 80352 20892 181293 283190 198842 42367 33279
17710 33279 -63512 -155757 -308322 -312841 -232185 180411 351362 422065 261857 25263 -166456
17699 -166456 -134034 -221089 -186244 -151452 -72011 57783 43542 -117818 -170870 -316204 -64667
17688 -64667 71222 144759 264711 233199 134270 -31106 -218813 -284379 -129336 84414
17678 84414 43692 -44861 -38992 -285202 -162023 -155474 -394733 -400049 -473985 -415202 -161032
17667 -161032 170806 218688 242639 492758 378487 222469 166459 266713 298352 279283
17657 279283 321225 402580 492458 518239 398874 216762 288320 451100 214813 10692
17647 10692 -309671 -244892 -186247 -101371 37053 48953 57593 -91806 -224188 -194817 2673
17636 2673 124379 140955 -59344 -40356 -88402 -91580 -196565 -227137 -345349 -156869 -25412
17625 -25412 138879 118983 -40536 -118316 -37527 66399 186747 87087 34983 -51438 31562
17614 31562 -98992 -139657 -45354 -135068 -98937 79195 136523 4018 87319 98946 -14590
17603 -14590 -158703 -286414 -377605 -183784 -97080 -50492 -33534 84336 199208 189776 38094
17592 38094 -118151 -22202 -239709 -180194 -111010 278789 456996 327683 174239 53048
17582 53048 31770 73680 203518 228580 471200 487213 246373 -16007 100694 230838
17572 230838 524875 519340 259166 13376 -113680 -41975 223081 203943 247898 158384 30192
17561 30192 -213419 -139496 98586 300599 323786 290508 319504 107631 -124177 -126173 1491
17550 1491 229620 189832 129193 43879 -62843 -254359 -417976 -268466 -151728 24117
17540 24117 -166095 -232447 -14097 189739 236439 139498 168115 205757 344374 466818 321674
17529 321674 118040 90290 58322 93260 3892 -22167 124323 25534 -9880 -115557 -228360
17518 -228360 98427 291618 220512 249536 281531 265221 286323 178780 263642 512783 347542
17507 347542 137320 -32800 -277768 -461741 -303386 -413179 -435643 -151176 275216 380194
17497 380194 159077 -65485 -320721 -446811 -164205 101541 248187 357514 184333 -2778
17487 -2778 104545 177484 312199 233189 249819 86623 -169775 -27135 262626 373885
17477 373885 427712 539292 508450 312954 87297 -33531 -9347 126208 120878 196879 289673
17466 289673 271634 364300 292743 114116 71670 58149 172329 132912 -109749 -113248 116811
17455 116811 -32913 -220114 -398237 -387515 -107466 218966 347852 369489 25085 -140180
17445 -140180 -201054 -87086 273676 144842 -21242 -164838 -367777 -426414 -186244 -97657
17435 -97657 43365 138102 224953 185186 83776 -121920 73 177296 200103 93381
17425 93381 -53496 -115473 -276036 -466204 -338356 -116513 244143 180021 137025 203201
17415 203201 280124 250194 251814 300423 394394 328705 251923 268524 -15420 48090 131610
17404 131610 9142 -19568 20135 27444 56015 13468 -133479 -162635 -126196 -73398 -113014
17393 -113014 -325468 -411735 -387283 -385771 -66115 335361 519251 386080 58764 52449 118188
17382 118188 105374 128103 92699 65253 -64788 -94183 -75789 124622 112315 -334260 -277716
17371 -277716 -175108 21482 61711 -20591 -4748 108779 136588 30992 109966 262619
17361 262619 195104 -32873 -221901 -211614 -71876 126210 183572 206778 311743 157870
17351 157870 21531 53031 87611 132036 48487 -36419 -43903 59330 10466 162049 179656
17340 179656 146359 181300 146872 279761 299677 132552 -139514 -252839 -208346 -46542
17330 -46542 17123 -195452 -266745 -231488 -19981 276843 297774 228554 143906 108621 197294
17319 197294 208050 141528 131347 -65900 12045 253434 250142 56935 -89028 -112394 -332369
17308 -332369 -287434 -262371 -156004 -290785 -256399 -53106 163043 406993 407299 294067 368300
17297 368300 423719 301095 343668 301706 163729 172032 238034 258891 -46 -66782 -15349
17286 -15349 -107875 -186122 -261585 -424414 -340067 -126756 -248225 -378894 -457598 -419561 -446232
17275 -446232 -293383 -423622 -215382 -91296 8809 -27097 -144899 -64701 -119038 -76813
17265 -76813 67943 113549 193246 223097 72920 -52640 -190522 86291 341330 325997
17255 325997 301954 399045 330446 95405 62979 -133436 -264525 49203 141305 39178
17245 39178 -112703 -280394 -217435 -222167 -229674 -206586 -299965 -112840 152968 -16069 -36394
17234 -36394 -60194 82223 342044 114533 -199935 17142 186974 208824 97574 246320
17224 246320 333709 381759 199251 80332 16583 -54821 6444 87855 217450 48554 -69206
17213 -69206 -185666 -169343 -262721 -218734 -213320 -269477 -427796 -396403 -263750 -309411 -179407
17202 -179407 -273147 -165176 35345 -9 176177 51660 -76762 117437 99367 221589
17192 221589 125567 115639 -34099 -132937 -294913 -270080 -164832 76169 173434 104020 2078
17181 2078 30903 32725 151108 31313 -8197 -158143 -419381 -356931 -181293 -207498 -288339
17170 -288339 -259171 -323898 -64017 120741 17608 -47926 -102832 -209251 -53355 273494
17160 273494 366267 339993 87213 22271 162170 115327 120668 149208 253925 216893 274329
17149 274329 185088 66921 -225655 -323956 -143224 -2463 -217958 -201586 -67797 -243488
17139 -243488 -371753 -467772 -242746 63182 99974 -23764 -26843 210416 288436 220111 121051
17128 121051 158737 217595 137860 105040 91794 155422 187523 115123 137265 201956 115122
17117 115122 -9434 -74694 -42278 -283646 -196684 27881 183035 317949 428267 162986
17107 162986 171630 172222 74166 -64246 -84783 93721 167533 319481 437315 304162 169768
17096 169768 323331 357828 155587 -46831 -145846 -242909 -34536 14817 -131425 -1006
17086 -1006 204507 195251 9261 -71048 -296945 -265307 -33888 -92350 21978 -54344 -267479
17075 -267479 -326323 -348084 -397891 -308722 -104824 -60751 -879 73899 161575 88982 -79419
17064 -79419 -93198 9264 356355 462161 296521 28171 176917 149789 -253514 -180516
17054 -180516 -96637 59226 74520 154702 171824 150663 2622 169689 428062 403647 328756
17043 328756 459647 335134 248314 395298 470835 505784 257614 2954 -14429 206422
17033 206422 152090 17873 150357 160653 36588 -165526 -324155 -243209 -35806 150650
17023 150650 47079 -109971 11125 90704 -99168 -2595 110838 88912 -18903 -80494
17013 -80494 -16069 127805 219622 104899 173882 211186 322310 278375 196506 226611 447292
17002 447292 296879 43827 -28448 57586 -22609 -129459 16169 33165 -7499 190767
16992 190767 54432 -160024 -206069 -174339 -385363 -265575 -280871 -430492 -285341 -254067
16982 -254067 -373573 -363932 -448459 -346806 -369913 -445273 -176659 -10877 -801 216224 137852
16971 137852 -63409 -9139 6421 -165472 -363019 -350715 -144246 5724 -134217 -360994
16961 -360994 -301096 166827 220775 161542 169481 250573 110941 -118623 -168799 -44845 238885
16950 238885 61026 -48142 155881 192123 159920 53943 -132050 -229073 -124537 -228375
16940 -228375 -104139 -10281 112461 -184525 -235874 -155820 53709 -129562 -137229 -271894
16930 -271894 -219347 -251096 -362002 -94855 352036 406364 205816 -18760 125390 29937
16920 29937 -16208 -149608 -258199 -150706 89835 43081 37655 -45328 -139458 -221645 -357917
16909 -357917 -279365 -165527 -166885 -116670 -171979 -122637 -105551 -103288 -238312 -116961 -224838
16898 -224838 -298441 -228598 -135741 -144167 -57321 -85237 -18144 252176 338920 357651 128620
16887 128620 -134002 79561 165523 15137 -57417 -61692 5969 -94490 2230 23290 160205
16876 160205 190778 -100365 -248239 -216640 -240363 -248238 -360785 -271206 -18441 142887 126000
16865 126000 11432 73637 200596 189870 153156 44346 198670 214171 82979 30217
16855 30217 75936 66305 235617 309842 339347 219043 -21877 90288 63782 -56389 17921
16844 17921 753 -56929 -80929 -66026 -2968 200051 361752 327779 394139 246595 109905
16833 109905 14246 68234 297995 211339 -85148 -168959 -239092 -92300 113745 206978 23009
16822 23009 167053 275851 174594 81245 -40679 -98860 -66249 -130132 34788 -68954
16812 -68954 -261482 -235763 -425763 -350247 -161374 -154593 -20108 -35183 29913 -10212 -72213
16801 -72213 -171807 -137319 -231846 -304415 -240120 -154397 51281 143816 13495 55556 93233
16790 93233 18920 -26281 199620 250218 11408 38174 179465 138575 -40570 -193638 7417
16779 7417 324548 237404 233877 423475 331810 628390 818264 513952 232048 66102 81575
16768 81575 157861 79196 -8400 97807 344543 450443 285539 -201553 -284338 -134173
16758 -134173 -85609 -68364 -55302 153172 127280 -69390 -149332 -290311 -407408 -188527
16748 -188527 11620 -18538 26942 117390 53295 15437 -87094 -16867 239704 230072 373947
16737 373947 424714 277692 119550 153728 10589 -79122 -58919 1939 52046 -130792 -208158
16726 -208158 -260284 -247364 -50999 -20987 74033 154588 21118 212772 386116 574477
16716 574477 501644 419978 300702 156370 79896 -52583 -175183 -105736 -73310 73886
16706 73886 95883 -14505 -228683 -217326 79770 355334 314381 68881 -48813 -102058
16696 -102058 -9034 60936 60898 28209 99400 123510 199524 192824 233590 267291 267701 129050
16684 129050 1374 -50357 -44277 -152643 -214919 -141161 -175043 -19498 137896 410001 383877
16673 383877 295175 208034 253655 199932 -64335 -264186 -156806 -72528 -59421 -15721 32278
16662 32278 -131715 -247191 -375580 -315654 -415736 -436610 -280991 -176005 -127227 52761
16652 52761 46877 135509 108196 -42779 -152003 -187765 -151411 -29373 -23353 174231 295074
16641 295074 171072 484794 530714 174433 63902 190941 60170 152620 116547 134213
16631 134213 233551 101706 -139899 -27068 34396 137134 -57462 -171272 -281201 -116648
16621 -116648 10582 -259565 -485344 -483350 -174775 271867 168002 -32963 48518 248321
16611 248321 244406 273990 157823 106837 174533 278023 139096 164326 301519 444101 341020
16600 341020 383573 400076 447747 278986 384076 228720 208485 494695 496676 227106 115624
16589 115624 251668 383366 405542 154523 320284 410685 387385 9596 -180053 46536
16579 46536 163948 -12133 -43737 222424 317283 289710 320031 208723 64923 7870 54118
16568 54118 95947 -5008 -22281 62198 -20086 104568 223183 55269 -242551 -109184
16558 -109184 -130717 -254753 -104917 -130682 -71736 -121300 -125024 -14835 -216352 -426370 -326261
16547 -326261 -256376 -189159 -58617 60571 59089 112838 148304 178568 227210 214780 115681
16536 115681 -61609 17347 202011 237009 177235 354473 465145 334914 222030 249329
16526 249329 498678 505070 117774 60758 290705 567369 304147 -14286 43333 42769 -13945
16515 -13945 -248425 -168328 -41100 -120279 -150014 -17693 73804 231822 449506 447705 352990
16504 352990 275331 445527 376297 400360 240881 -55484 -45322 22499 89064 222876 199531
16493 199531 158427 160311 296542 264807 375701 416442 428047 596371 522509 270896 269695
16482 269695 242886 160635 30718 118336 160743 31724 116171 219850 281688 204494 238514
16471 238514 273463 173289 245408 128927 135667 195999 179326 243989 117843 143132 263842
16460 263842 359937 533327 523838 262566 282337 279234 600995 600738 362048 35187 -16554
16449 -16554 201827 334626 109210 -95556 9891 123221 191809 149277 67683 166532
16439 166532 372046 296524 180315 22337 -119599 -125943 -196301 -164583 68325 11180 1520
16428 1520 -9775 100321 118756 26402 55501 188586 300541 250989 106730 259165 260427
16417 260427 164397 347523 589925 379849 290085 83332 240525 277800 205785 39283
16407 39283 259527 102473 229977 510011 618234 395795 160762 -125783 -183095 -26764
16397 -26764 -63359 52928 198446 308571 333678 137933 234764 216277 268900 250040 295505
16386 295505 248918 188459 355645 376767 261741 215249 75058 287656 379921 460444 422308
16375 422308 242163 301366 245275 29947 -110368 -162826 -109862 -233604 -316062 -412535 -251935
16364 -251935 3268 111147 16458 38695 -622 112060 19715 113285 114351 258452 178713
16353 178713 309381 436802 175907 91688 120520 -113379 -55640 -173198 -205504 -23827
16343 -23827 124117 272806 465755 188622 9875 -114658 -107049 -204182 -170596 -109828 -156745
16332 -156745 -16136 184643 349242 323526 -23942 -281809 -83348 173999 317313 255382
16322 255382 163185 245116 159266 -121510 11931 -55271 -201149 -345551 -154697 106087
16312 106087 360997 297490 254396 180587 39084 -64677 -110676 8369 237875 237111 166452
16301 166452 129056 198143 302884 101845 165814 -22547 -227360 -295264 -249897 120825
16291 120825 253900 263123 302246 361615 374567 349361 139607 -24592 -88429 9572 210416
16280 210416 103149 -170578 -111474 -38409 -34328 -53483 28702 175835 322392 454383 128386
16269 128386 156179 200194 98259 132845 -68976 -293746 -126956 -151866 -276658 -219787
16259 -219787 -53964 -196643 -98281 -70018 -18440 14758 -20094 -179396 -338908 -274861 -299995
16248 -299995 -120007 112720 -7541 44983 71708 161337 313256 264862 108278 75079
16238 75079 309387 223944 -252136 -343459 -299571 -112587 -154407 -270831 29719 207023
16228 207023 91641 -96305 -59955 -51009 81621 7578 -22871 160737 52335 2129 140727
16217 140727 147917 359482 513395 508665 283009 134743 -49043 8241 148 108287 272665
16206 272665 204708 94132 7083 -103951 107085 238311 183772 3525 52173 184758
16196 184758 123195 172062 275038 405658 303814 408045 295771 228181 188489 152057
16186 152057 212176 474739 726372 774534 484747 429529 434931 311953 572979 541874 242524
16175 242524 298178 301954 156084 -94632 -170022 -168746 -134127 -213600 -40524 -79773 -328697
16164 -328697 -300730 -281785 -49296 178825 87578 -29016 -208057 -172511 12467 51820
16154 51820 47968 36494 24613 34367 110164 192964 110237 308767 282968 159957 -25940
16143 -25940 157755 163978 163147 58924 154829 203172 144485 223209 52791 80292 9869 -86005
16131 -86005 94555 303834 233793 242483 209602 160008 87475 239618 364397 344939 311262
16120 311262 337068 414844 253742 165119 -87843 -153605 -167331 -79714 -110565 -307195 -184433
16109 -184433 -27411 -113050 -51080 -36501 -140123 6158 -3931 1526 -80841 22267 -23759
16098 -23759 24716 23300 -40643 -322281 -232925 -159399 -266533 -272988 -205151 -95521 -26583
16087 -26583 117804 172470 170771 341824 554415 396825 349918 224136 87569 -80693
16077 -80693 -45602 -46804 -230921 -312457 -430257 -395144 -218962 -184016 -62026 43070 205320
16066 205320 314366 380530 415120 297255 110016 -34566 213911 303408 392311 557865
16056 557865 623489 629160 491335 365459 264997 343445 489392 497128 326632 419278 386323
16045 386323 521487 679167 653463 657530 455319 148892 133653 128374 -42663 7636 2607
16034 2607 3459 -32665 100296 176654 34808 -125400 -97761 277853 493444 366705 260588
16023 260588 269279 200587 301406 204262 470 -14720 119096 224717 351006 114497
16013 114497 -66450 -108864 -47214 107896 426007 539666 332982 489644 642797 381316
16003 381316 165329 200178 271597 349557 451082 420267 299159 66093 -164024 -179069
15993 -179069 -311714 -71516 437921 305616 -12703 -49050 164182 242632 47730 32893
15983 32893 -126983 -196505 -19674 107512 110306 4111 219130 304438 173702 -45464
15973 -45464 -183755 -3381 -99882 -183340 -208653 -41237 187281 62709 121514 28809 81704
15962 81704 37127 139027 225594 153081 89043 256374 218031 239139 97133 98145 88467
15951 88467 -23525 59658 306892 289014 174863 53059 22946 87218 188948 187329 185228
15940 185228 -20648 19242 179432 124664 88861 55007 130597 -5831 94964 235030
15930 235030 173187 118988 86272 197445 146445 346819 410826 466605 561564 656345 538070
15919 538070 336987 120267 38803 85439 127199 -108933 -66223 232639 361233 636233
15909 636233 839389 745327 563942 512260 465598 310836 285072 396476 327821 282594 218740
15898 218740 137126 7502 -92010 -34212 -50495 -23550 -8885 85005 365114 297427 139492
15887 139492 143424 141768 118173 293640 -132503 -375719 -234794 -272815 -256924 35911 234414
15876 234414 232551 39769 -156091 -129856 72807 -52399 -121685 44696 228098 79235
15866 79235 -103724 -177659 -40494 205529 427811 637983 483285 115870 -290475 -232548
15856 -232548 -113475 -70988 -69840 -179476 -30278 56694 57175 143026 71676 186271 240537
15845 240537 245135 209386 177803 78512 29390 198451 235033 314511 581460 547171 235396
15834 235396 -163018 -28838 73546 180128 273063 319836 111964 -1556 168977 249855
15824 249855 223699 149459 467479 515307 359625 235025 159698 75491 181623 310429
15814 310429 224099 3160 -270547 -169796 -73464 57195 258762 232883 225036 258677 203302
15803 203302 -10344 46103 212133 148917 106153 -14005 -157221 74255 158438 278526
15793 278526 433558 440979 385463 300919 193355 151946 146684 44083 125812 275155 341887
15782 341887 294800 393685 580593 505326 309441 101719 101935 232978 239839 172500 99806
15771 99806 57119 9478 -129098 -192079 -21596 183482 342961 131621 165186 29720
15761 29720 -14194 236768 389329 679235 737950 642753 523293 242950 60422 181276
15751 181276 298806 191692 195604 -99245 -144949 -95064 84905 -19685 -96535 16700
15741 16700 168299 349047 500159 377351 449137 295751 353530 602501 534722 758483
15731 758483 727844 563618 358513 204536 120129 39210 32940 119423 177883 105355 202328
15720 202328 254956 189888 4908 -74518 -28989 -14886 67580 251546 473713 487457 224206
15709 224206 260877 423186 339060 102160 48899 182816 148818 99825 81801 24996 61007
15698 61007 54044 101960 52490 80612 -64519 -49811 165447 173682 249085 314683 267907 235145
15686 235145 52831 -10113 79068 175861 189313 208831 232011 332361 398187 401139 397179
15675 397179 308683 102563 -46788 91361 305182 252940 287907 422486 642859 596713
15665 596713 494742 427041 339818 367167 419800 414441 239452 486978 414573 428934 274075
15654 274075 302837 552914 407583 106704 109533 225639 356997 503876 251607 36925
15644 36925 313602 106734 77961 103936 159155 246079 207438 72352 128540 61841 -32156
15633 -32156 123156 370042 692938 512708 299398 202477 133912 71364 -92615 -158586
15623 -158586 -138282 -264097 -86460 199755 494133 404403 390836 365593 146241 168196
15613 168196 322443 293486 266481 305405 432283 337603 231037 102697 231291 340470
15603 340470 308885 361037 500415 328870 -158087 -356661 -463108 -263083 -48195 -250528
15593 -250528 -108483 220758 99017 -65186 147452 434960 683148 732751 645906 473483
15583 473483 293481 365376 365159 212155 61537 127103 135225 314987 266126 284644 380470
15572 380470 472391 339674 286291 408331 516243 444565 399635 485279 473438 523543 427025
15561 427025 245760 27042 34563 60365 -1636 229051 246125 241346 302265 591720 569890
15550 569890 465259 517889 545418 349625 482015 666628 503502 356474 345429 309947
15540 309947 174235 334652 471419 563220 641004 564652 351141 408573 310257 282553 86282
15529 86282 65161 53452 -8541 127399 90508 27092 36949 39666 246552 275566 347598 279676
15517 279676 63114 -4878 -122303 -217678 -69028 219238 326797 165542 -17258 79172
15507 79172 87836 -8120 134813 321646 261111 50969 128935 264170 377944 717121 1076886
15496 1076886 1127076 1023187 942270 997419 773606 467110 379691 318139 34405 -140315
15486 -140315 -174004 49970 120761 196099 272092 281770 116760 -87483 121977 469776 595778
15475 595778 594434 446911 374267 232219 -44550 -33924 213535 381758 334895 318704 454080
15464 454080 436612 458231 592905 529431 294468 343180 320774 340526 238992 193155 111673
15453 111673 -77231 -276642 -321817 -106532 63021 276328 443088 332889 223631 235930
15443 235930 197092 137604 55199 273801 342033 342717 236786 234005 192927 309932 430629
15432 430629 544082 320342 298936 383656 375310 113867 124432 269926 180088 35863 -87934
15421 -87934 -147164 -301200 -96635 -172464 -141976 69144 45166 235594 269164 267988 233494
15410 233494 109069 67367 179023 179217 203163 22171 -211199 -17153 172435 269003 96415
15399 96415 55821 104521 143267 198786 78672 -16516 -142537 -321195 -4982 160706 221333
15388 221333 463052 520389 499731 337914 132449 147263 133629 123666 151349 244371 91526
15377 91526 143583 135917 175172 300399 576589 485857 283142 397289 426783 177062 59083
15366 59083 107483 384325 502641 681545 566250 304582 392426 507782 601880 619904
15356 619904 591754 473383 468799 423760 188777 214761 499791 551480 485269 442215 362709
15345 362709 370633 299087 403866 270593 170145 95590 78048 62858 199826 116840 -103724
15334 -103724 -42021 -3758 -114381 3014 92438 179857 184687 410077 238097 61498 -26564
15323 -26564 4193 74044 124683 157170 -22916 53240 185329 296930 345498 104249 230062
15312 230062 306871 400719 265365 186395 69917 82042 245657 376450 362389 292190 180124
15301 180124 403357 456739 182203 253858 323767 292971 359125 360342 419472 500721 432048
15290 432048 238145 405297 583453 387092 -56550 -139870 110975 322609 234329 61250
15280 61250 86748 153339 241122 315469 419820 337605 -66702 85852 219233 90261 -12242
15269 -12242 168316 568878 586011 573199 647172 359192 232363 197925 382898 198623
15259 198623 57306 29471 108543 112136 235602 335282 474452 428979 446370 625456 694974
15248 694974 407286 72571 40985 156502 166056 428440 420672 139329 74656 309799 600658
15237 600658 687326 498360 267362 403991 404117 410953 332134 366217 352974 403180 475193
15226 475193 274244 287441 395088 355071 381974 227905 176229 425834 237322 165514
15216 165514 314789 549891 425662 362952 388291 385489 449938 532937 298221 -264700 -293259
15205 -293259 21566 13847 143846 292373 275393 542571 594372 335113 451808 722346
15195 722346 825188 540365 344410 343471 361849 335814 98576 373421 419616 298613 369859
15184 369859 394085 347305 150726 -73262 20471 293303 417570 538777 548407 532402 426944
15173 426944 437052 471763 411987 299807 100567 139893 224583 165031 114881 186497 110621
15162 110621 106437 -14485 208418 257291 -146437 -264129 -60114 27096 13056 -215470
15152 -215470 -401187 -92125 132601 91097 116033 150460 141512 83371 199749 257947 117745
15141 117745 251557 381051 203864 -92148 63240 181989 265800 335733 293162 276736
15131 276736 271225 315667 481233 388153 231193 434243 489671 337820 227684 266620 185724
15120 185724 247090 198040 298077 551572 513080 277239 233192 378366 305359 398709 476280
15109 476280 476899 533671 916573 942020 696178 227337 24495 125396 310559 498842
15099 498842 483654 424427 390973 164680 44086 311670 373873 290092 351831 177743 89648
15088 89648 124059 30702 -9148 74675 193936 270031 351784 382086 273449 137963 274870
15077 274870 348859 600970 614444 247847 182912 145549 241233 441369 584560 499272 275708
15066 275708 119348 166571 357065 528850 501609 391659 412547 458489 366859 271491 212483
15055 212483 96151 217155 228972 166941 53966 142052 183022 165134 134081 360432 385428
15044 385428 351396 385474 397489 260293 85702 -157483 -59188 164913 363498 382702
15034 382702 517141 573269 574631 569497 459711 345652 439120 530004 461867 310073 293892
15023 293892 251097 139285 364683 514375 242623 356772 533726 219468 169089 316958
15013 316958 415763 385162 469149 471477 335134 233838 166134 195911 161941 180105 438573
15002 438573 483884 442884 391163 119284 -99598 -144659 -83806 68382 155921 36745 109664
14991 109664 387616 333725 21777 102240 318346 734013 996712 910231 551915 530856
14981 530856 309526 101254 -12838 -7242 94636 188336 10392 111676 236883 450242
14971 450242 475138 479465 506363 665320 661226 432479 394414 302577 300434 330820 348942 633822
14959 633822 594050 481544 390614 643931 747013 654039 564263 491472 650096 733302 679985
14948 679985 751415 642165 687909 517495 613786 734670 577070 607182 431768 549436
14938 549436 474102 436129 293570 386903 335712 338824 467975 521314 466655 450983 289944
14927 289944 105202 23391 188672 268304 125788 148510 98861 259295 161670 114975 137725
14916 137725 124524 168398 -15699 -131104 27266 169200 253636 244611 97746 159862 515608
14905 515608 553930 518911 469456 213665 3855 358225 491437 375885 223941 154190
14895 154190 370142 361061 203413 186106 301523 140565 56408 116549 70473 14245 -66006
14884 -66006 94031 180520 394846 451917 330463 326069 546888 658071 708893 647003 588409
14873 588409 476300 184662 -113826 -97544 -57400 31428 46608 140619 359373 500303
14863 500303 516512 528808 376151 119465 -81947 -83044 177969 75462 -21556 216890
14853 216890 577738 483222 359247 324628 384518 513802 626504 582082 584676 660826 751192
14842 751192 607210 486916 354433 105527 35445 153795 117245 -4857 110000 198059
14832 198059 425827 513790 310905 396591 292030 417316 436955 370376 464009 591797
14822 591797 635784 544154 585989 617997 402542 482305 568017 421240 374633 407739 546401
14811 546401 675079 599381 585346 606427 536472 470262 319086 163104 321788 361610 270624
14800 270624 422366 544048 489962 625871 427068 582407 575936 268591 420190 494901
14790 494901 412092 344484 366636 493727 516395 438952 282270 143857 216110 406603 218432
14779 218432 177611 235406 48496 -53269 71227 156854 247427 345800 494522 580234 584405
14768 584405 536309 384136 539210 672603 657901 561304 478891 287834 361413 389062 157420
14757 157420 311146 391424 221962 205100 148838 548577 755106 578142 470131 535044
14747 535044 239134 92154 218192 350400 253196 253593 354634 535499 743120 730982
14737 730982 338489 52346 279518 173793 58300 117711 126744 271056 438547 301118
14727 301118 362000 296785 230265 335337 359460 397813 367480 332836 206075 231452 298089
14716 298089 570024 497622 676847 768329 690827 536987 441215 299436 336157 224559
14706 224559 169722 240756 24670 4025 120753 125560 205183 123966 30958 102197 285502
14695 285502 342275 343710 300878 327110 656817 679544 701148 748470 717182 731635 720987
14684 720987 545628 511359 508126 743044 810937 638582 358025 -3118 -82979 6296 -51619
14673 -51619 -63246 -174073 -236508 -36688 169664 319708 250106 337755 249238 226819 334717
14662 334717 353721 401601 606080 804472 900950 794944 550332 351829 404988 499928
14652 499928 378343 316354 36901 -28169 142594 299389 507494 367047 307165 252073
14642 252073 284843 327454 212215 239744 299303 351916 358119 319170 254090 234747 167975
14631 167975 191832 -109833 -83580 279705 390360 370604 420273 624915 580733 460840
14621 460840 539928 821025 913163 653801 570384 745335 799139 529509 352892 210263
14611 210263 133727 142159 269537 261214 91539 -217256 -178301 476373 790957 588750 572617
14600 572617 556766 381436 256879 232018 271172 225697 385904 480656 465579 731691 628676
14589 628676 443380 616676 474312 249284 46571 157902 381651 563601 494376 459929
14579 459929 520090 421792 210331 216083 143629 240055 413294 385400 469473 557747 394461
14568 394461 459021 518487 313835 139866 114713 299628 513603 480489 402944 611537
14558 611537 658169 622906 630920 688586 705129 387595 497127 121699 133396 403273 305280
14547 305280 99587 138642 347091 586942 457030 427151 556705 590189 475472 452001
14537 452001 496553 222362 84597 379272 343679 179476 296172 537705 632237 508836
14527 508836 427180 611702 518669 621058 698327 625171 581273 501507 425828 464355 614949
14516 614949 763720 712753 679688 899810 951941 588744 625672 642926 467893 218773
14506 218773 413621 565329 738057 743476 755402 748131 660948 566332 463596 377933 387410
14495 387410 291444 69279 301389 438313 658848 567274 505107 608984 602221 470945
14485 470945 481427 574323 542922 553486 505572 454201 424334 291231 304149 352845 435278
14474 435278 540547 314606 95999 120453 276636 442469 610126 759770 722553 485977
14464 485977 413463 424332 546746 671906 665588 508664 438912 300642 292033 494980 684144
14453 684144 610465 528843 599294 759663 673782 449580 423124 389961 496258 693556 681976
14442 681976 426661 563756 614440 715700 558788 500814 539749 516674 481157 332772
14432 332772 428794 226985 326419 522024 374629 399654 543749 475059 145996 141707 296862
14421 296862 244987 103757 235110 304924 282441 511836 710610 665153 584442 418214
14411 418214 365613 343500 449384 519287 641731 623437 659429 738216 864933 819792 746742
14400 746742 558096 480759 622110 725691 534881 396543 289672 496036 949728 936476
14390 936476 546228 436790 244213 232101 233489 443610 627534 600911 650719 568048 603099
14379 603099 708727 741715 807298 714796 510926 506105 559122 569465 572512 556110 488459
14368 488459 490071 361223 266513 304612 324760 467353 739024 722295 676555 691282 605230
14357 605230 249371 262794 287245 377633 423183 168489 182328 324181 396483 331290 324172
14346 324172 305955 287642 545637 737343 977800 1035622 1002592 842945 744200 792980 664934
14335 664934 538769 641308 698653 533233 570742 691310 890699 850198 738852 605102
14325 605102 574724 570621 573301 538535 422512 261326 -143 -209106 -352030 -385324 -120083
14314 -120083 108657 201841 194665 121182 154265 291015 315304 470602 485913 143523 35112
14303 35112 197820 274857 461617 477711 224007 184579 65175 289455 464448 710036
14293 710036 968920 1163031 1113859 738420 568567 571976 516594 647205 644966 732280 660725
14282 660725 581930 756645 639749 126713 -39651 66776 139748 196653 655561 688515
14272 688515 606545 615955 636917 509745 434924 387011 212749 255074 371785 536849 728340
14261 728340 670465 502443 534463 629084 677613 734588 675673 597023 573952 754401 564652
14250 564652 419245 471940 545519 644226 523751 589097 650584 508215 384897 626751
14240 626751 847405 645360 714796 803482 576272 218824 301037 719862 947124 903580
14230 903580 933902 998995 847502 877392 914552 811821 588161 532500 541961 456358 394881
14219 394881 553106 626332 314328 358950 342755 278397 291511 161889 239369 307402 352734
14208 352734 317692 402695 530804 508068 211539 59353 304574 376525 436987 428355 368169
14197 368169 479435 445575 390691 562220 672023 678062 1036907 1279344 1097042 1129542
14187 1129542 1228097 1102507 835490 877621 811562 568123 389125 398513 252416 375556
14177 375556 552384 650274 747414 695706 330085 456661 681310 753720 843021 753649 587836
14166 587836 466784 661798 669119 532752 535508 449530 309887 284969 398256 419373 509264
14155 509264 589366 540726 660725 743031 659207 416030 362722 201937 254059 357998 516911
14144 516911 513582 608875 583338 580376 754941 798493 690020 490411 516602 597077 502643
14133 502643 674935 654431 674751 598249 684036 843468 646895 563230 647496 414417 363449
14122 363449 599681 836631 663114 569344 807762 937385 755645 618643 486821 615345
14112 615345 582468 528083 493001 438782 489297 553336 615740 542982 514279 534082 564177
14101 564177 695598 708191 687863 569965 537440 543935 539918 460640 401691 300301 457396
14090 457396 581767 649508 468797 333410 585539 615320 593772 697709 472181 590525
14080 590525 743845 598896 433587 457871 407188 436448 556143 646059 617242 438089
14070 438089 298460 289437 365027 493968 607166 694497 693194 653646 546586 499385 462920
14059 462920 339538 214640 308167 435537 428556 323808 723343 1052171 929397 702223
14049 702223 685958 761899 812909 647093 635273 713941 701939 704808 926013 921103 755520
14038 755520 780469 670083 765142 847585 717725 739280 1035116 1338143 1258596 954520
14028 954520 870022 1071903 1072208 1047526 893442 882542 1108952 1137936 1067458 1073905 1045775
14017 1045775 975043 726778 510430 634268 495301 387563 457576 654737 622206 528235
14007 528235 541949 715667 794466 701295 670483 707495 813051 778571 472218 424931 324678
13996 324678 426139 652334 775913 720402 571048 607998 672634 737350 725187 686214 517962
13985 517962 213479 153129 580483 919869 968539 882899 852999 967359 868658 831791 1076808
13974 1076808 1047806 733392 516640 474125 461875 598996 743348 819017 715407 724329
13964 724329 650123 410338 466352 625331 904991 892372 717970 608190 616804 797955
13954 797955 498932 543249 695098 471784 311838 215411 176102 459927 696189 751127
13944 751127 779219 983573 1171367 983837 718529 723724 708521 823935 1061567 1185966
13934 1185966 1064085 925769 793896 885917 854449 736185 626810 713733 855081 964918
13924 964918 879970 778944 716514 657601 730582 925027 954528 811799 956361 769366
13914 769366 649824 682756 942586 791085 556437 534858 594591 592740 829746 1127338
13904 1127338 1265063 1296507 1181010 1016191 1066575 1143174 961832 853974 986819 920713
13894 920713 700168 662730 881625 831737 818212 801710 706106 582713 635864 672726 592249
13883 592249 565981 770542 683373 671257 852845 733922 555499 461971 386846 330548 265785
13872 265785 510119 610066 749469 529867 312324 344021 548795 614899 644917 669509
13862 669509 656982 567383 586244 724395 781206 539046 449077 516228 660279 735691 701648
13851 701648 649279 666503 780462 955076 847305 427862 275568 428840 563440 471195
13841 471195 451362 674362 778060 761881 721489 810526 794093 724424 689347 568172 609525
13830 609525 543720 389243 236827 388300 523230 523629 461896 805212 936501 894111 865670
13819 865670 956656 908169 779593 706083 750990 952009 947940 943914 769608 623376 490229
13808 490229 496469 491971 266947 343982 512356 551784 567036 571048 701681 678932 651283
13797 651283 765777 712192 748813 747926 758877 939826 824875 870225 831697 788326 1002208
13786 1002208 1056346 1132473 1229376 1232453 964241 735127 681436 616627 394380 419541 412066
13775 412066 425602 515130 704542 799445 981559 1024205 916525 793319 604168 585710
13765 585710 663640 838922 759372 650982 556696 451185 445983 518968 850196 883873 800060
13754 800060 641175 636457 628204 722953 811168 681427 722608 671842 702811 803081 832107
13743 832107 901931 844685 808261 643814 502632 578150 502862 395935 245764 528169
13733 528169 823864 1037487 852857 901267 779871 728710 737967 628536 834719 764701
13723 764701 680217 532576 340465 361340 559538 590595 627821 842946 931319 917041 715314
13712 715314 521572 416490 520926 489798 802414 939589 1049764 1079708 1020914 1038202
13702 1038202 912840 662151 518167 565270 691975 929125 1005259 896008 782830 911876
13692 911876 980008 948078 818214 1010655 1069688 1025912 916641 1039563 1081020 1145148 1222040
13681 1222040 1291261 1103941 1078584 894320 792698 685912 656011 475965 569341 571923
13671 571923 589176 691018 934866 896445 766214 572662 430184 374953 460686 771106
13661 771106 829243 959477 980507 738993 812437 753536 728815 892558 941021 1193456 1199100
13650 1199100 944918 868693 865199 802598 764259 820655 777471 799887 920024 900566 803180
13639 803180 834126 984344 983466 706904 482764 450116 591937 632436 709267 530078 370156
13628 370156 362838 332280 480911 466436 345091 404089 522532 666082 613799 780519 940577
13617 940577 1082130 937511 936614 975276 870069 761655 894023 1017558 1110121 1185806 1259799
13606 1259799 1169016 1033908 956298 838325 711694 685552 733909 927368 1006186 945606
13596 945606 898442 829284 990130 1013189 1022280 994409 1050596 890508 783699 1040961 838180
13585 838180 786742 870992 668701 672563 886110 1044990 961941 859106 957774 1106602 1165289
13574 1165289 1061979 897868 995955 1110917 1114795 960536 758039 759506 719353 653309 763945
13563 763945 1046838 996621 904640 943496 1139276 1267081 1167505 982147 772011 709720
13553 709720 861301 877957 777778 936856 944368 927081 774605 579757 741609 639594
13543 639594 717948 746845 915181 1052640 1034628 885875 889737 1087045 1032094 1075161 879289
13532 879289 789387 881289 956331 1175300 1121822 736117 752633 970867 1067109 1149263 1186324
13521 1186324 1156045 1185815 1189819 1089244 1206597 1149094 1250937 1279547 1470372 1441007 1421630
13510 1421630 1484716 1419883 1460264 1437334 1327621 1157308 1029358 801416 718835 741794
13500 741794 611985 489146 671758 947317 915773 829292 742393 925187 924618 940256 861148
13489 861148 771167 1026360 1040925 718649 735595 1048716 1050091 1192970 1160448 1004716 965083
13478 965083 1148443 1250025 1151413 1023233 689139 583684 657605 786122 956895 802089
13468 802089 902786 919336 798882 746128 934487 906079 893000 1054617 1125041 1152215 1004725
13457 1004725 988748 962400 1070353 1150026 1229026 1114645 991939 886687 772969 980903
13447 980903 908304 825261 921101 1007514 1136078 1211013 1062049 952787 1103676 1125220 1093663
13436 1093663 1065958 836040 678221 692663 770100 695666 776995 899658 784918 674361
13426 674361 706577 897793 999479 1007642 1124398 974591 928407 987823 819760 799630 846313
13415 846313 679973 783975 1037312 1267996 1411222 1267413 1211229 1297370 1201519 1080379
13405 1080379 1080130 1035722 946914 809896 705953 913271 1134385 1511908 1553811 1286288
13395 1286288 1361485 1279039 1229188 1204762 1189969 1315812 1356843 1167272 1151641 1075620 779438
13384 779438 944186 1157896 1038705 1238990 1375948 1108569 853986 828389 980759 1149864
13374 1149864 1214589 1095662 922289 1023948 971015 1029038 1274754 1222113 1263784 1459058
13364 1459058 1526292 1333565 1114492 1087341 1055799 1118664 1131124 1170145 1253592 1261962 1179389
13353 1179389 1058577 1120574 1205885 1139694 1155443 840840 726567 749123 636068 926998
13343 926998 1142529 1321924 1576201 1750904 1714254 1492293 1358943 1313130 1359143 1402058
13333 1402058 1170723 930370 999885 1112601 1134739 1073885 913424 874767 1065746 1098469
13323 1098469 1108965 1000616 764863 700573 848105 951754 817371 661380 699051 932030
13313 932030 883766 901335 982491 1353072 1474848 1203177 1144465 1243655 1174488 1237193 1319350
13302 1319350 1436561 1291925 1004658 1007156 1117456 1020031 809989 1016228 1306744 1182962
13292 1182962 1254383 1157774 1042900 1030942 953091 1068639 1220603 1168915 1020716 1055883
13282 1055883 1141368 1397389 1352863 1355229 1405741 1236223 1338349 1298307 1246339 1274796 1319607
13271 1319607 1332597 1173075 1020370 1082845 1134549 1312963 1379811 1075602 1059390 1305975
13261 1305975 1433223 1292268 1284143 1349489 1470995 1391896 1174054 913779 1066823 1157022
13251 1157022 871308 704548 998785 1085430 1174373 1419550 1443428 1262300 1365348 1357315
13241 1357315 1431216 1455236 1377358 1041870 969556 1222756 1588755 1486282 1383803 1415967
13231 1415967 1326795 1611552 1734175 1547319 1563184 1449448 1174189 1221578 1337669 1352821
13221 1352821 1458621 1559171 1464449 1181276 1040483 1148564 1134031 1134192 1313091 1457375
13211 1457375 1592031 1618329 1550650 1599209 1441873 1155786 1130761 1425244 1535703 1268217
13201 1268217 1145802 1281296 1137218 947914 1132220 1259082 1341355 1422844 1637419 1611345
13191 1611345 1379519 1223698 1172420 978728 1127282 1448902 1475061 1447488 1399750 1478573
13181 1478573 1427265 1360533 1114269 1039182 1152137 1423731 1698856 1621208 1258685 1242149
13171 1242149 1159847 1095257 1050316 871245 857519 1023984 1300358 1447789 1621425 1691665
13161 1691665 1542053 1307853 1100953 1077348 914414 865934 1129391 1337380 1202911 1170029
13151 1170029 1267020 1154519 1154445 1363108 1485305 1555320 1324853 1122286 1033514 1258530 1367057
13140 1367057 1438236 1496702 1334739 1341666 1293751 1035437 1045800 1268112 1440292 1352898 1222867
13129 1222867 1237310 1386019 1364171 1303474 1297879 1400705 1595785 1505110 1480388 1533947 1416441
13118 1416441 1412655 1270072 1124774 1279824 1276178 1268273 1237616 1442695 1641584 1593302 1607393
13107 1607393 1504642 1286409 1285352 1434554 1560732 1505579 1556003 1555716 1537326 1595803 1415051
13096 1415051 1304438 1201931 1389524 1546799 1438091 1529495 1605558 1644969 1597881 1349251
13086 1349251 1216384 1125629 1034935 1037728 1182022 1362549 1432165 1689966 1694823 1451491 1457701
13075 1457701 1479786 1546916 1449473 1309274 1326509 1573382 1766279 1747344 1572915 1535702
13065 1535702 1655207 1596195 1700817 1689156 1567147 1461289 1320057 1193521 1428327 1628897
13055 1628897 1813244 1674289 1610748 1674598 1582518 1459442 1374310 1188818 1302958 1405522
13045 1405522 1330655 1551914 1756092 1752047 1580697 1562479 1700571 1489464 1461228 1409876
13035 1409876 1511196 1461015 1540864 1549347 1530846 1480804 1557585 1143935 1172827 1418480 1472473
13024 1472473 1314701 1224125 1238944 1396745 1475189 1365616 1203218 1178744 1408247 1424975
13014 1424975 1655156 1705626 1803014 1644934 1584718 1598773 1528895 1480298 1505665 1418298 1401317
13003 1401317 1599785 1678466 1651104 1510272 1388551 1256603 1400972 1441904 1466986 1491619
12993 1491619 1461572 1420260 1428189 1630373 1704969 1849274 1827355 1654984 1291379 1296408 1311064
12982 1311064 1393783 1383794 1340411 1396857 1457805 1398579 1352054 1333792 1468498 1542614 1602534
12971 1602534 1431859 1401131 1551443 1745645 1728435 1676918 1627636 1462792 1603756 1750267
12961 1750267 1844347 1800929 1705371 1665628 1445553 1462304 1864184 1929685 1801042 1708199 1736062
12950 1736062 1548395 1386156 1456354 1551477 1501130 1541207 1703600 1558390 1569703 1582881
12940 1582881 1325111 1204308 1313581 1471366 1659976 1823955 1937228 1961992 1650043 1168439
12930 1168439 1102776 1483111 1703639 1705321 1688192 1716521 1554500 1363175 1544024 1689676
12920 1689676 1591382 1602269 1410478 1333969 1518286 1695978 1789518 1538286 1622202 1562057
12910 1562057 1559168 1616758 1604277 1529019 1686250 1631778 1542070 1471777 1392863 1600704 1690834
12899 1690834 1664805 1571235 1558401 1765531 1626463 1671763 1665885 1625534 1706293 1568055 1746231
12888 1746231 1770749 1572867 1526428 1599253 1668034 1617215 1580385 1732644 1766663 1630798 1574320
12877 1574320 1675464 1850829 1676841 1323295 1216242 1374889 1528178 1539263 1479106 1606015
12867 1606015 1757782 1739005 1800696 1674196 1492505 1349449 1375845 1515290 1630727 1615830
12857 1615830 1589047 1525142 1535535 1609998 1545185 1501015 1564945 1638211 1691103 1695138 1532334
12846 1532334 1598015 1837227 1927291 1866799 1847015 1701522 1887674 1968595 1652531 1589076
12836 1589076 1736609 1739818 1873676 2053803 1878210 1773085 1717201 1624834 1624908 1718028 1610543
12825 1610543 1522339 1569006 1427537 1574650 1763681 1737701 1837267 2003132 1833536 1656534
12815 1656534 1796437 1817542 1593405 1713675 1890807 1911978 1787716 1907442 2058859 2108830
12805 2108830 2039460 1995441 1789911 1819124 1758149 1878747 1959547 1862880 1883495 1906112 1849671
12794 1849671 1835933 1565651 1544622 1667826 1738344 1881388 2014309 2119693 1878592 1492110
12784 1492110 1511519 1649060 1636369 1645314 1994612 2168740 2109104 2213228 2119123 2204767 2210209
12773 2210209 2309218 2345933 2296293 2151229 2043328 1997923 2102910 2083321 2131318 2251992
12763 2251992 2262284 2239434 2169298 2045178 1837607 1775646 1851144 1923868 1884525 1831745 1982872
12752 1982872 2332402 2483297 2311644 1859264 1759347 1633590 1738821 1990656 2213869 2155474
12742 2155474 1940304 1808979 1844869 1927523 1868707 1881884 2173439 2150756 2213289 2218266 2050410
12731 2050410 1838172 1693911 1685953 1710887 1784668 1718022 1778200 1735545 1676926 1830620 1755162
12720 1755162 1838843 1860402 1922820 1979659 1984861 1955247 2020243 2256561 2234409 2260876 2285923
12709 2285923 2254315 2115429 2091443 2053017 2181769 2508986 2634789 2621951 2444099 2469358
12699 2469358 2473225 2279672 2292121 2317857 2325612 2458611 2424965 2281682 2001800 1964590 1984957
12688 1984957 2249164 2257412 2228971 2201610 2047276 1927495 1965958 2045061 1982877 2140571 2275740
12677 2275740 2085669 2157925 2218487 2320246 2461172 2344770 2029412 2115884 2316444 2142790
12667 2142790 2202028 2397302 2363105 1999543 2032374 2014988 2093001 2162712 2241468 2200571 2112005
12656 2112005 2094821 1920551 1836646 1718970 1949533 2167879 2345835 2374687 2319446 2279769
12646 2279769 2193247 2197410 2235620 2357292 2205304 2316614 2435556 2512009 2607123 2765666
12636 2765666 2708844 2550827 2190777 1930485 1758352 2113391 2153081 2150237 2059345 1964569
12626 1964569 1967976 2069188 2032885 1885744 1829899 2050898 2231654 2234292 2160325 2216144 2166599
12615 2166599 2100041 2008273 1982729 2121154 2074028 2051303 2425407 2773977 2542432 2242536
12605 2242536 2091618 2366145 2510088 2314336 2210479 2076033 1931325 1811036 1901776 2090783
12595 2090783 2077653 1829715 1779622 1845401 2036782 2463649 2393028 2304065 2155420 2220277
12585 2220277 2337295 2362120 2236453 2132871 2050664 2215828 2241459 2238912 2454273 2633126
12575 2633126 2713678 2567731 2161606 2028258 1833664 2054033 2270240 2418583 2350459 2473841
12565 2473841 2584411 2418099 2397772 2163870 2247507 2216082 2187156 2019511 1868587 2145088
12555 2145088 2213806 1951373 2012299 2208158 2183682 1872247 1964956 2092163 2185389 2146271
12545 2146271 2043415 2020108 1810667 1996168 2368971 2407409 2296395 2256847 2123081 1966657
12535 1966657 1898619 1912928 1943632 1985451 2210204 2235957 1945376 1901299 1750122 1973767
12525 1973767 2226165 2362564 2401722 2441291 2470963 2620194 2652582 2662907 2598661 2462463
12515 2462463 2238350 2351550 2484241 2656955 2643562 2624488 2393748 2361587 2539140 2659606
12505 2659606 2485676 2340617 2498813 2766271 2621678 2406570 2607400 2610894 2628553 2621731
12495 2621731 2639011 2535348 2610870 2567910 2238418 2117336 2246896 2341005 2408092 2458457
12485 2458457 2461720 2400899 2387954 2676784 2821229 2869088 2865647 2754278 2452340 2336357 2481426
12474 2481426 2491710 2669386 2725326 2834773 2829247 2687468 2527468 2246877 2328754 2591355
12464 2591355 2834465 2912884 2702533 2539394 2616951 2541182 2366080 2406203 2540492 2661815
12454 2661815 2519107 2427530 2544649 2564537 2525878 2708768 2550179 2537454 2381620 2281153
12444 2281153 2471756 2707059 2780850 2780254 2645436 2529406 2551752 2565245 2429090 2357766 2332480
12433 2332480 2269237 2472410 2539022 2536761 2564817 2673152 2669837 2622737 2651463 2448461 2400489
12422 2400489 2330816 2526332 2735471 2853843 3033139 2952265 2771828 2512417 2183266 2354208
12412 2354208 2449014 2511681 2717608 2588438 2740386 2614897 2570978 2449227 2451275 2452739 2567959
12401 2567959 2709880 2645153 2595213 2628850 2682679 2667683 2359011 2313922 2516638 2724947
12391 2724947 2648910 2610015 2907295 2958030 2794329 2641387 2516583 2514363 2737200 2672850
12381 2672850 2590021 2389913 2431696 2498326 2687645 2942835 3153506 3298973 3221397 2950981
12371 2950981 2860187 2842957 2756154 2744084 2830518 3018419 3094541 2982206 2798632 2736998 2355118
12360 2355118 2469665 2535866 2514636 2447451 2482025 2683898 2820082 2595565 2460151 2365396
12350 2365396 2399823 2484459 2655762 2677444 2574906 2540002 2560719 2614852 2577745 2547067 2675992
12339 2675992 2803752 3096262 2803217 2697069 2892236 2788852 2649450 2694335 2683734 2930107
12329 2930107 3184906 3098156 3071459 3020976 2954229 2946361 2916937 2950114 2929885 3057908 3108505
12318 3108505 3049917 2738142 2699256 2746303 2683691 2839685 2724003 2775595 2844253 2602279
12308 2602279 2728869 2590738 2782283 2819703 3025668 2938612 2904682 3036432 3156696 3189260
12298 3189260 3264407 2980784 2864053 3052262 3000409 2853141 2816401 2689331 2685586 2883630
12288 2883630 2851448 2746814 2784056 2891934 2795875 2615888 2676212 2842797 2871559 2759609
12278 2759609 2737299 2903060 2824152 2760907 2680890 2663540 2613360 2758011 2751912 3006985 3104415
12267 3104415 3021050 3023043 3045260 3043102 3029606 3086998 2951724 3083594 3155460 3082696 3063200
12256 3063200 3102931 3370091 3400967 3615464 3468373 3363650 3312643 3137259 3043470 3019555
12246 3019555 3037261 3158679 3096853 2865076 2569106 2785634 3096585 3033521 2832444 2802807
12236 2802807 2972999 3060226 3241301 3038543 3071673 3105433 3512882 3513805 3254589 2991988
12226 2991988 3085412 3033150 2967730 3081467 3241205 3230145 3211795 3247530 3232931 3103937 2998828
12215 2998828 2988251 2998243 2887367 3173755 3158274 3101380 2898369 2438128 2279830 2578310
12205 2578310 2891626 2989229 3097582 3341353 3300024 3296334 3293977 3240011 3118945 2999197 3018910
12194 3018910 3178456 3221296 3062194 2922139 3019610 3085622 2948963 2930672 3013729 2958821
12184 2958821 2903829 3012034 2996212 3217461 3243434 3276214 3379038 3348178 3141589 3095101
12174 3095101 2934031 2863893 3060841 3119672 3310594 3170907 3044373 3100737 2987856 3048397
12164 3048397 3255881 3259603 3293004 3389961 3147173 2946707 3005567 3017004 3108568 2975247 3110233
12153 3110233 3379396 3316043 3195575 3189226 3053116 3059075 2778663 2785261 2727925 2933563 3138456
12142 3138456 3037579 3150315 3147709 3036576 3234934 3434354 3387775 3149216 3248055 3338083
12132 3338083 3477336 3628692 3429996 3442298 3277486 3211674 3206360 3385148 3618826 3381862
12122 3381862 3387883 3406012 3361703 3240288 3341860 3470168 3242877 3138417 3319882 3278793
12112 3278793 3024475 2811520 2794201 2828436 2899241 3092446 3277229 3513161 3402940 3223264
12102 3223264 3272672 3190436 3163605 3087371 3033613 3093508 2936584 3149428 3214050 3187990 3056360
12091 3056360 3082686 3101208 3218152 3071797 3182921 3324970 3449438 3552988 3291269 3246737
12081 3246737 3128316 3260066 3320639 3276081 3204594 3242536 3169086 3249964 3500323 3317758
12071 3317758 3147246 3100830 2907672 2834431 2985101 3103204 3230647 3247663 3179096 3096343
12061 3096343 2948026 2842543 2898177 3128851 3160809 3177150 3189012 3026813 2769100 2609348
12051 2609348 3003155 3234053 3290346 3439069 3331939 3184572 3090100 3108693 3051613 3114866
12041 3114866 2923820 2842924 2994611 3021267 3032110 3075126 3226773 3279138 3151273 3110997
12031 3110997 3039144 3204903 3539483 3539112 3361144 3105234 3066003 3093529 3145549 3320647 3318045
12020 3318045 3098481 3085700 3154548 3140181 3199099 3099303 3052278 3154275 3061912 3172010 3207914
12009 3207914 3253599 3362097 3367549 3581363 3674374 3691772 3619955 3470354 3589764 3583417 3636998
11998 3636998 3685449 3576643 3334839 3251971 3292704 2919334 3084404 3280493 3020656 2811678
11988 2811678 2903250 2932801 3296939 3485488 3294735 2998819 3022698 3241236 3393796 3471275
11978 3471275 3418885 3369575 3294059 3200276 3293537 3264679 3094462 2974970 2886293 2819200 2935471
11967 2935471 2881552 3048228 3300810 3531005 3572152 3431043 3287343 3235962 2993770 3016282
11957 3016282 3190453 3349110 3451539 3482090 3611099 3525888 3426155 3383549 3219813 3096080
11947 3096080 3186299 3204294 3383483 3490068 3486297 3400366 3397585 3390840 3130923 2840530 2830017
11936 2830017 2965572 2823490 2670470 2875799 2954615 2821125 2885392 2955963 2979139 2736767
11926 2736767 2933158 3306993 3313002 3321696 3361337 3365194 3310190 3331091 3381426 3227606 3016545
11915 3016545 2937753 2952769 2857060 2775815 2925424 2945663 2985827 3028467 3142399 3107351 2967639
11904 2967639 3019603 3206095 3260722 3102881 3047484 2971410 2905604 3064032 3206043 3437542
11894 3437542 3577440 3400038 3315684 3109226 3050008 3099348 3035415 3150051 3196041 3222194
11884 3222194 3321268 3190832 2963043 2899075 3116948 3107627 3107854 2924311 2793715 2762908 2813397
11873 2813397 2986062 3032465 2989259 2944182 3033175 3034766 3090852 3095340 2933491 3063575 2994140
11862 2994140 3016047 3017597 2963953 2907299 3030710 3147554 2943003 2719833 2694284 2754038 2820136
11851 2820136 2916058 2761367 2891275 3038719 3117228 3056118 2803899 2798454 2829334 2927076 2865359
11840 2865359 3041143 3204760 3342195 3348029 3054334 3040113 3093826 3082221 2962463 2961669 3074399
11829 3074399 3009606 3127668 3264526 3247962 3191688 3374691 3227151 2877325 2773934 2741084
11819 2741084 2924916 3127868 3061662 3106617 3029454 2995768 2909201 3069821 3256046 3293941
11809 3293941 3030662 3015912 3264127 3735778 3609585 3244573 2928061 3023842 3236849 3176765
11799 3176765 3080508 3185807 3033460 2813768 2646700 2862662 2948583 3032300 2908322 2784130
11789 2784130 3044413 3344050 3112507 3007160 3133134 3303011 3187085 3257359 3197002 3068535
11779 3068535 3206533 3045266 3051847 3182997 3069101 2749728 2811220 2934648 3029387 3201499
11769 3201499 3024752 2965716 3030014 3063544 2957189 2919623 2943730 3032542 3223696 3541728
11759 3541728 3536343 3387519 3321315 3342175 3316148 3057281 3037484 3184589 3283666 3273042 3102234
11748 3102234 2855913 2984914 3154266 2924199 2964234 2999204 2985270 2827560 2819597 3132134
11738 3132134 3293085 3333870 3481696 3558731 3298000 3149085 2872175 2770814 2833217 2975348
11728 2975348 3201872 3218893 3037527 2844065 2807433 2806942 2969831 3060484 3172504 3196921 3236681
11717 3236681 3071031 2954661 3092668 3169358 3211873 3277250 3189284 3022844 2954071 3045231
11707 3045231 3289235 3192379 3269602 3196784 2942227 2718747 2733765 2825303 2692178 2694021 2803463
11696 2803463 2771174 2874169 2976233 3103299 3097636 3101841 2946931 2812467 3003362 3161960
11686 3161960 2898028 2698829 2577925 2685553 2760160 2815078 2882208 2844255 2861817 2874619
11676 2874619 2777724 2604902 2474481 2682290 2796589 2712337 2819711 3033962 2890973 2573904
11666 2573904 2242286 2193672 2602652 2696419 2547140 2521106 2416621 2491458 2401301 2621496
11656 2621496 2687569 2600405 2541659 2636801 2755537 2961042 2810054 2725336 2716583 2688505 2781442
11645 2781442 2575406 2539706 2636144 3023385 3025089 2721647 2508525 2221993 2242561 2410893
11635 2410893 2694818 2557958 2375327 2639764 2783875 2664824 2545159 2402311 2437806 2582952
11625 2582952 2604415 2491759 2344714 2451504 2718633 3002207 3120958 2753914 2620704 2626450
11615 2626450 2624359 2702098 2656586 2409789 2168022 2350269 2524306 2529873 2717659 2727605 2314064
11604 2314064 2274991 2430466 2369659 2555726 2569873 2417869 2514148 2639731 2580068 2347946
11594 2347946 2188142 2065367 2160629 2436379 2500771 2628180 2725099 2574958 2153880 2071392
11584 2071392 2058811 2395642 2562347 2571507 2625175 2513663 2673548 2594447 2630566 2849467
11574 2849467 2834945 2684108 2569932 2585763 2507825 2514681 2724027 2835747 2691928 2642043
11564 2642043 2515336 2454908 2332308 2436160 2581008 2602909 2469446 2173735 2119934 2085175
11554 2085175 2301782 2326347 2193586 2143952 2202898 2265162 2321925 2115903 1850649 1843658 1941467
11543 1941467 2001134 1928464 2248261 2280963 2232554 2351161 2497891 2397846 2424191 2356501
11533 2356501 2385539 2275834 2232351 2252970 2189233 2160455 2229847 2182556 2253198 2204140 2179273
11522 2179273 2233689 2045509 2221774 2384704 2232766 2216817 2269224 2334905 2153493 1886195
11512 1886195 1865515 2054958 2217194 2200617 2163977 2261422 2608333 2649073 2299805 2048184
11502 2048184 2184632 2143985 2136016 2461147 2476057 2307777 2312382 2620822 2545353 2474588 2305744
11491 2305744 2297744 2035916 1987171 2146072 2134105 2117645 2054514 2054732 2035164 2057552 2316087
11480 2316087 2232082 2301736 2156387 2226051 2254540 2300632 2365500 2320806 2576630 2669668 2443413
11469 2443413 2444069 2554413 2453345 2315443 2250979 2354559 2388441 2178826 2034338 2054335
11459 2054335 2011430 1959423 2069413 2187994 2014792 2145645 2218923 2097052 2192546 2023206
11449 2023206 1840465 1857618 2049328 1879669 1872392 1924176 1803856 1746910 1812972 1781192 1751709
11438 1751709 1667799 1513837 1679328 1839043 1998250 2135024 2099519 2107972 2050636 2182169
11428 2182169 2246925 2401973 2323188 2509047 2358214 2181116 2153385 2051007 2133571 2213800
11418 2213800 2034164 1929776 2045377 2213965 2203547 2069567 2129815 2106191 2080603 2185985
11408 2185985 2193928 2081136 2091394 2145164 2030459 2125186 2076713 2029415 1918368 2035453 1970550
11397 1970550 2104394 2217956 2046519 2052380 2434797 2513819 2264669 1957074 1900871 1880482
11387 1880482 1686685 1632059 1786387 1887981 1999037 2140344 2158285 2199169 2092705 1844364
11377 1844364 1864444 2015459 2155744 2187477 2122748 2102126 2182593 2307012 2541055 2465431
11367 2465431 2185271 1951369 2008435 2105014 1965749 1779340 1808062 1931234 1934360 1991575
11357 1991575 2150705 2293714 2303829 2127543 1880178 1633745 1572076 1911163 2103182 2143019
11347 2143019 1973291 1852759 2043252 2209469 2050112 2015401 2079706 2043976 1829090 1776023
11337 1776023 1878682 2007099 1836820 1807190 1959974 2115076 2108937 2097528 2176726 2150487
11327 2150487 1848548 1910067 1754419 1683589 1769486 1985619 2120210 1987163 1719957 1515004
11317 1515004 1690301 1845609 2226219 2284727 2067054 1929955 1924848 1900701 1713658 1688265
11307 1688265 1561065 1375628 1383227 1615488 1743849 1712596 1768349 1812747 1882701 1732976
11297 1732976 1532411 1742883 1734052 1850786 1774596 1843326 1904060 1704850 1501132 1631958
11287 1631958 1650282 1790720 1941437 1993267 1814028 1942421 1981115 1930001 1706785 1798426
11277 1798426 1945133 1959734 2002224 1856580 1887086 1833343 1822030 1880750 1990968 1939930 2004987
11266 2004987 1949646 1760932 1773408 1824305 1867513 1847679 1823187 1868508 1777065 1865894 1761073
11255 1761073 1662894 1563465 1502247 1789963 1849782 1932644 1927436 1946140 2077471 2003826 1672862
11244 1672862 1341842 1024887 1204160 1309677 1460923 1744818 1832703 1809199 1991655 1984763
11234 1984763 1847207 1781842 2066560 2390126 2323366 2313176 2220555 2026398 1780785 1876897
11224 1876897 1663178 1569014 1758662 1741256 1777937 1778145 1550993 1465573 1456567 1517349 1753120
11213 1753120 2048706 2094862 2032819 1935449 1868359 1608089 1604001 1606907 1700988 1852579 1850940
11202 1850940 2166201 2188490 2015160 1954880 1955040 2159896 2231433 2125412 2131133 2106812 2113847
11191 2113847 2271578 2261974 2140734 1932359 1857503 1718943 1436586 1645448 1761263 1790929
11181 1790929 1864296 1862869 1878562 1831731 1840202 1876004 1955505 1846981 1610609 1500538 1239758
11170 1239758 1414553 1765372 1672456 1585382 1692625 1483002 1494211 1528972 1735868 1910438
11160 1910438 1741264 1556335 1546514 1522377 1482339 1688603 1527082 1443408 1577020 1536111
11150 1536111 1505687 1497453 1407395 1640117 1476936 1418096 1691200 1712392 1664502 1841724 1996437
11139 1996437 2003889 2171105 2126491 2280690 1873695 1679947 1496366 1564381 1693982 1940128
11129 1940128 2079764 1989462 1851258 1904766 1857541 1733774 1846263 1881652 1826693 1730910
11119 1730910 1772608 2102765 2146371 2056238 1954565 2060784 1930480 1691486 1951080 1810046
11109 1810046 1833641 1684917 1556507 1546311 1342524 1172618 1316516 1766942 1989374 1847669
11099 1847669 1662580 1701979 1606846 1504823 1560230 1613457 1486417 1138866 1059137 1270507
11089 1270507 1448874 1572077 1734410 1694157 1751507 1755517 1747970 1691690 1530466 1645383 1916092
11078 1916092 1907968 1830752 1798998 1628591 1415782 1642008 1642315 1730344 1765729 1532192 1479354
11067 1479354 1702173 1758437 1765338 1927886 1937000 1814005 1789905 1862025 1859086 1958103 1917852
11056 1917852 1875493 1971248 2038394 1911387 1950926 1927310 1877317 1871972 2102267 2273897 2206644
11045 2206644 2270464 2479552 2456071 2407319 2281336 2272850 2276043 2405802 2348694 2494098 2766837
11034 2766837 2707328 2849242 3138308 3335656 3361019 3221291 3046487 3022002 2885127 2770287
11024 2770287 2729210 2879398 3090995 3339620 3552033 3732135 3854597 3637319 3517620 3400368
11014 3400368 3236051 2981437 2882293 2968415 3169987 3124526 3087709 3207703 3084414 2977193
11004 2977193 2834506 2718538 2654523 2569504 2464235 2487612 2607010 2474592 2435732 2654903
10994 2654903 2530304 2249885 2127987 2261937 1977283 1965842 2062543 1852275 1667117 1580879
10984 1580879 1678124 1664479 1654895 1644828 1660514 1890698 1869698 1606834 1602130 1677473 1530428
10973 1530428 1574372 1824999 1870285 1825309 1794391 1555129 1550110 1934674 1981690 1783627 1855201
10962 1855201 1822581 1807186 1712859 1736524 1774004 1788914 1815203 1894318 1860129 1581886 1513177
10951 1513177 1552085 1588056 1868168 1846607 1650871 1685756 1753153 1825595 1912737 1857298 1547588
10940 1547588 1471618 1800767 1842106 1674631 1700706 1701641 1693227 1635444 1726421 1695518 1778025
10929 1778025 1895251 1918106 1865758 1954477 1984175 1906576 2033733 2111479 2001338 1920592 1945253
10918 1945253 2000768 1867196 1703659 1651323 1699061 1705061 1723496 1740643 1910848 1887518 1782631
10907 1782631 1790895 1693583 1669582 1646643 1639635 1803433 1987603 2146503 2236951 2221426 2114619
10896 2114619 2083612 1886604 1650910 1717728 1640244 1522939 1537462 1347730 1099084 1105082
10886 1105082 1549102 1708513 1796008 1715219 1771275 1889202 1921122 1902128 1828146 1867251 2001973
10875 2001973 2245091 2169312 2107090 2105334 1819183 1924384 2169305 1962145 2009703 1931322
10865 1931322 1932656 1978377 1916907 1968408 2229130 2360029 2410953 2404996 2319951 2342460 2377325
10854 2377325 2349534 2312186 2491838 2487545 2269633 2212421 2169704 2015194 1679305 1515891
10844 1515891 1671688 1892965 1877038 2003706 2159780 2240025 2095232 1973748 2019819 2222443
10834 2222443 2491317 2523465 2522925 2447626 2156281 2117263 2201020 1932229 1785194 1849807 2055140
10823 2055140 2428028 2375909 1984343 2038318 2279561 2429612 2495299 2339674 2023275 1939612
10813 1939612 1934079 1950321 2094400 2185408 2234795 2059904 1971677 2055390 2142437 2144954 2398244
10802 2398244 2652538 2728978 2730983 2567561 2397358 2574235 2331150 2243559 2193778 2221050
10792 2221050 2263633 2392997 2523289 2465466 2318619 2232517 2402974 2380643 2298428 2343680
10782 2343680 2350039 2182433 2144631 2327920 2380856 2394394 2391098 2456372 2599913 2457411 2202851
10771 2202851 2159170 2151416 2243491 2285402 2536251 2813893 2917701 2746464 2514179 2466659
10761 2466659 2519160 2596386 2492598 2446820 2623723 2626416 2566116 2708701 2589381 2618209 2770868
10750 2770868 2701662 2392289 2413865 2586144 2643098 2906735 2905376 2942129 2988912 2721596 2583150
10739 2583150 2634423 2641237 2797892 2752880 2782559 2872211 3062814 3137659 3137689 3274539 3388639
10728 3388639 3272444 3245115 3119441 2976062 3105070 3319780 3612710 3661986 3605788 3871714
10718 3871714 4015211 3893225 3878412 3880508 3880394 3735997 3528543 3426800 3376256 3733245 3973026
10707 3973026 4138382 4278174 4248344 4148050 4189566 4190643 4167117 3935011 4070434 4155773
10697 4155773 4121887 4042432 3811449 3727738 3788697 4010894 4265682 4414999 4349812 4392746
10687 4392746 4422736 4324213 4378192 4365325 4113775 4278466 4478684 4517760 4384068 4603269
10677 4603269 4446833 4450986 4730114 4762658 4795126 4757783 4931102 5205098 5265114 5425122
10667 5425122 5478160 5610127 5665969 5755877 6066564 6238116 6364812 6591825 6562260 6421030
10657 6421030 6545321 6852065 7148701 7142833 7213050 7191080 7263865 7603831 7877120 8036574
10647 8036574 8196203 8474687 8966673 9092076 9405902 9656890 10012544 10277866 10399145
10638 10399145 10576940 11078816 11477821 11829334 12526352 13324268 14086863 15124016 16331273
10629 16331273 17300678 18198766 19063102 20396463 22270657 24055448 26313484 29367820
10621 29367820 33265790 38121075 44691785 53892251 66041998 81750696 100578138 119549010
10613 119549010 134048313 140785163 140046307 134955953 129676350 127687034 130847639 140994931
10605 140994931 159584038 188315601 225575470 262720920 287033409 290723450 276250672
10598 276250672 252525862 229792558 214808514 211242857 220267758 243210370 280190437
10591 280190437 327131031 370798604 392558443 382954340 347861959 301293909 257506781
10584 257506781 224703718 205406563 199616411 206401848 224068013 248528981 269265049
10577 269265049 273861818 257630004 225670899 188380368 154650524 129434720 113598515
10570 113598515 105850910 104806923 108941757 115227594 119179111 116266838 105112360 88100705
10562 88100705 69400095 52392679 38469592 28086846 20547670 14984330 11103408
10555 11103408 8170543 6144461 4794285 3467153 2557141 1889272 1175470 524383 108057
10546 108057 -111059 -195827 -622879 -1244594 -1321675 -1347464 -1680987 -1764497 -1749589 -1918277
10536 -1918277 -2044716 -1931773 -1834076 -1916319 -1808592 -1721845 -1604802 -1725416 -1776681 -1800507
10526 -1800507 -1871111 -1979311 -2023899 -2181670 -2303386 -2214671 -2023351 -1940687 -2048931 -2034757
10516 -2034757 -1909372 -1945394 -1910569 -1755006 -1756921 -1883239 -2006965 -1963688 -1705686 -1785829
10506 -1785829 -2024585 -1994526 -1555731 -1595942 -1838323 -2020126 -1801292 -1481744 -1478527 -1471720
10496 -1471720 -1464843 -1293614 -1014974 -848362 -999748 -1177824 -1296330 -1284820 -1059339 -1186227
10486 -1186227 -1378723 -1440243 -1609005 -1850666 -1955706 -1763490 -1839249 -1791238 -1457750 -1327868
10476 -1327868 -1265321 -1193142 -1160598 -1156179 -993049 -1084140 -1148700 -1005102 -1085132 -1089635 -1040800
10465 -1040800 -1187562 -1309936 -1421126 -1467964 -1523199 -1452622 -1458191 -1539300 -1432371 -1587240
10455 -1587240 -1585425 -1387923 -1322330 -1491099 -1826896 -1721164 -1727158 -1458896 -1474780 -1475552 -1279791
10444 -1279791 -1096162 -1111257 -1197968 -1116184 -920803 -857492 -946156 -898356 -1348743 -1438598 -1308104
10433 -1308104 -1320115 -1366763 -1317279 -1388395 -1429443 -1384363 -1446685 -1491518 -1372387 -1197108 -1194935
10422 -1194935 -1223437 -1275085 -1197078 -1106710 -968432 -671597 -709805 -992482 -1131530 -1200792
10412 -1200792 -1033935 -1045608 -1030012 -1072830 -1310092 -1224583 -1081881 -994187 -975104 -950070 -864256
10401 -864256 -996859 -1033334 -874820 -711714 -717195 -886023 -851763 -981521 -1073777 -897073
10391 -897073 -920742 -1147748 -1353877 -1236012 -1036701 -952426 -980694 -950115 -790060 -755441
10381 -755441 -950970 -1090513 -1045825 -882469 -864354 -885340 -637281 -479317 -455297 -453926 -483961
10370 -483961 -674633 -725961 -780709 -662507 -542874 -467958 -424227 -586082 -560654 -660581 -707844
10359 -707844 -652775 -548576 -394731 -486627 -651288 -626006 -533691 -641113 -849144 -720966
10349 -720966 -423937 -474206 -504103 -437505 -385326 -325790 -489991 -562953 -625794 -602116 -511140
10338 -511140 -342980 -415645 -568772 -532044 -507606 -654726 -675058 -586193 -631648 -604807 -668273
10327 -668273 -715169 -578214 -522449 -565263 -361931 -295362 -387912 -463669 -464852 -496319 -592319
10316 -592319 -325986 -462161 -783784 -904946 -837915 -843211 -821168 -718662 -616455 -686696
10306 -686696 -573332 -573408 -541355 -577720 -786472 -586822 -190769 -239655 -469348 -553673 -239235
10295 -239235 -302938 -523022 -566085 -513124 -627358 -672524 -813241 -570815 -401383 -387068
10285 -387068 -528090 -566554 -498828 -536500 -570660 -519291 -433106 -465297 -380883 -396451 -470473
10274 -470473 -848221 -681218 -335468 -242946 -300222 -282273 -124548 11455 -98163 -318452
10264 -318452 -490328 -553985 -702865 -753445 -721664 -656536 -602350 -604137 -488616 -380831 -163508
10253 -163508 -63325 -231677 -305390 -148338 -5582 -150297 -297112 -464816 -476706 -422541
10243 -422541 -251603 -254256 -366189 -188871 -86779 -124316 -208318 -239111 -349825 -599115
10233 -599115 -590586 -326844 -168371 -303685 -214985 -125107 -234913 -586787 -644138 -544807 -689130
10222 -689130 -700295 -472943 -510304 -462667 -280974 -188316 -109783 -120690 -82450 -109480 -57669
10211 -57669 -136938 -348425 -530357 -511020 -529287 -457236 -449487 -348593 -434755 -445135 -191125
10200 -191125 15386 -26896 -135976 -218309 -182411 95307 180875 164174 17173 -144604
10190 -144604 -137547 -279242 -533710 -491508 -251479 24320 150158 209059 252576 190915 153998
10179 153998 213583 321610 338173 453150 396318 271719 251592 113924 110491 139764 322862
10168 322862 389796 840914 1152028 1183885 1289885 1025396 844925 937820 1022632 1112751
10158 1112751 1065499 1034077 1213681 1502145 1677915 1769620 1866410 1562603 1251220 980353
10148 980353 1018964 785708 717502 624557 825723 1132504 1140639 1064303 939308 891359 907776
10137 907776 859660 652450 477772 498246 417326 426208 547624 593704 582230 356479 45873
10126 45873 137491 263051 192337 269382 296205 62669 -78360 -2122 -17382 16805 -144783
10115 -144783 -181970 -150100 -196687 -198711 -180211 -244488 -197342 -207641 -360833 -455828 -351354
10104 -351354 -559167 -497106 -485553 -619235 -543171 -642439 -730216 -639294 -621239 -551798 -351136
10093 -351136 -309742 -388351 -215275 -135620 75797 20042 -109327 -234152 -386400 -320202
10083 -320202 -471022 -479972 -253054 -302257 -412344 -474186 -532514 -676216 -606330 -378134 -221675
10072 -221675 -263221 -334414 -281749 -291375 -339856 -377908 -604749 -607668 -350629 -262870 -218234
10061 -218234 -380153 -468665 -386385 -264163 -280230 94400 348036 104946 -62324 66824
10051 66824 -29198 96563 127418 -188317 -129385 -208770 -210913 -192784 -133822 -305497 -209970
10040 -209970 -230353 -156959 -48852 -41354 -36463 -182978 -258870 -438311 -725662 -756681 -621172
10029 -621172 -569871 -446691 -416560 -408043 -248262 -229515 -39995 -57907 -195546 -170771 -119301
10018 -119301 128698 20771 -170893 -556387 -717586 -300772 67436 240034 -123807 -328827
10008 -328827 -190898 100191 175774 210454 142975 -77135 -65619 -87049 -236752 -221560 -141295
9997 -141295 -230903 -239623 -114665 95353 216177 39347 -176135 -395260 -421955 -264914
9987 -264914 -190031 53816 50301 32627 -311294 -388152 -238093 -216532 -158453 -368281 -553158
9976 -553158 -637199 -569215 -306949 -131987 -2317 -169459 -263408 -243177 -173406 -132221 -262956
9965 -262956 -131007 -57292 -121971 -125447 -153465 -95746 -179741 -200255 -229937 -141347 -144630 -93414
9953 -93414 -134763 -137702 -49962 -132450 -332786 -277150 51488 -10483 -124919 -263313 -1780
9942 -1780 56067 -47356 -140458 -38452 -52642 -149951 -181784 -172353 -174404 30663 105028 -39772
9930 -39772 230 -43944 -154746 -452584 -625953 -277846 -21008 42197 1877 -149411 -240625
9919 -240625 -177373 13452 152841 186331 -84716 -186203 -168091 -51398 108847 122825
9909 122825 293528 104951 13434 -5177 -158041 -123551 3573 -86345 -245051 -384370
9899 -384370 -448610 -350026 -311440 -127514 -162025 -81711 -186233 -414197 -500479 -418790 -205470
9888 -205470 -319430 -173675 32285 167920 -74011 -215077 -324734 -400360 -403916 -383412
9878 -383412 -175771 -95968 30144 58924 -122588 -361863 -288378 -344371 -358913 -162664 -236372
9867 -236372 -164577 -55891 -41240 -211137 -92914 -17021 -112399 -207062 -110765 164263 139707
9856 139707 -29746 -116007 -150260 -306084 -123345 -100962 -74932 -43978 -159252 -182103 -69202
9845 -69202 -13605 -15388 32715 178996 74187 -170319 -330124 -251253 -39801 -91933 -12585
9834 -12585 27262 -221253 -293265 -279919 -431675 -504486 -422260 -349879 -361433 -687788 -639848
9823 -639848 -291485 -137857 173914 74316 174650 360587 166076 130159 -185829 -284947
9813 -284947 -150920 -71829 -230739 -179038 -95180 10132 157360 37311 78562 247644
9803 247644 101850 -5468 87475 170830 177012 196624 320145 30666 -288927 -280705 -304579
9792 -304579 -54612 259103 305691 178590 152444 234876 208590 176018 91080 -66549 43254
9781 43254 27923 51420 149901 296888 114000 -108558 -356702 -422610 -410719 -332094 -49634
9770 -49634 -56432 -4001 94676 161086 73881 -18438 -158472 297541 403355 383592 440451
9759 440451 569348 442949 240309 81168 -34001 -29454 -103626 -65837 17272 222384 258882
9748 258882 238131 128568 151426 233300 213722 -54097 -245422 -208763 18069 302715 399864
9737 399864 224460 121461 -95650 -180869 -174531 14841 111906 229348 51773 -147605
9727 -147605 -298258 -139186 90757 -21785 -66846 191692 228089 141173 146418 286362 452265
9716 452265 375611 179161 181163 84174 9156 32368 16910 15421 40649 -123748 -123839 -218570
9704 -218570 -130104 71124 67682 196817 143280 24678 115105 36680 -65669 -51449 228765
9693 228765 331478 215551 251796 535463 417870 362590 438539 556450 534736 547380 616048
9682 616048 423808 561918 736735 776804 872062 710927 679507 778593 865099 1103172 1485179
9671 1485179 1581277 1365775 1164037 1415375 1754962 1674492 1755697 2012890 2303737 2857070
9661 2857070 3397296 3880471 4689221 5981348 7751441 10314679 14161777 20929086 33269780
9652 33269780 50991313 62039988 58179254 46194828 31641159 19731881 12311930
9645 12311930 8005839 5509352 3937726 2674213 2008709 1561663 1059894 818662 558438
9636 558438 449942 686030 581916 415843 604233 729963 694453 617432 603627 596113 509656
9625 509656 190200 -178680 -262270 -178614 -114716 -174574 -180149 -146712 -278000 -190047 -250050
9614 -250050 -456331 -354215 -251466 -234796 -392431 -529383 -584606 -479175 -504162 -278335
9604 -278335 -278148 -152734 -95040 -104519 -286579 -421729 -525782 -461880 -374559 -305742 -380274
9593 -380274 -175125 -40176 -174123 -232583 -521362 -551313 -184811 52620 41543 39320 -184147
9582 -184147 -279042 -315159 -547507 -383136 -180271 -16839 -56712 -180829 30089 175332
9572 175332 205450 173235 35123 -76984 -155906 -69121 213791 15275 -117059 -328872
9562 -328872 -424452 -451136 -265100 104713 -9172 -154793 -74728 -203067 -336713 -367381
9552 -367381 -217829 76247 216477 -102281 -325731 -292711 -62699 92076 44367 137389
9542 137389 -81175 -386031 -251048 -47706 -174700 9149 175349 57366 -39098 11762
9532 11762 42645 171417 16316 81239 -46250 -189812 14981 96495 -76766 -285074
9522 -285074 -74230 135116 168115 12306 -162185 -15572 110324 25924 -37259 -58760
9512 -58760 -178014 -208182 -381355 -502183 -490771 -479616 -438614 -437006 -437056 -493308 -447058 -387309
9500 -387309 -139777 -97882 -368067 -257502 -12932 -164126 -206965 -193067 -36499 -110137
9490 -110137 -221607 -530167 -601986 -570992 -363512 -113859 -141359 -162774 -233188 -237676 -48836
9479 -48836 -281135 -166871 -64761 -167794 -369704 -637827 -453084 -126378 -126713 -169673 -68352
9468 -68352 -171350 -95404 -56169 -97852 -123888 -225761 -96076 108886 103690 -5181 -2114
9457 -2114 183822 288571 261360 336184 179485 -27370 122030 167204 -3776 -115639 -236497
9446 -236497 -380165 -512590 -448294 -308953 -323517 -217342 -55684 132261 79146 -82397
9436 -82397 3195 -65882 -139821 -255839 -170144 -91384 86950 134737 85617 -93173 -139353
9425 -139353 -120684 -230335 -333158 -295278 -134886 -103539 -193173 -60965 -173846 -299870
9415 -299870 -213937 -156550 -126814 -371736 -514747 -445703 -334607 -193200 -216444 -339140 -438567
9404 -438567 -401900 -324576 -226821 -133516 -138123 -130617 4712 -113738 73403 319269 97950
9393 97950 -129739 145966 272535 339606 280051 31007 4803 -136397 -149737 -17390 -36077
9382 -36077 -293334 -312464 -99047 -90309 -51734 151334 54467 5502 -293143 -222010 -72263
9371 -72263 66143 46260 4112 -129592 -161941 -202470 -306422 -459316 -680289 -581558 -357885
9360 -357885 -366416 -535916 -461815 -462708 -389307 -253906 -322295 -171678 -159519 -19607 35676
9349 35676 -145298 -46357 -12500 -133068 -109922 -4231 -66412 -80650 -294556 -395513 -246479
9338 -246479 -111180 17964 13679 -1300 187365 173354 25447 16320 -111890 -187897 -144276
9327 -144276 18824 188676 219372 182802 188282 35148 67839 158064 142852 309585 254567
9316 254567 123161 -65707 -178889 -347378 -226720 -85448 -107780 19510 6685 142997
9306 142997 119487 -110013 -241606 -69067 125730 -49408 -230473 -151424 -149487 -272940
9296 -272940 -103016 47094 183586 325148 241285 106823 203033 184877 178101 -26883 -103950
9285 -103950 -138937 -129694 183441 328013 145774 -184565 -266332 -171147 -29834 36176 49337
9274 49337 -126158 -186577 -35657 83879 69872 23249 85484 96198 21412 320821 300540
9263 300540 133406 154260 -67228 -170247 -123404 -116862 -153118 246064 347069 143618 141010
9252 141010 48089 -101070 -172146 -94737 -114952 -342164 -141555 76406 1846 351893 427610
9241 427610 424081 420049 325210 232899 -83591 12230 325866 446283 346349 211822 -5234
9230 -5234 -42261 -126093 -383256 -343226 -190449 -216107 -319589 -189886 -245986 -235353 -148924
9219 -148924 -278276 -243284 -386256 -158648 -135457 -23721 -17823 172255 75574 -86498 -27384
9208 -27384 -74512 -152025 -250865 -135641 -151652 -30717 -250135 -239263 -193795 -424443 -274667
9197 -274667 -97807 -205522 -352274 -528614 -358132 -138684 -4579 -11349 177565 153144
9187 153144 38370 1634 12729 -19622 -142683 -153075 -176393 -336372 -264189 -194470 -107124
9176 -107124 -182942 -131058 28787 -130511 -205334 -267795 -406472 -396747 -314415 -213048 -115879
9165 -115879 -51388 189255 106746 20916 -174436 -224804 -162284 -167569 -345609 -244570 -313240
9154 -313240 -442858 -316760 -254430 -77630 150764 67204 107393 108683 293082 403805 225025
9143 225025 21084 -123195 -54557 -141934 -48685 83818 13533 3051 141359 88491 48708
9132 48708 51901 -130309 -107810 -7115 -169239 -146299 45049 156434 217325 461051 594428
9121 594428 450199 -56766 -246861 -165818 -201165 -330329 -193286 -2181 -25315 -129444
9111 -129444 -158521 -105280 -57640 -77485 -119941 -60376 -54295 17314 -193914 -326221 -500132
9100 -500132 -495839 -358670 -165465 -40847 -28176 -26161 -4009 68713 64377 -43016 -105870
9089 -105870 -29081 -235130 -379730 -323901 -346042 -318477 30728 135194 106742 214525 341923
9078 341923 123106 -172723 -335154 -234064 -45868 240737 238288 232854 110824 -32285
9068 -32285 40208 128364 208253 224415 197555 256302 23188 -54610 -129970 -8573 -854 37707
9056 37707 -115883 -303422 -219222 40341 123092 -56551 -275393 -414596 -507373 -265964
9046 -265964 -62250 113978 -9964 -217707 -385375 -444639 -429988 -422694 -383242 103332 380269
9035 380269 -120474 -322748 -356768 108010 256978 -39089 -80490 -233143 -446346 -390512
9025 -390512 -154746 15089 34991 20123 116595 88179 -131850 -349202 -466248 -404100 -362757
9014 -362757 -194563 -186527 -427322 -366888 -195898 -162251 -118403 -95068 -207 218407 126696
9003 126696 83488 109028 -109284 -126914 -113488 -57780 -154947 6089 100766 -40906 -147451
8992 -147451 -109873 -270901 -470838 -323925 -75075 -64665 -123413 -411111 -517697 -550890
8982 -550890 -253534 -38000 -143348 -155427 -274875 -326164 -366331 -269272 -73020 -14907 -104566
8971 -104566 83982 88925 -79684 -231517 -47530 50605 -34264 -79391 21907 32086 -124387
8960 -124387 167861 353887 389578 122162 -148387 -49229 -46060 -26027 -24095 7415 -262277
8949 -262277 -506207 -347781 -21151 180027 -149472 -106220 -72846 -145948 -293195 -196417
8939 -196417 -181095 -206889 -48278 204316 161838 135044 -30049 -265282 -235808 -41390 -85330
8928 -85330 -120301 47800 -16231 -45144 -6268 -22583 170384 -22990 -142570 -193286 -119956
8917 -119956 71621 134713 -15003 -171769 -275004 -467930 -462653 -263272 -76227 209507
8907 209507 365936 36077 -169961 -162670 64123 176 -27273 -115665 -148247 -145578 -354399
8896 -354399 -486900 -544164 -500206 -420108 -241893 -257696 -196305 -103929 -115541 -242911 -347391
8885 -347391 -331818 -223312 -214353 15245 -68028 -350959 -512949 -368534 -281552 -224041 -263294
8874 -263294 -203608 -113164 -69325 -195193 -292631 -303403 -202937 -137392 -156428 -249436 -255670
8863 -255670 -356996 -341821 -189864 -11686 170811 256002 253041 32213 -23423 -51443 -149289
8852 -149289 -301774 -158952 102110 230002 248556 177390 363804 473886 256820 112441
8842 112441 62096 141083 189890 118852 162311 38722 -190304 -87745 -39403 -83897 137335
8831 137335 214537 292338 282217 315634 275466 126076 -118516 -139069 -125832 -15855 -180106
8820 -180106 -240819 -295830 -180606 -160967 -240283 -257781 -214421 -342020 -438275 -462314 -281441
8809 -281441 -92283 147241 228413 -12717 -144054 -47889 -118382 -225999 -63136 -38488
8799 -38488 -128754 -137168 -213066 -233840 -125666 -90680 -49376 -37198 -21202 94584 48108 -212158
8787 -212158 -326728 -127948 75946 223208 189153 -46020 -152101 20632 32167 -34663
8777 -34663 -64431 -127971 -92531 -206292 -191616 -184563 51410 41838 -300947 -567564 -492127
8766 -492127 -335703 -388281 -298172 -129899 117940 167098 131720 55592 -42155 -34014 124627
8755 124627 89391 152791 164018 207455 197178 95719 -6393 39866 -47312 -410102 -568777
8744 -568777 -356031 -280618 -89336 -70064 -32017 173766 140804 -155736 -391582 -246491
8734 -246491 -44314 261376 200980 124385 38219 -326394 -424076 -406297 -284832 -172002 -123591
8723 -123591 -49657 -125520 -181538 73054 -7308 -40652 -194374 -304021 -266656 -201680 -249163
8712 -249163 -211625 -149040 -191490 -76786 76391 145258 125713 141103 80440 -20142 -282774
8701 -282774 -281265 -244761 25788 788 -130280 -23087 26651 -46641 -242369 -598875 -721236
8690 -721236 -524164 -244549 -12591 -35267 17688 -8961 -186728 -445969 -513614 -473222 -416919
8679 -416919 -144202 -132643 -182499 -190280 -143403 -224049 -22461 203372 154055 76512 206247
8668 206247 221891 135177 -14819 -144431 -233233 -169662 -57082 -24494 81104 -41519 -164502
8657 -164502 -111591 -218494 -324780 -396615 -572126 -514081 -270220 -81600 41504 -76275
8647 -76275 -153597 -120931 -32237 -25446 -209158 -330393 -497739 -642105 -265543 -83216 2727
8636 2727 15210 17521 -79774 63673 140755 27772 -50165 51673 80135 -187242 -236962
8625 -236962 -157930 -205007 -133866 -138795 -140684 -97764 -19331 -3329 64703 74327 222061 258465
8613 258465 71907 112167 97655 126004 192753 126979 79020 -16144 25550 85480 -77777
8602 -77777 28913 69535 186191 170180 228383 135842 208836 220629 75906 183955 257460
8591 257460 179815 316416 201263 -39962 99889 210789 141731 29079 43874 76579
8581 76579 -116865 -52872 -130600 -146422 26262 -49105 -209350 -324737 -264129 -133589 20258
8570 20258 -163054 -292369 -309140 -340413 -203888 -89707 63584 130567 59279 -274405 -238562
8559 -238562 -44043 132608 235261 153190 145537 18708 -2337 -130979 -172094 -464298 -400521
8548 -400521 -346403 -367444 -413985 -202411 -260831 -280114 -287132 -123041 157711 179427 175959
8537 175959 290836 176442 97875 106865 -92834 -329791 -251848 -305057 -155425 19357 -39018
8526 -39018 -168051 -262079 -239516 -292323 -70418 68889 227619 124283 30765 156996 171931
8515 171931 -81939 -147370 1844 209815 360035 140171 88989 -182619 -252361 8306
8505 8306 48311 71918 -58906 -132440 -140278 -90683 -680 -147934 6331 347605 211467
8494 211467 82319 -157301 -401862 -281340 -349445 -366492 -316257 -246861 -273982 -315177 -404480
8483 -404480 -301675 -307534 -197780 -382772 -458432 -582419 -327946 -203888 -289418 -407748
8473 -407748 -350677 -410384 -196790 -132610 -256943 -209132 -163095 -174682 50724 -45731 -97728
8462 -97728 -87989 -82524 -323899 -325623 -6040 136419 148599 272368 143166 78226 -57407
8451 -57407 -19146 -46544 -160905 -207002 -198532 15136 137233 30999 -103967 65191 204306
8440 204306 -42538 -177808 81681 2590 -242104 -227357 -31060 169076 248276 400844
8430 400844 221239 15606 -36118 -103035 -352036 -350536 -238230 -154705 -212443 -188316 -312617
8419 -312617 -230114 -212079 -46048 3209 -155376 -229853 -171635 -173442 -157576 -251613 -463635
8408 -463635 -279965 -92667 44519 17290 -227142 -240114 -157025 -400067 -312849 -336742 82379
8397 82379 306920 134510 -222889 -350183 -322442 26546 276479 355022 454328 487611 560531
8386 560531 410330 191343 32365 356430 478147 252360 -30416 -174362 -10790 140079
8376 140079 18052 -66578 11948 -80535 -65431 62391 90073 128200 -90032 -81777 38883
8365 38883 -164363 -447204 -548134 -471369 -179144 5187 -13873 -289305 -222820 -47324
8355 -47324 -122580 -90471 -44081 -74526 60883 88731 76069 72829 213145 -27222 -325589
8344 -325589 -349407 -242353 -3576 -3874 72922 52231 -63079 -44657 -53795 -140689 -373882
8333 -373882 -387249 -244420 -32965 -100871 -148729 -60024 -108772 -63431 -107585 -276958 -312621
8322 -312621 -201524 -7430 105752 37336 -144039 -116691 -217624 -345394 -63892 194936
8312 194936 315977 171766 -117117 -385572 -295382 -115877 107583 247286 -41063 -435728
8302 -435728 -409736 -281394 -321918 -334394 -181768 -92622 -152306 8833 -144632 -383273 -282286
8291 -282286 -290891 -257099 -98021 -40303 23840 -120726 -234255 -76417 40796 -7720 73287
8280 73287 -8888 -347192 -440070 -237009 -86360 -87757 -210032 -199717 -60012 157253 68966
8269 68966 14065 -92807 84739 152900 -90210 -105792 -218049 -31688 24087 103774 158219
8258 158219 -4802 -96533 -261859 -343996 -196347 -144513 -85902 -41345 6054 -54145 -173011
8247 -173011 -157717 -137521 17234 -124458 -212153 -67323 41258 122201 301299 346159 78799
8236 78799 -165473 -162649 72182 -83290 -128184 -198316 -211461 -108684 -66495 -9487 32485
8225 32485 93980 -115005 -161835 -257075 -308273 -139424 -351769 -461605 -251895 86134 37264
8214 37264 71469 91471 241020 58402 -102055 -262113 -393712 -208236 -147722 -55164 243157
8203 243157 186481 228472 226991 352107 401977 416729 230217 -3340 33494 281750 465397
8192 465397 486680 245602 55669 -199373 -195432 -33135 110607 151555 250358 70212 -112765
8181 -112765 -38287 114956 175609 -77723 -217494 -180234 -269816 -270508 -224495 -172302 -102305
8170 -102305 -82792 -88240 -128511 -32866 11231 214154 298228 194109 -82794 -215510 -31285
8159 -31285 57696 199567 65660 99398 106391 73837 185827 242206 251321 257936 22091 -149074
8147 -149074 -131860 2108 -145722 -153148 -170084 -225311 -198233 -129192 30613 225684 -15228
8136 -15228 -171966 -19541 69752 143559 111891 33761 -139946 -287412 -161638 -235021 -294830
8125 -294830 -282777 93113 285253 298958 72627 -7492 333286 375038 253985 117784
8115 117784 18361 6814 -7719 152300 23145 -148383 -102658 43564 -9704 78308 110830
8104 110830 125738 68521 41867 61235 -18885 -153581 -276298 -273942 -288498 -357890 -196150
8093 -196150 -74750 80352 21102 -140608 -159379 -260132 -361030 -148556 26882 6449
8083 6449 29802 -170543 -286521 -325443 -397618 -179700 11070 99155 212773 202884 -98469
8072 -98469 -204179 24148 231409 170075 207881 155581 -23448 -154678 6856 148909
8062 148909 -22543 -221531 -121057 13729 68968 114240 95512 17091 -164727 -220553 -32093
8051 -32093 -128329 59497 301479 231477 107507 -87965 -348960 -306514 -204213 -119066 -251297
8040 -251297 -285245 -307099 -441755 -331378 3856 129497 80845 79139 -64277 -18109 65860
8029 65860 160295 130604 100640 40998 -73259 -174480 33465 -4254 -43663 -70063 -92877
8018 -92877 -34397 7663 -71555 -265795 -214645 -245710 -203488 -99788 -212720 -465932 -343270
8007 -343270 -203233 -109804 -23832 -160665 53403 25365 -156438 -219630 95597 288327
7997 288327 355955 213372 74271 33326 85251 111794 133596 144277 148192 28940 -154664
7986 -154664 -242139 -149224 68440 76499 30853 348390 524283 382201 167120 164794 202204
7975 202204 -43860 -74703 118398 298875 423693 344386 584591 592322 473339 -6666
7965 -6666 -77240 26161 171856 324712 426983 232017 100679 -121283 -107467 32510
7955 32510 11436 -180790 -244550 -112443 -78007 -145047 -141924 -226911 -317983 -178312 -154830
7944 -154830 -179468 -82122 -8178 29360 -149441 -205819 -55977 90478 -125569 -363255 -253784
7933 -253784 7777 312959 319592 242886 309749 134769 -27204 51557 66113 -37979 -147055
7922 -147055 -202909 -207866 -159209 -165477 -112881 179016 311105 232789 212303 181342 245523 3642
7910 3642 -172920 92295 166207 23217 -92873 -10077 100811 -190831 -207558 -11008 -39398
7899 -39398 53883 107391 254221 277530 156918 72082 33105 63898 61524 -47171 -40664 15718
7887 15718 -117989 -82929 -52967 114256 329281 471497 307343 140479 -151273 -149677 -61003
7876 -61003 -84184 -263238 -504541 -494088 -253757 35477 97125 -19737 -227670 -54818
7866 -54818 -67604 -191642 -105554 -154283 -189531 -239735 -157441 -214363 -314420 -321936 -221404
7855 -221404 -69016 -92505 -547358 -413595 -216908 -119392 10850 -36971 295725 228593
7845 228593 178599 146844 30184 14017 -191066 -329059 -140174 -180125 75438 169950 34082
7834 34082 -40647 -63365 11884 104824 -38809 -195033 -198055 -116041 -49704 107495 91126
7823 91126 29053 145791 50976 -176442 -181591 -153104 -108632 -119823 -38519 58435 69772 250876
7811 250876 266729 -66904 -167267 -219842 -265165 -105520 -219842 -347845 -384163 -295116 -170023
7800 -170023 -259861 -306544 -247488 -82581 12868 67063 -3700 10430 182405 366998 193289
7789 193289 23352 -131130 -163878 -255532 -195076 -183551 -161797 191299 126364 101805 71731
7778 71731 96576 50351 8200 195380 126444 -26833 112003 32084 -226089 -198156 1590
7767 1590 31673 -140319 -154308 -116001 -218168 -430993 -429507 -200956 -187932 -215161 -164843
7756 -164843 -27882 -75997 35265 -1910 33696 -33785 -318769 -542714 -462486 -212820 55849
7745 55849 261866 307579 56461 -168168 -219756 -118142 49754 -139889 -174523 -178220 -213458
7734 -213458 -223866 -25009 -32990 145071 180282 141216 177498 161952 -95377 -262981 -262923 18612
7722 18612 34302 -134969 -144274 -232035 -200666 -109258 -110440 -154734 -157398 -207490 -243582 73688
7710 73688 40284 83824 94152 115626 169070 308814 212231 166314 236376 401579 489244
7699 489244 259138 236185 281189 285634 210783 200819 104107 -32399 -88637 -232692 -60013
7688 -60013 114075 139479 -114482 14638 -12154 -61489 -139520 -141526 33096 93556 132086
7677 132086 -29719 -54199 -159580 -365064 -396309 -193970 -136825 -163054 -36364 -84776 -36469
7666 -36469 -228439 -217454 -59838 -17190 -227746 -148875 -68950 -260456 -88294 60159 91046
7655 91046 -2534 -3032 -17639 -88165 -115776 -304322 -309652 -351296 -167107 76791 60923 97338
7643 97338 -38709 -325283 -359987 -366839 -238988 -138210 -56205 -42294 -154152 -169423 -65599
7632 -65599 -74465 -143383 -181140 -207023 -264267 -161922 -231402 -9829 52553 -22644 5783 151931
7620 151931 97772 -55933 -67877 -60688 -42804 250994 160676 -245239 -430207 -537745 -296168
7609 -296168 200963 202409 167183 221712 49869 -69746 -198109 42763 71841 181598 143857
7598 143857 -59934 -53981 -89466 158966 381849 342827 -91531 -430943 -287999 54156
7588 54156 407177 384493 150763 -62804 -177848 -311314 -445586 -361807 -35401 -58016
7578 -58016 -267952 -381032 -274921 -182255 -229890 -254235 -149274 -128000 -16661 -254642 -556810
7567 -556810 -486223 -267516 -73839 27719 -144696 -26179 -20653 66089 144114 90294 -288628
7556 -288628 -304043 -210016 -183251 57648 189390 439627 451937 236151 -170051 -57702
7546 -57702 -127468 -364872 -453181 -413508 -251724 -140669 -14876 119577 143942 45722 -105964
7535 -105964 -83463 49775 118020 65550 141707 204489 -193641 -255659 -172367 -88047 -105730
7524 -105730 -127915 3616 -142573 -247047 -148348 94715 130747 -158422 -175562 31287
7514 31287 -110649 -311835 -81122 32429 -75206 -340945 -637698 -543803 -237951 -104857
7504 -104857 -62292 -21676 -156018 -25990 -96757 -164411 62837 174476 -89414 37164
7494 37164 17952 96417 114989 -17299 62413 147977 -48131 -189819 -239918 -203218 -408188
7483 -408188 -330742 -240239 -257680 -257509 -229132 -338732 -293998 -214505 -74967 68070 223701
7472 223701 259061 71046 -240982 -317174 -154668 -108648 -277465 -240605 -139410 49352
7462 49352 52118 61027 231806 218795 281211 82122 47976 172402 180692 -48455 -53521 -101223
7450 -101223 -187314 -212416 -233999 -232843 -449695 -394238 -195371 -216957 -163603 -132941 -136881 -164857
7438 -164857 -218037 -251908 -190501 -119988 -194480 -173851 -177270 -283876 -247247 -462313 -454159 -214699
7426 -214699 -237605 -185826 -346221 -578177 -415160 -269587 -246195 -320271 -47306 7309 95525
7415 95525 -186624 -364617 -301237 -140510 -246114 -296472 -218779 -7736 211210 126036 40226
7404 40226 66639 -12182 -17414 -145137 -129144 45251 267652 283954 186690 1933 -136967
7393 -136967 -83250 -75302 -40370 138347 -75266 -84003 165873 242451 132011 11540 226676
7382 226676 269328 134545 -13197 -274599 -385561 -236305 -93859 -15817 22906 -223308
7372 -223308 -545653 -701278 -380726 -38956 83619 120606 92244 204513 135716 46728
7362 46728 32065 -23568 -67963 -112439 -179979 -132490 -51268 41345 72533 13353 -50714 -15761
7350 -15761 15013 98981 172870 196603 136207 71277 10932 14721 142547 59239 194133 365474
7338 365474 434761 202474 120855 18722 -132129 -361337 -478413 -87631 71052 -52962
7328 -52962 104650 170000 94531 3115 -296653 -260790 -79387 30101 209957 -36409 -227945
7317 -227945 -156273 161519 10418 -139848 -179191 -91972 -33164 109337 185543 215119 193942
7306 193942 245698 393057 78872 -52494 68180 283647 293810 242322 161303 201587 378688
7295 378688 357505 149909 -67971 -113390 39679 144984 272659 330892 368786 276894 357113
7284 357113 192524 -88329 -313447 -363940 -368330 -409678 -441333 -301389 -197985 -103393 -127376
7273 -127376 -79695 79638 42595 6509 23058 -102437 -134729 -266580 -226093 -91421 -193464
7262 -193464 -307140 -289517 -184013 -123778 -156657 21869 142247 88399 41999 -109665 15091
7251 15091 107959 139897 82941 70835 87908 58294 39711 75523 15139 -123107 80599
7240 80599 73566 -208434 -295777 -36893 -33901 -94876 -10111 -36958 12224 -45638 -198392 -115812
7228 -115812 -92306 -41569 5796 189787 159993 294707 173474 139463 96661 -81552 -155896
7217 -155896 146515 340379 253747 90090 172795 116490 12907 115216 110644 141474 324286
7206 324286 422037 425726 374787 162368 -89857 -134384 24492 45026 100198 166286 -46122
7195 -46122 -57393 33359 155560 170058 204887 122441 138806 76943 -10215 8055 -27200 40469
7183 40469 228377 204631 29589 104085 170588 84516 147046 30408 -61743 -194089 -253575
7172 -253575 -241885 -295054 -484541 -398219 -193363 -78011 -54934 -158533 -120050 -250683 -142833
7161 -142833 -58788 -116091 -42404 237721 196081 -61866 -28276 -308 -21011 -132379 -76506
7150 -76506 132020 286677 190139 142792 245548 230972 192570 98570 94862 26977 140468
7139 140468 -7027 -37866 -181988 -212861 -178068 -115490 118359 331192 395704 408588 215335
7128 215335 176764 74934 98107 130562 55729 40888 -158026 -206720 -226092 -126679 -83989
7117 -83989 -49384 -213421 -370256 -239443 -299412 -412273 -340846 -171225 559 149954
7107 149954 6218 64020 -287702 -549085 -448203 -393627 -454147 -437304 -434062 -391858 -394926
7096 -394926 -461516 -696073 -776223 -712568 -336656 -102400 -87426 -79999 -21725 64951 -64572
7085 -64572 -11519 115976 138543 275988 153942 91515 -112506 -158542 -118373 -69583 -253495
7074 -253495 -220122 -211544 -138777 10576 72089 32310 108338 139397 3898 -17246 -20416 -70743
7062 -70743 -25988 102753 48594 -48559 -4553 212486 -112356 -288128 -316245 -51383 78914
7051 78914 139216 201520 273495 152063 133900 342068 256775 254812 244435 148217 94964 131314
7039 131314 -22603 -163822 -155868 -179341 -186443 -121911 -1234 -115064 -268295 -429594 -518533
7028 -518533 -518450 -368456 -188772 -150731 -377761 -286387 -281893 -325531 -279699 -305024 -202924 -215243
7016 -215243 -165676 -79417 -111380 -138885 -241507 -75917 108839 265614 391656 230215
7006 230215 32592 -97604 -88340 171205 335751 92558 166245 294649 369688 159592
6996 159592 49597 -72714 -223370 -344399 -552139 -677242 -544087 -319583 -40271 9512
6986 9512 -92581 -29289 22637 201518 135114 77854 -58250 -104543 -118645 -189586 -95335
6975 -95335 -17641 -217404 -179101 -201764 -124513 -162387 -84993 -15327 -125342 -147398 -167158
6964 -167158 -56348 82227 109033 -44522 -145604 -48154 3638 -148874 -319888 -300115
6954 -300115 -320748 -354404 -188771 99697 275558 193757 312490 311845 91359 -172274 -234931
6943 -234931 -138920 -146084 -388938 -151427 -42221 188827 201093 19142 -46386 171204 226401
6932 226401 173527 149709 52540 38185 -72573 -70265 -124352 -25785 194358 358495 324076
6921 324076 186860 48801 -223412 -261602 -110813 40164 151396 159279 -213038 -399628
6911 -399628 -334393 -120490 -132290 -352517 -413254 -452390 -480108 -612284 -574434 -394044 -158720
6900 -158720 -25330 -142485 -159976 56200 190241 195080 38010 237802 402921 232108
6890 232108 -38267 -204902 -151953 -106822 91137 199299 29367 -68904 89216 -79593
6880 -79593 -4483 168119 50751 101617 257498 80267 107469 187994 44750 -262737 -146718
6869 -146718 -111350 -100622 -8482 157583 220206 230363 -71298 -229611 -214287 -233229 -339386
6858 -339386 -279001 -234302 -172701 -219493 -287081 -152224 -19340 -37675 -129960 -169688 -452956
6847 -452956 -482630 -406932 -306963 -62145 -298166 -556929 -397358 -75459 -175192 -183225 13915
6836 13915 144501 261521 175829 -17498 -58908 -149062 -92131 51709 38142 137283 237249
6825 237249 236710 -92730 -454571 -282122 93556 155845 19944 -57670 -36792 21506 153336
6814 153336 60171 -27801 106676 85030 -167423 -209110 62491 64020 114181 293616 57016
6803 57016 -202698 -28034 280098 423224 278282 -91572 -362451 -399135 -297341 -270891
6793 -270891 -259691 -215911 -89427 61178 5998 120611 74868 42173 28515 84367 144894
6782 144894 -34706 -124935 -25521 -54604 -107685 -98503 3229 -179291 -162034 -128261 -93052
6771 -93052 -61083 -81475 -268016 -248361 -16320 196629 258984 538191 411104 209931 315422
6760 315422 460144 486140 579754 723549 502614 422900 16568 -302499 -104862 -103576 -237175
6749 -237175 -142685 -226946 -34485 153890 244961 230038 71533 -21577 -181292 -317342 -39470
6738 -39470 18125 -178812 -66160 138592 -53278 80826 358927 437617 421159 307591
6728 307591 -13220 23944 200596 113958 -104780 -217195 -139693 -131477 -213045 -73566 113089
6717 113089 128132 368510 407738 295618 324122 407369 535905 456688 279426 104494 77162
6706 77162 107126 41625 -99775 -230821 -26990 144328 18107 -4923 -26640 -157106 -174549
6695 -174549 12454 61348 175967 270493 180805 -84047 -200953 -42487 36205 392785
6685 392785 432846 256051 117831 52366 -53479 16521 -99481 -210551 -201381 -90032 -130352
6674 -130352 -211962 -248207 -105289 -81870 -153855 -146658 -7346 -40725 -148171 -352969 -139305
6663 -139305 154693 165456 157052 28696 82332 237446 254182 69169 210508 365415 285782
6652 285782 273535 302352 165787 -163164 -291047 7577 84140 15708 30390 147452 119905
6641 119905 44944 -11861 -67674 -332486 -408226 -5013 -49820 -220101 -195904 -192315 -99289
6630 -99289 -136849 -152623 -27815 111481 123552 295258 143195 92973 241930 360817 303638
6619 303638 387746 372779 431299 199763 122903 198073 243160 341193 396544 455156 439951
6608 439951 349555 213348 28021 118484 178807 291726 352061 185319 -49289 -54739 -10742
6597 -10742 -115231 -54331 61827 10475 38431 128028 319869 463938 397105 391294 621267
6586 621267 708766 581619 407842 182655 24652 -66530 52612 215182 99544 -210152
6576 -210152 -388053 -310695 -224831 -222312 -33752 -42306 -174568 -1190 135649 72810 -67731
6565 -67731 107295 225025 109159 40319 118651 46141 200563 6810 -283731 -202480 -110962
6554 -110962 -259930 -491754 -355091 -111351 -37704 -84831 66995 34995 -67685 122735
6544 122735 133461 146915 64522 -58392 50361 29393 -56114 -98579 -63620 2707 -142143
6533 -142143 -2488 107619 92901 228275 268516 156443 22796 -144487 -22819 212596
6523 212596 182314 -179959 -261933 -112231 66684 127760 244631 123110 -30471 -299320
6513 -299320 -251805 -35457 -57413 -121042 -199490 -314155 -160629 -18538 100748 98240 -20854
6502 -20854 -76573 -118117 -121699 -118640 -242150 -162340 -87770 -172782 -97637 -52628 73592 193596
6490 193596 106048 324279 543638 445621 216268 134257 224417 353360 206858 169960 95661
6479 95661 35908 139236 130857 193006 376715 176724 -31339 -274803 -203213 -117262 46648
6468 46648 -10963 36869 29761 24793 213735 306448 501850 458314 224372 110061 95802
6457 95802 249199 273704 169898 184136 93214 98705 214917 132730 226242 300899 79217
6446 79217 -222408 -380458 -345260 -50720 -95689 -95041 -174694 -158910 -295733 -53020 74109
6435 74109 66035 153640 110723 18855 -291385 -499670 -500060 -360551 -249742 -20849 31286
6424 31286 225604 108561 -122703 -206043 -253136 -373690 -325531 -238037 -286837 -308722 -258724
6413 -258724 -374956 -272228 -267418 -320614 -194344 -203804 -170060 624 -26844 -197723 -397700
6402 -397700 -376222 -237413 -300381 35843 319544 296779 157805 39229 2310 -82224 95590
6391 95590 124386 148862 281535 317718 390568 366772 249974 111378 150434 116392 125175
6380 125175 -14999 -268620 -170585 -87995 -293533 -246049 -164012 34914 239707 228077 157696
6369 157696 100990 139085 175733 -147455 -253122 -201418 -143481 -33255 117425 165797 85451
6358 85451 -32217 -63126 -31317 -92219 77563 118756 79919 87131 67054 256329 308781
6347 308781 166889 -64048 -20328 148527 140345 88838 3286 19359 -5474 -86131 -33721
6336 -33721 70299 12724 -129570 -190229 -47800 240074 101120 -84148 -52235 285381
6326 285381 395961 162817 107631 247281 215911 9961 -341875 -430200 -342922 -289833 -215594
6315 -215594 57468 136147 157213 150625 61732 -133513 -264796 -203136 -250482 -282337 -188266
6304 -188266 -77717 -42226 -59819 -118690 12987 120234 -193557 -128809 59134 -68082
6294 -68082 -163255 -121717 -164736 -196017 -93135 -344161 -463315 -311332 -303265 -86113 176314
6283 176314 71076 -13933 92498 158334 -71489 76558 197660 157548 75590 -123809
6273 -123809 -348199 -440817 -311293 -106154 181359 87116 80104 344830 176159 53904
6263 53904 -7507 21959 120401 160296 279027 182994 120404 171062 -15963 -40639 -206293
6252 -206293 -61449 82832 95138 -54252 -12122 197997 207847 189727 -2781 -149476 -94445
6241 -94445 27214 -91368 -8559 182739 30227 -152498 -95005 -45057 56409 177564
6231 177564 276044 235855 80780 124602 151776 110260 133177 31016 -88006 108221 322073
6220 322073 394231 58998 -41157 165958 86393 181432 314255 401233 413578 284110 189117
6209 189117 78020 -27273 109700 93307 -40492 98945 67213 6397 95480 -53220
6199 -53220 -51263 -36631 34341 -183125 -299847 -183462 76622 84894 213946 161674 148190
6188 148190 327375 254564 104224 316909 421654 40152 -153720 -126970 47392 154916
6178 154916 -44212 -143687 3200 103893 83505 53600 229491 163093 28798 66454 216649
6167 216649 83410 -125236 91346 141890 -32802 -314888 -544295 -453395 -145220 179175
6157 179175 395136 267116 47525 -35427 5556 -88464 42934 188243 121411 -26050
6147 -26050 -4559 81014 23939 -313597 -280471 -74189 -4966 -95449 -115764 -151241 -83339
6136 -83339 20433 109339 -287593 -355110 -10433 96829 47167 41285 9976 137982 111693
6125 111693 7535 125146 179844 179761 -3614 -106577 45588 -87511 -238076 -338403 -371505
6114 -371505 -376586 -57159 101398 67782 -267676 -387816 -447622 -374489 -274729 -93529 -42294
6103 -42294 -146015 -309270 -195230 -229606 -181162 -188670 -212405 -398368 -335257 -230633 -232038
6092 -232038 842 172350 156395 63082 -112596 -163129 -357802 -309301 -407629 -373421 -203111
6081 -203111 -29686 176020 335989 205451 201747 96449 -95845 32975 -68534 -242395
6071 -242395 -315440 -132711 -41855 -38638 -73481 -243705 -197551 106500 226687 361374 450072
6060 450072 166701 -43052 -226662 -93468 -140332 -30570 54160 -80254 -115808 -216862
6050 -216862 -191941 -65828 188381 28123 9018 4677 -123360 -203624 -189078 -180450 -103418
6039 -103418 -178095 -211616 -46501 -187186 -455550 -522910 -465485 -337894 -274594 -172072 -308038
6028 -308038 -465131 -428304 -222439 22701 125812 1849 97357 -9885 68088 66705 19011
6017 19011 164522 322127 193034 119035 268559 202874 102251 159584 65257 76569 31320
6006 31320 -7255 -110325 -188771 -59546 15378 160231 150417 27331 -213703 -271545 -313465
5995 -313465 -259271 -353561 -280673 50802 39091 180673 334398 312361 -22135 -192954 -154253
5984 -154253 -145914 -181421 -203633 -129753 -360317 -471235 -220018 -87970 10380 -36779 -159004
5973 -159004 -35314 -45700 63205 87072 180172 57966 -127430 -260561 -167904 138289
5963 138289 76573 -52161 -88190 -2805 212853 212911 80781 123646 237165 194251 289429
5952 289429 170245 105716 333047 424710 183923 -46811 -15875 73329 -53814 -256957
5942 -256957 -344264 -402413 -289481 -46305 98397 236847 83895 -145704 -33069 159801
5932 159801 137649 -39161 -234078 -155730 -13689 23023 43934 -344422 -363145 -248707 62868
5921 62868 276316 211497 31901 133650 159287 -45919 48829 -122099 -500108 -538115 -129087
5910 -129087 -79205 -165161 -133865 -23901 44830 33374 -102782 4571 125764 83218 136982
5899 136982 68242 97008 195287 77061 105656 140285 117771 274146 212364 171142 142463
5888 142463 -15707 -121577 -46874 84639 99778 -40380 -37818 -117746 142785 262657 17593
5877 17593 -41683 139685 143894 32430 -25124 16460 183346 -55260 -106549 -148476 18722
5866 18722 -76031 -226451 -118149 121895 178078 147995 129899 231598 272590 134312 -127793
5855 -127793 -65511 38890 17873 -11688 132957 165322 38263 147479 107948 73735 234805
5844 234805 441880 320281 343604 296528 70790 -39913 67470 -49169 102730 -9284
5834 -9284 -18523 -224013 -405382 -385939 -255764 -257357 -97831 -24862 21739 127649 211066
5823 211066 -61579 -107379 -111685 130009 159270 -17452 143397 216317 48498 -77788 -121102
5812 -121102 -66253 -47285 -285777 -261235 -24511 149809 -108983 -289099 -143943 -227073
5802 -227073 -215459 -143756 46494 175171 249736 384755 475483 370327 162323 111350 187997
5791 187997 189093 164090 -133088 -389946 -246381 -186805 -321630 -366687 -262462 -201009 -113192
5780 -113192 -33698 -242750 -384090 -581211 -689416 -638496 -236495 148493 49999 -96292
5770 -96292 -185737 -321530 -227791 -287978 -290180 -411360 -446152 -401403 -174192 -100249 -110387
5759 -110387 -139763 -50107 195567 200055 124033 -79101 -29692 119907 271104 53875 -210539
5748 -210539 -259747 -252041 -392379 -584090 -511202 -228670 -140437 -230866 -169026 -121845 -248880
5737 -248880 -445278 -534046 -577748 -390556 -338851 -113660 35388 268001 247086 265260 158526
5726 158526 -18216 -269374 -368650 -385359 -262283 7446 17355 55419 88394 -74394 -125708
5715 -125708 -106516 134971 240550 147139 184093 190547 152846 181547 151941 -105393 -281084
5704 -281084 -286086 -201620 44633 78024 118388 -3985 38586 307969 417651 446437 447883
5693 447883 332015 365302 297929 255573 233183 189469 -47180 -169203 -276387 -492138 -372009
5682 -372009 -226791 -95858 -138772 -203586 28290 370897 283254 196225 174246 181779 215603
5671 215603 130980 -184405 -138498 -71506 -17621 -27427 86314 -67953 -122731 194396 558034
5660 558034 422070 478145 445601 2687 -41269 -20005 244559 160251 -65280 -63172 -26918
5649 -26918 34525 -86475 -177223 2921 77426 120710 195201 178463 -156957 -243021 51201
5638 51201 101063 69887 203499 272241 300453 182608 -253435 -313776 -60697 200557 350805
5627 350805 357473 396413 387730 168633 40289 177289 250429 221245 -121342 -63434 83514
5616 83514 164762 223379 20161 7060 54233 99864 -2376 21786 78134 18050 -32715
5605 -32715 155752 176053 415754 179870 -157249 -196527 -171680 -97657 36055 53173 -13449
5594 -13449 -259703 5752 -113606 -239873 -139402 -225944 -173934 -225274 -333334 -196674
5584 -196674 14454 56445 40307 -53980 -83460 98740 156603 -75995 76505 272174 202474
5573 202474 228944 208940 -11603 45757 212043 333406 118470 69395 -42979 -107936 -369180
5562 -369180 -238887 87243 -6268 -130899 -166874 -4583 74515 132428 299776 165604
5552 165604 117676 101780 64037 60330 168835 147383 287485 180983 -184657 -90730 -14528
5541 -14528 -85295 45501 -69733 -381913 -352864 -112819 -41072 162895 290707 142141
5531 142141 -137355 -91904 56062 111416 241571 260047 88155 124596 268846 -74936
5521 -74936 -455028 -280943 -180521 -230093 -69362 46914 28073 24193 -194463 -208297 17443
5510 17443 103074 59460 356169 393682 364142 239921 36039 -43464 62364 -9899 285576
5499 285576 125042 82858 214504 138543 69148 69129 52781 -112861 -68825 14496 -45198 -130627
5487 -130627 -49567 -210293 -206372 -158969 -62287 -140016 -101392 -192662 -285271 -116638 -108987 -97487
5475 -97487 -8129 178860 116753 -31886 36516 210133 373170 401712 313220 371024 235332
5464 235332 46599 89366 151133 119044 229453 84262 -95892 -221232 -7144 313074
5454 313074 209247 159972 533812 550219 206353 -8515 23540 85746 176879 121234 195778
5443 195778 233577 86728 -89416 89693 2932 -159934 -330136 -241215 -75328 14246
5433 14246 121118 236533 166888 132790 -77083 -170558 67308 18202 -95259 -162966 -458005
5422 -458005 -408664 -167312 -39238 54887 86729 49552 -125116 -61254 -15451 33790 -144596
5411 -144596 -215649 -196714 -49148 48081 77071 231364 314262 289844 298785 280836 -63699
5400 -63699 -354889 -255761 -204893 -297852 -250687 -316443 -232500 -64324 -170198 -78403 -5483
5389 -5483 348535 512666 280304 164375 178398 331934 412173 161145 208878 218305 149441
5378 149441 187717 97172 -168266 -139450 -28051 -31981 -13567 -17038 -208320 21345 225823
5367 225823 -108784 -205497 -163656 80837 266038 360976 365244 101044 84565 154092 295782
5356 295782 267503 112527 -229104 -218229 -92798 91611 91982 39347 148199 305149 264276
5345 264276 -2161 -43986 -142017 -63219 72854 14796 -21524 25203 54365 -127101 -137294
5334 -137294 -241276 -177552 97515 265918 322178 277243 121162 -32575 -324206 -346875
5324 -346875 -164002 -125406 -86352 -310860 -266494 -129669 -61157 -53642 58682 -110480 -204604
5313 -204604 -285502 -352009 -311812 -72348 48366 147817 305396 252404 112170 -9431 65010
5302 65010 279580 284988 179932 172208 -123525 -79661 167286 260834 6481 114625 219067
5291 219067 127319 51882 -85009 -236453 -131454 -88500 139082 51441 189644 272326 165038
5280 165038 179888 380039 511685 364416 235210 120258 72001 -127853 -70858 -210060
5270 -210060 -264329 -303909 -117843 49462 106514 135716 79114 43687 -84516 15841 46264
5259 46264 11348 41376 -210665 -264430 -151298 1995 -57076 -28489 -377143 -400140 -97113
5248 -97113 134290 128443 94815 334383 347633 219728 263559 127247 -117714 104886 173466
5237 173466 13166 47169 130482 -56713 -65358 39010 73626 58833 -29545 -28769 129513
5226 129513 59217 131 73726 87309 100768 -22640 -50512 168828 165351 136768 18891
5215 18891 14323 168265 187145 265947 306542 337200 131169 194660 512329 573477 569030 392339
5203 392339 271742 231976 192156 101447 61567 12492 -6953 126521 96818 -40708 -75793
5192 -75793 238573 267254 230529 306042 156513 3086 51513 157179 30853 -105821 106141
5181 106141 369054 447215 206000 74093 49780 -13791 -7386 9314 78774 211468 95322
5170 95322 227174 134439 -51866 -259189 -310379 -232465 -54164 -231820 -301293 -124349 -16109
5159 -16109 134924 154241 96709 27140 -94234 -248160 -119467 -207262 -331514 -310411 -408896
5148 -408896 -552470 -317658 30718 -168188 -256806 -48677 15896 40392 -19472 111120
5138 111120 188326 74676 176525 317463 193574 267777 182312 5527 135047 129269 -291306
5127 -291306 -387188 -104881 36331 188495 126631 3828 130410 62932 66101 116138 -54235
5116 -54235 -260513 -482573 -347779 -158718 152532 -29312 -313613 -181280 -84797 3894
5106 3894 211921 341048 309556 178965 86939 177211 125058 -78296 72205 336463 336421
5095 336421 459465 745174 415570 170902 237908 293630 241879 251997 18184 -208037
5085 -208037 -244646 -143667 -200287 -139860 143198 300072 370811 431176 327000 372200 282447
5074 282447 140730 -110558 -128402 -182750 -39403 47296 25977 170659 51942 -144254
5064 -144254 212766 552577 489322 424739 116215 -114522 -83356 65350 -94153 -351903
5054 -351903 -198103 127425 304605 318242 405665 320257 209444 136922 1584 -264167
5044 -264167 -397460 -245265 -148696 -213563 -266427 -186592 -123089 -136986 17687 60454 1069
5033 1069 282702 423577 395898 337561 368670 292592 414930 366616 -1590 -118421 -116208
5022 -116208 -124342 24522 -80911 -132653 129311 290345 177500 129648 167348 30525 -60159
5011 -60159 38782 207196 119879 37763 -27650 -30163 50523 220678 375184 492800 419481
5000 419481 379153 485535 418744 422940 277523 200963 198595 229961 132626 140980 174090 21318
4988 21318 3284 -109634 9357 60325 229850 206716 38573 -85028 -227048 -47161
4978 -47161 85612 296750 178483 -43428 45567 34297 55063 30339 114635 157315 5295
4967 5295 -43529 39634 6725 -42508 32300 59904 55807 -116653 -149028 213791 325325 127627
4955 127627 87130 21560 -100819 -263569 -305663 -103444 109514 4975 -32727 -256680
4945 -256680 -321118 -179686 -70117 -22017 138175 170104 284438 264418 87522 -84503
4935 -84503 -317399 -200723 2764 -29852 -179431 86575 268095 244701 103495 130136
4925 130136 94841 -102058 -245654 -183292 27920 316225 393454 340668 255391 358656 259200
4914 259200 199806 157800 23770 -130536 -200703 -149759 -96477 52338 139054 101405 -174
4903 -174 173955 125251 -138930 -231647 -93399 80302 253012 504750 298267 99695 169192
4892 169192 194216 51981 13016 13912 -32750 21214 223733 321885 320454 313288 383769 250359
4880 250359 71687 -175084 -94641 -38683 -63684 -24642 65141 109658 45006 24956 -19887
4869 -19887 754 -21154 -240827 -253882 -155844 251498 432089 444187 198493 21560 21424
4858 21424 137230 191238 170269 213868 297810 294643 394880 228888 -26323 -115475 85761
4847 85761 117656 55928 -29756 -186272 -288925 -31187 155996 103782 -182334 -43393 45449
4836 45449 162570 348653 185975 219389 160611 121589 239659 394178 579158 428961
4826 428961 325427 216535 178379 255727 181033 52486 -69820 -19106 -112082 -177985 -20321
4815 -20321 -129724 -108969 -92946 -29280 -27597 92761 220091 202958 185251 40587 83202
4804 83202 116890 176116 345580 286962 319580 107865 -64837 -32392 69623 26886 -260141
4793 -260141 -415277 -396986 -447470 -270583 -209840 -109330 -139045 -102269 143981 67142 -54316
4782 -54316 -16700 -188629 -150281 14286 -153533 -23785 205729 230313 86259 -38860
4772 -38860 117616 73110 77864 26601 343665 326491 153381 -27464 -385109 -371020 -309675
4761 -309675 -340433 -298903 -356894 -106699 111386 113950 89427 -46514 -36748 -84351 -240856
4750 -240856 -391438 -286833 -47733 227303 531181 541292 443755 377572 161635 129036
4740 129036 155623 105355 -61278 -113214 57978 74233 72437 -8295 -11720 222076 507512
4729 507512 393118 291260 279515 360535 75671 -47691 -279324 -391300 -209592 -163117
4719 -163117 52807 226954 109577 1817 -57859 25476 -22898 -16769 -132354 -94689 48545
4708 48545 2229 -7161 -23924 -22583 64656 59686 152913 210933 169510 97386 200157 174742
4696 174742 69186 29184 133560 287268 63591 -273750 -278270 -327186 -344936 -295235 -71631
4685 -71631 90104 183976 -21413 -162835 -173321 9182 255202 492101 369767 203513
4675 203513 56622 -18265 -38262 -15489 15928 -112306 -496870 -514759 -311585 -403210 -570478
4664 -570478 -344571 -17620 14093 -69568 -175448 -119513 -122431 -122195 -25120 -37462 -131529 -121542
4652 -121542 -267979 -405209 -171748 -121508 -159413 -170501 58493 123839 58591 145000 283082
4641 283082 98458 55088 101501 169591 270923 137944 127341 -100116 -237545 -132413
4631 -132413 90084 237902 82122 11508 57465 124546 301601 291392 87996 20704 -42387
4620 -42387 -243 18283 -45167 -78897 -53401 -15654 -216741 -202870 12652 79343 218316
4609 218316 137998 156352 214790 77388 37142 138663 81980 245187 225330 -105224 -154681
4598 -154681 155299 -34802 -142769 -53378 -80112 -350471 -302951 -57561 26035 -27220 59509
4587 59509 53849 -157970 -117448 -146573 -98365 -140480 -249313 -237134 -227230 -121015 -97238 -96973
4575 -96973 -9960 106794 66346 73437 62263 54090 -194731 -85374 167220 91126 71267
4564 71267 56963 46190 -10944 -7870 -139496 109632 236306 339645 477136 493239 372363
4553 372363 290262 -19192 -114267 -78107 147231 149083 14180 167948 260671 303228 369959
4542 369959 167296 -135383 -233648 -156119 31036 46715 60220 184274 61170 -63060
4532 -63060 -112125 -95571 -119324 -204258 -316180 -285914 -194688 -60154 203353 321356 15617
4521 15617 -169531 -179386 70737 13397 -15962 313957 295716 20154 71866 158493 88113
4510 88113 266338 359999 241280 102919 150706 6253 -20878 -1597 -236173 -371317 -355068
4499 -355068 -171215 -57907 12998 -216165 -55102 -31139 -11481 26755 116962 22078 -139850
4488 -139850 -62342 10358 90475 81419 164323 215918 231711 284923 444930 347745 79552
4477 79552 -154691 -10073 38534 80781 72932 44367 6278 22903 264083 310570 387475
4466 387475 501551 630609 443565 63727 -109447 -156036 -144054 -14276 -142795 -188517
4456 -188517 -66357 -310729 -359186 -318784 -239957 -369962 -442010 -292087 -61540 -137769 -102058
4445 -102058 196837 418882 419331 239454 245732 332563 125798 93034 62069 -47036 -5566
4434 -5566 34783 11392 137978 15232 93117 218740 -17089 -148637 -79627 -45661 -112781
4423 -112781 -20553 45046 151845 193039 66633 79327 -50247 -131297 -94549 116648 50259
4412 50259 -123774 -38898 50837 -105669 -61035 -43422 -231430 -124493 118467 212272 49852
4401 49852 301028 354975 202050 52889 47107 38480 -19876 -107749 -67609 -145384 -96338 27025
4389 27025 -296974 -394097 -279827 -3735 -178504 -157500 29834 -126277 -278296 -208202
4379 -208202 -188238 -172567 -155557 77705 138010 91292 -175694 -335774 -482153 -302319 -153094
4368 -153094 50014 75622 81952 159298 317338 318362 357703 197558 171702 267462 312896
4357 312896 369349 199637 75584 109535 -19566 109241 246240 -23340 -60685 -164315
4347 -164315 -271079 -195272 -35041 99023 108146 34626 -31710 81472 5217 -2560 -69322
4336 -69322 33604 95392 187529 243363 263013 301306 107950 201168 148681 115400 143272
4325 143272 234936 385295 367471 278643 76148 -188130 -167388 -4718 31763 -239595 -295801
4314 -295801 -263828 -179519 -321426 -223568 166584 404911 384431 421884 373649 324872 51519
4303 51519 -141833 -28871 40368 102277 298470 379221 271131 81642 175242 15160 -16875
4292 -16875 -18704 -127487 72136 167740 48956 -14679 110444 239539 18211 -110404 -72662
4281 -72662 146241 280169 349884 446062 263889 -48729 27464 64016 163418 237903 189924
4270 189924 -30341 -79876 -254443 -173764 -91184 -278409 -243640 20327 -78489 -103623 -131190
4259 -131190 -308068 -472327 -342921 -285560 1688 120760 -21856 -270248 -139955 -67577
4249 -67577 -297824 -338392 -161606 -193671 -202424 -322756 -114543 59443 15227 -133143 -159363
4238 -159363 -238173 -226619 -97577 -181270 -98185 70408 64462 -77275 -19978 10073 92932
4227 92932 -32857 32051 226168 334502 96240 60359 -104607 -214842 -114741 65444
4217 65444 246291 340746 373072 272551 195296 368960 364143 227519 12115 -130209 -147066
4206 -147066 -109376 182354 295439 239997 96889 89631 175884 215354 197526 243215 225264
4195 225264 216276 175433 166642 62021 -164373 -52099 -147018 -74552 68915 161798 206242
4184 206242 326851 340670 312899 259737 66747 -102338 12777 152441 -37153 -440775
4174 -440775 -515498 -278527 -45989 188584 141354 -89576 -282924 -288842 -88543 93665
4164 93665 212012 19919 -412303 -605457 -289445 -148944 -96605 -75830 -198529 -89050
4154 -89050 219555 395175 121270 -26841 -4207 -234442 -444573 -301163 -242945 -145048
4144 -145048 102290 272564 196444 36162 39272 -9228 88712 -123294 -243667 -313191 -340581
4133 -340581 -215219 -33428 76892 69306 179723 139359 47660 135050 361802 697621 603155
4122 603155 386826 179685 -72011 -258092 -286891 -172441 -8044 -152433 -299708 -233724
4112 -233724 -131240 -188553 -96412 78446 207133 136523 228621 330642 311143 351312 373883
4101 373883 413793 330441 440002 339788 246057 -37641 -415 -10882 31381 26724 -86747
4090 -86747 51896 -60865 -160095 -4874 167712 209589 163536 337128 370768 335339 560040
4079 560040 655684 505356 207316 -155455 -158473 20835 69655 187391 162093 109237 -50655
4068 -50655 -271199 -145234 31343 214650 234161 18585 -89593 -252639 -236792 -160920
4058 -160920 -71575 124430 69691 -82423 -93927 -269540 -203797 -78373 45704 -21990 65382
4047 65382 -132216 -78497 17983 75917 182887 254904 276549 223971 21761 -85804 -40312
4036 -40312 108708 122543 30488 42953 83087 205058 177453 15414 815 24402 170717
4025 170717 343335 289559 260868 374241 402121 450854 482687 200504 65444 80571 80114
4014 80114 257141 320779 127567 -48261 -121413 -152005 -238690 -125991 103860 222791 -30605
4003 -30605 47651 127766 -7835 -182528 -30526 -23044 -147144 -19741 25766 -199323 -180395
3992 -180395 102627 259243 139550 -50195 -162477 -172570 -227107 -199849 -64947 179494
3982 179494 298440 322498 237335 182826 133039 114247 35295 22029 76886 18537 -109430
3971 -109430 -216091 -227070 -144466 -131115 -32605 22759 -108989 59931 245219 281535 342775
3960 342775 488988 408963 312599 245539 299098 253581 254564 360545 224514 90278 -16842
3949 -16842 -45720 -55334 206748 123134 4212 74164 34715 -47940 -75974 -244231 -302136
3938 -302136 -153914 -80247 -292948 -27918 199300 374628 341847 273752 264263 297499 269263
3927 269263 71182 -76921 -184345 -221967 -107610 228265 226071 103105 154738 110785 104646
3916 104646 193327 151965 115558 102271 14888 104605 208566 265170 271517 86919 -11920
3905 -11920 82729 190620 226894 304957 161097 -8394 -261334 -180049 -27038 6034 -71482
3894 -71482 53272 378875 517051 161137 99777 161438 153097 235746 -122109 -179783 -243059
3883 -243059 -76297 194539 99849 -137406 -287369 -111418 36366 67272 208609 282671
3873 282671 130267 -29269 -235040 -234781 27264 253298 90767 1935 -137523 -302709
3863 -302709 -196924 -62452 26770 -127243 -117448 87957 86538 -13794 -5112 20531 53979
3852 53979 71166 -93771 -13034 150199 172367 41508 -152024 -153154 16121 314032 561097
3841 561097 471885 394812 517105 470475 205549 93453 125522 273187 118053 116934 72731
3830 72731 101035 75036 66784 11498 288244 131430 -7685 -111414 -240710 -166282 -207064
3819 -207064 -142883 -126346 -203276 -22691 -9971 40590 55059 -171343 -340372 -392075 -278224
3808 -278224 945 -153118 -220374 -232866 -261761 -393441 -247628 -371369 -83196 338504
3798 338504 389649 217243 142086 114568 115144 -127634 -594763 -486697 -322488 -252498 -193488
3787 -193488 -158833 -88910 33759 146923 57239 117161 16999 -31573 -29492 -157922 -245008
3776 -245008 -344532 -107564 146631 390085 170307 132690 63555 92778 -111577 -105304 26698
3765 26698 -98101 -14544 26833 67772 190199 89519 -104013 -15833 101996 225746 331905
3754 331905 394632 388459 391133 386009 291939 242804 25117 179540 147622 58107 179937 149191
3742 149191 21985 110779 237444 61362 -27431 32245 40724 80749 260376 181179 -87051
3731 -87051 103595 47850 33878 184997 352127 397447 498188 578717 310494 155846 111424
3720 111424 113571 110775 148916 236827 78007 -1186 72070 127515 292669 197924 51162
3709 51162 1485 59305 362038 514374 -13022 -232223 -93745 -173571 -18075 121978
3699 121978 123998 -31523 53341 -29 -136139 -12415 283098 190381 192659 65140 38981
3688 38981 212674 80782 -231151 -229137 18096 102412 245647 312927 302982 121007 -54127
3677 -54127 -141655 132273 257424 301622 493432 440828 499454 437051 516909 782483 725672
3666 725672 368598 193496 201531 214320 -68305 -130889 34227 16335 -48883 -223073 -285146
3655 -285146 -95072 80535 327397 246836 157286 -76599 -20598 87646 43312 80661 139369
3644 139369 252548 417863 589282 349265 108937 120454 19659 50003 28682 -30941
3634 -30941 -172324 -82301 -42879 -209720 -429827 -469999 -514010 -484170 -312261 -47143 -79917
3623 -79917 -31136 101995 57478 -178907 -161016 74937 271836 245830 236932 303280 66850
3612 66850 -35159 -34115 -201769 -109852 102833 227418 -23079 30598 136051 -114189 -218954
3601 -218954 154487 105241 -144150 -259641 -288994 -312970 -369705 -185528 -31785 -66342 -195587
3590 -195587 -250115 -241935 -251723 -28814 -311582 -388091 -283703 42357 -91013 -326604 -213819
3579 -213819 -212213 -214863 5678 425083 255465 -259218 -453199 -350703 -407526 -426203 -181494
3568 -181494 193033 357015 207622 53069 3902 -78808 100113 258519 88430 5012
3558 5012 130512 92027 69017 -59505 -259406 -364566 -175376 18158 147743 220314 156697
3547 156697 309560 324340 252889 222886 140054 101708 117864 -23924 173726 402543 488552
3536 488552 352490 330332 233073 96446 -106276 34978 49858 -42074 190042 66112
3526 66112 -72283 -221294 -3828 393589 515922 507682 394533 333524 303106 458529 267394
3515 267394 -58789 -55416 -25130 -140724 -338683 -169949 -126854 -42328 -113878 -103346 -234485
3504 -234485 -329441 -304895 -134276 -157044 -122151 2325 34329 183032 226248 66688 161233
3493 161233 183260 151227 15892 79083 83908 112334 238077 236929 172629 229093 375145
3482 375145 197533 -74284 -59351 -33558 -7395 94831 184767 286062 306777 195003 307267
3471 307267 246844 259491 370586 448003 161597 199676 128047 90511 -95316 -150176 -220990
3460 -220990 -118317 48457 105925 84532 -78017 -277546 -329807 -98656 89038 67810
3450 67810 -129715 -230673 -172018 -77832 -245909 -233767 -253034 -98018 -59338 -181505 -232455
3439 -232455 62704 147825 64693 73382 225184 59996 -58902 -17244 -15070 -261173 -408008
3428 -408008 -241751 -236971 -226380 -435696 -424568 -273304 -87145 153313 156912 42508 5456
3417 5456 80232 198658 248639 163391 189264 233092 191713 -95305 -373448 -225010 -306631
3406 -306631 -342057 -347603 -72929 35849 -86907 -121691 -138027 -140176 -237624 -368146 -333208
3395 -333208 -78982 -16562 -52615 -193012 -153969 -9418 143752 120188 183020 123335 140056
3384 140056 112411 158367 215507 197697 184792 99122 -41710 -1546 -31618 86962 168361
3373 168361 174821 192956 205878 26070 146306 -89643 -78650 -64597 8539 -50863 -106762
3362 -106762 -327603 -269286 -60953 62710 155908 93669 121298 241149 186669 182654 202881
3351 202881 255590 117508 127775 202655 122930 -188901 -537008 -508709 -317761 -88179 -95177
3340 -95177 -8216 76695 86687 43020 -159556 -299934 -452822 -485760 -566030 -509887 -429148
3329 -429148 -208809 -355152 -625754 -490433 -112565 232772 325714 61702 -15920 -20183
3319 -20183 9282 168750 551882 578105 316503 356100 411390 418759 447058 133112 221373
3308 221373 352737 96135 -94327 -267366 -202279 -20199 121247 118575 88245 220241
3298 220241 390867 391117 172577 151205 87848 313257 365289 187589 105445 392569 566584
3287 566584 217455 60805 154005 134516 110973 -19204 -214284 -196783 -59548 -43609 115193
3276 115193 208674 192108 52988 -108453 -108648 -51428 -102874 -58913 40244 60005 51213 195238
3264 195238 141801 67063 3827 32511 26822 -42310 -263630 -318713 -188949 -126453 -66902
3253 -66902 -23955 157015 288354 156760 146977 -73741 -232073 13881 146648 -156975
3243 -156975 -156860 219610 341546 189319 -107307 -160057 -102140 -76117 81924 132226 94009
3232 94009 68096 7337 -70207 213368 474426 464257 178950 -163766 65799 223545 335424
3221 335424 180104 193679 145999 -89774 113765 248119 301493 215946 -45771 -258547
3211 -258547 -193997 -62690 137464 216682 -40390 -32665 30157 67139 153910 176274 72781
3200 72781 55113 -40057 -30494 -218409 -215493 -200220 -50296 -52244 43541 49389 -127806 -103986
3188 -103986 -259841 -84619 185102 233372 80894 179578 252409 164180 -5416 -59971 165482
3177 165482 464452 531085 372172 257123 393714 286505 264342 218256 163985 43481
3167 43481 29486 -90292 7752 95812 152689 -87869 -129527 -18791 126354 98445 185315
3156 185315 92319 -25947 36680 237078 206865 219079 235656 158655 321236 324058 95926
3145 95926 -15758 53298 211185 -109353 -176661 -100501 -148896 95212 213451 118492 -115496
3134 -115496 -108424 -43069 42276 219729 336843 262582 76222 127802 13112 -62433 -69245
3123 -69245 -44274 -52874 151706 159969 -13729 -12565 163226 143626 320171 355751 231153
3112 231153 185195 148229 56749 100603 -95612 -199291 -93032 160002 224529 50431 80785
3101 80785 271510 67829 -64418 -64587 52875 -109329 5475 140713 189619 48857 -194799
3090 -194799 -154320 -76827 62810 81284 113687 282592 451934 440499 359452 133175 111621
3079 111621 206052 343814 48126 8278 -65180 161240 47689 126033 270106 194524 121248
3068 121248 -173595 -170815 -392529 -376026 -76562 40427 168964 179006 -121591 -71976 -418
3057 -418 110188 92559 19328 201364 159731 169362 -59950 -113477 109286 23463 249792
3046 249792 571257 495742 237945 115353 76407 157490 362511 281083 162054 289153
3036 289153 406112 450522 489959 444318 294932 64661 -63183 -98410 114119 153058 187826
3025 187826 56931 -269601 -424623 -172712 -154936 -409326 -337496 -164694 -280830 -193997
3015 -193997 -23252 282979 193426 97009 129529 -16372 -204205 -195975 -360368 -182510 -39315
3004 -39315 129790 350282 201053 -98415 -179524 -236013 -190525 -155380 35028 33910 -210685
2993 -210685 -57357 -129146 -218083 -183178 -212023 -271497 -320258 -211427 -68999 7199 109185
2982 109185 62981 -64516 -198947 -126305 159765 269097 30104 186613 181513 89077 134462
2971 134462 30337 49075 -73211 -40266 -21984 24951 65099 115264 217604 217320 88308
2960 88308 -27355 74827 302772 333131 101353 25965 29368 97580 -50424 -283999 -279573
2949 -279573 -201056 43830 118167 156224 131581 58787 51894 281618 308466 250866 175594
2938 175594 34065 -227221 -203224 -140476 -27925 8985 328531 337356 124727 -73069 -71246
2927 -71246 -55861 -133535 -135214 28854 -16014 -234311 -175108 -69347 51613 146647 325232
2916 325232 354229 221445 92610 4298 -32391 -76917 -404855 -232218 -95426 -92080 6028
2905 6028 -145735 -325252 -244328 -200342 -175348 -359504 -568031 -579797 -313613 -308813 -279112
2894 -279112 -158515 -148140 -114375 -88687 181193 159486 130830 278333 476094 401990 260828
2883 260828 231177 220486 216423 339606 186961 -24684 -13355 51460 176290 205393 121875
2872 121875 120604 187919 298952 231573 23780 -176857 12405 29667 5718 -37892 -19055
2861 -19055 45281 194385 230803 154640 -36435 -9402 217685 260038 183271 -55216 -117613
2850 -117613 129306 252439 186864 146440 313543 156408 172075 121978 9676 137764
2840 137764 89870 208460 356270 544283 534907 325229 393690 333914 150370 310807 389627
2829 389627 66282 80831 172080 111737 -112404 -67110 145603 354589 286381 94689 -80865
2818 -80865 -41300 160406 329109 271699 49181 -203869 -90552 150712 243436 144958 141714
2807 141714 143342 125882 49039 105760 231842 376294 441134 248676 149273 168114 -12809
2796 -12809 -326529 -263403 -150806 62563 276460 27596 -338459 -373617 23121 239636
2786 239636 217986 64225 -98941 -114400 -128137 -142885 -9848 58921 289825 295446 148899
2775 148899 30055 35013 256053 505870 604018 381023 109379 -59099 30754 -44661 221675
2764 221675 66008 -101028 -4924 -96547 -236422 -409266 -308165 -196216 72542 71107
2754 71107 324630 357859 312350 -38780 -101954 208751 173343 -147454 -209838 -4287 -75243
2743 -75243 -25233 173653 300512 156592 190233 421885 592601 410712 122128 -30894
2733 -30894 152759 -9709 34204 -28392 -52233 -11188 -128413 -177500 -182176 -205342 -65184
2722 -65184 123431 266727 255278 236299 -146326 -173826 -31574 245006 11383 -157944
2712 -157944 -220610 -7205 285517 255153 49546 -253214 -300314 8443 217001 229408
2702 229408 276417 408254 470105 460371 254281 -105814 -182514 -227939 -150412 120949 16343
2691 16343 59115 26280 38035 39663 172272 37093 124144 253362 168701 106005 151852
2680 151852 114360 199874 188774 179141 271371 153766 -12356 13837 98182 -221425 -267585
2669 -267585 -313330 -205929 -216732 -257574 -92814 -142446 -56323 -10041 39091 144188 32865
2658 32865 -76248 3854 -149254 -285203 -174637 -100980 37981 113908 37090 141675 258645
2647 258645 126401 54522 135847 333832 357831 201891 130767 243807 200949 96122 -97645
2636 -97645 -71721 -195063 -359159 -244354 -147477 -235817 -192677 -227534 -200369 -140334 -218928
2625 -218928 -288970 -346936 -169087 -105467 -277444 -154039 -81702 -153793 -395081 -258565 192100
2614 192100 542883 468373 163536 105656 157894 61930 -115727 -63184 40588 164463 227773
2603 227773 205110 134966 131490 122539 179634 348245 483374 361360 -40034 -147052 -199721
2592 -199721 -84808 26490 -73141 71370 175799 147140 53879 -30607 55134 -151527 -219513
2581 -219513 -236243 -213402 36570 74424 -70278 124749 285758 43327 -92537 -20678
2571 -20678 83927 7833 103092 209967 208585 117614 52169 69327 101696 -58309 -33175
2560 -33175 -35121 -66839 -32498 95041 37825 -90412 -222990 -103626 73887 151131 -181215
2549 -181215 -384125 -407367 -85283 -114186 -118651 -57144 -170944 13780 92096 36733 71539
2538 71539 239660 318273 226650 166915 -47131 -132371 -141422 41323 48573 -41815 -10306 124886
2526 124886 208371 386428 316886 188633 311474 239479 189058 260687 157382 -129862 -119696
2515 -119696 57344 326648 322272 167433 124401 117463 275596 439804 280326 327922 161916
2504 161916 -43864 854 95971 272702 121333 -3221 -127167 53323 249218 221992
2494 221992 302117 319346 161574 5212 -52553 -42060 72605 13960 -67956 -59139 -114686
2483 -114686 -342035 -60697 241318 207950 193549 205399 37356 185728 190546 107177 146112
2472 146112 89974 139601 149459 127381 -63898 11754 116785 68990 48742 -24047 66361
2461 66361 272055 452843 530275 568570 523495 226103 114745 10014 -111133 -128395 56565
2450 56565 359134 392019 43080 -252867 -217028 -187826 -213546 -303447 -229487 -132672 -90193
2439 -90193 99653 22903 112379 241124 250211 66356 -143878 -71429 -30057 -82423 -69608
2428 -69608 86297 75531 100425 144748 300188 204149 179286 -31284 -141789 -377670 -431195
2417 -431195 -296088 -163813 -107694 -34035 150772 164207 198441 162641 265578 486029 539560
2406 539560 385599 188757 182575 355337 252651 -8196 -86113 -95677 -313128 -86373 -10983
2395 -10983 -101188 -92038 -177058 -140597 -82951 83860 208572 317825 286168 74102 17871
2384 17871 133722 401843 387657 236304 338699 327842 222291 291023 63871 67291 195298
2373 195298 71714 47087 10068 149007 411712 449046 365139 266926 234411 43778 -225488
2362 -225488 -308517 -136853 -118329 -294506 -287947 -143461 -364895 -630697 -513294 -122218
2352 -122218 191666 409523 325085 334757 556567 347273 127019 -91254 -214888 -113631
2342 -113631 -11149 108250 249322 460004 540731 269239 237080 266956 180235 169988 6273
2331 6273 31555 56087 4805 84464 63738 -21866 -49268 251493 368102 335562 46508
2320 46508 209006 274662 -32533 -234241 -174077 78486 6090 -29255 -94430 -174791 -40318
2309 -40318 -81845 -28357 -81280 -93299 -34552 -38914 3445 -191276 -91237 -74594 -203979
2298 -203979 -291170 -286761 -121208 67087 -44633 76479 39132 -188255 -379998 -556013
2288 -556013 -472089 -153070 96192 72350 -75219 -221899 -275911 -196706 -1370 -18449 16937
2277 16937 10261 -107887 -155413 -69530 -90245 -223374 -441113 -173076 149264 102560 128003
2266 128003 186451 126770 -67941 -83375 241764 328563 69556 -105604 -343660 -421121 -470815
2255 -470815 -199233 179741 178651 224469 437968 110216 33330 68349 370522 427215 322433
2244 322433 151149 82060 -49506 63422 245933 84962 -268874 -203406 45382 100077
2234 100077 160369 305967 228338 147802 4557 -242012 -467336 -444269 -97187 -148630 -317195
2223 -317195 -289681 -117708 143045 34302 -133823 -177570 -74488 -10278 61116 -124082
2213 -124082 -35761 139222 372301 470052 368262 216792 361450 192861 -134919 -171623
2203 -171623 -164882 -119091 -53355 -94277 -276273 -382755 -187911 55052 19972 -22876 -49685
2192 -49685 120354 84170 -92690 -67045 -9835 -52239 -125093 -62023 -29230 2638 21850
2181 21850 9343 94702 71352 -20239 -222190 -24675 167354 143430 -73053 -96424 274030
2170 274030 248384 249960 78462 63261 -25884 35846 153347 122204 52429 -110264 -125984
2159 -125984 38949 157654 115836 105087 -62033 -76659 -68791 -325782 -260042 98671 210529
2148 210529 7499 -130851 -389323 -234337 109178 100449 141034 87440 59441 -157866 -167223
2137 -167223 -139209 -128805 -181620 -347153 -363019 -215660 -197112 -141843 -31391 16893 14158
2126 14158 74001 34976 86098 122447 185961 216355 -33814 -254163 -310476 -26211 93742
2115 93742 91072 141871 -32602 95623 77738 32950 141624 65717 -101367 20933 143222
2104 143222 111095 86399 343059 494903 401884 162709 102787 176294 89752 58826 47381
2093 47381 40490 -73379 -8947 40335 -104419 -64573 -57559 -143146 -6872 -18085 -157753
2082 -157753 -123939 -86587 -25279 -191650 -356955 -420201 -360839 -424042 -197929 46360 123139
2071 123139 -121765 -27857 66016 -210395 -242676 24016 -15248 -225053 -446350 -373827 -203868
2060 -203868 -69869 -5122 -209738 39864 204348 228585 201397 134689 62057 -73828 44931
2049 44931 115231 166921 103234 90067 75052 -121409 -325758 -214419 -34190 139370 26042
2038 26042 31483 76716 -92026 29786 279760 417055 87463 -125480 -84248 -38161 93130
2027 93130 120940 40166 271406 171213 152721 397561 145922 -199120 -339524 -168125
2017 -168125 -106920 -136698 -68507 88693 126324 154148 174822 115259 288481 237178 198639
2006 198639 103728 -91913 -263367 -414876 -241369 -85802 158774 248791 30792 147304
1996 147304 130301 226882 167251 49340 62902 129169 54954 -15962 -185468 -65559 111770
1985 111770 65727 80730 264222 175666 72360 -16470 -114882 -324056 -411560 -299666 -284697
1974 -284697 -7129 92015 9212 -67088 71801 -34598 -140170 -225369 44285 118835 127962
1963 127962 249096 382864 444065 370217 264870 236155 242896 347181 196151 19510 -70703
1952 -70703 -164794 -60913 -143669 -359668 -328708 3538 295832 382088 354593 439642 604621
1941 604621 456119 70357 -132881 54212 94565 -8950 -93275 -38591 235319 508789
1931 508789 504621 374944 371501 518288 411514 201482 -90897 -271522 -378919 -224745
1921 -224745 -153351 -456257 -300278 -7488 233204 183734 9289 -204146 -406350 -518734
1911 -518734 -530374 -543288 -524709 -337361 -122350 159735 200828 31302 -76692 24466
1901 24466 -282902 -405305 -178640 26246 -54094 -153467 38249 197731 245057 309399 184821
1890 184821 167743 160214 90073 -160593 -338777 -245873 -282046 -303750 -305303 -179733 33751
1879 33751 -18917 -55109 269090 455724 320242 161130 105623 49397 85249 -13695 29580
1868 29580 -82051 5556 -57541 -58695 10828 -125801 -321526 -166747 -151485 -256307 -91067
1857 -91067 -108694 -17857 -57775 -37692 142010 54290 -224017 -101858 -145790 24863 17346
1846 17346 -5968 15879 77813 24070 -165012 -95240 -368553 -522414 -461100 -329256 -186569
1835 -186569 60273 -176496 -473393 -435289 -196734 -74322 -11770 -304986 -627549 -478503
1825 -478503 -248416 -337160 -228151 39226 55243 41907 -32335 -63687 65949 138212 164830
1814 164830 246375 141584 -119797 -228682 -327408 -210557 -118849 -7273 -3802 -112746 -213983
1803 -213983 -148087 -97885 108808 70897 -166897 -426608 -559507 -475888 -261297 73460
1793 73460 200356 -38373 -267805 -371120 -434882 -319091 -286825 -498289 -642823 -681095
1783 -681095 -415047 -263624 -236055 -88712 -118802 -271588 -140721 -36485 -97623 37634
1773 37634 196654 127408 -135281 -166658 -22329 279601 151384 -15507 -123275 -246957
1763 -246957 -109100 -68647 -173775 -176138 -159977 -46090 -136599 -489655 -541959 -378125 -94863
1752 -94863 -51367 -174456 -93044 67058 310447 394318 209807 132567 193812 263641 209123
1741 209123 93487 -170856 -471086 -532878 -540214 -745305 -836697 -509237 -91666 112832
1731 112832 365547 306371 -92313 -284154 -296614 -130232 -50042 116499 88555 103276 190863
1720 190863 318322 97164 29492 -14528 -167837 -200233 32489 279443 358858 190648
1710 190648 92011 52976 -89491 75367 170927 -64667 -139163 7763 33325 29635 -178503
1699 -178503 -240343 -311104 -373091 -494415 -574227 -433275 -356496 -345589 -215957 -161935 -52481
1688 -52481 -194496 -361847 -464906 -269504 -203363 -248843 -13639 -136217 -274070 -344244
1678 -344244 -147234 141994 184182 37752 -83718 -109952 -125776 -3731 -60603 -82686 -29451
1667 -29451 -111086 34227 -223 139401 152801 -74441 -190093 -19357 -202483 -435931
1657 -435931 -234244 -53089 -42261 89177 227045 185749 113772 -11194 -201205 -201143 -223592
1646 -223592 -88184 1517 82044 -11953 -129192 -267174 -332646 -188274 -190477 -103708 -52970
1635 -52970 -99707 -171388 5966 -1626 -246442 -356589 -254337 -153345 -293828 -269077 -344562
1624 -344562 -352424 -275712 -254533 -42998 29935 108865 77768 -144280 -195614 -138249 79746
1613 79746 243870 203150 7765 -222349 100064 368290 328273 168115 -80977 -296416
1603 -296416 -275352 -233809 -125104 -45774 69370 58416 -164155 -402581 -416354 -210013 101747
1592 101747 43978 -68170 -42424 -16321 56233 -52634 25811 28403 -62795 -155263 -29194
1581 -29194 136939 223841 329653 53670 -137143 -177989 26291 256311 320980 231199 178360
1570 178360 44337 -481470 -571996 -465387 -304537 -170789 -51429 9287 120940 211730
1560 211730 208592 356649 410081 333581 240742 140365 139821 120566 2924 -46363 -26331 67235
1548 67235 6331 -172643 -64913 174082 206320 -26540 -72015 -88487 -250711 -257311 -183661
1537 -183661 -269656 -104524 108485 323892 330581 62110 -3626 -88610 -83851 33533 -120817
1526 -120817 -230081 -213776 -132973 -79636 92724 64124 -74118 -279391 -193350 -387945 -206057
1515 -206057 48309 98318 311547 384051 157261 -50983 74882 72420 25013 3069 17972
1504 17972 -62046 -110188 2211 68725 -121869 -79493 -143085 -245259 -15791 194564 171798
1493 171798 185002 183145 3007 -105175 -156218 -65379 -66960 49428 350 -203570 -55974
1482 -55974 204863 223324 262040 478483 498191 315340 375394 459524 379824 398699 111638
1471 111638 -191381 -417107 -254579 -19826 32562 34021 196207 140985 -549 190835
1461 190835 297116 229683 322633 104441 -42603 -35593 -58165 -37735 -112066 -189855 -72132
1450 -72132 -30665 -86937 -172309 -74759 -34237 -195828 -264357 -219133 -220507 -384982 -241771
1439 -241771 -13425 -23472 -128246 -201080 -224388 -368211 -387783 -378102 -340974 -170533 -56693
1428 -56693 -78562 -9085 38829 -66071 115867 76304 15501 -296 316313 223552 -41573
1417 -41573 -153178 -79396 129309 192069 188564 170896 138112 154287 267600 238842 238805 123057
1405 123057 64424 24699 -204830 -491499 -372031 -441794 -345243 -152385 40827 155367
1395 155367 237287 308091 189970 141101 175882 255172 161387 123353 62316 15604 -52194
1384 -52194 -256727 -352148 -259376 -99063 21901 134109 -96971 -250304 -428175 -427302 -309955
$$ [...]
##END NTUPLES=NMR SPECTRUM
##END=
