##TITLE=Analysis number 312057
Compound Code cc 33104
Book Reference 414/110
Project Code adrs
Chemist Name mattw
##JCAMPDX= 6.0         $$ Bruker NMR JCAMP-DX V2.0
##DATA TYPE= NMR SPECTRUM
##DATA CLASS= NTUPLES
##ORIGIN= Bruker BioSpin GmbH
##OWNER= NMR
$$ XWIN-NMR		Version 3.5
$$ Fri Jul 22 12:16:01 2005 GMT Daylight Time (UT+1h)  MAYBRIDGE\NMR@NMR_250MHZ
##.OBSERVE FREQUENCY= 250.131544655141
##.OBSERVE NUCLEUS= ^1H
##.ACQUISITION MODE= SIMULTANEOUS (DQD)
##.ACQUISITION SCHEME= undefined
##.AVERAGES= 16
##.DIGITISER RES= 18
##SPECTROMETER/DATA SYSTEM= dpx250
##.PULSE SEQUENCE= zg30
##.SOLVENT NAME= CDCl3
##.SHIFT REFERENCE= (INTERNAL, CDCl3, 0, 16.522)
##AUDIT TRAIL= $$ (NUMBER, WHEN, WHO, WHERE, WHAT)
$$ ##TITLE= Audit trail, XWIN-NMR		Version 3.5
$$ ##JCAMPDX= 5.01
$$ ##ORIGIN= Bruker BioSpin GmbH
$$ ##OWNER= NMR
$$ C:\u/data/dgb/nmr/ADRS/6420/pdata/1/auditp.txt
$$ ##AUDIT TRAIL=  $$ (NUMBER, WHEN, WHO, WHERE, WHAT)
(   1,<2005-07-22 12:15:34.88 +100>,<MAYBRIDGE\NMR>,<NMR_250MHZ>,
      <created by zg, POWCHK disabled, PULCHK disabled
       configuration hash MD5:
       62 19 C7 07 E1 42 D1 B7 37 6C 3D D0 77 39 F9 E6
       data hash MD5: 64K
       01 30 94 9D 7F 40 83 D6 03 FC CB D5 58 D6 02 18>)
(   2,<2005-07-22 12:15:50.63 +100>,<MAYBRIDGE\NMR>,<NMR_250MHZ>,
      <Start of raw data processing
       ef LB = 0.3 FT_mod = 6 PKNL = 1 SI = 32K 
       data hash MD5: 32K
       2B 66 78 EC 5C 93 44 76 CE 10 38 B5 22 6E BD 9B>)
(   3,<2005-07-22 12:15:52.52 +100>,<MAYBRIDGE\NMR>,<NMR_250MHZ>,
      <apk 
       data hash MD5: 32K
       7E 0F BE EF AC B4 6B D6 06 93 01 35 B5 F8 B5 3E>)
(   4,<2005-07-22 12:15:53.25 +100>,<MAYBRIDGE\NMR>,<NMR_250MHZ>,
      <abs ABSG = 5 
       data hash MD5: 32K
       CE 17 C0 55 6F 3A 83 C4 71 45 B2 D7 B1 A5 37 08>)
$$ ##END=
$$ 
$$ hash MD5
$$ 1F 3A DB B5 99 99 B5 BB FF FC A7 E4 3D 27 43 75
##$RELAX= 
##$RELAX= 
##$RELAX= 
##$RELAX= 
##$RELAX= 
##$RELAX= 
##$RELAX= 
$$ Bruker specific parameters
$$ --------------------------
##$DU= <C:\u>
##$EXPNO= 6420
##$NAME= <ADRS>
##$PROCNO= 1
##$TYPE= <nmr>
##$USER= <dgb>
##$AMP= (0..31)
100 100 100 100 100 100 100 100 100 100 100 100 100 100 100 100 100 100 
100 100 100 100 100 100 100 100 100 100 100 100 100 100 
##$AQSEQ= 0
##$AQ_mod= 3
##$AUNM= <au_zg>
##$AUTOPOS= <22 >
##$BF1= 250.13
##$BF2= 250.13
##$BF3= 250.13
##$BF4= 250.13
##$BF5= 500.13
##$BF6= 500.13
##$BF7= 500.13
##$BF8= 500.13
##$BYTORDA= 1
##$CFDGTYP= 0
##$CFRGTYP= 5
##$CHEMSTR= <none>
##$CNST= (0..31)
1 1 145 1 1 1 1 1 1 1 1 1 1 1 1 1 1 1 1 1 1 1 1 1 1 1 1 1 1 1 1 1 
##$CPDPRG= <>
##$CPDPRG1= <>
##$CPDPRG2= <>
##$CPDPRG3= <>
##$CPDPRG4= <mlev>
##$CPDPRG5= <mlev>
##$CPDPRG6= <mlev>
##$CPDPRG7= <mlev>
##$CPDPRG8= <mlev>
##$CPDPRGB= <>
##$CPDPRGT= <>
##$D= (0..31)
0 1 0 0 0 0 0 0 0 0.06 0 0 0 0 0 0 0.0002 0 0 0 0 0 0 0 0 0 0 0 0 0 0 
0 
##$DATE= 1122030933
##$DBL= (0..7)
120 120 120 120 120 120 120 120 
##$DBP= (0..7)
150 150 150 150 150 150 150 150 
##$DBP07= 0
##$DBPNAM0= <>
##$DBPNAM1= <>
$$ [...]
##$SUBNAM7= <"">
##$SUBNAM8= <"">
##$SUBNAM9= <"">
##$SW= 20.6930455092707
##$SWIBOX= (0..15)
0 0 3 0 0 0 0 0 0 0 0 0 0 0 0 0 
##$SW_h= 5175.983436853
##$TD= 65536
##$TD0= 1
##$TE= 295.16
##$TE2= 300
##$TE3= 300
##$TEG= 300
##$TL= (0..7)
0 120 120 120 120 120 120 120 
##$TP= (0..7)
150 150 150 150 150 150 150 150 
##$TP07= 0
##$TPNAME0= <>
##$TPNAME1= <>
##$TPNAME2= <>
##$TPNAME3= <>
##$TPNAME4= <>
##$TPNAME5= <>
##$TPNAME6= <>
##$TPNAME7= <>
##$TPOAL= (0..7)
0.5 0.5 0.5 0.5 0.5 0.5 0.5 0.5 
##$TPOFFS= (0..7)
0 0 0 0 0 0 0 0 
##$TUNHIN= 0
##$TUNHOUT= 0
##$TUNXOUT= 0
##$USERA1= <user>
##$USERA2= <user>
##$USERA3= <user>
##$USERA4= <user>
##$USERA5= <user>
##$V9= 5
##$VALIST= <valist>
##$VCLIST= <CCCCCCCCCCCCCCC>
##$VD= 0
##$VDLIST= <DDDDDDDDDDDDDDD>
##$VPLIST= <PPPPPPPPPPPPPPP>
##$VTLIST= <TTTTTTTTTTTTTTT>
##$WBST= 1024
##$WBSW= 4
##$XGAIN= (0..3)
0 0 0 0 
##$XL= 0
##$YL= 0
##$YMAX_a= 544784
##$YMIN_a= -410444
##$ZGOPTNS= <>
##$ZL1= 120
##$ZL2= 120
##$ZL3= 120
##$ZL4= 120
##$ABSF1= 16.522
##$ABSF2= -4.171173
##$ABSG= 5
##$ABSL= 3
##$ALPHA= 0
##$AQORDER= 0
##$ASSFAC= 0
##$ASSFACI= 0
##$ASSFACX= 0
##$ASSWID= 0
##$AUNMP= <proc_1d>
##$AZFE= 0.1
##$AZFW= 0.1
##$BCFW= 0
##$BC_mod= 0
##$BYTORDP= 0
##$COROFFS= 0
##$CY= 12.5
##$DATMOD= 1
##$DC= 0
##$DFILT= <>
##$DTYPP= 0
##$F1P= 14.0000005364418
##$F2P= -0.99999901652339
##$FCOR= 0.5
##$FTSIZE= 32768
##$FT_mod= 6
##$GAMMA= 0
##$GB= 0
##$INTBC= 1
##$INTSCL= 1
##$ISEN= 128
##$LB= 0.3
##$LEV0= 0
##$LPBIN= 0
##$MAXI= 10000
##$MC2= 0
##$MEAN= 0
##$ME_mod= 0
##$MI= 0
##$NCOEF= 0
##$NC_proc= -4
##$NLEV= 6
##$NOISF1= 0
##$NOISF2= 0
##$NSP= 0
##$NTH_PI= 0
##$NZP= 0
##$OFFSET= 16.522
##$PC= 1
##$PHC0= -79.76946
##$PHC1= 8.69064
##$PH_mod= 1
##$PKNL= yes
##$PPARMOD= 0
##$PSCAL= 4
##$PSIGN= 0
##$REVERSE= no
##$SF= 250.13
##$SI= 32768
##$SIGF1= 0
##$SIGF2= 0
##$SINO= 400
##$SIOLD= 32768
##$SREGLST= <1H.CDCl3>
##$SSB= 0
##$STSI= 32768
##$STSR= 0
##$SW_p= 5175.98343685301
##$SYMM= 0
##$S_DEV= 0
##$TDeff= 65536
##$TDoff= 0
##$TI= <Analysis number 999999
Compound Code 99
Book Reference 9
Project Code 9>
##$TILT= no
##$TM1= 0
##$TM2= 0
##$TOPLEV= 0
##$USERP1= <user>
##$USERP2= <user>
##$USERP3= <user>
##$USERP4= <user>
##$USERP5= <user>
##$WDW= 1
##$XDIM= 32768
##$YMAX_p= 525169241
##$YMIN_p= -945400
$$ End of Bruker specific parameters
$$ ---------------------------------
##NTUPLES= NMR SPECTRUM
##VAR_NAME=  FREQUENCY,     SPECTRUM/REAL,   SPECTRUM/IMAG
##SYMBOL=    X,             R,               I
##VAR_TYPE=  INDEPENDENT,   DEPENDENT,       DEPENDENT
##VAR_FORM=  AFFN,          ASDF,            ASDF
##VAR_DIM=   32768,         32768,           32768
##UNITS=     HZ,            ARBITRARY UNITS, ARBITRARY UNITS
##FACTOR=    0.157963299565203, 1,           1
##FIRST=     4132.6476996994, 0,             0
##LAST=      -1043.33573715361, 0,           0
##MIN=       -1043.33573715361, -945400,     0
##MAX=       4132.6476996994, 525169241,     0
$$ Real data points
##PAGE= N=1
##DATA TABLE= (X++(R..R)), XYDATA
$$ [...]
28143G6330j10216o0110j1190J615J03905j9455o7300M3895L9020L2512R349l3372
28131D983Q904M8092K1478l3812n525K866j7505K2107L8688m0967n6602k9243
28119c6536O400J8699Q7199k4664k5193j1368k9219l0799m386M3682J337L6368
28107C1520M183k3953O48K0782k8363J3724j0697J99K9633N0208p9416k9844K8345
28094F969m867o5631m4275M8231L5475L6871J4477j3118k0298k3141M151k4130
28082d9286J0617N608J811M0469J0371P21m47L188n466j607l1551m439m41K1765
28068A313k2092K2211N0911k5245m0776k4270R543L5390J692q2607r203L3163
28056d9970K7393M8015j4419K2275m822o7721O873l7797J0101L6610K7998K7298
$$ y = [76330, -33886, -93996, -105186, -103571, 334, -19121, -86421, -42526, -3506, 29006, 38355, 4983, 13887, 61979, 83457, 49645, 44120, 46986, 29481, 51588, 90276, 49309, -7293, -36536, -30136, -11437, 75762, 51098, 25905, 14537, -14682, -45481, -49867, -6185, -4848, 31520, 35703, 11750, 12398, 33180, 4817, 18541, 7844, 8043, 37676, 87884, 8468, -21376, 6969, 2102, -63529, -107804, -59573, -24098, 12773, 27250, 14132, -6166, -29307, -25156, -49286, -38669, -33061, -31250, 9219, 19590, 20311, 19864, 23052, 17586, 15979, -15572, -20011, -20452, 1313, -20779, 1432, 52343, 27098, -13678, -37948, -28405, 6985, 8677, -73930, -83133, -49970, -22577, 25438, 11019, 33294, 28472, -39249, -32376, -70173, -60072, -23462, 4536, 31834]
28044C1834J2612Q062q325k943r177J2655m3567p6982K9500M4366N0130k8250
28032A9915L1954M3103j4385j2334J9044k3749m4323K2493K1333M97j6318q7068
28020c9838j0064l972J577l231q269R0501M9826j3757o1216n7193k6937j0638
28008i3211M0813m9444j9487M0130M3529j2144k091K7623O0850M9233k9908k3015
27996C2878j9919j2580J9821J8653n2564k8514l9850K2315J01584L5228m7016
27985C0036j0760O2212m011o5208k0046J5007m2144k1879k9646p878L6044M1812
27973a6461K5219M0806L5404n6883j2219m514m8185k5704M7958O454l8201n128
27961e1454l690J2116n832l1296J7833M6673R825k973j5276J0389O1055J2990
$$ y = [31834, 44446, 52508, 44183, 41240, 32063, 44718, 1151, -75831, -46331, -1965, 48165, 19915, 51869, 94972, 80587, 68253, 87297, 63548, 19225, 41718, 63051, 63548, 47230, -39838, -49902, -53874, -52297, -55528, -63797, 26704, 76530, 62773, 1557, -55636, -82573, -93211, -52398, -101842, -121329, -81199, -37670, -49814, -51905, -24282, 36568, 85801, 55893, 32878, 12959, 379, 20200, 38853, -13711, -42225, -82075, -59760, 41824, 77052, 30036, 19276, 81488, 77477, 12269, -7777, 7230, -34914, -56793, -86439, -94317, -58273, -16461, 8758, 49564, 84968, 28085, 15866, 11352, -36833, -62537, -14579, -8125, -46326, -51454, -55144, -43028, -48860, -80156, -62323, -15650, -5825, -8798, -24074, -13685, 47370, 60360]
27949F0360k9762k9018l4890l3991P980L0230O1256M297m1169o0491j7426K5758
27937e6866L3509N19m9663Q1155r442m1575l4314L5749K1971M88N430o708l5143
27924e4890J1711j375K152J8326N1469N115K156j2101J6056m8195k9457K483o3079
27911i9629L3552N4029N0821k8435k8512J1943M4623l6327j2124o856N6881l0525
27899I441j8327J7940p287l1437l3823K4206M6925M1996k6771J9081k6357k694
27887A2893L6064N8289L4924p6551p1994j4748l8646j599k6362q963L3701J3592
27875d9400l6349q263M6081M4771j0208n984M6841j9622n9759M6734L2559k6014
27863A387L7885N6999k0709m8461k7175m6748m4832N4041P0418J090p1307l7497
$$ y = [60360, 30598, 1580, -33310, -67301, -59321, -29091, 32165, 36462, -4707, -65198, -82624, -56866, -23357, -22838, -72501, 8654, -788, -42363, -76677, -40928, -18957, -18469, -13039, -19747, -54890, -43179, -44554, -42402, -24076, 27393, 32508, 34664, 22563, 38619, -9576, -39033, -36550, -99629, -66077, -12048, 38773, 10338, -18174, -6231, 38392, 2065, -10059, -16915, 39966, 9441, -8886, 9054, 1767, -29670, -63493, -39287, 7638, 49634, 22863, 41944, 15587, 12893, 48957, 107246, 142170, 65619, -6375, -21123, -59769, -61368, -87730, -96693, -62992, -49400, -85749, -94012, -47931, -3160, -13368, -19352, 27489, 7867, -51892, -5158, 27401, 1387, 39272, 96271, 75562, 27101, -74, -46822, -91654, -37613, 32805, 33895, -37412, -74909]
27851g4909J8655j5055J7414M7827N7158j3498j6606m0610L296M9079m436k4718
27839C597R5k3160n9355k1835Q7671J0362N82k134j7080j9116j1261N441Q6942
27826D0749J0527n0185J1882J6113Q5M6611J8285K7821m4266m7053n1382m802
27814b5615K0964J9938m0887j0489J1101K5478j4553j820J6679j9674K4898L17
27802F337L4012k9662k9331l1598j4443k3950J9250k114O108Q6757j3875m1476
27790c3985j5389j8740J3977L9822r068m1194p8139L9682M8162M4802K7359K0241
27778C7530l8275J1680n5746m3696L638L720m940L7807O9026n071k0569P851j5213
27765a2258O1325P747m5098p934j5866M947K5433k3440N6000k1013n2284k8120
$$ y = [-74909, -56254, -71309, -53895, -6068, 51090, 37592, 20986, -19624, -16328, 32751, 28315, 3597, 3692, -19468, -78823, -100658, -12987, -2625, -2043, -4177, -21257, -40373, -51634, -46193, 40749, 51276, 1091, 12973, 29086, 29171, 75782, 94067, 121888, 77622, 30569, -20813, -25615, -4651, 15287, -25600, -36089, -24988, 490, -14063, -15883, 796, -18878, 6020, 6337, 40349, 10687, -18644, -50242, -64685, -88635, -69385, -71499, -65391, 21366, 7491, -33985, -49374, -68114, -54137, -14315, -23383, -64577, -142716, -103034, -54872, -10070, 17289, 37530, -745, 10935, -44811, -88507, -84869, -81149, -86089, -48282, 20744, 15673, -4896, 2955, -12258, 49067, 56814, 11716, 3782, -12084, -7137, 18296, -5144, 50856, 29843, -22441, -50561]
27753e0561r804N3695J416K6075j4887q7899q663M0226L4164O5835j6344j22462
27741h9209j7608J9064P0008J1811J0266L5753P1098l8484k4973l6238l0894O4555
27729D5149N3769l422j0377n1407j4061j3571k4140l726l4864J6356M6864l6352
27717b9782K8330K5326n1435k7352J7798M0237M25m211k4749K229N2484K1507
27705E0807m8281l3184N5127J1780L9048L5318j8641q980m0009q5965k4600k2135
27693h9715l9494L8650P7343J403K6990j4095k5722R0682N6326N9930k8580q7738
27681F5980r1613m8102J179O7412M4836k7403J4374M9411j3010J6121L031p3278
27669H938j0651n290l022K127M6187K5795j7918k2168K371M577M931l8486j1682
$$ y = [-50561, -60365, -6670, -5254, 20821, 5934, -81965, -90628, -50402, -16238, 49597, 33253, -89209, -106817, -87753, -17745, -5934, 4332, 40085, 111183, 72699, 47726, 11488, -19406, 45149, 98918, 95496, 85119, 33712, 19651, 6080, -18060, -21786, -56650, -40294, 6570, -29782, -1452, 23874, -27561, -54913, -37115, 3122, 3547, -664, -25413, -23184, 29300, 50807, 2526, -30658, 24469, 36249, 75297, 110615, 91974, 82994, 42985, -42980, -67580, -89715, -129209, -90559, -13216, -11813, 15177, 1082, -24640, 66042, 122368, 182298, 153718, 65980, -25633, -73735, -72556, -5144, 39692, 12289, 26663, 76074, 63064, 79185, 82216, 8938, -1713, -7003, -10025, -7898, 38289, 64084, 46166, 23998, 26369, 30946, 35877, -2609, -14291]
27656a4291j8997k9783l754L197O20l1438l343j1216K8329L0389J3943L2296j5582
27643a9630J729j4551K577P7514p6625J3425k6298k1898O0541J2016n0875m8102
27631i0177K0040O998K2609J3254J6700k5577l4198q3589L0923Q4895L0458K9724
27619B2060k7222k5804p060R679q031k5301M3464K2723k5078n0029K3096M7598
27607I5N2723K9366q964j4360m100l676q3335j253L8069J951n416K5995M7298
27594G4393K272m2116K128K8990M1445K0997p041l3423r9745n6924O9956L0332
27582C1264m1843j6208j8912N1729J0640j8318j2517Q627m3451M7020j6062m1737
27570e9768K2789R238K8474J3161J5717k179L5752J3415o515l3120k0298J5355
$$ y = [-14291, -33288, -63071, -66825, -63628, -63008, -94446, -97789, -109005, -80676, -50287, -36344, -4048, -19630, -17901, -32452, -29875, 47639, -28986, -15561, -41859, -63757, -3216, 8800, -42075, -90177, -70137, -63139, -40530, -27276, -10576, -36153, -70351, -153940, -123017, -38122, -7664, 22060, -5162, -30966, -38026, -28347, -36378, -61679, -18215, 4508, -20570, -70599, -47503, 95, 52818, 82184, 73220, 58860, 54760, 51084, -32251, -33504, 4565, 6516, 1100, 27095, 74393, 76665, 34549, 36677, 65667, 107112, 128109, 121068, 87645, -12100, -69024, 932, 31264, -10579, -26787, -45699, 6030, 16670, -1648, -14165, -5538, -48989, -1969, -18031, -59768, -36979, -27741, 733, 13894, 29611, 27432, 63184, 76599, 70084, 36964, 16666, 32021]
27558C2021J7264K0424J0881J8691j4328l9032j7268L3250K327j680k5162j1408
27546B5980o452K1269o39j1262k4884J1443M4201l4976J2398L3527l1820m0453
27534a668M114l159J0700L9225m03p3442L464M3203J2618J2492n6938m5905j4115
27521f9814M3424L9665m0784n8475O2051n685M8207Q5206l1578l2319L2507M5757
27509A18162l9436J039L6389K2720m7820J2940K3721o8038K4787j722m443L2434
27497A10733K5609q3343o1741L7028k9759L267J0070j952J00878k064j27507k0160
27485c8941P521L1481N3183k2152o5587l1257j8356N9041M2966O1895J3887j03538
27473i857N356o761n3628j571J4001L2441P856K24N104K2755j7134J058k1367
$$ y = [32021, 49285, 69709, 80590, 99281, 84953, 45921, 28653, 61903, 64230, 62550, 37388, 25980, 19528, 40797, 40158, 28896, 4012, 15455, 59656, 24680, 37078, 70605, 38785, -1668, 2446, -713, 9987, 49212, 48809, -24633, -21169, 22034, 34652, 47144, -9794, -55699, -69814, -26390, 13275, -27509, -85984, -23933, -29618, 18589, 103795, 72217, 39898, 72405, 118162, 78726, 79765, 116154, 138874, 91054, 103994, 127715, 59677, 84464, 82742, 78299, 110733, 136342, 52999, -8742, 28286, -1473, 1794, 11864, 9912, 110790, 108726, -18781, -38941, -31420, 61, 53244, 31092, -34495, -65752, -84108, -25067, 17899, 79794, 93681, -9857, -4501, -11262, -64890, -66461, -52460, -20019, -12163, -11939, -6835, 15920, -1214, -156, -21523]
27460b1523K6123R923K1758R181J7962J2762k8231o474k7374j7207L882J6965
27448A7747N304J5133M2208p9232K369l670q4913o0340J1167O2352M4201J7529
27436a0145L3006Q817k3046j4090l7742k7067P215r872L9247N1614J6281k4287
27424I931l915k5518k2577j5869J5630O9175L7111l6447m4378m0687l5306O0377
27412c2473O3936j9051p4462q747J9061q561l5027L8860J0128P57K8709L7800
27400B0930j3787M3710K3573q826j9116k4917o785m5064l4476J0926J1632J2277
27388b9923O517P393L361p252J6029P282K9742q392m5656n7037j019K2119k1927
27375g8763J8280L1288N3704L0886j6927m9842r699R826o111Q621q278J5938K4384
$$ y = [-21523, 4600, 14523, 36281, 45462, 63424, 76186, 47955, 41481, 14107, -3100, 782, 17747, 23051, 38184, 80392, 1160, 3529, -141, -85054, -145394, -134227, -71875, -27674, -10145, 22861, 31678, 8632, -5458, -43200, -70267, -63052, -72924, -33677, 17937, 34218, 9931, 6016, -19502, -42079, -57948, -42318, 26857, 63968, 27521, -16857, -57544, -92850, -32473, 31463, 12412, -62050, -70797, -51736, -60297, -95324, -56464, -46336, -45579, -16870, 20930, 7143, 50853, 74426, 65600, 46484, 21567, 14782, -30282, -64758, -53832, -42200, -29923, -23406, -16013, -12652, -19904, -3875, 3407, 33149, 24757, -20899, -77936, -78955, -56836, -78763, -60483, -29195, 24509, 55395, 38468, -11374, -21073, -11247, -17358, -8737, -17015, -1077, 23307]
27362B3307J4291K1988k5621l5958K3584K1341K118m4722J0829M1184J2087o5041
27350f13p1141M5785Q314m0179j5991o07L3438K0015K1020K0440l5871q37k5347
27337d1574j2914k6425L9557L1274K3005j8119k0641M284J3661j192k364m7119
27325e8567j7142J0013k7035O8566J4028L4353L3981K0435l5780r2885n7477N5299
27313e2211R663m4857l3151K9330L2578J7679N386m1085j8838J5160N2725N1882
27301B4261n2490k2673K9147m220k6729J8806J9680J6018M4695m072J7409j6425
27289D3407r585j1111j0081m2246j7079O4274O5220J8270k7102l8432p1390j9548
27277e5403J2125L7228O6856o0545k2276J7627L7232k9100k4222L3805l2703m0319
$$ y = [23307, 37598, 59586, 33965, -1993, 21591, 42932, 45050, 328, 11157, 52341, 64428, -613, -71754, -25969, -17655, -57834, -73825, -74432, -40994, -20979, 41, 20481, -15390, -16227, -41574, -54488, -80913, -41356, -10082, 12923, -5196, -25837, -21553, -7892, -9084, -11448, -58567, -75709, -65696, -92731, -24165, -10137, 24216, 58197, 78632, 42852, -50033, -107510, -52211, -42548, -87405, -120556, -91226, -58648, -40969, -35583, -76668, -95506, -80346, -27621, 24261, -28229, -50902, -21755, -25975, -52704, -33898, -14218, 1800, 46495, 42423, 59832, 43407, 33822, 22711, 12630, -29616, -46695, 17579, 82799, 101069, 73967, 35535, -35855, -55403, -43278, -6050, 60806, 261, -22015, -4388, 32844, 3744, -20478, 13327, -19376, -59695]
27265e9695N7003M3760J936l7708m4572k6748K4353j0595q591O4877N1130K8908
27253H4058p617m687m1849r330m9657l3638l928n370M3140K5807j2793k60J6329
27240B05k2769l3752k9860J1602N9117J3296l8570p493r849o009p845P2276M1098
27227D1447q007O7519J8215m67p0627q2215o680r401P7380J5897j3036l510j3277
27214A3238k7791j7165L6867K303p09j0048L1317j7861n7298j6822l770K9608
27202c8131O353j096K9332l0919L3531K8790m6452n9470j6360L3497o677K0441
27190d7161N4371L3419p3464p2266L6672N5046j5371l481L5803j9128R366O2978
27178E6784k651J2276K6912q716k760o959J6990J2459J354n6339r2244J6906M9450
$$ y = [-59695, -2692, 41068, 43004, 5296, -39276, -66024, -41671, -52266, -60857, 4020, 55150, 84058, 76441, 71754, 29905, 20575, -29082, -62720, -66648, -72018, -28878, -3071, -15864, -16124, 205, -22564, -56316, -86176, -74574, -15457, -2161, -40731, -48224, -58073, -64082, -71927, 349, 41447, 33440, 100959, 119174, 118707, 48080, -34135, -40815, -50216, 27164, 43061, 30025, 26515, 13238, -14553, -31718, 5149, 7452, 6743, -3305, 28012, 10151, -47147, -63969, -67739, -38131, -31778, -32874, -3542, -34461, -930, 27860, -18592, -78062, -94422, -60925, -67602, -47161, 7210, 40629, -32835, -105101, -68429, -13383, -28754, -32235, 3568, -15560, -6194, 56784, 54133, 66409, 93321, 84605, 81845, 74886, 91876, 104335, 105689, 49350, -42894, -25988, 23462]
27165B3462k550p0656L141K1734j3192J6511P9953k9929m2422k987k5524l402
27153d5861N5359j9134K5617J7453M776R3287N2232j4728j20282o4542l4548K2312
27141b8059L1944J2445j5037l6096m1437j388K4816L6207M7649L4547j5342k8343
27129B1906K192j6432n3774M4223l5933l7912K8988p146L0273L2244N4751k9500
27117C3880k5361J0023N354L4038J175k7563J0861r53K4341l3902p3670m6351
27105h8128P8964J4268l6397K8897R149K0741J1767j2161J1942M5711m5144p3421
27093c3812m9692j789k7343O5052M9753k5820p031O985K2021J6646J2615m8707
27081b1122L0489J0307p348J4529l5616l1988k348k3955l164m571L2694K8238
$$ y = [23462, 20912, -49744, -46603, -24869, -38061, -21550, 58403, 28474, -13948, -16935, -42459, -45861, 9498, -9636, 15981, 33434, 38210, 131497, 183729, 169001, 48719, -15823, -50371, -28059, 3885, 16330, 1293, -34803, -76240, -77628, -52812, -16605, 31044, 65591, 50249, 21906, 24098, 7666, -46108, -1885, -37818, -75730, -46742, -53888, -23615, 8629, 63380, 33880, 8519, 18542, 23896, 57934, 59109, 31546, 42407, 41454, 65795, 31893, -41777, -88128, -9164, 5104, -31293, -2396, 6753, 27494, 39261, 27100, 39042, 84753, 39609, -33812, -83504, -85293, -112636, -47584, 2169, -23651, -30682, -23697, -1676, 14970, 27585, -21122, 9367, 19674, 12326, 26855, -8761, -40749, -43097, -67052, -70216, -74787, -42093, -13855]
27069a3855J6380k6844l6872J1820M1538k0932k9398N1088L75k4288O383K5213
27057F08k5590m5099J2518l921J0671K380L2395K1089L3609l651k7898j2390n0275
27044e5554j0936P0308k4414P60j8818R696J1645K2659K2244J7605j6343K4354
27032E3206l611p531j9489J2348l6983q388J2323J3908K2730l5764j0822k0014
27020b8087l8382j0663N3958J9089Q772M2325J8188l702n2001j13807M4010N0643
27008i657J0748K9905j3130K7434P816l5231J020M0616M1513n6724n9861J6874
26996A323j5226r462k054M8778M7145k3813J261n841l4248k3454q7832j4573Q9580
26983b8416R7749m6134k9291o069K0319J8531p294j1158j6457J3544J1312k3126
$$ y = [-13855, 2525, -24319, -61191, -49371, -7833, -28765, -58163, -7075, -6700, -30988, -24605, 608, -24982, -70081, -57563, -61484, -50813, -48433, -16038, 5051, 38660, 35009, 7111, -5279, -55554, -66490, 3818, -20596, -19836, -38654, -28958, -17313, 5346, 27590, 45195, 28852, 53206, 49595, 42064, 22575, 34923, -2060, -10448, 1875, 15783, 38513, 2749, -8073, -28087, -66469, -77132, -23174, -4085, 4687, 47012, 65200, 61498, 9497, -104310, -60300, -9657, 1091, 30996, 17866, 45300, 53116, 17885, 18905, 59521, 101034, 44310, -15551, 1323, -13903, -23365, -25419, 23359, 70504, 46691, 47952, 42111, 7863, -15591, -103423, -117996, -28416, 69333, 23199, -6092, -12161, 8158, 26689, 19395, 8237, -8220, 5324, 16636, -6490]
26971f490P8987o1986k9464m3532J3875M3952n072q708L1391J9062j6024k7730
26959a1739l8260M8453N4954m9029l1959N315p227N308N4518r117l7282p285K670
26946b0680J3820n6186k626N5488J0317N3336J08868J9119p8778n8565m2819j1019
26934i725j9929j7300o978J0600p381O1685O8446J1049k7901n7579q500o092k3816
26921c3421O522L9564O081l7510n6523J3792J644M7580k0292j3652K2249N971
26909a7995J260o194M8586M9543n0966n2173K6133Q651L7732J8198N1208K3395
26897A37378M63n3672p5147m8784k6322M229J6064K8005j2928L3200J3800R357
26885B5643O944J0681l0655p432r339K3276R706K7717n485l2833n4448P507K7491
$$ y = [-6490, 72497, 10511, -18953, -62485, -48610, -4658, -9730, -18438, 12953, 32015, 15991, -11739, -49999, -1546, 53408, 4379, -27580, -22265, -29492, -24184, 30334, 21217, -16065, -23350, -20680, -6860, -63046, -65672, -10184, 133, 53469, 162337, 181456, 102678, 44113, 1294, -9725, -29654, -46954, -53932, -43332, -50713, 10972, 79418, 90467, 62566, 4987, -3513, -9605, -33421, -26899, 12665, 18746, -18764, -75287, -61495, -59851, -12271, -32563, -46215, -23966, -17995, -16735, -22929, 25657, 75200, 24234, -27939, -1806, 6845, 44577, 62775, 113983, 137378, 137841, 84169, 9022, -39762, -66084, -61855, -45791, -17786, -30714, 2486, 16286, 25643, 32587, 43268, 12613, 5181, -4158, 19118, 28824, 56541, 51056, 18223, -36225, -28718, -1227]
26872a227n877l0384O921J3522J4889M0606j7565l2536j2926L1725J1449l4248
26860a5651K1018J2041j4056k3253m548n453L7088J3287j1600L450j2929j5083
26848a5689L7529P956k0990k0276M7150J6711J956q1148p0108r971k198k4295
26836a33373O942N2P4973O1520k3453n2785k3360L5924L4225K2632k7534O99j1156
26823c4694m5658l8553P0531K1896K8415l2840n286k2978j6872N9655K5465l6153
26811b7072k2456J0431j1426n6355K5036P0066l691k3040J5079L3874r974K850
26799C322J7825L992Q864J8614O568j6661j672J016N1977m8260L7078j0376j26801
26786e4514o6494L3975R1673K883l0130J1396R6691m0521j8745J90n5035j1152
$$ y = [-1227, -7104, -37488, -30567, -17045, -2156, 38450, 20885, -11651, -24577, 7148, 18597, -15651, 5367, 17408, 3352, -19901, -24449, -29902, 7186, 20473, 8873, 12323, -606, -15689, 21840, 29796, 8806, -11470, 35680, 52391, 54347, -26801, -96909, -106880, -109078, -133373, -126431, -126379, -51406, 10114, -13339, -66124, -89484, -53560, -19335, 3297, -24237, -23538, -34694, -80352, -118905, -48374, -26478, 1937, -30903, -36189, -59167, -76039, -16384, 9081, -27072, -49528, -39097, -50523, -106878, -81842, -11776, -15467, -38507, -23428, 10446, 472, 3322, 21147, 25139, 34003, 52617, 59185, 42524, 40852, 41868, 93845, 45585, 82663, 72287, -54514, -121008, -87033, 4640, 7523, -22607, -11211, 85480, 44959, 26214, 26404, -28631, -39783]
26774c9783N3098K9882l4456k5016m2703J532n8742M7600M9210M7070j4252N490
26762A8930J4941p3407J0468j4253K4142J5392k133l9086l6826N8459M3911l156
26750A7382n3921p3228k0076N6271M6515k3986n753K3754o141L2252k3869k7740
26738e8540m167K3254q096l9361k4556K8285L3995J2260M2931J9299K188K7865
26726E5357L1132N594m6913o5218m3517M4676K8064j9531l2349N9240M0857r371
26714D8021J4336L1040K2760l8530L0805j5623m4912k9157m1325q385m0896Q2974
26702A1108N518r8535L885L6275j7220J4496N1222L8362N1669k056N902l2896
26690F7730n6106j2671J2927k6888o484k4400J3890P0746j6343j026L6213j8139
$$ y = [-39783, 13315, 43197, 8741, -16275, -58978, -57446, -116188, -68588, -19378, 27692, 13440, 18930, 33871, -39536, -29068, -43321, -19179, -3787, -5920, -45006, -81832, -23373, 20538, 17382, -36539, -109767, -129843, -73572, -27057, -51043, -56796, -33042, -39183, -6931, -30800, -58540, -62707, -39453, -47549, -86910, -111466, -83181, -49186, -36926, 6005, 25304, 27492, 55357, 86489, 92083, 45170, -20048, -63565, -18889, 9175, -10356, -42705, 16535, 57392, 48021, 62357, 93397, 116157, 77627, 108432, 92809, 47897, 18740, -22585, -30970, -71866, 11108, 16626, -81909, -78024, -41749, -58969, -44473, 6749, 45111, 96780, 94724, 100626, 67730, 11624, -1047, 11880, -15008, -21492, -45892, -32002, 38744, 22401, 21375, 57588, 39449]
26678C9449j2892k6208j4741Q72j1706L9453N7589K2482l1790j7485l8570k30
26666F223J9935K4734j5634m4464j6531k0733n3400l0331O4840M5346l0138Q645
26654d1508J3859N1273j0135o0692j2592j1948P7052R1508n4213L7739m0201o2867
26642b2725K3160l4820K9303N0273K3972m6328J8422K5500j4292L739l7720k7904
26630i420O508l1347m0503n0207K56N8743O8609K4830P518l569J1646j1442m0560
26617h938l1290n4145N6994L3398l845k5430m4193J3840K5134J6440M252P484
26605a0299L1758L690n3929k5228L1688L9228M0573k9390l2644k7334k9232j4094
26593g5213n950K1998L7620m3976M4214l5357k3482O0926n712k2412l7608L3886
$$ y = [39449, 26557, 349, -14392, -13520, -25226, 14227, 71816, 94298, 62508, 45023, 6453, 6223, 26158, 50892, 35258, -9206, -25737, -46470, -99870, -130201, -65361, -20015, -50153, -41508, -27649, 23624, 13489, -47203, -59795, -71743, 5309, 96817, 42604, 80343, 40142, -22725, 435, -34385, -5082, 45191, 69163, 22835, 41257, 66757, 52465, 56204, 18484, -9420, -2912, -34259, -74762, -124969, -124713, -65970, 2639, 27469, 34987, 31418, 43064, 31622, -8938, -40228, -94373, -37379, -3981, -7826, -33256, -77449, -63609, -38475, -22035, -17783, -10299, 21459, 25149, -28780, -54008, -22320, 16908, 57481, 28091, -4553, -31887, -61119, -75213, -81163, -59165, -21545, -65521, -21307, -56664, -80146, -19220, -24932, -47344, -84952, -51066]
26581e1066L835k2903k292j650N433N3629K7327q219k8187K1141K2922m9690o5664
26568i5384q821l1516K8100J7952l0577n656j9924J5632K8235N9513N0884j6434
26556g996l8593k4229N5236L1728L043p391j3323K4875m8013j1385K0918j5464
26544c0594k9276L3815K564j8224j2067J1748j0987M3774L1898j8991J4941n2034
26532c3433K2770K2512J4308l6514O855L1596j8948K4279R230q753k3578j7222
26520f898P209q30J1248l7226J9261k6843R782J3883o065M8639j775j1445j9476
26507e36N9827J6840q863L1536k3121m6137J9670l2131k4512P181O766M3634J6387
26494F6541k5609K3230j2643n3603m1500k367J3416J9584K808j6448j1492j0062
$$ y = [-51066, -47231, -70134, -72426, -74076, -68643, -15014, 12313, 4094, -24093, -2952, 19970, -29720, -95384, -104205, -135721, -107621, -89669, -120246, -125902, -145826, -130194, -101959, -42446, 8438, -7996, -46589, -70818, -15582, 16146, 19189, 11798, -1525, 23350, -24663, -36048, -15130, -30594, -59870, -26055, -23491, -41715, -53782, -42034, -53021, -9247, 22651, 3660, 18601, -33433, -10663, 11849, 26157, -10357, -3502, 28094, 9146, 33425, 42655, 33902, 10324, -6898, 311, -519, 10729, -26497, -7236, -34079, -24297, -10414, -16479, 32160, 30385, 18940, -536, 59291, 76131, 67268, 98804, 75683, 29546, 49216, 17085, -7427, -246, 6520, 50154, 66541, 40932, 64162, 51519, -2084, -43584, -45951, -32535, -12951, -10143, -26591, -38083, -48145]
26482d8145k668J5604M9331k1335o1682j5696J3375K8427L303m1043K9581M7863
26470c085J8765j5135l8780M2864J8331m1932m2032p909K2926j020N9664L4104
26458D6761L6690o2590j9337M3046L5513k7810P308Q873l2878l9336m3441k4552
26446g1753O0896L0234K6943j8617k3051m0727R795L6385K3250J8162O5534l4922
26434H2129o1230m72K271n0349k6410J4690J9277O7759J8756o0377l504o647L7660
26421C3553m1204n0906l310j0078J6443R9545k9575l2596J4496J2356J6354m919
26409B0159P515k9847k5281J5734n26L1825j9047m9544O368N9050m1482r921K0139
26396a4858L0264k0097N318L8843K4929k750o37J0712n5627q2268j0711L3716
$$ y = [-48145, -50813, -35209, 14122, -7213, -68895, -84591, -71216, -42789, -39486, -80529, -50948, -3085, 15680, 545, -38235, 4629, 22960, -18972, -61004, -68913, -45987, -47007, 12657, 46761, 83451, 20861, 1524, 44570, 80083, 52273, 59581, 68454, 35576, -3760, -47201, -71753, -10857, 19377, 46320, 27703, 4652, -36075, -26280, 10105, 33355, 51517, 117051, 82129, 20899, 20427, 22698, -27651, -54061, -39371, -20094, 47665, 66421, 6044, 2540, -4107, 33553, -7651, -58557, -61867, -71945, -55502, 44043, 14468, -18128, -3632, 8724, 25078, 20159, 27674, -2173, -27454, -11720, -12246, 19579, 532, -49012, -42644, 16406, -25076, -34997, -14858, 15406, -4691, 627, 39470, 64399, 61649, 61012, 71724, 16097, -66171, -76882, -43166]
26384d3166K561r824k5393k696M914r776j6043L828O8763k1446M1639J95m5306
26371e1750J5328N7510J2518L04J1652n6224R472j0619J442k3628m602p040k4325
26358f9962O5200j0425m5462m06J0962K6583N054O5150J4576k7047n496n1580
26346b2853J774L352K277K3767N3872j0429n5319k8861k8647M5216L8979K3494
26334D6622p33o099m7505k6211N8384L4957j2182j3987l3420l0485M1312q806
26322A847J3395J4935L9331k067j392N8869m8765l1280j2848r5011j6701L8979
26310d0708M2518l5987J3496K0168J34N7887O0582m4665o6651L3842m9317l3500
26298d2201K808O2293M1347q8922K303O9188L2391k747l2131l151m1067j0571
$$ y = [-43166, -40605, -50429, -75822, -78518, -73604, -83380, -99423, -95595, -26832, -48278, -6639, -6444, -51750, -36422, 21088, 33606, 33910, 45562, -10662, -1190, -11809, -10367, -33995, -38597, -45637, -69962, -4762, -15187, -60649, -61055, -50093, -23510, -18456, 46694, 61270, 34223, 28727, -22853, -21079, -17727, -15450, 8317, 62189, 51760, -3559, -32420, -61067, -15851, 23128, 46622, 45889, 39790, -7715, -33926, 24458, 59415, 47233, 33246, -174, -30659, 10653, 1847, 15242, 30177, 69508, 67441, 66049, 124918, 76153, 44873, 32025, -62986, -79687, -40708, 1810, -34177, -20681, -513, -379, 57508, 118090, 73425, 6774, 40616, -8701, -42201, -39393, 22900, 64247, -24675, -22372, 46816, 79207, 76460, 44329, 41178, 111, -10460]
26286a0460p3424k1094K1365l8330j1337j7129L7747P9397L6044L8087n7410j3110
26274b9654L7319K5174L9130J3645j03252k0951r245N2412N0393M0704J689p0090
26262B7274n9654j1398J3620Q5309J9310K0726l78q1499j13587M9393N5985L0352
26250C5453O27k0752k5576l3004j0103O7336M3464l1059o1128J8714K6617m367
26238F222j8929k300j4948j9883K8065Q748J3362J1549k3711R688q764J9173j007
26225G265j2404m3729k8207K7404K6361J8479L2586r227o8172k0975K1366L9642
26213i611N2451O5292j9211r3717l7071J7961M9265k0482J3604n5164j8082L3973
26201b0792o7568r751m520J9928N4836J6498M1385k4290R1707K8598n9817l4101
$$ y = [-10460, -83884, -104978, -83613, -121943, -133280, -150409, -112662, -33265, 2779, 40866, -16544, -29654, 7665, 32839, 71969, 85614, -17638, -38589, -47834, 4578, 54971, 95675, 97364, 27274, -32380, -43778, -30158, 55151, 74461, 95187, 94809, 13310, -100277, -50884, 5101, 35453, 36080, 15328, -10248, -43252, -53355, 13981, 57445, 26386, -34742, -16028, 10589, 6222, -12707, -15007, -29955, -49838, -21773, -13025, 337, 11886, -11825, -2137, -10901, 8272, 7265, -5139, -48868, -77075, -49671, -23310, -4831, 27755, 18528, -49644, -70619, -49253, -9611, 42840, 108132, 88921, -4796, -41867, -23906, 25359, 4877, 18481, -36683, -54765, -20792, -88360, -98111, -102631, -82703, -27867, -11369, 30016, 5726, 97433, 126031, 66214, 32113]
26189C2113l3036l9534Q595M0851L2015K0473O45p3288K3746j5259n5909m20J4331
26176d4677J8481R175L4214K5965N1149O867q3950o223J5556k3357k1252p5286
26164i3338n5990L9521M7342N2078P2882l7473o8471M3466k4574l5004k6194R652
26152g6103J8803J4269K8133K9400k4785M4400J4776j425k5006j3230n8267M936
26140d4099M9691k9921m7274j276j462j824L2431J7998O2085L7969p448o7503
26128f33o617L2821l8667J4507L0095M636j4805l4415N671K1810L4768j7169m4245
26115a2243p7714l7596J3508L6723J359r954q513J9795J1290P2069L9608j4832
26103C3500J9507K4856J6029k2015J5075q3179q9274J3936q580K9334L8982j87
$$ y = [32113, -923, -40457, -31862, 8989, 41004, 61477, 62122, -11166, 12580, -2679, -58588, -59008, -44677, -26196, -17021, 17193, 43158, 94307, 101174, 17224, 11001, 26557, 3200, -18052, -93338, -149328, -109807, -62465, -10387, 62495, 25022, -43449, 17, -24557, -59561, -85755, -76103, -57300, -43031, -14898, 14502, -10283, 34117, 48893, 47468, 22462, 9232, -49035, -44099, 5592, -24329, -71603, -72879, -74341, -76165, -43734, -25736, 36349, 74318, 66870, -633, -7250, 25571, -13096, 1411, 31506, 36142, 21337, -13078, -7407, 14403, 49171, 32002, -12243, -89957, -127553, -114045, -77322, -75963, -85917, -94430, -74635, -63345, 8724, 48332, 33500, 53007, 77863, 93892, 71877, 86952, 3773, -85501, -71565, -80145, -50811, -11829, -12016]
26091a2016l6896P750J9515R100o037n8269N065J9125K5922K3958L3670J8400
26079D9287o4987j7933J6425l8407m77O31K4742m3758N269L1204J3695K9017l7282
26066c2574m131L4453l35j1453N4582j0219n2936m1874J7498L8668k0803l2654
26054f1778L9063L9765l969M0641j6839k1061l7122R6639K0640n6397j3365l4098
26042g881k5117n908N280l56N707N252k7214J24k5115M5216K0035J8321j9837
26029a1493K7976l2891l412N9231j8189n8627l8054N3828o5679l6161N8485K0333
26017d4653Q231L8522L3394J656j7927k7508o9726m7525J9478M4181j1773k6828
26005a00478O4226O6038K7505R927L1848J605n2933Q536L6583j2435j7535m5270
$$ y = [-12016, -48912, -41162, -21647, -12547, -18584, -76853, -71788, -52663, -26741, -2783, 30887, 49287, -15700, -33633, -17208, -55615, -56092, -55461, -30719, -74477, -69208, -38004, -24309, 4708, -32574, -36705, -2252, -2587, -14040, 40542, 30323, -22613, -64487, -46989, -8321, -29124, -61778, -22715, 17050, 13081, 53722, 36883, 15822, -21300, 75339, 95979, 39582, 26217, -7881, -32998, -38906, -33626, -33982, -28275, -23023, -50237, -50113, -75228, -30012, -9977, 8344, -11493, 16483, -16408, -19820, 39411, 21222, -37405, -75459, -21631, -87310, -123471, -64986, -44653, -36422, 2100, 35494, 37150, 19223, -8285, -78011, -125536, -106058, -61877, -73650, -100478, -36252, 29786, 57291, 67218, 99066, 100671, 47738, 56274, 92857, 80422, 62887, 17617]
25993A7617k2658n0545J2518j7124l2327P4503k5616J1730P4792K9360l4652l0203
25981G395m3886n1815j3670Q6303N3370n0497o7719N7539J6171n0348l7991k7122
25969a22270p943R1705Q0327K469M9322o074k8584l6538j0449j8060n8655n38
25957f5288L1896k7701J8146J1427l768L3988l1885J0395m37l070j8230l3516
25945g8043K9830p263J1073J2453K7619j808L0298L824M1067K2848m5836l4726
25933A1336m224N6785J0771m3853n43m6981p4643J8554K9974p278J5075N6531
25921B1504r732q145k9379n789J2760p411J167j6266n0455k2565p928J14712O2317
25908E4790l772p4364m637J361q129l5481j5372J0387M3859O021k5352L0523N5075
$$ y = [17617, -5041, -55586, -43068, -60192, -92519, -18016, -43632, -31902, 42890, 72250, 37598, 7395, -36491, -88306, -101976, -15673, 37697, -12800, -80519, -22980, -6809, -57157, -95148, -122270, -130213, -38508, 41819, 44288, 93610, 87536, 58952, 22414, 11965, -6095, -64750, -65288, -33392, -61093, -42947, -31520, -35288, -1300, -33185, -22790, -23227, -26297, -44527, -78043, -48213, -55476, -44403, -31950, -4331, -6139, 24159, 27983, 69050, 91898, 46062, 11336, 7112, 63897, 74668, 30815, 30272, -16709, -91352, -72798, -42824, -50102, -35027, 21504, 11772, 3627, -25752, -31541, -18781, -26192, -25025, -41291, -91746, -114311, -122239, -7527, 54790, 51018, -23346, -27983, -26622, -34751, -70232, -85604, -75217, -31358, -25337, -50689, -20166, 34909]
25895C4909m1267P325n8270k3515m9278L9254Q3395J2397K0908o7624o371j6230
25883f4367K1857P1312M5923j5310j8329k1596K8593l8617l606J8845j7580R704
25871A6829k2075k9773k1975m9741M8003p1880j5943J09696K3930L403J6476J9068
25859B6018J2500J694k0420l6316n901K0872J9727k7863O2365k2357K6730K5706
25847H2755l0745l5366m0285j7743j5544O79k0946O6415M7527n3467m7917N1138
25835a3499j140n0892J272k7169J384l6930J5759r826L7068L6228J8476J8415
25823a0854O5939M1705o955k6927M0749l2067k0392j8829o0664n3597k1161R0409
25811a2644M1352O252P246N2867M334j00702m8480K0612K3787N1511j0403m9385
$$ y = [34909, -6358, 967, -57303, -80818, -130096, -90842, -7447, 4950, 25858, -41766, -48137, -64367, -42510, 28802, 74725, 59415, 41086, 19490, 48083, 9466, 5860, 24705, 7125, 16829, -5246, -35019, -56994, -106735, -58732, -130612, -146555, -36859, -12929, -9526, 6950, 26018, 38518, 40212, 19792, -16524, -22425, -1553, 18174, -9689, 52676, 30319, 57049, 82755, 52010, 16644, -23641, -41384, -56928, -56249, -77195, -10780, 36747, -16720, -64637, -13499, -14639, -65531, -64259, -91428, -90044, -126974, -111215, -121041, -83973, -47745, -29269, -10854, 55085, 96790, 89835, 62908, 103657, 71590, 51198, 32369, -28295, -81892, -103053, -12644, 28708, 34960, 42206, 95073, 99407, -1295, -49775, -29163, -5376, 46135, 35732, -13653]
25799a3653j4121k4930P706J3179L7231K7614O7801m5438m6544n3749j5604k7380
25787h7888q547J8944M3497L0525m576k6465j3309j7120q352L990K8953j2475
25775e2823K0219k3394j9120R160N0L9798Q0520r690n4744o1537J7352L9282L8411
25762B3484L0993L3777m4379l6025k6650K4475O3130l3278P14J9153k0679q251
25750B6464j0672j7623R722J2728j2881j0045n380j4591o5638n246K1676j719
25738g3205j4056j3016K9971L7827L4012m871n5924l1636J8024J6519M420m955
25726e6890L0779J1550R321m0936j4613O3740M0544O308L5427M8592k4590J4295
25714A23527k8050n3047J2644N1930l3938j9818j4681k3908j1047k5963l5694
$$ y = [-13653, -27774, -52704, -44998, -31819, 5412, 33026, 100827, 55389, 8845, -44904, -60508, -87888, -96435, -77491, -33994, -3469, -8045, -34510, -47819, -64939, -73291, -69301, -40348, -52823, -32604, -55998, -75118, -65958, -65908, -26110, 54410, 44720, -10024, -71561, -54209, -14927, 23484, 54477, 88254, 43875, 7850, -18800, 5675, 68805, 35527, 36241, 55394, 34715, 26464, 15792, -1831, 7891, 20619, 7738, -2307, -7687, -22278, -87916, -93162, -71486, -73205, -87261, -100277, -70306, -32479, 1533, -3338, -59262, -90898, -72874, -56355, -51935, -56890, -26111, -14561, -5240, -46176, -60789, 2951, 43495, 49803, 85230, 133822, 109232, 123527, 95477, 42430, 55074, 107004, 73066, 53248, 38567, 14659, 3612, -22351, -58045]
25703e8045M0566Q3067j4210j4686j3830L524n1710J5382l345J0946J317K8703
25691B7679j0571l8435K5209O1348N1843n6858m5794k3158j2609K5358p9661n4062
25679a29711j271L3145M4041q213L3585L3039M253k5229j3142N4453m6750K364
25667a9436N4796j4869J0673l5040J6507L2190O782o4929j6634Q0666K9970o5339
25655A5337l8994L4640L0142M5709m8378j6870n4857l7110j2300P4568N8834M4962
25643I5683O739m393k1312q4528q6932K5397l425P7475M7890K678l6764j1953
25631F555j6722k4798L8960K9607k937k9750n738L6812k0060P625M260l8719l73
25618a5278j9021q9339j0575K252J9872P6855M1425K9402k1891l4556j521k5497
$$ y = [-58045, -17479, 65588, 51378, 36692, 22862, 26386, -25324, -9942, -13287, -2341, -1024, 27679, 17108, -21327, 3882, 65230, 117073, 60215, 14421, -8737, -21346, 4012, -75649, -129711, -130982, -97837, -53796, -62009, -28424, 4615, 8868, -16361, -29503, 24950, -21800, -19436, 35360, 20491, 31164, -3876, 12631, 44821, 51603, -13326, -29960, 50706, 80676, 15337, -23657, 10983, 41125, 86834, 38456, 21586, -33271, -70381, -82681, -8113, 50721, 95683, 102422, 98029, 76717, -7811, -94743, -69346, -72771, 4704, 52594, 55272, 18508, 6555, -10167, -34965, 3995, 33602, 30665, 915, -4823, 31989, 11929, 19554, 23814, -14905, -15278, -34299, -123638, -134213, -131961, -112089, -35234, 6191, 35593, 13702, -20854, -22375, -47872]
25606d7872M0830L0503k909P123J1090K498k8526K4371M8525l6987L334L2590
25594H4570J2892m661p834J8324k0244p6022l7602l4113J1932N6887N7987k820
25582E9296o2767j9042k9265K0812J5191O749K6136L8833k6392j0653k5984q1960
25570h9046M2014K1343l1682l5602k8517K0478L5017J1058N5589L7049K8327J1621
25558G7649O7m0134N914l6661m1830j0245L5949Q7073J4058K8402j5423l0526
25546G4293o2810L392M7402M4061K3816O542m7711m7953o1341L4363L5370J1837
25534F1261l3666o48L9789L3817m441k6866L282q0713k3247N342O303O0285L0792
25521G1290k3627l7360K1882j7463l5907m343r476m0340n353j6761m0996r459
$$ y = [-47872, -7042, 23461, 20552, 27675, 38765, 41263, 12737, 37108, 85633, 48646, 51980, 84570, 97462, 92801, 84967, 103291, 83047, 7025, -30577, -64690, -52758, 4129, 62116, 59296, -3471, -22513, -51778, -30966, -15775, -9026, 17110, 55943, 29551, 18898, -7086, -89046, -47032, -25689, -57371, -92973, -121490, -101012, -65995, -54937, 652, 37701, 66028, 77649, 77716, 37582, 43496, 6835, -34995, -45240, -9291, 77782, 91840, 120242, 104819, 74293, 11483, 14875, 62277, 106338, 130154, 136696, 88985, 41032, -20309, 14054, 49424, 61261, 27595, 26947, 66736, 100553, 96112, 69246, 72528, -8185, -31432, -26090, -19787, 40498, 71290, 47663, 10303, 32185, 14722, -21185, -25528, -35004, -75344, -80697, -97458, -138454, -147913]
25509a47913J4988P5812K7499k4604J5894L1157M3843N6212k939q9200m1376l210
25497d3837Q1j3504K4707j97J5678l7683L442J9366K8703l7403N85J9592J7894
25484b576J2512N439L2196m14l9641o0186m8223M0861l4412j741M156J1234p218
25471h8013m818K3536M5280K4007m31L5956K2625k3587J4739M0455R84p229m9634
25458C3870j9886M6686M9535n371j8711J4142o2872n2748m509j5494K9040K4528
25446A8210J9166j1240N881l6523p3123M454o84L1283N1553j931p1308K0111N1179
25433G028k7652O9196M0468m7567j6845J9108J9899k6897K9073Q198k5236k759
25421D6014j3453j8523k9211Q325R151l0635R581k4014o0194O229Q8890j9745
$$ y = [-147913, -132925, -57113, -29614, -54218, -38324, -7167, 36676, 92888, 89949, 749, -40627, -43837, -43756, -57260, -32553, -32750, -17072, -54755, -51313, -31947, -3244, -40647, -40062, -20470, -2576, 9936, 15375, 47571, 47157, 7516, -52670, -100893, -60032, -94444, -96185, -92029, -80795, -88013, -92831, -69295, -24015, -8, -439, 35517, 58142, 34555, 49294, 89749, 90733, 83504, 33870, 13984, 60670, 110205, 104834, 86123, 100265, 37393, -15355, -19864, -35358, -6318, 18210, 37376, 26136, 32017, -4506, -77629, -73175, -73859, -42576, 8977, 7046, -64262, -44151, 7028, -20624, 48572, 89040, 41473, 24628, 43736, 63635, 36738, 65811, 74009, 48773, 46014, 32561, 14038, -15173, -6848, 2303, -28332, -18751, -42765, -102959, -96730, -7840, -27585]
25409b7585j5077l2001L5105M8973k5598l6718L4103l0231n9884m0056N046Q2656
25397f1267L2393k6117M9956M5363J2926l8612n5181k3311J91n9778J4477O7930
25385d1030k3469M6235K2884k9564k5118j5735O7450J7956o7690k4872P7380M9458
25373E3885O6856n239o5356Q668n0681q7055m304P1383k1430M0307N1413l2518
25361B5929q4758k883M1556K7838l5169J0015L5042l2411p2984j0411N8175M0045
25349a6L2310L3891l6724n2192j0567k2884j7842P1444L8183q496p329L554P4532
25336I7864K1337j4045k8485N044j591K2510K6172j8801L66k1280k1695j6876
25324E0520j9437j6311j2365q2894l5415k872N0241L2116J1459L1287J9344J4336
$$ y = [-27585, -42662, -74663, -39558, 9415, -16183, -52901, -18798, -49029, -108913, -148969, -143923, -61267, -28874, -54991, -5035, 40328, 53254, 14642, -40539, -63850, -63659, -123437, -108960, -41030, -64499, -18264, 4620, -24944, -50062, -65797, 1653, 19609, -48081, -72953, 4427, 53885, 120741, 115502, 50146, 58814, 8133, -78922, -83226, -11843, -33273, 7034, 58447, 25929, -58829, -61712, -20156, 7682, -27487, -17472, 17570, -14841, -87825, -98236, -40061, -16, 32294, 66185, 29461, -22731, -33298, -56182, -74024, -2580, 35603, 27107, 19778, 23332, 97864, 119201, 105156, 76671, 81715, 80124, 102634, 128806, 110005, 110371, 89091, 67396, 50520, 31083, 14772, 2407, -80487, -115902, -118774, -68533, -36417, -24958, 6329, 25673, 40009]
25312D0009m3177M5847N8262j2702n228M2835n0624j4065N5031m6657r1885L6198
25300A3844J7121J0172L6308k3104k9296o8229l8973P597j845R6911J8643N0511
25288H9660k9741k2349J645K6671j7291M561P39o8339n6236q583K4791N720N0585
25275A833m164n817M3129L984m5635R448N1234L5895l5064r3993q266O7178L0660
25262E0422J4012n4978k8425L2097M3359j1063j2411K2567L2841l4590j5732j0554
25250B7545o6480M2064L4244k7447j9794K9665k8192l6367R6049J5005J2741K2564
25238A01597l1405j6124n3778k0464M6582J4757p8542J2524Q100r72J3065l1503
25226c6163k4484J8022L8860K8987k1934k6880L0021L2196j7127L6030J436J2207
$$ y = [40009, -3168, 42679, 100941, 88239, 83011, 125846, 75222, 61157, 116188, 69531, -22354, 13844, 30965, 41137, 77445, 54341, 25045, -43184, -82157, -74560, -76405, 20506, 39149, 89660, 59919, 37570, 39215, 65886, 48595, 53156, 53895, -14444, -70680, -79263, -54472, -48752, 1833, -2331, -8148, 34981, 38965, -6670, 2778, 54012, 89907, 54843, -39150, -47416, 19762, 50422, 64434, 9456, -18969, 13128, 56487, 45424, 33013, 55580, 88421, 53831, 38099, 27545, -38935, 3129, 37373, 9926, -9868, 19797, -8395, -44762, 51287, 66292, 79033, 101597, 70192, 54068, 290, -20174, 26408, 41165, -37377, -24853, -16753, -17725, -4660, -36163, -60647, -42625, -3765, 25222, 3288, -23592, 6429, 38625, 21498, 57528, 58964, 71171]
25214G1171j3884k9701R89j9677l2067j1278J4183O091M109j8551J0419r625r011
25201c6832m075r227p667k9616k4223J7329K2446L7548K3947J6089j7532k4229
25189c6042M3577O9745J5026j3578o4552m679k3077n1607l69j5926J1129P1817
25177A464q316K1748n4667n068L1069M9405K7922n0813M5789j6841r4865M7212
25165e961N8252n5j4780m9837R871K2484p986J570J2673k1421J4589R416k2148
25152F667M2197N0544k1880K0155l1020j4136l5095k4606m8352J2856L5131n0210
25140e7749k6187J8337L4598N4742L3831J1232l8901k2499l4639j8495k5903J8187
25128e3446J7997J3455J6898l412j714L3308r741Q297j8116M0539j6584m5304
$$ y = [71171, 57287, 27586, 28575, 8898, -23169, -34447, -20264, -14173, -10064, -28615, -18196, -27821, -36832, -40907, -50134, -57801, -87417, -111640, -94311, -71865, -34317, -10370, 5719, -11813, -36042, 7535, 77280, 92306, 78728, 14176, 9497, -13580, -65187, -65556, -81482, -70353, 1464, -6852, 14896, -39771, -44839, -13770, 35635, 63557, 12744, 58533, 41692, -53173, -5961, 52291, 52236, 37456, -12381, -2510, 19974, 11988, 13558, 26231, 4810, 19399, 28815, 6667, 48864, 99408, 77528, 97683, 66663, 52527, 17432, -7174, -55526, -42670, -7539, -57749, -83936, -65599, -31001, 23741, 57572, 68804, 29903, 7404, -27235, -45730, -71633, -53446, -35449, -21994, -5096, -8508, -10222, 23086, 13345, 21642, 3526, 44065, 27481, -17823]
25116a7823J01295P4155n4067m9554n5083J6401r664l460J1398j6683P126j6513
25104a2472l345J0527k7068L0918M0969j8803j7361M0606L1775l7210j5709m1524
25092a8697P818k9048j7024p6919J3834L1086j5871l793J8182N61N1511J0701
25080b7659M5950L0296p3285Q013O5976l6088n4592j2630K7039Q52k4280k1900
25068g2308L1047o752k7341L9535J5724n0294N060N8725P322l0709N206j6095
25056d0880p948L63N86P7535o126m7389Q3133L7380m4303j2613L9093p975j7310
25043E3546j2510O835l2861m2382k2309l3576o197M6765P1390J5394N8244K6897
25031A29236k515j01811m2272L7335j6964j1372N1933K831M752p884l2660J6018
$$ y = [-17823, 83472, 157627, 103560, 54006, -1077, 15324, 5660, 2200, 13598, -3085, 4041, -12472, -15817, -5290, -32358, -1440, 39529, 20726, 3365, 43971, 75746, 38536, 22827, -18697, -10879, -39927, -56951, -133870, -120036, -88950, -104821, -108614, -90432, -89871, -38360, -27659, 18291, 48587, -24698, -16685, 49291, 13203, -41389, -54019, -26980, -26128, -50408, -72308, -41261, -48013, -75354, -35819, -20095, -70389, -65329, -6604, 718, -29991, -24785, -40880, -48828, -48465, -47879, 29656, 23530, -23859, 59274, 96654, 52351, 39738, 78831, 70856, 53546, 41036, 47871, 15010, -27372, -49681, -83257, -89454, -42689, 28701, 44095, 102339, 129236, 126721, 24910, -17362, 19973, 3009, -8363, 43570, 46401, 51153, 43269, 10609, 26627]
25019B6627k5679m0383k220k6404m034L5628O1088N1060k1517j13255m2179j7599
25007a18867N0022L4456O4174n9892o402l3009J8771N8291m6542Q958L520l0885
24995e7405j8830K0912k525J2237O5695k3599m4501L2843K7530k7147M661r100
24983a9229K6172N2474K6300M7105Q931k8953r882j4764l1636K0799j4076M742
24971F7983K8207p0530m0627l4548j5994P8708r171l7428Q523L2479m3779J8161
24959a8016k1929O342M7066n464l0358r5104k5072N5607O6242L6475o8472o265
24947e8948P1837K6454J5841L4132m6090k058j8515m7448j2613K1188M8912k604
24935C0088l5260k9150k6912n8195l3371L7783O1860l3921M1582J8052J407L1410
$$ y = [26627, 948, -39435, -41655, -68059, -72093, -36465, 24623, 75683, 54166, -59089, -101268, -118867, -68845, -34389, 29785, -30107, -36509, -69518, -50747, 7544, -38998, -30040, -26520, -57405, -76235, -55323, -57848, -45611, 20084, -3515, -48016, -15173, 12357, -14790, -10129, -19229, 6943, 59417, 85717, 132822, 141753, 112800, 102918, 88154, 56518, 77317, 63241, 67983, 96190, 25660, -14967, -49515, -65509, 13199, 4028, -33400, -24877, 7602, -36177, -18016, -39945, -33603, 13463, 7999, -22359, -117463, -142535, -86928, -20686, 15789, -52683, -58948, 12889, 39343, 55184, 89316, 43226, 41168, 22653, -24795, -37408, -16220, 32692, 30088, -5172, -34322, -61234, -119429, -152800, -115017, -53157, -87078, -45496, -27444, -26037, 5373]
24923E373j566L2850n093K1242O041L0727O8822l9631n9258n6025k0295n722j5162
24910c7697m9830j3229K6052J9936r815l478j3546J8670J5976J1120j5250l1465
24898h2556J7133L5812J3505J9002k5687k0860n0827L3955L4370L7197M8238j8457
24886D0825m9339k9813j4775L0138N0981k568j8584k2817L4342K2285o5456o106
24874c0887N4465J687n4305l2187M4957M6469N6133j9862O845j198o4934r0995
24862h3812L4412K8402j5027k3944j9443L3907J1819n993J3125M412M7907k1923
24850C842J6614M786r474j6382m7470K2925L6019l1382K875q960J3499J3023o663
24837f748k3507n2198Q296L5840K8417M4645K1594m8874l6562k9767J8525M1489
$$ y = [5373, 3807, 36657, 31564, 52806, 58847, 89574, 158396, 118765, 59507, 3482, -16813, -22535, -37697, -87527, -100756, -74704, -54768, -64583, -68061, -81607, -62937, -46961, -35841, -51091, -82556, -65423, -29611, -16106, 2896, -22791, -43651, -94478, -60523, -26153, 11044, 59282, 40825, -8514, -38327, -53102, -22964, 28017, 25449, 6865, -15952, 18390, 40675, -24781, -30887, 23578, 25265, -29040, -61227, -16270, 30199, 86332, 66470, 73315, 72117, 7183, -83812, -49400, -20998, -36025, -59969, -79412, -45505, -33686, -39679, -26554, -22142, 25765, 3842, 20456, 25242, 15768, -614, -48084, -25159, 10860, -20522, -17647, -26607, -13108, -85, -6748, -30255, -82453, -74157, -38317, -9900, 34745, 56339, 7465, -29097, -58864, -40339, 1150]
24825A150l5843q792Q080N8454p8483m6209L7023N1746K5388j6541L5918O4858
24813I6749N374q505m7918m4647o666P1998j7213l9499J8324N590k6148N0268
24801E7707k1709j1596l4730j2495p1553k9434L8365k7068J6222r354j119M3764
24789f3000N1826q678j1103k7891J2086n276m62N987r310p7696j5723K4760J9546
24776a04934R906K6534M1226l464l0403J4898P6829J4850k62L9924k2511l3449
24764B9144m3556k9668m0341k8945M696R7017Q127n0896J6154j692L1700j9712
24752b7972o2999k965J0074M6339k8511m1182J675J3071N856M4191N1238n731
24740C084q3609J4888M1342M4220N1523j9075m2328q7580n8886L9533J1812Q573
$$ y = [1150, -34693, -43485, -35405, 23049, -55434, -101643, -64620, -12874, 12514, -4027, 31891, 96749, 102123, 93618, 45700, 1053, -5613, 66385, 49172, 9673, 27997, 33587, 7439, 57707, 35998, 24402, -10328, -22823, -94376, -123810, -85445, -112513, -96291, -105645, -106764, -63000, -11174, -19852, -30955, -58846, -46760, -52036, -52498, -46511, -55821, -133517, -149240, -124480, -104934, -95028, -68494, -27268, -30732, -61135, -46237, 30592, 45442, 45180, 85104, 62593, 29144, -14412, -44080, -84421, -113366, -108670, -11653, -3526, -54422, -38268, -39960, -8260, -27972, -90971, -93936, -83862, -37523, -66034, -107216, -105541, -92470, -86614, -42423, 8815, 3084, -80525, -65637, -24295, 19925, 71448, 52373, 10045, -77535, -136421, -96888, -85076, -76503]
24728g6503J00735N1601m313n2927k0594m7668l1769L9459M0880K4844j671j4999
24716G075k9797M3401j7149J2979k0899j8496M3999J1656J0884k0209p287r576
24704F581Q146J2531K9058o052K8901j1244k0487j2309m8323r301J5324N2508
24692D5333l2500j9275Q62L5200K4131l2755o0341k3335Q883k2481L6997J8105
24680b1176N3546m907n4889k8257N4002l064p19N1421j9023k1194j2899N6974
24668D9815J3964O112k7175k4868M193N5830j510m2711k2026k9978K3417P3425
24656G8488K2885L445r7021n3537P750L0093l3147l8733m3346J7623M3597O801
24644e5102J1499L998p977O842o856k1567K7470J4692L0640M4054j4623n706j7377
$$ y = [-76503, 24232, 75833, 71520, 18593, -2001, -49669, -81438, -41979, -1099, 23745, 22074, 7075, -22722, 20679, 3530, 16509, -4390, -22886, 21113, 32769, 43653, 23444, 16157, 6581, 14727, 27258, 56316, 50264, 79165, 67921, 47434, 35125, -13198, -22499, -7175, 45333, 12833, -6442, -5580, 29620, 53751, 20996, -39345, -62680, -53797, -76278, -39281, -21176, 32370, 27463, -27426, -55683, -1681, -4745, -5464, 45957, 26934, 5740, -7159, 49815, 63779, 69891, 42716, 17848, 22041, 77871, 76361, 33650, 11624, -18354, 5063, 78488, 101373, 104818, 7797, -45740, -37990, -7897, -41044, -79777, -123123, -105500, -61903, -55102, -43603, -39605, -47582, -40740, -47596, -69163, -41693, -27001, 3639, 47693, 33070, 27364, 9987]
24631I987k3506K6325k96N224j7440p154K4960J8326p6111l7505L4522N668k809
24618c9809Q400j0368k3485q342j8503L1102P011N4710O233j8100L880N8800l7539
24605A3990n5624k0087J0133L8226J9274o0151n4066k7340L7257j9492R0724K4364
24593b792P88J6674N325j1361Q852k356l0723m728J5641k3265R149K0609j8221
24580a6408j3465L4882J988J162j5086m786K239j0574k5416M3180J6558j867k2710
24567a0303j656k6401j08153l9760R4851P9630J6064j8100l2955L8843M5893K5563
24555F3516J6034Q947j1297P207o9481J7386k9056m7049L967p669K6794L6685
24543A5984L382L920l477L3650n807j7022O191q616J3781J2367L4749P364j5011
$$ y = [9987, -13519, 12806, 12510, 17734, 294, -6860, 18100, 36426, -39685, -77190, -42668, -37000, -39809, -31409, -41777, -65262, -73604, -92107, -61005, -53994, 716, 6949, -11151, -7271, 51529, 13990, -41634, -61721, -51588, -13362, 5912, -54239, -108305, -135645, -98388, -117880, -27156, -2792, -2004, 14670, 19995, 8634, 17486, 15130, -15593, -20321, -4680, -27945, -18796, 1813, -16408, -29873, 5009, 6997, 8159, -6927, -11713, -9474, -20048, -45464, -2284, 14274, 12407, -10303, -11959, -38360, -146513, -186273, -91422, -11792, 4272, -13828, -46783, -7940, 37953, 63516, 79550, 88497, 77200, 84407, 14926, 32312, 3256, -43793, -39826, -47495, -20701, 15984, 19366, 23286, 19809, 53459, 47652, 30630, 36821, 28205, 41986, 54353, 89102, 96466, 81455]
24530H1455J515n2421k6422M5217K6627k6829o2305k4609l6952L464M4891J7253
24518i116m6268J5914K5731L6374l925m1807K2036N7424n36n0275Q762M0603Q074
24505F2991m1470o6727k0297J6254k9445Q166J3945j0887J8335P1326L0535j7761
24493C4965m3983j4918K1998K4614o3802j3310L1690k3789M4263n2610l7685J7412
24481g5155J8873O1890M5287j5794o4369l5868L4737M9583l9578m4628L7595M5255
24469A7828M5582R79l6840J3548J2260k4401k3606p999L9109j0005p6481K6616
24457b3410k9270L7757L0188m4830r0823k6052M7928P224Q485j1013j6468O391
24445a03893J0412J9182j3242J7181K0278N792p126K656O1039l963l8820K4392
$$ y = [81455, 82970, 30549, 4127, 49344, 75971, 49142, -13163, -37772, -74724, -71260, -26369, -9116, -55384, -39470, -13739, 22635, 18710, -23097, -1061, 56363, 55827, 5552, 14314, 54917, 62991, 21521, -45206, -65503, -49249, -78694, -70528, -56583, -67470, -49135, 22191, 52726, 34965, -9018, -23936, -1938, 22676, -41126, -54436, -22746, -46535, -2272, -54882, -92567, -75155, -56282, 5608, 50895, 35101, -29268, -65136, -30399, 19184, -20394, -65022, -27427, 17828, 63410, 64389, 27549, 41097, 53357, 28956, 5350, -2649, 36460, 26455, -50026, -23410, -52680, -14923, 15265, -29565, -120388, -146440, -98512, -91288, -82803, -93816, -110284, -103893, -93481, -74299, -87541, -70360, -50082, -44290, -51416, -48760, 12279, 8316, -30504, -6112]
24433f112m343L9297J0329k5878O467J119N1651k3204m9994k7711j5875j7096
24421f1350J600J1540q380l347J9082L4833L5216j4922j1541M5169l2395O6377
24409H1882K3965o7712m0383k659N9065N105j9801n1037l2875N197j7334k590
24397e9177j141p352l5112R275N1649M3868n4445J912K5626m469n7364J1938M1091
24384c3701p510m0459k476R699L7473k0523M8360P4985l45j3416K9405k7378p4412
24371b0298k5094M3334L6217R0552m5367j223O833K4624k117J9115o7326q4279
24359b5029k7303p8657K4300R2716J02167N8445l1838j03316m710J3376L6317
24348E6468M4877J1553k6381j8145O563l3177l6677k5476n1490k3067N448L4408
$$ y = [-6112, -10455, 28842, 39171, 13293, 19760, 20879, 72530, 49326, -668, -28379, -44254, -61350, -59750, -48210, -56590, -59937, -40855, -6022, 29194, 14272, 2731, 47900, 15505, 81882, 105847, 38135, -2248, -4907, 54158, 59263, 39462, -11575, -44450, -39253, -56587, -59177, -60318, -67670, -102782, -93507, -41858, 2010, -52435, -50523, -24897, -29366, -86730, -74792, -33701, -41211, -81670, -84146, -74447, -36974, -57497, -9137, 65848, 65503, 52087, 81492, 54114, -20298, -45392, -2058, 34159, 124711, 79344, 78121, 84954, 109578, 107461, 126576, 59250, -25029, -52332, -130989, -106689, -13973, 88194, 146639, 114801, 11485, 6775, 20151, 56468, 101345, 112898, 86517, 68372, 74935, 41758, 5081, -20395, -71885, -94952, -89504, -55096]
24336e5096N2415J5630J4965J9876J0752j1019m4279n5057K4966M2754j0319m7687
24324d2099J2196L6630L3391P188l8320M7950L5865m1445m7906k994J3673L3151
24312D7280N1612J2558l6321j3142k4447K2336l4314l337m4121m601L9865L8079
24300E1447j459p664k8944J6168Q6704m0773n9300J2247o1734l6534N757J7188
24288d6897n88q956K291m3380L6787Q3133L4089j8331l9661l8494J3406L3882
24276G281l1971n7589q296l8098O510N5103J04553L3083k2062L8989R787k1948
24264G5342l0668k6139j7941m0521k8637L9569K5314q149l067l7211N480j04M030
24251d2702K7377J6945m938K127k6737m0439l0502J3852J2554P9509L1993k7479
$$ y = [-55096, -2681, 12949, 27914, 47790, 58542, 47523, 3244, -51813, -26847, 15907, 5588, -42099, -29903, 6727, 40118, 47306, 8986, 56936, 92801, 51356, 3450, 456, 14129, 47280, 98892, 111450, 75129, 61987, 37540, 59876, 25562, 22225, -21896, -26497, 13368, 51447, 49988, 42324, 13380, 29548, 116252, 75479, 16179, 28426, -33308, -69842, -64085, -46897, -47485, -56441, -54150, -97530, -60743, 22390, 56479, 38148, -1513, -40007, -26601, 7281, -24690, -82279, -90575, -128673, -122163, -67060, 37493, 70576, 48514, 87503, 97290, 75342, 44674, 18535, 594, -39927, -68564, -28995, -3681, -11830, -14897, -52108, -46628, -46732, -42702, -15325, 1620, -3318, -1191, -27928, -68367, -98869, -85017, -72463, 7046, 39039, 11560]
24239A1560N41O246L4177M3907j9785J4022k3479k8671l9466p8346p356J2269
24227g4381k526J5449k316L7313J0682j4846R875j3718n3554M4999O396o5878
24215a02505P1387N0357K0628k3315m0017r388M399L0363j3157l8006M944j6746
24203f1056o468n410K1790j2505L088m180k154P074M8412q203n0408J619r8791
24190a67192q998M8023K6839O4926J9410K0087J8538l4710j8213M5595N4258n6125
24178A2438k7205Q840L6685K2754p2701J453L2686r29J2582Q499M931M1396l5262
24165D6167k9742j2299L1072K3005K3951m2151m3061k1261K8366m580j140L89
24153a284M5037K2625p643j4586L0945k0559m3262K3123l5354j732k126j5988
$$ y = [11560, 12101, 18347, 52524, 96431, 76646, 90668, 67189, 38518, -948, -79294, -86650, -74381, -76907, -61458, -63774, -26461, -15779, -30625, -20750, -34468, -88022, -43023, -36627, -102505, -31118, 19239, 39867, 16552, -23465, -32853, -28454, 1909, -11248, -49254, -44310, -61056, -67524, -72934, -51144, -63649, -60561, -64741, -66895, -59821, -11409, -19612, -70020, -68401, -167192, -176190, -128167, -101328, -36402, -16992, 3095, 21633, -13077, -31290, 14305, 68563, 12438, -14767, -5927, 30758, 53512, -19189, -17736, 14950, 14021, 26603, 35102, 40033, 81429, 46167, 16425, 4126, 35198, 58203, 82154, 40003, -3058, -24319, 4047, -533, -1673, -1284, 43753, 66378, 58735, 44149, 75094, 54535, 11273, 34396, -958, -2690, -4816, -20804]
24141b0804Q0901R8264j7969n0066j2845n2173q4376J9878j6846J1656M5953J3231
24129A4804n9629P2735J67j0377l7070Q739M8078Q234l6864j6928J9022o406j3748
24116i243J2098l5549J3358N7188J2787K0140J8119k9651o1204L1510j8811m923
24104E819o772O642k3726M2719M0308j0083J3221n6844k738P3867K5340K703q031
24091A02425k1091M88o5242k6513K5910j7785n3036j5094L5473M2897m543o9150
24079f5261m2934L9871J2346j4016J58N5997p893n2298m6765k6420K7453K9798
24067h9964j7103m4621K1528P9892M103n1641N2431M8837j8687J2762K5554J5652
24055C8743R964p227k6717k459O875K3599N393k6810k892l9615J9454m142L1707
$$ y = [-20804, 60097, 158361, 140392, 90326, 77481, 25308, -59068, -39190, -56036, -44380, 1573, 14804, -44825, 27910, 28077, 17700, -19370, -10631, 37447, 45681, 8817, -8111, 10911, 4505, -9243, 2855, -32694, -19336, 37852, 50639, 70779, 88898, 59247, -1957, 29553, 10742, 5819, -953, 5689, -18037, 24682, 64990, 54907, 68128, 11284, 8546, 82413, 107753, 110456, 102425, 81334, 81822, 16580, -9933, 15977, -1808, -54844, -69938, -34465, 8432, 3889, -65261, -108195, -68324, -55978, -69994, -69836, -13839, -21732, -74030, -120795, -147215, -119762, -89964, -107067, -151688, -130160, -50268, -46165, -97806, -45375, 3462, -15225, -2463, 23091, 38743, 48707, 41480, 14763, 12304, 19179, 42778, 48171, 21361, 18469, -21146, -1692, -5834, 25873]
24042B5873O5596K2273j0517l0540l763j5972l0197K0056j8844j7268L0984j0077
24030B7604l0917l9406R406M8635O809L9607p333j6258l3741k2519n493m2137
24018f5743j187j6110K0372M4658K0661M7836K3265o500n0999n344J2790K2648
24006D6347l3583o7906o84j2827o618m4591m8438L5336k1763O7700J00555L2064
23994D5592j3186m3185j064O488l9510p323K836m0056J8810p918N9733M395L6282
23981B1894Q566p0817p0563j2051J8763P277O383L4517M280K163J9508K5739l3552
23968c7893l5126j0305K0575K3761l9303K2930O7424P1762K3292j7606j0459K8342
23956A07394m0808K330J0029N96p4645o1883J6679p357J0245L7497J2301m776
$$ y = [25873, 91469, 113742, 103225, 72685, 68922, 52950, 22753, 42809, 23965, 6697, 37681, 27604, -3313, -42719, -33313, 15322, 22131, 61738, 54405, 38147, 4406, -18113, -23606, -65743, -66930, -83040, -62668, -18010, 2651, 50487, 73752, 67252, 16253, 10909, 23699, 46347, 12764, -55142, -55826, -68653, -75271, -119862, -168300, -132964, -154727, -87027, 13528, 45592, 32406, -10779, -11843, -5355, -44865, -52188, -49352, -89408, -70598, -78516, -18783, -14388, 21894, 30460, -40357, -110920, -122971, -104208, -96931, -90548, -56031, -51751, -49588, -30080, -4341, -37893, -73019, -83324, -62749, -38988, -78291, -55361, 12063, 83825, 107117, 89511, 79052, 107394, 66586, 68916, 78945, 79541, 4896, -56987, -40308, -47665, -37420, 77, 12378, 7602]
23944G602k9404l3003O2176K4132L8397J6475n3751o2203l386J0577l0716j9891
23932g2995O1608P081o2695q0597O8070M1728P8040K2879k8778m9197l0030M0817
23920d069K2511o2487l5917j396K0247P4217P351K2098M1500j7019m0352m0981
23908a4297j2398n5840N8710N5651j3343J5109M2374o270n5343n2697l4070k5368
23896i7782M1350J6348K7822P767o0473k4972L1142R3004k275p1027J6762O3903
23884D1569L1360L276m6749l8427K6107K2170n981L8882O4053N5778r2722n0032
23872D9284J358J243p113J3162o954k9166j8616l0189p516K3578q839M0239m5049
23859b4578o4366q079J552M3581K4647K6450O4841R6723l1827m2511o544O8811
$$ y = [7602, -21802, -54805, 7371, 31503, 69900, 86375, 32624, -29579, -32965, -22388, -53104, -72995, -11387, -4306, -67001, -147598, -79528, -37800, 40240, 63119, 34341, -14856, -44886, -4069, 18442, -44045, -79962, -81358, -61111, 13106, 20457, 42555, 84055, 67036, 26684, -14297, -26695, -82535, -23825, 31826, 18483, 33592, 75966, 69696, 14353, -38344, -72414, -97782, -56432, -40084, -12262, -4495, -64968, -89940, -58798, 34206, 31931, -39096, -22334, 41569, 72929, 76205, 29456, -8971, 17136, 39306, 33325, 72207, 136260, 192038, 99316, 49284, 50642, 51885, 44772, 57934, 50980, 21814, 3198, -26991, -34507, -10929, -19768, 20471, -24578, -88944, -97023, -95471, -51890, -27243, -793, 64048, 160771, 128944, 86433, 79889, 148700]
23847A48700J5428L0851J7756q973k3820o8372J5703M2783j7570J8698r638l9068
23835A22478N680k0026j7841l7511j4395j6613K6573N907j4882o2979m7165j4842
23823h5616L8758K4786N6837K5425j3256m3936K3735j3852J0269K0595M879k64
23811D8360K0931q6294m1443J5424j2942K7026M1072P8727k7839J72J2940K0128
23799I6262r818k6979l9661m8076l3588R619l225J4704J6690J217R420m5099p655
23786f6189J9428R100j7572J0351J5835k7674O38J6007P789L0224p460j4197j5174
23773c8894l2853L2456O4734J4513l7854k1555l2893k9798N2388K9845P5123q200
23761F7012n8726J8626M2586m6452o1364q650j3184J5661j9256l8473K7370M1630
$$ y = [148700, 164128, 194979, 212735, 203762, 179942, 111570, 127273, 170056, 152486, 171184, 161546, 122478, 128158, 108132, 90291, 52780, 38385, 21772, 48345, 54252, 39370, -23609, -70774, -85616, -46858, -22072, 34765, 60190, 46934, 2998, 26733, 12881, 23150, 43745, 48624, 48360, 69291, -17003, -58446, -43022, -55964, -28938, 12134, 90861, 63022, 63194, 76134, 96262, 86444, 59465, 19804, -28272, -61860, -52241, -55466, -40762, -24072, -22855, -13435, -58534, -66189, -46761, -37661, -55233, -44882, -29047, -56721, -56083, -40076, -32287, -2063, -9523, -23720, -38894, -71747, -39291, 25443, 39956, 2102, -19453, -52346, -82144, -29756, 89, 75212, 67012, 8286, 26912, 69498, 23046, -38318, -46968, -60152, -44491, -63747, -102220, -74850, -33220]
23749c3220O8806N0010L3277J9588k8389o9032l6765M4656q219m874O684O0428
23737A02950k1672Q048l184L644k8024M826N2291l7614n0644j2556l9597p1659
23725i3191K2094L6207K0604K7983N1499K1981m6512p0645q407l834L3383J9430
23713A0592J3967J9905l5777J7629k9261J1188N3753K1820k2350k0971K9408m680
23701F5223l0972n6573O92J0685j4582q837L8954K739J1316O1856J2896j1525
23689H1872j5839m9331n0467O8887J0294n4230k3444N1356J9329l2981n071R962
23677A0337Q7166L744l8948j2339n0997J1097O5894j0978n1901p88n281L5697
23665D2703m275q4306l0388N638Q071l9018J5598l276j0088K7386M1917N3447
$$ y = [-33220, 35586, 85596, 118873, 138461, 110072, 41040, 4275, 48931, 40712, 35838, 42522, 102950, 81278, 89326, 86142, 89786, 61762, 66588, 118879, 81265, 30621, 18065, -21532, -93191, -71097, -34890, -14286, 13697, 65196, 87177, 40665, -29980, -38387, -42221, -8838, 10592, 24559, 44464, 8687, 26316, -2945, 8243, 61996, 83816, 61466, 40495, 69903, 65223, 34251, -22322, -21630, -10945, -25527, -34364, 4590, 7329, 18645, 80501, 93397, 81872, 66033, 16702, -33765, 35122, 45416, -8814, -32258, 19098, 38427, 5446, 375, 10337, 97503, 101247, 62299, 49960, -1037, 10060, 75954, 64976, 13075, 12287, 7006, 42703, 38428, -45878, -76266, -70628, -62557, -101575, -85977, -89253, -99341, -71955, -30038, 23409]
23653B3409m399n1974j0658K216M6713M0359n0043p686Q389k096K4312J9111m850
23640C2803r277l3925k3853R368M4106M3308M7239M2520n1550k9114m1576l8711
23628h662r088L2622o166l3615k3106K9789N1417J7110L6341l0274p977O720l747
23615E1364O161m1579k5856N23k0295K6458N9524k5240k3625l7344q2196k4375
23603a36480L8865K1098L4354k3850k7160N3481N0143K2066k0716l8307l721L8845
23591H618m4878J8179M4386K0695o1736j9835l7807k5297M7649J9038J0864N479
23579a4645O0790N243j7305r824P310J1472j0455q538j4928l2351M6153j2362
23567A0560N2992k8331n3563j7322L6170k1070m7419j9178L0517Q5463O811q477
$$ y = [23409, 19010, -32964, -43622, -41406, 5307, 45666, -4377, -12063, -3674, -5770, 18542, 37653, 32803, 23526, -10399, -34252, -24884, 19222, 62530, 109769, 152289, 100739, 71625, 30049, -8662, -17750, 14872, 8706, -24909, -48015, -18226, 33191, 50301, 86642, 56368, 48391, 55111, 51364, 57525, 15946, -9910, -9387, -29682, -3224, 56300, 31060, 7435, -29909, -112105, -136480, -97615, -76517, -42163, -66013, -93173, -39692, 10451, 32517, 11801, -26506, -30227, 8618, -36260, -18081, 26305, 47000, -14736, -34571, -72378, -97675, -50026, -30988, -20124, -14645, 46145, 51388, 34083, 24259, 31569, 43041, 32586, 24048, 9120, -23231, 22922, 10560, 63552, 35221, -18342, -35664, 506, -20564, -67983, -87161, -56644, 28819, 35630, 27153]
23555B7153m1323k2246J4778O6304O3748n5501q3911p1172P779r896l4621p237
23543a46145J2951j7523M0226N8004K7086k2496K2331K9333m8647k5535P0994
23532E79J2767J4560L3054k6492j8525K4359k1291k5569K1572K837l5233J7874
23520D92j1953l2925M2344j6789K6830K5931l2163J814r017j9712J445N1066l0513
23507c150j0972n774J5559j0128K7329j7074J6471o660m3472K3961P9150j0109
23495E5131n2712j0203j5322j4302l3793k6756L2897P5134L3997j7936l7326N2084
23483D0893O679q8624m4076r644j0551P4968N5132m0867N287M2075q212l5879
23471a2819n4903n869N1931l191o998L6787J1211m332q26J6582k5401k9889R947
$$ y = [27153, -14170, -36416, -21638, 44666, 108414, 52913, -30998, -102170, -94391, -104287, -138908, -146145, -133194, -150717, -110491, -52487, -25401, -47897, -25566, 3767, -44880, -70415, 579, 13346, 27906, 60960, 34468, 15943, 40302, 19011, -6558, 15014, 17851, -17382, 492, -11461, -44386, -2042, -18831, 7999, 33930, 1767, 3581, -5436, -25148, -23703, 27363, -3150, -14122, -19896, -4337, -14465, 12864, -4210, 12261, 5601, -37871, -13910, 65240, 55131, 2419, -7784, -23106, -37408, -71201, -97957, -65060, 10074, 44071, 26135, -11191, 40893, 47572, -41052, -85128, -94772, -105323, -30355, 24777, -16090, -10803, 31272, 23060, -12819, -67722, -73591, -21660, -24851, -31849, 4938, 16149, 11817, 10991, 27573, 2172, -27717, -17770]
23458a7770O9948K5108k172j4479n3087k0558K8772r462j9014m0724m1148K6430
23446f8156M0016J9904j5983R470K8085k0034M153J174o6726j5176Q586M4874
23434b9813K7973J6192K2618j6893o870L060o699m435k6585m2348j0363M5652
23422b8511L3921l431J6618p365k5432k405J1426O2854K0410m5811j7567j20k2433
23409g846j050l303L5572P2898j421q813l9712Q750J0173o010j8639r0399Q605
23396d1195j8405L3706K2881K8939L019K3049J1594l2227n4810J9456K7515M8225
23384G1747L6860l9698n7039r577k7131J2100P7619N563k7226L4925j5376j6620
23372D6147l9540J3895J4276K0625l228j04392p0614m690J05802M5408m8812K0792
$$ y = [-17770, 52178, 77286, 75114, 60635, 7548, -13010, 15762, 6300, -12714, -53438, -94586, -68156, -28140, -8236, -24219, -14749, 13336, -6698, -2545, -1371, -68097, -83273, -74687, -29813, -1840, 14352, 36970, 20077, 13207, 16267, 9568, 5133, -21452, -63800, -74163, -28511, 5410, 1979, 18597, 11232, -14200, -16605, -5179, 57675, 78085, 32274, 14707, 14587, -7846, -8896, -12199, 23373, 96271, 94850, 86037, 46325, 55075, 65248, 59238, 40599, -49800, -41195, -59600, -25894, -3013, 25926, 28945, 51994, 63588, 31361, -23449, -3993, 23522, 71747, 108607, 68909, 11870, 2293, -24838, -12738, 64881, 70444, 43218, 78143, 62767, 46147, 6607, 20502, 34778, 55403, 52175, -52217, -122831, -127521, -21719, 23689, -25123, -4331]
23360d331J1658N1802J5168K5468J6713n8576n1673n8134k7412J3501N0155K6113
23348A0452K0864j6789k1787K9749N6684n609j02618l6869M3025j591n1789N923
23336g0355O7423M6402l0866n763J7853k3518k9835N8868J5528j9555q3846m0131
23324i7795K2429r015L2893Q2432N4293j5413O486K7117o7967j3596J5900o9413
23312c1649K2577K9836l631O300n184j0551m4059n1898j2845L8783M4624K3323
23300E626k4308j4944p477m936m541N7581J489l3465j085P509K5527r235K0314
23287A8055K5090R193m2877n046P4223k1760k1924M8192l9555K0173J2887o2303
23275A4348o1429L1147R5452M1275l7398J4918K2068n3560l5007k5987j830K7806
$$ y = [-4331, 7327, 59129, 74297, 99765, 116478, 57902, 6229, -51905, -79317, -65816, -15661, 10452, 31316, 14527, -7260, 22489, 79173, 73564, -29054, -65923, -22898, -24489, -76278, -70355, -2932, 43470, 12604, 6841, 24694, 1176, -28659, 30209, 45737, 26182, -57664, -97795, -75366, -84381, -51488, 30944, 85237, 69824, 76310, 103427, 35460, 21864, 37764, -31649, -9072, 20764, 17133, 23433, 18249, 7698, -36361, -88259, -101104, -62321, -17697, 5626, -18682, -33626, -41103, -46039, -50580, 7001, 8490, -24975, -26060, -18551, 6976, -2259, 18055, 43145, 52338, 9461, 4415, 78638, 56878, 34954, 83146, 43591, 63764, 76651, 14348, -47081, -15934, 79518, 120793, 83395, 98313, 120381, 66821, 31814, 5827, 3997, 31803]
23263C1803K4842M5602k2970Q962J4720J5563P450j3174M814L7987n3087r2648
23251I864k2649n6022L0836m757N0713j8023p0494j3852K8724J297j148L6219
23239b9292J00531K2603k0012k8920l7752N015j3666N740n1678O652O420K4550
23227i809m736K3830M808k0845L4267j0013J4095L97R193o1819l0492k083n08
23214e3715K4186K9053M8532L5544R41L3463M1693m7033j43821n0441M7742O1494
23202B7638N1676J8712l1844k0570L1498l9162N0J5474o891n3847l1972M1920
23190B682j2393q478m5383K8777j556J9454j3179L001J9431k2975L1265N9203
23178E9849K5014k8691k3175R725l8353J7499k174k6005k3993j7212Q975N122
$$ y = [31803, 56645, 102247, 79277, 88239, 102959, 118522, 125972, 112798, 117612, 155599, 102512, 9864, -12785, -68807, -37971, -42728, 7985, -10038, -80532, -94384, -65660, -64363, -65511, -29292, 71239, 93842, 73830, 44910, 7158, 12173, -1493, 4247, -47431, -40779, -34359, -9809, -14545, 9285, 14093, -6752, 27515, 17502, 31597, 31994, 41187, -20632, -51124, -53207, -53715, -29529, -476, 48056, 83600, 84541, 118004, 159697, 112664, -31157, -81598, -33856, 27638, 79314, 98026, 66182, 45612, 77110, 37948, 37998, 53472, 46581, -7266, -39238, 2682, -9711, -18189, -63572, -34795, -36351, -16897, -30076, -27075, -7644, -30619, 646, 59849, 84863, 56172, 32997, 42722, 4369, 21868, 19694, -6311, -30304, -47516, -38541, -33419]
23166c3419J3942m0803m4830N7424P3414J3531j4882k1827p068K1901L7693j5829
23154C9247k8530k6883l0942j8896M1645j6831M0682Q808M6831r784o175J2012
23142E1184O545m905j18915m0527k0298j8262O0406R8003O386j1629L6278k4986
23130A9280m2680l3883J1517N2557K8108k8803J008o739R875K8508N1627k1065
23118F9310m822O7370j4146m9952l0897p5769R719J0947M7648R559K1284j9337
23106D0914m5749J8895K4899L0666j5374O816j2016j5445J6090k0449k5478K4967
23094B8736j4251L0751N1494j6764m500m3557K5875M9454m1475l9361N5341J3629
23082I5372p401m3676n3092q094K3385k1188N8402R144L098p1672m112L4127j8566
$$ y = [-33419, -19477, -60280, -105110, -47686, 25728, 39259, 24377, 2550, -4518, 17383, 55076, 39247, 10717, -16166, -47108, -66004, -24359, -41190, -508, 8300, 55131, 45347, 39172, 51184, 57729, 52824, -66091, -106618, -126916, -145178, -84772, 13231, 19617, 7988, 44266, 19280, -23400, -57283, -45766, 6791, 34899, 6096, 7104, 365, 10240, 38748, 90375, 69310, 64488, 131858, 117712, 67760, 36863, -38906, -29187, -18240, 29408, 38967, 60251, 40914, -4835, 14060, 38959, 69625, 54251, 61067, 49051, 33606, 49696, 29247, 3769, 28736, 14485, 45236, 96730, 79966, 75466, 31909, 57784, 107238, 65763, 26402, 81743, 95372, 87971, 44295, -8797, -16891, 6494, -14694, 43708, 52852, 55950, -15722, -19834, 14293, -4273]
23069d273l050M7217M9182J1745o755l1724J25K137o2814k4218N2164N5400k1740
23056F3396l2083l0949N7564J5671n1965j9053k655K3231l1686N2149M4060L6601
23044A24281n6369o8606j2095j1878Q40N7299O492m8548L0797L3464J9311L4912
23032A09900L4926m6295n8155R093K8176p2120N5247N8585L8749n9442n0329m0388
23020G947k1687K2851o142L5844J0031J4068N737j9198Q646p1429m8934j0108
23008g2374K3492K3900N3064J9797J4622l0070K6294O7645J4486o1460n4355J4499
22996C9540K8257J895l6929L259K9098m5438n5330M5701J0823J4085m5606m6597
22984e7242K1342K9010O0993k8127m8771P57M3636J013k6718M19j6776J6438J1260
$$ y = [-4273, -7323, 39894, 89076, 100821, 94066, 62342, 62467, 64604, 1790, -22428, 29736, 85136, 63396, 31313, 364, 57928, 73599, 21634, 2581, -74, 23157, -8529, 43620, 87680, 124281, 67912, -694, -12789, -24667, -23827, 33472, 39964, -8584, 22213, 55677, 74988, 109900, 144826, 98531, 40376, 49469, 77645, 5525, 60772, 119357, 158106, 98664, 48335, 7947, -13740, 9111, 2969, 38813, 48844, 62912, 68649, 49451, 58097, -13332, -62266, -72374, -48882, -24982, 28082, 47879, 62501, 32431, 58725, 126370, 140856, 79396, 25041, 39540, 67797, 69692, 32763, 36022, 65120, 19682, -35648, 10053, 20876, 34961, -10645, -57242, -35900, -6890, 54103, 25976, -22795, -22038, 21598, 22611, -4107, -3688, -20464, -4026, 7234]
22971G234M1255M1489m1941q8636n5629K4817L2166j4418K1318N2840o438l6432
22959b2375n1641K7228N7057J210k5422j9055K2443O7192k0558j8564k4451M6558
22947C9622J1672n6464j0770J7532k7994P481m409J4909m3639l6983K3984N6636
22935h423P6357K4685j6951j2965L1956o721n7728J4127M5425K7613k8458K2401
22923A11318N262k5123K4315J3235L6547n011o696m0441k9808J3811M9639M673
22911A51721Q408O641Q0091J1517N4867P3717J4420L8326M4267J03334J56517
22900G43826K29607M05806N37687N93633L38886J15911n0823l24452n70564n71560
22890A447957m17621k54319k16581j33787p9870r3153p2476k101j7410l0094j3780
$$ y = [7234, 48489, 89978, 48037, -40599, -96228, -71411, -39245, -53663, -32345, 20495, 14057, -22375, -74016, -46788, 10269, 11479, -13943, -32998, -10555, 56637, 36079, 17515, -6936, 39622, 51294, -5170, -15940, 1592, -26402, -18921, -23330, -8421, -52060, -89043, -65059, -8423, 67934, 92619, 75668, 62703, 94659, 87938, 30210, 44337, 89762, 117375, 88917, 111318, 116580, 91457, 115772, 129007, 165554, 160543, 153847, 113406, 83598, 97409, 147048, 151721, 160129, 166770, 246861, 258378, 313245, 386962, 401382, 439708, 483975, 587309, 743826, 973433, 1379239, 1916926, 2510559, 2849445, 2965356, 2914533, 2590081, 2019517, 1447957, 1030336, 776017, 559436, 425649, 345779, 252626, 180150, 178049, 160639, 130545, 116765]
22879A16765L0492n191m8451L7205M0785K098j759l8249l9710j2088k9535J9732
22867G2094k6671J5866M4436j3503l8246o1891p325j5189J3666O7376K1992r50
22855G1655j2789j3171l7353M1292Q4177j3210J5529o127O221R520J642K0773
22843A68159k3551j0076m3278l2778O496m0411k2612K7306P730j3635K580M5646
22831G1576m2345l3382k5416l464o1280J8716N220O5271J7305M7101k633J1043
22819F7712M0736K6923p6332R64M1094J1248n469K9522k1887K2956n5227j05133
22807b2893r3709j23639m2552M467J0838L8960P5979K4301J7659O1783L4942R9235
22795H5371N1320n7957n2014L433k3522k3666J2472O3615O530J455l2394K9238
$$ y = [116765, 147257, 142066, 93615, 130820, 171605, 173703, 171944, 133695, 93985, 81897, 52362, 72094, 45423, 61289, 105725, 92222, 53976, -7915, -15240, -30429, -16763, 50613, 72605, 71655, 58866, 45695, 8342, 49634, 133811, 120601, 136130, 130003, 136224, 145744, 147386, 168159, 144608, 134532, 91254, 58476, 64972, 24561, 1949, 29255, 36985, 23350, 25930, 71576, 29231, -4151, -29567, -33031, -94311, -75595, -70375, -5104, 12201, 59302, 56669, 67712, 108448, 135371, 59039, 60003, 101097, 112345, 106876, 136398, 114511, 137467, 82240, -22893, -116602, -240241, -282793, -278326, -267488, -228528, -152549, -128248, -110589, -48806, -13864, 85371, 136691, 78734, 26720, 30153, 6631, -17035, -4563, 59052, 65582, 67037, 34643, 63881]
22783F3881k2064m1024L1747k5083J2106P7263R528p6827l534M4647P9255J9863
22771A69758n9192P644j7044n8108p921n07n81j8170r787q985l5016j1460Q0093
22758C0724J6090J7405m610j0910k2842Q521J0846J5091J4486J6525J00646r173
22746A82799p9325k5656j3701J7921N588L0216k8156r1246p713L1473O1750p384
22734G6566l2185O5940K8909n3789J65k6628j0772j7359J3580j5140P266P8474
22722A15027L5386M110k2552j7897o9023l3558O9758M3049n4221K438j4391l4950
22710B3176P4859L4557j8141j6204R932j8859J4587J229M6959m5570r641P314
22698A04198J1030J7948Q014o887k1565K155q917P462j0485j590J7801M1016q491
$$ y = [63881, 41817, 793, 32540, 7457, 19563, 96826, 106354, 29527, 25993, 70640, 149895, 169758, 110566, 118210, 101166, 43058, 35137, 34630, 34049, 15879, 6092, -2893, -37909, -49369, 30724, 46814, 64219, 59609, 48699, 25857, 34378, 45224, 60315, 74801, 91326, 191972, 182799, 103474, 77818, 64117, 82038, 87626, 117842, 89686, -1560, -9273, 22200, 83950, 76566, 44381, 110321, 139230, 85441, 85606, 58978, 48206, 30847, 44427, 29287, 36553, 115027, 150413, 154523, 131971, 114074, 45051, 11493, 81251, 124300, 70079, 72517, 58126, 23176, 98035, 132592, 114451, 98247, 108179, 89320, 103907, 105136, 152095, 106525, 96884, 104198, 115228, 133176, 141190, 134303, 112738, 114893, 105976, 113438, 102953, 101363, 119164, 160180, 151689]
22685A51689m3771j4825l7810J1442M2013N0376K6146k259k9137L1476L9901n0426
22673A74815k2758j0329j3742L281p176j960N6832L8566k6618k6854j601j5495
22661A46961k1990P828q822p9280m5208K4560M3166K3596P0211j0982p0267o6627
22649A3146j3914L0109K0447K6574m0791m8419R005M7703N8302j5702n3196k661
22637C0603L1681k5776j3683l8883k8839R662n3275L2765M6100o291K0855L0639
22625C5558K1040j0996M8523J9337l4133n8487J844L4049Q4752O1082j2236k2942
22613A67391m752j1726k6199q0453k0453k8196L5219L1949m475K8144l3204k7612
22601B5633J1098J1179L5780Q3434Q0398J28252P0932j7756K4887j0919m11o194
$$ y = [151689, 107918, 93093, 55283, 66725, 108738, 159114, 185260, 183001, 153864, 185340, 225241, 174815, 152057, 141728, 127986, 131267, 124091, 122131, 178963, 217529, 190911, 164057, 162456, 146961, 124971, 132799, 123977, 44697, -511, 24049, 67215, 90811, 161022, 150040, 79773, 13146, -768, 29341, 49788, 76362, 35571, -12848, -3843, 43860, 102162, 86460, 33264, 30603, 62284, 36508, 22825, -16058, -44897, -35235, -88510, -55745, -9645, -15936, 4919, 35558, 56598, 45602, 94125, 113462, 79329, 20842, 22686, 56735, 141487, 202569, 190333, 167391, 162639, 150913, 124714, 44261, 23808, -4388, 30831, 62780, 58305, 86449, 53245, 25633, 36731, 47910, 83690, 167124, 247522, 375774, 446706, 428950, 453837, 442918, 442507, 436313]
22589D36313l1821j2986j3083k7713j7845K9201o2634j2839m1768L9192J005n6915
22577B28107j4031j511n2677r8501j9961P4169N17O585j9994k1047L1420m0400
22565G2676l2630P3192M6513K4699l0312l9949j1755N4446M366k6623p9484l6875
22553A8264O775K6586l3135N2205J13130l0756n9500Q291O077M5601O1927m4662
22541A70803k0111L8383J490k3455m5865l4055o6448n3019j2806l0814M4950J5947
22529a5000L6953L3447O8440R9505O0594K1117l5979k6707O282j4707j0431l7614
22517A85900L2862j8173j5223l3020l4594k5693M9978P5316N6731l4830n8593
22506A80661m1710N3535R7501P7828M7618R4292J06335J91430K36396J75209P6949
$$ y = [436313, 404492, 391506, 378423, 350710, 332865, 362066, 299432, 286593, 244825, 284017, 285022, 228107, 214076, 212565, 159888, 61387, 41426, 115595, 116112, 122697, 102703, 81656, 113076, 72676, 40046, 113238, 159751, 184450, 154138, 114189, 102434, 156880, 161246, 134623, 55139, 18264, 25039, 51625, 18490, 70695, 183825, 153069, 93569, 101860, 107937, 153538, 215465, 170803, 150692, 189075, 190565, 167110, 121245, 87190, 20742, -32277, -45083, -75897, -30947, -15000, 21953, 55400, 123840, 223345, 283939, 305056, 269077, 242370, 248652, 233945, 223514, 185900, 218762, 200589, 185366, 152346, 117752, 92059, 142037, 217353, 274084, 239254, 180661, 138951, 192486, 289987, 367815, 415433, 509725, 616060, 807490, 1043886, 1219095, 1296044]
22495A296044L609k1597r7932k13951j84938j84658p0949J8787N512l109M7119
22484E93937k1636j9941o682k1571l0134q0350K780Q3605P4767K5743O976L0165
22472F37659J12807J05654J54271K40191J70619j5223O6232Q8144j18955k21928
22462A219471l13748k30646j96787j18965p1402r5430j8309R6242J03180O3346
22452D36952P1851N683m5497m9698n6353n8003O937J6057l932O6248Q7217J3525
22440D90987O3214l5955J5744O1878J2037j7217M8187P691O3083R3313Q4358O6617
22428I53937N3179K7539J00088K01429L19880N31165O04719M58407R6456l0614
22418C316185P2115j59486n45178n87241m07623k51769j35501p8536r9640q1940
$$ y = [1296044, 1299653, 1278056, 1180124, 966173, 781235, 596577, 525628, 544415, 549927, 546818, 593937, 572301, 552360, 545678, 524107, 493973, 413623, 416403, 500008, 574775, 600518, 607494, 637659, 750466, 856120, 1010391, 1250582, 1421201, 1405978, 1472210, 1560354, 1441399, 1219471, 905723, 675077, 478290, 359325, 287923, 192493, 174184, 270426, 373606, 436952, 508803, 514486, 468989, 419291, 362938, 304935, 311872, 327929, 323997, 390245, 477462, 490987, 554201, 518246, 533990, 595868, 607905, 590688, 638875, 646566, 709649, 802962, 887320, 953937, 1007116, 1034655, 1134743, 1336172, 1656052, 2187217, 2791936, 3250343, 3346799, 3316185, 3388300, 3228814, 2683636, 2096395, 1688772, 1437003, 1301502, 1222966, 1123326, 1041386]
22408A041386k6967Q82L836m592M791l2917K2827M4562J4674O8071O7213P8901
22396A282667J59401J34993M6178j3021j3445J10980J15695K0458L4643O1951
22386A940500J23526N8531R8993Q1466J09104Q0079P7724J62501J70308J78522
22376C081254L01981L79928L90337M01764M80115M92706N47288N98967O39506
22367G313846P19670Q93212R38187R70659J099305J261266J417621J613728J736750
22358A7964244J893928K086888K370355K889321L533720M304497N148660O270035
22350D6461648Q091645J0885572J4970098K0715716K9947990M8588154Q1363618
22343B61024441J14189181J03214855M2581459J078584L080721l9342231j09223735
$$ y = [1041386, 1014419, 1015301, 1019137, 1014545, 1019336, 986419, 1009246, 1053808, 1068482, 1136553, 1203766, 1282667, 1442068, 1577061, 1623239, 1610218, 1596773, 1707753, 1823448, 1843906, 1878549, 1940500, 2064026, 2122557, 2221550, 2303016, 2412120, 2492199, 2569923, 2732424, 2902732, 3081254, 3383235, 3763163, 4153500, 4555264, 5035379, 5528085, 6075373, 6674340, 7313846, 8033516, 8926728, 9864915, 10835574, 11934879, 13196145, 14613766, 16227494, 17964244, 19858172, 21945060, 24315415, 27204736, 30738456, 35042953, 40191613, 46461648, 54553293, 65438865, 80408963, 101124679, 131072669, 179660823, 261024441, 375213622, 478428477, 521009936, 522088520, 525169241, 485827010, 376603275]
22336C76603275j15424273q1035219n3933484l5266387k3303559j5915971j1010009
22329D0714373p938736o194547m975202l953994l162478k443741j866386j413268
22321H766021j059012q87295p39960o32281n25825m51928m47176l24890k67539
22312C430115k75645j61559j04551j36018r6849j40962j29569r9007q5751j57009
22302B043195j58828q5870j8356j54821j70355j59576p3028j10748r6486l9775
22292I75352m4896j3607m4512j08976k4908n3288q009M1229L6900M9115P9686
22281H84086m2929j2306l2452J982n1701k1569m435J0961m2351m6138Q81N6574
22269G00603O3623O1543N1305J24239K05882K35409L45468O00314P13511M95308
$$ y = [376603275, 261179002, 180143783, 126210299, 90943912, 67640353, 51724382, 40714373, 32775637, 26581090, 21605888, 17651894, 14489416, 12045675, 10179289, 8766021, 7707009, 6819714, 6079754, 5447473, 4921648, 4469720, 4022544, 3697654, 3430115, 3154470, 2992911, 2888360, 2752342, 2655493, 2514531, 2384962, 2285955, 2200204, 2043195, 1884367, 1798497, 1780141, 1625320, 1454965, 1295389, 1222361, 1111613, 1015127, 975352, 930456, 916849, 872337, 763361, 738453, 685165, 677156, 718385, 755285, 804400, 884086, 841157, 828851, 796399, 798381, 746680, 725111, 720676, 731637, 689286, 643148, 644029, 700603, 764226, 825769, 877074, 1001313, 1207195, 1442604, 1788072, 2388386, 3101897, 3597205]
22259C597205Q6120k45132m82297p39983o90191m62294k88051j44227q9060n1856
22249D90234k8606L2378k9955m9179p0049r7681o5972q03J4782J045n691K243
22237A92746J9402N904p432k4422J2178L8539k5607J7590L109m6685m284j1935
22225A69103N1913J05465N1961K2160k2933l6556q596p391q5962o3030j7691p7986
22213H0457q9684K602N0405J5660O655l9261j3894m0342l6484j0421r081n9336
22201a42724l0378K645L1345l761j2366J4617M560J4854k6255l4253m3461j07431
22189c32608j19780j91469j82726m6625j7457n4735L0607J94070K93909J81512
22179b45302P5852O9531J0910m6926N1023M2616K6511J8777l707j6431L3090p679
$$ y = [3597205, 3683325, 3438193, 2955896, 2215913, 1525722, 1063428, 775377, 631150, 542090, 490234, 461628, 494006, 464051, 414872, 344823, 247142, 181170, 180367, 195149, 196194, 190503, 192746, 212148, 218052, 210620, 186198, 198376, 236915, 211308, 228898, 232007, 185322, 181038, 169103, 221016, 326481, 378442, 400602, 377669, 341113, 332517, 325126, 239164, 176134, 158443, 80457, -9227, -6625, 43780, 59440, 66095, 26834, 12940, -27402, -63886, -74307, -83388, -142724, -173102, -170457, -139112, -142873, -155239, -140622, -136062, -121208, -147463, -181716, -225177, -332608, -452388, -643857, -826583, -873208, -890665, -945400, -914793, -720723, -426814, -245302, -169450, -99919, -89009, -135935, -84912, -42296, -15785, 2992, -715, -17146, 15944, 8265]
22167H265J5215J9162q408l5759l2115p140o975k8651n5349J4660J4397J968n496
22154a06226L1513O0519J34122P9795M9324K7094o3334p1318m8489q0456m0534
22143b7990l9402P504O6290M057J9938m618m2446K2946M7409O5739K0467J6348
22131A56242l561J6695p2312J6902K466L9358M025m6941l113J230l5747l0319
22119D4925m3134l9728l9351p285m996L2029K6123l809O511L0238L0837j9032
22107A3328J1559l5483k5284K3409k897O6595K6297J6766K3585n0457q477P847
22095F6788q6223j8919o257K828N7406J8656R996k0464k0459j8473l806M4831
22083B5904K6816K7801J936p056k9445m0953j0562M5546l743M4098K9346K5263
$$ y = [8265, 23480, 42642, 34234, -1525, -33640, -40780, -47755, -76406, -131755, -117095, -102698, -100730, -106226, -74713, -14194, 119928, 199723, 249047, 276141, 212807, 141489, 93000, 12544, -27990, -67392, -59888, 6402, 10459, 30397, 25779, -16667, 6279, 53688, 119427, 139894, 156242, 152681, 169376, 97064, 113966, 116432, 155790, 159815, 112874, 109761, 110991, 75244, 44925, 1791, -37937, -77288, -84573, -89569, -57540, -31417, -35226, -28715, 1523, 32360, 13328, 24887, -10596, -35880, -12471, -15368, 51227, 77524, 94290, 117875, 67418, 58941, 66788, -19435, -38354, -44611, -41783, 15623, 34279, 44275, 23811, 3352, -15121, -18927, 25904, 52720, 80521, 82457, 75401, 45956, 5003, -5559, 39987, 36244, 80342, 109688, 134951]
22071A34951l7856l3064o2891Q377J901J4670Q9063M6100l0357l1123n0301l7470
22059A2000k0906l3094L3394O4792r783l9917K4443J3648K5014J6446j4721O8230
22047A39546N2838l5147j8861j7581m6776n4762n8265p552l943j5871m2984M6536
22035f2822L5218n582N0070M9862J00740K944Q033j2125m8747m7682p4665j4251
22023a9007O5168R271p1607l0517j9649J3299N328q561k8584K5886Q5603O5417
22011I2047k1521l3103j1895o5584n563K3622k2229j453N8684j6818p704K0444
21999H927Q050k3946L7421J5816j1055J5117L1429l9605P815m0222k6470O648
21987a0075L0982q179j0377k4928m2333K3400P554n2958M5899K9139n2464k3232
$$ y = [134951, 97095, 64031, 1140, 9517, 11418, 26088, 115151, 161251, 130894, 99771, 49470, 12000, -8906, -42000, -8606, 56186, 46403, 6486, 30929, 44577, 69591, 86037, 71316, 139546, 192384, 157237, 138376, 120795, 74019, 19257, -39008, -46560, -50503, -66374, -109358, -62822, -27604, -33186, 16884, 66746, 167486, 170430, 178463, 166338, 117591, 69909, -4756, -19007, 46161, 55432, -16175, -46692, -66341, -53042, -47714, -56275, -84859, -58973, 26630, 92047, 70526, 37423, 25528, -40056, -45619, -21997, -44226, -45679, 13005, -3813, -11517, 8927, 16977, -6969, 30452, 46268, 35213, 50330, 81759, 42154, 49969, 9747, -16723, -10075, 20907, 12728, 2351, -22577, -64910, -41510, -33956, -86914, -41015, -11876, -64340, -87572]
21975h7572p520o22O5035L7423n2104L1507J7016K4572M429n174n219m216n3120
21962c5565p8694n0227l905q473k6591L2186L1086L0206K863J9664N0710K8010
21950h730M2413n3884n4671P668N0914n854r3246j1870Q5172O7714o066j4831
21938D729l7366m4677K9803k740J0976J8025J4075K1471J789l7257p2283j0744
21926a04199M6315K1826j6029J6885O0N1827P9410m6410l3744Q7291m2189m7485
21914A3558l4454j4580n222K6296L8830L6563p9246p0514k5787J07199J10388
21903A03031k1479J1895j9131m1276n2044K7005R133l3372J7873L3513J3249N62
21891D8959l9970j5750k889N8897O3617Q968j7605n4387l856m0567L0531l877
$$ y = [-87572, -95092, -95714, -30679, 6744, -45360, -13853, 3163, 27735, 32164, 26990, 21771, 17555, -35565, -114259, -164486, -168391, -176864, -203455, -171269, -140183, -109977, -107114, -87450, -36740, -8730, 33683, -20201, -74872, -67204, -16290, -22144, -115390, -127260, -42088, 25626, 19560, 4729, -32637, -77314, -47511, -50251, -39275, -21250, -7175, 14296, 16085, -21172, -93455, -104199, -57884, -36058, -52087, -35202, -35142, 16685, 96095, 49685, 15941, 103232, 61043, 13558, -20896, -35476, -40698, -14402, 24428, 60991, -18255, -88769, -114556, -7357, 103031, 81552, 93447, 74316, 33040, -19004, 8001, 17134, -16238, 1635, 35148, 48397, 48959, 8989, -6761, -9650, 49247, 112864, 121832, 104227, 49840, 45984, 5417, 35948, 32071]
21879C2071M220Q3549O2361L3726q875l6045k4958n8230p3111j32035j1968L8102
21867i1193M8295O3993o0002q9938j3094j4816Q986j694l045L0898N063N347j4733
21854a25933l6078n927K8169N0535L7036j821n6475o101j1265k281M8037L2016
21842e0088m4815o914K8164j9182M0428K8631m37j7472J773O5777P448j8226j3479
21829A608J683l61l5786l8341N7228M4256K637J501k655n7246n3322L996N362
21816f9440l3146k8826J7410J02594L8564N8475j8400n8248n2501N43J3694k776
21804c2057N311L0344L2079K1225l2325k3822L3317j413K2837m267K4722K6012
21792A01963q702L7545O3358Q97K7172M7363J0972J5839J3088P1387K04219K40302
$$ y = [32071, 36291, 119840, 182201, 215927, 207052, 171007, 146049, 87819, 14708, -117327, -129295, -91193, -42898, 21095, -38907, -128845, -141939, -156755, -147769, -149463, -152508, -121610, -116547, -111200, -125933, -162011, -167938, -139769, -89234, -52198, -54019, -110494, -116595, -127860, -130141, -82104, -50088, -94903, -101817, -73653, -92835, -52407, -23776, -24213, -41685, -39912, 25865, 33313, 15087, 1608, 3291, 2930, -32856, -71197, -13969, 30287, 32924, 34425, 31770, -25476, -78798, -74802, -69440, -102586, -131412, -114002, -11408, 27156, 85631, 67231, 8983, -43518, -42975, -29281, -32057, -26746, 3598, 35677, 56902, 24577, 755, 34072, 32659, 55496, 51229, 75951, 101963, 93261, 130806, 194164, 195061, 222233, 269596, 280568, 296407, 309495, 380882, 585101, 825403]
21780H25403K90545M97898N34535L64328J29161N7709q485l26384o13915n65011
21770A185784l77052k63131j12806q3699r0000n6132l5701k0831l9726J5636k8769
21759I3573n2781l7194l6986K5335N6635K2840k4426O0152l531J6196j0666o5798
21747D3349m2933R923O4541L4138q568m9503m8484j7175N6525J1217l9525K040
21735A5545O039J7334J6888n1237P015j8356k2717m6326K9763O3899J5404j6432
21723A6819n3446N85J6948N4388J5296k536p7845o8426L5088o613O9479N1377
21711E1114r893k1696k2089J7036M48j7353k4302O2892K1865r253Q428K9908o2292
21698B4813k8998J7795Q614l0607o581J3122m6699M6503K3789Q052k7441j7742
$$ y = [825403, 1115948, 1613846, 2148381, 2512709, 2641870, 2699579, 2691094, 2364710, 1750795, 1185784, 808732, 545601, 432795, 349096, 259096, 202964, 167263, 146432, 106706, 122342, 93573, 40792, 3598, -33388, -8053, 48582, 71422, 46996, 107148, 103617, 119813, 109147, 43349, 416, 10339, 74880, 109018, 100450, 50947, 2463, -14712, 41813, 53030, 13505, 15545, 21584, 38918, 55806, 4569, 11584, -6772, -29489, -75815, -46052, 17847, 33251, 16819, -36627, -36042, -19094, 35294, 50590, 48054, -29791, -98217, -63129, -69742, -263, 51114, 41221, 19525, -2564, 14472, 14920, -2433, -26735, 36157, 58022, 48769, 57197, 87105, 24813, -4185, 13610, 22224, -8383, -14964, -1842, -48541, -2038, 21751, 29803, 2362, -15380]
21686a5380l9977K0547O0131O6154j9870m3822L6363K589j523R451J9310j3428
21674H0545l1755j7006O902j6129R731J0310n5758j1179J4171J6291j6177o9372
21662g9426K1675J2175K1382N6965r9609p4811k4161L1210K1866j1364K4260N7830
21650d2008L7350L4588q781L6681N3894l8742m0887j4493m4965j8704n525J3255
21638c8337k4198l7946k3830J0478J06151O3471k6942m1313J0302K5425n2170
21627b8909q8309K9298P6807K6344j0983K7768L8093M5128p0424l2604k832p5400
21615f6023k1539n3857L0465K0811k2518J0652M9003n455J3869N9513M8174o0424
21603B671k1316K7601p1055k0155J1373L1077m674M6910J8355J7657l0809n003
$$ y = [-15380, -55357, -34810, 25321, 91475, 71605, 27783, 64146, 66735, 65212, 74663, 93973, 80545, 48790, 31784, 38686, 22557, 32288, 42598, -13160, -24339, -10168, 6123, -10054, -79426, -57751, -45576, -24194, 32771, -66838, -141649, -165810, -134600, -112734, -124098, -99838, -42008, -4658, 29930, 21149, 57830, 111724, 72982, 32095, 17602, -27363, -46067, -51592, -38337, -62535, -100481, -124311, -113833, -7682, 55789, 28847, -12466, -2164, 23261, -28909, -117218, -87920, -11113, 15231, 4248, 32016, 70109, 115237, 44813, 12209, 9377, -66023, -87562, -141419, -110954, -90143, -112661, -102009, -53006, -58461, -44592, 14921, 63095, 2671, -18645, 8956, -62099, -82254, -70881, -39804, -44478, 2432, 20787, 38444, 7635, 2632]
21591B632p685M7532K477o8294j8819J0336k7744r135j5188p708L1643L6125L115
21578b0713p399n5383N1254O7028J6962q998k7263l4455M2617K451n01l2469m1844
21565d8713k1323J3155k611L9810O5454l8807n5394L5166K3719M3377p333r330
21553C7170J2976l8309l5093r3727J238n515J4943P9233k7655k8329j9410k3976
21541a26454L723j989q754K2152k1097M8245R209R688M2730Q768n6012n3675J2710
21528a10756L5086M2303k5376L1758k4298n0489K3647J469L3980L9246K6247J3482
21516C6299j6631J0501M2062n1061n0892m6039J1627k1947M3814O2716k5586O786
21504A649N1245J1431n1945k4644K5539m353m0327j4065l3049l6736O8592O3743
$$ y = [2632, -5053, 42479, 44956, -23338, -42157, -31821, -59565, -68700, -83888, -91596, -59953, -23828, -20713, -28112, -83495, -32241, 34787, 51749, 42751, 15488, -18967, 23650, 26101, 25600, -6869, -48713, -70036, -56881, -59492, -19682, 45772, 6965, -48429, -13263, 10456, 53833, 46500, 37170, 50146, 11837, -23256, -116983, -115745, -121260, -106317, -27084, -54739, -83068, -102478, -126454, -122731, -124720, -133474, -111322, -132419, -84174, -74965, -65277, -22547, -13779, -69791, -123466, -110756, -75670, -33367, -58743, -26985, -51283, -101772, -78125, -76656, -42676, -3430, 22817, 36299, 19668, 30169, 72231, 21170, -29722, -75761, -64134, -86081, -42267, 20449, -5137, 1649, 52894, 64325, 12380, -12264, 13275, 8922, -31405, -45470, -78519, -115255, -46663, 17080]
21492A7080k3598j8419P0501J809J4087Q313j4759l7743r2494K590Q261p53k6715
21479i1840L1165L3939O2232K1860j2493j8017R43q699K1654m315n6934j0271
21467c0776K7116O806k1812n8894j5902M4279N0199M1418M4051k5285o7881m8141
21455e4822K8885L9096J1839n6017k7996K4812L9038l5026j6315L4317L1878N2248
21443G1937l0505J3646j1200N317k9182l3976l276N2333J3311J1137o1027K9304
21431B7819L972m7050k5987j3570L6085N1241k523o7228m523j8822M9602J8513
21419G529l0300j9107P0041l2784q846R728O5p0033R350P5921j6394k4116m4266
21406g3212J4397M5776P453k0912L652J4385M1632K4592J946n9856q5253j3507
$$ y = [17080, -6518, -24937, 45564, 47373, 61460, 69773, 55014, 17271, -75223, -72633, -64372, -65125, -91840, -60675, -26736, 35496, 57356, 44863, 26846, 27789, 19090, 40744, 36429, -20505, -30776, -3660, 3146, -18666, -77560, -93462, -49183, 1016, 42434, 86485, 61200, -6681, -54822, -25937, 13159, 24998, -31019, -59015, -34203, 4835, -30191, -46506, -12189, 19689, 71937, 41432, 55078, 43878, 49195, 20013, -13963, -17239, 35094, 48405, 59542, -1485, 27819, 31791, -15259, -41246, -54816, -18731, 32510, 29987, -37241, -41764, -60586, -10984, 7529, -22771, -41878, 28163, -4621, -13467, -3739, -3674, -73707, -64357, 11564, -4830, -28946, -73212, -58815, -13039, -5586, -26498, -22846, -8461, 33171, 57763, 59709, -147, -85400, -98907]
21394i8907P8630P6911l205o4257o7410k1674k3219k2532K5606J15740Q775K441
21382F899L4256j1549J046j8094j7322l803K7485n9201m272J0104L7333M4458
21370D7340o3643p2057M8278J00491j0549m6672k9701j9133M345j805J2615O311
21358b4180J3511m0427K3839j3453m1326K8865M451j2333Q393K044K1712J6913
21346a1991j7046j0695j9730M031K7061n720J5528l2736j7345K5981J4851N3934
21334B6123J4861o431L1918O259L2311n7766n9054j8808Q346o691k5557J0028
21322d4461M011j75r586J1696O1j90M0545J535l3210K4035K3815M0302k2501l7416
21308a539K708q231q491q737M4122K2865k4773j9927M0841k4042j374J7380J7304
$$ y = [-98907, -20277, 56634, 53429, -10828, -78238, -99912, -123131, -145663, -120057, -4317, 4458, 6899, 41155, 29606, 30652, 12558, -4764, -8567, 18918, -40283, -44555, -34451, 2882, 47340, -16303, -88360, -40082, 60409, 49860, 3188, -26513, -45646, -41301, -43106, -30491, -24180, -10669, -51096, -27257, -40710, -82036, -53171, -48720, -61053, -52660, -50616, -28904, -11991, -29037, -39732, -59462, -55431, -28370, -34090, -18562, -51298, -68643, -42662, -27811, 26123, 40984, 34553, 66471, 72730, 105041, 47275, -11779, -30587, -22241, -28932, -54489, -44461, -40450, -40625, -50211, -38515, -38454, -38644, 1901, 3436, -29774, -5739, 18076, 58378, 35877, -1539, 1169, -7062, -15553, -24290, 19832, 42697, 17924, -2003, 38838, 14796, 13422, 30802, 48106]
21295D8106j3067q070l5912k0087N011r125j103k4939L4226m7038m029J09891
21283C3864N7005k5566l7789j5617M1858k781j945j8294j5544P284K2104k9547
21271A5032m4924N634L0193k0948j3013P009l9874l6087L6616N4372j4172m2906
21259f3068n2439n3135L2449O8449Q6799L3380N13k1745j1749l7519l0377p440
21247e5882L3175m5391l093r187M790J3787L4001M3349K6800n7426k0268k9402
21235f4747o048J6682M445j4982k8324j3827P4317Q5957O170M560m2571k0852
21223G80k3882l6917K2436J235l209L0277L919L519l3263O944k4719l4020L1594
21210e5306j7660J4337L9838q582R779O3003K5963n5024p6873J288L7209J3600
$$ y = [48106, 35039, 26969, -8943, -29030, -24019, -33144, -34247, -59186, -24960, -71998, -76027, 33864, 90869, 65303, 27514, 11897, 53755, 50974, 49029, 30735, 15191, 22475, 44579, 15032, -29892, -24258, 5935, -15013, -28026, -21017, -60891, -96978, -60362, -5990, -20162, -63068, -115507, -168642, -136193, -67744, 19055, 52435, 52948, 31203, 19454, -18065, -48442, -55882, -22707, -68098, -71191, -80378, -75588, -61801, -27800, 15549, 42349, -15077, -35345, -64747, -70795, -54113, -49668, -64650, -92974, -106801, -32484, 53473, 59643, 64203, 21632, 780, -23102, -60019, -37583, -36348, -39557, -9280, -5361, -1842, -35105, -28161, -52880, -86900, -55306, -72966, -58629, -18791, -27373, -17594, 45409, 71372, 16348, -60525, -59237, -22028, -8428]
21198h428M558N3132j2773o349K7158m3772q795j9776l6978J3704J9368J601j6345
21185c3695J3747l8013l1005J5242K9183M410J9783M6036O108k523P924J4030
21173E1227o276p498l2055l5383k9476M7313P5192k9423l8981K9137J042l9425
21161a4606J902N0564N0026q630m2956l2891M318k3890j6789n0472K4672N9017
21149B65j9357M5562K7112o902J2938k6245k8839N6638j351P747K8543l6390p0732
21136a1011M4770N0922m6065N3587J3196p0671o8507l9973Q0151j2181o0435M24
21124f5793K0229R258m77j2468J5474M9312M0117l6768l4547r000l7514J9857
21112d2320p372J8875N4191m2501J605Q813J2843r181m8467J1114N3554P078k941
$$ y = [-8428, -3870, 49262, 36489, 30140, 57298, 13526, 4731, -15045, -52023, -38319, -18951, -17350, -33695, -19948, -57961, -88966, -73724, -44541, -40131, -20348, 25688, 31796, 29273, 37197, 51227, 44951, 37453, 5398, -29985, -59461, -12148, 63044, 33621, -5360, 23777, 24819, -14606, -12704, 37860, 87886, 79256, 36300, 3409, 7727, -16163, -32952, -83424, -58752, 265, -19092, 26470, 53582, 46680, 59618, 33373, 4534, 61172, 59821, 67568, 96111, 59721, -11011, 33759, 84681, 38616, 92203, 105399, 34728, -33779, -73752, 6399, -5782, -66217, -65793, -45564, -36306, -36783, -49251, -33777, 15535, 55652, 18884, -15663, -24663, -62177, -42320, -49692, -30817, 23374, -19127, -17522, -8709, 4134, -5047, -53514, -42400, 11154, 18232, 15291]
21099A5291L6003o137n0110j6731N4349J0584M514q4247j01306K240K5570L5679
21087g4301P2647L3438m4872j7331K0583l0298L235j1781Q338P3508L6032k5112
21075D4086l0338O421M5608K3308k3152o1121J8968N4370q60p3675k0129J0840
21063e674N7257j9938k0197j1918k4451j4801r245K9194K6336j5880j7749n3501
21051h0567k3699o830K3589P7247M1071N038R507N136l8270p8631n7114J4012
21039a09511q66M3010K3275M0682m1678p576K7630K1883r627J1655J6132k522
21027A2487j2054j6765m509K0316j8293l3188j9578K7287M0225l586J7008P843
21015A7193k8613K6950K9608l0911n028Q003P9521p359p1720n2439K6937M6062
$$ y = [15291, 51294, 45157, -4953, -21684, 32665, 43249, 47763, -36484, -137790, -135550, -109980, -74301, -1654, 31784, -13088, -30419, -9836, -40134, -36899, -48680, -40342, 33166, 69198, 44086, 13748, 20169, 65777, 89085, 65933, 4812, 23780, 78150, 77290, 3615, -16514, -5674, 51583, 31645, 11448, -470, -24921, -39722, -48967, -19773, 6563, -9317, -27066, -80567, -104266, -111096, -87507, -10260, 30811, 35849, 45356, 50492, 12222, -66409, -123523, -109511, -110377, -67367, -44092, -3410, -45088, -52664, -25034, -3151, -12778, -1123, 15009, 12487, 433, -16332, -20841, -525, -18818, -52006, -71584, -44297, -4072, -7658, 9350, 17193, -11420, 15530, 45138, 14227, 9199, 17202, 96723, 89364, 17644, -34795, -7858, 38204]
21003C8204J0228L184j5543m0430k1221L8620j3225m5015J9705Q717O7558N9580
20991A10362q496L2187k5137l5208m4598n4050l7846l4309R0390P0922N1224J5373
20979A30814J5251j5421j6677k6911k8624m3761j3909M2300l2295J3776r833Q249
20967B2959L1052L4754k7478J3667N1033P3937k2442M8681L7751K2033m7302J0792
20955B49437M8861P7472J34928J61240J80851K17694J23315o1787j47779o7898
20945I16334P468J14580K47519K56692K00036m1224k02308j90439j82898j32956
20935I92804l3801N1901J00626L3433j62160k46412j80252j49077q5339l0713
20925B91010p5651o2966o3135j3313K1968J5350L2294R903q4285o0702k2411J0865
$$ y = [38204, 48432, 51616, 36073, -4357, -25578, 13042, -183, -45198, -25493, -16776, 50782, 110362, 101866, 134053, 108916, 73708, 29110, -24940, -62786, -97095, -6705, 64217, 115441, 130814, 146065, 130644, 113967, 87056, 58432, 14671, 762, 43062, 10767, 24543, 14710, 22959, 54011, 88765, 61287, 74954, 125987, 199924, 177482, 226163, 263914, 285947, 238645, 249437, 298298, 375770, 510698, 671938, 852789, 1070483, 1193798, 1132011, 984232, 916334, 923802, 1038382, 1285901, 1542593, 1742629, 1701405, 1499097, 1308658, 1125760, 992804, 959003, 1010904, 1111530, 1144963, 982803, 736391, 556139, 407062, 321723, 291010, 215359, 152393, 89258, 75945, 97913, 113263, 145557, 155460, 71175, 10473, -11938, -1073]
20913a073P2750L843l8466O081k338k9577l4933n9831k1402O9033K6223R876L5226
20900C5412l3485J0444J5527N106K4043J4085r787l1201o3434K1344J8164L718
20888I936M7867j77o9463l0037O467M2250N5902K713k3005J2278J6471k1875Q502
20875E7829O46K9718j1326L32R672m917l5321N4364K8332j5852j7038l997k9928
20862F2514L1226p860O186N1961J1111k6692l5261M2241k7974q1723k9659M5834
20850D1904M3379L431K6042j8144Q23l3049j7394m2011L2209L0222K2463q417
20838H1458m8927m3053K940L1093Q661p092P396k0918r306m2152K81l6781J2016
20825f4384j4835l1641K9347j7889n915M0578M155J660J3477p352J3893J7591
$$ y = [-1073, 71677, 75520, 37054, 43135, 40797, 11220, -23713, -83544, -104946, -35913, -9690, 186, 35412, 1927, 12371, 27898, 33004, 57047, 71132, 61345, 30144, -33290, -11946, 6218, 9936, 57803, 57626, -11837, -41874, -35407, 6843, 62745, 65458, 42453, 54731, 71202, 49327, 57829, 58475, 88193, 76867, 77199, 86871, 81954, 46633, 100997, 129329, 113477, 96439, 92442, 62514, 93740, 85880, 92066, 144027, 155138, 128446, 93185, 135426, 107452, 25729, -3930, 41904, 85283, 88714, 114756, 96612, 97435, 64386, 46992, 4981, 37190, 67412, 89875, 81458, 32531, -10522, -7582, 23511, 32172, 25080, 32476, 11558, 2252, -39900, -39619, -76400, -64384, -79219, -110860, -81513, -99402, -105317, -64739, -60584, -58924, -45447, -52799, -38906, -21315]
20813b1315k0677K1712K0068k3374R22k5856J9291N7242K6325k5145l5516N839
20801d84J7953k9773J8918j4907j3788P552L5693m4792J74L5884N2393K563K3609
20788I0995l3088m8210j5923p076P808j1988j6186o7320k8521L0508P5181K6897
20776C077N6435m4087j9308N209m8563K1066M1859K9284m4644m1222j8436J9469
20764c9861N0367M6043K2797k0537J8522K334q601L5240N8826p5094k5820n273
20752E8943J6957J4151N556p939m5939K1105l202j6348j7941K6517K3032j8866
20740E6026q2119l006L2189L6692M9104k2325K349K6755L1646j8162m140k2041
20728H2968n0631o5442M0175N9856M741K8139K7745J4541l6431J6245J3867J9974
$$ y = [-21315, -41992, -20280, -212, -23586, -22664, -48520, -29229, 28013, 54338, 29193, -6323, -484, 17469, -12304, 6614, -8293, -22081, -14529, 21164, -23628, -23454, 12430, 64823, 67386, 90995, 57907, 9697, -6226, -13302, -5494, -17482, -33668, -100988, -129509, -99001, -23820, 3077, 59512, 15425, -3883, 1326, -47237, -26171, 15688, 44972, 328, -40894, -59330, -39861, 10506, 56549, 79346, 58809, 77331, 79665, 71064, 106304, 165130, 90036, 64216, 58943, 75900, 90051, 95607, 87668, 41729, 62834, 59632, 43284, 25343, 51860, 74892, 56026, -26093, -29099, 3090, 39782, 88886, 66561, 68910, 95665, 127311, 109149, 105009, 82968, 32337, -33105, 7070, 66926, 71667, 99806, 127551, 142092, 105661, 121906, 135773, 155747]
20716A55747l5837j2802k5063o828L1678m8518k9269N6268O7791K5899l4448j7295
20704A27323l0475N970k6983L7N0448L0724r066k7687l1040j1533M944l736n2396
20691B6530K9689P0321m1148K3881j3882m8734m872N676k9515m4110N054M858
20679a6252J1356o052N6102M3162k1651l4761l8896m298j1339p6019k5759N3403
20667g1004M6155O4642l4723k300l5428l1400K2807j402k1281L0560l687p127
20655d4188l143O3972M8176p682m0897M2542P9350n0518n9350n2653P4628K8738
20643G8975o4822J5030J4730K9447J8763J6464o722M183M0292L3737o452k6769
20631A46856M6729J4815j6141L0334R7125N46q1692j1768l1928K5496K7755o521
$$ y = [155747, 119910, 107108, 82045, 75217, 106895, 58377, 29108, 85376, 153167, 179066, 144618, 127323, 96848, 102818, 75835, 75872, 126320, 157044, 147978, 120291, 89251, 77718, 82662, 78926, 26530, 56219, 126540, 85392, 109273, 95391, 46657, 41785, 47461, 17946, -26164, -21110, -16252, -4896, -10948, 45154, 88316, 66665, 31904, -6992, -11290, -22629, -98648, -124407, -71004, -24849, 39793, 5070, 2770, -32658, -64058, -41251, -42653, -63934, -33374, -37061, -44188, -47331, 16641, 64817, 57135, 16238, 58780, 138130, 87612, 28262, -24391, 50237, 78975, 14153, 29183, 43913, 73360, 92123, 108587, 101865, 106048, 146340, 180077, 173625, 146856, 193585, 208400, 192259, 222593, 319718, 320264, 238572, 226804, 194876, 220372, 248127, 241606]
20619B41606J0824j5763j1446j3665M4520L7218k2663n3700l8404o0466k9937
20608H8124O3107O8240k6414k8230m8759J8592p084R439K5871J9296l2753m5333
20596A04096r989Q987q994j449K96l9616j8487j9032r705l8429Q371O8922R89
20583D5960l214k4486k2615L5599j672l3046K0638R191M4403L31J5321L2801j1892
20570A07319j7445j7199l1106k4275L8020Q019O1757K7916j8015m3941r282J463
20558H3231m4236L5839L8187M8976L1426J4823m0416l9877j3620l0759P3651J8012
20546A75237j692M206l6595l980K3294L9950j3139M9748K3947K2001j739K4913
20534C06151J00693J35811N4027p0254P65n6165m222K2793J11038Q5452k7350
$$ y = [241606, 252430, 236667, 225221, 211556, 256076, 293294, 270631, 216931, 178527, 118061, 88124, 151231, 219471, 193057, 164827, 116068, 134660, 127576, 137015, 162886, 182182, 149429, 104096, 94107, 103094, 94100, 92651, 92947, 53331, 34844, 15812, 6107, -32322, -23951, 44971, 45960, 42746, 18260, -4355, 31244, 29572, -3474, 17164, 26355, 70758, 71089, 86410, 119211, 107319, 89874, 72675, 41569, 17294, 55314, 63333, 125090, 153006, 134991, 91050, 81768, 83231, 38995, 74834, 113021, 161997, 193423, 208246, 167830, 127953, 114333, 83574, 157225, 175237, 173545, 177751, 141156, 137176, 160470, 200420, 187281, 237029, 260976, 282977, 281238, 306151, 406844, 542655, 596682, 526428, 527193, 471028, 466806, 489599, 600637, 686089, 658739]
20523F58739K4901O4125n292p0080p1119L7708K6500M4878k1271j06871J3831
20512E96049j2468Q043J2770j4353m7398O1470J18949O9077N3560N2899j1172
20501H87426o970o3828L7168P4039M6893K5622j2631m0309r906k9246o7818q8015
20489G52425n1980J8811L8390j8730n0580j13781j25662p1365k694K0336J2715
20478D07885m4069K9662N248l3j8994J1004J9141k4316J832m6488m777K5261J1316
20465C72672N7932M8138k2008k5134l5633J3312J6057j063J1896N8199L5930K3244
20453E53542K1682R007R836K1134j1425N7428M1523L3975K6101o9004r797m2827
20441F41175J0011R3121J02786n3660k3321J6829P3818J9451Q8532Q5737K1572
$$ y = [658739, 683640, 747765, 742473, 672393, 601274, 638982, 665482, 710360, 689089, 582218, 596049, 583581, 591624, 604394, 590041, 542643, 604113, 723062, 792139, 845699, 898598, 887426, 880456, 816628, 853796, 927835, 974728, 1000350, 987719, 947410, 937504, 908258, 840440, 752425, 700445, 719256, 757646, 738916, 688336, 574555, 448893, 377528, 374834, 395170, 407885, 363816, 393478, 398726, 398693, 379699, 390703, 409844, 385528, 387360, 340872, 336095, 361356, 372672, 430604, 478742, 456734, 431600, 395967, 409279, 425336, 424273, 436169, 494368, 530298, 553542, 575224, 584231, 594067, 615201, 603776, 661204, 702727, 736702, 762803, 693799, 684002, 641175, 651186, 744307, 847093, 793433, 770112, 786941, 860759, 880210, 968742, 1054479, 1076051]
20430A076051L9368N3215N2636j9957M5504N5776J34578J30930P0386K7807P3357
20419A739651J21366J17822N9180Q8982J34574J01932J12525J67646J67898J11806
20409B923382K13584K75879K75052K95455L59432M48554M24633M90003N75639
20400F281613O63111P27614R05390J083907J139531J181669J337067J490456J581529
20391A6391887J733161J724625J901632K386872L146076L965271N040439O334526
20383D2624489P763384R670876J3485679K1704795L4812588M4345600L2921302
20376B07328713O26260k2192859j6275481K472752K4972584M3382844M1883513
20369B82198326J9587824k522856j7842243l6476353m2954857k9658699q457691
$$ y = [1076051, 1115419, 1168634, 1221270, 1201313, 1246817, 1302593, 1437171, 1568101, 1638487, 1666294, 1739651, 1861017, 1978839, 2038019, 2127001, 2261575, 2363507, 2476032, 2643678, 2811576, 2923382, 3136966, 3412845, 3687897, 3983352, 4342784, 4791338, 5215971, 5705974, 6281613, 6944724, 7672338, 8577728, 9661635, 10801166, 11982835, 13319902, 14810358, 16391887, 18125048, 19849673, 21751305, 24138177, 27284253, 31249524, 36289963, 42624489, 50387873, 60058749, 73544428, 95249223, 130061811, 174407411, 207328713, 207954973, 185762114, 169486633, 171959385, 196931969, 240314813, 282198326, 301786150, 299263294, 281421051, 244944698, 201989841, 172331142, 163873451]
20362A63873451J3026137K3034576O804630k6870163m4176437l7246383k6225145
20355G2220666j7723629j1774031q141843n971547m816101m017268l065666k144311
20347A4566270j523320j260327j253236j264265j161313r10099o22841o53421
20339E917448o55760n75321m83510m18571l29773k77214k47445j81973j17068
20330B630813j26077j10470j11900j36589j71650k26884j03298o6557o1374o6173
20320A449841q015p5741o9953l9623q1977q6172k5788n3844o6065n3812J449m9761
20308H40539q2953N1652J3498m9855q7L7295j8469m8707J0235n7614n967J4443
20296G04010J2869M4045L97m1731m5921k179K0349K5451m08j01767j24686o4406
$$ y = [163873451, 176899588, 199934164, 206738794, 179868631, 135692194, 98445811, 72220666, 54497037, 42723006, 34581163, 28609616, 23793515, 19776247, 16710581, 14566270, 13042950, 11782623, 10529387, 9265122, 8103809, 7193710, 6570869, 5917448, 5261688, 4686367, 4202857, 3784286, 3454513, 3177299, 2929854, 2747881, 2630813, 2504736, 2394266, 2282366, 2145777, 1974127, 1747243, 1643945, 1577388, 1516014, 1449841, 1441826, 1366085, 1296132, 1256509, 1174532, 1088360, 1062572, 1008728, 942663, 888851, 890300, 840539, 757586, 809238, 822736, 772881, 772794, 810089, 791620, 742913, 753148, 695534, 689567, 704010, 716879, 760924, 761321, 719590, 673669, 671490, 691839, 717290, 716882, 615115, 490429, 426023]
20284D26023l8178n4501q80L4780M3291j3518k3230K3158k9l0234K066l6826p1621
20271B60301O454o182K9080q107J6021J6069q529l1004k2921m360k5088K0844
20259B42578J7624n2115n2449O3260Q5744M0056l5438m7103J2472O6821K6902
20248C68352j5963m2210o0592j0965K0290M5029j46r6979k9773M5215q04n4651
20236A66803m2292k0089J2658j7067r2990p7886L3583L4783q323N4073P553k5594
20224B5212p7578j20008j54794p2364J6893J21799l848K858n7560j03373j31182
20213e53945p7282P8821P7119J43310R2672K6012J1377n0764o77K9757Q6329O2845
20201g4426L2735K1993q704m0842L2426K8937J3810J8376p176J9069K3522l8743
$$ y = [426023, 387845, 333344, 332464, 367244, 410535, 397017, 373787, 396945, 396916, 366682, 368748, 331922, 260301, 266755, 260573, 289653, 281546, 297567, 313636, 305107, 274103, 251182, 246822, 221734, 242578, 260202, 208087, 155638, 218898, 304642, 344698, 309260, 262157, 274629, 341450, 368352, 352389, 310179, 249587, 238622, 258912, 303941, 303795, 206816, 177043, 222258, 221454, 166803, 124511, 104422, 117080, 100013, 7023, -70863, -37280, -2497, -10820, 43253, 50806, 25212, -52366, -172374, -327168, -399532, -382639, -260840, -264688, -261830, -319390, -422763, -553945, -631227, -552406, -475287, -331977, -239305, -213293, -201916, -252680, -253357, -223600, -137271, -74426, -41691, -19698, -28402, -69244, -36818, -7881, 5929, 24305, 17129, 36198, 59720, 20977]
20189B0977r00M1626K1850M1518N0938M0830n5419n2053M0387O5109P7739j5697
20177B76905n8635j17178l4709m0292k988M9549J2558n5610m0242Q2113L4437
20166A05908Q110K4484l5466q2763L6065Q0530k0307j3819j122m0095L9929M3939
20154A45393m9111o201k17N7172O6606L1596p3452n0327j5396j787l6180j8007
20142E0089K2761J7261K9922j348O176L3586q356m1486N524l0421j2721j8712
20130E2275k1367j3881K9643J9724k3720K2878L7849L178k808o3030o2437K6201
20118D505J1293l1150m947j8022P1673M7619J341m1810J5505Q2393l5863M852
20106A07389K0888n0164j9542m7041L0755n132J5879M1018j2979L4950k035o6254
$$ y = [20977, 20077, 61703, 83553, 125071, 176009, 216839, 161420, 109367, 149754, 214863, 292602, 276905, 218270, 101092, 66383, 26091, 23103, 72652, 85210, 29600, -10642, 71471, 105908, 114018, 138502, 103036, 20273, 56338, 136868, 116561, 102742, 101620, 61525, 101454, 145393, 96282, 90081, 89864, 147036, 213642, 245238, 171786, 121459, 106063, 104276, 68096, 50089, 72850, 90111, 120033, 118685, 124861, 158447, 150091, 108605, 114129, 83708, 70987, 52275, 30908, 17027, 46670, 66394, 42674, 65552, 103401, 106579, 103771, 40741, -21696, 4505, 15798, -15352, -20299, -38321, 33352, 80971, 82312, 40502, 56007, 138400, 102537, 107389, 128277, 78113, 58571, 11530, 42285, 37153, 53032, 94050, 81071, 116021, 113986, 47732]
20094D7732n8337K0988K3295M052Q138M4399K7092m9182k7250M2532N153K8857
20082A17469N536k6517M7919L7822j5520o6137m0028J2956L0229J7139N7228j3300
20070A64796m8465J041o703j2376o131n7510J8296K0817R896k6007J204l657K8788
20057H3989L7092n2054k1468j6360L1266m8703m7383O5877M3922k2329N4004O323
20045A14176K2469l3221L356n2025p4411K9338J4752k0873k3246j2859R541K0531
20033b472L3067n18J3354l2843m7590k468j3028P3692r684l4418Q284L3410K0546
20020C9332J3895k8096l5044j49l091l3633M2075m1151k1762N6677N0636M6344
20008H6033j3865k0054K7564R882l1422o1345n494L7352N8144M9741m3626M636
$$ y = [47732, -10605, 10383, 33678, 37730, 45868, 90267, 117359, 68177, 40927, 83459, 88612, 117469, 123005, 96488, 144407, 182229, 166709, 100572, 60544, 73500, 103729, 120868, 178096, 164796, 116331, 117372, 110669, 98293, 92162, 34652, 52948, 73765, 83661, 57654, 58858, 55201, 83989, 121081, 69027, 47559, 31199, 62465, 13762, -33621, 32256, 76178, 53849, 107853, 114176, 136645, 103424, 106780, 54755, -19656, 9682, 24434, 3561, -19685, -32544, -23003, -2472, 30595, 30077, 43431, 10588, -37002, -39470, -52498, 21194, 11510, -22908, -14624, 18786, 39332, 53227, 25131, -9913, -10062, -13153, -46786, -4711, -45862, -67624, -10947, 39689, 86033, 72168, 52114, 79678, 89560, 58138, -3207, -8701, 28651, 86795, 136536, 92910, 97546]
19996I7546K500j02970n3480M6042K4062O3897J7303k3860k0301l8035J2479j0551
19984A4632n2530R683k776P410o667J6441J0547J8677J5789r141k6935k4532P194
19971b2208o434N63o3784k5003L0374R9715K3174m9560P715K6147K2786K3916
19959F7401J2677k1425K3115R933m382K9934n8858k3347k8275L3241K7902n3368
19947A4548K2096N9110J8004K3923p0691k3171p200J6630n694N304j1029n6710
19935a4880j1324j0556n88J5539L8590L0233n26K5237L8094j6173k9902j8107
19923D5637m0848K9882M1787j9183L7236P6210k9376N35K4995J8432M4412m2m869
19910B24808j204r9864l744J0446O743j25m379k9089L8949K6841k8905o8281l0380
$$ y = [97546, 100046, -2924, -56404, -10362, 13700, 77597, 94900, 71040, 50739, 12704, 25183, 14632, -37898, -28215, -30991, -23581, -30248, -13807, -3260, 15417, 31206, 22065, -4870, -29402, -22208, -28642, -28079, -91863, -116866, -86492, 13223, 36397, -13163, -5448, 20699, 43485, 67401, 80078, 58653, 81768, 91701, 87319, 117253, 58395, 35048, 6773, 40014, 67916, 14548, 36644, 95754, 113758, 137681, 66990, 43819, 36619, 53249, 47555, 52859, 41830, -14880, -26204, -36760, -37348, -21809, 16781, 47014, 46488, 71725, 109819, 93646, 63744, 45637, 4789, 34671, 76458, 57275, 94511, 170721, 141345, 141880, 166875, 185307, 229719, 229677, 224808, 223604, 123740, 119996, 130442, 137185, 137060, 132681, 103592, 142541, 169382, 140477, 72196, 41816]
19897D1816l1547m262M7044N6442j1883m7623l7530k9659j7455n0095N452k629
19885h1929K8342O7309K960J9407k3683l5008M3273k5114P124n3418l3094N5043
19873b8788o745k6282L2551k0817J3422m2732L8741L276K2394K7981l661M5608
19861E4948J102m0757m0920o797k2135K544K1371l2441p0375L4000K0210N3726
19849b5524J6131j3240n371N741L309k409k4813J2365k959k996M4380l6642K4161
19836g867N0975K7500O3202n1718k9739M393k4078l0893j1174J4429o941J711
19824b00M4879n187l1785J6265N4445J568k2655P711p614L5611j5650K5826L3536
19811A36750P981j723j4273l9602O199N7538Q7268J4099O5097Q0343Q5024K36016
$$ y = [41816, 10269, 6007, 53051, 109493, 97610, 49987, 12457, -17202, -34657, -84752, -79300, -81929, -53587, 13722, 16682, 36089, 12406, -22602, 20671, -4443, 2681, -50737, -83831, -28788, -35533, -61815, -29264, -50081, -36659, -79391, -40650, -37374, -14980, 13001, 9340, 54948, 56050, 15293, -25627, -32424, -54559, -52015, -30644, -63085, -133460, -99460, -79250, -25524, -9393, -22633, -28004, -22263, -18954, -21363, -46176, -33811, -36770, -39766, 4614, -32028, -7867, 43108, 70608, 133810, 82092, 52353, 56746, 32668, 1775, -9399, 5030, -1911, -200, 44679, 39492, 7707, 23972, 78417, 79985, 57330, 65041, 57427, 93038, 77388, 103214, 136750, 144731, 143008, 128735, 89133, 95332, 152870, 240138, 254237, 319334, 399677, 484701, 720717]
19799G20717K61876J33841j1570p8738l9867M4387J50044K13756J79089M9445
19789A622980r2208j8032j70822j95953r3627l1695k2677l4187j1325r8050k37205
19778F17199j20594j22641o5747n3087q0677o4842l4771l962J7134M898M8659
19767A41569j115l8237J711l6637o6654k1599J5498l705o312K4836Q534K9475
19755D7364l4923q3718N7461J2645o5155N5906P2373n8704n7739O5657N2675j2194
19743E1648p559K0204r343J9072K6761q1181o7944M4874Q1792J8224k8499m0036
19731B8013L3944k7179l1400k3332K3086L4670J7678m3459j9620J0824M380n6342
19719d8737L8208L7987o877m7478k0604K9070K0690l3342J2780O3179P900m3404
$$ y = [720717, 982593, 1116434, 1104864, 1026126, 986259, 1030646, 1180690, 1394446, 1573535, 1622980, 1530772, 1512740, 1341918, 1145965, 1052338, 1020643, 997966, 963779, 952454, 854404, 617199, 496605, 373964, 308217, 255130, 174453, 109611, 74840, 70878, 88012, 92910, 141569, 140454, 102217, 103928, 67291, 637, -20962, -5464, -9169, -15481, 9355, 17889, 47364, 12441, -71277, -13816, -1171, -66326, -10420, 61953, 3249, -54490, 11167, 63842, 51648, 44089, 64293, 54950, 74022, 100783, 19602, -48342, -3468, 78324, 96548, 68049, 28013, 61957, 34778, 3378, -19954, 3132, 37802, 55480, 12021, -7599, 3225, 7605, -48737, -10529, 27458, 20581, -26897, -47501, -18431, 2259, -31083, -18303, 44876, 52776, 9372]
19707I372l3998J5465l7770o0454N4459L4267j4247j3039L9736K891J7506l3390
19695a9202l4295Q348O1562j0407m3520m2983K7699M0865k1721P61L2089M0913
19683D0109J959K6620J570o7691p6600L6923N6608J0240m576l792k7225l1381
19671c7236K3621o00j5228k4341L4981m1213L6399O2971N2614J3273r787l5913
19659E9541L036Q0603J1204L993k2731m9324O594k7363r866l4616K4752K50m6993
19646i20L1621O3962K9845O0346l0360j4758n1807p1110L8294N4543J0395n3016
19634F7035K787K3339k1934O767J636J5637j6719q118P3351O6889m8825l7244
19622A24601j5740N414Q785M161L7551j2855q4881j3108L7815L1435J5769m5125
$$ y = [9372, -24626, -9161, -46931, -107385, -52926, -18659, -32906, -45945, -6209, -3318, 14188, -19202, -53497, -45149, 16413, 6006, -37514, -80497, -52798, -11933, -33654, -32893, -804, 40109, 42068, 68688, 70258, 2567, -74033, -37110, 19498, 29738, 25162, 21370, -5855, -37236, -13615, -14215, -29443, -53784, -18803, -60016, -23617, 39354, 91968, 105241, 95454, 59541, 62577, 143180, 154384, 158377, 135646, 86322, 92916, 65553, 55687, 21071, 45823, 46073, -920, 30701, 94663, 124508, 184854, 154494, 139736, 87929, 16819, 55113, 109656, 120051, 67035, 69822, 93161, 71227, 77994, 79630, 95267, 78548, 70430, 143781, 210670, 161845, 124601, 108861, 114275, 123060, 127221, 164772, 151917, 67036, 53928, 91743, 123178, 138947, 93822]
19610I3822o1372L3651n016K7191l3527j583L2251L3497k2846N1529l4192n3455
19598E9950J1228j0112M7195K5800l2356J8462k2137k1448m0160n6283L4425J5109
19586B9673M2466K5055R531M5010m1271n1213J1104K6938m2605k2270l33J1379
19574D3464J9809k5187k2539K7205O4544J315n8466J7388K2677r761l0814m945
19562D4690l2860R1048j7849j3218j0692M01J3993j001k6932j0062J13N294K926
19549D5851k6513J0106N2086Q550K3143K996l1623j2101L0510O0483j9759m7129
19537I6600l1357k3195k118L3454J0203q968K9208K9087n2728N7j602L5058O227
19524A19926M1749M1824j0840n0204j9598K6973O9837L1025m2767r0028J2166
$$ y = [93822, 32450, 66101, 61085, 88276, 54749, 53166, 85417, 118914, 96068, 147597, 113405, 59950, 71178, 61066, 108261, 134061, 101705, 120167, 98030, 76582, 36422, -19861, 14564, 29673, 72139, 97194, 106725, 151735, 110464, 59251, 70355, 97293, 54688, 32418, 32085, 43464, 63273, 38086, 15547, 42752, 107296, 108611, 50145, 67533, 90210, 80449, 49635, 44690, 11830, 102878, 85029, 71811, 61119, 61520, 75513, 74512, 47580, 37518, 37631, 42925, 45851, 19338, 29444, 81530, 90080, 113223, 116219, 84596, 72495, 103005, 163488, 143729, 96600, 65243, 42048, 39930, 73384, 83587, 74619, 103827, 132914, 80186, 80243, 78641, 113699, 119926, 161675, 203499, 192659, 142455, 122857, 149830, 219667, 250692, 207925, 117897, 130063]
19513A30063O7987j5612K5893j5340n7223k5674K2377K126K7592L14J5429P541
19501A85473m1619O311k4494j0183M1001P306k0963j7371q599J888J28349K6174
19489B73273j1219k4164n2385q255Q1895L3480j8967m5203K300J4590P6793L8280
19477C60418M0222N3532O4508Q8569P0733Q0804K27097K00102J88524K06385J03919
19466A684813k1952o3361m2446l8550J2013J11009J71094J90406J09555M7224
19456B159805O888l5099o7381j08249j14233Q485k5449j00738j68698j8152M7486
19445A584665J3143J480n8829j44947j41482j41137j46937j16151j73894q5075
19435E90836o5352p9352j00368k9190l7383k0671O00L6609k0981k9908p541K5602
$$ y = [130063, 198050, 182438, 208331, 192991, 135768, 110094, 132471, 134597, 162189, 162503, 177932, 185473, 143854, 150165, 125671, 115488, 156489, 163795, 142832, 125461, 116862, 118750, 247099, 273273, 262054, 237890, 185505, 177250, 259145, 292625, 273658, 228455, 230755, 245345, 322138, 360418, 400640, 454172, 518680, 607249, 677982, 758786, 985883, 1185985, 1374509, 1580894, 1684813, 1662861, 1599500, 1557054, 1518504, 1530517, 1641526, 1812620, 2003026, 2112581, 2159805, 2166693, 2131594, 2064213, 1955964, 1841731, 1850216, 1824767, 1724029, 1555331, 1537179, 1584665, 1597808, 1599288, 1540459, 1395512, 1254030, 1112893, 965956, 849805, 675911, 590836, 525484, 446132, 345764, 316574, 279191, 258520, 259120, 295729, 274748, 244840, 237299, 262901]
19423B62901m0450j8876R408m4957l731M4798j5787K1246m5087j6286L7695k98
19411A90576O046K861j8231l1860N974m5356m6052l756Q438K7639O5467n9191
19399A02555K448Q809j37l2716m9322K7555N6436K9106k6290L4735K8748j839
19387A80088J9146j5932L8174n954J926N209J0273j7500n1565j7356m3363O41
19375A03787L0311O954J1070J0836m4317r938L2859K3523k4599l4396N2990J5855
19363A74935M731L3622K6918n7556o1214J0118R570P2689J83q939J8698K1065
19351B44820J2981M7011J1944p7273l0828M1084K0573j5945m0091k4899O0574
19340B49951O6123m0724p7278J8180K4623P3748r3J6892P7781K8382m5083J6479
$$ y = [262901, 222451, 203575, 212983, 168026, 164295, 209093, 193306, 214552, 169465, 153179, 190874, 190576, 196622, 199483, 181252, 149392, 155366, 110010, 63958, 60202, 68640, 96279, 161746, 102555, 105003, 113812, 113675, 80959, 31637, 59192, 115628, 144734, 118444, 153179, 181927, 180088, 199234, 183302, 221476, 215522, 217448, 222657, 232930, 215430, 163865, 146509, 103146, 103787, 134098, 141052, 152122, 162958, 118641, 108703, 141562, 165085, 140486, 106090, 159080, 174935, 179666, 213288, 240206, 182650, 121436, 131554, 141124, 213813, 213996, 205057, 223755, 244820, 257801, 304812, 316756, 239483, 208655, 249739, 270312, 254367, 214276, 189377, 249951, 316074, 275350, 198072, 216252, 240875, 314623, 314530, 331422, 409203, 437585, 392502, 408981]
19328D08981Q5937J10449Q9581k172n795N7200J21850K2486J3769m2701j03986
19317G55599r0169p6610r2186o9872m4168m3091K435j1100l1196p2751m8844m1747
19305A36300j8152k393p0547N1952P9607l354l5052K3719P4471n143o8253r0955
19293G2200L5444J78919O3499K495m9710j7526K2381J2711J9425J28K4876J9168
19281C84010K2460M875M8655J3921L8865J14737J20905J90953J81380Q6628K9975
19270A237364l1474l0557M3317M8916J35340J43747O9915K3114N7519M3515j04349
19259A636367k40820k99074k58876j23355p8828q8165j8601r5911p5782j06251
19249B50704o866N6747k2766j1393k3911j9465N5818K9116m4430m4696l1569P259
$$ y = [408981, 494918, 605367, 694948, 692776, 686981, 744181, 866031, 888517, 902286, 859585, 755599, 665430, 588820, 496634, 426762, 382594, 339503, 341938, 330838, 299642, 226891, 178047, 136300, 118148, 115755, 45208, 97160, 176767, 173413, 138361, 162080, 236551, 231408, 163155, 72200, 107644, 286563, 350062, 352557, 302847, 285321, 307702, 320413, 339838, 339966, 364842, 384010, 406470, 411345, 460000, 473921, 512786, 627523, 748428, 939381, 1120761, 1207389, 1237364, 1205890, 1175333, 1218650, 1267566, 1402906, 1546653, 1616568, 1639682, 1697201, 1740716, 1636367, 1395547, 1096473, 837597, 714242, 635414, 547249, 528648, 432737, 356955, 250704, 243838, 300585, 277819, 266426, 242515, 223050, 278868, 307984, 263554, 218858, 187289, 194548]
19237A94548M5396O0877j0462p096N8436O1486o2992o3153o4887n763j6914l0265
19225A59211N29M9703Q8382J05905M4459P392J6060L5922O7006R3217J45941J89825
19213A003552J12496n1098j53204j70670j58558m0570J0325K9117J28443J38114
19203H47947J06939J3310q4756j66419k04452j17003q3728j15472j14259l8297
19193D3810K1056J6827j5601K3647N1751m997k142L321l4209p0392p435j1609
19181A4027L0471K7904J6465R114j5399L3584K3264L4764o202o0695m8012k7993
19169C1292O538M9368K8364K677M1792M0002N041j0028l3511P460m5198J0874
19157A34671L6139J381j2152l6076n8463n0190o0769N3911N7816j4199k8614K7544
$$ y = [194548, 239944, 300821, 290359, 283263, 341699, 403185, 340193, 277040, 212153, 206390, 189476, 159211, 159740, 209443, 297825, 403730, 448189, 455581, 471641, 507563, 574569, 667786, 813727, 1003552, 1116048, 1064950, 911746, 741076, 582518, 541948, 552273, 581390, 709833, 847947, 954886, 968196, 883440, 717021, 512569, 395566, 311838, 196366, 82107, 43810, 64866, 81693, 66092, 89739, 141490, 136493, 134351, 137672, 103463, 33071, 25636, 14027, 44498, 72402, 88867, 97981, 82582, 116166, 139430, 174194, 167992, 107297, 59285, 31292, 37830, 87198, 115562, 118239, 160031, 200033, 205074, 195046, 161535, 168995, 123797, 134671, 170810, 172191, 160039, 123963, 65500, 15310, -45459, 8452, 66268, 52069, 23455, 50999]
19145E0999p62k061M7146N7425P915N334j4225k5621j9129P291L9837O4552M8671
19132B67372l8281l8001J0116N6744m3432P184K4419j9112Q3665M8008q328J1416
19120C61770K3151k8593K0797J4016K2227K6200J889l0627m2742q793l2243J3932
19108C40984K5401l2633r1634k2227K2696K9493O059q7931k6599K4516Q2369Q9218
19096C59712Q95r398j2834K8379N6515j2510k0678N3802K3029J9777k2895r9420
19084C64374l2279m0108N359K3700M3274j178j3678L6910J5417q3306n5785P7858
19072C40558M6012j2796l7955j5934k9066J0905O4580K3110k9231Q406p8174q0651
19060B09764l2081M4094K1358K8712l0637k9592M9878N7992M7384P1525j2688
$$ y = [50999, 50237, 48176, 95322, 152747, 160662, 165996, 151771, 126150, 107021, 114312, 154149, 218701, 267372, 229091, 191090, 201206, 257950, 214518, 221702, 246121, 227009, 310674, 358682, 350354, 361770, 384921, 356328, 377125, 391141, 413368, 439568, 441457, 410830, 368088, 359295, 327052, 340984, 366385, 333752, 242118, 219891, 242587, 272080, 278139, 190208, 163609, 188125, 270494, 359712, 360607, 351209, 338375, 366754, 423269, 410759, 390081, 443883, 466912, 486689, 463794, 364374, 332095, 291987, 297346, 321046, 364320, 363142, 349464, 386374, 401791, 318485, 262700, 340558, 386570, 373774, 335819, 319885, 290819, 301724, 366304, 389414, 360183, 368589, 290415, 209764, 177683, 221777, 243135, 271847, 241210, 211618, 261496, 319488, 366872, 438397, 425709]
19049D25709N363M1724n0570m9258n2558m4559O5406J5855j9507m8589n5062L62
19037B34316N53O890O4244L7579j183k4049J9571O9083O5863J20568J48913J03966
19025H46314K0002l3525k3932L9973J26537Q6874P5090K2107j4127q4153j41125
19014I20035m1973J3431n826n228K6337m7137m9740L1806R8993M4561M6075M857
19002A036191R4687J29940J54928J09617J45521J22800L1927K022o87Q378K6979
18991A862303P5380O5593Q5308O9226l0120r1295j33278q9295r0689j52858p0777
18980A499498p2237p0331j9398J9571l6975k1021J09552R1641J08273M8390N2443
18969A709406O0568N6949J30057L3907j6272p3321j26148m8302q2666m5136n8382
$$ y = [425709, 431072, 472796, 422226, 372968, 320410, 275851, 341257, 357112, 337605, 289016, 233954, 234316, 234869, 241759, 306003, 343582, 342399, 318350, 337921, 407004, 472867, 593435, 742348, 846314, 866316, 832791, 808859, 848832, 975369, 1062243, 1137333, 1159440, 1145313, 1061160, 920035, 878062, 891493, 885667, 880439, 906776, 859639, 809899, 841705, 940698, 985259, 1031334, 1036191, 1130878, 1260818, 1415746, 1525363, 1670884, 1793684, 1825611, 1827633, 1826946, 1835324, 1862303, 1937683, 2003276, 2088584, 2157810, 2127690, 2036395, 1903117, 1813822, 1723133, 1570275, 1499498, 1427261, 1356930, 1337532, 1357103, 1320128, 1299107, 1408659, 1500300, 1608573, 1656963, 1709406, 1769974, 1826923, 1956980, 1990887, 1974615, 1901294, 1775146, 1726844, 1644178, 1599042, 1540660]
18958A540660Q18Q8957Q3922o1808r6127m9796k3844m6357K2853L767L2526N9341
18946A554912j9058k7325l206J8615J1612J19986N1358N5100K2373N6587L1663
18935A872617M1736O7348J24984J47234R0083R0079J27443J37869J34934J78298
18925C012625K53736L59979L78688L10572K50920J26650L0936N522O7485J81795
18915D978908K74432L11146L34677K71740J00358J16873J95493K97761K92343
18906G173731K92338K49615K34001L43383M86789O06402O44022P14190O72201
18897A1416672N86470N14588N39540P60680R03891R01564R86704J108807J383297
18888A9102213J551431J776681K068446K453366K883541L166763L644830M433513
$$ y = [1540660, 1541478, 1630435, 1714357, 1652549, 1556422, 1506626, 1482782, 1436425, 1459278, 1463045, 1495571, 1554912, 1535854, 1508529, 1505323, 1523938, 1535550, 1655536, 1706894, 1761994, 1784367, 1840954, 1872617, 1914353, 1981701, 2106685, 2253919, 2344002, 2434081, 2561524, 2699393, 2834327, 3012625, 3266361, 3626340, 4005028, 4315600, 4566520, 4693170, 4724106, 4729628, 4797113, 4978908, 5253340, 5564486, 5899163, 6170903, 6271261, 6388134, 6583627, 6881388, 7173731, 7466069, 7715684, 7949685, 8293068, 8779857, 9386259, 10030281, 10744471, 11416672, 12003142, 12517730, 13057270, 13817950, 14721841, 15623405, 16610109, 17718916, 19102213, 20653644, 22430325, 24498771, 26952137, 29835678, 33002441, 36647271, 41080784]
18880D1080784N480538O959663Q958918J1790118J5807113K1377754K8827804
18873A40282692L5716803L5711323K3070089K375374j1964688j2026297j707039
18866B11458257J4080303L1815028M4939078M1437443J3899090k5280303n1274278
18859B81074618n5031694m6491548l5221772k5176034j7373352j1493002p009833
18852H3277383l467460l85468K574393N814199R812216J5394704K3365009L2544691
18844A68929667L8560115L6677700K8265264J9502556J1826183K911064p748834
18837B98923715j6814899k0930331j8679852j3561774j0212693q298477q496015
18830B01929674j1642544j7410937k3337993k6749422k5265578k0397621j5308836
$$ y = [41080784, 46561322, 53520985, 62479903, 74270021, 90077134, 111454888, 140282692, 175999495, 211710818, 234780907, 237156281, 225191593, 213165296, 211458257, 225538560, 257353588, 302292666, 343730109, 357629199, 332348896, 281074618, 226042924, 179551376, 144329604, 119153570, 101780218, 90287216, 83277383, 79809923, 79424455, 81998848, 87813047, 97625263, 113019967, 136384976, 168929667, 207489782, 244167482, 272432746, 291935302, 303761485, 306672549, 298923715, 282108816, 261178485, 242498633, 228936859, 218724166, 210425689, 201929674, 190287130, 172876193, 149538200, 122788778, 97523200, 77125579, 61816743]
18823F1816743j1109634p963505n847817m349085l181383k272067j719127j460863
18815B3913262j060904m87969J95833R80359K079006L444445M116080L326091
18807C6506203K203247K321968K526242J562632O50055O34452r5614j419048j377905
18798D3512232j305010l013712m864022m556177l649780l645125l608872k965169
18790A5904365k156379j565411j069229o79710m17446l59012l59594k13033j81642
18781H902909j16752l1196j11761q0947N4051J92991L61427M52130N10773O24280
18771A0757905O73357P76574Q95458J144193J346459J451838J359324J364446
18763A9769554J506878J705007K018404K150664K531062L171404M008346M833590
$$ y = [61816743, 50707109, 42743604, 36895787, 32546702, 29365319, 27093252, 25374125, 23913262, 22852358, 22364389, 22560222, 23540581, 25619587, 29064032, 33180112, 36506203, 38709450, 41031418, 43557660, 45120292, 45770347, 46404799, 46309185, 44890137, 43512232, 42207222, 39193510, 34329488, 29773311, 26123531, 22478406, 18869534, 15904365, 13747986, 12182575, 11113346, 10433636, 10016190, 9657178, 9297584, 9084551, 8902909, 8786157, 8754961, 8643200, 8562253, 8616304, 8809295, 9170722, 9622852, 10133625, 10757905, 11431262, 12207836, 13103294, 14247487, 15593946, 17045784, 18405108, 19769554, 21276432, 22981439, 24999843, 27150507, 29681569, 32852973, 36861319, 41694909]
18755D1694909N983328P734122J0263943J4520149K1047553K7296340K8601059
18748A57141403K5240723K5263667K9828386K6645851J4879016Q226914P233906
18741B94459866M83920o237023m940786p677044j8836122k3165961j6871182j3098567
18733B04117101j3094173o153686J1579193L3855218M7282250L7597061O122694
18726C21305658k7685137m8323903m5654197k7764549p659404J3884374L5326334
18719B13429176M5029412L0207804m801683l9063500n6977256n2455587l7790278
18712I7578088k5315258j6648468j1164323q007106o200953m985425l955195k995596
18704A8305764k235781j619259j199544q42630o03910n30073p11879q87689q51156
$$ y = [41694909, 47678237, 55412359, 65676302, 80196451, 101244004, 128540344, 157141403, 182382126, 207645793, 237474179, 264120030, 278999046, 287225960, 294459866, 294943786, 288706763, 283765977, 276088933, 257252811, 234086850, 217215668, 204117101, 191022928, 184869242, 196448435, 230303653, 277585903, 315182964, 321305658, 293620521, 245296618, 199642421, 171877872, 164218468, 178102842, 213429176, 258458588, 288666392, 283864709, 244801209, 187823953, 135368366, 97578088, 72262830, 55614362, 44450039, 36442933, 30241980, 25256555, 21301360, 18305764, 16069983, 14450724, 13251180, 12408550, 11804640, 11274567, 10562688, 9674999, 8823843]
18695H823843p51703n58127m52097l11120j02068Q6734R5147r757k53116k78708
18685F289028j27227N1881K42968L87748L80701L42230J74020P9131K63043N73546
18675H657069R31140J439434K211158L514358N509071P597505P586995M140439
18667D1587169j017633n143621o560440m811402k115239P04950L988160O870037
18659C3501981O945104K819111l102415p536259q744642o839567m561447l066040
18651I415826j997258j236227r10075q24094n63063m92404l95897k54468j85940
18642B556400n7140k2808k0934j6772j34991k08100k57428j02435p6928j15947
18632A542917k2999L2840M0078J6393q4788k2182m6344o2438o4512p1343m4181
$$ y = [8823843, 8072140, 7514013, 7061916, 6750796, 6648728, 6735462, 6830609, 6820852, 6567736, 6289028, 6161801, 6213682, 6456650, 6844398, 7225099, 7567329, 7741349, 7820480, 8083523, 8657069, 9588209, 11027643, 13238801, 16753159, 22262230, 29859735, 37446730, 41587169, 40569536, 35425915, 28865475, 24054073, 21938834, 22643784, 26631944, 33501981, 40447085, 43266196, 40163781, 32627522, 23882880, 17043313, 12481866, 9415826, 7418568, 6182341, 5272266, 4448172, 3885109, 3392705, 2996808, 2742340, 2556400, 2499260, 2476452, 2455518, 2438746, 2303755, 2095655, 1838227, 1735792, 1658864, 1542917, 1519918, 1552758, 1592836, 1609229, 1524441, 1502259, 1455915, 1393477, 1328965, 1257622, 1213441]
18621A213441M727n8807o4429l2783m2901l4508m5605n8718m1801k2080J49J1697
18609H28382j236k1702K7965J5168n9952p3403k9069j3088K7656L5808o8659m4958
18597F22912j07248r3352K2612p093j23463j25714r9385n4469p6700Q080n3848
18586h7668k8220j466k0922K0063J15307O8075r266N0828M6786M1347K9498o7566
18574A56796m3610p7324o0672R009M461N9027J4316J9836k1875n0713q9208o1435
18562a41392m1882O0398J17098J65233J42708N5192M1190K6275L7829K4707n3739
18551D33617r0199R9263R2427M4728M1185o6610j12841j16508Q504L3540o2334
18540C04772q7671L0184R1887K6228M2473M3737k4244l8827l8964m5355K0144
$$ y = [1213441, 1218168, 1159361, 1094932, 1062149, 1019248, 984740, 939135, 880417, 838616, 816536, 816685, 828382, 827146, 805444, 833409, 848577, 788625, 715222, 686153, 673065, 700721, 736529, 667870, 622912, 515664, 422312, 444924, 437831, 314368, 188654, 89269, 34800, -41900, -33820, -87668, -115888, -117354, -138276, -118213, -2906, 65169, 55903, 106731, 153517, 194864, 224362, 156796, 113186, 35862, -24810, -15801, -11340, 47687, 62003, 81839, 59964, 9251, -79957, -141392, -183274, -122876, -5778, 159455, 302163, 357355, 398545, 424820, 462649, 487356, 433617, 343418, 442681, 535108, 579836, 621021, 554411, 441570, 325062, 333566, 367106, 304772, 217101, 247285, 339172, 365400, 407873, 451610, 427366, 388539, 349575, 304220, 324364]
18529C24364M0189K4378L1310J7370o2785p1018L4477J4465n8410M097P755k5379
18517B80813j226M7999J4581n7890q4941r1533M7854K0903N5282L1800j1338J8032
18505B70336j2871q0685n3814J7818N1407q235m685L6799K0235N467K0173j604
18493B60341l5236L8763O3469J4593M164j0746n819o1435n5451j0520p448L8387
18481B33062L2805l9250J9148M9579K4749J0102l6145k3510k2120k2706Q979M443
18469B39136o540K755M0663l0646k5922M307K7031k7499o2650M4428O9067J1343
18457B85473K4742k971l4048m3095K6518J0409L1832O382m7915p2184l8621o7642
18445G8880o9590N9644Q6862P9857L7641l8311l5251O3476j4969k5361M4583K6444
$$ y = [324364, 364553, 388931, 420241, 437611, 374826, 303808, 338285, 352750, 294340, 298437, 306192, 280813, 279587, 327586, 342167, 284277, 199336, 107803, 155657, 176560, 231842, 263642, 252304, 270336, 257465, 176780, 122966, 140784, 192191, 183956, 179271, 216070, 236305, 241772, 261945, 260341, 225105, 263868, 327337, 341930, 346094, 335348, 329529, 268094, 212643, 202123, 194675, 233062, 265867, 226617, 245765, 295344, 320093, 330195, 294050, 270540, 248420, 225714, 234693, 239136, 232596, 235351, 276014, 245368, 219446, 223753, 250784, 223285, 160635, 205063, 274130, 285473, 310215, 307244, 273196, 230101, 256619, 267028, 298860, 305242, 257327, 185143, 146522, 78880, 9290, 68934, 155796, 235653, 273294, 234983, 199732, 263208, 248239, 222878, 267461, 293905]
18433B93905o6960o1209n0852l5335j9183J1969L3000M3103j525j7966N2977o515
18421A75409l6874M62o506j2912l2446M2788k0458J4395M0626K1132j9300O4542
18409B30858L3999O268M8575M0151k8943p5256q2484l1663k2539J2289L855J6150
18397A51260k3812k9383k4248j6693n7121j0699k8637J5660J1933R6139L0288
18386A14687j8165q177P5043L6489K1239l281l5764K8331N5426j195j14496j0788
18374A39349M501l9553q2938r1129Q087O2833L6877M5852l674L6788k9759k6905
18362F0329O821m6444k8119N8454m4870k1063L1915J9119O36n2924o449O5103
18350D2508N0388k8845p2367p549M9920J0211J7878J5907N8461o0596l6022n4135
$$ y = [293905, 226945, 165736, 114884, 79549, 60366, 72335, 105335, 148438, 146913, 128947, 181924, 175409, 138535, 138997, 132491, 119579, 87133, 129921, 109463, 123858, 164484, 185616, 166316, 230858, 264857, 271125, 319700, 359851, 330908, 255652, 173168, 141505, 118966, 131255, 135110, 151260, 127448, 98065, 73817, 57124, 3, -10696, -39333, -23673, -11740, 84399, 114687, 96522, 88345, 163388, 199877, 221116, 217835, 182071, 210402, 265828, 264633, 150137, 139349, 143850, 104297, 21359, -69770, -61683, 1150, 38027, 83879, 80205, 116993, 87234, 60329, 67150, 20706, -7413, 51041, 6171, -14892, 17023, 36142, 36778, -16146, -22595, 42508, 92896, 64051, -8316, -15865, 34055, 44266, 62144, 78051, 136512, 75916, 39894, -14241]
18338a4241p7563L5910M5982K9037J6906j2116J7729K6728K3712r4608k5182O8543
18326D0837L7783r6o6546l7078k388K4371N8403N172k6543l8134m4683m706r598
18313f3206O550M8195j0742m6001L6510P1125L4184p650k4255J4690q878R7031
18301A47553n792m4718J4885J4669k2342J3858O2541J8194p065O835n384n6153
18289A37081j3752q523L3362K4139L5512N6580K4351l1472K9588K50K6835j0600
18277C03351j9810J6600J19764M7854M5073J8117J18291J26957J45642K35863
18267A157702K53436J52900J04090L0688L707K5970p3924o7115P9316J02215Q8281
18256A857266k1842p4470p9060j10947p9778j29605m4389J3668o3843j11340l9705
$$ y = [-14241, -91804, -55894, -9912, 19125, 36031, 23915, 41644, 68372, 92084, -2524, -27706, 40837, 78620, 78524, 11978, -25100, -27488, -3117, 55286, 60458, 33915, -4219, -48902, -53608, -63206, -56656, -8461, -19203, -65204, -28694, 42431, 76615, 68965, 44710, 59400, 50522, 147553, 141761, 97043, 111928, 126597, 104255, 118113, 180654, 198848, 191783, 198618, 193234, 137081, 123329, 114806, 148168, 172307, 207819, 264399, 288750, 257278, 286866, 287116, 313951, 303351, 283541, 300141, 419905, 467759, 512832, 530949, 649240, 776197, 921839, 1157702, 1411138, 1564038, 1668128, 1698816, 1702523, 1728493, 1654569, 1587454, 1666770, 1768985, 1857266, 1835424, 1760954, 1681894, 1570947, 1491169, 1361564, 1317175, 1330843, 1267000, 1155660, 1115955]
18245A115955K2688J7986q623r0073j06858j37977p9630n4664m5738j30817k3517
18234D78732J40591O4611P497K2940J1482j2250M2907J54510J20483J46779J39691
18223A317973J16002Q0535K3226N0752K2938j0140p28l929k6858k3008n5818m6269
18211A444676k0459p2794q2399k4217j439K8034J8567j03082j37183j24257q6493
18200H38954m7731k9363M8156J33579K16436J59659J35236j9947j14017p3620
18190A247342l1565m1738l1965j15768n2335J5998R822r8976j06628j61074m2737
18179E90376o8295p6788p6264l2000l9704l4558l2828l6996r014J5179j1L8554
18167B37651j8110m274N8922K211m9147j9229J0741L5865L7217P987M902l456
$$ y = [1115955, 1138643, 1156629, 1148006, 1057933, 951075, 813098, 733468, 678804, 633066, 502249, 478732, 619323, 683934, 691431, 714371, 725853, 713603, 756510, 911020, 1031503, 1178282, 1317973, 1433975, 1514510, 1537736, 1588488, 1611426, 1601286, 1600558, 1596629, 1569771, 1546763, 1490945, 1444676, 1424217, 1351423, 1269024, 1244807, 1243368, 1271402, 1289969, 1186887, 1049704, 925447, 838954, 791223, 761860, 810016, 943595, 1160031, 1319690, 1454926, 1434979, 1320962, 1247342, 1215777, 1174039, 1142074, 1026306, 973971, 989969, 999791, 900815, 794187, 633113, 590376, 522081, 445293, 369029, 337029, 297325, 262767, 229939, 192943, 183929, 199108, 199097, 237651, 219541, 215267, 274189, 276400, 227253, 208024, 218765, 254630, 291847, 299834, 304736, 301280]
18155C01280J4309P6926R1741M0605l794K3912J14703J68434J32731J25278Q8738
18144A174863j2008p4960r2153j3222L9573L1843J29785K03450K49342J95322
18134A831835Q9608j8810m3732N5176Q5957J16213J70619K65754K98166K20171
18124C070957K85888K93538L57937M32496N50531P05935Q85227J006336J301824
18115H890669J817149K564415L563757N035190P548545J3606159K5258827L6681303
18107A04966014K5703204j0759456l6691366k8239710j8386259j1886049p330472
18100A7375906m648646l061421k119823j564528j206408r05530o35190n54826
18092B679534m56973l56130k30672j38098j56474j86821q7686j03957j28276o7758
$$ y = [301280, 315589, 392515, 484256, 524861, 521067, 544979, 659682, 828116, 960847, 1086125, 1174863, 1162855, 1087895, 995742, 982520, 1022093, 1053936, 1183721, 1387171, 1636513, 1831835, 1921443, 1902633, 1858901, 1914077, 2000034, 2116247, 2286866, 2552620, 2850786, 3070957, 3356845, 3650383, 4008320, 4440816, 4991347, 5697282, 6582509, 7588845, 8890669, 10707818, 13272233, 16835990, 21871180, 29419725, 43025884, 68284711, 104966014, 130669218, 119909762, 83218396, 54978686, 36592427, 24706378, 17375906, 12727260, 9665839, 7546016, 5981488, 4775080, 3869550, 3234360, 2679534, 2222561, 1866431, 1635759, 1497661, 1341187, 1154366, 1066680, 962723, 834447, 766689]
18082G66689m1021o1061j9310j2213j6119n5577k9061k6756l7139J0238J0123
18071D88793j1527j8133m0701m769o85o2679k8916J0893j5062j1400O70n8309
18059B48175p6320K2167J7194o3169n7461p9451J5244K7127R3987L7811L953m0236
18047A49021j5836K5964P2687K1567j6025P569m4878o5462l5949l4269K8622q789
18035H4222m8302P444k8505J3240R5091P9982j9516n9499n0408m8151j2664L8847
18023E1781l783P952j2084j3979K6450r150J2416k8196P0840k7488o6533n009
18011C217K4070P5j3013K8482K8237m19j3274m8560n6502l2411K379R8395P0513
17998I1189j6261m1502Q720O348m0194o4785P539J4797L2822L9400M98K1232P460
$$ y = [766689, 725668, 664607, 645297, 633084, 616965, 561388, 532327, 505571, 468432, 478670, 488793, 477266, 459133, 418432, 413663, 412978, 350299, 321383, 332276, 317214, 305814, 306484, 248175, 171855, 194022, 211216, 148047, 90586, 11135, 26379, 53506, 147493, 185304, 189257, 149021, 133185, 159149, 231836, 253403, 237378, 244947, 200069, 134607, 98658, 64389, 93011, 84222, 35920, 43364, 14859, 28099, 123190, 203172, 183656, 124157, 73749, 25598, 12934, 51781, 47998, 55950, 43866, 29887, 56337, 47187, 59603, 31407, 102247, 74759, 8226, 3217, 27287, 27362, 14349, 42831, 71068, 70649, 57375, 8815, -47687, -80098, -77719, 20676, 91189, 74928, 33426, 42146, 48494, 8300, -56485, -48946, -34149, -1327, 38073, 38571, 59803, 67263]
17985F7263J2863l3016k5698p3675j5679J8495Q0481j683l2459k2624L1450L2296
17973C8014M2814O1207l6998j9056l7328K3791M7015r877K7078N906m5930P93
17961I7429K4813j4736j4909j0002o3632q5515k6294k5998K6624j8432q6793L9465
17949a57980J13984M5522k1108K8009M9690M362j6211J9396j2217n9323l8205
17938d4081M1957k023k9928M7063O5761n495o9209k4571J2673M4173j3175l052
17926B0093J399m147k7944P1027j2235J5176k5438j0530J596O6252M383l3727
17914F5905j7537k2498L3000J1607J8167r503N3942k0882j10063j9086R8102N2612
17902A33766m6173k7277l0386N409k9567k100j3911L6L7822L2601J2274q7099
$$ y = [67263, 80126, 47110, 21412, -52263, -67942, -49447, 31034, 29351, -3108, -25732, 5718, 38014, 80828, 142035, 105037, 85981, 48653, 72444, 119459, 109582, 136660, 142566, 96636, 97429, 122242, 107506, 92597, 82595, 18963, -66552, -92846, -118844, -92220, -110652, -197445, -157980, -43996, 1526, -19582, 8427, 58117, 62479, 46268, 65664, 53447, -5876, -44081, -2124, -4147, -34075, 12988, 78749, 73254, 4045, -20526, -7853, 36320, 23145, 20093, 21492, 17345, -10599, 60428, 48193, 63369, 37931, 27401, 28997, 95249, 99632, 65905, 48368, 25870, 58870, 70477, 88644, 79141, 133083, 112201, 2138, -16948, 81154, 133766, 87593, 60316, 29930, 35339, 5772, 3672, -10239, -10203, 27619, 60220, 72494, -14605]
17890a4605l8018j2164K0243j52J3319Q3919J4771m8284l0930J6723k8060r388
17878c2626M6944l3754n8880k6921L9324N3583K5526j4095K9329M4718o844k6978
17866C9326K3228J4830j0588o9148j7056J0439K2166O6347j8390m7487q9409J7572
17854e8170L3974k7628L1391n524j3332o247M891P0570P2774K472p4978L4742
17842F4935p882J526J2269k8703o9856J032l3553k1389J1503L0447M1427O119
17830G875J4782o373M4266L5960l0206m1711J7087j0456K8816L6019m9049R978
17818E6988R158l4599J3658o712M1735J0530j5192o5413l2041j7723J0976o247
17806c4882j0185L5465L9821K7365J9495k3663l7947L1608k2113k064N4643r509
$$ y = [-14605, -52623, -64787, -44544, -44696, -31377, 52542, 67313, 19029, -11901, 4822, -23238, -32626, 14318, -19436, -78316, -105237, -65913, -12330, 13196, -899, 28430, 73148, 66304, 39326, 62554, 77384, 66796, -2352, -19408, -8969, 13197, 79544, 61154, 13667, -75742, -58170, -24196, -51824, -20433, -25957, -39289, -45536, -40645, 29925, 102699, 105171, 30193, 64935, 57053, 58579, 70848, 42145, -27711, -26679, -60232, -81621, -70118, -39671, 1756, 7875, 22657, 16284, 60550, 96510, 66304, 24593, 41680, 31224, 60040, 96059, 47010, 56988, 66146, 31547, 45205, 38493, 80228, 90758, 75566, 10153, -21888, -39611, -28635, -34882, -45067, -9602, 30219, 57584, 77079, 53416, 15469, 47077, 24964, 22900, 77543, 68034]
17794F8034q0480n3115L9179M0793m4028p9483l3880N439M7921K8055K7827J8906
17782a4832l9717j0135j3188M4874L1302j9557m6960K0767n342n1414L6006K152
17770f6044j0055O6930j1889l2177K9286l5459l448L1138K2052L6037K661l1644
17758b612K9605n3051R985J1780n6128n1297K3544K7304j649J7790L3008j5358
17746b7079o5651j5440K8739O4212J2464J863j3119j9206K4329k2340O107K3006
17734b115j900k561n8184l0796M4796L7656K7173O568j4524j1937J3863r006K6721
17721B5754P277n6674o1160l4674P1301q467K5832J8227j9431M974P573k2085
17709d1553R576O1687p311j4097K0130k0885L9267k5216o9329K4167L9316m3037
$$ y = [68034, -12446, -65561, -26382, 14411, -29617, -109100, -142980, -137541, -89620, -61565, -33738, -14832, -54549, -64684, -77872, -32998, -1696, -21253, -68213, -47446, -52788, -104202, -68196, -66044, -76099, -9169, -21058, -53235, -23949, -59408, -62856, -31718, -9666, 26371, 29032, -2612, 26993, -26058, -16073, -4293, -60421, -111718, -88174, -60870, -62519, -44729, -11721, -27079, -92730, -108170, -79431, -15219, -2755, -892, -14011, -33217, -8888, -31228, -25121, -2115, -4015, -6576, -64760, -95556, -50760, -13104, 14069, 20637, 6113, -5824, 8039, -967, 25754, 33031, -23643, -84803, -119477, -48176, -56643, -30811, -12584, -32015, -27041, -19468, -41553, -31977, 29710, 22399, 8302, 28432, 7547, 46814, 21598, -47731, -23564, 15752, -27285]
17697b7285M599K747O496k777k6078L0736J5464j7257k2331M2695L6847k244p0603
17684b8991q0587q4039n4074M7719J12109j4465m163K8701n406m504Q0292J9657
17672A2249j256J0494k4397j3367L1697k470j00947L6558R703m6166k726m7634
17660a38262k4161M3503M5515k1682p143O5329K6515k0565j6262m4105l122M8376
17648d6064Q317J8698K6077K0124K2568p103k7753P918J6678K2833l5842J9724
17636D6175K0575l7240k686n1406L5521j0079k6324p370K8233o9884l988j0975
17624h9448O5019K8248j931M860L2013l9050m2345K333M8157k3376r8204m159
17612a17883R5100N1611J2723J9965M272p7748j4638J0728K3186J4046l0448q9657
$$ y = [-27285, -22686, -19939, -13443, -16220, -42298, -11562, 3902, -13355, -35686, 7009, 43856, 41612, -28991, -109578, -193617, -247691, -199972, -87863, -102328, -106491, -77790, -83196, -87700, -7408, 12249, 10993, 21487, -2910, -16277, 15420, 12950, -87997, -51439, -41736, -87902, -90628, -138262, -162423, -118920, -73405, -95087, -102230, -36901, -10386, -30951, -47213, -91318, -94440, -46064, -37747, -19049, 7028, 27152, 49720, 42617, 14864, 22782, 39460, 62293, 26451, 46175, 66750, 29510, 26824, -24582, 10939, 860, -25464, -32834, -4601, -74485, -78473, -89448, -24429, 3819, 1888, 6748, 38761, -289, -42634, -40301, 7856, -15520, -113724, -117883, -22783, 28828, 41551, 61516, 65788, -11960, -26598, -15870, 7316, 21362, -9086, -98743]
17600i8743L3253M2371m8332K9029N0223M1767l9810m6295m4951k2401K936k256
17588a03209J04126K7961P979m1202l1488j5622M1885p465n8254j8302j584N3800
17576d1375L1911j4940n7527p8113j1033M7973O0666M7237l1924l7918j1675j8154
17564a14872K2851M4514J6033J8103J6347j8372M819n614l2983l3976l7482m493
17552a25125J225J9498r756J5834K3385M0938J6691k956J681j8841l4982J5035
17540e7373O3569K0249n8382m5966l5037Q058l8853n1055P8718M5878K980l0743
17528i7957N2884N34j4262k9501n893K995J0236Q24m4602K6454J6340l2743r4504
17515b09195P962O1923M0900M2355L1184k0261m3593j5169J298L4678M9025J0437
$$ y = [-98743, -65490, -23119, -71451, -42422, 7801, 49568, 9758, -36537, -81488, -103889, -100953, -103209, 917, 28878, 36857, -4345, -35833, -51455, -9570, -17035, -75289, -93591, -95175, -41375, -9464, -24404, -81931, -160044, -171077, -123104, -62438, -15201, -47125, -85043, -96718, -114872, -92021, -47507, -31474, -13371, 2976, -15396, -10577, -16191, -49174, -83150, -120632, -125125, -123900, -104402, -114158, -98324, -74939, -34001, -17310, -20266, -18585, -37426, -72408, -57373, 6196, 26445, -31937, -77903, -112940, -104882, -143735, -194790, -116072, -70194, -67214, -97957, -45073, -44539, -58801, -88302, -94195, -91200, -80964, -80140, -124742, -98288, -81948, -114691, -209195, -201233, -139310, -98410, -56055, -24871, -45132, -88725, -103894, -102596, -67918, -18893, -8456]
17503h456J3510P1106p0173k8246J6919M1800J6229k192m5580k6785O9298j1842
17491C5588M185K2814m3031k3214K7279L8047j0560J0035l5738q2211n3449J1958
17479i8297M6019O5295L0172K8061m3607M941J6122p3021q1849R647Q483k2703
17467a10737Q1112M1431K1719M749L4576K5138l2065m3044l1833j5775m6706L3260
17455c8175J7822j7842m9640J5136J7540k2733k5235M171L3786J6827L2497M2988
17443B7142R0920R7676K20788K04074r6316j94301j14827q0160r3578m431p604
17432D9383K0451J6577r1702k6643r56K6044J0529K6446l3826K9943n469l1292
17420a0515o5266L6318M3651k1760j5039O1102K1631j6659q7748m3019J7214L0535
$$ y = [-8456, 5054, 76160, 5987, -22259, -5340, 36460, 52689, 50497, 4917, -21868, 47430, 35588, 39773, 62587, 19556, -3658, 23621, 61668, 51108, 61143, 25405, -56806, -110255, -98297, -52278, 13017, 43189, 71250, 27643, 32584, 48706, -24315, -106164, -96517, -88034, -110737, -29625, 11806, 33525, 38274, 72850, 97988, 65923, 22879, -8954, -24729, -71435, -38175, -20353, -38195, -87835, -72699, -55159, -77892, -103127, -98956, -65170, -48343, -15846, 27142, 118062, 215738, 436526, 640600, 544284, 349983, 235156, 154996, 61418, 56987, 49383, 69834, 86411, -5291, -31934, -32890, -6846, 3683, 30129, -3697, 26246, 20777, -10515, -75781, -39463, 4188, -17572, -32611, 28491, 50122, 33463, -54285, -97304, -80090, -49555]
17408d9555j1849M6237k0620l2439J6202J8329m702L2984M6238q681m256J9226
17396D7114p3492l4370L5162Q1068K9346o601l5322l9404j3349o6124p84K8170
17384d8586j1609o1469k7737P8472J4014k2484k146l5028k6582L9527L3923J5008
17372e4697Q2215M1220J961n4247o002J8638o7512k3288J4698J1193l337P4002
17360C4844N2165o8013l0206J5761K4863L3586n265k5681n2497k4890K2521j0874
17348c3686o5418O011J2384n5632P3830Q6056K4714p52Q461J5596J3691n4824
17336C0431l0583R550j1909M150M8615K345m6504j1038l838r1k6072J7140M1797
17323B3993J1922j23263l6984K9367J7583o861P445N8460L9039K031K9133j1648
$$ y = [-49555, -61404, -15167, -35787, -68226, -52024, -33695, -38397, -5413, 40825, 32144, 27888, 47114, -26378, -60748, -25586, 55482, 84828, 78227, 42905, 3501, -9848, -75972, -76756, -48586, -60195, -121664, -149401, -70929, -56915, -79399, -81545, -116573, -143155, -103628, -69705, -54697, 27518, 68738, 70699, 16452, 10450, 29088, -38424, -61712, -47014, -35821, -39158, 34844, 87009, 18996, -11210, 4551, 29414, 63000, 57735, 32054, -20443, -45333, -22812, -33686, -99104, -93093, -80709, -136341, -62511, 23545, 48259, 47507, 55968, 71564, 85255, 30431, -152, 9398, -2511, 1639, 50254, 52599, 6095, -4943, -8781, -8872, -34944, -17804, 23993, 35915, -87348, -124332, -94965, -77382, -84243, -76798, -18338, 20701, 22732, 51865, 40217]
17311D0217k4758m256M6885L6312k0098q1632J9363J6881r9794n5436K5067L4318
17299f6931R640k4070j2180M946M138j5862L0737J3489r669l2479O5434P2081
17287C9274N1235k9997o777k9116p9872N067J8949k7029l3809K3995P7512n353
17275D079j642j2037k5181j9310K4254K8330k8279l9742k0333K5186l766o501
17263g4942m9634j7861K9009R244M5032M9207k8303l9312J0178L9141l0241J4153
17251d4329K0027J0816l6593K8247K7214K6227M8043j1640k7819Q781K2497m3768
17239B7703p1221r400P8709K1413J6232q19J93k2265K5256m8085q039L0551O707
17226D6935j6344k5938J4159K2765j1205o496l7199L391r80k7721K8447J3786
$$ y = [40217, 15459, 11203, 58088, 94400, 74302, -7330, 12033, 28914, -70880, -126316, -101249, -66931, -57291, -81361, -93541, -88595, -84457, -100319, -69582, -56093, -65762, -98241, -32807, 39274, 90509, 60512, 53735, 24619, -55253, -50186, -31237, -58266, -92075, -68080, 9432, 4079, 2437, -9600, -34781, -54091, -29837, -1507, -29786, -69528, -89861, -64675, -68441, -74942, -124576, -142437, -113428, -104184, -59152, -9945, -38248, -77560, -67382, -28241, -58482, -44329, -24302, -13486, -50079, -21832, 5382, 31609, 79652, 68012, 40193, 48974, 71471, 27703, -43518, -52918, 25791, 47204, 63436, 62617, 62810, 40545, 65801, 17716, 9677, 40228, 46935, 30591, 4653, 18812, 41577, 30372, 23876, -13323, -9932, -10912, -38633, -10186, 3600]
17214C600Q0829m783k2759j0281j5329j9440n0174m4828o936K1248M8595k725
17202b2983q722j2507M2745M5429P2130M021o6676L384o3860j7476N3023M687
17190C3195l5929l7455O024L0455M781j5730M294J0865N1853J0074P537P047j0874
17177F6137j1980k6203l4817m101l0836M8592L430K8653j672J2292j3646m5129
17165i280o9903k5940M2105J6376j6444l5652l0230O1824q710P642L8662m8100
17153g7650J6159N5658j5824m4452K072L7191K546l8289k3144R303J3241N6000
17141g189Q1028K9221j8730j8440k6301l2374n2225j6993Q0874O821m2881l473
17129b0662J7784K8678K9401j0929m5912j6781J3108Q811J0434j648k2921j4882
$$ y = [3600, 84429, 79646, 56887, 46606, 31277, 11837, -38337, -83165, -90101, -68853, -20258, -22983, -31705, -44212, -1467, 43962, 116092, 120113, 53437, 56821, -7039, -24515, 28508, 33195, -2734, -40189, -34165, -3710, 1071, -14659, -10365, 500, 52353, 62427, 69964, 77011, 66137, 54157, 27954, -6863, -10964, -41800, 6792, 10222, 38875, 37203, 49495, 35849, -9280, -79183, -105123, -63018, -46642, -63086, -98738, -128968, -67144, -75854, -68212, -29550, -77650, -61491, -5833, -21657, -66109, -64037, -26846, -24300, -62589, -85733, -76430, -63189, -7189, 73839, 103060, 84330, 65890, 39589, 7215, -45010, -62003, 18871, 25692, -17189, -20662, -2878, 25800, 55201, 44272, -1640, -18421, -5313, 3498, 13932, 12284, -10637, -25519]
17117b5519J6863o778K6947L0787J88K4898k8199m3249M0409J1578o3446l1552
17105d7073n499M8707K2378K7819j320l6783j3812o7836O0220L6722L732J0552
17093C7807k6658k0321o285Q197Q074R806L2973n706k515L1064j9261j6713M4743
17080G5205o2472p4384N3880J3970o059J1541l7036o4681j5121K4538N2121N8293
17068B9795M3370K6242n8398m4243p5360n1874o818J3149O8667N4212K6712l8574
17056a3120j4943J5014l6443J4688l0702k1442J5717L2692j9577k4173M0255k2683
17044f4717N88O8525R4254K0856r630K7474k848n7723k9135l1759k6162l354m6854
17031f0485O247P300o080Q291k8580m8043n2766O6934M0036j8669Q757N1433M4134
$$ y = [-25519, -8656, -15434, 11513, 42300, 42488, 67386, 39187, -4062, 36347, 47925, -15521, -47073, -52572, -3865, 18513, 46332, 45012, 8229, -5583, -73419, -13199, 23523, 27255, 37807, 11149, -9172, -15457, -7260, 814, 10620, 43593, 37887, 35372, 66436, 47175, 30462, 75205, 12733, -61651, -7771, 6199, 140, 11681, -25355, -90036, -105157, -80619, -28498, 29795, 73165, 99407, 41009, -3234, -78594, -130468, -137286, -124137, -55470, -1258, 25454, -13120, -28063, -13049, -49492, -34804, -65506, -86948, -71231, -38539, -58116, -82289, -42034, -64717, -64129, 4396, 98650, 119506, 109876, 137350, 134502, 76779, 47644, 15885, -10277, -13631, -60485, -54238, -46938, -53018, -44727, -73307, -121350, -174116, -107182, -67146, -85815, -77058, -25625, 18509]
17018A8509l7272j4204L3100k9503q971j37o446L469R063J1323j6428o0549L9935
17005e8111Q1441p6345m0175L026k3406p886j503K3570M8749K4399l9314j0430
16993g5985L3314K3965j6723j8539K7883j5833m3411j7225O3030M935M498j6124
16981d6215N2135M2771k299m0807p153L46k2734m8870k2953K3830M0750R674j9950
16968d1475K0464k7165J0289N6126j5127m455Q358j4272j1952m0336J2034k8144
16956g5655K6648L9409J2798R861m9440o5449J5223q508o148N1223q133R832J832
16943d6507M8908M3612R538j9376k9945n893K8331K7200K2890K7515K6266m0389
16931I2150o9652m3049j5499K1685J4605Q10k0110o440R690L7733j4397K9247
$$ y = [18509, -18763, -32967, 133, -29370, -38341, -38478, -44924, -41455, -32392, -21069, -37497, -98046, -58111, 23330, -53015, -93190, -90164, -113570, -121456, -122959, -99389, -50640, -26241, -65555, -75985, -42671, -18706, -35429, -53968, -26085, -41918, -85329, -102554, -39524, -34589, -30091, -46215, 5920, 48691, 46392, 5585, -1568, -1222, -23956, -72826, -95779, -71949, -31199, -21525, -41475, -21011, -48176, -37887, 18239, 3112, -1343, 7015, -7257, -19209, -59545, -47511, -75655, -49007, -9598, 3200, 13061, -36379, -101828, -86605, -95113, -101261, -50038, -58171, -48339, -46507, 2401, 46013, 55551, 36175, 6230, 337, 28668, 55868, 78758, 106273, 132539, 92150, 22498, -20551, -36050, -14365, 240, 1050, -19060, -25500, -15810, 21923, 7526, 36773]
16919C6773K8248p8971j3983K1909K9307j6366m3317O929M5747M1168K5520J714
16907H4678j6019m964l6371l3071K6605l022J5110j0412j4764j6474j880m1261
16895e1845N6254K9660p296L1012J9343J1895j5838o3482P87L2472N3896m6064
16883E0794k9381p8460k3076J8237N6293M7386l0936m7601O139j4795Q153O7378
16871C0131j1789n6756N5986L9495j6363j1731p303K9881J034m8235L7346r352
16859C2344k2548n8349m0907L4685N6446J3294J7152k047r67k7390k6541k8580
16847e3408k146L5373N7505j5508M4654j4089l9038l8096p3465l6744M8121M5648
16835d1193p648m8491k1092M4243L7073P053r679M2830N5475j3950p8900j2955
$$ y = [36773, 65021, -13950, -27933, -6024, 23283, 6917, -36400, -29471, 16276, 57444, 82964, 84678, 68659, 63695, 27324, -5747, 20858, 17836, 32946, 22534, 7770, -8704, -10584, -51845, 4409, 34069, 26773, 57785, 77128, 89023, 73185, 9703, 10490, 42962, 96858, 50794, 21413, -57047, -80123, -61886, -5593, 41793, 10857, -36744, -30605, -45400, -37247, 30131, 18342, -38414, 17572, 57067, 40704, 28973, 21670, 51551, 52585, 4350, 41696, 32344, 9796, -48553, -89460, -54775, 1671, 14965, 32117, 30070, 29103, 1713, -24828, -53408, -55554, -20181, 37324, 21816, 66470, 52381, 13343, -24753, -98218, -134962, -86841, -41193, -48841, -97332, -118424, -74181, -37108, -30055, -39734, 3096, 58571, 44621, -34279, -47234]
16823d7234q020p693j680l263k1919J04990O7842J393r6627n0141L6981J7673
$$ y = [-47234, -55254, -62947, -64627, -67890, -89809, 15181, 83023, 84416, -12211, -62352, -25371, -7698]
$$ [...]
##END NTUPLES=NMR SPECTRUM
##END=
