##TITLE=Analysis number 308803
Compound Code cc 33109
Book Reference 414/84/5
Project Code adrs
Chemist Name mattw
##JCAMPDX= 6.0         $$ Bruker NMR JCAMP-DX V2.0
##DATA TYPE= NMR SPECTRUM
##DATA CLASS= NTUPLES
##ORIGIN= Bruker BioSpin GmbH
##OWNER= NMR
$$ XWIN-NMR		Version 3.5
$$ Wed May 25 10:24:05 2005 GMT Daylight Time (UT+1h)  MAYBRIDGE\NMR@NMR_250MHZ
##.OBSERVE FREQUENCY= 250.131544655141
##.OBSERVE NUCLEUS= ^1H
##.ACQUISITION MODE= SIMULTANEOUS (DQD)
##.ACQUISITION SCHEME= undefined
##.AVERAGES= 16
##.DIGITISER RES= 18
##SPECTROMETER/DATA SYSTEM= dpx250
##.PULSE SEQUENCE= zg30
##.SOLVENT NAME= CDCl3
##.SHIFT REFERENCE= (INTERNAL, CDCl3, 0, 16.4556)
##AUDIT TRAIL= $$ (NUMBER, WHEN, WHO, WHERE, WHAT)
$$ ##TITLE= Audit trail, XWIN-NMR		Version 3.5
$$ ##JCAMPDX= 5.01
$$ ##ORIGIN= Bruker BioSpin GmbH
$$ ##OWNER= NMR
$$ C:\u/data/dgb/nmr/ADRS/3500/pdata/1/auditp.txt
$$ ##AUDIT TRAIL=  $$ (NUMBER, WHEN, WHO, WHERE, WHAT)
(   1,<2005-05-25 10:23:46.38 +100>,<MAYBRIDGE\NMR>,<NMR_250MHZ>,
      <created by zg, POWCHK disabled, PULCHK disabled
       configuration hash MD5:
       62 19 C7 07 E1 42 D1 B7 37 6C 3D D0 77 39 F9 E6
       data hash MD5: 64K
       9D F1 7E 56 9F 83 A4 B0 D2 F0 54 0B 9A 6F E3 9C>)
(   2,<2005-05-25 10:23:57.26 +100>,<MAYBRIDGE\NMR>,<NMR_250MHZ>,
      <Start of raw data processing
       ef LB = 0.3 FT_mod = 6 PKNL = 1 SI = 32K 
       data hash MD5: 32K
       B1 B1 62 C1 22 E4 5A 1E 22 45 F0 3B 61 E9 20 A8>)
(   3,<2005-05-25 10:23:59.24 +100>,<MAYBRIDGE\NMR>,<NMR_250MHZ>,
      <apk 
       data hash MD5: 32K
       B1 D3 35 05 C9 8E E7 1E D6 8F E1 D5 32 AB A9 FD>)
(   4,<2005-05-25 10:23:59.92 +100>,<MAYBRIDGE\NMR>,<NMR_250MHZ>,
      <abs ABSG = 5 
       data hash MD5: 32K
       75 05 AC 6E EC E1 75 53 75 24 44 AC 1C 4E 95 C9>)
$$ ##END=
$$ 
$$ hash MD5
$$ 33 7A A0 A0 5E 5A 94 68 A4 6B 49 84 B9 EC C6 A9
##$RELAX= 
##$RELAX= 
##$RELAX= 
##$RELAX= 
##$RELAX= 
##$RELAX= 
##$RELAX= 
$$ Bruker specific parameters
$$ --------------------------
##$DU= <C:\u>
##$EXPNO= 3500
##$NAME= <ADRS>
##$PROCNO= 1
##$TYPE= <nmr>
##$USER= <dgb>
##$AMP= (0..31)
100 100 100 100 100 100 100 100 100 100 100 100 100 100 100 100 100 100 
100 100 100 100 100 100 100 100 100 100 100 100 100 100 
##$AQSEQ= 0
##$AQ_mod= 3
##$AUNM= <au_zg>
##$AUTOPOS= <11 >
##$BF1= 250.13
##$BF2= 250.13
##$BF3= 250.13
##$BF4= 250.13
##$BF5= 500.13
##$BF6= 500.13
##$BF7= 500.13
##$BF8= 500.13
##$BYTORDA= 1
##$CFDGTYP= 0
##$CFRGTYP= 5
##$CHEMSTR= <none>
##$CNST= (0..31)
1 1 145 1 1 1 1 1 1 1 1 1 1 1 1 1 1 1 1 1 1 1 1 1 1 1 1 1 1 1 1 1 
##$CPDPRG= <>
##$CPDPRG1= <>
##$CPDPRG2= <>
##$CPDPRG3= <>
##$CPDPRG4= <mlev>
##$CPDPRG5= <mlev>
##$CPDPRG6= <mlev>
##$CPDPRG7= <mlev>
##$CPDPRG8= <mlev>
##$CPDPRGB= <>
##$CPDPRGT= <>
##$D= (0..31)
0 1 0 0 0 0 0 0 0 0.06 0 0 0 0 0 0 0.0002 0 0 0 0 0 0 0 0 0 0 0 0 0 0 
0 
##$DATE= 1117013025
##$DBL= (0..7)
120 120 120 120 120 120 120 120 
##$DBP= (0..7)
150 150 150 150 150 150 150 150 
##$DBP07= 0
##$DBPNAM0= <>
##$DBPNAM1= <>
$$ [...]
##$SUBNAM8= <"">
##$SUBNAM9= <"">
##$SW= 20.6930455092707
##$SWIBOX= (0..15)
0 0 3 0 0 0 0 0 0 0 0 0 0 0 0 0 
##$SW_h= 5175.983436853
##$TD= 65536
##$TD0= 1
##$TE= 295.16
##$TE2= 300
##$TE3= 300
##$TEG= 300
##$TL= (0..7)
0 120 120 120 120 120 120 120 
##$TP= (0..7)
150 150 150 150 150 150 150 150 
##$TP07= 0
##$TPNAME0= <>
##$TPNAME1= <>
##$TPNAME2= <>
##$TPNAME3= <>
##$TPNAME4= <>
##$TPNAME5= <>
##$TPNAME6= <>
##$TPNAME7= <>
##$TPOAL= (0..7)
0.5 0.5 0.5 0.5 0.5 0.5 0.5 0.5 
##$TPOFFS= (0..7)
0 0 0 0 0 0 0 0 
##$TUNHIN= 0
##$TUNHOUT= 0
##$TUNXOUT= 0
##$USERA1= <user>
##$USERA2= <user>
##$USERA3= <user>
##$USERA4= <user>
##$USERA5= <user>
##$V9= 5
##$VALIST= <valist>
##$VCLIST= <CCCCCCCCCCCCCCC>
##$VD= 0
##$VDLIST= <DDDDDDDDDDDDDDD>
##$VPLIST= <PPPPPPPPPPPPPPP>
##$VTLIST= <TTTTTTTTTTTTTTT>
##$WBST= 1024
##$WBSW= 4
##$XGAIN= (0..3)
0 0 0 0 
##$XL= 0
##$YL= 0
##$YMAX_a= 419469
##$YMIN_a= -292676
##$ZGOPTNS= <>
##$ZL1= 120
##$ZL2= 120
##$ZL3= 120
##$ZL4= 120
##$ABSF1= 16.45559
##$ABSF2= -4.237583
##$ABSG= 5
##$ABSL= 3
##$ALPHA= 0
##$AQORDER= 0
##$ASSFAC= 0
##$ASSFACI= 0
##$ASSFACX= 0
##$ASSWID= 0
##$AUNMP= <proc_1d>
##$AZFE= 0.1
##$AZFW= 0.1
##$BCFW= 0
##$BC_mod= 0
##$BYTORDP= 0
##$COROFFS= 0
##$CY= 12.5
##$DATMOD= 1
##$DC= 0
##$DFILT= <>
##$DTYPP= 0
##$F1P= 14.0000005364418
##$F2P= -0.99999901652339
##$FCOR= 0.5
##$FTSIZE= 32768
##$FT_mod= 6
##$GAMMA= 0
##$GB= 0
##$INTBC= 1
##$INTSCL= 1
##$ISEN= 128
##$LB= 0.3
##$LEV0= 0
##$LPBIN= 0
##$MAXI= 10000
##$MC2= 0
##$MEAN= 0
##$ME_mod= 0
##$MI= 0
##$NCOEF= 0
##$NC_proc= -4
##$NLEV= 6
##$NOISF1= 0
##$NOISF2= 0
##$NSP= 0
##$NTH_PI= 0
##$NZP= 0
##$OFFSET= 16.45559
##$PC= 1
##$PHC0= -62.19186
##$PHC1= -10.84267
##$PH_mod= 1
##$PKNL= yes
##$PPARMOD= 0
##$PSCAL= 4
##$PSIGN= 0
##$REVERSE= no
##$SF= 250.130016609128
##$SI= 32768
##$SIGF1= 0
##$SIGF2= 0
##$SINO= 400
##$SIOLD= 32768
##$SREGLST= <1H.CDCl3>
##$SSB= 0
##$STSI= 32768
##$STSR= 0
##$SW_p= 5175.98343685301
##$SYMM= 0
##$S_DEV= 0
##$TDeff= 65536
##$TDoff= 0
##$TI= <Analysis number 999999
Compound Code 99
Book Reference 9
Project Code 9>
##$TILT= no
##$TM1= 0
##$TM2= 0
##$TOPLEV= 0
##$USERP1= <user>
##$USERP2= <user>
##$USERP3= <user>
##$USERP4= <user>
##$USERP5= <user>
##$WDW= 1
##$XDIM= 32768
##$YMAX_p= 408541879
##$YMIN_p= -386031
$$ End of Bruker specific parameters
$$ ---------------------------------
##NTUPLES= NMR SPECTRUM
##VAR_NAME=  FREQUENCY,     SPECTRUM/REAL,   SPECTRUM/IMAG
##SYMBOL=    X,             R,               I
##VAR_TYPE=  INDEPENDENT,   DEPENDENT,       DEPENDENT
##VAR_FORM=  AFFN,          ASDF,            ASDF
##VAR_DIM=   32768,         32768,           32768
##UNITS=     HZ,            ARBITRARY UNITS, ARBITRARY UNITS
##FACTOR=    0.157963299565203, 1,           1
##FIRST=     4116.03682352966, 0,            0
##LAST=      -1059.94661332335, 0,           0
##MIN=       -1059.94661332335, -386031,     0
##MAX=       4116.03682352966, 408541879,    0
$$ Real data points
##PAGE= N=1
##DATA TABLE= (X++(R..R)), XYDATA
$$ [...]
19357A420571k05225P867l9210n4828l6058p1379j05321m9931n7228j00775k3444
19346F85039K520K8175K0992k229m0067k5309p9698n7263j18517J7929P7282N9766
19334E68620k6254l8450l6016J0814L064O0832M5849n6789q2089m4257K2385j8348
19322D09361p1428Q953K6795o0275O4869J04063m4947n2161l0368o0104l2371
19311B62387o1375K356l8179K0421L4963K9837N5550l4096K922n6274n459N4851
19299B67904Q0872K0517m0154n6580l1409m0610k7264J6344O8315J1043M164m3798
19287B29344l5517M7985O1025j4260k5469o3028q063P7200J5784m9222o4349l5001
19275A36429K3990K9526J8712M3808j578l8149l0175j4619J759K9887N749J3890
$$ plain form
19357 1420571 1215346 1223213 1184003 1129175 1093117 1021738 916417 866486 809258 708483 685039
19346 685039 687559 715734 736726 734497 694430 669121 589423 532160 413643 431572 508854 568620
19334 568620 542366 503916 467900 478714 481778 542610 588459 531670 449581 405324 427709 409361
19322 409361 337933 346886 373681 313406 378275 482338 437391 385230 354862 294758 262387
19311 262387 201012 203368 165189 185610 220573 250410 305960 271864 274786 218512 213053 267904
19299 267904 348776 369293 329139 272559 241150 200540 173276 189620 257935 268978 273142 229344
19287 229344 193827 241812 302837 288577 263108 200080 192017 269217 285001 235779 171430 136429
19275 136429 160419 189945 208657 252465 250887 212738 182563 167944 169703 199590 205339 219229
19263B19229P4468R2909L8240p1917r2950L990r803k0493L7400M2945o490n2533
19251B54995k1107P1875R2005o8460j57615m392M5687Q1066o717j1643m2780m8640
19239A84274N199J6519k3797n4851J7657o1453m0534O623O7042l8010j3312M5675
19227A11032J7527P0986M432l0088K2262o7673r611j7414n9574R8259J6423l3382
19215A23179L4458J12784q6422l397j4171k5558N9852l2029k4088O724Q90m6895
19203A05327q01P5584L9001k7740j4660j6105K6682q7869L0283N0374k6140M8796
19191B02732L588l5800K0837q54l5961j3123P0381N0351j7954m2621j04611j4289
19179H2676P2595K7180J9280l8910L260J6317K2956L9176K6754L1053P3903J2161
$$ plain form
19263 219229 293697 386606 424846 352929 259979 263969 254166 233673 271073 314018 307528 254995
19251 254995 233888 305763 397768 329308 171693 167301 212988 294054 287337 275694 232914 184274
19239 184274 189473 205992 182195 127344 145001 83548 43014 49637 116679 78669 65357 111032
19227 111032 128559 199545 203977 173889 196151 128478 118867 101453 41879 140138 156561 123179
19215 123179 157637 270421 183999 180602 166431 140873 200725 168696 144608 151332 152222 105327
19203 105327 104526 180110 219111 191371 176711 160606 187288 99419 129702 180076 153936 202732
19191 202732 206320 170520 191357 190503 154542 141419 211800 262151 244197 201576 96965 82676
19179 82676 155271 182451 201731 162821 166081 182398 205354 244530 271284 302337 376240 388401
19167C88401k6302L2940J39861Q9855J82445J72593J06729Q2081p8469j00586
19157I89548m807O9070j9117n722J06805j5227l3179j33703j42394j26419j28389
19146E56466j81511o7385k0820J9528m5243j5703L0479r0386n7089n7808J1599
19135H2127L8824k360O025J2790n5597k6997L1333L6452M5803K8597k1397n2475
19123A23125k1014R633L8803m085m1030L1513M2013l5850o7669r397k5875J2995
19111E3162p2577K2157K5243q006M6717j8786n4154Q5732L0083J1536O0619K603
19099A84329J1311k2708J9462l3624L0946J15962J66975J31630J39919N9994J126
19088H05322J2353O5652M3600J5512m616J6759M8066K6213l8020k6317J4525j00740
$$ plain form
19167 388401 362099 395039 534900 624755 807200 979793 1086522 1168603 1090134 989548
19157 989548 984741 1053811 1034694 1028972 1135777 1120550 1087371 953668 811274 684855 556466
19146 556466 374955 307570 286750 306278 261035 245332 275811 185425 128336 70528 82127
19135 82127 120951 118591 124616 137406 81809 54812 86145 122597 168400 196997 175600 123125
19123 123125 102111 111744 150547 146462 105432 136945 178958 143108 75439 66042 40167 53162
19111 53162 -19415 2742 27985 19979 66696 47910 -6244 79488 109571 121107 181726 184329
19099 184329 195640 172932 192394 158770 189716 305678 472653 604283 744202 804196 805322
19088 805322 817675 883327 926927 942439 937823 954582 1002648 1028861 990841 964524 979049 878309
19076H78309j74863j78061n8744o0417m8030O5175m4686m1062l4590N0083j6981
19065C36133n2539p1499l5908M6031M5441o4849p6773l4401K0536J05621O6970
19054B84763o2821j4728l7780l825J0099k7223L990L1172L947l2862M1045P5837
19042B71614K3383o2752j1087m7297q8169O476Q3023r048J8875m5291k8948Q385
19030A19164K8424J9134M674j6263J4019L4100K339R034j4087l4513J3505K4081
19018B03611l5251j0230O8777k2667n1081k0558J4871k1909n0037j2788K9170
19007I1908l6729J12892O6870K6813j6084N6450l8455j2306M4043j972o5356k6679
18995B01395J4126k6174r0871j8560J19053l1084n6899O2347O7160m2026L4567
$$ plain form
19076 878309 703446 525385 466641 406224 358194 423369 378683 337621 303031 353114 336133
19065 336133 283594 212095 176187 222218 267659 202810 126037 91636 112172 217793 284763
19054 284763 221942 207214 169434 165609 175708 148485 152475 183647 187594 154732 195777 271614
19042 271614 294997 232245 221158 173861 85692 92168 175191 166143 185018 139727 110779 119164
19030 119164 147588 166722 171396 155133 169152 203252 205591 214625 200538 166025 179530 203611
19018 203611 168360 158130 226907 204240 153159 132601 147472 125563 75526 62738 91908
19007 91908 55179 168071 234941 261754 245670 302120 263665 251359 295402 293430 228074 201395
18995 201395 215521 189347 98476 79916 198969 167885 110986 173333 240493 198467 233034
18984B33034l4980l5532N3798K3487l5362R648J62311J10100J3721N3750J7389
18973E71364N8151M6829M5438P873m6745j3421K3660l7479K8498r0873j5683L9529
18961F17141j17964j33869j25090p2110l0406l6977Q332J0763n6112L198L1055
18950I7961j1601O75m6627J8899j1062L0340L6203M2011K9009m35J861M3020O8430
18937B98684l1375j3317J5307k3314m2779p2823M9071M5029O8666k1137J5728
18926B87740j2286p796N2582l3366J23J7136J8572J00722O2608m965N3435L4492
18914E68997L9773N3723P0084M42Q879K7367o6392p6962N805l3388n9714q3570
18902D55044q7608o1122m0695m8353j9746m5820K8843J1341J2446N9133Q2349
$$ plain form
18984 233034 198054 162522 216320 239807 204445 214093 376404 486504 500225 553975 571364
18973 571364 629515 676344 721782 729655 682910 669489 693149 655670 684168 593295 577612 617141
18961 617141 499177 365308 240218 168108 137702 100725 109057 119820 63708 66906 97961
18950 97961 86360 87035 40408 59307 48245 78585 114788 156799 185808 185373 187234 230254 298684
18937 298684 267309 253992 269299 245985 203206 130383 179454 224483 293149 272012 287740
18926 287740 275454 267658 320240 286874 286997 304133 322705 423427 486035 481070 534505 568997
18914 568997 608770 662493 732577 733019 741898 769265 702873 625911 631716 598328 538614 455044
18902 455044 367436 306314 265619 217266 197520 151700 180543 191884 204330 263463 345812
18891C45812n3371j22116o9990o5188O6224M4072m834l1416r7070m7342J40777
18880A05558J11857l3431j3189j9895J4682K1686R483l3731k9819J01251J1200
18869B45652m0454l8840K6373q1974m3421J019k891M0597M2944M4522P219J0235
18857B10981L3838N1487n6035k4439J7377p134m9357M2960P596J4478M8014L0758
18845C20524l9119k2994j1416N008O3396O4926j0500o9855K8222P5959N2415O0391
18833E16957N3126J14588R9363k8367l1774L8505L282K1270J23970J17571O0226
18822A088717L5696k9525j3326Q100j04139q3649o0776L7635J30356J06697n6261
18811A059525r0216p8483j57617l2536J8574m8630p8147m0125l9734j1823j14684
$$ plain form
18891 345812 292441 170325 100335 35147 101371 145443 140609 109193 12123 -35219 105558
18880 105558 217415 183984 170795 150900 165582 187268 196751 163020 133201 234452 245652
18869 245652 205198 166358 192731 110757 67336 68355 65464 106061 149005 193527 200746 210981
18857 210981 244819 296306 240271 215832 233209 226075 176718 219678 227274 241752 289766 320524
18845 320524 281405 258411 246995 252003 315399 380325 369825 299970 328192 404151 456566 516957
18833 516957 570083 684671 784034 755667 723893 762398 765680 786950 910920 1028491 1088717
18822 1088717 1124413 1094888 1081562 1089662 985523 901874 841098 878733 1009089 1115786 1059525
18811 1059525 969309 890826 733209 700673 719247 670617 592470 552345 512611 500788 386104
18800C86104l1752m0393m0985M3533O8824N0198p2521r5012m746K6037K1812j3288
18788B97811o1337p4885J8057K57n3957Q2680O6784Q0400J8068p9451o3025M6154
18776B77556K4827L2198J6540M0003m6731l1562M0940J36266J94332K32761K82717
18765A199847m1334j86288k60814j63353r5545o6271J8984k8836n7130J1222J7682
18754C48164j5551Q5070K1088r1600p858O749P8517l5475m7026L9592L3572M0446
18742D55688J3431N2917K1106j05877J1168K9683k6166K6402n9359M495N2198
18731D75686p1411k4781N9652P4177K2674o0253j2807K4823J0522M5383n6721
18720D86944j08345m3231J0154k9831k1468K818o9990K0162K9292J14343Q4330
$$ plain form
18800 386104 354352 313959 272974 316507 385331 435529 363008 267996 263250 289287 311099 297811
18788 297811 236474 161589 179646 179903 125946 208626 275410 355810 373878 294427 231402 277556
18776 277556 302383 334581 351121 391124 344393 312831 353771 490037 684369 917130 1199847
18765 1199847 1158513 972225 711411 548058 452513 386242 405226 376390 319260 330482 348164
18754 348164 332613 417683 438771 347171 339313 346062 424579 389104 342078 381670 415242 455688
18742 455688 469119 522036 543142 437265 448433 478116 451950 478352 418993 423488 475686
18731 475686 404275 379494 439146 513323 535997 475744 462937 487760 498282 543665 486944
18720 486944 378599 335368 345522 315691 294223 297041 227051 247213 276505 390848 475178
18709D75178J0756Q236k6582n0707k6740N246M3394N3433J4831j5257q9932l1450
18697C70406J58697P2996m0312M4059Q3780n724j26304l0358j2380P1191Q2812
18686F68863M1884p5756J629k2137m7252l3463m9435N173M0092K0498L0955n6448
18674E24603m107P7679N8641l6404N8846n5623j31029P2035N930M9376J05734
18663G25681R402P9395O1369n5170l0103O455p9552p7877N613L2954J10542R4441
18651H83150K1299Q1305j8273j8589l3701n8215K3913Q2923M9779K0969N2886
18640A087446P1544m3342k4359o449J0482j8711N790M4455k0432L1050O9385k5899
18628A180960Q3789P5399J17491N9005J12032J81077J89885K12611K30909J22632
$$ plain form
18709 475178 485934 494170 467588 416881 390141 395387 438781 492214 507045 491788 401856 370406
18697 370406 529103 602099 561787 605846 689626 683902 557598 527240 514860 586051 668863
18686 668863 710747 634991 636620 614483 567231 533768 484333 489506 529598 550096 581051 524603
18674 524603 520496 598175 656816 620412 679258 623635 492606 564641 570571 619947 725681
18663 725681 735083 814478 875847 820677 790574 797029 717477 639600 645213 678167 788709 883150
18651 883150 904449 985754 967481 948892 915191 856976 880889 963812 1013591 1034560 1087446
18640 1087446 1158990 1115648 1091289 1084840 1095322 1076611 1082401 1126856 1106424 1137474 1206859 1180960
18628 1180960 1264749 1340148 1457639 1516644 1628676 1809753 1999638 2212249 2443158 2565790
18618B565790Q66n8513M1704O8887Q6929J51692K38201J30050J04172l102J06295
18607C432971J74631K12696J42935p017o5696k5296K00352K61237K96208K08695
18597D831716J04260l0908j00724q036J07756J92360J86365K06885J85253M27706
18587F102633N44494O99646Q28021Q45786J012158J331022J650819K015615K723321
18578A7753515L679076N046241P279286J0855584J6432385K4554775L3893617
18571A19494479L8494492L0198539R191596j2044296k0820274j4117304J647729
18564A52044961J9125810L0150233K4984654K167362k5408777m1494957m1550764
18557A20018522l3026815k3390087j5927687j0964435p660657n450922l934944
$$ plain form
18618 2565790 2566656 2508143 2549847 2618734 2705663 2857355 3095556 3225606 3329778 3326676 3432971
18607 3432971 3607602 3820298 3963233 3956216 3890520 3865224 4065576 4326813 4623021 4831716
18597 4831716 4935976 4905068 4804344 4796308 4904064 5096424 5282789 5489674 5674927 6102633
18587 6102633 6647127 7346773 8174794 9020580 10032738 11363760 13014579 15030194 17753515
18578 17753515 21432591 26478832 33758118 44613702 61046087 85600862 119494479
18571 119494479 157988971 188187510 197379106 185334810 164514536 150397232 152044961
18564 152044961 171170771 201321004 226305658 228473020 203064243 161569286 120018522
18557 120018522 86991707 63601620 47673933 36709498 29048841 23597919 19662975
18550A9662975k966890k356951j850590j474147j259377j005919q16053o67209
18542G265839n43977m90596l62098k46066j69080j47389j02651p2626k4683p8828
18532E027845m2843j28976j23249p2159r9862l7291J10360P8393k2479j65255
18522D524484k12141j31089M8730K12598K43400K40256K48157K25421R0188r36
18512E489068Q1549K32792L84538L76287K50250J23227R9525J98684R5942J40938
18502G472800L76237L77078M11841M92098P48432Q58861J122728J394074J909337
18493A5163486K587117L437823M880039P188179J0979367J6769901K3884192K8652072
18485A13542176K5869625J6650180R355839R777415J3008099R663829Q55438n355716
$$ plain form
18550 19662975 16696085 14339134 12488544 11014397 9755020 8749101 7933048 7265839
18542 7265839 6721862 6231266 5869168 5623102 5454022 5306633 5203982 5131356 5106673 5027845
18532 5027845 4985002 4856026 4732777 4660618 4560756 4523465 4633825 4712218 4689739 4524484
18522 4524484 4312343 4181254 4229984 4442582 4685982 4926238 5174395 5399816 5490004 5489068
18512 5489068 5570617 5803409 6187947 6564234 6814484 6937711 7037236 7235920 7331862 7472800
18502 7472800 7849037 8226115 8637956 9130054 9878486 10737347 11860075 13254149 15163486
18493 15163486 17750603 21188426 26068465 33256644 44236011 61005912 84890104 113542176
18485 113542176 139411801 156061981 165417820 175195235 188203334 197867163 198722601 193366885
18477A93366885p518660r463629j0434175p005305k730357n816059j6239907k5250011
18469A08908782k6513520k1493020j5192830j0314481p049855m854509l249669
18462B0240898k403211j655234j048579n60962j24625K61453O89338J272494K205809
18453A8877381L578522N358498P750111J0184854J1624009J1075886Q755779O372701
18445H3577741N754800O443259O178349L354122j603911o075158q352011q394056
18437H0883135q234520r054465j0193995j0528164r579590p797850n769525m143671
18429A5581355k948153k086018j481869j096516q91060n91657m61281m89187l50759
18420E184855j46783m8556q7985j39516j10432q2715j06908l0645k798N3610L4277
$$ plain form
18477 193366885 185848225 176384596 165950421 158945116 156214759 150398700 134158793 108908782
18469 108908782 82395262 60902242 45709412 35394931 28345076 23490567 20240898
18462 20240898 17837687 16182453 15133874 14572912 14448287 14709740 15399078 16671572 18877381
18453 18877381 22455903 27814401 35564512 45749366 57373375 68449261 77205040 83577741
18445 83577741 89332541 95775800 101954149 105308271 103704360 97629202 89277191 80883135
18437 80883135 72648615 63594150 53400155 42871991 33292401 25494551 19725026 15581355
18429 15581355 12633202 10547184 9065315 7968799 7077739 6486082 6024801 5535614 5184855
18420 5184855 5038072 4989516 4901531 4762015 4651583 4568868 4461960 4431315 4428517 4482127 4516404
18409D516404l763O2661J24658J2075J22210L06769M00860N50589O60735Q32387
18399G585585J104853J453591J810413K494356L570607N243122P610982J0432807
18391D1306316J2905408J3923905J2568976J0236333Q586964Q777122R159916
18384A17464940P190028K195798l940303q157690r367260q970552r465537j1366802
18376G5582622j3200535j3366650j1665926r077231o616943m679438l303299k450764
18368A1221836j802355j411755j126163q86478p06942o02372m45167l63695k43628
18359C633281j84059k08216j56639j46976k24147l41743k85030k34336j24380
18350A727755j63072j66561j16545q2994o9989p9974j30477n4989m1758o0590
$$ plain form
18409 4516404 4512641 4575302 4699960 4712035 4834245 5141014 5541874 6092463 6753198 7585585
18399 7585585 8690438 10144029 11954442 14448798 18019405 23262527 30873509 41306316
18391 41306316 54211724 68135629 80704605 90940938 99527902 108305024 117464940
18384 117464940 124654968 126850766 122910463 114752773 105385513 96414961 86949424 75582622
18376 75582622 62382087 49015437 37349511 28272280 21655337 16975899 13672600 11221836
18368 11221836 9419481 8007726 6881563 5995085 5288143 4685771 4240604 3876909 3633281
18359 3633281 3449222 3241006 3084367 2937391 2713244 2371501 2086471 1852135 1727755
18350 1727755 1564683 1398122 1281577 1198583 1128594 1048620 918143 863154 821396 760806
18340G60806n1108q6263n2268j527j661j708P2584L6889m1000j8719j0313m767
18328F00945k4190k2382m1694K2600P6259j209J6303k011l9743p5261l5906q22
18316D72889n5316l722l8888r4986M6450Q4713J2380K5907q6891n9390j6899j6900
18304B69347m3337n6546p7066J0772J17319M9448J3538o2669j0621j6044j2708
18293A81433P0599j0505l6486r168P8827L5615n9335J2460k2043k466j9312m5180
18281A74439K9663M6823M1082k5886J385M9366j6017l2116K6078j9034l7912o4090
18269A73781n4176j8930P005n8995K3029l4032J9222o76N188P5419M0275M6954
18257B24064m0205r7897n027R671q159L6628R3967k8905j13363p3370o098K8661
$$ plain form
18340 760806 709698 623435 571167 569640 567979 566271 638855 675744 634744 616025 605712 600945
18328 600945 576755 554373 512679 535279 611538 610329 626632 624621 584878 509617 473711 472889
18316 472889 417573 413851 374963 279977 326427 411140 423520 449427 362536 303146 286247 269347
18304 269347 226010 169464 92398 103170 220489 269937 283475 220806 210185 194141 181433
18293 181433 252032 241527 205041 195873 274700 310315 250980 263440 241397 238931 219619 174439
18281 174439 204102 250925 292007 266121 267506 316872 300855 268739 294817 275783 237871 173781
18269 173781 119605 100675 107680 48685 71714 37682 56904 56228 61416 136835 177110 224064
18257 224064 183859 85962 80935 90606 82447 119075 213042 184137 70774 -2596 -8694 19967
18245A9967L4006M3544J16156N4916J19m3483k4007O3335M3041n2691q460L0131
18233B76574J14721N649r9066j08515k3055r835k0928j8737j8905l8256j4894
18222D4753K5949N9544M63o2521n1004l1716K1188J2128L3675R4857M9741j1363
18210A85694M8489L5100n4537q5006Q280o619o9357m2252J09296Q7707l3219j04124
18198G9452L6552L7562J5393O2405Q9487P6910J090r0568o1929p9814R547J09560
18186B85647R6092n9686o9354k6737J548K4911O2947N3415J4806j7993j07952
18175B57644N0721N5356j7305L8285J7072j9671m2291n6817J9894N8274m2601
18164C18561o1476O4550O6582J4495M6052r2083J1967N1121j1896J9420J46520
$$ plain form
18245 19967 53973 97517 213673 268589 268708 225225 201218 264553 307594 254903 246443 276574
18233 276574 391295 396944 297878 189363 166308 156473 135545 116808 97903 59647 44753
18222 44753 70702 130246 130709 68188 17184 -14532 6656 18784 52459 147316 197057 185694
18210 185694 234183 269283 214746 129740 138020 131401 62044 19792 129088 216795 183576 79452
18198 79452 116004 153566 168959 231364 320851 397761 398851 308283 246354 166540 176087 285647
18186 285647 381739 322053 252699 225962 227510 252421 315368 368783 383589 365596 257644
18175 257644 308365 363721 346416 384701 401773 382102 339811 282994 302888 361162 318561
18164 318561 257085 321635 388217 402712 448764 356681 368648 419769 407873 427293 573813
18153E73813P1041l1264r3807j28024M2044J73417J0311j1342j9663j8074N9810
18142F28262K4222j0775L7709Q0303Q6747o630J0439l425J37812J47771m3564
18131A088871p740J57818J61995J68908J08862J38959J82847K17913L78666L20879
18121B917978L63857N45899P06790Q90997J212101J650145K189267L360770N391135
18112A9228939R298633J6776646K9767000M7325390M9545466J3596859k7652451
18105A57886482m9513986m0472408k4959714j4656483q714363n368157l621283
18098A0580088k582753j760120j309574r49304o44504n46822m41968k54435j78571
18089A912037k01204j82588j43875k12814j73496n8714o8484j22998j51642o1382
$$ plain form
18153 573813 644854 613590 519783 391759 433803 607220 617531 606189 586526 568452 628262
18142 628262 652484 641709 679418 759721 846468 839838 850277 846852 984664 1132435 1088871
18131 1088871 1081131 1238949 1400944 1569852 1678714 1817673 2000520 2218433 2597099 2917978
18121 2917978 3281835 3827734 4534524 5425521 6637622 8287767 10477034 13837804 19228939
18112 19228939 28527572 45304218 75071218 122396608 171942074 185538933 157886482
18105 157886482 108372496 67900088 42940374 28283891 19569528 14201371 10580088
18098 10580088 7997335 6237215 4927641 3978337 3333833 2787011 2345043 2090608 1912037
18089 1912037 1710833 1528245 1384370 1171556 998060 939346 870862 747864 596222 534840
18079E34840o3483r4040O8933R0627o6363n4833L7186L0187j8971j9165m3662
18068D01256k146L5186j7433m4500m1672J2335l0557j45669m5120o608L9621N2347
18056B07040M8434M4092J1752K3320n5947p7089j7822l3132L436n3738q677k5570
18044F6099k5801k339J1898k7760M63M6614M818m638p982m2337J7364J27437J00518
18031B64354j05020j14844j7338K308K8546m5014M6514J05009L7858l8285k7034
18020A37054l2471o8463l8463J2668k7968j9723l0481J02563J16311M2389Q3189
18009B76605j462J2696o870o7244j00037n7720k8297R3896M7840k819M8364M6202
17997B61154k1095m7952L6759l1440n1627k5597l0323Q201P5069N8513Q4924K5536
$$ plain form
18079 534840 471357 377317 446250 536877 470514 415681 452867 483054 464083 444918 401256
18068 401256 399110 434296 416863 372363 330691 343026 312469 166800 121680 115072 154693 207040
18056 207040 255474 299566 311318 334638 278691 201602 183780 150648 154084 100346 91669 66099
18044 66099 40298 37959 49857 22097 22560 69174 73992 69354 61372 19035 36399 163836 264354
18031 264354 159334 44490 27152 29460 58006 12992 59506 164515 202373 164088 137054
18020 137054 104583 36120 -2343 10325 -17643 -37366 -67847 34716 151027 193416 276605
18009 276605 275143 287839 280969 213725 113688 55968 27671 121567 169407 166588 214952 261154
17997 261154 240059 192107 228866 197426 145799 120202 89879 98080 173149 231662 316586 342122
17985C42122l2360L084M2321l1083O8372N5319L6442L3016K2290P5354Q6073J02075
17973H03025J14062J89001M4025K4649J15212R835J8701O4552k4218p5788l8590
17962A244466K9543N9280j52647j57189j20918r8614K9342q7134j44213j16845
17952D85071q9434J02328J00081k9999J2517N542r5329K9786O1512l8251L6698
17941E80522L936O3822K7102m4144K6162j921J7684l4431r1016R4597J54508r070
17929G87751R99p089j32906j8994J08213R0914M8740k8916N3324Q1353Q4685L9107
17917A107181M5005Q7001J62384J04586J03351J37501N3768J42733R6581k003
17907B038088n7187K3312J44014J31269K04234L03153K80779K40851K18981J50674
$$ plain form
17985 342122 309762 312846 355167 324084 392456 447775 484217 517233 539523 614877 700950 803025
17973 803025 917087 1106088 1150113 1174762 1289974 1299809 1318510 1383062 1358844 1283056 1244466
17962 1244466 1274009 1333289 1180642 1023453 902535 803921 833263 746129 601916 485071
17952 485071 395637 497965 598046 568047 580564 586106 490777 520563 582075 543824 580522
17941 580522 584458 648280 675382 631238 657400 655479 673163 638732 547716 642313 796821 787751
17929 787751 788750 781661 648755 629761 737974 828888 877628 848712 902036 983389 1068074 1107181
17917 1107181 1152186 1239187 1401571 1506157 1609508 1747009 1800777 1943510 2040091 2038088
17907 2038088 1980901 2004213 2148227 2279496 2483730 2786883 3067662 3308513 3527494 3678168
17897C678168O6138J66913K88325N05490O54987O78246Q24103J031463J395831
17888I289664J918065K783892M232713O783299J0250827J4323835J7583376J8149267
17880H5314938J4505803O546974l070962j0330387j2951661j1037703n757147
17873F3219855J132134P673856J2230352J3029120Q845358M61854q652780j5229078
17865H2710671j7323914j5950393j2723247r100730o192325m210545k960720k255545
17857A1993252j865152j422849j074184o76901l76814l07677k35297k43371l75185
17848E415822l22368l55081k57837j59773j38841o6123Q941J8755N9957J16796
17838D320248N3723Q3042K30696K88183K72281M05241P24325Q83005J218482J670535
$$ plain form
17897 3678168 3744306 3911219 4199544 4705034 5360021 6038267 6862370 7893833 9289664
17888 9289664 11207729 13991621 18224334 25007633 35258460 49582295 67165671 85314938
17880 85314938 99820741 106367715 103296753 92966366 80014705 68977002 63219855
17873 63219855 64351989 72025845 84256197 97285317 106130675 106592529 97939749 82710671
17865 82710671 65386757 49436364 36713117 27612387 21420062 17209517 14248797 11993252
17857 11993252 10128100 8705251 7631067 6954166 6577352 6269675 6034378 5791007 5415822
17848 5415822 5093454 4738373 4480536 4320763 4181922 4115799 4124740 4143495 4203452 4320248
17838 4320248 4373971 4457013 4687709 4975892 5248173 5653414 6377739 7260744 8479226 10149761
17828A0149761K610696M077075O289662R259059J2469941J4614520J4162791J0042500
17820H3676005K830972m679850r757580j0816795q294678l350852K471990P636137
17812E9715349J0613562J0058571N424264k024341r319504j3682269j4476587
17805D6309045j2560060r588422o679579m532327k960600j996224j432397j046605
17797E512831p94571o36620n44676l48443l02755k31636n2400l3184j75988k83115
17787B109443k37244k27227k30258k23110m7340j15312r4622K731r68K3083j04478
17776H54698j43957j65669j10520l7075l4855o7238o6163r4233j4383O8767k110
17765A87262J5271M1430j31371j1337J9347l8677n5683M8508K4313n8196l0360
$$ plain form
17828 10149761 12760457 16837532 23127194 32386253 44856194 59470714 73633505 83676005
17820 83676005 86506977 81827127 72069547 61252752 52958074 49607222 52079212 59715349
17812 59715349 70328911 80387482 85811746 83787405 74467901 60785632 46309045
17805 46309045 33748985 24160563 17480984 12948657 9988057 7991833 6559436 5512831
17797 5512831 4718260 4081640 3536964 3188521 2885766 2654130 2601730 2568546 2392558 2109443
17787 2109443 1872199 1644972 1414714 1191604 1144264 1028952 934330 937061 936093 959176 854698
17776 854698 710741 545072 434552 397477 362622 295384 229221 134988 120605 189372 187262
17765 187262 202533 243963 112592 101255 120602 81925 26242 74750 99063 40867 10507
17754A0507j6566o8205O529L9110K0972k0881k533m0216R2l4335k6795j4213R5093
17741e1441J30944K4013n7035j7455p7294o7546J9712o585N7062J09084l476q409
17729E1574j18570o6552M351M1925L5925N9304K5956m6390n1343O9376n2872l2911
17717h0227J2143M6412j742o785O131N1838p3087q047K0474Mm4398R9926j4660
17704G982p9066k5213L946l4325n0822n1762J1760Q6867l1463l9060k2307J1694
17692b11769N860l8832K884K8190J07330m1613p8804J04477P6192o9541j02938
17681b18564K9474P0741j9829m5393n8857J5489L8709Q2360l5799j0326P7525
17670g4470l8592L1322J7988l8611J2175M6783R0805j2711m0529n3372p5444N7472
$$ plain form
17754 10507 -6059 -74264 -67735 -28625 -7653 -28534 -31067 -71283 -71191 -105526 -132321 -146534 -51441
17741 -51441 79503 103516 46481 29026 -48268 -115814 -96102 -102687 -45625 63459 59983 51574
17729 51574 -66996 -133548 -129197 -87272 -51347 7957 33913 -12477 -63820 5556 -47316 -80227
17717 -80227 -68084 -21672 -23414 -30199 -24068 27770 -45317 -53364 -32890 -32886 -77284 22642 7982
17704 7982 -71084 -96297 -92351 -126676 -177498 -229260 -217500 -130633 -162096 -201156 -223463 -211769
17692 -211769 -205909 -244741 -241857 -213667 -106337 -147950 -226754 -122277 -46085 -115626 -218564
17681 -218564 -189090 -118349 -138178 -183571 -242428 -226939 -188230 -105870 -141669 -151995 -74470
17670 -74470 -113062 -81740 -63752 -102363 -90188 -43405 47400 34689 -5840 -59212 -134656 -77184
17658g7184k0758N5035P9950L2814n2034o6936J1108R2499j1086k3068o6427n9997
17646a06084n3177L6541L1462n0639k9399L8926Q1626M6302l6661j2388m8927
17635a02418O9503J832k1925q755l0388o5975n5414m3996L3612p111P9638J08619
17623d2778P1826N490l5112o6047k9558m5640L8731K4921M0613k0651j5402M067
17611f9540J811K6359n4993L3083J9333l9542p7275M569M7898P5746j2944m3429
17599h8924K2796j111O4044l7169j0503l9684M832J6220m5821R464o1312K1951
17587a45217M0520J3409O6563j9921l8265R777J6679j5192L7243o0137N6022M3654
17575E135J3563L5398p7669m7358M65l1931K759L9676j7733Q393J1717O452L6972
$$ plain form
17658 -77184 -97942 -42907 37043 69857 17823 -49113 -38005 54494 43408 20340 -46087 -106084
17646 -106084 -159261 -122720 -91258 -141897 -171296 -132370 -50744 -4442 -41103 -53491 -102418
17635 -102418 -32915 -31083 -53008 -61763 -92151 -158126 -213540 -257536 -223924 -231035 -151397 -42778
17623 -42778 29048 34538 -574 -66621 -96179 -141819 -103088 -78167 -37554 -58205 -73607 -69540
17611 -69540 -67729 -41370 -96363 -63280 -43947 -83489 -160764 -156195 -108297 -32551 -45495 -88924
17599 -88924 -66128 -67239 -3195 -40364 -50867 -90551 -85719 -69499 -115320 -105856 -167168 -145217
17587 -145217 -104697 -91288 -24725 -44646 -82911 -73134 -56455 -71647 -34404 -94541 -38519 5135
17575 5135 18698 54096 -23573 -70931 -70466 -102397 -99638 -59962 -77695 -69302 -57585 -51133 -14161
17562a4161k9827M6859N5146p6312j06832l6665P228Q8641J48729J9495J2286
17551A14587j18109j19090J637n1253l0207N7283l542p1556l8039P6212J08076
17540g4001K4528j17311n6620K281R0622R966k6904K0252O016l9061m2809L6572
17528a66469J6431K7701p7259K357N9185J45735O5311j06786r3525k1720j7612
17517a66651k6009K5915k7640M0074Q8301K6063n1526O3017N8269k2020m3555
17506c5762m8561q0954P621n994m6505p9481q1935j4460J19735J28830m2760O450
17494a73776J05241M9396j11431l5232J17473N103K1819j5971k2604q20Q413j01295
17482a53684l5699K51l0081K7983J10132N4861n9220N0009j7457J4720n0901j14795
$$ plain form
17562 -14161 -43988 2871 58017 -18295 -125127 -161792 -154564 -65923 82806 102301 114587
17551 114587 -3522 -122612 -120975 -172228 -202435 -145152 -148694 -220250 -258289 -182077 -74001
17540 -74001 -49473 -166784 -223404 -221123 -130501 -120535 -147439 -127187 -121171 -160232 -203041 -166469
17528 -166469 -150038 -122337 -199596 -197239 -138054 7681 72992 -33794 -127319 -149039 -166651
17517 -166651 -192660 -166745 -194385 -154311 -66010 -39947 -91473 -28456 29813 7793 -35762
17506 -35762 -84323 -165277 -157656 -163650 -210155 -289636 -371571 -386031 -266296 -137466 -180226 -173776
17494 -173776 -68535 -19139 -130570 -165802 -48329 -43226 -21407 -37378 -59982 -60802 -52389 -153684
17482 -153684 -189383 -189132 -219213 -191230 -81098 -26237 -85457 -35448 -52905 -38185 -89086 -203881
17470b03881o6729m3727O2397J13227J30939L2890n2148m4733Q1636m2421k0506
17459e3056l2189o6153p6689J2164O7044l3933K6741J23871J27664m4013r4238
17448d2787k9202O91P2256Q4256J8344K02096L81677K59060j6429k56660k75851
17437C97451j88205r3354j7067o7434J8846l2512j2300o844l215L4639n1984p8455
17425a00434j14300j9630J9167P2737L1730k2863q103m3553P630N0547M5989m5451
17413a26534K5100O5437R2754q0722p162N5906n1949j1040L1999n682o9450j0759
17401i2102m5362o0690P113K6894P4125j2146r3295j5509M9798j2569q768k390
17389a84901O698L8042J9356j1451K8106O179q436J7855j6353K8415L4165l8323
$$ plain form
17470 -203881 -270610 -314337 -251940 -138713 -7774 25116 -27032 -71765 9871 -32550 -53056
17459 -53056 -85245 -151398 -228087 -215923 -148879 -182812 -156071 -32200 95464 51451 -42787
17448 -42787 -71989 -71298 958 85214 103558 305654 687331 946391 929962 673302 397451
17437 397451 209246 115892 98825 31391 50237 17725 5425 -1419 -4634 30005 -21979 -100434
17425 -100434 -214734 -234364 -215197 -142460 -110730 -133593 -141696 -185249 -177619 -127072 -81083 -126534
17413 -126534 -101434 -35997 56757 -23965 -31127 24779 -27170 -38210 -6211 -11893 -81343 -92102
17401 -92102 -137464 -198154 -191041 -164147 -90022 -102168 -195463 -210972 -161174 -173743 -182511 -184901
17389 -184901 -178203 -140161 -120805 -132256 -104150 -97971 -106407 -88552 -104905 -76490 -42325 -80648
17377h0648j1889J7749J8916J5357k9461o4517N8127R13j5634l1446J17271Q8734
17365H3472O5593m0265o284N8721L0719R0807m5958j02861j0879K2955J6494L5437
17353A97951J0529L6086J11450M6152l7830o9122o8112j29734q5572o4623L441
17342d9384M0952j8363L0006k0623l2657m3492k0056J9707O6418P1685m0383r611
17330e801l0555K152n056q567J5593j9177o2381O5665J2289k5371m1319l1521
17318a34049O8450N0612O0607L7902o6288j45388j08366N5704J00614Q6296P2376
17307G8470O5584R0350J07253K6008J4729m8409o6614k0746N123M1926j20912
17296A72762r5025r855P8566P8712M5723K9198q4383n6727k0580r6361l2843L7243
$$ plain form
17377 -80648 -92537 -74788 -55872 -40515 -69976 -134493 -76366 -75453 -91087 -122533 -5262 83472
17365 83472 149065 108800 102516 161237 191956 282763 236805 133944 123065 146020 162514 197951
17353 197951 208480 244566 356016 402168 364338 295216 227104 97370 11798 -52825 -49384
17342 -49384 -8432 -26795 3211 -17412 -50069 -93561 -113617 -93910 -27492 44193 3810 -5801
17330 -5801 -36356 -34204 -39260 -47827 -32234 -51411 -113792 -48127 -35838 -61209 -102528 -134049
17318 -134049 -65599 -14987 45620 83522 17234 -128154 -236520 -180816 -80202 6094 78470
17307 78470 144054 234404 341657 367665 382394 333985 267371 246625 251748 293674 172762
17296 172762 77737 67882 146448 225160 270883 300081 215698 158971 138391 42030 9187 46430
17284D6430q9253l1405j8794O0881L9251j37299m3471N4376j406J4803j3219M8467
17272g0639K3938o1100p0898O3952M9803k8158n3573M0894p1789P1578l1292L219
17260a34065K4686m2275k7275Q4819O4902J6814K2098J107K6298j2549j15775
17249i1215j01611Q1498O7028R2613L555q1977O7427M120N4284l4227p8528n1818
17237f8851m4743K2635n124l9048l5930o143O925M4970m0785n7260N4909M3099
17225a25346M1702N6047j1840l5888M384J19231M1265j20148o9146j777j15K5602
17213g6029m9694p795M8300M9081l5842j5898j4071j1626j0393N8304N1517q3209
17201i7355p1499l0455M48n9407M6773R881p6518l5839M4241M9431K0786K4598
$$ plain form
17284 46430 -42823 -74228 -93022 -32141 7110 -130189 -173660 -119284 -120690 -105887 -119106 -70639
17272 -70639 -46701 -107801 -178699 -114747 -64944 -93102 -146675 -105781 -177570 -105992 -137284 -134065
17260 -134065 -109379 -151654 -178929 -94110 -29208 -12394 9704 10811 37109 24560 -91215
17249 -91215 -192826 -111328 -44300 48313 51868 -30109 37318 41438 95722 61495 -17033 -68851
17237 -68851 -113594 -90959 -96083 -135131 -171061 -177204 -170279 -125309 -166094 -223354 -168445 -125346
17225 -125346 -83644 -27597 -39437 -75325 -70941 48290 89555 -30593 -99739 -101516 -101631 -76029
17213 -76029 -125723 -133518 -85218 -36137 -71979 -87877 -101948 -113574 -123967 -65663 -14146 -97355
17201 -97355 -168854 -199309 -198861 -258268 -211495 -201614 -278132 -313971 -269730 -220299 -199513 -174915
17189a74915l1141M6170J7223j6592L4558m6260m888p336l448O3212L3596J1418
17177g8403j5212p3219R5412L7703o234N0915k4694o4197r0471m8780o7159N0043
17165b34296J72118R3696j5904q4638j7321L2094K3068N8152L0897r1160k4265
17154e7559j0208L3263K8582p5764j11727j00361O2749K4302J0194N1771J19230
17143b5528P7690k7176k4579k4491q1131k876O6619j3742l0470n212M1634m5844
17131i5106l1653K6947K2439N7875n292K4845K3127M0090j24164p2869m8263O796
17119a75228L7050N9398k4013j7621P2414l0694q5552M6265K0285l6387M5700
17108h8383L87n2617k9297Q7889J41554r209j2232J5913l9312j11750r1270k9128
$$ plain form
17189 -174915 -206056 -159886 -142663 -159255 -124697 -170957 -175845 -183181 -186629 -123417 -89821 -78403
17177 -78403 -93615 -166834 -71422 -33719 -39953 10962 -13732 -77929 -168400 -217180 -284339 -234296
17165 -234296 -62178 31518 15614 -69024 -86345 -54251 -31183 26969 57866 -33294 -57559
17154 -57559 -67767 -34504 -5922 -81686 -193413 -293774 -231025 -206723 -196529 -144758 -25528
17143 -25528 52162 24986 407 -24084 -105215 -108091 -41472 -55214 -85684 -90896 -49262 -95106
17131 -95106 -126759 -99812 -77373 -19498 -24790 55 23182 63272 -60892 -133761 -182024 -175228
17119 -175228 -138178 -78780 -102793 -120414 -48000 -78694 -164246 -117981 -97696 -134083 -88383
17108 -88383 -87996 -140613 -169910 -82021 59533 50324 38092 54005 14693 -97057 -188327 -217455
17096b17455P0429R600J0460k7906p3100j1133L9073L5100p9463N6886J8436J3557
17084a55516r344j1952K8577M2746M0832L296m1763m2671J17353j6755j4000L3666
17072b5531k6421q4109L071R692K2555L1351J8888j3591N3143M4032n2109p0064
17060h9093n2899J3440K7321k0930O0890K2138j6581O0192q3741N142j7526L710
17048h7937P2778J2069n9815L7344P534k2769j46697o0500J04466J22762k5842
17037d6607j03661n8534M4556N7233r7179r95N4212K6029J7295j0901O797L1015
17025h0740O457k3604L3583N9293N0364m1978l0501k0362L0679P7501M2115m8001
17013E4806j2087o0376O3420J2444j46630q4072k405L6211K6763m6140K1671M939
$$ plain form
17096 -217455 -147026 -137426 -126966 -154872 -227972 -239105 -200032 -164932 -244395 -187509 -169073 -155516
17084 -155516 -164860 -176812 -148235 -105489 -64657 -61361 -103124 -145795 -28442 -45197 -59197 -25531
17072 -25531 -51952 -136061 -132990 -123298 -100743 -69392 -50504 -64095 -10952 33080 -19029 -89093
17060 -89093 -141992 -128552 -101231 -122161 -61271 -39133 -55714 4478 -79263 -74121 -91647 -87937
17048 -87937 -15159 -3090 -62905 -25561 -18027 -40796 -187493 -247993 -143527 -20765 -46607
17037 -46607 -150268 -208802 -164246 -107013 -204192 -205187 -150975 -124946 -107651 -118552 -111755 -80740
17025 -80740 -74283 -97887 -64304 -5011 45353 3375 -27126 -47488 -16809 60692 102807 54806
17013 54806 42719 -17657 45763 58207 -88423 -172495 -174900 -138689 -111926 -158066 -136395 -131456
17001a31456M3952J10357P2450L3189k7649j43871l7456K9210K983J2420j18186
16990a54057M4737L5694q0590m505k0036L550N1675K7497O0679r169j00145K3001
16978a21669J1978J656L7234N1223J9860m7063N4576m0909l3284m7962j7078k0692
16966a52130P77j8273M4461K5758M8240J7809n4194k6356R234K1608P6717L9653
16954C3304j7646j12516j05084N5390J4469p2513J6324M9329j0288J6332j6802
16943a49701J093K6606l3097J807R3376N5472o2922p4670k6481K3100P2466L5849
16931c7102o2721L7046M3438M8430q413r2862k5595N2974N385k0027k0662L1760
16919d8349m4432q92O6697L0341k2316q3311j8138J4554N6768R1421Q731K0204
$$ plain form
17001 -131456 -87504 22853 95303 128492 100843 -43028 -80484 -51274 -48291 -35871 -154057
16990 -154057 -109320 -73626 -154216 -158721 -178757 -175207 -123532 -96035 -35356 -44525 -144670 -121669
16978 -121669 -109691 -108035 -70801 -19578 282 -46781 7795 -33114 -66398 -114360 -131438 -152130
16966 -152130 -151353 -169626 -125165 -99407 -51167 -33358 -87552 -113908 -104674 -83066 -6349 33304
16954 33304 15658 -96858 -201942 -146552 -132083 -204596 -188272 -138943 -149231 -132899 -149701
16943 -149701 -148608 -122002 -155099 -153292 -59916 -4444 -67366 -142036 -168517 -145417 -72951 -37102
16931 -37102 -99823 -62777 -19339 29091 20678 -72184 -97779 -44805 -39420 -59447 -80109 -48349
16919 -48349 -92781 -93673 -26976 3365 -18951 -102262 -120400 -105846 -49078 42343 51074 71278
16907G1278o3258q3734r7092l749m7117J637Q7658O1706k0651k7181J30949R6131
16895A06577m6006p9022m0490N0263M5648r263J1119M7471n1412q1094l2019L1441
16883d6787L8595M1856k9752l1279K7260P3396k1568r9463k4206M3487j9812L6906
16871a1367L7583K6559K3747o0146j3641M388M4572j02150k2115k1434j38577
16860b32581k3417M2673j3647K1480O2975q592l633N2160N0982k5725m6131n9997
16848a83453r573K1732L9022P904j5745l7701J3936l029L5896J7818o2209K8285
16836a47117N0265J2627L8400k4076j3533k8065L5736p4746J0231M4419N3674
16825d2185J982O17K1819k784K9911L1784j9579o4696p9187k1243O6478K9636
$$ plain form
16907 71278 8020 -75714 -172806 -176555 -223672 -222035 -134377 -72671 -93322 -120503 10446 106577
16895 106577 60571 -18451 -58941 -8678 36970 27707 38826 86297 34885 -46209 -78228 -46787
16883 -46787 -8192 33664 3912 -27367 -107 73289 51721 -47742 -71948 -28461 -48273 -11367
16871 -11367 26216 52775 76522 16376 2735 7123 51695 -50455 -72570 -94004 -232581
16860 -232581 -255998 -213325 -226972 -205492 -142517 -151109 -154742 -102582 -51600 -77325 -123456 -183453
16848 -183453 -193026 -171294 -132272 -124368 -140113 -177814 -163878 -166907 -131011 -113193 -175402 -147117
16836 -147117 -96852 -84225 -45825 -69901 -83434 -111499 -75763 -150509 -140278 -95859 -42185
16825 -42185 -40203 -39586 -17767 -20551 9360 41144 21565 -43131 -122318 -143561 -77083 -47447
16813d7447N04k4454N3356j7759j31584k1833R5826l5265r017j4504k8651m5711
16801b26539L364N4785N0242J2991k6464L8808O3641m8267R72M9182n9170k1395
16789a07850Q854l3647K0347l5451j6723L7467N74l1235m024N4839J11828O1438
16777F6417K5501l1998q2009l7688o0412J3466J42700P2052j01922j80851p277
16766a82021N7688P4877K2913J00963l7521l3529K6722K2723L0976q0478o1165
16755e7852K3994k2913m5168n5400j5837m422K5012N3671J2661K1447n1880q4501
16743b01188j3443P3206J7735k2430l582n14O9696N5114m5215p8716O519J0585
16731a32233L1593N6255P0240j3565o0195l1868k1908M4172K4571l5382K3760
$$ plain form
16813 -47447 -46943 -71397 -18041 -35800 -167384 -189217 -93391 -128656 -137673 -152177 -180828 -226539
16801 -226539 -223175 -168390 -118148 -105157 -131621 -92813 -29172 -77439 -76467 -27285 -86455 -107850
16789 -107850 -98996 -132643 -112296 -147747 -164470 -127003 -126429 -157664 -161688 -106849 4979 66417
16777 66417 91918 59920 -22089 -59777 -120189 -106723 35977 108029 6107 -174744 -182021
16766 -182021 -124333 -49456 -26543 74420 36899 3370 30092 52815 83791 3313 -57852
16755 -57852 -33858 -56771 -101939 -157339 -173176 -177598 -152586 -98915 -86254 -64807 -116687 -201188
16743 -201188 -214631 -141425 -123690 -146120 -149702 -150216 -80520 -25406 -70621 -149337 -142818 -132233
16731 -132233 -100640 -44385 25855 12290 -47905 -79773 -101681 -57509 -32938 -68320 -44560
16720d4560q5450m2494J0864o4348k4890P9619J22024J6665j8337J323L1350j0472
16708b8706O94k0438k1042M5181J17149k9673m1569n1968k0835K6337j4877p4563
16696a14310j4061Q2908J8339M8679m5475q7466J0747l3030j7596J9480P6444
16685e5341Q9446L5814l1311l5150n6481M6072M8384j9666l2614j10101K8827
16674i2121O168n960J248j853P380J500k2110n5848j1318L0757M9836O7166J4948
16661a0207l1431n7752n3488J3663N111l3576n2667K2020R0767O5956R629N7605
16649B5630p4401o1739j9295L7755L8018m6486o781L5330l8651o9195j22105j2780
16637c14700J47252J55998J22071Q3778p2769j37817k2781J7327K6280n3801l2829
$$ plain form
16720 -44560 -130010 -172504 -161640 -225988 -250878 -171259 -49235 -32570 -50907 -49584 -18234 -28706
16708 -28706 -28012 -48450 -69492 -24311 92838 63165 21596 -30372 -51207 -24870 -39747 -114310
16696 -114310 -128371 -45463 -27124 21555 -23920 -111386 -100639 -133669 -151265 -131785 -55341
16685 -55341 34105 69919 38608 3458 -53023 -6951 41433 21767 -10847 -120948 -92121
16674 -92121 -85953 -91913 -90665 -92518 -85138 -83638 -105748 -161596 -172914 -142157 -92321 -25155 -10207
16661 -10207 -41638 -99390 -152878 -139215 -134104 -167680 -220347 -198327 -107560 -41604 -31975 25630
16649 25630 -48771 -110510 -129805 -92050 -54032 -100518 -107299 -71969 -110620 -179815 -301920 -314700
16637 -314700 -167448 -11450 110621 194399 121630 -16187 -38968 -21641 4639 -49162 -81991
16626h1991J43769M5037o6061J0482j1761j7445j7489m3802k24j0187Q2346p386
16614B5288j12023O782J8986M7198O632k8049J0529K947L4404k8647j4605k2885
16602e3443j7102N9592k5654l6179J8010Q7553j6377j15357n9163O5164P1000
16591b1956R540m9419o3864jN7897K2987m8599K74N1694R7970l7967j01076m0743
16578a23263l0532j9053N06O0099N5494O8790m7084j1877j8864r631O2375o3565
16566g6605l1982L6842q412j5092P3058M6928l3446J4337N4289O376n4466n5779
16554d3952J8528o3930K657k0474k8220L6544M1292J4527n7793M7420k131o2378
16542a17910j578M8339l574K3593k6802N1906O7596j2623q1522o0953l3266L1291
$$ plain form
16626 -81991 61778 106815 40754 51236 39475 22030 4541 -39261 -39485 -49672 32674 25288
16614 25288 -86735 -79953 -60967 -13769 -7137 -35186 -24657 -21710 12694 -15953 -30558 -53443
16602 -53443 -70545 -10953 -36607 -72786 -54776 32777 16400 -98957 -158120 -92956 -21956
16591 -21956 -12416 -61835 -125699 -125700 -67803 -44816 -93415 -93141 -41447 56523 18556 -82520 -123263
16578 -123263 -153795 -172848 -172342 -112243 -56749 12041 -35043 -46920 -65784 -75415 -13040 -76605
16566 -76605 -108587 -71745 -80157 -95249 -22191 24737 -8709 5628 59917 66293 11827 -43952
16554 -43952 -25424 -89354 -86697 -107171 -135391 -98847 -57555 -43028 -100821 -53401 -55532 -117910
16542 -117910 -119488 -71149 -74723 -51130 -77932 -26026 41570 28947 -52575 -113528 -146794 -115503
16530a15503P2514O2017J4237j5201J28601P8754o0001j06492o1515K8651J8454
16519D4516q4403j7695J28425O1332O272q4123l21K7549L5936p6499o4342k9752
16507e3105R9404J572l6817N1293M554o0500j1291L5902r0640l1443P0262n075
16495b5884r4247p0699l9917k841j0039P984K9011J17240J1154O95J6999q590
16483f9134m1255M96M9278M3795K9706p0800j275J5586P229m6353m5746K1389
16471a07084J1110M607j2236k7579k0494L1832N4947l6308M5265Q6245l1238j1406
16459a2339o6224K8375p9759K3215J00724O80l4615L8375L3658p1663q2377P334
16447a14616L395p250L7734m8853L4400K2359J251N6178p9449l5979L4082J1692
$$ plain form
16530 -115503 -42989 19028 33265 18064 146665 225419 165418 58926 -2589 26062 44516
16519 44516 -39887 -57582 70843 132175 138447 54324 54003 81552 117488 40989 -23353 -53105
16507 -53105 46299 47871 11054 62347 66901 6401 -4890 31012 -59628 -91071 -20809 -25884
16495 -25884 -120131 -190830 -230747 -233588 -243627 -235643 -206632 -89392 -78238 -77543 -60544 -69134
16483 -69134 -110389 -109893 -60615 -16820 12886 -57914 -59189 -43603 -36374 -82727 -128473 -107084
16471 -107084 -95974 -91367 -103603 -131182 -151676 -119844 -64897 -101205 -55940 30305 -933 -12339
16459 -12339 -78563 -50188 -129947 -106732 -6008 -5328 -39943 -1568 32090 -39573 -121950 -114616
16447 -114616 -111221 -118471 -80737 -129590 -95190 -72831 -71580 -15402 -94851 -130830 -96748 -85056
16435h5056J7467M4032L1205J2654m4909K835M8842q07Q644Q0131P779l6305q5233
16422A279j924L8620J1992o308j20530l4916J7604l0P3705K1967M4847j7086o443
16409B2777N8930R6588n7278q4219m6033L1579k0157L9682P0629q0155r927M5410
16397F7826k4719j15963J9988m359q59O124r918j3866Q8147j9704l7809k3298
16385f8410O4665P1054N2216o0480j52724m4174l709M2258r881j9798J0034Q1884
16373c7065O600j8095K3206l6199m8527L2260N1099n3163l3791P3226P8727n7033
16361a8755M3479M9252m8136j12013n3679K8719J10478K3582K9641K638l3633
16350B1573M8079Q2772o0013r2175l6032j1292K5503p4044l8600j4200J5066R050
$$ plain form
16435 -85056 -67589 -23557 7648 20302 -24607 -21772 27070 26263 34907 115038 122817 86512 1279
16422 1279 -645 37975 49967 43659 -76871 -111787 -94183 -94213 -20508 1459 46306 29220 22777
16409 22777 81707 178295 121017 36798 -9235 22344 2187 41869 112498 32343 22416 67826
16397 67826 43107 -72856 -52868 -57227 -58086 -51962 -61880 -75746 12401 -7303 -45112 -68410
16385 -68410 -3745 67309 119525 59045 -93679 -137853 -141562 -99304 -109185 -128983 -118949 -37065
16373 -37065 -30465 -48560 -25354 -61553 -110080 -77820 -26721 -79884 -113675 -40449 38278 -18755
16361 -18755 24724 73976 25840 -86173 -139852 -111133 -655 22927 52568 55206 21573
16350 21573 69652 152424 92411 236 -35796 -47088 -21585 -95629 -134229 -148429 -133363 -124313
16338a24313P7917O0048P569N4889p6421j4499l9963j4180R212j01792n9615j0967
16326b32115J2318J1181L693J3118N5627K6847Q2938l3472O183r3146M2038K7864
16314g6926N3224J07832N1384j16976j17256k5452J9682J2990L0536Q854k1631
16303g3739L0935M7167j4624j7386n0715k1133o6273O5020j9020m2904P928L6317
16291a18427l587K3534m2366J3151J7525Q994J01734N091j15754l7588Q2877L9918
16279b4898K5445o1539J086N4183k5110k085o7828M7634k2091q6042Q2893L4973
16267d3379l0741m6446M6032M1318n1735k2194L0702Q2702J9399R787L6898j03489
16255c1146n7946M0698j080J9495n7765p675K3840m9914N25k3193L767l4737p391
$$ plain form
16338 -124313 -46396 13652 21221 76110 -311 -14810 -54773 -68953 -59741 -161533 -221148 -232115
16326 -232115 -219797 -208616 -204923 -191805 -136178 -109331 -26393 -59865 -53682 -146828 -104790 -76926
16314 -76926 -23702 84130 135514 18538 -98718 -124170 -104488 -91498 -60962 -52108 -73739
16303 -73739 -42804 4363 -10261 -27647 -78362 -99495 -165768 -100748 -119768 -162672 -154744 -118427
16291 -118427 -122014 -98480 -140846 -127695 -110170 -101176 558 5649 -110105 -147693 -64816 -24898
16279 -24898 547 -60992 -59906 -5723 -30833 -32918 -100746 -53112 -75203 -161245 -78352 -43379
16267 -43379 -74120 -120566 -74534 -33216 -84951 -107145 -76443 6259 25658 35445 72343 -31146
16255 -31146 -89092 -48394 -49474 -29979 -87744 -95419 -71579 -121493 -120968 -144161 -140394 -175131 -182522
16242a82522K2212J4116P2990J5107k4054Q926M3031j7082M419P7262j9466q1318
16230f6379l5667N5298Q14J519L4814j8129k834K239j9919l8712O4307N0530L613
16217C1494L157o1821J2251J4447k4422n8885M5076K5808N049O0897N0074o2077
16205D1048p473n8291j03370P8615Q6060o4374J7609J0539P4724O3750m3979o8363
16193B6495L0384n291o0699k1409k8913L0183M1490M1177L0775q5834O3253n153
16181E6458n1963n9617j2006J1248n6901n9802J2765M513M333o7124N5282J01757
16169f1057O6737l0564p9470j6108j2350J01699O8512q8257l119O2776r637n3761
16157e4599j0416m459l518J00421J5856l4449k3936K5081k7878j6422l0363n2435
$$ plain form
16242 -182522 -160310 -146194 -73204 -58097 -82151 -73225 -30194 -47276 -42857 34405 14939 -66379
16230 -66379 -102046 -46748 -45934 -44415 -9601 -27730 -30564 -28325 -48244 -86956 -22649 27881 31494
16217 31494 34651 -27170 -14919 -472 -24894 -83779 -38703 -12895 -7846 53051 103125 41048
16205 41048 33575 -24716 -128086 -49471 36589 -27785 -10176 363 75087 138837 94858 26495
16193 26495 56879 51588 -9111 -30520 -59433 -29250 12240 53417 84192 -1642 61611 56458
16181 56458 4495 -55122 -67128 -55880 -112781 -172583 -159818 -155305 -150972 -218096 -162814 -61057
16169 -61057 5680 -24884 -104354 -120462 -132812 -31113 37399 -50858 -53977 8799 -838 -54599
16157 -54599 -65015 -69474 -72992 27429 43285 8836 -15100 9981 -17897 -34319 -64682 -117117
16145a17117R1254P6386n146m2316N2731M4685q9190k1894J5884n1823m1545M2714
16133d5377O1088M1038R184q3266q3647k123j5952K0260N0259N139m275l5971
16121h3643n0369L2698O483O1554L3995m3267k4645l9739k8897l23K1377J00732
16109a4044M5746N830J941o1922J5369O5083k699k7908j54304j1092J04609k2330
16097e5721P915M9815J04099R1494q9409j33396L3028L9182J566K2273l3948l8301
16085a403k4398n7847N9522J50791K3386J7611r8854j08848J3410P7759Q0792
16074A31921o3201l0064M4346m9029N9367N4020q526k8877p5062n7755J12421
16063H9561M7724j06685n3220O6172P910j0517R531j7633k7784l5206l1034R469
$$ plain form
16145 -117117 -25863 50523 45377 3061 55792 100477 11287 -10607 5277 -46546 -88091 -45377
16133 -45377 15711 56749 65933 -17333 -100980 -103103 -119055 -98795 -48536 -43397 -47672 -83643
16121 -83643 -134012 -101314 -94831 -33277 718 -42549 -67194 -106933 -135830 -136153 -114776 -14044
16109 -14044 31702 37532 39473 -22449 -7080 58003 55304 27396 -126908 -138000 -33391 -55721
16097 -55721 -47806 2009 106108 197602 108193 -25203 7825 47007 48573 70846 36898 -1403
16085 -1403 -25801 -83648 -24126 126665 150051 167662 68808 -40040 -26630 51129 131921
16074 131921 68720 38656 83002 33973 93340 147360 138834 109957 34895 -22860 89561
16063 89561 137285 30600 -22620 43552 51462 40945 50476 32843 5059 -30147 -61181 -51712
16051e1712P3247m7911J4514m1182O848P6614p8578q614M3858Q65o4886K012l4334
16038a09259L2948L0772P3257O774R950R4699J4425j03194m9428q042j2137J9541
16026C06L7387O6253l3291j0625j9514j1758r793k5183n7556O1943M3371O57j3987
16013B8210n60J9234K32n8787K756P5591q420Q6432M7111q1321k8684j15109l3181
16000f6496K3406q121L5702J2264j3470j34146r4786J08087P6833j4250J7151
15989e7826O2966J2469K5732L3753k6920p1341k6663M5433K2130o0217R274k255
15977c3465n4933M6728L4942J9923Q080n0809L1814M9746K6327k7013n5964N0996
15965D6372J1424P0652j9350l8248n5432j28193m1649J5142k5349N6074O5252
$$ plain form
16051 -51712 21535 -26376 -11862 -53044 -46196 30418 -48160 -56774 -12916 -12051 -76937 -74925 -109259
16038 -109259 -76311 -45539 27718 34492 44442 139141 153566 50372 944 -7098 -19235 306
16026 306 37693 103946 70655 60030 40516 28758 18965 -6218 -63774 -1831 41540 42197 28210
16013 28210 27650 46884 47116 -11671 -8915 66676 58256 144688 191799 110478 81794 -33315 -66496
16000 -66496 -43090 -51211 -15509 -3245 -16715 -150861 -245647 -137560 -60727 -74977 -57826
15989 -57826 5140 17609 43341 77094 50174 -21167 -47830 -2397 19733 -40484 -31210 -33465
15977 -33465 -88398 -41670 -6728 13195 21275 -29534 2280 52026 78353 51340 -4624 46372
15965 46372 57796 128448 109098 70850 15418 -112775 -154424 -139282 -164631 -108557 -43305
15954d3305P4109P611l1165n9304J05466Q0252K5897k1891m5109p4895l8064j9458
15942c9856K5560o3130n8452j0374Q87P8132P3444P09p0241O492n2306q0408J7994
15929a71549N5294O5027K4849j4538k420J4030p8370k384K6073Q1109n2770n2098
15917a07747K4420N2828L7581J5211J3010M6171j4284l0147N5298k2955m8335
15906B1051K0948K4064N7326M2225l495p8575m0468j1252M183n9424K4612P2406
15894G3601K8372R3352q2414n7528p3452n4726K4251J05509J10390j9595j28792
15883A8968k1345l5201p6245P2760J38735J11588O7657J0791r9930j07304r523
15872G0951K3332J7841l2898L914m4935M1835l0627q0676N0380M0753j2666J8478
$$ plain form
15954 -43305 30804 38415 7250 -52054 53412 133664 159561 137670 92561 17666 -20398 -39856
15942 -39856 -14296 -77426 -135878 -146252 -145365 -67233 6211 6920 -63321 -56829 -109135 -189543 -171549
15929 -171549 -116255 -51228 -26379 -40917 -43337 -29307 -107677 -110061 -83988 -2879 -55649 -107747
15917 -107747 -83327 -30499 7082 22293 35303 81474 67190 37043 92341 69386 21051
15906 21051 41999 66063 123389 165614 162119 83544 43076 31824 36007 -23417 1195 73601
15894 73601 101973 195325 112911 55383 -18069 -72795 -48544 56965 167355 147760 18968
15883 18968 -2377 -37578 -113823 -41063 97672 209260 276917 287708 187778 80474 70951
15872 70951 94283 112124 79226 83140 38205 80040 49413 -31263 19117 59870 47204 65682
15860F5682J4021n1558q2432l6748j2087k348m0011m8643M0162k4135K9660K8605
15848a19832J3212J6122J5298O8066o6744p8977Q1921k3851j5405R4996K4838
15837I644K6736p1005M357N0776l2579K031J6440j8858k8533l0311K5989L9689
15825e624M163j0848N726l7913k5160M3251j0596m972p516Q9844k3432r4756M8
15812g7785J2984P0222M2099O4475k7356p8654o8351K9236P432m0564J3826M0547
15800a1889n6791J027l1061o2496N6610l8508p1166P7694J5949j494J01398J08462
15788H7735l9108k4630o8634q7532K7713R7611L9210L127M3149n3908m0989k9332
15776d5588L0403K4784m1216R73R6076K7980p4359l5670l2949K7057J6623l016
$$ plain form
15860 65682 79703 28145 -54287 -91035 -103122 -105470 -145481 -194124 -153962 -178097 -148437 -119832
15848 -119832 -106620 -90498 -75200 -7134 -73878 -152855 -70934 -94785 -110190 -15194 9644
15837 9644 36380 -34625 -30268 20508 -12071 -10040 6400 -12458 -40991 -71302 -45313 -5624
15825 -5624 -1461 -12309 -6583 -44496 -69656 -26405 -37001 -41973 -49489 40355 16923 -77833 -77785
15812 -77785 -64801 5421 47520 111995 84639 5985 -62366 -33130 -25698 -66262 -52436 -11889
15800 -11889 -68680 -67653 -98714 -161210 -104600 -143108 -214274 -136580 -120631 -122125 -20727 87735
15788 87735 48627 23997 -44637 -132169 -104456 -6845 32365 35492 78641 24733 -16256 -45588
15776 -45588 -15185 9599 -31617 -30644 65432 93412 19053 -16617 -49566 -22509 -5886 -8902
15764h902j02980r505k3068l812Q7158J39224J7805q9844l6355L5894Q0618P0061
15752A56294n1110j05859M9027K5140N2385n5369o3075l0928k1208J00967N5715
15741A11979n5901q9302l2495M2937N6277M4587O561q033j9507p8579J05800m2815
15729D1509k4410O3794N7281l2546j2867J04492m3773j50483r814K8193r693j4729
15717c046M8763j6122L4947K7599n28k0079n5806L3241Q2337J23200j9538j15188
15705A19780m8349J6315k8846j2384J1062n489L6157L1373j2071j2239n5079k9664
15693A0566m0630o0385L674J32893N4014n6076k9993O7145N0129j8242L2003p2931
15681G2167o8554K1136J4409k3991l347Q984M3217J076m2792n0695K0165m0303
$$ plain form
15764 -8902 -111882 -121387 -144455 -148267 -61109 78115 95920 6076 -30279 5615 86233 156294
15752 156294 105184 -675 48352 73492 125877 70508 7433 -23495 -44703 56264 111979
15741 111979 56078 -33224 -65719 -22782 33495 78082 84643 76610 57103 -21476 84324 41509
15729 41509 17099 80893 138174 105628 92761 197253 153480 2997 -6817 21376 11683 -3046
15717 -3046 45717 29595 64542 92141 91613 71534 15728 48969 131306 254506 234968 119780
15705 119780 71431 87746 58900 46516 57578 52089 88246 119619 107548 95309 40230 10566
15693 10566 -30064 -90449 -86775 46118 100132 44056 14063 81208 131337 113095 145098 72167
15681 72167 3613 24749 39158 15167 11820 20804 64021 65097 22305 -28390 -8225 -48528
15669d8528p617K5891L2711O3086M2248M4761l9160n4471J1879M9566k1070j6474
15657H2822J4343l5163j9801k000R02K1548K39m7997q3635m4167J22277J04323
15645A13691j0723K8269O457q8819j015M3410l40L1604k0369K9889R460L0370
15633A71884j37205o3873j9995O6822N7697m087j2889o7290m7491L4168l7953
15622f0212p8302j5383J10785M4488j0019r6146M1626P8462m3346n4033l1985
15611a14065R0808J23704J6142J6822l8337p6831k491K7152n3828P8317J7241
15600H4634m3492o7344N5318L1879l2807j4022K9263j949j1880K3552K4592J8805
15588I6549L7501k6479j5705P979N1568N3506J5442m6407k9117q9538q5885k7336
$$ plain form
15669 -48528 -56145 -30254 2457 65543 107791 152552 113392 58921 70800 120366 99296 82822
15657 82822 97165 62002 42201 40201 41103 62651 62890 14893 -68742 -112909 9368 113691
15645 113691 102968 131237 137694 48875 47860 91270 90930 122534 102165 132054 141514 171884
15633 171884 34679 -29194 -49189 17633 75330 71243 58354 -8936 -56427 -22259 -60212
15622 -60212 -138514 -153897 -43112 1376 -8643 -104789 -63163 15299 -28047 -82080 -114065
15611 -114065 -23257 100447 116589 133411 95074 18243 15752 42904 -10924 67393 84634
15600 84634 41142 -26202 29116 60995 28188 14166 43429 41480 29600 53152 77744 96549
15588 96549 134050 107571 91866 99845 151413 204919 220361 173954 144837 55299 -30586 -57922
15576e7922M4343M1633P6846N9856q7427j8778L6327N9252k9308o3917R591P7158
15564A47654j462j7515J2577n0073j7841N0592m369k1054m7052j3346N1019N5279
15552A44409K694n2441l6244N3784k5956O1352j7340m580M3844L338K4589l5848
15540A61601j43383k0408M412R5807N9978j190p1187L2069l7070j5940N6783k6620
15528I4852M5912j1798o1599k3382J4435k8501o8597M4750O6178o973n9251l0918
15516b4892K7156L2207L0116O799K5105K2042J2476k8256k4910M1527l1513Q399
15504I6256L095r4659m493J00064L0249n658j405N123R746m7307K4700L3775l5593
15491A13893o585l3112p1333j5329J17016K7871j18465p5604m080J09985O8426
$$ plain form
15576 -57922 -13579 28054 104900 164756 77329 58551 94878 154130 124822 60905 70496 147654
15564 147654 146192 128677 141254 91181 73340 123932 119563 98509 51457 38111 89130 144409
15552 144409 147103 94662 58418 112202 86246 147598 130258 125678 169522 172860 197449 161601
15540 161601 18218 -2190 2222 98029 158007 156817 85630 117699 80629 64689 121472 94852
15528 94852 140764 128966 67367 43985 58420 29919 -38678 6072 72250 65277 6026 -24892
15516 -24892 2264 34471 64587 71386 96491 118533 131009 102753 77843 119370 87857 96256
15504 96256 99351 4692 199 100263 130512 124854 123449 128572 138318 91011 115711 149486 113893
15491 113893 107308 74196 2863 -12466 104550 132421 13956 -61648 -65728 44257 112683
15480A12683q600p5914o0033M2626k5238M8554L702m6329L6510p011O3159R4150
15468A78259j9141l5062p5468J9073R1001M364j08763l2573L7469j8678n9777
15457a9296M5711R0403R6722l308l4126k0575r1449q2508P887k1250N7023J39086
15445A64320Q9370o0499o0405j1863K8938m8678m0558R2668p0125j14454J0513
15434b0773J10240k0528Q889M232n0059N802m6233o054J9145L9093N1661M524
15422I9939r9208k5135m8824O4188k2114J26247J4044j08584k4491j5725p0158
15411a09821m8851j5331L3361K8418O4711O0393L907R2731N9868m8846q2448M1522
15399G9614P7943j7206o9764P883K7824k5645l8140N801n3020q3707O6685L6315
$$ plain form
15480 112683 104083 28169 -31864 10762 -14476 34078 37780 -8549 27961 20950 84109 178259
15468 178259 159118 124056 48588 67661 158662 163026 54263 21690 59159 40481 -19296
15457 -19296 26415 116818 213540 210232 176106 155531 64082 -18426 -10539 -31789 25234 164320
15445 164320 253690 193191 132786 120923 149861 101183 60625 153293 83168 -31286 -20773
15434 -20773 89467 68939 77828 82060 32001 37803 -8430 -14484 4661 43754 95415 99939
15422 99939 731 -24404 -73228 -9040 -31154 95093 109137 553 -23938 -39663 -109821
15411 -109821 -158672 -174003 -140642 -112224 -47513 12880 16787 109518 169386 120540 38092 79614
15399 79614 157557 140351 70587 78470 106294 80649 42509 48310 -4710 -88417 -21732 14583
15387A4583N2115O1769l8006L229l2853k1638l3857k3761j4794O1983J53720k0367
15375A62123n2011n6865K5735m79l347J2329L3888l3346j3096k3010k4786J7255
15363D4390R9199M2574m526M7424m7814j36545R331l6286l1592P9513L2314l563
15351I4419n1240K0161k272R508J717P6047O3818m5283k1552j7702o6129r2717
15339c1225L7443N1427N3232K7987j9220J0046j3643L3637M9365m1770p392j160
15327A48727j8205m918o531r9279N4870q691Q800k2189j536P0939Q4692o5408
15315A41271r2518j172k3929L0553N4789r2584N4186q928M5814L2087j0106r8773
15303C0690o0924q539M5729J7190r161r126M5660l5021n6287K9256J2967n8396
$$ plain form
15387 14583 66698 128467 90461 93690 60837 39199 5342 -18419 -33213 28770 182490 162123
15375 162123 110112 53247 78982 78503 75156 87485 121373 88027 74931 51921 27135 44390
15363 44390 143589 186163 181637 229061 181247 44702 54033 17747 -13845 65668 97982 94419
15351 94419 43179 63340 61068 70576 72293 148340 212158 166875 145323 127621 61492 -31225
15339 -31225 6218 57645 110877 138864 119644 129690 116047 149684 199049 157279 149887 148727
15327 148727 130522 125604 119073 19794 74664 65973 74773 52584 51048 121987 206679 141271
15315 141271 48753 47581 23652 54205 108994 16410 70596 61668 107482 139569 129463 30690
15303 30690 -30234 -38773 6956 24146 14985 5859 51519 16498 -39789 -10533 2434 -55962
15291e5962l7784P1453J69072M3105k1807o4638L3730J05768L385J8074O531j4572
15279B56355q8960q4571j17446m7416M7126k6713M9353J3493M5878K3542N056
15268G5697O8229m8810k6764Q0236p326n3815l904j4419m1559Q1369M5315L6446
15256A90695l5875j3344l5055l8946j6559O996L3645K4062r46L0030P5345J6179
15244B36227j0319J5142n5736j7900K6583K4908m3087k3062j0051o41k0609o1070
15232F0385k709J58256Q7086n7750j33881q2772m2678N8368n9351j1942K6879
15221a09m179q8501J797J6907K0003P1744P5970L5645m5145O33J3732n5201p1705
15208b8409K8172N5941L5523k797l7709k1376K0856m0213M7079L9373M0314N9861
$$ plain form
15291 -55962 -93746 -22293 146779 189884 168077 103439 137169 242937 246322 264396 270927 256355
15279 256355 167395 82824 -34622 -82038 -34912 -61625 -12272 1221 47099 70641 75697
15268 75697 143926 95116 68352 148588 141262 87447 83543 69124 27565 108934 154249 190695
15256 190695 154820 141476 106421 67475 50916 57912 91557 115619 114673 144703 220048 236227
15244 236227 225908 241050 185314 167414 193997 218905 175818 152756 142705 142064 121455 60385
15232 60385 57676 215932 303018 245268 111387 28615 -14063 44305 -15046 -26988 -109
15221 -109 -4288 -92789 -90992 -74085 -54082 17662 93632 129277 84132 84765 98497 43296 -28409
15208 -28409 -237 55704 91227 88430 50721 29345 50201 9988 57067 96440 136754 196615
15196A96615k4726K113J222r525j1868O2084L9057N94j7979q8023m8252o1317
15184C9995O1545J01948o61p928l2637k3551j6588o383M7396r771k1664l3489
15172I8212j5123J2282n9932q3210L6189M5388M0703j7002l1123k2152K9338o2764
15160b9194l21K1916L1830L7701M4054l8337l1625R7189P0761q9795r0873K1530
15148D4836R2677o422K1657k0099j5464k6334p090J1508m6892j5196q153N4005
15136G9033Q9996O2543k3666k6916l9256k9782j1789k6388N6643L7624k2699j8216
15124A27127P0021m9782j5956J6768L9795L9382J8685p7480o5250o3466N1447
15113I1291R2439J18818K1514m2401j31624q8254j1751K7026m3628k0125m883
$$ plain form
15196 196615 171889 174002 175224 165699 153831 215915 254972 255566 237587 149564 101312 39995
15184 39995 101540 203488 202827 194899 162262 138711 122123 115740 163136 153365 131701 98212
15172 98212 83089 95371 35439 -47771 -11582 33806 74509 57507 26384 4232 33570 -29194
15160 -29194 -29515 -7599 24231 61932 105986 67649 36024 133213 203974 114179 23306 44836
15148 44836 137513 131091 152748 132649 117185 90851 83761 95269 48377 33181 25028 79033
15136 79033 169029 231572 207906 180990 141734 111952 100163 73775 130418 168042 145343 127127
15124 127127 197148 147366 131410 148178 187973 227355 246040 168560 103310 39844 91291
15113 91291 183730 302548 324062 281661 150037 61783 50032 77058 33430 13305 8422
15102H422L7809P0570n630J8191M3113q2511m3197K0548k5745J04758J02168m9222
15090A99274m3016p338O9181n459j24152P0011O3921Q265o6287j30849n9098O2659
15078C7112J5907P2632J12024l7045m3387K5937J9107q8914l2751P5827L1067
15067A87516P0214M196k3299j4196m6495K089M4814P539n7132P668J2490K5349
15055B20753J6367j0815o2014o259j6510o761K160M998J7100J09799k8667j11934
15043A28217L1303M6609j7368Q834K4042r480n2868n9093k5418Q218P1277P2091
15031B26364Q2048j6397k2484j7982j0897j46339j8469q965M4905K064P7742L7717
15019B29307P276l7584k0493l8463Q434j7811l9336K8905P1771k9279Q6300J3202
$$ plain form
15102 8422 46231 116801 111171 129362 172475 89964 46767 67315 41570 146328 248496 199274
15090 199274 156258 148920 218101 212642 88490 158501 222422 230687 164400 33551 -25547 37112
15078 37112 53019 125651 237675 200630 157243 183180 202287 113373 80622 156449 187516
15067 187516 257730 261926 238627 224431 177936 180025 224839 232378 175246 182914 195404 220753
15055 220753 237120 226305 164291 158032 141522 134761 136921 141919 159019 268818 240151 128217
15043 128217 159520 206129 188761 197595 221637 212157 159289 100196 74778 82996 154273 226364
15031 226364 308412 292015 269531 251549 240652 94313 75844 66879 111784 113848 191590 229307
15019 229307 236583 198999 178506 140043 148477 130666 91330 120235 192006 162727 249027 262229
15007B62229m345L9643l6096q7537q3763J7682Q5961O9816M3388K2683J43193
14996D72854J48510K00394L56234N94192O59974K61192l05783o56463n24357m30925
14986G75822k87776j06980m4150k5200RM4274o2530q531j7235n0332N5197R733
14974B82301l3727O7k8146n6642m4817Q492k3890o6136K9126O6247r492M7084
14962A70467P4091J0080q4342l4454k2220J8890J02426Q404M590R632p2062k3389
14950A62113Q252L9630o1603l0847j9341K8798J4402K9959K8538L8022n663l6541
14938A95719k2363M0233j4668N306q6834r0877J9640M6591O9311l237J10767k0277
14926B49311q4095m2372J7356J8543K2781k0681M343k4256p5319q515M1036J40938
$$ plain form
15007 262229 257884 297527 261431 173894 90131 107813 193774 263590 306978 329661 472854
14996 472854 621364 821758 1177992 1772184 2432158 2693350 2387567 1731104 1206747 775822
14986 775822 488046 381066 336916 311716 311725 355999 293469 284938 267703 217371 272568 282301
14974 282301 248574 248641 220495 163853 119036 127528 103638 37502 66628 132875 123383 170467
14962 170467 244558 254638 170296 135842 113622 132512 234938 243342 247932 257564 185502 162113
14950 162113 170365 209995 148392 117545 98204 127002 141404 171363 199901 237923 232260 195719
14938 195719 173356 213589 198921 204227 117393 26516 46156 92747 162058 158821 269588 249311
14926 249311 165216 122844 140200 158743 181524 160843 165186 140930 65611 57096 98132 239070
14914B39070P0190j23752l3346K0555m3592k0523l0613J04247Q7530j32489l0787
14903A06490M7552k5363L539O2949k5020p653m3195j0633r900K3479J1183K5726
14891A59154N746J8812k3395k8469j1631K7230J20763Q079j02311N1958N7142
14880B83078P354q1158k7577j8042m4507l1343P9033M5512j9655r4575m2322O0577
14868A16375J9755O4359O5964j1889K3359O6369l584l9929p2101m3578M3686K5554
14856B54340k9367o9471O258m960K0799P105n782O6675M8129J7153m8044q9092
14844A73743K4684k643L5049R9716l2156n9848o6018p334L813K2698J525N2362
14832B45591o962p9444P9451J3378n9325r2900N5023J00647L2498M0643k8751
$$ plain form
14914 239070 309260 185508 152162 172717 129125 108602 77989 182236 269766 137277 106490
14903 106490 154042 128679 132218 195167 170147 162494 119299 108666 98766 122245 133428 159154
14891 159154 164900 183712 160317 131848 120217 147447 268210 276289 173978 225936 283078
14880 283078 290432 209274 181697 163655 119148 87805 166838 212350 192695 98120 55798 116375
14868 116375 136130 200489 266453 254564 277923 344292 340708 300779 228678 185100 228786 254340
14856 254340 224973 155502 161760 156800 177599 184704 178922 245597 293726 310879 262835 173743
14844 173743 198427 195784 230833 330549 298393 238545 172527 165193 169006 191704 193229 245591
14832 245591 238629 159185 238636 252014 192689 99789 154812 255459 287957 328600 299849
14821B99849m9487o9490K0779N3209j2529o908m2699m9751J06866J28246K2103
14810D00188p509R648j9702n9513l0418K8019j03925L7139O8957l263n6471j9562
14798B43588j6647J486l666J5579N498j18799K0681O3745j1532K8590k5606l2420
14786A70497N6443M0502n9727J8368P500N9269K3634j06036K4577M5821L0344
14775C11192O5800p2804L9919M7521p3407o8589p0199J8059J3508K707N7902J0349
14763B81958p4250k0436P0757L2230Q691m3596M8257L5550k3107m9887p0460J8562
14751B14269P7364N5770p0771j16608o656P5721P014k5499m2525O0908Q9274L3551
14739C51812o2003k056M999J514q255k0198M7832K3182J2103M2199M0500r0284
$$ plain form
14821 299849 250362 180872 201651 254860 242331 235423 192724 142973 249839 378085 400188
14810 400188 392679 402327 382625 323112 292694 320713 216788 253927 322884 319621 263150 243588
14798 243588 226941 228427 224761 240340 245838 127039 147720 211465 199933 228523 202917 170497
14786 170497 226940 267442 207715 226083 233583 292852 316486 210450 235027 280848 311192
14775 311192 376992 304188 344107 391628 318221 249632 179433 197492 211000 213707 271609 281958
14763 281958 207708 187272 258029 290259 298950 255354 303611 339161 316054 266167 195707 214269
14751 214269 291633 347403 276632 160024 153368 229089 236103 210604 168079 228987 318261 351812
14739 351812 289809 287753 292752 294266 286011 265813 313645 336827 348930 391129 431629 341345
14727C41345J2902p4710m6804R554l271l3387q2968l2495j8774K495n9904M7045
14715F1028M3407L907n6810m756P4540R4965O493n4609l7559n1970n1085P1010
14703I8561O4040K1853K4117K7230O6189O4230l3977n1636l555P172m0498M8281
14691B92007R5450M1386k3532J898k6004q1815r9479l3337M6645N2015P7858M4794
14679C87886P6935J6199p2010p4890k0748j5036l9330J5623P8845K5192j1558
14668C67108j3464l245k0347j10906J9475J03183N19o1142j05949j4261J6097
14657A77068K7817K9506k2077L4379J9614o4761q011q2930n6752R9617O0811L2010
14645B46291K8825l4076L0048O9440R80k0604r5939m5004k2005q872O3626J5692
$$ plain form
14727 341345 354247 279537 232733 242287 239016 205629 122661 90166 71392 73887 13983 61028
14715 61028 104435 108342 51532 46776 121316 216281 222774 168165 130606 78636 27551 98561
14703 98561 162601 184454 208571 235801 301990 366220 332243 280607 277052 284224 243726 292007
14691 292007 387457 428843 405311 407209 381205 299390 199911 166574 213219 265234 343092 387886
14679 387886 464821 481020 409010 334120 313372 298336 259006 274629 353474 378666 367108
14668 367108 353644 350399 330052 219146 238621 341804 342323 281181 175232 160971 177068
14657 177068 204885 234391 212314 246693 266307 201546 193535 110605 53853 153470 214281 246291
14645 246291 275116 241040 271088 340528 341508 320904 224965 179961 157956 149084 212710 228402
14633B28402O01K6357J704l7876k6614l5471m462Q2162J0105k3547O1334L6961
14621C19656P2797J8120l2128p1147n454K8546l558j0845M9571j8785m8279Q378
14609C06872p4432o1742N4418K9726O7985p2378k4934J7563L5226L2064p0461
14598B39907L2070L5828M031R5431P348K1021L5423L5668p8477k6688k9476j55020
14586B17066k1821O2288J71506M1117q6152j02027q852m1387m8613k0938N4548
14575B16735K7970O9357l2433M0406R186k2437R477l2914o8138L8802L9426N224
14563C00661M3774M1258n063m2637l1488N988p6804q1706J5109K1340R276N9652
14551B59360O6915k3763j7035N1238R1407k4615K0216p7956k4723P1623l3944
$$ plain form
14633 228402 229003 255360 257064 219188 192574 157103 152641 234803 244908 221361 282695 319656
14621 319656 392453 410573 378445 307298 301844 330390 326832 315987 365558 346773 298494 306872
14609 306872 232440 170698 225116 254842 322827 250449 225515 243078 278304 310368 239907
14598 239907 271977 307805 311836 407267 414615 435636 471059 506727 428250 401562 372086 217066
14586 217066 195245 257533 429039 470156 384004 281977 273125 231738 183125 162187 216735
14575 216735 244705 314062 281629 322035 331221 308784 318261 285347 217209 256011 295437 300661
14563 300661 344435 385693 380630 337993 306505 312493 235689 153983 169092 190432 199708 259360
14551 259360 326275 302512 285477 336715 428122 403507 423723 345767 321044 392667 358723
14540C58723N001m391p8807M0308N5752N495q1080L6454Q149p6147n4076P2890
14528B88271Q2534M623O3562j7971q1360P9009Q0774n6266J8373P552K4525q3027
14516D10599l2253O7826N8980m1908R493p5326j09302M7989R9442R2343j8605
14505E09278p6700p8669O9973P836L3753n3391o3803k9125L4036O9042R4084n080
14493E11234r040j2630J2137K0048j073O8494R2677J3648n5188o391P3896J27437
14481H35249J34177J36285J78068J51635K00115K84509K81437J83878O5906M087
14471B455346l6082l5141j4487L0096n2707l3612j81327k91256l36179k54474
14461A250177k67893j75771o1929p397k4662r3017j14597k30j2645k0009O5796
$$ plain form
14540 358723 363724 359333 280526 320834 376586 382081 301001 337455 345604 269457 215381 288271
14528 288271 370805 375428 438990 421019 339659 418668 499442 443176 461549 469101 493626 410599
14516 410599 378346 446172 505152 463244 472737 397411 288109 336098 435540 527883 509278
14505 509278 432578 353909 423882 431718 465471 412080 348277 319152 353188 422230 516314 511234
14493 511234 502194 489564 501701 521749 520676 589170 681847 695495 640307 633916 707812 835249
14481 835249 969426 1105711 1283779 1435414 1635529 1920038 2201475 2385353 2451259 2455346
14471 2455346 2419264 2384123 2369636 2399732 2347025 2313413 2132086 1840830 1504651 1250177
14461 1250177 982284 806513 744584 737187 712525 619508 504911 504681 492036 472027 537823
14450E37823K6402o5808m527m0846P9523Q724K1022M4258l3856n1555k9791l9752
14438D51617J6664Q0990M4128l1739L0942l8643n6931N6177O4998j11838j1631
14427D94734O8579N9308K3842m4354j6154l7831k2298J6943l7950k1611M5924
14416E29132k5452K199L7763M1172l0061K7087K5215q7221q8412j8223m0263O1079
14404D34015m8229j62860J4964P1613M8641j9376L2411J1649P079j7019J04125
14393D77013L5306o778l6941K8797J1044l7014j0028J3347m3078K46K8748J1373
14381D72035K2474l9878l4006J9058Q7066l1568k6191M1718K590O511m2525O9454
14369E46738R815L1670m688N242n40j9649L7650o289m7268l7910q081n3231j3482
$$ plain form
14450 537823 564225 498417 493890 453044 532567 541291 562313 606571 572715 521160 491369 451617
14438 451617 468281 549271 593399 561660 592602 553959 497028 553205 618203 506365 494734
14427 494734 563313 622621 646463 602109 585955 548124 525826 542769 504819 483208 529132
14416 529132 503680 505879 543642 584814 554753 581840 607055 519834 431422 413199 372936 434015
14404 434015 385786 222926 237890 309503 358144 338768 371179 382828 389907 372888 477013
14393 477013 512319 505541 468600 497397 508441 471427 461399 474746 431668 431914 460662 472035
14381 472035 494509 454631 420625 439683 526749 495181 468990 510708 513298 519809 477284 546738
14369 546738 556553 588223 583535 588777 588237 568588 606238 599949 552681 514771 506690 453459 439977
14356D39977K487j28667K072O8541J00936M6711p204N0177J34050J6413j12141
14345F13352j00076K9425L7675J9973m7375j0920O4485r0064R1804M1325q3830
14334E65774n2645m2770L0885K4240L5059O467N769j4768O265L9463q437o016
14322E89286O0715p2757J5889N0881R737j6260q9943J6393n87l6609N3418O2822
14310F42985o5195Q425K6984M1927J2567j7150P402p7438q2030L0699L5593p6818
14298D87951N29j516M8495M7770J45744L8465N159l3524n6647m346k0039n217
14286F52824P5434L1863K8545j7533N3615L0079M2969l3683J0726Q0337J0559
14275I65735k290o0944O882R0527P3811M94r0164J6267N2410p190j82308p5554
$$ plain form
14356 439977 442464 313797 315869 384410 485346 532057 524853 575030 709080 725493 613352
14345 613352 513276 542701 580376 600349 552974 542054 606539 516475 608279 649604 565774
14334 565774 513129 470359 501244 525484 560543 567010 572779 558011 564276 603739 595302 589286
14322 589286 650001 577244 593133 644014 653751 637491 547548 563941 563354 526745 580163 642985
14310 642985 577790 586215 613199 655126 667693 650543 657945 580507 498477 529176 564769 487951
14298 487951 488480 486964 535459 583229 728973 767438 772597 739073 682426 678080 658041 652824
14286 652824 728258 760121 788666 771133 824748 854827 897796 864113 874839 955176 965735
14275 965735 963445 902501 909383 999910 1073721 1074215 984051 1000318 1052728 1045538 863230 787676
14263G87676L8421j3384K3915L2172J7485j4655l9295l3440N422k0889l6137N5807
14251H03098K5340L8737K0426l3619j5871M9892O8343p906l0614q7830o2843m3413
14239G23740m4856J6987M4850Q9545L2945o9084j24029Q5007K0712K644J0896
14228G89357O0723L2830r8617n5678k4781l7206p70J6084L490K7992R7056R684
14216H20164l8608l8267J06398R0392p4212m5532O2230j6784n6857J02042J22203
14205A033169q470J0040M5425q938J8676N3394K868p6544q0372k0826o1532r657
14193H97233P4583L5805L7945l8126Q3605Q6693L1735j6623o147n1987J21594
14182A256310N3772j66093k4674K0305K0613K631k5441n4207l3144K3322O3669
$$ plain form
14263 787676 826097 812713 836628 868800 886285 871630 832335 798895 804317 783428 747291 803098
14251 803098 828438 867175 887601 853982 838111 888003 956346 948440 917826 829996 767153 723740
14239 723740 678884 695871 740721 830266 863211 794127 670098 755105 775817 778461 789357
14228 789357 850080 882910 784293 728615 703834 666628 665858 681942 685432 713424 810480 820164
14216 820164 781556 743289 849687 940079 865867 820335 882565 865781 808924 910966 1033169
14205 1033169 1024699 1034739 1080164 1071226 1089902 1143296 1146164 1069620 989248 968422 906890 897233
14193 897233 971816 1007621 1045566 1007440 1091045 1177738 1209473 1192850 1186703 1134716 1256310
14182 1256310 1310082 1143989 1119315 1139620 1160233 1162864 1137423 1083216 1050072 1073394 1137063
14171A137063L8961p1092N325O7542J0164r52P344j4952O6408M8743K3926j539
14159A316941K8936j745N3272P1999k8465L4697L6945P7888M6010N6243J2692
14148A705413P875j6598M2795M6580q1830p1640j7891M8346K3116R5719R633m965
14136A786553k1452M8277R858L321r0651j8098K7205K25P6371J04688M5321L6671
14124B008289n7982r0799P6035J25172k3590n4218N841K9910L4289O8045L9995
14113B160987K3428O3027J29445P1299m4194p112N7408P8187k4057K0223l309
14102B525332N4410J30774L4538R238j3587K3694P8111O4589Q0484J36022J63451
14091C287056Q949r918O5886J53681J53160M3151n2567L8234R5665R2657N4756
$$ plain form
14171 1137063 1176024 1104932 1110257 1177799 1187963 1187011 1194355 1179403 1245811 1294554 1318480 1316941
14159 1316941 1345877 1344132 1397404 1469403 1440938 1475635 1512580 1590468 1636478 1692721 1705413
14148 1705413 1713288 1696690 1739485 1786065 1704235 1632595 1614704 1663050 1686166 1781885 1791518 1786553
14136 1786553 1765101 1813378 1823236 1826557 1735906 1717808 1745013 1745238 1821609 1926297 1971618 2008289
14124 2008289 1950307 1859508 1935543 2060715 2037125 1982907 1988748 2018658 2052947 2120992 2160987
14113 2160987 2184415 2247442 2376887 2448186 2403992 2396880 2454288 2532475 2508418 2528641 2525332
14102 2525332 2579742 2710516 2745054 2754292 2740705 2764399 2842510 2907099 2987583 3123605 3287056
14091 3287056 3296005 3286087 3351973 3505654 3658814 3701965 3649398 3687632 3783297 3875954 3930710
14080C930710P8869Q3555N1467J38737J04458R6501J16828R1833O7285J82334
14070D942577J65644J50604J73010K34955K20821J31433J41872K69310L16098
14061F746324K53076K94051L13231K25069K94393M20540M52181L93112M13158
14052I805135N01324N74637N90375O72196R04863R31318J063861J366809J519797
14043A7930315J773433K217314K488237K812193L272563L741033M297771M984093
14035D3516952N994665P587715J0195269J4044531J9779611K8183316L8931815
14028A68233874M9920842N6648763N5165151M3782725K5891949Q898575j094495
14021D07447384k032306P75024N45858q325754k4877057m2564389n4600233n7232761
$$ plain form
14080 3930710 4009579 4093134 4144601 4283338 4387796 4484297 4601125 4692958 4760243 4942577
14070 4942577 5108221 5258825 5431835 5666790 5887611 6019044 6160916 6430226 6746324
14061 6746324 6999400 7293451 7606682 7831751 8126144 8546684 8998865 9391977 9805135
14052 9805135 10306459 10881096 11471471 12143667 13048530 13979848 15043709 16410518 17930315
14043 17930315 19703748 21921062 24409299 27221492 30494055 34235088 38532859 43516952
14035 43516952 49511617 57099332 67294601 81339132 101118743 129302059 168233874
14028 168233874 218154716 274803479 329968630 373751355 399643304 408541879 407447384
14021 407447384 405415078 406190102 406735960 398410206 373533149 330968760 276368527 219135766
14013B19135766n1582616m1168163l0364733k1637533j5303968j0962056q098144
14006D0018553o138114m911525l936535l294639k828379k420935k153622j947427
13998A2387377j635390j386850j327374j000582q13801o69697o46719n19257m67492
13989C920215m60828l27661l00419k57430l10471k35133k70758j59833j41639
13980A456043k04546j73577o0321j55066j22629p0200l0560l8218m2316M927l2321
13969E31216l837J4724q0397o1959r0636l9801m6891l0913l6615M864m3255q0251
13957C6249j02267p2018l3080j1456o0064P084k6478k9905q978L3966P9659O7043
13945a20245r582l7980p2900k1833m5686J9229K1034O9538J07721K8828M934J7853
$$ plain form
14013 219135766 167553150 126384987 96020254 74382721 59078753 48116697 40018553
14006 40018553 33880439 28968914 25032379 21737740 18909361 16488426 14334804 12387377
13998 12387377 10751987 9365137 8037763 7037181 6223380 5553683 4906964 4387707 3920215
13989 3920215 3459387 3131726 2831307 2573877 2263406 2028273 1757515 1597682 1456043
13980 1456043 1251497 1077920 1017599 862533 739904 669704 639144 600926 558610 563537 531216
13969 531216 527379 542103 461706 399747 309111 269310 222419 191506 154891 159755 116500 36249
13957 36249 -66018 -138036 -171116 -182572 -242636 -235552 -262030 -291935 -300913 -266947 -187288 -120245
13945 -120245 -129827 -167807 -240707 -262540 -308226 -288997 -267963 -198425 -90704 -61876 -56942 -39089
13933c9089j5360O010K6015r4775q5887R727P7329k6385p6921r0563J12332L8858
13921a58709j2440j5082J5479k9402k3583l7186K9380J7570k3669j2673k3224
13910b73539N2308R8032l3756n8271J9087p884m7453M9232R552M0932N5954n4955
13898a50761Q739Q3842j3788p9279L3433N5605J04953l895p6117l5382J5348o8329
13886a25631j01775J7863M8642L879P4381L425O4891P3235J4190o9010l5206J5704
13874a5412l0872j7071K263M944J4408J6824l8913q0433j4358J7802k6634J5716
13862a51736k9694J8702n7122j5330q41O8859K8922j7270M1263K0208l545N6107
13850d1477K5694j5193l3622j0639J31045O8500k7611o3014J7737j3572q0663
$$ plain form
13933 -39089 -54449 -48439 -22424 -117199 -203086 -193359 -116030 -142415 -219336 -309899 -197567 -158709
13921 -158709 -171149 -186231 -170752 -200154 -223737 -260923 -231543 -213973 -237642 -250315 -273539
13910 -273539 -221231 -123199 -156955 -215226 -196139 -204023 -251476 -202244 -192692 -151760 -95806 -150761
13898 -150761 -142022 -58180 -71968 -151247 -117814 -62209 42744 38849 -37268 -72650 -57302 -125631
13886 -125631 -227406 -209543 -160901 -157022 -82641 -79216 -14325 58910 73100 4090 -31116 -15412
13874 -15412 -46284 -63355 -61092 -56148 -41740 -24916 -63829 -144262 -158620 -140818 -167452 -151736
13862 -151736 -181430 -162728 -219850 -235180 -236021 -167162 -138240 -155510 -114247 -94039 -97584 -41477
13850 -41477 -15783 -30976 -64598 -75237 55808 124308 96697 33683 51420 37848 -42815
13839d2815p5596l2600p62k6064L5421n998Q991J2855M2860O7072o0381M2558
13827c4459O6004k3487K3339O4848N9089L1838p6264p7666J1984J5089L1069K9441
13815A20825l3222m9465k6757K75O1941J4135l6971p2155o0229L6297K9508R0213
13803G4395J5607j12725j6548J04672r61o5419n3010l477K0141j0898R8697O153
13791E6627n0667j5358j3163o3000Q1664J7949N1714M0943o1835J8022O1547M6146
13779A70589k6442r4756r8395k5387K8632M8971K8307Q4135L126m4133J6167m8122
13767D2692j19286M7116J17911J18334n30r2614l431k9463k7419j5118N0085L1506
13755A19783j4095k0000o2004j0149K3371O0524J5773L2961n9042J7982j0814
$$ plain form
13839 -42815 -118411 -151011 -151773 -177837 -142416 -148414 -139423 -126568 -83708 -16636 -77017 -34459
13827 -34459 31545 8058 31397 96245 155334 187172 110908 33242 45226 60315 91384 120825
13815 120825 87603 38138 11381 11656 73597 87732 50761 -21394 -81623 -45326 -15818 74395
13803 74395 90002 -22723 -39271 65401 64440 -979 -53989 -57466 -37325 -48223 50474 56627
13791 56627 5960 -9398 -22561 -85561 -3897 14052 65766 106709 44874 62896 124443 170589
13779 170589 144147 49391 -49004 -74391 -45759 3212 31519 115654 118780 74647 90814 42692
13767 42692 -76594 -29478 88433 206767 206237 113623 110192 80729 53310 38192 88277 119783
13755 119783 105688 85688 23684 13535 36906 97430 113203 146164 87122 105104 94290
13744I4290Q242n6944J04126J34877J8118m9609p8814m2402n079l3250p9916l770
13732I869j0725K7747M8572K5848N7473j241j0421j05106l7781j6194O0109j856
13720D6294o7364J8055k570J44498N9052l9417p3792p5269k0932O1742o113K1494
13708F5678J09970j9738r2355K3281q207p5642O5310M8647J4404k9355L8639P4973
13696B15605N1977m6550j10971K7473L8187J4663j5929P252q7372m8002k751m966
13684C8616n8718N9648O2593M5103k555q186m3796l5123L7537K9400K6502q857
13672A42164k7440K5363m2816k8606L4968K1902j9024O4499K964J9592p0302l9874
13660H3390L3813J9752K9558R7380N6396l2417o6879M8473M0531j9289J18944
$$ plain form
13744 94290 102532 45588 149714 284591 302709 253100 174286 131884 126805 93555 13639 9869
13732 9869 -856 26891 75463 101311 158784 157543 147122 42016 4235 -11959 48150 46294
13720 46294 -21070 -3015 -5585 138913 197965 158548 84756 9487 -11445 50297 44184 65678
13708 65678 175648 155910 63555 86836 78629 2987 68297 116944 131348 101993 140632 215605
13696 215605 267582 221032 110061 137534 175721 190384 174455 181707 94335 46333 43582 38616
13684 38616 -20102 39546 102139 147242 144687 136501 92705 57582 95119 124519 151021 142164
13672 142164 114724 140087 97271 68665 103633 125535 106511 171010 173974 193566 123264 83390
13660 83390 117203 136955 166513 263893 320289 287872 220993 269466 309997 290708 409652
13649D09652j3767j13185k507o826J054j89L6446L8576p972n3094K7886K198k2050
13636B96222k7737K7378P1568K7803k6043J0961L4993n1182J0324L9188j1029
13625D02446r4625o9198J0355J08238M519L8253R074q9485R746N6381N0874k2047
13613D14531k2745j1295P2814M4936k7841r6647k0255L5434K4996k833k6828Q5547
13601D69814K1543m4039J9578O4414M4439L5776l9277j2082J6127m0392K2191
13590E58092M8563M7458N6132M250o4038m763L111N0207M5232J02180j4229o082
13578H26113Q4592L5754J15325N1567O3863K27664K76318K77824K71331J90775
13568B421126J53632k1697o2919O8462Q400m6214l4299j95365k65694k53196k85598
$$ plain form
13649 409652 395885 282700 280193 273367 274421 274232 310678 349254 341282 288188 316074 318272 296222
13636 296222 268485 295863 367431 395234 369191 380152 415145 363963 374287 413475 402446
13625 402446 307821 238623 248978 357216 361735 399988 409062 319577 329323 385704 436578 414531
13613 414531 391786 380491 453305 498241 470400 373753 353498 388932 413928 411095 384267 469814
13601 469814 491357 447318 466896 531310 575749 611525 572248 560166 576293 535901 558092
13590 558092 606655 654113 710245 714495 650457 645694 648805 699012 744244 846424 832195 826113
13578 826113 910705 946459 1061784 1113351 1177214 1404878 1681196 1959020 2230351 2421126
13568 2421126 2574758 2553061 2490142 2558604 2567004 2520790 2486491 2291126 2025432 1772236 1486638
13557A486638j57727j37254j45893j59694p8925m8019j08476k2645L9757j155
13547F66607n1501k2723o2523j07864j03825K7347O0257N2802K4981n621m1144
13536D36793k6895j3130K6789J479k353O7716L2927L7309P1679p156q3499l0965
13524E10694M8547L5404l8684L989L7043l3290q561o4659M6316J4373J6112N6324
13512F23608l6546p6307L969R3313k7481o345P7292M3500j8196o6699j6273r146
13500E84689L4744J583o8399L5424K3553j04562L2930J24399N705l7372p5951
13489E56743J3202J5207K0763O875J1107p7570o8750J0760R7154P5759q8300L7890
13477F10840J16611k2000q4931n2408J8114K1714P237J24926J1054j1673m8677
$$ plain form
13557 1486638 1328911 1191657 1045764 886070 807145 759126 650650 628005 667762 666607
13547 666607 615106 592383 529860 421996 318171 345518 405775 458577 483558 477937 436793
13536 436793 409898 396768 423557 425036 422683 490399 523326 560635 632314 625158 541659 510694
13524 510694 559241 594645 555961 559950 596993 563703 555142 490483 536799 551172 567284 623608
13512 623608 587062 510755 514724 608037 580556 574211 651503 695003 676807 610108 593835 584689
13500 584689 619433 621016 552617 588041 611594 507032 539962 664361 670066 632694 556743
13489 556743 569945 585152 605915 612790 623897 546327 477577 488337 585491 661250 572950 610840
13477 610840 727451 705451 620520 568112 586226 607940 615177 740103 751157 739484 690807
13466F90807M4217N4677q7450k0849L2697L5710q5460k7179O7550K3053m7527
13455F80246K0660r1716k7324J13491R8245O9340l1796K584p8739J1967K0213
13444G87171p71J30893M2023p1055k9708k1153k8636l8587m4399J6490O4141N2420
13432H58829l2997k032m340k7141N2156O0545j1625J6412j9235q6865L352k8594
13420G78465j2073J0814l9603j8056l459R5428N533K6064M4500L7779L2024O616
13408I64032n7569J5385l4855r9617J7875N7994k4005p1940N0789K8919N083Q4878
13396I36969O9574L227j06335n0501J5717j6875O1727O1219m3650L0519M505N966
13384I72062n0640p421Q1259n6392K1381O9650Lq855J152k5557P0692J4999r2543
$$ plain form
13466 690807 735024 789701 702251 681402 714099 749809 664349 637170 704720 727773 680246
13455 680246 700906 609190 581866 695357 793602 862942 831146 833730 754991 766958 787171
13444 787171 786400 917293 959316 888261 858553 837400 808764 770177 725778 742268 806409 858829
13432 858829 825832 823800 819460 792319 844475 905020 893395 909807 890572 803707 807059 778465
13420 778465 766392 777206 737603 719547 716088 811516 817049 843113 887613 925392 957416 964032
13408 964032 906463 921848 886993 787376 805251 863245 839240 767300 818089 847008 852091 936969
13396 936969 1006543 1009770 903435 852934 868651 851776 913503 974722 931072 961591 966096 972062
13384 972062 921422 914001 995260 938868 960249 1029899 1029902 1021047 1022199 996642 1067334 1082333 989790
13371I89790O6185K8375P417J2616P7278p2455m120M4037Q429M5006K0993k0757
13359A202794p0531l3779l348N8378N7432j6803l5446o8892Q827k4897N578Q5157
13347A164470M4974K5872j4694n9240J7360Q275L5143J3053Q4960N595j2596M0955
13335A354127n4882j26788L5849O0189M95L7292Q8282k0632j24053r2179r118
13324A148582J0724R3784L6746q61l7226M5169K8688J21730L97m8550o6459j12368
13312A220356k5179L2677P8507O8253J10381K0200L3183l8124k414J4612p0681
13301A441771p5889M0064L2813j7577N3022J1154k2865P1497R5149q089p2041
13290A549009J3295N8813P316j8316J5439L2050j6293p5553o5250Q7071O8025
$$ plain form
13371 989790 1055975 1084350 1091767 1104383 1181661 1109206 1105086 1149123 1157552 1202558 1223551 1202794
13359 1202794 1132263 1098484 1095136 1153514 1210946 1194143 1158697 1089805 1098632 1073735 1079313 1164470
13347 1164470 1209444 1235316 1220622 1161382 1178742 1187017 1222160 1235213 1320173 1325768 1313172 1354127
13335 1354127 1299245 1172457 1208306 1268495 1268990 1306282 1394564 1373932 1249879 1157700 1148582
13324 1148582 1159306 1253090 1289836 1288975 1251749 1296918 1325606 1447336 1447733 1399183 1332724 1220356
13312 1220356 1195177 1227854 1306361 1374614 1484995 1505195 1538378 1500254 1497840 1512452 1441771
13301 1441771 1365882 1405946 1438759 1421182 1474204 1485358 1462493 1533990 1629139 1621050 1549009
13290 1549009 1562304 1621117 1628433 1610117 1625556 1657606 1641313 1565760 1500510 1587581 1655606
13279A655606m5002q5374J5673P5090L6642N0230N5676m610n1029J6820m7678
13268A672044O008Q939O9159Q3029L008P042L204J0757J954K0277N8044O9772
13256B013237p8450j9496L3954l6019N6022J2653m5580j09346J0070P3480M7929
13245A958454m5996o2840Q481J8957L6180J01576L0725j31400k923J14957O7086
13234B093257q9898p0419P6605n134m0286L0473J3270M5740L0207k741j2996R440
13222B077518Q553P0477m008O8136N06p5715k1832J7198J5593N3182N7139k3189
13210B243558J0043K382L1722M8467o7647K0430L4088l2295K3633L1504q625j5637
13198B321623m9772K2121N5556N3646Q3302R4470J260k7056l5211p6412j7384
$$ plain form
13279 1655606 1610604 1525230 1540903 1615993 1652635 1702865 1758541 1753931 1702902 1719722 1672044
13268 1672044 1678052 1686991 1756150 1839179 1842187 1849229 1852433 1863190 1865144 1885421 1943465 2013237
13256 2013237 1934787 1915291 1949245 1913226 1969248 1981901 1936321 1826975 1837045 1910525 1958454
13245 1958454 1912458 1849618 1858099 1877056 1913236 2014812 2045537 1914137 1911214 2026171 2093257
13234 2093257 2003359 1932940 2009545 2004411 1964125 1994598 2007868 2053608 2083815 2081074 2068078 2077518
13222 2077518 2086071 2156548 2152540 2220676 2221182 2145467 2123635 2140833 2156426 2209608 2266747 2243558
13210 2243558 2253601 2255983 2287705 2336172 2268525 2288955 2323043 2290748 2314381 2345885 2337260 2321623
13198 2321623 2271851 2293972 2349528 2403174 2486476 2580946 2582206 2555150 2519939 2443527 2426143
13187B426143J03084K5887q5968K1799J13270L301k5854o6473m7844J19928O8651
13176B655924l8592L1506L652N887q7553m5031N2557Q1591O4268M7582n9611r2237
13164B619943M9610J04627M0969K1101j1754n5853k438L62L3206j2549L7050M7478
13152B871752L7852K528L7398m8153r4051M2834M9280l5768m3609R2390N6731
13141B969184M5440m2918k1408M1880K9399K6610Q7046k2744M5280N2880k46j5229
13129C195174L2274j8574M2615J6091O5428k3893o6034p994l696j6880J4975l5866
13117C193620N4070P9493k0427N7677J09113n9141l6476R4523R6727l8020l6069
13106C495090m58M6035N0891n63k6263m7170m8794P230Q7362R7200O0025J265
$$ plain form
13187 2426143 2529227 2555114 2469146 2490945 2604215 2607516 2581662 2515189 2467345 2587273 2655924
13176 2655924 2617332 2648838 2652490 2658377 2570824 2525793 2578350 2659941 2724209 2771791 2712180 2619943
13164 2619943 2669553 2774180 2815149 2836250 2824496 2768643 2766205 2766567 2799773 2787224 2824274 2871752
13152 2871752 2909604 2912132 2949530 2901377 2807326 2850160 2899440 2863672 2820063 2912453 2969184
13141 2969184 3014624 2971706 2950298 2992178 3021577 3048187 3135233 3112489 3157769 3210649 3210403 3195174
13129 3195174 3227448 3208874 3251489 3267580 3333008 3309115 3243081 3235087 3231391 3214511 3229486 3193620
13117 3193620 3247690 3327183 3306756 3364433 3473546 3414405 3377929 3472452 3569179 3531159 3495090
13106 3495090 3494632 3540667 3591558 3590995 3564732 3517562 3468768 3475998 3563360 3660560 3720585 3721850
13094C721850Q334M7856l7576n224O8226O616n2992n646N6104K3388m447o1883
13082C764606k2999j9971M9482R7022Q8106K8661J7338L9755N5493l0959L3579
13071D100113n9731k7994P3051P8634l3968m4809p4546k7129K9815N632j6793
13060D002275O6047Q1919K7859K9973k2847O5509K989R171l5086J9824N1063L2869
13048D331565l2551m4404j430O6864J857P4575M3288K0714L9194J30582J1375
13037D641629k8256k4267l5315N2075j2383L4670o5823k9623M7114P3623R7061
13026D750505J10360n3105p6415m017O9535J3526o8931K7982Q3231N0972R8174
13015E001817P197j61762m4564l5054L4757N6885k3895j6406J01016J00813j3021
$$ plain form
13094 3721850 3730184 3778040 3740464 3735240 3803466 3810082 3757090 3751444 3807548 3830936 3826489 3764606
13082 3764606 3741607 3721636 3771118 3868140 3956246 3984907 4002245 4042000 4097493 4066534 4100113
13071 4100113 4040382 4012388 4085439 4164073 4130105 4085296 4010750 3983621 4013436 4019068 4002275
13060 4002275 4068322 4150241 4178100 4208073 4185226 4250735 4253724 4262895 4227809 4247633 4298696 4331565
13048 4331565 4299014 4254610 4253180 4320044 4321901 4396476 4439764 4460478 4499672 4630254 4641629
13037 4641629 4613373 4589106 4553791 4605866 4593483 4628153 4562330 4532707 4579821 4653444 4750505
13026 4750505 4860865 4807760 4731345 4727328 4796863 4810389 4741458 4769440 4852671 4903643 5001817
13015 5001817 5009014 4847252 4802688 4767634 4802391 4859276 4835381 4818975 4919991 5020804 5007783
13004E007783m4487p7555r562p0599l9388R1460N8992J4591J3934L8151P463M5858
12992E036641K8090m0552j5816j8655j0033m3322P227P5682L154j2926K7385L8285
12980E075160J12797O5880j9153j3249j32181q5233N8133N1963M6235K2108k5110
12969E157350O589J5509K4834L4673M0036M3153O9736j8604p5139l4632J9147
12958E282652J6969M9929J392n9107K5102L61k5535R8632J7062n1238J0404L1419
12946E398042k71K9079P613N7108j3639n2680M0863j8416p3940l0121P3815m572
12934E412881m7939J8163M8892l655j0123j4923J0622o153k8503J1249R403M330
12922E404244j8755K724k8886m1066l8854M6678o218j15446J7967L9815K2234
$$ plain form
13004 5007783 4963296 4885741 4876179 4805580 4766192 4857652 4916644 4931235 4945169 4983320 4990783 5036641
12992 5036641 5064731 5024179 5008363 4989708 4979675 4936353 4943580 5019262 5022416 5009490 5036875 5075160
12980 5075160 5187957 5253837 5234684 5221435 5089254 5004021 5062154 5114117 5160352 5182460 5157350
12969 5157350 5163939 5179448 5204282 5238955 5278991 5322144 5391880 5373276 5298137 5263505 5282652
12958 5282652 5299621 5349550 5350942 5291835 5316937 5317298 5291763 5390395 5407457 5356219 5366623 5398042
12946 5398042 5397771 5426850 5434463 5491571 5477932 5425252 5466115 5447699 5373759 5343638 5417453 5412881
12934 5412881 5364942 5383105 5431997 5428342 5418219 5403296 5413918 5407765 5379262 5390511 5399914 5404244
12922 5404244 5385489 5388213 5359327 5318261 5279407 5326085 5319867 5204421 5222388 5262203 5284437
12911E284437l1118l1387L0573N3622l1386p0401R7525L4653K2915k6483o628
12900E326322r9055M3878O2368n7329p3363o5855J8267j3902j4822p2627M5257
12889E099139l906j7121q1350L817J10831j7337Q8841j0644o3009j24707j5649
12878D968905Q8930J1169K6516j0139m6789q0765R991m6630L7701R2275n592p2187
12866D973385r176J4696n5280m6264N7676J04479m7849j3052L9206j1264j9204
12855D987353o20L6531n2082n0288p246O2523j6145n4632n6009j31292m7258N7614
12843D728449P1957P1787K4998k7644k5196N4531p9333q9978L8548L3632k6261
12832D775490p5333m242j942j3661K2682L5365J4139j13168j21788q8050O2269
$$ plain form
12911 5284437 5253319 5221932 5252505 5306127 5274741 5204340 5301865 5336518 5359433 5332950 5326322
12900 5326322 5227267 5271145 5333513 5276184 5202821 5136966 5155233 5141331 5126509 5053882 5099139
12889 5099139 5095233 5078112 4996762 5000579 5111410 5094073 5182914 5172270 5109261 4984554 4968905
12878 4968905 5057835 5069004 5095520 5085381 5038592 4957827 4967818 4921188 4958889 5051164 5045572 4973385
12866 4973385 4964209 4978905 4923625 4877361 4935037 5039516 4991667 4978615 5017821 5006557 4987353
12855 4987353 4986733 5023264 4971182 4920894 4913648 4976171 4960026 4905394 4849385 4718093 4670835 4728449
12843 4728449 4800406 4872193 4897191 4869547 4844351 4898882 4819549 4729571 4768119 4801751 4775490
12832 4775490 4700157 4695915 4693973 4680312 4702994 4738359 4752498 4639330 4517542 4429492 4491761
12821D491761l229j1364M2006J2552j648q2023p4266l778J1135l0227o4362n582
12809D280975J06035J2380k8251O497L510P3660j2157m0338j6445r110n3466l0645
12797D292645Q384j4671j5868m2688l8847j12431j42237Q347J27556R0018j68936
12786C991272l6085L5720k6393m8178n524m5110J8863j9819j3684L3516r042J2658
12774C888194p6378k8231P5926M4504j4066m1991m9080j6091L2921p4973j35678
12763C605057K2882J08459k5110n9584k5706L1190J00283p5460j7182L6500J6036
12752C717365l9173m2959j3131m9881j6165n8918L5782L6025k1128l9781l6368
12741C471668n2659q8238l9105M5548J0918j0041k7923L0145Q4271N6397m7096
$$ plain form
12821 4491761 4488532 4477168 4519174 4531726 4530078 4448055 4373789 4370011 4381146 4350919 4286557 4280975
12809 4280975 4387010 4399390 4371139 4377636 4381146 4454806 4442649 4402311 4385866 4376756 4323290 4292645
12797 4292645 4301029 4286358 4270490 4227802 4188955 4076524 3934287 3942634 4070190 4160208 3991272
12786 3991272 3955187 3990907 3964514 3916336 3910812 3865702 3884565 3864746 3851062 3884578 3875536 3888194
12774 3888194 3811816 3783585 3859511 3904015 3889949 3847958 3798878 3782787 3815708 3740735 3605057
12763 3605057 3627939 3736398 3711288 3651704 3625998 3657188 3757471 3682011 3664829 3701329 3717365
12752 3717365 3678192 3635233 3622102 3572221 3556056 3497138 3532920 3568945 3547817 3508036 3471668
12741 3471668 3419009 3330771 3291666 3337214 3348132 3338091 3310168 3340313 3424584 3480981 3433885
12730C433885j13617L188N6560o7538q8206j01742L4007l662l3353M2718O4894
12719C227134k8476m8613L1422j8538l8894M7253J2791o4995N857L1316o5133
12708C091124j4550o1256k4256n99O5493L9514N9014j4428o1862l8708k494Q74
12696C037866j6011k4590m5214J9051k3703m5821m6413l9143j0652j3707M6178
12685B837841j8544m4407K8357k2155j9561k408o5601o6493n4039M8696k7092
12674B594594q1001l8760n6552N4239Q6394N0032M7664k7193k6485r25j8560l9974
12662B543473j07142o598l3767L9421j5249l4873M5292j4306J6508p6922j88703
12651B167134N1816J70120J08668o7214j4014l4578o0917M3421J0540j03794l8219
$$ plain form
12730 3433885 3320268 3323456 3380016 3312478 3224272 3122530 3156537 3152875 3119522 3162240 3227134
12719 3227134 3198658 3150045 3181467 3162929 3124035 3171288 3184079 3119084 3124941 3156257 3091124
12708 3091124 3076574 3015318 2991062 2990463 3055956 3095470 3154484 3140056 3078194 3039486 3036992 3037866
12696 3037866 3021855 2997265 2952051 2971102 2947399 2901578 2855165 2816022 2805370 2791663 2837841
12685 2837841 2819297 2774890 2803247 2781092 2761531 2759123 2693522 2627029 2572990 2621686 2594594
12674 2594594 2513593 2474833 2418281 2472520 2558914 2608946 2656610 2629417 2602932 2602007 2583447 2543473
12662 2543473 2436331 2429733 2395966 2435387 2420138 2385265 2430557 2416251 2432759 2355837 2167134
12651 2167134 2218950 2389070 2497738 2430524 2416510 2381932 2321015 2364436 2374976 2271182 2232963
12640B232963J7186Q7808j7381o0011j9414j7814J4649l3426L2671K6316L0051
12629B293598m4215p6977m9083L9712O4210k8462K4690j8835j5894m6490p6223
12618B066031o2390l1827L083P947P3740P2660J1780l2002m6974k7385k331N6806
12606B089138J14893K921o4135j32912K2002M7950k0656l0408q6223n1055O239
12595A897754K6177l765J7341M9280j404m0241p014o2660m9453L5420K4003p5154
12583A810284l5764L8167N1917n7175p8153J2239R1936m7073j7580O4307n4144
12572A778961n0511J8583P5944q977J0924N8648p6444r7818k8532P1130N2964
12561A804872m9406l589o9416n4241K156O2331O7892M2489R408q20j5883j00860
$$ plain form
12640 2232963 2250149 2337957 2320576 2260565 2241151 2223337 2237986 2204560 2237231 2263547 2293598
12629 2293598 2249383 2172406 2123323 2163035 2227245 2198783 2223473 2204638 2188744 2142254 2066031
12618 2066031 2003641 1971814 1974897 1982844 2056584 2129244 2141024 2109022 2062048 2034663 2032332 2089138
12606 2089138 2204031 2206952 2142817 2009905 2031907 2079857 2059201 2028793 1942570 1891515 1897754
12595 1897754 1923931 1920166 1937507 1986787 1985383 1945142 1938128 1875468 1826015 1861435 1885438 1810284
12583 1810284 1774520 1812687 1864604 1807429 1729276 1741515 1833451 1786378 1768798 1833105 1778961
12572 1778961 1728450 1747033 1822977 1814000 1824924 1883572 1807128 1709310 1680778 1751908 1804872
12561 1804872 1755466 1751877 1682461 1628220 1630376 1692707 1760599 1803088 1812496 1811676 1795793 1694933
12549A694933l296j062l0733k1887k3075k6766Q4162N530j11774j5836n7771L2779
12537A525204M8900P7041p8112k8933M8443J29279N5039k0917j28558q1444M0803
12526A586745N488j10945L9455Q9l8815q5714o9910P4815R0664o0112M1061J8925
12514A491746p86K1196k6211m119K8378M0786M238q7330l4268N3190k0887J220
12502A467153L0218M5079N1729k7519o5867o9573M8589k1154o4563p4043K9716
12491A349765J26241P7237L4982k8165m1754j03332l7186j15563p2005R1325P5334
12480A356879n8681K5519K2716o4842J385k7327R7144J5860m0965j1062r2227
12469A224399j148J6760M8108J16586j5313p4921j6322o7241O0013L7577m6513
$$ plain form
12549 1694933 1691637 1690575 1659842 1637955 1614880 1588114 1672276 1677806 1566032 1550196 1492425 1525204
12537 1525204 1574104 1651145 1573033 1544100 1592543 1721822 1776861 1755944 1627386 1545942 1586745
12526 1586745 1592233 1481288 1520743 1520832 1482017 1396303 1326393 1401208 1491872 1431760 1472821 1491746
12514 1491746 1490960 1512156 1485945 1481826 1510204 1550990 1555228 1467898 1433630 1486820 1465933 1467153
12502 1467153 1497371 1542450 1594179 1566660 1500793 1431220 1479809 1458655 1394092 1320049 1349765
12491 1349765 1476006 1553243 1588225 1560060 1518306 1414974 1377788 1262225 1190220 1281545 1356879
12480 1356879 1298198 1323717 1346433 1281591 1282976 1255649 1352793 1368653 1327688 1316626 1224399
12469 1224399 1223251 1240011 1288119 1404705 1389392 1314471 1298149 1230908 1290921 1328498 1281985
12458A281985l0169Q0115Q5040k3100j7660K5465J4178J34104O8247q4912p9607
12447A453686p0498r9471o3188k1007O0502K2076J1990j4297r437m9658K8095
12436A248793Q0336n778J1558m3408l5345n7997j5652J38444O2580p7596j123
12425A304812p3058m1255o364J09499M8069M4595k3445j07870o3645K4952J5783
12414A232073o2134J1821N9363o6721j9344o8569l5341K1426K8784o4246l2786
12403A004326Q240J0548m142r0987O3619J35099m844o108L0779P9861O9040K7948
12391A323379j01338j30904m8648N6920P8818k6286j8481q0982j28709k7080j5641
12380H81048j8436p6028l7833L9920J06168j5485k7217J9378P708N1503k2017
$$ plain form
12458 1281985 1251816 1331931 1416971 1393871 1376211 1401676 1415854 1549958 1618205 1533293 1453686
12447 1453686 1383188 1283717 1220529 1199522 1260024 1282100 1294090 1279793 1270356 1220698 1248793
12436 1248793 1329129 1323351 1334909 1291501 1256156 1198159 1182507 1320951 1383531 1305935 1304812
12425 1304812 1231754 1190499 1184135 1293634 1341703 1386298 1362853 1254983 1191338 1216290 1232073
12414 1232073 1169939 1181760 1241123 1174402 1155058 1086489 1051148 1072574 1101358 1037112 1004326
12403 1004326 1012566 1023114 1018972 927985 991604 1126703 1121859 1115751 1146530 1226391 1295431 1323379
12391 1323379 1222041 1091137 1042489 1099409 1178227 1151941 1133460 1052478 923769 896689 881048
12380 881048 862612 786584 748751 788671 894839 879354 852137 871515 879223 930726 908709
12369I08709M4005L9790Q6177J6678n2237k2139j2042m0705j05588l7346K9905
12358H55207J05577O8677p099n8234q5773n1888N7625P2134O4546n5876l9072
12347I25824j0204k2638K2486m3928m1912L7255L0041M0250n4282P1769N378m1447
12335I18592j20797j9327P974k8358L261O2501J43349n0211p6963L623r1415j22731
12323F29498n8091K3010P5353J15389O0631l4292p6173M2071M5070M2100J1548
12312H76114j7526k2636j8168o472L359M2201J495P1983r355p216j03538j21109
12300F89132l6287M1732L3126j1372N4924k1054N172L2595J13499N827n7866m4805
12288H04623o352l2162J3979J9286j6727O739K5820j2481K8345j0093p0761K0988
$$ plain form
12369 908709 952714 992504 1078681 1095359 1043122 1020983 1008941 968236 862648 825302 855207
12358 855207 960784 1029461 1022362 964128 878355 826467 884092 956226 1020772 964896 925824
12347 925824 915620 892982 915468 871540 829628 866883 896924 937174 882892 954661 960039 918592
12335 918592 797795 778468 786442 758084 761345 823846 967195 916984 840021 843644 752229 629498
12323 629498 571407 594417 669770 785159 845790 811498 735325 777396 822466 864566 876114
12312 876114 858588 835952 817784 811312 814671 856872 858367 930350 920995 913779 810241 689132
12300 689132 652845 694577 727703 716331 771255 750201 755373 787968 901467 907294 849428 804623
12288 804623 798271 766109 780088 799374 782647 789386 815206 802725 831070 820977 750216 771204
12276G71204P4467M9448m4603p5058M619l5575l8760N527o1490N3985L6081j2092
12264G27753j7052k0550J8944o261p8462l3461L921N748J20544k839m1478O2590
12252G39397k7067n8016j2128J8566L8278n3856L004p132K712N3577P8238O264
12240G81837l6808q014k3540o409n5482k9507p256L7677J10862K830M625n7182
12228G13633m7552m5091o1802j8398J4381L6726n5721J540J0891p27M6235O7486
12216F61601L992P6903j9542m4057q1526o4947m4099L0565M3419L0804k3070m2001
12204E28042l1971k3003N9316J2695n9900p4167J3122p150N7022P8038K3199l9700
12192E35543l0218O3273N4689o4270l1402p1079J82310O9608p1122j6838K6490
$$ plain form
12276 771204 845671 895119 850516 775458 780077 744502 705742 711269 649779 703764 739845 727753
12264 727753 710701 690151 709095 702834 624372 590911 594832 600580 721124 718285 676807 739397
12252 739397 712330 654314 642186 660752 699030 645174 648178 641046 643758 697335 775573 781837
12240 781837 745029 737015 713475 707066 651584 622077 614821 652498 763360 766190 770815 713633
12228 713633 666081 620990 559188 540790 555171 591897 536176 537716 548607 547880 594115 661601
12216 661601 665593 742496 722954 678897 597371 532424 488325 518890 562309 593113 570043 528042
12204 528042 496071 473068 532384 545079 485179 411012 424134 416984 474006 552044 575243 535543
12192 535543 505325 568598 623287 559017 527615 456536 638846 708454 637332 620494 646984
12181F46984j6724j5220K3264l5385N005j7535q2215l2124j7447n3595J3060K2868
12169D40936m5001M8913M8985k2750O8122L8794J2402M871M554l6535L6560o4574
12157E35277o5062J7302O303M9235J28865J48n1748Q0664J3673L6989R774o2462
12145F98958k8139j3777m4969n7701k6486k8615K9707J9394Q268L7808P047M720
12133F06215J05201N8132k3557j4290J8960N2489m823N9243J15570J73626K00176
12122A346942J5069j09238j74217j79010r9620j26305q1982p8581J0461p249k5703
12111D90567k6111L9369K3527J0755k9704N5278r651L149n4396k2227r839L0665
12099E01382Q6280n98j17183k8009Q2941j5209j8254n8126j8880J32190P7408
$$ plain form
12181 646984 630260 615040 638304 602919 607924 590389 508174 476050 458603 405008 418068 440936
12169 440936 395935 444848 493833 471083 539205 577999 590401 595272 599826 563291 599851 535277
12157 535277 470215 487517 493820 543055 671920 672068 620320 700984 714657 751646 761420 698958
12145 698958 670819 657042 612073 554372 527886 499271 528978 548372 556640 594448 601495 606215
12133 606215 711416 769548 745991 731701 750661 803150 798327 857570 973140 1146766 1346942
12122 1346942 1362011 1252773 1078556 899546 799926 673621 591639 513058 523519 516270 490567
12111 490567 464456 503825 527352 538107 508403 563681 554030 557179 502783 480556 470717 501382
12099 501382 587662 587064 469881 441872 524813 509604 491350 433224 414344 546534 623942
12088F23942j11249p7786J0651J2798m9584n4777m9483j9147K3458N6973J27748
12077D93544K1900m6301k8867K3055k0318L8368n8538j0822J3196k4567q130j3580
12065C78940l0152L5523M3109M1324j3893l0255l7177k7405m0481Q6282M805q933
12053D01687Q866j9386k1761r500m4549R126O4513N8101n781j01780q11L409l5161
12040C06973L1080L5042O459L2329J06R008m940M0547k0508l5863r2524k5977
12028B81732K4266J05068P6063J2079k1118K5363m4531Q494O649N2384j2924j4144
12016D99381j9357l9635m0093n8894n1669Q3878J0652J3697R988p531L6775j36148
12004C01044j2501P1702M5189M1781n2363p794j03416q4627N4889N7436q734j1448
$$ plain form
12088 623942 512693 434907 445558 458356 408772 353995 304512 285365 308823 365796 493544
12077 493544 515444 469143 440276 463331 443013 481381 422843 412021 425217 400650 392520 378940
12065 378940 348788 384311 427420 468744 454851 424596 387419 360014 319533 405815 410620 401687
12053 401687 410553 391167 369406 359906 315357 324483 388996 447097 441316 339536 338725 342134 306973
12040 306973 338053 373095 379554 411883 411989 420997 416057 456604 436096 400233 307709 281732
12028 281732 305998 411066 487129 499208 478090 503453 458922 467416 474065 526449 513525 499381
12016 499381 480024 440389 400296 341402 289733 373611 384263 397960 407948 400417 437192 301044
12004 301044 288543 360245 405434 447215 394852 387058 283642 199015 253904 311340 302606 291158
11992B91158Q9989N6803J2243m5756Q606L4511l8142r0142m3007l4359m1989O5822
11980B65737P0833J4334m2640o3422K2018Q8774N2391k5509q875k2642m1539M6485
11968C55945m5042l8947Q601N9605N1113l8343k1775j32395j9194L1665N3231
11957B64464N7792K6819J498n3058p9669K6267P783r0999N3125j2018M4897j8991
11945B27910K1716m158J1234qj4986J5327n0168J4334N2112k5530o1677K9549
11933B15655L3437m6380R0666J44202p9678j35504j3233J364N7823M9702l6711
11922B81343P057N0962m684K9255N4517k5951j4754n7489n6463k9258M7606k5139
11910B57002J3766m2330J5752p0399j2393l6585M5600N9982P9221J8386K4745
$$ plain form
11992 291158 381147 437950 450193 404437 413043 447554 409412 319270 276263 241904 199915 265737
11980 265737 336570 350904 308264 244842 266860 355634 408025 382516 373641 350999 309460 355945
11968 355945 310903 271956 280557 340162 391275 352932 331157 198762 179568 211233 264464
11957 264464 322256 349075 350573 297515 217846 244113 251896 160897 214022 202004 246901 227910
11945 227910 249626 245468 256702 256694 241708 257035 206867 221201 273313 247783 186106 215655
11933 215655 249092 202712 293378 437580 357902 222398 209165 210529 268352 318054 281343
11922 281343 288400 339362 334678 363933 418450 392499 377745 320256 263793 234535 282141 257002
11910 257002 270768 228438 244190 173791 161398 124813 170413 230395 309616 328002 352747
11899C52747M183m1612j7791J0609Q9081l4697l5923o2787n1964Q852l3969k5125
11887A61604M8711L3616M3002J16638m4475j41629K9145O8369k981J866k1971
11876B91895K9073l5420l2867O0595Q252m1873J9874K5701K9427M2740P165m3177
11864C61385l7530K2767K9974J2087J7850p371j0865L711k8436K6896n4302j16409
11852B19757K1344O6406K8410n5681L0826j2017l1299j2023R72j5861l4602K3911
11840B30143o0660l5612J05999O843K625m9958o0554K6292M0305j2090j4657k5608
11828A53068j1563m8407K3594N865L8317R22L174J414M0357M4614K2728n2472
11816B21611k891N9456l9121o5853j4422P8302O9421M6664j0279p0238k8878j1303
$$ plain form
11899 352747 356930 315318 297527 308136 397217 362520 326597 263810 211846 220698 186729 161604
11887 161604 210315 243931 286933 403571 359096 217467 246612 314981 312000 313866 291895
11876 291895 320968 285548 252681 313276 321528 279655 299529 325230 354657 397397 404562 361385
11864 361385 323855 346622 376596 388683 406533 399162 388297 392008 363572 390468 336166 219757
11852 219757 241101 307507 335917 280236 311062 299045 267746 255723 256695 240834 206232 230143
11840 230143 169483 133871 239870 246713 249338 199380 138826 165118 205423 193333 178676 153068
11828 153068 141505 93098 116692 122557 160874 161796 164970 166384 206741 251355 274083 221611
11816 221611 218720 278176 239055 173202 158780 237082 306503 353167 342888 272650 243772 232469
11804B32469L96Q94P7401J5825M243M4506n2334n3005j02995K9656N3078O2005
11792C12139o0683k3404J02295L6994q5177q2719m7858l549K8032k2795K777J3639
11780A69691n731L0002O6300J5095O3435N1735r9128o7878K5577M1167k5646M3457
11768C08076J3628l7198n2948j8988o4151K9371m5148o6836O1372J01894n2127
11757A76945J3102M2525p548j0562J705P2986o8459L0107L9959l5186m996N5317
11745C05895m0214r5533M5211N449r419O2470P0361R932j2198j17175M5447K3190
11733B93416N932p0024m9679j7059Q9290J13389j2955q2702m8372K6393N4936
11722C02565o620j03o151J0935o5212o8129K451O1500P614l7736L433K8603n0310
$$ plain form
11804 232469 232865 233759 311160 326985 331228 375734 323400 270395 167400 197056 250134 312139
11792 312139 251456 228052 330347 367341 282164 199445 151587 148038 176070 153275 156052 169691
11780 169691 163960 193962 260262 275357 338792 390527 291399 223521 249098 290265 264619 308076
11768 308076 321704 284506 231558 212570 148419 177790 132642 65806 127178 229072 176945
11757 176945 190047 232572 225024 214462 216167 289153 220694 250801 290760 255574 250578 305895
11745 305895 265681 170148 215359 220808 211389 273859 344220 354152 341954 224779 270226 293416
11733 293416 299348 229324 179645 162586 251876 365265 352310 269608 221236 247629 302565
11722 302565 295945 295842 289691 300626 235414 167285 169736 231236 238850 201114 204547 233150 182840
11709A82840n6942P6849O8781N6895j7970j6811k4591j209L6175n6013J0987n4612
11697B04379m6387q0122L1352K760N1255P6245K4851o6916q485j5581O3818o1979
11685A75190j05692P5609O130P6235M6726j04104j23472M3402K2328L9566O6470
11674B18388J05054L4134k6937j5368m2272q1467m141Q712j02393N4501Q9205
11663B37416J4542m5336M452M8579J9463m3934L0704o144p1872m4132k4279l3416
11651H6043M2520J9308N7044o6857p4366q2070O942P6348L7992L0590K7384l2320
11639A28558l3523j7747K9284N9928J1454M5807J2564L7046q5422J2251M8142
11628B48342q9053l8651K3308M383L6745j01389m0835N6869K4807n4965Q9764
$$ plain form
11709 182840 125898 202747 271528 328423 310453 293642 269051 267842 304017 248004 258991 204379
11697 204379 157992 77870 109222 111982 163237 239482 264333 197417 188932 173351 237169 175190
11685 175190 69498 145107 151237 227472 274198 170094 46622 90024 112352 151918 218388
11674 218388 323442 357576 330639 315271 272999 191532 187391 196103 93710 148211 237416
11663 237416 251958 206622 211074 259653 279116 235182 265886 259742 187870 143738 119459 86043
11651 86043 128563 147871 204915 138058 63692 -18378 -11436 64912 102904 133494 160878 128558
11639 128558 95035 77288 106572 166500 177954 223761 236325 273371 187949 200200 248342
11628 248342 159289 120638 143946 148329 185074 83685 42850 99719 124526 69561 159325
11617A59325R4603m0357m1180Q6959J03371o4065j7432P2236k5104R313n5894
11606B81775n1476k3174p77N406m9257m5218J15564R7199k8509q8380P2627N6585
11594C42365r6298p1874l2460p6882n6087N6821O1893j2979l0673O4181P2221
11583B20228J9369o7259r8067m8699K401O9346L2212K9073J6174l3106J733l7528
11571A05877J0396J03519N358j7050O72m2834J6385m7070r673j858n7359K6545
11559I2908M0456n1638J7372M8089J1352L2450m1384o0839J4862K5074k03O4601
11547A93100k9719l4046m2350n8435P9325J05714P177o7249l119K3313L6470m89
11535B09692j2953n0811K3084L5736O570m8094o5755J6428J8869O7568m4535n1476
$$ plain form
11617 159325 253928 213571 172391 259350 362721 298656 281224 353460 328356 337669 281775
11606 281775 230299 207125 206348 211754 162497 117279 232843 330042 301533 213153 285780 342365
11594 342365 246067 174193 141733 64851 8764 65585 127478 114499 83826 148007 220228
11583 220228 239597 172338 74271 25572 27973 97319 129531 158604 174778 141672 143405 105877
11571 105877 116273 219792 225150 208100 208772 165938 182323 135253 125580 123722 66363 92908
11559 92908 133364 81726 99098 147187 158539 190989 149605 88766 103628 128702 128499 193100
11547 193100 163381 129335 86985 28550 107875 213589 220766 153517 150398 173711 210181 209692
11535 209692 196739 145928 169012 204748 211318 163224 97469 113897 132766 200334 155799 104323
11523A04323j0534O3318N9077p7047j00067o0028Q1520l207M2409L1002N0061
11512A80827o2249o0763k5956O6143P9559k534m732p4739p472R8833N8727k5951
11500B19693r0407o3729K6221O3335j1454o7404l0967K5200J4461n556K9983m02
11488A08974j8201j3692R7349N9602m8585p1796J20992J23818q8099o6991M8181
11477B51552M2864k9015l7698q6110o7456r690N8842N2274k8400n7646j223R1104
11465A79398J9522J6918o7834o9460m8240l6853M7152K9588K7633L5278M9165
11454A82267n8379l3922N9876l9256m7345M739J8850q436l8195L7959N4065N3776
11442A85999k4490J4422o181m3970k0159j3417M5465m2728j15216k2702r9125
$$ plain form
11523 104323 93789 157107 216184 139137 39070 -20958 60562 57355 99764 130766 180827
11512 180827 118578 57815 31859 98002 177561 175027 170295 95556 88084 186917 245644 219693
11500 219693 129286 65557 91778 155113 143659 76255 45288 70488 84949 79393 109376 108974
11488 108974 90773 77081 174430 234032 185447 113651 234643 358461 270362 203371 251552
11477 251552 294416 265401 227703 141593 74137 64447 123289 175563 147163 89517 88294 179398
11465 179398 198920 215838 148004 78544 30304 -6549 40603 70191 97824 133102 182267
11454 182267 123888 89966 149842 110586 63241 67980 86830 78394 40199 78158 132223 185999
11442 185999 161509 175931 169750 125780 105621 92204 137669 94941 -20275 -42977 -142102
11431a42102o5395J57572J32012N0012l371m6747J1119l9910j24198J62259O1472
11420A52723n1473o4652R1263n441K4317P63m9452M2325n3440K7041J5497R119
11408A38590L340q3493k908P3531k904n3891P4827r270j5192M4023M2077M1942
11396B50672k5867j3241J7247J4771j7875p939l2904k7485r0215j3090J24216
11385A78290J4238L924p146M9136j2093J1407N2989L340m3009n193o8719k1310
11373A55854J21012l150m5217j64335j05626L0518j5225j6768L035j3180K0866
11362c2216K3476M7052L9007O9818O2233k2404j40097N9865J3851J9900L9277
11351A79762m464m9543j8766o5249N2991K6639m185p77l8835Q9795k246o6134
$$ plain form
11431 -142102 -207497 -49925 82087 132099 128728 81981 93100 53190 -71008 91251 152723
11420 152723 101250 36598 127861 122420 146737 147500 98048 140373 86933 113974 129471 138590
11408 138590 141930 58437 55529 129060 126156 72265 147092 137822 122630 166653 208730 250672
11396 250672 224805 211564 228811 243582 225707 217768 184864 157379 67164 54074 178290
11385 178290 192528 196452 189306 238442 226349 237756 290745 294085 251076 245883 177164 155854
11373 155854 276866 273716 228499 64164 -41462 -10944 -26169 -42937 -39902 -53082 -32216
11362 -32216 -8740 38312 77319 147137 209370 186966 46869 106734 120585 140485 179762
11351 179762 175298 125755 106989 41740 94731 121370 117185 116408 77573 167368 165122 98988
11339I8988n5681q2755J5263O6883N4497K0390L3525P4573K8723r0171j04564
11328E9671J6405M6994L6580k7892j03902o8917J18898l5390j3364L3538R7467
11317A60088k4620p9470q449J9169Q4733K8687p8013o8943K1540N8278R7402O0334
11305B70736q141p1556q2735j6810O3074N9019P0721J7426j20109r6431M4831
11294A30025L5549o1155N7075P0277j4264l8600l0230j4947j1757o2367k1144
11283C8462J6033k1515j4890L0178K4769j6737k3299p468L0989n116J152J12942
11271A65500m1331n9612l5428l7624m2537J8249J14571j4716J733p9594M6925
11260C6136N4496k7891m4389R4924J20412n7454l5789o8734O5376N1571o3855
$$ plain form
11339 98988 43307 -39448 -24185 42698 97195 117585 151110 225683 254406 164235 59671
11328 59671 76076 123070 159650 131758 27856 -41061 77837 42447 29083 62621 160088
11317 160088 135468 55998 47549 66718 151451 180138 102125 33182 54722 113000 210402 270736
11305 270736 262595 191039 108304 91494 154568 213587 284308 301734 181625 85194 130025
11294 130025 165574 104419 161494 231771 217507 178907 148677 133730 121973 59606 38462
11283 38462 54495 32980 18090 48268 73037 56300 33001 25533 56522 51406 52558 165500
11271 165500 124169 64557 29129 -8495 -51032 -32783 81788 67072 68805 -10789 36136
11260 36136 90632 62741 18352 113276 233688 176234 140445 71711 137087 188658 124803
11249A24803j67792j5653N4059P6350k1215K4911K1351j9099l8435r3319K9087
11238b4952J7425N9434N8006N8051M8142k8564K5846j5309n7231j761k7765p0346
11226D0976J3773Q221p4126P677Q9355Q0838p4021j04960M682P5144K8569R558
11214A05686m9903j03383J9938P7724O8192p8872n396m2150m6812O4597P0553
11203H0174K9797j974o5207J9829p9517N5016L1518J7145j4684N1812j8795o4600
11191D0514K7831J1103M0966P9810L6897m5521j03529k2890L12J0431O3911l5408
11179A04427l1313L3636P0132n4146l9178n0890P0558P5107K1889k7209O136m0369
11167A38780n5716L9408N0501o2728l8179K2916J12968k6276j8454j069P5548
$$ plain form
11249 124803 -42989 -58642 -4583 71767 50552 75463 96814 77715 39280 -54039 -24952
11238 -24952 -7527 51907 109913 167964 216106 187542 213388 198079 140848 139087 111322 40976
11226 40976 54749 62970 -11156 -3479 85876 166714 92693 -12267 -7585 67559 96128 105686
11214 105686 55783 -47600 -27662 50062 118254 39382 33986 -8164 -54976 9621 80174
11203 80174 109971 107997 42790 62619 -16898 38118 69636 86781 72097 123909 105114 40514
11191 40514 68345 79448 120414 200224 237121 191600 88071 65181 65493 75924 139835 104427
11179 104427 73114 106750 176882 122736 83558 32668 103226 178333 200222 173013 179149 138780
11167 138780 83064 122472 172973 110245 72066 94982 207950 181674 163220 162151 237699
11156B37699j6478L6194M4175q3903m4362J0550j6868n4887J5398p8933m9960
11145a375K7825M0817M4217o0451p695M2744o9179J5179P0409M97k9794j0036
11133F3158P3310R360k6538j8951o518o7544k9507M2438m3632l0964O6543J07167
11121A38322j4882n9310l7148p7282Q570M1126R892q9273K2198O1313K0995O0581
11109H5102L5709n581n835m9347O6296L0815L5981R9698q7602l0027o8386n4318
11097E2505M5811R7452K5688k2355j4244o6162o7467J30032K7483p5466k8412
11086A04865o5747p1237J2825p23Q7367N2881J2504J09312O5461l4250k0867q6879
11074A65512r691K7003J0824J4784l8188M1070L9305M8675l7517j19671k2031
$$ plain form
11156 237699 221221 257415 301590 217687 173325 183875 167007 112120 127518 48585 -1375
11145 -1375 26450 67267 111484 51033 43338 86082 16903 32082 102491 102988 73194 63158
11133 63158 136468 145828 119290 100339 93821 26277 -3230 39208 -4424 -35388 31155 138322
11121 138322 123440 64130 26982 -50300 -41730 -604 9288 -79985 -57787 3526 24521 85102
11109 85102 120811 115230 109395 60048 126344 157159 193140 292838 205236 175209 106823 52505
11097 52505 98316 195768 221456 199101 184857 118695 51228 181260 208743 133277 104865
11086 104865 39118 -32119 -19294 -20017 67350 120231 132735 242047 307508 273258 252391 165512
11074 165512 155821 182824 193648 208432 170244 211314 250619 299294 261777 142106 120075
11063A20075K5770j8760k9249l2O6321n7009o5305L1320O2351k3216l5328L9842
11051A16780k2656n4518K1382J5661L7510o4546K1481J1371n664J14794k745q1363
11039A07487n2271l0165o0898J6966M6269k8184j7867N3482K1656k4605j9747
11028A2123L6580R7722P2252o7472q032p7628k0032l5695j8728n15K2146Q9854
11016A02575M4494L2993k9475j9643J9498m8871q208l7264J587l8092J7369P1042
11004A08005K7976k4766p5261k0927m3378o0914K907K0921M0782M3986K0522R542
10992D9395m0046J5279O3466j6371J9683k9601l1105o026M1808Q626k6941k4114
10980B4053L2405O7123j35787J9441L4151k5459l5958j2365O065l3112q9372l377
$$ plain form
11063 120075 145845 127085 97836 97804 164125 107116 41811 73131 135482 112266 76938 116780
11051 116780 94124 39606 60988 76649 114159 49613 71094 82465 76801 191595 188850 107487
11039 107487 55216 25051 -35847 -18881 27388 -796 -18663 34819 56475 31870 12123
11028 12123 48703 146425 218677 151205 143173 65545 45513 9818 -8910 -9425 12721 102575
11016 102575 147069 180062 150587 130944 150442 101571 93363 56099 57686 19594 36963 108005
11004 108005 135981 111215 35954 15027 -28351 -89265 -86358 -65437 -24655 19331 39853 49395
10992 49395 9349 24628 88094 71723 91406 61805 30700 24674 66482 75108 48167 24053
10980 24053 56458 123581 -12206 7235 41386 15927 -20031 -32396 -26331 -59443 -148815 -152192
10968a52192J33329O3420M131K3626o2862j2888K5493P6L2287M7636L6216K9653
10956A67925o2868n336M0780J1145P77q0165j9738J6825m392J5329M031M6807
10944A31120p7567m0568j2958N8416M7464l9407J04304j4057k8886j3707k6410
10933H7744j1462K9329m1287j2146k9516q1777k2710P938O42J07950R9655m507
10921A29853q5634p786M6500m3927q1792k4761L3032O1986p570O000m2258l6428
10909e2785j2373Q2305L0133m727j7382L0212l2570K5930k5313j272L7273p437
10897E1994Q188k9976q2742J6100J8127J3517m736J2996J8869m54K2995M367l1783
10884A7462l0724K0832P7948M6597j08635l8526J000N0344m1744L7282K6773O128
$$ plain form
10968 -152192 -18863 44557 48688 72314 9452 -3436 22057 22133 54420 102056 138272 167925
10956 167925 105057 99721 140501 151646 152423 72258 52520 69345 64953 80282 84313 131120
10944 131120 53553 12985 27 58443 105907 66500 170804 156747 127861 114154 87744
10933 87744 76282 105611 64324 52178 22662 -59115 -81825 -73887 -73245 34705 134360 129853
10921 129853 44219 36433 82933 39006 -42786 -67547 -34515 27471 19901 25901 -16357 -52785
10909 -52785 -65158 17147 47280 42553 25171 55383 22813 48743 23430 22158 59431 51994
10897 51994 60182 30206 -52536 -36436 -18309 -4792 -9528 3468 22337 21883 44878 49245 17462
10884 17462 -13262 7570 85518 132115 23480 -15046 -14046 36298 -5446 31836 58609 64737
10872F4737O5928l662m6488q5090P31L925j5310K6371P0397K8647K8136O463l9039
10859A05746p0984k277R3936J9708j798J4938O7846O9737m0344p6260p9092m4240
10847E6916n5792K500M6676N0448q62O6171Q789o4857n8318K1868l2297o204l4561
10834D77J6663n1418J27R7931P0176L906j2547M8562P8432L4609q0462j24685
10822H1771m7339M673l5118J6278M8481j8933j0795J2871K6328q260j748Q1242
10810A49451O1718J1580l810r6038j07058j3000O6702N658j06778J4736M1506
10799B4667J547m624J444K6529l2312L9937K6083o792j10521q3682M2665R831
10787f5228n798M4598K7020J3395k8521K1228j3087K9077M4433q227K1070R466
$$ plain form
10872 64737 130665 127003 80515 -4575 -3844 81 -15229 11142 81539 110186 138322 144785 105746
10859 105746 34762 32485 126421 146129 144331 159269 227115 296852 256508 180248 101156 56916
10847 56916 1124 3624 50300 100748 99886 166057 174846 109989 51671 73539 41242 35038 477
10834 477 17140 -34278 -34151 63780 133956 137862 125315 173877 252309 286918 206456 81771
10822 81771 34432 39105 3987 20265 68746 49813 39018 51889 78217 69957 68209 149451
10810 149451 211169 222749 218939 122901 15843 2843 69545 75203 -31575 -16839 24667
10799 24667 26214 21590 23034 49563 17251 57188 83271 76479 -34042 -117724 -75059 -65228
10787 -65228 -71026 -26428 592 13987 -14534 6694 -6393 22684 67117 58890 79960 89426
10775H9426O1822J12696K8574k2679n3520q2637j9262L6524N2j13003k7247r077
10763A669O2981O7822n6908p686n6816j6688Q6533k2488j8037K8067M6436k0081
10751I4804L1488m3635l168N974Q2876L1580N0964J2587k4611L4801l9635l6399
10739A97626m868n7794o3988n5067N010O8101M0457L8706r7630m3872j614K6095
10727E1162L5806J9014n1665q6915J9796N1909L5710L1125N0110j969j30409m4309
10715b0635r008O0906L2570P6134k1491o0750k5348K9160J7268l2040M5997J5098
10703A07861J9308o486o283K5371o6161o012p1348l5352m2199O2786O0854L8503
10691H0842K6697M4058l8929k8868o7961l319J6349K1192n2329J6143K0983k4290
$$ plain form
10775 89426 151248 263944 292518 269839 216319 133682 114420 150944 150996 37993 10746 1669
10763 1669 64650 132472 75564 67878 11062 -5626 80907 58419 40382 68449 114885 94804
10751 94804 126292 82657 79489 85463 168339 199919 250883 263470 238859 273660 234025 197626
10739 197626 192758 134964 70976 15909 20919 89020 129477 168183 70553 26681 25067 51162
10727 51162 86968 105982 54317 -32598 -12802 39107 74817 105942 156052 154083 23674 -20635
10715 -20635 -29643 31263 63833 139967 118476 57726 32378 61538 78806 46766 92763 107861
10703 107861 127169 120683 114400 139771 73610 67598 -3750 -39102 -81301 -18515 42339 80842
10691 80842 107539 151597 112668 83800 15839 12520 28869 50061 -2268 13875 34858 10568
10679A0568j5235k2602L2026O9973K7672o0703k8217L3020J10089p543r6856n4570
10667b378j898Q9483J19067M90o5263j6168k5468J5031J7375J645k2800L1106
10655A40222O854k2372m7281p092j6850m1940K9072k2552o9960l4285N4455J26329
10643I4600Q7585j07250p031O8105k8259m1177k8799Q190r567O2148L3295j2466
10631A19374J1405M4133k6403o6977j8709J4801K1654O52o8199K8927J1473r892
10619F2239q452N8183J06783l6449r0947m7367k5693L0774j2549j6931l8290M3806
10607B5107M9582K9028o811j7460K8992j0773K988m3364j2510Q6911O6689r4995
10595A03384j47029o1448N3833K8417r814n891M811N739r126M6402N8479k892
$$ plain form
10679 10568 -4667 -27269 4757 74730 102402 41699 13482 46502 156591 149048 52192 -2378
10667 -2378 -4276 85207 204274 204764 139501 123333 97865 112896 130271 131916 109116 140222
10655 140222 147076 124704 77423 70331 53481 11541 40613 18061 -51899 -86184 -31729 94600
10643 94600 182185 74935 67904 136009 107750 66573 37774 45964 36397 98545 131840 119374
10631 119374 130779 174912 148509 81532 62823 77624 99278 99930 31731 60658 72131 62239
10619 62239 53787 111970 218753 182304 91357 43990 18297 49071 36522 19591 -18699 25107
10607 25107 74689 103717 96906 79446 108438 97665 100653 57289 44779 131690 198379 103384
10595 103384 -43645 -105093 -51260 -22843 -32657 -38548 -33737 -27998 -37124 9278 67757 64865
10583F4865r6580j6136L644K8758N2357P8134n2950J0373n699M993M7107K3905
10571A42771L0640m5172r3777R768Q0627j7787m4703k0681K6186R545L7152L67
10559A14936L8378L1913k4008J6954p8220n1655m1837n398Q099J568K9413k4316
10547A5827K7995J3770K8702q2863m4749J1434o3737O003M6098J3313O2419K4428
10535E8640q030p0330k9443j4748N9510j7441n450j7857k176J34798M6984o6604
10523F7853N1773J08812L091o247o4804r5048j00103n4522q735m5679Q6248Q1498
10511B4137J2270r209p5583J0899L1442L3326J68415p1216J0918j2091J473l9231
10499H5550p4104l0261M681R1739N6542P245r9120m3530O8873L9034N3237k4270
$$ plain form
10583 64865 -31715 -47851 -44207 -15449 36908 115042 62092 72465 66766 71759 118866 142771
10571 142771 173411 128239 34462 44230 124857 107070 62367 41686 67872 77417 114569 114936
10559 114936 153314 185227 161219 178173 99953 48298 6461 1063 9162 10730 40143 15827
10547 15827 43822 57592 86294 3431 -41318 -29884 -93621 -87618 -41520 -28207 34212 58640
10535 58640 50610 -19720 -49163 -63911 -4401 -21842 -27292 -45149 -47325 87473 134457 67853
10523 67853 119626 228438 231529 225282 160478 65430 -34673 -89195 -97930 -143609 -57361 24137
10511 24137 36407 27198 -48385 -37486 -6044 27282 195697 124481 135399 123308 124781 85550
10499 85550 11446 -18815 -14134 77605 134147 141392 42272 -1258 67615 106649 159886 135616
10487A35616n2252n9645j510m7772j1523K9469J2681N7837o1029J5711M7722L9075
10475A04380k0356p360O6782P4969m3156N459j09197n8000N0550m0945l6356M1647
10463B8417k9567K5076K0529J8974J5845j17646m4855J9365J9629M7385Q8150
10452I1302j7238j15292L4376Q969p9690l8142M6085M7840l5465q8946p565J07135
10440d6631N7015N3889K7084r369M7405l7395j10193r7452P4196P5580L7662K3858
10428I5649M0313k6005r5957K8775P3866M5425j4383j0093L3286q982m1514j7754
10416A02626O3439k8893J7580o5352K1467m7484q4009N7212R521j04125l700k1712
10404h3430N1772J0468L2126N2022N877p260n2591j975J0958k6307L0873n413
$$ plain form
10487 135616 83364 23719 22209 -25563 -37086 -7617 5064 62901 1872 17583 65305 104380
10475 104380 84024 76664 143446 218415 175259 180718 71521 13521 64071 23126 -13230 28417
10463 28417 -1150 23926 44455 63429 79274 -38372 -83227 -63862 -44233 3152 91302
10452 91302 74064 -41228 -6852 2117 -77573 -115715 -69630 -21790 -57255 -146201 -153766 -46631
10440 -46631 10384 64273 91357 81988 129393 91998 -18195 -115647 -41451 34129 71791 95649
10428 95649 135962 109957 14000 42775 116641 162066 147683 137590 170876 161894 120380 102626
10416 102626 166065 137172 154752 89400 110867 63383 -20626 36586 46107 -58018 -61718 -83430
10404 -83430 -31658 -21190 10936 62958 68835 61575 8984 7009 17967 -8340 22533 17120
10392A7120p6920l4014K2472R7283N3861R328p8588j3415p664q4218N2384L4537
10380g834Q5308l4458j01512q699N3131j4127j6837J9284j477j4795Q5071P8788
10368A21843p4528r5932m2581K7048P7452k1954j132L397M8688M4417o392k3108
10356E7218L4828l3892n0039p5894n2019J08710K0037o0013j0274J8798o473J7596
10344c1417L9822j6975J5560N6148O4947j4514k3180k9382J0376J099Q870m3299
10332C8055k2785J9958o2254o674J43378M6005p1542k0969K5015m6924m4698m4266
10320d7701J8200O8835J021m2555P54J561l1594p114j2151P054N293M1185l9988
10307c7200k5545q67L5796o6711n3820K6426K7807L9608K6070J06684R7334P589
$$ plain form
10392 17120 -59800 -93814 -71342 25941 79802 89130 10542 -2873 -10537 -94755 -42371 -7834
10380 -7834 77474 43016 -58496 -67195 -14064 -28191 -45028 -25744 -27221 -42016 43055 121843
10368 121843 47315 -48617 -91198 -64150 13302 -8652 -9784 -6387 42301 86718 80326 57218
10356 57218 92046 58154 8115 -67779 -119798 -11088 8949 -51064 -61338 -42540 -49013 -31417
10344 -31417 8405 -8570 6990 63138 128085 113571 90391 61009 71385 72484 81354 38055
10332 38055 15270 35228 -27026 -33700 109678 155683 84141 63172 88187 41263 -3435 -47701
10320 -47701 -29501 39334 40355 -2200 -1446 115 -31479 -38593 -50744 -43690 -38397 2788 -37200
10307 -37200 -62745 -63612 -27816 -94527 -148347 -121921 -94114 -54506 -28436 78248 175582 183171
10295A83171l0807l1637o1191r2133j0888k982j3731l5367R589J10329r0920k6432
10283i2999R1316L9082N233J6308J8655l5063j22619M411J25494M9137M386m4542
10271E8799J6649L4328j5770k5510J2164p053O560l5938r6606K7659J50162j0443
10259A15001K8866k6499l0135K1596Q548k0651M8097M8003j8510K3151P466r342
10247A95591j2626p8617Q66K2311l1373o9280n6350L7925k8389l647M4823p449
10235A3785j05281k9690k295k1280M2815N0229P0878M3794N866m7362j03822O8784
10223a3579l1161m4118Q216j7290k66R8025J8163l9369K7573o6279k6043P107
10211g9021k3652n0596O7262N7234J6999RM509l050j0735r7735O4409P1536m588
$$ plain form
10295 183171 152364 120727 59536 -32597 -43485 -46467 -60198 -95565 -85976 24353 -66567 -92999
10283 -92999 -1683 37399 42632 58940 77595 42532 -80087 -75676 49818 98955 103341 58799
10271 58799 75448 109776 94006 68496 80660 73607 80167 44229 -52377 -24718 125444 115001
10259 115001 143867 117368 87233 108829 117377 96726 144823 192826 174316 197467 204933 195591
10247 195591 182965 104348 105214 127525 96152 26872 -29478 8447 -19942 -23589 21234 13785
10235 13785 -91496 -121186 -123481 -144761 -101946 -51717 19161 62955 68821 21459 -82363 -13579
10223 -13579 -44740 -88858 -80642 -97932 -98198 -173 17990 -21379 6194 -60085 -86128 -79021
10211 -79021 -102673 -153269 -86007 -28773 -11774 -11765 -7256 -10306 -21041 -118776 -54367 17169 12581
10198A2581J12319j7373l1959P094M8027O530k665K3481J7489j7549p5766l6975
10186D5234K683N0916l9273m1526j0482o4982j0936P7645J7120l7729j9530O118
10174b4742k4506R0755Q6637j08466J3102J21089J0764q4741L2994j9229j7271
10163G6386m5231j5255O6395M135o4995l3707m7088J7782M3018r626o2914o9004
10151a40104o2312J9988M1002n259K9999K9724M1160R5030q503n5919k3278K3557
10139a4915n839r305j5536m3376L4886M3460Q8436r00l7482o2136J7484Q5154
10127G9931m3010q590K3266K900K706j4995J8549k1799O9113L0040m7401n5578
10115C5132k8094Q155K81J423m6788M1337l2981k9980J8976J08370O743p8111
$$ plain form
10198 12581 124900 107527 75568 82662 130689 137219 134554 158035 175524 157975 82209 45234
10186 45234 47917 98833 59560 18034 7552 -57430 -68366 9279 26399 -11330 -30860 -24742
10174 -24742 -49248 41507 128144 19678 32780 153869 164633 79892 112886 93657 76386
10163 76386 31155 15900 82295 86430 21435 -12272 -59360 -41578 1440 -8186 -71100 -140104
10151 -140104 -202416 -182428 -141426 -146685 -116686 -86962 -45802 49228 40725 -15194 -38472 -14915
10139 -14915 -20754 -30059 -45595 -88971 -54085 -10625 77811 76911 39429 -22707 -5223 79931
10127 79931 36921 28331 51597 54497 57203 42208 60757 38958 108071 138111 90710 35132
10115 35132 7038 15193 15474 16897 -29891 11446 -21535 -51515 -32539 75831 82574 4463
10103D463J6119N779J0599M0675K5433J8465p4646r2257l2948M7758k3539q7379
10091a41478M5124n166l5623m44N4552j3581k2457K2164K2228K5346R1050M7181
10079H8896j3934O167N9677p7313j00958K5783k2055k3466o312K4392K8092R8455
10067H7424l2957k7819O0120P779q5522p4388K049K9160k9391j3560L2343M6000
10055A238j5682j1563O2238k6898k3743K4448j1736m1965k8899o139Q1147P9398
10043H1844k4193r6734k9002N8840J4162K9472R1809l5915m2998j6305O7435K9352
10031A27767L2936R9715p194p4406r8124p9226K0166P0137Q1168k742n2241l6521
10019H1435p9208n8571Q6927N6166K7196J2007o2347J2001j6213O111O869K7679
$$ plain form
10103 4463 20582 26361 36960 77635 103068 121533 46887 -45370 -78318 -30560 -54099 -141478
10091 -141478 -96354 -101520 -137143 -137587 -83035 -96616 -119073 -96909 -74681 -49335 41715 88896
10079 88896 74962 81129 140806 63493 -37465 -11682 -33737 -57203 -63515 -39123 -11031 87424
10067 87424 54467 26648 86768 94547 9025 -65363 -63314 -34154 -63545 -77105 -44762 1238
10055 1238 -14444 -26007 36231 9333 -14410 10038 -1698 -43663 -72562 -78701 2446 81844
10043 81844 57651 -39083 -68085 -9245 4917 34389 126198 90283 47285 30980 98415 127767
10031 127767 160703 260418 253224 178818 80694 1468 21634 91771 172939 170197 117956 81435
10019 81435 2227 -56344 30583 86749 113945 125952 63605 75606 59393 65504 72373 100052
10007A00052O6813L8922k1993r3758J0717q362j0899p6947k1032o0332j2089L2064
9995e6844L9508O2274q1385M5924P2564L2346j01914m3371o3307k0534l9708j7255
9983a71702R719K7658R6477M3960j1213p5011k2786N4242m2712j3206M9439m1496
9971i6631N2918n250M8376P8084M5098r1500n025O6259j2031j0458l8095l4028
9959b283N8284J1021k5575N164J3766j8250K4435p9420j2190K0977o093m511R759
9946d916n0220N7873K4567O919j5965k7186L3446J24667L8681o3815L8640L1474
9934A94165k5326k7602M1744N3278L8324j6392q6480p5732j8054J7155N8075r885
9922A43270l7894p4861p518j2176j935M6887J4737m0465l6689R939k5159M7208
$$ plain form
10007 100052 166865 205787 183794 90036 100753 92391 81492 4545 -16487 -76819 -88908 -56844
9995 -56844 -17336 44938 -36447 9477 82041 114387 12473 -30898 -94205 -114739 -154447 -171702
9983 -171702 -161983 -134325 -37848 6112 -5101 -80112 -102898 -48656 -91368 -104574 -55135 -96631
9971 -96631 -43713 -48963 -587 77497 122595 31095 26070 92329 80298 69840 31745 -2283
9959 -2283 56001 67022 41447 46611 60377 42127 66562 -12858 -25048 -4071 -10164 -14675 -4916
9946 -4916 -55136 2737 27304 34223 18258 -8928 24518 149185 187866 124051 162691 194165
9934 194165 168839 141237 182981 236259 274583 258191 171711 95979 77925 95080 153155 143270
9922 143270 105376 30515 22997 10821 8886 55773 70510 30045 -6644 3295 -21864 25344
9910B5344R8279J7691o3102j9105l6782p7470k9391O191P9040M961m5450m7695
9898h7489n6654Q709l8191P237J25035P8692l6429J8010L0102N6117l0375N280
9886H0044L7736J5837l3923o439o6674r72o4867P1770N9845k3454n5642j06484
9874i3223J4459J9467o2288L6567R2230J30615M9107r5003m5460O8315n2071p97
9862F1918m9358k8144r9678L3025Q2152Q0584o4436q9705k9029O1483J7772L2216
9850H800M1393J3927j1695j80O6244p3934m7711m9806o5467j9764P7296M6430
9838a4467l9294P8017N9205M407K6072n0812j1782m981O065L1404o546n388j3637
9825E8263o5935O7052L1836L1326K0301J5812l9936l7420j2659m8972j67357j5096
$$ plain form
9910 25344 123623 141314 78212 59107 22325 -55145 -84536 -78345 695 5656 -39794 -87489
9898 -87489 -144143 -135434 -173625 -166388 -41353 37339 910 18920 49022 105139 74764 80044
9886 80044 117780 133617 99694 93255 26581 25609 -39258 32512 92357 68903 13261 -93223
9874 -93223 -78764 -59297 -121585 -85018 7212 137827 186934 91931 46471 114786 62715 61918
9862 61918 12560 -15584 -115262 -82237 -85 80499 16063 -73642 -102671 -41188 -23416 8800
9850 8800 50193 64120 52425 52245 118489 44555 -3156 -52962 -118429 -138193 -60897 -14467
9838 -14467 -53761 24256 83461 87868 113940 63128 51346 46365 52430 83834 77288 71900 58263
9825 58263 -7672 59380 91216 122542 142843 158655 118719 81299 68640 19668 -147689 -162785
9813a62785J15107L1189J8731m4746O116O048j8144k9077n5495p1534M0350J33606
9801c0634J05218K2598J8514k4715q4544k8474N1734j5108p1706O3888M6985j15445
9789f1689O4055L2908m1651q082j26439n4780P7332J06960L0482J3781o3679L9886
9777I084N9408O2068n4698j32670m9381j8582K4733N9557P8724R6098M3302p2260
9765A05383l5144J23126n2983j07176m4184j6221q9349M047Q6924P6552J7487
9754F8462r0796n1077J1908j564j9163k6511O768j5729O9348J10890k576p1144
9742a1184m7023L6844J8300m322o283J3751o687l224k948l8297K8639P6004k9549
9729B4021K151N1108m6417q4159J6206K8646j8600J5996r8288n6778N9300L1493
$$ plain form
9813 -162785 -47678 -16489 2242 -42504 -36388 -30340 -48484 -77561 -133056 -204590 -164240 -30634
9801 -30634 74584 97182 115696 90981 6437 -22037 29697 14589 -57117 6771 53756 -61689
9789 -61689 2366 35274 -6377 -14459 -140898 -195678 -118346 -11386 19096 32877 -30802 9084
9777 9084 68492 130560 75862 -56808 -106189 -124771 -100038 -40481 38243 134341 177643 105383
9765 105383 70239 193365 140382 33206 -10978 -27199 -116548 -112501 -25577 50975 68462
9754 68462 -22334 -73411 -61503 -63067 -82230 -108741 -101973 -117702 -48354 62536 59960 -11184
9742 -11184 -58207 -21363 -3063 -7385 -13668 83 -6604 -9828 -12776 -51073 -22434 53570 24021
9729 24021 26172 77280 30863 -53296 -37090 -8444 -27044 -11048 -109336 -166114 -106814 -75321
9717g5321n447q6243J07889O9082K326Q0015o245p8586j2247p0425L0245J1744
9705c3213m0727p21R52O9913N7345R934l5159k5543p913L0631o3897k6817J143
9692f4072K7196r557k4174o5897k6659k4555O0725P8648N6710L0864P1725J4553
9680A25507m9127o1233M9655l3372k5233M4155k8594R0175M282m3256L735k6981
9668D9713J4605L4913P724O8714q1073k630k1035o4980r619l1189o947m5844O8663
9655a8985R4045k0463j2155L2134n8076l1262r2530l7743P0939P1617M9691j3733
9643C3479K0127O9814o2390m4325q103N9563j6271n4453n7158n2139Q9792J54142
9631A32078P8129n0875j21479l4995j5004K1485J8110J7154k9597M4719q8820
$$ plain form
9717 -75321 -80768 -167011 -59122 9960 12286 92301 86056 7470 -4777 -75202 -44957 -33213
9705 -33213 -73940 -74661 -73709 -3796 53549 63483 28324 2781 -5132 25499 -38398 -65215 -64072
9692 -64072 -36876 -46433 -70607 -136504 -163163 -187718 -126993 -48345 8365 39229 110954 125507
9680 125507 76380 15147 64802 31430 6197 50352 21758 111933 116215 72959 76694 49713
9668 49713 64318 99231 106955 175669 94596 91966 70931 5951 -3668 -34857 -41804 -87648 -18985
9655 -18985 75060 54597 42442 74576 16500 -14762 -107292 -145035 -74096 -2479 47212 33479
9643 33479 53606 123420 61030 16705 8602 68165 51894 -2559 -59717 -111856 -22064 132078
9631 132078 210207 159332 37853 2858 -12146 9339 27449 44603 15006 59725 -29095
9620b9095n7857J40065P2386k7626j4305j2940j04956j8198q100J4613Q8258k3905
9608A8340J856L4998j1627j3940M750k9257K4528O2550K4344j1738n3374J8383
9596F9813m4433j43116l9251J07387K6666N8507R5944M3868q1959p8334p8547
9585f3455P4721k0026l924L7127k3389O9872l235j14683J0119J7394l3717M9822
9573c374J5504J4869j407l8258M2439K0866q333m1247k7601k7599R927O4541k4780
9560d453k8964O7243J9192J6915m0288p8881m2065M5139k9586o0815L6032O4568
9548c5963K9939j1023J760o0896L8332L1933J1228K6022o0954l7637L5535K4874
9536f850K9419L3867L4489j04808j7134q856M4870M6401o1428o594N2866K4355
$$ plain form
9620 -29095 -86952 53113 125499 97873 83568 70628 -34328 -52526 -60626 -46013 42245 18340
9608 18340 20196 55194 43567 29627 34377 5120 29648 92198 116542 104804 51430 69813
9596 69813 25380 -117736 -156987 -49600 -22934 35573 131517 175385 93426 15092 -63455
9585 -63455 11266 -8760 -12684 24443 1054 70926 67691 -46992 -36873 -19479 -53196 -3374
9573 -3374 12130 26999 25592 -12666 29773 50639 42306 1059 -26542 -54141 -44214 20327 -4453
9560 -4453 -33417 33826 53018 69933 29645 -49236 -91301 -46162 -75748 -136563 -100531 -35963
9548 -35963 -6024 -17047 -15287 -76183 -37851 -5918 5310 31332 -29622 -67259 -31724 -6850
9536 -6850 22569 56436 90925 -13883 -31017 -39873 4997 51398 -10030 -16624 36242 60597
9524F0597l8158M7919J22866j8164r1803k2712n9904o6039J10053L1480k7136
9513D8999K7848L8250p186m1593l2573K9186n9582k3236O7911J9172j1621l9025
9501A6550M2609L8532m0628n1103o3418o426O951O8997J7083O1460J40613l9724
9489A91496j00043j42242k7246o305k1618j1376O513Q453M6143J3993l7221R334
9477g0119P0963L6312L5006m296k6425j0654j3276n8453O6640P9067n6004m7616
9465A145k3003j0868O8489L9487l1489K177l0688k7139k6384Q904j6160J3759
9453c1770M0208o4165m5787K7874R7207J1744k320Q7990r2194q4707M049K4672
9441b7199k1033k1157M166N5865P2268j35610L058P5662L5838O2277j5050k6209
$$ plain form
9524 60597 22439 70358 193224 175060 83257 60545 641 -65398 44655 76135 48999
9513 48999 76847 115097 107911 66318 33745 62931 3349 -19887 48024 67196 55575 16550
9501 16550 59159 97691 57063 5960 -57458 -63884 -56933 12064 29147 90607 231220 191496
9489 191496 91453 -50789 -78035 -84340 -105958 -117334 -110821 -102368 -56225 -42232 -79453 -70119
9477 -70119 844 37156 72162 67866 41441 30787 17511 -40942 25698 104765 48761 1145
9465 1145 -21858 -32726 35763 75250 43761 45938 15250 -11889 -38273 -29369 -45529 -31770
9453 -31770 8438 -55727 -101514 -73640 23567 35311 32991 120981 28787 -55920 -51871 -27199
9441 -27199 -48232 -69389 -65223 -9358 62910 -72700 -69642 6020 41858 104135 89085 62876
9429F2876p3970N6110M778o3553K1955j1053j00944o6140K3264L0424R9245M4583
9417B7575m9921K1045o238N4438m7220n2040j6535l8147J6582J33682N5519o1947
9405C6793r6899M2835J1868M0728N4845r2484k1030M5348l4088n6621O531J9059
9393d3115n6034l0081m8361n0302k6036P4091N9798J2195j5176R6932O4313J4361
9381E2585J4675J7665j5800J906l0306J1996r8732m7824M8729k0142o0936n7605
9369a83789k5656l0806o546R1968O4483P3462N18N9789j001r3882K3208J1429
9357a6823P7431N4576L0128o6889N215L6878k5360o9580r5546J1166K2174m612
9345d1242J8326j3033j7666n3413n6147P290J6669p113N6608O8403n856O142J1726
$$ plain form
9429 62876 -11094 45016 49794 -13759 8196 -2857 -103801 -169941 -146677 -116253 -17008 27575
9417 27575 -22346 -1301 -7539 46899 -321 -52361 -68896 -107043 -90461 43221 98740 36793
9405 36793 -60106 -17271 -5403 35325 90170 -2314 -23344 22004 -12084 -68705 -62174 -43115
9393 -43115 -99149 -129230 -177591 -227893 -253929 -179838 -120040 -107845 -123021 -26089 38224 52585
9381 52585 67260 84925 69125 71031 40725 52721 -46011 -93835 -45106 -65248 -126184 -183789
9369 -183789 -209445 -240251 -246797 -154829 -90346 -16884 -16366 43423 42422 -51460 -28252 -16823
9357 -16823 60608 115184 145312 78423 83638 120516 95156 25576 -69970 -58804 -36630 -41242
9345 -41242 -22916 -35949 -53615 -107028 -163175 -155885 -139216 -146329 -89721 -21318 -27174 -21032 -9306
9332i306P2362l7567q7941K4992l5491J6044Q39K3188J743n398n4983O2958J38597
9319A10037m148o786M1883o816q6905p2927o912j7824K2054P28m5604k2524J17934
9306B2190k5879O8967N6083M5612l2024l6219k7883k4420k4884l5529O1736k7975
9294A9775n7751O5074k5478p7563l1869O2455K9324M6123O2958R6083j25379j11121
9282d7369o2173J7615r761K8646P8901M3948N5573j8911j36019l3150J6050M120
9270f2530R7495P2818j7505o0103r9595o3516R614O8672n4606j05185N7481J07247
9258d9713P9597N345n8690j62866l1148M9932Q1696k1735j137P3193L3880N5978
9246E4332J07720l2487j09520j14925k9985J8742J33057J2968l5400o930r6312
$$ plain form
9332 -9306 63056 25489 -62452 -37460 -72951 -56907 -56068 -32880 -31137 -36535 -91518 -28560 110037
9319 110037 105889 99103 140986 134170 47265 -25662 -32574 -50398 -28344 -27616 -73220 -95744 22190
9306 22190 -3689 65278 121361 166973 134949 98730 70847 46427 21543 -13986 47750 19775
9294 19775 -37976 27098 1620 -75943 -107812 -45357 -16033 30090 93048 189131 63752 -47369
9282 -47369 -109542 -91927 -101688 -73042 5859 49807 105380 86469 -49550 -82700 -66650 -62530
9270 -62530 34965 107783 90278 30175 -69420 -132936 -123322 -54650 -109256 -214441 -156960 -49713
9258 -49713 29884 35229 -23461 -186327 -217475 -167543 -85847 -107582 -108719 -35526 -1646 54332
9246 54332 162052 129565 20045 -94880 -124865 -106123 26934 39902 4502 -2428 -98740
9235i8740K2334P9344n112J0153N7981K5637p9114p5356p0257N677L1150N3737
9223d2566L6370l8272m2528j601P267J906J8715k286l0913K4159J00249J7228
9211D7728k3018q098o5485p1211Q5946J07659J0567j0563j1365j22839p7719L3673
9199a04725O2909o2223q8363k4114L6559M5164l0403k0356J5938J3393Q9154J23302
9187E6235P9969N906m392j3882p0370k5172K0926j777K6610k4161L6256o129m7647
9174C2372q7023N14j6162j3484P137M5761K4503r838n6184n200J5367k3576L1225
9161e4588M4328q81N9408j6494M9789J5608n7156O9836m4709m9791j7153l2371
9149c4174N3010J2378M8276k8423j23120m9301N4604P0506R6904m4949j9767l7113
$$ plain form
9235 -98740 -76406 2938 -2174 7979 65960 91597 12483 -62873 -133130 -127453 -96303 -42566
9223 -42566 -6196 -44468 -86996 -88597 -81330 -79424 -60709 -62995 -93908 -69749 30500 47728
9211 47728 24710 16612 -48873 -120084 -34138 73521 84088 73525 62160 -60679 -138398 -104725
9199 -104725 -41816 -104039 -192402 -216516 -179957 -134793 -165196 -185552 -169614 -156221 -67067 56235
9187 56235 136204 142110 137718 123836 53466 28294 49220 47443 74053 49892 86148 80019 32372
9174 32372 -54651 -54137 -70299 -83783 -76646 -30885 -6382 -16220 -72404 -77604 -62237 -85813 -54588
9161 -54588 -10260 -11141 48267 31773 81562 97170 40014 109850 65141 15350 -1803 -34174
9149 -34174 18836 31214 79490 51067 -72053 -121354 -66750 3756 100660 55711 35944 -1169
9137a169j9063l1656n814o89L3001J4174l6790l6581k650N8177j1715p2663L4100
9124g9338O598j7228K7460N6363m6745r879N4152P5795m8486k7363l8443K0291
9112b6823L0055l1567n8376M5264L6518K07k8634R394n1250k9123J15704J4397
9100B5766q7810m1609m0230M302O1267L6078l7599j43246k9798R3891J19172r9697
9088a39513k2241M1799P1705O014j5288l639K2751L4722j285R1816M1609j2185
9076A16265o9477o9307k0460j6648q576K1051L7638J9051o0886k8307k5168P8747
9064b6077K6014l5324l4751j8040j0448m8766l5247O6091L3758Q799L4263P8276
9052C8548J2168M6164K3333p8557p3741j5560k2504N0465J181j1019m2426m2244
$$ plain form
9137 -1169 -20232 -51888 -57702 -58391 -25390 -11216 -48006 -84587 -87237 -29060 -40775 -113438 -79338
9124 -79338 -72740 -89968 -62508 -6145 -52890 -62769 -8617 67178 18692 -8671 -47114 -26823
9112 -26823 3232 -28335 -86711 -41447 -4929 -4722 -33356 -23962 -75212 -104335 11369 25766
9100 25766 -62044 -103653 -143883 -139581 -78314 -42236 -79835 -223081 -252879 -158988 -39816 -139513
9088 -139513 -161754 -119955 -48250 -42236 -57524 -61163 -38412 -3690 -4975 86841 128450 116265
9076 116265 46788 -22519 -42979 -59627 -68203 -47152 -9514 9537 -51349 -79656 -104824 -26077
9064 -26077 -63 -35387 -70138 -88178 -98626 -147392 -182639 -116548 -82790 -73991 -39728 38548
9052 38548 50716 96880 120213 41656 -32085 -47645 -70149 -19684 -18503 -29522 -71948 -114192
9040a14192K5561j8984n908O0161L8403N265P704L870k765k8499O582k9225Q5026
9027C2999p5103o1790j5243N2245n929j1543l8049j2499J09562k0245k8046Q172
9015f5469N967R4933M7553l0102J8045k121N3715p4598j46868P1280K159k8298
9003e3804m7679k1622P9677L8550k4708k4530j4031l1704N6099K9785L1301j0958
8991F376m8738l117J2961p2668n3490L5557N8906L5024K8497L0760N3417K7405
8979A10890k3562J5127l6320M4403O777m6090k2113J1999o2486l0030K1197J9223
8967I015k0241l3217J0740q7071j7754O2492L643N8808L0758n4130P8714J49939
8955A91696n5649j18289J4213l4276J8244J9498N1560j3010m5097l7092k7043
$$ plain form
9040 -114192 -88631 -107615 -113523 -53362 -14959 -9694 -1990 1880 -885 -29384 -22802 -52027 32999
9027 32999 -42104 -103894 -119137 -66892 -72821 -84364 -122413 -134912 -25350 -45595 -73641 -65469
9015 -65469 -59502 35431 82984 52882 70927 68806 122521 47923 -98945 -27665 -25506 -53804
9003 -53804 -101483 -123105 -43428 -4878 -29586 -54116 -68147 -99851 -43752 -13967 17334 6376
8991 6376 -42362 -45479 -32518 -105186 -158676 -123119 -64213 -29189 -692 30068 83485 110890
8979 110890 87328 102455 66135 110538 117315 71225 49112 61111 -1375 -31405 -10208 9015
8967 9015 -11226 -44443 -33703 -120774 -138528 -76036 -72393 -13585 17173 -36957 41757 191696
8955 191696 136047 17758 31971 -2305 15939 35437 86997 73987 28890 -8202 -35245
8944c5245o3479n7934M612M8194O294j2276m821l9098L0231J0391j9679J2364
8932a20446k8284M3732O3369Q03M2879M5634L8217m0066L7856M4593n351m3610
8920G9326l1758j4657r168l1249j16799N933J04547M0259P6342R6730j2078n2003
8908A35425l5841k9252k3669m0355m2565N0743J1699k4108P430j1436j4108K7676
8896A1639m8640K7111p261m1359l7428R5J6937M9795j1900l20O3597L9208p7900
8883a6426q5060L6875K8267l6774n7948n2894N4358L4776n542L512J5570p4800
8871a56086L7497N4287J4552M5919m4752n95l4904N5676J3249k7661j1160j7548
8859g1526l6195o8466J3821M1898m9241J8319j9421l7776L3789J33132k1942o5881
$$ plain form
8944 -35245 -98724 -156658 -152046 -103852 -97558 -109834 -114655 -153753 -123522 -113131 -132810 -120446
8932 -120446 -148730 -104998 -41629 -40826 2053 47687 85904 45838 83694 128287 122936 79326
8920 79326 47568 32911 23743 -7506 -124305 -118372 -13825 26434 102776 199506 187428 135425
8908 135425 99584 70332 46663 6308 -36257 14486 26185 2077 9507 -1929 -16037 11639
8896 11639 -37001 -9890 -17151 -58510 -95938 -95843 -78906 -29111 -41011 -41331 22266 61474 -16426
8883 -16426 -101486 -64611 -36344 -73118 -131066 -183960 -129602 -94826 -100368 -96856 -81286 -156086
8871 -156086 -118589 -64302 -49750 -3831 -48583 -49178 -84082 -28406 -15157 -42818 -53978 -71526
8859 -71526 -107721 -176187 -162366 -120468 -169709 -151390 -170811 -208587 -174798 -41666 -63608 -129489
8847a29489K9842M2237J7130j9822O6683L0069o95J3360N8794j2765p6394m7709
8835b8759l5772k7266M8522P9452J6979J3842p8274m709n4014k8342l9338p038
8823a44717P367K1776P9757j2117j9841K788J4531o056o954O2574J4780m6M6656
8810F0498p2142n2861P1066l1229o2526j0836P7068l4542l2469q0331l016L2125
8798a39195L7037R475l6712L4491J14143M4530j252L180N27R617j8179j03970
8786d6308k0857l1372r9085J4502K5513L5510Q1592M1438k0565K2249p314o9913
8774g4610K4955L6492p4061j35631n4084M7508J3763P4525J08804Q506n6555m7252
8762a27640O031l385M0935R9508m1351r3500j05331j3803l420L0407N1583M4259
$$ plain form
8847 -129489 -99647 -57410 -40280 -60102 6581 36650 35955 49315 108109 95344 18950 -28759
8835 -28759 -64531 -91797 -43275 36177 53156 66998 -11276 -15985 -69999 -98341 -137679 -144717
8823 -144717 -137350 -115574 -35817 -47934 -67775 -64987 -50456 -56512 -63466 -892 13888 13842 60498
8810 60498 -11644 -64505 6561 -24668 -87194 -98030 -20962 -55504 -87973 -168304 -171320 -139195
8798 -139195 -102158 -92683 -129395 -94904 19239 63769 62517 65697 66224 75841 57662 -46308
8786 -46308 -67165 -98537 -197622 -183120 -157607 -122097 -40505 933 -19632 2617 -4697 -74610
8774 -74610 -49655 -13163 -87224 -222855 -276939 -229431 -215668 -141143 -32339 -23833 -80388 -127640
8762 -127640 -121609 -124994 -84059 15449 -25902 -119402 -224733 -238536 -241956 -211549 -159966 -115707
8750a15707q620q073J10718R0732k9612n859m7652l5470j5527k7834n581J9638
8738g8847N8975J158j03924M1386J06415l3167l0576j3447n2430j6150j00277
8727b20884J9822K980R3907J4124n672L7489m4541M1444J37953m5261m6829J4246
8715a222n0521m0208N8600M1406j0141J833m2421n1072k1821N2409J6723M3244
8703c191O3727M8667J12043l8308r2234m6034o8263J0513l9145J1818k6348Q449
8691e8306K1192N4990J9310L8797J1345l7330p0102p2117O6682L7826n9799K993
8679d4519L3016l6664m6570K04018O8542k08336j31869N7085R3005O8870m835
8668E1743R461k456K4476j2490L5236P373K0112K0212r952r4580P797o4098K0028
$$ plain form
8750 -115707 -124327 -132400 -21682 69050 39438 33579 -14073 -49543 -65070 -92904 -98485 -78847
8738 -78847 -19872 -18714 -122638 -81252 25163 -8004 -38580 -52027 -104457 -120607 -220884
8727 -220884 -201062 -198082 -104175 -90051 -95723 -58234 -102775 -61331 76622 31361 -15468 -1222
8715 -1222 -51743 -91951 -33351 8055 -2086 -253 -42674 -93746 -115567 -63158 -46435 -3191
8703 -3191 60536 109203 221246 182938 90704 44670 -23593 -13080 -52225 -40407 -66755 -58306
8691 -58306 -37114 17876 37186 75983 87328 49998 -20104 -92221 -25539 12287 -47512 -44519
8679 -44519 -11503 -48167 -94737 109281 177823 -30513 -162382 -105297 -12292 56578 51743
8668 51743 61204 58748 83224 70734 105970 113343 133455 153667 143715 49135 56932 -7166 12862
8655A2862j062L7481j364m1015J8850P641L8696L9365l7412n7067K806L5150R1168
8642A46099n715p7577J8008m5012L8088m8180r628P2l3353l7373o1702R0692J09609
8629H4028l1178k1689l5760K1397P3852K9393p0015r5192n1169L8238K9753J7349
8617a0993j7389l7765L4160J2909R9545M779k3430Q0807k058n894m3772L686J12860
8604B07445R8912q1238j9274K7436o581k6185j5975m1139l0662L3150J01770l9218
8592B08441R160K6492J6191P168o3634N499Q2115P6316k2731j1533j9745m9402
8580B64337m7910O8735k0610j11348k5853J52069J0250j30396j45417m8546K0596
8569a4093n404N1485j9991n1983M989J26167K8181m8980q1749M3554N1722N6841
$$ plain form
8655 12862 11800 49281 47917 6902 25752 33393 72089 111454 74042 16975 19781 54931 146099
8642 146099 140384 62807 80815 35803 73891 25711 16083 16155 -17198 -54571 -116273 -25581 84028
8629 84028 52850 31161 -4599 16798 90650 120043 50028 -45164 -96333 -58095 -28342 -10993
8617 -10993 -28382 -66147 -31987 -19078 80467 85246 61816 142623 140565 134671 90899 94585 207445
8604 207445 306357 225119 205845 233281 226700 200515 184540 143401 112739 145889 247659 208441
8592 208441 217601 244093 260284 267452 203818 209317 291432 367748 345017 333484 313739 264337
8580 264337 216427 285162 264552 153204 127351 279420 289670 159274 13857 -34689 -14093
8569 -14093 -19497 31988 11997 -39986 -34997 91170 119351 70371 -11378 32176 83898 140739
8557A40739o0218o8683J7175K5862l8059n4788P8258J1329k2226L8193k2229k435
8545D2918K8830L9239K536n5213n2082l9364m3320j455K465K4244R6174O0845
8533A05817n2411m6233n2228j9409L8362J06161P166k0719L4820q4511j49412
8522a32597l0304J18318N3064l006k4840K1625K7830J8882J2731O2416N063n3433
8510G5749q3887r538N2030o0893L9657K2793o5583n7340m9040k6008R7925Q7296
8498B3161M7193O7434j07851J620O5214o1961m6025k845m2931j8460k1320j6527
8486a13298J31032J03610j9996n7865p7872j6345k2206l1804m3959M5673K7020
$$ plain form
8557 140739 80521 11838 29013 54875 16816 -37972 40286 51615 29389 67582 45353 42918
8545 42918 71748 110987 113523 58310 6228 -33136 -76456 -77911 -75446 -51202 44972 105817
8533 105817 53406 7173 -45055 -64464 -26102 80059 87225 66506 101326 16815 -132597
8522 -132597 -162901 -44583 8481 5475 -19365 2260 30090 48972 61703 124119 129182 75749
8510 75749 -8138 -17676 34354 -26539 13118 35911 -29672 -87012 -136052 -162060 -64135 23161
8498 23161 70354 137788 29937 31557 96771 34810 -11215 -14060 -56991 -75451 -96771 -113298
8486 -113298 17734 121344 101348 43483 -34389 -50734 -72940 -104744 -148703 -103030 -76010
$$ [...]
##END NTUPLES=NMR SPECTRUM
##END=
