##TITLE=Analysis number 311984
Compound Code cc 33524
Book Reference 378/151/4
Project Code adrs
Chemist Name benw
##JCAMPDX= 6.0         $$ Bruker NMR JCAMP-DX V2.0
##DATA TYPE= NMR SPECTRUM
##DATA CLASS= NTUPLES
##ORIGIN= Bruker BioSpin GmbH
##OWNER= NMR
$$ XWIN-NMR		Version 3.5
$$ Thu Jul 21 10:07:56 2005 GMT Daylight Time (UT+1h)  MAYBRIDGE\NMR@NMR_250MHZ
##.OBSERVE FREQUENCY= 250.131544655141
##.OBSERVE NUCLEUS= ^1H
##.ACQUISITION MODE= SIMULTANEOUS (DQD)
##.ACQUISITION SCHEME= undefined
##.AVERAGES= 16
##.DIGITISER RES= 18
##SPECTROMETER/DATA SYSTEM= dpx250
##.PULSE SEQUENCE= zg30
##.SOLVENT NAME= CDCl3
##.SHIFT REFERENCE= (INTERNAL, CDCl3, 0, 16.522)
##AUDIT TRAIL= $$ (NUMBER, WHEN, WHO, WHERE, WHAT)
$$ ##TITLE= Audit trail, XWIN-NMR		Version 3.5
$$ ##JCAMPDX= 5.01
$$ ##ORIGIN= Bruker BioSpin GmbH
$$ ##OWNER= NMR
$$ C:\u/data/dgb/nmr/ADRS/6240/pdata/1/auditp.txt
$$ ##AUDIT TRAIL=  $$ (NUMBER, WHEN, WHO, WHERE, WHAT)
(   1,<2005-07-21 10:07:36.41 +100>,<MAYBRIDGE\NMR>,<NMR_250MHZ>,
      <created by zg, POWCHK disabled, PULCHK disabled
       configuration hash MD5:
       62 19 C7 07 E1 42 D1 B7 37 6C 3D D0 77 39 F9 E6
       data hash MD5: 64K
       7C BD 66 E3 A8 C4 EB 2A 32 4A 3B 5C F4 5A 7C 2F>)
(   2,<2005-07-21 10:07:47.64 +100>,<MAYBRIDGE\NMR>,<NMR_250MHZ>,
      <Start of raw data processing
       ef LB = 0.3 FT_mod = 6 PKNL = 1 SI = 32K 
       data hash MD5: 32K
       2C BF 0A 9B 2E 66 74 FD 75 89 C4 0C 82 F5 E4 93>)
(   3,<2005-07-21 10:07:49.36 +100>,<MAYBRIDGE\NMR>,<NMR_250MHZ>,
      <apk 
       data hash MD5: 32K
       56 A1 64 64 AF 0B 39 22 10 D2 D8 B7 6E 48 CA AA>)
(   4,<2005-07-21 10:07:50.05 +100>,<MAYBRIDGE\NMR>,<NMR_250MHZ>,
      <abs ABSG = 5 
       data hash MD5: 32K
       C6 FF 22 2E 92 6C AA E1 49 C2 10 94 F9 68 40 FC>)
$$ ##END=
$$ 
$$ hash MD5
$$ 0A E7 5C 46 2D 62 93 C4 15 20 B6 F2 EF 19 97 85
##$RELAX= 
##$RELAX= 
##$RELAX= 
##$RELAX= 
##$RELAX= 
##$RELAX= 
##$RELAX= 
$$ Bruker specific parameters
$$ --------------------------
##$DU= <C:\u>
##$EXPNO= 6240
##$NAME= <ADRS>
##$PROCNO= 1
##$TYPE= <nmr>
##$USER= <dgb>
##$AMP= (0..31)
100 100 100 100 100 100 100 100 100 100 100 100 100 100 100 100 100 100 
100 100 100 100 100 100 100 100 100 100 100 100 100 100 
##$AQSEQ= 0
##$AQ_mod= 3
##$AUNM= <au_zg>
##$AUTOPOS= <6 >
##$BF1= 250.13
##$BF2= 250.13
##$BF3= 250.13
##$BF4= 250.13
##$BF5= 500.13
##$BF6= 500.13
##$BF7= 500.13
##$BF8= 500.13
##$BYTORDA= 1
##$CFDGTYP= 0
##$CFRGTYP= 5
##$CHEMSTR= <none>
##$CNST= (0..31)
1 1 145 1 1 1 1 1 1 1 1 1 1 1 1 1 1 1 1 1 1 1 1 1 1 1 1 1 1 1 1 1 
##$CPDPRG= <>
##$CPDPRG1= <>
##$CPDPRG2= <>
##$CPDPRG3= <>
##$CPDPRG4= <mlev>
##$CPDPRG5= <mlev>
##$CPDPRG6= <mlev>
##$CPDPRG7= <mlev>
##$CPDPRG8= <mlev>
##$CPDPRGB= <>
##$CPDPRGT= <>
##$D= (0..31)
0 1 0 0 0 0 0 0 0 0.06 0 0 0 0 0 0 0.0002 0 0 0 0 0 0 0 0 0 0 0 0 0 0 
0 
##$DATE= 1121936855
##$DBL= (0..7)
120 120 120 120 120 120 120 120 
##$DBP= (0..7)
150 150 150 150 150 150 150 150 
##$DBP07= 0
##$DBPNAM0= <>
##$DBPNAM1= <>
$$ [...]
##$SUBNAM7= <"">
##$SUBNAM8= <"">
##$SUBNAM9= <"">
##$SW= 20.6930455092707
##$SWIBOX= (0..15)
0 0 3 0 0 0 0 0 0 0 0 0 0 0 0 0 
##$SW_h= 5175.983436853
##$TD= 65536
##$TD0= 1
##$TE= 295.16
##$TE2= 300
##$TE3= 300
##$TEG= 300
##$TL= (0..7)
0 120 120 120 120 120 120 120 
##$TP= (0..7)
150 150 150 150 150 150 150 150 
##$TP07= 0
##$TPNAME0= <>
##$TPNAME1= <>
##$TPNAME2= <>
##$TPNAME3= <>
##$TPNAME4= <>
##$TPNAME5= <>
##$TPNAME6= <>
##$TPNAME7= <>
##$TPOAL= (0..7)
0.5 0.5 0.5 0.5 0.5 0.5 0.5 0.5 
##$TPOFFS= (0..7)
0 0 0 0 0 0 0 0 
##$TUNHIN= 0
##$TUNHOUT= 0
##$TUNXOUT= 0
##$USERA1= <user>
##$USERA2= <user>
##$USERA3= <user>
##$USERA4= <user>
##$USERA5= <user>
##$V9= 5
##$VALIST= <valist>
##$VCLIST= <CCCCCCCCCCCCCCC>
##$VD= 0
##$VDLIST= <DDDDDDDDDDDDDDD>
##$VPLIST= <PPPPPPPPPPPPPPP>
##$VTLIST= <TTTTTTTTTTTTTTT>
##$WBST= 1024
##$WBSW= 4
##$XGAIN= (0..3)
0 0 0 0 
##$XL= 0
##$YL= 0
##$YMAX_a= 318072
##$YMIN_a= -269567
##$ZGOPTNS= <>
##$ZL1= 120
##$ZL2= 120
##$ZL3= 120
##$ZL4= 120
##$ABSF1= 16.522
##$ABSF2= -4.171173
##$ABSG= 5
##$ABSL= 3
##$ALPHA= 0
##$AQORDER= 0
##$ASSFAC= 0
##$ASSFACI= 0
##$ASSFACX= 0
##$ASSWID= 0
##$AUNMP= <proc_1d>
##$AZFE= 0.1
##$AZFW= 0.1
##$BCFW= 0
##$BC_mod= 0
##$BYTORDP= 0
##$COROFFS= 0
##$CY= 12.5
##$DATMOD= 1
##$DC= 0
##$DFILT= <>
##$DTYPP= 0
##$F1P= 14.0000005364418
##$F2P= -0.99999901652339
##$FCOR= 0.5
##$FTSIZE= 32768
##$FT_mod= 6
##$GAMMA= 0
##$GB= 0
##$INTBC= 1
##$INTSCL= 1
##$ISEN= 128
##$LB= 0.3
##$LEV0= 0
##$LPBIN= 0
##$MAXI= 10000
##$MC2= 0
##$MEAN= 0
##$ME_mod= 0
##$MI= 0
##$NCOEF= 0
##$NC_proc= -4
##$NLEV= 6
##$NOISF1= 0
##$NOISF2= 0
##$NSP= 0
##$NTH_PI= 0
##$NZP= 0
##$OFFSET= 16.522
##$PC= 1
##$PHC0= -76.74939
##$PHC1= 11.09402
##$PH_mod= 1
##$PKNL= yes
##$PPARMOD= 0
##$PSCAL= 4
##$PSIGN= 0
##$REVERSE= no
##$SF= 250.13
##$SI= 32768
##$SIGF1= 0
##$SIGF2= 0
##$SINO= 400
##$SIOLD= 32768
##$SREGLST= <1H.CDCl3>
##$SSB= 0
##$STSI= 32768
##$STSR= 0
##$SW_p= 5175.98343685301
##$SYMM= 0
##$S_DEV= 0
##$TDeff= 65536
##$TDoff= 0
##$TI= <Analysis number 999999
Compound Code 99
Book Reference 9
Project Code 9>
##$TILT= no
##$TM1= 0
##$TM2= 0
##$TOPLEV= 0
##$USERP1= <user>
##$USERP2= <user>
##$USERP3= <user>
##$USERP4= <user>
##$USERP5= <user>
##$WDW= 1
##$XDIM= 32768
##$YMAX_p= 525979273
##$YMIN_p= -469737
$$ End of Bruker specific parameters
$$ ---------------------------------
##NTUPLES= NMR SPECTRUM
##VAR_NAME=  FREQUENCY,     SPECTRUM/REAL,   SPECTRUM/IMAG
##SYMBOL=    X,             R,               I
##VAR_TYPE=  INDEPENDENT,   DEPENDENT,       DEPENDENT
##VAR_FORM=  AFFN,          ASDF,            ASDF
##VAR_DIM=   32768,         32768,           32768
##UNITS=     HZ,            ARBITRARY UNITS, ARBITRARY UNITS
##FACTOR=    0.157963299565203, 1,           1
##FIRST=     4132.6476996994, 0,             0
##LAST=      -1043.33573715361, 0,           0
##MIN=       -1043.33573715361, -469737,     0
##MAX=       4132.6476996994, 525979273,     0
$$ Real data points
##PAGE= N=1
##DATA TABLE= (X++(R..R)), XYDATA
$$ [...]
19466D10191l8650J17577J38419R9596O2394N7046j87382j33617P1299m0550n9450
$$ 410191 371541 489118 627537 727133 789527 846573 659191 525574 596873 556323 496873
19455D96873N6341j7827j16225J05039J80362N4885q2k8245k9975K5041P4388
$$ 496873 553214 535387 419162 524201 704563 759448 759366 731121 701146 726187 800575
19444H00575m421o2813j19239j50213k9400J12971P1511j6727o8440L3296N6751
$$ 800575 796154 733341 614102 463889 434489 547460 618971 602244 533804 567100 623851
19433F23851m9735J6636P7242L3996P420P51l3174P2877n4315j32057p914J92238
$$ 623851 574116 590752 667994 701990 709410 710161 676987 749864 695549 563492 555578 747816
19421G47816k3893Q5654K4754n8313k2818J8510m367N1435l8973O1549j7597j14247
$$ 747816 723923 809577 834331 776018 753200 771710 767343 818778 779805 841354 823757 709510
19409G09510m4794K7571J52389P8228j04545N723o7127L8970R1402P4678J03723
$$ 709510 664716 692287 844676 922904 818359 824082 756955 795925 887327 962005 1065728
19398A065728Q8759o3902r5171J39727J81581P1486Q2299J46583Q7400O7210Q8954
$$ 1065728 1154487 1090585 995414 1135141 1316722 1388208 1470507 1617090 1704490 1771700 1860654
19387A860654J86582o1743j57039k95083k62894n8040q735J24181K00316Q1473
$$ 1860654 2047236 1985493 1828454 1533371 1270477 1212437 1203702 1327883 1528199 1609672
19377A609672m2506l8264P1841R039q0669R0062J67079P8876M9076m4413O0470
$$ 1609672 1567166 1528902 1600743 1609782 1529113 1619175 1786254 1865130 1914206 1869793 1930263
19366A930263K32569L02911L38026J87402K47104K82810K81336L71038K61664
$$ 1930263 2162832 2465743 2803769 2991171 3238275 3521085 3802421 4173459 4435123
19357D435123L75231L28863L52906N21954N46744P31694Q63929Q98653J073709
$$ 4435123 4810354 5139217 5492123 6014077 6560821 7292515 8156444 9055097 10128806
19348A0128806J323593J576510K107925K919558M291610O624602J1214858J8679575
$$ 10128806 11452399 13028909 15136834 18056392 22348002 28972604 40187462 58867037
19340E8867037K3561780J9960100J7638348J8120138J2220421Q714j0298222j5451129
$$ 58867037 82428817 102388917 120027265 138147403 150367824 150376538 140078316 124627187
19332A24627187j8021021j5851786p805757J839225J1178731J8370625J6554465
$$ 124627187 106606166 90754380 82948623 84787848 95966579 114337204 130891669
19325A30891669J3578426Q935310n116651j8129107k3769003k5646432k3827471
$$ 130891669 144470095 153405405 148288754 130159647 106390644 80744212 56916741
19318E6916741j8217201j1850240p195428m505030k999011k058198j510989j024813
$$ 56916741 38699540 26849300 19653872 15148842 12149831 10091633 8580644 7555831
19310G555831q55150q27181p74899o53156o03916l80117l57441l06901o1638j02200
$$ 7555831 6700681 5873500 5098601 4445445 3841529 3461412 3103971 2797070 2735432 2633232
19300B633232j74275k17218j80627k11726k03810k96932k05292k57251j55668
$$ 2633232 2458957 2241739 2061112 1849386 1645576 1348644 1143352 886101 730433
19291G30433M6794k0135K4993o4796m6989p1652O1612O4698J45140n0647p6246
$$ 730433 777227 757092 782085 717289 670300 598648 660260 724958 870098 819451 743205
19280G43205M4147l9263n7569q7455o9025N9092j3832O8081L6037j92344J03258
$$ 743205 787352 748089 690520 603065 534040 593132 579300 647381 683418 491074 594332
19269E94332K8515q7725p4441p8537Q1860m4180r4343j11570O429k4947K4227
$$ 594332 622847 535122 460681 382144 464004 419824 325481 213911 220340 195393 219620
19258B19620K2713k3960R1950R2778O7036j7781p141o2923r43n3676j35802k5245
$$ 219620 242333 218373 310323 403101 470137 452356 445215 382292 381349 327673 191871 166626
19246A66626J70255O4275K0404Q9015O0934K7553R1733L7338N9835j6187J42921
$$ 166626 336881 401156 421560 510575 571509 599062 690795 728133 787968 771781 914702
19235I14702J86559K73946L25020L45021K95171K85059J10297m8867k53961l28758
$$ 914702 1101261 1375207 1700227 2045248 2340419 2625478 2735775 2686908 2432947 2104189
19225B104189k88634j06169K4478J75221J85956J70792K07931J61176n0197l52203
$$ 2104189 1815555 1709386 1733864 1909085 2095041 2265833 2473764 2634940 2584743 2232540
19215B232540k52933j18604k44690l34370l10408k17150j6145J5840M5294k9948
$$ 2232540 1979607 1861003 1616313 1281943 971535 754385 738240 754080 799374 769426
19205G69426n2958p4185l9088p2595r0804O3224R0332J710j24699j18482K4566
$$ 769426 716468 642283 603195 530600 439796 503020 593352 595062 470363 351881 376447
19194C76447L5290O7734m5973m0230N4908K6329n1202m7123N5514P4320L7092
$$ 376447 411737 479471 433498 393268 448176 474505 423303 376180 431694 506014 543106
19183E43106N355N974L2939J020m1297l629Q8862j6252N2734K23335K72271L15357
$$ 543106 548461 554435 587374 588394 547097 543468 632330 616078 668812 892147 1164418 1479775
19171A479775M35195K68104J97216J15963j06376j55561k61714m13511j90088
$$ 1479775 1914970 2183074 2380290 2496253 2389877 2234316 1972602 1559091 1369003
19162A369003J951Q0452L25780L74541K11548P5515R1723j87251k63174k51528
$$ 1369003 1370954 1451406 1777186 2151727 2363275 2438790 2530513 2343262 2080088 1828560
19152A828560k38073l24119l21649k08702m4990o3635P079n8539k8241o8830K4165
$$ 1828560 1590487 1266368 944719 736017 691027 627392 634471 575932 547691 478861 503026
19141E03026n3173J2615O7365O4657K1165o2372J04021O7817j09843j8843J33383
$$ 503026 449853 462468 529833 594490 615655 553283 657304 725121 615278 596435 729818
19130G29818J0819j7741l572j12506K189J89J0784K0103j990J08977O6291n4559
$$ 729818 740637 722896 719324 606818 609007 609196 619980 640083 638093 747070 813361 758802
19118G58802j25109r0140n4168L6411K06349L7333Q2472k9104j6793k2228r4550
$$ 758802 633693 543553 489385 525796 732145 769478 851950 822846 806053 783825 689275
19107F89275l3427P755m4479j3871K4679K16186L3114q6467P475j0965J5830J2725
$$ 689275 655848 663603 619124 605253 629932 846118 879232 792765 800240 789275 805105 817830
19095H17830J7146J15788J16697P2671K43855L3026J08228J20587J27982J16632
$$ 817830 834976 950764 1067461 1140132 1383987 1417013 1525241 1645828 1773810 1890442
19085A890442J01367l9413j57375j09398m25j67978j05356r6511j5009J26210
$$ 1890442 1991809 1952396 1795021 1685623 1685198 1517220 1411864 1315353 1300344 1426554
19075A426554L02759J57813l491J7175J3738j26577n5033o4153P895j0348p8035
$$ 1426554 1729313 1887126 1883635 1900810 1914548 1787971 1732938 1668785 1676680 1666332 1588297
19064A588297J00667K08019K12297P0610M9694l5441m2292l05552l06033k12403
$$ 1588297 1688964 1896983 2109280 2179890 2229584 2194143 2151851 1846299 1540266 1327863
19054A327863j63249L4363O2028J2948j23985N9814J34762p194J6914m0247k6878
$$ 1327863 1164614 1198977 1261005 1273953 1149968 1209782 1344544 1337350 1354264 1314017 1287139
19043A287139q9779j27838l4353J80879j09331j28962n2558m0286m1335J84820
$$ 1287139 1197360 1069522 1035169 1216048 1106717 977755 925197 884911 843576 1028396
19033A028396R6279J0990m5966o8744n4646p5619m0377k8402r152K855P6903M2023
$$ 1028396 1124675 1135665 1089699 1020955 966309 890690 850313 821911 812759 815614 892517 934540
19021I34540J3527j87855o5679J32074J5594o6830m5034L276P2465p3145o9952
$$ 934540 948067 760212 694533 826607 842201 775371 730337 733613 806078 732933 662981
19010F62981j06617L9457J76801J22064J0864j42879P4053J21713N2485J17344
$$ 662981 556364 595821 772622 894686 905550 762671 836724 958437 1010922 1128266
19000A128266O6690m3502J1403j45176J73N037Q1800J86398N7127J26188P4579
$$ 1128266 1194956 1151454 1162857 1017681 1017854 1022891 1104691 1291089 1348216 1474404 1548983
18989A548983p4206J4579m4832k52226j87880O2320M3849N6582J16328O3053Q0468
$$ 1548983 1474777 1489356 1444524 1192298 1004418 1066738 1110587 1167169 1283497 1346550 1427018
18978A427018n4723J0853p1531j93972j16897l9284K2306R5108j5234q1596r4398
$$ 1427018 1372295 1383148 1311617 1117645 1000748 961464 983770 1078878 1063644 982048 887650
18967H87650N668l3996P0271N2440J13806J33272k3429j57776p6840Q2049J01827
$$ 887650 893318 859322 929593 982033 1095839 1229111 1205682 1047906 971066 1053115 1154942
18956A154942M627q4323m2059m7762k6870P9987R9335j17260n2438j5668J04157
$$ 1154942 1159569 1075246 1033187 985425 958555 1038542 1137877 1020617 968179 952511 1056668
18945A056668J09799Q7808O7227p62O44k8955n7553p118k3755o528M2250Q9684
$$ 1056668 1166467 1254275 1321502 1320740 1321384 1292429 1234876 1227758 1204003 1197475 1239725 1329409
18933A329409k6652j12235K2133P1049l3335r5970o3903j21154L9359J94849J29360
$$ 1329409 1302757 1190522 1212655 1283704 1250369 1154399 1090496 969342 1008701 1203550 1332910
18922A332910J16978N9670j0626Q6565p0923K2709N6833J4293J3841j9446O7941
$$ 1332910 1449888 1509558 1498932 1585497 1514574 1537283 1594116 1608409 1622250 1602804 1670745
18911A670745J74800K51652K14500K96748K18248K64121K50618L56139J89225
$$ 1670745 1845545 2097197 2311697 2608445 2826693 3090814 3341432 3697571 3886796
18902C886796M6251P7902K4331p4433k5726j50696m6590N5967P5179J30145K01536
$$ 3886796 3933047 4010949 4035280 3960847 3935121 3784425 3737835 3793802 3868981 3999126 4200662
18891D200662L35754L44112J39268L01935N59718O98630P04732Q41618J005782
$$ 4200662 4536416 4880528 5019796 5321731 5881449 6580079 7284811 8126429 9132211
18882I132211J262541J315565J774506K636873L929036O450746J1508982J8242119
$$ 9132211 10394752 11710317 13484823 16121696 20050732 26501478 38010460 56252579
18874E6252579K1241732J6415574J3397367J3530342P203345p791555j5309356
$$ 56252579 77494311 93909885 107307252 120837594 128040939 120249384 104940028
18867A04940028j8676826k1517747j9685454j4233128r022487n529555l487777
$$ 104940028 86263202 64745455 45060001 30826873 21804386 16274831 12787054
18860A2787054k468242j831499j118834p87135o63097l01703j13522K4745K40891
$$ 12787054 10318812 8487313 7368479 6581344 5918247 5616544 5503022 5527767 5768658
18851E768658K79030L37991J37049M9257M4945j04043k92982l91823l92100k30006
$$ 5768658 6047688 6385679 6522728 6571985 6616930 6512887 6219905 5828082 5435982 5205976
18841E205976j21911J48154L95460M61598L95113K06638J02690J29673N03302
$$ 5205976 5084065 5232219 5627679 6089277 6484390 6691028 6793718 6923391 7426693
18832G426693Q09282Q24389R45302J377453J630483J869983K270357L096953M710792
$$ 7426693 8235975 9060364 10005666 11383119 13013602 14883585 17153942 20250895 24961687
18823B4961687P608796J2498734J9858048K8050216K9029757K1529461K0018244
$$ 24961687 32570483 45069217 64927265 92977481 122007238 143536699 163554943
18816A63554943J2613545r386006k2447589k6519376k9338602k6912679j9813005
$$ 163554943 176168488 166782482 144334893 117815517 88476915 61564236 41751231
18809D1751231j2509030p643006m782840l253940k485505j807320j481942j212423
$$ 41751231 29242201 21599195 16816355 13562415 11076910 9269590 7787648 6575225
18801F575225q13805m28550k03337j16631L4173p3840l1662j78169l47494l85944
$$ 6575225 5761420 5332870 5129533 5012902 5047075 4973235 4941573 4763404 4415910 4029966
18791D029966k94062l04207m59554l53257m7972r7513r1226n3920O5952q405j94709
$$ 4029966 3735904 3431697 2972143 2618886 2570914 2473401 2382175 2328255 2394207 2385802 2191093
18780B191093j24081o7990p0340j02046q4612r1578j29647k13314m1568J01154
$$ 2191093 2067012 1999022 1928682 1826636 1742024 1650446 1520799 1307485 1265917 1367071
18770A367071M3995J75775K74499L15039K33057J54421p8057l50270k64998j65312
$$ 1367071 1411066 1586841 1861340 2176379 2409436 2563857 2485800 2135530 1870532 1705220
18760A705220n5625l0254j15248k17386k28597j52847J41275R7858k0637Q42Q8958
$$ 1705220 1649595 1619341 1504093 1286707 1058110 905263 1046538 1144396 1123759 1124601 1213559
18749A213559M9809r763p4583J20849j910J43352J2065k5476L6912q2055K8652
$$ 1213559 1263368 1253605 1179022 1299871 1297961 1441313 1453378 1427902 1464814 1382759 1411411
18738A411411p5107j3238L0465K5587k4069q7193J9424O5007j08794m8145K0630
$$ 1411411 1336304 1323066 1353531 1379118 1355049 1267856 1287280 1352287 1243493 1195348 1215978
18727A215978P8458o6229m9760j14219m7065M1275J0874R161J2941K3769J05535
$$ 1215978 1294436 1228207 1178447 1064228 1017163 1058438 1069312 1078473 1091414 1115183 1220718
18716A220718r3136p9672P8000R3635j14417l3173O0852q127O9680j9384j38824
$$ 1220718 1127582 1047910 1125910 1219545 1105128 1071955 1132807 1124680 1194360 1174976 1036152
18705A036152K8501k0589M4154J26820N1187L0177o1530p8681N465n0111j6960
$$ 1036152 1064653 1044064 1088218 1215038 1266225 1296402 1234872 1156191 1161656 1111545 1094585
18694A094585M1877K2644O5521J13205O7034L2967j4128j09629k458q6518j37433
$$ 1094585 1136462 1159106 1224627 1337832 1404866 1437833 1423705 1314076 1311618 1225100 1087667
18683A087667p8188J6268Q0233P2324Q7640q405q7783j10732P9380P3986J54771
$$ 1087667 1009479 1025747 1105980 1178304 1265944 1257539 1169756 1059024 1138404 1212390 1367161
18672A367161N3130O759M9965J27065K72476L00399K32935J54380l5652j2978
$$ 1367161 1420291 1427050 1477015 1604080 1876556 2176955 2409890 2564270 2528618 2515640
18662B515640J8102k20505k38478j44688k48459j02299q7323r8061r2767j09186
$$ 2515640 2533742 2313237 2074759 1930071 1681612 1579313 1491990 1393929 1301162 1191976
18652A191976q9903o0285l2289J05320J35606L9343J3053j8066L9024R8418J61527
$$ 1191976 1102073 1041788 1009499 1114819 1250425 1289768 1302821 1284755 1323779 1422197 1583724
18641A583724k4663o232L8178K01562J30014J1259m4399j50589q6123K8778l3117
$$ 1583724 1559061 1552829 1591007 1792569 1922583 1933842 1889443 1738854 1652731 1681509 1648392
18630A648392J9894O1928j3961J8703o5313j03617N6155m9190O696L7098J8150
$$ 1648392 1668286 1730214 1716253 1734956 1669643 1566026 1622181 1572991 1579687 1616785 1634935
18619A634935K3149j2161O2876J89419M26661N35434M52329K27685K15998R2653
$$ 1634935 1658084 1645923 1708799 1898218 2324879 2860313 3312642 3540327 3756325 3848978
18609C848978q7969l59827l28762m09472m36966l68050j29244R5081N486o6631
$$ 3848978 3761009 3401182 3072420 2662948 2225982 1857932 1728688 1823769 1829255 1762624
18599A762624k2181P66m3401r0244m4126R1520K18690P9257O4779k4527Q8860
$$ 1762624 1740443 1741209 1697808 1607564 1563438 1654958 1873648 1952905 2017684 1993157 2082017
18588B082017M8963j16318k8230L1258Q7416K4478L1090J68804k1357M9707K9594
$$ 2082017 2130980 2014662 1986432 2017690 2105106 2129584 2160674 2329478 2308121 2357828 2387422
18577B387422Q0816R4012m3250j32316q9833J6545K0952n2515o7394Q5742J19207
$$ 2387422 2468238 2562250 2519000 2386684 2296851 2313396 2334348 2281833 2214439 2300181 2419388
18566B419388p1697j06947R728j4548K1217N0064J02442j25919L0085J28620K25771
$$ 2419388 2347691 2240744 2250472 2235924 2257141 2307205 2409647 2283728 2313813 2442433 2668204
18555B668204J59237q5476J31778O9653k4493J9989J39235L38269L61200K72737
$$ 2668204 2827441 2741965 2873743 2943396 2918903 2938892 3078127 3416396 3777596 4050333
18545D050333K92655L98725K69637L86992N64087N50667L21958K64526K65025
$$ 4050333 4342988 4741713 5011350 5398342 5962429 6513096 6835054 7099580 7364605
18536G364605L08868L65095L30968M33690N97561O65803P40138P68278P75133
$$ 7364605 7673473 8038568 8369536 8803226 9400787 10066590 10806728 11575006 12350139
18527A2350139P77721R90552J212116J660814K304683L019995M165390N892198
$$ 12350139 13127860 14118412 15330528 16991342 19296025 22316020 26481410 32373608
18519C2373608Q570123J2840986J7636652K2466117K8234927L6509790M5996469
$$ 32373608 40943731 53784717 71421369 93887486 122122413 158632203 204628672
18512B04628672N2537292M1511774J6869817K870741j2976483l1080402l6491029
$$ 204628672 257165964 298677738 315547555 318418296 305441813 274361411 237870382
18505B37870382l1062139k4376933j8598756r460116l183302q476407j0923096
$$ 237870382 206808243 182431310 163832554 154372438 151189136 142712729 131789633
18498A31789633j1177438j6900796j9808315j7555957j5442851j3015056r684878
$$ 131789633 120612195 103711399 83903084 66347127 50904276 37889220 28204342
18491B8204342o298379m067550k681763j963004j475897j055268q05994n89846
$$ 28204342 21905963 17838413 15156650 13193646 11717749 10662481 9856487 9266641
18483I266641k91813l8016M581Q623L8732j34102l06933m74769m72241l95068
$$ 9266641 8974828 8936812 8941393 8950016 8988748 8854646 8547713 8072944 7600703 7205635
18473G205635l54252p0660K74798L66841N31641P30232Q70991R39071J011765
$$ 7205635 6851383 6780723 7055521 7422362 7954003 8684235 9555226 10494297 11506062
18464A1506062J189339J936672L287026O179396J0682246J3661173J0011208P285809
$$ 11506062 12695401 14632073 17919099 24098495 34780741 48441914 58453122 65738931
18456F5738931O161756j052265p799687r068923r227143q069300m483610J152805
$$ 65738931 71900687 70848422 63048735 53979812 44752669 36683369 32199759 33352564
18448C3352564P537567J0898878P718633N900124M198798l133799r129483j0128351
$$ 33352564 40890131 51789009 59507642 65407766 69606564 66472765 57343282 47214931
18440D7214931j0868687j0153409p650361m838712k952342j980555j331070r23272
$$ 47214931 36346244 26192835 18542474 13703762 10751420 8770865 7439795 6516523
18432F516523n81044r0871M392J62945K13142q027k65383l27589l70224l37748
$$ 6516523 5935479 5844608 5849000 6011945 6225087 6217060 5951677 5624088 5253864 4916116
18422D916116l89614m14402p9797Q1862K00085J98528J84965K24842k1528j91633
$$ 4916116 4526502 4112100 4032303 4114165 4314250 4512778 4697743 4922585 4901057 4709424
18412D709424j37242k33373m32689k94219l38383l92756k78216k13748j83025
$$ 4709424 4572182 4338809 3906120 3611901 3273518 2880762 2602546 2388798 2205773
18403B205773j92115k5578n5292j02516j68490o2184j27183j49129L6223P229
$$ 2205773 2013658 1988080 1932788 1830272 1661782 1599598 1472415 1323286 1359509 1366738
18393A366738o5060n7573j12151p6311O1313J58595K1327L2268J36400k885R1906
$$ 1366738 1301678 1244105 1131954 1055643 1116956 1275551 1296878 1329146 1465546 1462661 1554567
18382A554567R0112L6870J15608O8486J24780K33641K90936M2234j55052j00693
$$ 1554567 1644679 1681549 1797157 1865643 1990423 2224064 2515000 2557234 2402182 2301489
18372B301489p8831j00825j0370r8403j26514j67847J0581L27395L41135J86576
$$ 2301489 2222658 2121833 2111463 2013060 1886546 1718699 1729280 2056675 2397810 2584386
18362B584386J48043J9818j02290n4713l89557k79690j07784o6708J0677p384
$$ 2584386 2732429 2752247 2649957 2595244 2205687 1925997 1818213 1751505 1762182 1754798
18352A754798j63563k14942k01639N6602k5967K9619N5060j10941J42148K26410
$$ 1754798 1591235 1376293 1174654 1231256 1205289 1234908 1289968 1179027 1321175 1547585
18342A547585J20806J27246J26153o0330q0188o2537o3066K8597J1575k32531
$$ 1547585 1668391 1795637 1921790 1861460 1781272 1718735 1655669 1684266 1695841 1463310
18332A463310j90015j65824q3680P2400M925p340j8775R6257J6191p0584o0640
$$ 1463310 1273295 1107471 1023791 1096191 1101116 1093776 1075001 1171258 1187449 1116865 1056225
18321A056225J5137l3350O5707K5695q0678L0013k8343j9669p3359J021l3620
$$ 1056225 1071362 1038012 1103719 1129414 1048736 1078749 1050406 1030737 957378 958399 924779
18310I24779J07795N8612N0727L9992j25516j52483p712P6618r2490j11079L4050
$$ 924779 1032574 1091186 1141913 1181905 1056389 903906 896194 972812 880322 769243 803293
18299H03293J28136O0365J05658o8646m5441J1501o1347J07941J41248N7453n3575
$$ 803293 931429 991794 1097452 1028806 983365 994866 933519 1041460 1182708 1240161 1186586
18288A186586k6733L6897M7254M8837L3984P1685j09207k5169r4658j14025l5228
$$ 1186586 1159853 1196750 1244004 1292841 1326825 1398510 1289303 1264134 1169476 1055451 1020223
18277A020223j08741m7573m7625o5365P9211R7898o3018m4131Q418P4938L9389
$$ 1020223 911482 863909 816284 750919 830130 928028 865010 820879 829297 904235 943624
18266I43624J0683J6040o6724j54670l2586J9635j04825o972k2584k3112l8713
$$ 943624 954307 970347 903623 748953 716367 736002 631177 624205 601621 578509 539796
18255E39796l3685R3765L4549M2215Q0605M4142J7243N1807L9925j28623j27197
$$ 539796 506111 599876 634425 676640 757245 801387 818630 870437 910362 781739 654542
18244F54542r823O8391L6383q2596n3899L9775J4164P1048J71415J103P6554J39287
$$ 654542 644719 713110 749493 666897 612998 652773 666937 737985 909400 910503 987057 1126344
18232A126344L3801p8460j81472o8085J55813R740q4373j87683j04868L2130l2403
$$ 1126344 1160145 1081685 900213 832128 987941 997681 913308 725625 620757 652887 620484
18221F20484J9477R5858m0521j7833m1638M2536J1930l4128k0134L6530k8002
$$ 620484 639961 735819 695298 677465 635827 678363 690293 656165 636031 672561 644559
18210F44559o1498Q0046l495j37336o5708Q1081M7103K5557k4728J7184J57467
$$ 644559 583061 663107 659612 522276 456568 537649 584752 610309 585581 602765 760232
18199G60232J18162J5790n9303l1880j2889J40534r9568q4566K8274O3938l9113
$$ 760232 878394 894184 834881 803001 790112 930646 831078 746512 774786 838724 799611
18188G99611j09819R991N5322j2041l5651P9477j6285o7645n1612J2990K8051
$$ 799611 689792 699783 755105 743064 707413 786890 770605 702960 651348 664338 692389
18177F92389O192J10521O5797k3469j0564K4255L4040J2431r454j5918m5003R883
$$ 692389 698581 809102 874899 851430 840866 865121 899161 911592 902138 886220 841217 851100
18165H51100J08225k0126r6845J05090l2404j09159L3873J87928P3467k2407M4713
$$ 851100 959325 939199 842354 947444 915040 805881 839754 1027682 1101149 1078742 1123455
18154A123455m7532k5002K8373j6400M0024L3955O0214k7676P0908Q4525l3111
$$ 1123455 1075923 1050921 1079294 1062894 1102918 1136873 1197087 1169411 1240319 1324844 1291733
18143A291733J7819J3693K6278N6026L6339J79416N3658Q9143J68723M3612J05206
$$ 1291733 1309552 1323245 1349523 1405549 1441888 1621304 1674962 1764105 1932828 1976440 2081646
18132B081646J17311J61911J94070K86048K06412N9719K52241L92888M77858N82486
$$ 2081646 2198957 2360868 2554938 2840986 3047398 3107117 3359358 3752246 4230104 4812590
18122D812590O60146P62918Q91466J161207J593881K144744K628132L546898M991061
$$ 4812590 5472736 6235654 7127120 8288327 9882208 12026952 14655084 18201982 23193043
18113B3193043P645603J3344914K5970155M9792796P0144139L8721236k293025
$$ 23193043 30838646 44183560 70153715 119946511 190090650 228811886 226518861
18106B26518861j9507844m3257069n2295043m2345574k5977816j4265802q274757
$$ 226518861 207011017 163753948 111458905 69113331 43135515 28869713 20594956
18099B0594956n286831l513528k503669j780794j250651j062611j032562p69840
$$ 20594956 15308125 11794597 9290928 7510134 6259483 5196872 4164310 3394470
18091C394470n71162l55807k96506l44410k86310j46299j05855p2375q9202j01744
$$ 3394470 2823308 2467501 2170995 1826585 1540275 1393976 1288121 1215746 1126544 1024800
18081A024800j40783k5197k1043J25590J6454j08231k2751p1706l5552m3088m8757
$$ 1024800 884017 858820 837777 963367 979821 871590 848839 777133 741581 698493 649736
18070F49736j47231n2762K12676K10440J19491m3376q2274o757n0209j32930r7329
$$ 649736 502505 449743 662419 872859 992350 948974 866700 859943 809734 676804 579475
18059E79475Q5423K20991J74738N450l8992P904p5858j53801j25667l2724J7661
$$ 579475 664898 885889 1060627 1066077 1027085 1034989 959131 805330 679663 646939 664600
18048F64600k6756n247k5046p3883k0980k58O3636J09771J09007Q6505J9835Q0743
$$ 664600 637844 632597 607551 533668 512688 512430 576066 685837 794844 881349 901184 981927
18036I81927O5246m9876M3747O0499n3966o9434J9308r6390r4021k7706m0371
$$ 981927 1047173 997297 1041044 1101543 1047577 978143 997451 901061 807040 779334 738963
18025G38963j02605r0419j40475M0246J15455J17802j4447m2414J20077P8088
$$ 738963 636358 545939 405464 445710 561165 678967 664520 622106 742183 820271
18015H20271J09725J39407Q1432O9985L4524J88369J44196J6835K64545L36109
$$ 820271 929996 1069403 1150835 1220820 1255344 1443713 1587909 1604744 1869289 2205398
18005B205398J76330J72191R9037K22269R3673j63414j83462k80083j97253q6173
$$ 2205398 2381728 2553919 2652956 2875225 2968898 2805484 2622022 2341939 2144686 2058513
17995B058513j53374k80606l20911k27428j02527k35662j74378o8187o979r655
$$ 2058513 1905139 1624533 1303622 1076194 973667 738005 563627 495440 488461 478806
17985D78806J55938Q0353j13043r9778J32947P5915Q0215M7446P1018j14411K2325
$$ 478806 634744 715097 602054 502276 635223 711138 791353 838799 909817 795406 817731
17974H17731J8150l5294p843J0006L4205K0216j9193Q8054K9450j16792j33087
$$ 817731 835881 800587 792744 802750 836955 857171 837978 926032 955482 838690 705603
17963G05603j90325j08858K733J4648o3913K086l8353r265M3280O1031L2926l0301
$$ 705603 515278 406420 409153 423801 359888 361974 323621 314356 357636 418667 451593 421292
17951D21292o0089n5020o4955o5966L1553Q416R691k9883j7647m3450m6983j1566
$$ 421292 361203 306183 241228 175262 206815 215231 224922 195039 177392 133942 86959 75393
17939G5393J16791K13676J23390o643j1493P5585J05159J03347Q6689J12915L3599
$$ 75393 192184 405860 529250 522607 511114 586699 691858 795205 881894 994809 1028408
17928A028408J05026J79531J72222R6491J88446r487p7044r9982r6580j18200
$$ 1028408 1133434 1312965 1485187 1581678 1770124 1760637 1683593 1583611 1487031 1368831
17918A368831k09884k48071n2760L830k2927r6631m247k0239Q580o499j83763
$$ 1368831 1158947 910876 858116 861946 839019 742388 738141 717902 726482 719983 536220
17907E36220j57672j65177o9520R4469J4761J4142M0537J36546J10765p6761n2642
$$ 536220 378548 213371 143851 238320 253081 267223 307760 444306 555071 478310 425668
17896D25668l0972l9782n1010p4349o27o844R1209L3526K8800n8961r1172J1301
$$ 425668 394696 354914 303904 229555 228928 222084 313293 346819 375619 316658 225486 236787
17884B36787O8907k9114Q630m4696O1596q8258P583p0862l0102M3791p3437l8411
$$ 236787 305694 276580 285210 240514 302110 213852 221435 150573 120471 164262 90825 52414
17872E2414J5804J29368P9848k06j0363j3648R337R0807j149n7057p4695j13544
$$ 52414 68218 197586 277434 277228 266865 253217 262554 353361 352212 295155 220460 106916
17860A06916J3443k5848L2105O7864K838n9300r2801P8853J20269Q4232K8613
$$ 106916 120359 94511 126616 194480 197318 138018 45217 124070 244339 328571 357184
17849C57184n9706l0276m4013M7366J3288p4116J15380J0927k2323m9630K6920
$$ 357184 297478 267202 223189 270555 283843 209727 325107 336034 313711 264081 291001
17838B91001k1429p8478j11954j17629L3385J92124J41590P2060j5082k2461k28067
$$ 291001 269572 191094 79140 -38489 -5104 187020 328610 400670 385588 363127 135060
17827A35060n8401o3187l1424R1957m2458N5860O5437j72715r047J17834P4864
$$ 135060 76659 13472 -17952 74005 31547 87407 152844 -19871 -28918 88916 163780
17816A63780J01444M4274j2775J2980j2138J2267p4181L6439J8515j71594l3738
$$ 163780 265224 309498 296723 309703 297565 309832 235651 272090 290605 119011 85273
17805H5273J6033q2363l5539N6848J320M1172P3971l3001j115p9005Q6958M1582
$$ 85273 101306 18943 -16596 40252 41572 82744 156715 123714 122599 43594 130552 172134
17793A72134j00987p7549n702Q6824L5786J15485l5399k5739k514J9463L0558
$$ 172134 71147 -6402 -12104 74720 110506 225991 190592 164853 162339 181802 212360
17782B12360J27599N6889J69808J63034J11512K5050m466J02303J39596R3549
$$ 212360 339959 396848 566656 729690 841202 866252 861786 964089 1103685 1197234
17772A197234P3233J88578J44127Q2288p2134j08046j93018k35638m5491J1872
$$ 1197234 1270467 1459045 1603172 1685460 1613326 1505280 1312262 1076624 1031133 1043005
17762A043005j14117j98811L0382j33345n7742j49435j48609j10575M760O883
$$ 1043005 928888 730077 760459 627114 569372 419937 271328 160753 165513 172396
17752A72396q6754L4942m684L3578L3176q6971N921N7797L8954l2528k1276j39245
$$ 172396 85642 120584 115900 149478 182654 95683 101604 159401 198355 165827 144551 5306
17740E306J3281J66193Q7268j16822J2688Q7941m2030n8903K1129j5635j5032
$$ 5306 18587 184780 272048 155226 167914 255855 213825 154922 176051 160416 145384
17729A45384J0501m1940l6557j8099j10677l2589J10769R9388L1992R992N4426
$$ 145384 155885 113945 77388 59289 -51388 -83977 26792 126180 158172 168164 222590
17718B22590p6603j30338L1504j2100O048K3100M0657J91589J50364n8995m8514
$$ 222590 145987 15649 47153 35053 41101 64201 104858 296447 446811 387816 339302
17707C39302L8968j18794n3930p4045q356M5487r1925q4379J67181J35876L8052
$$ 339302 378270 259476 205546 131501 123145 168632 76707 -7672 159509 295385 333437
17696C33437N9155R5041J49073j7971n4488k1442n8849K2847p4308j5720j7816
$$ 333437 392592 487633 636706 618735 564247 542805 483956 506803 432495 416775 398959
17685C98959J16118j08632k24269r4299N2509M7026p243j9934P6976O3119m6518
$$ 398959 515077 406445 182176 87877 140386 187412 180169 160235 237211 300330 253812
17674B53812j28023J878R3224J8479j9975M3160n1559N4164l9939j08340o6659
$$ 253812 125789 127667 220891 239370 219395 262555 210996 265160 225221 116881 50222
17663E0222J9108O3823j7851j5923o4366O7033N2488n8722o3651M2921J17507
$$ 50222 69330 133153 115302 99379 35013 102046 154534 95812 32161 75082 192589
17652A92589J7216m8131j877Q2146N7577L2944j15340j11589m1071J8643k3397
$$ 192589 209805 161674 159797 241943 299520 332464 217124 105535 64464 83107 59710
17641E9710J27969o5318j80799J2195J06934L0865K2621P4798k6039j04838J1111
$$ 59710 187679 122361 -58438 -46243 60691 91556 114177 188975 162936 58098 69209
17630F9209m6994m7155N1844J48263O5710j05719o8340P9523j7657j36838K7606
$$ 69209 22215 -24940 26904 175167 240877 135158 66818 146341 128684 -8154 19452
17619A9452R714N4986j1241r7818o7362P9989J30899j05722q6034Q4377O458R5171
$$ 19452 29166 84152 72911 -24907 -92269 -12280 118619 12897 -73137 11240 17698 112869
17607A12869p0244J60185J70134l1143J6673p7066l021q4623K2047R8752n0607
$$ 112869 42625 202810 372944 341801 358474 281408 278387 193764 215811 314563 263956
17596B63956j29145o716j8305m870J47791J40438j15203p9629o4274K573L097
$$ 263956 134811 128095 109790 104920 252711 393149 277946 198317 134043 136616 139713
17585A39713k2573L8549L8099M3873j05230j31717q1402Q0790P0470Q3002N7904
$$ 139713 117140 155689 193788 237661 132431 714 -80688 102 70572 153574 211478
17574B11478j2806k4117O1466m4623P7248Q3536Q9421l5471k32364j80967j29566
$$ 211478 198672 174555 236021 191398 268646 352182 441603 406132 173768 -7199 -136765
17563a36765R5113N8126j959q8643n6024M9616J17352n5448m1345J01597R150
$$ -136765 -41652 16474 14515 -74128 -130152 -80536 36816 -18632 -59977 41620 50770
17552E0770j29099p9056j02105L7306J72488Q6002j0049m4798N2419M989n3546
$$ 50770 -78329 -157385 -259490 -222184 -49696 36306 26257 -18541 33878 38867 -14679
17541a4679n6436Q7328K5825k9206O1103j5921p7824m1967K6535q6841n484K8930
$$ -14679 -71115 16213 42038 12832 73935 58014 -19810 -61777 -35242 -122083 -127567 -98637
17529i8637N2639N4592N0498j04295j64892K4567J20656Q6527Q6061j6150o3002
$$ -98637 -45998 8594 59092 -45203 -210095 -185528 -64872 21655 107716 91566 28564
17518B8564o5161r032J5570p4480M0289O6669M0230M840q6481J07726k1906j06361
$$ 28564 -36597 -45629 -30059 -104539 -64250 2419 42649 47489 -38992 68734 46828 -59533
17506e9533M7333R544R1538J5001o3727j8916l5915K6635P5891n2185j5145l5190
$$ -59533 -12200 -2656 88882 103883 40156 21240 -14675 11960 87851 35666 20521 -14669
17494a4669K4915n0156R0748N6258j12r6288M1829k4354j8826R6409Q3039n9116
$$ -14669 10246 -39910 50838 107096 106984 10696 52525 28171 9345 105754 188793 129677
17482A29677j66363j3308L3246L1817l7157N0350M4524m8300K0324j08628m6843
$$ 129677 -36686 -49994 -16748 15069 -22088 28262 72786 24486 44810 -63818 -110661
17471a10661R7676Q9581L1946l2122l2679M5781R715M6810L0117M4052m6927j2814
$$ -110661 -12985 76596 108542 76420 43741 89522 99237 146047 176164 220216 173289 160475
17459A60475k5560q1533J09206p994p9933N5949o5668o2793k5344L9001m8712
$$ 160475 134915 53382 162588 154594 74661 130610 64942 2149 -23195 15806 -32906
17448c2906j9433K37219M1509J14603K08690K36341J77813J3486l2769j83985
$$ -32906 -52339 184880 226389 340992 549682 786023 963836 977322 944553 760568
17438G60568j81782j50296j81501o1894k596r9654Q455r7455j49229j03075O2591
$$ 760568 578786 428490 246989 185095 182499 82845 91300 -6155 -155384 -258459 -195868
17427a95868J8417R4746P1541L0949r7487K2789M5927J21857j3254r0798q1614
$$ -195868 -177451 -82705 -11164 19785 -77702 -54913 -8986 112871 99617 8819 -72795
17416g2795j01943L4996l8849J2528J35686J03171N490r599J0172K0249k3690
$$ -72795 -174738 -139742 -178591 -166063 -30377 72794 78284 68685 78857 99106 75416
17405G5416o866j8834R3072l631K8477O800q7826l2509j20556M8990L0068P2147
$$ 75416 68550 49716 142788 139157 167634 174434 86608 54099 -66457 -17467 12601 84748
17393H4748n5046p2668j9003N8336K7500r5428p0147o3054K7407O3539J56234
$$ 84748 29702 -42966 -61969 -3633 23867 -71561 -141708 -204762 -177355 -113816 42418
17382D2418J33555n6639j11278k1327R696K4179k7869k8635N0720N5747J26692
$$ 42418 175973 119334 8056 -13271 -3575 20604 -7265 -35900 14820 70567 197259
17371A97259M7743p5074p0119q218Q3240o5040l2716q5355K0502M0034p54M2063
$$ 197259 245002 169928 99809 91591 174831 109791 77075 -8280 12222 52256 51502 93565
17359I3565L9221Q3990K7905j05682M497M7521r7756L4631r7228m9820n3592J2113
$$ 93565 132786 216776 244681 138999 143496 191017 93261 127892 30664 -19156 -72748 -60635
17347f0635J0232k827O3620J28193j34266J13047J53174l8140q3009n621q807
$$ -60635 -50403 -53230 10390 138583 4317 117364 270538 232398 149389 143768 134961
17336A34961l2663K5921O0544K093M2851m8282j07512n4929r3132k7319J18155
$$ 134961 102298 128219 188763 190856 233707 185425 77913 22984 -70148 -97467 20688
17325B0688O0513O6077n5867p3810p6004l6365q7785o4113k651O4783J78133O2288
$$ 20688 81201 147278 91411 17601 -58403 -94768 -182553 -246666 -249317 -184534 -6401 55887
17313E5887q1139m699j1133o5840K6202O0533K8884M5198N4899J30025n4831j49423
$$ 55887 -25252 -29951 -41084 -106924 -80722 -20189 8695 53893 108792 238817 183986 34563
17301C4563j57540m5300p9288J23429J71853j3666K6299k9292j26200K5912J15392
$$ 34563 -122977 -168277 -247565 -124136 47717 34051 60350 31058 -95142 -69230 46162
17290D6162J71407l8098q9278o8593K0156J762j6374r0080P1846p155K2020K046
$$ 46162 217569 179471 90193 21600 41756 43518 27144 -62936 8910 1755 23775 25821
17278B5821M312m9803j1913J06151m7474O5848N5833Q3589l8677q2947m0922k7454
$$ 25821 30133 -19670 -31583 74568 27094 92942 148775 232364 193687 110740 69818 42364
17266D2364o9370r5967n7440J9338L7077m2054Q7364J23093m0790p2331j39574
$$ 42364 -27006 -122973 -180413 -161075 -123998 -166052 -78688 44405 3615 -68716 -208290
17255b08290q4146P8245J08647m293k5030P0215R4458K2138n8052q8911j16263
$$ -208290 -292436 -214191 -105544 -109837 -134867 -64652 29806 51944 -6108 -95019 -211282
17244b11282o732m4473l5024K6559J13732L4243K7349K3842l2199N253j9054Q8622
$$ -211282 -218014 -262487 -297511 -270952 -157220 -122977 -95628 -71786 -103985 -98732 -117786 -29164
17232b9164J69101k9713r4636O1093M4072M6078L3798q7417n0141N826L7331J60271
$$ -29164 139937 110224 15588 76681 120753 166831 200629 113212 63071 68897 106228 266499
17220B66499M1058k16640j10924l0754o1691M0194J08700k7681N677j4360p2610
$$ 266499 307557 90917 -20007 -50761 -112452 -72258 36442 8761 14438 78 -72532
17209g2532O7070O2668j5190K0595j0315n1708N5920Q711l2320K2740m6121r4033
$$ -72532 -5462 57206 42016 62611 52296 588 56508 65219 32899 55639 9518 -84515
17197h4515N2740N7357j07203j05929o7453P6265q903N6051o6898q4965J02522
$$ -84515 -31775 25582 -81621 -187550 -255003 -178738 -187641 -131590 -198488 -283453 -180931
17186a80931J99884Q4617l2100K7370L4630j6233k4909j6982k0730n147L4688
$$ -180931 18953 103570 71470 98840 133470 117237 92328 75346 54616 49469 84157
17175H4157M9608j09097L892n574k8406k8957Q6012M5398L6097j32014l5539L7107
$$ 84157 133765 24668 28560 22986 -5420 -34377 51635 97033 133130 1116 -34423 2684
17163B684k8241M6444j5921l615p223P1090P6238j00672p1746M8563J36304m8683
$$ 2684 -25557 20887 4966 1351 -5872 65218 141456 40784 -30962 17601 153905 105222
17151A05222r1653o1297L9627Q9973J32541M0060K2716r0045q0959l7902O3158
$$ 105222 13569 -47728 -8101 81872 214413 254473 277189 187144 106185 68283 131441
17140A31441Q6564p3961l9903l2274k7331m3401P2230n9078m6205n2757m5252
$$ 131441 218005 144044 104141 71867 44536 1135 73365 14287 -31918 -84675 -129927
17129a29927J05203Q7358L0421j7065m0769j35707p5701P4807J25730J30287L8691
$$ -129927 -24724 62634 93055 75990 35221 -100486 -176187 -101380 24350 154637 193328
17118A93328n5551m3016m1929p3686n1931j9467J21426K7271m178m4306N3634
$$ 193328 137777 94761 52832 -20854 -72785 -92252 29174 56445 52267 7961 61595
17107F1595N7194M6947j25447j01758o820O3194o3182K8434J00001J05447r84
$$ 61595 118789 165736 40289 -61469 -68289 -5095 -68277 -39843 60158 165605 164621
17096A64621n6816l2777o8695j9431m6209J0651j0128m6674N2908k1013M4636
$$ 164621 107805 75028 6333 -13098 -59307 -48656 -58784 -105458 -52550 -73563 -28927
17085b8927M0691j08827m3627L5060M7351l7658k6332N6586m6917j06183R1198
$$ -28927 11764 -97063 -140690 -105630 -58279 -95937 -122269 -65683 -112600 -218783 -127585
17074a27585Q5509j3130p7721o7778J08303J31246K4829L3319j85903j44N4573
$$ -127585 -42076 -55206 -132927 -200705 -92402 38844 63673 96992 -88911 -89055 -34482
17063c4482o838m9519j5931j8952L464L4862Q7892O837q7391J470m2596M9780
$$ -34482 -41320 -90839 -106770 -125722 -122258 -87396 496 7333 -80058 -78588 -121184 -71404
17051g1404N6759m20L6512j781j18192R191R3516J12414L8403q669q782j1537
$$ -71404 -14645 -15065 21447 19666 -98526 -89335 4181 116595 154998 146329 137547 126010
17039A26010j25174j7333P7947j3489l7469J1074R4629j62831M836K198J3935
$$ 126010 836 -16497 61450 47961 10492 21566 116195 -46636 -41800 -39602 -25667
17028b5667j04375K7662r6537J99215J30369N3878O890o8357j44496m3083J46389
$$ -25667 -130042 -102380 -198917 298 130667 184545 191435 123078 -21418 -64501 81888
17017H1888m5705q1188N9081K6516K6333j12029K4510N9346m8013L774o276n8918
$$ 81888 36183 -45005 14076 40592 66925 -45104 -20594 38752 -9261 -5487 -11763 -70681
17005g0681j1047j9062j27058j77176o4713Q2323J70398K8485M391L5306k9042
$$ -70681 -81728 -100790 -227848 -405024 -469737 -387414 -217016 -188531 -184140 -148834 -177876
16994a77876J9943J50143l0455j57302P5417P2009L7007o6482K2475J819K3652
$$ -177876 -157933 -7790 -38245 -195547 -120130 -48121 -11114 -77596 -55121 -53302 -29650
16983b9650J16678R9617j8229j08902P2283o0607j11423q7078M9440p0462M0397
$$ -29650 87028 186645 168416 59514 131797 71190 -40233 -127311 -77871 -148333 -107936
16972a07936L4989Q1234m519j35323o0982k6714k8225J0365J09457K667m6250
$$ -107936 -72947 8287 3768 -131555 -192537 -219251 -247476 -237111 -127654 -124987 -171237
16961a71237O6758L2235r9780n5126n9870J00723J36729K4214M2604j02226j017
$$ -171237 -104479 -72244 -172024 -227150 -287020 -186297 -49568 -25354 17250 -84976 -85993
16950h5993k6007j63145P6244K1891M0498m93k9214K6309J32657O2135j48802
$$ -85993 -112000 -275145 -198901 -177010 -136512 -137005 -166219 -139910 -7253 54882 -93920
16939i3920r486J7928k620q9702q2667O1300J62980L3037q0051p477p3262J0202
$$ -93920 -103406 -85478 -88098 -177800 -260467 -199167 -36187 -3150 -83201 -90678 -163940 -153738
16927a53738J02971l6538j23183k633Q3823J5582L4408M3378m4912p0280j16066
$$ -153738 -50767 -87305 -210488 -213121 -129298 -113716 -79308 -35930 -80842 -151122 -267188
16916b67188L0290M0894P5091J25342o5080k9925K3537j31442L0323M8622P1400
$$ -267188 -236898 -196004 -120913 4429 -60651 -90576 -67039 -198481 -168158 -119536 -48136
16905d8136l3978M6973L6348R0370P0058N6117o8671j24375p6540K8476q766j24592
$$ -48136 -82114 -35141 1207 91577 161635 217752 149081 24706 -51834 -23358 -32124 -156716
16893a56716j13683q990N8077J14896M9315L4934O4198p2829l5067O4273J366
$$ -156716 -270399 -279389 -221312 -106416 -57101 -22167 42031 -30798 -65865 -1592 -226
16882b26J11355r4419N7815r4253j04551P4153O7180L3753O315o6279p3643N5336
$$ -226 111129 16710 74525 -19728 -124279 -50126 17054 50807 57122 -9157 -82800 -27464
16870b7464K4250K6904Q0224l3582n2082N9151L3524N2734P268n880o5936j81638
$$ -27464 -3214 23690 103914 70332 18250 77401 110925 163659 170927 165047 99111 -82527
16858h2527l3972r0857O6263L3762j6768L2149N2908n4667r4093n9248J22590
$$ -82527 -116499 -207356 -141093 -107331 -124099 -91950 -39042 -93709 -187802 -247050 -124460
16847a24460j06171O4317P4810O0066j190k0072j497j10180n3644R127M165J6938
$$ -124460 -230631 -166314 -91504 -31438 -32628 -52700 -54197 -164377 -218021 -208894 -204729 -187791
16835a87791k8950M3985Q5333N9598J50147K1101n1009j12730j12940r9988N0834
$$ -187791 -216741 -172756 -87423 -27825 122322 143423 92414 -20316 -133256 -233244 -182410
16824a82410J10103n4303q5278J08576J11652J09514K049j02921O515o2818O2853
$$ -182410 -72307 -126610 -211888 -103312 8340 117854 119903 16982 23497 -39321 23532
16813B3532K657j6054m7829M562m190o6062J2810j8285J0576O3325K9833L7078
$$ 23532 26189 10135 -37694 -33132 -37322 -103384 -90574 -108859 -98283 -34958 -5125 31953
16801C1953L8217j1026j04368l7188R735r6633k4944K5669P7591k9232R1984R4763
$$ 31953 70170 59144 -45224 -82412 -72677 -169310 -194254 -168585 -90994 -120226 -28242 66521
16789F6521o9673j50218q2875O9197M2006K1036j3195n5160n2965J317J17005
$$ 66521 -3152 -153370 -236245 -167048 -125042 -104006 -117201 -172361 -225326 -224009 -107004
16778a07004M1036J12384j0621Q6J9915j00921R8196M2612l1872l787j70481k3557
$$ -107004 -65968 46416 35795 35881 55796 -45125 53071 95683 63811 60024 -110457 -134014
16766a34014R1696K4353o3061q6602L0438R8326k5798k9572j16400J41130O0608
$$ -134014 -42318 -17965 -81026 -167628 -137190 -38864 -64662 -94234 -210634 -69504 -8896
16755h896J13398o5336j9158p2692j11000j32693J7885J86179m7272J9844j8021
$$ -8896 104502 39166 20008 -52684 -163684 -296377 -278492 -92313 -139585 -119741 -137762
16744a37762k2078K9271j46045l2065J7095Q4501N0256R404K7099J4624j4802
$$ -137762 -159840 -130569 -276614 -308679 -291584 -207083 -156827 -147423 -120324 -105700 -120502
16733a20502M4979N7809o171M0048r6453j19117M0892J31193k4505r0865q0276
$$ -120502 -75523 -17714 -23885 16163 -80290 -199407 -158515 -27322 -51827 -142692 -222968
16722b22968N7114J13923o0026j64329l08j7179m0595J7762Q5393K2280r797M7033
$$ -222968 -165854 -51931 -111957 -276286 -276594 -293773 -334368 -316606 -231213 -208933 -218730 -171697
16710a71697J10188j02563j21201J40145J27806n3801l4091m2580P4843J60638
$$ -171697 -61509 -164072 -285273 -145128 -17322 -71123 -105214 -147794 -72951 87687
16700H7687Q9327j22298r8322n17m138L4787K5911p2545O857j2160N1384P6787
$$ 87687 177014 54716 -43606 -44123 -48261 -13474 12437 -60108 -53251 -65411 -14027 62760
16688F2760R8398R6913q4170j37356j800O9786Q2266L129r8085r947J5829n1015
$$ 62760 161158 258071 173901 36545 34745 104531 186797 189926 91841 81894 97723 46708
16676D6708Q818J144o0099K4654j7427j18726l2170J09324O0806k0483q9488K935
$$ 46708 55526 56670 -3429 21225 3798 -114928 -147098 -37774 23032 2549 -86939 -84004
16664h4004k0293K4166N0231K0401n123j47393k4016r9816j0388J15981k868M9087
$$ -84004 -104297 -80131 -29900 -9499 -14622 -162015 -186031 -285847 -296235 -180254 -183122 -134035
16652a34035O115l5576r0094R2788J00118j7655K3991O4900j4332K2796j00367
$$ -134035 -127920 -163496 -253590 -160802 -60684 -78339 -54348 10552 -3780 19016 -81351
16641h1351j68826j75250O7212K2589J07195M9587m829P0096J00788J07458j42198
$$ -81351 -250177 -425427 -358215 -335626 -228431 -178844 -183673 -113577 -12789 94669 -47529
16630d7529j30433Q864J5649n0078m5563l5420n6767k1324R5463l334l1509J20770
$$ -47529 -177962 -169098 -153449 -203527 -249090 -284510 -341277 -362601 -267138 -270472 -301981 -181211
16618a81211R1638K7307J44306J3642n7166o7876l1924k6917k0537j2439Q0117
$$ -181211 -89573 -62266 82040 95682 38516 -29360 -61284 -88201 -108738 -121177 -41060
16607d1060j4445l663J6566k4650m0819M5791j9708l6076p3681k3644k5066j1619
$$ -41060 -55505 -59168 -42602 -67252 -108071 -62280 -81988 -118064 -191745 -215389 -240455 -252074
16595b52074M5061P5292M0389O187m032o8336k7805L1662M1930j5151j3221L3571
$$ -252074 -207013 -131721 -91332 -85145 -89177 -157513 -185318 -153656 -111726 -126877 -140098 -106527
16583a06527q7081O8419P6331M7702J9952l4150l1663j17798k7172Q779j4766
$$ -106527 -193608 -125189 -48858 -1156 18796 -15354 -47017 -164815 -191987 -183208 -197974
16572a97974L6144K4872N898J06000J32535l4425o1970q3207M8111j17249l6853
$$ -197974 -161830 -136958 -131060 -25060 107475 73050 11080 -72127 -24016 -141265 -178118
16561a78118n0178L4548J19512O7395M8371P4086M5348j8763j87870n8343M4226
$$ -178118 -228296 -193748 -74236 -6841 41530 115616 160964 142201 -45669 -104012 -59786
16550e9786l7M9976j01552o0181K8793J3850k9229m5394M4669L3462r916j7207
$$ -59786 -59823 -9847 -111399 -171580 -142787 -128937 -158166 -203560 -158891 -125429 -135345 -152552
16538a52552m7309L7877R3407k2023M2354j0429J04126l7382m2404R2636q0951
$$ -152552 -199861 -161984 -68577 -90600 -48246 -58675 45451 8069 -34335 58301 -22650
16527b2650k5736Q0421N282q4259K6094L0072j2535l3063m4025K5829L1602l9567
$$ -22650 -48386 32035 37317 -46942 -20848 9224 -3311 -36374 -80399 -54570 -22968 -62535
16515f2535n5620j3940O9093k2836k1119Q662M2095j9941K877K4232L6153q6713
$$ -62535 -118155 -132095 -63002 -85838 -106957 -98295 -56200 -76141 -73264 -49032 -12879 -99592
16503i9592j65606Q868J00270P8069j9761M0814j11559m5435R7385J43290M6090
$$ -99592 -265198 -256330 -156060 -77991 -97752 -56938 -168497 -213932 -116547 26743 72833
16492G2833k5624l3137J2880k0804j00775p0581m6418o5151K3900J17829J594
$$ 72833 47209 14072 26952 6148 -94627 -165208 -211626 -276777 -252877 -135048 -133454
16481a33454m2797J3481Q7980J7275j03533k4112l0808J5105P6508p4930R1889
$$ -133454 -176251 -162770 -74790 -57515 -161048 -185160 -215968 -200863 -124355 -199285 -107396
16470a07396N8357M818k1306n814m7920p5042M5471O5937q3566p6045P2288M4562
$$ -107396 -49039 -44221 -65527 -71341 -119261 -194303 -148832 -82895 -166461 -242506 -170218 -125656
16458a25656o6931R0783R9155j34392j565R3450r3480j4393n4984O7653J57165
$$ -125656 -192587 -101804 -2649 -137041 -138606 -45156 -138636 -153029 -208013 -140360 16805
16447A6805m7024o4021j9566o3848q9413J1176o747J40312p6365q7645O4729J09652
$$ 16805 -30219 -94240 -113806 -177654 -267067 -255891 -262638 -122326 -198691 -286336 -221607 -111955
16435a11955m2902l9716O2281P8522N403q26Q5163l5002p2905o6695j45582j1464
$$ -111955 -154857 -194573 -132292 -53770 -48367 -49193 35970 968 -71937 -138632 -284214 -295678
16423b95678J39046K8746J06842n4191p7528P365L7316M4144J79548J350j29034
$$ -295678 -156632 -127886 -21044 -75235 -152763 -145398 -108082 -63938 115610 116960 -12074
16412a2074r51o4266Q3954m6558K8683j03853j03808K1885R9111M6595j50731
$$ -12074 -13025 -77291 6663 -39895 -11212 -115065 -218873 -196988 -97877 -51282 -202013
16401b02013l0396N1424L6780J01791L8974q4487j57701k2727N5476M978q0920
$$ -202013 -232409 -180985 -144205 -42414 -3440 -87927 -245628 -268355 -212879 -207901 -288821
16390b88821O1811Q244L2755O4978M6837J9918Q2072p789r3922k7207j820O2486
$$ -288821 -227010 -218766 -186011 -121033 -74196 -54278 27794 20005 -73917 -101124 -102944 -40458
16378d0458m5935n7543L157K6366Q6457M4883k9727m976r0716L1136L7252n0803
$$ -40458 -86393 -143936 -140779 -114413 -27956 16927 -12800 -17776 -108492 -77356 -40104 -90907
16366i0907j20514j7213M2625J52724Q3932k2045k3544o2934j28677k6177J96177
$$ -90907 -211421 -228634 -186009 -33285 50647 28602 5058 -57876 -186553 -212730 -16553
16355a6553j5908p1707O6585o156o1779k4637l0550L6416k9033k172m364M938
$$ -16553 -32461 -104168 -37583 -43739 -105518 -130155 -160705 -124289 -153322 -155494 -159858 -154920
16343a54920O3007J989l5667r3046r4140P8627J6077P6078J9109j5376N7715M6660
$$ -154920 -91913 -89924 -125591 -218637 -312777 -234150 -218073 -141995 -122886 -138262 -80547 -33887
16331c3887p4262O2445J8202j33868L8908P4060Q210K4379K5844k5546j16034
$$ -33887 -108149 -45704 -27502 -161370 -122462 -48402 -40192 -15813 10031 -15515 -131549
16320a31549o5633O8123Q3162N2169l26q0046j1011L2411n1945o9535O3482M3019
$$ -131549 -197182 -129059 -45897 6272 5946 -74100 -85111 -52700 -104645 -174180 -110698 -67679
16308f7679M2279N2721o5258m0975K9330L5443L1506p8387L6795o0247m9716j3288
$$ -67679 -25400 27321 -37937 -78912 -49582 -14139 17367 -61020 -24225 -84472 -134188 -147476
16296a47476M4468L1900r4964L9402N0558P7142N0091l529M8049M8332o0780l2395
$$ -147476 -103008 -71108 -166072 -126670 -76112 1030 51121 47592 95641 143973 83193 50798
16284E0798p8433J7590O9836k6640m2958o9513L4735M3013P8108L4929L9312q7825
$$ 50798 -27635 -10045 59791 33151 -9807 -79320 -44585 -1572 76536 111465 150777 62952
16272F2952j61002j2160K9355M9285M5516R522j01746M6664l422M1545q1954K6893
$$ 62952 -98050 -110210 -80855 -31570 13946 23468 -78278 -31614 -35036 6509 -75445 -48552
16260d8552Q7851l0830K8346p14R0200P556m6408j7518r2385p8767l2821m3516
$$ -48552 39299 8469 36815 36101 126301 133857 87449 69931 -22454 -101221 -134042 -177558
16248a77558M178J00001J03138l2119j28278p4838l632J07441q6282j12545L1795
$$ -177558 -173380 -73379 29759 -2360 -130638 -205476 -209108 -101667 -187949 -300494 -268699
16237b68699J05270o098M1794j8460M8673m3605m3512L6850j12496m8122O2307
$$ -268699 -163429 -169527 -127733 -146193 -97520 -141125 -184637 -147787 -260283 -308405 -246098
16226b46098M2872l9973K7011N6815N4480l7242N7233K3889K453l1607m6611L8240
$$ -246098 -203226 -243199 -216188 -159373 -104893 -142135 -84902 -61013 -58560 -90167 -136778 -98538
16214i8538J2572k1228n981m9470J673M8148j4387N6687o0522J4234O7853K3389
$$ -98538 -85966 -107194 -113175 -162645 -160972 -112824 -127211 -70524 -131046 -116812 -48959 -25570
16202b5570j2593q0937l8552Q3844J85573p0034o3646q7676j50297p0127m1768
$$ -25570 -38163 -119100 -157652 -73808 111765 41731 -21915 -109591 -259888 -330015 -371783
16191c71783P8648J94171J02926p2973m4357N0764m2610r493K9156j2397O5031
$$ -371783 -293135 -98964 3962 -69011 -113368 -62604 -105214 -114707 -85551 -97948 -32917
16180c2917j7312K1568P9421o8414M4221N8217R917j2679k7560j8358M4396p5891
$$ -32917 -50229 -28661 50760 -17654 26567 84784 94701 82022 54462 36104 80500 4609
16168D609j08027j6851P2500j14856L5436J9060K6151N721M60q4826q6083l1064
$$ 4609 -103418 -120269 -47769 -162625 -127189 -108129 -81978 -76257 -75797 -160623 -246706 -277770
16156b77770O4694J60060J31715M9760j18048j41934l1393M9490K6937m1635o5734
$$ -277770 -213076 -53016 78699 128459 10411 -131523 -162916 -113426 -86489 -128124 -193858
16145a93858m1383N0638P7831J4917L3980Q2710M878m1698j2797L7312l6896j70051
$$ -193858 -235241 -184603 -106772 -91855 -57875 24835 29713 -11985 -24782 12530 -24366 -194417
16133a94417r5857M5045P6336J07575p768l8082l3995j1853L7677o5921k2487
$$ -194417 -290274 -245229 -168893 -61318 -69086 -107168 -141163 -153016 -115339 -181260 -203747
16122b03747O5338J55423J05410l3938q7111j64713r7116P2604N9529o710M0826
$$ -203747 -138409 17014 122424 88486 1375 -163338 -260454 -187850 -128321 -135031 -94205
16111i4205k8400l8104l0356O5911K0578n3776P777o6875j5980n9892J6654M4798
$$ -94205 -122605 -160709 -191065 -125154 -104576 -158352 -150575 -217450 -233430 -293322 -276668 -231870
16099b31870J13294N6100K963q5491Q725N1732j2191J3259J37554M3527j9924
$$ -231870 -118576 -62476 -59513 -145004 -136279 -84547 -96738 -83479 54075 97602 77678
16088G7678q969L346p3955J6442k4115K9048q8641j12184j0758J00351L8467K4286
$$ 77678 68709 72055 -1900 14542 -9573 19475 -69166 -181350 -192108 -91757 -53290 -29004
16076b9004J11683r8753j80621J07048p0977m969J27170J38112K0701K5257k05804
$$ -29004 82679 -16074 -196695 -89647 -160624 -165593 -38423 99689 120390 145647 -60157
16065f0157p7279L6543p389K2453r6676M361K8432m2652P0125O8877o0281n1018
$$ -60157 -137436 -100893 -108282 -85829 -182505 -178144 -149712 -192364 -122239 -53362 -113643 -164661
16053a64661L221K154q4004m5398K4520L508N5425J408O2847K4937Q9236J349
$$ -164661 -161440 -159286 -243290 -288688 -264168 -260660 -205235 -203827 -140980 -116043 -26807 -25458
16041b5458Q4384K1102j41177k0698O5891r66m2053M9K6805M0244k1027l1100
$$ -25458 58926 80028 -61149 -81847 -15956 -16922 -58975 -58926 -32121 8123 -12904 -44004
16029d4004Q0251Q2350m2975m9151M428l5231j314n9875m6206K1658J23557j8051
$$ -44004 36247 118597 75622 26471 30899 -4332 -5646 -65521 -111727 -90069 33488 15437
16017A5437j44143N927Q4930N0943O4336O0875J325J4813l1267p6057j14726n7627
$$ 15437 -128706 -122779 -37849 13094 77430 138305 139630 154443 123176 47119 -67607 -125234
16005a25234r229L1050n710p1324N0938L5955K8336o9957k9358l0063M2224L1469
$$ -125234 -134463 -103413 -109123 -180447 -129509 -93554 -65218 -135175 -164533 -194596 -152372 -120903
15993a20903L214J37015J33391k3454k7680l1067q6852l8648N2898n7433n6581
$$ -120903 -117689 19326 152717 129263 101583 70516 -16336 -54984 -2086 -59519 -116100
15982a16100o6292Ln9389K9122L8925M9235J9541J0864M7333M438O5457O7385
$$ -116100 -182392 -182389 -241778 -212656 -173731 -124496 -104955 -94091 -46758 -42320 23137 90522
15970I0522k0333m770l7563j88654m0504J22295o8979r478J15996l8297k8514
$$ 90522 70189 65419 27856 -160798 -201302 -79007 -147986 -157464 -41468 -79765 -108279
15959a08279o4059J4642J21945L2159J9091k2958j6098K8870r1553l7254j7706
$$ -108279 -172338 -157696 -35751 -3592 15499 -7459 -23557 5313 -86240 -123494 -141200
15948a41200R7457K0388l0432K3296J17650m428l7967j4860q7480r9547O9948
$$ -141200 -43743 -23355 -53787 -30491 87159 82731 44764 29904 -57576 -157123 -87175
15937h7175L6006n2282o1824O8559J1293R8824K468j7826J6845r2378p6146p3517
$$ -87175 -51169 -103451 -165275 -96716 -85423 13401 15869 -1957 14888 -77490 -153636 -227153
15925b27153p2648K1205L2770l6102J53126J47394m9624o7547j38015j34536j0704
$$ -227153 -299801 -278596 -245826 -281928 -128802 18592 -31032 -98579 -236594 -371130 -381834
15914c81834J53197J40205R38J8426M8052r0266N4406R6533k6336N9792o9152
$$ -381834 -228637 -88432 -87494 -69068 -21016 -111282 -56876 39657 13321 73113 3961
15903C961j69600k0630R4888O1602p0321q0830R8852N8636Q4924K1729q7382j31
$$ 3961 -165639 -186269 -91381 -29779 -100100 -180930 -82078 -23442 61482 83211 -4171 -4302
15891d302n2051j22230R688J20177J0766l5216j00960j02645N3195R1774P9802
$$ -4302 -56353 -178583 -168895 -48718 -37952 -73168 -174128 -276773 -223578 -131804 -52002
15880e2002L3895p286j13136k8096J52992M4390P2988r8668o8248R2506N5719
$$ -52002 -18107 -25393 -138529 -166625 -13633 30757 103745 5077 -63171 29335 85054
15869H5054P9760n2768j48513m2802M4344P5454J04685k2158m4566o8389l9723
$$ 85054 164814 112046 -36467 -79269 -34925 40529 145214 123056 78490 10101 -29622
15858b9622J08196r815r44K5179n8553k9126J6382k663o9866o8465K0698j1953
$$ -29622 78574 68759 67815 92994 34441 5315 21697 19034 -50832 -119297 -98599 -110552
15846a10552j20830O757P9766o5401O540j07813L5565P9972N6459O2462r5142
$$ -110552 -231382 -224625 -144859 -210260 -203720 -311533 -275968 -195996 -139537 -77075 -172217
15835a72217j35312O9333Q3277N9674M7435N9751l4613L3665j98343j19568n9164
$$ -172217 -307529 -238196 -154919 -95245 -47810 11941 -22672 10993 -187350 -306918 -366082
15824c66082l3007J05500R7877K7115l120N6978N70L3738m3392q6855j03738M3981
$$ -366082 -399089 -293589 -195712 -168597 -171717 -114739 -114169 -80431 -123823 -210678 -314416 -270435
15812b70435O2400J00835o360P0908Q453Q8334L5910p4251j32530o8285R8944
$$ -270435 -208035 -107200 -113560 -42652 -34199 54135 90045 15794 -116736 -185021 -86077
15801h6077N2723K1445m9251p2396q4332J8693J48189j48700p2524O8620K4573
$$ -86077 -33354 -11909 -61160 -133556 -217888 -199195 -51006 -199706 -272230 -203610 -179037
15790a79037L6340J42613J66528r975M3327o5774p8588M2594o1514j1971M9501
$$ -179037 -142697 -84 166444 156469 199796 134022 55434 98028 36514 24543 74044
15779G4044m3899J0622j5577m9100j12289n8923R3381M0250J629J9589o8922J622
$$ 74044 30145 40767 25190 -23910 -136199 -195122 -101741 -61491 -59862 -40273 -109195 -107573
15767a07573N2137j12807j32304r109J01108J12431J38664K0810j34052K1242
$$ -107573 -55436 -168243 -300547 -309656 -208548 -96117 42547 63357 -70695 -49453
15757d9453q1954J8794O1658j1580J8972j01068l1385J73104K1086j26033q604
$$ -49453 -131407 -112613 -50955 -62535 -43563 -144631 -176016 -2912 18174 -107859 -116463
15746a16463J4960o4796n0485Q1468J69211m6163n2935m8072p3617J43J29776
$$ -116463 -101503 -166299 -216784 -135316 33895 -12268 -65203 -113275 -186892 -186749 -56973
15735e6973o838M3932P2288J6875M4118j0187l2692l3083p8998o8942l8876j2681
$$ -56973 -63811 -19879 52409 69284 113402 103215 70523 37440 -41558 -110500 -149376 -162057
15723a62057O2977m8788L2970M6290j13002r0690O7275J00883m2447o7980K0802
$$ -162057 -99080 -147868 -114898 -68608 -181610 -272300 -205025 -104142 -146589 -214569 -193767
15712a93767M558P9041k8373O121P5613K3662M7572l9771J3751L4852q5881O7906
$$ -193767 -189209 -110168 -138541 -132420 -56807 -33145 14427 -25344 -11593 23259 -62622 5284
15700E284M5671L4236K1958j30097j62849J8775K3698j52818n5260L5846O3352
$$ 5284 50955 85191 107149 -22948 -185797 -167022 -143324 -296142 -351402 -315556 -252204
15689b52204R2091J22239Q846o140m2052P9325L4208j47034j05421p716J03086
$$ -252204 -160113 -37874 -29028 -35168 -77220 2105 36313 -110721 -216142 -223858 -120772
15678a20772m496M8852Q9353o4540q4011L5119J1393N058Q5652r4607Q6084J18014
$$ -120772 -125268 -76416 12937 -51603 -135614 -100495 -89102 -84044 1608 -92999 -6915 111099
15666A11099l2389o5018l7023r1655j8739M8806o8489j05358K41811N9699r3088
$$ 111099 78710 13692 -23331 -114986 -133725 -84919 -153408 -258766 -16955 42744 -50344
15655e0344k3199K8313r2816o7283L3506Q9844R5221P1377N3402J1862j0221m7549
$$ -50344 -73543 -45230 -138046 -205329 -171823 -81979 13242 84619 138021 149883 139662 92113
15643I2113r2392J4429J9403J9273j91397j03644P0325k7767o3060Q8836J28693
$$ 92113 -279 14150 33553 52826 -138571 -242215 -171890 -199657 -262717 -173881 -45188
15632d5188n056p6770J09719P6667l4082r6405R0219J83267M9973n6212o0176
$$ -45188 -50244 -127014 -17295 59372 25290 -71115 19104 202371 252344 196132 135956
15621A35956j34303j13504N1048N7627J5160R1848j43256j4299J15135q8440l2330
$$ 135956 1653 -111851 -60803 -3176 11984 103832 -39424 -53723 61412 -27028 -59358
15610e9358r7271M665M6922K2913J01008o6612o9153J42643J18665j03134j01687
$$ -59358 -156629 -151964 -105042 -82129 18879 -47733 -116886 25757 144422 41288 -60399
15599f0399Q8202N8015j03051J883k5918l4684j12411l3199J09241O403J8050
$$ -60399 27803 85818 -17233 -15350 -41268 -75952 -188363 -221562 -112321 -105918 -87868
15588h7868K3885O3385L5030K0891o7226r2928m7761O9000l6420m7917M0387Q1728
$$ -87868 -63983 -598 34432 55323 -11903 -104831 -152592 -83592 -120012 -167929 -127542 -45814
15576d5814J03059o5923p0035L1948O4978J2197l4492q8935k4546L0846J23839
$$ -45814 57245 -8678 -78713 -46765 18213 30410 -4082 -93017 -117563 -86717 37122
15565C7122J02312o7221k0179L0792l0679o4066m4997K612K9709R0333L5099R3740
$$ 37122 139434 72213 52034 82826 52147 -11919 -56916 -54304 -24595 65738 100837 194577
15553A94577l0053l8947o4304p1874k0856j16706K3656J39031m748j24241J4069
$$ 194577 164524 125577 61273 -10601 -31457 -148163 -124507 14524 9776 -114465 -100396
15542a00396P7388J7264J520N6531n7545n0745J58291K2333j6738J5359K9626
$$ -100396 -23008 -5744 -4224 52307 -5238 -55983 102308 124641 107903 123262 152888
15531A52888K9729l1108j36130K0942q8538l2330Q0673N6140K362K9852o4899
$$ 152888 182617 151509 15379 36321 -52217 -84547 -3874 52266 54628 84480 19581
15520A9581j17438j1043l0496L4760K02M334j05287j38281J07656J04123j4621
$$ 19581 -97857 -108900 -139396 -104636 -104434 -100100 -205387 -343668 -236012 -131889 -146510
15509a46510K3605K640l2357j20123o7941m9792M3761K15582J0621l1231r5487
$$ -146510 -122905 -120265 -152622 -272745 -340686 -390478 -346717 -131135 -120514 -151745 -247232
15498b47232n8980J33072J6213o6833R3677R6707j10675m0242K8510M7958q567
$$ -247232 -306212 -173140 -156927 -223760 -130083 -33376 -144051 -184293 -155783 -107825 -116392
15487a16392M9147N5447K4039n7873l3884p1031J3428k5873p292M2068k6973K801
$$ -116392 -67245 -11798 12241 -45632 -79516 -150547 -137119 -162992 -170284 -128216 -155189 -152388
15475a52388L2526J44227o335j3627K4352k3925j54044P7396J1102k2690J03057
$$ -152388 -119862 24365 18030 4403 28755 4830 -149214 -71818 -60716 -83406 19651
15464A9651r529j8907N9416L1707n7603l5556J290L9647j9778J6323l8487J08135
$$ 19651 10122 -8785 50631 82338 24735 -10821 -9531 30116 10338 26661 -11826 96309
15452I6309n081j3523J1834o82M3702m1962k5257o9314o3801r3212q3632L3429
$$ 96309 91228 77705 89539 88857 132559 90597 65340 -3974 -67775 -160987 -244619 -211190
15440b11190J11988Q8052p329j6606Q0070R412J029o3091m2525M3434n5928j02015
$$ -211190 -99202 -11150 -18479 -35085 44985 54397 55426 -7665 -50190 -6756 -62684 -164699
15428a64699L1959R0089m6843j75534J18806R6911O0260N4390p838R523r3333
$$ -164699 -132740 -42651 -89494 -265028 -146222 -49311 10949 65339 57501 67024 -26309
15417b6309j00944p6902k1141l3166P9306P4819K643M8446l0829o0200O140r757
$$ -26309 -127253 -204155 -225296 -258462 -179156 -104337 -101694 -53248 -84077 -144277 -138137 -147894
15405a47894L1958j0122L6234K1206q5356q9968l5170J12933J70549k1156Q1103
$$ -147894 -115936 -126058 -89824 -68618 -153974 -243942 -279112 -166179 4370 -16786 64317
15394F4317Q1362r6718l3880J48191M5965k5188r83j13220n4417L2810j2892l990
$$ 64317 145679 48961 15081 163272 209237 184049 183066 69846 15429 48239 35347 31357
15382C1357n8027J22763J3827m8984l815P5365K7634q2525n9621K4930p3373L9994
$$ 31357 -26670 96093 109920 60936 57121 132486 160120 77595 17974 42904 -30469 9525
15370I525O5732N2383J6473r0891J2146K6163j03628o924N838q143R482N135J8690
$$ 9525 75257 127640 144113 53222 65368 91531 -12097 -19021 -13183 -21326 -11844 -6709 11981
15357A1981l1592J8451J36396J22316R6227K9019O9034N6638n396k8234j09822
$$ 11981 -19611 -1160 135236 257552 353779 382798 451832 508470 503074 474840 365018
15346C65018j40749j69308p0532M4072n0224q2695r7970N159J19733Q5985J06084
$$ 365018 224269 54961 -15571 28501 -21723 -104418 -202388 -197229 -77496 8489 114573
15335A14573L4764q6009j06998j00420J3865p6581P2902O9255l395n854k5928
$$ 114573 149337 63328 -43670 -144090 -130225 -206806 -133904 -64649 -68044 -73898 -99826
15324i9826o6919M4908j20647O0410J65183R7146j9794j26652k01815q5734N8528
$$ -99826 -166745 -121837 -242484 -182074 -16891 80255 60461 -66191 -268006 -353740 -295212
15313b95212O8044N4322j09005n2574j819J118J01905J04480L2820n9414j11384
$$ -295212 -227168 -172846 -281851 -334425 -336244 -335126 -233221 -128741 -95921 -155335 -266719
15302b66719p678K7938J23436N7955M3795L4159k5228j28465q2362J8005J82134
$$ -266719 -274397 -246459 -123023 -65068 -21273 12886 -12342 -140807 -223169 -205164 -23030
15291b3030J38962p4826j24894l7368j26792l0445Q1294N5685q5424j8464N6208
$$ -23030 115932 41106 -83788 -121156 -247948 -278393 -197099 -141414 -226838 -245302 -189094
15280a89094j3141N6809L3177o608j3794J5008j9708k0417K4438N3521L8470N93
$$ -189094 -202235 -145426 -112249 -118857 -132651 -117643 -137351 -157768 -133330 -79809 -41339 -40746
15268d0746j80439o7381M0890K6110J3308J26217Q2190p253j9801p421O3649J01077
$$ -40746 -221185 -288566 -247676 -221566 -208258 -82041 149 -7104 -26905 -34326 29323 130400
15256A30400m5965m7507m420o4775l7264M0862J43742N7572m3594r6038j12298
$$ 130400 84435 36928 32508 -32267 -69531 -28669 115073 172645 129051 33013 -79285
15245g9285n5985l6744l7002R6989R2956M8890j02991p6755R915o4223O2143O6335
$$ -79285 -135270 -172014 -209016 -112027 -19071 29819 -73172 -149927 -140012 -204235 -142092 -75757
15233g5757k7486l6137R5278M8969N0832J4529L3922N3702j3973j28370m5601
$$ -75757 -103243 -139380 -44102 4867 55699 70228 104150 157852 143879 15509 -30092
15222c0092j4192M8010J18434L4363O435n7465j28691j60748o8576L3503K196
$$ -30092 -44284 3726 122160 156523 162958 105493 -23198 -183946 -252522 -219019 -216823
15211b16823l121k5074M717R5341P5846k3615k0625N8919l898n3534o1173j6659
$$ -216823 -219944 -245018 -240301 -144960 -69114 -92729 -113354 -54435 -58333 -111867 -173040 -189699
15199a89699J12862M9078o2245n7941K6616M721p822q4077m2282L3182N7392k0037
$$ -189699 -76837 -27759 -90004 -147945 -121329 -116608 -124430 -208507 -250789 -217607 -160215 -180252
15187a80252k2092K439N1437J01700N240j6970O0364N704q9162j9091q6137p0814
$$ -180252 -202344 -199905 -148468 -46768 -41528 -58498 1866 7570 -81592 -100683 -186820 -257634
15175b57634R049J7485Q1873j9831k2379N0972Q0918k3062j46113q8872k5443
$$ -257634 -248585 -231100 -149227 -169058 -191437 -140465 -59547 -82609 -228722 -317594 -343037
15164c43037J32716J18170k8939l4281P5021O3907O383M370J3097P1343l0078
$$ -343037 -210321 -92151 -121090 -155371 -80350 -16443 -10060 -5690 7407 78750 48672
15153D8672j06005K7957o471n7540r6090O8173P6707j06870o7422P6703O6209
$$ 48672 -57333 -29376 -35847 -93387 -189477 -121304 -44597 -151467 -218889 -142186 -75977
15142g5977Q3116J16105M0458k6597q68p6305p3496l7753N1166n9987J4827P1586
$$ -75977 7139 123244 163702 137105 136237 59932 -13564 -51317 -151 -60138 -45311 26275
15130B6275J4879r520r3932r3187J2379q5645J3688J28802J11407P2705j9979
$$ 26275 41154 31634 -62298 -155485 -143106 -228751 -215063 -86261 25146 97851 77872
15119G7872r448L4578n5744k8336M103L8171J11300J28909o6112j39077q5815
$$ 77872 68424 103002 47258 18922 23025 61196 172496 301405 235293 96216 10401
15108A0401j00360l7456M6841N5316J8053r814J9671k4506J7195l8776l799L0247
$$ 10401 -89959 -127415 -80574 -25258 -7205 -17019 2652 -21854 -4659 -43435 -47234 -16987
15096a6987J5191j08286j21989M3793K0573R9250N4158n2666j66763n0080N5611
$$ -16987 -1796 -110082 -232071 -188278 -167705 -68455 -14297 -66963 -233726 -283806 -228195
15085b28195J16279M9011K8800l3721J0185o142L2033j1705j06481M5989J5877
$$ -228195 -111916 -62905 -34105 -67826 -57641 -63783 -31750 -43455 -149936 -103947 -88070
15074h8070J9309M2132m3503m9458L2350N1105L0572q5498P5129l4801j1002p8144
$$ -88070 -68761 -26629 -70132 -119590 -87240 -36135 -5563 -91061 -15932 -50733 -61735 -139879
15062a39879n3896J0815j6106K4983J62217N6659Q0402K0431Q5032j84562m8371
$$ -139879 -193775 -182960 -199066 -174083 -11866 44793 125195 145626 230658 46096 -2275
15051b275l2247K6301n1339m064p12j600M5503M3694L0261n6309l6276j6255L8088
$$ -2275 -34522 -8221 -59560 -63624 -64336 -65936 -20433 23261 53522 -2787 -39063 -55318 -17230
15038a7230J62311M3545m4636k1836m2677n4756o1240n958K8531J06764M8284
$$ -17230 145081 188626 143990 122154 79477 24721 -36519 -42477 -13946 92818 141102
15027A41102m4823m0615N366M1647j0714j44931O019j3332p5206l9288m615p064
$$ 141102 96279 55664 61030 102677 91963 -52968 -46949 -60281 -135487 -174775 -179390 -186454
15015a86454N242l0078M2800N8588Q7831O1951N9655J01431m2780n1758j00750
$$ -186454 -181212 -211290 -168490 -109902 -22071 39880 99535 200966 158186 106428 5678
15004E678q3342Q116l2266o7073K8898J12536R5081o1355q0601O8831K6704n5248
$$ 5678 -77664 -69548 -101814 -168887 -139989 -27453 67628 6273 -74328 -5497 21207 -34041
14992c4041J5822j6533j6277K0455P7266j5712P268n0743j17365j04438J29038
$$ -34041 -18219 -34752 -51029 -30574 46692 30980 38248 -12495 -129860 -234298 -105260
14981a05260J50441n1214p132m2874m5338N163n957J09057M2790k9633k4758R206
$$ -105260 45181 -6033 -13165 -56039 -101377 -96214 -102171 6886 49676 20043 -4715 4491
14969D491r292P4884Q4550L1703o2153n8656k7907n4638j22182M7373O4569j6941
$$ 4491 -4801 70083 154633 186336 124183 65527 37620 -17018 -139200 -91827 -27258 -44199
14957d4199r9700m1477J1504o978N7806m6470n5603K8996J21642J7054o5965J01796
$$ -44199 -143899 -185376 -173872 -180850 -123044 -169514 -225117 -196121 -74479 -57425 -123390 -21594
14945b1594Q0946K2017l2754N8965J496j72264l3272M6588N040M2984M7028N7581
$$ -21594 59352 81369 48615 107580 109076 -63188 -96460 -49872 -44832 -1848 45180 102761
14933A02761l5911N8590K7009j75472j9793R9614M9451M5423o4414j32327l7444
$$ 102761 66850 125440 152449 -23023 -42816 56798 106249 151672 87258 -45069 -82513
14922h2513J09157O4017o0326j83546R2660J5793M9551R0171n066l6943j17183
$$ -82513 26644 90661 30335 -153211 -60551 -44758 4793 94964 89898 52955 -64228
14911f4228l3024k7116J1096L0055n8764j33455L5461N6342J55688J34348q346
$$ -64228 -97252 -124368 -113272 -83217 -141981 -275436 -239975 -183633 -27945 106403 98057
14900I8057j47654r8410J354R0125j18197M5489K53261k6133k2299n5541K4082
$$ 98057 -49597 -148007 -146653 -56528 -174725 -129236 124025 97892 75593 20052 44134
14889D4134q028j3497p5566q9645p3592L9101L4262J04783N7246n3674q5816P4643
$$ 44134 36106 22609 -52957 -142602 -216194 -177093 -142831 -38048 19198 -34476 -120292 -45649
14877d5649J62142L4967L3048k8255n7147L063J7677o0478j0432j20731o2238
$$ -45649 116493 151460 184508 156253 99106 102169 119846 59368 48936 -71795 -134033
14866a34033Q2858m039M7154J05220P7093k7975J6500J16207r6275r0578k0399
$$ -134033 -51175 -55214 -8060 97160 174253 146278 162778 278985 182710 92132 71733
14855G1733K3908N1591r875j221k5117r9718j8558L0538m9493N4467J2265L4212
$$ 71733 95641 147232 137357 136136 111019 11301 -7257 23281 -26212 28255 40520 74732
14843G4732J25252P694p2079k05503j31121N2334N6158j53203j17270Q4148J29203
$$ 74732 199984 207678 135599 -69904 -201025 -148691 -92533 -245736 -363006 -278858 -149655
14832a49655L0399J35486J31580P665o4075p8301Q541R710j9041n9564o1511N1874
$$ -149655 -119256 16230 147810 155475 91400 13099 21640 31350 12309 -47255 -108766 -56892
14820e6892k8107R4656J0945j19320k1247Q1289J6914j3338o551l3834q2082r0346
$$ -56892 -84999 9657 20602 -98718 -119965 -38676 -21762 -35100 -41651 -75485 -157567 -247913
14808b47913Q9077J02275m1016O362J8306r4227K1714J14037J25972J9833j18828
$$ -247913 -158836 -56561 -97577 -91215 -72909 -167136 -145422 -31385 94587 114420 -4408
14797d408j00334q7227J31960J40304p1299J2645J9312J7522l1718K084L4474
$$ -4408 -104742 -191969 -60009 80295 8996 21641 40953 58475 26757 28841 63315
14786F3315P1330J6497p5661j10508L925m5281j6114q581r123K1142j1801j31940
$$ 63315 134645 151142 75481 -35027 -31102 -76383 -92497 -101078 -110201 -89059 -100860 -232800
14774b32800j3009J27737l7887k5042m1533M0973P6910J86189J75836K3745o5045
$$ -232800 -245809 -118072 -155959 -181001 -222534 -181561 -104651 81538 257374 281119 216074
14763B16074k3882p0177o8312K9323M8901j25662k6789M0534m5738o7274j44905
$$ 216074 192192 122015 53703 83026 131927 6265 -20524 20010 -25728 -93002 -237907
14752b37907L3291M2788J4540p3941K2823m4347P2633R2442R4014J13697j0086
$$ -237907 -204616 -161828 -147288 -221229 -198406 -242753 -170120 -77678 16336 130033 119947
14741A19947J03172J9021m4009m2895j2790J0555L2665l4183n377m3064j18781
$$ 119947 223119 242140 198131 155236 142446 153001 185666 151483 146106 103042 -15739
14730a5739k1519k8433J6923j6028Q4299p88K9288L3822r3045M472j2114m4027
$$ -15739 -37258 -65691 -48768 -64796 19503 18715 48003 81825 -11220 -6748 -18862 -62889
14718f2889N1522K16J04421J01862K6368O5708J07807J09220R6785R2405L99779
$$ -62889 -11367 -11151 93270 195132 221500 287208 395015 504235 601020 693425 1093204
14707A093204M25744M52614L13218J65081J45973J62147L0160l68862l56953m33700
$$ 1093204 1518948 1971562 2284780 2449861 2595834 2757981 2788141 2419279 2062326 1628626
14697A628626m24841k90958r8143j24617k59925j17597P598l8282q1085p0904
$$ 1628626 1203785 912827 814684 690067 430142 312545 320143 281861 200776 129872
14687A29872p4986Q8415j0896r7936J8249R0189o1988j05207j35500L8205M7095
$$ 129872 54886 143301 132405 34469 52718 142907 80919 -24288 -159788 -121583 -74488
14676g4488R5115M8896o0436k7196J0525J01803L5019r2132p5278p559N3252q9852
$$ -74488 20627 69523 9087 -18109 -7584 94219 129238 37106 -38172 -45731 7521 -82331
14664h2331m9644n0832p2124J19756k2112L6000K82881M5952n0207p1353p4612
$$ -82331 -131975 -182807 -254931 -135175 -157287 -121287 161594 207546 157339 85986 11374
14653A1374j5405r686K0209L7614o4557k8326p283o0831r5721N5385J23361M108
$$ 11374 -4031 -13717 6492 44106 -20451 -48777 -56060 -116891 -212612 -157227 -33866 -29758
14641b9758j7987K3124O5919J03763O9979j34679m2622J0825j6059q286M8249
$$ -29758 -47745 -24621 41298 145061 215040 80361 37739 48564 32505 24219 72468
14630G2468O6609n5788j39935N6668J84414l5433o9568o3363j941L5856k2885
$$ 72468 139077 83289 -56646 22 184436 149003 79435 16072 14131 49987 27102
14619B7102j07685N569N7521M5520M202P6208k6849J21573o5903j45947J9723
$$ 27102 -80583 -75014 -17493 28027 32229 108437 81588 203161 137258 -8689 11034
14608A1034j682J8431p0748j9415J3085N1146K0893Q8867J9808m6484K7954Q0493
$$ 11034 9352 27783 -42965 -62380 -49295 1851 22744 111611 131419 84935 112889 193382
14596A93382M1523m7466j23369j255L2974r933L7261j9198r410K6201O5818l9293
$$ 193382 234905 187439 64070 62815 95789 85856 123117 103919 94509 120710 186528 147235
14584A47235j15433m1568O4058Q1671M4266q6054K1097L6072j6836j09014K7217
$$ 147235 31802 -9766 54292 135963 180229 94175 115272 151344 134508 25494 52711
14573E2711n6649k0799o852m5988p961N4120L9871J2174J1745j969J02483p9421
$$ 52711 -3938 -24737 -31589 -77577 -85538 -31418 8453 20627 32372 30403 132886 53465
14561E3465q9001p448J34037j2607o5308j3430O9299P4014o9274j0127Q6114R6558
$$ 53465 -35536 -42984 91053 78446 13138 -292 69007 143021 73747 63620 149734 246292
14549B46292K653m7735q7964J420K4014l0441l4925O9199l7425J1328K8837n0434
$$ 246292 248945 201210 113246 114666 138680 108239 73314 142513 105088 116416 145253 94819
14537I4819M0992M7484M3636K1066j7055N681m5399K4279p3503o3771p696p7906
$$ 94819 135811 183295 226931 247997 230942 236623 191224 215503 142000 78229 70533 -7373
14525g373N7288N7831n8526J04667M944L1502P6908k9459k7827m633o5245m3941
$$ -7373 49915 107746 49220 153887 158831 190333 267241 237782 209955 205322 140077 96136
14513I6136q2448L9538L9953n0537M9681r5855L2450N0162J11749M5805l4318
$$ 96136 13688 53226 93179 42642 92323 -3532 28918 79080 190829 236634 202316
14502B02316O9817j32386r1374P6652K4323j12471L1104J075M9402K7708q036
$$ 202316 272133 139747 48373 125025 149348 36877 67981 69056 118458 146166 138130
14491A38130M2088n8868O2905m2122N806M5736J19657P5847p4853l6849m033J09489
$$ 138130 180218 121350 184255 142133 147939 193675 313332 389179 314326 277477 273444 382933
14479C82933O7832K0303k4934N0721m9357o5418J3643k8252j06661O3098L1191
$$ 382933 450765 471068 446134 496855 447498 382080 395723 367471 260810 323908 355099
14468C55099L5085o2750j7526M1295K4269J22735R2990j28771o1421r1689q606
$$ 355099 390184 327434 309908 351203 375472 498207 591197 462426 401005 309316 300710
14457C00710R6863R3888J3766j82191j30386K1085K9968j4931l3769j5605j79085
$$ 300710 397573 491461 505227 323036 192650 213735 243703 228772 195003 179398 313
14446C13o8754L9694N9152R8692L4799K5558j2470r3802N1388l4368L8186J0835
$$ 313 -68441 -28747 30405 129097 163896 189454 176984 83182 134570 100202 138388 149223
14434A49223n2469r5708o7283R3753J31133M6673k2365j03976r1352o4985l9120
$$ 149223 96754 1046 -66237 27516 158649 205322 182957 78981 -12371 -77356 -116476
14423a16476J27269J31587L9202k0931J15609O5433R186N2798P8723l702L306
$$ -116476 10793 142380 181582 160651 276260 341693 350879 403677 482400 478698 482004
14412D82004m5772j58302j83658m0089J21403R4080J12547K5303o8131m7027p6456
$$ 482004 436232 277930 94272 54183 175586 269666 382213 407516 339385 292358 215902
14401B15902m4112k3718M7709P0426J17980r2167k5977N8953m3250K6822L1179
$$ 215902 171790 148072 195781 266207 384187 292020 266043 324996 281746 308568 339747
14390C39747m0968L5579J33615N919M2595J8663j45933L5165j6117j5562r7142
$$ 339747 298779 334358 467973 473892 516487 535150 389217 424382 408265 392703 295561
14379B95561q7619J12358N6179q6264j41226R091o03q060q0300L8416R0821Q9052
$$ 295561 207942 320300 376479 290215 148989 158080 157477 149417 69117 107533 198354 287406
14367B87406J4204M6728K1051Q6759j07190l4040P792K6746q2588O4162J08368
$$ 287406 301610 348338 369389 456148 348958 314918 322710 349456 266868 331030 439398
14356D39398O3791J20305K10657K17286P6023p446J33695M589O8961m1955j61534
$$ 439398 503189 623494 834151 1051437 1127460 1120014 1253709 1258298 1327259 1285304 1123770
14345A123770j53579j27720l6742j09349m526n5060j36622r4293j3498O9284J23986
$$ 1123770 970191 842471 805729 696380 691854 636794 500172 405879 392381 461665 585651
14334E85651j1179n7040k1031J00054n4732o5666k3769L903L4521k4033o9415
$$ 585651 574472 517432 496401 596455 541723 476057 452288 456191 490712 466679 397264
14323C97264q1182p2733r550j40P9463L1634P2117O7101m3460Q7059J21142o1206
$$ 397264 316082 243349 233799 233659 313122 344756 416873 483974 440514 527573 648715 587509
14311E87509R7768n1210p8122O2514O9567R5548M8869L4208m9714K4937L4562
$$ 587509 685277 634067 555945 618459 688026 783574 832443 866651 816937 841874 876436
14300H76436K16441p9161o1874J2712M027L8582M6435N3180J32427P7070N5786
$$ 876436 1092877 1013716 951842 964554 968581 1007163 1053598 1106778 1239205 1316275 1372061
14289A372061Q0605Q2174n2590r9792N3209J05316k0876o7023K7456O5427Q8318
$$ 1372061 1452666 1534840 1482250 1382458 1435667 1540983 1520107 1453084 1480540 1545967 1634285
14278A634285L8257k8205M6707J37307N4713N8145Q7138R0114O1533J22461J02091
$$ 1634285 1672542 1644337 1691044 1828351 1883064 1941209 2028347 2118461 2179994 2302455 2404546
14267B404546K03716K20937J76804L40235L76347M61893N50359O70176Q28451
$$ 2404546 2608262 2829199 3006003 3346238 3722585 4184478 4734837 5405013 6233464
14258F233464J176606J434453J549899J262377P12469j0797m96137o12252o21931
$$ 6233464 7410070 8844523 10394422 11656799 12369268 12358471 11862334 11250082 10628151
14249A0628151k44579L02348Q73283R84918J092989J292825J774386K388454K549308
$$ 10628151 10383572 10685920 11559203 12544121 13637110 14929935 16704321 19092775 21642083
14240B1642083K682851K841591L279187M237045N383774O487467Q744973J2811649
$$ 21642083 24324934 27166525 30445712 34682757 40066531 46553998 55298971 68110620
14232F8110620K0261190L4154004N8368893R0245079R9168462O3874406L7120558
$$ 68110620 88371810 122525814 180894707 271139786 370308248 434182654 471303212
14225D71303212L0935647K3740414p868854m6591630o2280773p8839109q6686477
$$ 471303212 502238859 525979273 518110419 471518789 409238016 330398907 243712430
14218B43712430p5003624n2708300l2825402k0228007j3057303r118761o626546
$$ 243712430 168708806 116000506 83175104 62947097 49889794 40771033 34144487
14211C4144487m651195l396089k996738k693535k423907k281977j930441j669377
$$ 34144487 29493292 26097203 23100465 20406930 17983023 15701046 13770605 12101228
14203A2101228j491010j249058j166317j108529r78685q53639o02832n46870l67060
$$ 12101228 10610218 9361160 8194843 7086314 6107629 5253990 4651158 4104288 3737228
14194C737228l57240k99163q0749j60478j72543k83375q2441j58732j01000j28359
$$ 3737228 3379988 3080825 3000076 2839598 2667055 2383680 2301239 2142507 2041507 1913148
14184A913148j61065q9410O2024Q4667R420p0595n0995j12447o7263k61548j30295
$$ 1913148 1752083 1662673 1724697 1809364 1818784 1748189 1697194 1584747 1517484 1255936 1125641
14173A125641L5640k2396l761r3520j53939r8193j27653o6877K12478R1405k4995
$$ 1125641 1161281 1138885 1135124 1041604 887665 789472 661819 594942 807420 898825 873830
14162H73830k34166j24414j07491M915J04098M6145L9214P1088O2780o20k6905
$$ 873830 639664 515250 407759 412674 516772 562917 602131 673219 735999 735379 708474
14151G08474j5993j9853m2390l8674p2633l4179O7679k1334J0317L5037j08514
$$ 708474 692481 672628 630238 591564 518931 484752 552431 531097 541414 576451 467937
14140D67937r0667J02569r5836L1887l3065j14978K3275M0450P8742M011j1340
$$ 467937 377270 479839 384003 415890 382825 267847 291122 331572 410314 414325 402985
14129D02985r7113O3453R2479k7644m8379M6629j34044N629o0692k1307n9145
$$ 402985 305872 369325 461804 434160 385781 432410 298366 303995 243303 221996 162851
14118A62851L3758J44286p1067r3971O7804K4197l9658L9052O3320m7906q0701
$$ 162851 196609 340895 269828 175857 243661 267858 228200 267252 330572 282666 201965
14107B01965j4653o0796Q9127N9659q0350O3336P7992J0351n0759P1164J49718
$$ 201965 187312 126516 215643 275302 194952 258288 336280 346631 295872 367036 516754
14096E16754N2809o8277K5659M496O5869K3629j98925m8144l7826j5343m0551
$$ 516754 569563 501286 526945 531441 597310 620939 422014 373870 336044 320701 280150
14085B80150Q6250n1679o3059n348o0654J6231l4310o4275M4960J0340J2011o9330
$$ 280150 366400 314721 251662 246314 185660 201891 167581 103306 148266 158606 170617 101287
14073A01287o5453J8501L4727n8731l3054Q1231K2643o0048M5574N020j23724
$$ 101287 35834 54335 89062 30331 -2723 78508 101151 41103 86677 91697 -32027
14062c2027j46161Q3576K04544J21494L9240J7710P232j3813j12405m3495o5743
$$ -32027 -178188 -94612 109932 231426 270666 288376 295608 281795 169390 125895 60152
14051F0152K3064K6450O2300j8794j15661q5877j8810q0455O216O8795P621m2879
$$ 60152 83216 109666 171966 153172 37511 -48366 -67176 -147631 -141415 -72620 -64999 -107878
14039a07878N1872J1063m1369k081o4642l9258L1801J41405J9797p6108J3950
$$ -107878 -56006 -44943 -86312 -88393 -153035 -192293 -160492 -19087 710 -75398 -61448
14028f1448O7964p9383q0074O9621J10200o9206j01083J496R1729J33207K0880
$$ -61448 6516 -72867 -152941 -83320 26880 -42326 -143409 -141913 -50184 83023 103903
14017A03903j56766j26347K8177J40896M6934Q7557K4720l4290p3248q8860l4124
$$ 103903 -52863 -179210 -151033 -10137 36797 124354 149074 114784 41536 -47324 -81448
14006h1448m702J2085J4941p2850M5374R0443o6781k2141p7274n8617o6124P4660
$$ -81448 -86150 -74065 -59124 -131974 -86600 3843 -62938 -85079 -162353 -220970 -287094 -212434
13994b12434O4491P6942k9070j64748J3233J90137P9641j46231o5672M4524J62629
$$ -212434 -147943 -71001 -100071 -264819 -251586 -61449 18192 -128039 -193711 -149187 13442
13983A3442k939k7621M3688l4171J8582l5959M6304L8490k5884j61738j20988
$$ 13442 10503 -17118 26570 -7601 10981 -24978 21326 59816 33932 -127806 -248794
13972b48794j4665R0365J60905L0640q7917j571Q8165Q631n7773R7499J30585
$$ -248794 -263459 -173094 -12189 18451 -69466 -71037 17128 25759 -32014 65485 196070
13961A96070k3722o6909J5475j05773o8094L2379n8139j58283M3955n0050j38550
$$ 196070 172348 105439 120914 15141 -52953 -20574 -78713 -236996 -193041 -243091 -381641
13950c81641O8503J45809l5080m3355Q1398j6167j04135J0402O1050O2997R6855
$$ -381641 -313138 -167329 -202409 -245764 -164366 -180533 -284668 -274266 -213216 -150219 -53364
13939e3364K5782P5429m5150o2642l6522J12746K4074j0477O6867j9785m5834
$$ -53364 -27582 47847 2697 -59945 -96467 16279 40353 29876 96743 76958 31124
13928C1124q6479o7144O151j4995k6318P7490M5706j55556k386N577j3872N0508
$$ 31124 -55355 -122499 -116348 -131343 -157661 -80171 -34465 -190021 -192407 -186830 -200702 -150194
13916a50194N2302M7728J2144l7062Q0436J42517O723j52247k5618p682q1053
$$ -150194 -97892 -50164 -38020 -75082 5354 147871 154594 2347 -23271 -30953 -112006
13905a12006j1013J1682r9236K2721n3600k605K15494R3965k0694J3115j3152
$$ -112006 -123019 -111337 -210573 -187852 -241452 -244057 -28563 65402 44708 57823 44671
13894D4671j9306P3712m7879r8309j07191p2719L6002J16371l2570q8105M2011
$$ 44671 25365 99077 51198 -47111 -154302 -227021 -191019 -74648 -107218 -195323 -153312
13883a53312R8679L9882n5224L8495K9794l7854l1941N2766R0707N7608K1148
$$ -153312 -54633 -14751 -69975 -31480 -1686 -39540 -71481 -18715 71992 129600 150748
13872A50748q368l7884m8861q6323o0139q3569N0126P5780M99Q7363l7462O483
$$ 150748 142380 104496 55635 -30688 -90827 -174396 -124270 -48490 -47991 39372 1910 8393
13860H393J09311P768q5368m3587o8272m7070l4279K9799k1522K5152N5493R617
$$ 8393 117704 125472 40104 -3483 -71755 -118825 -153104 -123305 -144827 -119675 -64182 -54565
13848e4565J3893J902K834N7082L9845j9106q9680l7160J8833k9464r0908l3046
$$ -54565 -40672 -38770 -35936 21146 60991 41885 -47795 -84955 -66122 -95586 -186494 -219540
13836b19540n6812m6414L0874J01805l2202L3332l1448k0772J63890O4807p3193
$$ -219540 -276352 -322766 -291892 -190087 -222289 -188957 -220405 -241177 -77287 -12480 -85673
13825h5673R0349J04549J9173K6516l7985q5280K7899j7758j75315M8653M0356
$$ -85673 4676 109225 128398 154914 116929 31649 59548 41790 -133525 -84872 -44516
13814d4516J2743Q4246O2014j39634l1392L6623R1506r8291j44271m2604n3863
$$ -44516 -31773 52473 114487 -25147 -56539 -19916 71590 -26701 -170972 -213576 -267439
13803b67439l344m9202K1763k8987M0596m0132l7311P1604Q6807P8176N4724Q1923
$$ -267439 -270783 -319985 -298222 -327209 -286613 -326745 -364056 -292452 -205645 -127469 -72745 9178
13791I178J7701r0488K0695R5511L2316L3848k6058Q1854K8312j68522p9665Q301
$$ 9178 26879 -63609 -42914 52597 84913 118761 92703 174557 202869 34347 -45318 -37017
13779c7017J3925O2780k9486K9733J11617j09804q6617M8658M3737M4992o0212
$$ -37017 -23092 39688 10202 39935 151552 41748 -44869 3789 47526 92518 32306
13768C2306o5790M833j4002R0413P6063j75884q4415J39808r275l469J6253k84
$$ 32306 -33484 -28651 -42653 47760 123823 -52061 -136476 3332 -5943 -9412 6841 6557
13756F557L8615P874M0579O500K1995J01976p6039j08765J58614K33528J18030
$$ 6557 45172 53046 93625 100125 122120 224096 148057 39292 197906 431434 549464
13745E49464K29517L58409N28052M17550K37836J94024P7029K4478j17648k52569
$$ 549464 778981 1137390 1665442 2082992 2320828 2514852 2591881 2616359 2498711 2246142
13735B246142l33878m74741n00364m79811r1106K4757j26064j21702j85986k3738
$$ 2246142 1912264 1437523 937159 457348 366242 390999 264935 143233 -42753 -66491
13725f6491j989Q2878j03374p9833J28266M8302j3302J12018J35180m8841j56532
$$ -66491 -68480 14398 -88976 -168809 -40543 7759 -5543 106475 241655 192814 36282
13714C6282M2552r8504k3995J03032Q3209m7860N8110j08496p0600N4209M7414
$$ 36282 78834 -19670 -43665 59367 142576 94716 152826 44330 -26270 27939 75353
13703G5353K4967j8119J01831J21299r490r6058P7572N1124K0276k2574M4868
$$ 75353 100320 82201 184032 305331 295841 199783 277355 328479 348755 326181 371049
13692C71049j8226j29354o7010p5322R350p3737m9312J21099Q7559J30345J3160
$$ 371049 352823 223469 156459 81137 90487 16750 -32562 88537 176096 306441 319601
13681C19601L2113j1872Q4022L7644k3475N9890K31717J93369J48794K64846M01760
$$ 319601 351714 339842 423864 461508 438033 497923 729640 923009 1071803 1336649 1738409
13670A738409Q46117P47004N63434N43494J37740j93198j31226l0408j0788J60153
$$ 1738409 2584526 3331530 3894964 4438458 4576198 4383000 4251774 4221366 4210578 4370731
13660D370731J69835j91240n47417o17660o11069o68884n57605l25819k49404
$$ 4370731 4540566 4349326 3801909 3184249 2573180 1904296 1346691 1020872 771468
13651G71468k73379j42985j24186o5239P036l5413l2834O1841J59249J027j09171
$$ 771468 498089 355104 230918 165679 172715 137302 104468 166309 325558 326585 217414
13640B17414j73935m1255m3731L5762r228L629Q3163J00235N1376k7213K5299
$$ 217414 43479 2224 -41507 -5745 -14973 -11344 71819 172054 223430 196217 221516
13629B21516j33903j37135M9451M1417P7453L8641p9353m0885j6738Q285J07277
$$ 221516 87613 -49522 -71 41346 118799 157440 78087 37202 20464 28749 136026
13618A36026m1768K6350q5905q4589n0785K0059r768p7398P8670J69848L1675
$$ 136026 94258 120608 34703 -49886 -100671 -80612 -90380 -167778 -89108 80740 112415
13607A12415j0316J6552L3127r284r2131j00335J4464P9109q3544m8285J44928
$$ 112415 102099 118651 151778 142494 50363 -49972 -35508 43601 -39943 -88228 56700
13596E6700O2853q7424J5863l5887K319K7819L557q3904o5414L8390J00347P1224
$$ 56700 119553 32129 47992 12105 14424 42243 45800 -38104 -103518 -65128 35219 106443
13584A06443k5035n35l1898r2850j55640j27519n645J66255J83472k5035r9474
$$ 106443 81408 80873 48975 -43875 -199515 -327034 -332679 -166424 17048 -7987 -107461
13573a07461O6779N3982m5069K9721R0426O6390k5174j94879j27646l3396K4246
$$ -107461 -40682 13300 -31769 -2048 88378 154768 129594 -65285 -192931 -226327 -202081
13562b02081J02961R5672q848l0695L2293J7629K7077L487n5937j20658J36292
$$ -202081 -99120 -3448 -12296 -42991 -10698 6931 34008 37495 -18442 -139100 -2808
13551b808N2325j6106Q6320J07383K774p8720j51289J0964J7753O0557p4972q1056
$$ -2808 49517 33411 119731 227114 229888 151168 -121 10843 28596 89153 14181 -66875
13539f6875j0736K2781O6750N7689J3857o5519j5151P4456Q879K7388M5340n9619
$$ -66875 -77611 -54830 11920 69609 83466 17947 2796 77252 86131 113519 158859 99240
13527I9240j804O0976n0612L9138J645M9296K1681M0879N1423J5245J76183O1649
$$ 99240 97436 158412 107800 146938 148583 197879 219560 260439 311862 327107 503290 564939
13515E64939R3124J18363j8326m475j3560k2446J18500k0126p7352J6850o2180
$$ 564939 658063 776426 758100 753625 740065 717619 836119 815993 738641 755491 693311
13504F93311l1109q5074r6168j00943j38127n4648J24475N087k07029o1360k5324
$$ 693311 662202 577128 480960 380017 241890 187242 311717 316804 109775 48415 23091
13493B3091J04034M3823k8918p0699r0355J18217J15794o2646j31255p4663p2795
$$ 23091 127125 170948 142030 71331 -19024 99193 214987 152341 21086 -53577 -126372
13482a26372K7221J26933J01645n8724j20583k3370J41043J06642L7419k2860
$$ -126372 -99151 27782 129427 70703 -49880 -73250 67793 174435 211854 188994
13472A88994k139j8493k8447k6258l6783R0288J80525R580L1700k1986n8105o9718
$$ 188994 186855 168362 139915 113657 76874 167162 347687 357267 388967 366981 308876 239158
13460B39158O0840N3123j45225j00016R4058M1550J8948o9608L0531J3279m6042
$$ 239158 299998 353121 207896 107880 201938 243488 262436 192828 223359 236638 190596
13449A90596Q6490m7095j15065M14N5442j24767j16175N1578O2198N1943Q9502
$$ 190596 277086 229991 114926 115340 170782 46015 -70160 -18582 43616 95559 185061
13438A85061P8543M832N0121J8586L4355J10668J00051J35882J32977J81902l9781
$$ 185061 263604 268436 318557 337143 371498 482166 582217 718099 851076 1032978 993197
13427I93197j28518L9215R7498J44189J42321R0987M5520k08941j81290j00223
$$ 993197 864679 903894 1001392 1145581 1287902 1378889 1424409 1215468 1034178 933955
13417I33955j64216p5656J07780q143K9029l6695j00701k20719j24175q1329J6012
$$ 933955 769739 694083 801863 793720 822749 786054 685353 464634 340459 259130 275142
13406B75142j5212N294M5140p6840l3480N5769l3328N3944j0262J1868O1553k3527
$$ 275142 259930 265224 310364 233524 200044 255813 222485 276429 266167 278035 339588 316061
13394C16061m8389j22480j02935J4619L4371k9165o3034R4585P4090q5101l3825
$$ 316061 267672 145192 42257 56876 91247 62082 -952 93633 167723 82622 48797
13383D8797n4329m0786R6813O3907N4995l5560m4479k4217L2165k9013L0409L1201
$$ 48797 -5532 -46318 50495 114402 169397 133837 89358 65141 97306 68293 98702 129903
13371A29903r5438o2558k9095m3917Q1901J38104M9152j19512j8160J7817m7576
$$ 129903 34465 -28093 -57188 -101105 -19204 118900 168052 48540 30380 48197 621
13360F21m1746O5369R5423k7938j45900k1207l3201r41k5400m0474P3068n7793
$$ 621 -41125 24244 119667 91729 -54171 -75378 -108579 -109520 -134920 -175394 -102326 -160119
13348a60119J4121J9821K7420J5288N2006N3476n9153j8708m0673J2815N8145
$$ -160119 -145998 -126177 -98757 -83469 -31463 22013 -37140 -55848 -96521 -83706 -25561
13337b5561N0711l6232j50470Q8949J5289R9561K2078r9497L4017P3930o1835
$$ -25561 25150 -11082 -161552 -72603 -57314 42247 64325 -35172 -1155 72775 10940
13326A0940l4622J02493R1788k6584j6292q8849o9247L5610N9178N2147p0828
$$ 10940 -23682 78811 170599 144015 127723 38874 -30373 5237 64415 116562 45734
13315D5734r8480O6147Q247K4464l9136n6532J2133J04495M9349j64655k3773
$$ 45734 -52746 13401 21648 46112 6976 -49556 -37423 67072 116421 -48234 -72007
13304g2007r9067k8147J0533K8041N8139Q6743L3871l7452n548l6429p8234j1521
$$ -72007 -171074 -199221 -188688 -160647 -102508 -15765 18106 -19346 -24894 -61323 -139557 -151078
13292a51078O0531Q6801J02j29943N688K7003o5035p9379M3368j7093J08418J75022
$$ -151078 -90547 -3746 -3644 -133587 -127899 -100896 -165931 -245310 -201942 -219035 -110617 64405
13280F4405l2049p745n7714J2299J46043Q1630r032q6947p6298O9496K9662j35021
$$ 64405 32356 24611 -33103 -20804 125239 206869 197837 110890 34592 104088 133750 -1271
13268a271p6398J19276O0721j3374j49257r3502J41075J21604P8844j11662r0256
$$ -1271 -77669 41607 102328 88954 -60303 -153805 -12730 108874 187718 76056 -14200
13257a4200P5639O4236j9417O1736j14542r4167J03576R4631o6074r5684k6925
$$ -14200 61439 125675 106258 167994 53452 -40715 62861 157492 91418 -4266 -31191
13246c1191q6669p1887k3945J61666K7156Q2773R1971q6348m1785j11470n7667
$$ -31191 -117860 -189747 -213692 -52026 -24870 57903 149874 63526 21741 -89729 -147396
13235a47396m0601m3194k6567R030j447j14300p968R8670Q8978M4156P1832K370
$$ -147396 -187997 -231191 -257758 -248728 -250175 -364475 -372443 -273773 -184795 -140639 -68807 -66437
13223f6437k7803J6770J14107P584j28280J4698J3243P234l3379N272P9095l6613
$$ -66437 -94240 -77470 36637 44221 -84059 -69361 -56118 -48884 -82263 -76991 2104 -34509
13211c4509k3915j52553m4850L2998P3728O9244P0917k2209m6799j32568o9336
$$ -34509 -58424 -210977 -255827 -222829 -149101 -79857 -8940 -31149 -77948 -210516 -279852
13200b79852k9709P0946J54138o52J7294M8150K3018N251K5052Q777q9676J06682
$$ -279852 -309561 -238615 -84477 -85129 -67835 -19685 3333 8584 33636 42413 -47263 59419
13188E9419K3483j70897p6794P2138J17074q5808K8635K8062r6046j48059L8972
$$ 59419 82902 -87995 -164789 -92651 24423 -61385 -32750 -4688 -100734 -248793 -209821
13177b09821L6140o2187J4195J6045O617k1282k710m1368O9258J67094J05073
$$ -209821 -173681 -235868 -221673 -205628 -199011 -220293 -223003 -264371 -195113 -28019 77054
13166G7054k7382j1573O9719j12762k8306N0494Q7179k2994q1356Q348J24939
$$ 77054 49672 38099 107818 -4944 -33250 17244 104423 81429 73 8421 133360
13155A33360M0740p6983N5641p2431j10603k6352n5092n5123J25359q435l8792
$$ 133360 174100 97117 152758 80327 -30276 -56628 -111720 -166843 -41484 -49919 -88711
13144h8711K4353Q2873P2003j14682o6463J511j0628j0716N6862J5079j4508L1661
$$ -88711 -64358 18515 90518 -24164 -90627 -89116 -99744 -110460 -53598 -38519 -53027 -21366
13132b1366P0099K0246K8330O15j503J8213M3729q8233j2759R7694j30059p1192
$$ -21366 48733 68979 97309 97924 96421 114634 158363 70130 57371 155065 25006 -46186
13120d6186O5509K5351p2180J14117o6338j76275J59506J19720p6427P4184J06747
$$ -46186 19323 44674 -27506 86611 20273 -156002 3504 123224 46797 120981 227728
13109B27728j9898o930k110n5000m351M6959j7570p2848o8511m1959q5496l9027
$$ 227728 207830 200900 198790 143790 139439 186398 168828 95980 27469 -14490 -99986 -139013
13097a39013j02165l8622R3473O9301n0434M2354K9755L6676o231Q5766k6277
$$ -139013 -241178 -279800 -186327 -117026 -167460 -125106 -95351 -58675 -64906 20860 -5417
13086e417n4348j21566n5996J55994o4096j6978M2038L8545k0203J6347K6976
$$ -5417 -59765 -181331 -237327 -81333 -145429 -162407 -120369 -81824 -102027 -85680 -58704
13075e8704R6148k0434p3914m1001k8683R6046l3646j16449r2934j11288J467
$$ -58704 37444 17010 -56904 -97905 -126588 -30542 -64188 -180637 -273571 -384859 -383392
13064c83392J28137J04831O3754n9777n8488n7148P8608J18513J55859J54085
$$ -383392 -255255 -150424 -86670 -146447 -204935 -262083 -183475 -64962 90897 244982
13054B44982m6094l5795o7898q7523M9862j3449p5857l2297K4831r1451r8696
$$ 244982 198888 163093 95195 7672 57534 44085 -31772 -64069 -39238 -130689 -229385
13043b29385M1572J23084J6653K9571j5610p9166M4108j3593J757l6241l0283
$$ -229385 -187813 -64729 -48076 -18505 -34115 -113281 -69173 -82766 -81009 -117250 -147533
13032a47533l531l192j7459J7320K1738O3867J4742k2756O0484k2188J1884m0433
$$ -147533 -151064 -154256 -171715 -154395 -132657 -68790 -54048 -76804 -16320 -38508 -26624 -67057
13020f7057N3056R179K884M1669j4918L816O9877j6271N4000N4527J9885p9734
$$ -67057 -14001 -4822 -1938 39731 24813 28629 98506 82235 136235 190762 210647 130913
13008A30913L371l5393l7992J25056L4489o8702j6097l1784j39598P9214J05064
$$ 130913 134284 98891 60899 185955 220444 151742 135645 103861 -35737 43477 148541
12997A48541r285m5766q0057n2457j4583l2646M0610j4435M0157j7731k6827n9528
$$ 148541 139256 93490 13433 -39024 -53607 -86253 -45643 -60078 -19921 -37652 -64479 -124007
12985a24007L3492K02541p6367J3333J22308M8548j52639j09714J346L2340L5129
$$ -124007 -90515 112026 35659 48992 171300 219848 67209 -42505 -41159 -8819 26310
12974B6310M2663m0174j191N158n4014K5672n9498o6723j12543n3078R7472M3616
$$ 26310 68973 28799 27608 32766 -21248 4424 -55074 -121797 -234340 -287418 -189946 -146330
12962a46330M8065J06572J45471o4487j52877Q823l8268P5170J1004m461J3947
$$ -146330 -98265 8307 153778 89291 -63586 -54763 -93031 -17861 -6857 -11318 2629
12951B629K2778n6463O3652Q8611o4733k14775J6698J87669J25755k3681q1041
$$ 2629 25407 -31056 32596 121207 56474 -158301 -141603 46066 171821 148140 67099
12940F7099Q197j1915r6597j05745j5961Q04l1904q0030M3410P915J0476j4360
$$ 67099 75296 63381 -33216 -138961 -154922 -154118 -186022 -266052 -222642 -214727 -204251 -218611
12928b18611O386J11801N7332m704j09958L5301J11856o5203n0123J14858l2680
$$ -218611 -212225 -100424 -43092 -47796 -157754 -122453 -10597 -75800 -125923 -11065 -43745
12917d3745R613M7969L0116m5708p2139p661J6761n1589L4162J6051k6711J7599
$$ -43745 -34132 13837 43953 -1755 -73894 -81555 -64794 -116383 -82221 -66170 -92881 -75282
12905g5282J15488l2906o4721Q3502K6547k5893K0089j03230j8128m852m7878
$$ -75282 40206 7300 -57421 26081 52628 26735 46824 -56406 -74534 -79386 -127264
12894a27264O4158J75513R0594j01276m3431l3983n3885r8193r129L6194k0768
$$ -127264 -63106 112407 203001 101725 58294 24311 -29574 -127767 -136896 -100702 -121470
12883a21470L1072j0165L6895K6176J8701k4004j490J04836l6904O7427L6313
$$ -121470 -90398 -100563 -63668 -37492 -18791 -42795 -44285 60551 23647 91074 127387
12872A27387p2112r9618J6663K8608q9822J00316J20455P6857k9760k6306K5454
$$ 127387 55275 -44343 -27680 928 -88894 11422 131877 208734 178974 152668 178122
12861A78122o4463j82250r2374N6942N6625j9890J2631P3391q5106O1022o241
$$ 178122 113659 -68591 -160965 -104023 -47398 -67288 -54657 18734 -66372 -5350 -11591
12850a1591m0786J1970J19459O3262l6021l6429M3167n1264q158l5363o333m4432
$$ -11591 -52377 -40407 79052 142314 106293 69864 113031 61767 53609 18246 11913 -32519
12838c2519r1014J26427R5208N0354m2569o926M3288j16490O4697k0023L6753
$$ -32519 -123533 2894 98102 148456 105887 98961 142249 25759 90456 70433 107186
12827A07186p7100j653n5239j01593J59772Q4948j22095j44197j4648J8868j9021
$$ 107186 30086 28433 -26806 -128399 31373 116321 -5774 -149971 -164619 -145751 -164772
12816a64772m9512M9813L6860m4156p333K8499J45333N8498j5899j12629L1604
$$ -164772 -214284 -164471 -127611 -171767 -179100 -150601 -5268 53230 37331 -75298 -43694
12805d3694q927P2548o0998l6931j1222j6837o8864M9294K2790o1121j6589p0982
$$ -43694 -52621 19927 -41071 -78002 -89224 -106061 -174925 -125631 -102841 -163962 -180551 -251533
12793b51533r369L838J20272J03858Q8240l3752l4499l4120n5553j15896J2079
$$ -251533 -260902 -257064 -136792 -32934 55306 21554 -12945 -47065 -102618 -218514 -206435
12782b06435J8489M190O5545J02496M0789j1856k5874M1066J37230j19677r8804
$$ -206435 -187946 -183756 -118211 -15715 25074 13218 -12656 28410 165640 45963 -52841
12771e2841n4194q6347O1119J96659Q2419m0683J6817m7564o2562m6601m125L0391
$$ -52841 -107035 -193382 -132263 64396 146815 106132 122949 75385 12823 -33778 -37903 -7512
12759g512l160k1349K2799l159j0429J9858k5670n0740O6633J12699R3210q1655
$$ -7512 -10672 -32021 -9222 -12381 -22810 -2952 -28622 -79362 -12729 99970 193180 111525
12747A11525r9586p889L6660O5144j31192r8602p2423k9007K153O9802R6142O7267
$$ 111525 11939 4050 40710 105854 -25338 -123940 -196363 -225370 -223217 -153415 -57273 9994
12735I994L7871j9985j6681m661j110n186n226K909M9657n2998K084j1011k28101
$$ 9994 47865 27880 11199 6538 5428 242 -4984 -2075 47582 -5416 -3332 -14343 -242444
12722b42444P0981J17175j5870J4491Q3791Q922n5457o5267J9451j5893l2759
$$ -242444 -171463 -54288 -70158 -55667 28124 37046 -18411 -83678 -64227 -80120 -112879
12711a12879O9611N4575N9382N231q430l292q4317o0969J11955r0791j1203n9823
$$ -112879 -43268 11307 70689 75920 67490 64198 -20119 -81088 30867 -59924 -71127 -130950
12699a30950k5399Q2460R4492J19913j2331m8539l0627p5858J7637K3016K8082
$$ -130950 -156349 -73889 20603 140516 128185 79646 49019 -26839 -9202 13814 41896
12688D1896N8035l325p1552j2689J7862R0447P425l446r0727R349j63939J2457
$$ 41896 99931 96606 25054 12365 30227 120674 128099 124653 33926 43275 -120664 -108207
12676a08207Q8860N9957p8610M2463r390R0797N2557o2747j18274p6215L9300
$$ -108207 -19347 40610 -38000 4463 -4927 85870 138427 75680 -42594 -118809 -79509
12665g9509L6548p983P1155l4006m2538j7906n0380M5418J48254N1193l1527O238
$$ -79509 -42961 -50944 20211 -13795 -56333 -74239 -124619 -79201 69053 120246 88719 94957
12653I4957R2840Q9580Q7283q6843j06094r4146o0261J5708l5665J23310L6901
$$ 94957 187797 277377 364660 277817 171723 77577 17316 33024 -2641 120669 157570
12642A57570n0877j40836K0145N3862o1773j5105n3392m1362N3957m0194j7250
$$ 157570 106693 -34143 -13998 39864 -21909 -37014 -90406 -131768 -77811 -118005 -135255
12631a35255N284P8512N2661P5952J3533m5413Q4705o7767j22831J2866O0132
$$ -135255 -129971 -51459 1202 77154 90687 45274 129979 62212 -60619 -47753 12379
12620A2379J35950l4548j93379J3030R3112J5819l4179o7924M5939o403p2435
$$ 12379 148329 113781 -79598 -66568 26544 42363 8184 -59740 -13801 -20204 -92639
12609i2639j5940p2870N1507P7630N7064j3431k1050M637o4331Q6466k1991R4520
$$ -92639 -108579 -181449 -129942 -52312 4752 -8679 -29729 -25092 -89423 -2957 -24948 69572
12597F9572l8529o9908M5281K7148j3731m8733o315J4236l0N3801J00799l3683
$$ 69572 31043 -38865 6416 33564 19833 -28900 -35215 -20979 -21009 32792 133591 99908
12585I9908L620l9953j4785o2765n4022J257m2657O5226j00982j9023Q1123o170
$$ 99908 103528 63575 48790 -13975 -67997 -66740 -109397 -44171 -145153 -164176 -83053 -89223
12573h9223r721k1555J8210Q8191j9947o1377j6511L4489n231m1254R643J00425
$$ -89223 -98944 -120499 -102289 -14098 -34045 -95422 -111933 -77444 -82675 -123929 -114286 -13861
12561a3861O8698n66P4586M265j2487j4574P2683L7364j3690L3669n5887j36808
$$ -13861 54837 54271 128857 133122 120635 106061 178744 216108 202418 236087 180200 43392
12549D3392J8537R395o1364j8650M8207K4590m9067L7812M3403J58J31061J99825
$$ 43392 61929 71324 9960 -8690 39517 64107 15040 52852 96255 96413 227474 427299
12537D27299k3573m9794p2134k8551J39496J75741J76080L93467N74742Q63223
$$ 427299 403726 353932 281798 253247 392743 568484 744564 1138031 1712773 2575996
12527B575996J696068L122399M832448L678561J81496q49955k727912l643821
$$ 2575996 4272064 7394463 12226911 15905472 16086968 15237013 12509101 8865280
12519H865280l303105k203470j076301o41258m04016k25346j32744j49754j32319
$$ 8865280 5562175 3358705 2282404 1641146 1237130 1011784 879040 729286 596967
12510E96967O3922j21540j82843j79303j11643o9623L1333Q3733m7493P402k272
$$ 596967 660889 539349 356506 177203 65560 -4063 27270 111003 63510 70912 68640
12499F8640j6838p3309r1324M6720O3549R7576N0444n9967j20062m5598m1112
$$ 68640 51802 -21507 -112831 -66111 -2562 95014 145458 85491 -34571 -80169 -121281
12488a21281r4795P3737J03625j5313m4739R5289J4254o5058m8758r5355Q813
$$ -121281 -216076 -142339 -38714 -54027 -98766 -3477 10777 -54281 -103039 -198394 -189581
12477a89581J53149O8837J48147N3578n4505j71291j11932j9141L4402J0324J5681
$$ -189581 -36432 32405 180552 234130 179625 8334 -103598 -122739 -88337 -78013 -62332
12466f2332O898R2264l3401Q9045L0565p1502k1029m6745l5128r9891n3325J02071
$$ -62332 -55434 36830 3429 92474 123039 51537 30508 -16237 -51365 -151256 -204581 -102510
12454a02510L8836Q4293l8127o2980j995j5607k5149l0002N7842J29363k2814
$$ -102510 -63674 20619 -17508 -80488 -82483 -98090 -123239 -153241 -95399 33964 11150
12443A1150p4953N6683R5866m9601n4472p0247J1274P0968K813N9929J11301n831
$$ 11150 -63803 -7120 88746 39145 -15327 -85574 -74300 -3332 -519 59410 170711 164880
12431A64880m206J8077n5317J33737j5290R3268J8863j45029j60741m912O3520
$$ 164880 160674 178751 123434 257171 241881 335149 354012 208983 48242 43330 106850
12420A06850l9583o7013j24356k316o5155L5336J15225O6100J3006j3469J037
$$ 106850 67267 254 -124102 -126418 -191573 -156237 -41012 25088 38094 24625 25662
12409B5662j4544k2563o4711N7410N4226j4553q597R160K2521j2251L0879Q6513
$$ 25662 11118 -11445 -76156 -18746 35480 20927 12330 21490 44011 31760 62639 149152
12397A49152j13554L3101L5173o995n6143r4990q5280J62635J03282K9298R4186
$$ 149152 35598 68699 103872 96877 40734 -54256 -139536 23099 126381 155679 249865
12386B49865m2409m8254K147J46660K05834N1808j9924R836n5177r283j49099
$$ 249865 207456 159202 161349 308009 513843 565651 545727 555563 500386 491103 342004
12375C42004j69266n2398k8327m2553j3574L0288J64977N5889o8666j114j50413
$$ 342004 172738 120340 92013 49460 35886 66174 231151 287040 218374 217260 66847
12364F6847m9307O9681o0827P3403J92325R011k7225q1371r919J73973m1818j16721
$$ 66847 17540 87221 26394 99797 292122 301133 273908 192537 182618 356591 314773 198052
12352A98052j03327j59931k7392r8597L5977J06176j3141M8065L0910m5000L9394
$$ 198052 94725 -65206 -92598 -191195 -155218 -49042 -62183 -14118 16792 -28208 11186
12341A1186P6522J37176N7321j0742j6770L4695K8979O3759L6806M3395j8276
$$ 11186 87708 224884 282205 271463 254693 289388 318367 382126 418932 462327 444051
12330D44051n7673p5092j24603L1564M6674o2091P0783J06297O4547j31053k37864
$$ 444051 386378 311286 186683 218247 264921 202830 273613 379910 444457 313404 75540
12319G5540L890o5155O0692o1427M261M1309j9467r046M187P9177m608l5587n7088
$$ 75540 79430 14275 74967 13540 17801 59110 39643 30597 34784 113961 109353 73766 16678
12306A6678Q1523L4810l0812n0519N5103M3438K1171o785J3505m1288j22388n7781
$$ 16678 98201 133011 102199 51680 106783 150221 171392 164607 178112 136824 14436 -43345
12294d3345K7391K8675m5238k6269P8917K4220N3465K2810m0780Q2434Q9375m2546
$$ -43345 -15954 12721 -32517 -58786 20131 44351 97816 120626 79846 162280 251655 209109
12282B09109n5021M2859r9826n6061O2626n6517q042J3538K7712P9590J13975
$$ 209109 154088 196947 97121 41060 103686 47169 39127 52665 80377 159967 273942
12271B73942j02092j31518R3130R1477j95656l7254j3112Q7908k0738J0011k5088
$$ 273942 171850 40332 133462 224939 29283 -7971 -21083 66825 46087 56098 31010
12260C1010P6507J7846K5402J8184n7905j06303J7614k8626R3558K2747l5545
$$ 31010 107517 125363 150765 168949 111044 4741 22355 -6271 87287 110034 74489
12249G4489o3044j20423L80J04105Q0887J26738J7989p3442m7722p9720q6531
$$ 74489 11445 -108978 -108598 -4493 76394 203132 221121 147679 99957 20237 -66294
12238f6294j369r0164J51405Q563j8066j66P0476P2416j8969K0704M979N9195
$$ -66294 -67663 -157827 -6422 2141 -15925 -16091 54385 126801 107832 128536 133515 192710
12226A92710J2387N7692J8922N0538r2431m9812Q8915j20147j30153r9577j3552
$$ 192710 205097 262789 281711 332249 239818 190006 278921 158774 28621 -70956 -84508
12215h4508O0172K9266n1294Q4446J12576k5621p2603K5582o7285q6982J5363
$$ -84508 -24336 4930 -46364 38082 150658 125037 52434 78016 10731 -76251 -60888
12204f0888Q8444R8343K3922n8661K3466J07362J6032q1196j3680j48592l9761
$$ -60888 27556 125899 149821 91160 114626 221988 238020 156824 143144 -5448 -45209
12193d5209P3609m1231j00058o2579r6292K51662J62098j15345j27149j05646
$$ -45209 28400 -12831 -112889 -175468 -271760 -20098 142000 26655 -100494 -206140
12183b06140J00819J26977k3083J34928J66508j7076j16348n5171j6200N4578
$$ -206140 -105321 21656 -1427 133501 300009 282933 166585 111414 95214 149792
12173A49792o827j38383k7421J6108k7197m348J10241n0401j44630J20552J12978
$$ 149792 142965 4582 -22839 -6731 -33928 -38276 71965 21564 -123066 -2514 110464
12162A10464n9881M8435k0542l2814K6726k8084r2691k3824j6072p1163M0705
$$ 110464 50583 99018 78476 45662 72388 44304 -48387 -72211 -88283 -159446 -118741
12151a18741K2802P6123Q6398N8404m2175O8579o8859q3014j11539l0044Q6372
$$ -118741 -95939 -19816 66582 124986 82811 151390 82531 -483 -112022 -142066 -55694
12140e5694m5588k5055P3390J0157m5181n7127O2591J09828j32825k7613J6208
$$ -55694 -101282 -126337 -52947 -42790 -87971 -145098 -82507 27321 -105504 -133117 -116909
12129a16909N1711J14559j7505l8934L0677r0444Q5513M4875N2064J4922p6802
$$ -116909 -65198 49361 31856 -7078 23599 -66845 18668 63543 115607 130529 53727
12118E3727j2603r879n5526M8076j06691m9678P4379m247j3562K917M6835K8061
$$ 53727 41124 31245 -24281 23795 -82896 -132574 -58195 -62442 -76004 -73087 -26252 1809
12106A809M087n2434J0008j3902K1020j16664j2535J2267M4072j7884k5575q1411
$$ 1809 5896 -46538 -36530 -50432 -29412 -146076 -158611 -146344 -102272 -120156 -145731 -227142
12094b27142p7174L6543J02134N75J19907Q2911j04169M3876N7610P6248p7974
$$ -227142 -304316 -267773 -165639 -165064 -45157 37754 -66415 -22539 35071 111319 33345
12083C3345j06173J1233N7830L7444m7262R0226m4673l8467N7176m4115J9305
$$ 33345 -72828 -61595 -3765 33679 -13583 76643 31970 -6497 50679 6564 25869
12072B5869K9754N568M6287R8569l4018j04977l7516K1964m3235r7852J858P8152
$$ 25869 55623 61191 107478 206047 172029 67052 29536 51500 8265 -89587 -87729 -9577
12060i577L2620j3668L3584M6333M0615k015n9636l3924n3849r2712m2399O2445
$$ -9577 23043 9375 42959 89292 129907 127892 68256 34332 -19517 -112229 -154628 -92183
12048i2183P8863l9793q173K099L231p7754j9207O7703N0106j4377n0768O9899
$$ -92183 -13320 -53113 -61286 -59187 -55956 -133710 -152917 -85214 -35108 -49485 -100253 -30354
12036c0354R8411J8486K6350K4705P1897m0447o3275K8381j7316j55257k4408
$$ -30354 68057 86543 112893 137598 209495 169048 105773 134154 116838 -38419 -62827
12025f2827J52351J06249m4868p7004j12495r222m7069J31461J24158q7739j14126
$$ -62827 89524 195773 150905 73901 -38594 -47816 -94885 36576 160734 72995 -41131
12014d1131q4586J66223N4822k9561j0120P1103k4070j2070O2249j49537o8922
$$ -41131 -125717 40506 95328 65767 55647 126750 102680 90610 152859 3322 -65600
12003f5600J04672M1579o3447p2544j6929j6081Q046R0040m84m5181j7396Q9958
$$ -65600 39072 80651 17204 -55340 -72269 -88350 -80304 9736 9252 -35929 -53325 36633
11991C6633K5555L1819o386J1608K3480K1946M6917n3027j11727m2153p1861p8782
$$ 36633 62188 94007 87621 99229 122709 144655 191572 138545 26818 -15335 -87196 -165978
11979a65978J06861J75931Q1477l3119K1968m9434j1071K9620k0423m1998j31119
$$ -165978 -59117 116814 198291 165172 187140 137706 126635 156255 135832 93834 -37285
11968c7285j12081R5773J1865r4097J08527K4865o2833J47010j9498n0996M9350
$$ -37285 -149366 -53593 -41728 -135825 -27298 -2433 -65266 81744 62246 11250 60600
11957F0600q7576n3059p4340K6976J14364k6354k0167j7000R0024P8899M6976
$$ 60600 -26976 -80035 -154375 -127399 -13035 -39389 -59556 -76556 13468 92367 139343
11946A39343n0681m5546l346J0710L9052o5644r657M4781L2929j02140o3137k7566
$$ 139343 88662 43116 39770 50480 89532 23888 14231 59012 91941 -10199 -73336 -100902
11934a00902l7922J25265O2603j15052l1604L5910L8311J88245P6595p778M086
$$ -100902 -138824 -13559 49044 -66008 -97612 -61702 -23391 164854 241449 233671 237757
11923B37757o5361o4593r9274o7588o5358P0965M2346K7383q9122j15134M6709
$$ 237757 172396 107803 8529 -59059 -124417 -53452 -11106 16277 -72845 -187979 -141270
11912a41270n2011L8973J78914K4767N3430O2762q8749j16479L6372k2079o6530
$$ -141270 -193281 -154308 24606 49373 102803 165565 76816 -39663 -3291 -25370 -91900
11901i1900J7028J8829r9606q2668O4941J43246N3560O932K7169J41982l5580
$$ -91900 -74872 -56043 -155649 -238317 -173376 -30130 23430 30362 57531 199513 163933
11890A63933J7094o464r8308k4617J1743n7385p6125L5023l4441p7122N4180J20651
$$ 163933 181027 174563 76255 51638 63381 5996 -70129 -35106 -69547 -146669 -92489 28162
11878B8162L170j10074m5991m8185J5787K7536J39583J28440N5244j51725j38832
$$ 28162 31332 -78742 -124733 -172918 -157131 -129595 9988 138428 193672 41947 -96885
11867i6885k1902M0807J13160J43921j28241j88499Q6309J29063J5375k4928n1950
$$ -96885 -118787 -77980 35180 179101 50860 -137639 -51330 77733 93108 68180 16230
11856A6230j9326O4070l0480n1712j1834n3198K554j1175n8725K3801J60326J58131
$$ 16230 -3096 60974 30494 -21218 -33052 -86250 -83696 -94871 -153596 -129795 30531 188662
11844A88662q0228n0320p6980j27111M4064J17927J07429N1011m7815q363o9992
$$ 188662 108434 58114 -18866 -145977 -101913 16014 123443 174454 126639 118276 48284
11833D8284J14954r15K9975J1831j05872j9827l0973l6403J2085n7506m7709j6616
$$ 48284 163238 162323 192298 204129 98257 78430 47457 11054 23139 -34367 -82076 -98692
11821i8692o0790K02961J04019K5245k0396p8760q5507k3623Q892L1994m3625
$$ -98692 -159482 43479 147498 172743 152347 73587 -11920 -35543 -26651 5343 -38282
11810c8282l0798l3104m4818N5212L2085r2824o4205k042J49693P9030M7097M0991
$$ -38282 -69080 -102184 -147002 -91790 -59705 -152529 -216734 -218776 -69083 9947 57044 98035
11798I8035j17706l4737L5351L0426P6369j3j33434J9871J1354L9386k7503J28118
$$ 98035 -19671 -54408 -19057 11369 87738 87725 -45709 -25838 -14484 24902 -2601 125517
11786A25517k3043q1827m290l4247m0789P4134n0350O1798J13017p5341j5606
$$ 125517 102474 20647 16357 -17890 -58679 15455 -34895 26903 139920 64579 48973
11775D8973r688p9363L4645Q0921j00247n2222R1080O8674o7723L513J8114J4549
$$ 48973 39285 -40078 -5433 75488 -24759 -76981 14099 82773 15050 18563 36677 51226
11763E1226j22055Q3058R1839k8342j02351k660K6708o499N6659K1958l6118p1835
$$ 51226 -70829 12229 104068 75726 -26625 -29285 -2577 -9076 47583 69541 33423 -38412
11751c8412o946M625J0393J1594j3680k1985M2953M9831K124j0032J4977m8336
$$ -38412 -45358 -40733 -30340 -18746 -32426 -54411 -11458 38373 40497 30465 45442 -2894
11739b894l216n1m2974m7978Q9743J00040o4299j6469J0746m2768n6457J3153
$$ -2894 -6110 -6161 -49135 -97113 -7370 92670 28371 11902 22648 -20120 -76577 -63424
11727f3424j0899J14366Q1559j20463j21412O4342j6943L4222J60141J1852j8380
$$ -63424 -74323 40043 121602 1139 -120273 -55931 -72874 -38652 121489 133341 114961
11716A14961n0603o0582j72955j08195N8339K12072R0595M8083N3388j64438l9920
$$ 114961 64358 3776 -169179 -277374 -219035 -6963 83632 131715 185103 20665 -19255
11705a9255O3293l8666k413k2892Q376K9565m0910n253o1853O4042j2524n6027
$$ -19255 44038 5372 2959 -19933 -11557 18008 -22902 -28155 -90008 -25966 -38490 -94517
11693i4517k7451L214p6142M2303P6243J11083L6488j36443p5064j14283m7599
$$ -94517 -121968 -118754 -194896 -152593 -76350 34733 71221 -65222 -140286 -254569 -302168
11682c02168m8156k3322K12371j3402Q8714M6682j5504L7495Q0538O246k2139
$$ -302168 -350324 -373646 -161275 -174677 -85963 -39281 -54785 -17290 63248 69494 47355
11671D7355q8476O4975j4700j08312J41180O2238N8832L2604P4284j48534j09670
$$ 47355 -41121 23854 9154 -99158 42022 104260 163092 195696 269980 121446 11776
11660A1776j5017p7644J5252J93403j878j20267n9445O1711K0003p5759M3048
$$ 11776 -3241 -80885 -65633 127770 125892 5625 -53820 7891 27894 -47865 -4817
11649d817N8051l2797n8100k3017J7948K4164P7843K9944j8491K8569j4528o3813
$$ -4817 53234 20437 -37663 -60680 -42732 -18568 59275 89219 70728 99297 84769 20956
11637B0956M3934P037j8466n2632r485o0249O2033Q6738m3201P1875P6454j1049
$$ 20956 64890 71927 53461 829 -8656 -68905 -6872 79866 36665 108540 184994 173945
11625A73945j02852m8119R30j19688j21621R1080J19454J65209N4854Q784L8438
$$ 173945 71093 22974 23904 -95784 -217405 -126325 -6871 158338 213192 221976 260414
11614B60414L880q5485j87311j02089j5343N5277L9059O471o1422P4243R548m5396
$$ 260414 264294 178809 -8502 -110591 -125934 -70657 -31598 -25127 -86549 -12306 -2758 -48154
11602d8154k4442o9033p7775Q2515J12933O5941k8526j16172Q1309l042l4067
$$ -48154 -72596 -141629 -219404 -136889 -23956 41985 13459 -102713 -21404 -24446 -58513
11591e8513Q7251j374m4492J4279j7501j1834L2766L867K1854j27912q9004P3019
$$ -58513 28738 27364 -17128 -2849 -20350 -32184 582 4449 26303 -101609 -190613 -117594
11579a17594J66226N3942L4778L2007q4573j5718k6294M9505r6236j00688p2158
$$ -117594 48632 102574 137352 169359 84786 69068 42774 92279 -3957 -104645 -176803
11568a76803J70663J38014N8813p266l7721j8157J57029p7836j28239K2814N5374
$$ -176803 -6140 131874 190687 183421 145700 127543 284572 206736 78497 101311 156685
11557A56685M0051n278m9068m2021k5072K4573Q7888q1023q4684q466J60401K7059
$$ 156685 196736 191458 142390 100369 75297 99870 187758 106735 22051 13585 173986 201045
11545B01045j13207q1426L7588l9495k7266O7984q0144j12312L9535j7894j613
$$ 201045 87838 6412 44000 4505 -22761 45223 -34921 -147233 -107698 -125592 -127205
11534a27205j3341R4316K6141J15260o3835J7081L3890O7743o4439j1194l5106
$$ -127205 -140546 -46230 -20089 95171 31336 48417 82307 150050 85611 74417 39311
11523C9311o266j0791J0030K710j7602K4114n2519n6343p7495J75377J09517K7157
$$ 39311 33045 22254 32284 34994 17392 41506 -11013 -67356 -144851 30526 140043 167200
11511A67200j04179j07536Q8224O0585l4645J1413j09350q3257N0693N2656M3006
$$ 167200 63021 -44515 43709 104294 69649 81062 -28288 -111545 -60852 -8196 34810
11500C4810M1976o1257n1272k8014O6815O6043P8108m6338r3584m0940n299n0696
$$ 34810 76786 15529 -35743 -63757 3058 69101 147209 100871 7287 -33653 -38952 -89648
11488h9648n0619n6692L708L4318M3663Q4718r5013j18469m268P7062M6751O7468
$$ -89648 -140267 -196959 -193251 -158933 -115270 -30552 -125565 -244034 -248302 -171240 -124489 -57021
11476e7021N3286o6020j2000J7320K8136j4700N7422K0304q9685o7603k2031J80673
$$ -57021 -3735 -69755 -81755 -64435 -36299 -50999 6423 26727 -62958 -130561 -152592 28081
11464B8081J01781o5575K267j8107m6655l5125l4956N2540j987Q7701K1263L6675
$$ 28081 129862 64287 66554 48447 1792 -33333 -68289 -15749 -17736 69965 91228 127903
11452A27903n2125q4542l4715N1061k1615J20960J82463P4486o2589J7954L408
$$ 127903 75778 -8764 -43479 7582 -14033 106927 289390 363876 301287 319241 322649
11441C22649n4292r4198p3458o6058M9844p2188p344J32909L0374n8627q7123
$$ 322649 268357 174159 100701 34643 84487 12299 4955 137864 168238 109611 22488
11430B2488n6040K0117j9449k9630J21048J02878P7355J9298j03892m1232p1288
$$ 22488 -33552 -13435 -32884 -62514 58534 161412 238767 258065 154173 112941 41653
11419D1653j28315K0635J9178q756j41707L2726O7366m0969J1802L3969L4309
$$ 41653 -86662 -66027 -46849 -55605 -197312 -164586 -97220 -138189 -126387 -92418 -58109
11408e8109k6195K9691R1455r816n9392L7799O3929o0865J5513j0729j82j03390
$$ -58109 -84304 -54613 36842 27026 -32366 5433 69362 8497 24010 13281 13099 -90291
11396i0291j12596P3572K0466J18152N2129L5846N0144K3298q387j25971m1943
$$ -90291 -202887 -129315 -108849 9303 61432 97278 147422 170720 162333 36362 -5581
11385e581L6993L9563o5375k348P7515L0236P0908r7347j31809p9272o4983o3468
$$ -5581 31412 70975 5600 3252 80767 111003 181911 84564 -47245 -126517 -191500 -254968
11373b54968L2661r730K2903R8441N5097q9363j56860N8961J67870M8412j2058
$$ -254968 -222307 -232037 -209134 -110693 -55596 -144959 -301819 -242858 -74988 -26576 -38634
11362c8634J23945K4842l9972k8548o2258r59N1373Q9825m8995k1977m0525j67190
$$ -38634 85311 110153 70181 41633 -20625 -21584 29789 119614 70619 48642 8117 -159073
11350a59073O6034P9726P7863L2348K3584n5088L6017J18098k5192j4643K8264
$$ -159073 -93039 -13313 64550 96898 120482 65394 101411 219509 194317 179674 207938
11339B07938n0034j74207j07395N7173L0913j7662m8017q408O6186p5883o1890
$$ 207938 157904 -16303 -123698 -66525 -35612 -53274 -101291 -109699 -43513 -119396 -181286
11328a81286N7794P1079J16742R3484J1118j72248j5539j253K5408K2938j0363
$$ -181286 -123492 -52413 64329 157813 168931 -3317 -18856 -20109 5299 28237 17874
11317A7874j6954k9565p850K7230p0672q4656N3510J25860j1774N7176j06666
$$ 17874 920 -28645 -36495 -9265 -79937 -164593 -111083 14777 3003 60179 -46487
11306d6487n9674J59l143n881q07J15061M3676j03709J046J24129J38339o7052
$$ -46487 -106161 -106002 -109145 -115026 -115833 -772 42904 -60805 -59759 64370 202709 135657
11294A35657K0945L007J4263j61396k7538Q1143j1578K710o7740k4760n1796K9468
$$ 135657 156602 159609 173872 12476 -15062 66081 54503 57213 -10527 -35287 -87083 -57615
11282e7615R2764n7686r5851j29663p078K53692M9561l3915R4659p1921j22795
$$ -57615 35149 -22537 -118388 -248051 -255129 -1437 48124 14209 108868 36947 -85848
11271h5848M6564J8724m7439l0220j32594q1464J58403J06235j32787L7828M2426
$$ -85848 -39284 -20560 -67999 -98219 -230813 -312277 -153874 -47639 -180426 -142598 -100172
11260a00172p7755J67076J08437j67565j22317Q8182J33570J17751n7272j66933
$$ -100172 -177927 -10851 97586 -69979 -192296 -104114 29456 147207 89935 -76998
11250g6998m1783R929L9560k2626m528m6677M2438J96568J11312L5297o5203r8157
$$ -76998 -118781 -108852 -69292 -91918 -96446 -143123 -100685 95883 207195 242492 177289 79132
11238G9132M1831L3021j43858n2719Q1116O7043k6470j40713L0443N6614k4922
$$ 79132 120963 153984 10126 -42593 38523 105566 79096 -61617 -31174 25440 518
11227E18P8411R993n6192k9455K6837K5466n5523j2655K4868l9144l8763j06045
$$ 518 78929 88922 32730 3275 30112 55578 55 -12600 12268 -26876 -65639 -171684
11215a71684j998O3283R0351J8308k7190N6105j09223m8652J6671J2711L2160
$$ -171684 -173682 -110399 -20048 -1740 -28930 27175 -82048 -130700 -114029 -101318 -69158
11204f9158R1601R6263l8481k1697j15715M8268R2208n7442j1950K4776j02431
$$ -69158 22443 118706 80225 58528 -57187 -8919 83289 25847 13897 38673 -63758
11193f3758j1671N8632p9158L8802R3563k6917Q6809j0710M2222r6730j34758
$$ -63758 -75429 -16797 -95955 -57153 36410 9493 96302 85592 127814 31084 -103674
11182a03674J42931l8201r4690M548L4622L8668O8933j01656l2976n3275R1460
$$ -103674 39257 1056 -93634 -89086 -54464 -15796 53137 -48519 -81495 -134770 -43310
11171d3310J6360r143r6639K388K6513L5352L9585L8771n9734J0873Q705N9722
$$ -43310 -26950 -36093 -132732 -130344 -103831 -68479 -28894 9877 -49857 -38984 -30279 29443
11159B9443k6583q5049r2634O5125J37790q2557j9260M7820m4670N1673R3616
$$ 29443 2860 -82189 -174823 -109698 28092 -54465 -73725 -25905 -70575 -18902 74714
11148G4714L5709m302K3540K4108p2618K033l3728q7668M3521L8909p2692j29198
$$ 74714 110423 106121 129661 153769 81151 83184 49456 -38212 5309 44218 -28474 -157672
11136a57672l9267Q6413l531j3510j4727N0143q5008J17922J80575o8298r0579
$$ -157672 -196939 -110526 -114057 -127567 -142294 -92151 -177159 -59237 121338 53040 -37539
11125c7539m9109Q0340l8208m1338J3926J048k8334j5108L1131M5250Q5439r9307
$$ -37539 -86648 -6308 -44516 -85854 -71928 -70880 -99214 -114322 -83191 -37941 47498 -51809
11113e1809n5959j3299l490K0388J11256k1955J0406J09189M0331p7945n7327
$$ -51809 -107768 -121067 -124557 -104169 7087 -14868 -4462 104727 145058 67113 9786
11102I786P5706k0866j09308j42397P1639O057M9963N9515m3946q0124Q893K68237
$$ 9786 85492 64626 -44682 -187079 -115440 -109383 -59420 95 -43851 -123975 -115082 153155
11090A53155P0126j39422r3658N1354R4293L3771q365p6559J6313N0097k3751
$$ 153155 223281 83859 -9799 41555 135848 169619 161254 84695 101008 151105 127354
11079A27354j13153j9236o2830Q2072J64968J32120q9622p3684o4284Q8571J03661
$$ 127354 14201 -5035 -67865 14207 179175 311295 221673 147989 83705 172276 275937
11068B75937r9706m6727J12090m1558l524o6719L8776P4940q2327o8087O3459
$$ 275937 176231 129504 241594 200036 196512 129793 168569 243509 161182 93095 156554
11057A56554N6780j02394q0886k6411Q4012m6346o5822j36796M5880J07708L9097
$$ 156554 213334 110940 30054 3643 87655 41309 -24513 -161309 -115429 -7721 31376
11046C1376J8246O8844j23834M1632n1971N6005L8423j5437K5656o1372r5163
$$ 31376 49622 118466 -5368 36264 -15707 40298 78721 63284 88940 27568 -67595
11035f7595L8471J4206J5369j8890j0584N1687R3655q0624l3486J0919n1462l4600
$$ -67595 -29124 -14918 451 -18439 -29023 22664 116319 35695 2209 13128 -38334 -72934
11023g2934J10894Q5812j37542O5624Q6288n3316o4244J01183j4023j54612k9764
$$ -72934 37960 123772 -13770 51854 138142 84826 20582 121765 107742 -46870 -76634
11012g6634M2429j6209R8719J34328N021j3617q1845k8154j05947r279P5577j6426
$$ -76634 -34205 -50414 48305 182633 187654 174037 92192 64038 -41909 -51188 24389 7963
11000G963m816k6839o328n31L5361k7174O5432L6493L5924N4069m3717p6142r1282
$$ 7963 3147 -23692 -30020 -30551 4810 -22364 43068 79561 115485 169554 125837 49695 -41587
10987d1587P450O876M2109J31957p8350l8971J08829q002j18281j60522L0463
$$ -41587 -34137 -27261 14848 146805 68455 29484 138313 130311 12030 -148492 -118029
10976a18029J4148J12865J11764N2269j571j30506q1525j37405r7397J25593J25691
$$ -118029 -103881 8984 120748 173017 171446 40940 -40585 -177990 -275387 -149794 -24103
10965b4103q1127N4675O0564R4267M5586L8909m9548j40082l7792R2285j22532
$$ -24103 -105230 -50555 10009 104276 149862 188771 139223 -859 -38651 53634 -68898
10954f8898p6004M2403K1708O8159n1098n6949j04015m1833J35882Q4012J6423
$$ -68898 -144902 -102499 -80791 -12632 -63730 -120679 -224694 -266527 -130645 -46633 -30210
10943c0210j7143M1071K3227j47105J10244L5369L4452q6755k7064P5468M0525
$$ -30210 -47353 -6282 16945 -130160 -19916 15453 49905 -36850 -63914 11554 52079
10932E2079j9689Q6766r0493J7681n5499n3675r3808l3372M6297P9749r305n8311
$$ 52079 32390 119156 28663 46344 -9155 -62830 -156638 -190010 -143713 -63964 -73269 -131580
10920a31580J37977Q4059k8430o9901M2566L2905R7910K1482j08813j45270l3020
$$ -131580 6397 90456 62026 -7875 34691 67596 165506 186988 78175 -67095 -100115
10909a00115p1300K3502m735j5068R8743M5322K2310K8172r684J48653J2301q5687
$$ -100115 -171415 -147913 -152648 -167716 -68973 -23651 -1341 26831 17147 165800 178101 92414
10897I2414n0595r9750R0276J07533J04796L3042q6603j89104j85374N7191J59602
$$ 92414 41819 -57931 32345 139878 244674 277716 191113 2009 -183365 -126174 33428
10886C3428J8602L9024Q766l7515J18980j27973m0928j9476J15164J07356l6888
$$ 33428 52030 91054 99820 62305 181285 53312 12384 -7092 108072 215428 178540
10875A78540N2079K1232k658j05110j18142m6519l8591L7686Q038O8197K8515
$$ 178540 230619 251851 249193 144083 25941 -20578 -59169 -21483 -13445 54752 83267
10864H3267M0840p0694j49189q0425L7035K396o642j1028M2268o5970q041O5966
$$ 83267 124107 53413 -95776 -176201 -139166 -136770 -143412 -154440 -112172 -178142 -186183 -120217
10852a20217K3913P3599M783K01080j8216n6709K5719k428k04772r9759R1881
$$ -120217 -96304 -22705 -17922 183158 164942 108233 133952 131524 -73248 -173007 -81126
10841h1126n4723l068O7627o7493L1808J47866J15196o6238j1546p7038k52977
$$ -81126 -135849 -138917 -71290 -138783 -106975 40891 156087 89849 78303 1265 -251712
10830b51712j7975N9162j031Q1047J54635Q6342m1589j32446n5477O8287P7117
$$ -251712 -269687 -210525 -211556 -130509 24126 110468 68879 -63567 -119044 -50757 26360
10819B6360O2139r304q4168p4727j1466p2216N7822K7001K0151L6146L3001K4158
$$ 26360 88499 79195 -4973 -79700 -91166 -163382 -105560 -78559 -58408 -22262 10739 34897
10807C4897J5335o2583J0962j0120M2961K1249J6292Q1038N1530l443l9958m3990
$$ 34897 50232 -12351 -1389 -11509 31452 52701 68993 150031 201561 198118 158160 114170
10795A14170L8375P5830L3504k36879j23486M4146O6066P7122J9053j10390J09359
$$ 114170 152545 228375 261879 25000 -98486 -54340 11726 88848 107901 -2489 106870
10784A06870J5525j09310j6182J03664n3098q3574l4012N7282K2147m2974n8855
$$ 106870 122395 13085 -3097 100567 47469 -36105 -70117 -12835 9312 -33662 -92517
10773i2517K0083J00050J45994m326L0841J09939J2074l74449j57684J98609J50418
$$ -92517 -72434 27616 173610 169284 200125 310064 322138 -52311 -209995 -11386 139032
10762A39032L748r6767j19189p1774j484P5227o6347P306J831M8317l2501M6219
$$ 139032 142780 46013 -73176 -144950 -146434 -71207 -137554 -130248 -128417 -80100 -112601 -66382
10750f6382q92n2243j01491P6781l8347j4379n2583R2253J02905n9974J9330Q939
$$ -66382 -67274 -119517 -221008 -144227 -182574 -196953 -249536 -157283 -54378 -114352 -95022 -86083
10738h6083j17847n2353P8660k277N6875R7714J43960L2591k3818k6857q5785
$$ -86083 -203930 -256283 -177623 -179900 -123025 -25311 118649 151240 127422 100565 14780
10727A4780p6451L4714m8201q5623J16598L6323o4716j13877q3938J05935P9220
$$ 14780 -61671 -26957 -75158 -160781 -44183 -7860 -72576 -186453 -270391 -164456 -85236
10716h5236Q8390J5683n4441q914L8772M9843o184j9239j29363n8291m8213J4957
$$ -85236 3154 18837 -35604 -44518 -5746 44097 37913 18674 -110689 -168980 -217193 -202236
10704b02236j42603K336J52119K8098j3245l4009j8767N955K1476m8875j0088
$$ -202236 -344839 -342503 -190384 -162286 -175531 -209540 -228307 -222352 -200876 -249751 -259839
10693b59839Q0216L3895P590K3643P6602J7391r2924p1298K4910K16425J8184
$$ -259839 -179623 -145728 -138138 -114495 -37893 -20502 -113426 -184724 -159814 56611 74795
10682G4795J07442O3536m6009j66709j30244j2595Q582j0581J36335M0100p6827
$$ 74795 182237 245773 199764 33055 -97189 -109784 -101202 -111783 24552 64652 -12175
10671a2175o6287m6314J95017J44213n7165r6754K1389l4571j2281Q498j7484
$$ -12175 -78462 -124776 70241 214454 157289 60535 81924 47353 35072 43570 26086
10660B6086J3331Q3091l4874j4599q643l8256K6329Q4946O4223p9994j60089J5201
$$ 26086 39417 122508 87634 73035 64392 26136 52465 137411 201634 121640 -38449 -23248
10648b3248J61680J8285m7041l6850n7103J09997J7879k3137q8667n0031P7729
$$ -23248 138432 156717 109676 72826 15723 125720 143599 120462 31795 -18236 59493
10637E9493J13775J5890p1666j25054j22270J00656M2396L8126O6100n6374o9293
$$ 59493 173268 189158 117492 -7562 -129832 -29176 13220 51346 117446 61072 -8221
10626h221n0695K6249J08787k198j7537p4815j60534j3612j488J5542J7552M8930
$$ -8221 -58916 -32667 76120 73922 56385 -18430 -178964 -192576 -194064 -178522 -160970 -112040
10614a12040R9561m5672m9211K8685j46461o2644l2477L7226P4274P3565P3967
$$ -112040 -12479 -58151 -107362 -78677 -225138 -287782 -320259 -283033 -208759 -135194 -61227
10603f1227R1461j8899K0737j1702m974O7004k1100r4350K5543L2496K2233N3365
$$ -61227 30234 11335 32072 20370 15396 82400 61300 -33050 -7507 24989 47222 100587
10591A00587J3133M4605n5674K0762k2948r2094k7492j3338m2721L745N2967N959
$$ 100587 113720 158325 102651 123413 100465 8371 -19121 -32459 -75180 -71435 -18468 -12509
10579a2509K9888Q5157n9398p3014l7965L4398j8756L0590J12575o1866p4016
$$ -12509 17379 102536 43138 -29876 -67841 -33443 -52199 -21609 90966 29100 -44916
10568d4916N8451J09606J5721j5224M5331j20623p5508L6723m9025o8676R071
$$ -44916 13535 123141 138862 123638 168969 48346 -27162 9561 -39464 -108140 -99069
10557i9069P9303r8869j28815n0038J948J91495J60630J06588m0292n6722q6751
$$ -99069 -19766 -118635 -247450 -297488 -295540 -104045 56585 163173 122881 66159 -20592
10546b0592L3808M3621M32K9200j44816r7408o0482J3582P0985j9991P9145n1419
$$ -20592 13216 56837 57269 86469 -58347 -155755 -216237 -202655 -131670 -151661 -72516 -123935
10534a23935M9008P5530m7388m5196K581j3683P618j8392J50041J17746K4798
$$ -123935 -74927 603 -46785 -91981 -89400 -103083 -95465 -113857 36184 153930 178728
10523A78728q9743q3611j55666q0767N6725J09938j9986l1904J15533P6429M1726
$$ 178728 88985 5374 -150292 -231059 -174334 -64396 -84382 -116286 -753 75676 117402
10512A17402L8037k7134n517M0014N0144o4292k2360j9324j52552o6246n9764
$$ 117402 155439 128305 122788 162802 212946 148654 126294 106970 -45582 -111828 -171592
10501a71592j3696J5310R119L8606R0934j8424K6618j2619j0144K7878m4422K4800
$$ -171592 -185288 -169978 -160859 -122253 -31319 -49743 -23125 -35744 -45888 -18010 -62432 -37632
10489c7632m3297k3236J43125K6431Q1189K3788r3811n3928p491L7562N6980J08876
$$ -37632 -80929 -104165 38960 65391 146580 170368 76557 22629 15138 52700 109680 218556
10477B18556m9509r6667k6302M5288M3458o3508l5489L8526n9703k8736R4819
$$ 218556 169047 72380 46078 91366 134824 71316 35827 74353 14650 -14086 80733
10466H0733l9387J6828l3594l3429L6161R8286n8328q6399K2890J56149O8552
$$ 80733 41346 58174 24580 -8849 27312 125598 67270 -19129 3761 159910 228462
10455B28462o7357k3564L0428J5357J5156l4609q130l4608L2034Q615j43037p7530
$$ 228462 161105 137541 167969 183326 198482 163873 155743 121135 153169 161784 18747 -58783
10443e8783P9866O7774j00931j3640N0144M8726M8544R378n7976q1166J8373Q2945
$$ -58783 21083 88857 -12074 -25714 24430 73156 121700 131078 73102 -8064 10309 93254
10431I3254K7866N0796L2519j73171J9429m0567q9121K7865m2470N3654K92R9126
$$ 93254 121120 171916 204435 31264 50693 10126 -78995 -51130 -93600 -39946 -39654 59472
10419E9472K8508j39548j55476k2324j9726O6975l0416J4205m802M3755J13033
$$ 59472 87980 -51568 -207044 -229368 -249094 -182119 -212535 -198330 -203132 -159377 -46344
10408d6344K5709j2842J13925q7709L5355n5735P6972N2154j25386L8190J73656
$$ -46344 -20635 -33477 80448 -7261 28094 -27641 49331 101485 -23901 14289 187945
10397A87945R3497o1882j03795r2139M2091n9954M4657L9533J55832n1122j9594
$$ 187945 281442 219560 115765 23626 65717 5763 50420 89953 245785 194663 175069
10386A75069k1617m7930r1948R7482n8144j01283K3416M9388P5769J5720J24599
$$ 175069 153452 105522 13574 111056 52912 -48371 -24955 24433 100202 115922 240521
10375B40521N7160j4831q5935j22814p6260J3180j57004n3570N9172L491J29104
$$ 240521 297681 282850 196915 74101 -2159 11021 -145983 -199553 -140381 -136890 -7786
10364g786J60738J12166J1672j03242n0982Q7390q4611j73817K3272O8609n1765
$$ -7786 152952 265118 276790 173548 122566 209956 125345 -48472 -25200 43409 -8356
10353h356l5774M199o8873O669R8607J03887l5038l0861J3965M5778p143N3329
$$ -8356 -44130 -39931 -108804 -102135 -3528 100359 65321 34460 48425 94203 87060 140389
10341A40389o740j06090M0976k5388m6402m3153j3045Q9118P7556k9920j9211
$$ 140389 133649 27559 68535 43147 -3255 -46408 -59453 29665 107221 77301 58090
10330E8090J275n3131Q8762J7417j14029j24964R575J04898J35964k053j21334
$$ 58090 59365 6234 94996 112413 -1616 -126580 -117005 -12107 123857 121804 470
10319D70n4776l0892j02552n3610R6726J19701Q2241j2740o9518p741J7432j21511
$$ 470 -54306 -85198 -187750 -241360 -144634 -24933 57308 44568 -24950 -32691 -15259 -136770
10307a36770j59078K3710O1928O1749k5978k0744O5332J56678K9288j9818Q3461
$$ -136770 -295848 -272138 -210210 -148461 -174439 -195183 -129851 26827 56115 36297 119758
10296A19758O2780m8968Q0059j30657o1533O0231j01920n2948o8629m1200M9404
$$ 119758 182538 133570 213629 82972 21439 81670 -20250 -73198 -141827 -183027 -133623
10285a33623J75308J30878k8890P8613o0022l5067j56745r3706L7335o146Q6621
$$ -133623 41685 172563 143673 222286 162264 127197 -29548 -123254 -85919 -92065 -5444
10274e444l029k3155K8288j7683L5917M2199q0380n9793N9733M3234L974o7760
$$ -5444 -8473 -31628 -3340 -21023 14894 57093 -23287 -83080 -23347 19887 23861 -43899
10262d3899J9175j8728j68221j04560K23786J46715K1904m0967M7030l041r402
$$ -43899 -24724 -43452 -211673 -316233 -92447 54268 76172 35205 82235 79194 69792
10251F9792j29401j25079j6384Q0024J99396J01351q4778j67715k2242N009K6045
$$ 69792 -59609 -184688 -201072 -121048 78348 179699 94921 -72794 -95036 -90027 -63982
10240f3982O3N0745P4935O7501O5501J9017l0730L8971k6647k3607p7265m8763
$$ -63982 -63919 -13174 61761 129262 194763 213780 183050 222021 195374 171767 94502 45739
10228D5739P5685K2145O7462L6243l3278l5990p5054k4459J6400q8457J6627l134
$$ 45739 121424 143569 211031 247274 213996 178006 102952 78493 94893 6436 23063 19929
10216A9929j5437R6679m7366J09356J0026p3909N231n6863L2858p6256J4336M5242
$$ 19929 4492 101171 53805 163161 173187 99278 104509 47646 80504 4248 18584 63826
10204F3826M2166n0388J3925M7957J09722l4480j13316r8209n9829K0167M7609
$$ 63826 105992 55604 69529 117486 227208 192728 79412 -18797 -78626 -58459 -10850
10193a0850J4583L1229P0782j3666p8933L0673L1756k7023N9786P778n2642r2782
$$ -10850 3733 34962 105744 92078 13145 43818 75574 48551 108337 116115 63473 -29309
10181b9309p3543Q0619J15427J05457l6129o6578L6264o0303j4273R2584J13943
$$ -29309 -102852 -22233 93194 198651 162522 95944 132208 71905 57632 150216 264159
10170B64159j04538o0268l307J05409Q2213k0378o4962q3784K1972q4633Q472
$$ 264159 159621 99353 96046 201455 283668 263290 198328 114544 136516 51883 60355
10159F0355O995K5324k536r7564o6483N1151M3356L7650j9296J1743l2957l0823
$$ 60355 67350 92674 90138 -7426 -73909 -22758 20598 58248 38952 50695 17738 -13085
10147a3085l2430r4480L8640k7322J28001R0563N7756O1240j826L3635o5781l3085
$$ -13085 -45515 -139995 -101355 -128677 -676 89887 147643 208883 207057 240692 174911 141826
10135A41826j5304l3872k4788Q493l3129n0331l9355q9076J1200P0739J09906
$$ 141826 126522 92650 67862 76355 43226 -7105 -46460 -135536 -124336 -53597 56309
10124E6309J5258q7855J0961J10820J05206J0725o5290J9995J21562o0855l8904
$$ 56309 71567 -16288 -5327 105493 210699 221424 156134 176129 297691 236836 197932
10113A97932q4509J0044M2318j3422o7553p3614K2487l5026j32509j3464J31011
$$ 197932 113423 123467 165785 152363 84810 11196 33683 -1343 -133852 -147316 -16305
10102a6305J17821m2340j76440K1602j5740O4942p77j4181P0272J23702o3858
$$ -16305 101516 59176 -117264 -95662 -111402 -46460 -47237 -61418 8854 132556 68698
10091F8698k1073J566Q4037L2252J6049o1067m4834n1446J51637K03976O0113
$$ 68698 47625 49191 133228 165480 181529 120462 75628 24182 175819 379795 439908
10080D39908o4767j9238Q0693M0301L2711j02598K7318J79224J04716J49352J36240
$$ 439908 375141 355903 436596 476897 509608 407010 434328 613552 718268 867620 1003860
10069A003860M1199P4620J24743J94467J25078K89750M94914O74823P78713R67855
$$ 1003860 1045059 1119679 1244422 1438889 1563967 1853717 2348631 3023454 3802167 4770022
10059D770022J416937K692406N334359J0547035J6819342J1945895M64237l392561
$$ 4770022 6186959 8879365 14213724 24760759 41580101 53525996 53990233 50597672
10051E0597672r222681j2371487j0668157o801091l710133k198131j479986q44171
$$ 50597672 41374991 29003504 18335347 11534256 7824123 5625992 4146006 3301835
10043C301835o44887n60114k89202k64705l45509q3724j49426j05212j7479p9183
$$ 3301835 2656948 2096834 1807632 1542927 1197418 1113694 964268 859056 841577 762394
10033G62394o7518O6232p8355j23799o5120J9252J1999j8364n5681j62464o3970
$$ 762394 694876 761108 682753 558954 493834 513086 525085 506721 451040 288576 224606
10022B24606r2901o559R0595m0165j1173L8169J67081o1612L249l4494J9928m7467
$$ 224606 131705 125146 215741 175576 164403 202572 369653 308041 311290 276796 296724 249257
10010B49257j32142j10860j6976m6716J34717J7208l0855q840m9023P4624J36694
$$ 249257 117115 6255 -10721 -57437 77280 94488 63633 54793 5770 80394 217088
9999B17088P3931p8326J958n8031P5300K4865r0367j51788K2613K7954L9568J04501
$$ 217088 291019 212693 214651 156620 231920 256785 166418 14630 37243 65197 104765 209266
9987B09266J04131n7914K9745k5962k7939j9290p7818m2927O0569K5530L3403
$$ 209266 313397 255483 285228 259266 231327 212037 134219 91292 151861 177391 210794
9976B10794j2939p1457j9141K4780o8777j09723p9980J91746J99395n6800j12576
$$ 210794 197855 126398 107257 132037 63260 -46463 -126443 65303 264698 207898 95322
9965I5322K3886N0804O8181J30078Q2495j10458q5269j04148j40193j28983l2052
$$ 95322 119208 170012 238193 368271 450766 340308 255039 150891 10698 -118285 -150337
9954a50337R2125p0838N813J46950P7381p0059J4094J43586J04602p129o320J8235
$$ -150337 -58212 -129050 -123237 23713 101094 31035 45129 188715 293317 286188 279868 298103
9942B98103L5146P3616j04570R768j6670p0635j04847n8171R3692J7458P3540
$$ 298103 333249 406865 302295 312063 295393 224758 119911 61740 155432 172890 246430
9931B46430n2315r0827l5707K5886Q7091R8442j8096j3422N255N5557n2742j30005
$$ 246430 194115 103288 67581 93467 180558 279000 260904 247482 252737 308294 255552 125547
9919A25547q3623L6962M5617l1949k7395o8992J2843M9479O363J43585Q3908l0277
$$ 125547 41924 78886 124503 92554 65159 -3833 9010 58489 64852 208437 292345 262068
9907B62068j52946j20372l6271R8123O4326n0663P7358M6113r227K3715l0068
$$ 262068 109122 -11250 -47521 50602 114928 64265 141623 187736 178509 202224 172156
9896A72156l2333k0487m0929j0135k5134p2513m6758L4967M2511o6393o3540m3499
$$ 172156 139823 119336 78407 68272 43138 -29375 -76133 -41166 1345 -65048 -128588 -172087
9884a72087J18904P9504k9361q285j21619L1137J6674J8845J0430J38257R1824
$$ -172087 -53183 26321 -3040 -11325 -132944 -101807 -85133 -66288 -55858 82399 174223
9873A74223N5547J0626j07954l1555p1164o7109N6891Q7491J8815K8636L7562
$$ 174223 229770 240396 132442 100887 29723 -37386 19505 106996 125811 154447 192009
9862A92009k2541O3575N040N7986r1212o5771M9353P6074n7773K3560N4353K9285
$$ 192009 169468 233043 238083 296069 204857 139086 188439 264513 206740 230300 284653 313938
9850C13938l5664r0219q6055N6969M5015P1344m8859j4743P0918N666l3602p3433
$$ 313938 278274 188055 102000 158969 203984 275328 226469 211726 282644 288310 254708 181275
9838A81275n9919O1620O8570n3156j08179M2976N3557m2762n6300L751k6867M2475
$$ 181275 121356 182976 251546 198390 90211 133187 186744 143982 87682 91433 64566 107041
9826A07041J7368n605j50175j06935j06642K3832P6771r6597N1458P5088N5179
$$ 107041 124409 118804 -31371 -138306 -244948 -221116 -144345 -240942 -189484 -114396 -59217
9815e9217N7592J716M342L6018J2008j8103l8245j13397M1118Q2300L784m9267
$$ -59217 -1625 91 4433 40451 52459 34356 -3889 -117286 -76168 6132 9916 -39351
9803c9351L3879k4969R9275k4215j42644J25693Q4242o6923p1780r8526Q1038
$$ -39351 -5472 -30441 68834 44619 -98025 27668 111910 44987 -26793 -125319 -44281
9792d4281Q7577O8604O0366L6929j28211r9117R6580J06556N3164j43868n4365
$$ -44281 43296 111900 172266 209195 80984 -18133 78447 185003 238167 94299 39934
9781C9934O1322m0961k6174k8122L6612m6927j07053Q3339Q0641O9828J00613
$$ 39934 101256 60295 34121 5999 42611 -4316 -111369 -28030 52611 122439 223052
9770B23052n243p3969m9901j09782l4487P43k8715R0254l8760j58580k4634J59223
$$ 223052 217809 143840 93939 -15843 -50330 -49587 -78302 11952 -26808 -185388 -210022 -50799
9758e0799J50566P3515k800j1799P68m3959K1940J6468K713P6467m9881l6775
$$ -50799 99767 173282 170482 158683 159451 115492 137432 153900 156613 233080 183199 146424
9746A46424j3133L0956o8184L7960J1498o6371J1837k6960O5302n1332j10005
$$ 146424 133291 164247 96063 134023 145521 79150 90987 64027 129329 77997 -32008
9735c2008Q186J20703L9259j06598p3341o1048K0390N4743O8672M212o790M8409
$$ -32008 -23822 96881 136140 29542 -43799 -104847 -84457 -29714 38958 43170 36380 84789
9723H4789N5262k0698q2513j9907l3232Q3285p21k5881K6566O0245L7767o3069
$$ 84789 140051 119353 36840 16933 -16299 66986 66265 40384 66950 127195 164962 101893
9711A01893l6156r4904k2795M4642q3464L3421Q3448M7137O1329Q1148J5506k7885
$$ 101893 65737 -29167 -51962 -7320 -90784 -57363 26085 73222 134551 215699 231205 203320
9699B03320J5338j12763j17917q6487k5774r251O0804K4583J25824o3255k22291
$$ 203320 218658 105895 -12022 -98509 -124283 -133534 -72730 -48147 77677 14422 -207869
9688b07869m6139K23500J55110K0704L8458j4863j26625m6335L598r6326J68334
$$ -207869 -254008 -30508 124602 145306 183764 168901 42276 -4059 -461 -96787 71547
9677G1547K1113r9322j83874J21365J55598N0211N7456j13458m5130j4732P5336
$$ 71547 92660 -6662 -190536 -69171 86427 136638 194094 80636 35506 20774 96110
9666I6110k8525r562R7240n0627r722k4732m2899l6834J07181R3303R7387N026
$$ 96110 67585 58023 155263 104636 94914 70182 27283 -9551 97630 190933 288320 293346
9654B93346p353R0569J5333Q1738p8872j8800N7476k3309q3095Q174L7348j10084
$$ 293346 285993 376562 391895 473633 394761 375961 433437 410128 327033 335207 372555 262471
9642B62471k2386J04772L330m2670j01703n8698M0595O487j355P5690O167r9971
$$ 262471 240085 344857 348187 305517 203814 145116 185711 192198 190843 266533 272700 172729
9630A72729M082k9160j41485j2504J18565M3971j4066N930j1928O3319j6211j49696
$$ 172729 176811 147651 6166 -6338 112227 156198 142132 148062 136134 199453 183242 33546
9618C3546q4171M8343l577J08180P8089J4328k7479k0754n6575O8639k2942k2636
$$ 33546 -50625 -2282 -5859 102321 180410 194738 167259 146505 89930 158569 135627 112991
9606A12991P5287Q3111l2304q0983j3576J25489N830q2412O5765k8001P717L369
$$ 112991 188278 271389 239085 158102 144526 270015 275845 193433 259198 231197 238914 242283
9594B42283o1790m8303L1466j8568K6528J15755M8285j39880M511n5029n2420
$$ 242283 180493 132190 163656 145088 171616 287371 335656 195776 200287 145258 92838
9583I2838J35748O3372j1526p755n0688j032j5301r1740O115R0060P1814J9412
$$ 92838 228586 291958 280432 272677 221989 220957 205656 113916 120031 210091 281905 301317
9571C01317k2967K6730q6756k4995k3744p5489P4137P857j03706k224J26690N7526
$$ 301317 278350 305080 218324 193329 169585 94096 168233 176090 72384 70160 196850 254376
9559B54376j39443m187J39281O4042K7231m9364o1542Q2447r342r7721o6761K4873
$$ 254376 114933 110746 250027 314069 341300 291936 230394 312841 303499 205778 139017 163890
9547A63890j02169n4203J46894L0206j7126j16345k6919L6468j22325P593J16991
$$ 163890 61721 7518 154412 184618 167492 51147 24228 60696 -61629 -54036 62955
9536F2955J20199J1069l2907J6201l3195j9048l8377p5877K0855M9473O8484J2858
$$ 62955 183154 194223 161316 177517 144322 125274 86897 11020 31875 81348 149832 162690
9524A62690M7823J5730p1980j53326Q443J34797J19704k2120q5234M7977J14171
$$ 162690 210513 226243 154263 937 9380 144177 263881 241761 156527 204504 318675
9513C18675J7479q6203L4708n427j38807l1937j9019n434J02900K312m2041L170
$$ 318675 336154 249951 284659 279232 140425 108488 89469 84035 186935 189247 147206 150376
9501A50376L5265J17074o917l6615P74r6991m6471l4687K0207o4440l6924J3017
$$ 150376 185641 302715 295798 259183 259957 162966 116495 81808 102015 37575 651 13668
9489A3668K1202k3373p8306L9869L5103J0150P1435P0080Q7616J09931O4718j2286
$$ 13668 34870 11497 -66809 -26940 8163 18313 89748 159828 247444 357375 422093 409807
9477D09807o7463O744j2173O2212j4649r5731j65561j4964J60169p4O209K0702
$$ 409807 342344 349088 336915 399127 384478 288747 123186 108222 268391 268317 274526 295228
9465B95228j03826q7003q9199k1880N9997Q7347J27481J30762o1832j02291j765
$$ 295228 191402 104399 15200 -6680 53317 140664 268145 398907 337075 234784 233019
9454B33019J3872Q1679j1886k31037q8986k7700M7483k6767P4395O741P1285P2569
$$ 233019 246891 328570 316684 85647 -3339 -31039 16444 -10323 64072 70813 142098 214667
9442B14667O958m1218K1155n1829l6945q3512J63547N4349n7689M2453M2280K127
$$ 214667 221625 180407 201562 149733 112788 29276 192823 247172 189483 231936 274216 276343
9430B76343r95j005J8710n1751k8639L5945M4877M35n4030m8645q053j6550K4417
$$ 276343 275348 274343 293053 241302 212663 248608 293485 293920 239890 191245 183192 166642 191059
9417A91059l0006q4470J03804J72152j3515j39133j49270Q4965N242r1291J457
$$ 191059 161053 76583 180387 352539 339024 199891 50621 135586 140828 49537 50994
9406E0994j1636k4982N5580M9013K1146P0840O5302J9011p9092j86011n9872K5527
$$ 50994 39358 14376 69956 118969 140115 210955 276257 295268 216176 30165 -29707 -4180
9394d180M4271m805o2395N4032O1954J36265J02436o6156j25366j28931r915R9974
$$ -4180 40091 35286 -27109 26923 88877 225142 327578 261422 136056 7125 -2790 97184
9382I7184O0860l518K5270n3153J1871N8037R0773p8423n9212K0653O0009j05372
$$ 97184 158044 154526 179796 126643 138514 196551 287324 208901 149689 170342 230351 124979
9370A24979n3067J78267O1260j54069j6551m4261q1175J80001J31231K0697l4700
$$ 124979 71912 250179 311439 157370 140819 96558 15383 195384 326615 347312 312612
9359C12612L8568J16497k4759l4586p61k5254j27879K7839J8909K429K2136n7776
$$ 312612 351180 467677 442918 408332 407571 382317 254438 282277 301186 303615 325751 267975
9347B67975o7346l2747M6363Q3871Q4082j3783k1599L578j6873j06544k9122J09737
$$ 267975 200629 167882 214245 298116 382198 368415 346816 350394 333521 226977 197855 307592
9335C07592j585o9241j17525N9017j0904L100m2800n8477Q0215j0155P6636M0206
$$ 307592 306007 236766 119241 178258 167354 170454 127654 69177 149392 139237 215873 256079
9323B56079r232R909j66292j12559J13392L5613M8134M6014J05162M7196O2610
$$ 256079 246847 256756 90464 -22095 91297 126910 175044 221058 326220 373416 436026
9312D36026o1614j01280j6014l34J5839O4950r5604j97862Q340J29228L3074k16797
$$ 436026 374412 273132 257118 256784 272623 337573 241969 44107 52447 181675 214749 -2048
9300b048m3329J83686N4138l5090J66220k4595j12291P945J43977j7715o1087
$$ -2048 -45377 138309 192447 157357 323577 298982 186691 194636 338613 320898 259811
9289B59811K7391k3630l3204M234o137N6927N7655Q1575O9495o6860M754J13335
$$ 259811 287202 263572 230368 234602 228465 285392 343047 424622 494117 427257 432011 545346
9277E45346N5145r3990o7307k8945l8376j23126q3116J08448J39263m9291j9778
$$ 545346 600491 506501 439194 410249 371873 248747 165631 274079 413342 364051 344273
9266C44273j7216J8818L5218L3548K2045M9850N4746m7343o769r5932q6018M6864
$$ 344273 327057 345875 381093 414641 436686 486536 541282 493939 487170 391238 305220 352084
9254C52084L9710J74997j351l8664l3444r5697q6787P0675L5180Q2229K5852j49850
$$ 352084 391794 566791 565440 526776 493332 397635 310848 381523 416703 498932 524784 374934
9242C74934L7943M8788Q65p0178K1658L0018p0080q3995Q1435O2366l8263n3372
$$ 374934 412877 461665 462530 392352 414010 444028 373948 289953 371388 433754 395491 342119
9230C42119j4997J31203J00164q7500k6673J24115L7365M4106N7244O8972K3404
$$ 342119 327122 458325 558489 470989 444316 568431 605796 649902 707146 776118 799522
9219G99522M9209j08426j04472J7932K216R179o5436l9787O7124J24486M9891
$$ 799522 848731 740305 635833 653765 655981 665160 599724 559937 627061 751547 801438
9208H01438j19105O8130O2978m292J7076J65465L0720l889J7879n782J01208L672
$$ 801438 682333 750463 813441 809149 826225 991690 1022410 1018521 1036400 1030618 1131826 1135498
9196A135498J3849l9663K7132P2864L1R2478L4579k0161p2277k2036N0680K4379
$$ 1135498 1149347 1109684 1136816 1209680 1209711 1302189 1336768 1316607 1244330 1222294 1272974 1297353
9184A297353R9206L6801O9147Q9616K4545N8298j982j4720m494J96470N9494P4785
$$ 1297353 1396559 1433360 1502507 1592123 1616668 1674966 1672984 1658264 1653770 1850240 1909734 1984519
9172A984519O5216J65669Q7946k1518M9696Q9582J17892J55429J53484J78686
$$ 1984519 2049735 2215404 2303350 2281832 2331528 2421110 2539002 2694431 2847915 3026601
9162C026601J93366K9051M8024R1805J63017J90828K46570J37442K11088J93829
$$ 3026601 3219967 3249018 3297042 3388847 3551864 3742692 3989262 4126704 4337792 4531621
9152D531621R5061N0056J53773K18588K96628K75868L68275L69442M24982K71309
$$ 4531621 4626682 4676738 4830511 5049099 5345727 5621595 5989870 6359312 6784294 7055603
9142G055603L17317M15312L23128N42390N91859N39737P35276P60892O06595N64934
$$ 7055603 7372920 7788232 8111360 8653750 9245609 9785346 10520622 11281514 11888109 12453043
9132A2453043P62564R03218R76013R90319J089943J151476J174499J113225J083588
$$ 12453043 13215607 14118825 15094838 16085157 17175100 18326576 19501075 20614300 21697888
9123B1697888J129425J210470R82284Q88058N96539N29835L41430J83655p1344
$$ 21697888 22827313 24037783 25020067 25908125 26504664 27034499 27375929 27559584 27488240
9114B7488240k73891m36018n74605p42564p84919r18106j036960j153763j123767
$$ 27488240 27214349 26778331 26203726 25461162 24676243 23758137 22721177 21567414 20443647
9105B0443647j178144j076628r35488r07146r42074q96431q20578q12990q12267
$$ 20443647 19265503 18188875 17253387 16346241 15404167 14507736 13687158 12874168 12061901
9096A2061901p59268o53258n84388o03065n73610n27062l97306k99019m24384
$$ 12061901 11302633 10649375 10064987 9461922 8888312 8361250 7963944 7664925 7240541
9087G240541m06651k27865k68439k72654l17046k68452l54493l16624j69763k25302
$$ 7240541 6833890 6606025 6337586 6064932 5747886 5479434 5124941 4808317 4638554 4413252
9077D413252k48213k63325p5017j30321j77487j29694j03184q8260n7067q6129
$$ 4413252 4165039 3901714 3826697 3696376 3518889 3389195 3286011 3197751 3140684 3054555
9067C054555r1970k80961j75971m2039n817j4911Q502k28967j96326r7195m7462
$$ 3054555 2962585 2681624 2505653 2463614 2457797 2442886 2451388 2222421 2026095 1928900 1881438
9056A881438j7771r2021N1904k0166k6848j22022j20988l1775n9610R3491J07738
$$ 1881438 1863667 1771646 1823550 1803384 1776536 1654514 1533526 1501751 1442141 1535632 1643370
9045A643370j04520q7325r7274l8987M4404o5808L5250o2128j09243P8166J22255
$$ 1643370 1538850 1451525 1354251 1315264 1359668 1293860 1329110 1266982 1157739 1235905 1358160
9034A358160p0032o5973m790j63879r3998P85l292J23339J07044j13235j02617
$$ 1358160 1288128 1222155 1217365 1053486 959488 960273 956981 1080320 1187364 1074129 971512
9023I71512p3095n9543J7187K1866j223m7464L6756J6852n5559j61386j04071
$$ 971512 898417 838874 856061 877927 876704 829240 865996 882848 827289 665903 561832
9012E61832L1928P1310l1891N0145j43877o9579O8058J25692Q8963k0265R2599
$$ 561832 593760 665070 633179 683324 539447 469868 537926 663618 752581 732316 824915
9001H24915q0618p8827j27838j4235R202m5869l5305M6024K8474p7330l6668J3514
$$ 824915 744297 665470 537632 523397 532599 486730 451425 497449 525923 448593 411925 425439
8989D25439Q1710k9476J7749k571n0601K9833l0026J08939J16672N277j36820
$$ 425439 507149 477673 495422 492851 442250 472083 442057 550996 667668 672945 536125
8978E36125j41111j0099Q875L5118J1379n6926j43357K6037P9277R3850R6770
$$ 536125 395014 384915 393790 428908 440287 383361 240004 266041 345318 439168 535938
8967E35938L0789l8589r5494j41424P318Q3216m299j17406n1325P7637Q07K7714
$$ 535938 566727 528138 432644 291220 298538 381754 377455 260049 208724 286361 287168 314882
8955C14882J1651J78m4638o6852K5917M0661n6231j00363J2766M8745N2774L7013
$$ 314882 326533 326711 282073 215221 241138 281799 225568 125205 137971 186716 239490 276503
8943B76503K1798l9811n7515L1000P2641K1979J5551o3812n2342r1484K2552M5304
$$ 276503 298301 258490 200975 231975 304616 326595 342146 278334 225992 134508 157060 202364
8931B02364r332p7599j23342k8115P934L1378L3229q583R3037J33399j32770n1329
$$ 202364 193032 115433 -7909 -36024 -28090 3288 36517 27934 120971 254370 121600 70271
8919G0271Q3259L2924o5562l1323N8707P5132O6696r2519m7701J43517Q4947o9064
$$ 70271 153530 186454 120892 89569 148276 223408 290104 197585 149884 293401 378348 309284
8907C09284j18815o8806M5794l1260j30936K1142Q1683k1756P6661Q9014o8499
$$ 309284 190469 121663 167457 136197 5261 26403 108086 86330 162991 252005 183506
8896A83506k4559M6084J42249M4104j10445j12873R6932J28106j10490n4569r361
$$ 183506 158947 205031 347280 391384 280939 168066 264998 393104 282614 228045 218684
8885B18684R7602J6332j17038L933M4367l9405J00806J34020N9076J89986M9953
$$ 218684 316286 332618 215580 219513 263880 224475 325281 459301 518377 708363 758316
8874G58316O1050L94116M90093K31672K2611p5223k33768l16558k83497k39934
$$ 758316 819366 1213482 1703575 1935247 1957858 1882635 1648867 1332309 1048812 808878
8864H08878j90686j01110o1872p5124j35018M0180o5524O0708J116r4032O5654
$$ 808878 618192 517082 455210 380086 245068 285248 219724 280432 281548 187516 253170
8853B53170O549r6596j01290K1531O5526j3627o8173M2409O8326J4964j8102n4008
$$ 253170 259719 163123 61833 83364 148890 135263 67090 109499 177825 192789 174687 120679
8841A20679N263k2900R0655K58r2671p7621L6884o0188m3078O9066O8443O1903
$$ 120679 125942 103042 193697 193955 101284 23663 60547 359 -42719 26347 94790 156693
8829A56693k2327j6643M5986M3841o4416n1029p719L5883k7752J461j3666P4310
$$ 156693 134366 117723 163709 207550 143134 92105 84386 120269 92517 93978 80312 154622
$$ [...]
##END NTUPLES=NMR SPECTRUM
##END=
