##TITLE=Analysis number 309197
Compound Code cc 33809
Book Reference 416/166
Project Code adrs
Chemist Name stevep
##JCAMPDX= 6.0         $$ Bruker NMR JCAMP-DX V2.0
##DATA TYPE= NMR SPECTRUM
##DATA CLASS= NTUPLES
##ORIGIN= Bruker BioSpin GmbH
##OWNER= NMR
$$ XWIN-NMR		Version 3.5
$$ Tue May 31 10:46:55 2005 GMT Daylight Time (UT+1h)  MAYBRIDGE\NMR@NMR_250MHZ
##.OBSERVE FREQUENCY= 250.131544655141
##.OBSERVE NUCLEUS= ^1H
##.ACQUISITION MODE= SIMULTANEOUS (DQD)
##.ACQUISITION SCHEME= undefined
##.AVERAGES= 16
##.DIGITISER RES= 18
##SPECTROMETER/DATA SYSTEM= dpx250
##.PULSE SEQUENCE= zg30
##.SOLVENT NAME= CDCl3
##.SHIFT REFERENCE= (INTERNAL, CDCl3, 0, 16.4451)
##AUDIT TRAIL= $$ (NUMBER, WHEN, WHO, WHERE, WHAT)
$$ ##TITLE= Audit trail, XWIN-NMR		Version 3.5
$$ ##JCAMPDX= 5.01
$$ ##ORIGIN= Bruker BioSpin GmbH
$$ ##OWNER= NMR
$$ C:\u/data/dgb/nmr/ADRS/3650/pdata/1/auditp.txt
$$ ##AUDIT TRAIL=  $$ (NUMBER, WHEN, WHO, WHERE, WHAT)
(   1,<2005-05-31 10:46:15.93 +100>,<MAYBRIDGE\NMR>,<NMR_250MHZ>,
      <created by zg, POWCHK disabled, PULCHK disabled
       configuration hash MD5:
       62 19 C7 07 E1 42 D1 B7 37 6C 3D D0 77 39 F9 E6
       data hash MD5: 64K
       0D 2E A8 AD 0D C5 21 AA 8C CD 58 2E 65 A9 77 11>)
(   2,<2005-05-31 10:46:32.15 +100>,<MAYBRIDGE\NMR>,<NMR_250MHZ>,
      <Start of raw data processing
       ef LB = 0.3 FT_mod = 6 PKNL = 1 SI = 32K 
       data hash MD5: 32K
       45 EB 03 B6 70 4A 07 8F A2 05 BF B4 84 06 81 01>)
(   3,<2005-05-31 10:46:37.45 +100>,<MAYBRIDGE\NMR>,<NMR_250MHZ>,
      <apk 
       data hash MD5: 32K
       63 8B 07 14 A8 01 CF A4 B2 A3 8B 68 84 4F 2E 1D>)
(   4,<2005-05-31 10:46:38.81 +100>,<MAYBRIDGE\NMR>,<NMR_250MHZ>,
      <abs ABSG = 5 
       data hash MD5: 32K
       DD 78 C2 17 07 A1 BC 87 C3 DB 43 3B 52 1E 52 77>)
$$ ##END=
$$ 
$$ hash MD5
$$ 9B B0 34 85 4F 51 F6 69 2C 1B 31 4E A0 96 74 8B
##$RELAX= 
##$RELAX= 
##$RELAX= 
##$RELAX= 
##$RELAX= 
##$RELAX= 
##$RELAX= 
$$ Bruker specific parameters
$$ --------------------------
##$DU= <C:\u>
##$EXPNO= 3650
##$NAME= <ADRS>
##$PROCNO= 1
##$TYPE= <nmr>
##$USER= <dgb>
##$AMP= (0..31)
100 100 100 100 100 100 100 100 100 100 100 100 100 100 100 100 100 100 
100 100 100 100 100 100 100 100 100 100 100 100 100 100 
##$AQSEQ= 0
##$AQ_mod= 3
##$AUNM= <au_zg>
##$AUTOPOS= <33 >
##$BF1= 250.13
##$BF2= 250.13
##$BF3= 250.13
##$BF4= 250.13
##$BF5= 500.13
##$BF6= 500.13
##$BF7= 500.13
##$BF8= 500.13
##$BYTORDA= 1
##$CFDGTYP= 0
##$CFRGTYP= 5
##$CHEMSTR= <none>
##$CNST= (0..31)
1 1 145 1 1 1 1 1 1 1 1 1 1 1 1 1 1 1 1 1 1 1 1 1 1 1 1 1 1 1 1 1 
##$CPDPRG= <>
##$CPDPRG1= <>
##$CPDPRG2= <>
##$CPDPRG3= <>
##$CPDPRG4= <mlev>
##$CPDPRG5= <mlev>
##$CPDPRG6= <mlev>
##$CPDPRG7= <mlev>
##$CPDPRG8= <mlev>
##$CPDPRGB= <>
##$CPDPRGT= <>
##$D= (0..31)
0 1 0 0 0 0 0 0 0 0.06 0 0 0 0 0 0 0.0002 0 0 0 0 0 0 0 0 0 0 0 0 0 0 
0 
##$DATE= 1117532773
##$DBL= (0..7)
120 120 120 120 120 120 120 120 
##$DBP= (0..7)
150 150 150 150 150 150 150 150 
##$DBP07= 0
##$DBPNAM0= <>
##$DBPNAM1= <>
$$ [...]
##$SUBNAM7= <"">
##$SUBNAM8= <"">
##$SUBNAM9= <"">
##$SW= 20.6930455092707
##$SWIBOX= (0..15)
0 0 3 0 0 0 0 0 0 0 0 0 0 0 0 0 
##$SW_h= 5175.983436853
##$TD= 65536
##$TD0= 1
##$TE= 295.16
##$TE2= 300
##$TE3= 300
##$TEG= 300
##$TL= (0..7)
0 120 120 120 120 120 120 120 
##$TP= (0..7)
150 150 150 150 150 150 150 150 
##$TP07= 0
##$TPNAME0= <>
##$TPNAME1= <>
##$TPNAME2= <>
##$TPNAME3= <>
##$TPNAME4= <>
##$TPNAME5= <>
##$TPNAME6= <>
##$TPNAME7= <>
##$TPOAL= (0..7)
0.5 0.5 0.5 0.5 0.5 0.5 0.5 0.5 
##$TPOFFS= (0..7)
0 0 0 0 0 0 0 0 
##$TUNHIN= 0
##$TUNHOUT= 0
##$TUNXOUT= 0
##$USERA1= <user>
##$USERA2= <user>
##$USERA3= <user>
##$USERA4= <user>
##$USERA5= <user>
##$V9= 5
##$VALIST= <valist>
##$VCLIST= <CCCCCCCCCCCCCCC>
##$VD= 0
##$VDLIST= <DDDDDDDDDDDDDDD>
##$VPLIST= <PPPPPPPPPPPPPPP>
##$VTLIST= <TTTTTTTTTTTTTTT>
##$WBST= 1024
##$WBSW= 4
##$XGAIN= (0..3)
0 0 0 0 
##$XL= 0
##$YL= 0
##$YMAX_a= 325344
##$YMIN_a= -526109
##$ZGOPTNS= <>
##$ZL1= 120
##$ZL2= 120
##$ZL3= 120
##$ZL4= 120
##$ABSF1= 16.44512
##$ABSF2= -4.248053
##$ABSG= 5
##$ABSL= 3
##$ALPHA= 0
##$AQORDER= 0
##$ASSFAC= 0
##$ASSFACI= 0
##$ASSFACX= 0
##$ASSWID= 0
##$AUNMP= <proc_1d>
##$AZFE= 0.1
##$AZFW= 0.1
##$BCFW= 0
##$BC_mod= 0
##$BYTORDP= 0
##$COROFFS= 0
##$CY= 12.5
##$DATMOD= 1
##$DC= 0
##$DFILT= <>
##$DTYPP= 0
##$F1P= 14.0000005364418
##$F2P= -0.99999901652339
##$FCOR= 0.5
##$FTSIZE= 32768
##$FT_mod= 6
##$GAMMA= 0
##$GB= 0
##$INTBC= 1
##$INTSCL= 1
##$ISEN= 128
##$LB= 0.3
##$LEV0= 0
##$LPBIN= 0
##$MAXI= 10000
##$MC2= 0
##$MEAN= 0
##$ME_mod= 0
##$MI= 0
##$NCOEF= 0
##$NC_proc= -5
##$NLEV= 6
##$NOISF1= 0
##$NOISF2= 0
##$NSP= 0
##$NTH_PI= 0
##$NZP= 0
##$OFFSET= 16.44512
##$PC= 1
##$PHC0= -75.07536
##$PHC1= 6.973093
##$PH_mod= 1
##$PKNL= yes
##$PPARMOD= 0
##$PSCAL= 4
##$PSIGN= 0
##$REVERSE= no
##$SF= 250.130019227783
##$SI= 32768
##$SIGF1= 0
##$SIGF2= 0
##$SINO= 400
##$SIOLD= 32768
##$SREGLST= <1H.CDCl3>
##$SSB= 0
##$STSI= 32768
##$STSR= 0
##$SW_p= 5175.98343685301
##$SYMM= 0
##$S_DEV= 0
##$TDeff= 65536
##$TDoff= 0
##$TI= <Analysis number 999999
Compound Code 99
Book Reference 9
Project Code 9>
##$TILT= no
##$TM1= 0
##$TM2= 0
##$TOPLEV= 0
##$USERP1= <user>
##$USERP2= <user>
##$USERP3= <user>
##$USERP4= <user>
##$USERP5= <user>
##$WDW= 1
##$XDIM= 32768
##$YMAX_p= 448408587
##$YMIN_p= -517246
$$ End of Bruker specific parameters
$$ ---------------------------------
##NTUPLES= NMR SPECTRUM
##VAR_NAME=  FREQUENCY,     SPECTRUM/REAL,   SPECTRUM/IMAG
##SYMBOL=    X,             R,               I
##VAR_TYPE=  INDEPENDENT,   DEPENDENT,       DEPENDENT
##VAR_FORM=  AFFN,          ASDF,            ASDF
##VAR_DIM=   32768,         32768,           32768
##UNITS=     HZ,            ARBITRARY UNITS, ARBITRARY UNITS
##FACTOR=    0.157963299565203, 1,           1
##FIRST=     4113.41814623173, 0,            0
##LAST=      -1062.56529062128, 0,           0
##MIN=       -1062.56529062128, -517246,     0
##MAX=       4113.41814623173, 448408587,    0
$$ Real data points
##PAGE= N=1
##DATA TABLE= (X++(R..R)), XYDATA
$$ [...]
23725 -74439 -70252 -17200 17173 82670 85080 79811 82162 50752 26443 29821 7563 -16181 22211
23712 22211 19797 6175 5505 -4904 -34674 -29787 -62245 -83512 -53578 -27344 -852 13681
23700 13681 45469 16735 -27775 -25886 -9992 -35617 -86763 -88347 -77918 -71370 -43540 -68832
23688 -68832 -89459 -39887 19291 70719 6868 -53700 -51800 -37737 5319 8606 -12993 -27310
23676 -27310 -33549 -39273 -75402 -94628 -88590 -61017 -38907 32971 52506 11063 1376 68306
23664 68306 36554 -31184 -52295 -53990 -32548 -4741 -851 -38266 -41455 -31650 -30602 -61320 -84253
23651 -84253 -59732 -14169 13207 16794 -406 -26231 -33807 -30827 -6669 -6737 17804 -38393 -34816
23638 -34816 -23774 16889 47598 17767 31199 6200 -19214 -18898 9430 -47277 -95665 -52224
23626 -52224 -53370 -138016 -135853 -108969 -85202 -50748 -981 -32034 -92089 -76797 -7942 35490
23614 35490 -14340 -24859 -4051 15659 -11097 -22075 -43779 -26307 13273 4611 -65640 -75433
23602 -75433 -72145 -35503 -10228 4249 45006 65845 26255 35369 1919 -43328 -61134 -70295
23590 -70295 -56236 -6076 11279 -28627 -27070 -10812 -52293 -24150 4825 -9171 -44580 -19006
23578 -19006 43769 89620 63877 59028 16116 -13947 7324 41999 -24327 -98587 -104423 -93769
23566 -93769 -69263 -67848 -44636 -28870 -2751 2869 11848 54489 132411 125361 40873 -1012
23554 -1012 61132 101846 29039 22423 18387 -27156 -55264 -63405 -52713 30030 68119 13820
23542 13820 12249 -28110 -65744 -90528 -97620 -76543 -96037 -98708 -72742 -47787 -35037 19595
23530 19595 18445 12335 4216 2040 -4830 -32975 -18833 -29593 -38535 -18999 31122 53361 72309
23517 72309 11340 -1848 5546 8522 -12215 -98003 -136449 -112375 -73566 -29673 -15883 -15857 -12491
23504 -12491 -16990 -57820 -54585 -54445 42 37950 11472 2594 26075 62648 35058 -60258 -83724
23491 -83724 -56500 -48660 -84054 -90667 -46695 -44306 -5361 -21745 -50781 -26638 -30771 -47067
23479 -47067 -60048 -77997 -63003 -27548 -28495 -28214 142 35769 30067 11137 -41903 -77133 -89770
23466 -89770 -69179 -71918 -32179 29679 60041 59019 31539 -28125 -15714 -7856 15165 43045
23454 43045 20813 -33101 -29830 -2974 4449 -20957 -14858 -17217 -53741 -86807 -42323 -8018
23442 -8018 26594 34814 -3668 -18430 -23914 -37469 -26827 -33174 -9762 -25460 -35516 -53544
23430 -53544 -77415 -88671 -67132 7724 14116 -10610 -40641 -36577 -77404 -122977 -88691 -14639
23418 -14639 -2729 -77744 -114519 -98071 -73846 -24190 -31493 -7859 5121 10815 -19066 -64368
23406 -64368 -61004 -43826 -47225 -11178 13296 6011 7070 41346 57293 87534 81975 49239 68376
23393 68376 110288 86290 47475 -28920 -27004 -34746 -27220 39079 60935 67212 54949 88220
23381 88220 149701 92740 50166 58133 64274 45329 66234 43019 -5958 -10478 -29397 -43607
23369 -43607 -20574 12660 -2620 13160 22885 10820 -83404 -131744 -110000 -106268 -108518 -127963
23357 -127963 -114277 -59596 -16468 -2885 -3945 -17664 -51546 -28282 -18568 6920 31514 28691
23345 28691 -18754 11948 48419 31856 61890 29161 -5581 -39076 -46114 -59252 -62050 -52102
23333 -52102 -70556 -28400 17024 66928 44314 5756 -26971 -27188 -32598 -25509 -43459 -23601
23321 -23601 -31108 -30742 107 30932 1010 -24266 -64283 -27012 9533 -11195 8423 10676
23309 10676 -6530 -44336 -35498 -716 42994 82911 49155 6048 7272 -5038 -19271 -41891
23297 -41891 -23106 -21314 -45019 -69852 -64242 -88835 -71565 -3439 70705 77750 14936 4359
23285 4359 15475 23207 17879 15965 23175 20686 -11995 -7071 12624 63895 95007 99767 28694
23272 28694 1711 -18839 10242 16359 23925 36154 24869 18649 -59252 -48975 -7196 29744
23260 29744 50850 56436 24363 3725 -34137 -70982 -75864 -68080 18903 87476 58455 -18116
23248 -18116 -77223 -34162 -4129 79453 65544 80071 22439 -2344 3955 4960 5484 7640 6004
23235 6004 390 -34637 190 -38211 -87439 -77648 -96735 -90433 -77889 -36546 19024 -28313
23223 -28313 4276 62261 11594 -74888 -65915 -54277 -48967 -45849 -28075 -56957 -45522 -59773
23211 -59773 -72454 -89251 -65932 -19788 49938 75432 101381 59422 -10595 -72383 -57044 10088
23199 10088 4663 -4011 -17433 -8225 22612 46208 36768 8182 613 -29483 3863 32287 30492
23186 30492 23579 70764 122219 95690 29034 16596 69086 64466 85142 46370 10529 17981
23174 17981 70947 70295 45410 42504 -23463 -58578 15588 71444 56529 286 -8107 17029
23162 17029 -22512 -105055 -62806 12051 10615 52353 37608 -1931 -996 7508 4076 21959 12489
23149 12489 20899 6733 9101 19720 2102 -27522 20569 38942 -8805 -35866 7131 89874
23137 89874 105796 36746 -24634 -31315 16240 13352 -787 -11411 -69844 -95112 -48729 -31781
23125 -31781 -11100 -6572 74 -40038 -24625 -1680 -45592 -4825 39192 19044 -24681 -36959
23113 -36959 -9655 28727 -845 -45510 -28633 -12674 -28005 -10986 -5912 -57287 -44571 -11055
23101 -11055 14986 14524 55434 67442 17798 1445 6492 -22176 -112621 -136516 -59512 -34439
23089 -34439 -91386 -117383 -56606 -37964 2540 31997 13270 -18680 -51199 -54595 -57697 -25562
23077 -25562 -24068 -10551 73613 95934 89164 13712 63574 89442 31739 -23895 98 -997
23065 -997 -5704 32719 90185 73756 -25204 -79604 -99128 -85355 -99512 -97654 -53668 -45184 -36418
23052 -36418 -44426 -63068 -32238 -51861 27651 65471 9009 -4512 -15604 -53500 -123771 -96741
23040 -96741 -53599 -51705 -9825 62569 107350 78994 49720 93425 83616 14798 -31349 -97029
23028 -97029 -134973 -98180 -46490 -47851 -3250 28354 18779 -1448 -27191 -35783 -28737 20239
23016 20239 45613 8046 -44748 -72366 -89355 -80902 -88263 -117025 -61376 -14472 -13038 13276
23004 13276 16690 34895 7957 -52698 -85262 -26173 -25309 -52984 -108760 -95514 -69085 -51613
22992 -51613 7720 43156 48733 94707 125595 166559 102536 76375 88051 67838 26292 -32385
22980 -32385 -4594 24502 32234 -17425 8141 9205 -2619 22908 9819 -2150 46683 48277
22968 48277 51014 19330 -17244 -27736 3858 63569 40571 32650 4686 -26562 2135 39807
22956 39807 11818 54002 89674 72203 59733 59727 65459 87091 52213 11116 35246 82416 134539
22943 134539 100996 12565 -28893 -21364 -19059 -64980 -62905 -51228 -7772 7462 -4094 -2436
22931 -2436 -17965 -6142 -22212 15960 37116 12853 -10637 6008 4409 13716 14491 62348 137104
22918 137104 59328 -48564 -55859 -59862 -66496 -58036 -45767 -46572 17155 18475 -15516 -46017 -26517
22905 -26517 6215 -7584 -61016 -50666 -18811 33539 3352 849 11710 13179 41000 19339
22893 19339 -8614 -37055 -81739 -64806 -1986 -17773 -35244 -84194 -133186 -118591 -97460 -89359
22881 -89359 -36683 8016 25070 35919 12353 1737 -19393 -46173 9588 14127 -23563 -44766
22869 -44766 -31722 21193 48271 26355 29458 49511 53402 25959 -35903 -82297 -45552 -47974
22857 -47974 -22916 47691 1378 -32483 -41069 9134 8510 11590 -15951 -89742 -72015 21466
22845 21466 44251 42537 70722 31106 -22137 -40390 -62978 -52345 3194 1340 32144 30922
22833 30922 26056 -27234 -21014 -12507 -12078 8488 -40681 -61255 -70307 -78857 -69715 -1207 19541
22820 19541 11681 9400 4864 -9664 16660 12522 20842 -19652 -58021 -54959 -36548 -29335 -28390
22807 -28390 -65502 -47292 -58539 -66039 -79195 -21480 -22855 -43764 -92444 -139546 -119204 -114571
22795 -114571 -106872 -101138 -46443 -11559 -18595 -600 19070 45325 28766 -15331 -55873 -115653
22783 -115653 -102814 -57884 -41386 -77108 -95955 -76339 -77468 -94193 -100950 -90776 -54782 -43902
22771 -43902 -50762 -53582 -112472 -168724 -190101 -231597 -167201 -101216 -79516 -83006 -78184 -61610
22759 -61610 -55383 -59466 -32243 -6520 -1525 27987 33287 40590 47044 32261 22041 -38860 -70837
22746 -70837 -19892 -30238 -100835 -135132 -84038 -99246 -102484 -28161 -17725 -27045 -26782 -9977
22734 -9977 12516 30041 4710 -9086 -23300 22404 23312 9056 -16934 -62258 -66102 -33258
22722 -33258 17223 22154 1330 -24538 -48317 -74922 -73026 -62554 -64164 -12876 4816 41061
22710 41061 64161 19624 24332 18651 50401 59515 25852 4128 -7627 -39246 -70454 -25161
22698 -25161 10358 -55718 -98257 -72586 -25293 44408 72849 36579 30337 8978 -9144 33749
22686 33749 76634 40282 43284 81566 82629 71400 73857 122922 115934 63094 53799 40401 -11463
22673 -11463 -43939 -70920 -63277 -41183 -34544 -40521 -75905 -73817 -36786 -26918 17044 55267 23701
22660 23701 26021 46853 -5445 -1430 50174 90567 109973 66280 64605 34111 29929 -40610
22648 -40610 7144 59869 50390 12088 -14896 26328 34562 3737 -38553 47540 112456 107080
22636 107080 38335 -14653 41740 24498 -19186 -30154 19929 33824 22610 -26785 -57109
22625 -57109 -22756 -48155 -122766 -113448 -97960 -70868 -100955 -109866 -163612 -165074 -96691 -33099
22613 -33099 -26513 -47048 -45958 5786 16974 -964 42352 22710 12561 42562 92419 100569
22601 100569 47200 20372 24807 218 -34303 -74533 -126977 -111517 -72549 -65579 -89983 -57169
22589 -57169 4606 71569 88943 66008 53827 -22435 -48453 -10989 -9638 -9290 -3183 -57014
22577 -57014 -41047 -49753 -66893 -91584 -46498 -14078 -48926 -42291 -51547 -94508 -87412 -49816
22565 -49816 -48848 -48785 -5132 12729 -41341 -53347 -59114 -5266 41835 30667 41 -22533 -61048
22552 -61048 -97509 -52042 -26456 -19524 -38923 -28340 16862 -12137 -19421 14576 15211 38491
22540 38491 58172 34624 11297 39171 42896 25153 -4120 16453 52766 35690 36359 7843
22528 7843 1895 -41102 -55301 -58873 -60590 -51886 -37529 -42209 -7308 7495 41833 41139 881
22515 881 -4636 -3935 15581 -5823 -22795 -66385 -39942 523 68995 92994 66117 103280 50701
22502 50701 35909 -38176 -24432 13017 25895 21737 -36134 -22853 -26426 -17808 -69467 -46153
22490 -46153 -12773 -44342 -38249 -30386 -37696 -441 22000 64163 89932 38043 22240 30392
22478 30392 66807 47545 14623 -21768 -32388 -23747 -14507 -73307 -62839 -28852 -48226 -43355
22466 -43355 -43063 -64993 -60089 -66497 -55163 -49657 -26390 -215 23805 7844 418 -24563 -40995
22453 -40995 -24383 -2308 30514 33005 61316 34736 59358 58665 54375 76769 40312 31030 76785
22440 76785 54200 94285 97738 76782 57318 28221 7433 -16472 -20904 5268 -1885 -14674
22428 -14674 -14104 -47630 -43321 -50057 -26265 6952 -10867 -8993 8749 -3538 2424 -32501 -55086
22415 -55086 -17975 -35199 -16310 14602 3178 -6847 -5875 -55503 -26884 -19814 57137 49793
22403 49793 77567 152862 106026 87407 75309 114270 98182 65720 95125 103268 136375 100740
22391 100740 102603 132403 151276 165267 138890 165892 222004 270357 370154 564070 933573
22380 933573 1525185 2382792 3463421 4253761 4242367 3579098 2578715 1738706 1213437
22371 1213437 876394 628504 434980 309787 241616 198939 146164 191153 168701 104465
22361 104465 126681 93920 53896 47814 33522 21286 62415 33493 20614 15729 29416 88910
22349 88910 120465 86579 64181 23595 8691 16833 -50349 -76551 -82342 -12331 -24836 -46773
22337 -46773 -47704 -11760 7915 -13797 10360 674 9152 46488 52369 10724 8506 11937 -21461
22324 -21461 -16238 17477 1800 -34443 -44885 -43960 30416 47021 19039 -6990 4258 17519
22312 17519 48123 60636 56657 7141 -12009 -32671 -47572 -43406 -22206 -22402 -59610 -48064
22300 -48064 35136 50045 -3911 -48679 11817 98378 90630 36430 -44475 -107836 -102591 -64633
22288 -64633 -27964 -80625 -78977 -73898 -69587 -21398 2855 1545 -34273 -72712 -33764 -13074
22276 -13074 -31764 -59426 -86160 -63218 -66898 -31290 -20953 21047 29628 73919 110084 82916
22264 82916 30692 14477 16882 183 -31123 -1071 -676 -56384 -70304 -40146 -52708 -50671
22252 -50671 -46841 -52088 -13726 -12046 -3120 12601 -24790 -26320 -10642 -7582 -35033 -58245 -31513
22239 -31513 -73074 -154674 -185190 -209808 -134834 -53507 -15862 19916 22955 27280 71401 80905
22227 80905 31342 -16523 25702 60160 63708 18036 -45365 -73945 -53401 -51102 -91448 -68923
22215 -68923 -32176 -14359 -9914 -55396 -32223 39807 51834 54427 -27902 -28360 -13256 -10982 -22402
22202 -22402 23348 34417 -42403 -52737 -63938 -29587 -32356 -15408 312 6798 2880 -4251
22190 -4251 3696 -34358 -3588 -17 10481 28047 26755 43629 -2790 12233 -11548 -1991 22545
22177 22545 335 1466 1419 -2347 16435 -23925 -100236 -54581 -28999 -26087 -31313 15208 -18345
22164 -18345 -28391 -34016 -29815 -10360 -13647 -46537 -34021 2070 -11067 -20258 -21797 52609 65529
22151 65529 -7537 -56739 -1427 70528 60266 80460 121220 78069 34729 35197 46682 50524
22139 50524 8391 -23376 -56601 -46120 -25828 13697 58768 51986 22238 -17592 -11599 36336
22127 36336 35279 9832 -10879 -862 -26689 35879 74970 104614 86745 -2974 -46424 -3691
22115 -3691 -4959 -33085 -33001 15446 -17692 -76390 -69818 -79584 -73504 -71709 -73384 -49550 21145 15995
22101 15995 33518 69474 77566 86115 67910 80108 62663 102925 108442 78926 34091 22661
22089 22661 35669 52140 58213 -20895 9114 47188 15136 2803 -45099 -82991 -91154 -61938
22077 -61938 -23435 -44829 -44057 -22286 -14917 -6333 -14960 -11523 10838 29115 41765 58295 51458
22064 51458 8410 -93000 -105596 -44773 -9052 -50830 -21842 -37350 -31894 25612 25121 30289
22052 30289 37141 114924 159016 111402 41708 12138 27686 32936 25039 7023 10439 31764
22040 31764 20269 -28064 -39615 -43359 -112125 -127158 -136490 -93302 -30016 32590 8027 16610
22028 16610 2541 24680 -2669 1020 24191 66320 46511 -28550 -128274 -125745 -76102 -91885
22016 -91885 -60606 -37666 9953 19636 -24196 -25870 9451 -24573 -48681 -58240 -43617 -14177
22004 -14177 -5864 -17561 -25829 -76155 -97316 -12822 15096 -34631 -74706 -63238 -28673 -5979
21992 -5979 -11895 59176 66582 29637 37165 40495 14574 -2051 -18916 -27686 -31492 -44939 -75479
21979 -75479 -27771 -44678 -81959 -72189 -58000 -69372 -37970 -19949 -27645 -58189 -101974 -111469
21967 -111469 -74929 -45959 -41988 -63996 -86523 -59964 -51114 -92700 -89506 -87447 -113196 -134388
21955 -134388 -92282 -84432 -55777 -73462 -71436 -51839 -29630 -7651 53055 21625 -148 31437
21943 31437 54318 48575 15415 13569 1584 -14165 25465 24446 40812 57029 90544 56624
21931 56624 -53471 -77787 -46822 -28429 -20434 14806 17787 -4850 -1099 5491 43865 35707
21919 35707 -1093 20462 30327 32758 12725 589 11590 49452 74133 18050 -8909 -24181
21907 -24181 -47322 -26689 12057 51440 81218 91934 96379 125312 109757 104752 96218 73679
21895 73679 52596 -3911 -42134 -44358 -85284 -46248 -52 27045 81740 106912 85128 97171
21883 97171 56838 117 -2508 35526 26869 23260 -11086 -12595 -17158 -79910 -137986 -82287 8447
21870 8447 52319 28862 -3450 -33878 -77081 -27047 -51746 -41863 -64770 -17856 -36457 -93481
21858 -93481 -31948 -44382 -52156 -33885 -26678 -2928 1786 -3780 22802 54071 13011 21449 51132
21845 51132 49309 22164 -14816 -79376 -56574 8603 36840 31237 28592 21502 35016 17610
21833 17610 -56871 -67288 -49428 37490 39968 -2772 -44882 -60138 -49720 -12566 18240 26954
21821 26954 -35031 -83370 -92631 -90832 -48502 -35871 -33094 -45901 -86384 -63315 -20675 -32175
21809 -32175 -8037 -56358 -78232 -65057 -13598 -14920 94059 91634 25170 -44713 -34090 809
21797 809 -42167 -54691 -71155 -66578 -30430 16702 2818 18860 10111 -14016 41186 55988
21785 55988 23780 3840 -3405 -9017 -20668 -54658 -6270 28349 -32639 -64598 -29158 12576
21773 12576 17709 -4243 -46806 -55050 -66186 -34388 -51316 -61343 -103037 -62537 -23960 -2909
21761 -2909 15922 2042 -45342 -53681 -34855 -75030 -80015 -63165 -54347 -20902 -76774 -127811
21749 -127811 -110190 -57906 -44750 -17401 1880 7393 8400 5864 40773 48333 15272 -40459
21737 -40459 -63550 -64874 -5335 -12268 5094 53200 38666 39672 -31798 -43320 7110 27783
21725 27783 12317 -5772 -50206 -64662 -71981 -68557 -72077 -69720 -95059 -86460 -66928 -37400 -15941
21712 -15941 -23932 -35168 -86283 -96085 -80623 -63532 -63821 -49635 -52531 -85886 -126207 -110436 -59443
21699 -59443 -48180 -17182 -30155 9284 16236 -23289 -26787 -34133 -21178 -5255 -11304 -83532
21687 -83532 -115631 -78372 -59666 -70525 -24322 -14610 -27196 -24092 -51608 -66663 -38482 23589
21675 23589 89866 51883 9740 6947 19320 -4426 -52487 -61763 -76641 -84652 -80400 -80531 -67878
21662 -67878 -44193 -45180 6955 -5609 -43092 1987 60260 52220 34557 22751 12766 19632 21924
21649 21924 33226 27646 22549 -10180 25227 95561 66147 106876 74502 6760 -12453 32663
21637 32663 63056 13460 -51328 -97991 -119995 -109611 -38464 35170 46631 66804 95034 88434
21625 88434 85105 51838 -534 -11872 -29516 -7831 29810 13728 -40902 -16387 -43364 -51039
21613 -51039 -12266 -40824 -94789 -81484 -34923 2378 29200 45958 22792 19344 22468 -604
21601 -604 -45681 -77907 -70114 -31409 -20249 18552 44330 33197 -36344 -1009 -29086 -32014
21589 -32014 26785 -2429 -36935 -68290 -122524 -106254 -58376 -73932 -97543 -53419 -26711 -32171
21577 -32171 -1474 25126 46055 -8729 15344 38783 21062 -22746 -18970 -40141 -33859 -61664
21565 -61664 -55723 8329 -24079 2950 17790 25517 35516 37705 60005 84261 62217 21415
21553 21415 -5944 23139 48591 44492 54932 44464 6238 7774 4407 9677 13081 -52168 -16614
21540 -16614 -21692 -32746 -32124 -18710 1790 40862 75343 20639 44050 67540 37519 -17850
21528 -17850 -54934 -75365 -88900 -97166 -67860 -6632 58857 67709 54196 53943 48208 22044 -9044
21515 -9044 17464 65570 64464 41961 25413 65952 79831 32872 412 -20812 -5427 66947
21503 66947 46688 13741 -28108 -6165 -12558 -91622 -132515 -97610 -20351 -60560 -86974 -73553
21491 -73553 -18939 -26392 -62785 -86649 -50955 1788 48416 32331 34897 37518 -13039 -15813
21479 -15813 480 -25741 -31931 -50801 -90961 -119426 -122520 -43074 43364 40040 -14724 -48458
21467 -48458 -77757 -51559 -4974 17387 -17816 -54732 -2359 35752 29569 -7926 2086 51622
21455 51622 70607 57775 80476 80202 64163 14178 -72969 -147016 -135565 -73900 -17764 -22570
21443 -22570 -48629 -66712 -36466 -24417 -34783 -80561 -69735 -37399 -41860 -61654 -56726 -93401
21431 -93401 -105192 -109048 -127277 -134050 -104399 -106112 -55167 -1962 -10860 -62859 -47089 -61474
21419 -61474 -94239 -57525 2282 53250 43776 5145 -6594 5565 11316 -50548 -27030 -10474
21407 -10474 -25968 -19492 -2687 44947 70205 93728 100752 81698 28242 -3485 -3265 -16159
21395 -16159 14099 62208 326 62629 144855 134146 52805 4580 -46546 -37731 -16512 -4666
21383 -4666 -47717 -98877 -51222 -63444 -53730 -57157 -4535 39323 31310 49102 67306 76722 66380
21370 66380 -4703 -29254 10415 -25768 -54797 -60474 -92509 -75456 -3348 4856 8386 1118
21358 1118 38613 63578 52377 33647 51293 -10974 -7637 39300 26156 -31510 -68912 -85972
21346 -85972 -123513 -86573 -87875 -97525 -110977 -96745 -51410 7957 6160 -66419 -88631 -105256
21334 -105256 -146625 -135218 -82801 -133848 -133133 -69247 10221 18188 16721 44401 27140 72096
21322 72096 80012 28162 -38735 -56470 -60504 -36364 -2538 59245 35061 6080 23794 20218
21310 20218 32091 38497 14748 10646 -38864 -40269 -33885 -13651 -3100 34622 57514 38923
21298 38923 -31933 -46066 -26365 -18325 -19063 -30214 4892 22590 29768 -11268 -30427 -71095
21286 -71095 -38247 38289 36267 24248 27809 43633 -1984 -24844 -32122 16488 81415 94767
21274 94767 7541 -84028 -56105 -65018 -70704 -82582 -52248 -80911 -137515 -82129 -17307 -5936
21262 -5936 -36135 4710 7811 -13680 -57370 -88251 -94004 -110567 -80972 -42852 -12656 -15775
21250 -15775 -56941 -38978 -26076 -87045 -53880 -12641 -19452 33572 15918 19813 24056 -14573
21238 -14573 8924 -46017 -43244 72306 103341 73392 43794 -41687 -32008 -17933 -36982 -25649
21226 -25649 -55794 -18294 18737 19975 -1349 -1704 -11361 -13952 -23937 -12382 38556 -3523 -37799
21213 -37799 -5772 -35134 -69033 -73534 -6158 34718 43730 -4952 -24863 -33978 -37744 -66106
21201 -66106 -76383 -40278 -13631 -12579 -50105 -97788 -92645 -65270 20649 22869 699 -10101
21189 -10101 -19720 -40844 -20011 405 10958 35746 10461 1597 -14465 -37557 -67711 -75374
21177 -75374 -49153 -20249 -85841 -88695 -51644 7658 721 -25131 -24990 -61571 -84782 -9292
21165 -9292 -29655 -21010 -37897 -5510 -27905 6682 38438 33771 23219 63919 29849 6131
21153 6131 -42274 -99115 -94819 -54836 -37407 1519 -30286 -55541 -29309 8465 31643 21163
21141 21163 -7092 7337 64326 85587 94085 37267 27110 35803 24758 57792 91551 56794
21129 56794 40522 60164 61162 37977 -10196 1761 -15 15020 32822 37503 54844 44392
21117 44392 46796 12278 -6328 878 11998 39032 2797 -1292 48736 25202 -35239 -74341
21105 -74341 -61635 -64160 -67857 -105203 -88715 -90907 -106963 -98541 -32480 43543 -13719 -27033
21093 -27033 -61754 -56904 4366 -3868 -79894 -148800 -136319 -114744 -35754 25360 42025 15866
21081 15866 -5297 -19316 8448 9647 769 2910 21617 36340 -18216 -44941 -34658 -35573 -3138
21068 -3138 -58336 -125167 -92529 -21980 -30603 -50913 -77393 -122103 -94852 -11292 -7144 -16879
21056 -16879 -55594 -124153 -140276 -124788 -81311 -34954 -26472 -17056 23654 79874 97236 40643
21044 40643 -17775 -26978 -6004 22873 -47121 -79568 -84397 -62292 -72055 -125024 -129995 -67138
21032 -67138 -51828 -90762 31370 105746 79418 64136 63933 26892 33619 49574 -540 -46960
21020 -46960 -59672 -33109 -21548 -7292 -35862 -3849 55594 59158 21776 35121 31753 12972
21008 12972 -15918 -25233 -91614 -119386 -98186 -80811 -51847 -48807 -11614 33108 35813 7220
20996 7220 24195 25869 34335 53920 15988 -31301 -80958 -46612 1790 -18564 50245 91908
20984 91908 85842 80140 51480 16570 23747 90489 114559 122461 125322 31052 -38590 4375 -23658
20971 -23658 -19140 -41048 -74460 -84836 -66733 -10541 2494 -5254 -66793 -114298 -120581 -83693
20959 -83693 -51014 -75182 -8218 832 -85604 -80982 -65375 -83734 -47686 -24674 -11531 -11965
20947 -11965 -13680 -28067 2417 53789 94880 60111 19578 7959 37621 36912 -52198 -115543
20935 -115543 -152955 -104298 -80806 -101775 -96813 -121767 -118026 -69539 -29172 -12350 -30737 -11885
20923 -11885 15455 16284 38352 65564 33328 21611 -18014 -38854 -13647 -59812 -87487 -75706
20911 -75706 -95531 -61661 -7727 -35397 -81030 -76303 -84288 -73023 -54932 -51908 -95366 -92170
20899 -92170 -45199 21375 22115 -15354 -19770 18706 14146 -19934 -19020 -14941 -27130 -18318 -13896
20886 -13896 18465 42120 43502 16176 25201 17027 31980 13540 6127 37967 39015 -4608 -29506
20873 -29506 -73458 -63987 -63746 -65413 -100843 -112931 -121487 -120660 -109244 -62061 -41320 -91925 -35456
20860 -35456 18006 -2854 -23727 -46356 -51169 -36770 -32902 -101734 -63499 -11389 19844 -5854
20848 -5854 -50988 -26257 -9214 33847 53694 -5959 -72380 -115367 -108476 -98784 -74006 -30792
20836 -30792 17285 -32541 -39791 -63130 -115147 -90193 -59507 -29696 -51567 -24473 -48352 -68347
20824 -68347 -112479 -170319 -133733 -18718 39719 87319 37315 -51149 -61442 -66798 -36329 15976
20812 15976 23109 -38934 -60282 -72382 -66516 -75463 -95309 -70958 -62598 -85863 -52950 -39161
20800 -39161 -39662 -34601 -65959 -56278 -42983 15749 6870 -13244 -16509 15953 13930 56005 76938
20787 76938 63893 59601 24412 3274 -27598 -17338 -14771 -26209 -5754 -27672 -19379 -7442
20775 -7442 8926 68853 81319 50933 -11435 -55662 -55620 -33354 -20502 34977 50589 -2807
20763 -2807 -21965 -24894 3922 -12252 18114 -106 -51724 -19970 1147 -52031 -79007 -58601
20751 -58601 -75827 -44732 10019 23451 29414 45028 14643 -43822 -46765 -13509 -35411 11504
20739 11504 22920 3167 -22421 -25621 -6204 -30381 -5952 19441 4029 -23680 -15148 18043
20727 18043 10880 -26317 -19485 -36343 2224 38274 -8759 -37214 -41263 886 28580 52377
20715 52377 55981 67173 75063 35087 2707 11503 14606 8291 264 2811 -67 13093 -18488
20702 -18488 -46486 -53054 -38198 -56258 -34527 -40779 -107333 -50693 57136 51963 -15768 -35276
20690 -35276 -67670 -106296 -106181 -42095 25105 -15384 -46987 -35327 -12542 14659 -5692 10805
20678 10805 -19644 3759 -17928 -44864 -31377 1833 -9450 -42981 -66423 -58342 -28498 -14840
20666 -14840 -8968 26299 69751 77090 6575 -52965 -7744 57834 34320 27320 12541 9498
20654 9498 43755 22555 -13796 -39022 -29518 -35658 -26614 19677 -18072 -57468 -73842 -93405
20642 -93405 -68924 -87134 -14755 15044 25599 30710 47523 78128 53421 -28560 -31163 60498
20630 60498 65594 80641 98811 65289 60 -16166 -16125 24958 52320 7173 -29656 -56423
20618 -56423 -50234 -6580 47858 52883 75805 70745 36180 30558 25531 39844 29502 5983 -84280
20605 -84280 -139659 -112763 -24441 25458 -26372 -53905 -9085 11204 56867 110453 84637 69700
20593 69700 94022 51274 33373 46166 -4573 20176 33224 20015 19244 19996 -5281 -10704 10550
20580 10550 3781 -19584 -43878 -53277 -84551 -97341 -56480 -40410 -49118 -27161 -34552 -37758 -24981
20567 -24981 -24714 37350 46335 -4526 -29475 -19908 -2855 28094 1155 -25252 -48144 12545
20555 12545 90513 101158 43008 56401 88970 103525 100952 57032 48325 15589 24745 43620
20543 43620 73169 22070 -45354 -7388 -11046 -29312 -75575 -101000 -34336 6786 20571 -5246
20531 -5246 -2760 10039 21232 -20853 -25093 -49255 -29702 -41340 -43671 -6957 -16603 -22912 -37460
20518 -37460 -77865 -121132 -109360 -88857 -106490 -79520 -25706 19408 33394 40436 29347 -16726
20506 -16726 -6260 3966 19414 -22510 -34009 -37359 50681 92356 62074 -5941 -55097 -21031
20494 -21031 -42423 -35116 34856 86493 91366 38178 -17205 -26210 44303 42809 29823 2784
20482 2784 26567 16900 47131 64137 30176 67560 109860 87647 30124 -166 -20055 -57566
20470 -57566 -41948 -43987 -6236 48849 5540 -48806 -69074 -40080 41103 73388 96481 73538
20458 73538 47455 51719 35216 18905 -6526 -58536 -81760 -77124 2798 48873 70398 25876
20446 25876 -13028 -40909 -76804 -37345 -20643 -58074 -61563 -1675 3721 -24745 -9942 11205
20434 11205 3418 -44319 -98108 -127301 -151200 -144231 -71093 -59177 -85175 -57398 -68968 -74207
20422 -74207 -4757 -2442 -9329 40998 54060 42670 1097 -75623 -57377 -29307 -31614 -29528
20410 -29528 -7444 45579 63109 46680 90379 91928 71108 54472 66605 27224 -13717 17253
20398 17253 28811 55622 50495 36395 22089 7116 13985 56538 66639 56776 14165 -30409
20386 -30409 -9383 59109 62114 41665 8942 -21053 -37267 -40088 -56364 -42399 -50069 -99178
20374 -99178 -83791 -41869 -44287 -57234 -44750 -47138 -59691 -84355 -82035 -23143 20644 16732
20362 16732 36868 60597 71329 31696 -30994 -66821 -71119 13505 63416 74974 32117 20267
20350 20267 20586 33656 18750 -1127 6665 36502 52699 -4763 25603 26685 33533 44178 37331
20337 37331 41627 33011 48922 72280 67721 48439 53302 73152 121035 121068 77115 77987 14632
20324 14632 -15386 -32634 -21186 1810 28602 1754 -26888 -37193 22962 56226 38583 15954
20312 15954 -243 -34553 -24689 -24577 1332 -2911 -4526 -3893 -31176 -49003 -47539 1234 31078
20299 31078 44181 47984 84023 93572 108094 127973 71375 31682 83987 75396 38706 48528
20287 48528 89972 90274 66700 45381 17876 -26156 -63306 -95865 -114736 -64732 -61015 -68034
20275 -68034 -44929 12490 22287 -22692 -22320 -13491 -15576 6826 -9404 -6498 -17706 -72335 -80978
20262 -80978 -36641 -49151 -19684 17835 8616 41670 50359 31997 41092 87802 126087 87478
20250 87478 50147 48793 40190 21609 29100 21547 59337 57743 3055 -42736 -89710 -94781 -68576
20237 -68576 -26222 -20959 -27668 -63892 -97462 -73912 -39444 -25527 -63983 -79136 -87522 -133103
20225 -133103 -134784 -98409 -63748 -63614 -41982 26636 -1781 -29593 19345 47205 22829 9463
20213 9463 3161 1093 24000 40651 72874 68887 36127 79606 73307 38803 -4410 -77616 -68972
20200 -68972 -40071 30723 1366 -64020 13571 64405 56164 42626 16857 35486 108676 116698
20188 116698 107570 26556 -12034 61142 101176 32814 10355 42150 20474 -6575 -33899 -58583
20176 -58583 -66676 -5037 895 -7424 -20183 -70438 -38566 -13815 -190 12751 46034 49049
20164 49049 60949 -19844 -50770 -5974 8741 -13397 -78817 -94064 -74110 -59404 -63424 -81434
20152 -81434 -76648 -17008 -33158 -57990 -102749 -70692 -15947 -49465 -8362 9753 12021 31758
20140 31758 -33688 -46120 -19936 5825 71224 60997 49222 42977 11269 38796 18425 -8621
20128 -8621 26111 -5321 -35136 -37617 -2453 16314 44986 55867 67498 51819 80848 87588
20116 87588 83876 20206 -48157 -28759 15904 7569 8934 -1407 -27650 -50529 -43721 -53253 -45735
20103 -45735 -25434 -8289 -23264 -43362 1117 4524 -2920 43372 83123 95342 66352 86850
20091 86850 104887 65042 -13326 15764 41055 37325 45854 80584 46669 2029 10375 30256
20079 30256 97649 88815 63409 46952 17325 16311 -24462 -47375 -37110 -74721 -101647 -57664
20067 -57664 19661 94337 49450 -21066 -33522 -14224 -36102 -86666 -57029 646 1037 -30822
20055 -30822 19050 3937 -39270 -60008 -64684 -42792 -14459 -6747 3138 43940 40436 20352
20043 20352 147 -34990 14097 38563 23099 57192 71574 107868 95890 52772 65930 55964
20031 55964 41175 38060 18131 71725 85305 42418 661 17021 16741 -14451 -4999 16588
20019 16588 -302 31738 23072 -13411 -29419 3218 47199 20418 1377 32047 67962 64828
20007 64828 112040 97940 91204 62666 79127 47136 -3227 27631 57039 42216 37144 21570
19995 21570 14147 20753 36233 32384 19788 -23933 -71792 -107250 -28091 66667 85548 34467
19983 34467 36221 86735 107623 107722 40144 -33504 -47100 3582 -2271 -23889 2245 22217 56230
19970 56230 56782 38258 104 -19331 -64199 -77698 -17010 208 41120 -6554 36031 31849
19958 31849 40453 3645 -21055 36482 -5217 -38779 -25290 -5455 -32592 -34072 -82413 -61297
19946 -61297 4956 29593 47768 77253 104644 30056 -1629 -23020 -26621 -36345 -63258 -82840
19934 -82840 -23815 20556 24075 34136 39739 65614 84547 63908 53391 57142 37079 37954 53028
19921 53028 72705 111956 150075 122347 30527 -5902 7132 11792 -11316 7010 19001 -17081
19909 -17081 -1053 75028 48314 17811 52859 82668 61396 24949 55294 66426 63276 56964
19897 56964 27041 51534 -3781 3124 -1166 -18861 -16919 35219 46706 38634 45951 23621 -10215
19884 -10215 20078 44418 48958 29933 34222 48862 26159 6321 -12366 18376 86054 71983
19872 71983 16448 -50281 -46492 -26117 -1907 12746 21515 21305 43113 52860 24397 -40949 -25142
19859 -25142 -42977 -34130 -11729 -2076 -7490 16824 62592 49696 -25880 -64272 -78863 -77030
19847 -77030 -82637 -70956 -49617 2282 63669 79316 104088 87295 116312 90077 80589 106138
19835 106138 52418 63293 77031 101495 66462 41188 17858 12609 81113 49633 71758 94213
19823 94213 75262 81800 32264 -26402 -11278 37866 33707 99725 99697 78829 104507 126365 122522
19810 122522 116532 96084 102682 58787 7361 -37320 -39856 19953 41034 47517 79119 76889
19798 76889 53843 -3507 -38061 -11287 25056 28654 49641 50156 69953 -14992 -48747 -58187
19786 -58187 -36163 -63207 -129511 -95635 -14229 27696 -11509 -39710 -29121 -35762 -38003 -18300
19774 -18300 -55396 -102363 -73774 -22198 -10854 -25088 -22467 -4694 9454 27189 3803 -29918
19762 -29918 -32272 15916 68407 47186 77727 36147 -11281 6574 -2737 77894 65323 -423
19750 -423 9696 66446 93693 48428 17051 3687 1672 -22911 -11680 6030 -6144 -35566
19738 -35566 -42822 -28787 71976 119821 98856 59828 8796 -18470 -28899 -76220 -73709 -36565
19726 -36565 -17860 36007 50577 -2327 -733 5316 -32534 -4576 18200 -16219 -62131 4135
19714 4135 18473 37645 -8235 -4163 -11521 6111 32116 55280 50487 56972 66202 54663 44671
19701 44671 44532 20570 76386 105463 74362 44687 43358 15718 25863 1695 -40460 -68874
19689 -68874 -24897 18836 17768 3161 -1043 -5807 38999 39399 2531 20614 -1924 28905 2687
19676 2687 -43653 -27367 9421 47445 77893 67744 24796 -35324 -21272 57751 97831 95163
19664 95163 53351 61399 82566 73111 53968 54440 1972 733 -2070 24315 68436 50233 -12879
19651 -12879 -6290 13 -689 -66382 -50455 -47637 -73893 -56147 5498 -21590 -42233 -67705 -27008
19638 -27008 -621 14826 -15497 -24441 -47658 -39591 1994 17927 -30280 -58955 -57758 -19215
19626 -19215 12027 -9910 -14406 -30366 -27009 -25903 -31661 7980 41409 56018 58885 47755 46931
19613 46931 -13811 12923 61799 78345 82900 62676 50570 41267 10836 8032 -2172 -17354
19601 -17354 -52940 -88011 -65973 -56916 -35345 6114 -18333 -21278 -41070 -73139 -45206 15722
19589 15722 32290 36584 30163 11773 2072 -19124 -51869 -28986 14423 57629 96495 91678
19577 91678 75438 69239 28708 35868 30001 62964 92388 69188 76754 38411 -2490 5652 -34119
19564 -34119 -31225 -26737 -23323 -24493 -7994 41746 73735 114877 72005 8240 -5010 66254
19552 66254 116304 84035 64125 21636 -32076 -43504 273 58920 71601 88091 52890 51966
19540 51966 12439 19762 60211 45281 15437 -21715 -41866 -61909 -92192 -3835 79595 115243
19528 115243 59372 26161 33636 -27974 -92428 -28967 -6194 13113 -247 26809 -6971 43481
19516 43481 67316 80940 52498 43151 46451 9155 -19253 -9998 -17427 17667 37855 7884
19504 7884 19893 28478 58018 66603 65510 45001 -34252 -90689 -82227 -56457 -25325 1985 17234
19491 17234 -262 -3807 16642 -5778 11436 62797 106705 58464 3869 -1009 49783 68241
19479 68241 28221 38220 20245 48364 64051 68610 55385 53294 54019 27861 26549 44536 16419
19466 16419 37796 82829 48489 54119 59795 69696 65214 21050 26847 52136 11548 -13991 5186
19453 5186 1821 -20361 -39440 -70823 -84102 -25717 -18463 6926 17498 51074 47305 42290 -24573
19440 -24573 -65267 -67571 -41379 -3223 -1874 -29717 -57201 -58771 -26887 25385 99560 118532
19428 118532 20966 22633 33849 34375 45081 42286 39879 37893 48536 94809 61731 29681 -4862
19415 -4862 -19346 24721 79532 119761 156149 130555 160014 143746 82750 96126 114611 113780
19403 113780 63822 29438 -12299 4585 8964 35108 54405 55632 23877 12279 23582 -1423
19391 -1423 -16316 39999 122141 98268 27350 8096 -4502 -17099 -14914 -43046 -6874 9430
19379 9430 -3794 -20089 -51738 -54035 -54286 -57485 -2038 13619 7008 19797 1647 -15619 -14808
19366 -14808 11414 4579 33230 89523 97831 67893 -12174 -15251 -10511 1852 2165 35396 41091
19353 41091 71236 87940 14452 -19059 -9172 7677 40492 33696 69698 112097 145080 109559
19341 109559 33616 55739 61429 48228 26865 -16407 17733 34089 7164 12145 23800 42752
19329 42752 36446 62234 55751 61734 55303 6954 26846 15595 49837 39336 51458 55593 104690
19316 104690 111180 101844 112597 103651 105304 70934 25864 5128 -19839 -2376 30982 45203
19304 45203 37916 11116 -32608 -66152 -63271 -18586 38269 51525 130616 146794 93487 91887
19292 91887 138517 156411 137707 92094 81192 53464 -21254 -28565 9413 33496 17787 27429
19280 27429 22491 24992 48795 35036 6734 -48607 -92118 -95538 2199 17438 -2197 24546
19268 24546 -18598 -41760 -5826 21744 15223 59734 105851 67725 11429 29297 56624 46310
19256 46310 6411 17542 -36812 -84946 -51034 -53062 -104527 -111034 -71448 3311 56540 52482
19244 52482 28922 39513 21691 31336 86520 77713 105850 91476 83854 91543 93182 39898 45092
19231 45092 33185 47070 47821 27842 85817 94499 24521 9615 5151 -24928 15442 40460
19219 40460 52664 80752 83349 110201 51810 -6498 25518 43822 52139 46569 23564 17480
19207 17480 52779 92629 54695 11694 5794 6930 -56142 -61756 31637 7311 -17517 37232
19195 37232 56818 16628 47820 77416 52025 5090 33208 86353 75440 47003 70340 107732
19183 107732 94280 67512 56500 20034 -13697 27204 104193 67142 48826 28977 23927 69037
19171 69037 102706 118719 89775 51708 54038 47322 67136 109274 149636 156477 123454 103700
19159 103700 121662 121107 92243 69532 81682 78514 109717 142047 132409 105338 99825 98196 105462
19146 105462 94995 101379 65897 40528 85293 99813 64477 -8804 -17716 -1343 4326 23258
19134 23258 32499 74430 99204 119402 123295 107701 131623 150304 125268 102074 23906 36470
19122 36470 54992 9999 -39053 -71141 -34748 -48528 -45973 9446 4010 1563 61348 80165
19110 80165 16406 -2149 33560 39101 28316 32918 22669 13824 -20851 17304 26126 33982 104942
19097 104942 119954 43890 21787 17648 48834 62456 96447 120730 70886 46743 61209 53702
19085 53702 35858 57576 44483 35943 50967 4178 -68429 -80365 -19820 39408 16335 -1972
19073 -1972 27868 50980 81832 40258 22560 38112 65897 63703 -15499 -55182 -6046 53537
19061 53537 42843 40950 74189 103038 87901 96765 108447 121497 55245 35401 56925 12066
19049 12066 41703 97601 100435 76988 95290 58914 51523 47761 67452 100177 144508 101100
19037 101100 67371 65468 96283 41202 -38011 -51403 -25549 17519 82035 118950 26330 -28857
19025 -28857 -43591 6524 11727 -34633 -18980 56448 15100 9149 35077 14177 38121 52133
19013 52133 65465 36412 36865 79568 81046 61198 49980 21622 48680 42754 35610 -2178 27493
19000 27493 20563 66306 63226 18417 12911 9055 -12639 25670 116394 154254 130253 90045
18988 90045 77934 151487 151918 138498 103810 43779 -2013 46316 81479 88308 109624 99607
18976 99607 82555 84605 73750 66239 89355 133913 123456 129383 95250 83805 45654 46523 38543
18963 38543 25987 82373 82947 49219 107478 105351 58579 59486 73982 12185 37677 65427 48043
18950 48043 43629 27023 34281 76137 116965 99057 66313 30249 26206 36674 75631 83905
18938 83905 134297 146247 106635 70669 50402 61162 24756 13248 85047 73120 75345 99156
18926 99156 62642 34929 22607 57893 68500 24904 -14961 7891 76060 113713 102499 103284
18914 103284 88378 63001 54450 81321 114170 79021 54855 83972 127104 125495 111890 111811
18902 111811 122211 120063 83966 124097 143420 111791 122309 163885 158760 143691 68401 26085
18890 26085 12925 31419 58140 58220 75733 93833 114788 23844 -48712 6171 42665 97027
18878 97027 92409 89821 171842 199774 146384 101684 91872 31061 10104 -5209 3961 53374
18866 53374 88240 21947 -35500 -59280 2371 58349 90850 114217 91005 64038 62155 44891
18854 44891 79528 126727 143288 113178 139199 100520 56829 76126 86852 67796 114366 78401
18842 78401 48190 90440 119087 118231 164927 211397 115998 87242 139371 187881 169996 122250
18830 122250 110252 174739 244767 197782 159649 162192 114748 94633 151189 166637 142196 141627
18818 141627 124933 111143 113211 125602 119385 123292 106097 98305 71797 68787 84890 129538
18806 129538 180792 175221 130710 111210 92110 98973 139284 174034 180680 141688 125307 128388
18794 128388 148906 152560 119295 116988 136693 156817 168989 125335 107952 160713 171133 139538
18782 139538 124589 75173 64406 141341 228127 209121 106435 90556 99299 96718 154832 176650
18770 176650 205886 265879 378220 566368 735924 766037 611227 459327 313253 255425
18760 255425 219652 202572 214944 197796 173845 164970 110324 113927 162053 105347 109311 128402
18748 128402 164420 177318 85817 50828 12803 39485 14066 31493 49016 22859 42633
18737 42633 29220 25893 14933 -10160 15236 5529 30768 78959 111566 114666 92187 51213
18725 51213 102837 125694 135599 91867 94405 127163 142415 77552 49045 58376 140523 106495
18713 106495 94238 118871 120955 97798 112942 113855 106424 122466 88962 104439 92137 85032
18701 85032 75183 118311 137112 131136 79575 122877 124130 102411 97640 61443 94330 141946
18689 141946 125396 127559 124139 148285 125348 89857 40243 54341 66184 87185 90047 123785
18677 123785 111629 121882 181676 223584 295771 341751 351150 291641 296888 306750 285030 341035
18665 341035 367118 402240 512170 550747 609741 679709 711698 631794 523770 455452 360846
18654 360846 277564 278060 287560 250463 210415 191259 204457 186350 133411 151562 199361 223234
18642 223234 234454 285573 285430 253208 251835 260978 292683 332651 318906 277664 284783 321139
18630 321139 345877 317568 311207 363406 393189 384126 296632 334041 307547 304403 355438 409023
18618 409023 501699 594373 736429 927929 1027030 1147159 1267800 1272107 1230704 1190795 1085308
18607 1085308 958378 823084 672086 549512 493227 454349 424206 470912 461010 415083 423036
18596 423036 377920 320786 267956 238084 233533 178828 130743 157132 192235 207364 253199 233672
18584 233672 254154 255817 233475 221110 154216 150638 180375 191987 202056 161820 123346 140430
18572 140430 236254 329125 330377 335055 351042 381031 434424 583171 754177 830939 864646
18561 864646 866595 903793 889709 808141 680982 634047 632390 539455 406270 335530 302643
18550 302643 343137 322002 266311 281621 324726 270293 208234 203653 200654 159107 179324 189257
18538 189257 161794 95221 148019 190505 240561 218447 260920 268600 328803 342141 311690 260106
18526 260106 221188 232963 224320 197280 192905 154629 181725 207956 248466 258240 253695 220907
18514 220907 227951 232239 217509 211602 254966 274545 234146 145986 144734 178830 98590 118574
18502 118574 177313 214839 191485 145017 146636 146760 121252 90074 128969 165014 174283 90678
18490 90678 427 11888 46992 53776 76759 173620 188927 161602 163789 188188 162621 138753
18478 138753 121861 139228 138334 153209 162249 162512 118914 112389 184893 114517 107045 144604 157714
18465 157714 211722 263912 263883 214511 205280 194562 212999 204482 212345 241477 250241 188330 207422
18452 207422 241827 223833 186712 180789 235436 331025 477140 550661 541846 525175 429623 351422
18440 351422 212218 110781 82723 -1079 -89506 -82957 -57762 -43547 26572 75597 134949
18429 134949 218583 295803 293136 306559 353876 337224 364171 373528 417151 436841 450438 417770
18417 417770 321420 253795 245691 271962 255033 269672 299151 323676 381509 387455 367207 312448
18405 312448 319134 347825 403152 482376 576514 699252 869492 1061194 1226450 1308942 1358528
18394 1358528 1337605 1184157 979970 821524 713251 634634 581904 498539 527217 512416
18384 512416 443168 340679 340138 388765 355180 340918 428459 478893 437887 451323 483712 434364
18372 434364 394653 416845 470174 474856 459355 415945 386466 428511 509404 502664 478215 454157
18360 454157 456279 413498 438504 443597 454929 472011 474950 445181 508740 730754 988936 1194729
18348 1194729 1337564 1377656 1427569 1458751 1438450 1334781 1060740 820487 710107 647262
18338 647262 558196 495042 485000 508740 522858 533772 551716 617646 655921 732675 872923
18327 872923 1007731 1079607 1134689 1227388 1248178 1273857 1283049 1354742 1473363 1469826 1432714
18316 1432714 1424370 1421257 1333458 1269299 1238906 1228863 1266150 1308340 1317814 1337096 1330622 1366731
18304 1366731 1441051 1477883 1539109 1651150 1718506 1745359 1668981 1651593 1737577 1750862 1721971
18293 1721971 1624318 1515058 1425463 1372697 1429207 1625571 1900689 2112751 2186956 2009057
18283 2009057 1687157 1454321 1306732 1240941 1232911 1153617 1149832 1114855 1007012 869215 788231
18272 788231 759602 684593 639551 613609 561719 553859 551019 576681 606518 597424 597729 615380
18260 615380 607123 576244 640030 676681 715348 717639 712724 754270 807963 822611 955553 1162175
18248 1162175 1338580 1340402 1273686 1206963 1152721 1187177 1336612 1492136 1667969 1785360
18238 1785360 1705937 1551902 1327886 1187681 1140030 1120212 1147133 1182639 1193629 1150304 1043557
18227 1043557 939955 941736 969395 1003216 1023939 981241 938975 877193 857057 862997 923426
18216 923426 972019 1010927 1022048 990808 976630 1011758 1079384 1143973 1205565 1226161 1202285
18205 1202285 1167911 1185066 1211107 1255397 1305459 1382587 1454595 1533515 1677032 1776776 1890841
18194 1890841 2069564 2290403 2527971 2691717 2812422 2880202 2884653 2838197 2764261 2730172
18184 2730172 2689543 2764585 2920612 3150367 3411969 3641525 3947173 4403219 5072329 5909005
18174 5909005 6922373 8266914 10217361 13012983 17187386 23735940 33882779 48090876
18166 48090876 65028057 81229373 92790430 97094027 93472287 82552492 67138110
18159 67138110 51245467 37828619 28022274 21254604 16647452 13380238 11087683 9482899
18151 9482899 8420368 7686867 7160115 6821125 6712280 6686794 6731710 6830018 6967354 7122950
18141 7122950 7390840 7629688 7774993 7912754 8041719 8083366 8069532 7909215 7894895 8092851
18131 8092851 8448741 8968919 9709470 10723232 12084345 13905257 16429338 19815771 24586270
18122 24586270 31689277 42505462 58795078 81081187 107786434 135493382 160484689
18115 160484689 179801157 190897818 192484755 186868696 178945238 174095955 179178098 191459547
18107 191459547 191110497 158161235 112395097 77453745 54856169 40457802 31029820
18100 31029820 24609546 20111306 16899300 14675490 13124668 12072822 11407899 11049112
18092 11049112 10892975 10821417 10780307 10708561 10581739 10363593 10116780 9792154 9448867 9167142
18082 9167142 8912822 8734706 8682750 8850936 9234457 9884137 10833764 12129284 13923837
18073 13923837 16353226 19819870 24990477 32930909 45300735 62996515 84720338 106254916
18065 106254916 122751648 130372922 127907503 115572092 95856873 74256709 54936377
18058 54936377 40180350 29793312 22623689 17652115 14113009 11471806 9559217 8114212
18050 8114212 7058827 6202991 5494526 4940130 4511992 4221745 4035268 3924526 3890447
18041 3890447 3898024 3895821 3893433 3847478 3721141 3594892 3306966 2967277 2654310 2412953 2213780
18030 2213780 1996635 1859746 1750382 1656078 1656036 1616782 1590833 1582692 1593194 1574224 1494136
18019 1494136 1432364 1517867 1607084 1697483 1840592 1962144 2031301 1999089 1940847 1910190 1900238
18008 1900238 1932275 2066211 2154014 2186260 2158300 2060603 1996656 1954871 1988622 2069685 2127176
17997 2127176 2145273 2052271 1952614 1852329 1759555 1719799 1714416 1677191 1622448 1512585 1393085
17986 1393085 1281707 1153447 999587 909688 749306 660183 647483 657251 671352 649584 624303
17975 624303 735873 780758 837247 917081 927833 896054 976359 1060558 1122076 1166112 1248310
17964 1248310 1306375 1299165 1356472 1379270 1409521 1426371 1478277 1571409 1702910 1760639 1731486
17953 1731486 1711056 1667383 1624554 1551349 1564037 1544794 1504537 1418915 1299599 1174067 1022866
17942 1022866 910712 897823 895884 883118 874396 802740 787855 696662 533559 437015 376971
17931 376971 319937 299686 309319 251842 260175 333751 279446 282924 418592 433593 466601 493462
17919 493462 505654 478569 433889 458811 472328 504700 525087 462048 352928 326457 385574
17908 385574 427241 457661 493845 530777 539400 528925 489121 456626 456645 495984 517055 520345
17896 520345 533245 562913 525451 559591 543990 517194 535743 536586 510001 513696 476777 418986
17884 418986 396733 346960 294125 294127 361009 379634 374143 354922 343909 338267 314090 319739 365349
17871 365349 407612 387914 392330 385536 411459 409155 445425 442256 400673 392051 455202 503284
17859 503284 479549 489140 530213 547124 485881 457042 480467 511333 484717 390935 419277 437651
17847 437651 402029 455478 518594 570449 661478 675669 626115 582637 598874 605982 576529 545082
17835 545082 479792 500995 462554 398374 323239 285445 277770 210393 233315 277068 330224 355806
17823 355806 374764 349604 345099 297113 318106 337224 315720 302422 265966 288892 290975 252529
17811 252529 216657 267842 237341 162661 191871 239907 226338 178738 164647 177977 193087
17800 193087 186482 217646 241956 271468 307848 293930 285694 291488 337244 357127 354945 427311
17788 427311 511620 552661 507550 497418 500228 524602 523434 516425 442937 347805 353640 368252
17776 368252 401096 410938 363263 346014 336897 306369 361628 399791 398065 419011 467924 476518
17764 476518 481733 475517 486864 513558 525711 502483 445066 448724 433843 393759 349743 345313
17752 345313 333477 347535 406025 476579 502008 484813 524079 507243 511590 514691 589532 645010
17740 645010 693340 691360 676061 661512 687894 736452 735926 738142 751911 759044 768356 745631 713245
17727 713245 766424 850453 850709 831604 869855 907051 977087 959130 944358 930368 959444 971861
17715 971861 965389 954427 918281 907618 941545 984133 1020222 1062044 1039936 981248 989547 983703
17703 983703 983325 1001219 982541 944009 954222 957168 938344 952944 917840 847320 804318 826970
17691 826970 876454 848283 920459 950486 913031 874083 889702 955115 982552 949109 998360
17680 998360 1059043 1044647 1050888 1099589 1173646 1234475 1386188 1519499 1617878 1754849 1940981
17669 1940981 2047293 2215691 2399471 2545861 2584660 2547211 2473242 2347149 2200536 2066343
17659 2066343 1918345 1837905 1742135 1629456 1580075 1575444 1532812 1570396 1701242 1700352 1716395
17648 1716395 1680241 1659762 1668321 1726475 1827639 1931417 2019894 2040168 2078244 2171748 2234521
17637 2234521 2277274 2365776 2473230 2556807 2645022 2722085 2771601 2884097 2964076 3076832 3208945
17626 3208945 3384582 3612518 3852788 4089152 4415218 4815226 5276586 5760660 6249246
17617 6249246 6798587 7365932 7868088 8437668 9109636 9908332 10961394 12361641 14307422
17608 14307422 17121982 21165018 26604455 33380762 41178352 49934579 59416904 68635751
17600 68635751 76596983 83009807 88239667 92270030 95179538 97642910 100734863 105169928
17592 105169928 111119485 118305821 125935304 133277378 139874490 145125483 148569131 149875324
17584 149875324 148830362 145821333 141894951 138053573 134342741 130935008 128629152 128127371
17576 128127371 129311643 130926532 131016593 128688732 124140360 117381557 107711322 95459083
17568 95459083 82185045 69183168 56980345 46022775 36826292 29598826 24256656
17561 24256656 20349274 17429851 15279903 13698223 12542781 11680392 10901457 10214403
17553 10214403 9527973 8949207 8448211 7973589 7549318 7198993 6871494 6606222 6425328
17544 6425328 6276927 6154270 5991668 5908427 5893407 5790810 5723356 5730556 5746097 5819185 5890907
17533 5890907 5952267 6122978 6309231 6465071 6641362 6846765 7100947 7497337 7853189 8238761
17523 8238761 8660111 9136430 9701762 10461241 11490434 12948431 15072926 18154709 22693499
17514 22693499 28622766 35046546 41517595 49124865 58901223 69461614 78958098 87424568
17506 87424568 95593013 104273576 114093827 122278875 124472619 121749249 119973921 119341931
17498 119341931 115996811 109509909 102839795 97639672 94506217 91645280 86177143 77873309
17490 77873309 70340936 64831507 60259623 56709765 56290992 60366396 68401996 79100722
17482 79100722 90502111 100403816 106849518 109074562 107965750 104887324 100856225 96563366
17474 96563366 91918538 86606127 80924429 75930657 72967061 73502724 78453385 87535311
17466 87535311 99192990 110603545 120112423 128483860 136393055 142303135 145052463 146388303
17458 146388303 147442424 148420387 148449064 144968051 136884674 128330285 122715072 117521050
17450 117521050 109813373 101178874 93918132 88450543 83933403 78393515 70406393 61808063
17442 61808063 54843297 48819336 42433420 36280834 31748958 29322976 29008309 30874432
17434 30874432 35236380 42027729 50869605 60736562 70259383 77982067 82757830 84558509
17426 84558509 84334990 82923818 80741667 77884377 74027427 68834491 62850019 57175452
17418 57175452 52989948 51281116 52500157 56146951 60947576 65620790 68837817 69949900
17410 69949900 69388754 67784730 65634579 63028751 59507010 54488456 48008058 40677746
17402 40677746 33283935 26528400 20882142 16600310 13463774 11198113 9506997 8241512
17394 8241512 7305791 6569865 5983361 5488393 5077105 4716274 4422387 4157287 3934457
17385 3934457 3735706 3508639 3337709 3167274 2981172 2857222 2723483 2585511 2459259
17376 2459259 2239982 2066874 2008466 1950636 1824159 1725141 1658954 1590183 1491932 1462512 1382027
17365 1382027 1369426 1340377 1294388 1203536 1154603 1147637 1072744 1021421 1002424 995607 944115 921057
17353 921057 912618 873704 818737 722310 683135 681405 713977 738871 743088 677048 651787 573855
17341 573855 490972 429537 428981 449587 456796 430166 395026 419652 395622 310262 215148 168328
17329 168328 185652 216687 221875 196297 159375 153837 152754 171052 194422 155821 109881 67493
17317 67493 112310 202876 229392 191109 156147 140403 191347 190598 184806 135438 94648 99480
17305 99480 116031 112103 128086 88538 137173 220260 233204 232016 214350 128437 42607 51316
17293 51316 94046 104577 78366 69559 139984 135579 77756 40242 33024 53731 64669 71440
17281 71440 99928 96208 79958 49920 87009 112805 107438 96667 104457 155715 201352 167735
17269 167735 182639 192725 178945 180617 205287 266327 254530 254567 280708 298273 345817 387056
17257 387056 409220 378625 274778 247386 266340 268516 256408 263643 273904 280257 282424 299548
17245 299548 236001 188462 181815 155404 119680 166444 191676 140537 94952 102515 136807 150579
17233 150579 159267 143195 133540 105972 38452 27526 37364 -2645 -48067 -44881 -5114 19150
17221 19150 -26540 -37593 -11269 -4205 -24278 -37485 -21131 -6959 -15760 41941 29323 -27245
17209 -27245 -88011 -48405 46 -5575 -34721 -20644 -47256 -103359 -68847 -12495 -4713 -65267
17197 -65267 -103575 -49928 -36103 -76177 -54329 -9953 6483 16865 52479 65500 52783 11617
17185 11617 9909 5011 18688 34326 90387 109195 81203 111343 141670 187120 200153 171483
17173 171483 115388 84722 36370 40603 76390 60643 75454 35454 41632 35785 -9610 -1683
17161 -1683 -26841 25225 18848 -844 8714 59253 70889 88349 53541 24101 67144 91208
17149 91208 65321 15200 15024 -19253 -29759 -17827 10222 64052 45537 5849 76511 106890
17137 106890 73028 140964 206387 226259 248362 250016 240187 217088 222040 216581 159675 134969
17125 134969 119597 127003 136244 112070 113928 115881 153036 205965 219286 172936 106290 87255
17113 87255 61570 88733 154505 228375 333910 420534 466902 490394 528305 557136 628625
17102 628625 713454 651897 641440 697142 671468 668028 724819 754845 777554 832112 879202 827885
17090 827885 741910 694076 666779 633426 548848 467869 487340 529679 581000 588656 632599 547147
17078 547147 452178 374094 282953 190173 125627 116461 81720 63607 42619 -8534 -41114 -63446
17066 -63446 -105194 -64959 -51033 -45475 -29890 -47512 -73686 -101332 -129693 -90869 -94354 -127195
17054 -127195 -75554 -28347 3223 38072 62126 56406 5372 -29726 -11721 -5101 -6369 -4725
17042 -4725 -44731 -79853 -43393 29766 28436 31856 48364 38731 8196 -9547 -28100 -71772
17030 -71772 -46265 -57022 -55748 -26659 -22689 -36370 -36289 -103069 -142701 -113940 -137766 -165096 -114551
17017 -114551 -106065 -127431 -51821 -48970 -13648 40307 53143 45302 83115 85591 101099 114617
17005 114617 163321 223094 286019 402848 453984 574628 675922 712330 869675 1171076
16995 1171076 1412228 1531622 1408388 1243203 1078562 923630 747592 662600 632718 617450
16985 617450 607399 647293 677753 696107 719424 696835 624886 516078 442599 439043 408647
16974 408647 315191 238800 260035 260915 310058 376749 399852 387042 411608 424243 443553 458188
16962 458188 407573 343616 360281 399255 382106 372203 374814 423509 404062 428047 469798 499659
16950 499659 498402 511151 508440 566374 582552 567268 504627 496252 452571 418189 492588 561583
16938 561583 531142 477270 448117 406666 357625 381803 404869 401934 418674 399450 359007 359378
16926 359378 378122 362750 285487 261448 223459 181965 135702 102310 93180 104566 153398 194627
16914 194627 203089 204390 295120 305465 254465 242931 241342 165545 132667 117320 74265 47947
16902 47947 -27344 -44653 -30150 -2038 11197 -50827 -84915 -119491 -123004 -69098 -52871 -69998
16890 -69998 -79859 -90744 -97360 -66039 -34014 -49454 -80672 -107442 -124173 -102034 -111677 -95168
16878 -95168 -39003 1726 10770 -13611 -59601 -75759 -2950 37093 41467 14750 -21261 -50473
16866 -50473 -102440 -163810 -144840 -187773 -137702 -137192 -69848 -46905 -69580 -61793 -82034 -114689
16854 -114689 -73309 -103131 -117252 -158385 -178494 -167280 -142052 -109217 -58228 -24822 -29039 -73500
16842 -73500 -75563 -91026 -72817 -61932 -45050 -98648 -141027 -140183 -80623 -73538 -101445 -132698
16830 -132698 -125032 -113660 -104321 -68565 -50563 -44056 -66538 -91254 -88075 -123135 -154841 -143681
16818 -143681 -136049 -158068 -220960 -187482 -133599 -67061 -39640 -61064 -60375 -63981 -71662 -104044
16806 -104044 -192007 -200999 -160276 -130404 -66191 -70993 -60335 -72747 -80678 -50161 -83994 -129330
16794 -129330 -104623 -94634 -109554 -124073 -131766 -134154 -125738 -110871 -178055 -181664 -151806 -153621 -71841
16781 -71841 -78649 -77649 -79515 -114419 -161771 -152780 -43391 -21185 -21464 -12528 -23569 -43350 -76958
16768 -76958 -72775 -122714 -108326 -143710 -139835 -118944 -105998 -98446 -135344 -136487 -79268 -35327
16756 -35327 -60049 -60221 -43671 -46813 -23822 -46124 -73402 -132883 -124767 -125326 -156995 -129919 -133965
16743 -133965 -117060 -96449 -115656 -128567 -137207 -147646 -140116 -105332 -73985 -88485 -116408 -100383
16731 -100383 -122212 -112792 -111574 -60493 -68768 -127207 -175151 -184298 -158944 -152611 -156811 -187342 -152312
16718 -152312 -165963 -210474 -185766 -167995 -124003 -122636 -145238 -159270 -140061 -133878 -90621 -80464
16706 -80464 -56630 -63060 -68087 -48172 -48620 -37868 -35508 -2702 10801 5168 -20035 -4473 22283
16693 22283 -4397 -18572 -3701 -11307 13576 -47735 -86838 -46624 -47690 -20726 -71387 -97982
16681 -97982 -147209 -172784 -168052 -155437 -119289 -45420 -6396 -19130 -35065 -126905 -133356 -68637
16669 -68637 -35175 -101395 -75864 -82115 -114696 -71635 -58438 -68357 -89012 -131182 -109593 -65219
16657 -65219 -49525 24120 -23789 -71680 -91668 -83656 -84715 -62775 -61696 -89251 -159153 -195528
16645 -195528 -155552 -139145 -172989 -162377 -99674 -41698 -33405 -45173 -87784 -80515 -75612 -104722
16633 -104722 -99789 -114344 -100265 -103423 -84593 -136170 -181761 -196420 -198666 -156868 -113597 -158266
16621 -158266 -149868 -130288 -170672 -216148 -195059 -135590 -143205 -133544 -132120 -84733 -86319 -114450
16609 -114450 -133182 -146601 -137616 -65529 -65206 -136828 -119143 -111963 -99095 -98969 -133428 -131761 -170934
16596 -170934 -209401 -183127 -158956 -122861 -64109 -54729 -37455 -37304 -98866 -134481 -128372 -105445
16584 -105445 -58696 -43247 -12180 -13721 -22277 -63031 -39642 -76727 -95211 -56852 -51835 -58392
16572 -58392 -64354 -5426 32330 -17382 -27747 -26489 -59808 -121361 -116652 -49228 -50595 -93755
16560 -93755 -141463 -162233 -151004 -123090 -94332 -95078 -34566 -12592 -53825 -64646 -17506 -25434
16548 -25434 -85296 -87276 -94124 -61325 -53820 -106959 -160663 -137656 -73543 -54286 -107330 -145085
16536 -145085 -150013 -117657 -38667 -23796 -50127 -112183 -155453 -143851 -148431 -197339 -183651 -121034
16524 -121034 -118761 -71367 -44112 -49309 -51463 -91916 -95599 -42168 -13832 -29548 -79598 -58386
16512 -58386 -76751 -88007 -102886 -67864 -68948 -72616 -105615 -162049 -138695 -77740 -42365 -68016
16500 -68016 -118056 -97204 -104681 -86517 -96113 -69967 -74912 -77568 -66914 -24387 -65919 -103286
16488 -103286 -64357 -19127 -41397 -70427 -50707 -38789 -28146 -67082 -80003 -76063 -87399 -69647
16476 -69647 -31503 -22175 -39115 -75613 -131480 -130393 -87525 -89176 -101102 -121207 -106631 -159692
16464 -159692 -155229 -130650 -115434 -126000 -118721 -43681 -37422 -94624 -128564 -117187 -88580 -44534
16452 -44534 -22382 -59579 -77656 -104916 -102023 -94162 -133768 -116214 -85415 -94655 -76476 -91306
16440 -91306 -78995 -9963 -14893 -71108 -79716 -111222 -118699 -149163 -120424 -69429 -110374 -118567
16428 -118567 -52187 -24102 -58687 -83028 -114339 -136246 -90285 -77169 -50706 -92924 -83807 -73288
16416 -73288 -28594 -25459 -88275 -134253 -157350 -99903 -105467 -57159 -21131 -21658 -25840 1092 36884
16403 36884 29872 -3226 -11717 -30280 1668 -55935 -157758 -157764 -152857 -126697 -93281 -34094 -50482
16390 -50482 -60890 -107643 -111586 -125487 -109106 -125811 -58655 -34807 -29397 -34141 -30267 -27946 -29202
16377 -29202 -60570 -85550 -61022 -12039 -23392 -21255 2873 20557 13428 57435 51072 32423
16365 32423 -67784 -81480 5280 24358 12426 -21332 -108322 -125303 -96201 -95480 -95633 -99635
16353 -99635 -67095 -117408 -185409 -187433 -127164 -87531 -103976 -110174 -167538 -156276 -99576 -27595
16341 -27595 4318 -36234 -34351 -24892 -7296 12505 -36055 -33193 1579 6724 1221 -20945 5029
16328 5029 -26823 -2393 -19054 -55222 -69814 -39223 -40729 1096 35092 66193 95834 77409
16316 77409 38314 25743 4975 -14477 29265 5165 -4706 -12688 -41025 -22058 -26715 -42529
16304 -42529 -55523 -42669 -13488 -57492 -90100 -103231 -96097 -143044 -150377 -105614 -97699 -87680
16292 -87680 -56330 -36628 -39128 -57325 -42191 -64750 -67691 -95149 -79745 -77030 -134097 -154116
16280 -154116 -107494 -76790 -86630 -78322 -48650 -70305 -100011 -91455 -73541 -28093 -21987 -27378
16268 -27378 -13557 -14220 -20963 -6392 -68939 -94832 -84244 -59335 -50193 -96566 -127799 -76621
16256 -76621 -63548 -85879 -51637 -43654 -32613 -50275 -75425 -76155 -43038 -62303 -43577 -38827
16244 -38827 -23466 -27146 -1163 53668 24655 -13555 -49059 -47843 -86423 -142737 -148028 -137961
16232 -137961 -81204 -36773 -7603 -10453 -60399 -52794 -49548 -63605 -29255 5032 -6660 16648
16220 16648 21913 39886 50919 14868 3473 -8912 -27157 -8352 -11965 -31806 -76852 -91978
16208 -91978 -120179 -150476 -182056 -113149 -82873 -118519 -144897 -120552 -76162 -76179 -73151 -81172 -85003
16195 -85003 -153998 -183884 -212067 -128224 -39099 -30666 -48467 -103028 -133519 -75302 -64507 -82972
16183 -82972 -101476 -122841 -79557 -77662 -86812 -107455 -90061 -94568 -133843 -135782 -138051 -128035 -176513
16170 -176513 -134581 -103753 -104315 -72660 -30346 -36474 -20309 -78407 -126720 -114918 -129929 -126811
16158 -126811 -138912 -111278 -119305 -141885 -112630 -36226 -15962 -14690 16733 -22912 -40106 -34050
16146 -34050 -57320 -75177 -32116 -53741 -49045 -30758 -27564 -35014 -88700 -95465 -85021 -73083
16134 -73083 -37667 -67082 -18619 -22665 -77508 -80042 -47934 -69434 -115953 -75216 -62113 -114825
16122 -114825 -108107 -96657 -48680 20696 -5 15644 6118 -35754 -38071 -56872 -45070 -23804
16110 -23804 35240 51905 55347 -8623 -13351 -46008 -35281 -42248 -36083 -31734 -46197 -9767 1163
16097 1163 -15063 -78453 -136734 -61316 -25469 -49790 -14849 58691 60067 68839 44268 -3877
16085 -3877 -34840 -28465 -33795 29288 41143 57238 19078 -13217 -54644 -89017 -73847 -23553
16073 -23553 -22823 -34582 -33209 -41484 -24990 -6008 -33855 -48609 -38876 -54725 -24316 9451 16317
16060 16317 -24460 -28415 -8201 -14603 12240 -12773 -63008 -2941 -13535 -57648 -77291 -84404
16048 -84404 -65049 -41028 -79080 -83716 -82439 -121188 -117755 -106103 -128294 -93876 -84537 -26268
16036 -26268 1300 -42224 -65237 -106208 -115986 -105483 -79351 -16617 -14837 -30839 -36721 -24188
16024 -24188 -21669 -39266 -52743 -48377 -80595 -81918 -39384 -75458 -98723 -67383 -807 -8080
16012 -8080 -8730 -58807 -79870 -61090 -18204 7889 -59758 -69124 -69483 -32659 69351 61636 -16261
15999 -16261 -110646 -144630 -66962 -36640 -69721 -108745 -72905 -89425 -105644 -50615 -33649 -12789
15987 -12789 -75032 -159138 -98730 -51892 -13406 -10845 -69834 -73432 -8065 16520 31597 -703
15975 -703 -36016 -40751 -83487 -89654 -132212 -75057 21846 8939 -27777 -30455 -36712 -5841 54019
15962 54019 -33016 -79001 -64273 -53603 -59585 -31182 -38578 -43837 -49049 -53425 -79723 -88196 -69978
15949 -69978 -57574 -96080 -75241 -68097 -52932 -35024 -19427 -88839 -60600 -69940 -76033 -34633
15937 -34633 -23375 -6149 -89656 -89205 -22637 -38310 -24632 979 -15548 -17367 -28007 -38119
15925 -38119 10329 27531 5053 -19218 -109412 -96483 -78225 -59755 -9548 -5443 -42 10414
15913 10414 -20301 -25388 -4876 3460 15426 -9752 -16479 -6507 -12318 -28444 -25303 -17514 -34539
15900 -34539 -11546 -14035 -26824 10583 12901 -43202 -49333 -24826 9523 27450 16689 59729
15888 59729 24593 -26763 -40606 18448 10594 45545 64669 32203 -13201 -106245 -129135 -91965
15876 -91965 -78866 -62594 -23441 -48670 -19058 -9911 -37379 -47401 -35965 -266 3800 -5224
15864 -5224 1898 10729 34419 37609 42481 66205 74958 48510 27207 -22 -55533 -43012 1011
15851 1011 28415 35682 -3331 -12876 55614 73689 20284 -14788 -12048 -13217 -13331 -23159 -26381
15838 -26381 -37574 -31751 -66846 -67310 17132 -22598 -40721 -22156 -46459 -50736 -13310 2658
15826 2658 -9594 -18516 -44583 -16593 -38244 -30757 -26416 -21466 -43846 -38855 -55478 -77769 -70058
15813 -70058 -39868 -51325 -32760 13794 50378 90720 73207 20963 -48419 -35575 -34952 -40271
15801 -40271 -46537 -14517 13470 46089 48994 38684 24676 67930 25291 33995 28308 -21056
15789 -21056 -49576 -16389 -25120 -17969 -55296 -34829 -41966 -33709 14180 -16175 -53404 -47785 -24503
15776 -24503 -36398 -72520 -74675 -30561 -30967 -29356 34139 -54205 -65587 -52403 -74551 -98233
15764 -98233 -81900 -2595 -32912 -21951 -11974 -46074 -43020 -57668 -53384 -45622 -40603 -67636 -87373
15751 -87373 -76714 -79096 -77266 -31051 -48394 -66852 -60252 -42495 -26954 -26452 -23740 -41872 -38407
15738 -38407 -35229 -2966 -500 -647 42604 37977 7163 78026 45875 59040 75147 45021 26440
15725 26440 31227 -19250 -36998 -71971 -101867 -109265 -122607 -86946 -87691 11272 7395 -11630 -48926
15712 -48926 -73625 -40314 -24143 10623 722 -20676 -12351 -48960 -48973 -44566 -11578 15087 28626
15699 28626 62570 78525 47636 31618 -6355 37983 38444 -5216 -19744 8322 47959 44340
15687 44340 4774 -11046 -56856 -81123 -100382 -74484 -57098 -46718 -38114 -88173 -48598 -11971
15675 -11971 -7233 -15398 -28846 -66387 -24433 -5643 31381 26863 21784 52271 80562 91801
15663 91801 42267 -45727 -98821 -60152 -63304 -37005 53068 7360 21854 13017 -20673 -38223
15651 -38223 -38121 -53266 -44517 -23196 -16887 -18564 -40812 -49073 -23660 54909 50630 -4915 27691
15638 27691 37452 -16963 -17423 -2525 -2085 21724 60974 81237 12992 -620 -40846 -68235 -74397
15625 -74397 -54266 -16156 -26344 -128883 -142568 -137120 -111272 -96129 -81835 -80532 -53471 -75413
15613 -75413 -56842 -48573 -61795 -26273 -31102 -4518 -3828 -26334 -52202 -37036 -43983 -32027 -20066
15600 -20066 -1344 6252 5510 1348 -49591 -98956 -73475 -37428 -44493 -34555 17903 10757 9246
15587 9246 18289 9271 13964 24632 8723 -891 -57265 -65949 -46787 -42083 -30814 -10871 -37340
15574 -37340 -55773 -53687 -53707 -70581 -61024 -74493 -57156 -26383 -6089 -23357 -45413 -86168 -77759
15561 -77759 -37946 -44832 -74230 -31093 26080 13598 74659 55229 19530 11839 -4282 -91126
15549 -91126 -124558 -75718 -18211 -43130 -57737 -31818 -33586 -43784 -37438 -63794 -104657 -111376
15537 -111376 -100157 -104181 -52977 -3800 -6381 25255 71752 82342 47527 -14791 -35738 -43638
15525 -43638 -38985 -49033 -33534 -60547 -29008 -11674 467 -39523 -82243 -79035 -62736 55
15513 55 30781 38908 29068 -25142 -37827 -39643 -27334 -49039 -74859 -93285 -92969 -71645 -78032
15500 -78032 -63782 -22450 -43966 -20587 -7145 5649 15985 -15373 13399 43867 14361 3990
15488 3990 -10666 -84646 -87375 -22146 41036 32589 32888 43094 73584 50048 26872 49077 76904
15475 76904 31194 51881 68344 55211 -5399 5965 22000 5423 4278 41015 31732 65765
15463 65765 98261 112700 91662 71844 63096 -24438 -90382 -74360 -43214 -10879 -39194 -64880
15451 -64880 -67550 -96323 -26176 25955 -10962 -70348 -62379 890 43 13437 13266 -11479 27943
15438 27943 55009 40031 18487 10175 -24754 41977 100211 91778 114178 108655 41408 -17802
15426 -17802 -43073 -91441 -79838 -83128 -85541 -60679 -31880 52337 68046 38193 -25096 -68374
15414 -68374 -17194 31451 48232 38393 32219 11149 2702 -7443 -2864 -31746 -36029 -13088 15487
15401 15487 22 -45293 -46059 -41378 2162 3188 -46345 -43061 -4420 -2380 -410 19288 -17800
15388 -17800 -103541 -96478 -18402 66169 4554 -6470 -11014 5828 -4188 -23652 -62470 -44117
15376 -44117 -46473 9805 56003 -20789 -5950 20024 17833 14411 39489 20014 -32081 -9203
15364 -9203 39806 19194 -38021 -8006 3653 75608 71671 -7212 33710 69362 74967 60062
15352 60062 89360 67020 10528 24261 56826 26516 16452 -182 -17111 -30231 -1331 4759
15340 4759 -21403 -125333 -126638 -103778 -125580 -81375 -48122 -57177 -59064 -13252 2778 -26831
15328 -26831 3483 32244 10554 5054 5264 20298 -15508 31621 68237 56350 19567 32905
15316 32905 76656 66044 40439 -17089 -36446 -24970 46074 115628 135876 108627 96073 101341
15304 101341 55113 88429 61007 80159 88450 53833 34068 48572 4889 39987 12453 47281
15292 47281 113096 118947 85401 54523 42063 23940 -19285 -32248 -15318 -63198 -48528 29528
15280 29528 41010 148 -78781 -61641 18031 65937 41003 16615 51934 95616 70480 30431
15268 30431 21929 44881 54607 -15776 -34764 -38281 -46402 -35179 -27036 28632 45971 48644 77967
15255 77967 111392 119989 78556 23623 3969 27044 49651 17026 33271 32818 50819 -1655
15243 -1655 4062 47672 88338 104954 52550 33834 -23918 -77374 -102211 -100322 -80279 10080
15231 10080 -1306 -2161 -10903 -10091 51328 21117 21135 21444 19621 16903 17854 6721 -60149 -33089
15217 -33089 30039 47317 66918 88554 116572 124852 112731 96054 38443 -35761 -41314 14038
15205 14038 57271 82541 86410 22558 17338 69336 72380 60527 38615 -21001 -82101 -96303
15193 -96303 -45772 50089 77914 18065 -106558 -159322 -149399 -118518 -35983 28401 29466 21999
15181 21999 39848 1159 -13224 12490 -27504 -65274 -48825 -33195 -40538 -15601 38190 16963
15169 16963 -75861 -106104 -80312 -99649 -81257 -112709 -101700 -54591 -45127 -52439 -13466 -22772
15157 -22772 -13291 -48727 -82010 -53102 -56949 -32520 17479 -34813 -24174 47040 58623 -9600
15145 -9600 -7921 65295 94645 99449 93526 34645 18042 37608 19587 68179 104993 107171 80048
15132 80048 59709 62217 15825 10244 -11592 33562 47999 19527 -9970 62172 103745 100483
15120 100483 88810 71240 90887 78973 49071 36401 9686 -35712 -86175 -55262 -57219 -53300
15108 -53300 -31966 -77862 -113540 -34634 -13541 -17196 4589 -37977 -40551 47442 47008 -23719
15096 -23719 8482 44930 57820 60027 114316 104960 -1696 -63112 -28415 -21297 -30076 -19878
15084 -19878 -5898 -15665 -78299 -52732 36552 36072 45756 19381 41343 56571 52182 13749 449
15071 449 28992 104226 107662 130986 141776 174695 225234 256861 229227 166049 65982 39261
15059 39261 59262 42561 15881 9405 -27425 -27186 -16219 -19166 -2269 -12471 -54404 -40884
15047 -40884 859 73278 113027 103417 97645 54740 25890 19538 8170 13215 20566 16444 60708
15034 60708 54631 34937 -5624 43870 68894 62963 75102 49235 5327 66361 49496 -23059
15022 -23059 -27226 -31529 -58865 -62577 2346 42821 46924 45937 13791 26743 53138 88110 21771
15009 21771 9406 -8632 -40989 -9673 3896 815 -8410 -20160 14879 16447 19503 51354
14997 51354 36095 9307 5411 10888 -57691 -51827 -255 44031 60475 36127 50342 30318
14985 30318 -7819 -3224 45581 55619 66722 45837 68294 67256 42865 111261 146546 76358
14973 76358 -17569 -25622 11564 26411 21091 37687 11294 -4650 11590 12366 49268 29722
14961 29722 13362 966 82224 43836 25560 15505 34557 54261 40951 29726 54086 26165
14949 26165 -16778 -29744 -15928 50928 88179 35257 -55684 -14737 90178 86928 33766 53782
14937 53782 77018 107246 94646 27065 30066 66531 71655 81099 127924 135111 151059 166571
14925 166571 106059 32895 25625 41533 31749 25270 3806 46907 38183 -29939 -39598 30926
14913 30926 22095 -16482 -64474 -67774 -2507 34031 29430 -17086 -38938 -60 25947 41102
14901 41102 32728 102307 67436 -5356 -5332 20088 22508 14620 58004 57471 31507 35804 45792 31416
14887 31416 5091 19669 103092 59677 78262 77890 21692 26895 54386 36359 42513 31615
14875 31615 18008 26790 28324 3755 72905 87022 14835 21095 82982 113774 119316 63318
14863 63318 -32112 -47752 -21668 28312 66961 68160 73207 67649 -12436 -32452 6111 37037
14851 37037 101611 117828 114637 86450 56493 74656 53955 -6047 39399 117333 161120 141925
14839 141925 105987 146952 168892 149836 108728 6218 -51474 -775 16503 8092 -42770
14828 -42770 -21893 49884 74329 22161 -22793 40512 58493 63708 83540 96441 65060 36035
14816 36035 19796 -2892 12138 62149 161947 133157 93439 81645 76053 76492 84627 74576
14804 74576 96520 111301 144156 156407 110746 77246 73366 74096 60256 -16786 -25670 -3340
14792 -3340 -21953 -12483 14259 60564 63089 43586 26497 22878 49448 36466 38872 23949 10229
14779 10229 -7666 -1081 44346 75098 81144 35310 11783 63433 94819 85540 92683 89923 64537
14766 64537 27385 21418 2209 -23554 -52160 -3001 100170 142662 106725 90373 62524 43435
14754 43435 24197 6303 40475 74724 67985 100103 138132 113176 96262 102109 103594 86575
14742 86575 97666 80937 62227 28577 7534 18758 24794 61428 123193 118702 139598 99665
14730 99665 109702 110318 123165 122168 127445 109051 115587 97454 85597 79254 94782 82159 94599
14717 94599 58399 73493 74379 119792 148417 167804 150450 46156 -36135 -17371 23416 41456
14705 41456 73503 75933 4776 12857 95004 116346 100211 93390 62367 49185 89926 107232
14693 107232 47559 27880 3048 -39436 22267 109831 126920 89927 109002 123634 96346
14682 96346 88888 87002 47374 114812 162055 170108 167368 161314 104629 97275 99349 86941 89413
14669 89413 126028 113867 115782 105770 80423 85692 127483 152781 103470 117139 113027 112877 138389
14656 138389 147656 147066 125333 65065 88679 105520 73053 81383 83219 64822 94560 101564 90510
14643 90510 131483 140398 112662 123965 197938 185750 126103 105029 117573 148097 168168 123946
14631 123946 68468 38568 72376 96093 132669 184082 228913 241479 256235 189157 153426
14620 153426 166098 149153 157363 163895 165713 131799 112884 70015 34927 30329 23354 59288
14608 59288 49042 50848 103105 115924 171778 167516 178687 207293 190807 167974 100074 92428
14596 92428 102816 129443 88466 52568 92489 95903 82720 79016 119305 147175 176194 194208
14584 194208 169533 129575 101237 112180 161332 223946 245440 307368 424612 530050 652408
14573 652408 798005 930267 995880 958968 892057 807562 639678 474101 342775 231581
14563 231581 226852 195170 165062 132032 121490 129302 141191 123717 105796 139359 181537 137645
14551 137645 123063 141105 142560 118981 181164 214149 127904 92520 126159 102892 59097 27847
14539 27847 92610 97741 88590 70332 115238 133967 163912 196653 169071 105331 86772 149609
14527 149609 221070 220323 209174 217357 211638 146822 101257 109684 81530 94527 94091 91367 88299
14514 88299 79308 96194 106720 101910 97720 89946 50571 20632 23812 3227 -15062 -11858 17494
14501 17494 6148 73473 126647 177388 160559 108481 158777 153217 148601 131636 153206 153779
14489 153779 169953 175530 202821 239409 271164 266366 239818 215495 188036 158930 160314 158038
14477 158038 199493 223318 212347 191944 189468 134199 117827 148083 161409 136141 83806 94998
14465 94998 136543 160891 146168 134246 87212 88875 119295 166220 164249 153674 198366 263249
14453 263249 266299 259707 225883 258144 333739 378090 322732 278683 236392 222969 254235 251489
14441 251489 271540 206836 246298 274375 284657 321833 384932 421186 429910 435412 421145 373786
14429 373786 363860 422673 530942 629385 705578 774401 861330 1020087 1172700 1303225 1491620
14418 1491620 1698838 1897726 2113988 2327596 2423657 2410077 2401474 2340676 2245009 2115132
14408 2115132 1978302 1765028 1578083 1369413 1212465 1094227 1030138 901795 819951 788539
14398 788539 720061 671831 649375 581381 531774 438435 357222 371745 376904 352012 354439 336156
14386 336156 300577 265717 286296 330026 315253 299817 313094 319917 341419 335809 331438 346604
14374 346604 322690 301048 288033 282769 270467 274147 279423 269336 255296 227684 173782 185590
14362 185590 171076 100462 112593 170958 164664 192678 210560 247549 259019 262726 252456 206212
14350 206212 209911 229568 207739 168332 163813 217122 258845 279716 262148 174498 129505 189734
14338 189734 168280 119483 147193 168415 150451 174229 175428 180308 183802 191522 189188 146669
14326 146669 130965 101454 98360 128066 126635 131261 155604 164068 178788 176857 141387 133674 99400
14313 99400 39644 56046 43326 43171 40433 14947 10134 43332 55970 63837 81497 27189 -53605
14300 -53605 -67393 -104291 -142036 -212403 -264353 -334206 -395572 -356580 -372909 -387010 -415613 -386429
14288 -386429 -289561 -218380 -180598 -128396 -88667 -39112 11017 69426 124788 141773 148890 177499
14276 177499 163115 206694 248360 239412 241860 214371 241708 247692 236556 258890 219046 170422
14264 170422 207610 208069 166058 159901 129422 138754 166673 193091 260029 249396 250891 251063 244902
14251 244902 281991 310376 325421 321091 273442 214806 208298 244020 273302 302152 359494 417147
14239 417147 428040 467237 413060 399418 428033 488634 522187 507673 497773 523615 534257 520806
14227 520806 579483 564787 519544 495507 497071 518088 544158 555134 603484 607950 569180 572655
14215 572655 531515 490401 469766 419638 432146 499629 541090 530922 447817 431560 462917
14204 462917 461216 433418 424337 482372 441996 426211 405776 418685 380292 379622 407360 432178
14192 432178 423984 457949 414166 382762 424861 435782 409549 403542 392335 401664 422098 403261
14180 403261 403186 452092 531364 566664 573406 553099 501239 479165 411641 379121 367332 360684
14168 360684 402662 407692 431054 437272 414992 370502 359133 333018 322480 315011 359873 390406
14156 390406 370880 358467 358969 351754 388740 479146 565408 542304 534426 527934 541348 573205
14144 573205 596369 601133 553545 556287 522953 510571 534342 533692 544215 564681 600939 618988
14132 618988 590751 599220 543324 539848 573626 633894 631693 590211 620125 628446 619323 645457
14120 645457 653920 664820 690890 654125 651385 726174 767125 815332 895861 927334 948684 988808
14108 988808 1004581 997676 959130 982580 1047576 1114917 1179022 1229115 1384079 1524324 1555907
14097 1555907 1537114 1529718 1600304 1627418 1597454 1566227 1582639 1577100 1557735 1559336 1526074 1504804
14085 1504804 1467878 1429661 1383900 1400525 1382343 1369998 1367037 1368549 1360158 1392077 1376357 1373543
14073 1373543 1393870 1403432 1433670 1494650 1541432 1568131 1633343 1665016 1747302 1842472 1881714
14062 1881714 1867062 1872264 1909733 1982847 2016216 2022029 2068229 2108133 2163775 2215111 2245659 2254789
14050 2254789 2316773 2359552 2474375 2546243 2550740 2584284 2684468 2731650 2786372 2837746 2929259
14039 2929259 2996802 3097955 3249089 3399624 3567188 3740690 3833710 3927580 4110384 4280628
14029 4280628 4434139 4599896 4829964 5039252 5188910 5381861 5517770 5733067 5907272
14020 5907272 6138280 6402492 6659226 6906074 7223376 7470857 7744626 8048335 8338484
14011 8338484 8665206 9015094 9386732 9843631 10366707 10855064 11371108 11944173 12644012
14002 12644012 13368259 14078259 14906778 15868173 16834613 17939511 19151275 20478248 21993563
13993 21993563 23698340 25560099 27603729 29949099 32648329 35634481 39042278 42938788
13985 42938788 47354634 52402091 58285318 65075952 73001128 82287975 93130758 105934341
13977 105934341 121220967 139417430 160956021 186164141 215056912 247134459 281370557
13970 281370557 316201972 349560380 379197894 402943295 418718692 425249215 422021716
13963 422021716 409204627 388138184 360742910 329101087 295446469 261750186 229670496
13956 229670496 200427541 174503997 152085625 132922565 116644685 102902131 91194474
13949 91194474 81139680 72471947 64990361 58520981 52830380 47907675 43644697 39877638
13941 39877638 36649452 33842731 31337664 29093230 27109521 25337047 23732545 22321659
13933 22321659 20995270 19754559 18637535 17667704 16782102 15977369 15265954 14617074 14021461
13924 14021461 13421041 12898435 12391052 11881100 11442359 11053803 10707175 10249978 9830869
13915 9830869 9499352 9171177 8773649 8416129 8043067 7721488 7420429 7081038 6785200
13906 6785200 6550421 6270660 5968895 5683524 5448820 5171151 4889374 4764984 4685441 4486279
13896 4486279 4280498 4060036 3951774 3818538 3676866 3589239 3488536 3358410 3256209 3222694
13886 3222694 3093847 2969829 2878620 2770231 2693313 2640545 2559147 2486754 2414593 2318009 2198947
13875 2198947 2118745 2090214 1998551 1926003 1847338 1752978 1659206 1627261 1594707 1454789 1411119
13864 1411119 1436490 1404461 1333081 1277205 1263266 1250452 1235644 1236751 1202002 1198940 1216596 1209996
13852 1209996 1146364 1101962 1081739 1040461 983697 972128 953098 979260 981604 901677 813133
13841 813133 748850 698531 713736 754033 659220 563530 571621 528479 437578 343960 324029 320340
13829 320340 282966 265413 252044 285056 258337 256917 287158 333674 369988 337885 303313 351950
13817 351950 346197 333621 322389 355081 397412 424441 428855 413795 360216 329143 349200 317804
13805 317804 316028 304370 228089 256876 274473 303066 289638 323342 370800 400181 355072 299794
13793 299794 353831 395947 367268 300048 322318 356785 389149 372348 344026 358572 378739
13782 378739 421097 439556 400549 396623 357540 438867 509656 461062 437173 438265 384299 372482
13770 372482 399841 403687 324397 267026 188072 147099 180551 159867 132819 141314 180170 201427
13758 201427 172035 126399 129544 172124 220446 239143 303336 297558 242651 198463 228949 248027
13746 248027 219211 228269 233654 233803 216006 186456 187723 255307 311389 310027 287336 220630 189254
13733 189254 229248 270743 270346 241580 207061 224732 314424 269709 232897 250213 205330 222219
13721 222219 245563 287617 274575 259382 220946 211770 215105 236631 269119 261998 203675 178975
13709 178975 231958 311317 292791 211521 222612 239168 173567 125217 139527 195266 203926 187251
13697 187251 155775 148571 195828 231686 237113 208430 156019 143805 164177 172469 170864 156465
13685 156465 121897 152840 179455 179808 182269 222606 228701 206186 150178 117149 145808 116405
13673 116405 60973 82718 88027 82935 127699 88655 108427 81894 8895 8906 8002 30832 64670
13660 64670 114424 153455 114222 60677 41488 103305 171671 193613 221500 246789 248500 205453
13648 205453 216511 295250 347105 447926 521204 586531 660566 715266 708189 741028 838584
13637 838584 796288 773602 788360 715161 588062 509325 474627 428060 384858 322896 276751
13626 276751 291635 301008 338512 355879 279430 227669 263100 310044 294217 261165 248488 190620
13614 190620 154703 177344 179685 140243 76411 101093 142026 177783 166198 161176 160646 120306
13602 120306 155670 167558 147487 145636 142432 187338 231685 200060 184094 244703 265895 258655
13590 258655 221968 155507 125310 151859 143999 167629 179777 144495 141607 131055 118561 118495
13578 118495 96131 96180 92089 51774 44637 78109 89314 87329 93780 116157 128720 200644 234564
13565 234564 210921 208012 158224 160209 193614 171555 182658 201020 185114 132306 122110 137047
13553 137047 154603 190697 216163 247417 255627 269940 220452 199675 204027 182783 148985 150805
13541 150805 196343 244438 184202 136798 179213 180689 159133 188764 253186 294480 307955 349394
13529 349394 389405 391179 370655 332647 354484 424572 543634 678159 773158 933161 1176757
13518 1176757 1356934 1463565 1596759 1835006 2013261 2134365 2284686 2331977 2343067 2280960
13508 2280960 2167767 2056860 1900492 1710755 1581160 1410197 1219632 1114748 990197
13499 990197 867448 757787 652540 590737 510124 499005 532028 494169 437533 382387 389286
13488 389286 388756 370187 335877 297793 270601 250431 234682 251479 260722 290426 249705 162802
13476 162802 172419 135951 157703 193363 150494 118857 125038 137145 107929 84745 125485 109852
13464 109852 94887 102788 87114 53877 26459 -23556 -30864 1826 67691 96737 141037 145878
13452 145878 116133 109540 148498 121196 122389 114434 127927 156448 137129 97219 116100 118329
13440 118329 86703 107315 89991 53977 60883 126386 118028 119421 112141 143345 141725 119234
13428 119234 100240 123643 158250 205941 243237 272526 211245 225662 200779 183866 187473 171424
13416 171424 170796 153559 156995 155888 154214 149795 135929 105209 104637 204651 245256 270787 272249
13403 272249 273149 223958 175598 187220 188728 191010 160346 119957 108178 118011 115795 159383 184703
13390 184703 202911 246112 248134 231738 260883 277240 190241 141872 155987 143415 129644 112260
13378 112260 69790 78419 159583 196498 168953 180466 170759 156515 172982 193853 209758 185336
13366 185336 167972 194608 196455 191138 181601 175275 216711 227614 173492 116473 150510 188743
13354 188743 217438 207604 150881 129768 159281 181841 217506 187350 118725 120950 139091 130894
13342 130894 106593 118448 115701 141384 156090 130021 114330 183409 203104 140239 116781 147228
13330 147228 159723 118312 129892 191179 205496 193370 154171 100065 151317 175491 160582
13319 160582 145112 168821 179752 212512 139889 87935 101333 120429 126521 145067 149617 167782
13307 167782 198437 183603 177922 164417 195735 197685 195550 167334 153488 176227 186634 144720
13295 144720 131830 172495 217960 273358 277675 251872 214092 177069 217749 211576 179656 138270
13283 138270 191614 222223 224727 169367 189407 202943 209927 183397 174803 135392 93915 77553
13271 77553 144317 246215 309937 306740 235677 171920 132880 109468 141519 172184 185692 133894
13259 133894 117694 152960 159308 135801 115219 181520 200649 170213 140948 154505 209338 254996
13247 254996 258651 231008 220258 235627 234837 205806 164216 159490 190013 229951 267873 290246
13235 290246 298506 260521 228893 241333 256966 240953 212986 262656 321977 340031 291933 281538
13223 281538 304941 346756 332340 296932 290413 325411 327286 324268 342413 359381 345474 350526
13211 350526 356011 352154 373460 388212 333993 341660 418950 467910 465595 533943 582539 577909
13199 577909 621694 778558 959013 1124414 1390173 1706281 2021809 2238122 2247689 2108984
13189 2108984 1898007 1650282 1406969 1226256 1058324 914297 817608 826104 826750 819575 860687
13178 860687 869156 912111 1004046 1107608 1214706 1295669 1406784 1525161 1566606 1580997 1570757
13167 1570757 1605917 1698688 1865865 2063868 2267895 2427201 2531716 2533479 2382901 2158485
13157 2158485 1884646 1638587 1513181 1475247 1516443 1510949 1500771 1443315 1403015 1350571 1356886
13146 1356886 1299773 1165064 1037137 969807 896908 889120 880613 904201 959743 1030255 1123884
13135 1123884 1227110 1457589 1821321 2148140 2357379 2473420 2382008 2084317 1821524 1553773
13125 1553773 1266500 1076460 993772 889683 763706 687445 686489 660739 637560 594693 530008
13114 530008 463724 438310 463013 503470 476046 429166 411064 452293 533188 544988 526014
13103 526014 471273 401990 371548 355378 344685 370582 355718 350840 309055 235090 265790 296770
13091 296770 298200 345115 340530 337731 349115 307801 265547 278147 296018 313619 298561 288768
13079 288768 297113 289555 216614 171217 207672 224676 170743 68928 4083 -38550 -113017 -169316
13067 -169316 -223510 -239903 -142256 -29799 106862 186550 203652 223702 218162 228511 262329
13056 262329 255171 267162 285574 281394 270777 195877 143226 56135 39806 95092 99403 30540
13044 30540 -17899 -68663 -98406 -104604 -182639 -248120 -300016 -326957 -272548 -183465 -100283 -17733
13032 -17733 18878 93676 145304 175770 146540 119690 141270 152623 198151 190454 195792 216793
13020 216793 260652 294103 334084 366981 300365 276419 325620 340696 306218 273834 185234
13009 185234 120477 -8541 -58488 -66479 -69352 -356 104651 268801 327291 392875 471680
12998 471680 557860 618409 644152 631258 655587 668421 684213 635024 604371 663740 653588
12987 653588 577942 632035 654354 624689 629745 642228 682535 672325 666285 676766 715887 718045
12975 718045 737825 786724 814891 824532 802671 783192 781097 772599 782933 766389 764277 747399
12963 747399 744609 738594 751120 753015 743727 757747 796546 863082 950217 923789 870167 812059
12951 812059 819546 852443 872711 820956 806280 848171 871900 838242 837190 892031 871617 823798
12939 823798 812866 786426 800717 835870 787276 722236 697695 666790 685822 739841 797704
12928 797704 881845 934062 942835 935916 917623 928920 874941 850453 887580 948864 868946 764339
12916 764339 709439 719979 716898 667213 591969 584165 620163 632271 729988 737273 724933 697859
12904 697859 705492 744900 747826 730108 684852 653845 662444 729432 730701 755052 808031 859664
12892 859664 871717 893166 943965 917644 907399 949333 953775 965205 1007531 1039303 1030140 1037944
12880 1037944 1048622 1044989 1017978 1055335 1142556 1215859 1315699 1427419 1514678 1609999 1652499
12869 1652499 1642258 1677736 1738837 1789190 1828164 1838078 1898949 2055473 2165389 2188867 2078726
12858 2078726 1982905 1925701 1907740 1893273 1860558 1820470 1793043 1807321 1787586 1758648 1789970
12847 1789970 1832469 1901706 2008579 2113899 2233084 2273869 2235610 2200873 2191374 2161455 2097761
12836 2097761 2070776 2048574 2065016 2074470 2032821 2068570 2167218 2218073 2217456 2227890 2221473 2233343
12824 2233343 2278294 2270657 2239259 2171829 2146571 2159311 2160884 2251210 2296453 2416718 2627103
12813 2627103 2788153 2891385 2979322 3089438 3132313 3205209 3272686 3308397 3352418 3371597 3339376
12802 3339376 3340772 3299402 3297970 3374931 3429455 3422264 3435865 3462423 3516632 3576535 3687544 3773401
12790 3773401 3872655 4007751 4190086 4351544 4531557 4694571 4901730 5173378 5377021 5589114
12780 5589114 5818938 6174046 6630686 7168471 7770015 8478975 9286399 10012148 10418825
12771 10418825 10557710 10550533 10562476 10628781 10841742 11237739 11834561 12532585 13416259 14536933
12761 14536933 15791632 17117228 18765895 20726003 22919054 25320065 28029863 31312029
12753 31312029 35448118 40739687 47761327 57217829 70247442 88517248 114172210 149934407
12745 149934407 198231593 259126698 326300956 382370573 405983106 388715232 342787285
12738 342787285 286868889 233929036 190014571 156433736 132404754 116388469 107023859
12731 107023859 103191747 103979689 108834434 117633717 130754649 148332342 169296316 191301851
12723 191301851 211355813 226681927 236052145 240648618 243444937 247975539 257586329 275397546
12715 275397546 303306915 340513139 381856537 417518439 434945474 426344942 395556588
12708 395556588 354783010 314985378 282128517 258138931 242669843 234468479 231808095
12701 231808095 233046214 235993152 237251471 233170248 221816792 204348196 183706641
12694 183706641 163154182 145267432 131252650 121221731 115408774 114353672 118979633
12687 118979633 130613986 151314062 183784388 230083460 289526381 356060796 415685656
12680 415685656 448408587 439215795 391425309 324821784 258686985 202509687 158148479
12673 158148479 124289164 98871706 80017014 66110989 55823121 48155155 42368983
12666 42368983 37900006 34246620 31116925 28372091 25823802 23450195 21360108 19588601
12658 19588601 18039206 16669683 15497223 14510352 13728584 13102687 12492152 11931977 11408459
12649 11408459 10843743 10341909 9845554 9316643 8851376 8471689 8098715 7810722 7627929
12640 7627929 7422985 7246471 7045007 6775902 6540258 6399500 6244732 6051918 5889683
12631 5889683 5693366 5439831 5218497 5013218 4826424 4677977 4452715 4251172 4080988
12622 4080988 3934066 3779346 3608028 3410814 3208427 3025383 2894077 2735792 2659342 2514436
12612 2514436 2338301 2239445 2137815 2106968 2038926 2024588 2017042 2008565 1964017 1911268 1878933
12601 1878933 1822494 1741766 1593028 1520880 1481931 1442471 1388327 1354418 1324462 1307758 1308377
12590 1308377 1296583 1230183 1193425 1125028 1064360 1002170 962118 966798 932636 893499 856596
12579 856596 801731 784983 794909 776819 833757 849774 836836 853946 867904 884625 968047 1072878
12567 1072878 1181979 1358708 1511705 1703144 1850062 1926505 1941934 1838628 1700194 1556621
12557 1556621 1363305 1187828 977125 852720 805896 780007 691425 625625 601963 533953
12547 533953 493274 460246 453427 466142 440536 443432 418083 362724 340668 369538 365657 388425
12535 388425 397144 433608 498805 492185 497145 535097 578069 541452 497780 507510 555761 587850
12523 587850 608884 592466 609484 574412 552464 537337 512359 533552 511083 458582 465423 506139
12511 506139 503395 496780 445281 424847 435835 455507 441701 409707 429597 404061 434287 411993
12499 411993 363408 293917 326390 368341 352193 315931 298249 360760 459844 485979 500069
12488 500069 487293 450817 496360 489265 447756 431800 475870 435936 362964 267618 264608 309720
12476 309720 312396 294399 344695 367742 383112 397835 397852 308435 241551 221987 217947 220473 249451
12463 249451 233536 223644 184882 164539 231998 284809 248105 214096 246980 272566 229443 207266
12451 207266 269567 271099 284271 314371 362807 418675 473890 429250 402654 375930 309387 214075
12439 214075 228177 324032 394403 384780 338567 284162 285211 294849 309524 236700 271537 275096
12427 275096 299731 386031 438294 438135 427256 418635 436829 519344 627074 768382 888961
12416 888961 955122 1010108 952265 943763 971455 978522 1053341 1130695 1129105 1009964 911655 806853
12404 806853 735270 643579 579941 533540 556173 559712 554896 585867 638514 660132 634456 669801
12392 669801 702440 746471 762389 745795 746640 807636 897990 941593 959891 948358 834200 720954
12380 720954 652168 620716 586358 586815 612919 619121 688840 797793 887106 877510 794122 753855
12368 753855 637864 573773 456244 317887 280113 267997 332678 377963 417500 431867 513359
12357 513359 594008 700717 780608 835876 802805 765107 717257 642667 546199 451789 369282
12346 369282 324768 288809 226135 200718 230056 271029 258329 291536 304397 224645 194668
12335 194668 203758 211937 240642 213795 204414 161662 196687 231549 206786 147417 150330 151462
12323 151462 127549 126526 169510 213367 198603 147998 101954 128335 168275 156498 134504 149440
12311 149440 165178 161674 146352 229045 272332 280632 282302 237180 204590 197580 202207 220961
12299 220961 237376 277146 300518 293893 305555 357895 440904 504954 562291 657861 833677
12288 833677 1058460 1305400 1610158 1844405 1886761 1786680 1663114 1523841 1299075 1068633
12278 1068633 892241 769769 696233 668465 642881 629904 673931 735822 799364 847422 920775
12267 920775 993205 1105094 1227926 1278642 1345948 1364468 1427047 1485235 1594901 1706923 1851622
12256 1851622 2024376 2203417 2283144 2198260 1971541 1722974 1565503 1440818 1375343 1315057
12246 1315057 1236765 1220371 1264553 1347044 1387888 1294093 1223604 1159914 1073233 1016345 956983
12235 956983 884615 859188 886310 868469 839553 864326 979732 1109106 1300449 1607886 1925821
12224 1925821 2219078 2415344 2441229 2287028 1993038 1654131 1341972 1014203 790918 627567
12214 627567 545069 487387 430232 421770 419352 365814 283435 237859 253838 270421 249103 230762
12202 230762 243081 287978 235383 205900 181012 180941 216879 244128 282820 261496 266543 246636
12190 246636 176911 136955 161814 176471 169080 160491 141527 187547 135049 92750 137315 159098
12178 159098 126992 118764 99235 53560 13860 76583 132400 145322 152891 171068 168785 181196
12166 181196 188371 198105 200572 208295 223845 191642 153709 131538 152334 158619 140070 120911
12154 120911 140143 156011 147157 169919 228634 245900 217948 209413 202329 216184 197420 182250
12142 182250 181445 201129 160281 134975 146961 129966 68459 59621 78736 80317 88799 119459
12130 119459 121043 63893 -1915 8899 88390 127180 125108 95164 131910 181797 157192 168326
12118 168326 227279 254977 282045 307551 330809 259594 216866 180208 92380 105255 146992
12107 146992 183925 244343 275558 303951 283763 274705 238259 286948 363735 324532 217885
12096 217885 161012 224535 220347 142488 147747 210918 202208 224548 241577 233484 283964 329616
12084 329616 316591 308592 295328 344131 396454 431873 493172 554567 630967 792738 1015808
12073 1015808 1297203 1604813 1884036 2117938 2307657 2359794 2231124 2038195 1798256 1562844
12063 1562844 1344022 1150148 996990 891313 837533 868540 863655 913048 1013487 1052858
12053 1052858 1159166 1259214 1323001 1373101 1409726 1402943 1340815 1270593 1231992 1300553 1415080
12042 1415080 1602366 1799576 1940610 2109187 2224402 2284061 2245720 2129824 1983620 1885241
12032 1885241 1784123 1606473 1563094 1558820 1535986 1486480 1358734 1237016 1133152 1040324
12022 1040324 913735 931340 959064 939712 923370 898517 873491 896003 935103 1044264 1190539
12011 1190539 1381309 1633511 1832069 1973831 2014735 1945021 1774155 1542764 1352548 1128065
12001 1128065 926893 796486 693480 602175 571930 505572 419234 394794 379507 369408 318374
11990 318374 315111 313980 289552 288849 286058 251012 233424 255789 244488 218819 233288 164585
11978 164585 104928 144712 144226 102558 30967 -102460 -253052 -372007 -398948 -332782 -301023
11967 -301023 -189822 -55199 -33220 -7585 30143 66576 107636 147341 136189 104276 54429
11956 54429 13938 -17874 20351 -6645 -59555 -46348 -28460 -49717 -16791 -30235 -34914 -96583
11944 -96583 -189100 -230403 -278920 -384077 -466917 -517246 -489633 -339961 -230365 -116851 -43816
11933 -43816 24983 72860 38065 -22126 8306 -25608 -39658 3396 58549 30080 53960 145309
11921 145309 182926 188583 223599 251286 279320 259941 214789 166477 97404 19918 -31126 -46627
11909 -46627 -87513 -108898 -10265 80145 221336 378781 484553 551374 534995 606827 637442
11898 637442 663009 663215 656629 640116 639367 593346 575897 581162 565908 583583 592436 593575 570282
11885 570282 565080 525982 549173 586314 627455 683499 695600 712797 736440 746729 748209 733024
11873 733024 687976 735383 771156 786338 775381 770623 801212 700004 661824 621177 604141
11862 604141 611796 621187 650725 702065 689634 679385 670310 649717 647760 672831 672858 669745 715539
11849 715539 777147 741074 696757 720695 764223 780694 796482 782886 711516 703029 710634 715203
11837 715203 724698 649481 602510 604219 596327 594352 591263 615876 617877 637279 678218 654677 667155
11824 667155 631914 644527 670059 659136 664875 706240 750233 733781 708072 696298 657518 602063
11812 602063 608442 561424 505787 525722 534116 502691 492103 522869 566216 582819 602958 603920
11800 603920 585166 619495 620390 623684 724104 777902 797659 824457 849785 862346 861755 870822
11788 870822 921855 926064 972748 1005849 1018540 1035752 1051423 1103211 1146854 1146968 1220945 1329700
11776 1329700 1462120 1513869 1595942 1620177 1600834 1612459 1684892 1747318 1830373 1979480 2120698
11765 2120698 2336431 2504511 2636881 2722098 2763353 2675727 2538286 2387298 2332427 2266063
11755 2266063 2178348 2089109 2024826 2047707 2136793 2244878 2396611 2570509 2823254 3221306
11745 3221306 3758500 4286194 4779509 5129188 5193657 5022918 4708280 4261257 3823215 3485216
11735 3485216 3222112 3065766 2983742 2897305 2862617 2872351 2932390 3052304 3168474 3315425
11725 3315425 3471366 3609539 3708945 3753554 3843714 3932112 3965936 3995116 4049202 4210751 4531661
11714 4531661 4900618 5331019 5769774 6156665 6413202 6454074 6271933 5978534 5722775 5434144
11704 5434144 5284426 5199063 5127802 5158570 5181034 5184358 5187004 5160673 5140375 5112161 5009671
11693 5009671 4933831 4920611 4961364 5084263 5288009 5484875 5699329 5917008 6238084 6705952
11683 6705952 7240533 7858878 8464432 8991226 9292884 9314011 9270735 9206908 9222066 9334897
11673 9334897 9519562 9800642 10196574 10665090 11233895 11831093 12611171 13621723 14676784
11664 14676784 15897222 17222585 18823624 20787067 23077461 25913341 29333753 33475400
11656 33475400 38476553 44644246 52587649 63196088 77811305 98350091 127015952
11649 127015952 166298795 218256304 281804831 348711617 402957285 427574751 415813330
11642 415813330 375051801 320350120 264954437 216564617 178102528 149813892 130798899
11635 130798899 119643857 115066618 116290796 123070479 135257612 152104023 171570537
11628 171570537 190721940 207125289 219781371 228424297 232647409 232067520 227686178 222504796
11620 222504796 221475149 229711215 250592049 284657551 328992759 376247225 415336143
11613 415336143 435086772 429585847 401830527 361940363 321591387 289191583 268052232
11606 268052232 256859580 251549631 247918883 243059270 235563655 224895341 210611218
11599 210611218 192471706 171600676 150634099 132307575 118325108 109198496 104584173
11592 104584173 104370107 108869892 119119409 136532820 162604488 198729739 245153135
11585 245153135 298671209 349590335 382569178 384550239 354225358 302957487 246442492
11578 246442492 195409570 153625161 121068993 96496973 78362056 65085910 55231565
11571 55231565 47831076 41939587 36991686 32795776 29166364 26105374 23516920 21332353
11563 21332353 19505877 17952674 16559173 15394549 14391100 13474319 12715215 12106643
11555 12106643 11574398 11083747 10634551 10121531 9598762 9140624 8683942 8264075 7900504
11546 7900504 7609944 7294851 6993058 6769743 6534949 6300414 6139167 5983729 5791991
11537 5791991 5581122 5446190 5360924 5214325 5060640 4905480 4682433 4457482 4287953 4094975
11527 4094975 3875811 3712154 3630586 3463060 3281526 3126512 2972414 2802327 2648763 2523215
11517 2523215 2362933 2203053 2147387 2089285 2004887 1901542 1807648 1832677 1828011 1785911 1716035
11506 1716035 1676767 1687779 1635289 1508370 1460376 1432931 1397108 1354809 1261015 1105976 969866
11495 969866 953223 988014 959188 948292 975559 1000272 933166 893822 873985 801187 691534
11484 691534 723398 711740 672668 648188 626046 624366 595375 631840 724564 743389 758558 733093
11472 733093 724210 753957 775576 871358 964625 1130599 1298604 1364658 1405474 1394973 1342050
11461 1342050 1282235 1098606 908459 822506 774053 706473 679892 698309 606675 495592 466023
11450 466023 436048 389227 352301 337599 372106 343235 313823 308690 283634 271530 248684 262054
11438 262054 332850 334651 326296 378902 377249 389818 441154 421300 395995 396492 384093 375819 384453
11425 384453 394130 406559 387544 382454 372008 349201 341697 357918 370952 361073 382305 375740
11413 375740 318448 300120 299585 295635 279438 272870 290711 253050 181984 169377 204176 194427
11401 194427 184774 206097 186964 183007 176986 200922 237256 254145 272183 301525 307218 347335
11389 347335 357318 423433 413796 360678 277387 228717 221871 224288 204831 197256 226499 211137
11377 211137 205553 184791 162477 133686 97946 67329 64523 67585 97138 97057 131284 122847 164048
11364 164048 211914 180863 140908 117970 92178 120143 158015 147179 130066 156773 148821 176644
11352 176644 141354 87536 92632 131911 149097 118819 64732 24647 -2194 -9361 -22055 31432
11340 31432 66554 102393 103423 111809 62153 -18070 -64682 -62044 -90085 -126631 -87517 -18375
11328 -18375 -21773 -33176 23907 103944 125242 135539 217814 359285 526754 646558 715956
11317 715956 670549 572474 501358 400002 255861 204409 132351 103539 124520 143780 169995
11306 169995 230063 237727 220140 245183 317892 392882 377827 308531 227819 186578 204580 225637
11294 225637 251494 326932 368667 426049 515338 558056 590956 678967 709315 707316 644455 593427
11282 593427 551427 469206 430897 469617 475185 496684 486593 380437 296090 296647 293985 304250
11270 304250 268308 198285 167973 104474 108710 183477 178335 200778 215217 291032 375589 463194
11258 463194 540815 617471 616304 562904 504841 363042 241378 217282 166752 145162 156031
11247 156031 117019 102236 104788 73918 18962 19513 88862 117532 118885 111532 78770 49641
11235 49641 10227 7706 55238 75036 131886 180991 153396 155898 114657 105633 180481 221954
11223 221954 224997 242235 350144 474501 646346 832346 1050192 1313384 1553756 1783197
11213 1783197 1926429 1939636 1813732 1632146 1388490 1161045 941727 777553 634834 571272
11203 571272 556745 585484 594542 668876 707096 767026 812851 934766 1036401 1074564 1087522
11192 1087522 1135506 1164141 1189948 1210505 1214027 1290627 1467718 1652646 1771271 1852170 1892558
11181 1892558 1908710 1870770 1745415 1602127 1449122 1299195 1276664 1251024 1240294 1245862 1193161
11170 1193161 1151636 1116091 1000519 844699 715426 573824 530741 478300 483339 548378 599537
11159 599537 642732 723012 799025 942335 1160060 1397694 1647774 1858534 1961752 1842696
11149 1842696 1584324 1320167 1008301 779962 618093 523517 405017 280453 252826 235168
11139 235168 187787 152701 181093 198398 193504 161296 110919 107114 64530 63030 63708 45476
11127 45476 63962 63450 -8169 -71741 -106504 -59111 -1068 -36635 -80524 -117600 -101796 -83626
11115 -83626 -33320 -14969 -54728 -48916 -29678 16868 -27476 -65609 -63005 -76618 -74922 -37215
11103 -37215 -3232 39635 18964 -23588 -42673 -56333 -71411 -52849 -52826 -89033 -99000 -79583
11091 -79583 -74382 -71893 -111286 -89920 -72921 -74451 -56241 -17546 2738 -24676 14906 30610
11079 30610 -7098 -20438 -23891 -28847 -34482 -43285 -47179 -86404 -67371 -56591 -70414 -92873 -109725
11066 -109725 -104154 -94566 -103957 -102398 -72979 -75049 -124212 -124435 -77336 -87591 -93648 -26051 -10834
11053 -10834 3724 3375 2601 -66122 -66492 -26552 -106725 -114763 -94306 -98649 -45486 -35216 -41120
11040 -41120 -83188 -80418 -99672 -81572 -33258 -71497 -108116 -119134 -127705 -136135 -83218 -71501
11028 -71501 -132660 -136112 -136081 -106555 -115428 -134852 -140192 -108606 -33899 -74663 -132697 -122846 -74367
11015 -74367 -62450 -95987 -134395 -113306 -155311 -256162 -230782 -210716 -190475 -197230 -160939 -134274
11003 -134274 -73085 -45153 -91688 -181156 -167202 -153345 -121978 -115591 -106427 -101017 -110136 -94452
10991 -94452 -83757 -119193 -127439 -127320 -75015 -55837 -59349 -66235 -75878 -100725 -89546 -66723 -64272
10978 -64272 -40288 -27450 -42531 -47327 -42942 -15372 -14551 -32034 -60174 -71745 -106560 -112540 -136595
10965 -136595 -131958 -139156 -94730 -56077 9187 18546 -12276 -48686 -132599 -129510 -166045 -198363
10953 -198363 -187349 -151445 -100891 -60725 -123961 -182997 -154475 -124392 -92416 -47531 -27669
10942 -27669 -31892 -42841 -42439 -43637 -64967 -60083 -21287 -32569 -65791 -82084 -34255 -28064 -67583
10929 -67583 -90047 -66831 -43432 -79958 -101189 -109058 -100816 -166956 -215241 -181804 -155350 -120356
10917 -120356 -137104 -141036 -171064 -178600 -169084 -194343 -191849 -184647 -158691 -146150 -149723 -115291 -89297
10904 -89297 -63656 -66790 -97150 -97818 -92417 -112094 -97522 -76874 -88571 -101968 -106713 -121200 -123272
10891 -123272 -105368 -101690 -45314 1780 23271 -8646 -22636 -49734 -118226 -101915 -91036 -102349
10879 -102349 -99447 -103266 -106306 -94331 7609 29443 -25140 -55774 -49580 4441 21962 1835
10867 1835 -37072 -41515 -94524 -131413 -144980 -83350 -117046 -160971 -149328 -159807 -143557 -135520
10855 -135520 -76876 -45766 -34311 -41477 -35408 -55065 -89580 -60805 -107656 -137218 -139429 -103159
10843 -103159 -97089 -107303 -120915 -116691 -98928 -61681 -2149 12058 41791 52837 31310 11989
10831 11989 -3628 -6055 -16462 -24595 10092 -12702 -81258 -81081 -24350 -51518 -88036 -87330 1726
10818 1726 29029 16321 -10499 -32881 -88748 -143593 -208493 -165361 -125928 -98167 -103791 -121106
10806 -121106 -95316 -63128 -19432 -5483 -22315 -42296 -78503 -98552 -101125 -124310 -109330 -81616
10794 -81616 -99928 -25491 8092 5858 -21986 -102986 -181418 -206484 -182017 -113443 -88313 -69941
10782 -69941 -116127 -129440 -79413 -118770 -99411 -82965 -53106 -60812 -37641 36130 -6056 -50828
10770 -50828 -51621 -40598 -35786 -79944 -113146 -91169 -46864 -55145 -25747 -15172 -54926 -98642
10758 -98642 -68651 -16773 7475 -12884 -24450 -80279 -131607 -82778 -48605 -73373 -93947 -113681
10746 -113681 -106492 -115002 -91044 -94091 -83411 -75443 -6107 18092 -13926 -53615 -85349 -126001
10734 -126001 -161065 -138024 -74897 -48200 -6503 2875 5120 -11724 -117000 -128865 -87493 -73901
10722 -73901 -97495 -57661 -65730 -99112 -49219 -16037 -5478 -22759 -74291 -108124 -42971 -42332
10710 -42332 -104498 -142732 -135004 -113959 -65723 -38793 -70361 -106321 -79477 -13144 17061 -32201
10698 -32201 -79564 -96245 -43159 -11956 -13088 -10565 -30466 -14566 -63794 -139558 -135676 -165444
10686 -165444 -174664 -139471 -117117 -79428 -99169 -153049 -115107 -73260 -61691 -69799 -93515 -46481
10674 -46481 -56697 -21710 2764 -5362 -5356 -48614 -110626 -105088 -135332 -137423 -130534 -128623 -109790
10661 -109790 -84017 -36060 -32823 -35676 12714 55570 -2745 -10098 3453 -35370 -21694 -76197
10649 -76197 -121556 -100226 -67944 -58891 -37292 -51304 -80830 -49616 -60514 -41472 6426 3841
10637 3841 -68991 -116924 -95779 -44801 -25064 -2248 -17651 -82842 -101458 -98102 -131002 -122184
10625 -122184 -86236 -102116 -102143 -100520 -107788 -123622 -121570 -100988 -74088 -52100 -50785 -71934 -106146
10612 -106146 -58839 -30974 -29230 -44709 -102923 -114353 -195010 -234113 -152086 -107444 -56881 -14092
10600 -14092 -18522 -43368 -37424 -5515 -39764 -106496 -56735 -44082 -101016 -93304 -72732 -75610
10588 -75610 -77485 -66371 -81800 -144738 -199064 -136140 -56491 -2144 20279 -7228 -25872 1057
10576 1057 -11842 -10904 13829 -19426 -49430 -47329 -16767 -17584 -12250 -57998 -111178 -106918 -160417
10563 -160417 -145856 -132126 -112112 -69937 -54383 -85604 -117662 -100693 -65286 -74383 -75689 -33410
10551 -33410 -16027 4935 58852 60951 28232 -29012 -40370 -43265 -37097 -26185 -27619 -9670
10539 -9670 -37921 -73387 -55894 -55451 -52473 -50623 1245 18868 -16714 -19099 42687 -10710 -23888
10526 -23888 -20702 -48669 -48843 -69979 -82481 -50451 -77573 -75627 -15876 15260 4606 -12791
10514 -12791 -27875 -21890 -18847 -56433 -88077 -41530 2116 10496 14967 27041 -2675 -46569
10502 -46569 -75698 -98765 -84974 -45334 -14844 -6306 -85129 -206883 -210250 -177187 -146142 -102029
10490 -102029 -80630 -82048 -27716 14781 9494 43949 -7276 -57761 -56841 -66157 -97882 -101022 -32321
10477 -32321 4659 12195 41500 96876 99053 87159 51032 2162 -16831 26936 -1347 9696
10465 9696 -44727 -120971 -80201 -46998 -52911 -68302 -85780 -58134 -38712 -40397 -23098 7261
10453 7261 36652 -31 -68577 -118568 -116282 -87694 -83304 -77992 -59154 -866 37928 29590 -6838
10440 -6838 19318 18551 -45209 -80462 -59303 6680 3558 11542 20426 10850 1546 -14796 -33849
10427 -33849 -77796 -108451 -108614 -51261 -36340 -8465 8122 2047 -62727 -24534 15272 20460
10415 20460 -3058 -7164 -59543 -77080 -79275 -60895 -65481 -94915 -8854 26407 5699 52155
10403 52155 -9313 -12141 -42257 -39406 -53199 -56814 -90160 -58034 -34357 -7418 -8520 29709
10391 29709 28182 -11077 -61896 -112383 -60250 13018 49833 10863 -99133 -148095 -91687 -40787
10379 -40787 -46578 -40422 -49405 -25752 -22938 -27054 -62974 -46841 34090 29542 -6884 20458 28236
10366 28236 -3845 15304 90725 147979 153590 112793 102483 112090 108352 106113 39791 74814
10354 74814 52699 -4482 -60895 -78738 -39255 -19604 -20862 16452 54943 52382 -18684 -36484
10342 -36484 -9623 51559 20635 -45858 -12076 8828 17808 8006 14017 -7090 -37436 -89
10330 -89 25476 47022 70553 32181 13049 22029 22479 -15198 -60848 -27202 -52892 -52638 -28889
10317 -28889 -31550 -29480 -36034 -69791 -67187 -40748 -44212 -49609 -94766 -93585 -63979 -10040 62606
10304 62606 54893 94796 112188 96562 63508 67620 59987 129435 168861 133794 138040 137718 120822
10291 120822 109576 109331 154036 172747 130322 87206 32427 -24545 12582 90627 89678 66091
10279 66091 -8359 6295 9927 -5364 3262 8658 26613 33487 33050 30640 -18717 -52950 -15722
10266 -15722 -4807 -35334 -26033 -20510 -31323 -31958 -64399 -61711 1836 60902 94104 70176 41309
10253 41309 18207 24271 58979 121878 126317 135372 86186 15328 24341 63265 19146 5253
10241 5253 3528 61475 78149 150021 195662 160952 91717 47385 76029 109637 109047 96988
10229 96988 74453 112829 132408 114407 65084 64901 157311 174696 171080 231854 361161 510697
10217 510697 753402 1043276 1276825 1432189 1595143 1864374 2061237 2012694 1817118 1628054
10207 1628054 1445988 1235389 945828 685555 515757 400411 290386 179782 160830 142791
10197 142791 104664 129909 185524 222847 177676 149615 161211 104033 33108 -34512 -29482 -11346
10185 -11346 21598 16703 7767 39462 97589 167013 169615 133319 118578 154881 152065 146493 139845
10172 139845 110190 97085 70229 89537 61949 58050 123037 96955 111928 108013 103024 75362
10160 75362 89579 86120 88460 8185 -29335 5934 59536 122396 73588 37483 66736 75063
10148 75063 90557 158714 130309 129657 99932 82899 58931 15465 51304 67129 82651 101968
10136 101968 47102 47141 9259 22309 35752 55656 100832 94638 44899 27828 16804 31604
10124 31604 -18914 35785 81227 107876 77747 72964 65492 49905 45348 52228 58104 65092 120462
10111 120462 175162 206285 170900 167928 147739 101973 69123 64072 95170 103970 109238 97095
10099 97095 43915 45660 44927 40314 55323 81229 87908 89928 66549 26047 10150 38913 47810
10086 47810 45636 37803 13703 6991 42759 95443 111045 62448 36351 37198 29457 33773 -11704
10073 -11704 -857 49137 35955 19232 17742 60636 78870 54178 13588 -1270 -22476 -16411
10061 -16411 -8651 12827 20928 48981 46704 -34533 -43264 -54148 -27543 -4583 18417 40167
10049 40167 29205 61589 93448 175223 286384 365526 385296 312664 231123 170214 145552
10038 145552 141402 172837 162105 134105 168016 177236 134273 113527 88573 112913 111152 98460
10026 98460 113747 103025 107102 90384 117212 119497 127136 150043 208764 254260 250819 265755
10014 265755 211258 142945 138833 170780 222568 212274 172683 178312 158401 158382 145236 123913
10002 123913 104108 118617 198561 267038 282552 285515 307493 313525 274871 237712 207631 243786
9990 243786 264875 270819 310089 344092 313846 301605 286968 278626 311622 333860 331668 316289
9978 316289 296375 299301 314108 306877 315033 351847 390198 397797 387878 404037 389872 332625 384347
9965 384347 447130 401756 391297 403886 390186 351334 382177 400567 437772 441185 474580 447958
9953 447958 354883 375040 418624 402040 348398 289542 316143 384313 427513 421522 423918 448542
9941 448542 437068 410844 425242 400951 404764 401073 392609 432875 417619 421414 406157 399009 414130
9928 414130 398274 418096 428801 434475 485394 413125 377811 381007 467204 503577 531427 560810
9916 560810 562346 573527 574310 587432 588409 585297 606598 578559 613572 617191 619673 622382 629655 610244
9902 610244 619322 642490 670261 697836 675767 649783 695678 700286 729793 745966 770739 773068
9890 773068 782776 787832 737120 658741 668692 776659 856512 835343 803961 813744 834200 867543
9878 867543 904154 943706 953052 930194 942447 957484 933919 988865 1057642 1061822 1076339 1037787
9866 1037787 1035135 1082623 1142221 1181894 1146324 1184093 1212662 1222494 1300762 1404226 1401301 1377056
9854 1377056 1437419 1483743 1471303 1488864 1474640 1464016 1472040 1452462 1550677 1693919 1742301
9843 1742301 1773395 1735832 1760835 1768848 1784150 1772337 1755364 1805457 1885023 1956067 1968818 2031099
9831 2031099 2079891 2118985 2134975 2141566 2187267 2180168 2200898 2266882 2333843 2421337 2556323 2619753
9819 2619753 2658094 2690928 2763085 2788666 2859038 2944543 3007607 3019148 3089811 3211344 3308050
9808 3308050 3389061 3441432 3484668 3596992 3649995 3778823 3877471 4033718 4159622 4266326
9798 4266326 4360197 4445201 4547091 4667324 4797072 4937809 5129273 5347891 5501538 5610824
9788 5610824 5823702 6018256 6226613 6433393 6623049 6847190 7052122 7267126 7519065 7747879
9778 7747879 8056531 8349541 8615068 8966022 9294966 9654371 10081211 10519335 10909233 11323956
9768 11323956 11741839 12221783 12733431 13255417 13792844 14478997 15158921 15820228 16512745
9759 16512745 17265759 18085695 18912575 19797819 20710127 21707806 22816095 23960188 25119374
9750 25119374 26432770 27783013 29195028 30672149 32331688 34141759 35954965 37808219
9742 37808219 39763520 41830499 44005491 46305703 48693499 51213112 53777502 56406013
9734 56406013 59060180 61657214 64340946 66969405 69412024 71776512 73984517 76012891
9726 76012891 77765862 79230616 80355052 81113798 81488747 81458376 81071356 80360124 79321790
9717 79321790 77985193 76334175 74438189 72366562 70157618 67801355 65318706 62790433
9709 62790433 60259556 57770841 55316699 52972759 50669773 48452974 46279317 44175455
9701 44175455 42169682 40274943 38424176 36712374 35117113 33657471 32193448 30772165
9693 30772165 29499286 28252733 27080383 25972987 24904658 23911213 22975081 22063465 21220868
9684 21220868 20392971 19660776 18930727 18225930 17573712 16970134 16396957 15811117 15250716
9675 15250716 14764455 14298606 13796834 13312684 12901812 12511205 12118582 11705680 11312540
9666 11312540 10951218 10638391 10293358 10009688 9736970 9470066 9241679 8970403 8639510
9657 8639510 8338314 8073316 7903683 7765174 7526014 7294750 7098819 6870184 6760203 6583473
9647 6583473 6438130 6354342 6187829 6031033 5837754 5647264 5500722 5344674 5213014 5111346
9637 5111346 5053503 4937614 4810421 4693236 4613948 4509029 4414869 4324050 4221463 4136061
9627 4136061 4044991 3928423 3858662 3802744 3691448 3577977 3521542 3489794 3431974 3369015 3350434
9616 3350434 3306479 3218697 3147717 3106376 3037674 2987986 2927641 2874293 2835711 2810713 2787827
9605 2787827 2759779 2754153 2715749 2616869 2535439 2513883 2474012 2419853 2370537 2299640 2283647 2251892
9593 2251892 2221086 2176103 2085833 2082665 2092663 2049719 2024211 2033965 2073483 2039558 1989150 1954218
9581 1954218 1901888 1882431 1861763 1822268 1787671 1796040 1804843 1796385 1799155 1777460 1807070 1757488
9569 1757488 1728377 1769410 1774192 1709424 1675627 1695300 1676763 1620540 1518725 1513671 1531123 1517067
9557 1517067 1566688 1543510 1510820 1511154 1480526 1470057 1481787 1491305 1449167 1424886 1424708 1434399 1433805
9544 1433805 1447112 1435823 1436663 1408671 1355574 1347951 1423897 1422409 1411232 1387658 1325408 1286993
9532 1286993 1336376 1343761 1331121 1338064 1317310 1336883 1392416 1421250 1389023 1382880 1387819 1339898
9520 1339898 1282947 1292674 1303889 1303762 1301034 1305378 1297719 1285148 1323788 1381950 1392516 1397097 1362160
9507 1362160 1317689 1242778 1299235 1331891 1291788 1276117 1316745 1342285 1339627 1358442 1381871 1426810
9495 1426810 1439848 1368707 1319340 1300723 1342104 1376745 1408641 1464161 1419949 1397816 1396252 1364383
9483 1364383 1381851 1420896 1431502 1449033 1417233 1370879 1392533 1407245 1404031 1426860 1442598 1434956
9471 1434956 1412001 1443928 1483952 1423644 1438164 1469011 1473732 1469215 1502746 1542876 1471592 1502858
9459 1502858 1582309 1589764 1605519 1587187 1609447 1672605 1657510 1641557 1648942 1659062 1632967 1582998
9447 1582998 1587884 1641768 1657640 1685879 1748169 1815349 1853168 1845533 1815911 1813514 1868898 1929401
9435 1929401 1952470 1933137 1924134 1979170 1984600 1981290 2033656 2086254 2080173 2094811 2126166 2147661
9423 2147661 2149100 2164897 2209949 2222470 2252939 2305459 2288576 2304725 2302614 2355394 2405295 2476085
9411 2476085 2508845 2537676 2551324 2593513 2617588 2654421 2732356 2773019 2794784 2814404 2808784 2886242
9399 2886242 2885467 2944926 3006903 3058315 3096670 3159948 3201416 3201201 3201439 3207072 3216433 3165444 3194206
9386 3194206 3189587 3186801 3208928 3291801 3303928 3283982 3303828 3337282 3324808 3343586 3432246 3408907
9374 3408907 3384901 3386749 3379702 3417517 3441530 3463886 3462079 3499085 3503761 3476530 3466672 3406120
9362 3406120 3356120 3295264 3243056 3254538 3279641 3244694 3161717 3139610 3133415 3085007 3062120 3057832
9350 3057832 3047323 3045413 2983413 2938337 2874277 2837374 2812748 2755794 2728586 2689520 2580777
9339 2580777 2521263 2478881 2447287 2444956 2455477 2432371 2396954 2320590 2254974 2211540 2134437 2071517
9327 2071517 2016142 1963883 1923883 1892089 1889688 1869805 1853118 1811329 1766459 1732474 1732306 1723404
9315 1723404 1671273 1612083 1555918 1524131 1521033 1469475 1461538 1442891 1379354 1350959 1317113 1312803
9303 1312803 1242801 1162388 1147687 1133863 1119200 1084981 1042744 1037831 1068259 1041619 1032708 1030209
9291 1030209 1029017 1016163 990491 930477 902799 894828 914527 915924 952654 919125 914010 942046
9279 942046 896531 935569 1051240 1040922 1023728 1065880 1096488 1033920 937444 837046 759053
9268 759053 718032 718917 729360 689901 698153 696990 659252 667164 679203 693538 721567 728348 720936
9255 720936 684672 695238 705755 684272 695661 670645 583051 579326 638116 649398 688102 691813
9243 691813 673948 708569 788328 933974 1081762 1142735 1161278 1069070 963433 852388 706511
9232 706511 647764 616970 549498 495572 454057 528103 537571 491609 464948 535318 536005 515474
9220 515474 512568 550277 577521 579020 578082 529110 424246 331234 321264 359844 367909 328365 312401
9207 312401 354373 373906 356480 335919 375475 455005 447367 440269 477578 468474 422313 408049
9195 408049 378314 374714 350844 304781 307817 356108 306646 254395 262601 294621 299508 275542
9183 275542 223279 116766 104013 108391 87083 157364 172631 165540 178851 179700 161559 143750
9171 143750 191631 157788 149391 171217 177725 177926 105616 151266 185836 221255 226448 323784 358496
9158 358496 338137 321095 256678 166871 97713 75742 88534 51599 58354 68286 116770 81397
9146 81397 46399 -17853 -74760 -38140 7780 34596 30925 52681 97597 50644 53973 67245
9134 67245 65231 26148 51552 70333 54089 73212 104379 112414 132521 154604 144872 98537
9122 98537 123084 184474 247041 257709 195001 128307 93485 54801 18389 29562 48328 29185
9110 29185 9881 4764 38506 37705 34824 57664 56491 34439 57773 27204 22253 43431 -16278
9097 -16278 -11994 37817 54907 27566 53040 63781 42872 25987 44186 134311 149121 151344
9085 151344 146538 148877 150922 144622 105858 44404 4676 5595 74907 64781 43203 17350 -11417
9072 -11417 40183 132177 94399 -949 -18157 -16739 15798 9989 19274 77411 119385 125381 55402
9059 55402 40041 48123 74648 112355 101333 64074 82047 74532 81977 65195 34626 21491
9047 21491 18998 25013 50414 102604 75627 31733 42210 52889 61672 5476 -17030 -21374 13755
9034 13755 69751 44096 44214 15971 14945 81669 73216 79457 88924 83948 125365 155714 143551
9021 143551 102617 46123 29256 77755 65097 -36013 -99066 -37760 -5610 -27449 9446
9010 9446 25663 52091 94842 114840 133865 172454 185123 147482 81757 79293 11396 -33610
8998 -33610 8495 51931 151490 168161 107088 54678 21436 -15430 -43606 -10034 -18108 -5561
8986 -5561 37637 52657 110697 107422 89095 73977 98662 101685 86576 42053 -14100 12054
8974 12054 29253 76882 77332 94761 84042 40028 60414 52748 30225 8255 -28203 -74618
8962 -74618 -65240 -65051 -15594 58380 83826 106294 73442 53805 87437 157737 204584 174541
8950 174541 158292 97981 37374 -5075 39108 116003 138981 125631 63308 6562 6432 58913
8938 58913 51866 12177 -13639 29188 97283 148196 160928 203268 206415 133821 161011 175221
8926 175221 141877 104832 67578 52069 -3609 7001 27388 67380 85706 100444 91104 109440
8914 109440 97305 142277 168280 167848 203102 256617 301948 256317 232001 243787 259220 299676
8902 299676 311207 350100 354030 398537 413455 436421 520404 547862 599387 709540 828363
8891 828363 986603 1109414 1203083 1346275 1587738 1989168 2606402 3530702 5053187 7563409
8881 7563409 11375833 15590820 17760991 16274202 12608697 9009076 6331724 4561842
8873 4561842 3417764 2635703 2091732 1721901 1469683 1319530 1211775 1089402 985181
8864 985181 856167 777419 734574 651514 565846 488116 465201 472928 431231 424508 501801 542915
8852 542915 638304 825555 999115 1158862 1264274 1274092 1094603 882402 683351 585790
8842 585790 489272 410617 383867 327524 275798 219150 179265 121888 128538 144622 111469 98197
8830 98197 86482 146883 271405 295096 215007 161205 133751 150302 152394 97362 55865 98523
8818 98523 105715 112212 100611 85493 89991 85824 77707 60343 70919 49328 18112 -18779 -20122
8805 -20122 18038 580 7373 -658 -1766 59371 112589 93633 77542 100383 52701 47414 80295
8792 80295 87036 46050 22645 1161 1951 4086 1347 3290 671 -32504 -16860 -23596 4302
8779 4302 25543 390 -10937 -15348 6189 31584 44383 97255 71020 56546 54542 -7730
8767 -7730 -24892 -32318 -53320 -53083 13581 17581 -17235 22954 18518 -36095 -74262 -48332 12369
8754 12369 -25764 -58436 403 38810 9415 -3660 75861 88007 78507 71876 44946 14534
8742 14534 19088 13022 5592 20446 21711 54658 27108 14583 56531 68802 50355 28050 36098
8729 36098 90321 83066 133230 202291 210194 169500 158128 180366 186658 163922 167275 207208 194942
8716 194942 105828 12832 -3380 18477 51778 42211 -37541 -27240 38575 86577 105112 81876
8704 81876 61014 110802 154055 131434 90433 71505 78103 91516 132637 147862 161023 145203
8692 145203 72210 45560 77731 61050 146015 215197 209092 222372 205560 122637 118039 119750
8680 119750 127186 111902 67575 52249 4726 167 951 -19326 -12595 1587 65904 135881 180614
8667 180614 221359 204993 198445 170688 200386 181209 153869 150891 139944 149376 132347 182670
8655 182670 194567 120116 180708 252042 268175 302734 303687 286712 287735 289970 276738 219076
8643 219076 204870 201753 197761 186394 193206 248925 291132 242251 168717 164428 134438 117290
8631 117290 164177 160561 198088 178658 161174 244370 298359 318839 332458 321856 362808 419957
8619 419957 473423 420486 361513 425759 420040 422778 423376 474820 551436 606470 623303 616767 683515
8606 683515 731499 753730 783876 827328 952851 1052231 1064252 1017130 979225 943521 870393
8595 870393 740139 676881 618096 515633 454372 452532 384492 329876 250786 205661 241182
8584 241182 251753 253630 250005 313888 294277 250390 221202 266590 329393 356727 368707 348256
8572 348256 376702 406959 340514 286486 281489 267626 257514 231247 294674 341520 318280 289068
8560 289068 303328 414084 480662 494596 485172 532967 594383 640091 710883 803095 952416
8549 952416 1211417 1583112 2099997 2992313 4367957 6054317 7389294 7517769 6413332
8540 6413332 4937605 3702271 2712352 2034570 1514823 1172359 962611 797893 718996
8531 718996 643127 626049 629166 563428 467922 424676 368728 334608 332602 304533 291231 264410
8519 264410 211339 155444 124788 171428 144923 115978 124068 129410 122955 140868 181618 188836
8507 188836 133823 121648 126118 137636 170111 175133 130168 195448 171885 150993 173885 166117
8495 166117 120591 122724 124207 163599 124044 123278 176827 129609 74302 61730 62376 90830 182949
8482 182949 223101 210098 200117 170732 175357 172012 90770 65595 63424 59266 52810 41047 -222
8469 -222 -23743 -16116 -809 32294 57603 76389 41108 -2814 331 1289 1149 8274 -15147 3661
8455 3661 14307 7514 34398 27239 5229 -4834 2218 68291 82325 102875 59828 12574 44543
8442 44543 57390 54063 61465 48633 35594 89151 100548 135988 122877 87073 81978 129233
8430 129233 79249 75992 89923 14658 -1715 -3593 -48800 -100989 13574 51874 54286 110691
8418 110691 190180 200671 133081 61902 62380 51561 56217 75719 69681 76310 1803 -8466 -30135
8405 -30135 -23394 -17400 -8516 -12208 -11756 7012 -26168 -100992 -92991 -52941 -30460 -3520 -5421
8392 -5421 -42739 -4691 -9472 -31956 18316 58170 57445 68858 41763 49429 65868 69434 80586
8379 80586 103269 86064 95635 64785 6593 -53281 -90387 -92773 -33692 -10268 -10385 -47690 -75960
8366 -75960 -59015 -8715 31100 44463 28281 6024 35337 22399 12192 46335 38897 30104
8354 30104 38659 63462 12982 -35553 3030 48498 25864 3870 6742 67682 1186 -39857
8342 -39857 -11028 -50815 -71753 -15726 8401 4689 11554 -29451 -32972 10311 -7475 -8917 -1476
8329 -1476 -8050 -32120 -42825 -51927 -16927 -22771 -57716 -66604 34430 54472 21552 22827 76474
8316 76474 61601 -9153 -42074 -61610 -42118 -30703 -61685 -58539 -27052 -4418 5442 3224
8304 3224 -1943 -10328 -71644 -46789 -32322 -82360 -80927 -17341 65645 41826 2903 69014 64199
8291 64199 40306 53226 88988 43911 -14493 -3761 -13863 -64845 -40058 -67913 -109415 -48072
8279 -48072 -18551 -35002 -31920 -43372 -44889 -50061 -24032 -48770 -65356 -23480 16331 47140
8267 47140 18027 30896 44263 46061 23498 25687 8704 -35955 -52138 -45172 -52307 -42010 -31114
8254 -31114 -22005 8461 -38458 -68403 -80464 -76434 -58436 -40050 -32569 -31224 24594 65566 65111
8241 65111 59720 105701 122849 103713 71523 57013 28135 27750 28143 -16232 -4495 -34070 -89819
8228 -89819 -46786 10542 31586 -15602 -40405 -6623 41186 52922 24158 6765 33133 29723
8216 29723 6108 -28578 -51311 -27659 17580 66500 58260 24757 13590 43833 57758 15638
8204 15638 -58014 -103253 -85795 -104471 -141742 -146237 -55140 11516 -5238 -51290 -50922 10842
8192 10842 36673 19587 -8575 -43750 -24486 -30146 -62096 -45437 -6157 -27282 16519 22478
8180 22478 39237 38056 -31638 -75097 -123374 -66263 -2746 35976 -31606 -52154 -55300 -18646
8168 -18646 -5922 -43587 -68412 -40476 39574 30890 -28934 -36854 63668 85719 91936 99049
8156 99049 28333 21416 47731 32979 -1666 29952 43666 52134 97905 150794 118422 59355
8144 59355 95201 114244 74606 56331 41587 26764 70538 119079 99925 124466 162112 186695
8132 186695 219063 181430 123521 64662 73611 109678 91540 105718 105052 87834 69801 48191
8120 48191 25933 34787 -4230 -16544 -14174 35577 29166 18572 10463 -36594 -41737 45388 70726
8107 70726 2037 14181 47218 67418 56823 75668 24325 -14041 16969 -47959 -39189 777
8095 777 5754 35246 15611 60132 44847 23626 36377 101574 88300 69988 84378 78141 29695
8082 29695 -8586 48781 27674 -12036 -29127 -2068 36245 77257 125378 135747 71473 48042
8070 48042 83658 53542 45219 47020 64962 6914 -46702 -39147 39739 98404 96684 72492 44694
8057 44694 8777 28064 60816 71028 80692 65250 57005 96760 136809 130809 120348 138953
8045 138953 117576 87248 77175 63137 102231 120147 122970 144166 160540 181696 160840 76293
8033 76293 63955 66941 108341 157041 188504 164845 124853 96761 66068 61307 91017 107343
8021 107343 146627 121827 92140 105049 121556 134234 146302 200488 245480 235125 226990 175899
8009 175899 145324 186922 204941 246124 224022 231380 243874 220030 208970 187484 145056 160637
7997 160637 203944 171671 129147 107936 111376 139657 169259 132582 92990 141877 160393 117901
7985 117901 139469 143371 161093 178608 117875 63582 72100 84880 108324 152917 182823 203289
7973 203289 251753 236179 209859 180302 154009 171358 165809 171808 194295 215629 260975 235015
7961 235015 209188 241133 237518 157447 131747 188431 262542 256932 152196 126346 140003 125546
7949 125546 99691 134802 152648 120144 112378 82009 126776 137447 164078 176077 92551 78774
7937 78774 125611 150122 111956 154373 141652 118121 118908 145560 177336 214731 205913 222740
7925 222740 252543 229112 210688 167524 140327 168878 191546 194682 177356 178950 195072 151100
7913 151100 89726 104631 139211 146103 122361 129209 114377 124988 183292 113866 86534 128583
7901 128583 112487 96856 30270 17486 36468 127519 133118 83669 52043 16433 20729 -11092
7889 -11092 6926 42854 -20442 -34497 -7445 14033 63848 124299 111062 78559 61935 54615
7877 54615 45929 32477 52902 61173 41845 58120 66873 53444 38463 -30315 -19522 12212
7865 12212 9506 14472 -12 59561 60660 61093 102118 94061 98181 80074 74121 50356 56987 38702
7851 38702 -20405 -43913 8153 65416 88596 13854 -4790 43752 92436 66684 32111 24602
7839 24602 4426 -56285 -90966 -67046 -35833 -323 35910 37300 31549 53921 87993 45531
7827 45531 -12832 -4993 -2729 1175 -43352 -39805 -34353 -11909 5246 -17316 -29128 -1948 -23852
7814 -23852 -17154 36918 31934 -14345 -24038 -13190 -35122 -40836 -5580 14725 40581 47653 96031
7801 96031 79306 47128 1350 -57855 -38365 -33241 -36693 3004 -1699 -42777 -52216 6770 39370
7788 39370 38899 17885 27166 12671 -3480 1071 -20546 -24665 -42005 -44765 -55692 -82610 -70907
7775 -70907 -62261 -63293 -62440 -49462 -44256 -69143 -84583 -51974 -94346 -78487 -28127 8479 -30363
7762 -30363 -84598 -75868 -35917 36034 -9346 -40982 -19330 -18299 -6234 1018 11643 -11788
7750 -11788 -39227 -91738 -86308 -59207 -21040 -27849 -58477 -101056 -49524 -26652 -59034 -80284
7738 -80284 -98795 -120213 -115558 -113218 -79865 -89286 -94799 -64410 -21094 -54064 -41922 -42800 -32704
7725 -32704 -34006 -37788 -56139 -53235 -83189 -48691 -11902 -33745 -39299 -27424 -48503 -37239 -42181
7712 -42181 -26872 -47017 -47129 -53467 -58400 -78037 -64465 -49764 -40408 -59767 -73157 -77442 -19970
7699 -19970 -10395 1971 33047 9064 -38748 -44774 -15297 -11000 -64471 -35136 -52589 11001
7687 11001 65843 33353 36211 63050 57507 46516 -23907 -55366 -27908 -11909 -24781 -4404
7675 -4404 -12824 -6063 -5633 1750 -6088 35309 52708 40771 2302 -15076 -61576 -102131 -42330
7662 -42330 -38903 -80481 -83819 -49174 -23186 -57904 6935 61427 -7469 -72320 -105407 -95520
7650 -95520 -65687 -40669 -45110 -30971 -30907 -32757 -54458 -96121 -110100 -123744 -36746 -2694 -28254
7637 -28254 -36929 -41128 -48880 -65377 -50319 -64070 -43909 -74182 -74364 -27322 -69993 -53789 -237
7624 -237 4941 53962 -17391 -51968 5461 40190 75849 72356 36611 -3085 9629 36232 -28031
7611 -28031 -44137 -64775 -55498 -47673 -61932 -81225 -57328 -49835 -26164 -13847 38876 30956 5957
7598 5957 -33895 -45895 -48526 21527 23836 -385 13777 37998 50963 57 -66766 -58779 -108104
7585 -108104 -137082 -93317 -72203 -92117 -95285 -24542 11161 -15504 -29717 -58188 -86370 -125550
7573 -125550 -86502 -80149 -104371 -129346 -76534 -13272 18357 -12473 -15910 -79006 -139961 -139172
7561 -139172 -103881 -64404 -46759 -38509 -19996 -12843 -9085 17844 -23218 -26434 -11353 -19467 -67081
7548 -67081 -110831 -50764 76192 44914 23561 20255 -52568 -38189 -7411 -12134 11586 50815
7536 50815 49433 32353 -42761 -75639 -71136 -91581 -70436 -87307 -62494 -34545 -5845 -27139
7524 -27139 -13192 -35630 -60420 -38550 -4954 22728 41634 -4797 -29557 -44501 -72537 -86451
7512 -86451 -84733 -64502 -91927 -97324 -79921 -65380 -37103 -19231 2376 -3895 -12357 -9746 2131
7499 2131 41262 35799 -32875 -91826 -90697 -102751 -66127 -34429 13802 70768 83102 123044
7487 123044 64897 11447 -6908 39472 42834 20117 -4062 -27125 -45433 456 -11259 -102416
7475 -102416 -140158 -92065 -35325 15428 1339 -30005 17022 -12767 -35957 -54428 -25059 -14812
7463 -14812 12490 4898 -91 -36718 -61326 -4460 14676 24608 -25713 -42823 -19685 -12900 -54562
7450 -54562 -89426 -104063 -121347 -96491 -8702 42468 46634 53314 9658 -28663 -82191 -37557
7438 -37557 -1299 12821 992 -3150 -63918 -99374 -82509 -41673 -82937 -63331 -58537 -17727
7426 -17727 58180 48119 62441 46117 14163 -9395 -25995 -85855 -45198 -3987 -23019 -31494
7414 -31494 -36460 -57151 -69100 -119342 -115183 -63710 -42656 -45370 -73290 -98363 -92340 7911
7402 7911 -2576 -64686 -78301 -102310 -80177 -51902 -37495 -49145 -55647 -58881 -78157 -107703
7390 -107703 -14799 56276 27146 18294 39720 74418 56725 19271 -46130 -3149 51168 100501
7378 100501 41965 -7907 -55389 -64142 -5880 -35561 -17520 55764 90166 84549 49404 -32519
7366 -32519 -41698 -43499 -38639 -23702 -17903 27923 21737 38904 85475 14080 10419 28458 15935
7353 15935 2599 7050 37715 42246 16555 -24049 -37420 -14000 -9258 -53786 -102008 -105264 -73491
7340 -73491 -27512 -25571 -59669 -132948 -140713 -136013 -136742 -119351 -81782 -113483 -157643 -110798 -77527
7327 -77527 -81836 -109091 -130425 -138183 -73389 -41630 -61910 -48767 -38549 -58255 -62201 6555
7315 6555 22272 18506 -12407 -31932 17470 48341 72443 84079 49197 -22375 -75827 -40066
7303 -40066 46365 10726 -26949 -39250 -41203 -40781 -30811 -42783 -1746 -66160 -40318 10183 590
7290 590 -56228 -82612 -59286 -48047 -47922 -24206 -38767 -73345 -46939 10069 -5940 -64305 -102065
7277 -102065 -39459 66080 79376 35698 -25135 -35349 -4270 -20443 -38415 -53072 -17770
7266 -17770 -52139 -81992 -77862 -45210 -93 25415 55328 -19158 -24731 20439 -3345 -65746
7254 -65746 -60329 -68774 -102580 -87316 -31161 5512 -14769 -34359 -87267 -69668 -43457 -46171
7242 -46171 -43714 -56201 -42014 -6721 13174 -2552 -10068 29296 38689 82536 65747 34260
7230 34260 -7930 -43109 -13839 -1516 -15077 -63332 -30670 -28762 -43225 -25204 -27339 -47177
7218 -47177 -94094 -100195 -57797 -17312 -25799 -32470 -11154 -14984 -44141 -24126 8935 11824 3209
7205 3209 -40701 -34392 -84390 -160258 -156793 -116338 9786 56864 31477 -7853 -11641 6947
7193 6947 38931 67475 -23957 -57407 -5835 -4474 -45695 -48572 -24864 8730 41168 30459
7181 30459 -41358 -58594 -22985 -53409 -44250 -24924 -27331 -20430 18987 39948 24712 45752
7169 45752 85262 94524 38495 -39726 -44635 -30312 -20874 -12934 -37536 -48073 -79967 -63706 -73929
7156 -73929 -32325 -14831 -18699 -27787 -18142 -16980 -36879 -48147 -72718 -117795 -62406 -42580 -36116
7143 -36116 -56482 -16725 5817 -18216 -31614 -58217 -22151 -1928 -17776 -63486 -48376 -35978
7131 -35978 -44408 -39785 -34569 -28687 6460 3456 -67193 -63295 -13588 -43215 -47368 -27005 9474
7118 9474 -9463 -38981 -79334 -73411 -48938 -84637 -139971 -59404 9221 20407 3643 30136
7106 30136 7945 -35998 -40372 -5291 23413 5366 -2773 14004 52062 32348 -3164 5044
7094 5044 27130 -20152 -21443 -24695 -78979 -119125 -156356 -144188 -168002 -144634 -82618 -43245
7082 -43245 -14593 1152 13544 69384 11972 -64707 -96773 -101762 -135614 -115550 -52357 -17967
7070 -17967 3034 -2508 19995 29741 11298 -32186 -86640 -84420 -75179 -60387 -36172 -33867 -57034
7057 -57034 -52905 -41016 2574 12103 19666 -8088 -21588 -24723 -10583 -30918 -9556 -11792 -34020
7044 -34020 -82132 -65221 27122 75444 64349 22458 -20401 -21978 32163 931 -47820 -60111
7032 -60111 -76630 -84235 -42668 -17217 -50743 -44904 -6956 -24273 -53037 -82884 -35338 -23662
7020 -23662 -114151 -166968 -140682 -140403 -123643 -116194 -77238 -79141 -138037 -97556 -25519 -50556 -51605
7007 -51605 -32652 -3087 19809 32184 25316 45482 15037 12593 3592 -18589 -42261 -27034
6995 -27034 -25382 -16913 -52226 -66227 -64566 -70160 -5427 40268 45545 38224 47617 43570 5752
6982 5752 -2462 -6709 44565 45865 65501 25802 35259 50274 66472 -15087 -92520 -65981 -48414
6969 -48414 -79925 -91149 -105346 -113289 -100536 -58795 -75514 -15019 36920 23986 -46443 -58623
6957 -58623 -70165 -34270 -81629 -81733 -99491 -104499 -101011 -84192 -81583 -88792 -84913 -76770 -75335 -97490
6943 -97490 -52292 8239 26339 -31709 -33338 1117 -13741 -32842 -66033 -39155 -33520 -2703
6931 -2703 32484 -23657 -13816 2778 -33826 -71290 -54520 22412 23141 27192 5099 -19655 -5954
6918 -5954 8637 -5288 -13689 14983 7869 -7549 -16943 -21915 -62989 -32890 23685 3374 -1364
6905 -1364 13295 -1599 -30250 -14202 -26321 -4668 57184 90580 75881 19105 -23383 -58928
6893 -58928 -31152 -6380 -24802 -51373 -74384 -108421 -112331 -88831 -32909 -16556 17821 5734
6881 5734 17776 59169 25274 -31562 -35034 -18134 34184 105602 95410 98700 114204 99348
6869 99348 54168 35066 95368 116717 98395 60135 57178 57580 39522 43310 36186 46242 11157
6856 11157 -29764 -23007 -3468 16992 -816 9421 35589 111459 46954 -24484 -40462 -13568
6844 -13568 -21267 -14211 4719 19449 31404 -6344 -105802 -83573 -5571 -44510 -137822 -120273
6832 -120273 -54634 -37497 -15691 38849 59993 67948 97915 48435 37380 92448 62684 72568
6820 72568 66756 36569 -26929 -14090 29679 40430 9714 -14902 -47233 -58977 -35195 -75307
6808 -75307 -85170 -34540 53264 70568 58705 73310 46723 71779 32628 12022 35074 -18032
6796 -18032 -63008 -33587 5129 17321 51626 35930 -14650 -43079 -47081 -38097 17301 44207
6784 44207 1859 -52263 -77031 -39852 -433 -18221 -36927 -12181 -8174 -4646 -46141 -54437
6772 -54437 2720 3271 4720 -265 -18291 -2386 9170 43502 96053 139027 151712 119317 108769
6759 108769 104909 57776 57410 174260 306251 432004 479715 507433 540960 547002 483301 375848
6747 375848 305915 288483 272144 255876 271424 310370 330218 430574 542504 659380 779477
6736 779477 914006 1145754 1515382 2055618 2773587 3787793 5369794 7649705 10100458
6727 10100458 11452700 10697113 8309371 5911467 4099971 2962184 2176783 1608789 1206541
6718 1206541 912166 767429 673344 561040 432429 398841 360679 370107 368274 334004 350249
6707 350249 342382 351461 335354 369497 414380 374140 298261 235981 182132 162517 163873 184321
6695 184321 135323 127439 114778 101518 103164 102261 135427 195814 211792 199740 131098 155821
6683 155821 137868 95917 50713 28708 39815 16118 -9446 374 22079 61789 61216 55081
6671 55081 77240 85866 95142 117025 96244 77295 32503 15736 47851 29954 38294 42962 34619
6658 34619 9429 55625 82810 -987 -76793 -77790 -63169 -96508 -70939 -45687 -18976 -21117
6646 -21117 -42839 -94803 -118176 -71913 -32377 -12238 -44998 -95688 -83166 -61764 -26414 15551
6634 15551 -7452 21365 -4764 -1410 35755 48620 64053 7891 24174 -28748 -47008 -59725
6622 -59725 -43224 8156 33392 20665 -37426 -4682 16378 44299 11389 -23872 -39662 -28255
6610 -28255 23820 36436 58285 50626 58229 31148 -3771 -19217 -56251 -83257 24 41772
6598 41772 19319 -25082 -73131 -88151 -72874 -81995 -41272 -19040 -34968 -79633 -84922 -32583
6586 -32583 -19324 -38427 -9882 6071 -15769 13905 14691 20398 -2088 -14338 -30635 14750
6574 14750 15732 16455 105695 147670 59530 -20224 -84858 -60833 -13685 35659 53975 -7374 -70077
6561 -70077 -78003 -67885 -119188 -117304 -135776 -57284 -78990 -88354 -26036 -40982 -62207 -65576 -84372
6548 -84372 -69674 -76782 -90233 -87755 -96608 -145132 -121764 -107620 -105601 -85404 -82857 -5861 42479
6535 42479 6845 26327 8165 18306 -4510 21074 35421 39516 47212 58431 20111 -46568
6523 -46568 -50294 -39052 -82270 -53143 -97508 -93848 -73816 -38826 -37729 -83984 -98608 -95504 -135573
6510 -135573 -113232 -9111 7324 -2547 -6994 -29140 -13991 -40946 -58430 -41040 -25305 -57040
6498 -57040 -68723 -156689 -188725 -111068 -66975 -67422 -53455 -9795 21298 2382 -30107 26458
6486 26458 20772 -22312 -82535 -113223 -78920 -37274 -14900 -24196 -7269 27782 30984 -30373
6474 -30373 -60076 -75334 -53680 15057 79631 136379 106233 9501 20442 -1846 -87603 -88720
6462 -88720 29683 86818 19310 -49392 -61023 -49009 -4607 -17074 -9524 33941 65756 34363
6450 34363 7808 21277 28535 29398 23802 8634 -54316 -57783 -44982 -19592 -4386 33282 17014
6437 17014 -11786 -23384 -794 33522 37020 -1737 19491 90759 41893 9244 -18419 53145
6425 53145 85535 46501 -12218 -36213 -22346 -28089 -353 3600 -69486 -124095 -92973 -88301
6413 -88301 -48231 -46825 -71852 -71994 -33949 16963 7953 -1072 -4690 -35497 -53442 -6079 25801
6400 25801 -3523 -24735 -2480 32547 31710 32054 64117 86765 32077 -17930 -68054 -151914 -158684
6387 -158684 -60272 31817 30898 -40735 -60908 -91661 -110292 -71976 -32852 -4455 -1057 3438
6375 3438 4754 -3269 -23818 -74660 -19120 -15410 -20928 -101676 -79206 -22638 -15931 59 -14097
6362 -14097 -15151 -8788 -39853 -48921 32135 93979 93884 32534 18868 11135 848 8272 54451
6349 54451 -738 -79880 -54435 -16993 1234 -34471 -85680 -78054 -47482 -9336 23837 61910
6337 61910 70584 64183 46966 60584 32125 588 14140 42011 61983 71436 7598 76607
6325 76607 144059 137344 65449 -30130 -10787 3120 37494 22504 39955 9725 -14460 23289
6313 23289 45018 48977 88253 84255 61574 45872 18738 34860 84389 48025 27134 33891
6301 33891 71170 83160 12373 16520 17723 -26415 -64535 -116263 -129747 -140762 -89798 -105059
6289 -105059 -88501 -58643 -53268 -18206 12720 30136 -17401 -41453 -37161 -4652 12337 -26029
6277 -26029 -6555 -10787 -38693 -42664 -61890 -98779 -42543 22554 -22725 -41987 -9939 15688
6265 15688 -25087 -86254 -103741 -65376 -49861 -14129 35627 56087 18435 -25145 8479 -22326
6253 -22326 -64904 -77291 -64404 -97633 -144416 -147102 -102455 -57927 15820 16028 6802 -11510 -10779
6240 -10779 56415 61901 60663 37217 -53394 -49875 -45486 -66056 -46885 -95604 -121893 -81117 -64290
6227 -64290 -87378 -111802 -124168 -119508 -77227 -38387 -20301 33219 64051 -8677 -14908 14683
6215 14683 12976 31486 66886 46664 -570 -24578 -23247 -10471 -21681 -160 -11491 -54989
6203 -54989 -80294 -59847 -11438 -46138 -15375 16409 6529 1941 10081 9262 -19980 -44668 -67652
6190 -67652 -116924 -103841 -37071 -29441 -63917 -87140 -33857 -11639 -14043 -36881 -65720 -30233
6178 -30233 -6321 48086 33056 36556 55773 45171 -3692 -23637 -29498 -9954 -14826 -21045 12092
6165 12092 14222 27640 63526 71389 49951 11015 24393 44967 65668 35889 -21537 -98425
6153 -98425 -129069 -83016 -67 44130 9943 -35056 -33253 -26459 9788 5929 9339 3264 50691
6140 50691 -648 -35837 -27639 25987 8657 10278 43580 58515 56138 42455 44365 -1492 -13436
6127 -13436 -8383 -32768 -69207 -33111 -1668 -17249 -14818 16972 -8349 -20767 -35856 39344
6115 39344 33246 -29322 -44085 -67057 -63754 16303 77906 67083 15048 13757 690 47352
6103 47352 19734 51278 76993 39921 -8036 -54805 -77427 -47279 8524 3193 -21857 -58127
6091 -58127 -60147 -14881 -24363 -11909 2883 -36912 -37551 -3912 17693 -2115 -67271 -48910 -54252
6078 -54252 -91610 -87335 -19966 -16083 -46158 -61238 -41946 -33310 -21495 24447 -30056 -57749
6066 -57749 -64123 -132388 -137935 -57214 -53892 -56887 -52789 -93513 -145772 -103322 -33046 -30191 7462
6053 7462 71326 79573 73066 23220 -19104 -61742 -66585 -47940 -28405 38117 84158 82709 37021
6040 37021 13608 14044 12635 45651 49019 -28014 472 31046 24114 6928 -38372 -58284 -30558
6027 -30558 -42631 -79716 -77408 -39913 -50841 -88572 -91418 -47465 4639 -2966 -83141 -61357
6015 -61357 -10089 19908 21450 64074 74461 -5634 -39288 -15003 1984 -16049 -53568 -76163
6003 -76163 -60272 -90214 -46222 -32481 -9437 9364 48169 74697 8961 9583 22495 -45355
5991 -45355 -16259 18200 -5055 3467 -1165 5819 -6696 -6937 -25728 -49247 -10488 -13837 -19683
5978 -19683 -11144 -16394 -16918 16161 18490 2692 -9378 -9354 -17465 -24509 -20349 -18759 15054 -7089
5964 -7089 -92126 -88486 -28233 28305 -10921 -1743 37377 43926 -90545 -88349 -45528 -41154 -32659
5951 -32659 -21303 -27502 7298 -4576 18753 58100 27571 27225 21318 -52639 -56966 -17288 19050
5938 19050 18414 2227 -33732 -68440 -74072 -22403 -25174 -75880 -82341 -14818 17375 3465 -36664
5925 -36664 -15956 45732 64691 47792 -40477 -69592 -111212 -66416 13876 21935 -19405 -46620
5913 -46620 -66973 -71101 -54788 -24665 47055 52391 23826 -23075 -64917 -81088 -66763 -39504
5901 -39504 -4672 -2608 -16617 -12773 -3184 18131 -20427 -46523 -36594 17680 -12713 4684 29294
5888 29294 41050 44711 35453 3313 36078 16939 20489 4310 24730 73889 57604 13376
5876 13376 5357 -28370 -39415 -3652 6718 -47003 -57348 -80092 -60128 -3403 -13405 -119751
5864 -119751 -132231 -138982 -121325 -89521 -58940 -43559 -30603 -3773 19876 -27027 -29731 20162
5852 20162 33623 34362 9978 13941 1188 -36288 -38238 -33237 -1129 -25245 -38032 -17083 -34945
5839 -34945 -92485 -41557 9600 28537 91459 102876 65413 36221 37445 46323 62282 44449
5827 44449 28189 11113 32793 -42620 -113838 -34588 -27972 -31242 -43980 -38210 64512 111515
5815 111515 47318 72566 106782 30327 9688 26632 11257 12028 33395 68400 102230 54730
5803 54730 18665 52576 60200 50280 37552 983 -62203 -64683 -32333 14482 46416 21582
5791 21582 3180 -17563 114 -8251 -3562 -23770 -27823 -25697 -41626 -49140 -39388 29896 48501
5778 48501 35430 64236 33216 46983 56700 71403 25418 -9549 -7253 -11408 -33995 -47998
5766 -47998 -67694 -80282 -32392 21596 24240 13360 -35668 -50788 -14805 -487 46080 49662
5754 49662 52718 120161 157844 119746 57864 36841 5613 7720 40241 47730 41924 44564 26930
5741 26930 52480 100273 61413 15240 467 -54237 -91133 -56992 -8928 -24133 -18634 5107
5729 5107 -27670 13207 58675 64180 28331 26564 32517 25226 -1175 -43158 -42892 4845 17145
5716 17145 37791 95968 36175 -3435 4528 7632 396 2878 -11766 -46702 -42473 -60528 -62919
5703 -62919 -26515 -50992 -88940 -85230 -70868 -75297 -61680 -33859 38829 51450 -9978 -15881
5691 -15881 -12389 -19413 -6709 8777 34130 29142 -33009 -58946 -60101 -75116 -92640 -108243 -73798
5678 -73798 -23235 35494 23619 626 -67086 -78990 -29113 34386 74576 52478 55893 705
5666 705 -16677 -9488 -5848 -86749 -119905 -99373 -77166 -83225 -82319 -46023 -44624 -59349 -25652
5653 -25652 4812 17270 64079 104954 63870 8062 7319 -11149 -18637 -37302 21403 4430
5641 4430 -48037 -23995 -12260 -3251 26724 36209 46721 -22186 -34125 -28512 -7912 -23732 -25844
5628 -25844 13323 18793 75858 58782 -26839 -116475 -95157 -81165 -81231 -64898 -41403 -68271 -88445
5615 -88445 -40114 -13763 -23751 -10798 69127 91415 13425 -3520 -1810 -61663 -131095 -122656
5603 -122656 -87225 -65105 6450 33033 24826 5082 -8374 -38814 -30402 -197 27645 2410
5591 2410 12835 17763 38382 19321 -73795 -97721 -68779 -90669 -98349 -92041 -40409 -51299 -59949
5578 -59949 -72226 -81308 -74044 -58292 -50525 -54640 -87972 -52365 -48750 -2249 41431 43801 36487
5565 36487 -19872 -84387 -69647 -60818 -90803 -121060 -75269 -56646 -52804 -29327 37420 35019
5553 35019 19531 -19279 -8589 28246 56195 67001 2531 -21974 -49889 -24015 10007 4913
5541 4913 -22079 1694 27519 21933 43507 -5289 -16778 -35658 -40076 -83381 -54031 -5046
5529 -5046 41014 56708 35385 44161 88745 54433 33284 46112 -9332 -42943 -14552 -43077
5517 -43077 -47641 -52718 -70346 -97506 -94059 -102991 -55253 -61793 -88543 -89137 -64649 -64515 -108969 -131950
5503 -131950 -152577 -79109 4084 29914 -14028 -49390 -63685 -46120 -29627 -74827 -65882 -36706
5491 -36706 -79556 -77627 -47850 -26874 -12317 -27692 -68761 -70557 -14834 9858 10744 34393 44069
5478 44069 -35652 -10272 44534 63725 47903 15066 10055 -73683 -117299 -111495 -84196 -31176
5466 -31176 777 44915 -16046 -29084 11481 -20527 -59353 -21848 -19005 20152 -5949 -96586
5454 -96586 -97368 -91340 -27397 -1876 -48284 -69939 -68970 -31790 28335 17083 13631 5023 30077
5441 30077 8103 -11890 -19048 6232 34650 61151 55609 29431 1241 4601 20223 22586 -9143
5428 -9143 -90402 -84256 -68432 -89753 -104619 -95480 -38099 41369 40776 57640 75099 40440 17907
5415 17907 7620 36381 72368 79196 54813 -2302 18907 -11012 13336 -13012 32285 97130
5403 97130 72632 64413 32088 -5750 33379 139225 181878 156899 119198 42277 2236 -8133
5391 -8133 -19408 -8005 -74002 -80010 -60541 -37799 -42696 -39248 -3203 -14142 -10475 -10149 -43925
5378 -43925 -52284 -7235 -33748 -39669 -11571 -19317 -4321 61921 58240 2585 -20424 -2729 -6165
5365 -6165 6195 32243 40886 -6536 -56536 -66326 -21481 -6759 -34477 -82739 -32352 23753
5353 23753 45447 17522 36965 37034 15160 -12621 -27306 -31643 1624 7798 31100 68618 98525
5340 98525 46109 9716 42659 7068 -6832 -38759 -15207 3065 22192 37728 -42286 -83238
5328 -83238 -42514 23648 52363 65169 47993 -6934 -10064 -26460 -17412 29002 21312 -54990
5316 -54990 -99016 -88990 -9912 16099 -29454 -26859 -13082 31994 -9771 -57044 -35528 17423
5304 17423 29211 15112 15096 1227 -22981 13553 -17466 -91233 -119282 -76318 -4693 91 -44405
5291 -44405 -66165 -90649 -113177 -111357 -41980 4872 -12364 4649 14894 49539 46171 54347
5279 54347 -2561 -12236 23491 844 4816 18365 -31819 -18305 23001 61328 88951 42133
5267 42133 -71298 -108634 -76655 -78866 -73995 -35564 -41096 -27895 -38096 17230 776 -1413
5255 -1413 8697 -22969 -59092 -12289 -31949 -34573 11662 91818 135961 84910 8356 -71064
5243 -71064 -92858 -64511 -11897 50478 36360 -21357 -47821 -59303 -51917 -7131 22227 28736
5231 28736 33252 -23483 -73081 -54283 18465 29243 -15705 -48960 -76758 -92572 -58416 -47961
5219 -47961 -52905 -43600 -49302 -56120 -8774 -2636 -29171 -22751 -60819 -137860 -85606 -36734 -22793
5206 -22793 -65975 -40259 -77104 -29754 -30693 -46953 -13863 36819 47626 19823 -39279 -57891
5194 -57891 -84592 -117755 -92514 -42498 9739 -6901 -23768 34717 33302 4561 -22938 -4841
5182 -4841 -5386 -51000 -26416 -28340 -11682 -9763 -9174 23056 86881 57776 6174 -12301 -4298
5169 -4298 8724 -6575 -24676 -1879 -30257 -52951 -12509 -23802 -87251 -81425 -58034 20238
5157 20238 43172 -5457 -26736 3300 57431 89563 43512 24954 -7313 -24648 -39907 -22127
5145 -22127 -16848 -7767 -7830 1244 -45549 -53566 -14961 20799 25767 33558 8761 -5082 -11320 44133
5131 44133 101996 84866 54372 59635 45119 16622 33338 52960 47099 36154 43475 42348 30198
5118 30198 30527 46656 41948 40227 17774 -1024 16916 31821 61646 69495 34417 21275 16447
5105 16447 23168 31000 38120 12129 -36346 -54044 -67251 -130334 -87426 -67702 -115387 -107164 -29439
5092 -29439 -1260 27136 83340 66844 -9072 -74962 -67998 4764 22152 -48028 -45221 -18210
5080 -18210 -5159 35612 55585 18008 -34732 -23551 -46607 -51295 11636 48045 32255 61813
5068 61813 50636 31690 1232 43809 57876 71298 31742 -22773 19061 28075 -38765 -39958
5056 -39958 -16325 -36979 -24326 -9123 -29716 -6397 -23001 -76094 -89895 -91742 -84482 -78766
5044 -78766 -2645 23122 -59406 -85619 -11516 20812 82540 75964 5437 -14537 -42565 -51791
5032 -51791 -43452 -22125 18726 34821 5550 60815 48846 -18184 -27614 -12215 9720 79360
5020 79360 23187 -53621 -109651 -59631 8984 6269 -8389 -25109 -31135 2303 18843 30778
5008 30778 21665 12120 10236 15804 -10476 -25299 -54032 -53073 -33292 -6579 60265 54917 22370
4995 22370 -17171 1074 -6994 -8314 -24900 -15944 -20114 -35120 -57939 -46132 -25802 -5512 -46179
4982 -46179 -111424 -95201 -38801 -34540 -23296 -961 -25736 -29631 -51459 -84154 -72868 -30465
4970 -30465 -12170 -26114 -21600 65 21435 22619 -18920 -6236 21736 57835 39533 -28348
4958 -28348 -56624 -72963 -5772 -13625 -56213 -37161 -32186 -86273 -18218 9614 11393 7588 -21237
4945 -21237 -11632 -28747 -83550 -88116 -86254 -47150 -64339 -92860 -106270 -111833 -58149 -8544 -20148
4932 -20148 34155 70750 65136 49535 66967 29514 -19615 12955 18839 6137 5277 -24453 2255
4919 2255 7057 -34479 -7868 -16271 -19008 -6563 -34107 -71697 -22021 1866 186 -13144 -50443
4906 -50443 -30844 -37381 -69108 -8374 -41291 -52671 -2895 7229 -44358 -75079 -68660 -51453
4894 -51453 -97602 -55350 -28577 -24579 -17441 -16689 -14081 -6802 -21974 -21367 -3257 -21090 -9793
4881 -9793 -31585 -36515 -31972 -2924 10852 -13000 -22576 -16764 -24097 -5599 328 9000 -10038
4868 -10038 24820 -5806 -20486 -48327 -73297 -88856 -46341 -16639 19669 -6447 -50985 -94152
4856 -94152 -47362 -11767 -53287 -97915 -76076 -18135 12691 38413 86208 100889 114605 112471
4844 112471 76839 94490 47942 11486 -87215 -81407 -5276 11603 -24185 -98270 -86996 -24915
4832 -24915 -1794 1361 31854 22590 -13115 -49877 -43015 55008 119264 90694 41886 62492
4820 62492 70451 37755 -6222 1120 28217 743 26660 79177 88391 96900 104910 54154 29423
4807 29423 -34217 -62413 -39588 -48939 -54671 -98768 -96868 -73379 -8898 18457 39223 4784
4795 4784 -41860 -50107 -13413 27561 558 -41706 -70890 -55305 -23570 -38340 -65871 -55032
4783 -55032 -57209 -7742 21880 4787 32040 33020 19981 45008 56767 -37802 -66590 -37353
4771 -37353 -16633 10954 10817 49680 66896 14356 -1901 55004 40220 31901 17942 -9101
4759 -9101 -7839 -39295 -8560 14306 51013 89467 53525 20145 44465 67805 54114 -30013
4747 -30013 -63175 -77747 -110847 -126641 -88388 -55982 18861 88551 92485 -25354 -90229 -72856
4735 -72856 -6909 12107 64240 59817 -17769 -44857 7385 21077 -5406 -61436 -88482 -59340
4723 -59340 -61910 -30081 -4607 -19611 -9671 29430 96431 89731 31964 3501 6309 -19677 -66342
4710 -66342 -24261 9453 54052 91699 78498 51753 65943 53681 15835 50425 101821 51269
4698 51269 -12413 -15122 2280 57410 86495 74857 49155 42952 -823 -26595 -5741 -8974
4686 -8974 -34147 -10660 3369 28813 6278 -18771 13411 19052 12039 -2915 -6646 29733 82933
4673 82933 119004 94730 63334 32338 33029 32627 55349 95916 41526 -11124 -44694 -2123 47112
4660 47112 45354 34993 65030 67493 77307 93723 75418 8243 -40953 -23977 -25879 -31896 -17321
4647 -17321 -38499 -66586 -46499 -59849 -46119 -19269 8553 -3665 -29205 -45333 -15019 -7031
4635 -7031 -9366 1992 -42893 -72157 -18946 -22944 25946 84373 61169 13234 -15179 -3475
4623 -3475 67787 73253 -2829 -1845 12431 14358 -11436 -12279 -45286 -38460 -13187 15995 -17157
4610 -17157 -26318 -145 -2506 -31929 -77545 -51388 -5789 39360 12858 39462 27759 54321
4598 54321 46124 56163 70498 90277 90361 56149 26303 43985 -7084 -77747 -124402 -118512 -64916
4585 -64916 25826 15963 6660 17662 -3105 -13537 -42856 -27516 -15285 -7238 39361 87256
4573 87256 69690 868 -32635 -56016 -49582 -22215 -27020 -29924 2524 41997 68378 51997
4561 51997 -9880 -31245 -35062 -11619 -27147 -20675 -44912 -82908 -50652 -14115 -10147 -1775 41947
4548 41947 16354 -71349 -96957 -95480 -42301 -56725 -29382 -41405 -1445 73296 63356 91334
4536 91334 41460 -24366 -64878 -1524 -15190 -29030 -69985 -30014 -84591 -112678 -109697 -94687
4524 -94687 -17436 928 38551 45027 -3069 -29583 31820 -10799 -53961 -57949 -7308 71588
4512 71588 71507 77745 52133 24427 16061 22707 26629 29874 -35099 -45133 -14747 38967 41852 -20009
4498 -20009 -24009 -37878 -61357 -54329 -30879 -34330 -4423 9347 4122 -7860 9892 -13258 -24021
4485 -24021 -50697 -60453 -61438 -45032 -6586 24442 63930 -516 -39417 -70961 -33977 16828
4473 16828 36804 60023 58114 33425 -21320 -47925 -45705 -15683 12087 19061 -2408 -4225 30577
4460 30577 45466 28233 40673 58276 27318 69034 103786 75001 63239 49464 38712 11016
4448 11016 -31273 -48546 -21798 -8102 -12861 -6414 13986 18392 13212 27755 62228 -19809 -60075
4435 -60075 -54265 -52839 -11674 32502 35002 22862 -2489 28853 24891 69373 83680 69552 42953
4422 42953 34202 29963 15193 -22476 -7985 24471 -21334 -32998 -1114 -16043 9284 430
4410 430 20418 22680 60092 82728 68562 72883 102625 100379 53305 8537 -30823 -19070 17836
4397 17836 6938 -10491 -3250 9538 20862 36565 64246 44950 38898 -411 -1448 48009
4385 48009 81086 53710 52203 40495 -15929 -19039 -20835 11718 2979 -8183 -24843 -164 2252
4372 2252 50121 15904 37588 72348 63960 61184 -8824 -21139 6986 48234 60587 21424
4360 21424 24360 91471 86937 80279 19928 -25301 -56539 -39258 -10361 -40123 -45198 25064 -7385
4347 -7385 -671 29376 91737 102079 120396 41363 -5786 -48548 -19312 8634 -14646 -44656
4335 -44656 -47196 7361 37572 -2420 -31677 -6485 29269 39835 -5598 -9923 -8766 -16320 -51447
4322 -51447 -10185 12731 24379 -2842 -68112 -40045 -18187 -25069 -42431 -14594 4795 -18397
4310 -18397 -30306 -1348 61447 87704 85635 57092 -34029 -66137 -52596 -36949 -97157 -106057
4298 -106057 -70047 -72743 -1766 -42538 -54422 -16872 -12452 -10182 12357 2154 13421 -16359
4286 -16359 -77611 -42430 -54084 -93451 6594 66577 47035 68869 119804 136652 116565 75091
$$ [...]
##END NTUPLES=NMR SPECTRUM
##END=
