##TITLE=Analysis number 312176
Compound Code cc 34046
Book Reference 416/200
Project Code qc-cat
Chemist Name stevenp
##JCAMPDX= 6.0         $$ Bruker NMR JCAMP-DX V2.0
##DATA TYPE= NMR SPECTRUM
##DATA CLASS= NTUPLES
##ORIGIN= Bruker BioSpin GmbH
##OWNER= NMR
$$ XWIN-NMR		Version 3.5
$$ Wed Jul 27 09:37:55 2005 GMT Daylight Time (UT+1h)  MAYBRIDGE\NMR@NMR_250MHZ
##.OBSERVE FREQUENCY= 250.131544655141
##.OBSERVE NUCLEUS= ^1H
##.ACQUISITION MODE= SIMULTANEOUS (DQD)
##.ACQUISITION SCHEME= undefined
##.AVERAGES= 16
##.DIGITISER RES= 18
##SPECTROMETER/DATA SYSTEM= dpx250
##.PULSE SEQUENCE= zg30
##.SOLVENT NAME= CDCl3
##.SHIFT REFERENCE= (INTERNAL, CDCl3, 0, 16.522)
##AUDIT TRAIL= $$ (NUMBER, WHEN, WHO, WHERE, WHAT)
$$ ##TITLE= Audit trail, XWIN-NMR		Version 3.5
$$ ##JCAMPDX= 5.01
$$ ##ORIGIN= Bruker BioSpin GmbH
$$ ##OWNER= NMR
$$ C:\u/data/dgb/nmr/ADRS/6680/pdata/1/auditp.txt
$$ ##AUDIT TRAIL=  $$ (NUMBER, WHEN, WHO, WHERE, WHAT)
(   1,<2005-07-27 09:37:26.91 +100>,<MAYBRIDGE\NMR>,<NMR_250MHZ>,
      <created by zg, POWCHK disabled, PULCHK disabled
       configuration hash MD5:
       62 19 C7 07 E1 42 D1 B7 37 6C 3D D0 77 39 F9 E6
       data hash MD5: 64K
       AA 15 92 24 B7 05 D5 ED A7 1F 6E F3 AC 83 DE 8D>)
(   2,<2005-07-27 09:37:43.54 +100>,<MAYBRIDGE\NMR>,<NMR_250MHZ>,
      <Start of raw data processing
       ef LB = 0.3 FT_mod = 6 PKNL = 1 SI = 32K 
       data hash MD5: 32K
       45 C5 71 04 AA A5 F7 57 67 37 7B E8 26 FC 02 F5>)
(   3,<2005-07-27 09:37:45.39 +100>,<MAYBRIDGE\NMR>,<NMR_250MHZ>,
      <apk 
       data hash MD5: 32K
       E3 99 DA CF A1 00 9D E6 61 20 54 FE 89 23 71 55>)
(   4,<2005-07-27 09:37:46.24 +100>,<MAYBRIDGE\NMR>,<NMR_250MHZ>,
      <abs ABSG = 5 
       data hash MD5: 32K
       D6 A4 C3 FC AF 5E 27 E9 0A 78 D6 D5 38 14 00 9B>)
$$ ##END=
$$ 
$$ hash MD5
$$ E3 6E 05 F0 82 E2 6A 5D AE 11 DC 9D A5 D7 52 69
##$RELAX= 
##$RELAX= 
##$RELAX= 
##$RELAX= 
##$RELAX= 
##$RELAX= 
##$RELAX= 
$$ Bruker specific parameters
$$ --------------------------
##$DU= <C:\u>
##$EXPNO= 6680
##$NAME= <ADRS>
##$PROCNO= 1
##$TYPE= <nmr>
##$USER= <dgb>
##$AMP= (0..31)
100 100 100 100 100 100 100 100 100 100 100 100 100 100 100 100 100 100 
100 100 100 100 100 100 100 100 100 100 100 100 100 100 
##$AQSEQ= 0
##$AQ_mod= 3
##$AUNM= <au_zg>
##$AUTOPOS= <3 >
##$BF1= 250.13
##$BF2= 250.13
##$BF3= 250.13
##$BF4= 250.13
##$BF5= 500.13
##$BF6= 500.13
##$BF7= 500.13
##$BF8= 500.13
##$BYTORDA= 1
##$CFDGTYP= 0
##$CFRGTYP= 5
##$CHEMSTR= <none>
##$CNST= (0..31)
1 1 145 1 1 1 1 1 1 1 1 1 1 1 1 1 1 1 1 1 1 1 1 1 1 1 1 1 1 1 1 1 
##$CPDPRG= <>
##$CPDPRG1= <>
##$CPDPRG2= <>
##$CPDPRG3= <>
##$CPDPRG4= <mlev>
##$CPDPRG5= <mlev>
##$CPDPRG6= <mlev>
##$CPDPRG7= <mlev>
##$CPDPRG8= <mlev>
##$CPDPRGB= <>
##$CPDPRGT= <>
##$D= (0..31)
0 1 0 0 0 0 0 0 0 0.06 0 0 0 0 0 0 0.0002 0 0 0 0 0 0 0 0 0 0 0 0 0 0 
0 
##$DATE= 1122453445
##$DBL= (0..7)
120 120 120 120 120 120 120 120 
##$DBP= (0..7)
150 150 150 150 150 150 150 150 
##$DBP07= 0
##$DBPNAM0= <>
##$DBPNAM1= <>
$$ [...]
##$SUBNAM7= <"">
##$SUBNAM8= <"">
##$SUBNAM9= <"">
##$SW= 20.6930455092707
##$SWIBOX= (0..15)
0 0 3 0 0 0 0 0 0 0 0 0 0 0 0 0 
##$SW_h= 5175.983436853
##$TD= 65536
##$TD0= 1
##$TE= 294.16
##$TE2= 300
##$TE3= 300
##$TEG= 300
##$TL= (0..7)
0 120 120 120 120 120 120 120 
##$TP= (0..7)
150 150 150 150 150 150 150 150 
##$TP07= 0
##$TPNAME0= <>
##$TPNAME1= <>
##$TPNAME2= <>
##$TPNAME3= <>
##$TPNAME4= <>
##$TPNAME5= <>
##$TPNAME6= <>
##$TPNAME7= <>
##$TPOAL= (0..7)
0.5 0.5 0.5 0.5 0.5 0.5 0.5 0.5 
##$TPOFFS= (0..7)
0 0 0 0 0 0 0 0 
##$TUNHIN= 0
##$TUNHOUT= 0
##$TUNXOUT= 0
##$USERA1= <user>
##$USERA2= <user>
##$USERA3= <user>
##$USERA4= <user>
##$USERA5= <user>
##$V9= 5
##$VALIST= <valist>
##$VCLIST= <CCCCCCCCCCCCCCC>
##$VD= 0
##$VDLIST= <DDDDDDDDDDDDDDD>
##$VPLIST= <PPPPPPPPPPPPPPP>
##$VTLIST= <TTTTTTTTTTTTTTT>
##$WBST= 1024
##$WBSW= 4
##$XGAIN= (0..3)
0 0 0 0 
##$XL= 0
##$YL= 0
##$YMAX_a= 315289
##$YMIN_a= -542153
##$ZGOPTNS= <>
##$ZL1= 120
##$ZL2= 120
##$ZL3= 120
##$ZL4= 120
##$ABSF1= 16.522
##$ABSF2= -4.171173
##$ABSG= 5
##$ABSL= 3
##$ALPHA= 0
##$AQORDER= 0
##$ASSFAC= 0
##$ASSFACI= 0
##$ASSFACX= 0
##$ASSWID= 0
##$AUNMP= <proc_1d>
##$AZFE= 0.1
##$AZFW= 0.1
##$BCFW= 0
##$BC_mod= 0
##$BYTORDP= 0
##$COROFFS= 0
##$CY= 12.5
##$DATMOD= 1
##$DC= 0
##$DFILT= <>
##$DTYPP= 0
##$F1P= 14.0000005364418
##$F2P= -0.99999901652339
##$FCOR= 0.5
##$FTSIZE= 32768
##$FT_mod= 6
##$GAMMA= 0
##$GB= 0
##$INTBC= 1
##$INTSCL= 1
##$ISEN= 128
##$LB= 0.3
##$LEV0= 0
##$LPBIN= 0
##$MAXI= 10000
##$MC2= 0
##$MEAN= 0
##$ME_mod= 0
##$MI= 0
##$NCOEF= 0
##$NC_proc= -4
##$NLEV= 6
##$NOISF1= 0
##$NOISF2= 0
##$NSP= 0
##$NTH_PI= 0
##$NZP= 0
##$OFFSET= 16.522
##$PC= 1
##$PHC0= -77.89552
##$PHC1= 6.340754
##$PH_mod= 1
##$PKNL= yes
##$PPARMOD= 0
##$PSCAL= 4
##$PSIGN= 0
##$REVERSE= no
##$SF= 250.13
##$SI= 32768
##$SIGF1= 0
##$SIGF2= 0
##$SINO= 400
##$SIOLD= 32768
##$SREGLST= <1H.CDCl3>
##$SSB= 0
##$STSI= 32768
##$STSR= 0
##$SW_p= 5175.98343685301
##$SYMM= 0
##$S_DEV= 0
##$TDeff= 65536
##$TDoff= 0
##$TI= <Analysis number 999999
Compound Code 99
Book Reference 9
Project Code 9>
##$TILT= no
##$TM1= 0
##$TM2= 0
##$TOPLEV= 0
##$USERP1= <user>
##$USERP2= <user>
##$USERP3= <user>
##$USERP4= <user>
##$USERP5= <user>
##$WDW= 1
##$XDIM= 32768
##$YMAX_p= 509586615
##$YMIN_p= -122591
$$ End of Bruker specific parameters
$$ ---------------------------------
##NTUPLES= NMR SPECTRUM
##VAR_NAME=  FREQUENCY,     SPECTRUM/REAL,   SPECTRUM/IMAG
##SYMBOL=    X,             R,               I
##VAR_TYPE=  INDEPENDENT,   DEPENDENT,       DEPENDENT
##VAR_FORM=  AFFN,          ASDF,            ASDF
##VAR_DIM=   32768,         32768,           32768
##UNITS=     HZ,            ARBITRARY UNITS, ARBITRARY UNITS
##FACTOR=    0.157963299565203, 1,           1
##FIRST=     4132.6476996994, 0,             0
##LAST=      -1043.33573715361, 0,           0
##MIN=       -1043.33573715361, -122591,     0
##MAX=       4132.6476996994, 509586615,     0
$$ Real data points
##PAGE= N=1
##DATA TABLE= (X++(R..R)), XYDATA
$$ [...]
16298A0970K745L038j4866l0130j2443K2808J9146O197K1226k5636l2035q99K385
16285b7494M092K5891L6794r506j9835q146k3125k1195K363J5456J8063R044O167
16272H569j2102j4271o204p643L4175L2876n365j2123P596M267j4707j6205J9774
16259A8637l392N075J3891k0144q780L009k9116k5882j0665k991K4148K5293J5487
16246D570j5467j9061J5434P406p321J2675k247m843k8377k563K2739N523j380
16233a2912L661J665j3801k0953K0342k155J8377J6916J8167j9394k7271k0069
16221c7427K695J9808K3998O294j2015j3934J4362N663R40q429o361J8108j1765
16208A937j0581K0262O53M089j7164o429Q911p984j3598P567L1781R121o314q471
$$ plain form
16298 10970 13715 16753 1887 -28243 -40686 -17878 1268 7465 28691 3055 -28980 -29879 -27494
16285 -27494 -23402 2489 39283 29777 9942 1796 -21329 -42524 -40161 -24705 -6642 2402 8569
16272 8569 -3533 -17804 -24008 -31651 2524 35400 30035 17912 25508 29775 15068 -1137 18637
16259 18637 15245 20320 34211 14067 5287 8296 -20820 -46702 -57367 -60358 -36210 -10917 4570
16246 4570 -10897 -29958 -14524 -7118 -14439 -1764 -4011 -8854 -37231 -39794 -17055 -11532 -12912
16233 -12912 -9251 -7586 -21387 -42340 -21998 -24153 -5776 11140 29307 9913 -17358 -37427
16221 -37427 -34732 -14924 9074 15368 3353 -10581 3781 9444 10384 1955 -4406 13702 1937
16208 1937 -8644 11618 12271 16360 -804 -7233 1678 -6306 -19904 -12337 19444 28565 22251 13780
16194A3780l535k548J3442M335k4270k7608J7181L6056j7574j7710j6448J2403
16182a2496j1007p498L067J1889J6782l320l551Q275J1961K3535l0050n1917j338
16169d5668K3578K2862J3912O511J4122q60J2047j4950j1090m065J5911J010j0008
16156B3312N599p198k2368l3554J4598K8727K3057j2675j9525k3839l4370L93
16144e7843J536J3115J3592R182r130J0757m294m971J8678K8746o34l42n484Q198
16130B1106k207j2353j9350L310N734p494k3826R716N566k2053P004J4217m179
16117b4809P793J7580k868J2610n699j044J9025J0976N819q868k0331j6592j7835
16104b4243M988j0974J2164l1188o867K685J5078k468J8157L819J9401J6829L07
$$ plain form
16194 13780 10245 7697 21139 25474 1204 -26404 -9223 26833 9259 -8451 -24899 -12496
16182 -12496 -23503 -31001 -27934 -16045 737 -2583 -6134 2141 14102 37637 7587 -44330 -45668
16169 -45668 -22090 772 14684 21195 35317 34457 46504 31554 20464 16399 32310 33320 23312
16156 23312 28911 21713 -655 -34209 -19611 9116 32173 19498 -27 -23866 -58236 -57843
16144 -57843 -56307 -43192 -29600 -20418 -29548 -18791 -23085 -28056 -9378 19368 18734 18392 12908 21106
16130 21106 18899 6546 -12804 -9494 -3760 -11254 -35080 -25364 -19798 -41851 -34847 -20630 -24809
16117 -24809 -17016 564 -2304 10306 4607 3563 22588 33564 39383 30515 10184 -6408 -24243
16104 -24243 -19255 -30229 -18065 -49253 -56120 -53435 -38357 -40825 -22668 -18849 552 17381 17688
16091A7688K2965J454j7152l0206o445J9594q321q938K345m41j3193n026J0085
16078a5591J8005n951k1188J8325J7001j5678K265j95J4511o957j8146m299K4422
16065F524J156o49J752q817n391J5667N638j5077J69P150j2555q622K289P918
16051b848O710P401K806O045N871K043j4738j5350L532L622K094R827K0177J2783
16037D9975j7320k3772m615l6389j8219n720J7785l770K0931K5802K0220K832
16025B7740j6620l4744L4022M2642l1344k4104q641j0178J0517J7200j3367j5050
16013b1927Q456M617J6254J1587J3961j0517J6204K4755l4848j3609l9244J2447
16001a1864n040j6425J2647l283k967L423l017K0717K6778K0542l451k0348j5727
$$ plain form
16091 17688 40653 42107 24955 -5251 -11696 7898 -423 -9361 -7016 -7457 -20650 -25676 -15591
16078 -15591 2414 -3537 -24725 -6400 10601 -5077 -2812 -3007 11504 4547 -13599 -17898 6524
16065 6524 7680 7031 8783 -34 -5425 10242 15880 803 972 8122 -4433 -13055 -10766 -2848
16051 -2848 3862 11263 14069 20114 25985 28028 13290 -2060 1472 5094 7188 17015 37192 49975
16037 49975 32655 8883 4268 -32121 -50340 -56060 -38275 -42045 -21114 4688 24908 27740
16025 27740 11120 -23624 10398 53040 21696 -2408 -11049 -21227 -10710 6490 -6877 -21927
16013 -21927 -13471 -8854 7400 18987 32948 22431 38635 63390 28542 14933 -24311 -11864
16001 -11864 -16904 -33329 -20682 -23965 -26932 -23509 -26526 -5809 20969 41511 38060 17712 1985
15988A985J4690l4076j1061L1646J2819Q049j464q232j9360j8630K0444K8033
15976B4843j8326m3467q429J8323O461j743R430M301o890k768k1249J0315J3497
15963a5702K2897J3664l4999l5259J486J6899K6096K0497o323k4175J4141m143
15951d921m7233l370L7100K0914Q828R847O610k0151k4827L446J0872J253L539
15938A907o513k0762m982J3896M677l328K1421L4269j6710j4403O727J0906j2425
15925A4680j2240K1573K2415l963l358p350j7975j8516O83N734j5904m0872j3508
15912f8601K6645K1913K3319K4985k379L056j7129j3085N245J7161N449j8816
15900G763n973n953k3738J3471O445j3951m395l223O472j3873K1355l385R64J6250
$$ plain form
15988 1985 16675 -17401 -28462 3184 16003 24052 22588 14356 -5004 -23634 -3190 24843
15976 24843 6517 -36950 -45379 -27056 -20595 -22338 -12908 -8607 -15497 -18265 -39514 -29199 -15702
15963 -15702 7195 20859 -14140 -49399 -47913 -31014 -4918 15579 9256 -14919 -778 -4921
15951 -4921 -52154 -55524 -18424 2490 11318 21165 27775 7624 -17203 -13757 -2885 -1632 1907
15938 1907 -4606 -25368 -30350 -16454 -11777 -15105 6316 40585 23875 9472 16199 27105 14680
15925 14680 2440 24013 46428 42465 39107 31757 13782 -4734 -4051 1683 -14221 -55093 -68601
15912 -68601 -41956 -20043 3276 28261 25882 28938 11809 -1276 3969 21130 26579 7763
15900 7763 1790 -4163 -27901 -14430 -7985 -21936 -26331 -29554 -23082 -36955 -15600 -18985 -18021 -1771
15886a771J771q453m787J6546L728j3015J901n722l247j5684k4247J2267J5755
15873b4958J4202R030j5343l370k918L1780K7894j1357k9487j4514p853q86L232
15860b4548k655J3577j3060J104L1782K6658M824J4481n547M256j298j1936l1894
15847E744k6789o587K4243K5039O60j8101j8873M888J8572k063P15L672N544r429
15833G235O927q690r648K5790k0839m4313J5320P887k4167K3480K4101m956o275
15820h148J440j0882j765l589J3112n543l6249n284K8137L3404k2662m097O838
15807a5288O032P709K2003K9327r677j3373j4277Q629Q646j3644j2705J0722p572
15794F532q586J0218J8867n067m1104j4144J9697k0029k4425p430N96O077K295
$$ plain form
15886 -1771 0 -8453 -13240 3306 7034 -5981 -4080 -9802 -13049 -28733 -52980 -40713 -24958
15873 -24958 -10756 -1726 -17069 -20439 -23357 8423 36317 24960 -4527 -19041 -26894 -27780 -24548
15860 -24548 -27203 -13626 -26686 -25582 6200 32858 37682 52163 46616 50872 49574 37638 5744
15847 5744 -21045 -27632 -3389 21650 22310 4209 -14664 -9776 8796 6733 7448 11120 16664 7235
15833 7235 14162 5472 -4176 21614 775 -43538 -28218 -20331 -44498 -21018 3083 -1873 -8148
15820 -8148 -6708 -17590 -19355 -22944 -9832 -15375 -51624 -56908 -28771 4633 -18029 -22126 -15288
15807 -15288 -9256 -1547 20456 49783 40106 26733 12456 21085 29731 16087 3382 14104 6532
15794 6532 -2054 8164 27031 21964 -19140 -33284 -13587 -33616 -58041 -65471 -64875 -58798 -56503
15781e6503N071p779M07J3016J5964K8473K9843j0953j3453k344j4211j7134L905
15768b5698L3943K1924L134j9868R566l290j0110K652p143k0138k2330k2119j719
15755f1196K6804K7935N504Q533j1848j5697J01J6065l985k6149j2357K4821K700
15742a8769J6514J7867M50P781N328R454r105j2161J7183j3855k4067j2093R446
15729f027J97K266Q435k1468l2643L7489K5088k1541j3811K97J9869O972j4360
15716i237q797Q30J6278O971K0827J3673j9082l2676n98M78j0468J6522P565N127
15702G413j1827k3550j117N314l0092l565M9357K0003m917n628m953j1225j3259
15689b8046p945k0825J5380O240J9312J9506j0381J7295J7491J4113k5788k1057
$$ plain form
15781 -56503 -51432 -59211 -58804 -45788 -29824 -1351 28492 17539 4086 1742 -12469 -29603 -25698
15768 -25698 8245 30169 33303 13435 23001 19711 9601 12253 5110 -15028 -37358 -59477 -61196
15755 -61196 -34392 -6457 -953 7580 -4268 -19965 -19864 -3799 -7784 -33933 -46290 -21469 -18769
15742 -18769 -2255 15612 16062 23843 29171 38625 29520 17359 34542 20687 -3380 -15473 -6027
15729 -6027 -5830 -3564 4871 -16597 -49240 -11751 13337 -8204 -22015 -21718 -1849 5123 -9237
15716 -9237 -18034 -17204 -926 6045 26872 40545 21463 -11213 -11811 -11333 -21801 -5279 2286 7413
15702 7413 -4414 -27964 -29081 -23767 -53859 -57424 -8067 11936 7019 1391 -3562 -14787 -28046
15689 -28046 -35991 -56816 -41436 -35196 -15884 3622 -6759 10536 28027 42140 16352 -4705
15677d705J5903l3177m485R614J8314j8944o779K5674J6297r170j7235k5369K7053
15664g009K5594L1795L88k5852L459p723j6411k2578p400J2918K7884J846L601
15651B0512L54R420J1116j544Q262j161q669k8443L967p384j2818J1745K2426
15638B7783K5980k9544k6501P730J586m0760j0246L1657J8971r918j914q197M18
15625a2955q276R188k513J2457K9312k6180k6353K572P840k6518K1335R670k3024
15612c3445J3171P833J4902P888j3486j4149l120K1509r182J306J7786j592p683
15599A738m883P221J1503l2790k0754N123R813M746k821o90N682K303j9788l158
15585c6755L9125J9924k1267J4203K52Q05R618j6520p199L102O648L198n957Q555
$$ plain form
15677 -4705 11198 -21979 -26464 -16850 1464 -17480 -24259 1415 17712 8542 -8693 -34062 -7009
15664 -7009 18585 50380 50768 24916 28375 20652 4241 -18337 -25737 -12819 15065 16911 20512
15651 20512 20866 30286 41402 39858 48120 46959 38290 9847 13814 6430 -6388 5357 27783
15638 27783 53763 24219 -2282 5448 7034 -33726 -43972 -12315 6656 -3262 -5176 -13373 -12955
15625 -12955 -21231 -12043 -14556 -2099 27213 1033 -25320 -22748 -14908 -41426 -20091 -10421 -33445
15612 -33445 -20274 -12441 2461 10349 -3137 -17286 -20406 1103 -8079 -6773 11013 9421 1738
15599 1738 -3145 4076 15579 -17211 -37965 -32842 -23029 -18283 -21104 -21794 -16112 -13809 -33597 -36755
15585 -36755 2370 22294 1027 15230 15482 16287 25905 9385 2186 5288 11936 15134 9177 17732
15571A7732p333J853J0793k2334k8713j0036k2570N456P461m331p912K7402N1999
15558A9467J6719l186j8016k5957J6937n719j8081K2780r49k7706j011k710q789
15545c6221r273L313J3976M778K0286j135k3912l622o545q068r437J834J1516
15532d2510k825J2415K0603q337J6163N467J3483J0030j991q737j8530M238K1196
15519B0665k7804p107J0101R540O018j1294j8117J2671J0632k3305J6504P425
15507E929j5925N345J4513r332K892J8405J6801P651j4188k6520j1521j3055j3100
15494c2105M334P13J9428j3630Q68J8158M4043n81j3372j8272l905r957p570k049
15480a3897k4038L3209r394p855L564J16K3260o1R072L0440l3785j4862l859r940
$$ plain form
15571 17732 10399 12252 23045 711 -28002 -38038 -60608 -55152 -47691 -52022 -59934 -32532 19467
15558 19467 36186 33000 14984 -10973 5964 245 -17836 4944 3995 -23711 -24722 -27432 -36221
15545 -36221 -45494 -42181 -28205 -23427 -3141 -4276 -28188 -31810 -38355 -46423 -55860 -54026 -42510
15532 -42510 -45335 -32920 -12317 -20654 -4491 976 14459 24489 22498 13761 -4769 -531 20665
15519 20665 -7139 -14246 -4145 5395 11413 119 -17998 -5327 5305 -18000 -1496 5929
15507 5929 -9996 -4651 9862 530 3422 21827 38628 46279 32091 5571 -5950 -19005 -32105
15494 -32105 -27771 -27058 -7630 -21260 -20392 -2234 41809 41228 27856 9584 5679 -4278 -11848 -13897
15480 -13897 -37935 -4726 -14120 -21975 -18411 -18295 4965 4904 13976 44416 10631 -4231 -8090 -18030
15466a8030M4119n530l5278k0703j486k4718k4553L668K8941J9294L4870J7818
15454A8412k4023k4335k0296K065L5795J7716j1411j4686N016j9425J3111J9987
15442b074l9174q747M620J5355N070Q633Q76L1706J7783n951j9767k393l934j9158
15428a7155J34N970K1010n131n478L830M472O728o16J8985J4923k539j0631j1242
15414B3260j3068m0076K2740n631o498P775K8213m385K0610p24q414l4594j2714
15401b3506K0933j3822j4264M441p141O441j0102O078M3628J0247J5802j4047
15389B4688l0984K1357K758j443j5735k722K5570K6737o732k7323l700J7975j6464
15376A3982k0700K319K9394q848k7604M921o382j5625O885k6077O094K2761J3373
$$ plain form
15466 -18030 26089 20559 -14719 -35422 -36908 -61626 -86179 -82511 -53570 -34276 594 18412
15454 18412 -5611 -29946 -50242 -48177 -12382 5334 -6077 -20763 -15747 -35172 -22061 -2074
15442 -2074 -41248 -49995 -45375 -30020 -24950 -16317 -15441 16265 34048 28097 8330 5937 2003 -17155
15428 -17155 -17021 -11051 9959 4828 -650 3180 7652 14380 13764 32749 47672 45133 34502 23260
15414 23260 10192 -29884 -7144 -12775 -19273 -11498 16715 12330 32940 32216 23802 -10792 -23506
15401 -23506 -2573 -16395 -30659 -26218 -33359 -26918 -37020 -30942 12686 22933 38735 24688
15389 24688 -6296 15061 17819 16376 641 -2081 23489 50226 43494 16171 12471 30446 13982
15376 13982 -6718 -4399 24995 16147 -11457 -6536 -12918 -28543 -21658 -47735 -41641 -18880 -5507
15363e507Q841J5848K5994k0632j7117p061j5005l1465R743L0256l665j490N260
15350f000k0350k8902j4439J543J5964K1524O011K3279Q605k6722j1934L4960
15338C539J2398J7513j0580j3859j049R593J5379l0547q199K4947J970o213j2386
15325B506q488j5869Q939j2469k1969K6J1749K477r242P518k268M698P433J4990
15311i969p300p891p529J9703K7201J0803O434R33j6426j7267J0558J3180k5273
15298b843k772n531p591j5357L003J0924K3671K1779N941n301k0747j0168J0040
15285E048m473k068J434o662p320N141J5103o756Q345k0970j5641q922L1494j1968
15271a8215n358J4821J4828K0154J3908j0113k2642l3223l964j786P232L9909
$$ plain form
15363 -5507 3334 19182 45176 24544 7427 366 -14639 -46104 -36361 -6105 -9770 -11260 -6000
15350 -6000 -26350 -55252 -69691 -68148 -52184 -30660 -24649 -1370 7235 -19487 -31421 3539
15338 3539 15937 33450 22870 9011 7962 17555 32934 2387 -5812 19135 21105 14892 2506
15325 2506 -5982 -21851 -12912 -25381 -47350 -47324 -35575 -33098 -42340 -34822 -37090 -32392 -24959 -9969
15311 -9969 -17269 -25160 -32689 -12986 14215 25018 31452 32385 15959 -1308 9250 22430 -2843
15298 -2843 -5615 -11146 -18737 -34094 -31091 -20167 3504 25283 31224 25923 5176 -4992 5048
15285 5048 575 -1493 -59 -6721 -14041 -8900 6203 -553 7792 -13178 -28819 -37741 -6247 -18215
15271 -18215 -23573 -8752 6076 26230 40138 30025 7383 -25840 -29804 -31590 -24358 15551
15259A5551K3412j8406k5573j0584P79J2903l679l2923J2244M522n687k770j6017
15246d6228j0493N611K319J8093O592N713j7261J5625j3430K133K8680K5558K2018
15233D4930l3188k5059J9725J4934o334K4330Q017m2323l2897m434J7076J7593
15221B370J6885L89j3534M1272K1352k9535l6574p10o30K800k6384N04K7057J6045
15207B1307j4526j1191k978J1283J4391k6820j7813L4397q545N894M114L07k6300
15194a6480K0590L2567k8733k5920J6800j290j4444Q071q268L721k247r255j467
15181b6355M1578k594q800M37p824k1230k0036L7682O579j312J5329K1249J0932
15168D5635j7521k4392j3492m649J7112j16J1747J1562K11Q161J7041k1806j7001
$$ plain form
15259 15551 38963 20557 -5016 -15600 -14821 -1918 -5597 -38520 -26276 -21754 -27441 -30211 -46228
15246 -46228 -56721 -51110 -48791 -30698 -24106 -18393 -35654 -20029 -33459 -31326 -2646 22912 44930
15233 44930 11742 -13317 6408 21342 15008 39338 47355 5032 -27865 -32299 -15223 2370
15221 2370 19255 19644 6110 47382 68734 39199 2625 1915 1285 4085 -22299 -21795 5262 21307
15207 21307 6781 -4410 -7388 3895 18286 -8534 -26347 8050 -495 5399 9513 9820 -16480
15194 -16480 4110 36677 7944 -17976 -1176 -2466 -16910 -8839 -17107 -13386 -15633 -24888 -26355
15181 -26355 15223 12629 3829 4266 -3558 -24788 -44824 -7142 -563 -1875 13454 34703 45635
15168 45635 28114 3722 -9770 -14419 2693 2577 14324 25886 26097 34258 51299 29493 12492
15155A2492j4971l4739n623k910M0K0706M2807J6712l2854m7471n474J3836O86
15142c6763j5674P696L7934J1736m109j7709r967j1115j3209M563K8053P841N418
15129e305j15k1576J1958O771J6430m159j3878p516k376l293j1129k4182m195
15116f2565J1620P345J5635K5257J3886k2J1505J1628J928j6783j6213k1125J7715
15103a89q825J5769j5411j2477J8416M410r844l6765m56K4219p854k6515J4670
15090d0852L3119j560J574J1198n455l7716K0186J5520K532r674L993m512J1764
15077A17j930k2423J334j6156p78j2582J1567j28k208M27K1679J2992R631m803
15063c261j1315j9770j2349K056J2985J1056j2720r8Q281M003j8205J8081L4746
$$ plain form
15155 12492 -2479 -37218 -42841 -45751 -45711 -25005 17802 34514 1660 -45811 -51285 -37449 -36763
15142 -36763 -52437 -44741 -6807 4929 820 -16889 -26856 -37971 -51180 -46617 -18564 -10723 -5305
15129 -5305 -5420 -26996 -15038 -8267 8163 4004 -9874 -17390 -19766 -23059 -34188 -58370 -62565
15116 -62565 -50945 -43600 -27965 -2708 11178 11156 22661 34289 36217 19434 3221 -17904 -189
15103 -189 -9014 6755 -8656 -21133 -2717 1693 -8151 -44916 -45372 -21153 -29007 -55522 -40852
15090 -40852 -7733 -9293 -7719 3479 -1976 -39692 -19506 -3986 -1454 -11128 -7135 -11647 117
15077 117 -1813 -24236 -22902 -39058 -39836 -52418 -40851 -40979 -43187 -42760 -21081 -8089 1542 -3261
15063 -3261 -14576 -34346 -46695 -44639 -31654 -20598 -33318 -33416 -25135 -21132 -39337 -21256 13490
15050A3490Q006K46j8924l810J2080R54k8410p458j4459J900K3176M516K605j1709
15036a7797P105L186K9247J0489k5861j0221J8233R518o663O869k3517j8841r656
15023b7909J168j280K749J1575K6135J1308P99k9778K6501l050k0770k204O1p8
15009d773m517O807m849j2244k5111J3489K5777j9224k995N755n893J4441J2707
14996f30j0591m7549N062L9851j2334j5445l444J8689J2397O530j497k613o499
14983a8073L061K5065J4832k6879Q7M512o955J188J4259r106l2747j5478L454
14970d2780L5560l110J0444R258j0307j1760m42q408K724J1591J9178K2197J971
14957C6116l410j0581k7901k0462K494J767n828o339p357L0433J4280L278j6355
$$ plain form
15050 13490 21496 21742 2818 -992 11088 12042 -16368 -23826 -38285 -36385 -13209 -8693 -6088 -17797
15036 -17797 -10692 -7506 21741 32230 6369 -3852 14381 23899 17236 24105 588 -18253 -27909
15023 -27909 -26741 -28021 -25272 -13697 12438 23746 24545 -5233 21268 18218 -2552 -4756 -4695 -4773
15009 -4773 -9290 -2483 -7332 -19576 -44687 -31198 -5421 -24645 -27640 -21885 -27778 -13337 -630
14996 -630 -11221 -58770 -53708 -13857 -26191 -41636 -45080 -26391 -13994 -7464 -8961 -11574 -18073
14983 -18073 -15012 10053 24885 -1994 -1907 2605 -4350 -3162 11097 1991 -30756 -46234 -42780
14970 -42780 -7220 -10330 114 9372 -935 -12695 -13137 -21545 -18821 -7230 11948 34145 36116
14957 36116 32706 22125 -5776 -26238 -23744 -21977 -27805 -34144 -41501 -11068 3212 6490 -9865
14944i865l5431N112K4378Q233n511j3865Q212j7959j3188L2367J38l3033J7205
14931c3207J0832J2506k5352N497Q343J268K0210l782j2866L382J0784K8413J2721
14918C8749k9099R573m050j257J1924L562Q074j8279p934j2004k7764q370K315
14905c4560O706J1321l897J3983Q276o289P685J0972O42r24l4038j6476K0011
14892a6588L0508J1333m740p287n261k1566j2259K0087K2019j3543j8991J28K2052
14879E892K2596L2328j9326l1772j1796m948o974K0805Q315k1661P129K8421J9068
14866D8077J309l7197l8976J7066L350k6022j3530J7346L4219j0782j2981k041
14854b0162P765j1R155J0789L596n835l830J1605j3558j7033J4055K2784j8996
$$ plain form
14944 -9865 -45296 -40184 -15806 -7573 -13084 -26949 -18737 -36696 -49884 -17517 -17379 -50412 -33207
14931 -33207 -22375 -9869 -35221 -29724 -21381 -20113 97 -3685 -16551 -13169 -2385 26028 38749
14918 38749 9650 19223 15173 13916 25840 29402 37476 19197 11263 -741 -28505 -36875 -34560
14905 -34560 -27854 -16533 -20430 -6447 1829 -4460 3225 14197 14839 13915 -20123 -36599 -16588
14892 -16588 13920 25253 20513 13226 7965 -13601 -25860 -5773 16246 2703 -16288 -16160 5892
14879 5892 28488 60816 41490 9718 -2078 -7026 -14000 6805 15120 -6541 588 29009 48077
14866 48077 49386 12189 -26787 -9721 -6371 -32393 -45923 -28577 5642 -5140 -18121 -20162
14854 -20162 -12397 -12408 -3253 7536 11132 5297 1467 13072 -486 -17519 -3464 19320 324
14841C24j9837j836J5272o568o76q529j5456q059J3324O684q930j4716j1496L4801
14827b5698N205J5314k741N03L7929j2436k2223j287m315n71R880j5426p112L275
14813a9703K3051J5009j8762j9749J3965j1256k0391j0400K2042R963J9195K4761
14801B7725j684j1508k4955k3021J5854K9391J8727r53q039j6447J981M814P232
14788A9117R367k494m450j971J6864r789k743j7853n140R873J1834J5339m201
14775C3753k6427l198K635j1329j4869p100K4371K5011J8256J4898j4208k3524
14763A8269J4535q778j1083q884l2030j203J3053j3576P477q100K376j7514P184
14750c8274K4396K1024N288l791j7094j918j642p638j271J5086K363K2266k9314
$$ plain form
14841 324 -19513 -21349 -6077 -12645 -13321 -21850 -37306 -45365 -32041 -25357 -34287 -49003 -60499 -25698
14827 -25698 -20493 -5179 -7920 -7417 30512 18076 -4147 -5434 -9749 -10320 -440 -15866 -22978 -19703
14813 -19703 3348 18357 -405 -20154 -6189 -17445 -37836 -48236 -26194 -16231 2964 27725
14801 27725 26041 14533 -10422 -33443 -17589 11802 30529 29576 21537 5090 7071 11885 19117
14788 19117 28484 25990 21540 19569 36433 26644 23901 6048 908 10781 22615 37954 33753
14775 33753 7326 4128 6763 -4566 -19435 -26535 -2164 22847 41103 56001 41793 18269
14763 18269 32804 24026 12943 4059 -27971 -29174 -16121 -29697 -22220 -30320 -27944 -45458 -38274
14750 -38274 -13878 7146 12434 8643 -8451 -10369 -12011 -19649 -20920 -5834 -3471 18795 -10519
14737a0519n681n59L540J6203O039q491K45r513k4511J35J1228M033P252K692
14723g907K4757O600k4743R874J8026k7019j5106K0498K9937j2509J5307k45R06
14710C8376q588j7201j8398p861j0142m1313J1724K8177j7450r39J3509q966j6847
14697e5919K4238K3334n477J9580k4553n601J1705K673J1090k048j0483J5656
14685D195K9365m798j2213N175k5655O536J0158n019Q984l6845k1981K8833J19
14672a3146k2221K5040r890j4760R357K3763j4468m125K309j7539O710K165j156
14659b7961p854J6681J632k5360O583K3206n747R883M36R997j5941M605l49L894
14645f295P50J3404P690K5539p827k1707k3900l692J8954L446j3507j3117j4621
$$ plain form
14737 -10519 -16200 -16759 -13219 2984 9023 532 777 -8736 -33247 -33112 -21884 -17851 -10599 -7907
14723 -7907 16850 23450 -1293 8581 26607 -412 -15518 4980 34917 22408 37715 37470 38376
14710 38376 29788 12587 -5811 -13672 -23814 -65127 -53403 -25226 -42676 -43615 -30106 -39072 -55919
14697 -55919 -31681 -8347 -13824 5756 -18797 -24398 -12693 -10020 1070 -978 -11461 4195
14685 4195 33560 28762 16549 21724 -3931 2605 12763 7744 16728 -20117 -42098 -13265 -13146
14672 -13146 -35367 -10327 -20217 -34977 -25620 -1857 -16325 -20450 -18141 -35680 -28970 -26805 -27961
14659 -27961 -35815 -19134 -17502 -42862 -36279 -13073 -18820 -8937 -8501 1496 -14445 -9840 -10189 -6295
14645 -6295 -5545 7859 15549 41088 33261 11554 -12346 -16038 2916 6362 -7145 -20262 -34883
14632c4883j9273j6374j0274J1340J1051J1248o944O739J5978K8857J6508j2134
14620A839J7717q872O889R722k9961l1396j1350J2063K8053j3361l1252l6329
14608h6238L0798N1464L009k5205r449J6204R714N45J3086J42j1841j0124q692
14595b6587o217Q904j1749m04K3013J7729J5309K8392q502k5302J4066p437J256
14582B2471P071j9800j7499j3724J6632J3464l0452k4341L5100K8865l0106j8501
14570c0820M281R586K4471P79J1561p048K805M420l4819r468J4678l557p529n005
14556b5665r054P431j4476J2100L1987k2440j3436m272M616l0k754q533j5293
14543e9819k815J1233J4114J4578J5068k456j0520J5354j4215j4116M818M3915
$$ plain form
14632 -34883 -54156 -70530 -80804 -69464 -58413 -47165 -54109 -47370 -31392 -2535 13973 1839
14620 1839 19556 10684 17573 27295 -2666 -34062 -45412 -33349 -5296 -18657 -49909 -86238
14608 -86238 -55440 -3976 -967 -26172 -35621 -19417 -9703 -9158 3928 4070 -7771 -17895 -26587
14595 -26587 -32804 -23900 -35649 -36053 -13040 4689 19998 48390 39888 14586 28652 21215 22471
14582 22471 29542 9742 -7757 -21481 -4849 8615 -21837 -46178 -11078 17787 -12319 -30820
14570 -30820 -26539 -16953 7518 8297 19858 12810 15615 20035 -14784 -24252 -9574 -13131 -20660 -25665
14556 -25665 -34719 -27288 -41764 -29664 2323 -20117 -33553 -37825 -33209 -33239 -35993 -44526 -59819
14543 -59819 -62634 -51401 -37287 -22709 -7641 -10097 -20617 -5263 -19478 -33594 -28776 15139
14531A5139k5782k9458J064r274J884L480L765q120j35M381K1426K0780j9172
14518b0022R737j0699n745L097k0K3087k690o621N400J4371j1658p427j0165L194
14504a6161k0833N511K5499J6417R171j2294k6699j1256J6753K043J6826K4137
14492B9114Q907j08j7142n761j3664j1524j8695k0275O476L359j0014K9387K4807
14479D867k0830n034P97M005J0501J960k9525j4050q891m635K6724o782K411J5456
14465b3026Q506l5857k1559K1312K1499O215j434J2938j4873j6999J7809P822
14453a7647M458M715J6611J0223j0074k1763j9539j1254J323j1311O877L2506
14441a4875J3897J2887J7575L528j5250j0984k578p05m79P789l7939p175m55J0875
$$ plain form
14531 15139 -10643 -40101 -39037 -48311 -46427 -42947 -39182 -47302 -47437 -43056 -21630 -850 -20022
14518 -20022 -10285 -20984 -26729 -23632 -23652 -565 -3255 -9876 -4476 9895 -1763 -9190 -19355 -16161
14504 -16161 -36994 -31483 -5984 10433 19604 7310 -19389 -30645 -13892 -11849 4977 29114
14492 29114 38021 37913 20771 15010 1346 -10178 -28873 -49148 -42672 -39313 -49327 -19940 4867
14479 4867 -15963 -20997 -20200 -16195 -5694 -3734 -33259 -47309 -56200 -60835 -34111 -40893 -38482 -23026
14465 -23026 -14520 -50377 -71936 -50624 -29125 -22910 -24344 -11406 -26279 -43278 -25469 -17647
14453 -17647 -13189 -8474 8137 18360 8286 -13477 -33016 -44270 -42947 -54258 -47381 -14875
14441 -14875 -978 11909 29484 33012 17762 6778 4200 3495 3016 10805 -27134 -34309 -34764 -23889
14427b3889j9235n401j332O66J2060J0900j3280j3971J1231K0693q311k300K2615
14414i554N776J324j6697j7610M293j3314J3260p39J8521J9301J3938J8588j6460
14401B0627l2765P697J2477m897j1740J3166J6626j1476k1867l1850k897J4744
14389c2155j4501N129R159J2784M943K2065K430k1934n734k5700r366K9928N656
14376a7296k1616k5980K4610K0895j8717k2027k3823M2542L3337o85J7988L221
14364A2449k0597o958k024J629K0087N707l6618P053M300j5286L1423K5877k374
14351B4668j0158j7491L533j3257k419q22M366k6118M940P940r548k1067K9745
14338b5688J235j1149l808K7427o220J7394L8964p271k1810k0757r967R788m303
$$ plain form
14427 -23889 -43124 -48525 -49857 -49191 -37131 -26231 -39511 -53482 -42251 -21558 -29869 -32169 -9554
14414 -9554 -3778 -2454 -19151 -36761 -32468 -45782 -32522 -33261 -14740 4561 18499 37087 20627
14401 20627 -12138 -4441 8036 3139 -8601 4565 21191 9715 -12152 -44002 -46899 -32155
14389 -32155 -46656 -41527 -32368 -19584 -14641 7424 9854 -12080 -17814 -43514 -52880 -22952 -17296
14376 -17296 -38912 -64892 -40282 -19387 -38104 -60131 -83954 -41412 -8075 -8760 9228 12449
14364 12449 -8148 -15106 -17130 -15501 4586 10293 -26325 -19272 -14972 -30258 1165 27042 24668
14351 24668 14510 -2981 552 -12705 -15124 -15946 -11580 -37698 -32758 -24818 -34366 -55433 -25688
14338 -25688 -24453 -35602 -39410 -11983 -18203 -809 38155 30884 9074 -11683 -21650 -11862 -16165
14325a6165J8982K0308O373k2097j3957L3105J1619q457k8129j5356j113J6471
14313A584O952m887J0637J9087j3531l5691J2486o559J3772N214q196p440L109
14300c463j3866n968n607L737k6482J6914j8590K973k15J5009R508J272q169r814
14286d2761K42Q787l58j6186l164J1423j7447k341L9457J8797r249k3632K581
14273c3851N631o151K6393N30M090k2445J60L0003J2031L1724k4639m7748K3651
14260f21j0443K310p172m432m636o074l839J0618J1532J4936k3152N757r277K2585
14246a908Q229m8250m805L8157m990n827K1209J4560j8471j2342J690j357q888
14233b2993O641J5653K8480j5448k8055o763J0804M947q095k5471j4568o603Q624
$$ plain form
14325 -16165 2817 23125 29498 7401 -6556 26549 38168 29711 1582 -13774 -14887 1584
14313 1584 8536 3649 14286 33373 19842 -15849 -3363 -9922 3850 9064 868 -6572 -3463
14300 -3463 -17329 -23297 -28904 -25167 -51649 -34735 -53325 -50352 -50567 -35558 -26050 -24778 -32947 -42761
14286 -42761 -42519 -33732 -34090 -50276 -53440 -42017 -59464 -61805 -22348 -3551 -12800 -36432 -33851
14273 -33851 -28220 -34371 -7978 -7448 -3358 -25803 -25643 4360 16391 48115 23476 -24272 -621
14260 -621 -11064 -8754 -15926 -20358 -24994 -31068 -34907 -24289 -12757 2179 -20973 -15216 -24493 -1908
14246 -1908 6321 -41929 -46734 -8577 -13567 -19394 1815 16375 -2096 -14438 -12748 -14105 -22993
14233 -22993 -16352 -699 27781 12333 -15722 -22485 -11681 -6734 -14829 -40300 -54868 -61471 -52847
14220e2847J0938J9399J7173k923k557L2532k580k2838R649K2176K938j7266m2876
14207b9082j122J5662J7813k7522m990P8j6132k0347J1561K4269k3191L43K1048
14194c1612R023o693O250j8798j2262M5238K5241j5480j6386L604J199j9775K1588
14181h863K4643j8098R040J83O268j2552q977K3024Q988J3585k4255j7484J1014
14168F516J8672j4508k8652o261L9016k8544k0347K410L173j0286j0562J6073
14156c3300L0405L2205k1396p508r786J0930J3934J2812R341j7720k7912k2492
14144c0487m924J4541K0547J4903k147j7987J817K042j0098M402N344K548j8495
14131a7994k2316Q708J8659K1112J1798j058N371r67k0917n958j3994j8413L164
$$ plain form
14220 -52847 -41909 -22510 -5337 -8260 -10817 21715 19135 -3703 5946 28122 31060 13794 -29082
14207 -29082 -30204 -14542 3271 -24251 -29241 -29163 -45295 -65642 -54081 -29812 -53003 -52660 -31612
14194 -31612 -22589 -29282 -23032 -41830 -54092 -8854 16387 907 -15479 -11875 -10676 -30451 -8863
14181 -8863 15780 -2318 6722 6905 13173 621 -8356 14668 23656 37241 12986 -4498 6516
14168 6516 25188 10680 -17972 -24233 14783 -13761 -34108 -31698 -28525 -38811 -49373 -33300
14156 -33300 -2895 29310 7914 406 -9380 1550 15484 28296 37637 19917 -7995 -30487
14144 -30487 -35411 -20870 -323 14580 12433 -5554 -3737 -1695 -11793 -7391 -2047 501 -17994
14131 -17994 -40310 -31602 -12943 8169 19967 18909 24280 23313 2396 -3562 -17556 -35969 -32805
14118c2805J2681j5376K4324J0930J3788N93k4827L607J593J7348j1574J301k0190
14105a8607k2264q564j451J0589J7983l204k346r223l1241Q167m360J7437K8920
14092a8164K6737j1226P884J327j8020p042n280k6684K8143J102K83K1104r71
14079h07n596R862k079k2245P390j7632n358J7711J2748J6850k747q669o544l209
14065a0325P68L9108j1909k6558q283J1605K3398q187j4241j4348j5955J7376
14053a7551K0426j2979k4285n739j873Q997J255m063j4180J205Q040J0273j1187
14040d1661j2489K4057J7469q174N206K7067o672j5028O90P578l796m5321Q853
14027d2221J3633J7224J3642j9661j7787K1866L777O480O954j4957O087K1308
$$ plain form
14118 -32805 -20124 -35500 -11176 -246 13542 14135 -10692 -7085 -5492 11856 282 1583 -18607
14105 -18607 -40871 -49435 -50886 -40297 -22314 -25518 -27864 -37087 -68328 -60161 -64521 -47084 -18164
14092 -18164 8573 -2653 5231 6558 -11462 -18504 -23784 -50468 -22325 -21223 -20940 164 -807
14079 -807 -6403 3459 1380 -20865 -13475 -31107 -36465 -18754 -6006 10844 8097 -572 -7116 -10325
14065 -10325 -9557 29551 17642 -8916 -17199 -5594 17804 9617 -4624 -18972 -34927 -17551
14053 -17551 2875 -10104 -34389 -40128 -42001 -33004 -31749 -35812 -49992 -48787 -40747 -30474 -41661
14040 -41661 -54150 -30093 -12624 -20798 -15592 11475 4803 -10225 -9535 -1957 -5753 -51074 -42221
14027 -42221 -28588 -11364 2278 -17383 -35170 -13304 -9527 -3047 3907 -11050 -4963 16345
14015A6345K5561O56l1289k5110j4509R732K0575q692m669p246L7075o79K0251
14002C8001K891n12k0245Q348j771k3951j2671j2912j8529L1175K4886q378k1948
13989a5616J8407K5686N031J6880K2590k2424k1723j5829k221l3667M347K9786
13977A1247J6470J6683J533p217j488J842k1678m451r391l373K2415m115l2020
13964a3543k1338K2799J6696J0514k313J4593p414l4956J362k1617P272K3808
13952d137P030L0480K2734J9731L982J8375K3507L5104K2539L9220M6589Q7980
13940C53134Q8829J07907J40531J14986R0147J05211P8080K3715j0948q1575j03530
13929I06487j39850j29225q6650q5115j36980o6978n3258m8201j4900j1005k2193
$$ plain form
14015 16345 41906 42562 11273 -13837 -28346 -18614 1961 -6731 -11400 -18646 18429 17750 38001
14002 38001 40892 40380 20135 28483 26712 2761 -9910 -22822 -41351 -10176 14710 6332 -15616
13989 -15616 2791 28477 33508 50388 72978 50554 28831 13002 10781 -22886 -18539 11247
13977 11247 27717 44400 45933 38716 37228 39070 17392 12941 3550 177 22592 18477 -13543
13964 -13543 -34881 -12082 4614 15128 12815 27408 19994 -14962 -13600 -35217 -27945 -4137
13952 -4137 2893 33373 56107 75838 79820 98195 121702 156806 179345 218565 265154 353134
13940 353134 441963 549870 690401 805387 895534 1000745 1078825 1102540 1091592 1010017 906487
13929 906487 766637 637412 550762 465647 328667 261689 208431 160230 145330 134325 112132
13918A12132j7056j8478j4739N004l5816l7101J0404J8047N217j1676n103k6438
13906a5603J5231L1394J7618j4354r122k2256j1653R42L0992K7723J6878k3580
13894D4210l0783k074Q81p928Q046p169n063j1566N800R243k335j2915k9998l1912
13880g3563k321K3575J0879L9300J5415l1740o273k3899j863O610N542n458l692
13867d7488J5395R570Q315J7398j9627J9984J364j0301R780j5888P536R118j4659
13854i503N171L4281o906k2627J4270l7365l3260K0795p451k8683P141L0897R230
13841b4010n314J3632Q341j5978k749K042j6830q016j9703R889K1194k319K834
13828c6987k862q661j4060Q20M1163K8041o889j2790k750k9875j531r380K2774
$$ plain form
13918 112132 95076 76598 61859 66863 31047 -6054 4350 22397 27614 15938 10835 -15603
13906 -15603 -372 31022 48640 34286 25164 2908 -8745 -7803 23189 50912 67790 44210
13894 44210 13427 11353 12234 4306 12352 5183 120 -11446 -5646 3597 1262 -11653 -41651 -73563
13880 -73563 -75884 -52309 -41430 -2130 13285 -18455 -24728 -48627 -50490 -43880 -38338 -43796 -47488
13867 -47488 -32093 -22523 -14208 3190 -16437 3547 4911 -5390 4390 -11498 -3962 5156 -9503
13854 -9503 -4332 29949 23043 416 14686 -22679 -55939 -35144 -42595 -71278 -64137 -33240 -24010
13841 -24010 -29324 -15692 -7351 -23329 -26078 -24036 -40866 -48882 -68585 -58696 -37502 -39821 -36987
13828 -36987 -39849 -48510 -62570 -61750 -20587 7454 565 -12225 -14975 -44850 -46381 -55761 -32987
13815c2987P574K220J0285N5l1985l6963J8676K1202J0619O080R829K362K1656
13802H623l454R832l5239l3360R793K0050n665R765n463j667J6282L4450K9869
13789E3816M285l1580j9158k2062Q762J4215J5304j2039M735Q340r924K2879l2819
13776D754m948J6372j1801k700j8202l020j3119k2577k1336K1857L5269N225n827
13763b0053J9100o873N365K743k0213O704J8685M775J6474k799n7679l6759K9381
13750d1149o834k6714L638J6144K8586L0781j0039j3075k2416j0774P477J402
13738d2973N398Q181J4919J1885K0969j1850q355J3585L470k4646r441K881L0314
13725A4337R828J1201o499m2526J8768P05l610r136k9974R970J3438j1540N890
$$ plain form
13815 -32987 -25413 -23193 -12908 -12853 -44838 -81801 -63125 -41923 -31304 -25224 -15395 -13033 8623
13802 8623 5169 15001 -20238 -53598 -43805 -23755 -29420 -19655 -25118 -26785 -10503 23947 53816
13789 53816 58101 26521 7363 -14699 -5937 8278 23582 11543 16278 24618 14694 37573 4754
13776 4754 -194 16178 4377 1677 -16525 -19545 -32664 -55241 -76577 -54720 -19451 -14226 -20053
13763 -20053 -953 -7826 -2461 282 -19931 -13227 5458 10233 26707 23908 -33771 -70530 -41149
13750 -41149 -47983 -74697 -71059 -54915 -26329 4452 -5587 -18662 -41078 -51852 -44375 -42973
13738 -42973 -37575 -29394 -14475 -2590 18379 6529 -1826 11759 15229 -9417 -18858 -15977 14337
13725 14337 24165 35366 28867 -13659 5109 5814 2204 -6932 -36906 -26936 -13498 -25038 -19148
13712a9148q25J7251K3540M727K959j6946k159r819J8230J9537j1885j1669m2314
13699b8521K0543l183j1867n26m946J4278j0755l62pJ5359J8716K1470l780j6776
13685I643j872P737j96j5108j2169P211J9597L4578q096l246j7849j2186p627
13672D17l6063Q86L2043K9877Q111j8881j9799m608L204O343Q34j9206J3102K1920
13658A8180p391N233k2627P343J8469J2561n000j1466j4059J9502J5890O233k4233
13645A8635l3232J282j8341L4350j010k7635K2684n417j611J7993M361j497r553
13632A009J1576R63k483R85j4453N244j89o409J9304J4335j3012J603N690J192
13618B5355j0384n358K0665O32j8182l085n504K1579o091r859l341o170j7057
$$ plain form
13712 -19148 -19973 -2722 20818 25545 28504 11558 9399 -420 17810 37347 25462 13793 -28521
13699 -28521 -7978 -11161 -23028 -23554 -28500 -14222 -24977 -25339 -25346 -9987 8729 30199 26419 9643
13685 9643 7771 15508 15312 204 -11965 -4754 14843 49421 41325 38079 20230 8044 417
13672 417 -35646 -34760 -2717 27160 35271 16390 -3409 -8017 -4813 1530 2364 -16842 -3740 18180
13658 18180 10789 16022 -6605 738 19207 31768 26768 15302 1243 20745 36635 42868 18635
13645 18635 -14597 -13315 -31656 2694 1684 -25951 -3267 -8684 -10295 7698 12059 10562 1009
13632 1009 12585 13548 11065 12050 -2403 2841 2652 -3757 15547 29882 16870 18473 24163 25355
13618 25355 14971 9613 30278 30910 12728 9643 4139 25718 19627 9768 6427 257 -16800
13605a6800j7759j9833J7501L7431J0617N800j8041j1993K1416N101j6524M35
13593b649q508j3310K1609J3829q896l2256k464J6636K4676J2659j3105j6058
13581g837R369k165r239Q650J6529O978R601J9661L0231k6611k3248o934q061
13568A6924k9358j3172K1739P88n457J4667j0038K1089q83r931j3156j5177k009
13555b3974J4631R019J781r683J3497J1107R033o961Q621J4748K1126k7773j0803
13542B4369k6653k0283K19J0882j0923K428K3079O14k4154R36j0604k9641N44
13529e9187J9627j132L515l102Q079K5897Q730N835l869l987k4946k9079K0201
13516c3418Q419k8191j3255K1948L9599J1472J766j5783k0285M863J0033r599
$$ plain form
13605 -16800 -34559 -54392 -36891 540 11157 16957 -1084 -13077 8339 13440 -3084 -2649
13593 -2649 -11157 -24467 -2858 10971 2075 -30181 -32645 -16009 8667 21326 8221 -7837
13581 -7837 1532 -633 -9872 -1222 15307 22285 31886 51547 81778 55167 31919 24985 16924
13568 16924 -12434 -25606 -3867 -3079 -8536 6131 -3907 17182 16299 6368 -6788 -21965 -23974
13555 -23974 -9343 -324 1457 -8226 5271 16378 25411 18450 27071 41819 62945 35172 24369
13542 24369 -2284 -22567 -22348 -11466 -22389 -19961 3118 3732 -20422 -19486 -30090 -59731 -59187
13529 -59187 -39560 -40692 -37177 -40279 -32200 -6303 2427 8262 4393 406 -24540 -53619 -33418
13516 -33418 -24999 -53190 -66445 -44497 -4898 6574 8340 -7443 -27728 -22865 -12832 -22431
13504b2431k001O593J1788l4145l783K4300K0428k7273m371Q578K1756n311k6135
13491c2007k4971k547K7963J9584k5579J1937M167k415M060J1397J5093r113q010
13478a0441j1678J7615J7488Q757J5398k917k0117p938M681K684m633j2403l2572
13465c6076o4L2127K2540q637k8735J6577p041O963n678m829N5o382K838P843
13451h499Q665k366K0706J2122j4653J787J958m2206k5445j3366K1620L3398J4751
13438H472j580j8166k5083l158J6676K9935K6356l1365J0054J8205n113L215m50
13425B7998n766m28k9331k5405P843l753J0828j219l6038o072P806K7712N313
13412b0512j5242R529j8886j4978j026R95n951J4686O365q836J2070J2805N84
$$ plain form
13504 -22431 -24432 -17839 -6051 -40196 -43979 -19679 749 -26524 -30895 -22317 -561 -5872 -32007
13491 -32007 -56978 -59525 -31562 -11978 -37557 -25620 -21453 -23868 -19808 -8411 6682 -2431 -10441
13478 -10441 -22119 -4504 12984 21741 37139 34222 14105 6167 10848 13532 8899 -3504 -36076
13465 -36076 -36140 -4013 18527 9890 -18845 -2268 -9309 -2346 -8024 -12853 -12798 -19180 -16342 -8499
13451 -8499 166 -2200 18506 30628 15975 17762 19720 -22486 -47931 -61297 -39677 -6279 8472
13438 8472 6892 -11274 -36357 -39515 -22839 7096 33452 2087 12141 30346 25233 28448 27998
13425 27998 22232 21804 -7527 -32932 -25089 -28842 -18014 -19233 -55271 -61343 -53537 -25825 -20512
13412 -20512 -35754 -26225 -45111 -60089 -61115 -60120 -66071 -51385 -45020 -53856 -41786 -28981 -28397
13399b8397N456R389j8221K0113O214Q467q843J024J3540J8966m246k3646j7942
13386a8126j8964K383J6448j273M167P626o609j1267J9319k764l652M658m184
13373a2238L2L2239J1621J5985K0586P668L3840L6421L8448K7771J4476q116J091
13360B19824m969j0480J8985L1610j8310k5917K27q213n95p764K374K0783L4975
13347B52530L4391K3799r272k2267j7748j6407m5045m8939l0991N386p807j2617
13335A05013Q348n12k8305p175J539j4059l031r128k4598k5664L275J5163J6634
13322C7500o693r418p907j6608L637l62j9052K391M495Q72O404K9532q578q611
13308G602K497r887k9126j3965J2914L3211k314m812J3401k5243j0681J7624n38
$$ plain form
13399 -28397 -22941 -13552 -31773 -11660 -5446 3021 -5822 -4798 8742 27708 23462 -184 -18126
13386 -18126 -37090 -34707 -18259 -19532 -15365 -7739 -14348 -25615 -6296 -9060 -12712 -8054 -12238
13373 -12238 -12206 20033 31654 47639 68225 75893 109733 146154 184602 212373 226849 218733 219824
13360 219824 214855 204375 223360 254970 236660 210743 210970 202757 202162 194398 196772 217555 252530
13347 252530 286921 310720 301448 279181 261433 245026 199981 151042 120051 125437 117630 105013
13335 105013 113361 112849 84544 77369 78908 64849 61818 52690 28092 2428 5703 20866 37500
13322 37500 30807 21389 13482 -3126 511 149 -18903 -16512 -12017 -11145 -4741 24791 16213 7602
13308 7602 10099 212 -28914 -42879 -29965 3246 932 -3880 9521 -15722 -26403 -8779 -9317
13295i317R142J7942o463R756j3931k5097K1946M3021K0572K0444j157J3642R000
13282A09500L832J3875L8246M2424J4258J6266K4490M231J2785K1714J0118o163
13270C05576j8162j5542l3036j9043J1115L254r997O927K3160K7707L8897K3378
13258C44234k3405l5323j2282j7222j6860l3804l6590j1628m1596l8011k6491
13247E1022J2281n196Q839o538m506P411k0914j0184l564J124M301k6046p079
13234I51Q695j2300j2227K3456m600o658k194j3770j5698P194J7641k3255J5268
13221a7497K8004N989j9374k0735P327K4237J9218J5371J1474j1748j7476j2029
13209A2761K0952O2673O9917Q5227N6177K4432j6843l3417o2643o4032m5573m9078
$$ plain form
13295 -9317 -175 17767 11304 21060 7129 -17968 3978 46999 67571 88015 86858 100500 109500
13282 109500 113332 127207 165453 207877 222135 238401 262891 267122 279907 301621 311739 305576
13270 305576 287414 271872 238836 219793 230908 234162 224165 231092 254252 281959 320856 344234
13258 344234 320829 285506 273224 256002 239142 205338 168748 157120 115524 77513 51022
13247 51022 63303 58107 66946 60408 55902 63313 42399 32215 28651 29775 34076 8030 951
13234 951 9646 -2654 -14881 8575 3975 -2683 -4877 -18647 -34345 -27151 -9510 -32765 -17497
13221 -17497 10507 16496 -2878 -23613 -16286 7951 27169 42540 54014 42266 24790 12761
13209 12761 33713 96386 166303 251530 307707 332139 315296 281879 219236 155204 109631 60553
13197F0553m0242m758j6924J1494M730L39j4258l1817Q636J7714p49m997J6673
13184F394Q932K5136k4288q204n118r185j8743K1988L0428p691k2669L152Q422
13171H554l749K4135L0791K9517Q030L6461N7290O2675J01350J68238K05822J66220
13159H95334Q8476l3539j26159j40892j63206j40947q6090r4760o8206m5154M918
13148H9775Q532k9231j5369j4118l641j1106k1457j0338m284k1302J8587J7338
13136C386P549J6966n181j5415j5475k6670K1346L9334K913Q477P492l051L1491
13123G3162L2681k3377J63M9699N7536R8789J70222K28969K13961J16155J7758
13112A035718j13202j70988j72288j47779j06103r8717o8459l3345k0630r33j2026
$$ plain form
13197 60553 20311 15553 -1371 10123 14853 15192 934 -30883 -22247 -4533 -5282 -10279 6394
13184 6394 15326 40462 16174 7970 2852 -6333 -25076 -3088 27340 19649 -3020 132 8554
13171 8554 4805 28940 59731 89248 97278 133739 191029 253704 355054 523292 729114 895334
13159 895334 983810 950271 824112 683220 520014 379067 292977 198217 130011 84857 89775
13148 89775 98307 69076 53707 39589 35948 24842 3385 -6953 -11237 -32539 -13952 3386
13136 3386 10935 27901 22720 7305 -8170 -34840 -13494 25840 28753 37230 44722 41671 73162
13123 73162 105843 82466 82629 132328 189864 288653 458875 687844 901805 1017960 1035718
13112 1035718 922516 751528 579240 431461 325358 226641 158182 124837 104207 103274 91248
13101I1248L997j7071m2606l1074l744J9253L364j9581j7473r562o846P544N039
13088a7512J307J2238J2311j5917Q581K137L143J3442L420m931K1835l566K4156
13075F0644k2472j7574N2654L7075O1827R1036N2005J1964k8249l9689m8239n4028
13063A56954l8850n2762m7663j1809K5043r821L049k521r416Q687k223L6828m0529
13050A4967n2333J1255J7838K4359n438k4673k83Q441n497p660q422j037j766
13037c0249M543K1351J6048N317N520l3908r140k0011J0974K6007J5541j2542
13025e49j3906j546L2101J1054R234r949j3824L696k0758m63J9865J9779l297
13012C1437k282j1254j9962P75k5728J7464R628M888l46L4017J9245J2958j3456
$$ plain form
13101 91248 95245 78174 35568 4494 750 20003 23367 3786 -13687 -23249 -30095 -22551 -17512
13088 -17512 -16205 -3967 8344 -7573 1008 3145 6288 19730 23150 18219 40054 36488 60644
13075 60644 38172 20598 73252 110327 172154 263190 315195 327159 298910 259221 210982 156954
13063 156954 118104 65342 17679 5870 30913 21092 24141 21620 12204 20891 18668 55496 14967
13050 14967 -37366 -26111 -8273 16086 10648 -14025 -14308 -5867 -11364 -19024 -27446 -28483 -30249
13037 -30249 -25706 -4355 11693 17010 22530 -11378 -20518 -40529 -29555 -3548 11993 -549
13025 -549 -14455 -16001 16100 27154 36388 26439 12615 16311 -4447 -4910 14955 34734 31437
13012 31437 29155 17901 -2061 -1286 -27014 -9550 78 4966 4620 38637 57882 70840 57384
12999E7384j4253j6409l9259L6J1337Q74J0564J0573k0465J141R670J2759j4360
12986I592K655P097K2425J4769o495p31K8750L2370k5559p0357M5193P0711P1326
12973B01746N5852L190K701k1043j6844N411m0774m3936r223j9484j6544q531
12961I2521J12l8776J792J4163l5617k0611q089l619O686j3774l1579M654j2064
12948d4201j1292j427J4381j5280K2310L2546O133k581r329N872K6417P626m308
12935B6867q422Q030K518N720K6710K6876K5504K982j2971K905m001l519j1158
12922H8041p106n507m1127k2698r638P584J4615P471K700j5470j0952p10K4403
12909C1606J9903K2872K3504p555J4689K4702K8360O8949O5894Q6446J32198J48575
$$ plain form
12999 57384 43131 26722 -12537 -12501 -1164 -290 10274 20847 382 1523 11193 23952 9592
12986 9592 12247 19344 41769 56538 50043 49312 78062 110432 84873 14516 59709 130420 201746
12973 201746 257598 260788 263489 242446 225602 231013 190239 146303 137080 117596 101052 92521
12961 92521 92633 53857 55649 69812 34195 13584 5495 1876 8562 -5212 -36791 -32137 -44201
12948 -44201 -55493 -56920 -42539 -57819 -35509 -2963 3170 589 -8740 -2868 23549 31175 26867
12935 26867 18445 26475 28993 34713 61423 88299 113803 116785 103814 106719 102718 99199 88041
12922 88041 80935 75428 34301 11603 1965 9549 24164 31635 34335 18865 7913 7203 31606
12909 31606 51509 74381 97885 90330 105019 129721 158081 227030 292924 379370 511568 660143
12897F60143J68909J47706J02849P0121N5999Q076k0908q9676r8055n4466q1055
12886H69643j09878j30571j06479j24450r7614o3774m2717k0215q380K141l137
12875A64569m2533j4899k0876l7197k3196J1158j1315J2541Q582m858k5050q80
12863A6046J9154j7066M280J7824K522k1812j1488P678K5475j5686J9832M9939
12851I6698N897J1198j325j6059k210J3920M82j1258l5398k795o479k3034K163
12838C1800L912Q027k4836l2179QK323J620j506J1905K2418o864J29K2233K1173
12824F0163K5993p834j0179m3208l8799k1683R41K5393k004J1441j2801j7515
12812c0092K7454J617j1511K3704Q439P501k1071j9604J0718K5469o26k392L187
$$ plain form
12897 660143 829052 976758 1079607 1149728 1205727 1213803 1192895 1103219 1005164 950698 869643
12886 869643 759765 629194 522715 398265 300651 236877 194160 173945 165565 167706 164569
12875 164569 122036 107137 86261 49064 25868 37026 25711 38252 46834 41976 16926 16046
12863 16046 35200 18134 22414 40238 42760 20948 9460 17138 42613 26927 46759 96698
12851 96698 102595 113793 112468 96409 94199 108119 108601 97343 61945 59150 52671 29637 31800
12838 31800 35712 43739 18903 -13276 -13268 -10945 -9325 -10831 1074 23492 16628 16757 38990 60163
12824 60163 86156 78322 68143 24935 -13864 -35547 -34606 -9213 -11217 224 -12577 -30092
12812 -30092 -2638 -1021 -12532 11172 19611 27112 6041 -13563 -2845 22624 21998 19606 22793
12799B2793J4309J4267N971J948k1983l2654j620J1791K7638k755k3592L6537
12787E2650R503r390j9984j1593J7299m712k7242k8111M779L2879K0806K639n155
12774C4368l5144l0268M820K9108J6111J0065j2241K3154K910J2010j5026o571
12762C3296O598M807k4097k006M218q946K602J3273J5000J9830m847j8923K5936
12749F6741j9629K62K6221P019j9616N862O77N151l163j6893N690J9406L2477
12736A10205L1625l042j0115K7893J6505r945q63J1257L3703J0667k7232r004
12724A81654J1452q812k0039l0026k3561m507j1501k1130J7527k7193k9232J7492
12712E2124J8765M5487M6147K8312J7958L5370J0704m858Lj7587l7732j2806k9652
$$ plain form
12799 22793 37102 51369 57340 59288 37305 4651 3031 14822 42460 39705 16113 52650
12787 52650 62153 52763 32779 21186 38485 33773 6531 -21580 -16801 16078 36884 39523 34368
12774 34368 -776 -31044 -26224 2884 18995 29060 16819 39973 42883 54893 39867 33296
12762 33296 39894 44701 20604 18598 22816 13870 16472 29745 44745 64575 59728 40805 66741
12749 66741 47112 47374 73595 80614 60998 66860 67537 72688 69525 52632 58322 77728 110205
12736 110205 141830 138788 128673 156566 173071 163126 162263 173520 207223 217890 190658 181654
12724 181654 193106 184294 164255 134229 110668 106161 94660 73530 91057 63864 34632 52124
12712 52124 70889 116376 162523 190835 208793 244163 254867 250009 250012 232425 194693 181887 152235
12699A52235j5582J409k1276k6390j2335j2177l847j1004O782K1644J8132o671
12687I0920j6348j4771J3201J0946r629j1614j1715j3084l3667n881J0629j4016
12675e029o051L932q49J291j6260N550J3386L256J6359L360P36L0195J4193j5442
12661D8627l5387J8656J9280R676o670K1390M3690r403l247J5375J017k2998j4736
12648H5270J7784Q82K983J3388J5343J9299J1858K028K8404K9700k4750m5007
12636A57182j9889K6645m006j0205k6546k7333m6983l0544J2682j4291r412K599
12624I899J8878J9134N723N817L6055M3012L2844L2485K4564K3910L2453K9864
12612C14638N118N674n932j5815j3324j0403R463K2784J6377M8131N4903K4684
$$ plain form
12699 152235 136653 138062 116786 90396 78061 65884 62037 51033 57815 79459 97591 90920
12687 90920 74572 59801 73002 83948 74319 62705 50990 37906 4239 -1642 8987 -5029
12675 -5029 -11080 -7148 -7997 -6706 -22966 -17416 -4030 -774 15585 18945 19681 49876 64069 48627
12661 48627 13240 31896 51176 60852 54182 75572 119262 109859 106612 121987 123004 100006 85270
12648 85270 103054 103936 106919 120307 135650 154949 166807 168835 197239 226939 202189 157182
12636 157182 137293 163938 159932 149727 123181 95848 48865 18321 31003 16712 7300 9899
12624 9899 28777 47911 53634 59451 95506 138518 171362 203847 228411 252321 284774 314638
12612 314638 319756 325430 319498 303683 290359 279956 289419 312203 328580 376711 431614 456298
12600D56298J5230L8773K1232K1446j3163j7114J9567J9562J0074M1598N8335
12589F71838N0528J6900q997k7323j4796o5164k8123j0725o1579m2394m1113l9907
12577C99145J7932Q144q671k8095O106N980o048J9201J0903J973M3188J5443p476
12564D77725j9361k6536J4328M0537l330J0769K0956R31J8195L8151N8491M0611
12552F71467J1790N58N325L6268J1600k8319j1163L7325K6893R276j262J1827
12540G81585p498k3418L1434J3672j1178K0157K6543J986N824L4784N2725N3023
12528I79639N8578J9210N3627M8232P9867O4521R2555R3065Q0223Q7970Q2040
12517A739527R3905Q0092O9836Q7353J01557Q3439J27723J46377K07612K35764
$$ plain form
12600 456298 471528 510301 531533 552979 539816 522702 542269 561831 571905 613503 671838
12589 671838 722366 739266 730269 702946 688150 622986 594863 584138 522559 480165 439052 399145
12577 399145 417077 425221 416550 388455 394561 400541 394493 413694 424597 426570 469758 485201 477725
12564 477725 458364 431828 446156 486693 483363 494132 515088 516019 534214 572365 630856 671467
12552 671467 683257 683815 689140 725408 737008 708689 697526 734851 761744 771020 769758 781585
12540 781585 774087 750669 782103 795775 784597 804754 831297 833283 839107 873891 926616 979639
12528 979639 1038217 1057427 1111054 1159286 1239153 1303674 1396229 1489294 1569517 1657487 1739527
12517 1739527 1833432 1913524 1983360 2070713 2172270 2255709 2383432 2529809 2737421 2973185
12507B973185K65247K76982K85193K40516K59423K94754L20929L62926L79688
12498E658843M57727N94044P38469Q94067J068390J298383J521546J695146J889158
12489A5815773K106248K348107K737203L253812M065140N338913P371907J0311455
12481E3348558J4110014J8333744K2244307K5122810K6248136K4957291K0848965
12474B05213825J4244962N870672l148866j1695208j8620800k3169874k5201126
12467A43493585k4915735k2724409j9317179j5500983j1927737q946940o669754
12460C3490848n069582l894679l141658k612819k230529k005846j815023j601615
12452A1119097j370233j167113r71125q00728o36720n33057m67754m19465l39903
$$ plain form
12507 2973185 3238432 3515414 3800607 4041123 4300546 4595300 4916229 5279155 5658843
12498 5658843 6116570 6710614 7449083 8343150 9411540 10709923 12231469 13926615 15815773
12489 15815773 17922021 20270128 23007331 26261143 30326283 35665196 43037103 53348558
12481 53348558 67458572 85792316 108036623 133159433 159407569 184364860 205213825
12474 205213825 219458787 225329459 222180593 210485385 191864585 168694711 143493585
12467 143493585 118577850 95853441 76536262 61035279 49107542 40160602 33490848
12460 33490848 28421266 24526587 21384929 18772110 16541581 14535735 12720712 11119097
12452 11119097 9748864 8581751 7610626 6809898 6173178 5640121 5172367 4752902 4412999
12443D412999l06511k65635k23229k38634j92471j60388j73510j79876j52393
12434B520352j58800j48561j48179r8766q6533r2615q9512o3128o2319o3452m9873
12423A458614l6815k6967k5462k3854k9790m2900l4931l0075j2937l9347n182
12412A150354n3681m4515l9296k4486l4172m0061m2860n2417l6026k0476k4916
12401G37448J2230j8596k3710l7503q291j0044k6186k9013k6630k4598k682o303
12389E36122J0061p141l8535k4073r110m0918P66M536J7968O378k5763m5034n801
12376C79456J0233Q583J7743N045j5276l3301K892o136j657k3865j2002o998O986
12363C31703j4107N348j7633k3381j296J3800m582j564K5681J2530K7667K9827
$$ plain form
12443 4412999 4106488 3840853 3617624 3378990 3186519 3026131 2852621 2672745 2520352
12434 2520352 2361552 2212991 2064812 1966046 1879513 1786898 1697386 1634258 1571939 1508487 1458614
12423 1458614 1421799 1394832 1369370 1345516 1315726 1272826 1237895 1207820 1194883 1155536 1150354
12412 1150354 1096673 1052158 1012862 988376 954204 914143 871283 818866 782840 762364 737448
12401 737448 749678 731082 707372 669869 661578 651534 625348 596335 569705 545107 542425 536122
12389 536122 546183 539042 500507 476434 467324 426406 427172 431708 449676 456054 430291 385257 379456
12376 379456 389689 398272 416015 421060 405784 372483 375375 369239 367582 343717 331715 324717 331703
12363 331703 317596 322944 305311 281930 280634 294434 289852 288288 313969 326499 354166 383993
12351C83993N085J2980K9229J6787K0763R33J2215j1300j961R100l3382l2206
12339D12236l2017k503j2987k3675p332m633N562L624J4928j7947m46R812p321
12326C37301j1935j6304j6935l795j1135k2897k8615k4893L304J1690j3435j2458
12314A89893K135j9068R197J5247L486n710k4331m693j1640k0628m885j9646l552
12301A05805J9871l40J9028p7j721j3080N4217Q614j9242N047j8595J0483J0853
12288A80863j6223j5876N525J3343j5J673L1608K2228j5493R87q404O145R741
12275B16102p982m64J4988l682k0503j6215j3333j4745r858n294P255M274m148
12262A46395m360l3813j8924K4139J4560K5403K0090k1243j6034j1175O056J9220
$$ plain form
12351 383993 389078 402058 431287 448074 468837 469770 481985 470685 468724 477824 444442 412236
12339 412236 380219 377716 364729 341054 333722 329089 334651 338275 353203 335256 334810 344622 337301
12326 337301 325366 309062 292127 288332 277197 254300 225685 200792 204096 215786 202351 189893
12314 189893 192028 172960 182157 197404 200890 195180 170849 166156 154516 133888 129003 109357 105805
12301 105805 125676 125336 144364 144287 142566 129486 183703 192317 173075 178122 159527 170010 180863
12288 180863 164640 148764 154289 167632 167617 169290 200898 223126 207633 208620 200216 206361 216102
12275 216102 208120 207656 222644 218962 198459 182244 168911 154166 144308 139014 146269 150543 146395
12262 146395 142035 108222 89298 113437 127997 153400 173490 152247 136213 125038 131094 150314
12250A50314R980k4155j5392O957m963k6763K601J3354L785j2345j2689k259N4
12237H8479J4975j0391j878L8616J1237O852J0833L12l04p389j4765j3680k787
12224A20110k6245k3512K481P643l592J7799Q721J0903j0846k340J2783J2271
12212A26176k6218j5738k3234k5183L916J2848K0177j0536l4241r888j425P300
12200B3954R645j8111j6949k0428J5441J5511L3106K6498o807k1427m782J6412
12188E2063J3218j1076k3512j5599J3954K0700L2009M653k8692k3404J2734m822
12176D2226J5013l51J689P503k186L085L0544K1208J3225L903k0321J372M278
12163A21188k0988j0464n286n169N521J0507Q339q720k6205p617M76J9339J8303
$$ plain form
12250 150314 160294 136139 120747 127704 122741 95978 98579 111933 115718 103373 90684 88425 88479
12237 88479 103454 93063 91185 129801 141038 147890 158723 159035 158731 151342 136577 122897 120110
12224 120110 93865 70353 72834 80477 76885 94684 103405 114308 103462 101122 113905 126176
12212 126176 99958 84220 60986 35803 39719 52567 72744 62208 27967 18079 16654 23954
12200 23954 33599 15488 -1461 -21889 -6448 9063 42169 68667 61860 40433 35651 52063
12188 52063 65281 54205 30693 15094 29048 49748 81757 86410 57718 34314 47048 42226
12176 42226 57239 56888 58577 66080 63894 66979 97523 118731 131956 135859 115538 116910 121188
12163 121188 100200 89736 84450 79281 84802 95309 103648 94928 68723 61106 61582 80921 99224
12150I9224j6094j9160k7437p710l05R013K380J2170j6962l002M315O427j2155
12137C0704l3167M3427M7708J1851l5084j2535J6459k327k6118L56J7553k634
12125E6193N422J4714K751o357J8378J1918j8990K3934J8372k731q76k446l9793
12112H0489q449K7542L6856K6022o49J2167R315L1459O5111Q1791O5677N6396
12100D83727P4403O6478K1838J0109m0516n9068m8098k7748j7401j9991l9640
12089D04093k0127m2963n3475k7943k0998j3972N140k0742L353o528k7764K7498
12077B05572K4538L2292J1257K068Q514O1287N9689Q0343Q5199L9557J4901K4078
12065F49295L1690R077J2090K4714L3800P7141O9739O9082R7680P7912L3538N5115
$$ plain form
12150 99224 83130 63970 36533 28823 28518 37531 39911 52081 35119 32117 36432 42859 30704
12137 30704 -2463 40964 88672 100523 65439 52904 69363 67036 40918 41274 58827 56193
12125 56193 61615 76329 79080 72723 91101 103019 84029 107963 126335 123604 122728 120282 80489
12112 80489 72040 99582 136438 162460 161811 173978 183293 214752 279863 361654 427331 483727
12100 483727 558130 624608 646446 656555 616039 556971 508873 481125 463724 443733 404093
12089 404093 383966 341003 287528 259585 238587 224615 229755 209013 212366 205838 178074 205572
12077 205572 230110 262402 273659 275727 284241 345528 405217 485560 570759 610316 625217 649295
12065 649295 680985 690062 702152 726866 760666 837807 907546 976628 1074308 1152220 1185758 1240873
12053A240873P2909N8597P3201Q1514O2169M3150K2743k4994m0594n4681r1412
12042A443475j10632j03751r8992p7651l6622l3792l9989k8544k7112k4974l1091
12031H30325m1308k7211m6256j8893n6913p7270n2944p887J1089j6586j0802k6004
12019D59340n4387k9137n203k2897j2076o578Q058p22k1727k2548o471L405L8567
12006C27624L5057N0773N8649L6744O1186O1510L8184J2827L8657l274R615N683
11994G33235p940o871l3439m0644m8147p1756o3764q0300n6218l1173j7599k4511
11982B50873k0648l9236k4207L4997P419j881K6784J3611M0427N2927M1701M7931
11970D30698J6503j1877k2701n3381n6048m1651l1912j8697l7405r36j2081k0724
$$ plain form
12053 1240873 1313782 1372379 1445580 1527094 1589263 1632413 1655156 1630162 1589568 1534887 1443475
12042 1443475 1332843 1229092 1130100 1052449 1015827 982035 942046 913502 886390 861416 830325
12031 830325 789017 761806 715550 696657 639744 562474 509530 501643 512732 496146 485344 459340
12019 459340 404953 375816 370613 347716 335640 329062 337120 336398 314671 292123 285652 289057 327624
12006 327624 362681 413454 472103 508847 570033 631543 669727 682554 721211 717937 727552 733235
11994 733235 725295 718424 684985 644341 596194 524438 460674 380374 324156 292983 275384 250873
11982 250873 230225 190989 166782 201779 209198 207317 234101 247712 288139 341066 382767 430698
11970 430698 447201 435324 412623 359242 303194 261543 229631 210934 173529 172593 160512 139788
11958A39788j65j6969k5951j5068J9314p793l6569L0096M9302J1969j4224p205
11946A26525K83k0917q870R737p006j0698N579J4901k9832l10r94o312l6158K263
11932C8191J3994R768Q150Q828j5321L428l310j436k9165O098L5417J1471o881
11919G9232k4700M626K7481J9000r217k801K5094M98J7122J7650M0685N7981M3034
11906B95685O1530J4915J8377L739l2528m5762n3826q0336k5406j9912J357r398
11894A28435l8799j2186j2802J0929J801K928K1348N007m359j463q355J1082M223
11881A07789K0282j1445k8023N797j99J884j2554Q354q60n37K1296M251J0545
11868A26580r526j614K6689K9022O097j4005q738p733k1606j6412Q103K3950J7585
$$ plain form
11958 139788 139623 122654 96703 81635 100949 93156 56587 86683 135985 147954 133730 126525
11946 126525 126808 105891 97021 106758 99752 89054 94633 109534 79702 79392 78398 72086 35928 38191
11932 38191 52185 61953 70103 78931 63610 67038 63728 62292 33127 39225 74642 86113 79232
11919 79232 54532 59158 86639 105639 96422 93621 118715 119213 136335 153985 194670 252651 295685
11906 295685 357215 372130 390507 394246 361718 315956 262130 181794 156388 136476 137833 128435
11894 128435 89636 77450 64648 75577 77378 80306 101654 106661 102302 100839 92484 103566 107789
11881 107789 128071 116626 88603 94400 94201 96085 83531 91885 91025 90488 111784 116035 126580
11868 126580 117054 115440 142129 171151 177248 163243 154505 146772 125166 108754 116857 140807 158392
11855A58392j4941l6144m0789o529J6605N229P571J0162N59o455j4084K9819j0172
11842I9223j6283k1601m084Q323J0166K6441M3808L0751p239j9021P103j2934
11830A44653j2999j5903j97j1160j9458p432O57K202L613p62j263K0789Q62j251
11816A02351J7909k9333l5812p088J0397j0457L2099K1471M754j9331J1759J4216
11804A12935N118j1337q78J6088j4717j3750O199L473j3954N09j912J5286k178
11791A00882k2143J6368L7231K0232J8926K3536K1049q723K340K2724K9702L6164
11779B98288K0435L14m444j5148K9477L9198p72k1743k297J6422K5557N686j0716
11766C80257j6243J1488K2360Q591j0009j2747k054j2339K227p399r149j2093
$$ plain form
11855 158392 143451 107307 66518 59989 76594 81823 89394 99556 100115 93660 79576 109395 99223
11842 99223 82940 61339 57255 65578 75744 102185 145993 176744 169505 150484 157587 144653
11830 144653 131654 115751 115554 104394 84936 77504 78161 80363 83976 83214 81951 102740 103602 102351
11816 102351 120260 90927 55115 48027 58424 47967 80066 101537 106291 86960 98719 112935
11804 112935 118053 106716 105838 121926 107209 93459 99658 103131 89177 89686 87774 103060 100882
11791 100882 78739 95107 132338 152570 171496 195032 216081 207358 209698 232422 262124 298288
11779 298288 318723 319037 314593 299445 328922 368120 367348 345605 343308 359730 385287 390973 380257
11766 380257 364014 375502 397862 406453 396444 383697 381643 369304 371531 364132 354983 342890
11754C42890K514J0994K8063L760k3684o920L5266K3560K6183P6k261K8421J8421
11741D87283p170K2413p94J5036K3233N773j8903j4339j5690L515K7107J3747
11729E41211k9014j4954j3376r037R052p833K2405K6635J3542K8650K3801M208
11717E95290K4807L7455P00J8671L1015k2109L510K3841K3147J6594K9432L8167
11705H20520L8146K6607J8592M7404K3734J6430J9217M9247K6926J9529L4929
11694A141281K1028K9868M2936M4845O1613N9595N5443O0821O2757Q8545J03907
11683A772639R5491J18320J42635J36024J40255J91412J90515K50808K78721L34479
11673C651299L47462L44641L54384L81501M00184M31467M60547N60085O44603
$$ plain form
11754 342890 345404 356398 384461 388221 364537 357617 392883 416443 442626 442702 440441 468862 487283
11741 487283 480113 502526 501732 516768 540001 545774 526871 512532 496842 500357 527464 541211
11729 541211 512197 497243 483867 474830 483882 476049 498454 525089 538631 567281 591082 595290
11717 595290 620097 657552 658252 676923 707938 685829 689339 713180 736327 752921 782353 820520
11705 820520 858666 885273 903865 951269 975003 991433 1010650 1059897 1086823 1106352 1141281
11694 1141281 1162309 1192177 1235113 1279958 1341571 1401166 1456609 1517430 1580187 1668732 1772639
11683 1772639 1868130 1986450 2129085 2265109 2405364 2596776 2787291 3038099 3316820 3651299
11673 3651299 3998761 4343402 4697786 5079287 5479471 5910938 6371485 6931570 7576173
11664G576173P77435Q85657J023427J197193J442151J800820K143422K537561
11656A9383839L058829L651146M330247N242309O431639P885499R393986J0450087
11648F9827581J0426610Q904905O038660K522573r43404l765801n613476o521266
11640H0876382o615543o157252n425729m504161l481161k481262j528014o81388
11632E0001872K4493M99992Q39304J169748J609970K184397K877141L704148M571157
11623F7482222N302655N869714O177990O169852N949528N643844N383030N169594
11615A13148429M883000M215985K909280R86452j182463l154695m451371n042358
11607A12312259n104936m868529m623852m443411m484319m631617m792109m817736
$$ plain form
11664 7576173 8353608 9239265 10262692 11459885 12902036 14702856 16846278 19383839
11656 19383839 22442668 26093814 30424061 35666370 42098009 49983508 59377494 69827581
11648 69827581 80254191 89159096 95197756 97720329 96776925 93011124 87397648 80876382
11640 80876382 74260839 68103587 62677858 58173697 54692536 52211274 50683260 50001872
11632 50001872 50026365 50526357 51365661 52535409 54145379 56329776 59206917 62911065 67482222
11623 67482222 72784877 78654591 84832581 91002433 96951961 102595805 107978835 113148429
11615 113148429 118031429 122247414 125156694 126143146 124960683 121805988 117354617 112312259
11607 112312259 107207323 102338794 97714942 93271531 88787212 84155595 79363486 74545750
11599G4545750m694660m489954m128843l718303l313509k914721k549295k170323
11591D6566142j709276j134350m83800K61498J072243K029198L203407M686657
11583E4491719O454734Q374653J0154387J1373375J1719956J0519998P130899
11576A20219721J760427m388888r664914j2951785j4064732j3407520j1745795
11569E5756514r761762p901481o278209n000137l958562l200000k607586k163106
11561A4885671j808670j520373j275940j134288r82062q57814p48961o36822n64379
11552E356362m61543l92637l42586l17405k93842k34072k02862j80041j71072
11543B760302j40544j27335j20652q1204j08215j11022j22991r4086p5953j03953
$$ plain form
11599 74545750 69851090 65361136 61232293 57513990 54200481 51285760 48736465 46566142
11591 46566142 44856866 43722516 43238716 43500214 44572457 46601655 49805062 54491719
11583 54491719 60946453 69321106 79475493 90848868 102568824 113088822 120219721
11576 120219721 121980148 117591260 107926346 94974561 80909829 67502309 55756514
11569 55756514 45994752 38093271 31815062 26814925 22856363 19656363 17048777 14885671
11561 14885671 13077001 11556628 10280688 9146400 8164338 7306524 6557563 5920741 5356362
11552 5356362 4894819 4502182 4159596 3842191 3548349 3314277 3111415 2931374 2760302
11543 2760302 2619758 2492423 2371771 2290567 2182352 2071330 1948339 1854253 1778300 1674347
11533A674347n5607r4039p1209l2826m2438k6074k2967k1187j1003j1807l4519
11522A250671m295J7593l3185l7114j416j2363M653l4267o1786n2624n1963L077
11510I86981m445n4825j5956j3068m1519k3319l6154j9920j4227Q824R016l781
11498G77607M803L654Q705m487j3354j6270K9382J1323O867k0077j2298o836k1581
11485G47438M9589o477l6332j9857j350j7777j7643k5479m640r35k7093k6653
11473F12791k735l349l9718K021J8358K6238J1938r474k066k318J5331j4011J6189
11460F29195K4499J6747j0503m592K1170J8216K0140K7258K0399Q758j4347j5796
11448G41144j6886l6272l8003k2643L207k3478m3676m4480j8943j2600m5673k4506
$$ plain form
11533 1674347 1618740 1524701 1453492 1420666 1378228 1352154 1329187 1308000 1296997 1285190 1250671
11522 1250671 1246376 1263969 1230784 1193670 1192254 1179891 1184544 1150277 1088491 1035867 983904 986981
11510 986981 982536 927711 911755 898687 857168 833849 797695 777775 763548 772372 781388 777607
11498 777607 782410 786064 794769 790282 776928 760658 790040 801363 808230 788153 775855 769019 747438
11485 747438 797027 790550 754218 734361 733011 715234 697591 672112 667472 666537 639444 612791
11473 612791 610056 606707 566989 569010 587368 613606 625544 616070 614004 611686 627017 613006 629195
11460 629195 653694 670441 659938 655346 676516 694732 714872 742130 762529 771287 756940 741144
11448 741144 724258 687986 649983 627340 630547 607069 563393 518913 499970 487370 441697 417191
11436D17191j6903l479o774K1197p190j0421j2555j721N292j5347l0394k2136
11424C16760j4722J542J6060K2279L655m863J0198o446K375j8018Q75q92p713
11411C21090j2156J1047k8887m8973j9408K8619K3052j1563Q75m005R742J568
11399B71001J406M0894j9423k1374M657n210o613j1018j3838k1460p993o45o484
11386B03900m67K4976K1784M686q710j9358K2552L1535K5935k398o761j8320k2814
11373B56540k610N183m923l7382J0117l949p206p715k0193N777K1931Q259J6737
11360B40566K2193k1869j4718j2232P492l375l247J1010K335p206r449K272j5395
11347A98377K6032J8503J1468k026j6122m2494m5093r688J7591J3716J7496K1320
$$ plain form
11436 417191 400288 396809 390035 411232 404042 393621 381066 379345 384637 369290 338896 316760
11424 316760 302038 303580 319640 341919 345574 340711 350909 344463 346838 328820 329695 328803 321090
11411 321090 308934 319981 291094 242121 222713 251332 274384 262821 263696 259691 269433 271001
11399 271001 272407 313301 293878 272504 277161 271951 265338 254320 240482 219022 211029 210384 203900
11386 203900 203433 228409 250193 254879 246169 226811 249363 280898 306833 304435 297674 279354 256540
11373 256540 253930 259113 254190 216808 226925 222976 215770 208055 187862 193639 215570 223829 240566
11360 240566 262759 240890 226172 213940 221432 218057 214810 225820 228155 220949 211500 213772 198377
11347 198377 224409 242912 254380 252354 236232 193738 148645 138957 156548 170264 187760 209080
11335B09080j10q586j3922k1484n662L242j716L74m635l2592M835O751k103M357
11321A37829O500J3298K15K0365J8754n408k4895j3091j1561m175K450l358P390
11308A44313K9925R053j953j9898l1230J1103Q855J3647J06k1500J8851K306l1117
11295A32461q079q947J7419J1900J7231q362P513r39k882K503j0498K5186j8650
11282A55856j2028q596O300M986n724J3039L5606p42k7481m3751j4206k60O596
11269A09595j3370j2564K5696K9172j4506j5681J1655J222K0662p92k1681m847
11257A14561l745l864J0075N2098P193l5318k1158N287J2970Q74j6375K073j6281
11244A08390j1447k403K535L9482P667n242K5233j4168o224J736m803J7409J4267
$$ plain form
11335 209080 208970 200384 186462 164978 159316 162558 160842 161216 156581 123989 128824 135575 133472 137829
11321 137829 144329 157627 157842 178207 196961 191553 166658 153567 142006 137831 140281 136923 144313
11308 144313 174238 183291 181338 161440 130210 141313 150168 163815 163921 142421 161272 163578 132461
11295 132461 124382 115435 132854 144754 161985 153623 161136 160197 157315 159818 149320 174506 155856
11282 155856 143828 135232 141532 146518 140794 153833 189439 188697 161216 117465 103259 102999 109595
11269 109595 96225 83661 109357 138529 124023 108342 119997 121219 141881 141089 119408 114561
11257 114561 110816 106952 117027 169125 176318 141000 119842 125129 138099 138973 122598 124671 108390
11244 108390 96943 94540 97075 136557 144224 138982 164215 150047 143823 145559 140756 158165 172432
11231A72432K0682K1756k4000Q043L0306J5946K5416M8583M0746N4792L1386M7875
11219D93963Q1089M0717J3246N908n630l6580j5266n9143k1787m4068j7795q828
11207D25826k8344R277k6611k0036j641M635J8165L3785j8750m607K9437K4441
11195D45577J9674J6515L0959K7701L9585J3273M3941L4206N3314J5110k716p848
11183G29291J3740K380j3146j7292j1689k1184j1097j1216l2456l8135m9914k4610
11171E14672k0078n329j8207m2225q383J953J258N957r087j6207k5290k4220k4517
11158C30297j9975K5724N5634L1282J8911N6017P9123R7776N1699M3503L8704
11147H08695j403n2259q0903m1100k3318o8663q1551n9488j9585j2654k9954k7100
$$ plain form
11231 172432 193114 214870 190870 198913 229219 245165 270581 319164 359910 414702 446088 493963
11219 493963 575052 615769 629015 634923 629293 592713 577447 518304 496517 452449 434654 425826
11207 425826 397482 406759 380148 360112 358471 363106 381271 415056 396306 391699 421136 445577
11195 445577 465251 481766 512725 540426 580011 593284 637225 671431 724745 739855 737139 729291
11183 729291 743031 745411 732265 714973 703284 682100 671003 659787 627331 589196 539282 514672
11171 514672 494594 489265 471058 428833 420450 422403 423661 429618 420531 404324 379034 354814 330297
11158 330297 310322 336046 391680 422962 441873 497890 577013 674789 726488 769991 808695
11147 808695 807292 755033 674130 633030 609712 541049 459498 400010 380425 367771 337817 310717
11135C10717j3104k3590k2014J4702O388l916j8092j7434j5169n797j6304M0093
11123B36480L3215M228k7291l515K4739M863O438R397j7809j4799J0664P44k1764
11110B45590n78p851Q238J5708k9363j7511K7438r088O31J3350J9461j5749m0875
11097B09401j8250k791K2301K3449k8199m905j186k9592j4813J2173p959l0192
11085A29437l620J9396J0239j7096q83O131n287k251K2733J5166N485k2081j1520
11072A45849j8224j411K9862o124Q07L5367K1572l990N37J0258j4774k3442J7070
11059A93357M2268p911q547L2784N9354M3066O2538R9399P6083O5657M6596l818
11047G00826m3148p9778j17541q0115o2299p3683m3554n0857k5653Q052M996J0982
$$ plain form
11135 310717 297613 274023 252009 266711 273099 269183 251091 233657 218488 212691 196387 236480
11123 236480 269695 273923 246632 243117 267856 272719 279157 288554 270745 255946 266610 267354 245590
11110 245590 245012 237161 245399 261107 231744 214233 241671 232583 233214 246564 266025 250276 209401
11097 209401 191151 188360 210661 234110 205911 201006 199820 170228 155415 167588 159629 129437
11085 129437 125817 145213 155452 138356 137473 143604 138317 136066 158799 173965 179450 157369 145849
11072 145849 127625 126214 156076 149952 150759 186126 207698 203708 204245 214503 199729 176287 193357
11059 193357 235625 227714 219167 251951 311305 354371 416909 516308 592391 658048 704644 700826
11047 700826 657678 577900 460359 380244 317945 244262 200708 149851 124198 132250 137246 148228
11035A48228O169J0058m688o825J8505O942j5752j2580J0873K8042M1674N6064
11023B86710O3534N2749R1205R7231O8169K1894l3582o5893o1300r1280j02628
11012C26809m8680m4191j495j0989j4080l9697k2097n7734n492J7572k579j9087
11000G8260p397m811p349J9157L4382O808j7902j3478l892J63J623j0200k9200
10987D6164j5325P779L9500J6600j0241j1927L955o14p277j6190O240K1331K9425
10974A09420J4396o232m2056k7431k67o025L5405J037J4777K5069l882k4872k1238
10961F8101j3685L0417J0027j2839Q784k8839k0548o503R584M3623J9614l488
10949A04248l0397j1394l020R740k371l063k528n543P870K4867j388p361L1827
$$ plain form
11035 148228 154397 164455 159767 152942 171447 178389 162637 150057 160930 188972 230646 286710
11023 286710 350244 402993 494198 591429 659598 681492 647910 582017 520717 429437 326809
11012 326809 278129 233938 232443 221454 207374 167677 145580 87846 82354 99926 97347 78260
11000 78260 70863 66052 58703 77860 112242 119050 101148 87670 83778 83941 85564 75364 46164
10987 46164 30839 38618 78118 94718 84477 72550 76505 75891 68614 52424 58664 79995 109420
10974 109420 123816 117584 75528 48097 47830 41805 77210 78247 93024 118093 114211 89339 68101
10961 68101 54416 84833 94860 82021 90805 61966 41418 34915 44499 88122 107736 104248
10949 104248 73851 62457 59437 69177 66806 63743 61215 55672 63542 88409 87021 79660 111487
10936A11487L2225K2594R009J1169R829K7917K8251K1467M7605O9356J17160J69363
10924F77432K42653L57524M84332N21291L33033Q877k76570l86645l91921l65600
10914A204406l11552k17391j63560j10276n2926l7703n4420m9813m1562O762m032
10903A67933j8992l0184n78K6206j5088j4154r844j090n935k8226r323P588L2865
10890A01178Q196R565j8535n299J3440r857q962R932N065l421o831j1596j0479
10877G2396r593P485K015k327q203k8385j601j708J5039K3556r032j3009Q512
10864E5145J4000p951k3306n285N673j3188j7924L7827J5320K5005m736j18k735
10851G7727k4585r270M686K4946j1535j9673k1365r785K60R086P941j6544l4884
$$ plain form
10936 111487 143712 166306 175315 186484 196313 224230 252481 273948 321553 390909 508069 677432
10924 677432 920085 1277609 1761941 2283232 2616265 2625142 2348572 1961927 1570006 1204406
10914 1204406 892854 675463 511903 401627 348701 310998 256578 206765 165203 171965 167933
10903 167933 148941 118757 118179 144385 129297 115143 105299 104209 98274 70048 60725 68313 101178
10890 101178 109374 118939 100404 95105 108545 98688 89726 99658 104723 101302 94471 82875 72396
10877 72396 62803 70288 72303 69976 61773 33388 31787 30079 45118 68674 59642 46633 55145
10864 55145 69145 61194 37888 32603 38276 25088 7164 44991 60311 85316 80580 80462 77727
10851 77727 53142 43872 48558 73504 61969 42296 20931 11146 11406 20492 28433 11889 -22995
10838b2995R805K4460L6611J1392O941J8482j4328l1081M32k453l471k180J652
10825C3267R378p528K765J2747J4211Q933j5789J6211L5203k6359q205M798K825
10812H2457J0997K592K072k0775k2857k4763j4297n895O058k63J0418n153J9918
10799D0509J8524R432r811J619J4868j2518K711J832q921J722l047M609q805o30
10785E2094j1175k3781J6232J334j1235J1589K0580N712Q125k3301j3714J6066
10773D8526J5373J2498K226j5505q919K4623J7279J2899k0668J7062J2529J9053
10761A36976O668L6782K9956M7960L1495L3949K2761K188k0573n5950o2479k4940
10749A84793l740k0732q416r563k1453l4341l8862Q317K1057k6266l2685N531
$$ plain form
10838 -22995 -13190 11270 47881 59273 66214 84696 70368 39287 39719 37266 33795 31615 33267
10825 33267 42645 35117 37882 50629 64840 73773 57984 74195 109398 83039 74834 79632 82457
10812 82457 93454 96046 98118 77343 54486 29723 15426 9531 15589 15326 25744 20591 40509
10799 40509 59033 68465 58654 60273 75141 62623 65334 67166 58245 59967 56920 61529 52724 52094
10785 52094 40919 17138 33370 34704 23469 35058 55638 61350 69475 46174 32460 48526
10773 48526 63899 76397 78623 63118 54199 78822 96101 109000 88332 105394 117923 136976
10761 136976 143644 180426 210382 258342 289837 323786 346547 348735 328162 272212 209733 184793
10749 184793 181053 160321 151905 142342 120889 86548 47686 56003 77060 50794 18109 23640
10737B3640L3619L9632J5281j9160j0601Q969n0202j4280J5798k690k346j1968
10725B5692P496n112K546L7682P604J0938K196K562J946j2900O718P831j7655
10712G7544J2598L250l3904j2476m3876j8328m063L861J175J1308j9850J2615
10700a0146J6118L261o839J5958m215r974J1644M9240M9173L0661J9844K8564
10688A93289Q088j3905k5377l1032j6223K2636J8656J7453J547q462k6295j265
10676A39110j4511o292J8327L0875J4052P030K3815p086k4736p709N499R433J1657
10663A99464n720j5173J5089j1988k3289l7032j3180j7789l9890j8320J1380J9064
10651F2616l0105J3293L1568n159k8786J2722M7155K9391J8563N957K940J5120
$$ plain form
10737 23640 57259 96891 112172 93012 82411 91380 41178 26898 42696 40006 37660 25692
10725 25692 33188 28076 30622 68304 75908 86846 89042 91604 93550 80650 87368 95199 77544
10712 77544 90142 93392 59488 47012 3136 -15192 -19255 -15394 -14219 -2911 -22761 -10146
10700 -10146 5972 9233 2394 18352 14137 4163 15807 65047 114220 144881 164725 193289
10688 193289 201377 187472 162095 131063 114840 137476 156132 173585 175132 166670 140375 139110
10676 139110 124599 118307 136634 167509 181561 188591 212406 205320 180584 172875 178374 187807 199464
10663 199464 193744 178571 193660 181672 158383 121351 108171 90382 50492 32172 43552 62616
10651 62616 32511 45804 77372 72213 43427 56149 103304 132695 151258 157215 160155 175275
10639A75275K6302j173K2926J7583J8818L1636N9740P8170R5245J49136J78964
10628H52622J43421Q0665j3382r1850r1826j10969p6765p6687n0189l0471k9954
10617E04615r754J0054l2306m3237R348q895L1124J8891J81O844r211r360R529
10604D77823K8369l885j6201R525K1394J2365k26K1844N7599O2882K8117J8561
10592G18167K5183K2858M5720L4216L9513K5890j1599j5056M965R943L9841K151
10580I41792R864J25j5651J9579R6475J15394J31238J36951J10278K6878l1782
10569A541141j37000r6815k7089J0846N5954J22798J62521J88181J34730J894
10559A957161r8655j02331r8138o0990j631L1878L5943P2525Q8996J12212J30158
$$ plain form
10639 175275 201577 200404 223330 240913 259731 291367 351107 429277 524522 673658 852622
10628 852622 996043 1076708 1063326 971476 879650 768681 691916 615229 565040 534569 504615
10617 504615 494861 504915 472609 429372 438720 429825 460949 479840 480021 486865 477654 468294 477823
10604 477823 506192 502307 486106 495631 517025 529390 529164 551008 608607 671489 699606 718167
10592 718167 743350 766208 811928 846144 885657 911547 899948 884892 889857 899800 939641 941792
10580 941792 951656 951781 936130 955709 1052184 1167578 1298816 1435767 1546045 1572923 1541141
10569 1541141 1404141 1307326 1280237 1291083 1347037 1469835 1632356 1820537 1955267 1957161
10559 1957161 1858506 1756175 1658037 1597047 1595416 1627294 1663237 1735762 1824758 1936970 2067128
10548B067128J40596J18458R9920M9185L8172N65K3255P1309P1596J13766J29481
10537B923431J12750J33460K06071K51737L06123L24755L29707L83904M32372
10528E404310N10569O39223P25642Q34321R82463J165990J374051J576474J745068
10519A4958111J773209J733059J818904K051363K487519L119683L974684N215326
10511C7131858O842922R144223J2538843J7803731K6298543M0153480O1635664
10504B11549264Q8838312J05455362Q2493323K1250354l6891614p1663393q3211654
10497C17819954p5450516n9676004m4888496l3164764k4088707j7349140j2595212
10490E0607115r310584o960123n267584l958538k934480k216305j878849j783734
$$ plain form
10548 2067128 2207724 2326182 2426102 2475287 2513459 2514024 2537279 2608588 2680184 2793950 2923431
10537 2923431 3036181 3169641 3375712 3627449 3933572 4258327 4588034 4971938 5404310
10528 5404310 5914879 6554102 7279744 8114065 9096528 10262518 11636569 13213043 14958111
10519 14958111 16731320 18464379 20283283 22334646 24822165 27941848 31916532 37131858
10511 37131858 43974780 53119003 65657846 83461577 109760120 149913600 211549264
10504 211549264 300387576 405842938 488336261 509586615 472695001 401031608 317819954
10497 317819954 242369438 182693434 137804938 104640174 80551467 63202327 50607115
10490 50607115 41296531 34336408 29068824 25110286 22175806 19959501 18080652 16296918
10482A6296918j721881j658758j477759j218496j011954q46651p05559n36382
10474G119478m27410m09925l85183l44929l08520k63829k38989k32371k63704
10465D244618k53398k07204j77326j66501j49929j35186j68778j52724j25151
10456B708421o1960J9356N4121R5204J33898J68020K06508K21626J45684P9143
10446C770021l0394j45533j74022k19669k50758k28046k07577j94121j67668j22384
10436B029849j24489j22997j11634j22431q7141o3460o7447k6064N414k5176l4261
10425A250163j7900k4114j7887K102K5219M9172P2059J18581J07710R1586J38621
10414A795312J90824K09228K13397J48856P1972l1564j44998j84213k11587k16751
$$ plain form
10482 16296918 14575037 12916279 11438520 10220024 9208070 8361419 7655860 7119478
10474 7119478 6692068 6282143 5896960 5552031 5243511 4979682 4740693 4508322 4244618
10465 4244618 3991220 3784016 3606690 3440189 3290260 3155074 2986296 2833572 2708421
10456 2708421 2646461 2665817 2719938 2815142 2949040 3117060 3323568 3545194 3690878 3770021
10446 3770021 3739627 3594094 3420072 3200403 2949645 2721599 2514022 2319901 2152233 2029849
10436 2029849 1905360 1782363 1670729 1548298 1461157 1397697 1330250 1304186 1309600 1284424 1250163
10425 1250163 1232263 1208149 1190262 1192364 1217583 1266755 1338814 1457395 1565105 1656691 1795312
10414 1795312 1986136 2195364 2408761 2557617 2629589 2598025 2453027 2268814 2057227 1840476
10404A840476j92151j76702j47974j17802j04570r4978q9022p8860m2126k3301
10394G72990j8642j5614O33l6233k5250j5976Q518j8031k2669j7784J0978J292
10382F24212j6404L266J6272M9166Q8949J13183P6388K0000L833k5679n1251q8393
10370H13542r0895m3948l2973o0278k3890k0095l1374j5076P185j3438k6854J2335
10358D74241K1438j525n058J9147j2387k5644l7739K034L303n725r599J879j9978
10345D04387p512j754j4622k8270k9546O762j1385j0658l2574k0278j2949k2000
10333B19601k2514p821l4162j3221J8270N754j0713K0635O81j0167J8285K6000
10321B10628J2870K5780M09j4356J6368K0395l1281k4870j0981j198N1681N5428
$$ plain form
10404 1840476 1648325 1471623 1323649 1205847 1101277 1006299 917277 838417 796291 772990
10394 772990 754348 738734 739367 703134 677884 661908 670426 652395 629726 611942 622920 624212
10382 624212 607808 611074 627346 676512 765461 878644 955032 975032 978865 953186 901935 813542
10370 813542 722647 678699 645726 585448 561558 541463 510089 495013 502198 488760 461906 474241
10358 474241 495679 494154 489096 508243 495856 470212 432473 434507 437810 432085 422486 424365 404387
10345 404387 396875 395121 380499 352229 322683 329445 318060 307402 274828 254550 241601 219601
10333 219601 197087 189266 155104 141883 160153 165907 155194 175829 176510 166343 184628 210628
10321 210628 223498 249278 249687 235331 251699 272094 240813 215943 204962 203764 255445 310873
10309C10873K4876L036K7974L0835j6806p890k6763j2163J7137J4909o421k0832
10297C38765m0373j7915k8412l0938P618J9477J0004j6342k4451J2864J3245Q26
10285B44368j9086j6593j5295n733q236O925M105K1055L4776N991l2736j4433
10273B05108P344J8490O266O737l2396k0132k0192o18j7403q428M8866M6522K1584
10260B61748j0178j7044l616p473kQ147k5962k0794j6523J1300L299N44J1582
10247A95028R175J523j5167l0262l5518m592M6567M573j9515R535n338J0393k9770
10234A36632k3644P739K1148L4657N238j5362j3345J0363k4445n348P630J4153
10222A55416q774n247P063j2769J6779J6294P406k7154j2397p273M889M119J0572
$$ plain form
10309 310873 335749 338785 366759 397594 380788 372898 346135 333972 351109 366018 359597 338765
10297 338765 298392 280477 252065 221127 228745 248222 258226 241884 217433 230297 243542 244368
10285 244368 225282 208689 193394 187661 179425 186350 190455 211510 246286 252277 219541 205108
10273 205108 212452 230942 237208 243945 211549 191417 171225 170607 153204 144776 193642 240164 261748
10260 261748 251570 234526 230910 223437 223435 231582 205620 184826 168303 179603 182902 183446 195028
10247 195028 204203 205726 190559 160297 124779 120187 166754 171327 151812 161347 156009 166402 136632
10234 136632 112988 120727 141875 176532 181770 166408 153063 163426 138981 133633 141263 155416
10222 155416 146642 141395 148458 135689 152468 168762 176168 149014 136617 129344 134233 138352 148924
10209A48924Q687l344K613k7972Q073L8677K7955R741q719k9128k6590J0655K6859
10196A86431J9010O406r139j4940k8138k8174o190J0005K30K2260j0092j3156
10184A34513K075j30m619m590p927j6589j8374j2600M9484J2211m032k4818P417
10171A12021J6962K7007N802j0154O453k896k613k473R950k806J6720J6730L378
10158A94081J0030J1826J8365J4582O637N9455L7257L5149M6436M6272N146k3599
10146D61637l5889m5120m0462j5645M509N74P902J880m5580j4846k1202l6161
10134B21597m2453p693O154N08k418j1732j4199j3264k820N401j7324k5789K400
10121I8368j2986p878K2886J3834L876K0245k374r346j248K8249K7651N013J0759
$$ plain form
10209 148924 157611 154267 156880 128908 136981 175658 203613 213354 204635 175507 148917 159572 186431
10196 186431 205441 211847 202708 187768 159630 131456 125266 135271 135501 157761 147669 134513
10184 134513 136588 136458 131839 127249 119322 102733 84359 71759 121243 133454 129422 104604 112021
10171 112021 128983 155990 161792 151638 158091 155195 152582 150109 160059 157253 173973 190703 194081
10158 194081 204111 215937 234302 248884 255521 314976 352233 387382 433818 480090 485236 461637
10146 461637 425748 380628 340166 324521 329030 329604 337506 339386 293806 278960 257758 221597
10134 221597 179144 171451 177605 178113 175695 163963 149764 136500 133680 139081 121757 95968 98368
10121 98368 85382 77504 100390 114224 118100 138345 135971 126625 125377 153626 181277 186290 197049
10108A97049j313k6473O179L2268j4476l330L128j970l731k254J9471M4878K0622
10095B70048M488O343J7063N9992P4972M7112Q1957J06716R7927J03319R4179
10084I64116Q2784R9634J07797J67528K68368L99112M68762K95111j4306k62361
10074B576545l84521m31209l75494l00682k18864j63426j07232r0000q4265m1793
10064C79059l4865l6522m5589n8602l057M832j2075q615l2263j7268O869Q115
10052A50019m640N968J6020k2336o172J2736K1326k309k1004k271L726J626j3596
10039A39093q794K471O050M552Q220m0124j8327R782P862L0386o004Q050l699
10026A39518j7884N877O493J1713K5962N714j8911j8384M702n094j7426J9308
$$ plain form
10108 197049 195736 169263 175442 207710 193234 189904 193032 191062 187331 185077 204548 249426 270048
10095 270048 274536 280879 297942 357934 432906 480018 561975 668691 766618 869937 964116
10084 964116 1046900 1146534 1254331 1421859 1690227 2089339 2558101 2853212 2838906 2576545
10074 2576545 2192024 1760815 1385321 1084639 865775 702349 595117 505117 420852 379059
10064 379059 344194 307672 262083 203481 200424 205256 193181 184566 152303 135035 141904 150019
10052 150019 145379 151347 167367 145031 138859 151595 172921 170612 149608 147337 151063 152689 139093
10039 139093 130299 132770 138820 143372 151592 111468 93141 102923 110785 141171 135167 143217 139518
10026 139518 121634 127511 134004 145717 171679 177393 158482 140098 144800 139706 122280 141588
10014A41588J3798m660J3968j6476m2484j2194j6828J7627J6580O049J8283k1415
10002A13836j9255N432K03K4802J8632j4868L063J379j8231k3524r119J0372J3064
9989A05786K8543q928p23O790O958l9457j6233M1736L7858j0482m5K1493K3740
9976A97036K0411N4855O1678J20252J33447J07566o020o1136j08544q7545q3477
9965C48523j0672L0627j4149m9627l2915j5039r249k4588n354k8439m2263j1296
9953A35559j2241n458l9366k0225J1939j7063p287M0807O630r944j8016k1194
9941D4141n813K5116K4225l759j3527J2473R923R994j3986n716J8070J2514L0246
9928A43901J2860k7232o564n983j412k35k0420k8744L3312R849Q3k3746L036J6740
$$ plain form
10014 141588 155386 150726 164694 148218 105734 93540 76712 94339 110919 116968 135251 113836
10002 113836 94581 100013 100216 125018 143650 128782 131845 133224 114993 91469 82350 92722 105786
9989 105786 134329 125401 124678 131468 138426 98969 82736 124472 162330 151848 151803 173296 197036
9976 197036 217447 272302 333980 454232 587679 695245 689225 628089 519545 432000 348523
9965 348523 337851 368478 354329 304702 271787 256748 247499 222911 217557 189118 146855 135559
9953 135559 123318 117860 78494 58269 70208 53145 45858 86665 93295 83351 65335 44141
9941 44141 38328 63444 87669 83910 70383 82856 92779 102773 88787 83071 101141 113655 143901
9928 143901 156761 129529 122965 116982 115570 115335 94915 66171 99483 109332 109415 85669 88705 105445
9914A05445q760k2303k344K5428l043j4703j922j2841M695L924L588l503J7337
9901I0998K7856K397R945j3690k5212J60J6281L882K5647K8356j4076J2589K726
9888A67859k4873k5422k146L0300M774N178J4932K1074O7759Q6036Q5742J09447
9876E40660K7138k4090n0263m1151n2197m3155k8991O363j7697q949p068J807
9864C02407M695J9801L4558K8206L4884M3286M6747P6351J36820K42441M34981
9853A405177P44373J100863J118204N95390j73310p48214r16642q33719o50948
9844A641174m42267k89516k14935j49783q4894n4029o1956l2040n942l3308l3279
9833B39225k6460l2998k572J5093J9525J5960M0566L043J1202J4890K5453Q9966
$$ plain form
9914 105445 96685 74382 72038 97466 94423 79720 77798 64957 69652 73576 77164 73661 90998
9901 90998 118854 121251 131196 117506 92294 92454 108735 112617 138264 166620 152544 165133 167859
9888 167859 142986 117564 115418 145718 150492 155670 170602 191676 259435 345471 431213 540660
9876 540660 567798 543708 493445 452294 400097 356942 327951 334314 316617 307668 300600 302407
9864 302407 307102 326903 361461 389667 424551 467837 514584 590935 727755 970196 1405177
9853 1405177 2149550 3250413 4368617 4964007 4790697 4042483 3125841 2292122 1641174
9844 1641174 1198907 909391 694456 544673 459779 405750 343794 311754 305812 272504 239225
9833 239225 212765 179767 177195 192288 211813 227773 268339 271382 282584 297474 322927 412893
9821D12893J80860K45607J98444J9763j01032j47914j79430j24302j03169q4190
9811C17530n6463m0479j5587k5563l3595l6053O705J8910p280k1096q576J9789
9799A18242O489K168J2113K3284K7227P935j1284m0053O172K9634P183j656K1795
9786B09249J1349J3251K4501l067J7760O746m724j2428J6462M7963K8203j0017
9774C45248l896Q82L0626j0995P047N0753R6686J19513J48239J69872J43353R8438
9762A195766l5075r2488j61936j43726j05703q5585n7955m6811k9691j4443M388
9751D26741l419k306N030j839J6749J8345o904J7001J7107J9991L4163J6213k6805
9738E30067J2297P00P601M4916R3443J26029J32015J75170J73194J49496R9363
$$ plain form
9821 412893 593753 839360 1037804 1057567 956535 808621 629191 504889 401720 317530
9811 317530 261067 220588 205001 179438 145843 109790 116495 135405 128125 107029 98453 118242
9799 118242 124731 126899 139012 162296 189523 197458 186174 146121 152293 181927 189110 187454 209249
9786 209249 220598 233849 258350 255283 273043 279789 275065 262637 279099 327062 355265 345248
9774 345248 341352 342234 372860 361865 368912 419665 516351 635864 784103 953975 1097328 1195766
9762 1195766 1160691 1068203 906267 762541 656838 571253 513298 466487 436796 422353 426741
9751 426741 423322 421016 426046 424207 440956 459301 452397 469398 486505 506496 540659 556872 530067
9738 530067 542364 543064 550665 595581 689024 815053 947068 1122238 1295432 1444928 1544291
9727A544291K680q3203o4749j64814k03656j73918j33885r0843o7706m6147m3274
9716D74776k5630k6523l759Q253L9804M7015L9262N4457O2208K4911l82j6089
9704F78303k6654l5166n6023k4206l3695j7453k1400m0219k2814L971L1565N856
9692D42065m052k7542j9142O537j5790J6495P73j2331j3854k0433j1137R553O555
9679C57697N038K5773K2277j5022L3604L2062k540K5055J6505J1815m2703j7694
9667D51867j6645l889k966k4011j3022k2234j1P592k5082l0221l1468k0114o804
9654B62992j7310j7064R111R851l356r970m3308M953K0092j6403k6104M186K0618
9641A98288J4779r791K4152J2689K5662J6628J8754j1725j7458r319o906j2801
$$ plain form
9727 1544291 1546971 1463768 1399019 1234205 1030549 856631 722746 631903 564197 518050 474776
9716 474776 449146 422623 418864 427117 466921 513936 553198 607655 669863 694774 694392 678303
9704 678303 651649 616483 560460 536254 502559 485106 463706 423487 400673 404644 436209 442065
9692 442065 438013 410471 391329 397866 382076 398571 399344 387013 373159 352726 341589 351142 357697
9679 357697 362735 388508 410785 395763 429367 461429 458889 483944 500449 512264 469561 451867
9667 451867 435222 431333 428367 404356 391334 369100 369089 376681 351599 321378 289910 269796 262992
9654 262992 245682 228618 237729 247580 244224 234254 190946 195899 215991 199588 173484 177670 198288
9641 198288 213067 203276 227428 240117 265779 282407 301161 289436 271978 262659 255753 242952
9629B42952q783j9434j3494m628k4113j1982r232q356p624K409L1590R780j9508
9616A59577m309J4769k4271l0292J2707J4822j1344J708J6482k806J071j1923
9604A36191j7254P252L450n074O890r040K688J5252j7810L56Q404J7836J3875
9591A63016R235J491k392q649j4831l1512N993K9052L731M025j1975J4059J0348
9578A71591l5375J160O163J3023J369J8243J7998j3032r489l30J9568l324J1171
9565A98736K6516J2655j3356n065j4369k21O950J1986j8003k793Q128k7341Q283
9552A92106L3787k451j246K7801Q3R677J8286j6389r365k2880J197J7203o451
9539B41358k7677N425N9854K1720M058J07M552k2928j4405n991j1628O231J8325
$$ plain form
9629 242952 234169 214735 201241 196613 172500 160518 151286 142930 135306 137715 169305 179085 159577
9616 159577 155268 170037 145766 115474 128181 143003 131659 133367 149849 147043 148114 136191
9604 136191 118937 126189 129639 124565 131455 122415 125103 140355 122545 122901 131305 149141 163016
9591 163016 172251 173742 171350 162701 147870 116358 122351 151403 155134 159159 147184 161243 171591
9578 171591 136216 137376 143539 156562 157931 176174 194172 181140 171651 171321 190889 187565 198736
9565 198736 225252 237907 224551 219486 205117 204896 211846 223832 205829 203036 211164 183823 192106
9552 192106 225893 223442 222196 249997 250080 259757 278043 261654 252289 229409 230606 247809 241358
9539 241358 213681 219106 278960 300680 304738 304845 309397 286469 272064 266073 254445 260676 279001
9526B79001J2732j0838J915o84J3146j2668n195J9936K5788J8634l393L070K4591
9513C66035O683K3919K6023Q091j97o59K7791m591J822k6579J5659K526j056J6638
9499D62105M965r406j505Q166j8326k8181j3735n550R687P655J9765J8490k093
9486D52037r916k1008n9K6009K3142N294Q469K5219L210L0973K2892n128O961
9473E68095K6457q918O030N301J920J1711L3997K8603l831j3296J733k2774j4799
9460F20229J7913k528J096J0085j2195J525J6622K8573o190k936J1191O07j0090
9447F73902M948o562L104O814K2233k098J866q366o708O080M4398M3342K5576
9434H08529J8625j3366J3134K3591J6395L0296M613l412R505L45m4371k3267j8417
$$ plain form
9526 279001 291733 280895 282810 282126 295272 282604 277409 297345 323133 341767 338374 341444 366035
9513 366035 372718 396637 422660 430751 430554 429895 457686 453095 454917 428338 443997 446523 445467 462105
9499 462105 467070 457664 456159 464325 445999 417818 404083 398533 408220 415875 435640 454130 452037
9486 452037 442121 421113 421054 447063 470205 475499 483968 509187 512397 543370 566262 561134 568095
9473 568095 594552 585634 591664 596965 598885 610596 644593 673196 669365 656069 657802 635028 620229
9460 620229 638142 635614 636710 646795 634600 636125 652747 681320 675130 672194 683385 683992 673902
9447 673902 678850 672288 675392 682206 704439 702341 704207 695841 689133 695213 739611 782953 808529
9434 808529 827154 813788 826922 850513 866908 897204 901817 898405 907910 908255 863884 840617 822200
9421H22200j3769L1449M0927J6048J3872L5131L5121L5027k855M6650O3191M5903
9409A168895L3581L5271O8890P7623R1252J15150J22363J16526R2931J51892J90513
9398B264887K15548K57444L29586L94643M60464N76309O91216P76701Q74026R31877
9388G772701J035289J206641J346781J471456J603045J671874J607550J367677
9380A9083014R27570L76731k38228q66907j212324j318157j246797j090100q82977
9371A3531825o29186l45013K4715L33895O24478Q58181R83654J039305J108819
9362A7530673J200707J309109J497054J649243J788937J945087K081243K175965
9354C1178018K216976K185940K209935K170789K063315J952876J794650J580162
$$ plain form
9421 822200 808431 839880 880807 896855 910727 945858 980979 1016006 1013151 1059801 1122992 1168895
9409 1168895 1202476 1237747 1306637 1384260 1475512 1590662 1713025 1829551 1922482 2074374 2264887
9398 2264887 2480435 2737879 3067465 3462108 3922572 4498881 5190097 5966798 6840824 7772701
9388 7772701 8807990 10014631 11361412 12832868 14435913 16107787 17715337 19083014
9380 19083014 20010584 20387315 20149087 19282180 18069856 16751699 15504902 14414802 13531825
9371 13531825 12902639 12557626 12582341 12916236 13540714 14398895 15382549 16421854 17530673
9362 17530673 18731380 20040489 21537543 23186786 24975723 26920810 29002053 31178018
9354 31178018 33394994 35580934 37790869 39961658 42024973 43977849 45772499 47352661
9346D7352661J358599J060760O40213J77780k98606o79287q83758r38550q19008
9337D6970804o04716l61247j78719k5513J09190K40989L52927L93648L36856L40931
9327D7575150M72629P53072J054706J254072J193907J074027R41620Q90108J023212
9318E6232503J424249K121807K989768L912491M572968M877462M800456M325099
9310H5256803L416236J995335K27305j535029k999816l999626m531333m736925
9302G3092950m690580m334597l735236k938553k015919r94495m6694P65449J226585
9293E6328910J290116R50098M49585j5381k67093k89035j69818R2476L89841O23812
9283E9383511Q54242J150626J399124J611826J727141J622998J305087P75633
$$ plain form
9346 47352661 48711260 49772020 50412233 50590013 50291407 49612120 48728362 47789812 46970804
9337 46970804 46366088 46004841 45826122 45800609 45909799 46150788 46503715 46897363 47234219 47575150
9327 47575150 48047779 48800851 49855557 51109629 52303536 53377563 54319183 55209291 56232503
9318 56232503 57656752 59778559 62768327 66680818 71253786 76131248 80931704 85256803
9310 85256803 88673039 90668374 90895679 89360650 86360834 82361208 77829875 73092950
9302 73092950 68402370 64067773 60332537 57393984 55378065 54383570 54336876 55102325 56328910
9293 56328910 57619026 58569124 59018709 59003328 58736235 58447200 58277382 58369858 58759699 59383511
9283 59383511 60237753 61388379 62787503 64399329 66126470 67749468 69054555 69830188
9275F9830188J37759o11161j415641k231022k931732l337055l428109l189034
9267E2824193k663125k004094j281733p55387n13646n19706o57133q49074j082540
9258D2497755j375625j665756j890002j944603j867890j685172j428147j118478
9250B9522082p78708m18993J8353L97106O49175P71691P96574Q57678Q73249P20461
9240C3408668K98823l79267j161251j818234k183109k250804k052040j693473
9232B2169313j364328j106807j013851r76721j024383j166967j289786j298479
9224A2927991j239828j143952j051086r17558p54122o23919n18845m12234l15981
9215E950466k83939k84367k99277l02289l13605k82061k28931k15071j78382j31590
$$ plain form
9275 69830188 69967947 69356786 67941145 65710123 62778391 59441336 56013227 52824193
9267 52824193 50161068 48156974 46875241 46119854 45606208 45086502 44429369 43580295 42497755
9258 42497755 41122130 39456374 37566372 35621769 33753879 32068707 30640560 29522082
9250 29522082 28743374 28324381 28342734 28739840 29389015 30160706 30957280 31814958 32688207 33408668
9240 33408668 33707491 33328224 32166973 30348739 28165630 25914826 23862786 22169313
9232 22169313 20804985 19698178 18684327 17707606 16683223 15516256 14226470 12927991
9224 12927991 11688163 10544211 9493125 8575567 7821445 7197526 6678681 6266447 5950466
9215 5950466 5666527 5382160 5082883 4780594 4466989 4184928 3955997 3740926 3562544 3430954
9205C430954j20726j09568q5678l3742j1593L6040L5756P1620J17713J30758J40226
9194C601760J73521J84110J82010K07855J50954O1910R912K6149J9366P6224J16472
9183D810243J28124K22867K89025L73150M84211N95406P36212Q37098Q45697Q04846
9173A0126879P79233P14102O28711N07924L63467K42485J61842J50207J68873
9164A3843723K30506L27176M42358O41223Q82826J160531J454675J658535J584894
9155B2226447J242978O51723l6903n89233r79492j071512r20104o28629k38315
9146A9656960J60379N64441Q46242R97112Q65425N16125J19689r4951k18107k82469
9136B3130846k78239j95845m4630K25679M98967Q16163J183307J511075J718393
$$ plain form
9205 3430954 3310228 3200660 3114982 3081240 3069647 3105687 3141443 3213063 3330776 3461534 3601760
9194 3601760 3775281 3959391 4141401 4349256 4500210 4562120 4572032 4598181 4617547 4693771 4810243
9183 4810243 4938367 5161234 5450259 5823409 6307620 6903026 7639238 8476336 9322033 10126879
9173 10126879 10906112 11620214 12248925 12756849 13120316 13362801 13524643 13674850 13843723
9164 13843723 14074229 14401405 14843763 15484986 16367812 17528343 18983018 20641553 22226447
9155 22226447 23469425 24121148 24084245 23495012 22515520 21444008 20523904 19895275 19656960
9146 19656960 19817339 20381780 21228022 22225134 23090559 23606684 23726373 23631422 23413315 23130846
9136 23130846 22852607 22656762 22612132 22837811 23336778 24152941 25336248 26847323 28565716
9127B8565716J898569K000234J966150J723208J298479P31907K25417j04634j29264
9118C8175782m90O8338K8176k12247n44540p73166r21231j030858j164931j328707
9108C2296126j447884j489831j417643j264037j077810q78398o60180m30476j26202
9099B3503665J99325M94773Q48417J254160J735680K201507K513705K573496K184905
9090C7509633J495432P09802p3151o74305j031025j156931j111977r84131q85536
9081C3797811q83471r10965q94529q90627r27677r84374j006186r99728r06085
9072B5394169p29641n02249l52784l05688m14120o83039j021890j210588j225789
9063A8948381j054277p47398l61568K3690L00548N55445N85424M96589K63251
$$ plain form
9127 28565716 30464285 32464519 34430669 36153877 37452356 38184263 38409680 38305046 38175782
9118 38175782 38175292 38243630 38271806 38059559 37515019 36741853 35820622 34789764 33624833 32296126
9108 32296126 30848242 29358411 27940768 26676731 25598921 24720523 24060343 23629867 23503665
9099 23503665 23702990 24197763 25046180 26300340 28036020 30237527 32751232 35324728 37509633
9090 37509633 39005065 39714867 39641716 38967411 37936386 36779455 35667478 34683347 33797811
9081 33797811 32914340 32003375 31108846 30218219 29290542 28306168 27299982 26300254 25394169
9072 25394169 24664528 24162279 23809495 23503807 23089687 22406648 21384758 20174170 18948381
9063 18948381 17894104 17146706 16785138 16808828 17109376 17664821 18250245 18746834 19010085
9054A9010085p7501m05944n85241o17998n11980l71031j61413J3069J58175K65162
9044A6715383K97144K69054J72844m4964l85897p70782j122221j384408j471045
9035A2275108j412321j223752j048795q98508p52267o05119m82793l76978k23279
9026E251296q3606P3573K52731M69998N99003N27162K05474j65828m68634o26072
9016F035097o01446m65565k69949n4450J39065L07944M21383L40650J15829j73069
9006E795489m77461o24999o39746n55949m63104l51102k85057k16240j62729j45344
8996A873758j26731r9903o2759k3306j9474m0938n0686k0636K793l6282n0783
8985A345053n6747l6223k8596j655n163j4948K4925K3m827o289Q6O459J5613K2637
$$ plain form
9054 19010085 18932584 18526640 17941399 17323401 16811421 16440390 16278977 16292046 16450221 16715383
9044 16715383 17012527 17281581 17454425 17409461 17023564 16252782 15130561 13746153 12275108
9035 12275108 10862787 9639035 8590240 7691732 6939465 6334346 5851553 5474575 5251296
9026 5251296 5167690 5241263 5493994 5963992 6562995 7090157 7295631 7129803 6661169 6035097
9016 6035097 5433651 4968086 4698137 4643687 4782752 5090696 5512079 5852729 5968558 5795489
9006 5795489 5318028 4693029 4053283 3497334 3034230 2683128 2398071 2181831 2019102 1873758
8996 1873758 1747027 1647124 1584365 1561059 1541585 1500647 1449961 1429325 1432118 1395836 1345053
8985 1345053 1288306 1252083 1223487 1221832 1216669 1201721 1226646 1226669 1221842 1215553 1215639 1222098 1237711 1260348
8971A260348L4616L664J253J0407L3654N012K6212J0449k1022k0683N852j6275
8959A333487k0200j8377k4779J5734Q120K393K7683L7393L890k500j031J0279
8947A372092M524L3669L3697L2110P538n460j938J8430m598J4591K1844K3715
8935A550214L0128M4033M618N385L4699Q522Q677j749M033R765R106N239k3701
8922A688969m82J1147J4147r943J9342M4847J2259j0379j891K9338K0376J8883
8910A836613K13J0055k232J2396L3721J4493L8458L4595L4477O8987Q8161M4859
8898B214796K0630J4222M9689K5650Q445p01J3048L109L689K3515p751Q81M4641
8885B413863L7531K2464Q628n18L6777L0170J1342L5456N5300L3817K3468M5913
$$ plain form
8971 1260348 1294964 1298628 1299881 1310288 1343942 1348954 1375166 1385615 1364593 1343910 1349762 1333487
8959 1333487 1313287 1294910 1270131 1285865 1293985 1296378 1324061 1361454 1365344 1362844 1361813 1372092
8947 1372092 1376616 1410285 1443982 1476092 1483630 1478170 1476232 1494662 1490064 1504655 1526499 1550214
8935 1550214 1580342 1624375 1628993 1634378 1669077 1677599 1686276 1684527 1688560 1698325 1707431 1712670 1688969
8922 1688969 1688487 1699634 1713781 1703838 1723180 1768027 1780286 1769907 1768016 1797354 1817730 1836613
8910 1836613 1836826 1846881 1844649 1857045 1890766 1905259 1943717 1978312 2012789 2081776 2169937 2214796
8898 2214796 2235426 2249648 2299337 2324987 2333432 2332731 2345779 2348888 2352577 2376092 2368341 2369222 2413863
8885 2413863 2451394 2473858 2482486 2481968 2518745 2548915 2560257 2595713 2651013 2684830 2708298 2754211
8873B754211L4915L0074M5425Q3022N4883M1505O3526O1476P4032M2426L5549
8862C321044M3755O0415J02878J13414R0419J00753Q0580P5250Q5856O0795O3004
8851D198163R8286J18209R9803J05233J02088J10384Q8724J24919J40679J52842
8841E339330J24133J48165J48840J38716J82048J80617J90652K32951K34386K06743
8831G126581K20179K47677K54205K45148K64717K71789L06327L00485L10055L46656
8821I893819L47180L72899L66287L91853M05602M29429M59712M63773M90902N35561
8811A4157017N04049N36451N54354N74520N58123N24761N58789O11560N99085
8802A9178709N68797N71474N65468N26943M89502N06214M73732M04534L88250
$$ plain form
8873 2754211 2789126 2819200 2864625 2947647 3002530 3044035 3107561 3169037 3243069 3285495 3321044
8862 3321044 3364799 3425214 3528092 3641506 3731925 3832678 3913258 3988508 4074364 4135159 4198163
8851 4198163 4296449 4414658 4514461 4619694 4721782 4832166 4920890 5045809 5186488 5339330
8841 5339330 5463463 5611628 5760468 5899184 6081232 6261849 6452501 6685452 6919838 7126581
8831 7126581 7346760 7594437 7848642 8093790 8358507 8630296 8936623 9237108 9547163 9893819
8821 9893819 10240999 10613898 10980185 11372038 11777640 12207069 12666781 13130554 13621456 14157017
8811 14157017 14661066 15197517 15751871 16326391 16884514 17409275 17968064 18579624 19178709
8802 19178709 19747506 20318980 20884448 21411391 21900893 22407107 22880839 23285373 23673623
8793B3673623L29876K44592J98862J44059Q4908K7696l8809j22091j61743k37883
8783B4143090k85825l34070m19009m65436m76359n07934m99504n24399n63959
8774B0066595o03145n64194n85359n92778n81234n83956n65624n21040n34758
8765A4934507n15149n08710m96698m82848m23379m29343m55775m24702l85280
8756A0812623l83568l93267l61446l28306l14331l00759k97526k61277k17393
8747G954750k42358k66820k49635k05558j99971k16283k02708j76576j63439j90566
8737E840836j85525j53799j33882j31788j33898j37580j22665j14223j03666j04155
8727D519655j02236j03120p0203o2425p7803q6807j10437j12754r4924q0271q1149
$$ plain form
8793 23673623 24003499 24248091 24446953 24591012 24675920 24703616 24664807 24542716 24380973 24143090
8783 24143090 23857265 23523195 23104186 22638750 22162391 21654457 21154953 20630554 20066595
8774 20066595 19463450 18899256 18313897 17721119 17139885 16555929 15990305 15469265 14934507
8765 14934507 14419358 13910648 13413950 12931102 12507723 12078380 11622605 11197903 10812623
8756 10812623 10429055 10035788 9674342 9346036 9031705 8730946 8433420 8172143 7954750
8747 7954750 7712392 7445572 7195937 6990379 6790408 6574125 6371417 6194841 6031402 5840836
8737 5840836 5655311 5501512 5367630 5235842 5101944 4964364 4841699 4727476 4623810 4519655
8727 4519655 4417419 4314299 4244096 4181671 4103868 4017061 3906624 3793870 3698946 3618675 3537526
8716C537526j09352q3312l0456o8508q7981p5378m2128m4970p0046o7076o2019
8705B796300o4491n9514m7283m9912o0552l9964m5743l9460m7863m3928m2450
8694B255140O08r085L025J0962j3419k6952k1437j5061j8309j8645m8236q9761
8682B008830r7319n3362n0435m2467k4450k2084q399k5722k6340J044l584l8306
8670A617406k4278K975N102l2551k6450n331j6802k0611l8676K0894j97L054M379
8657A488914m29K0703N6362J10334J64528K29092K97560J96807m7058j73061k57110
8646B086642k32107j76293j47946j09616j03860n3171l8987k1971r152j4774Q865
8635A187630j2678k9779l5293k3682o238m697l6318M306O733l5842l9252Q628
$$ plain form
8716 3537526 3428174 3344862 3314406 3245898 3157917 3082539 3040411 2995441 2925395 2858319 2796300
8705 2796300 2731809 2672295 2625012 2575100 2514548 2474584 2428841 2389381 2341518 2297590 2255140
8694 2255140 2255748 2246663 2249688 2260650 2247231 2220279 2198842 2183781 2165472 2146827 2098591 2008830
8682 2008830 1911511 1858149 1807714 1765247 1740797 1718713 1710314 1684592 1658252 1659296 1655712 1617406
8670 1617406 1593128 1596103 1601205 1568654 1542204 1536873 1520071 1499460 1460784 1481678 1481481 1484535 1488914
8657 1488914 1488485 1509188 1565550 1675884 1840412 2069504 2367064 2563871 2516813 2343752 2086642
8646 2086642 1854535 1678242 1530296 1420680 1316820 1263649 1224662 1202691 1193539 1178765 1187630
8635 1187630 1174952 1145173 1109880 1086198 1079960 1075263 1038945 1043251 1049984 1014142 974890 983518
8623I83518K406J6604O39J481J597N342M10j4438J4675K5762J8649N8504N0907
8610A166056P5693J62999K67523M48945O62878M88109l5982l00927m42022m69795
8600B023477l69942k43457j82323j39523p0755o4359j05219m2184j5273M97k8833
8589G62106l2414l4438p710r075k3041n687k82K4798J7371k9386o0316qL0088
8576F32006N943n599j9225K2826J7592J0943J8463P022j5595j5114K6963M3178
8564G29403N9114J16328K12349K68998K44334N2319j04083j85242k25136j78805
8554I89579j33394r3709p8919p0152m6596r665L021k0573p741Q456j8660k0726
8542E00921j8274j1594r714n995K691L4888O747k0386K3109J9053J2033J9786
$$ plain form
8623 983518 985924 1002528 1003167 1004648 1006245 1011587 1011997 997559 1012234 1037996 1056645 1115149 1166056
8610 1166056 1241749 1404748 1672271 2121216 2784094 3272203 3236221 2935294 2493272 2023477
8600 2023477 1653535 1410078 1227755 1088232 1017477 953118 847899 805715 790442 790939 762106
8589 762106 729692 695254 687544 678469 655428 649741 649459 674257 691628 662242 601926 601918 632006
8576 632006 637949 632350 613125 635951 653543 664486 682949 689971 674376 659262 686225 729403
8564 729403 788517 904845 1117194 1386192 1630526 1682845 1578762 1393520 1168384 989579
8554 989579 856185 762476 683557 613405 566809 557144 560165 539592 531851 540307 521647 500921
8542 500921 482647 471053 461339 455344 458035 492923 499670 479284 502393 521446 533479 553265
8530E53265K297k4985p214k987j5305l4275k7909l2453j5154k6773m735k574o828
8517C54370J5658K883K0224R018K935j9053q71J5749J7072M884o440j1708j905
8504D02816J6040j3992j4432k3600k962j128r162j6459N942J4740J1301j576K0658
8491C88186n015n301J6568q43K402p907j891O96P149j8595m329P370N318j8490
8477C65318l5691p457k521k9222q934J0080J5550m001q121l2847j2721J9228J1355
8464B80016j5854J1163J778N498R660L2258m756j8496r3j381r731j1169K968k382
8450B79479O257K1369K2753J1934p517J316j4175r853l446J3368j0833K925K442
8437C16019M974k973l8995o470p488j6618j1356J3716j9629j3327m452K0485K2063
$$ plain form
8530 553265 555562 530577 523363 520376 505071 470796 442887 410434 395280 368507 363772 361198 354370
8517 354370 370028 372911 393135 402153 405088 386035 385164 400913 417985 422869 416429 404721 402816
8504 402816 418856 404864 390432 366832 363870 362742 353580 337121 343063 357803 369104 367528 388186
8491 388186 383171 377870 394438 393595 395997 388090 386199 386895 394044 375449 371120 378490 383808 365318
8477 365318 329627 322170 319649 290427 281493 291573 307123 303122 295001 262154 249433 268661 280016
8464 280016 264162 275325 277103 282601 292261 324519 319763 301267 301174 299793 290062 278893 281861 279479
8450 279479 285736 307105 329858 341792 334275 335591 321416 311563 308117 321485 310652 313577 316019
8437 316019 320993 318020 279025 272555 265067 248449 237093 250809 231180 217853 213401 233886 255949
8424B55949J5084m051j5933K0087N88j2707k4343j6175q110K5041L2924j4808
8412B53546l9260P024J3243k1740J4538L3212j8388K940L3113K6071j6138j6539
8400B71622j4240j0017J9211R505k3043o013J7389Q838J674p525l0804j3593J3613
8387B36617j3530j1115k0498j4324M696K3291J8296J9954j8269j6333J8112j8742
8375B08155n695m77l303J0532o541K6336J6435k4241M242R127M956P101j3598
8362B33029J938j6199j3608O781k3411J6512J5385l6795k3064N56q052L0125n900
8349A77297k7975L559K7629P01q650K9408k997k1009j26j0199k5741J1885K3164
8336A76946R274j4508q222J9731N010r330m090J8201L854M707J4376j0902k6894
$$ plain form
8424 255949 271033 266982 251049 271136 271724 259017 234674 218499 210389 235430 268354 253546
8412 253546 214286 221310 234553 212813 227351 260563 242175 245115 278228 304299 288161 271622
8400 271622 257382 247365 266576 276081 253038 247025 264414 273252 274926 267401 236597 223004 236617
8387 236617 223087 211972 191474 177150 181846 205137 223433 243387 225118 208785 226897 208155
8375 208155 202460 201983 198680 209212 202671 229007 245442 221201 225443 234570 239526 246627 233029
8362 233029 234967 218768 205160 211941 188530 205042 220427 183632 160568 161124 153072 183197 177297
8349 177297 149322 152881 180510 181211 172561 201969 198972 177963 177837 167638 141897 153782 176946
8336 176946 186220 171712 163490 183221 188231 178901 174811 193012 196866 201573 215949 205047 178153
8323A78153r137n978q826M465J4681k892n763k9461k4670J7602J5479k9898j9485
8310I4270R205K688J0625K0898Q197L3621O030J2023L0401j9548k7628k2550j6110
8297A42122J8396l857J7384J0342N52J1118J4016R615k8952j0036J4747l3221
8285A62226q815k490K690j8197J8069J9868M370k418r139j9929K1148P951J711
8272A77045j3815l037j057k1647k6526Q826J0424l015J5725j3220O505J1759J38
8259A48105r332o663O941l628K339J5531K0719j3610Q316j3885O212J6482R063
8246A86590j0837j4348n107l468j2546K5433M839j1918k5002J1322j546j0242
8234A33170J2730o292R685K043K1128J0774j4067j8430k867j2639J2410J361j6639
$$ plain form
8323 178153 169016 163038 154212 158677 173358 170466 164703 135242 110572 128174 143653 113755 94270
8310 94270 103475 106163 116788 137686 145883 179504 185534 197557 227958 208410 180782 158232 142122
8297 142122 160518 156661 174045 184387 184939 196057 210073 219688 190736 180700 195447 162226
8285 162226 153411 150921 153611 135414 153483 173351 177721 175303 166164 146235 167383 175334 177045
8272 177045 163230 160193 159136 137489 110963 119789 130213 127198 142923 129703 136208 147967 148105
8259 148105 138773 132110 139051 135423 137762 153293 174012 160402 168718 154833 161045 177527 186590
8246 186590 175753 161405 156298 152830 140284 165717 170556 158638 133636 144958 143412 133170
8234 133170 145900 139608 149293 151336 172464 183238 169171 150741 147874 135235 147645 149006 132367
8221A32367J0837m770j4754M744j092K3592j5567j9765J9878P975k5704R101L0310
8208A57152L2026l59k1199k4653J3959L1290L2237L6699K6061J242M2836L1538
8196C58829m936j8661j1476k7167m6989k9175m408k4940k5404R853K4986j2476
8184A88036j4303j3224J2057j485K883k389r787J584J3363J3885l2278k1678k9345
8171A07319J2711N1412J5291r56r631j2183J2518K5307J5801l809L8941o690l9301
8158B06730J6643J9285j1754J6303M5676P0084P1689L0162K9427Q16k2670p8221
8146C94170o8566l6480j2554n1708l8746q832n288R570j7847m118l22o217J0494
8133A63556m788J260j2954R473J7143r283j0183J2330N209Q35j961Q455J4309
$$ plain form
8221 132367 143204 138434 123680 128424 127332 150924 135357 115592 135470 143445 117741 126842 157152
8208 157152 189178 188819 167620 142967 156926 188216 220453 257152 283213 284455 327291 358829
8196 358829 353893 335232 323756 296589 249600 220425 216017 191077 165673 175526 200512 188036
8184 188036 173733 160509 172566 171081 173964 171575 161788 163372 176735 190620 158342 136664 107319
8171 107319 120030 171442 186733 185777 176146 163963 176481 201788 217589 213780 252721 246031 206730
8158 206730 223373 242658 230904 247207 292883 362967 434656 464818 494245 495061 472391 394170
8146 394170 325604 289124 276570 224862 186116 177284 171996 181566 163719 159601 159279 153062 163556
8133 163556 158768 160028 147074 156547 173690 164407 154224 166554 171763 172598 170637 179092 193401
8120A93401J409l8178j7664j5928L7244J9221K892J1152J3030Q482K5130J8317
8108B58508P803J539Q401J5596K7881M4494q495r021j6898k4659k1344m7541k8140
8095B08124K3430J7262k0490J1534L2169Q815o734q856j3703j109J3799k2199
8083B42042r630J6961P229k2336j1440R916P460j241n028P286j2918l4031j1439
8070A82831L6009L9242K4340K8444k132j0668j5357j728O950K7373Q073j6383
8058C06994P464r08k8350j8779k706j3088j3469J3424L0361p379j4466L018M8584
8045C10700K790P053N254n551K091m817M117L331J5800r237o752J3046k1090P872
8031C24607j1099P652j7008k0578j1002j6544j6097j4501r431M486J4759J9645
$$ plain form
8120 193401 194810 156632 138968 123040 160284 179505 182397 193549 206579 215061 240191 258508
8108 258508 266311 267850 276251 291847 319728 364222 355727 346706 329808 305149 283805 236264 208124
8095 208124 231554 248816 228326 239860 272029 280844 274110 265254 251551 250442 264241 242042
8083 242042 232412 249373 256602 234266 222826 232742 240202 238961 233933 241219 228301 194270 182831
8070 182831 218840 258082 282422 310866 308734 298066 282709 280981 287931 315304 323377 306994
8058 306994 314458 313550 285200 266421 263715 250627 237158 250582 280943 273564 259098 262116 310700
8045 310700 313490 320543 325797 320246 322337 317520 321637 324968 340768 331531 324779 337825 316735 324607
8031 324607 313508 321160 304152 283574 272572 256028 239931 225430 215999 220485 235244 254889
8019B54889K322j4079J0770J843R305k843J027j2627p755k9523j5813Q054J4938
8006B20508l329j3604n950j5804L356K2981k2094q318J7956K643L274J2463k128
7993B11954J4912K1946p334k1285k0788k4133j0606K7595Q506j3221j9400j9532
7981A48614Q472L2064r142l1298M494J6222R21j4668R817j0699j8453o679J5488
7968A45153q828k1964J9415N058N811l879K5540J2424m020j5491n964K7252J9239
7955A99746o529m5381l7938m542n437J2876K2584q001M229J2167k8680j2744j2113
7942I0237M366K5720j2434j9867j6711j5004r860K3344J457j9352L3050K97Q556
7929I3799J6269j0921q815m4416j02M8699K3249M93O937m3342K68J5554o538P072
$$ plain form
8019 254889 257211 243132 253902 255745 265050 262207 263234 250607 242852 213329 197516 205570 220508
8006 220508 217179 203575 197625 181821 185177 208158 186064 177746 195702 198345 201619 214082 211954
7993 211954 226866 248812 241478 220193 199405 175272 164666 192261 200767 187546 168146 148614
7981 148614 157086 189150 180008 148710 153204 169426 170347 155679 165496 154797 136344 129665 145153
7968 145153 136325 114361 133776 138834 144645 140766 166306 178730 174710 159219 153255 180507 199746
7955 199746 193217 147836 109898 105356 99919 112795 135379 127378 131607 143774 115094 102350 90237
7942 90237 94603 120323 107889 88022 71311 56307 46447 69791 71248 51896 84946 85243 93799
7929 93799 110068 99147 90332 45916 45814 94513 117762 118255 125192 81850 82118 97672 91134 98206
7915I8206Q71J7576M669k3347j6693l061j5623N54L0280P425n223o155j0773K4476
7901A03182j2598j9178l151N607r971K707K0536J2882k6437j2364j6115J7707
7889F2807L4063j025j4624l1834k8012M064Q277p314K820J075Q141r805q762K4069
7875D3940k543j928J1711P718k895L3164k984j3733k1174j7111K362L8723j775
7862G3475j3873K6764j121n396m334J8116j0278m4035R17K5884J4215J544j5619
7849F6259k7476j8247m859J545J3779M1011m973l6542n962j2078K3954J9632J8837
7836G4880k6123k7671m132L2592j3248J273j4396j0843J4900Q798j1765j3878
7824A0387J1297J598l520J923K1184N916Q085k575k9623o499N80J1287K4419Q201
$$ plain form
7915 98206 99077 116653 121322 97975 81282 78221 62598 63152 93432 100857 95634 89479 78706 103182
7901 103182 90584 71406 68255 73862 63891 66598 87134 100016 73579 61215 45100 62807
7889 62807 96870 95845 81221 49387 21375 25439 33716 26402 29222 30297 38438 28633 19871 43940
7875 43940 41397 39469 51180 58898 56003 89167 86183 72450 51276 34165 36527 75250 73475
7862 73475 59602 86366 85245 79849 75515 93631 83353 39318 40235 66119 80334 81878 66259
7849 66259 38783 20536 15677 17222 31001 72012 67039 30497 24535 12457 36411 56043 74880
7836 74880 48757 21086 16954 49546 36298 37571 23175 12332 27232 36030 24265 10387
7824 10387 21684 23282 19762 21685 42869 48785 56870 54295 24672 18173 18753 30040 54459 62660
7810F2660j4778j5399P90j727p72J2602J4335J6252Q868l6943l6145R034J3948
7797C2725J5282K090N027r802j1766K2120O097j1367M215o463o030j5135J8103
7784D5096K2326K2572k1154K125j0104k7346J0284L1248J602k3502J0346K7317
7772I0810J1188j7201j8790l8211o810p87r9Q737J6610M250K189J3631j0084k8970
7758B6463k8443l52L2240J5496L4597j8918j0993J2989J6664J6522l7012k8210
7746C1043l2231l0746J5064M4559M7873j1044k5070J3525Q51j0250j3087L1882
7734F2369O007p365l0736j8067J2383N293q378j6589j8733J7481M4533J8413P723
7721G4334p698j8981m867J3381J272j1736j9181k4635K3171J878k2093j1706L1820
$$ plain form
7810 62660 47882 32483 33273 31546 30774 43376 57711 73963 82831 45888 9743 18777 32725
7797 32725 48007 50097 55124 45322 33556 55676 61773 50406 54621 48158 42128 26993 45096
7784 45096 67422 89994 68840 70965 60861 33515 43799 75047 76649 53147 63493 90810
7772 90810 101998 84797 66007 27796 20986 20199 20100 28837 45447 49697 51886 65517 55433 26463
7758 26463 -1980 -2332 29908 45404 80001 61083 50090 63079 79743 96265 59253 31043
7746 31043 -1188 -31934 -16870 27689 75562 64518 39448 52973 53824 43574 30487 62369
7734 62369 68376 61011 30275 12208 24591 29884 21506 4917 -13816 3665 48198 66611 74334
7721 74334 66636 47655 42788 56169 57441 45705 26524 1889 25060 26938 4845 -6861 24959
7708B4959J2683Q319p057l867j8865n127K899k1981M379J77J1805m091J3542R518
7694B7293O26j0646o998J0131J2325J5250J2158K95o325k3584j484J9185j9241
7681B8985l675J119J7449K8267k1434l2734O929J2096m240N602K613o432j351
7668C3194j6410J149J3934J4699Q633J9812p792j6607k5409m87N007n090K6608
7655E1241J4669M99m6O64j2606R14j2490l57j1280k7512j9500J0198L2247R043
7641C5684r849K0594K7737j854l7990l7308k4740J5158M1477L6050P41k4288k6295
7628A5117j7156k348J1008l596j0915J4809L7856O393j0038j5699n47n278o859
7615A2747K3494K0555m236k2853l0669o04L02j7803J7815L2718K5893J5622j8463
$$ plain form
7708 24959 37642 45961 38904 35037 16172 11045 13944 -8037 -3658 -3481 8324 4233 17775 27293
7694 27293 27919 17273 10275 20406 32731 47981 60139 60434 54109 30525 29041 48226 28985
7681 28985 25310 26429 43878 72145 50711 17977 24906 37002 32762 38364 40977 34545 33194
7668 33194 16784 17933 31867 46566 55199 75011 67219 50612 25203 24716 29723 24633 51241
7655 51241 65910 66409 66363 67027 54421 55335 42845 42488 31208 3696 -15804 -5606 26641 35684
7641 35684 25835 46429 74166 72312 34322 -2986 -27726 -12568 28909 64959 65700 41412 15117
7628 15117 -2039 -4387 6621 3025 -7890 6919 44775 51168 41130 25431 24884 19606 12747
7615 12747 36241 56796 52560 29707 -962 -1566 -1264 -19067 -1252 31466 57359 72981 54518
7602E4518j9291n549J1194K4218J2646j1280k6626m91J0049k5597j2040J0752
7590B2503J2878j5241K834M7559J3669j1478q599Q802J1980q575k2554j6757K2494
7577E9515K6074q601k8849l1137k013k1991n158l248M674K6389p985J3314J7211
7564C8195j8895J7116J835l490L1409j4809k0746j2393J0071J9223M0970L831
7552I2317j6407n0925k2516J1105O505j164L0422m716k8482j3108r856j3415K1312
7539A072K1212k116k0762p447J0442o170M527r663J7896K1678r649K673m683l450
7525A5560M460r441K582k007J3227L973O569q999K502o393K1888J5103K815J0298
7511G2137l024l1807l8093L553L2166l0516n178j6250j656q722M077K6978J2925
$$ plain form
7602 54518 35227 29678 40872 65090 77736 66456 39830 39339 49388 23791 11751 22503
7590 22503 35381 20140 22974 70533 84202 72724 64125 72927 84907 76332 53778 37021 59515
7577 59515 85589 76988 48139 17002 14989 -7002 -12160 -15408 -10734 15655 7670 20984 38195
7564 38195 19300 36416 38251 34761 66170 51361 30615 18222 28293 47516 88486 92317
7552 92317 75910 24985 2469 13574 20079 18915 49337 44621 16139 3031 -6825 -20240 1072
7539 1072 22284 20168 -594 -8041 2401 -3769 758 -8905 8991 30669 21020 23693 19010 15560
7525 15560 20020 10579 13161 11154 24381 28354 34923 25924 28426 22033 43921 59024 61839 72137
7511 72137 69113 37306 -787 2766 34932 4416 -762 -17012 -18668 -27390 -23313 3665 16590
7498A6590j5157R873J6934j4203j0958J5296j0685j3667o298r707K6019K8051
7486C2088P315j134Q971M834r70j9505j9707M070l225J5609j439J2729n670k3709
7472A0257j1377L414J2636K446j1259j2812J2517L2203j4666j8570L1981L6646
7460G3416J8632j8592k3096L170q925l2572o739k797J8379K4616k103l6928l458
7447C003J5097L7767J2248J3571p27j1658k6473p582J3117M366P636k0056k1060
7434A9249k3646J9684K7973L285p837k1533k1522j7739k296J8139J5911j0808
7422a140j6721k4243L6782l872m06J099J9842j1404L849J5484k090l366r716j8502
7408a4404j5321o895K0033L5061O093P300j229k3232Q428K6044l940j2639p772
$$ plain form
7498 16590 1433 11306 28240 14037 3079 18375 7690 -5977 -12275 -21982 4037 32088
7486 32088 39403 38269 47240 52074 51104 31599 11892 15962 12737 28346 26907 39636 33966 10257
7472 10257 -1120 2294 14930 17376 6117 -6695 5822 38025 23359 4789 36770 73416
7460 73416 92048 73456 50360 53530 44605 12033 5294 2497 20876 45492 43389 6461 3003
7447 3003 18100 55867 68115 81686 80959 69301 42828 35246 48363 52729 60365 40309 19249
7434 19249 -4397 15287 43260 46545 38708 17175 -4347 -22086 -24382 -6243 9668 -1140
7422 -1140 -17861 -42104 -5322 -9194 -9600 -8501 11341 -63 3786 19270 17180 13814 4098 -14404
7408 -14404 -29725 -36620 -16587 18474 24567 31867 30638 7406 15834 41878 37938 25299 17527
7395A7527m661Q18K0403j4786q230J799r135j2178M84j2949J100j064J1460q35
7381a0247J2087J7761J2282l2003p674L8517O809k2234M68Q030k304J40j9925
7368A707n162M0749K5467R533l363m3316k4340J4402q823J6085o466j2804L883
7355G552r33K5287k678k6145r881K1344J9262j4801J720M321j6483j4014J10O620
7341A281K0172K3387m125K4463J7561p483k9286l201l666l0136r455N975l511
7328A976n350j49J2036j1115J854J6040Q359J143j6659k8722L694L5304J2894
7315C1305j1154L201k8817k1781J5249p072k409J1440j2280K4180M811K1261J7535
7302D5469K270J866j0288M236k1589j9307K7427q277o210l818j6837J091J1068
$$ plain form
7395 17527 12866 13684 34087 19301 11071 12870 3735 -8443 -7959 -20908 -19808 -20872 -9412 -10247
7381 -10247 1840 19601 31883 -120 -7794 30723 37532 15298 15766 23796 21492 21632 1707
7368 1707 -3455 37294 62761 72294 68931 25615 1275 15677 6854 22939 16473 3669 7552
7355 7552 6619 31906 29228 3083 -6798 14546 33808 19007 20727 25048 8565 -5449 -5339 1281
7341 1281 21453 44840 40715 65178 82739 75256 45970 42769 39103 8967 -488 5487 1976
7328 1976 -3374 -3523 8513 -2602 -748 15292 23651 24794 8135 -20587 -16893 18411 31305
7315 31305 20151 23352 -5465 -27246 -11997 -19069 -21478 -10038 -22318 1862 6673 27934 45469
7302 45469 47739 49605 39317 43553 21964 2657 30084 21807 15597 11779 -5058 -3967 7101
7289G101K3423r511N063J1876K077J3022j680j2095r91K9838q900n122l287K026
7275E2840J1819q049K5j7636N851j0614n5033j681K0128K7469R77r554M469J9270
7261D0281n676j6876l5694k7326J1580J6670P190k9599J8596L1076j8477j8190
7249b6445J9739J3167m962K404J350J3891K2323o404M715J6776j3480j2074l2398
7236a398j0265K1552J4454K106q734r010r321q683q700o830N091K4035R355J9338
7222C2990K3305j9083o28J1914j8948K239J344L359k6465j5736K512N599M918
7209G320k0201N580J1471K2816K7578J5045j9117j874m0395k1714j5738N130m113
7196b8212J8036K190j5971j8776K7146Q14J8832J0622k0603k708K5389m994j2521
$$ plain form
7289 7101 30524 21013 26076 37952 40029 53051 51371 39276 38285 68123 59223 54101 50814 52840
7275 52840 64659 56610 56635 38999 44850 34236 -20797 -22478 -2350 25119 26096 16542 21011 40281
7261 40281 34605 17729 -17965 -45291 -33711 -17041 -9851 -39450 -20854 10222 -8255 -26445
7249 -26445 -6706 6461 1499 3903 5253 19144 41467 35063 39778 56554 43074 31000 -1398
7236 -1398 -11663 9889 24343 26449 17715 8705 -616 -9299 -17999 -24829 -19738 4297 13652 32990
7222 32990 56295 37212 36584 48498 29550 31789 33133 36492 10027 -5709 -3197 2402 7320
7209 7320 -12881 -7301 4170 26986 54564 69609 50492 48618 8223 -13491 -29229 -24099 -28212
7196 -28212 -10176 -7986 -23957 -42733 -15587 -14773 4059 14681 -5922 -8630 16759 11765 -756
7183g56k7174j8474l15k732K2570J1138N23J1638J064J1930J8809j8401m3005
7170c3185O763P781J4611K1038J5618m233M63O485j8937k609L935K4013l199j7668
7156B0876j4922j6178N899p12P861Q465k3065m989L2501R778J2413J122l5715
7143C334K430K896r789p714J0683j2619K00j6409j5727J1236J3698L2984K245
7130A7448n867l765j1314Q232m740j223J628k1548J432p217J7116J8513k1102
7117a2407J2559n101k0621m135J4925N0r538j1116o106L1254R255q437L487l271
7103i202L7735K5004K3167j8417p703O841O754k1378r706l6471k3505j631j464
7090b9976J7899M352J3341J4353q182q025Q001Q980q251R424j6113J3336l832
$$ plain form
7183 -756 -27930 -46404 -46719 -49451 -26881 -15743 -15220 -3582 -2518 9412 28221 9820 -33185
7170 -33185 -26422 -18641 -4030 17008 32626 28393 28856 35341 16404 13795 17730 41743 38544 20876
7156 20876 5954 -10224 -4325 -5037 2824 11289 -11776 -16765 15736 25514 37927 39049 3334
7143 3334 5764 8660 -1129 -8843 1840 -10779 -10579 -26988 -42715 -31479 -17781 15203 17448
7130 17448 11581 7816 -3498 4734 -6 -1229 399 -21149 -19717 -26934 -9818 8695 -12407
7117 -12407 152 -4949 -25570 -29705 -14780 -14730 -24268 -35384 -41490 -10236 -981 -9418 -5931 -9202
7103 -9202 28533 53537 76704 58287 50584 57425 64179 42801 33095 -3376 -26881 -28512 -29976
7090 -29976 -12077 -7725 5616 19969 11787 3762 11763 20743 12492 21916 5803 19139 15307
7077A5307J3205j4478j5258j8742L761K8037M634L036P340R982q984m2339p655
7064b2154P773J3839m107m048r924k5887N924j480P968o614L1355K7271o969k1318
7050h371j7881R554L575J5895r327J7797J0243R764R987o81O720l1913N180P981
7036B8523J5883J2859m80L849l294k8024k9208p66k955k460R029L3825p035l2105
7022b359K524J6652K1653O627J7182j7874j1193l4716j710L084K145J1575r297
7009D293j0942J2140l972J9103M548j3949j4551l78l874J7681N813m2203j7827
6996d4118M591J6741N963k401J5168J2608r226N53P181J0299p982j1983M7225
6983D4619N994j3449j0482Q73j3152k2310J0071J4155j8358p436Q135J4631K2589
$$ plain form
7077 15307 28512 14034 -1224 -19966 -16205 11832 16466 19502 26842 36824 27840 -14499 -22154
7064 -22154 -14381 -542 -4649 -8697 -18621 -44508 -38584 -40064 -32096 -38710 -7355 19916 12947 -8371
7050 -8371 -26252 -16698 -13123 2772 -6555 11242 21485 31249 41236 40555 47275 15362 20542 28523
7036 28523 44406 57265 56785 60634 57340 29316 108 -658 -3613 -6073 2956 36781 29746 -2359
7022 -2359 165 16817 38470 45097 62279 44405 33212 -1504 -3214 -130 2015 13590 4293
7009 4293 -6649 5491 1519 20622 25170 11221 -3330 -3708 -7582 10099 15912 -26291 -44118
6996 -44118 -39527 -22786 -16823 -19224 -4056 8552 -674 -121 7060 17359 9377 -2606 44619
6983 44619 50613 37164 26682 27555 14403 -7907 2164 16319 -2039 -9475 -1340 13291 35880
6970C5880k392l98J3481j6958k7767P645j3479k2271J1566L5419L4665k8566M517
6957C1342J530p635j929J8140k5138k6217j0815K5560Q142j2633J51r273k7775
6944c6550J1645J2098K6804J0287q103K087r517J0834q435k1386m131k223k680
6931a9270l048L1492J6745o783j9666m253N188J7109p990j8296r631j3376K3912
6918g867j6545J493J2793N945p261k3701k3468O944J7033J3449M7730K5514p770
6905D4289j6639j2605L849l2583r555K159J3602n355j7374K570P511Q6K44J1085
6891h716j343O61L422L174K599o995J283n690J0977j765l1L126j387m323J6814
6876A1806K7513J3528j4539l0416J3887j2389l015Q839p000m462N938N527k8671
$$ plain form
6970 35880 33488 33090 46571 29613 1846 9491 -3988 -26259 -14693 20726 55391 26825 31342
6957 31342 32872 25237 23308 41448 16310 -9907 -20722 4838 12980 347 498 -8775 -36550
6944 -36550 -24905 -12807 13997 24284 16181 18268 8751 19585 11150 -10236 -14367 -16590 -19270
6931 -19270 -22318 9174 25919 19136 -530 -4783 405 17514 9524 -8772 -18403 -31779 -7867
6918 -7867 -24412 -22919 -10126 -4181 -11442 -35143 -58611 -51667 -34634 -21185 26545 52059 44289
6905 44289 27650 15045 18894 -13689 -23244 -21085 -7483 -12838 -30212 -27642 -20131 -20045 -19801 -8716
6891 -8716 -10059 -9398 -5976 -2802 -203 -7198 -5915 -11605 -628 -2393 -2424 702 -685 -5008 11806
6876 11806 39319 52847 38308 7892 21779 9390 6375 15214 8214 3752 9690 15217 -13454
6863a3454j8773J5739k3107j125K529R063P739J2349J7902P924j4963J3899K307
6850A8029r922K5735k1652j5654J5890q378O108j0842K5611Q79j7091q616k825
6837b728R154K0330L4401m335j6226l2862k0162M406n24o546o517J0598J5025
6824D014j171J3886j1107K0259O269J1352j1078n791L9477r231j3308p942k4812
6811A0817J4485L6632N105j3841k9157j6109J2663M377j1561k0161k7814p661
6799d2225j239K5972L5816k0247j7180O984K0466m61j0017j6281j6965K9023K6583
6786B0229L1110j235P912l517k5682q348N779k521p944R623J665K0981l144l8890
6772F018l7194J330J2234K4382M176k956o259N389p216J339q704M674n743j407
$$ plain form
6863 -13454 -32227 -16488 -39595 -40720 -38191 -29128 -21389 -9040 8862 16786 1823 15722 18029
6850 18029 8107 33842 12190 -3464 12426 4048 10156 -686 24925 25804 8713 97 -2728
6837 -2728 6426 26756 61157 56822 40596 7734 -12428 -8022 -8546 -15092 -21609 -11011 4014
6824 4014 2843 16729 5622 25881 32150 43502 32424 26633 66110 56879 43571 35629 10817
6811 10817 25302 61934 67039 53198 24041 7932 20595 24972 13411 -6750 -34564 -42225
6799 -42225 -43464 -17492 18324 -1923 -19103 -12119 8347 7886 -2131 -18412 -35377 -6354 20229
6786 20229 51339 50104 58016 54499 28817 20469 26248 23727 15783 25406 27071 48052 44908 6018
6772 6018 -31176 -29846 -17612 6770 10946 7990 1731 7120 -96 1243 -7461 -2787 -8530 -9937
6758i937J4930K8801l586O177q722k8130k6368j383O449p694j3571R258Q680L1146
6744F050R991r83r72n924p343J3468J9262k0958n984J8651L86J3418n187j4166
6730A9709j2417j475j6463k0918k640J6150K9602J6274k6553R433J3592q065l0133
6717a3904j1716J0661J0631j031j2038J1642K0736j6013j2587M737K6214L277
6705B0609Q480k9297K468Q599L1919O867J7514j261m5059j155j237J2878O68l4187
6691b194L4078j3695j798o287j8677j2142J3906K5083J1835o343j2958k7711r501
6678b6404p760L026Q387J3937J4521K05J4340L420k316j4947k425j6340R904N675
6664C223k6309k9974J5765K4508k0714j187L3046J22j6157p982N604K757o112
$$ plain form
6758 -9937 4993 33794 30208 36385 27663 -467 -26835 -28218 -21769 -29463 -43034 -33776 -25096 6050
6744 6050 16041 15058 14086 8162 819 14287 33549 12591 6607 25258 25644 39062 33875 19709
6730 19709 7292 5817 -10646 -31564 -34204 -18054 11548 27822 1269 10702 24294 16229 -13904
6717 -13904 -25620 -14959 -4328 -5359 -17397 -5755 14981 -1032 -13619 -8882 17332 20609
6705 20609 29089 -208 2260 10859 42778 49645 67159 65898 20839 19684 18447 31325 31993 -2194
6691 -2194 31884 18189 16391 10104 -8573 -20715 -6809 18274 30109 23766 10808 -16903 -26404
6678 -26404 -34164 -31138 -22751 -8814 5707 5912 20252 23672 21356 6409 3984 -12356 -2452 3223
6664 3223 -23086 -53060 -37295 -12787 -33501 -34688 -1642 -1520 -17677 -25659 -20055 -17298 -23410
6651b3410o944j869M167J2560K2004J3584L0428J1202k746k7898P737k4250l1320
6638a6755J6865J5369j3459j4601R822Q714q353L22N421m373p18m004q502O153
6624h099L2835M542r150J5627M350l1018k7242J6495j3290k0782J373M962K0791
6611h606K5218k659j0743j359J1842J4267l4440n775O057K7511n394m8974n131
6598c8186k0408l817M498M3033K6335J0945l665k4808j2726L3593O277l4359l3303
6585d6591K1406K4178j3035k996k099K9632k319l6924l216K541k520J4066Q281
6572i596J1748L390r258R117K816l2448r859J0307O5k496J9545J8215J3333l5495
6558a0616j938L1861m249k0018j5295k952J5575j5998J1219J9313m579k849R396
$$ plain form
6651 -23410 -30354 -32223 -28056 -15496 6508 20092 50520 61722 58976 31078 38815 14565 -16755
6638 -16755 110 15479 2020 -12581 -2759 5955 -2398 -2076 3345 -1028 -1746 -5750 -14252 -8099
6624 -8099 24736 29278 20128 35755 40105 9087 -18155 -1660 -14950 -35732 -34359 -29397 -8606
6611 -8606 16612 13953 3210 1851 13693 27960 -6480 -12255 -6198 21313 15919 -33055 -38186
6598 -38186 -58594 -62411 -57913 -14880 11455 22400 18735 -6073 -18799 14794 21071 -13288 -46591
6585 -46591 -25185 -1007 -14042 -17038 -19137 10495 8176 -28748 -31964 -29423 -31943 -17877 -9596
6572 -9596 2152 5542 -3716 5401 8217 -24231 -34090 -23783 -23718 -26214 -6669 11546 24879 -10616
6558 -10616 -12554 19307 15058 -4960 -20255 -23207 -7632 -23630 -12411 6902 2323 -526 8870
6545H870Q937K5658k607m3309J843j0424j8337n900O718K6810j8377l8148q332
6532f6598J1811K7534K4401O755k0021J767j4245R358K7241L020M217j9502j7140
6519b1402K827J2969K1748j5833l2093o004r241n990J7576o315Q144O093j5436
6506d2957N695P584j1145p822P165J2925M243J0152K6493Q892k1855l4784m089
6493c9503R330L6644O823l9474p083K1586N399k9324l382Q083J8178N781J4280
6480G338k6792j4037k0286J7293J0574J9772N674k7313o97L518J1982J469j2957
6467b4462n774K1352J0019n174j4036J0576K9528r130O18Q810Q717j0778q838
6454A1428K5345R332K463k0756l0988R700O286J0451l9928j6277J3564J5530J5618
$$ plain form
6545 8870 17807 43465 40858 -2451 -608 -11032 -29369 -35269 -28551 -1741 -20118 -58266 -66598
6532 -66598 -54787 -27253 -2852 3903 -16118 -14351 -28596 -19238 8003 11023 15240 -4262 -21402
6519 -21402 -18575 -5606 16142 309 -31784 -37788 -47029 -53019 -35443 -41758 -33614 -27521 -42957
6506 -42957 -37262 -29678 -40823 -48645 -41480 -28555 -24312 -14160 12333 21225 -630 -35414 -39503
6493 -39503 -30173 6471 13294 -26180 -33263 -11677 -6278 -35602 -38984 -30901 -12723 -6942 7338
6480 7338 -19454 -33491 -53777 -36484 -25910 -6138 -464 -27777 -28474 -24956 -12974 -11505 -24462
6467 -24462 -30236 -8884 1135 -4039 -18075 -7499 22029 12899 13517 22327 31044 20266 11428
6454 11428 36773 46105 48568 27812 -3176 6524 12810 23261 -16667 -32944 -19380 -3850 11768
6441A1768K1033Q385l123K171Q078m3654j6864k5028q218Q039P347J6317N506
6428h243j3736R45j4040o118J5176M39J463Q854P952P242R260L3906K7549j6040
6414E4609n3538l8141J4192k334j2942P957L7310k829n4514k410O740L1053j842
6401a6689k9976p480K5145J8517m778l760J1220P238j304N258k533k333Q503J6233
6387B3261J4585k1686k6125o705k595J3101J168L7361J93k0661o331Q107j9294
6374e621L846K4983M0855l19m9646k5227n734J7867j6682P596J69k3796o814M992
6360c3531O686J2937J5123n023Q326K5187J1339j8073m020j533m8019O325J4130
6347a0146o522J1136j5674J9540J5023j3692n422k046q578J033J945k82J8311
$$ plain form
6441 11768 32801 41186 38063 40234 48312 4658 -12206 -37234 -45452 -37413 -30066 -13749 -8243
6428 -8243 -21979 -21034 -35074 -41192 -26016 -25577 -24114 -15260 -7308 -66 9194 43100 70649 54609
6414 54609 1071 -37070 -22878 -25212 -38154 -30197 7113 4284 -50230 -52640 -45900 -14847 -16689
6401 -16689 -46665 -54145 -29000 -10483 -15261 -19021 -7801 -563 -1867 3391 858 -1475 7028 23261
6387 23261 37846 16160 -9965 -16670 -19265 -6164 -4996 32365 32558 11897 5566 13673 -5621
6374 -5621 -1775 23208 64063 63744 14098 -11129 -16863 1004 -15678 -8082 -7913 -31709 -38523 -33531
6360 -33531 -26845 -13908 1215 -3808 4518 29705 41044 22971 18951 17418 -30601 -24276 -10146
6347 -10146 -16668 -5532 -21206 -1666 13357 -335 -5757 -7803 -16381 -15348 -13403 -13685 4626
6334D626J3950j4968m537m806l711K464j9613j6618K6616J1618j9241J9505L0401
6321B5686k382l703L432k0357j4461k859K3787K9312J2802j2261k8417j7779J956
6308e244P582j2472k5201J7183K2821j5614L201O271n358l431l4928J0157K4229
6295a0804P597p134o179J494K2122n860j7868j4775J0147K8847Q12J473Q44K5979
6281C6695J4981j1728k4128J1252Q211O052k6597j976p552j0368M738j1296j4830
6268b6546J6672J1717J3752J1802o738j3844q009J2102j8402J761R876o533j9653
6255b2043J2700J8587O820J1829r79k3406N085K0161J2386j8775m186P57J0325
6242B9261K90J9506r461k2353m0417j2083J1815o099k03R933N52j1661j1490p857
$$ plain form
6334 4626 18576 3608 -929 -5735 -9446 -6982 -26595 -43213 -16597 -4979 -24220 -4715 25686
6321 25686 23304 19601 23033 2676 -11785 -14644 9143 38455 51257 38996 10579 -7200 -5244
6308 -5244 2338 -10134 -35335 -18152 4669 -10945 -7744 -1473 -6831 -10262 -45190 -35033 -10804
6295 -10804 -3207 -10341 -16520 -15026 7096 1236 -16632 -31407 -21260 7587 8399 9872 10716 36695
6281 36695 51676 39948 15820 27072 35283 41335 14738 12762 5210 -5158 -420 -11716 -26546
6268 -26546 -9874 1843 15595 27397 20659 6815 -1194 10908 -7494 -5733 4143 -2390 -22043
6255 -22043 -9343 9244 16064 27893 26914 3508 8593 28754 41140 22365 18179 18936 29261
6242 29261 29551 49057 39596 17243 -23174 -35257 -23442 -29541 -29744 -19811 -19259 -30920 -42410 -50267
6228e0267K6780R338j0061l8021l268N7101K1420m6107j1090K4796J7927L646
6216B194Q762p740k8431l258L682L9840M731k7906n955o351l0327J7669K3467
6203i623j7521Q099j851j3167L165K9912j1622m2961J6214Q494o260K4153J4539
6190A571J8317l24j4544k5321k3530k177J3366J9157J0953O443n142J3808K4069
6177C6646k3784k5010J3057j8340j6037K0462p985J386J1929K0949J9203K0998
6165E3474N662J405j2734k7016M465j7574Q087j2758M075M653J295l727q525n792
6151e010K0250Q593J2363l42l692j0064k4436P529J4732l2054m1008J7052J6935
6138a9152L1899j6977J3352K6740j4236k3551O365P231K0025L39j1649J3510K2750
$$ plain form
6228 -50267 -23487 -14149 -24210 -62231 -65499 -8398 13022 -33085 -44175 -19379 -1452 2194
6216 2194 10956 3216 -25215 -28473 -24791 15049 19780 -8126 -14081 -20432 -50759 -33090 -9623
6203 -9623 -27144 -19045 -20896 -34063 -30898 -986 -12608 -55569 -39355 -30861 -37121 -12968 1571
6190 1571 19888 19564 5020 -20301 -43831 -46008 -32642 -13485 -2532 3911 -1231 12577 36646
6177 36646 12862 -12148 909 -17431 -33468 -13006 -20991 -19605 -7676 13273 32476 53474
6165 53474 59136 60541 47807 20791 25256 7682 15769 3011 7086 11739 13034 9307 782 -5010
6151 -5010 15240 23833 36196 35854 32162 22098 -2338 5191 19923 -12131 -53139 -36087 -19152
6138 -19152 12747 -4230 9122 35862 21626 -1925 4440 11671 31696 32035 20386 33896 56646
6125E6646k1745n947J5487K3585j0471k4068j5151j3860n339j1371N110J4395
6113G271J2023k817k5139L296j0980l0037J0366L9300Q298j1697j1720J7876m570
6100A470j416j3794L0593K5829p051j5500L507K293K273o289R045L533l3147l535
6086b189K6646j5981L665M982J8336O862k9135j4697M224m356O191K1475N116
6073C1139k9106j9259l91j401J1964k322K2145O415p536K677j0542J267j0636
6060e586L190K72k653r694J7470J1423J1358j9839k6764J4849q40J6308J6712
6047B6206p678j1956n615Q575k7454q010J4665L1974j9139j6475J1168K4604j076
6034A9789k7273J3371n925q107k2973M94l401J7114J6880j4131K2409K0213k2906
$$ plain form
6125 56646 34901 28954 44441 68026 57555 33487 18336 4476 -863 -12234 -7124 7271
6113 7271 19294 16477 -8662 -5366 -16346 -46383 -36017 3283 11581 -116 -11836 6040 1470
6100 1470 54 -13740 16853 42682 35631 20131 23638 25931 28204 21915 30960 34493 1346 -2189
6086 -2189 24457 8476 12141 17123 35459 42321 13186 -1511 2713 -1643 4548 26023 31139
6073 31139 2033 -17226 -17617 -19018 -7054 -9376 12769 19184 11648 14325 3783 5050 -5586
6060 -5586 -2396 -2124 -4777 -14471 2999 14422 25780 5941 -20823 -5974 -6814 9494 26206
6047 26206 18528 6572 957 9532 -17922 -25932 -11267 20707 1568 -14907 -3739 20865 19789
6034 19789 -7484 5887 -38 -8145 -31118 -30624 -34025 -16911 -31 -14162 8247 28460 5554
6021E554k8281r906O207J4342J0908L714J3943j3856m765K2721N760k3036j7694
6008a4389l380J7823p514n012o883p806K58l0889j658K4347L0696Q124j8089j1227
5994b5599J0018n332j3175j751K4528J7558K2280J8664M605l2920k3576J6833
5982A2133N613k2227p327R472Q500j8552p146P102p656k039K9312r576n895r312
5968a7598m536j3326P603J420L3837K868k2060m90J7197L4169k8179l5446Q489
5955a6052K5489m404n905k15K4475l6079k6847J9281J6340j1417k1523J6494P704
5942a2659J8890J056k5564n971P321K9346J8902q724r665O185j7721j5675l431
5929a7710R139k1332J6233K1010l451j150J2681L242L056k3066j4212j0548j5165
$$ plain form
6021 5554 -22727 -32633 -26426 -12084 -1176 2538 16481 2625 -2140 20581 26341 3305 -14389
6008 -14389 -17769 54 -7460 -12472 -19355 -27161 -26903 -57792 -59450 -35103 -4407 3717 -14372 -25599
5994 -25599 -15581 -20913 -34088 -35839 -11311 6247 28527 47191 51796 18876 -4700 12133
5982 12133 17746 -4481 -11808 -2336 6164 -12388 -19534 -12432 -20088 -22127 7185 -2391 -8286 -17598
5968 -17598 -22134 -35460 -27857 -26437 7400 10268 -11792 -12282 4915 39084 10905 -24541 -16052
5955 -16052 9437 5033 -872 -1087 23388 -12691 -39538 -20257 -3917 -15334 -36857 -20363 -12659
5942 -12659 6231 7287 -18277 -24248 -16927 12419 31321 22597 12932 19117 1396 -14279 -17710
5929 -17710 -8571 -29903 -13670 7340 3889 2739 15420 18662 21718 -1348 -15560 -26108 -41273
5916d1273k8694j2847K1228L5505K1493j1656R78K1995j9064k4615R455N685M689
5903a7121j4146J0831K7613R899J1848j3298k7825k668q408m923J0549K6878K367
5890A1596P057L911j4635K671j8457K0265k1635j4729L3430M437r997M36j7625
5877a3275l939j5232k6965J3010J1602J3608J6902J2958M1915k226k3544K2360
5865D7174j2854j488J623N922k0951k3242J49O574j5701M298j546j835J7035N843
5851A1001k45l618j0119m82J962j0397R78Q907K563j3848l5381K0419M1371j6667
5837c556q655M2309J2210k3817l3414j1054K392N567k990J3990K6759k4114m1112
5824d5485j1166K51O104R545m64j0554K0948J6046n277K2613J1711r157j0658
$$ plain form
5916 -41273 -69967 -82814 -61586 -26081 -4588 -16244 -15266 6729 -12335 -36950 -27495 -21810 -17121
5903 -17121 -31267 -20436 7177 17076 28924 15626 -12199 -14867 -23275 -28198 -17649 9229 11596
5890 11596 18653 22564 7929 10600 -7857 12408 -9227 -23956 9474 13911 3914 4350 -13275
5877 -13275 -17214 -32446 -59411 -46401 -34799 -21191 -4289 8669 50584 48358 24814 47174
5865 47174 34320 32832 34455 40377 19426 -3816 -3667 2907 -12794 -8496 -10042 -11877 5158 11001
5851 11001 10756 7138 -2981 -3463 -1501 -11898 -10920 -2013 550 -13298 -48679 -28260 13111 -3556
5837 -3556 -12211 30098 42308 18491 -14923 -25977 -23585 -18018 -21008 -7018 19741 -4373 -45485
5824 -45485 -56651 -56400 -50296 -40751 -41215 -51769 -30821 -14775 -20052 2561 14272 5115 -5543
5811e543k7268j2600K7950L2742j9084o814J0976K6601m805K382l1530j7590j6634
5798d1217R196J4032P900Q126q36Q681L445p134j4093K2522k565n317o044J3360
5784A0056N247L524k0012L0832N121k4445Q696Q256J930j1078k5902P351Q678
5771H254j0137Q784K9332L1128k0680k4341k1464k0869L663M2871j5085j715P004
5758A6745k8242N997J6785O23l59K5425r770N632L583l3960l1209R264J104J3484
5744d898K8814J0973n006j9908k3296l18N412J7999j6420j2320M977K0478O563
5731A3050j1791r198O263L2468K2024l4702j5374j5799N264J1989J6856m888j4901
5718A261j2413j1050O653m674j0502o572R764J1331m712Q418j4926k2169J6801
$$ plain form
5811 -5543 -32811 -45411 -17461 15281 -3803 -10617 359 26960 22155 24537 -6993 -24583 -41217
5798 -41217 -32021 -17989 -10089 -1963 -2799 5882 9327 2193 -11900 10622 8057 2740 -3304 10056
5784 10056 15303 18827 -1185 29647 34768 10323 19019 27275 29205 18127 -7775 -424 8254
5771 8254 -1883 6901 36233 67361 46681 22340 876 -19993 -16330 26541 11456 9741 16745
5758 16745 -11497 -5500 11285 11908 11549 36974 27204 32836 36419 2459 -28750 -19486 -18382 -4898
5744 -4898 23916 34889 29883 9975 -13321 -13639 -8227 9772 -6648 -18968 -13991 6487 13050
5731 13050 1259 -7939 -1676 30792 52816 18114 2740 -13059 -7795 4194 21050 16162 1261
5718 1261 -11152 -22202 -15549 -20223 -30725 -37297 -27533 -16202 -20914 -12496 -27422 -49591 -32790
5705c2790K5417j3773r135J8408N519n740n821p086k4855n735K4349K3716J8017
5692A0491J7261j1796R82J5037m692j807m588j6496K886m637q634r857p101R581
5678a3370j7575J8341L6815K539j6070p014n992j6483n739N971k840Q962j136
5665a3591J1925J9801j550l2044J9K2641K567j2071K4674J0955J4048m517k0863
5652B1994k238k5897j2224k5375O205L1327n203j1105J8774p674K16p800m784
5639b3784p474J2940K5642J1704N169j7739J6166L6142n45m906k6345q682J2841
5626C1129P665J3022J8952m4705j1944j196R094M435n635M001J0396o935r155
5613A9124j9051k6888r567J2807J4002K6099q33J4048O626j3724j8496q529m432
$$ plain form
5705 -32790 -7373 -21146 -30281 -11873 -6354 -12094 -17915 -25001 -49856 -55591 -31242 -7526 10491
5692 10491 27752 15956 16938 31975 27283 25476 20888 4392 7278 2641 -5993 -15850 -22951 -13370
5678 -13370 -30945 -12604 24211 26750 10680 3666 -2326 -18809 -24548 -18577 -21417 -12455 -13591
5665 -13591 -1666 18135 16585 -15459 -15440 7201 9768 -2303 22371 33326 47374 42857 21994
5652 21994 19756 -6141 -18365 -43740 -37535 -6208 -11411 -22516 -3742 -11416 -11200 -19000 -23784
5639 -23784 -31258 -18318 7324 19028 24197 6458 22624 58766 58221 53315 26970 18288 31129
5626 31129 38794 51816 70768 26063 14119 12923 22017 26452 20817 24818 35214 28279 19124
5613 19124 73 -26815 -36382 -23575 -9573 16526 15693 29741 36367 22643 4147 -4382 -8814
5600h814N335J5882j410J7476j27l498j9084j6990m053p371P811M208O006L668
5586i61r347R345k6960k6529L399K3311L7043M961j4980o635P010J2501q139j2403
5572h384R274k2961k0645K317k545J0802K9549J7062j693n132m414k2855N347
5559a4278j0283J172o950P672L85k3410K3612L0172K3673R72j7038k1534J5082
5546I247j889k3154o516j4262K163J9903J8179n609j4273J6921j5749m1073j0096
5533f6208K6979L3554K224k2504j7265J7897K5615J7962n305k5720l4335K0996
5521b6110L0457l833q811o51J8731j0277J4740Q747J841O180k3407j5577K412
5508e558j2497k753k0330q126R832J4197J013j7323J4239P268k2452K248O230
$$ plain form
5600 -8814 -3479 12403 10993 28469 28342 24844 5760 -11230 -15283 -22654 -14843 -10635 -4629 -961
5586 -961 -10308 -963 -27923 -54452 -51053 -27742 9301 14262 -718 -7353 -343 12158 4019 -8384
5572 -8384 890 -22071 -42716 -40399 -42944 -32142 -2593 14469 12776 7644 3230 -19625 -14278
5559 -14278 -24561 -23389 -30339 -22667 -22282 -45692 -22080 8092 31765 32737 15699 -5835 9247
5546 9247 7358 -15796 -22312 -36574 -34411 -14508 3671 -1938 -16211 710 -15039 -56112 -66208
5533 -66208 -39229 -5675 -3451 -25955 -43220 -25323 292 18254 12949 -12771 -47106 -26110
5521 -26110 4347 514 -8297 -8948 9783 -494 14246 22993 24834 31014 7607 -7970 -5558
5508 -5558 -18055 -20808 -41138 -49264 -39432 -25235 -24222 -41545 -27306 -20038 -42490 -40242 -34012
5495c4012M918j7593J2108L3538J0671Q684k2969j4018K2963j9096j7323J5946
5483a6183K2610j00j8059Q442R501j4718J92J7466k873l1035k9620Q326J8891
5470b7160K664J2017L898k7447j210P56k0553J2599J4430P258J6970K160p093
5457a0711J7957l3523J8947J5906r162K8405j4522J4213j2562j9571k8330O359
5445b6594P881N533J5467l451k473K1940J6620n0937n318J5285K252k0452L0728
5432F481K0411m2797j0946J5657M541p366J299j4246O385l550m340K1490K4290
5419A7309J0036J1366k56k4604J8235n535j4921n152p255k393L4804J6336j0357
5406C7613n143m960j383Q320j4322j7991K784K1761K1993m7469k2049r104L18
$$ plain form
5495 -34012 -29094 -46687 -34579 -1041 9630 18314 -4655 -18673 4290 -14806 -32129 -16183
5483 -16183 6427 6327 -11732 -3290 6211 -8507 -8315 9151 6278 -24757 -54377 -46051 -27160
5470 -27160 -24496 -12479 -8581 -36028 -37238 -36482 -57035 -44436 -30006 -22748 -5778 -3618 -10711
5457 -10711 7246 -26277 -7330 8576 -586 27819 13297 27510 14948 -4623 -32953 -26594
5445 -26594 -18713 -13180 2287 -1164 -3637 18303 34923 -16014 -21332 -6047 -3795 -24247 6481
5432 6481 26892 -15905 -26851 -11194 -6653 -14019 -12720 -26966 -20581 -24131 -28471 -6981 17309
5419 17309 27345 38711 38455 13851 32086 26551 11630 6478 -777 -3170 31634 47970 37613
5406 37613 32470 27510 26127 34447 20125 2134 4918 26679 48672 1203 -20846 -29950 -29632
5393b9632J8489J9876J1747k5607j5886O671J9345N287N940j7910j5915O896k484
5380a3183J0849Q988k7945j0312N0946Q684J3742j6559l9010O444j1323J3078
5368e601P543j1437j1965O602J0381j7031k8244P643l281K2809K567j1483J5172
5355a6325Q427O04M860J7876J9162k0419m0393J5189J4484j9800q306J701l890
5342b6830K329L0959J31O159j0277k0891j6035j0907J4642q326j2916K3395J3067
5329a5500L0439J6855Q455j3959k00m838Q215K6350k5441m0782N208j0579j5803
5316c1580J7733j03L0084K4148k0082l2733n206K2974j4377k0359K6848M0070
5304C7417j6671j4178j0072k3296K1329Q788r595n346P787j5615o554o297J49
$$ plain form
5393 -29632 -11143 8733 20480 -5127 -21013 -14342 5003 10290 16230 -1680 -17595 -10699 -13183
5380 -13183 -2334 6654 -21291 -31603 19343 28027 41769 25210 -13800 -7356 -18679 -5601
5368 -5601 1942 -9495 -21460 -14858 -4477 -21508 -49752 -42109 -45390 -22581 -20014 -31497 -16325
5355 -16325 -7898 -7294 -2434 15442 34604 14185 -26208 -11019 3465 -16335 -24641 -22940 -26830
5342 -26830 -24501 6458 6589 12748 2471 -18420 -34455 -45362 -30720 -39046 -51962 -28567 -15500
5329 -15500 14939 31794 40249 26290 26090 21252 29467 55817 30376 -10406 -5198 -15777 -31580
5316 -31580 -13847 -13950 16134 40282 20200 -12533 -17739 5235 -9142 -29501 -2653 37417
5304 37417 20746 6568 -3504 -26800 -5471 3317 -6278 -11624 -3837 -19452 -26006 -32303 -32154
5291c2154R017q592J010K898J1806J036M407L804k0275j1271p392J2900K3850
5278h956p604m059j09k0852M486P523m486j3022j0727O008M4067J124N88l216
5264i235k2267K077K2869P006j5755j5708L0938Q796l4977n439L2893L365J4159
5251A8722J368k1534p564J6438k807j0597l575n813j4555J3524K9234K3536j7569
5238A8808j7490j2500l33j1396O105J7335M406J1655m568k1683K658p76J2671
5225D892J0513k1433j4308K6393j6446R559P989k1679J0481J3901Q197m83k5300
5212g724k0390o018j1399K22q081N515j1370J6215K9889j8052k2545L1667J0513
5199a1558j8146l3370l74O458L649M1335L317K525J5785o56j9891J3272j4230
$$ plain form
5291 -32154 -23137 -31729 -30719 -27821 -16015 -14979 -10572 -6768 -27043 -38314 -45706 -32806 -8956
5278 -8956 -16560 -20619 -20728 -41580 -37094 -29571 -34057 -47079 -57806 -51798 -7731 -6607 -6019 -9235
5264 -9235 -31502 -29425 -6556 450 -15305 -31013 -75 8721 -26256 -31695 1198 4563 18722
5251 18722 20090 -1444 -9008 7430 4623 -5974 -9549 -15362 -29917 -16393 12841 36377 18808
5238 18808 1318 -11182 -11515 -22911 -16806 529 4935 16590 12022 -9661 -7003 -7779 4892
5225 4892 15405 -6028 -20336 6057 -10389 -830 7159 -14520 -4039 9862 18059 17576 -7724
5212 -7724 -28114 -34132 -45531 -45309 -53390 -47875 -59245 -43030 -13141 -31193 -53738 -22071 -11558
5199 -11558 -29704 -63074 -63448 -56990 -53341 -12006 -8689 -6164 9621 8965 -10926 2346 -11884
5186a1884n980J2898P356p00k0335P067n222k053j0859J2589J0202j7595k181
5173b6697N157P170J2972K3302K3310k3972l5568j0990J7175r856P35J8264J0503
5160A1505n301j1923J8251n545N605J9476J3569j1057j1711j8382j2350k2507
5148c0370p638L9654K8208J985M25j4373P699m373q312k001P699N094m681j3930
5134E086k0153j8419R613K7029J4893m822j2601K0330K6312j3973k2812k1976
5122a1493R971J4355J1642J215m952J2737k1947l8662q464N450J1256K853K8679
5109A2640K5823N55N99j6182j9645j1010n459J9353J1993K531k2482l426l644
5096h354J4492M566L566j504R164j0935J2639L0907j613j1913m8198P377k890
$$ plain form
5186 -11884 -17864 -4966 2390 1690 -18645 -11578 -16800 -18853 -29712 -17123 -6921 -24516 -26697
5173 -26697 -21540 -14370 -1398 21904 45214 21242 -14326 -25316 -8141 -17997 -17262 1002 11505
5160 11505 6204 -5719 12532 6987 12592 32068 45637 34580 22869 4487 -7863 -30370
5148 -30370 -38008 1646 29854 31839 32264 17891 25590 21217 12905 10904 18603 23697 19016 5086
5134 5086 -15067 -33486 -23873 3156 18049 13227 626 20956 47268 33295 10483 -11493
5122 -11493 -1522 12833 24475 25690 20738 33475 11528 -27134 -35598 -30148 -18892 -16039 12640
5109 12640 38463 39018 39617 23435 3790 -7220 -12679 6674 18667 21198 -1284 -4710 -8354
5096 -8354 6138 10704 14270 12766 21930 10995 23634 54541 52928 41015 -7183 194 -2696
5083b696j8364J451n560M494J4754K635J786J4183L5708k4973m1520j6192M649
5070b9645L2889O042J237j1077j8104k462M27P440M898j3344O712N901J3361p673
5056c398q158K1712J9352M654Q459j1520o2074n411L0337K1912K6296j3880k2101
5043F180P85J9331j1981l939K1485j8143k180K174Q043j9582k3449k912j8960
5030d3148L124L4503J9734j365j0237p356o521j1592K3188K2678m963q316o429
5017C300k629j309L1800K0309k2097j9429j9924K2399N193l519J5459q14j7630
5004A1109k149R010k1741o330Q553R303o182j2324Q518J3599o885k7753j1780
4991c5052J7163J5660J5415J2068k757j6712M241O030o918j4595k5328o124J7213
$$ plain form
5083 -2696 -21060 -19609 -25169 -20675 -5921 -3286 -1500 12683 48391 23418 -18102 -34294 -29645
5070 -29645 3244 9286 10523 -554 -18658 -21120 -20693 -13253 -8355 -21699 -14987 -9086 4275 -3398
5056 -3398 -11556 10156 29508 34162 42621 31101 -30973 -36384 -6047 15865 42161 28281 6180
5043 6180 6965 26296 14315 10376 31861 13718 11538 13712 21755 2173 -21276 -24188 -43148
5030 -43148 -40024 -5521 14213 12848 2611 -4745 -11266 -22858 330 23008 18045 9729 3300
5017 3300 671 -638 31162 51471 29374 9945 -9979 12420 17613 14094 29553 28739 11109
5004 11109 8960 17970 -3771 -10101 -1548 7755 1573 -10751 -2233 11366 4481 -23272 -35052
4991 -35052 -17889 -2229 13186 25254 22497 5785 10026 16056 9138 -5457 -30785 -36909 -19696
4978a9696J4726K7198j7426k9105J064k10L3374R788k0081j9994O651J1189r119
4965a1641n154L77q217Q40P327L0958K8191j1940k2464p515k887J3218J1255k5174
4951b826k7650J5553N630K530K4492q551k8078j9431q329J3784q202k6866l7600
4938a05544K2756L8096L7709K2817J119l952j9451l1331R885M1721r355j8231
4926a3761J5405J2964L235J5683l2724l834k843l667k4396j578p077K6835Q746
4913g012J8022J9663P561j2940j2088q799j1853n937O238j5618j345l301j078
4900b8487j6674j4602L1250J5877k529J1046k910l671n959j6605j8488K9078J2047
4887a0627L86p462j338K1856J7048j7283q814k677j3065j1959k0453k5830o236
$$ plain form
4978 -19696 -4970 22228 4802 -24303 -23239 -23449 9925 19713 -368 -20362 -13711 -2522 -11641
4965 -11641 -16795 -16418 -24635 -23795 -16468 14490 42681 30741 8277 762 -2125 11093 22348 -2826
4951 -2826 -30476 -14923 -9293 -6763 17729 9178 -18900 -38331 -46660 -32876 -41078 -67944 -105544
4938 -105544 -82788 -44692 -6983 15834 16953 13001 -6450 -37781 -27896 13825 4470 -13761
4926 -13761 1644 14608 17843 33526 802 -3032 -5875 -9542 -33938 -35516 -42593 -15758 -7012
4913 -7012 11010 30673 38234 25294 13206 4407 -7446 -13383 -7145 -22763 -24108 -27409 -28487
4900 -28487 -45161 -59763 -28513 -12636 -15165 -4119 -7029 -10700 -16659 -33264 -51752 -22674 -10627
4887 -10627 -10241 -17703 -19041 2815 19863 2580 -6234 -8911 -21976 -33935 -54388 -80218 -86454
4874h6454J9948J5337K4244k129m984M1312J7166j4444k1485m683j5455Q568J8244
4861d815J7823M799k5305j6971j516R233J4654K7980J0139j0693m465j3631k6445
4848a9213k9365N794p047j7312j7275L0807L5121K702j8575P841j4466p388J5780
4835c2596J1738m122k5070J9701J7947J7203P535L014P89J0042o66l832k9810
4822h127k0970J274J6574J2253L864q638o706J5910K0733j3284k4140L947j5172
4809b2482k460J6062J7485j8400j4193M665J3133q383k4220J632J5948L127K2852
4796D766j0379k0678J3256L604j571J1772L952K473K4p894k1718k0586k0772j313
4782f5064J0370K0937L7472Q645R298j6766k5478N952P077o202J832J946n522
$$ plain form
4874 -86454 -66506 -51169 -26925 -29054 -34038 7274 24440 9996 -11489 -16172 -31627 -23059 -4815
4861 -4815 13008 17807 -7498 -24469 -25985 -16752 -2098 25882 36021 25328 20863 7232 -19213
4848 -19213 -48578 -42784 -49831 -67143 -84418 -53611 -18490 -15788 -34363 -26522 -40988 -48376 -32596
4835 -32596 -20858 -24980 -50050 -30349 -12402 4801 12336 15350 16139 26181 25515 21683 -8127
4822 -8127 -29097 -27823 -11249 1004 4868 -3770 -10476 5434 26167 12883 -11257 -7310 -22482
4809 -22482 -24942 -8880 8605 -9795 -23988 -19323 -6190 -14573 -38793 -37161 -21213 -18086 4766
4796 4766 -5613 -26291 -13035 -9431 -11002 770 4722 7195 7219 -675 -22393 -42979 -63751 -65064
4782 -65064 -54694 -33757 3715 12360 21658 4892 -20586 -14634 -7557 -13759 -11927 -9981 -15503
4769a5503o342Q002M86J6757J2512k1373j4854K5648K6281k1998P47P658k7113
4756i092L319L3477k6478j5181J2068k1185J4096J3060L033j833R991m1408J5650
4743a0483K1149k1352R316J7855L217m695j9808q343J0532J3695K483K455j455
4730A4566j0993k9314L953J5031M261j5135P295L1562q130k9753j52L073r328
4717b3064J8706J630o742k0173P503K891R960M667j4687N394J395J0541O043j178
4703B886K1919J5616j8310k1700j7730M113J6389j8638j1235j3939q06j1905k398
$$ plain form
4769 -15503 -21845 -13843 -13357 3400 15912 -5461 -20315 5333 31614 9616 10363 18021 -9092
4756 -9092 -5773 27704 1226 -13955 -1887 -23072 -8976 4084 7117 5284 15275 -26133 -10483
4743 -10483 10666 -10686 -1370 16485 19702 15007 -4801 -13144 -2612 11083 13566 16021 14566
4730 14566 3573 -25741 -21788 -6757 -2496 -17631 -10336 21226 13096 -16657 -16809 -13736 -23064
4717 -23064 -4358 -2728 -9470 -29643 -22140 -19249 -9289 -4622 -19309 -13915 -12520 -1979 4064 2886
4703 2886 24805 40421 22111 411 -17319 -13206 3183 -15455 -26690 -40629 -41435 -53340 -55738
$$ [...]
##END NTUPLES=NMR SPECTRUM
##END=
