##TITLE=Analysis number 309198
Compound Code cc 34804
Book Reference 399/165
Project Code adrs
Chemist Name evam
##JCAMPDX= 6.0         $$ Bruker NMR JCAMP-DX V2.0
##DATA TYPE= NMR SPECTRUM
##DATA CLASS= NTUPLES
##ORIGIN= Bruker BioSpin GmbH
##OWNER= NMR
$$ XWIN-NMR		Version 3.5
$$ Tue May 31 10:54:38 2005 GMT Daylight Time (UT+1h)  MAYBRIDGE\NMR@NMR_250MHZ
##.OBSERVE FREQUENCY= 250.131544655141
##.OBSERVE NUCLEUS= ^1H
##.ACQUISITION MODE= SIMULTANEOUS (DQD)
##.ACQUISITION SCHEME= undefined
##.AVERAGES= 16
##.DIGITISER RES= 18
##SPECTROMETER/DATA SYSTEM= dpx250
##.PULSE SEQUENCE= zg30
##.SOLVENT NAME= CDCl3
##.SHIFT REFERENCE= (INTERNAL, CDCl3, 0, 16.4529)
##AUDIT TRAIL= $$ (NUMBER, WHEN, WHO, WHERE, WHAT)
$$ ##TITLE= Audit trail, XWIN-NMR		Version 3.5
$$ ##JCAMPDX= 5.01
$$ ##ORIGIN= Bruker BioSpin GmbH
$$ ##OWNER= NMR
$$ C:\u/data/dgb/nmr/ADRS/3660/pdata/1/auditp.txt
$$ ##AUDIT TRAIL=  $$ (NUMBER, WHEN, WHO, WHERE, WHAT)
(   1,<2005-05-31 10:54:16.57 +100>,<MAYBRIDGE\NMR>,<NMR_250MHZ>,
      <created by zg, POWCHK disabled, PULCHK disabled
       configuration hash MD5:
       62 19 C7 07 E1 42 D1 B7 37 6C 3D D0 77 39 F9 E6
       data hash MD5: 64K
       B3 42 50 AF D2 68 05 CD 25 A6 9D 6B CF BA 38 05>)
(   2,<2005-05-31 10:54:29.07 +100>,<MAYBRIDGE\NMR>,<NMR_250MHZ>,
      <Start of raw data processing
       ef LB = 0.3 FT_mod = 6 PKNL = 1 SI = 32K 
       data hash MD5: 32K
       B0 24 70 1D D9 C3 10 78 49 4F C6 68 7D 7B FD 99>)
(   3,<2005-05-31 10:54:30.76 +100>,<MAYBRIDGE\NMR>,<NMR_250MHZ>,
      <apk 
       data hash MD5: 32K
       04 61 89 12 20 06 D1 A9 B1 B9 6D B1 B6 1E ED 20>)
(   4,<2005-05-31 10:54:31.46 +100>,<MAYBRIDGE\NMR>,<NMR_250MHZ>,
      <abs ABSG = 5 
       data hash MD5: 32K
       85 59 6D B2 09 A6 A4 B8 E1 74 12 CB 26 71 BE 67>)
$$ ##END=
$$ 
$$ hash MD5
$$ AD 1C A9 A7 72 90 B6 68 18 19 BA 01 02 71 ED CD
##$RELAX= 
##$RELAX= 
##$RELAX= 
##$RELAX= 
##$RELAX= 
##$RELAX= 
##$RELAX= 
$$ Bruker specific parameters
$$ --------------------------
##$DU= <C:\u>
##$EXPNO= 3660
##$NAME= <ADRS>
##$PROCNO= 1
##$TYPE= <nmr>
##$USER= <dgb>
##$AMP= (0..31)
100 100 100 100 100 100 100 100 100 100 100 100 100 100 100 100 100 100 
100 100 100 100 100 100 100 100 100 100 100 100 100 100 
##$AQSEQ= 0
##$AQ_mod= 3
##$AUNM= <au_zg>
##$AUTOPOS= <34 >
##$BF1= 250.13
##$BF2= 250.13
##$BF3= 250.13
##$BF4= 250.13
##$BF5= 500.13
##$BF6= 500.13
##$BF7= 500.13
##$BF8= 500.13
##$BYTORDA= 1
##$CFDGTYP= 0
##$CFRGTYP= 5
##$CHEMSTR= <none>
##$CNST= (0..31)
1 1 145 1 1 1 1 1 1 1 1 1 1 1 1 1 1 1 1 1 1 1 1 1 1 1 1 1 1 1 1 1 
##$CPDPRG= <>
##$CPDPRG1= <>
##$CPDPRG2= <>
##$CPDPRG3= <>
##$CPDPRG4= <mlev>
##$CPDPRG5= <mlev>
##$CPDPRG6= <mlev>
##$CPDPRG7= <mlev>
##$CPDPRG8= <mlev>
##$CPDPRGB= <>
##$CPDPRGT= <>
##$D= (0..31)
0 1 0 0 0 0 0 0 0 0.06 0 0 0 0 0 0 0.0002 0 0 0 0 0 0 0 0 0 0 0 0 0 0 
0 
##$DATE= 1117533255
##$DBL= (0..7)
120 120 120 120 120 120 120 120 
##$DBP= (0..7)
150 150 150 150 150 150 150 150 
##$DBP07= 0
##$DBPNAM0= <>
##$DBPNAM1= <>
$$ [...]
##$SUBNAM7= <"">
##$SUBNAM8= <"">
##$SUBNAM9= <"">
##$SW= 20.6930455092707
##$SWIBOX= (0..15)
0 0 3 0 0 0 0 0 0 0 0 0 0 0 0 0 
##$SW_h= 5175.983436853
##$TD= 65536
##$TD0= 1
##$TE= 295.16
##$TE2= 300
##$TE3= 300
##$TEG= 300
##$TL= (0..7)
0 120 120 120 120 120 120 120 
##$TP= (0..7)
150 150 150 150 150 150 150 150 
##$TP07= 0
##$TPNAME0= <>
##$TPNAME1= <>
##$TPNAME2= <>
##$TPNAME3= <>
##$TPNAME4= <>
##$TPNAME5= <>
##$TPNAME6= <>
##$TPNAME7= <>
##$TPOAL= (0..7)
0.5 0.5 0.5 0.5 0.5 0.5 0.5 0.5 
##$TPOFFS= (0..7)
0 0 0 0 0 0 0 0 
##$TUNHIN= 0
##$TUNHOUT= 0
##$TUNXOUT= 0
##$USERA1= <user>
##$USERA2= <user>
##$USERA3= <user>
##$USERA4= <user>
##$USERA5= <user>
##$V9= 5
##$VALIST= <valist>
##$VCLIST= <CCCCCCCCCCCCCCC>
##$VD= 0
##$VDLIST= <DDDDDDDDDDDDDDD>
##$VPLIST= <PPPPPPPPPPPPPPP>
##$VTLIST= <TTTTTTTTTTTTTTT>
##$WBST= 1024
##$WBSW= 4
##$XGAIN= (0..3)
0 0 0 0 
##$XL= 0
##$YL= 0
##$YMAX_a= 285100
##$YMIN_a= -280152
##$ZGOPTNS= <>
##$ZL1= 120
##$ZL2= 120
##$ZL3= 120
##$ZL4= 120
##$ABSF1= 16.45293
##$ABSF2= -4.240242
##$ABSG= 5
##$ABSL= 3
##$ALPHA= 0
##$AQORDER= 0
##$ASSFAC= 0
##$ASSFACI= 0
##$ASSFACX= 0
##$ASSWID= 0
##$AUNMP= <proc_1d>
##$AZFE= 0.1
##$AZFW= 0.1
##$BCFW= 0
##$BC_mod= 0
##$BYTORDP= 0
##$COROFFS= 0
##$CY= 12.5
##$DATMOD= 1
##$DC= 0
##$DFILT= <>
##$DTYPP= 0
##$F1P= 14.0000005364418
##$F2P= -0.99999901652339
##$FCOR= 0.5
##$FTSIZE= 32768
##$FT_mod= 6
##$GAMMA= 0
##$GB= 0
##$INTBC= 1
##$INTSCL= 1
##$ISEN= 128
##$LB= 0.3
##$LEV0= 0
##$LPBIN= 0
##$MAXI= 10000
##$MC2= 0
##$MEAN= 0
##$ME_mod= 0
##$MI= 0
##$NCOEF= 0
##$NC_proc= -3
##$NLEV= 6
##$NOISF1= 0
##$NOISF2= 0
##$NSP= 0
##$NTH_PI= 0
##$NZP= 0
##$OFFSET= 16.45293
##$PC= 1
##$PHC0= -68.63563
##$PHC1= 5.966795
##$PH_mod= 1
##$PKNL= yes
##$PPARMOD= 0
##$PSCAL= 4
##$PSIGN= 0
##$REVERSE= no
##$SF= 250.13001727459
##$SI= 32768
##$SIGF1= 0
##$SIGF2= 0
##$SINO= 400
##$SIOLD= 32768
##$SREGLST= <1H.CDCl3>
##$SSB= 0
##$STSI= 32768
##$STSR= 0
##$SW_p= 5175.98343685301
##$SYMM= 0
##$S_DEV= 0
##$TDeff= 65536
##$TDoff= 0
##$TI= <Analysis number 999999
Compound Code 99
Book Reference 9
Project Code 9>
##$TILT= no
##$TM1= 0
##$TM2= 0
##$TOPLEV= 0
##$USERP1= <user>
##$USERP2= <user>
##$USERP3= <user>
##$USERP4= <user>
##$USERP5= <user>
##$WDW= 1
##$XDIM= 32768
##$YMAX_p= 434114095
##$YMIN_p= -159575
$$ End of Bruker specific parameters
$$ ---------------------------------
##NTUPLES= NMR SPECTRUM
##VAR_NAME=  FREQUENCY,     SPECTRUM/REAL,   SPECTRUM/IMAG
##SYMBOL=    X,             R,               I
##VAR_TYPE=  INDEPENDENT,   DEPENDENT,       DEPENDENT
##VAR_FORM=  AFFN,          ASDF,            ASDF
##VAR_DIM=   32768,         32768,           32768
##UNITS=     HZ,            ARBITRARY UNITS, ARBITRARY UNITS
##FACTOR=    0.157963299565203, 1,           1
##FIRST=     4115.37177778605, 0,            0
##LAST=      -1060.61165906696, 0,           0
##MIN=       -1060.61165906696, -159575,     0
##MAX=       4115.37177778605, 434114095,    0
$$ Real data points
##PAGE= N=1
##DATA TABLE= (X++(R..R)), XYDATA
$$ [...]
$$ plain form
16791 -39875 -39496 -3642 -10678 -69421 -83177 -66680 -8348 -9803 -7353 120 -270 17620 31995
16778 31995 22310 -51974 -34583 -23471 -20106 -9482 -2895 1694 -6000 29895 6296 11058 5387
16765 5387 -31902 -57718 -68488 -41626 -5148 4158 19859 52305 73555 26727 2493 4095
16753 4095 -12093 12652 33051 34720 4214 -7828 -37798 -40745 -17025 -5259 -52584 -38816
16741 -38816 -20336 -29888 -64626 -88221 -64763 -52320 -42731 19758 56277 42427 -16585 -12942
16729 -12942 -32425 -23303 -778 -44154 -73527 -91653 -96795 -105826 -118315 -63428 -13884 -41910
16717 -41910 -34297 -25703 3175 54596 42188 -26167 -32649 12452 71461 68858 5508 23450
16705 23450 13352 -30948 -5565 -18581 -31028 43390 72849 92174 62029 16738 -14606 1365
$$ packed form
16791c9875L79L5854p036n8743j3756J6497N8332j455K450P473l90J7890J4375
16778C1995r685p4284J7391J1112L365J0624O587M589p694L5895k3599M762n671
16765E387l7289k5816j0770K6862L6478R306J5701L2446K1250m6828k4234J602
16753D095j6188K4745K0399J669l0506j2042k9970k947K3720J1766m7325J3768
16741c8816J8480r552l4738k3595K3458J2443R589O2489L6519j3850n9012L643
16729a2942j9483R122K2525m3376k9373j8126n142r031j2489N4887M9544k8026
16717d1910P613Q594K8878N1421j2408o8355o482M5101N9009k603o3350J7942
16705B3450j0098m4300K5383j3016j2447P4418K9459J9325l0145m5291l1344J5971
$$ plain form
16693 1365 7169 -14443 -15652 12562 20065 2451 -54932 -81581 -84325 -80418 -37799 -18504 -22007
16680 -22007 -22837 -24785 -10737 52421 46728 30341 5042 -22669 -50015 -6345 32570 48376
16668 48376 70343 79312 18716 -46711 -70334 -64649 -42522 -19620 -20652 -17458 -49024 -69924
16656 -69924 -78456 -59250 -33596 -6927 -19725 -39754 -44267 -11567 -26953 -43561 -45192 -37928
16644 -37928 -30593 -34980 -37081 -22650 -7922 8983 12694 -28758 -40875 -6571 37952 32215 -14370
16631 -14370 -23596 -19268 -43952 -59085 -42198 -26931 -24489 -15468 -65977 -103237 -85999 -79701 -99284
16618 -99284 -86417 -54246 -53265 -37623 -12613 -12767 -64617 -77913 -22060 569 -1331 -34296 -18316
16605 -18316 7469 23592 31469 6852 -21178 -36846 12582 37088 13100 -18127 4142 10394
$$ packed form
16693A365N804k1612j209K8214P503j7614n7383k6649k744L907M2619J9295l503
16680b2007q30j948J4048O3158n693j6387k5299k7711k7346M3670L8915J5806
16668D8376K1967Q969o0596o5427k3623N685K2127K2902j032L194l1566k0900
16656f9924q532J9206K5654K6669j2798k0029m513L2700j5386j6608j631P264
16644c7928P335m387k101J4431J4728J6905L711m1452j2117L4304M4523n737m6585
16631a4370r226M328k4684j5133J6887J5267K442R021n0509l7260J7238O298j9583
16618i9284J2867L2171R81J5642K5010j54n1850j3296N5853K2629j900l2965J5980
16605a8316K5785J6123P877k4617k8030j5668M9428K4506k3988l1227K2269O252
$$ plain form
16593 10394 8364 3791 5173 13120 -33386 -29804 -21747 2773 31406 71367 89934 64167 56796
16580 56796 40146 4980 1288 -250 -44293 -81395 -51392 -40212 -63434 -57635 -40252 17705
16568 17705 -21340 -56604 -56074 -59806 -44910 -29185 1904 -14142 -49533 -55188 -25130 -29908 -31771
16555 -31771 -1116 2071 -2648 21467 72240 89078 89883 56994 -1469 -16161 -5706 -28357
16543 -28357 1772 -8855 -31853 -38733 -47418 -54840 -50563 -29709 -49126 -41274 -18850 4774 6205
16530 6205 -7584 2431 8383 21015 6572 5872 25593 1756 -38114 -57225 -31057 15945
16518 15945 -7610 -39395 -36447 6145 -9327 -8059 -48578 -51335 6490 85457 61074 -6478
16506 -6478 -13201 -45174 -38978 -24263 -36187 -45416 -43779 -78133 -86985 -95014 -42189 14900 3724
$$ packed form
16593A0394k030m573J382P947m6506L582Q057K4520K8633L9961J8567k5767p371
16580E6796j6650l5166l692j538m4043l7102L0003J1180k3222N799J7383N7957
16568A7705l9045l5264N30l732J4896J5725L1089j6046l5391n655L0058m778j863
16555c1771L0655L187m719K4115N0773J6838Q05l2889n8463j4692J0455k2651
16543b8357L0129j0627k2998o880q685p422M277K0854j9417P852K2424K3624J431
16530F205j3789J0015N952J2632j4443p00J9721k3837l9870j9111K6168M7002
16518A5945k3555l1785K948M2592j5472J268m0519k757N7825P8967k4383o7552
16506f478o723l1973O196J4715j1924r229J637l4354q852q029N2825N7089j1176
$$ plain form
16493 3724 24922 25644 5661 -18530 -17577 -5321 3147 -60796 -65160 -32736 -15913 -9784 -50304
16480 -50304 -67260 -25499 -37803 -50679 -53408 -27821 -56694 -77174 -27086 -26236 -33878 13420
16468 13420 42253 17499 16014 29033 -3893 -49073 -32852 -43378 -16804 -43775 -6663 46286
16456 46286 79513 80130 75858 78103 34879 -4023 -9292 5371 -21927 -13778 12661 38158 1979
16443 1979 -37147 -67520 -25049 -11912 -30874 -12960 -30719 -76149 -53411 -12367 22602 7800
16431 7800 -31695 508 7211 1030 -35651 -81573 -34054 -3936 -49671 -85904 -53756 -42616
16419 -42616 10563 53447 48306 -912 -48084 -47001 -54441 -45416 -38709 -12202 -48553 -52996 -47457
16406 -47457 -46494 -26210 34510 43658 30716 21554 3008 -56401 -77051 -50809 -40539 -39512 -25751
$$ packed form
16493C724K1198P22j9983k4191R53J2256Q468o3943m364L2424J6823O129m0520
16480e0304j6956M1761j2304j2876k729K5587k8873k0480N0088Q50p642M7298
16468A3420K8833k4754j485J3019l2926m5180J6221j0526K6574k6971L7112N2949
16456D6286L3227O17m272K245m3224l8902n269J4663k7298Q149K6439K5497l6179
16443A979l9126l0373M2471J3137j8962J7914j7759m5430K2738M1044L4969j4802
16431G800l9495L2203O703o181l6681m5922M7519L0118m5735l6233L2148J1140
16419d2616N3179M2884n141m9218m7172J083p440R025O707K6507l6351m443N539
16406d7457R63K0284O0720R148j2942r162j8546n9409k0650K6242J0270J027J3761
$$ plain form
16393 -25751 -21910 -11130 -4770 16564 25514 56351 32933 18590 42876 21601 -13356 -40047
16381 -40047 -18833 -458 1033 10239 17831 24162 4444 -16256 -13882 12199 -7384 8802 31800
16368 31800 17343 -27574 -56145 -42697 -21570 -42358 -67885 -99041 -105715 -89917 -65203 -76450
16356 -76450 -52568 -25271 -34769 -11352 -12644 -10292 18670 3346 -16484 -17858 19839 -8025
16344 -8025 -4113 10333 -31501 -60226 -54639 -33992 -5737 1793 -8526 -22967 22289 82798
16332 82798 35240 -15267 39633 78961 70418 42931 21083 -5039 -24767 -56595 -33385 -28994
16320 -28994 25479 53689 54842 52358 73945 44864 29232 35817 47717 40361 26556 36217 25068
16307 25068 -28339 -40050 -29436 -1871 -16160 -57481 -30654 11873 15606 3633 33707 69049
$$ packed form
16393b5751L841J0780O360K1334Q950L0837k3418j4343K4286k1275l4957k6691
16381d0047K1214J8375J491R206P592O331j9718k0700K374K6081j9583J6186K2998
16368C1800j4457m4917k8571J3448K1127k0788k5527l1156o674J5798K4714j1247
16356g6450K3882K7297r498K3417j292K352K8962j5324j9830j374L7697k7864
16344h025L912J4446m1834k8725N587K0647K8255P530j0319j4441M5256O0509
16332H2798m7558n0507N4900L9328q543k7487k1848k6122j9728l1828K3210M391
16320b8994N4473K8210J153k484K1587k9081j5632O585J1900p356j3805R661j1149
16307B5068n3407j1711J0614K7565j4289m1321K6827M2527L733j1973L0074L5342
$$ plain form
16295 69049 46481 10230 34018 52575 42485 82052 34090 8474 20470 37480 -3031 -17965
16283 -17965 -4958 4819 -21328 -26500 -15482 -53055 -29930 6487 -15827 -33655 -10470 -168
16271 -168 -2862 -41285 -88092 -81066 -85192 -68643 -81771 -61603 -12370 28069 10932 -6278 -10466
16258 -10466 -16412 -7378 22030 31780 1513 -29070 -27021 -22023 -3970 -17307 -16382 443 -7484
16245 -7484 -53833 -56332 -47808 -1949 -17141 -42941 -25402 -26780 -22338 -27502 -32904 13140 14171
16232 14171 9191 43806 51031 -12027 -56968 -46714 -27823 14419 15763 -26933 -39053 -32927
16220 -32927 -33865 -29805 -61164 -66924 -30876 -16068 -26074 -18773 7580 30800 41735 84833 49740
16207 49740 9918 6257 23155 16650 35524 37429 26296 30513 26276 2200 -11649 -20970 -8083
$$ packed form
16295F9049k2568l6251K3788J8557j0090L9567m7962k5616J1996J7010m0511j4934
16283a7965J3007R777k6147n172J1018l7573K3125L6417k2314j7828K3185J0302
16271a68k694l8423m6807P026m126J6549j3128K0168M9233M0439j7137j7210m188
16258a0466n946R034K9408R750l0267l0583K049M998J8053j3337R25J6825p927
16245g484m6349k499Q524M5859j5192k5800J7539j378M442n164n402M6044J031
16232A4171m980L4615P225o3058m4941J0254J8891M2242J344m2696j2120O126
16220c2927r38M060l1359n760L6048J4808j0006P301K6353K3220J0935M3098l5093
16207D9740l9822l661J6898o505J8874J905j1133M217m237k4076j3849r321J2887
$$ plain form
16194 -8083 7165 762 -41068 -73135 -37805 5771 36104 15675 14424 2195 -41080 -77539
16182 -77539 -62638 -54002 -39927 -19114 -20784 -6992 -5183 -8182 7706 17818 37103 58052
16170 58052 45084 22764 21832 18829 20636 19547 -144 -6366 -20547 -37309 -10438 -18016 -28981
16157 -28981 -68982 -92623 -63640 -55427 -53445 -67585 -99089 -98519 -59029 -71812 -36936 -3946
16145 -3946 9336 203 -34054 -52839 -46931 -58640 -77866 -92353 -51166 -59063 -78988 -87112 -60896
16132 -60896 -59779 -26987 3574 18066 53806 24019 -36642 -46343 -40342 -24563 1378 10488
16120 10488 28318 8591 -14831 -10225 -37878 -13893 12314 22807 28548 19108 -32797 -9806
16108 -9806 -22541 -27107 -26623 -34504 -32568 -15406 9474 27107 14305 -16079 10809 12531 10403
$$ packed form
16194h083J5248o403m1830l2067L5330M3576L0333k0429j251j2229m3275l6459
16182g7539J4901Q636J4075K0813j670J3792J809k999J5888J0112J9285K0949
16170E8052j2968k2320r32l003J807j089j9691o222j4181j6762K6871p578j0965
16157b8981m0001k3641K8983Q213J982j4140l1504N70L9490j2783L4876L2990
16145c946J3282r133l4257j8785N908j1709j9226j4487M1187p897j9925q124K6216
16132f0896J117L2792L0561J4492L5740k9787o0661r701O001J5779K5941R110
16120A0488J7830j9727k3422M606k7653K3985K6207J0493N741r440n1905K2991
16108i806j2735m566M84p881J936J7162K4880J7633j2802l0384K6888J722k128
$$ plain form
16095 10403 -44488 -57250 -909 -32600 -14704 5024 7210 -18846 11551 13060 -1802 57452
16083 57452 67605 35916 -23327 -58925 -65534 -8323 27827 57689 89320 72063 63875 67786
16071 67786 31583 -27155 -41943 -71374 -96614 -111854 -92771 -84789 -55091 -13298 -17396 -44519
16059 -44519 29841 25734 -28148 -72321 -38561 -3673 -30352 -27814 33521 37955 8180 -31416
16047 -31416 -1706 61 -2489 -397 -20870 -10808 -1967 5362 21956 28017 22503 -8703 -10755
16034 -10755 -11508 -23479 -230 10149 -10078 8452 -11399 -526 19891 44206 63385 53185
16022 53185 9267 -14117 -50422 -70103 -73069 -67543 -59298 -24498 -35100 -33420 -38379 -62668 -59601
16009 -59601 -38372 25989 53623 5629 -29780 -21037 -38989 -48737 -47479 -32322 -17884 -65420
$$ packed form
16095A0403n4891j2762N6341l1691J7896J9728K186k6056L0397J509j4862N9254
16083E7452J0153l1689n9243l5598o609N7211L6150K9862L1631j7257q188L911
16071F7786l6203n8738j4788k9431k5240j5240J9083P982K9698M1793m098k7123
16059d4519P4360m107n3882m4173L3760L4888k6679K538O1335M434k9775l9596
16047c1416K9710J767k550K092k0473J0062Q841P329J6594O061n514l1206k052
16034a0755p53j1971K3249J0379k0227J8530j9851J0873K0417K4315J9179j0200
16022E3185m3918k3384l6305j9681k966N526Q245L4800j0602J680m959k4289L067
16009e9601K1229O4361K7634m7994l5409Q743j7952r748J258J5157J4438m7536
$$ plain form
15997 -65420 -89073 -79586 -44322 -38754 -80851 -90723 -39291 -65004 -48313 -11610 -17769 9620
15985 9620 47385 52213 19060 784 -19590 -25866 -13439 15465 -8931 18177 34488 16223
15973 16223 16206 -24020 -12673 -10990 -7779 29288 39756 14245 48518 57364 25841 10138 20570
15960 20570 -187 -23645 -16013 -13652 -16683 14555 -6274 -12458 -13859 6457 -5891 -38829 -45575
15947 -45575 -39374 -1074 19704 -46021 -42745 13590 43232 12406 -27081 -56024 -59556 -85502
15935 -85502 -105702 -63225 -11207 9876 -41120 -22940 12756 19424 18591 28479 47691 50740 48784
15922 48784 28441 32174 40630 5727 15770 20831 -2532 -3107 -19694 -12276 35879 62395 60245
15909 60245 46419 -4306 -54694 -54848 -23037 -17558 18875 4165 20630 4597 1280 22830
$$ packed form
15997f5420k3653R487L5264N568m2097r872N1432k5713J6691L6703o159K7389
15985I620L7765M828l3153j8276k0374o276J2427K8904k4396K7108J6311j8265
15973A6223j7m0226J1347J683L211L7067J0468k5511L4273Q846l1523j5703J0432
15960B0570k0757k3458P632K361l031L1238k0829o184j401K0316j2348l2938o746
15947d5575O201L8300K0778o5725L276N6335K9642l0826l9487k8943l532k5946
15935h5502k0200M2477N2018K1083n0996J8180L5696O668q33R888J9212L049j956
15922D8784k0343L733Q456l4903J0043N061k3363n75j6587P418M8155K6516k150
15909F0245j3826n0725n0388j54L1811N479L6433j4710J6465j6033l317K1550
$$ plain form
15897 22830 36504 63379 27012 -23018 -35097 -3254 39347 45396 1862 -7315 -17631 -26910
15885 -26910 -16192 16386 -6775 6094 -15078 3298 21753 -902 12894 34588 33537 27261
15873 27261 -4224 19466 31665 4900 -8801 13761 19080 14546 8864 23075 8855 2790
15861 2790 18759 -32884 -21712 -11949 -500 16092 -3097 37586 61118 30761 -18311 -38521
15849 -38521 -11204 -17072 1935 24834 26805 2555 -17462 14969 23018 30579 27691 35356 29596
15836 29596 18266 -36299 -24997 -31976 -17027 -1973 -23353 -51190 -45855 -20255 -11096 -10336 -12663
15823 -12663 -11593 -12162 -43277 -3220 24073 6591 -26337 -33588 -9483 -38944 -62789 -67173 -61224
15810 -61224 -19879 -19609 -29994 -29774 -31370 -57153 -88198 -69209 -73179 -89706 -72284 -32692 -41016
$$ packed form
15897B2830J3674K6875l6367n0030j2079L1843M2601O049m3534r177j0316r279
15885b6910J0718L2578k3161J2869k1172J8376J8455k2655J3796K1694j051o276
15873B7261l1485K3690J2199k6765j3701K2562N319m534n682J4211j4220o065
15861B790J5969n1643J1172R763J1449J6592j9189M0683K3532l0357m9072k0210
15849c8521K7317n868J9007K2899J971k4250k0017L2431Q049P561k888P665n760
15836B9596j1330n4565J1302o979J4949J5054k1380k7837N335K5600R159P60k327
15823a2663J070n69l1115M0057K7293j7482l2928p251K4105k9461k3845m384N949
15810f1224M1345K70j0385K20j596k5783l1045J8989l970j6527J7422L9592q324
$$ plain form
15797 -41016 -51443 -37356 -26030 -37468 2827 27057 1808 4656 33069 3208 -17847 -48733
15785 -48733 -68578 -41017 -20335 1011 15525 22530 26710 46415 23935 25005 35189 19533
15773 19533 3437 -20815 -46527 -60438 -50584 -56387 -64458 -57909 -52337 -63635 -93932 -45964 -25092
15760 -25092 -14995 -34164 -37969 -14209 11895 49747 47467 19485 9197 36244 57871 42189
15748 42189 5100 -9415 -12883 -33474 -26508 -32442 -77273 -73993 -60911 -50869 -60110 -57107 -36242
15735 -36242 -6831 -34473 -68537 -60114 -56391 -61462 -74457 -48775 -45736 -53120 -37262 -46910 -25149
15722 -25149 -5649 -11062 16375 -3674 -48915 -49210 -65345 -76658 -98574 -67645 -26224 -1990
15710 -1990 -26398 -5766 -2478 -31026 -40704 -61328 -92430 -52186 -13414 -28623 -8198 31813
$$ packed form
15797d1016j0427J4087J1326j1438M0295K4230k5249K848K8413k9861k1055l0886
15785d8733j9845K7561K0682K1346J4514P005M180J9705k2480J070J0184j5656
15773A9533j6096k4252k5712j3911R854n803q071O549N572j1298l0297M7968K0872
15760b5092J0097j9169l805K3760K6104L7852k280k7982j0288K7047K1627j5682
15748D2189l7089j4515l468k0591O966n934m4831L280J3082J0042r241L003K0865
15735c6242K9411k7642l4064Q423L723n071j2995K5682L039p384J5858r648K1761
15722b5149J9500n413K7437k0049m5241k95j6135j1313k1916L0929M1421K4234
15710a990k4408K0632L288k8548r678k0624l1102M0244L8772j5209K0425M0011
$$ plain form
15698 31813 75617 91966 79201 43837 15205 15522 24821 13907 14584 13487 44257 25564 -13476
15685 -13476 19073 43949 37179 28109 -29833 -39469 -6835 -836 -4288 -20057 1664 -2390 -38192
15672 -38192 -36091 9718 35103 -1409 625 10662 -14200 -37383 -82021 -134049 -112077 -84952
15660 -84952 -67060 -18458 4716 -27241 -26510 -58108 -97526 -66795 5790 -12471 -44692 -24631
15648 -24631 -24115 -19353 -39535 -51152 -74802 -102079 -67776 -40831 -33519 -16763 -9480 -44202 -48067
15635 -48067 -42843 -26565 -21666 -2894 -20419 -14214 49093 61442 57381 54995 29839 20797 44953
15622 44953 77835 82014 87387 99613 86739 52690 40927 44371 52346 42773 36701 47003 38123
15609 38123 -20 -24878 -33759 -11855 35676 35771 47318 51243 56567 71270 94985 80925 59443
$$ packed form
15698C1813M3804J6349j2765l5364k8632L17R299j0914O77j097L0770j8693l9040
15685a3476L2549K4876o770r070n7942r636L2634N999l452j5769K1721m054l5802
15672c8192K101M5809K5385l6512K034J0037k4862k3183m4638n2028K1972K7125
15660h4952J7892M8602K3174l1957P31l1598l9418L0731P2585j8261l2221K0061
15648b4631N16M762k0182j1617k3650k7277L4303K6945P312J6756P283l4722l865
15635d8067N224J6278M899J8772j7525O205O3307J2349m061k386k5156r042K4156
15622D4953L2882M179N373J2226j2874l4049j1763L444P975r573o072J0302q880
15609C8123l8143k4858q881K1904M7531R5J1547L925N324J4703K3715j4060k1482
$$ plain form
15596 59443 30110 -9139 -4454 -34232 -42827 -14854 7880 22543 34065 36801 40412 68228
15584 68228 58210 10761 -8607 35357 59658 30617 21253 17271 9780 -7366 21093 42805
15572 42805 11748 16137 26512 539 15767 23954 21403 18202 16553 -42687 -78684 -43158 -56480
15559 -56480 -53694 -17277 -4243 -26533 -56169 -55927 -79026 -45138 -30244 2288 31057 34202
15547 34202 14890 23995 14715 9307 70009 86014 63800 29733 44353 78096 34157 -17295
15535 -17295 -5642 -16132 4635 51681 31001 30628 44381 42623 22419 7818 3332 -21673
15523 -21673 -19883 -14341 -23725 -25094 -7482 28287 23589 -10144 -67879 -69347 -34743 -31854 -47893
15510 -47893 -73453 -106042 -57547 47108 31085 7976 -28578 -23338 -16734 -5504 24795 26811
$$ packed form
15596E9443k9333l9249M685k9778q595K7973K2734J4663J1522K736L611K7816
15584F8228j0018m7449j9368M3964K4301k9041r364l982p491j7146K8459K1712
15572D2805l1057M389J0375k5973J5228Q187k551l201j649n9240l5997L5526j3322
15559e6480K786L6417J3034k2290k9636K42k3099L3888J4894L2532K8769L145
15547C4202j9312R105r280n408O0702J6005k2214l4067J4620L3743m3939n1452
15535a7295J1653j0490K0767M7046k0680l73J3753j758k0204j4601m486k5005
15523b1673J790N542r384j369J7612L5769m698l3733n7735j468L4604K889j6039
15510d7893k5560l2589M8495J04655j6023k3109l6554N240O604J1230L0299K016
$$ plain form
15498 26811 3617 -24363 25359 73456 70544 76356 -26659 -67485 -46425 -45714 -29870 -15631
15486 -15631 -24378 -2859 -32362 -9648 4294 10353 38147 -152 -7872 6757 12773 755
15474 755 11916 10514 -26795 -35643 -58577 -36250 -23826 -26282 -5902 951 44231 59087 -11534
15461 -11534 -30760 -4994 3670 11119 55337 107558 102507 61154 38939 39944 38277 31207 -1198
15448 -1198 -4995 29331 50181 78771 88618 86463 18318 -34182 -39719 -44866 -44150 -42248 -66671
15435 -66671 -88846 -101039 -100977 -101792 -60374 -4434 31376 12462 -15017 -28969 -37687 2245 24173
15422 24173 49544 72489 102194 113559 73993 16207 -35545 4146 15780 -4465 -9161 20762
15410 20762 15837 -6296 -3217 -3532 7982 21615 37952 40561 52053 24813 -21740 8219 2522
$$ packed form
15498B6811k3194k7980M9722M8097k912N812j03015m0826K1060P11J5844J4239
15486a5631q747K1519k9503K2714J3942O059K7794l8299p720J4629O016j2018
15474G55J1161j402l7309q848k2934K2327J2424k456K0380O853M3280J4856p0621
15461a1534j9226K5766Q664P449M4218N2221n051m1353k2215J005j667p070l2405
15448a198l797L4326K0850K8590R847k155o8145n2500n537n147P16J902k4423
15435f6671k2175j2193O2q15M1418N5940L5810j8914k7479j3952q718L9932K1928
15422B4173K5371K2945K9705J1365l9566n7786n1752L9691J1634k0245m696K9923
15410B0762m925k2133L079l15J1514J3633J6337K609J1492k7240m6553K9959n697
$$ plain form
15397 2522 -45792 8177 25912 -323 -9264 -6890 -11862 -3510 26839 17446 -28620 -14890 10598
15384 10598 3812 10662 -2384 -101118 -115109 -70416 -60789 -53397 -59546 -43901 -9220 -24737 -10077
15371 -10077 -15971 -755 -23087 29886 54172 46113 23204 20426 2421 31249 65784 63926
15359 63926 57967 30493 15068 19083 41899 78721 41388 12307 10793 -2238 11108 30300
15347 30300 -5446 -47969 -48018 -41303 -40367 -42281 -25986 1 -769 -10118 -12271 -31900 -8134 30577
15333 30577 32506 20154 5566 -34833 -11487 -1115 -27376 -41538 -65552 -73134 -53484 -37355
15321 -37355 -59387 -47180 -48129 -25607 -44668 -44605 -8410 -29954 -38563 -46857 -17086 -11091 -63906
15308 -63906 -42860 3585 16447 -3398 -2890 5002 11840 14780 39620 45368 -2958 -18453 30072
$$ packed form
15397B522m8314N3969J7735k6235q941K374m972Q352L0349r393m6066J3730K5488
15384A0598o786O850j3046r8734j3991M4693R627P392o149J5645L4681j5517J4660
15371a0077n894J5216k2332N2973K4286q059k2909k778j8005K8828L4535j858
15359F3926n959k7474j5425M015K2816L6822l7333k9081j514j3031J3346J9192
15347C0300l5746m2523m9O715R36j914J6295K5987p70r349k153j9629K3766L8711
15333C0577J929j2352j4588m0399K3346J0372k6261j4162k4014p582J9650J6129
15321c7355k2032J2207r49K2522j9061O3L6195k1544q609q294K9771N995n2815
15308f3906K1046M6445J2862j9845N08P892O838K940K4840N748m8326j5495M8525
$$ plain form
15295 30072 44265 -10145 -101572 -104513 -72551 -92041 -80142 -75341 -96930 -82049 -75646 -87264
15283 -87264 -79851 -78245 -37354 -4237 -26494 -51770 -48351 -67613 -64535 -29340 -2607 20998
15271 20998 29947 14892 -17560 -57361 -75141 -89065 -58718 -18636 24727 14880 -3907 -34697
15259 -34697 -41422 -61506 -57902 -59537 -56174 -19738 10280 7466 -16345 -76034 -97088 -108804 -88503
15246 -88503 -78422 -23253 -681 -12002 27025 34908 50898 54363 50754 50749 42369 48906 91158
15233 91158 117730 112138 84490 49849 57930 123168 156162 164450 140060 128656 116217 110544
15221 110544 107423 91296 82536 68300 66841 69192 8473 -32641 -32818 26135 72020 82514 70887
15208 70887 39370 -1096 19442 47301 35527 -13463 12094 16321 18475 2748 -25246 -61366
$$ packed form
15295C0072J4193n4410r1427k941L1962j9490J1899M801k1589J4881O403j1618
15283h7264P413J606M0891L3117k2257k5276L419j9262L078L5195K6733K3605
15271B0998Q949j5055l2452l9801j7780j3924L0347M0082M3363r847j8787l0790
15259c4697o725k0084L604j635L363L6436L0018k814k3811n9689k1054j1716K0301
15246h8503J0081N5169K2572j1321L9027P883J5990L465l609nq380O537M2252
15233I1158K6572n592k7648l4641Q081O5238L2994Q288k4390j1404j2439n673
15221A10544l121j6127q760j4236j459K351o0719m1114j77N8953M5885J0494j1627
15208G0887l1517m0466K0538K7859j1774m8990K5557M227K154j5727k7994l6120
$$ plain form
15196 -61366 -22101 -4162 7829 12901 35221 49313 46983 17293 -1636 -20129 -39567 -11719
15184 -11719 -8083 1375 13508 -38913 -61668 -48763 -7521 3617 9255 7247 -26983 -52885
15172 -52885 -27636 -25300 1804 -1711 -42337 -6393 35195 43191 37991 -20431 -40218 -58366
15160 -58366 -59544 -99466 -111877 -97699 -50869 -30904 -60772 -67240 -57115 -57046 -40229 -15595 7238
15147 7238 -3987 -14587 -27114 -44145 -29009 -39706 -47816 -34823 -26349 -34797 -14198 9312
15135 9312 23950 9434 -39618 -88706 -74763 -24058 -784 -1425 -6474 4328 -24787 -51256
15123 -51256 -38534 -28154 -4935 29652 10534 11191 -2630 -18016 -28339 -39394 -38248 -32428
15111 -32428 -72115 -71611 -67690 -58517 -30816 -22688 -24639 -6881 4247 7267 14766 29367 3564
$$ packed form
15196f1366L9265J7939J1991N072K2320J4092k330k9690j8929j8493j9438K7848
15184a1719L636R458J2133n2421k2755J2905M1242J1138N638k008l4230k5902
15172e2885K5249K336K7104l515m0626L5944M1588P996n200n8422j9787j8148
15160e8366j178l9922j2411J4178M6830J9965k9868o468J0125O9J6817K4634K2833
15147G238j1225j0600j2527j7031J5136j0697q110J2993Q474q448K0599K3510
15135I312J4638j4516m9052m9088J3943N0705K3274o41n049J0802k9115k6469
15123e1256J2722J0380K3219L4587j9118O57j3821j5386j0323j1055J146N820
15111c2428l9687N04L921R173K7701Q128j951J7758J1128L020P499J4601k5803
$$ plain form
15098 3564 -20025 -18718 -31461 -32562 4979 50262 55940 63258 84718 61520 47322 69982 78212
15085 78212 29342 16319 14857 -2728 -42620 -28934 14473 7255 -35467 -54968 -29976 -19788
15073 -19788 -23542 -33890 -31891 -32164 -15445 -1430 -36209 -75162 -81581 -69733 -79033 -47491 -14755
15060 -14755 -32807 -22408 17383 22199 23998 -7289 -31534 -54798 -39046 -12845 -24528 -33109
15048 -33109 -49054 -45891 -23695 3952 22630 4810 31906 36478 -4960 -21815 -18726 -34037
15036 -34037 -90262 -68333 -29574 -10760 2862 3538 9281 7022 -5832 345 -16062 -24779 -37164
15023 -37164 -12163 -26626 -66221 -40556 -33333 11431 35920 5065 -8221 -17392 -42349 -33505
15011 -33505 -58519 -66050 -44795 -21130 -17634 -6833 -7287 15208 1835 8289 51768 39091 20185
$$ packed form
15098C564k3589J307j2743j101L7541M5283N678P318K1460k3198j4198K2660Q230
15085G8212m8870j3023j462j7585l9892J3686M3407p218m2722j9501K4992J0188
15073a9788l754j0348J999k73J6719J4015l4779l8953o419J1848r300L1542L2736
15060a4755j8052J0399L9791M816J799l1287k4245k3264J5752K6201j1683q581
15048c3109j5945L163K2196K7647J8678j7820K7096M572m1438j6855L089j5311
15036c4037n6225K1929L8759J8814J3622O76N743k259j2854O177j6407q717j2385
15023c7164K5001j4463l9595K5665P223M4764K4489l0855j3286r171k4957Q844
15011c3505k5014p531K1255K3665L496J0801m54K2495j3373O454M3479j2677j8906
$$ plain form
14998 20185 6162 40782 48526 41569 40287 46090 17284 -44637 -64949 -88595 -61045 -2070
14986 -2070 1471 14640 24658 21952 30667 28354 13433 17175 -39302 -38053 26752 37055 -4212
14973 -4212 -12164 4919 -8075 -8533 -7018 3982 -23309 -62320 -95110 -99293 -90683 -90564 -89053 -91687
14959 -91687 -43453 -37787 -16003 2881 -27075 -73028 -85006 -50902 -30227 -16926 -19998 1910
14947 1910 -6981 -14761 -34035 -30109 -14866 -18233 -73530 -86784 -76725 -75766 -62582 -35132 -56201
14934 -56201 -76031 -88201 -55467 -26136 -31514 -28239 -34558 -43740 -61194 -51967 -34641 -22848 -58971
14921 -58971 -56201 15815 10823 -24079 -42365 -5824 2442 -15048 -18855 -38018 -24280 -15737 -4408
14908 -4408 -2398 -30300 -52206 -88920 -71541 -38756 -41596 5638 22030 1762 -837 -23069
$$ packed form
14998B0185j4023L4620P744o957j282N803k8806o1921k0312k3646K7550N8975
14986b070L541J3169J0018k706Q715k313j4921L742n6477J249O4805J0303m1267
14973d212p952J7083j2994m58J515J1000k7291l9011l2790m183Q610J19J511k634
14959i1687M8234N666K1784J8884k9956m5953j1978L4104K0675J3301l072K1908
14947A910q891p780j9274L926J5243l367n5297j3254J0059R59J3184K7450k1069
14934e6201j9830j2170L2734K9331n378L275o319r182j7454R227J7326J1793l6123
14921e8971K770P2016m992l4902j8286L6541Q266j7490l807j9163J3738Q543J1329
14908d408K010k7902k1906l6714J7379L2785k840M7234J6392k0268k599k2232
$$ plain form
14896 -23069 -56758 -88105 -105538 -55296 -24009 8565 28992 36575 7968 -33685 -19532 -23228
14884 -23228 -65397 -76963 -74361 -119907 -122719 -83842 -36220 -18922 5342 26783 47676 37935
14872 37935 39123 11906 -5612 -28765 -36491 -27101 -9879 -57529 -97039 -52565 -8429 -22375
14860 -22375 -14541 -15816 -5541 -9322 4969 -28024 -43624 -36586 -29604 -66648 -71564 -86108 -84533
14847 -84533 -74177 -66744 -98424 -79141 -37506 -69466 -76772 -92500 -105719 -90770 -30573 10846
14835 10846 -5850 -13452 -2935 -18171 -5990 6181 28381 49333 28440 10211 13274 17380
14823 17380 14453 11220 31933 26532 -31839 -39347 -30813 -39322 -39445 -47057 -19691 -12032 9186 26008
14809 26008 15543 8711 16090 8955 7584 22632 2719 6310 -8906 -20093 13244 79930 86333
$$ packed form
14896b3069l3689l1347j7433N0242L1287L2574K0427P583k8607m1653J4153l696
14884b3228m2169j1566K602m5546k812L8877M7622J7298K4264K1441K0893r741
14872C7935J188k7217j7518k3153p726R390J7222m7650l9510M4474M4136j3946
14860b2375P834j275J0275l781J4291l2993j5600P038O982l7044m916j4544J575
14847h4533J0356P433l1680J9283M1635l1960p306j5728j3219J4949O0197M1419
14835A0846j6696p602J0517j5236J2181J2171K2200K0952k0893j8229L063M106
14823A7380k927l233K0713n401n8371p508Q534q509j23p612K7366P659K1218J6822
14809B6008j0465o832P379p135j371J5048j9913L591j5216j1187L3337O6686O403
$$ plain form
14796 86333 64219 13085 -11653 -19196 75 45517 21021 -8046 -24703 -40210 -31043 206
14784 206 4014 -28238 2108 98757 113101 88686 113819 117332 117667 108089 89845 47327 26151
14771 26151 25381 18293 23038 24178 7206 -35375 -30785 -30480 -37359 -28984 -39344 -53304 -69989 -53662
14757 -53662 -21177 2431 -7874 -29345 1621 -46827 -36922 -7785 -3472 18713 35118 56005
14745 56005 45510 -22094 -33856 -37766 -46424 -47954 -15361 14851 27081 27888 -867 -11075 -2368
14732 -2368 -3881 2457 31322 16068 -9247 -2528 9291 3610 -22019 -41039 -14899 -11355 6881
14719 6881 -2472 46936 69159 74369 77813 25802 -13848 4296 24151 13803 12000 11395 -3515
14706 -3515 15078 35727 9483 -22937 -18510 -16704 -59606 -73149 -19491 -21216 -26212 -8799 -20631
$$ packed form
14796H6333k2114n1134k4738p543J9271M5442k4496k9067j6657j5507R167L1249
14784B06L808l2252L0346R6649J4344k4415K5133L513L35r578j8244m2518k1176
14771B6151p70p088M745J140j6972m2581M590L05o879Q375j0360j3960j6685J6327
14757e3662L2485K3608j0305k1471L0966m8448R905K9137M313K2185J6405K0887
14745E6005j0495o7604j1762l910q658j530L2593L0212J2230Q07k8755j0208Q707
14732b368j513O338K8865j5254k5315O719J1819n681k5629j9020K6140L544J8236
14719F881r353M9408K2223N210L444n2011l9650J8144J9855j0348j803o05j4910
14706c515J8593K0649k6244l2420M427J806m2902j3543N3658j725m996J7413j1832
$$ plain form
14693 -20631 11512 -8365 -18619 -958 -11213 -7175 12406 -14249 -49108 -99129 -71614 -56447
14681 -56447 -51975 -9220 12420 29368 37443 28386 12712 -22345 12461 47106 23018 22212 6003
14668 6003 -37153 -32050 -41335 -38698 -22218 -19369 28827 37020 48399 21919 -8143 29100 18406
14655 18406 -47557 -106988 -123919 -97541 -78047 -70306 -43751 -92962 -85258 -94314 -65145 -4691
14643 -4691 20566 18208 -10502 -34187 28109 23781 799 29677 22101 4054 -20783 -1752
14631 -1752 19329 49966 67518 52834 47486 25263 29273 22733 -17220 -31272 -28662 -29647 -38332
14618 -38332 -14308 -48952 -82349 -95913 -116225 -98392 -73105 -36972 -5533 -10662 -34411 -45463
14606 -45463 -30880 -11645 23671 46521 24762 -12537 -45861 -59601 -27380 -58974 -64574 -61214
$$ packed form
14693b0631L2143j9877j0254J7661j0255M038J9581k6655l4859n0021K7515J5167
14681e6447M472M2755K1640J6948Q075r057j5674l5057L4806L4645k4088q06j6209
14668F003m3156N103r285K637J6480K849M8196Q193J1379k6480l0062L7243j0694
14655A8406o5963n9431j6931K6378J9494P741K6555m9211P704r056K9169O0454
14643d691K5257k358k8710k3685O2296m328k2982K8878p576j8047k4837J9031
14631a752K1081L0637J7552j4684n348k2223M010o540l9953j4052K610r85q685
14618c8332K4024l4644l3397j3564k0312J7833K5287L6133L1439n129k3749j1052
14606d5463J4583J9235L5316K2850k1759l7299l3324j3740L2221l1594n600L360
$$ plain form
14594 -61214 -39216 -37540 -28019 -22901 -12162 -45844 -23228 -1519 -33460 -54524 -79401 -75573
14582 -75573 -9441 46177 27505 27514 -16776 -19508 3404 22108 24204 46589 47530 40515 20833
14569 20833 1057 -56483 -84455 -91075 -87006 -64261 -30802 440 -7537 -15677 -1223 15153
14557 15153 3193 15191 45203 19040 12061 -20992 -9592 6295 13319 32286 46844 31554
14545 31554 -19411 -45162 -56550 -65505 -8171 14686 11595 -27683 -39086 -29606 -24694 -3120
14533 -3120 -2004 -23256 -28687 -35083 -49206 -69441 -69963 -39349 -30865 -18320 -7577 1921 43998
14520 43998 44592 21299 5254 6027 -20153 -10571 -6028 12662 -20267 -73154 -65853 -27942 -13906
14507 -13906 19655 39498 4648 -26960 24792 45665 -20485 -52900 -26080 -4626 -4632 25540
$$ packed form
14594f1214K1998J676R521N118J0739l3682K2616K1709l1941k1064k4877L828
14582g5573O6132N5618j8672Rm4290k732K2912J8704K096K2385R41p015j9682
14569B0833j9776n7540k7972o620M069K2745L3459L1242p977q140J4454J6376
14557A5153j1960J1998L0012k6163o979l3053J1400J5887P024J8967J4558j5290
14545C1554n0965k5751j1388q955N7334K2857l091l9278j1403R480M912K1574
14533c120J116k1252n431o396j4123k0235n22L0614Q484J2545J0743R498M2077
14520D3998N94k3293j6045P73k6180R582M543J8690l2929n2887P301L7911J4036
14507a3906L3561J9843l4850l1608N1752K0873o6150l2415K6820K1454oL0172
$$ plain form
14495 25540 47734 23036 17963 20009 -503 -53744 -51622 -14651 -7788 11542 22498 -4910
14483 -4910 -41223 -56907 9051 58743 26585 6818 9470 2112 28830 47663 -9406 -77663
14471 -77663 -76365 -35690 -14670 -26886 -22462 10591 -5151 -13490 -8551 18223 -21809 -45120
14459 -45120 10745 96234 82676 81462 63385 18322 -42409 -61614 -57204 -47189 -34524 -15013
14447 -15013 19521 38552 54163 14744 -12417 27627 53438 46930 49199 56107 25364 23198
14435 23198 42515 32353 53758 46426 26410 36441 39639 38730 14991 -20951 29735 32182 28540
14422 28540 34696 24631 -6377 -31509 -21373 8471 12343 -2995 -33640 -52302 -61614 -69443
14410 -69443 -51101 -17556 2590 24489 -2964 -30514 -17234 27515 22976 -3414 -12368 38304
$$ packed form
14495B5540K2194k4698n073K046k0512n3241K122L6971O863J9330J0956k7408
14483d910l6313j5684O5958M9692l2158j9767K652p358K6718J8833n7069o8257
14471g7663J298M0675K1020j2216M424L3053j5742q339M939K6774m0032k3311
14459d5120N5865Q5489j3558j214j8077m5063o0731j9205M410J0015J2665J9511
14447a5013L4534J9031J5611l9419k7161M0044K5811o508K269O908l0743k166
14435B3198J9317j0162K1405p332k0016J0031L198r09k3739l5942N0686K447l642
14422B8540O156j0065l1008k5132J0136K9844L872j5338l0645j8662r312p829
14410f9443J8342L3545K0146K1899k7453k7550J3280M4749m539k6390q954N0672
$$ plain form
14398 38304 14567 -16730 13137 -4235 -7584 -36707 -33624 -24886 -28027 -37338 -43080 -45267 -11392
14385 -11392 -6926 24185 46557 54972 41860 14698 16741 8731 -34581 -40688 -60532 -89614 -79428
14372 -79428 -44078 -34158 -85977 -75857 -53780 -22931 -3717 -10604 -18419 -2868 -11908 -45610
14360 -45610 -42792 -48124 -55218 -7645 4502 -14901 -48209 -42090 -52848 -55896 -53905 -74019 -97907
14347 -97907 -94966 -91199 -21865 12128 53624 74846 35144 33020 6879 1511 -4349 -16551 -35053
14334 -35053 -19615 -31056 -12842 -873 -11125 -43600 -25575 17481 -4990 -32403 -49156 -102017
14322 -102017 -109458 -65951 -51436 -43065 -36459 11790 6074 -24099 -16700 -17381 -13653 10611 32920
14309 32920 43127 42293 57885 51091 70315 85837 78133 28738 -32828 -82904 -116827 -97639
$$ packed form
14398C8304k3737l1297K9867j7372l349k9123L083Q738l141r311n742k187L3875
14385a1392M466L1111K2372Q415j3112k7162K043q010m3312o107j9844k9082J0186
14372g9428L5350R920n1819J0120K2077L0849J9214o887p815J5551r040l3702
14360d5610K818n332p094M7573J2147j9403l3308O119j0758l048J991k0114k3888
14347i7907K941L767O9334L3993M1496K1222l9702k124k6141n368n860j2202j8502
14334c5053J5438j1441J8214J1969j0252l2475J8025M3056k2471k7413j6753n2861
14322a02017p441M3507J4515Q371O606M8249n716l0173P399o81L728K4264K2309
14309C2920J0207q34J5592o794J9224J5522p704m9395o1566n0076l3923J9188
$$ plain form
14297 -97639 -46705 -7189 19431 24814 37471 43890 64414 66285 24400 -25901 -58628 -51082
14285 -51082 -24626 -31723 1478 -3798 -13008 -21691 -43938 -21425 -28926 -25275 -4685 4978 5911
14272 5911 -2063 -25 -11392 -7628 23006 22090 -3545 -5328 -2516 34906 15775 45114 1204
14259 1204 -29956 -53465 -75192 -75285 -85319 -73141 -43977 -29484 -15642 -22130 -88970 -60339 -31494
14246 -31494 -60625 -37804 -17454 -17963 -34292 -58535 -29731 -34946 -44826 -39078 -18251 29558 41692
14233 41692 7197 -26678 -557 -17669 -20172 -50976 -30752 -6919 -34486 -23948 -51904 -55618
14221 -55618 -21016 135 14017 -171 23468 19777 30824 83388 124677 106893 108307 87480
14209 87480 66006 44157 14431 9408 17103 43638 57263 52501 29992 18904 -939 3200
$$ packed form
14297i7639N0934L9516K6620N383J2657O419K0524J871m1885n0301l2727P546
14285e1082K6456p097L3201n276r210q683k2247K2513p501L651K0590R663R33
14272E911p974K038j1367L764L0634r16k5635j783K812L7422j9131K9339m3910
14259A204l1160k3509k1727r3j0034J2178K9164J4493J3842o488o6840K8631K8845
14246c1494k9131K2821K0350n09j6329k4243K8804n215r880N748K0827M7809J2134
14233D1692l4495l3875K6121j7112k503l0804K0224K3833k7567J0538k7956l714
14221e5618L4602K1151J3882j4188K3639l691J1047N2564M1289j7784J414k0827
14209H7480k1474k1849k9726n023P695K6535J3625m762k2509j1088j9843M139
$$ plain form
14197 3200 63763 79649 108248 107794 79796 36279 47002 58929 83559 134168 209053 276830
14185 276830 293750 354356 409076 524116 652530 734719 850421 943699 1020037 1090525 1104656
14174 1104656 1067000 1020163 910252 817399 722392 614059 563748 461696 358519 342860
14164 342860 309174 309637 313255 250300 208019 229971 247696 250486 230955 251418 230097 197074
14152 197074 211112 271109 315903 319875 331981 385912 443138 498345 594689 692900 832958
14141 832958 949322 945811 965375 1017083 1019854 987325 930717 852077 804106 724884 621153
14130 621153 515875 444731 423176 356331 294064 220637 217091 229443 227220 210440 198007 169151
14118 169151 146367 135719 87794 66039 76191 89395 62021 46020 64231 82186 108030
$$ packed form
14197C200O0563J5886K8599m54k7998m3517J0723J1927K4630N0609P4885O7777
14185B76830J6920O0606N4720J15040J28414Q2189J15702R3278P6338P0488J4131
14174A104656l7656m6837j09911r2853r5007j08333n0311j02052j03177j5659
14164C42860l3686M63L618o2955m2281K1952J7725K790j9531K0463k1321l3023
14152A97074J4038N9997M4794L972J2106N3931N7226N5207R6344R8211J40058
14141H32958J16364l511J9564N1708K771l2529n6608p8640m7971p9222j03731
14130F21153j05278p1144k1555o6845o2267p3427l546J2352k223j6780j2433k8856
14118A69151k2784j0648m7925k1755J0152J3204k7374j6001J8211J7955K5844
$$ plain form
14107 108030 48595 15665 -1616 -2356 21758 57349 54554 56865 99358 108744 126724 103924
14095 103924 43519 24364 49775 46906 49944 68700 58931 31888 -2309 6349 1491 -3171 8098
14082 8098 34233 52503 35836 3535 7796 -4864 23889 18099 34006 63251 52084 32032
14070 32032 24156 45037 14395 16235 -4085 -5866 -19505 1571 44608 43865 55942 9387 4590
14057 4590 -6937 -40858 -16000 -66546 -6621 21304 -5355 -38963 -87804 -82036 -38184 -57694
14045 -57694 -42298 -15241 40157 32306 -7384 8266 -4032 -16652 -12082 -35301 -53178 -23771
14033 -23771 -21816 -45622 -50248 -35494 -37610 -58344 -14267 -46947 -56665 -46714 -6480 -13524 -59987
14020 -59987 -39469 -18551 -8240 36538 51118 36220 31819 33835 4480 6350 18284 10855
$$ packed form
14107A08030n9435l2930j7281p40K4114L5591k795K311M2493R386J7980k2800
14095A03924o0405j9155K5411k869L038J8756r769k7043l4197Q658m858m662J1269
14082H098K6135J8270j6667l2301M261j2660K8753n790J5907K9245j1167k0052
14070C2032p876K0881l0642J840k0320j781j3639K1076M3037p43J2077m6555m797
14057D590j1527l3921K4858n0546N9925K7925k6659l3608m8841N768M3852j9510
14045e7694J5396K7057N5398p851l9690J5650j2298j2620M570k3219j7877K9407
14033b3771J955k3806m626J4754k116k0734M4077l2680r718R951M0234p044m6463
14020e9987K0518K0918J0311M4778J4580j4898m401K016k9355J870J1934p429
$$ plain form
14008 10855 12299 -19323 -24027 -21332 -13265 -32306 -24102 16461 30977 24212 6992 52739 80621
13995 80621 38615 -2989 11507 13149 -31901 -64601 -80326 -73105 -78636 -91329 -59218 -3389
13983 -3389 -7462 -12149 16601 19663 6193 -19871 -462 -7428 -7094 5245 1541 6553 -39654
13970 -39654 -51754 -61832 -13272 13002 31513 49337 37523 184 -52024 -45335 -5077 17463
13958 17463 3080 10031 -12699 -51059 -65233 -73341 -85975 -90548 -97308 -97647 -69908 -63472 -47479
13945 -47479 -17929 -4233 -45957 -51964 -42625 -10641 -10286 -15812 20631 32484 52028 50572 20941
13932 20941 -27429 -40609 -73167 -65950 -29699 4447 16922 -5082 1727 -18166 -35244 -26293
13920 -26293 13220 10887 -37600 -17880 -15493 -35308 -55150 -43861 -10044 -43224 -67949 -14913
$$ packed form
14008A0855J444l1622m704K695Q067j9041Q204M0563J4516o765j7220M5747K7882
13995H0621m2006m1604J4496J642m5050l2700j5725P221n531j2693L2111N5829
13983c389m073m687K8750L062j3470k6064J9409o966L34J2339l704N012m6207
13970c9654j2100j0078M8560K6274J8511J7824j1814l7339n2208O689M0258K2540
13958A7463j4383O951k2730l8360j4174q108j2634m573o760l39K7739O436J5993
13945d7479K9550J3696m1724o007R339L1984L55n526L6443J1853J9544j456k9631
13932B0941m8370j3180l2558P217L6251L4146J2475k2004O809j9893j7078Q951
13920b6293L9513k333m8487J9720K387j9815j9842J1289L3817l3180k4725N3036
$$ plain form
13908 -14913 -8751 -2100 -37414 -45175 -68944 -67660 -88739 -91878 -103617 -85682 -58452 -14017 4621
13895 4621 -2888 -26920 -49201 -50262 -46016 -12433 -8367 -10595 7704 31011 30470 55744 54393
13882 54393 28948 18673 20846 501 -15598 14866 21409 17927 12795 -20550 -45000 -16231
13870 -16231 -4250 4952 14017 -3918 13748 73208 95762 48802 35784 66156 22266 -31082
13858 -31082 -34198 -25857 21052 45536 2459 -30349 -12454 -11409 -35088 -100730 -61047 -36778
13846 -36778 -3371 -1551 -28677 -42012 -4509 -30077 -35880 -9791 -5582 -2950 -13702 -55595
13834 -55595 -47112 -59389 -54438 -17584 -25551 -8046 -7114 -30061 -35617 -29165 6015 11986 -23419
13821 -23419 -42450 -5113 21441 -15242 1392 25653 36122 34052 8873 -9907 -5972 1124
$$ packed form
13908a4913O162O651l5314p761k3769J284k1079l139j1739J7935K7230M4435J8638
13895D621p509k4032k2281j061M246L3583M066k228J8299K3307n41K5274j351
13882E4393k5445j0275K173k0345j6099L0464O543l482n132l3345k4450K8769
13870a6231J1981R202R065j7935J7666N9460K2554m6960j3018L0372m3890n3348
13858c1082l116Q341M6909K4484m3077l2808J7895J045k3679o5642L9683K4269
13846c6778L3407J820k7126j3335L7503k5568n803K6089M209K632j0752m1893
13834e5595Q483j2277M951L6854p967J7505R32k2947n556O452L5180N971l5405
13821b3419j9031L7337K6554l6683J6634K4261J0469k070k5179j8780L935P096
$$ plain form
13809 1124 -17825 -12563 27981 17094 -10623 -8549 -26997 -23995 -34787 -28595 -78231 -51847 -9968
13796 -9968 -44808 -74899 -40238 27269 23114 -11119 -11716 21739 9364 -10349 -40275 -61067
13784 -61067 -57673 -64239 -69600 -55743 2688 14530 13760 6534 5206 -16682 -33311 -34401 10436
13771 10436 11400 -10529 18583 -457 6606 11747 10844 35925 20334 3451 -32797 3611 -7454
13758 -7454 -39456 -39779 -29521 -34876 -47806 -52531 -1555 35240 -29802 -49911 -39599 -17505 12644
13745 12644 18755 -6744 8189 16070 25619 27621 14455 28305 39933 18201 17195 2025 22298
13732 22298 51478 5370 -19888 33994 28094 8952 -5704 1392 32576 27175 11599 9711
13720 9711 -2710 -20396 -26081 -65982 -24185 23955 35796 28126 5564 -49112 -33593 -26895
$$ packed form
13809A124j8949N262M0544j0887k7717K074j8448L002j0792O192m9636K6384M1879
13796i968l4840l0091L4661O7507m155l4233n97L3455j2375j9713k9926k0792
13784f1067L394o566n361J3857N8431J1842p70p226j328k1888j6629j090M4837
13771A0436R64k1929K9112j9040P063N141r03K5081j5591j6883l6248L6408j1065
13758g454l2002l23J0258n355j2930m725N0976L6795o5042k0109J0312K2094L0149
13745A2644O111k5499J4933P881R549K002j3166J3850J1628k1732j006j5170K0273
13732B2298K9180m6108k5258N3882n900j9142j4656P096L1184n401j5576j888
13720I711j2421j7686n685l9901M1797M8140J1841p670k2562n4676J5519O698
$$ plain form
13708 -26895 -69478 -54469 -59687 -74838 -50134 -39474 -60970 -71771 -59381 -42731 -23536 -33264
13696 -33264 -34275 -24041 22367 42499 56913 26422 2740 13264 29437 49018 4095 -21087
13684 -21087 -45389 -3704 27299 40594 23527 -20049 -43049 -24590 -12132 16616 68239 61539
13672 61539 38746 4184 12055 43459 51466 18075 -13072 -4968 -29488 -16161 1163 23264
13660 23264 -3115 6350 2190 -18206 -51835 -63473 -75788 -83261 -74984 -49363 -41816 -44560 -10398
13647 -10398 23552 -20323 -26776 -22697 -8026 28303 11547 -6747 3337 22142 30618 -11598
13635 -11598 -47779 -39565 -47435 -48286 -25210 -63098 -62961 -89982 -51482 -40387 -75215 -64449 -32540
13622 -32540 -34062 -49931 -43311 -31722 -37596 -19590 -11395 -4395 34112 39596 15577 10467 17377
$$ packed form
13708b6895m2583J5009n218j5151K4704J0660k1496j0801J2390J6650J9195r728
13696c3264j011J0234M6408K0132J4414l0491k3682J0524J6173J9581m4923k5182
13684b1087k4302M1685L1003J3295j7067m3576k3000J8459J2458K8748N1623o700
13672F1539k2793l4562P871L1404Q007l3391l1147Q104k4520J3327J7324K2101
13660B3264k6379R465m160k0396l3629j1638j2315p473Q277K5621P547k744L4162
13647a0398L3950m3875o453M079J4671L6329j6756j8294J0084J8805Q476m2216
13635a1598l6181Q214p870q51K3076l7888J37k7021L8500J1095l4828J0766L1909
13622c2540j522j5869O620J1589n874J8006Q195P000L8507N484k4019n110O910
$$ plain form
13609 17377 18920 -43 -16414 -31144 21950 34868 -28626 -41573 -70486 -68964 -65400 -80153
13597 -80153 -58436 -47160 -60675 -50677 1031 50406 35917 1876 -8503 17079 4983 -33394
13585 -33394 -76420 -48021 -2062 17115 38262 26934 27892 27420 39087 32831 -28970 -46116 -3926
13572 -3926 5014 3313 13702 21683 23447 35667 107494 107369 36669 -12005 -47595 -64895 -65958
13559 -65958 -56507 -31440 -47157 -32270 21687 36477 13597 26380 26091 51869 62107 44231
13547 44231 76793 51238 -3342 -58516 -59299 -54024 -11719 6269 5680 -19993 -43159 -39541 -15488
13534 -15488 27779 58892 30659 5713 10787 57545 75209 38667 20286 30273 -2335 9695
13522 9695 8541 24528 10709 -38020 -88351 -42071 -18669 4965 5238 12732 28235 62258 78893
$$ packed form
13609A7377J543j8963j6371j4730N3094J2918o3494j2947k8913J522L564j4753
13597h0153K1717J1276j3515R998N1708M9375j4489l4041j0379K5582j2096l8377
13585c3394m3026K8399M5959J9177K1147j1328R58m72J1667o256o1801j7146M2190
13572c926Q940j701J0389P981J764J2220P1827j25p0700m8674l5590j7300j063
13559f5958R451K5067j5717J4887N3957J4790k2880J2783k89K5778J0238j7876
13547D4231L2562k5555n4580n5174p83N275M2305J7988n89k5673k3166L618K4053
13534a5488M3267L1113k8233k4946N074M6758J7664l6542j8381R987l2608J2030
13522I695j154J5987j3819m8729n0331M6280K3402K3634K73P494J5503L4023J6635
$$ plain form
13509 78893 90033 79427 54837 541 -2402 4099 -740 -22981 -51191 -58982 -41943 -51917 -61172
13496 -61172 -58969 -48311 -34577 -65386 -70940 -51679 -28768 -49100 -20787 -31140 -46928 -59173
13484 -59173 -71434 -98861 -87497 -83577 -64948 -59511 -36444 9274 3085 -7299 -22740 -13411
13472 -13411 -2921 -21976 14604 37923 35208 32289 74086 97129 36195 -7461 34023 42843
13460 42843 -7054 19039 21008 -16171 -16554 -18448 -16289 28293 62853 75974 91568 103169 76360
13447 76360 52731 33885 32095 12115 16423 55820 27995 16980 21532 10107 -8925 -19890
13435 -19890 -27678 -32651 9885 38862 35529 10210 6484 10986 -8233 -47683 -49917 -93093 -106197
13422 -106197 -98930 -77605 -68380 -55375 -29793 -34338 7895 42094 45931 23498 11245 -5913
$$ packed form
13509G8893J1140j0606k4590n4296k943O501m839k2241k8210p791J7039r974r255
13496f1172K203J0658J3734l0809n554J9261K2911k0332K8313j0353j5788j2245
13484e9173j2261k7427J1364L920J8629N437K3067M5718o189j0384j5441R329
13472a3411J0490j9055L6580K3319k715k919M1797K3043o0934m3656M1484Q820
13460D2843m9897K6093J969l7179l83j894K159M4582L4560J3121J5594J1601k6809
13447G6360k3629j8846j790j9980M308L9397k7825j1015M552j1425j9032j0965
13435a9890p788m973M2536K8977l333k5319l726M502j9219l9450k234m3176j3104
13422a06197P267K1325R225J3005K5582m545M2233L4199L837k2433j2253j7158
$$ plain form
13410 -5913 363 6498 32999 39995 35099 8289 -19833 -32036 -32737 -41650 -11382 425 3979
13397 3979 -6170 -44621 -64962 -39120 -25312 -36940 -36652 19345 13287 -27350 -74538 -53615
13385 -53615 -46758 -53965 -28085 -32699 -52487 -44002 -18099 33306 48094 44277 19979 4619 -13659
13372 -13659 -17799 -2456 -11646 1879 1433 -59922 -58211 -49436 -40421 -34277 -49103 -91406 -106125
13359 -106125 -74910 -31827 -5985 -29349 -61622 -55686 -23072 -6442 -9553 -53299 -23096 40653
13347 40653 30622 -19201 -54761 -39348 19423 45832 48896 22227 -11658 -14738 -44466 -86026
13335 -86026 -111194 -122857 -97312 -26593 2579 5185 -24933 -33936 -31560 -40512 -49563 -43860 -19237
13322 -19237 20744 39332 21791 -1315 -6905 25151 15529 2989 16868 45211 77482 78237
$$ packed form
13410e913O276O135K6501O996m896k6810k8122j2203p01q913L0268J1807L554
13397C979j0149l8451k0341K5842J3808j1628K88N5997o058m0637m7188K0923
13385e3615O857p207K5880m614j9788Q485K5903N1405J4788l817k4298j5360j8278
13372a3659m140J5343r190J3525m46o1355J711Q775R015O144j4826m2303j4719
13359a06125L1215M3083K5842k3364l2273N936L2614J6630l111m3746L0203O3749
13347D0653j0031m9823l5560J5413N8771K6409L064k6669l3885l080k9728m1560
13335h6026k5168j1663K5545P0719K9172K606l0118r003K376q952r051N703K4623
13322a9237L9981J8588j7541k3106n590L2056r622j2540J3879K8343L2271P55
$$ plain form
13310 78237 52403 5617 -26340 -17742 -18597 -5011 -56479 -82797 -92407 -73102 -58863 -44637
13298 -44637 -38474 -37326 -31888 -3465 5050 23356 59709 28422 976 18818 66257 30185
13286 30185 2014 19665 15759 7143 16282 31654 32833 3416 -11513 -15715 18298 40472 59571
13273 59571 66113 52028 23966 -197 -26157 -20942 -2495 21180 17305 18856 9516 14044 20799
13260 20799 23111 25335 45474 58389 40297 -16787 -41141 -50768 -72019 -49511 -6285 -18731
13248 -18731 -14338 13593 -2895 -5750 -8106 -1156 17607 29187 39490 32775 10234 -6790 10297
13235 10297 39385 64343 79279 41346 27504 23683 -19323 -26895 -43488 -37188 -17400 2590
13223 2590 -18565 -47139 -15488 -19782 -23148 -12274 -25116 -37490 -23164 18021 19305 20767 -11334
$$ packed form
13310G8237k5834m6786l1957Q598q55J3586n1468k6318r610J9305J4239J4226
13298d4637O163J148N438K8423Q515J8306L6353l1287k7446J7842M7439l6072
13286C0185k8171J7651l906q616R139J5372J179k9417j4929m202L4013K2174J9099
13273E9571O542j4085k8062k4163k5960N215J8447K3675l875J551r340M528O755
13260B0799K312K224K0139J2915j8092n7084k4354r627k1251K2508M3226j2446
13248a8731M393K7931j6488k855k356O950J8763J1580J0303o715k2541j7024J7087
13235A0297K9088K4958J4936l7933j3842l821m3006p572j6593O300J9788J9990
13223B590k1155k8574L1651m294l366J0874j2842j2374J4326M1185J284J462l2101
$$ plain form
13210 -11334 -62967 -53953 -32695 -5683 32843 46628 40508 30023 36970 108942 174497 249211
13198 249211 298238 302737 249568 208489 214693 189350 115434 98613 115131 95434 63876 52021
13186 52021 12888 -1350 -13380 -54797 -32870 4809 30462 -31879 -7201 4652 7896 3121
13174 3121 -11643 -4215 -2923 -18039 -33635 -16798 10201 46796 82341 98099 135400 100999
13162 100999 67684 95562 129546 142159 137660 164105 252491 365232 542066 693045 856757
13151 856757 923491 808693 670591 516033 356695 220480 114134 94079 112511 54617
13141 54617 -7577 -18514 -36423 -48749 -57644 -52491 -39641 -21410 -8842 6262 -12840 -9972
13129 -9972 -28164 -38204 498 19007 36113 30020 -31873 -6045 74807 93451 77410 18068
$$ packed form
13210a1334n1633R014K1258K7012L8526J3785o120j0485O947P1972O5555P4714
13198B49211M9027M499n3169m1079O204k5343p3916j6821J6518j9697l1558j1855
13186E2021l9133j4238j2030m1417K1927L7679K5653o2341K4678J1853L244m775
13174C121j4764P428J292j5116j5596J6837K6999L6595L5545J5758L7301l4401
13162A00999l3315K7878L3984J2613m499K6445Q8386J12741J76834J50979J63712
13151H56757O6734j14798j38102j54558j59338j36215j06346k0055J8432n7894
13141E4617o2194j0937j7909j2326q895N153J2850J8231J2568J5104j9102K868
13129i972j8192j0040L8702J8509J7106o093o1893K5828Q0852J8644j6041n9342
$$ plain form
13117 18068 -13222 -9095 34261 83645 126428 174215 266978 387440 517668 676937 859914
13106 859914 927384 868043 692678 505294 362847 290507 168335 78126 72467 94004 66674
13095 66674 63950 46820 12765 10954 8314 40515 47794 23118 11380 46 -31380 -3975
13083 -3975 -4475 4486 -7372 -28610 -16581 -6423 22233 22545 -8 -13939 -7870 3400 12625
13070 12625 10707 -28087 -10485 10960 40736 69178 127416 192373 251197 277946 250679 215382
13058 215382 180045 148688 117370 66552 40929 19646 -90 -32028 -25174 -15414 3872 38150
13046 38150 25124 49733 4556 -57471 -28042 30971 41859 42477 39850 58648 39380 -1782
13034 -1782 -23589 -81934 -88270 -65498 -45303 -59106 -38750 -8903 26934 43365 40200 -16333
$$ packed form
13117A8068l1290M127M3356M9384M2783M7787R2763J20462J30228J59269J82977
13106H59914O7470n9341j75365j87384j42447p2340j22172r0209n659K1537k7330
13095F6674k724j7130l4055j811k640L2201P279k4676j1738j1334l1426K7405
13083c975n00Q961j1858k1238J2029J0158K8656L12k2553j3931O069J1270R225
13070A2625j918l8794J7602K1445K9776K8442N8238O4957N8824K6749k7267l5297
13058B15382l5337l1357l1318n0818k5623k1283j9736l1938O854R760J9286L4278
13046C8150j3026K4609m5177o2027K9429N9013J0888O18k627J8798j9268m1162
13034a782k1807n8345o336K2772K0195j3803K0356K9847L5837J6431l165n6533
$$ plain form
13022 -16333 -13890 15667 69191 71164 39663 23918 -35913 -44430 -9478 13611 33077 11301
13010 11301 -15874 -30073 -31473 -24288 -16576 -21795 -38583 -23580 -57543 -78691 -56042 -22837
12998 -22837 -1297 -51104 -82087 -54715 -18116 -22572 -26183 -34702 -53340 -40476 846 4065
12986 4065 -22896 -13458 6894 7099 2659 8014 13823 9026 -74088 -106272 -73152 -53172 -81960
12973 -81960 -82794 -64068 -38158 -44729 -46610 -25240 -33523 -5547 1014 -21306 6829 55745 74079
12960 74079 29715 12982 1125 -4501 35688 37228 47240 48351 67395 71098 54642 69011
12948 69011 32780 -17612 -37707 -43374 -25704 1378 561 23155 -12690 -33737 -53138 -31578
12936 -31578 32141 27370 -7291 -28955 -16999 -27365 -67803 -84294 -36774 -2083 -4992 -27283
$$ packed form
13022a6333K443K9557N3524J973l1501j5745n9831q517L4952K3089J9466k1776
13010A1301k7175j4199j400P185P712n219j6788J5003l3963k1148K2649L3205
12998b2837K1540m9807l0983K7372L6599m456l611q519j8638J2864M1322L219
12986D065k6961R438K0352K05m440N355N809m797q3114l2184L3120J9980k8788
12973h1960q34J8726K5910o571j881K1370q283K7976O561k2320K8135M8916J8334
12960G4079m4364j6733j1857n626M0189J540J0012J111J9044L703j6456J4369
12948F9011l6231n0392k0095n667J7670K7082q17K2594l5845k1047j9401K1560
12936c1578O3719m771l4661k1664J1956j0366m0438j6491M7520L4691k909k2291
$$ plain form
12924 -27283 -13437 42576 76085 49031 1682 -36696 -11208 37787 37885 35693 63495 10717
12912 10717 8263 37348 35945 1522 -27403 -29501 -70925 -111797 -87714 -33551 -41838 -52240
12900 -52240 -73761 -62121 -65282 -68739 -56111 -46431 -4935 35609 54709 32870 -17771 -53816
12888 -53816 -73802 -78763 -76728 -69766 -15199 -263 -46169 -51471 -29475 -20260 -24549 -30675 -6761
12875 -6761 53874 65346 51844 18323 44137 46365 27228 -5250 -15814 33757 27536 38757
12863 38757 69694 36810 41439 40243 6391 33010 47984 48355 26557 28823 25188 -24671 -51977
12850 -51977 -10699 5831 22121 -1668 -9785 -8684 12878 11348 -16692 -29268 2284 12293
12838 12293 -20348 -42884 -2396 7529 -6315 30292 23329 7631 34930 29484 -708 -14408
$$ packed form
12924b7283J3846N6013L3509k7054m7349l8378K5488M8995R8k192K7802n2778
12912A0717k454K9085j403l4423k8925k098m1424m0872K4083N4163q287j0402
12900e2240k1521J1640l161l457J2628R680M1496M0544J9100k1839n0641l6045
12888e3816j9986m961K035O962N4567J4936m5906n302K1996R215m289o126K3914
12875f761O0635J1472j3502l3521K5814K228j9137l2478j0564M9571o221J1221
12863C8757L0937l2884M629j196l3852K6619J4974L71k1798K266l635m9859k7306
12850e1977M1278J6530J6290k3789q117J101K1562j530k8040j2576L1552J0009
12838A2293l2641k2536M0488R925j3844L6607o963j5698K7299n446l0192j3700
$$ plain form
12826 -14408 4121 73072 61646 24391 -19658 -11406 -15143 -9917 12546 28228 23229 10146
12814 10146 3692 11746 16567 45639 15538 38550 75828 32917 -7960 -17209 -50524 -27983
12802 -27983 -30561 -42897 -76723 -91254 -60692 -18873 12656 5478 32530 41057 -14802 -26034
12790 -26034 -29899 -38833 -41182 -47032 -12184 6673 4701 -3241 -13337 10528 26287 78261 74962
12777 74962 4348 16320 29946 14782 25450 82738 61008 54533 21461 -33858 -15936 9947
12765 9947 -4087 -14802 40953 55484 70440 78672 35203 27895 37298 33227 -8227 10887 4754
12752 4754 -5944 -43896 -72024 -92308 -55016 -12900 27627 32267 9921 10713 22850 50258
12740 50258 43040 29450 16076 28452 14362 16917 30380 60122 43272 -1695 11666 46217
$$ packed form
12826a4408J8529O8951j1426l7255m4049Q252l737N226K2463J5682m999j3083
12814A0146o454Q054M821K9072l0101K3012L7278m2911m0877r249l3315K2541
12802b7983k578j2336l3826j4531L0562M1819L1529p178K7052Q527n5859j1232
12790b6034l865q934k349n850L4848J8857j972p942j0096K3865J5759N1974l299
12777G4962p0614J1972J3626j5164J0668N7288k1730o475l3072n5319J7922K5883
12765I947j4034j0715N5755J4531J4956Q232m3469p308R403m071m1454J9114o133
12752D754j0698l7952k8128k0284L7292M2116M0527M640k2346P92J2137K7408
12740E0258p218j3590j3374J2376j4090K555J3463K9742j6850m4967J3361L4551
$$ plain form
12728 46217 41353 -25503 -64997 -36024 -18894 24488 29113 14023 4874 -774 12435 63043
12716 63043 56577 22333 9433 43696 37486 11720 1439 12348 2978 19935 8595 -18410
12704 -18410 1129 -23251 -33492 -21784 -54643 -84105 -56827 -14178 14134 469 -33933 -51154
12692 -51154 -57101 -73205 -54875 -44495 -83549 -74201 -42233 -23735 -38361 -5992 21896 -11516
12680 -11516 -33268 -24013 -14370 -30048 -4116 -27095 -43315 -29613 -10931 -12589 -37830 -5057
12668 -5057 -6391 -33227 -37517 -9906 18417 34868 55589 77038 51732 39986 -11488 -20731
12656 -20731 17927 42532 36566 25397 -5613 -47826 -52462 -38581 -33770 -36538 22925 48629
12644 48629 26535 3488 -38006 -35909 -21960 -27162 -18123 -8646 593 -9589 -31283 -51244 -25814
$$ packed form
12728D6217m864o6856l9494K8973J7130M3382M625j5090r149n648J3209N0608
12716F3043o466l4244j2900L4263o210k5766j0281J0909r370J6957j1340k7005
12704a8410J9539k4380j0241J1708l2859k9462K7278M2649K8312j3665l4402j7221
12692e1154n947j6104J8330J0380l9054R348L1968J8498j4626L2369K7888l3412
12680a1516k1752R255R643j5678K5932k2979j6220J3702J8682j658k5241L2773
12668e057j334k6836m290K7611K8323J6451K0721K1449k5306j1746n1474r243
12656b0731L8658K4605n966j1169l1010m2213m636J3881M811k768N9463K5704
12644D8629k2094k3047m1494K097J3949n202R039R477R239j0182k1694j9961K5430
$$ plain form
12631 -25814 -30368 -21996 -9110 2365 33843 40270 18833 9016 16423 -1531 -25964 -15104 13931
12618 13931 41161 -29848 -52432 -13237 7679 28421 -9784 -23395 -36513 -49381 -4850 42513
12606 42513 37177 17690 21660 11488 -1857 -34627 -62399 -62465 -71785 -41825 -44189 -44570 -3113
12593 -3113 -742 -36426 -29347 -31011 -29239 20001 41006 47492 62125 29553 -92 -19924 -34259
12580 -34259 -28393 -28229 -53185 -64798 -65330 -45845 -37320 -57331 -38309 30689 67875 31668 -4067
12567 -4067 -2944 -10545 -21798 -9135 8882 6227 -10223 -10264 28008 14669 18707 -5549 22507
12554 22507 47425 34469 -8938 -26405 -16289 13801 9470 -4904 33360 52328 44042 2434
12542 2434 -13817 -1014 -11939 3265 32023 36134 42178 26179 39124 41871 53707 47696 7328
$$ packed form
12631b5814m554Q372J2886J1475L1478O427k1437r817P407j7954k4433J0860K9035
12618A3931K7230p1009k2584L9195K0916K0742l8205j3611j3118j2868M4531M7363
12606D2513n336j9487L970j0172j3345l2770k7772o6r320K9960k364l81M1457
12593c113K371l5684P079j664J772M9240K1005O486J4633l2572k9645j9832j4335
12580c4259N866J64k4956j1613n32J9485Q525k0011J9022O8998L7186l6207l5735
12567d067J123p601j1253J2663J8017k655j6450m1L8272j3339M038k4256K8056
12554B2507K4918j2956m3407j7467J0116L0090m331j4374L8264J8968q286m1608
12542B434j6251J2803j0925J5204K8758M111O044j5999J2945K747J1836o011m0368
$$ plain form
12529 7328 -24175 -30279 -14118 34579 35892 13371 -19258 -32664 16974 34462 37802 31833 -9457
12516 -9457 -33980 -20715 -46026 -81000 -68098 -30043 16561 30974 46138 33521 38713 37195
12504 37195 46207 56470 70442 89998 87669 58048 15569 -24054 -56614 -31145 14776 45371
12492 45371 86379 60628 52906 35916 19038 -15426 -36659 -39682 -17739 -5892 -11707 -17032
12480 -17032 -15121 -47128 -29317 441 17493 -7760 -41018 -57412 -29202 -724 20872 24850
12468 24850 31502 14278 40385 44423 24835 7466 6322 -12580 -40450 -41484 -27312 2018
12456 2018 21384 40446 49950 22278 7012 11894 10635 -21664 27516 30973 6566 -1670 28053
12443 28053 41691 38665 16493 23387 21717 9390 -32300 6823 41930 13492 18859 -7505
$$ packed form
12529G328l1503o104J6161M8697J313k2521l2629j3406M9638J7488L340n969m1290
12516i457k4523J3265k5311l4974J2902L8055M6604J4413J5164j2617N192j518
12504C7195R012J0263J3972J9556k329k9621m2479l9623l2560K5469M5921L0595
12492D5371M1008k5751p722j6990j6878l4464k1233l023K1943J1847n815n325
12480a7032J911l2007J7811K9758J7052k5253l3258j6394K8210K8478K1596L978
12468B4850O652j7224K6107M038j9588j7369j144j8902k7870j034J4172K9330
12456B018J9366J9062R504k7672j5266M882j259l2299M9180L457k4407q236K9723
12443B8053J3638l026k2172O894j670j2327m1690L9123L5107k8438N367k6364
$$ plain form
12431 -7505 -74659 -46480 33882 62993 38152 47891 61015 62322 59302 68834 108393 76079 19930
12418 19930 6067 32809 73276 22485 1069 39168 40800 64706 28349 -62082 -80466 -80406
12406 -80406 -45860 -19570 -2898 30813 6447 2290 -1763 -19770 11989 -5215 6400 19835
12394 19835 63508 32448 -1594 -12793 6362 17090 -15359 -12011 29951 51281 9984 -5771
12382 -5771 -14237 14386 23255 37710 70836 67618 34588 -4122 -1330 32238 48445 32408 42283
12369 42283 18391 18510 4233 -42581 5943 17749 -17043 -58573 -65011 -85803 -91763 -47048
12357 -47048 -39683 -30508 -14279 28149 13325 -28203 -34886 -1538 -16543 -17523 16038 69908 58942
12344 58942 -5382 -86398 -62226 -14016 11791 5912 3469 18354 12401 -13294 -33651 -31659
$$ packed form
12431g505o7154K8179Q0362K9111k4841R739J3124J307l020R532L9559l2314n6149
12418A9930j3863K6742M0467n0791k1416L8099J632K3906l6357r0431j8384O0
12406h0406L4546K6290J6672L3711k4366m157m053j8007L1759j7204J1615J3435
12394A9835M3673l1060l4042j1199J9155J0728l2449L348M1962K1330m1297j5755
12382e771q466K8623Q869J4455L3126l218l3030l8710K792L3568J6207j6037R875
12369D2283k3892J19j4277m6814M8524J1806l4792m1530o438k0792n960M4715
12357d7048P365R175J6229M2428j4824m1528o683L3348j5005r80L3561N3870j0966
12344E8942o4324q1016K4172M8210K5807n879k443J4885n953k5695k0357J992
$$ plain form
12332 -31659 -12772 -15536 -14823 -36583 -71444 -52358 -31181 -13453 -20652 -6572 -3782 -18394 -32267
12319 -32267 -28409 -28206 -55137 -53658 -3338 16127 -20844 -55647 -28026 -16478 -38283 -47678 -53593
12306 -53593 -60644 -23846 -24230 5226 35157 32060 20133 2478 -29768 -12375 -22843 -37152
12294 -37152 -42505 -37012 -28435 -48339 -52250 -10911 -31092 -50763 -34371 -36407 -53727 -72523 -78902
12281 -78902 -38474 -3128 -21456 -58430 -66229 -30700 18069 53446 55974 27372 49236 30301
12269 30301 14190 44993 30658 10340 44510 61878 24890 -40291 -86197 -60156 -18162 -4723
12257 -4723 1493 -14020 -15670 -10065 -10906 -42425 -27645 -36271 -43575 -23158 -27592 -61262 -46211
12244 -46211 -6165 -14729 19728 5483 -29961 -29981 -44354 -60339 -77248 -75711 -46501 852 10839
$$ packed form
12332c1659J8887k764P13k1760l4861J9086K1177J7728p199J4080K790j4612j3873
12319c2267L858K03k6931J479N0320J9465l6971l4803K7621J1548k1805r395n915
12306e3593p051L6798l84K9456K9931l097j1927j7655l2246J7393j0468j4309
12294c7152n353N493Q577j9904l911M1339k0181j9671J6392k036j7320j8796o379
12281g8902M0428L5346j8328l6974p799L5529M8769L5377K528k8602K1864j8935
12269C0301j6111L0803j4335k0318L4170J7368l6988o5181m5906K6041M1994J3439
12257d723O216j5513j650N605q41l1519J4780q626p304K0417m434l3670J5051
12244d6211M0046q564L4457j4245l5444k0j4373j5985j6909J537K9210M7353R987
$$ plain form
12231 10839 16165 34511 52530 42390 18600 -21217 24895 74026 65211 28611 6584 -11854
12219 -11854 -18474 7782 -1277 -31345 -79185 -81347 -75339 -49788 -28144 -365 28121 23815 16085
12206 16085 13821 10061 -4855 -16434 -35331 -31771 -24548 -11671 -16331 20074 38068 36847 23112
12193 23112 30285 26239 24556 11224 -17501 -13394 -39313 -57266 -84707 -91785 -30993 -8847 -921
12180 -921 16049 -19662 9754 -2452 -36651 -8662 7374 -16008 -49069 -48777 -42735 -4566 25010
12167 25010 35036 15982 31398 5168 11822 29097 -30581 -57059 -5039 23815 56485 43239
12155 43239 -10635 -14655 -5143 16133 49512 46519 46327 44002 7483 -35600 -39774 -16328 -5466
12142 -5466 -1698 -2940 32846 47473 14278 22168 56917 54959 31167 30750 22559 -20817 -24695
$$ packed form
12231A0839N326J8346J8019j0140k3790l9817M6112M9131q815l6600k2027j8438
12219a1854o620K6256r059l0068m7840k162O008K5551K1644K7779K8486m306p730
12206A6085k264l760j4916j1579j8897L560P223J2877m660L6405J7994j221j3735
12193B3112P173m046j683j3332k8725M107k5919j7953k7441p078O0792K2146P926
12180i21J6970l5711K9416j2206l4199K7989J6036k3382l3061K92O042L8169K9576
12167B5010J0026j9054J5416k6230O654J7275n9678k6478N2020K8854L2670j3246
12155D3239n3874m020R512K1276L3379k993j92k325l6519m3083m174K3446J0862
12142e466L768j242L5786J4627l3195P890L4749j958k3792m17q191m3376l878
$$ plain form
12129 -24695 -6837 -20233 -21790 6099 42942 52697 35159 -4763 -33192 -17579 4247 2990
12117 2990 -47148 -111804 -95130 -69773 -86803 -62452 -57439 -45603 -27320 3159 15432 1448
12105 1448 -2250 34173 37537 17703 27568 24490 -30217 -57620 -56415 -49955 -54118 -51087 -67131
12092 -67131 -69935 -76256 -88911 -66153 -52025 -28183 -26718 9686 22646 9476 -44595 -49506
12080 -49506 -48805 -37746 -69181 -40702 -3330 -13893 -15778 3355 9337 968 -20817 -77528 -74355
12067 -74355 -61990 -86901 -62634 -54058 -43333 -26656 16527 -3014 -6185 17005 4159 -7650
12055 -7650 -18077 -19130 -41139 -72999 -66738 -28667 39111 45716 49613 12080 -9698 2325 47231
12042 47231 41196 39776 37605 23174 7653 -43384 -75942 -35225 -11851 -38309 -73328 -67209
$$ packed form
12129b4695J7858j3396j557K7889L6843R755j7538l9922k8429J5613K1826j257
12117B990n0138o4656J6674K5357j7030K4351N013J1836J8283L0479J2273j3984
12105A448l698L6423L364j9834R865l078n4707k7403J205O460m163L031j6044
12092f7131k804o321j2655K2758J4128K3842J465L6404J2960j3170n4071m911
12080d9506P01J1059l1435K8479L7372j0563j885J9133N982q369k1785n6711L173
12067g4355J2365k4911K4267Q576J0725J6677M3183j9541l171K3190j2846j1809
12055g650j0427j053k2009l1860O261L8071O7778O605L897l7533k1778J2023M4906
12042D7231o035j420k171j4431j5521n1037l2558M0717K3374k6458l5019O119
$$ plain form
12030 -67209 -78542 -84402 -67705 -58220 -35010 -53411 -53005 -20196 7155 29056 11940 -599
12018 -599 22933 44233 32474 -785 -34307 -70568 -67613 -58213 -59565 -32995 -29843 -25076 -4712
12005 -4712 10936 4681 4315 -4951 10894 -17872 -36659 8660 48081 82050 71601 41997 34024
11992 34024 -17425 -74203 -79127 -63964 -54366 -81633 -107385 -95523 -50695 -31453 -33693 -54524
11980 -54524 -40286 -39145 -30067 -35320 -61131 -91756 -68263 -39354 -5305 4061 26649 44943
11968 44943 36113 18612 35577 52477 5226 -9458 25008 9571 -2692 37813 24761 12211
11956 12211 15741 25937 12781 17668 17520 15086 24212 -10498 -9889 -36 10929 -16353 -79456
11943 -79456 -49468 6119 47023 66529 43932 12129 45860 50711 86306 86602 30540 4408
$$ packed form
12030f7209j1333n860J6697R485K3210j8401M06L2809K7351K1901j7116j2539
12018e99K3532K1300j1759l3259l3522l6261K955R400j352K6570L152M767K0364
12005d712J5648o255l66r266J5845k8766j8787M5319L9421L3969j0449k9604p973
11992C4024n1449n6778m924J5163R598k7267k5752J1862M4828J9242k240k0831
11980e4524J4238J141R078n253k5811l0625K3493K8909L4049R366K2588J8294
11968D4943q830j7501J6965J6900m7251j4684L4466j5437j2263M0505j3052j2550
11956A2211L530J0196j3156M887j48k434R126l4710O09R853J0965k7282o3103
11943g9456K9988N5587M0904J9506k2597l1803L3731M851L5595K96n6062k6132
$$ plain form
11931 4408 2437 12402 4622 3179 18797 18887 2393 2455 3852 25787 -12342 -37020 1769 37602
11917 37602 15716 -2111 -23869 -63050 -52491 -38295 -67798 -75526 -56299 -56313 -26759 22404
11905 22404 37408 27106 62880 70278 60646 58574 72628 64995 3339 -6135 10910 -630 26213
11892 26213 31372 -31386 -2148 -15420 -61306 -37716 11257 -10169 13122 61266 72075 67100
11880 67100 73822 56896 22131 6348 21715 31858 68959 74621 69426 53623 37234 5597
11868 5597 -14034 -12904 4394 20556 6417 -22624 -61264 -43667 -47624 -30691 -17652 -12604
11856 -12604 -11245 -24272 -19045 -1897 52234 47106 27525 46965 33680 37133 39521 9924 -474
11843 -474 -11434 39384 61702 64608 49057 47820 76131 62765 90330 105678 91537 112407
$$ packed form
11931D408j971R965p780j443J5618R0j6494O2J397K1935l8129k4678L8789L5833
11917C7602k1886j7827k1758l9181J0559J4196k9503p728J9227j4K9554M9163
11905B2404J5004j0302L5774P398r632k072J4054p633o1656r474J7045j1540K6843
11892B6213N159o2758K9238j3272m5886K3590M8973k1426K3291M8144J0809m975
11880F7100O722j6926l4765j5783J5367J0143L7101N662n195j5803j6389l1637
11868E597j9631J130J7298J6162j4139k9041l8640J7597l957J6933J3039N048
11856a2604J359j3027N227J7148N4131n128j9581J9440j3285L453K388k9597j0398
11843d74j0960N0818K2318K906j5551j237K8311j3366K7565J5348j4141K0870
$$ plain form
11831 112407 59319 29648 -40766 -55329 -33613 -25129 -27052 6566 -13228 -65960 -69932 -50237
11819 -50237 -59015 -29036 -27276 -10641 -2046 -12344 1254 14584 42643 32003 57204 40929
11807 40929 -7525 7951 -3421 -18466 -15661 -13166 -42164 -96093 -61504 -29988 -9593 34781
11795 34781 85178 68231 20243 27944 76149 50171 -1956 -52937 -11236 23798 59435 51425
11783 51425 8810 25807 34231 46635 28690 56070 61958 36638 28740 21418 62148 44885
11771 44885 17709 32131 68960 56705 27178 -12880 -26731 27344 30536 -3139 -17008 9808
11759 9808 33103 50513 67238 81684 58510 4276 -41281 -18743 -16856 -9308 5984 -22106
11747 -22106 -23421 19053 16910 25949 44739 31958 53644 95125 99100 61475 30163 -20628
$$ packed form
11831A12407n3088k9671p0414j4563K1716Q484j923L3618j9794n2732l972J9695
11819e0237q778K9979J760J6635Q595j0298J3598J3330K8059j0640K5201j6275
11807D0929m8454J5476j1372j5045K805K495k8998n3929L4589L1516K0395M4374
11795C4781N0397j6947m7988P701M8205k5978n2127n0981M1701L5034L5637q010
11783E1425m2615J6997Q424J2404j7945K7380N888k5320p898p322M0730j7263
11771D4885k7176J4422L6829j2255k9527m0058j3851N4075L192l3675j3869K6816
11759I808K3295J7410J6725J4446k3174n4234m5557K2538J887P548J5292k8090
11747b2106j315M2474k143R039J8790j2781K1686M1481L975l7625l1312n0791
$$ plain form
11735 -20628 -52046 -20641 1621 54632 64715 28759 17718 20543 19692 22210 -24974 -25487 -1997
11722 -1997 5632 18957 24515 14529 8617 3067 31445 29524 54525 46604 9891 1702 -26279
11709 -26279 -45353 -20249 44179 86827 70358 67745 69106 20310 -6796 17512 28893 13819
11697 13819 13533 37165 47661 41226 8302 3049 55727 58485 29778 35763 50615 52390 47756
11684 47756 64386 67217 53238 58732 82045 39400 40228 36156 -4032 20962 20562 -31207 -44997
11671 -44997 -40666 -50568 -40268 -1972 -3860 39632 26812 -30330 -23243 -26092 -14775 9690 13979
11658 13979 -23259 -16797 8915 11993 -1691 -663 28342 82764 115337 48921 31072 53017
11646 53017 47009 25976 24659 14723 34187 54591 45259 17193 418 -27554 -24387 -8981 3830
$$ packed form
11735b0628l1418L1405K2262N3011J0083l5956j1041K825q51K518m7184n13K3490
11722a997P629J3325N558r986n912n550K8378j921K5001p921l6713q189k7981
11709b6279j9074K5104O4428M2648j6469k613J361m8796k7106K4308J1381j5074
11697A3819k86K3632J0496o435l2924n253N2678K758k8707N985J4852J775m634
11684D7756J6630K831j3979N494K3313m2645Q28m072m0188K4994m00n1769j3790
11671d4997M331r902J0300L8296j888M3492j2820n7142P087k849J1317K4465M289
11658A3979l7238O462K5712L078j3684J028K9005N4422L2573o6416j7849K1945
11646E3017o008k1033j317r936J9464K0404r332k8066j6775k7972L167J5406J2811
$$ plain form
11633 3830 24954 63581 38156 7856 14327 12275 -32921 -33531 14054 38149 61389 62533 56358
11620 56358 -6317 -14834 21526 8035 -27567 -41348 21770 36473 50293 40350 9423 28818
11608 28818 13654 -17360 9573 44434 43308 52303 67896 74150 38326 4552 -9720 3556
11596 3556 1493 10358 25754 1503 8860 32433 70342 106117 114637 81370 19153 34583 100142
11583 100142 120803 108052 87295 42347 17979 29563 31019 30728 55698 49654 53483 40717
11571 40717 2786 -20568 -21598 -33166 -15883 11375 13970 6982 16861 23320 31601 -8250 -7468
11558 -7468 48360 21268 -50383 -63034 -24390 -58669 -53780 -41569 -21281 -16609 -19453 -21753 9729
11545 9729 -4757 -9094 -2795 21786 59372 62100 49169 22971 2064 4897 -13872 -29252 9411
$$ packed form
11633C830K1124L8627k5425l0300O471k052m5196o10M7585K4095K3240J144o175
11620E6358o2675q517L6360j3491l5602j3781O3118J4703J3820r943l0927J9395
11608B8818j5164l1014K6933L4861j126Q995J5593O254l5824l3774j4272J3276
11596C556k063Q865J5396k4251P357K3573L7909L5775Q520l3267o2217J5430O5559
11583A00142K0661j2751k0757m4948k4368J1584J456k91K4970o044L829j2766
11571D0717l7931k3354j030j1568J7283K7258K595o988R879O459Q281l9851P82
11558g468N5828k7092p1651j2651L8644l4279M889J2211K0288M672k844k300L1482
11545I729j4486m337O299K4581L7586K728j2931k6198k0907K833j8769j5380L8663
$$ plain form
11532 9411 5593 33 15980 7238 10839 21209 25022 40634 45530 27310 -25452 -39989 -33369
11519 -33369 12465 23596 46812 46143 39422 43910 10217 44571 90759 41289 12175 -4695
11507 -4695 -8613 -5023 -13116 -10410 32775 41692 -13030 -46323 -92676 -70655 -2419 35428 30848
11494 30848 17303 30026 53783 49292 44689 48622 13555 -19311 6214 48493 64526 44848
11482 44848 -22402 -50369 -58095 -69271 -17031 9883 25672 13752 2283 -6182 7351 9771
11470 9771 30669 39053 7030 9225 26259 24686 54752 88998 58502 53142 54306 45447 64477
11457 64477 61799 16549 -6927 -4797 3012 43502 36706 46911 34565 28092 36413 26530 -6378
11444 -6378 -7620 -19051 6584 23276 37272 28985 70666 124825 98632 77825 71229 61156
$$ packed form
11532I411l818n560J5947q742L601J0370L813J5612M896j8220n2762j4537O620
11519c3369M5834J1131K3216o69o721M488l3693L4354M6188m9470k9114j6870
11507d695l918L590q093K706M3185Q917n4722l3293m6353K2021O8236L7847m580
11494C0848j3545J2723K3757m491m603L933l5067l2866K5525M2279J6033j9678
11482D4848o7250k7967p726j1176N2240K6914J5789j1920j1469q465J3533K420
11470I771K0898Q384l2023K195J7034j573L0066L4246l0496n360J164q859J9030
11457F4477k678m5250k3476K130P809M0490o796J0205j2346o473Q321r883l2908
11444f378j242j1431K5635J6692J3996q287M1681N4159k6193k0807o596j0073
$$ plain form
11432 61156 86544 81503 56713 30286 18852 -2524 -21946 1720 52306 -3545 -26923 3244
11420 3244 67758 111518 84843 79950 57386 37558 17333 -3464 32845 46043 31383 21148
11408 21148 13019 -13288 -23910 -10541 37932 67371 58767 42613 48598 8547 -15257 17631
11396 17631 59496 48103 44218 73265 97251 69509 34144 8101 4900 23012 56673 52111
11384 52111 60729 77579 47411 41160 33518 34775 49787 65559 20442 9775 46666 63980
11372 63980 64227 33872 36607 5846 1579 28699 42066 76274 45804 23005 16851 28158 35615
11359 35615 57299 56806 40614 57509 112561 90685 75457 112433 66885 36877 83571 82145
11347 82145 101385 83475 71163 65770 64487 67619 60444 69167 87401 113437 147903 69732 31001
$$ packed form
11432F1156K5388n041k4790k6427j1434k1376j9422K3666N0586n5851k3378L0167
11420C244O4514M3760k6675m893k2564j9828k0225k0797L6309J3198j4660j0235
11408B1148q129k6307j0622J3369M8473K9439q604j6154N985m0051k3804L2888
11396A7631M1865j1393l885K9047K3986k7742l5365k6043l201J8112L3661m562
11384E2111Q618J6850l0168o251p642J257J5012J5772m5117j0667L6891J7314
11372F3980K47l0355K735l0761m267K7120J3367L4208l0470k2799o154J1307P457
11359C5615K1684m93j6192J6895N5052k1876j5228L6976m5548l0008M6694j426
11347H2145J9240j7910j2312n393j283L132p175Q723J8234K6036L4466p8171l8731
$$ plain form
11334 31001 41512 38196 -6723 36910 68449 55701 20567 46159 59760 54357 50626 44090
11322 44090 60100 99264 99517 79378 72173 55067 65496 55510 62572 64497 65528 90346 79137
11309 79137 55165 40867 19855 -1762 34200 56637 56146 81365 99304 98874 84128 68423
11297 68423 81962 71626 48775 59534 95618 114556 128943 160255 190462 216273 303903 383150
11285 383150 478658 749854 1168781 1741539 2196322 2237720 1952411 1589627 1204682 878173
11275 878173 645646 500051 405546 332363 327796 285562 181865 173137 191629 134454 102335
11264 102335 104983 147441 148896 121539 131831 168009 206315 155044 160315 139176 94508 98350
11252 98350 83907 57179 38479 8604 -25059 -40954 -24415 11069 37259 49810 64234 94281
$$ packed form
11334C1001J0511l316m4919M3633L1539j2748l5134K5592J3601n403l731o536
11322D4090J6010L9164K53k0139p205j7106J0429r986P062J925J031K4818j1209
11309G9137k3972j4298k1012k1617L5962K2437m91K5219J7939m30j4746j5705
11297F8423J3539j0336k2851J0759L6084J8938J4387L1312L0207K5811Q7630P9247
11285C83150R5508K71196M18927N72758M54783M1398k85309l62784l84945l26509
11275H78173k32527j45595r4505p3183m567m2234j03697q728J8492n7175l2119
11264A02335K648M2458J455k7357J0292L6178L8306n1271N271k1139m4668L842
11252I8350j4443k6728j8700k9875l3663j5895J6539L5484K6190J2551J4424L0047
$$ plain form
11240 94281 69098 70673 74247 74461 75293 46717 -10390 7794 34075 25961 61983 34003 -17262
11227 -17262 -15459 32220 65150 65012 47434 53820 44053 43449 60150 111001 113429 108152 96407
11214 96407 81084 60664 95385 94133 72796 98036 105984 103540 147621 150528 83706 56300
11202 56300 55570 88706 138805 162283 130952 126627 92967 55302 31183 5132 35042 47466
11190 47466 41673 43019 33791 28526 7430 38304 72119 71245 68578 62330 62575 52961 51698 74408
11176 74408 107675 66087 6459 -8198 24405 10614 -18089 -1877 70535 62753 76697 95686
11164 95686 84711 112938 151062 119755 106901 77473 48975 12168 2821 8116 21853 17340
11152 17340 12198 31364 48622 83481 59441 70934 58339 47834 54324 63067 61655 64271 65535
$$ packed form
11240I4281k5183J575L574K14Q32k8576n7107J8184K6281q114L6022k7980n1265
11227a7262J803M7679L2930j38j7578O386r767o04J6701N0851K428n277j1745
11214I6407j5323k0420L4721j252k1337K5240P948k444M4081K907o6822k7406
11202E6300p30L3136N0099K3478l1331m325l3660l7665k4119k6051K9910J2424
11190D7466n793J346r228n265k1096L0874L3815q74k667o248K45r614j263K2710
11176G4408L3267m1588n9628j4657L2603j3791k8703J6212P2412p782J3944J8989
11164I5686j0975K8227L8124l1307j2854k9428k8498l6807r347N295J3737m513
11152A7340n142J9166J7258L4859k4040J1493j2595j0505O490Q743j412K616J264
$$ plain form
11139 65535 38407 46439 20711 15882 11712 33064 79092 91885 74378 60714 46854 45387
11127 45387 66733 85663 131076 180322 228138 225515 241400 276903 243563 225856 268284 293401
11115 293401 249941 230542 201866 166804 141760 130020 142822 109717 105037 115354 109561 115503
11103 115503 142843 113156 69404 113324 124721 103482 94220 77705 75826 82646 49116 51675
11091 51675 82063 69930 54629 65709 90277 107957 102504 109486 108059 76194 64783 86785
11079 86785 113911 119152 97998 110190 101809 87086 69878 110935 121837 121967 132102 147370
11067 147370 161244 164873 140494 166431 208532 219767 254573 230751 216964 159780 92463 102178
11055 102178 96492 91288 102476 113697 123856 129413 143599 146395 152892 158990 183030 169817 158153
$$ packed form
11139F5535k7128Q032k5728m829m170K1352M6028J2793j7507j3664j3860j467
11127D5387K1346J8930M5413M9246M7816k623J5885L5503l3340j7707M2428K5117
11115B93401m3460j9399k8676l5062k5044j1740J2802l3105m680J0317n793N942
11103A15503K7340k9687m3752M3920J1397k1239r262j6515j879O820l3530K559
11091E1675L0388j2133j5301J1080K4568J7680n453O982j427l1865j1411K2002
11079H6785K7126N241k1154J2192q381j4723j7208M1057J0902J30J0135J5268
11067A47370J3874L629k4379K5937M2101J1235L4806k3822j3787n7184o7317R715
11055A02178n686n204J1188J1221J0159N557J4186K796O497O098K4040j3213j1664
$$ plain form
11042 158153 174945 211159 213895 165324 121803 137045 150958 116419 131575 150751 146431 119497
11030 119497 98338 109576 113916 141971 141048 154615 169388 199885 188708 172281 112925 106940
11018 106940 157793 206506 237223 240119 244670 247720 238754 199914 160811 163363 187111 189724 183705
11005 183705 229202 287297 297442 267700 273668 316488 370487 411448 447379 551102 653473
10994 653473 723715 702010 651549 542477 416576 305182 280622 305728 300034 275450 288023
10983 288023 292233 258456 242924 275680 284956 262543 260344 313942 305195 296369 316675 318075 287605
10970 287605 271262 274248 279126 278003 276125 273270 265568 285752 319888 301936 350716 350318 325365
10957 325365 323128 344029 339868 371055 421002 477795 455817 445901 473466 527138 566678 563132
$$ packed form
11042A58153J6792L6214K736m8571m3521J5242J3913l4539J5156J9176m320k6934
11030A19497k1159J1238M340K8055r23J3567J4773L0497j1177j6427n9356n985
11018A06940N0853M8713L0717K896M551L050q966l8840l9103K552K3748K613o019
11005A83705M5497N8095J0145k9742N968M2820N3999M0961L5931J03723J02371
10994F53473P0242k1705n0461j09072j25901j11394k4560K5106n694k4584J2573
10983B88023M210l3777j5532L2756R276k2413k199N3598q747q826K0306J400l0470
10970B87605j6343K986M878j123j878k855p702K0184L4136j7952M8780l98k4953
10957C25365k237K0901m161L1187M9947N6793k1978r916K7565N3672L9540l546
$$ plain form
10945 563132 567779 575433 565399 585383 602052 631410 688976 710418 712435 684660 671095 718130
10933 718130 757878 752667 760845 751340 726263 695254 663430 705545 766151 818831 860052 902967
10921 902967 958394 977052 981188 1009123 1058716 1084755 1078151 1135824 1173481 1231732 1324175 1424367
10909 1424367 1528957 1614412 1664921 1695286 1766693 1833452 1939037 2028639 2196368 2403411
10899 2403411 2628311 2854401 3056050 3325188 3741338 4224302 4837617 5656756 6536742
10890 6536742 7145922 7376647 7477799 7679028 8002889 8494047 9230516 10211803 11465048
10881 11465048 12953428 14775347 17151398 20221849 24101278 29253289 36226719 45890300
10873 45890300 59811195 81090047 115946732 174819894 268044402 376789652 434114095
$$ packed form
10945E63132M647P654j0034J9984J6669K9358N7566K1442K017k7775j3565M7035
10933G18130L9748n211Q178r505k5077l1009l1824M2115O0606N2680M1221M2915
10921I02967N5427J8658M136K7935M9593K6039o604N7673L7657N8251R2443J00192
10909A424367J04590Q5455N0509L0365P1407O6759J05585Q9602J67729K07043
10899B403411K24900K26090K01649K69138M16150M82964O13315Q19139Q79986
10890F536742O09180K30725J01152K01229L23861M91158P36469R81287J253245
10881A1465048J488380J821919K376051L070451L879429N152011O973430R663581
10873D5890300J3920895K1278852L4856685N8873162R3224508J08745250N7324443
$$ plain form
10866 434114095 405935877 335912527 261570796 192218434 136597996 98524272 73547081
10859 73547081 56653857 44934566 36519844 30292015 25650829 22267154 19812891 18053815
10851 18053815 16814941 16122818 16065784 16472093 16699055 16135303 14910170 13600366 12443045
10842 12443045 11324376 10101059 8921935 7936374 7125394 6469552 5990390 5618842 5346292
10833 5346292 5142547 4984062 4832932 4732403 4626212 4475969 4287738 4105824 3920748
10824 3920748 3841426 3869786 3974226 3952956 3798136 3582659 3384475 3192209 3082516 2986175
10814 2986175 2869109 2766021 2661136 2549693 2454787 2324934 2165295 2053000 1993076 1911008
10804 1911008 1795262 1657589 1578212 1502489 1425439 1321092 1244476 1182713 1150352 1077692 993090
$$ packed form
10866D34114095k8178218p0023350p4341731o9352362n5620438l8073724k4977191
10859G3547081j6893224j1719291q414722o227829m641186l383675k454263j759076
10851A8053815j238874o92123n7034M06309K26962n63752j225133j309804j157321
10842A2443045j118669j223317j179124r85561q10980o55842m79162l71548k72550
10833E346292k03745j58485j51130j00529j06191j50243j88231j81914j85076
10824C920748p9322K8360J04440k1270j54820k15477j98184j92266j09693r6341
10814B986175j17066j03088j04885j11443r4906j29853j59639j12295n9924q2068
10804A911008j15746j37673p9377p5723p7050j04347p6616o1763l2361p2660q4602
$$ plain form
10793 993090 935550 914418 885784 850143 812521 821446 770896 738748 725286 700581 716863 718855
10781 718855 728151 725499 701816 667400 652738 693028 639419 611525 633038 586321 529255 467421
10769 467421 422132 373662 351966 370514 391356 372198 367406 366852 381584 332577 309329 317633
10757 317633 298917 275588 310554 324388 264147 268367 256912 266572 288508 308922 311915 289368
10745 289368 321136 386566 431268 439573 422361 427253 384273 333402 292314 224778 176245 114550
10733 114550 104883 120815 128397 113138 108233 138034 146936 96630 88843 80898 83530 93010 96250
10720 96250 76104 24621 -30046 3619 69873 95548 59575 60846 73183 51123 35383 38141
10708 38141 50694 61383 83752 128149 132163 99797 62737 88357 67080 14697 35209 21225
$$ packed form
10793I93090n7540k1132k8634l5641l7622Q925n0550l2148j3462k4705J6282J992
10781G18855R296k652k3683l4416j4662M0290n3609k7894K1513m6717n7066o1834
10769D67421m5289m8470k1696J8548K0842j9158m792n54J4732m9007k3248Q304
10757C17633j8716k3329L4966J3834o0241M220j1455R660K1936K0414K993k2547
10745B89368L1768O5430M4702Q305j7212M892m2980n0871m1088o7536m8533o1695
10733A14550r667J5932P582j5259m905K9801Q902n0306p787p945K632R480L240
10720I6250k0146n1483n4667L3665O6254K5675l5973J271J2337k2060j5740K758
10708C8141J2553J0689K2369M4397M014l2366l7060K5620k1277n2383K0512j3984
$$ plain form
10696 21225 27929 38219 48809 29851 6503 9448 -24495 54820 89745 77675 78324 72099 57053
10683 57053 58525 52610 67723 110247 123737 118278 105474 86265 32886 8651 21879 28172
10671 28172 23552 5603 33785 71716 70972 50995 13424 47155 77261 102937 113598 121956
10659 121956 137781 74119 17614 26876 34778 58792 105533 75222 72431 61549 72070 117180
10647 117180 138185 107035 87186 69174 134428 149159 151469 161522 136948 93207 107317 117171
10635 117171 81843 83717 92162 79944 45730 66847 83306 51291 71997 102040 100761 52819
10623 52819 62789 90844 94788 69242 13252 7067 8435 29196 55630 148943 203789 127622
10611 127622 95361 130771 148436 156996 138669 77284 80045 72649 80505 57122 14406 -19522
$$ packed form
10696B1225O704J0290J0590j8958k3348K945l3943P9315L4925j2070O49o225j5046
10683E7053J472n915J5113M2524J3490n459j2804j9209n3379k4235J3228O293
10671B8172m620j7949K8182L7931p44j9977l7571L3731L0106K5676J0661Q358
10659A21956J5825o3662n6505R262P902K4014M6741l0311k791j0882J0521M5110
10647A17180K1005l1150j9849j8012O5254J4731K310J0053k4574m3741J4110R854
10635A17171l5328J874Q445j2218l4214K1117J6459l2015K0706L0043j279m7942
10623E2819R970K8055L944k5546n5990o185J368K0761K6434R3313N4846p6167
10611A27622l2261L5410J7665Q560j8327o1385K761p396P856k3383m2716l3928
$$ plain form
10599 -19522 28665 45647 23210 531 -16133 -2660 42179 50710 63071 28517 -4094 -4124
10587 -4124 -7613 -15248 -8827 -15918 -4277 -13649 -63456 -43689 -25521 -49697 -58717 -31705 -8193
10574 -8193 24912 14786 -35971 -6337 17815 -5708 -44740 -21968 -10862 -27151 -8142 12626
10562 12626 32637 64458 75016 56100 63785 26150 -15555 -27499 16153 51441 62895 48905
10550 48905 35245 48607 103040 128506 124776 99194 85365 130264 133875 133687 79665 22357
10538 22357 -31874 -28698 -26098 -27986 -49370 -45750 -32233 -45620 -76174 -69780 -63221 -34253 43374
10525 43374 43659 -7668 7051 -12084 12546 41606 47781 34402 33711 48532 27249 -42953 -45238
10512 -45238 -28499 -60139 -46565 -11423 -27965 -56083 -30360 18536 49746 44357 28023 20530
$$ packed form
10599a9522M8187J6982k2437k2679j6664J3473M4839Q531J2361l4554l2611l0
10587d124l489p635O421p091J1641r372m9807J9767J8168k4176r020K7012K3512
10574h193L3105j0126n0757K9634K4152k3523l9032K2772J1106j6289J9009K0768
10562A2626K0011L1821J0558j8916P685l7635m1705j1944M3652L5288J1454j3990
10550D8905j3660J3362N4433K5466l730k5582j3829M4899L611j88n4022n7308
10538B2357n4231L176K600j888k1384L620J3517j3387l0554O394O559K8968P7627
10525D3374K85n1327J4719j9135K4630K9060O175j3379o91J4821k1283p0202k285
10512d5238J6739l1640J3574L5142j6542k8118K5723M8896L1210n389j6334p493
$$ plain form
10500 20530 -3906 -20896 -17365 -15243 -5758 3956 -21207 -67713 -70234 -14555 -6709 -4505 13756
10487 13756 58337 48226 10087 2550 12929 39143 43140 23483 -2325 -3184 -16796 -12929 -22605
10474 -22605 -17478 8073 -98 -30859 -39861 -24591 -21180 -27793 -15499 -38913 -31611 -7794 33441
10461 33441 16382 33429 65846 114068 144890 167884 220008 309538 384940 555498 820996
10450 820996 1230589 1733856 2146124 2163239 1864150 1457437 1055343 735434 529325 400515
10440 400515 273934 209630 189180 106898 21733 28051 37038 47132 12331 -13085 14233 50117
10428 50117 84058 50047 19202 37816 88789 133332 159549 141400 128541 102991 70595 22225
10416 22225 28290 40356 32190 -19078 -26440 -43240 -33703 -22856 6389 55411 61670 86741 95151
$$ packed form
10500B0530k4436j6990L531K122R485R714k5163m6506k521N5679P846K204J8261
10487A3756M4581j0111l8139p537J0379K6214L997j9657k5808q59j3612L867r676
10474b2605N127K5551q171l0761r002J5270L411o613J2294k3414P302K3817M1235
10461C3441j7059J7047L2417M8222L0822K2994N2124Q9530P5402J70558K65498
10450H20996M09593N03267M12268J7115k99089m06713m02094l19909k06109j28810
10440D00515j26581o4304k0450q2282q5165O318Q987J0094l4801k5416K7318L5884
10428E0117L3941l4011l0845J8614N0973M4543K6217j8149j2859k5550l2396m8370
10416B2225O065J2066q166n1268p362j6800R537J0847K9245M9022O259K5071Q410
$$ plain form
10403 95151 81028 42696 -5028 -21622 6763 18419 -24600 -13941 -37005 -72322 -75121 -41551
10391 -41551 -9626 -872 11768 -6285 -35851 -46111 -32377 5049 25949 35540 32116 26442
10379 26442 14389 24170 41083 68402 67068 73721 61354 37863 16853 -11023 -25266 16236
10367 16236 23394 -6240 -19797 -27851 -20257 -36403 -41754 -37711 14251 16496 16648 20487 -15474
10354 -15474 12922 26300 -8188 27457 22205 -7738 -10847 -14932 1514 1345 -30940 13032 66018
10341 66018 85408 60489 22583 -7031 -15793 -9032 -15329 3555 -32247 -20205 40009 -6414
10329 -6414 -8973 21985 64218 28307 -7349 5224 40953 15348 9737 32246 27261 17588 -8946
10316 -8946 -25085 -38519 -35557 -53891 -37029 -19801 6247 23461 22268 -437 18272 20308
$$ packed form
10403I5151j4123l8332m7724j6594K8385J1656m3019J0659k3064l5317k799L3570
10391d1551L1925Q754J2640j8053k9566j0260J3734L7426K0900R591l424n674
10379B6442j2053R781J6913K7319j334O653j2367k3491k1010k7876j4243M1502
10367A6236P158k9634j3557q054P594j6146n351M043N1962K245J52L839l5961
10354a5474K8396J3378l4488L5645n252k9943l109m085J6446j69l2285M3972N2986
10341F6018J9390k4919l7906k9614q762O761o297J8884l5802J2042O0214m6423
10329f414k559L0958M2233l5911l5656J2573L5729k5605n611K2509m985r673k6534
10316h946j6139j3434K962j8334J6862J7228K6048J7214j193k2705J8709K036
$$ plain form
10304 20308 42133 66050 81980 44878 26892 2837 32524 62606 41617 -11986 -19432 -27501
10292 -27501 -3636 -18496 -20512 13310 -3888 -18578 30597 44477 51382 29644 -28967 -26852
10280 -26852 -24679 -28540 -16069 -8840 -12097 10264 48363 28355 -14653 -16304 3032 -20038 -41897
10267 -41897 -44642 -14758 15835 18108 33288 56306 76901 85681 80932 61060 3896 17705
10255 17705 22944 44601 48300 52240 80254 36976 -13850 11399 9566 -49486 -82726 -34668
10243 -34668 -4432 -15776 -39491 -16345 12675 17666 33676 11055 -26777 -39718 -5698 -27504
10231 -27504 -77367 -107710 -129326 -91031 -43847 -3266 17733 25311 -5318 -8440 4789 11037
10219 11037 2803 8393 14357 -42869 -38602 -39832 -69659 -60898 -23295 -9122 9683 -8573 -30418
$$ packed form
10304B0308K1825K3917J5930l7102j7986k4055K9687L0082k0989n3603p446q069
10292b7501K3865j4860k016L3822j7198j4690M9175J3880O905k1738n8611K115
10280b6852K173l861J2471P229l257K2361L8099k0008m3008j651J9336k3070k1859
10267d1897k745K9884L0593K273J5180K3018K0595Q780m749j9872n7164J3809
10255A7705N239K1657L699L940K8014m3278n0826K5249j833n9052l3240M8058
10243c4668L0236j1344k3715K3146K9020M991J6010k2621l7832j2941L4020k1806
10231b7504m9863l0343k1616L8295M7184M0581K0999P578l0629l122J3229O248
10219A1037q234N590N964n7226M267j230k9827Q761L7603J4173J8805j8256k1845
$$ plain form
10206 -30418 -7756 4493 -8383 -20492 -41216 -46681 -33057 -5673 38221 78385 94850 97960
10194 97960 64728 35517 35059 15558 -7071 -23178 13878 -18864 -73133 -81683 -82799 -39005
10182 -39005 -32549 -63697 -86686 -67034 -52566 -37930 2008 11206 55782 55947 12103 7706 20306
10169 20306 16816 71666 100369 67386 5564 -17081 -58814 -44969 -20905 -27675 -56105 -34295
10157 -34295 -28164 -20781 -15596 -53423 -88600 -42194 11436 1913 23465 -37362 -79910 -72567 -16986
10144 -16986 33218 38691 48238 20847 41130 63133 75394 53182 -1054 11751 12632 -26448
10132 -26448 -23251 -13873 -6168 -33528 -8794 23601 4846 2398 11666 41541 38488 28275 44779
10119 44779 16814 -1810 36086 39998 28104 -18079 -73323 -77555 -17863 13238 -2608 -37315
$$ packed form
10206c0418K2662J2249j2876j2109k0724n465J3624K7384M3894M0164J6465L110
10194I7960l3232k9211m58j9501k2629j6107L7056l2742n4269q550j116M3794
10182c9005O456l1148k2989J9652J4468J4636L9938R198M4576J65m3844m397J2600
10169B0306l490N4850K8703l2983o1822k2645m1733J3845K4064o770k8430K1810
10157c4295O131P383N185l7827l5177M6406N3630r523K1552o0827m2548P343N5581
10144a6986N0204N473R547k7391K0283K2003J2261k2212n4236J2805Q81l9080
10132b6448L197R378P705k7360K4734L2395j8755k448R268K9875l053j0213J6504
10119D4779k7965j8624L7896L912j1894m6183n5244m232N9692L1101j5846l4707
$$ plain form
10107 -37315 -36349 -17910 -7809 5051 39776 30127 10343 -18142 -18009 -16541 31477 50536 17683
10094 17683 -27637 -24608 -23709 5631 -1865 -38969 -61428 -70985 -8960 32809 44458 21363 -15504
10081 -15504 -37362 -42368 -31306 -26459 39618 33366 38599 35379 29661 17818 60409 44325 32394
10068 32394 51939 71720 78474 46961 32262 24983 16648 -12987 22384 32062 67945 105971
10056 105971 142086 104216 147136 198127 255547 400038 557428 830228 1424511 2338947
10046 2338947 3012235 2916448 2352171 1783926 1258474 826579 531108 338712 222449 166010
10036 166010 140074 109646 115468 106253 95412 116825 92689 83652 126008 136734 129361 117289
10024 117289 107473 106364 133551 159856 111755 86891 59310 39098 66314 52963 5802 10555
$$ packed form
10107c7315R66J8439J0101J2860L4725r649j9784k8485J33J468M8018J9059l2853
10094A7683m5320L029Q99K9340p496l7104k2459r557O2025M1769J1649k3095l6867
10081a5504k1858n006J1062M847O6077o252N233l220n718j1843M2591j6084j1931
10068C2394J9545J9781O754l1513j4699p279q335k9635L5371R678L5883L8026
10056A05971L6115l7870M2920N0991N7420J44491J57390K72800N94283R14436
10046B338947O73288r5787n64277n68245n25452m31895k95471j92396j16263n6439
10036A66010k5936l0428N822r215j0841K1413k4136r037M2356J0726p373j2072
10024A17289r816j109K7187K6305m8101k4864k7581k0212K7216j3351m7161M753
$$ plain form
10012 10555 31241 7835 -438 48694 21969 4558 17218 35870 19354 8419 7652 -26050
10000 -26050 -41812 17182 71456 44107 87381 149382 167266 179845 219550 249376 334024 377347
9988 377347 379458 340489 275703 241630 284146 361065 432259 545523 666585 760830 792724
9977 792724 759928 674126 544025 437854 345605 269981 220250 169125 146021 116088 82878
9966 82878 68048 40287 36529 31376 44679 73923 122944 179470 137914 126353 128876 121001 180547
9953 180547 249744 311953 359107 319200 287011 227765 122431 77416 45961 13599 4099 -5047
9941 -5047 6864 -33608 -60932 -49656 3863 38160 63710 77877 59721 102315 123080 80812
9929 80812 77081 32705 13985 28145 22615 2086 1332 48969 92512 80149 21210 4899 18521
$$ packed form
10012A0555K0686k3406q273M9132k6725j7411J2660J8652j6516j0935p67l3702
10000b6050j5762N8994N4274k7349M3274O2001J7884J2579L9705K9826Q4648M3323
9988C77347K111l8969o4786l4073M2516P6919P1194J13264J21062R4245L1894
9977G92724l2796q5802j30101j06171r2249p5624m9731n1125k3104k9933l3210
9966H2878j4830k7761l758n153J3303K9244M9021N6526m1556j1561K523p875N9546
9953A80547O9197O2209M7154l9907l2189n9246j05334m5015l1455l2362r500r146
9941e047J1911m0472k7324J1276N3519L4297K5550J4167j8156M2594K0765m2268
9929H0812l731m4376j8720J4160n530k0529p54M7637M3543j2363n8939j6311J3622
$$ plain form
9916 18521 12767 35126 49967 92651 88523 59429 44067 39123 38596 66745 16530 -20642 -13631
9903 -13631 -34457 -29867 -26238 -38835 1552 41039 18679 -21318 -19613 -32 -10974 14934
9891 14934 60903 34232 41711 14017 45320 53508 83564 40297 8713 6349 35106 31299 46199
9878 46199 57998 82409 70683 64364 40850 3704 3786 2420 -9961 2590 15827 65881 86272
9865 86272 91356 110054 106819 125771 115169 141286 138723 173273 222399 236048 249253 255649 312125
9852 312125 404816 506794 640244 888084 1287942 1990425 3002971 3830988 4064295 3628682
9842 3628682 2912808 2187350 1510999 1027233 710283 502397 391847 335677 247058 187457
9832 187457 135018 116909 118608 118170 86590 111869 105602 123229 140696 154884 163795 185397 183963
$$ packed form
9916A8521n754K2359J4841M2684m128k9094j5362m944n27K8149n0215l7172P011
9903a3631k0826M590L629j2597M0387L9487k2360l9997J705J9581j0942K5908
9891A4934M5969k6671P479k7694L1303Q188L0056m3267l1584k364K8757l807J4900
9878D6199J1799K4411j1726o319k3514l7146Q2j366j2381J2551J3237N0054K0391
9865H6272N084J8698l235J8952j0602K6117k563L4550M9126J3649J3205O396N6476
9852C12125R2691J01978J33450K47840L99858P02483J012546Q28017K33307m35613
9842C628682p15874p25458o76351m83766l16950k07886j10550n6170q8619n9601
9832A87457n2439j8109J699m38l1580K5279o267J7627J7467J4188Q911K1602j434
$$ plain form
9819 183963 148245 111893 131311 134755 134951 138372 113544 69235 27403 7248 3418 24211 40683
9806 40683 31430 20754 38534 77003 106198 73550 64018 78249 67410 69534 76534 76064 44116
9793 44116 -2231 -3729 -15566 -822 16711 24335 46519 89599 103039 114874 71883 68664
9781 68664 82511 53112 66357 88907 116724 133236 90600 36177 43873 32439 27562 23781
9769 23781 7871 19055 32291 22566 27826 38789 48305 61021 49459 64125 91244 75019
9757 75019 54891 58310 94005 57189 -19015 -26620 16259 17552 28868 39441 10109 -12868
9745 -12868 -25918 2247 29696 24454 7947 -12678 9274 29547 25418 62616 107663 100779
9733 100779 57916 5044 15432 -24039 -19797 -31482 -30177 -45678 -35459 -14003 -12948 -47109
$$ packed form
9819A83963l5718l6352J9418L444J96L421k4828m4309m1832k0155l830K0793J6472
9806D0683r253j0676J7780L8469K9195l2648r532J4231j0839K124P000m70l1948
9793D4116m6347j498j1837J4744J7533P624K2184M3080J3440J1835m2991l219
9781F8664J3847k9399J3245K2550K7817J6512m2636n4423P696j1434m877l781
9769B3781j5910J1184J3236r725N260J0963R516J2716j1562J4666K7119j6225
9757G5019k0128L419L5695l6816p6204p605M2879J293J1316J0573k9332k2977
9745a2868j3050K8165K7449n242j6507k0625K1952K0273m129L7198M5047o884
9733A00779m2863n2872J0388l9471M242j1685J305j5501J0219K1456J055l4161
$$ plain form
9721 -47109 -37448 -3804 16412 3299 27708 52385 22719 2562 2085 24125 -313 -50951
9709 -50951 -41258 -44620 -42065 -20995 30454 61251 48998 34599 30159 50636 72232 40890 -1103
9696 -1103 -10898 -4028 10570 31459 24707 -4166 -15899 -9828 -25953 -7276 20908 4284 -30693
9683 -30693 -5178 37629 52971 76984 64449 29608 -4348 -39404 -59307 -29633 -20894 -25551
9671 -25551 6300 3718 22308 30047 30957 33511 14425 -23888 -31414 -35153 -40598 -36821 -19259 -40907
9657 -40907 -9013 4533 8100 5353 3238 -57653 -71318 -87498 -76476 -49025 -33932 -26258 -1200
9644 -1200 -47687 -28446 17290 50732 56758 39199 57344 58156 23075 -2832 23387 55548 39748
9631 39748 53509 31384 12143 5856 56232 46795 31458 38062 27540 34814 76687 64106 91006
$$ packed form
9721d7109R661L3644K0216j3113K4409K4677k9666k0157m77K2040k4438n0638
9709e0951R693l362K555K1070N1449L0797j2253j4399m440K0477K1596l1342m1993
9696a103r795O870J4598K0889o752k8873j1733O071j6125J8677K8184j6624l4977
9683c0693K5515M2807J5342K4013j2535l4841l3956l5056j9903K9674Q739m657
9671b5551L1851k582J8590P739R10K554j9086l8313p526l739n445L777J7562k1648
9657d0907L1894J3546L567k747k115o0891j3665j6180J1022K7451J5093P674K5058
9644a200m6487J9241M5736L3442O026j7559J8145Q12l5081k5907K6219L2161j5800
9631C9748J3761k2125j9241o287N0376r437j5337O604j0522P274M1873j2581K6900
$$ plain form
9618 91006 76200 -20753 -71781 -48601 -25661 6317 688 31081 16045 14465 31296 54931
9606 54931 14968 3999 7454 9214 73835 51223 3950 -30984 -60976 -44676 -48301 -49015 -30070
9593 -30070 16203 24391 7219 4415 10293 -26315 -51094 -17372 39796 54534 79253 70317 27713
9580 27713 32083 50210 60651 72319 53656 37456 28767 63899 75106 12855 -23291 8365
9568 8365 13250 18102 24548 32875 42723 43677 10396 29717 23887 35043 33924 56955 90224 93336
9554 93336 36564 46423 46119 22277 25154 31498 46502 52216 58076 44471 36369 47522 44845 50020
9540 50020 77866 48800 53394 51468 60826 90816 76104 18060 10221 33780 13949 64338 36891
9527 36891 12207 37631 26588 27381 18807 25279 45786 49526 30377 38630 72499 42527 39443
$$ packed form
9618I1006j4806r6953n1028K3180K2940L1978n629L0393j5036j580J6831K3635
9606E4931l9963j0969L455J760O4621k2612m7273l4934k9992J6300l625p14J8945
9593c0070M6273Q188j7172k804N878l6608k4779L3722N7168J4738K4719q936m2604
9580B7713M370J8127J0441J1668j8663j6200q689L5132J1207o2251l6146L1656
9568H365M885M852O446Q327R848R54l3281J9321n830J1156j119K3031L3269L112
9554I3336n6772R859l04k3842K877O344J5004N714N860j3605q102J1153k677N175
9540E0020K7846k9066M594j926R358K9990j4712n8044p839K3559j9831N0389k7447
9527C6891k4684K5424j1043P93q574O472K0507L740j9149Q253L3869k9972l084
$$ plain form
9514 39443 49757 15925 9851 32081 70161 62869 52524 97650 92950 58169 27634 24362 37963
9501 37963 50404 49111 16850 65006 92035 78508 41890 83025 83007 42669 14346 9595 34692
9488 34692 43365 64411 39229 -2852 -14915 23605 30521 40901 16236 16374 210 13361 21502
9475 21502 11613 -44657 -14039 45366 32779 40917 32164 44484 55067 66316 34701 16835
9463 16835 48650 43823 63380 107334 93473 68116 100174 91428 94881 87101 76641 56529 30080
9450 30080 34368 96879 99954 69319 66143 102722 117573 110679 119452 126310 114535 86767 93985
9437 93985 74926 56744 58612 62838 82586 84352 100289 121810 98422 54918 38066 59254
9425 59254 104330 115330 128370 109496 80335 70892 58160 54299 72115 82232 69477 78956
$$ packed form
9514C9443J0314l3832o074K2230L8080p292j0345M5126m700l4781l0535l272J3601
9501C7963J2441j293l2261M8156K7029j3527l6618M1135j8m0338k8323m751K5097
9488C4692Q673K1046k5182m2081j2063L8520O916J0380k4665J38j6164J3151Q141
9475B1502r889n6270L0618N9405j2587Q138q753J2320J0583J1249l1615j7866
9463A6835L1815m827J9557M3954j3861k5357L2058q746L453p780j0460k0112k6449
9450C0080M288O2511L075l0635l176L6579J4851o894Q773O858j1775k7768P218
9437I3985j9059j8182J868M226J9748J766J5937K1521k3388m3504j6852K1188
9425E9254M5076J1000J3040j8874k9161r443j2732l861J7816J0117j2755R479
$$ plain form
9413 78956 49940 63657 84920 97522 114267 101845 75399 83490 44267 15559 9841 14746
9401 14746 25629 5308 10582 50971 47406 60523 83651 102033 87821 98260 118617 128510
9389 128510 101180 79569 96712 134202 139806 138002 112686 109833 126121 147959 155855 144117
9377 144117 106142 135112 145965 135648 103757 104026 90853 85208 68452 75338 89973 65815
9365 65815 63115 95909 107970 121854 122843 96619 110450 133995 124322 104674 94825 82661 82662 109453
9351 109453 144359 96928 101170 117290 152804 184141 153804 141958 152875 129531 145811 122328
9339 122328 61969 71782 106910 107507 117542 115885 100029 138719 190855 199466 159155 119371 119883
9326 119883 131349 139958 165945 187347 214514 203734 186700 170618 159027 153618 150588 152101
$$ packed form
9413G8956k9016J3717K1263J2602J6745j2422k6446Q091l9223k8708n718M905
9401A4746J0883k0321N274M0389l565J3117K3128J8382j4212J0439K0357R893
9389A28510k7330k1611J7143L7490N604j804k5316k853J6288K1838P896j1738
9377A44117l7975K8970J0853j0317l1891K69j3173n645j6756O886J4635k4158
9365F5815k700L2794J2061J3884R89k6224J3831K3545r673j9648r849j2164JK6791
9351A09453L4906m7431M242J6120L5514L1337l0337j1846J0917k3344J6280k3483
9339A22328o0359R813L5128N97J0035j657j5856L8690N2136Q611m0311l9784N12
9326A19883J1466Q609K5987K1402K7167j0780j7034j6082j1591n409l030J513
$$ plain form
9314 152101 130459 130076 155154 203597 210244 170784 215934 271129 302971 299621 283250 268592
9302 268592 267330 231041 196293 224750 251227 231741 234174 257232 231937 215076 216577 242803
9290 242803 247004 253470 294028 310677 282155 281751 260020 271717 298492 362906 323742 294528
9278 294528 276061 255255 283480 319987 324002 291919 276100 304415 306741 274826 293298 332066
9266 332066 309305 319685 322074 326849 324592 343773 355032 356167 363313 357807 348319 375309 427383
9253 427383 426689 394365 355922 359207 376608 408651 415941 392649 378289 408019 444595 442758 456198
9240 456198 411818 408280 444946 489091 515197 502026 488779 466121 464393 477295 471657 507725
9228 507725 534047 512033 541684 600646 629616 645800 642632 648632 706849 746365 721400 726690
$$ packed form
9314A52101k1642l83K5078M8443O647l9460M5150N5195L1842l350j6371j4658
9302B68592j262l6289l4748K8457K6477j9486K433K3058k5295j6861J501K6226
9290B42803M201O466M0558J6649k8522m04k1731J1697K6775O4414l9164k9214
9278B94528j8467k0806K8225L6507M015l2083j5819K8315K326l1915J8472L8768
9266C32066k2761J0380K389M775k257J9181J1259J135P146n506r488K6990N2074
9253D27383o94l2324l8443L285J7401L2043P290k3292j4360K9730L6576j837J3440
9240D56198m4380l538L6666M4145K6106j3171j3247k2658j728J2902n638L6068
9228E07725K6322k2014K9651N8962K8970J6184l168O000N8217L9516k4965N290
$$ plain form
9216 726690 678279 681735 686950 697068 756349 838406 874798 851633 833993 806008 826022 896566
9204 896566 964856 1000578 1005216 994550 959207 985038 1045184 1082265 1090118 1050967 1051011 1021335 1036292
9191 1036292 1082500 1077837 1118828 1145618 1142551 1183255 1203902 1264035 1336658 1366251 1335585 1390511
9179 1390511 1444568 1426282 1408836 1441204 1475464 1488910 1502280 1518958 1550476 1588410 1632024
9168 1632024 1622821 1620767 1643655 1656180 1681142 1684802 1664972 1674785 1737209 1762493 1766437 1759108 1777529
9155 1777529 1779331 1771849 1775425 1776101 1776699 1792092 1765394 1732851 1738676 1734299 1729845 1701872 1679973
9142 1679973 1710095 1742229 1762113 1735479 1699606 1673690 1657850 1614492 1611989 1582373 1574928 1597264
9130 1597264 1595853 1539762 1543547 1491327 1442452 1435845 1412119 1403942 1390669 1347140 1303721 1301584
$$ packed form
9216G26690m8411L456N215J0118N9281Q2057L6392k3165j7640k7985K0014P0544
9204H96566O8290L5722M638j0666l5343K5831O0146L7081P853l9151M4k9676J4957
9191A036292M6208m663M0991K6790l067M0704K0647O0133P2623K9593l0666N4926
9179A390511N4057j8286j7446L2368L4260J3446J3370J6678L1518L7934M3614
9168A632024r203k054K2888J2525K4962L660j9830R813O2424K5284L944p329J8421
9155A777529J802p482L576O76N98J5393k6698l2543N825m377m454k7973k1899
9142A679973L0122L2134J9884k6634l5873k5916j5840m3358k503k9616p445K2336
9130A597264j411n6091L785n2220m8875o607k3726q177j3273m3529m3419k137
$$ plain form
9118 1301584 1276704 1300195 1284466 1240020 1228742 1222545 1253842 1251607 1163226 1094542 1061736 1050716
9106 1050716 1066515 1080163 1040443 1007071 976449 977931 985493 1014945 991830 904460 867980 892480
9094 892480 907232 915304 918783 883906 833101 800652 792129 779309 784139 757035 747635 730950 708122
9081 708122 685710 706575 669241 642262 648961 647704 615864 585127 552646 505993 512494 521839
9069 521839 551431 527188 499603 492542 498247 524559 490180 480469 494397 475627 465004 466943
9057 466943 457861 450415 425619 421865 424462 401284 419302 424803 356990 331190 364208 389915 424323
9044 424323 444905 443757 385571 359708 356671 328767 307578 304797 304019 312736 327550 333144 295787
9031 295787 291030 265765 254568 280209 323494 313337 308684 284824 283705 260708 274863 270790
$$ packed form
9118A301584k4880K3491j5729m4446j1278o197L1297k235q8381o8684l2806j1020
9106A050716J5799J3648l9720l3372l0622J482P562K9452k3115q7370l6480K4500
9094H92480J4752Q072L479l4877n0805l2449q523j2820M830k7104r400j6685k2828
9081G08122k2412K0865l7334k6979O699j257l1840l0737l2481m6653O501R345
9069E21839K9592k4243k7585p061N705K6312l4379r711J3928j8770j0623J939
9057D66943r082p446k4796l754K597k3178J8018N501o7813k5800L3018K5707L4408
9044D24323K0582j148n8186k5863l037k7904k1189k781p78Q717J4814N594l7357
9031B95787m757k5265j1197K5641M3285j0157m653k3860j119k2997J4155m073
$$ plain form
9019 270790 255638 242368 238058 242468 241198 270868 268624 221568 202698 180840 195100 201061 183139
9006 183139 224874 244101 216948 213706 214700 205450 186141 151086 183099 217899 193459 167761
8994 167761 181267 198162 166491 133005 143687 161844 149845 173729 169571 123681 124622 130055
8982 130055 123007 137366 177627 215919 194759 158966 144183 135916 101969 129609 136382 131309
8970 131309 138906 147543 141159 143089 144482 170836 186052 166808 173973 152837 131862 103527 93196
8957 93196 94355 65102 73510 80407 135694 165727 123976 69926 96525 110778 82233 69724
8945 69724 84758 88706 96375 111693 88631 107662 118665 100265 115567 150886 164730 121770
8933 121770 70607 115615 149506 132182 88066 100669 116639 125432 163519 172124 137965 134973
$$ packed form
9019B70790j5152j3270m310M410j270K9670k244m7056j8870k1858J4260N961j7922
9006A83139M1735J9227k7153l242R94r250j9309l5055L2013L4800k4440k5698
8994A67761J3506J6895l1671l3486J0682J8157j1999K3884m158m5890R41N433
8982A30055p048J4359M0261L8292k1160l5793j4783q267l3947K7640O773n073
8970A31309P597Q637o384J930J393K6354J5216j9244P165k1136k0975k8335j0331
8957I3196J159k9253Q408O897N5287L0033m1751n4050K6599J4253k8545j2509
8945F9724J5034L948P669J5318k3062J9031J1003j8400J5302L5319J3844m2960
8933A21770n1163M5008L3891j7324m4116J2603J5970Q793L8087Q605l4159k992
$$ plain form
8921 134973 119042 124877 96792 69437 55067 49804 35095 38241 54804 65850 74819 89402
8909 89402 87790 96829 106038 99882 111417 125965 131273 103748 128559 137208 133124 95571 82061
8896 82061 96647 106477 97843 98621 90548 66963 49118 5034 28849 15859 32134 85831 59380
8883 59380 2048 3454 43520 57122 41544 45963 88978 72073 37087 24272 19089 43548
8871 43548 5469 -7056 15402 35016 35932 47394 44675 55220 110890 137999 130458 88138 14920
8858 14920 12593 70000 79159 71859 38566 29209 30377 37899 54768 73941 109454 124020 86772
8845 86772 56005 29629 -11056 13214 53369 56944 37590 4657 2216 48148 61568 69493
8833 69493 93061 93899 72929 77585 63152 43755 -4563 -30665 -39886 -17099 39028 29869 30653
$$ packed form
8921A34973j5931N835k8085k7355j4370n263j4709L146J6563J1046Q969J4583
8909H9402j612R039R209o156J1535J4548N308k7525K4811Q649m084l7553j3510
8896H2061J4586R830q634P78q073k3585j7845m4084K3815j2990J6275N3697k6451
8883E9380n7332J406M0066J3602j5578M419M3015j6905l4986j2815n183K4459
8871D3548l8079j2525K2458J9614R16J1462k719J0545N5670K7109p541m2320p3218
8858A4920k327N7407R159p300l3293r357J168P522J6869J9173L5513J4566l7248
8845H6772l0767k6376m0685K4270M0155L575j9354l2933k441M5932J3420P925
8833F9493K3568Q38k0970M656j4433j9397m8318k6102r221K2787N6127r159P84
$$ plain form
8820 30653 78893 79288 65080 89229 77961 95562 93507 81420 90732 73608 81422 81858 46804
8807 46804 24674 10393 17742 23472 18354 -7983 -181 -37404 -36135 8738 36185 24405 34349
8794 34349 26749 19614 -29267 -710 28203 29851 13251 52247 63853 35353 31549 8341 6086
8781 6086 15114 3618 1220 -4771 -8255 -4134 19194 63585 30170 7628 61252 122642 89149
8768 89149 52305 35367 37130 9498 -8116 -29186 -21385 -8673 -46617 -68349 -42704 -55661
8756 -55661 -56335 -28215 31989 17668 13280 51575 77424 32869 -88 182 26222 30431 38723
8743 38723 47494 30053 21308 50678 88282 97417 116891 94672 65211 79032 71731 -12054 -27877
8730 -27877 3981 39567 35571 43108 33702 65282 59415 72218 115672 139067 138196 103202 57640
$$ packed form
8820C0653M8240L95j4208K4149j1268J7601k055j2087R312j7124P814M36l5054
8807D6804k2130j4281P349N730n118k6337P802l7223J269M4873K7447j1780R944
8794C4349p600p135m8881K8557K8913J648j6600L8996J1606k8500l804k3208k255
8781F086R028j1496k398n991l484M121K3328M4391l3415k2542N3624O1390l3493
8768H9149l6844j6938J763k7632j7614k1070P801J2712l7944k1732K5645j2957
8756e5661o74K8120O0204j4321m388L8295K5849m4555l2957K70K6040M209Q292
8743C8723Q771j7441q745K9370L7604R135J9474k2219k9461J3821p301q3785j5823
8730b7877L1858L5586l996P537r406L1580n867J2803M3454K3395q71l4994m5562
$$ plain form
8717 57640 11363 -43356 -25097 -12801 -13028 5466 -8801 35387 38643 4163 -10367 -10944 25291
8704 25291 29812 4421 -3390 -9320 2631 16115 17589 44041 48907 43529 58777 60901 39117
8691 39117 32791 59538 89026 36505 29285 47826 66920 56515 44331 45876 27105 39654
8679 39654 75000 105317 93508 42868 21367 42072 30969 46971 54407 54297 89763 96344 74387
8666 74387 32963 15965 64399 63869 54180 56190 78748 91412 89737 95227 83307 70011 80085
8653 80085 100009 85579 86140 130432 131805 172524 272904 407432 570714 824882 1100962
8642 1100962 1202344 1062679 832619 623309 474016 322572 239233 229079 198901 163309
8632 163309 155395 153582 125898 92639 110924 120075 102289 101370 95853 60814 48580 63246 57116
$$ packed form
8717E7640m6277n4719J8259J2296k27J8494j4267M4188L256l4480j4530n77L6235
8704B5291M521k5391p811n930J1951J3484J474K6452M866n378J5248K124k1784
8691C9117o326K6747K9488n2521p220J8541J9094j0405j2184J545j8771J2549
8679C9654L5346L0317j1809n0640k1501K0705j1103J6002P436j10L5466O581k1957
8666G4387m1424j6998M8434n30r689K010K2558J2664j675N490j1920j3296J0074
8653H0085J9924j4430N61M4292J373M0719J00380J34528J63282K54168K76080
8642A100962J01382j39665k30060k09310j49293j51444q3339j0154l0178l5592
8632A63309p914j813k7684l3259J8285R151j7786r19n517l5039j2234J4666o130
$$ plain form
8619 57116 53662 94781 99712 106290 146542 137980 144936 173486 174630 167164 219505 243885 246948
8606 246948 276828 317765 342416 411981 550646 680746 941312 1442174 1993193 2245753
8596 2245753 2057335 1694152 1341196 986882 730070 545164 469407 388325 355351 361789
8586 361789 352375 344120 309814 244487 263368 261572 219885 138058 147704 149957 158927 157839 161907
8573 161907 186634 174906 153764 114121 77905 114231 144424 136102 105045 107779 142877 164592
8561 164592 185037 174172 157791 155860 217664 357559 517550 699779 936839 1063690 1001014
8550 1001014 841584 673907 476808 347431 269833 220408 177379 121871 117974 108541 108098
8539 108098 108593 96880 54217 69011 70436 67633 74113 47800 18025 9954 -37684 -13096 15526
$$ packed form
8619E7116l454M1119M931O578M0252q562O956K8550J144p466N2341K4380L063
8606B46948K9880M0937K4651O9565J38665J30100K60566N00862N51019K52560
8596B245753j88418l63183l52956l54314k56812j84906p5757q1082l2974O438
8586C61789r414q255l4306o5327J8881j796m1687q1827R646K253Q970j088M068
8573A61907K4727j1728k1142l9643l6216L6326L0193q322l1057K734L5098K1715
8561A64592K0445j0865j6381j931O1804J39895J59991J82229K37060J26851o2676
8550A001014j59430j67677j97099j29377p7598m9425m3029n5508l897r433m43
8539A08098M95j1713m2663J4794J425k803O480k6313k9775q071m7638K4588K8622
$$ plain form
8526 15526 13574 29698 26046 36147 27671 31357 47574 78844 90899 75802 64244 51266 11944
8513 11944 -9726 -12143 45680 56699 36887 -25106 -27239 9813 39909 32754 -13669 -56369
8501 -56369 -36835 -3360 -13890 -7713 -3087 16151 26978 13432 -25050 -59033 -67812 -39746
8489 -39746 -23331 -17009 -23202 -46761 -55355 -39042 -12485 13040 67247 74462 30739 30044 -12911
8476 -12911 -39044 -36782 -18163 14343 19543 29262 33804 39776 37754 29497 20230 38215 35423 37180
8462 37180 8581 -13507 -43186 -25664 32099 42895 8459 7769 31754 14907 15300 39594 47925
8449 47925 53528 60256 100993 87760 77605 75446 40484 -11447 -41821 -17012 29703 14422
8437 14422 6073 6902 13967 -1218 18405 59849 70943 53586 50475 39204 -10900 -38930 -27105
$$ packed form
8526A5526j952J6124l652J0101q476L686J6217L1270J2055j5097j1558j2978l9322
8513A1944k1670k417N7823J1019j9812o1993k133L7052L0096p155m6423m2700
8501e6369J9534L3475j0530O177M626J9238J0827j3546l8482l3983q779K8066
8489c9746J6415O322o193k3559q594J6313K6557K5525N4207P215m3723o95m2955
8476a2911k6133K262J8619L2506N200R719M542N972k022q257r267J7985k792J757
8462C7180k8599k2088k9679J7522N7763J0796l4436o90K3985j6847L93K4294Q331
8449D7925N603O728M0737j3233j0155k159l4962n1931l0374K4809M6715j5281
8437A4422q349Q29P065j5185J9623M1444J1094j7357l111j1271n0104k8030J1825
$$ plain form
8424 -27105 -40797 -19877 -9884 -20979 -12406 7149 -3311 -20043 16770 56640 38121 26258
8412 26258 20765 34897 32804 -19126 -8299 49099 63713 42396 50061 62518 58120 25105 44635
8399 44635 47147 22 -25609 -30142 8298 64126 82692 38320 -14235 9164 61259 58770
8387 58770 53342 52800 29076 -12946 -25602 -36630 -40584 -32771 10506 16388 43271 91284 82407
8374 82407 74113 78749 86234 65563 53322 48606 27996 31945 42677 27117 3869 -12145 -48995
8361 -48995 -48541 -10007 28442 29174 45112 45656 53036 78238 80920 51935 33751 52041 36903
8348 36903 -7940 3774 38302 52712 55917 49535 20626 -7290 -402 -36691 -34126 -4418 24153
8335 24153 29606 68327 79899 67218 66313 67247 60799 38494 20218 -4022 -49002 -79692 -117101
$$ packed form
8424b7105j3692K0920R993j1095Q573J9555j0460j6732L6813L9870j8519j1863
8412B6258n493J4132k093n1930J0827N7398J4614k1317P665J2457m398l3015J9530
8399D4635K512m7125k5631m533L8440N5828J8566m4372n2555K3399N2095k489
8387E8770n428n42k3724m2022j2656j1028l954P813M3277N882K6883M8013q877
8374H2407q294M636P485k0671j2241m716k0610L949J0732j5560k3248j6014l6850
8361d8995M54L8534L8449P32J5938N44P380K5202K682k8985j8184J8290j5138
8348C6903m4843J1714L4528J4410L205o382k8909k7916O888l6289K565K9708K8571
8335B4153N453L8721J1572j2681r05R34o448k2305j8276k4240m4980l0690l7409
$$ plain form
8322 -117101 -131236 -159575 -113161 -46901 -26200 -3805 11416 15249 23517 -17665 2688 19950
8310 19950 16684 20356 26502 48887 21233 -17537 9959 44643 25376 4320 17725 -19710
8298 -19710 -14664 -12959 -26367 -11892 37562 37509 -4272 8838 45745 30825 27041 52031 102627
8285 102627 57594 12807 -32114 -19359 15606 11741 13198 -6985 -48942 -55592 -55439 -47075 -20456
8272 -20456 4290 -1063 -7851 -40795 -58575 -26627 1294 20519 30923 39375 30557 7243 -38072
8259 -38072 -48941 -37097 -18979 2065 4662 -22360 -24476 -9103 400 3025 -20236 -42484 -33001
8246 -33001 -40100 -13981 -21194 -35057 13703 3474 -8335 12315 35799 27447 16031 18942 31833
8233 31833 29651 34629 -30090 -53387 -38054 -48103 -75362 -70028 -34081 -2386 32662 10548
$$ packed form
8322a17101j4135k8339M6414O6260K0701K2395J5221L833Q268m1182K0353J7262
8310A9950l266L672O146K2385k7654l8770K7496L4684j9267k1056J3405l7435
8298a9710N046J705j3408J4475M9454n3m1781J3110L6907j4920l784K4990N0596
8285A02627m5033m4787m4921J2755L4965l865J457k0183m1957o650J53Q364K6619
8272b0456K4746n353o788l2944j7780L1948K7921J9225J0404Q452q818k3314m5315
8259c8072j0869J1844J8118K1044K597k7022k116J5373R503K625k3261k2248R483
8246c3001p099K6119p213j3863M8760j0229j1809K0650K3484q352j1416K911J2891
8233C1833k182M978o4719k3297J5333j0049k7259N334L5947L1695L5048k2114
$$ plain form
8221 10548 -5923 3474 24531 -2917 -13101 -36924 -49149 -52370 -56495 -36780 -15337 5967
8209 5967 21490 -2962 -22146 -47136 -36780 -39397 -21434 21253 3936 -3230 -1607 -23986 17581
8196 17581 7133 4088 11247 22078 50016 60936 64363 68957 70405 56857 21923 -13551 -27366
8183 -27366 1054 -29823 -16297 -23843 -15094 -29515 -36326 -53548 -21501 9874 -29472 -56475
8171 -56475 -6465 34587 47243 17831 -18465 -39823 -30202 -24098 -18216 2393 -11008 -14540 17422
8158 17422 41649 12085 18457 38597 63079 65154 36738 4395 -21368 -22492 -10272 -8215 -26061
8145 -26061 -10910 -12056 -65818 -112701 -121866 -94310 -51512 -55058 -71351 -74673 -57358 -53888 -52767
8132 -52767 -65552 -54488 -26060 -134 1555 3858 4405 6245 -18895 -12739 -29770 -52487 -43192
$$ packed form
8221A0548j6471R397K1057k7448j0184k3823j2225l221m125J9715K1443K1304
8209E967J5523k4452j9184k4990J0356k617J7963M2687j7317p166J623k2379M1567
8196A7581j0448l045P159J0831K7938J0920L427M594J448j3548l4934l5474j3815
8183b7366K8420l0877J3526p546Q749j4421o811j7222L2047L1375l9346k7003
8171e6475N0010M1052J2656k9412l6296k1358R621O104N882K0609j3401l532L1962
8158A7422K4227k9564O372K0140K4482K075k8416l2343k5763j124J2220K057j7846
8145b6061J5151j146n3762m6883r165K7556M2798l546j6293l322J7315L470J121
8132e2767j2785J1064K8428K5926J689K303N47J840k5140O156j7031k2717R295
$$ plain form
8119 -43192 -47102 -52375 -41728 -22320 -37487 -74118 -106129 -50753 -30756 -32002 -8445 -994 -16137
8106 -16137 4189 -25377 -32067 3896 14547 57195 13904 -13091 -25653 15615 47227 29795
8094 29795 17150 19398 25320 18526 -33480 -14505 -3311 10577 22595 1050 -7295 44839 72077
8081 72077 44819 6040 -35312 -38376 -29879 -6497 -3077 4621 21403 -2543 -17859 -46280 -65912
8068 -65912 -75495 -74145 -34371 -13750 16927 -14613 -36102 -22019 -852 -2729 14402 44061
8056 44061 42064 41649 61253 39771 3474 7642 27461 -3227 -10046 51265 106658 94134 86602
8043 86602 57267 33790 39401 11356 -319 -29599 6725 8485 -30689 13150 25842 15716
8031 15716 40352 25928 -23 -8845 -12650 34322 25667 40624 841 -25909 28889 53141
$$ packed form
8119d3192l910n273J0647J9408j5167l6631l2011N5376J9997j246K3557P451j5143
8106a6137K0326k9566o690L5963J0651M2648m3291k6995j2562M1268L1612j7432
8094B9795j2645K248N922o794n2006J8975J1194J3888J2018k1545q345N2134K7238
8081G2077k7258l8779m1352l064Q497K3382L420P698J6782k3946j5316k8421j9632
8068f5912r583J350L9774K0621L0677l1540k1489J4083K1167j877J7131K9659
8056D4061j997m15J9604k1482l6297M168J9819l0688o819O1311N5393j2524p532
8043H6602k9335k3477N611k8045j1675k9280L6324J760l9174M3839J2692j0126
8031A5716K4636j4424k5951q822l805M6972q655J4957l9783k6750N4798K4252
$$ plain form
8019 53141 33412 80817 88451 18058 5756 32368 -5112 -29343 -48391 2044 313 -10205
8007 -10205 22139 -7143 18351 43256 58501 50524 55844 53809 34205 24518 30269 60242 27818
7994 27818 -14733 25505 15915 -34250 -46155 -19307 -8137 18062 45346 19986 -22895 -38914
7982 -38914 -38310 -28666 -12667 15407 25486 9046 -40193 -37618 -12065 14466 50917 35150 18070
7969 18070 21767 12249 39489 68332 57391 42769 26053 22730 54961 73841 109142 89302
7957 89302 28218 12828 -1863 -32753 -47358 -19274 -9902 36066 85289 81351 71365 40147
7945 40147 37089 50910 85545 88584 101061 83616 67819 61592 34660 42381 27383 -6025 -11031
7932 -11031 18343 -8580 1713 58500 93846 105870 101360 60496 69912 87644 125846 139782
$$ packed form
8019E3141j9729M7405P634p0393j2302K6612l7480k4231j9048N0435j731j0518
8007a0205L2344k9282K5494K4905J5245p977N320k035j9604r687N751K9973l2424
7994B7818m2551M0238r590n0165j1905K6848J1170K6199K7284k5360m2881j6019
7982c8914O04R644J5999K8074J0079j6440m9239K575K5553K6531L6451j5767j7080
7969A8070L697r518K7240K8843j0941j4622j6716l323L2231J8880L5301j9840
7957H9302o1084j5390j4691l0890j4605K8084R372M5968M9223l938r986l1218
7945D0147l058J3821L4635L039J2477j7445j5797o227k6932P721j4998l3408n006
7932a1031K9374k6923J0293N6787L5346J2024m510m0864R416J7732L8202J3936
$$ plain form
7920 139782 124560 112310 106762 121303 94674 66542 67353 62363 71238 52514 13585 8135 6073
7907 6073 27434 58482 51779 34101 103444 90633 50966 64951 76870 78126 28866 5170
7895 5170 -13340 19217 35005 47700 39135 70593 48069 19708 2793 -4148 1521 -1489 -37368
7882 -37368 -10625 18626 14310 -21382 -26459 -3833 36339 38138 44700 5943 -22598 -23698 11548
7869 11548 5217 -19119 3167 -885 8871 9236 15628 32906 22344 16272 19643 59091 123239
7856 123239 120139 97392 66050 -15954 -44279 -40349 -33474 -20270 14622 25622 14165 20530
7844 20530 5946 -5336 11269 38425 35038 3833 30054 32476 21098 -4459 -37810 12019
7832 12019 16408 -34352 -79080 -118267 -136271 -113004 -66851 -18550 -31962 -42868 -32242 -37871
$$ packed form
7920A39782j5222j2250n548J4541k6629k8132Q11m990Q875j8724l8929n450k062
7907F073K1361L1048o703j7678O9343j2811l9667J3985J1919J256m9260k3696
7895E170j8510L2557J5788J2695q565L1458k2524k8361j6915o941N669l010l5879
7882c7368K6743K9251m316l5692n077K2626M0172J799O562l8757k8541j100L5246
7869A1548o331k4336K2286m052R756L65O392J7278j0562o072L371L9448O4148
7856A23239l100k2747l1342q2004k8325L930O875J3204L4892J1000j1457O365
7844B0530j4584j1282J6605K7156l387l1205K6221K422j1378k5557l3351M9829
7832A2019M389n0760m4728l9187j8004K3267M6153M8301j3412j0906J0626n629
$$ plain form
7820 -37871 -31094 -38072 -60810 -23737 -16704 -47352 -59565 -68452 -66739 -27529 14211 19672 1542
7807 1542 61340 96636 90037 57583 14671 -19519 -22659 19115 52737 56805 67128 42040 25927
7794 25927 54247 73364 39603 -11069 -5973 25465 31893 45525 44695 29203 59919 35325 22871
7781 22871 61326 49187 19210 3213 -35202 -19796 19907 4217 -14753 -22690 -29090 -13333
7769 -13333 3266 -11692 -48314 -18119 -19781 -17243 -8056 -7298 5711 12752 -33560 -60206 -40145
7756 -40145 -37808 -26388 -32500 -56179 -74600 -55033 -12172 23687 18599 1782 -10019 11772
7744 11772 -7920 -27915 -34666 736 41968 80760 52011 4106 7785 40694 56437 56209 31103
7731 31103 -28911 -46731 -79352 -60307 9350 29771 54556 48918 31429 14030 -28213 -43101
$$ packed form
7820c7871O777o978k2738L7073P033l0648j2213q887J713L9210M1740N461j8130
7807A542N9798L5296o599l2454m2912l4190l140M1774L3622M068J0323k5088j6113
7794B5927K8320J9117l3761n0672N096L1438O428J3632q30j5492L0716k4594j2454
7781B2871L8455j2139k9977j5997l8415J5406L9703j5690j8970p937o400J5757
7769a3333J6599j4958l6622L0195j662K538R187P58J3009P041m6312k6646K0061
7756d0145K337J1420o112k3679j8421J9567M2861L5859n088j6817j1801K1791
7744A1772j9692j9995o751L5402M1232L8792k8749m7905L679L2909J5743k28k5106
7731C1103o0014j7820l2621J9045O9657K0421K4785n638j7489j7399m2243j4888
$$ plain form
7719 -43101 -29490 -7854 -59288 -52077 -23962 -17384 -20849 -2405 37482 81390 39248 -28302
7707 -28302 -37596 -28332 -10121 3822 8440 -4294 -10920 3513 15594 35786 33498 3355 25028
7694 25028 1214 -17316 -59767 -60890 -42639 -22569 933 -32102 -86022 -44803 -23071 -27221
7682 -27221 -26001 -46508 -61871 -48240 -37868 -52391 -21726 -7355 1539 1805 4428 23753 -41263
7669 -41263 -71275 -82667 -76230 -29182 5151 13148 -7245 -25366 -48344 -54998 -62251 -57418 -12892
7656 -12892 -15480 -18838 -18518 -28790 -19351 15150 24555 24135 -3627 -32786 3946 -2025 -38431 -38014
7642 -38014 -25864 -33753 -30911 -15534 4143 19086 -36412 -70785 -59052 -38310 -27484 12564
7630 12564 24021 -40704 -92826 -108609 -96532 -65596 -72161 -40066 -16633 56382 92563 71937
$$ packed form
7719d3101J3611K1636n1434P211K8115O578l465J8444L9887M3908m2142o7550
7707b8302r294R264J8211J3943M618j2734o626J4433J2081K0192k288l0143K1673
7694B5028k3814j8530m2451j123J8251K0070K3502l3035n3920M1219K1732m150
7682b7221J220k0507j5363J3631J0372j4523L0665J4371Q894K66K623J9325o5016
7669d1263l0012j1392O437M7048L4333P997k0393j8121k2978o654p253M833M4526
7656a2892k588l358L20j0272R439L4501R405m20k7762k9159L6732n971l6406M17
7642c8014J2150p889K842J5377J9677J4943n5498l4373J1733K0742J0826M0048
7630A2564J1457o4725n2122j5783J2077L0936o565L2095K3433P3015L6181k0626
$$ plain form
7618 71937 37036 26222 36615 56561 47764 78616 82430 78459 90365 31601 2157 -15145
7606 -15145 -57020 -38573 -49323 -31829 -11911 -50132 -63296 -71742 -56582 -90314 -61435 -33351
7594 -33351 17383 35836 15153 20720 21078 13760 10636 660 34246 82045 49408 11208 -35143
7581 -35143 -25625 -57243 -47363 20080 69671 78763 86108 97848 36306 -2284 -11481 -39640 -57987
7568 -57987 -40883 -33136 -46461 -61930 -22330 -8929 -11939 7468 18236 2274 39405 54043
7556 54043 63003 16652 38506 57243 56829 41244 3455 3287 17466 41415 71920 52141 50947
7543 50947 27695 -2043 21224 59935 65832 28955 14631 6443 251 10663 50442 -18822
7531 -18822 -72164 -1719 39267 -3034 -53403 -24488 1620 -10527 -5100 -5325 25971 19668 11721
$$ packed form
7618G1937l4901j0814J0393J9946q797L0852L814l971J1906n8764k9444j7302
7606a5145m1875J8447j0750J7494J9918l8221j3164q446J5160l3732K8879K8084
7594c3351N0734J8453k0683N567L58p318l124r976L3586M7799l2637l8200m6351
7581c5143R518l1618R880O7443M9591R092P345J1740o1542l8590r197k8159j8347
7568e7987J7104P747j3325j5469L9600J3401l010J9407J0768j5962L7131J4638
7556E4043Q960m6351K1854J8737m14j5585l7789j68J4179K3949L0505j9779j194
7543E0947k3252k9738K3267L8711N897l6877j4324q188o192J0412L9779o9264
7531a8822n3342P0445M0986m2301n0369K8915K6108j2147N427k25L1296o303p947
$$ plain form
7518 11721 13810 4845 -30417 -12715 -68039 -107064 -58672 -15010 -30390 -23882 -61698 -57521 -55179
7505 -55179 -60338 -49201 -44286 -71692 -68846 -59716 -35038 -32483 25272 23297 42591 84751 61546
7492 61546 59647 54570 31501 32046 55979 17698 -61 35400 12068 -14172 -53191 -82987 -57266
7479 -57266 -37784 -41951 -30725 -43931 -48843 -49483 -14984 34433 7787 -56705 -36204 -19197 -24209
7466 -24209 -21674 -781 -14409 -11874 -53239 -41382 -28452 22210 42485 36380 -602 -11031
7454 -11031 15774 30945 13006 -26819 -45468 -10103 41368 43988 6461 -13264 15897 16453
7442 16453 -28290 -23662 -34187 -60405 -39446 -38504 -15875 9542 17106 18680 20341 7865 -26683
7429 -26683 -7098 -10 -43279 -59190 -45456 -25431 5541 2367 -4841 -11383 6631 51818 32137
$$ packed form
7518A1721K089q965l5262J7702n5324l9025M8392M3662j5380O508l7816M177K342
7505e5179n159J1137M915k7406K846R130K4678K555N7755j975J9294M2160k3205
7492F1546j899n077k3069N45K3933l8281j7759L5461k3332k6240l9019k9796K5721
7479e7266J9482m167J1226j3206m912o40L4499M9417k6646o4492K0501J7007n012
7466b4209K535K0893j3628K535m1365J1857J2930N0662K0275o105l6982j0429
7454a1031K6805J5171j7939l9825j8649L5365N1471K620l7527j9725K9161N56
7442A6453m4743M628j0525k6218K0959R42K2629K5417P564J574J661j2476l4548
7429b6683J9585P088m3269j5911J3734K0025L0972l174p208o542J8014M5187j9681
$$ plain form
7416 32137 47058 40434 3277 1474 -14349 6293 -18213 -79060 -90358 -60410 -41114 -14370
7404 -14370 -10866 -29031 -41802 -36697 -27629 -27005 -7264 -4620 -12384 40212 63361 31774 -9712
7391 -9712 -11897 -34357 -42346 -34961 -27529 -4649 16161 5060 -2179 45354 47024 -1282 13282
7378 13282 -26953 -43103 -28307 -13024 -31891 -2002 19041 -2241 -13282 -28730 -43939 2798
7366 2798 -13531 -38196 -13281 -13169 50380 34918 -6033 -44552 -37496 -41551 -77481 -61967 -29195
7353 -29195 9998 -16569 14939 -27125 -34563 9091 19200 18146 15477 26040 22416 -5896 -6512
7340 -6512 -2523 -232 -17554 -5058 -2588 1265 -4026 29552 8293 -2574 942 5334 -1080 21870
7326 21870 39160 19029 -7934 -25011 21028 43216 8995 -989 -4850 -34900 -11769 -859
$$ packed form
7416C2137J4921o624l7157j803j5823K0642k4506o0847j1298K9948J9296K6744
7404a4370L504j8165j2771N105R068O24J9741K644p764N2596K3149l1587m1486
7391i712k185k2460p989P385P432K2880K0810j1101p239M7533J670m8306J4564
7378A3282m0235j6150J4796J5283j8867K9889K1043k1282j1041j5448j5209M6737
7366B798j6329k4665K4915J12O3549j5462m0951l8519P056m055l5930J5514L2772
7353b9195L9193k6567L1508m2064p438M3654J0109j054k669J0563l624k8312o16
7340f512L989K291j7322J2496K470L853n291L3578k1259j0867L516M392o414K2950
7326B1870J7290k0131k6963j7077M6039K2188l4221r984l861l0050K3131J0910
$$ plain form
7314 -859 -4972 -21899 -5485 -41160 -42575 -31914 -216 25234 39870 13395 -42748 -70502 -8128
7301 -8128 64471 113244 61496 12359 32922 46423 -18742 -62162 -18163 8809 21720 19623
7289 19623 10778 -10106 -8772 3250 -6095 -11775 -23862 -43930 -75640 -46885 -18853 -9278 -14642
7276 -14642 -31634 -16617 -24591 -15917 14131 -15309 -40787 -53382 -56799 -69500 -42341 6261
7264 6261 14489 -9556 -33330 -22767 -26824 9044 24929 -1930 -10396 5100 12960 18564 7198
7251 7198 24504 42726 33700 52745 25178 -5361 20171 -16614 -26078 -4060 -343 9908 -7775
7238 -7775 -17283 -2188 9935 -15652 -5971 -8049 -19112 -32927 -41958 -36040 -44155 -42537 -15292
7225 -15292 542 7529 4423 1192 2842 20049 -7622 14978 21158 -9482 -41387 -20722 -18885
$$ packed form
7314h59m113j6927J6414l5675j415J0661L1698K5450J4636k6475n6143k7754O2374
7301h128P2599M8773n1748m9137K0563J3501o5165m3420M3999K6972J2911k097
7289A9623q845k0884J334J2022r345n680j2087k0068l1710K8755K8032R575n364
7276a4642j6992J5017p974Q674L0048k9440k5478j2595l417j2701K7159M8602
7264F261Q228k4045k3774J0563m057L5868J5885k6859q466J5496P860N604j1366
7251G198J7306J8222r026J9045k7567l0539K5532l6785r464K2018L717J0251j7683
7238g775r508J5095J2123k5587R681k078j1063j3815r031N918q115J618K7245
7225a5292J5834O987l106l231J650J7207k7671K2600O180l0640l1905K0665J837
$$ plain form
7212 -18885 -76926 -105378 -100739 -97222 -88448 -47818 -30025 -24875 -20396 -37920 -41995 -9923 24085
7199 24085 25197 11364 8741 -1255 4331 -11342 -35630 -45497 -39240 -50655 -56810 -33324 -27048
7186 -27048 -15321 -37285 -46486 -34347 -20803 -18191 -30336 -58605 -63937 -47112 -31222 -48427
7174 -48427 -10092 11764 3171 -16584 -13644 893 4817 -20174 -22361 -15969 -30745 -19974 -34792
7161 -34792 -51028 -22992 -38259 -54789 -83619 -84180 -19332 -4918 17439 31677 -6591 7117
7149 7117 -21185 -18237 1766 -446 6861 1210 -32606 -73030 -92226 -98285 -79603 -97212 -61032
7136 -61032 -31388 2014 24305 -2081 -48995 -65682 -49090 -16777 24697 3947 -22732 -14579
7124 -14579 -9469 -43242 -117111 -104941 -94296 -62209 -26877 -25742 -54822 -74812 -13398 28564
$$ packed form
7212a8885n8041k8452M639L517Q774M0630J7793N150M479j7524m075L2072L4008
7199B4085J112j3833k623r996N586j5673k4288r867O257j1415o155K3486O276
7186b7048J1727k1964r201J2139J3544K612j2145k8269n332J6825J5890j7205
7174d8427L8335K1856q593j9755K940J4537L924k4991k187O392j4776J0771j4818
7161c4792j6236K8036j5267j6530k8830n61O4848J4414K2357J4238l8268J3708
7149G117k8302K948K0003k212P307n651l3816m0424j9196o059J8682j7609L6180
7136f1032K9644L3402K2291k6386m6914j6687J6592L2313M1474k0750k6679Q153
7124a4579N110l3773p3869J2170J0645L2087L5332J135k9080j9990O1414M1962
$$ plain form
7112 28564 53092 30694 -23064 8637 24307 133 8401 3944 -43922 -60978 -49385 -39497
7100 -39497 -47081 -44618 -49646 -44649 -70930 -59119 -72587 -101079 -40813 -13938 -29218 -34935 -32556
7087 -32556 -36807 -5205 -12101 -2248 11361 31318 9024 16900 39620 55058 31005 34490 38096
7074 38096 40058 -5718 -40090 -41152 -28646 -16799 -1811 22098 49678 85983 96440 34519
7062 34519 -63370 -48075 -16943 -8202 -10079 -77823 -115769 -98038 -36395 -58735 -103432 -102174
7050 -102174 -93318 -46941 -53866 -3718 -2468 -7196 -852 11766 -14831 -10838 15133 34441 41854
7037 41854 -3339 -45935 -28210 -48058 -62200 -28725 40450 64064 35618 -32017 -69746 -51373
7025 -51373 12994 34212 5392 -33811 -22617 -44588 -80273 -48241 -41432 -32247 5972 12930
$$ packed form
7112B8564K4528k2398n3758L1701J5670k4174Q268m457m7866j7056J1593R888
7100c9497p584K463n028M997k6281J1811j3468k8492O0266K6875j5280n717K379
7087c2556m251L1602o896R853J3609J9957k2294P876K2720J5438k4053L485L606
7074C8096J962m5776l4372j062J2506J1847J4988K3909K7580L6305J0457o1921
7062C4519r7889J5295L1132Q741j877o7744l7946J7731O1643k2340m4697J258
7050a02174Q856M6377o925N0148J250m728O344J2618k6597L993K5971J9308P413
7037D1854m5193m2596J7725j9848j4142L3475O9175K3614k8446o7635l7729J8373
7025e1373O4367K1218k8820l9203J1194k1971l5685L2032O809R185L8219O958
$$ plain form
7013 12930 -44610 -67093 -79853 -76872 -39215 -19412 -1003 22954 3644 12645 48307 43552
7001 43552 40141 -10393 -31286 -38418 -23493 5302 27435 33791 27684 30916 45355 49822 53905
6988 53905 26163 15365 40736 51319 17257 -4141 1485 -11515 -28444 -36329 -28984 -1643
6976 -1643 25223 -4349 -42474 -67557 -42920 -18928 29184 -16961 -28687 -30389 -17838 -18114 -15316
6963 -15316 15656 27155 17134 -35890 -5900 18888 43131 62049 21257 33941 62493 62997
6951 62997 64109 54947 17021 11930 -27049 -17724 -10422 -24993 -51291 -59086 -34812 16687 48782
6938 48782 38122 54450 53181 32391 -6834 -8157 14214 13097 6648 -134 10630 32183 34126
6925 34126 -12517 -21646 -39386 -51194 -55826 -66057 -67011 -63790 -65695 -44222 -50677 -74362 -43969
$$ packed form
7013A2930n7540k2483j2760K981L7657J9803J8409K3957j9310R001L5662m755
7001D3552l411n0534k0893p132J4925K8795K2133O356o107L232J4439M467M083
6988E3905k7742j0798K5371J0583l4062k1398N626j3000j6929p885P345K7341
6976a643K6866k9572l8125k5083K4637K3992M8112m6145j1726j702J2551k76K798
6963a5316L0972J1499j0021n3024K9990K4788K4243J8918m0792J2684K8552N04
6951F2997J112r162l7926n091l8979R325P302j4571k6298p795K4274N1499L2095
6938D8782j0660J6328j269k0790l9225j323K2371j117o449o782J0764K1553J943
6925C4126m6643r129j7740j1808m632j0231r54L221j905K1473o455k3685L0393
$$ plain form
6912 -43969 -9440 -11162 -513 -9296 -28968 -35497 14368 23540 25914 7379 18395 15843 9704
6899 9704 11295 30638 61183 20137 -1728 -4467 -15892 22840 31550 33091 34940 46011 27792
6886 27792 12745 6759 -9222 18984 14910 2573 -18475 19387 10600 -4144 -12819 -1994 -13271
6873 -13271 -25307 -3102 -653 33420 46127 13527 -7935 -33362 -53113 -33115 -19646 -1866
6861 -1866 -35647 -35510 4416 4315 36482 65584 15349 -44289 -59204 -37266 12515 15550 6321
6848 6321 -16312 -64504 -53299 -18795 -33706 -24377 11461 12462 6778 -638 -21401 -24322 -6493
6835 -6493 18060 15827 39241 49704 46580 24521 16364 9467 44595 27815 1447 -14785 612
6822 612 7739 32237 52802 37038 53354 62178 5067 -23585 16547 21259 25964 -3645 -23387
$$ packed form
6912d3969L4529j722J0649q783j9672o529M9865R172K374j8535J1016k552o139
6899I704J591J9343L0545m1046k1865k739j1425L8732Q710J541J849J1071j8219
6886B7792j5047n986j5981K8206m074j2337k1048L7862q787j4744q675J0825j1277
6873a3271j2036K2205K449L4073J2707l2600k1462k5427j9751J9998J3469J7780
6861a866l3781J37L9926j01L2167K9102n0235n9638j4915K1938M9781L035r229
6848F321k2633m8192J1205L4504j4911R329L5838J001n684p416k0763k921J7829
6835f493K4553k233K3414J0463l124k2059q157o897L5128j6780k6368j6232J5397
6822F12P127K4498K0565j5764J6316Q824n7111k8652M0132M712M705k9609j9742
$$ plain form
6809 -23387 -18940 -2146 3403 12961 -1273 -64762 -60713 -43992 -21806 -4520 27173 21021 12596
6796 12596 32341 29480 -15267 -27965 -48890 -67398 -29280 -27326 -55132 -69283 -62408 -28534
6784 -28534 17603 51176 41997 -1449 -60653 -76030 1706 26467 12673 16007 25553 48195
6772 48195 45043 -16836 -31708 777 13577 37488 46934 32683 46298 34073 2845 18023
6760 18023 6112 16493 26023 -16595 -25915 -28162 -15184 12353 15129 -4096 -28123 -25202 40013
6747 40013 64456 68329 13358 22880 70734 113414 125796 76511 87240 65421 44367 85691
6735 85691 99963 107589 126025 148926 154820 121926 112367 150614 123840 93586 98151 100645 139237
6722 139237 220799 350267 497411 688778 961424 1291427 1686826 1986645 1988092 1704678
$$ packed form
6809b3387M447J6794N549R558j4234o3489M049J6721K2186J7286L1693o152q425
6796A2596J9745k861m4747j2698k0925j8508L8118J954k7806j4151O875L3874
6784b8534M6137L3573r179m3446n9204j5377P7736K4761j3794L334R546K2642
6772D8195l152o1879j4872L2485J2800K3911R446j4251J3615j2225l1228J5178
6760A8023j1911J0381R530m2618r320k247J2978K7537K776j9225k4027K921O5215
6747D0013K4443L873n4971R522M7854M2680J2382m9285J0729k1819k1054M1324
6735H5691J4272P626J8436K2901N894l2894r559L8247k6774l0254M565K494L8592
6722A39237Q1562J29468J47144J91367K72646L30003L95399K99819J447k83414
$$ plain form
6712 1704678 1352422 1014374 782666 588147 437452 335012 287304 271504 200356 168351
6702 168351 190511 165189 109766 97927 100515 82488 55259 61260 38742 8829 -1798 26455
6690 26455 35744 65556 42621 19900 4677 30794 39101 26618 11237 4707 10289 17190 -9465
6677 -9465 -19469 -9751 19128 28831 3249 11190 3553 1161 5256 -30787 -56436 -80729 -106951
6664 -106951 -137808 -90310 -31090 8685 1148 -17793 419 11915 33040 34601 47862 62620
6652 62620 12848 47582 82729 59856 46500 60927 33621 28799 32054 -7883 2974 9702
6640 9702 -19175 -60912 -66138 -56118 -27916 33287 24169 5286 -2173 15070 256 -14435 58229
6627 58229 38423 -9754 -11001 18529 20325 26838 42238 23810 11342 38972 3421 -15455
$$ packed form
6712A704678l52256l38048k31708j94519j50695j02440m7708j5800p1148l2005
6702A68351K2160k5322n5423j1839K588j8027k7229O001k2518k9913j0627K8253
6690B6455R289K9812k2935k2721j5223K6117Q307j2483j5381o530N582O901k6655
6677i465j0004R718K8879R703k5582P941p637k392M095l6043k5649k4293k6222
6664a06951l0857M7498N9220L9775p537j8941J8212J1496K1125J561J3261J4758
6652F2620m9772L4734L5147k2873j3356J4427k7306m822L255l9937J0857O728
6640I702k8877m1737n226J0020K8202O1203r118j8883p459J7243j4814j4691P2664
6627E8229j9806m8177j247K9530J796O513J5400j8428j2468K7630l5551j8876
$$ plain form
6615 -15455 -22773 -18456 -27657 -22965 -41840 -61575 -29986 -14580 -11095 -21175 -17088 -13686 -15241
6602 -15241 8399 -18314 -35395 -56623 -61417 -25810 10256 19207 29038 44471 35229 11731 46695
6589 46695 -14835 -35855 -15598 3790 57580 37030 -6092 2070 47416 41453 28615 40459
6577 40459 1203 204 24402 1372 -29049 -39694 -67236 -63868 -24332 6367 17261 -8178
6565 -8178 -44823 -40320 -30433 -25396 38042 58892 38672 40313 51350 37175 39739 24666 -31759
6552 -31759 -53944 -2407 24469 26481 10125 -60983 -92553 -66256 -80048 -71482 -45861 -50386
6540 -50386 -47914 -14360 9061 27705 35944 29546 47964 46603 15303 8718 6586 869 14643
6527 14643 30308 -26917 -51130 -24688 33219 75793 87533 49696 -27327 -53341 -57235 -73512
$$ packed form
6615a5455p318M317r201M692j8875j9735L1589J5406L485j0080M087L402j555
6602a5241K3640k6713j7081k1228m794L5607L6066Q951R831J5433r242k3498L4964
6589D6695o1530k1020K0257J9388N3790k0550m3122Q162M5346n963j2838J1844
6577D0459l9256r99K4198k3030l0421j0645k7542L368L9536L0699J0894k5439
6565h178l6645M503R887N037O3438K0850k0220J641J1037j4175K564j5073n6425
6552c1759k2185N1537K6876K012j6356p1108l1570K6297j3792Q566K5621m525
6540e0386K472L3554K3421J8644Q239o398J8418j361l1300o585k132n717J3774
6527A4643J5665n7225k4213K6442N7907M2574J1740l7837p7023k6014l894j6277
$$ plain form
6515 -73512 -56125 -23594 -8691 -3378 -3413 14457 8126 -34990 -55607 -40033 -25270 2790 10356
6502 10356 -47453 -34900 -1399 -12988 -9175 21671 40932 51412 -23468 -49082 -46447 -30778
6490 -30778 8162 -35583 -33719 -15788 -23538 1153 30107 86623 96356 76723 64596 36996
6478 36996 13280 35133 22878 -73272 -93110 -94136 -72016 -62889 -84845 -69986 -33476 -38755
6466 -38755 -9590 55700 82777 62614 16976 608 -20865 -25226 -37990 -19736 -7777 29764
6454 29764 39226 1865 -10866 -38100 -51245 -33130 -11895 -20193 9224 14345 43901 59121
6442 59121 33053 30862 -1708 -17101 -7569 8053 2651 -17854 21192 34351 19369 -30132
6430 -30132 -31899 -25933 -28210 -685 51035 55949 26728 32209 -5491 -43424 -52010 -31787 -18953
$$ packed form
6515g3512J7387L2531J4903N313l5J7870o331m3116k0617J5574J4763K8060P566
6502A0356n7809J2553L3501j1589L813L0846J9261J0480p4880k5614K635J5669
6490c0778L8940m3745J864J7931p750K4691K8954N6516R733j9633j2127k7600
6478C6996k3716K1853j2255r6150j9838j026K2120R127k1956J4859L6510n279
6466c8755K9165O5290K7077k0163m5638j6368k1473m361j2764J8254J1959L7541
6454B9764R462l7361j2731k7234j3145J8115K1235q298K9417N121K9556J5220
6442E9121k6068k191l2570j5393R532J5622n402k0505L9046J3159j4982m9501
6430c0132j767N966k277K7525N1720M914k9221N481l7700l7933q586K0223J2834
$$ plain form
6417 -18953 -42521 -30342 15269 12031 35158 86293 87387 100141 97436 74507 50610 27439
6405 27439 42903 -22429 -26062 13911 13149 -27780 -60337 -68356 -53831 -32180 2339 2016 -6255
6392 -6255 178 -309 12342 -20577 7254 25294 30729 -7715 -28612 -52473 -41727 -29043 -48762
6379 -48762 -26130 17807 3276 -30530 -13330 9490 4208 -6139 13370 14758 -26224 -37193
6367 -37193 -23414 -18623 -13083 14705 39764 22300 -2640 6087 -2144 -36150 -67983 -70290 -77757
6354 -77757 -59865 -8268 17184 5984 35250 43083 30501 30813 33620 19156 -19676 -34896 -15714
6341 -15714 -29012 -61812 -66977 -71156 -50040 -71620 -93488 -75796 -59820 -74945 -20387 -6617
6329 -6617 -31891 13472 77608 83566 30327 23573 10276 -55855 -34912 -36492 -34930 -20395 -32876
$$ packed form
6417a8953k3568J2179M5611l238K3127N1135J094J2754k705k2929k3897k3171
6405B7439J5464o5332l633L9973p62m0929l2557q019J4525K1651L4519l23q271
6392f255O433m87J2651l2919K7831J8040N435l8444k0897k3861J0746J2684j9719
6379d8762K2632M3937j4531l3806J7200K2820n282j0347J9509J388m0982j0969
6367c7193J3779M791N540K7788K5059j7464k4940Q727q231l4006l1833k307p467
6354g7757J7892N1597K5452j1200K9266P833j2582L12K807j4464l8832j5220J9182
6341a5714j3298l2800n165m179K1116k1580k1868J7692J5976j5125N4558J3770
6329f617k5274M5363O4136N958n3239o754j3297o6131K0943j580J562J4535j2481
$$ plain form
6316 -32876 -50319 -34157 -22406 -23676 -60228 -46806 -8351 4370 -31751 -35988 3020 47156
6304 47156 51974 21822 -1245 -31025 -71727 -34224 18700 35037 34810 31364 10930 -57127 -76147
6291 -76147 -60262 -46808 -35825 -68002 -94060 -65277 -76425 -73585 -22187 -1998 -25674 -34205
6279 -34205 -20660 -20754 -50901 -104409 -111673 -91225 -45209 -30954 -19077 -37153 -5378 11354 13041
6266 13041 28391 26392 6262 3076 -4520 1356 -1696 -22920 -31112 -19284 -27614 -12019 599
6253 599 11176 28584 15938 -8703 -5696 -4756 -8933 435 32738 -2199 -5523 -14498 6788 10122
6239 10122 -31233 -32819 -44568 -51781 -62473 -38682 -33295 -39455 -23109 42752 4603 -14216 3574
6226 3574 -3623 5379 16192 -5679 2206 21794 8667 702 -361 6437 2084 -761 25695 26436
$$ packed form
6316c2876j7443J6162J1751j270l6552J3422L8455J2721l6121m237L9008M4136
6304D7156M818l0152k3067k9780m0702L7503N2924J6337k27l446k0434o8057j9020
6291g6147J5885J3454J0983l2177k6058K8783j1148K840N1398K0189k3676q531
6279c4205J3545r4l0147n3508p264K0448M6016J4255J1877j8076L1775J6732J687
6266A3041J5350j999k0130l186p596N876l052k1224q192J1828q330J5595J2618
6253E99J0577J7408j2646k4641L007R40m177R368L2303l4937l324q975K1286L334
6239A0122m1355j586j1749p213j0692K3791N387o160J6346O5861l8149j8819J7790
6226C574p197R002J0813k1871P885J9588j3127p965j063O798m353k845K6456P41
$$ plain form
6212 26436 9162 46124 42437 -12709 -31835 -40411 -37317 -37927 -40248 -19654 -6942 -33589 -48589
6199 -48589 -32106 -18173 -30783 -55528 -4881 32115 37670 52048 68102 53230 16091 -69735
6187 -69735 -68631 -70075 -79479 -94092 -108481 -93361 -47889 -20555 11435 -22524 -42714 -73818
6175 -73818 -70603 -44844 -106 41304 48816 49308 48172 35763 22808 14679 -23449 -78357 -62290
6162 -62290 -19216 11503 60119 66789 29116 1361 -10986 25589 26185 -10112 -10779 -27566 -50712
6149 -50712 -9156 26318 47474 81134 72850 14390 -77442 -107985 -71725 -44759 -37257 -64429
6137 -64429 -27621 -2507 11658 -25544 -80134 -76201 -7890 16497 8423 44121 75825 63002
6125 63002 44458 36993 26541 20908 28528 79642 88619 42345 -8351 -9016 32256 51266 27243
$$ packed form
6212B6436j7274L6962l687n5146j9126q576L094o10k321K0594J2712k6647j5000
6199d8589J6483J3933j2610k4745N0647L6996N555J4378J6054j4872l7139q5826
6187f9735J104j444r404j4613j4389J5120M5472K7334L1990l3959k0190l1104
6175g3818L215K5759M4738M1410P512M92j136j2409j2955q129l8128n4908J6067
6162f2290M3074L0719M8616O670l7673k7755j2347L6575N96l6297o67j6787k3146
6149e0712M1556L5474K1156L3660q284n8460r1832l0543L6260K6966P502k7172
6137f4429L6808K5114J4165l7202n4590L933O8311K4387q074L5698L1704j2823
6125F3002j8544p465j0452n633P620N1114Q977m6274n0696o65M1272J9010k4023
$$ plain form
6112 27243 31944 62404 44993 25273 43999 80768 62416 27665 -4020 -551 -20637 -37603
6100 -37603 -56998 -59064 -3901 69265 88626 29738 -13829 -33599 14441 34550 45507 78180
6088 78180 94327 43073 -10082 -30211 -28777 -21691 -30603 -39854 -14219 659 -33232 -50041 -36336
6075 -36336 35272 65596 40964 6340 13656 14388 4485 14917 -2787 17282 40839 37093 8984
6062 8984 -25222 -56478 -61365 -57762 -57420 -47506 -27658 -13138 -1412 25586 21370 -1552 -29675
6049 -29675 -61648 -83592 -81818 -62267 -44243 7209 2645 -15876 -7605 15337 5076 11420 -23792
6036 -23792 -16631 -51077 -82065 -77232 -76767 -86080 -108111 -58262 29355 45344 26243 56043 38280
6023 38280 -8523 -33394 -12890 -10225 -3920 20358 27065 15453 -22034 -25014 -63328 -73367 -67669
$$ packed form
6112B7243M701L0460j7411j9720J8726L6769j8352l4751l1685L469k0086j6966
6100c7603j9395k066N5163P3166J9361n8888m3567j9770M8040K0109J0957L2673
6088G8180J6147n1254n3155k0129J434P086q912r251K5635J4878l3891j6809J3705
6075c6336P1608L0324k4632l4624P316P32r903J0432j7704K0069K3557l746k8109
6062H984l4206l1256m887L603L42R914J9848J4520J1726K6998m216k2922k8123
6049b9675l1973k1944J774J9551J8024N1452m564j8521Q271K2942j0261O344l5212
6036b3792P161l4446l0988M833M65r313k2031M9849Q7617J5989j9101K9800j7763
6023C8280m6803k4871K0504K665O305K4278O707j1612l7487k980l8314j0039N698
$$ plain form
6010 -67669 -50542 -46134 -35054 -34002 -53954 -57886 -33402 -41866 -10377 38242 48329 20628 873
5997 873 2743 -1582 -1984 -12093 32362 31875 -14565 -24727 30166 52125 51537 83322 64760 59672
5983 59672 21573 -6995 -15138 -9413 -40966 -52154 -59873 -13502 17251 93700 73250 33878
5971 33878 28275 -4014 16966 -7609 -13841 20848 23717 51269 34622 12739 8654 20240 256
5958 256 -5761 -37107 -80979 -98389 -79909 -49504 29241 40492 4483 -37269 -36899 -44437 -45391
5945 -45391 -50831 -44669 -74258 -119110 -70105 -49826 -16249 -33881 -57213 -28590 8365 -32251
5933 -32251 -64519 -63081 -44690 -9589 11273 71251 88503 88584 45924 7573 29126 -16229 -48413
5920 -48413 241 37744 26845 7223 5565 1951 -30182 -55265 -57871 -6835 15411 -27282
$$ packed form
6010f7669J7127M408J1080J052j9952l932K4484q464L1489M8619J0087k7701j9755
5997H73J870m325m02j0109M4455m87m6440j0162N4893K1959n88L1785j8562n088
5983E9672l8099k8568q143N725l1553j1188p719M6371L0753P6449k0450l9372
5971C3878n603l2289K0980k4575o232L4689K869K7552j6647k1883m085J1586j9984
5958B56o017l1346m3872j7410J8480L0405P8745J1251l6009m1752L70p538r54
5945d5391n440O162k9589m4852M9005K0279L3577j7632k3332K8623L6955m0616
5933c2251l2268J438J8391L5101K0862N9978J7252Q1m2660l8351K1553m5355l2184
5920d8413M8654L7503j0899j9622j658l614l2133k5083k606N1036K2246m2693
$$ plain form
5908 -27282 57 -10292 -43199 -73748 -56167 -15897 7803 3887 -72349 -86157 -53967 -847
5896 -847 13738 17516 3032 -3376 44475 38840 -12514 -16435 -40240 -77716 -69676 -8542 30083
5883 30083 -10503 11075 1275 -57388 -49013 -28575 -19776 -7285 -3803 7505 -9764 -49784 -51839
5870 -51839 -59049 -68980 -35560 32556 29544 -29212 -36863 -10476 -18612 -18880 5713 7552 -4380
5857 -4380 -35300 -29170 16153 19860 -13505 -48863 -57038 -30087 -24164 -21355 -27092 -45367 -59962
5844 -59962 -28804 13343 -33743 -72402 -60698 -41008 -53223 -87381 -64984 6971 11211 -54570
5832 -54570 -43847 -25691 -25912 -29880 -36290 18314 20872 8375 9076 24446 48141 32811 37340
5819 37340 66604 65295 41590 65053 86367 117656 126085 99282 61189 62323 63021 32638 32307
$$ packed form
5908b7282K7339j0349l2907l0549J7581M0270K3700l916p6236j3808L2190N3120
5896h47J4585L778j4484o408M7851n635n1354l921k3805l7476Q040O1134L8625
5883C0083m0586K1578r800n8663Q375K0438Q799J2491L482J1308j7269m0020k055
5870e1839p210r931L3420O8116l012n8756p651K6387q136k68K4593J839j1932
5857d380l0920O130M5323L707l3365l5358q175K6951N923K809n737j8275j4595
5844e9962L1158M2147m7086l8659J1704J9690j2215l4158K2397P1955M240o5781
5832e4570J0723J8156k21l968o410N4604K558j2497P01J5370K3695j5330M529
5819C7340K9264j309k3705K3463K1314L1289Q429k6803l8093J134O98l0383l31
$$ plain form
5806 32307 -36221 -60581 -22896 -34632 -46529 -22779 -33340 -56146 -61714 -67327 -41587 -39847
5794 -39847 -67908 -27866 -24078 -41271 -28867 -12549 -23970 -103584 -98734 -43476 -45008 -74533
5782 -74533 -26587 -15945 -1775 -7303 -50591 -57492 -36270 -28778 -36769 -29132 -13829 -768 -13005
5769 -13005 -11191 5598 55942 107591 90313 62194 61352 23410 21974 49191 57029 34529 7223
5756 7223 27142 75351 79160 26585 -6049 -27008 15195 61851 32562 -2230 -16856 -3842
5744 -3842 20058 15397 -2229 5714 41238 46542 66300 85395 62486 44171 22385 -44267 -39013
5731 -39013 -12933 -10220 -13884 -33249 -53568 -74837 -38477 -16902 6921 18080 -10438 -33494
5719 -33494 -49895 -19264 13410 14654 14575 -21236 -49349 -68852 -74457 -67487 -45373 -35581 -49114
$$ packed form
5806C2307o8528k4360L7685j1736j1897K3750j0561k2806n568n613K5740J740
5794c9847k8061M0042L788j7193J2404J6318j1421p9614M850N5258j532k9525
5782g4533M7946J0642J4170n528m3288o901K1222P492p991P637J5303J3061j2237
5769a3005J814J6789N0344N1649j7278k8119q42l7942j436K7217P838k2500k7306
5756G223J9919M8209L809n2575l2634k0959M2203M6656k9289l4792j4626J3014
5744c842K3900m661j7626P943L5524N304J9758J9095k2909j8315k1786o6652N254
5731c9013K6080K713l664j9365k0319k1269L6360K1575K3823J1159k8518k3056
5719c3494j6401L0631L2674J244p9l5811k8113j9503n605O970K2114R792j3533
$$ plain form
5706 -49114 -42353 -41520 -66267 -58990 -34089 26123 60428 35304 22334 56502 79657 60870 36911
5693 36911 22298 55011 51765 30074 -20035 -69358 -49821 -20280 676 -27736 -12359 13619
5681 13619 -24003 -45510 -718 -17428 -2124 16463 45396 43258 -6830 -9999 23161 44237
5669 44237 53676 39171 4909 22644 22817 -1799 17857 5710 -40376 -27239 5032 1594 -27643
5656 -27643 -11777 -7440 134 2462 -33932 -82897 -81065 -27058 3472 -20931 40839 98917 74103
5643 74103 33276 -34368 -45794 -7385 2191 -2298 13242 27823 26180 -1023 9695 10709 -5091
5630 -5091 4446 -3556 31734 20880 30377 35688 -3802 17803 57454 66079 30838 -32401 -29761
5617 -29761 -17432 -15982 17489 23160 5515 12864 30274 45323 45340 15076 6010 -23072 -51359
$$ packed form
5706d9114O761Q33k4747P277K4901O0212L4305k5124j2970L4168K3155j8787k3959
5693C6911j4613L2713l246k1691n0109m9323J9537K9541K0956k8412J5377K5978
5681A3619l7622k1507M4792j6710J5304J8587K8933k138n0088l169L3160K1076
5669D4237R439j4505l4262J7735J73k4616J9656j2147m6086J3137L2271l438k9237
5656b7643J5866M337P574K328l6394m8965J832N4007L0530k4403O1770N8078k4814
5643G4103m0827o7644j1426L8409R576m489J5540J4581j643k7203J0718J014j5800
5630e091R537q002L5290j0854R497N311l9490K1605L9651Q625l5241o3239K640
5617b9761J2329J450L3471N671j7645P349J7410J5049J7l0264r066k9082k8287
$$ plain form
5604 -51359 -58573 -34775 -15987 -18322 -27026 -8283 34545 71947 92910 81040 65444 16643
5592 16643 -17285 -12025 -1296 -6308 20732 55739 32375 -13952 -28210 -24063 1455 23600
5580 23600 -13267 -16044 -40191 -40851 -30573 -15204 -27603 -63571 -35698 -20861 -23253 -34556 11578
5567 11578 21441 -8430 4574 -20208 -50843 -67144 -72288 -57780 -87255 -43859 -39755 -34665 -40325
5554 -40325 -77831 -66968 -57713 -41639 -66466 -59014 -25717 -9223 1358 12099 -23944 -2258
5542 -2258 -2232 -22974 -33582 -21650 -55153 -62985 -27911 14961 -12653 -14495 15806 2050 -1
5529 -1 -33645 -56327 -69315 -47076 -71975 -24370 -22141 -30064 4541 23399 66945 51674 1164
5516 1164 -3350 -2936 -20368 -63340 -44016 -27594 -516 -16339 -21043 7362 29242 22082 62322
$$ packed form
5604e1359p214K3798J8788k335q704J8743M2828L7402K0963j1870j5596m8801
5592A6643l3928N260J0729n012K7040L5007k3364m6327j4258M147K5518K2145
5580B3600l6867k777k4147o60J0278J5369j2399l5968K7873J4837k392j1303M6134
5567A1578R863k9871J3004k4782l0635j6301n144J4508k9475M3396M104N090n660
5554d0325l7506J0863R255J6074k4827P452L3297J6494J0581J0741l6043K1686
5542b258K6k0742j0608J1932l3503p832L5074M2872k7614j842L0301j3756k051
5529al3644k2682j2988K2239k4899M7605K229p923L4605J8858M3546j5271n0510
5516A164m514M14j7432m2972J9324J6422K7078j5823m704K8405K1880p160M0240
$$ plain form
5503 62322 30415 25524 3573 -27719 -23993 -31307 -44340 -46579 -16368 33226 37919 102 -54463
5490 -54463 -34792 6625 27093 45591 37251 -6009 -12290 -23448 -35927 -20423 -5426 7660
5478 7660 31381 8220 9696 6139 -16269 23839 -14972 -24493 11728 19516 3251 23526 42189
5465 42189 51425 49265 2894 4444 -25804 -2444 28559 35123 52791 43854 58366 60790 41575
5452 41575 17793 -23819 -40084 -21065 -6790 11856 3773 14503 32066 -28898 -79491 -88823
5440 -88823 -61943 -47278 -58782 -53469 -21639 -30422 -30650 5977 3478 3754 16712 17426 15497 2954
5426 2954 -24999 -32563 -50694 -71071 -66220 -37054 -20430 -53999 -26725 -2984 13191 48530
5414 48530 53077 73066 71695 70567 75748 9728 7899 30092 11341 -9790 14056 -9422 -47375
$$ packed form
5503F2322l1907m891k1951l1292L726p314j3033k239L0211M9594M693l7817n4565
5490e4463J9671M1417K0468J8498q340m3260o281j1158j2479J5504J4997J3086
5478G660K3721k3161J476l557k2408M0108l8811r521L6221P788j6265K0275J8663
5465D2189R236k160m6371J550l0248K3360L1003O564J7668q937J4512K424j9215
5452D1575k3782m1612j6265J9019J4275J8646q083J0730J7563o0964n0593r332
5440h8823K6880J4665j1504N313L1830q783k28L6627k499K76J2958P14j929j2543
5426B954k7953p564j8131k0377M851K9166J6624l3569K7274K3741J6175L5339
5414D8530M547J9989j371j128N181o6020j829K2193j8751k1131K3846k3478l7953
$$ plain form
5401 -47375 -27855 645 -31132 -11551 -33461 469 5143 -4171 -37162 -26059 -29321 -36052 -34366
5388 -34366 6983 51745 78396 66163 31712 -13075 -2869 44633 39316 2449 32612 48351
5376 48351 54339 83240 68264 62338 49217 38751 57403 69111 25661 4518 9216 -5378
5364 -5378 -13528 -16333 -15712 4313 4783 -6134 -22397 -19838 -7924 4162 -44318 -69244 -24636
5351 -24636 32569 21036 -14495 -29504 -25251 -3172 9109 -6491 -31179 -57316 -22649 -34812
5339 -34812 -16603 26955 37397 44949 38959 33310 16269 -7757 -40119 -58722 -36853 -33094 -32400
5326 -32400 -3075 -13740 -52321 -59891 -63386 -6133 46904 51643 61166 43135 19333 -6331 -32467
5313 -32467 -21522 -12096 -2844 10063 10461 -58509 -57297 -55812 -59592 -92733 -87960 -65744 -1850
$$ packed form
5401d7375J9520K8500l1777J9581k1910L3930M674r314l2991J1103l262o731J686
5388c4366M1349M4762K6651j2233l4451m4787J0206M7502n317l6867L0163J5739
5376D8351N988K8901j4976n926j3121j0466J8652J1708m3450k1143M698j4594
5364e378q150k805O21K0025M70j0917j6263K559J1914J2086m8480k4926M4608
5351b4636N7205j1533l5531j5009M253K2079J2281j5600k4688k6137L4667j2163
5339c4812J8209M3558J0442P552n990n649j7041k4026l2362j8603K1869L759O94
5326c2400K9325j0665l8581p570l495N7253N3037M739R523j8031k3802k5664k6136
5313c2467J0945R426R252J2907L98o8970J212J485l780l3141M773K2216O3894
$$ plain form
5300 -1850 20251 4634 12240 174 -5875 -6445 -49711 -84442 -70305 -43359 -17128 3895 -7431
5287 -7431 -22576 199 36577 38912 22858 23002 18292 -4286 933 -25068 -40340 -12183 33778
5274 33778 12051 -319 -6561 -20278 -4861 18420 21876 48837 73778 37519 25132 29034
5262 29034 11352 -46105 -84817 -50319 -3885 -1848 -48210 -105338 -85691 -28118 -8525 -59286
5250 -59286 -65920 -45137 -4582 6634 10235 4004 -12315 -26899 -41045 -26206 -26103 -32142 -23397
5237 -23397 -10926 -22237 6024 17911 -9053 -34283 -33717 10610 15147 -42711 -89537 -78077
5225 -78077 -22007 12371 -8445 -64972 -48578 -9097 16200 14775 -12577 -42706 -39374 -46509
5213 -46509 -55188 -34497 -41424 -37584 2415 21030 3142 3799 10447 -24141 -71472 -95763 -105124
$$ packed form
5300a850K2101j5617P606j2066o049n70m3266l4731J4137K6946K6231K1023j1326
5287g431j5145K2775L6378K335j6054J44m710k2578N219k6001j5272K8157M5961
5274C3778k1727j2370o242j3717J5417K3281L456K6961K4941l6259j2387L902
5262B9034j7682n7457l8712L4498M6434K037m6362n7128J9647N7573J9593n0761
5250e9286o634K0783M0555J1216L601o231j6319j4584j4146J4839J03o039Q745
5237b3397J2471j1311K8261J1887k6964k5230N66M4327M537n7858m6826J1460
5225g8077N6070L4378k0816n6527J6394L9481K5297j425k7352l0129L332p135
5213d6509q679K0691o927L840L9999J8615j7888O57O648l4588m7331k4291r361
$$ plain form
5200 -105124 -101160 -106417 -93722 -38119 -18440 -43171 -69463 -77014 -42282 -7826 -72837 -104831
5188 -104831 -42581 2536 4244 11174 25031 6739 -18153 -14859 -14978 -66671 -54592 -10922 8214
5175 8214 17272 30678 48345 -1672 -3077 -20489 -71039 -52658 -47414 -38564 -42786 -84591 -68345
5162 -68345 -33373 -51724 -79379 -65631 -25867 -31575 -22040 -20200 -44480 -58018 -17824 23001
5150 23001 27692 27779 -26632 -70494 -40122 6342 6038 -21854 11426 6835 -20591 -5980 13365
5137 13365 14249 17530 -1079 -13812 13441 7223 -18524 -27957 -49889 -53143 -44731 -88514 -100024
5124 -100024 -90671 -94028 -46925 -41048 -20627 -15256 -30273 -27706 -32734 3500 29226 15287 11811
5111 11811 48288 48173 44361 14766 -30152 -44079 -20372 -17675 2854 -131 -3242 -6074 -10943
$$ packed form
5200a05124L964n257J2695N5603J9679k4731k6292p551L4732L4456o5011l1994
5188a04831O2250M5117J708O930J3857j8292k4892L294j19n1693J2079M3670J9136
5175H214R058J3406J7667n0017j405j7412n0550J8381N244Q850m222m1805J6246
5162f8345L4972j8351k7655J3748L9764n708R535J840k4280j3538M0194M0825
5150B3001M691Q7n4411m3862L0372M6464l04k7892L3280m591k7426J4611J9345
5137A3365Q84L281j8609j2733K7253o218k5747r433k1932l254Q412m3783j1510
5124a00024R353l357M7103N877K0421N371j5017K567n028L6234K5726j3939l476
5111A1811L6477j15l812k9595m4918j3927K3707K697K0529k985l111k832m869
$$ plain form
5098 -10943 -33600 -61080 -54393 -43599 -58127 -22005 -1325 -22756 -59174 -16358 -8643 479
5086 479 -21868 -64315 -93414 -91404 -48384 -24935 -30098 -87650 -89993 -78369 -43302 -53666 -35084
5073 -35084 1544 -18991 -49519 -99683 -105384 -66917 -101338 -98576 -52195 -26480 -15805 8685
5061 8685 6046 -18616 -36760 -45899 -3383 50906 50003 39943 33090 12744 54665 54642 7223 7942
5047 7942 -21858 -33577 -27459 13687 45838 62508 40501 23735 28307 18758 -20312 -28213 -174
5034 -174 -16181 -41971 4682 12089 12129 29037 59753 67558 52998 21707 29571 21751 17206 20523
5020 20523 8515 30436 -3992 618 24405 19559 28532 35151 52014 8177 -24164 15474 9157
5007 9157 22046 50553 -13081 -4136 6524 5947 26534 62523 51873 70434 98926 82665 63008
$$ packed form
5098a0943k2657k7480O687J0794j4528L6122K0680k1431l6418M2816P715R122
5086D79k2347m2447k9099K010M3020K3449n163n7552k343J1624L5067j0364J8582
5073c5084L6628k0535l0528n0164n701L8467l4421K762M6381K5715J0675K4490
5061H685k639k4662j8144r139M2516N4289r03j0060o853k0346M1921k3m7419P19
5047G942k9800j1719O118M1146L2151J6670k2007j6766M572r549l9070p901K8039
5034a74j6007k5790M6653P407M0J6908L0716P805j4560l1291P864p820m545L317
5020B0523j2008K1921l4428M610K3787m846Q973O619J6863m3837l2341L9638o317
5007I157J2889K8507o3634Q945J0660n77K0587L5989j0650J8561K8492j6261j9657
$$ plain form
4994 63008 34903 40256 37922 50795 65719 77362 44340 27433 38639 44172 52209 45065 -10574
4981 -10574 -24921 -5536 -10723 -15253 -16549 -30016 16967 24224 8082 53614 67344 43756 1953
4968 1953 -15320 -24150 -23809 10807 29237 12166 -13294 5585 29003 -5384 -63296 -124945 -127591
4955 -127591 -110851 -90527 -56226 -31242 -42218 974 -908 -12402 35049 19202 -2149 -37307
4943 -37307 -35228 25205 51185 55438 72398 65622 80106 31985 -3810 -33663 -42849 -23886 -33519
4930 -33519 -33099 -61619 -9794 -6395 -60285 -61532 -40214 -5451 -42983 -33861 -8726 20801 41176
4917 41176 29391 40779 11630 5784 -33543 -17757 26293 6465 35722 33376 82505 116228
4905 116228 63149 7667 6663 25153 66228 58503 7163 -3838 11418 8782 1203 6150 31450
$$ packed form
4994F3008k8105N353k334J2873J4924J1643l3022j6907J1206N533Q037p144n5639
4981a0574j4347J9385n187m530j296j3467M6983P257j6142M5532J3730k3588m1803
4968A953j7273q830L41L4616J8430j7071k5460J8879K3418l4387n7912o1649k646
4955a27591J6740K0324L4301K4984j0976M3192j882j1494M7451j5847k1351l5158
4943c7307K079O0433K5980M253J6960o776J4484m8121l5795k9853r186J8963r633
4930c3519M20k8520N1825L399n3890j247K1318L4763l7532R122K5135K9527K0375
4917D1176j1785J1388k9149n846l9327J5786M4050j9828K9257k346M9129L3723
4905A16228n3079n5482j004J8490M1075p725n1340j1001J5256k636p579M947K5300
$$ plain form
4892 31450 25870 -16643 -23948 -10189 -15315 -2961 45321 42405 9459 5049 8351 44245 55549
$$ packed form
4892C1450n580m2513p305J3759n126J2354M8282k916l2946m410L302L5894J1304
$$ [...]
##END NTUPLES=NMR SPECTRUM
##END=
