##TITLE=Analysis number 308989
Compound Code cc 34808
Book Reference 399/163
Project Code adrs
Chemist Name evam
##JCAMPDX= 6.0         $$ Bruker NMR JCAMP-DX V2.0
##DATA TYPE= NMR SPECTRUM
##DATA CLASS= NTUPLES
##ORIGIN= Bruker BioSpin GmbH
##OWNER= NMR
$$ XWIN-NMR		Version 3.5
$$ Thu May 26 11:04:30 2005 GMT Daylight Time (UT+1h)  MAYBRIDGE\NMR@NMR_250MHZ
##.OBSERVE FREQUENCY= 250.131544655141
##.OBSERVE NUCLEUS= ^1H
##.ACQUISITION MODE= SIMULTANEOUS (DQD)
##.ACQUISITION SCHEME= undefined
##.AVERAGES= 16
##.DIGITISER RES= 18
##SPECTROMETER/DATA SYSTEM= dpx250
##.PULSE SEQUENCE= zg30
##.SOLVENT NAME= CDCl3
##.SHIFT REFERENCE= (INTERNAL, CDCl3, 0, 16.4502)
##AUDIT TRAIL= $$ (NUMBER, WHEN, WHO, WHERE, WHAT)
$$ ##TITLE= Audit trail, XWIN-NMR		Version 3.5
$$ ##JCAMPDX= 5.01
$$ ##ORIGIN= Bruker BioSpin GmbH
$$ ##OWNER= NMR
$$ C:\u/data/dgb/nmr/ADRS/3550/pdata/1/auditp.txt
$$ ##AUDIT TRAIL=  $$ (NUMBER, WHEN, WHO, WHERE, WHAT)
(   1,<2005-05-26 11:04:11.93 +100>,<MAYBRIDGE\NMR>,<NMR_250MHZ>,
      <created by zg, POWCHK disabled, PULCHK disabled
       configuration hash MD5:
       62 19 C7 07 E1 42 D1 B7 37 6C 3D D0 77 39 F9 E6
       data hash MD5: 64K
       49 67 5B 74 47 F1 DC 14 AC A9 EF 8F 20 94 2B BF>)
(   2,<2005-05-26 11:04:23.23 +100>,<MAYBRIDGE\NMR>,<NMR_250MHZ>,
      <Start of raw data processing
       ef LB = 0.3 FT_mod = 6 PKNL = 1 SI = 32K 
       data hash MD5: 32K
       47 04 AB 38 8F AC A2 9E 2B 24 62 CB 5F 47 A1 4F>)
(   3,<2005-05-26 11:04:24.92 +100>,<MAYBRIDGE\NMR>,<NMR_250MHZ>,
      <apk 
       data hash MD5: 32K
       2B FA 90 03 D2 6C C2 C0 C3 A9 40 50 82 44 48 3D>)
(   4,<2005-05-26 11:04:25.56 +100>,<MAYBRIDGE\NMR>,<NMR_250MHZ>,
      <abs ABSG = 5 
       data hash MD5: 32K
       CD B6 3F 90 D7 0D E1 83 AA 61 EA 1F 4C B3 7C 81>)
$$ ##END=
$$ 
$$ hash MD5
$$ AF A6 86 28 9A F1 F7 BB B1 54 46 D5 1D 2A 83 AA
##$RELAX= 
##$RELAX= 
##$RELAX= 
##$RELAX= 
##$RELAX= 
##$RELAX= 
##$RELAX= 
$$ Bruker specific parameters
$$ --------------------------
##$DU= <C:\u>
##$EXPNO= 3550
##$NAME= <ADRS>
##$PROCNO= 1
##$TYPE= <nmr>
##$USER= <dgb>
##$AMP= (0..31)
100 100 100 100 100 100 100 100 100 100 100 100 100 100 100 100 100 100 
100 100 100 100 100 100 100 100 100 100 100 100 100 100 
##$AQSEQ= 0
##$AQ_mod= 3
##$AUNM= <au_zg>
##$AUTOPOS= <12 >
##$BF1= 250.13
##$BF2= 250.13
##$BF3= 250.13
##$BF4= 250.13
##$BF5= 500.13
##$BF6= 500.13
##$BF7= 500.13
##$BF8= 500.13
##$BYTORDA= 1
##$CFDGTYP= 0
##$CFRGTYP= 5
##$CHEMSTR= <none>
##$CNST= (0..31)
1 1 145 1 1 1 1 1 1 1 1 1 1 1 1 1 1 1 1 1 1 1 1 1 1 1 1 1 1 1 1 1 
##$CPDPRG= <>
##$CPDPRG1= <>
##$CPDPRG2= <>
##$CPDPRG3= <>
##$CPDPRG4= <mlev>
##$CPDPRG5= <mlev>
##$CPDPRG6= <mlev>
##$CPDPRG7= <mlev>
##$CPDPRG8= <mlev>
##$CPDPRGB= <>
##$CPDPRGT= <>
##$D= (0..31)
0 1 0 0 0 0 0 0 0 0.06 0 0 0 0 0 0 0.0002 0 0 0 0 0 0 0 0 0 0 0 0 0 0 
0 
##$DATE= 1117101851
##$DBL= (0..7)
120 120 120 120 120 120 120 120 
##$DBP= (0..7)
150 150 150 150 150 150 150 150 
##$DBP07= 0
##$DBPNAM0= <>
##$DBPNAM1= <>
$$ [...]
##$SUBNAM7= <"">
##$SUBNAM8= <"">
##$SUBNAM9= <"">
##$SW= 20.6930455092707
##$SWIBOX= (0..15)
0 0 3 0 0 0 0 0 0 0 0 0 0 0 0 0 
##$SW_h= 5175.983436853
##$TD= 65536
##$TD0= 1
##$TE= 295.16
##$TE2= 300
##$TE3= 300
##$TEG= 300
##$TL= (0..7)
0 120 120 120 120 120 120 120 
##$TP= (0..7)
150 150 150 150 150 150 150 150 
##$TP07= 0
##$TPNAME0= <>
##$TPNAME1= <>
##$TPNAME2= <>
##$TPNAME3= <>
##$TPNAME4= <>
##$TPNAME5= <>
##$TPNAME6= <>
##$TPNAME7= <>
##$TPOAL= (0..7)
0.5 0.5 0.5 0.5 0.5 0.5 0.5 0.5 
##$TPOFFS= (0..7)
0 0 0 0 0 0 0 0 
##$TUNHIN= 0
##$TUNHOUT= 0
##$TUNXOUT= 0
##$USERA1= <user>
##$USERA2= <user>
##$USERA3= <user>
##$USERA4= <user>
##$USERA5= <user>
##$V9= 5
##$VALIST= <valist>
##$VCLIST= <CCCCCCCCCCCCCCC>
##$VD= 0
##$VDLIST= <DDDDDDDDDDDDDDD>
##$VPLIST= <PPPPPPPPPPPPPPP>
##$VTLIST= <TTTTTTTTTTTTTTT>
##$WBST= 1024
##$WBSW= 4
##$XGAIN= (0..3)
0 0 0 0 
##$XL= 0
##$YL= 0
##$YMAX_a= 395299
##$YMIN_a= -416489
##$ZGOPTNS= <>
##$ZL1= 120
##$ZL2= 120
##$ZL3= 120
##$ZL4= 120
##$ABSF1= 16.45019
##$ABSF2= -4.242983
##$ABSG= 5
##$ABSL= 3
##$ALPHA= 0
##$AQORDER= 0
##$ASSFAC= 0
##$ASSFACI= 0
##$ASSFACX= 0
##$ASSWID= 0
##$AUNMP= <proc_1d>
##$AZFE= 0.1
##$AZFW= 0.1
##$BCFW= 0
##$BC_mod= 0
##$BYTORDP= 0
##$COROFFS= 0
##$CY= 12.5
##$DATMOD= 1
##$DC= 0
##$DFILT= <>
##$DTYPP= 0
##$F1P= 14.0000005364418
##$F2P= -0.99999901652339
##$FCOR= 0.5
##$FTSIZE= 32768
##$FT_mod= 6
##$GAMMA= 0
##$GB= 0
##$INTBC= 1
##$INTSCL= 1
##$ISEN= 128
##$LB= 0.3
##$LEV0= 0
##$LPBIN= 0
##$MAXI= 10000
##$MC2= 0
##$MEAN= 0
##$ME_mod= 0
##$MI= 0
##$NCOEF= 0
##$NC_proc= -2
##$NLEV= 6
##$NOISF1= 0
##$NOISF2= 0
##$NSP= 0
##$NTH_PI= 0
##$NZP= 0
##$OFFSET= 16.45019
##$PC= 1
##$PHC0= -71.20664
##$PHC1= 0.8786568
##$PH_mod= 1
##$PKNL= yes
##$PPARMOD= 0
##$PSCAL= 4
##$PSIGN= 0
##$REVERSE= no
##$SF= 250.13001796103
##$SI= 32768
##$SIGF1= 0
##$SIGF2= 0
##$SINO= 400
##$SIOLD= 32768
##$SREGLST= <1H.CDCl3>
##$SSB= 0
##$STSI= 32768
##$STSR= 0
##$SW_p= 5175.98343685301
##$SYMM= 0
##$S_DEV= 0
##$TDeff= 65536
##$TDoff= 0
##$TI= <Analysis number 999999
Compound Code 99
Book Reference 9
Project Code 9>
##$TILT= no
##$TM1= 0
##$TM2= 0
##$TOPLEV= 0
##$USERP1= <user>
##$USERP2= <user>
##$USERP3= <user>
##$USERP4= <user>
##$USERP5= <user>
##$WDW= 1
##$XDIM= 32768
##$YMAX_p= 340461426
##$YMIN_p= -426828
$$ End of Bruker specific parameters
$$ ---------------------------------
##NTUPLES= NMR SPECTRUM
##VAR_NAME=  FREQUENCY,     SPECTRUM/REAL,   SPECTRUM/IMAG
##SYMBOL=    X,             R,               I
##VAR_TYPE=  INDEPENDENT,   DEPENDENT,       DEPENDENT
##VAR_FORM=  AFFN,          ASDF,            ASDF
##VAR_DIM=   32768,         32768,           32768
##UNITS=     HZ,            ARBITRARY UNITS, ARBITRARY UNITS
##FACTOR=    0.157963299565203, 1,           1
##FIRST=     4114.68621772263, 0,            0
##LAST=      -1061.29721913038, 0,           0
##MIN=       -1061.29721913038, -426828,     0
##MAX=       4114.68621772263, 340461426,    0
$$ Real data points
##PAGE= N=1
##DATA TABLE= (X++(R..R)), XYDATA
$$ [...]
$$ plain form
17239 -9082 -13224 -3640 4061 15223 19050 7442 6505 -7398 -14401 -7004 -4045 -19213 -18494 -13359
17225 -13359 -9786 716 10479 7201 16256 12330 12544 8049 5807 5496 2889 2073 8807 10094 1686
17210 1686 -898 -9626 -12153 152 16829 24110 21774 14802 916 -9031 1006 -2974 -5670 -243
17196 -243 17947 5366 -9809 2441 16282 12514 9564 5990 1174 8752 15912 11196 13599 30085
17182 30085 43981 37961 30799 30848 21781 26046 36490 32373 10391 389 2729 -3571 -8405 -5239
17168 -5239 784 -12017 -12257 -5526 -9732 -9876 14362 29245 21079 13674 13040 19818 26268 20080 15814
17153 15814 9427 2800 -1385 -6377 2954 7085 -9514 -23481 -12025 13364 24822 21754 5856
17140 5856 14312 -1133 -3244 6718 9937 17192 15062 13645 7780 9187 4968 5999 10450 -553
$$ packed form
17239i082m142R584P701J1162L827j1608r37j3903p003P397K959j5168P19N135
17225a3359L573J0502R763l278R055l926K14m495k242l11k607q16O734J287q408
17210A686k584q728k527J2305J6677P281k336o972j3886r947J0037l980k696N427
17196b43J8190j2581j5175J2250J3841l768k950l574m816P578P160m716K403J6486
17182C0085J3896o020p162M9r067M265J0444m117k1982j0002K340o300m834L166
17168e239O023j2801k40O731m206j44K4238J4883q166p405o34O778O450o188m266
17153A5814o387o627m185m992R331M131j6599j3967J1456K5389J1458l068j5898
17140E856Q456j5445k111R962L219P255k130j417n865J407m219J031M451j1003
$$ plain form
17126 -553 713 -157 -1685 2115 -2849 -1721 -2259 2998 -4878 -3199 58 13537 24827 30044 28759
17111 28759 28062 26400 9851 14672 5989 -4674 -10668 -463 -4969 -23751 -31929 -42671 -34863
17098 -34863 -10273 -4369 -8134 6886 25258 29681 20872 11074 5842 2406 -12 -10650 -23160
17085 -23160 -19549 -22038 -12393 -2990 -3292 -8838 -18106 -11989 -12305 1446 -6624 -15556 -13982 -16134 -21497
17070 -21497 -9752 -7633 -18764 -17425 -4925 1828 -3812 4506 4479 -5662 -875 727 3348 10071
17056 10071 6404 6207 19029 11711 -8048 -11899 -11974 -1162 9718 -630 -8315 -4294 3081 4420
17042 4420 12082 8669 -10297 2666 14860 20912 23496 18385 6296 -135 1080 -5732 -13782 -8429
17028 -8429 -7253 -11491 -3476 10573 21897 15218 3521 -4142 2477 9669 -1061 5465 5623 -2310
$$ packed form
17126e53J266q70j528L800m964J128n38N257p876J679L257J3479J1290N217j285
17111B8759o97j662j6549M821q683j0663n994J0205m506j8782q178j0742P808
17098c4863K4590N904l765J5020J8372M423q809r798n232l436k418j0638j2510
17085b3160L611k489R645R403l02n546r268O117l16J3751q070q932J574k152n363
17070b1497J1745K119j1131J339J2500O753n640Q318k7j0141M787J602K621O723
17056A0071l667j97J2822p318j9759l851p5J0812J0880j0348p685M021P375J339
17042D420P662l413j8966J2963J2194O052K584n111j2089o431J215o812q050N353
17028h429J176m238Q015J4049J1324o679j1697p663O619P192j0730O526J58p933
$$ plain form
17014 -2310 4911 23069 20619 9341 3470 -10927 -11361 -8688 4551 8977 11717 16917 18380 15625
17000 15625 23063 30620 21701 19892 21894 13871 2608 -1364 4235 -3100 -11802 -1336 162 -4791
16986 -4791 9005 4693 -10646 -7555 -9271 -1357 -3328 10951 23865 12929 -1435 -280 -10402
16973 -10402 -11663 -15001 -14745 4672 4469 -231 2526 12748 17919 25740 18008 3580 -8250 -13975
16959 -13975 -239 11192 288 1307 21934 28558 8711 -6339 -307 11312 14166 3636
16947 3636 -12716 -17191 -10026 -3589 4009 10679 5762 -738 -4149 -14720 -23144 -20376 -10572 8853
16933 8853 12187 -4947 -14260 -7746 -3503 828 3894 3468 12728 6810 9012 7602 6794 21492 14828
16918 14828 14791 7041 9036 -243 -1257 -4436 -8011 -1690 3427 -3264 -8133 -1367 -8627 -1712 -11157
$$ packed form
17014b310P221J8158k450j1278n871j4397m34K673J3239M426K740N200J463k755
17000A5625P438P557q919j809K002q023j1263l972N599p335q702J0466J498m953
16986d791J3796m312j5339L091j716P914j971J4279J2914j0936j4364J155j0122
16973a0402j261l338K56J9417k03m700K757J0222N171P821p732j4428j1830n725
16959a3975J3736J1431j0904J019K0627O624j9847j5050O032J1619K854j0530
16947C636j6352m475P165O437P598O670m917o500l411j0571q424K768R804J9425
16933H853L334j7134r313O514M243M331L066m26R260n918K202j410q08J4698o664
16918A4828l7p750J995r279j014l179l575O321N117o691m869O766p260O915r445
$$ plain form
16903 -11157 -13140 -16696 -10611 -16386 -9474 -7050 -7289 -4523 -10147 58 7101 2178 5405 3710
16889 3710 -1119 18409 29020 32533 25088 23821 19688 7939 6987 -1402 -7967 -3970 5536 3074
16875 3074 -12673 -1220 16508 28271 23351 30273 18040 13316 24261 28856 32776 21810 11000
16862 11000 11565 22939 24123 10675 10370 25513 31687 30545 23707 6403 11290 14428 21839 24706
16848 24706 23126 23496 29024 32662 17509 19562 10441 -793 -1155 10721 12339 -4736 512 15059
16834 15059 20340 19049 25685 25652 28221 26788 19192 9971 4485 10670 15328 6545 -562 -6854 7451
16819 7451 23859 22885 17153 10930 934 3866 4724 2901 9224 10560 20214 17054 19223 24053 25570
16804 25570 20126 22727 14019 -4331 -6498 1113 4940 3278 2644 2772 -8057 -16093 -14848 -3952
$$ packed form
16903a1157j983l556O085n775O912K424k39K766n624J0205P043m923L227j695
16889C710m829J9528J0611L513p445j267m133j1749r52q389o565L997R506k462
16875C074j5747J1453J7728J1763m920O922j2233m724J0945M595L920j0966j0810
16862A1000N65J1374J184j3448l05J5143O174j142o838j7304M887L138P411K867
16848B4706j580L70N528L638j5153K053r121j1234l62J1876J618j7075N248J4547
16834A5059N281j291O636l3K569j433p596r221n486O185M658q783p107o292J4305
16819G451J6408r74n732o223r996K932Q58j823O323J336R654l160K169M830J517
16804B5570n444K601q708j8350k167P611L827j662o34J28j0829q036J245J0896
$$ plain form
16790 -3952 1256 6450 -5649 -17881 -16768 -4631 9493 18908 25909 25978 19710 3590 -5960 534
16776 534 9985 4165 3558 6186 -3191 -10052 -8620 5466 -491 -15552 -16684 -6958 12183 20644
16762 20644 14116 7027 5300 3070 9208 17360 25428 20303 15798 3939 -7415 -14681 -15511 -16948
16748 -16948 -6455 -1319 5146 4310 11315 17382 5482 2904 9714 2573 -8652 -17487 -19334 5024
16734 5024 3400 4113 2083 14841 17331 7206 -1762 -2079 12952 4578 -6364 3749 5038 8473
16720 8473 8601 16019 16774 12667 809 -2322 -8449 -10031 10262 15216 6658 7582 25059 22781 26903
16705 26903 17884 15782 15593 12622 5985 10956 14802 17933 12680 -3617 -7694 -3361 -110 -6811
16691 -6811 -19673 -14015 -3402 14042 8571 -7762 -15471 -9609 1965 956 -6389 -4924 -13762
$$ packed form
16790c952N208N194j2099j2232J113J2137J4124R415P001O9o268j6120r550O494
16776E34R451n820o07K628r377o861J432J4086n957j5061j132R726J9141Q461
16762B0644o528p089j727k230O138Q152Q068n125m505j1859j1354p266q30j437
16748a6948J0493N136O465q36P005O067j1900k578O810p141j1225q835j847K4358
16734E024j624P13k030J2758K490j0125q968l17J5031q374j0942J0113J289L435
16720H473J28P418P55m107j1858l131o127j582K0293M954q558R24J7477k278M122
16705B6903r019k102j89k971o637M971L846L131n253j6297m077M333L251o701
16691f811j2862N658J0613J7444n471j6333p709N862J1574j009p345J465q838
$$ plain form
16678 -13762 -1315 12289 17295 16756 19691 21131 7562 -1640 3870 7436 4021 5382 -3946 -15504
16664 -15504 -6280 -10302 -16472 -11140 -4268 4061 4839 3087 6639 209 -5777 -4215 6373 12426
16650 12426 18929 4801 -5113 -5447 -10359 -2073 2333 -4534 -9157 -1095 5507 -515 -714 5790 2150
16635 2150 -11091 -19569 -11084 -10593 -5228 9949 19516 21124 15430 5837 -1608 -4355 -823 5910
16621 5910 15636 13097 12587 14555 6904 2875 18713 19744 16891 20005 6207 -2562 -2347 -5739 -2032
16606 -2032 1197 14678 26410 8590 -1323 931 1059 2165 -3346 7109 7801 -7365 -379 14730
16592 14730 22063 9386 -6091 -2209 9307 -2526 -5938 5576 -1462 2883 11338 6089 1049
16579 1049 2274 2422 14393 5388 38 10509 6879 9611 9368 1184 5433 1974 11126 10403 -10981
$$ packed form
16678a3762J2447J3604N006n39K935J440j3569r202N510L566l415J361r328j1558
16664a5504R224m022o170N332O872Q329P78j752L552o430n986J562J0588O053
16650A2426O503j4128r914l34m912Q286M406o867m623Q062O602o022j99O504l640
16635B150j3241q478Q485M91N365J5177R567J608n694r593p445k747L532O733
16621E910R726k539n10J968p651m029J5838J031k853L114j3798q769K15l392L707
16606b032L229J3481J1732j7820r913K254J28J106n511J0455O92j5166O986J5109
16592A4730P333j2677j5477L882J1516j1833l412J1514p038M345Q455n249n040
16579A049J225J48J1971r005n350J0471l630K732k43q184M249l459R152p23k1384
$$ plain form
16564 -10981 -10245 2494 9422 8101 7895 13123 25623 13725 21680 30947 30962 18845 10399 12197
16550 12197 18715 16117 3030 5309 5756 -5184 -5565 5089 18460 21114 8839 -5244 -15564
16537 -15564 -7274 2812 18233 23081 10768 -3836 -4873 -1398 8235 8068 -3368 1014 3994
16524 3994 7813 16711 3305 -1318 9982 14026 7376 -4009 -11280 -8955 142 5663 -66 7419
16510 7419 12735 15548 3777 -4851 1899 5849 11323 18621 27659 36726 42552 42600 44987 24632 17664
16495 17664 15772 23640 23256 12485 -4677 -3483 13645 11503 -739 23215 31997 15919 -1443
16482 -1443 -11866 -9549 7681 231 6323 12460 7383 -2862 -11999 -15050 -12176 -883 18039
16469 18039 2643 -16534 -15706 -8195 -1240 -3125 -4847 1894 7993 -7105 -14086 -23176 -22194 -16624
$$ packed form
16564a0981P36J2739O928j321k06N228J2500j1898P955R267J5j2117q446J798
16550A2197O518k598j3087K279M47j0940l81J0654J3371K654j2275j4083j0320
16537a5564Q290J0086J5421M848j2313j4604j037L475R633j67j1436M382K980
16524C994L819Q898j3406m623J1300M044o650j1385p271K325R097N521n729P485
16510G419N316K813j1771q628O750L950N474P298R038R067N826M8K387k0355o968
16495A7664j892P868l84j0771j7162J194J7128k142j2242K3954Q782j6078j7362
16482a443j0423K317J7230p450O092O137n077j0245r137l051K874J1293J8922
16469A8039j5396j9177Q28P511O955j885j722O741O099j5098o981r090R82N570
$$ plain form
16455 -16624 -13122 -14003 -22939 -27385 -7797 -6615 10320 8436 7657 -5843 -14779 -13316 -14335 -11686
16441 -11686 6755 -288 8658 11845 -3653 -10618 7166 33345 27175 16032 18362 19430 18538
16428 18538 16958 14262 6614 5046 16976 23250 5650 -4500 -15132 -6882 12301 17736 10952
16415 10952 3813 -4766 -8988 -3417 -6087 -10554 -13960 -14637 -1526 4788 8974 3585 -1166 -3248
16401 -3248 12060 18818 12015 -3552 -1204 5648 -1097 -2466 -424 2995 3750 13788 14749 9308
16387 9308 14735 11191 404 -3209 7458 11726 17450 14993 4453 5541 15505 32129 32465 28282
16373 28282 30313 30813 25828 27738 38741 34838 26476 17643 8895 5898 11965 16950 8048 1755
16359 1755 4891 8962 6808 9411 4548 12870 17996 12384 11021 3645 -12752 -26883 -20501 -26518
$$ packed form
16455a6624L502q81q936m446J9588J182J6935j884p79j3500q936J463j019K649
16441a1686J8441p043Q946L187j5498o965J7784K6179o170j1143K330J068q92
16428A8538j580k696p648j568J1930O274j7600j0150j0632Q250J9183N435o784
16415A0952p139q579m222N571k670m467l406o77J3111O314M186n389m751k082
16401c248J5308O758o803j5567K348O852o745j369K042L419P55J0038R61n441
16387I308N427l544j0787l613J0667M268N724k457j0540J088R964J6624L36m183
16373B8282K031N00m985J910J1003l903q362q833q748k997O067M985q902o293
16359A755L136M071k154K603m863Q322N126n612j363p376j6397j4131O382o017
$$ plain form
16345 -26518 -21493 -16106 -888 990 -8579 -27292 -45104 -41360 -30437 -20778 -11462 4689 -1987
16332 -1987 -11130 -5956 -123 -493 2305 15319 15439 21269 17207 10315 -5854 -2388 10740 -6671
16318 -6671 -4426 -108 8065 20223 21530 15539 8499 3358 4340 -3403 -4328 5054 1656 -8254 2761
16303 2761 8554 -428 -12985 -5433 8474 8465 -1767 -3575 -14404 -22890 -15168 -20499 -16136 -5836
16289 -5836 12712 25619 24434 14392 20755 9969 10355 16448 19949 17790 -4272 -9896 -762 -3386
16275 -3386 -9004 -9441 -6246 -12882 -15244 -14126 7046 21646 23328 21285 19168 20158 13728 13757 610
16260 610 -6295 -7489 -4743 1533 5350 8971 8037 -1818 -7922 -11739 -10808 -2977 28 -11477 -18845
16245 -18845 -732 2743 -1136 19600 37459 40372 34137 24490 16832 2474 -5089 231 9554
$$ packed form
16345b6518N025N387J5218J878r569j8713j7812L744J0923R659R316J6151o676
16332a987r143N174N833l70K798J3014J20N830m062o892j6169L466J3128j7411
16318f671K245M318Q173J2158J307n991p040n141R82p743r25R382l398r910J1015
16303B761N793q982j2557P552J3907rj0232j808j0829q486P722n331M363J0300
16289e836J8548J2907j185j0042O363j0786L86O093L501k159k2062n624R134k624
16275c386n618m37L195o636k362J118K1172J4600J682k043k117R90o430K9j3147
16260F10o905j194K746O276L817L621r34r855o104l817R31P831L005j1505p368
16245a8845J8113L475l879K0736J7859K913o235r647p658j4358p563N320R323
$$ plain form
16232 9554 7400 -4449 -12529 -6421 -2061 -8880 617 11609 -5099 -20512 -16071 -16325 -27073 -25026
16218 -25026 -20173 -14966 1416 7593 -11475 -18894 -11178 -3157 6093 10511 3399 -10609 -7729 8839
16204 8839 12150 5266 4476 4956 -212 -8502 899 9638 7584 5419 8407 9667 2050 6837 24381
16189 24381 20980 6732 -4568 1774 13516 21022 11194 1823 -901 5030 5407 -4375 -1337 3931
16175 3931 -6954 2193 6625 4049 6585 -4704 -26253 -30550 -21671 -8188 -8362 -7821 -741 -10478
16161 -10478 -10789 -7696 -2345 -2780 7575 26243 12272 5377 -1426 2487 9226 11559 21162 23627
16147 23627 24678 28716 34568 29680 21498 22478 3783 -14083 -31377 -12615 -4828 -2088 7900 7192
16133 7192 -15484 -1538 6175 7180 4342 19202 39925 45962 36925 23017 7702 10334 11475
$$ packed form
16232I554k154j1849q080O108M360o819R497J0992j6708j5413M441k54j0748K047
16218b5026M853N207J6382O177j9068p419P716Q021R250M418p112j4008K880J6568
16204H839L311o884p90M80n168q290R401Q739k054k165K988J260p617M787J7544
16189B4381l401j4248j1300O342J1742P506r828r371k724N931L77r782L038N268
16175C931j0885R147M432k576K536j1289k1549m297Q879J3483j74N41P080r737
16161a0478l11L093N351m35J0355J8668j3971o895o803L913O739K333R603K465
16147B3627J051M038N852m888q182R80j8695j7866j7294J8762P787K740R988p08
16133G192k2676J3946P713J005k838J4860K0723O037r037j3908j5315K632J141
$$ plain form
16120 11475 2169 9178 16113 12226 11099 8785 -7001 -15284 -3986 -6306 -3874 -7173 -6525 -15300
16106 -15300 -17481 -6162 -954 4218 -1535 -8867 -12070 -11464 -18850 -18058 -17520 -7450 -7164 -485 7011
16091 7011 15946 12170 10319 12575 23008 17562 20169 18377 927 -4776 -10840 -19141 -19893 -22790
16077 -22790 -33409 -37467 -13341 -9831 -17329 -25029 -34577 -21238 -8571 -9128 -4294 -5491 -9726 -9460
16063 -9460 -16322 -2068 5153 -8563 -10844 -753 -128 -5739 -13104 -2324 13520 12696 11608 -1151
16049 -1151 -8854 4101 17448 22469 9296 -3723 -10438 -2528 -6044 -3131 -2408 5258 7513 5165
16035 5165 8679 7044 3146 10213 2812 -10459 -12315 2994 -9808 -1443 30220 38973 26706
16022 26706 24033 18767 21832 8059 -14404 -22273 -17467 -8332 -6527 1799 -4646 -1618 2228 -238
$$ packed form
16120A1475r306P009O935l887j127k314j5786q283J1298k320K432l299O48q775
16106a5300k181J1319N208N172n753p332l203O06p386P92N38J0070K86O679P496
16091G011Q935l776j851K256J0433n446K607j792j7450n703o064q301p52k897
16077b2790j0619m058K4126L510p498p700r548J3339J2667n57M834j197m235K66
16063i460o862J4254P221j3716k281J0091O25n611p365J0780J5844q24j088j2759
16049a151p703J2955J3347N021j3173j3019o715P910l516K913P23P666K255k348
16035E165L514j635l898P067p401j3271j856J5309j2802Q365L1663Q753j2267
16022B6706k673n266L065j3773k2463p869M806R135J805Q326o445L028L846k466
$$ plain form
16008 -238 7807 9023 -7573 -13141 -3074 13257 15155 18447 7787 12259 5729 -8972 -13979 -17592
15994 -17592 -23576 -21899 -15517 -10252 -9069 -4430 5601 8287 14579 16782 22411 24721 7587 -12727
15980 -12727 -18878 -8880 -8266 -25603 -36505 -29337 -20065 -22782 -33486 -35327 -35080 -24824 -11065 -9542
15966 -9542 -2921 2079 4065 21808 29157 11443 7304 13693 7252 10244 23489 25751 35138 49482
15952 49482 43348 24954 16543 14393 13176 15684 3396 10338 16205 14930 8372 623 7961 22142
15938 22142 20350 30148 21121 9396 -2570 2845 17412 10876 -959 9630 31237 44813 43767
15925 43767 27609 12780 18356 13051 -14884 -17525 -17431 -15258 -13927 -15218 -15149 628 7783 8054 9727
15910 9727 4213 7384 -4576 -16529 -7904 1516 -5821 -4654 8350 -1612 -4346 -17176 -13262 -1630
$$ packed form
16008b38Q045J216j6596n568J0067J6331J898L292j0660M472o530j4701n007l613
15994a7592n984J677O382N265J183M639J0031K686O292K203N629K310j7134k0314
15980a2727o151R998O14j7337j0902P168R272k717j0704j841K47J0256J3759J523
15966i542O621N000J986J7743P349j7714m139O389o441K992J3245K262R387J4344
15952D9482o134j8394q411k150j217K508j2288O942N867j275o558p749P338J4181
15938B2142j792R798r027j1725j1966N415J4567o536j1835J0589K1607J3576j046
15925D3767j6158j4829N576n305k7935k641R4K173J331j291O9J5777P155K71J673
15910I727n514L171j1960j1953Q625R420p337J167J3004r962k734j2830L914J1632
$$ plain form
15896 -1630 -801 3612 6614 -3020 -13069 -16379 -13003 -11864 -12205 -12756 -21335 -10370 -8388 -4008 2775
15881 2775 5829 6714 1576 -14596 -29767 -28601 -19738 -25780 -26062 -18053 -4929 -8309 -4969 8135
15867 8135 12634 172 -18584 -29388 -31157 -16143 -1121 12105 27432 35419 35846 23579 5316
15854 5316 -9724 -12754 -8088 -16009 -6209 6565 2283 -13295 -7862 -3329 -8359 -10282 -21521 -6308
15840 -6308 13959 25449 21678 8613 -16203 -8402 1774 16008 24478 13025 5551 3199 -5649
15827 -5649 -3615 -13360 -16544 -23037 -23530 -7908 4043 17016 20456 10780 -1221 3189 -4248 -26214
15813 -26214 -17263 1901 1178 1064 -6919 3560 13552 17348 -8035 -18016 -12362 4632 21910 25598
15799 25598 9798 -2307 -9083 3394 14208 15317 2408 10048 18015 17605 14288 8902 -1176
$$ packed form
15896a630Q29M413L002r634j0049l310L376J139l41n51q579J0965J982M380O783
15881B775L054Q85n138j6172j5171J166Q863o042k82Q009J3124l380L340J3104
15867H135M499j2462j8756j0804j769J5014J5022J3226J5327P987M27j2267j8263
15854E316j5040l030M666p921R800J2774m282j5578N433M533n030j923j1239J5213
15840f308K0267J1490l771j3065k4816P801J0176J4234Q470j1453p474k352q848
15827e649K034r745l184o493m93J5622J1951J2973L440r676j2001M410p437k1966
15813b6214Q951J9164p23j14p983J0479R992L796k5383r981N654J6994J7278L688
15799B5598j5800j2105o776J2477J0814J109j2909P640P967m10l317n386j0078
$$ plain form
15786 -1176 4150 -1936 -8701 -16515 -13505 -6097 -13988 -17997 -16989 -23556 -5838 16051 5212 -7251
15772 -7251 1370 15763 26155 14799 -7076 -6569 -4111 1524 11540 3538 -7155 -8104 -11216 -18439
15758 -18439 -23193 -25950 -25127 -12329 7985 10060 15207 7199 4487 7953 5725 2303 7701 851
15744 851 10652 19781 7981 4507 23069 27478 15033 -1263 -484 -14599 -18706 -13049 -6356 8438
15730 8438 7420 3215 5015 2187 -1523 -1953 -6331 74 -14573 -17096 -21452 -17784 -6399 -8755
15716 -8755 -11064 -16780 -7742 -8497 -11956 -2868 -9423 -4865 -17613 -23730 -15482 -18931 -26533 -20702 -14153
15701 -14153 -10188 -14641 -23764 -8079 24253 19428 15076 29662 29393 21582 13861 857 -2243 -3754
15687 -3754 -8120 -14696 -5318 8673 10390 1833 9136 8305 11363 20953 30545 2881 -8207 3576
$$ packed form
15786a176N326o086o765p814L010P408p891m009J008o567J7718K1889j0839j2463
15772g251Q621J4393J0392j1356k1875N07K458N635J0016q002j0693r49l112p223
15758a8439m754k757Q23J2798K0314K075N147q008k712L466k228l422N398o850
15744H51R801R129j1800l474J8562M409j2445j6296P79j4115m107N657O693J4794
15730H438j018m205J800k828l710m30m378O405j4647k523m356L668J1385k356
15716h755k309n716R038p55l459R088o555M558j2748o117Q248l449p602N831O549
15701a4153L965m453r123J5685L2332m825m352J4586k69p811p721j3004l100j511
15687c754m366o576R378J3991J717q557P303q31L058R590R592k7664j1088J1783
$$ plain form
15673 3576 -2164 1579 461 16475 8730 -3868 -12443 -3942 -3741 -17844 -19293 -9420 1676 -8488
15659 -8488 4169 21991 22444 9021 6122 -317 -1850 -13646 -13532 -5633 433 -6730 2299 15881
15645 15881 28202 38576 34346 36279 11061 -14471 -16171 -25787 -39724 -36608 -24204 -7226 6165
15632 6165 -1087 -4264 10413 16880 -5627 -13388 -14037 -8540 -9454 -13416 -1168 6364 5974 21367
15618 21367 9731 -804 8357 9291 6220 3135 7172 23800 19228 6803 -110 -2789 -8506 -9371
15604 -9371 -17770 -9243 41 2301 -4594 -1248 -12796 -20444 -8606 -8164 -10562 -6702 -1279 -3574
15590 -3574 6943 8764 13421 9291 4267 -1224 -11559 -14425 -17287 -14168 -226 -6492 -12418 -5302
15576 -5302 -9531 -5432 -5881 5680 -2464 -19635 -20046 -3680 11915 23540 33727 21943 -4363
$$ packed form
15673C576n740L743j118J6014p745j2598q575Q501K01j4103j449R873J1096j0164
15659h488J2657J7822M53j3423k899o439j533j1796J14P899O066p163R029J3582
15645A5881J2321J0374m230J933k5218k5532j700r616j3937L116J2404J6978J3391
15632F165p252l177J4677O467k2507p761o49N497r14l962J2248P532l90J5393
15618B1367j1636j0535R161R34l071l085M037J6628m572j2425o913k679n717q65
15604i371q399Q527R284K260o895L346j1548p648J1838M42k398L860N423k295
15590c574J0517J821M657m130n024n491j0335k866k862L119J3942o266n926P116
15576e302m229M099m49J1561q144j7171m11J6366J5595J1625J0187j1784k6306
$$ plain form
15563 -4363 -18952 -13310 -7750 -6945 1756 -1416 -2974 8394 4609 -1202 -6708 -7002 -3483 6602
15549 6602 14586 -4766 -6576 5204 7289 -375 -11676 -10037 1844 9487 9135 1787 -805 -4963
15535 -4963 -8260 -10377 -12026 -1461 802 2846 4761 -9676 6106 11970 2375 7996 22661 15467
15521 15467 -224 -22194 -26256 -25527 -15400 -12153 -7633 738 1253 -579 3841 -8124 -14302 -366
15507 -366 -8881 -6454 -3046 -5563 3201 10985 8079 4862 5782 6556 13968 14296 8257 16085 32161
15492 32161 41350 34044 23324 11414 9036 14122 10950 12728 -6377 -393 4870 1595 2905 1581
15478 1581 1679 8792 5656 10189 14366 -1898 -12125 -9587 -3481 -7550 -14817 -21084 -19613 -19251 -13163
15463 -13163 -13715 -12649 -5218 1418 -4544 -2122 4968 2788 6720 -3889 -4272 3856 5860 -8036
$$ packed form
15563d363j4589N642N560Q05Q701l172j558J1368l785n811n506k94L519J0085
15549F602P984j9352j810J1780K085p664j1301J639J1881P643l52p348k592m158
15535d963l297k117j649J0565K263K044J915j4437J5782N864r595N621J4665p194
15521A5467j5691k1970m062P29J0127L247M520Q371N15j832M420j1965o178J3936
15507c66q515K427L408k517Q764P784k906l217R20P74P412L28o039P828J6076
15492C2161R189p306j0720j1910k378N086l172J778j9105N984N263l275J310j324
15478A581R8P113l136M533M177j6264j0227K538O106m069p267o267J471L62O088
15463a3163n52J066P431O636n962K422P090k180L932j0609l83Q128K004j3896
$$ plain form
15449 -8036 -5164 -7503 -9606 -4299 -2081 3113 -500 -2412 -5622 -5009 -3145 -3057 -16186 -11872 7134
15434 7134 -2015 -9192 -14616 -19098 -14779 -10358 -4522 3456 5160 6664 -995 3696 3796 7528 2707
15419 2707 -5471 -1350 1109 -1348 3000 -7602 -16207 -4190 -13510 -16559 -11257 4446 12905 11511
15405 11511 1816 8207 1201 5721 15954 11600 1205 -11060 -16654 -19393 -10292 8758 15040
15392 15040 12569 10031 4668 8354 7307 1567 -4403 -3804 2651 -1780 -11443 -21862 -12878 -9656
15378 -9656 -11547 -426 -15493 -20462 -13552 -15451 -9471 1614 8897 24833 29083 27804 29315 34101
15364 34101 14742 2842 17401 16866 2630 610 6339 2612 3335 1717 -7557 -14234 -18818 -6568
15350 -6568 -8074 -8599 -7682 -25327 -21316 -9716 588 -4050 -4806 -16120 -6075 11977 28313 24215
$$ packed form
15449h036K872k339k103N307K218N194l613j912l210O13J864Q8j3129M314J9006
15434G134r149p177n424m482M319M421N836P978J704J504p659M691J00L732m821
15419B707q178M121K459k457M348j0602q605J2017r320l049N302J5703Q459j394
15405A1511r695O391p006M520J0233m354j0395j2265n594k739R101J9050O282
15392A5040k471k538n363L686j047n740n970N99O455m431r663j0419Q984L222
15378i656j891J1121j5067m969O910j899N980J1085P283J5936M250j279J511M786
15364C4101j9359j1900J4559n35j4236k020N729l727P23j618r274o677m584J2250
15350f568j506n25R17j7645M011J1600J0304m638p56j1314J0045J8052J6336m098
$$ plain form
15336 24215 11672 5600 9061 1573 -4760 3151 -1590 -15609 -34401 -34045 -24026 -28355 -25882 -18802
15322 -18802 -13272 -6171 6308 17756 22339 8067 -8847 -6855 -2648 -2864 -640 -13873 -16716
15309 -16716 -13833 -31697 -28121 -7717 -9269 -13477 6571 13429 983 -9461 -16422 -22596 -25601
15296 -25601 -17918 -2505 -7819 -17785 -14916 -21857 -28658 -23161 -5090 -358 -4571 -8434 1604 10629
15282 10629 8632 5811 5777 -9138 -1797 6884 3844 -18479 -13719 3172 5818 -10275 -12621 -6658
15268 -6658 -6454 -7657 -14046 -10436 -5855 -112 -10454 -21873 -16036 18 11085 22734 24006 6726
15254 6726 -1960 -4197 -11311 -9956 -3903 104 8063 5747 8403 10755 11674 10861 -2105 9705 9305
15239 9305 -5080 -2656 5598 -3329 -14565 -4278 -6867 -17272 -16753 -26302 -24514 -19516 2561 13012
$$ packed form
15336B4215j2543o072L461p488o333P911m741j4019j8792L56J0019m329K473P080
15322a8802N530P101J2479J1448M583j4272j6914J992M207k16K224j3233k843
15309a6716K883j7864L576K0404j552m208K0048O858j2446j0444o961o174l005
15296b5601P683J5413n314r966K869o941o801N497J8071M732m213l863J0038R025
15282A0629j997k821l4j4915P341Q681l040k2323M760J6891K646j6093k346N963
15268f658K04j203o389L610M581N743j0342j1419N837J6054J1067J1649J272j7280
15254F726q686k237p114J355O053M007P959k316K656K352R19q13j2966J1810m00
15239I305j4385K424Q254q927j1236J0287k589j0405N19r549J788M998K2077J0451
$$ plain form
15225 13012 8366 10679 22139 12996 12340 15915 10859 2686 -4699 -8543 -5457 -4455 -6119 -3263
15211 -3263 -6211 -20071 -29428 -18989 -17894 -12436 -10227 -18358 -16168 -6552 -5438 -2136 -3559 -8746
15197 -8746 -3204 2165 11044 -95 -6734 2609 3802 6612 3841 6748 -875 -1550 -200 11077
15183 11077 18422 22654 25589 11766 940 -2092 423 2164 -911 115 6023 6750 -1087 -14906
15169 -14906 -12077 -8107 -5833 -1690 -389 -13224 -1928 12285 -1859 -10539 -1758 -490 -4828
15156 -4828 -4816 2374 21500 17805 1350 -16598 -7393 7162 -8604 -14852 -11949 -989 -5023 -23183
15142 -23183 -16031 -8619 -12364 -16476 -7167 -2647 3864 3110 103 1494 -1285 -2393 8783 2078
15128 2078 -5472 -16481 -1161 10754 15764 -5789 -5043 -1106 1603 -2403 -2206 -2562 -13841 -21439
$$ packed form
15225A3012m646K313J1460r143o56L575n056q173p385l844L086J002j664K856
15211c263k948j3860r357J0439J095N458K209q131K190R616J114L302j423n187
15197h746N542N369Q879j1139o639R343J193K810k771K907p623o75J350J1277
15183A1077P345M232K935j3823j0826l032K515J741l075J026N908P27p837j3819
15169a4906K829L970K274M143J301j2835J1296J4213j4144q680Q781J268m338
15156d828J2P190J9126l695j6455j7948R205J4555j5766o248K903J0960m034j8160
15142b3183P152P412l745m112R309M520O511p54l007J391k779j108J1176o705
15128B078p550j1009J5320J1915N010k1553P46L937K709m006J97l56j1279p598
$$ plain form
15114 -21439 -22168 -18118 -23014 -19213 -22078 -18720 -22357 -15829 -2937 -7545 -339 3578 924 -234
15100 -234 -2910 -3563 -9275 2974 10270 5269 2008 4039 15626 15972 13431 10650 10566 19630 18081
15085 18081 11937 8119 1501 -3478 4612 10251 8810 3796 -17000 -22618 -15919 -4056 -5848 -20146
15071 -20146 -26231 -12868 -64 2560 5290 4535 9441 2403 -10305 -4784 20320 20638 7814 -1885
15057 -1885 3257 4027 1991 -12288 -22226 -17917 -15639 -6110 18041 23582 13130 -695 -9318 -15468
15043 -15468 -5509 -4672 -12712 -13987 -6692 -1927 -3191 -7862 -6533 -23642 -28264 -23509 -24209 -14348 -15732
15028 -15732 -21575 -27354 -15050 7342 6724 4019 8334 -3352 -7380 -5031 -9469 -181 11409 691
15014 691 -10426 -24402 -32300 -21584 -17139 -9108 -5806 4970 -3209 -7196 9954 25123 38097
$$ packed form
15114b1439p29M050m896L801k865L358l637O528J2892m608P206L917k654j158
15100b34k676o53n712J2249P296n001l261K031J1587L46k541k781q4R064j549
15085A8081o144l818o618m979Q090N639j441n014k0796n618O699J1863j792j4298
15071b0146o085J3363J2804K624K730p55M906p038j2708N521K5104L18j2824r699
15057a885N142P70k036j4279r938M309K278R529K4151N541j0452j3825q623o150
15043a5468R959Q37q040j275P295M765j264m671J329j7109m622M755p00R861j384
15028a5732n843n779J2304K2392o18k705M315j1686m028K349m438R288J1590j0718
15014F91j1117j3976p898J0716M445Q031L302J0776q179l987J7150J5169J2974
$$ plain form
15001 38097 50011 53878 44332 57774 65093 72064 71272 55713 40773 35880 27713 5392 -19157
14988 -19157 -18447 -2963 12232 21430 24131 9284 6035 19994 16922 12837 5029 11588 8233 11284
14974 11284 18789 31485 24115 21255 19399 10921 8216 9108 11846 -1336 -11578 -6410 -4782 1169
14960 1169 11712 8813 7757 5952 1333 5662 5163 15178 16985 6189 6679 -10294 -14254 -12691
14946 -12691 -9015 1443 5800 15141 21013 20443 13334 19388 4494 7164 26776 30760 22073 5667
14932 5667 9908 25576 26457 27274 29027 9403 -13050 -17541 -4625 -6895 -1200 -1788 -6053 1041
14918 1041 11350 10067 21977 34906 22399 18722 8715 -3967 -304 -6542 -8899 -12007 -9329
14905 -9329 9737 13127 9984 15778 11989 -1865 -121 13069 17436 5894 -8258 -5012 2028
$$ packed form
15001C8097J1914L867r546J3442P319O971p92j5559j4940m893q167k2321k4549
14988a9157P10J5484J5195R198K701j4847l249J3959l072m085p808O559l355L051
14974A1284P505J2696p370k860j856q478k705Q92K738j3182j0242N168J628N951
14960A169J0543k899j056j805m619M329m99J0015J807j0796M90j6973l960J563
14946a2691L676J0458M357R341N872n70p109O054j4894K670J9612L984q687j6406
14932E667M241J5668Q81Q17J753j9624k2453m491J2916k270N695n88m265P094
14918A041J0309j283J1910J2929j2507l677j0007j2682L663o238k357l108K678
14905i329J9066L390l143N794l789j3854J744J3190M367j1542j4152L246P040
$$ plain form
14892 2028 -10361 -9551 4773 -4347 -10662 1253 6232 5055 -3559 -12114 -6956 -4364 5191 -1885
14878 -1885 -14009 -6296 2524 -2827 7867 19622 8973 4874 2841 -11959 -17547 -15636 -13679
14865 -13679 -10057 8333 19430 10266 18016 14131 -595 7698 29288 20434 -893 -5918 -1713
14852 -1713 -309 -3440 -5209 -13688 -16543 -15018 -10636 -2843 1481 -10414 -17851 -6115 -5255 -3473
14838 -3473 12316 17824 8226 1057 -527 -5275 -17904 -21373 -10054 6183 12103 -114 -5261
14825 -5261 -2754 1683 600 -2426 -6776 2107 9643 19899 24313 15689 1366 -6919 -12224 -3186
14811 -3186 8092 10220 18798 14104 6533 13447 17194 23656 21665 21743 16962 9914 3769 19137 24659
14796 24659 27479 19653 8919 8512 2035 10456 26654 23001 16961 25886 31671 34863 37906 41802
$$ packed form
14892B028j2389Q10J4324r120o315J1915M979j177q614q555N158K592R555p076
14878a885j2124P713Q820n351J0694J1755j0649m099k033j4800n588J911J957
14865a3679L622J8390J1097r164P750l885j4726Q293K1590q854k1327n025M205
14852a713J404l131j769q479k855J525M382P793M324j1895p437J1736Q60J782
14838c473J5789N508r598p169j584m748j2629l469J1319J6237N920j2217n147
14825e261K507M437j083l026m350Q883P536J0256M414q624j4323q285n305R038
14811c186J1278K128Q578m694p571O914L747O462j991P8m781p048o145J5368N522
14796B4659K820p826j0734m07o477Q421J6198l653o040Q925N785L192L043L896
$$ plain form
14782 41802 50207 35792 23024 28436 28572 8842 11699 15300 19297 11815 38 -379 8553 13126
14768 13126 9760 18039 5346 9223 17806 15394 10356 -237 4454 -9155 -24215 -30214 -11789
14755 -11789 -5928 -6820 -2532 8206 6235 1346 83 1856 4447 16362 28247 29679 24348 14212
14741 14212 8387 21955 19391 20539 6431 -268 479 -2350 7208 9776 15964 9416 -5921 -5987
14727 -5987 -10448 -18458 -21537 -12882 -9371 -12442 -2885 6373 9320 11368 5335 5191 965 -6312 -4371
14712 -4371 -10573 -13906 -10025 -6095 -6597 1849 9036 23465 23298 28501 19911 14717 7957 2243 -5086
14697 -5086 -500 10819 15061 12578 8439 -2051 -1263 -8270 -7634 1536 -1413 -4664 5664 5054 3245
14682 3245 11071 18773 16191 10896 13363 24081 12415 -3402 -8130 -8134 -12363 -3021 7928 9751
$$ packed form
14782D1802Q405j4415j2768N412J36j9730K857L601L997p482j1777m17Q932M573
14768A3126l366Q279j2693L877Q583k412n038j0593M691j3609j5060n999J8425
14755a1789N861q92M288J0738j971m889j263J773K591J1915J1885J432n331j0136
14741A4212n825J3568k564J148j4108o699P47k829R558K568O188o548j5337o6
14727e987m461q010l079Q655L511l071R557R258K947K048o033j44m226p277J941
14712d371o202l333L881L930n02Q446P187J4429j67N203q590n194o760n714p329
14697e086M586J1319M242k483m139j0490P88p007O36R170k949l251J0328o10j809
14682C245P826P702k582n295K467J0718j1666j5817m728mm229R342J0949J823
$$ plain form
14668 9751 13104 -1563 -20005 -12170 1538 -543 -2730 -6914 4729 -3084 -3287 5644 6594 2691
14654 2691 11444 12913 13690 1107 -1900 15572 19209 -8 -14031 -9036 4198 18928 21891
14641 21891 23435 28502 21117 22844 25894 21054 22407 18141 7909 -8857 -4713 3311 9508 -3308
14627 -3308 3696 9784 8587 -430 1583 -7840 -18548 -17288 -20221 -16283 -6848 1532 794 -5000 -12045
14612 -12045 -12900 -14892 -8060 -20633 -14126 -1208 6616 8740 9478 11014 1544 -8779 -11424 -4477
14598 -4477 11852 -5583 -12461 -1922 -2332 1771 -997 3039 5591 2794 15029 4068 -893 11993
14584 11993 18867 1459 -6520 4506 6139 259 1698 6971 20590 6241 -2086 -5143 -4257 -16697
14570 -16697 -14914 -16723 -17840 -14883 -13938 -10719 1836 5040 -22074 -33166 -10075 -8336 -11335 -12056
$$ packed form
14668I751L353j4667j8442P835J3708k081k187m184J1643p813k03Q931R50l903
14654B691Q753J469P77j2583l007J7472L637j9217j4023M995J3234J4730K963
14641B1891J544N067p385J727L050m840J353m266j0232j6766M144Q024O197j2816
14627c308P004O088j197r017K013r423j0708J260k933L938R435Q380p38n794p045
14612a2045q55j992O832j2573O507J2918P824K124P38J536r470j0323k645O947
14598d477J6329j7435o878J0539m10M103k768M036K552k797J2235j0961m961J2886
14584A1993O874j7408p979J1026J633n880J439N273J3619j4349q327l057Q86j2440
14570a6697J783j809j117K957R45L219J2555L204k7114j1092K3091J739k999p21
$$ plain form
14556 -12056 -3349 -5116 2884 8105 13367 8688 446 6937 -1930 -8515 4517 -3424 -17285 -454
14542 -454 7638 11276 5930 -1768 -15639 -4185 -15628 -28493 -16147 -8378 -6528 -13219 -10230 -2784
14528 -2784 1640 -1544 -487 7953 10573 4747 -8552 -2290 5781 3789 2423 -9090 -13656 -10033
14514 -10033 3314 12836 8032 3836 2073 10543 22290 18928 28112 20674 11936 4044 2820 -3291
14500 -3291 8311 7559 9767 5529 8007 -2875 -4950 -4872 12343 27494 28062 33853 36406 39946 42062
14485 42062 30546 34079 35274 19452 5050 6898 16706 12195 5247 18814 11726 17799 15539
14472 15539 11510 11234 12268 21895 29312 15684 1178 572 -1440 1474 3704 5725 -555 -10627
14458 -10627 -9151 -2212 5932 -6695 -642 11493 13603 14746 3530 5969 9714 9351 4859 1174
$$ packed form
14556a2056Q707j767Q000N221N262m679q242O491q867o585J3032p941j3861J6831
14542d54Q092L638n346p698j3871J1454j1443j2865J2346P769J850o691K989P446
14528b784M424l184J057Q440K620n826j3299O262Q071j992j366j1513m566L623
14514a0033J3347R522m804m196j763Q470J1747l362R184p438q738p892j224o111
14500c291J1602p52K208m238K478j0882k075P8J7215J5151N68N791K553L540K116
14485D2062j1516L533J195j5822j4402J848R808m511o948J3567p088O073k260
14472A5539m029k76J034R627P417j3628j4506o06k012K914K230K021o280j0072
14458a0627J476O939Q144j2627O053J2135K110J143j1216K439L745l63m492l685
$$ plain form
14444 1174 11170 671 -17715 -13471 -18207 -16874 -5793 5584 29073 38467 40884 27911 2035
14431 2035 -1145 -288 -9120 -10568 -3842 -8192 -14552 10146 26697 25614 21485 15991 3411 -1623
14417 -1623 -354 -10077 -16883 -11546 -13244 -6184 -327 6208 15661 3296 4485 -1987 1238 768 8397
14402 8397 2857 1580 11918 9087 6285 7630 7533 2487 -13331 -14699 -1175 18745 35926 31352
14388 31352 37141 27209 14327 982 -8520 -13643 -3877 10432 24355 23093 19258 33889 27076
14375 27076 19263 11519 13982 12387 15501 11289 8958 4110 624 6196 -2080 -10021 312 -5960
14361 -5960 -14828 -4329 -1179 -16769 -23433 -12826 -114 15317 27566 27253 18095 9291 3488
14348 3488 9607 15163 8373 5363 18082 12217 -673 1121 9143 3262 -3272 -10305 -16593 -19571
$$ packed form
14444A174R996j0499j8386M244m736J333J1081J1377K3489R394K417j2973k5876
14431B035l180Q57q832j448O726m350o360K4698J6551j083m129n494j2580n034
14417a623J269r723o806N337j698P060N857O535R453j2365J189o472L225m70P629
14402H397n540j277J0338k831k802J345r7n046j5818j368J3524J9920J7181m574
14388C1352N789r932j2882j3345r502n123R766J4309J3923j262l835J4631o813
14375B7076p813p744K463j595L114m212k331m848l486N572q276p941J0333o272
14361e960q868J0499L150j5590o664J0607J2712J5431J2249l13r158q804n803
14348C488O119N556o790l010J2719n865j2890J794Q022n881o534p033o288k978
$$ plain form
14334 -19571 -14209 -8546 2904 8739 6705 9518 17754 22551 15930 8783 -391 -6121 3002 14664
14320 14664 7040 10904 28897 34412 19212 10376 17351 4861 3884 7937 7827 -3308 169 11969
14306 11969 5538 -2019 3717 15449 20157 24949 15749 7170 8165 -3204 -11981 -9315 -19574 -6845
14292 -6845 -7089 -9796 -13328 -14774 -4510 4221 5823 -4332 -4554 -15069 -7881 5303 -7720 -9819
14278 -9819 -10487 -1152 8241 11289 24853 29908 15921 25992 24189 14296 28325 27167 23797 33440
14264 33440 31079 28762 33481 33532 50546 55569 63397 79926 99690 137168 187724 246144 329765
14251 329765 441900 569339 680570 762465 792757 768353 697561 589083 469778 370421
14241 370421 275960 209847 166566 127585 99153 82404 58912 61014 62830 59869 63866 58957
$$ packed form
14334a9571N362N663J1450N835k034K813Q236M797o621p147r174n730R123J1662
14320A4664p624L864J7993N515j5200q836O975j2490r77M053j10j1135L477J1800
14306A1969o431p557N736J1732M708M792r200q579R95j1369q777K666j0259J2729
14292f845k44k707l532j446J0264Q731J602j0155k22j0515P188J3184j3023k099
14278i819o68R335R393L048J3564N055j3987J0071j803r893J4029j158l370R643
14264C3440k361k317M719N1J7014N023P828J6529J9764L7478N0556N8420Q3621
14251C29765J12135J27439J11231Q1895L0292k4404p0792j08478j19305r9357
14241C70421r4461o6113m3281l8981k8432j6749k3492K102J816k961L997m909
$$ plain form
14229 58957 46433 40478 44563 33950 25350 17825 13168 16843 18090 14114 -1114 -5398 3067 10213
14215 10213 16220 13134 21528 28329 19924 17133 9223 10779 11790 2008 4153 238 6931 9844
14201 9844 15520 25628 25471 20826 15558 15128 26188 19713 32964 46747 72020 91870 116434
14188 116434 125436 133052 147578 147434 147222 130379 101151 90526 90466 87231 74999 69188 63458 66574
14174 66574 62180 51330 33353 36497 37295 31733 36945 30189 30166 25025 19902 12322 20607 37546
14160 37546 43690 50165 42721 53970 78032 84233 90574 106570 98975 96800 115849 126967 121527
14147 121527 114085 115153 112176 97638 81315 56819 46448 45375 47021 47966 36168 12530 15144
14134 15144 7682 -1448 654 10383 8729 16329 18746 18873 22546 24209 13440 4539 6908 4138
$$ packed form
14229E8957j2524n955M085j0613q600p525m657L675J247l976j5228m284Q465P146
14215A0213O007l086Q394O801q405k791p910J556J011r782K145l915O693K913
14201I844N676J0108j57m645n268m30J1060o475J3251J3783K5273J9850K4564
14188A16434R002P616J4526j44k12j6843k9228j0625o0l235j2232n811n730L116
14174F6574m394j0850j7977L144P98n562N212o756k3n141n123p580Q285J6939
14160C7546O144O475p444J1249K4062O201O341J5996p595k175J9049J1118n440
14147A21527p442J068k977j4538j6323k4496j0371j073J646R45j1798k3638K614
14134A5144p462r130K102R729j654P600K417J27L673J663j0769q901K369k770
$$ plain form
14120 4138 7546 12581 1019 -12117 4405 20145 32186 28334 25519 39725 30769 16107 8654
14107 8654 -4936 -22320 -22616 -19969 -13306 -7158 -3621 2532 18459 27456 45003 47079 38673 31320
14093 31320 40926 40603 42366 43878 56696 48196 30629 27694 22346 13765 22769 24180 26817 15683
14079 15683 -10902 -9027 995 10734 7426 8736 13425 18712 23194 32328 37094 31409 28443 36975
14065 36975 35883 18714 15960 33931 35284 32220 34719 17054 12557 14977 22266 21244 26080 38577
14051 38577 43343 29324 22557 21126 29340 37605 42340 39868 45201 43654 48905 59294 49874 41965
14037 41965 46241 43482 43098 43520 39986 38663 50065 52518 60627 65136 68283 62509 74740 85950
14023 85950 102014 128243 134197 142400 161726 168029 175713 177065 184859 183785 170810 167627 168940
$$ packed form
14120D138L408N035j1562j3136J6522J5740J2041l852k815J4206q956j4662p453
14107H654j3590j7384k96K647O663O148L537O153J5927Q997J7547K076q406p353
14093C1320R606l23J763J512J2818q500j7567k935n348q581R004J411K637j1134
14079A5683k6585J875J0022R739l308J310M689N287M482R134M766n685k966Q532
14065C6975j092j7169k754J7971J353l064K499j7665m497K420P289j022M836J2497
14051C8577M766j4019o767j431Q214Q265M735k472N333j547N251J0389r420p909
14037D1965M276k759l84M22l534j323J1402K453Q109M509L147n774J2231J1210
14023H5950J6064K6229N954Q203J9326O303P684J352P794j074j2975l183J313
$$ plain form
14010 168940 144548 116135 84611 79259 76500 65755 68037 72021 77104 68103 67365 65553 58325
13997 58325 63882 64927 61480 42978 41707 44414 52420 61280 60281 63674 66062 63407 62756 58972 60611
13982 60611 63699 74233 81547 87374 93362 92402 87865 95331 110227 124768 129898 119121 107577
13969 107577 95461 89806 78238 82303 79267 70801 79235 100443 119221 116702 123023 127978 119551
13956 119551 103259 87997 80707 60545 46298 22245 11277 21027 32845 21278 16997 17589
13944 17589 9490 5689 20632 14865 21308 32917 40186 41663 31804 10557 4935 22108 29721
13931 29721 27875 17938 18267 6364 11335 13329 12034 7961 9004 9519 9175 8387 17282 24590 16443
13916 16443 16240 15115 15740 19455 14550 8898 29057 29542 16863 -4271 -8145 -11121 -7945 -3092
$$ packed form
14010A68940k4392k8413l1524n352k759j0745K282L984N083r001p38j812p228
13997E8325N557J045l447j8502j271K707Q006Q860r99L393K388k655o51l784J639
13982F0611L088J0534P314N827N988r60m537P466J4896J4541N130j0777j1544
13969A07577j2116n655j1568M065l036q466Q434K1208J8778k519O321M955q427
13956A19551j6292j5262p290k0162j4247k4053j0968R750J1818j1567m281N92
13944A7589q099l801J4943n767O443J1609P269J477r859k1247n622J7173P613
13931B9721j846r937L29j1903M971J994j295m073J043N15l44p88Q895P308q147
13916A6443k03j125O25L715m905n652K0159M85j2679k1134l874k976L176M853
$$ plain form
13902 -3092 20493 32368 20818 7678 -17655 -47975 -85698 -113571 -167113 -205062 -224330 -206052
13890 -206052 -169251 -130992 -93978 -40602 74 14256 21072 39832 40608 37420 38934 45107 62157
13877 62157 76471 81895 104286 115621 102250 103708 110200 118231 125595 105249 102134 107552 122816
13864 122816 126180 139915 123371 118530 118335 116817 122798 137378 119545 119764 120114 131241 140686 142373
13850 142373 146112 145130 156398 166904 158817 155691 158793 158708 160650 155131 170905 181869 182714 197554
13836 197554 198218 215958 224766 214930 207068 209090 224625 233845 244998 245412 255680 268288 275678
13823 275678 288272 308762 315324 329907 346064 351758 356411 366220 383191 390774 384728 392279 405668
13810 405668 427351 457523 481682 507889 524500 542603 579532 630736 679135 721449 774725
$$ packed form
13902c092K3585J1875j1550j3140k5333l0320l7723k7873n3542l7949j9268J8278
13890b06052L6801L8259L7014N3376M0676J4182O816J8760P76l188J514O173J7050
13877F2157J4314N424K2391J1335j3371J458O492Q031P364k0346l115N418J5264
13864A22816L364J3735j6544m841j95j518N981J4580j7833K19L50J1127R445J687
13850A42373L739r82J1268J0506q087l126L102q5J942n519J5774J0964Q45J4840
13836A97554O64J7740Q808r836p862K022J5535R220J1153M14J0268J2608P390
13823B75678J2594K0490O562J4583J6157N694M653R809J6971P583o046P551J3389
13810D05668K1683L0172K4159K6207J6611J8103L6929N1204M8399M2314N3276
$$ plain form
13799 774725 839219 913647 979285 1043708 1113095 1191587 1286584 1414091 1576553 1787434 2049885
13788 2049885 2385364 2806079 3296318 3832410 4393418 4968793 5545380 6133261 6801743
13779 6801743 7633684 8735502 10317412 12681959 16375209 22383050 32048027 46661766
13771 46661766 66647262 90823001 115929029 137602596 151235160 153865439 144960384
13764 144960384 126727492 103316798 79067175 57738798 41121742 29401591 21682795
13757 21682795 16682675 13374363 11121804 9544577 8400090 7517109 6793669 6129695
13749 6129695 5486972 4858700 4231819 3652442 3134156 2694030 2337928 2069597 1872388
13740 1872388 1713353 1570966 1454722 1350590 1253227 1164675 1090790 1017873 955010 931358
$$ packed form
13799G74725O4494P4428O5638O4423O9387P8492R4997J27507J62462K10881K62451
13788B049885L35479M20715M90239N36092N61008N75375N76587N87881O68482
13779F801743Q31941J101818J581910K364547L693250O007841R664977J4613739
13771D6661766J9985496K4175739K5106028K1673567J3632564K630279q905055
13764A44960384j8232892k3410694k4249623k1328377j6617056j1720151p718796
13757B1682795n000120l308312k252559j577227j144487q82981p23440o63974
13749F129695o42723o28272o26881n79377n18286m40126l56102k68331j97209
13740A872388j59035j42387j16244j04132r7363q8552p3885p2917o2863k3652
$$ plain form
13730 931358 908125 875568 862320 879667 916344 928233 914312 866240 791821 718583 663534
13719 663534 598414 552179 511823 463982 432586 412058 380848 366820 353642 328764 324917 328236
13707 328236 310371 292915 306906 311195 301858 281811 254048 220869 209393 210023 203193 187374
13695 187374 180572 184180 182683 190771 193083 186475 191512 185070 159244 145595 133534 117941 95450
13682 95450 105941 110788 113631 118931 133546 134643 135026 137323 124619 103702 102954 114745 112396 100980
13668 100980 90403 81712 74755 81406 72558 64009 59426 51143 50662 59943 61056 65074 60979 54842
13654 54842 58951 54468 49865 52915 50385 54219 65444 78942 113142 145847 182933 231189 281412
13641 281412 324672 337649 352447 344578 320806 283335 248309 212095 190285 175496 166989 151515
$$ packed form
13730I31358k3233l2557j3248J7347L6677J1889j3921m8072p4419p3238n5049
13719F63534o5120m6235m0356m7841l1396k0528l1210j4028j3178k4878l847L319
13707C28236j7865j7456J3991M289r337k0047k7763l3179j1476O30o830j5819
13695A87374o802L608j497Q088K312o608N037o442k5826j3649j2061j5593k2491
13682I5450J0491M847K843N300J4615J097L83K297j2704k0917p48J1791k349j1416
13668A00980j0577q691o957O651q848q549m583q283m81R281J113M018m095o137
13654E4842M109m483m603L050k530L834J1225J3498L4200L2705L7086M8256N0223
13641B81412M3260J2977J4798p869k3772l7471l5026l6214k1810j4789q507j5474
$$ plain form
13629 151515 137506 133935 137595 130945 130047 126141 109057 92643 94098 91486 98630 90448 86076 99381
13615 99381 105278 111495 97040 97992 97235 97996 101399 88434 72986 71316 77635 69946 56732 68659
13601 68659 76347 78401 82133 57664 46898 52957 51407 52479 55169 58606 56627 66286 62145 58136
13587 58136 52320 38380 38156 26188 25108 28114 37019 27894 5800 -5560 -24191 -31709 -6067
13574 -6067 -8433 -12057 -17902 -11586 811 19482 30390 34984 41606 35135 28050 31016 42695 42299
13560 42299 41325 50003 55018 41534 35642 33402 36583 23838 11225 80 -8997 9416 11555
13547 11555 11544 17411 9711 8131 18135 24221 19152 16503 16379 23649 23671 19666 13523 5642 12859
13532 12859 6376 10891 15381 25427 32001 47533 59899 59801 42137 29648 23196 26582 27590 28811
$$ packed form
13629A51515j4009l571L660o650q98l906j7084j6414J455k612P144q182m372J3305
13615I9381N897O217j4455R52p57P61L403j2965j5448j670O319p689j3214J1927
13601F8659P688K054L732k4469j0766O059j550J072K690L437j979R659m141m009
13587E8136n816j3940k24j1968j080L006Q905r125k2094j1360j8631p518K5642
13574f067k366l624n845O316J2397J8671J0908M594O622o471p085K966J1679l96
13560D2299r74Q678N015j3484n892k240L181j2745j2613j1145r077J8413K139
13547A1555j1N867p700j580J0004O086n069k649j24P270K2m005o143p881P217
13532A2859o483M515M490J0046O574J5532J2366r8j7664j2489o452L386J008J221
$$ plain form
13518 28811 40166 45462 54931 50785 47948 45084 47083 49605 46993 30655 21827 16487 22175 28599
13504 28599 16009 23296 25329 19267 14930 19722 7493 12108 5282 14317 24912 25456 23075 7322
13490 7322 -19179 -28089 -24888 -14287 -4317 -11106 -18244 -19881 -13062 -6439 -6076 5935 -9340 -23007
13476 -23007 -23642 -17491 -10183 -15895 -7089 1883 1062 1010 5584 13936 5780 767 7733 14481 16629
13461 16629 26618 20920 10689 8477 2503 -11191 -16896 -26468 -31897 -11076 -6417 -29447 -41983
13448 -41983 -43825 -31397 -17093 -13172 -11301 -16256 -22411 -3247 -1590 -7419 1815 8164 4067 16970
13434 16970 25042 26856 27777 46565 52415 42763 31796 14441 3475 2492 10454 12158 -1497 -6556
13420 -6556 -4595 -9555 -13812 3890 10265 9033 15403 5961 -2674 -3320 2113 8516 2152 -6230 -11885
$$ packed form
13518B8811J1355N296R469m146k837k864J999K522k612j6338q828n340N688O424
13504B8599j2590P287K033o062m337M792j2229M615o826R035J0595N44k381j5753
13490G322k6501q910L201J0601R970o789p138j637O819O623L63J2011j5275j3667
13476b3007o35O151P308n712Q806Q972q21n2M574Q352q156n013O966O748K148
13461A6629R989n698j0231k212n974j3694n705r572n429K0821M659k3030j2536
13448d1983j842J2428J4304L921J871m955o155J9164J657n829R234O349m097J2903
13434A6970Q072J814R21J8788N850r652j0967j7355j0966r83P962J704j3655n059
13420f556J961m960m257J7702O375j232O370r442q635o46N433O403o364q382n655
$$ plain form
13405 -11885 -3658 15892 8957 -4374 -12356 -8783 -5066 -18759 -15248 4339 20391 9892 573
13392 573 6978 7158 6810 14592 30274 22799 -5544 -11686 -15779 -2903 -3327 -15913 -20237 -23386 -22594
13377 -22594 -21584 -22307 -19022 -14623 -32835 -27339 -14582 4212 5181 12996 11914 16122 29554 49006
13363 49006 42473 20404 3347 8851 7241 -2596 -22306 -15884 -8797 -14165 -15076 -6119 12022 17194
13349 17194 26605 24374 18192 2301 -314 5129 4968 -13226 -17867 -14112 -2439 19611 11398 10114
13335 10114 15649 6787 -6630 2295 23590 30128 25415 32467 26807 14396 7649 7478 325 -2080
13321 -2080 -8040 -4405 2099 5336 6491 12262 6537 -6283 -4319 1756 -542 1631 1545 -7278 -12591
13306 -12591 -1913 2621 -592 -9499 -7113 2607 10239 20003 32105 27229 13812 11159 17391 27942
$$ packed form
13405a1885Q227J9550o935j3331p982L573L717j3693L511J9587J6052j0499r319
13392E73O405J80l48P782J5682p475k8343o142m093J2876m24j2586m324l149P92
13377b2594J010p23L285M399j8212N496J2757J8794R69P815j082M208J3432J9452
13363D9006o533k2069j7057N504j610r837j9710O422P087n368r11Q957J8141N172
13349A7194R411k231o182j5891k615N443j61j8194m641L755J1673K2050q213j284
13335A0114N535q862j3417Q925K1295O538m713P052n660j2411o747j71p153k405
13321b080n960L635O504L237J155N771n725j2820J964O075k298K173q6q823n313
13306a2591J0678M534l213q907K386R720P632R764J2102m876j3417k653O232J0551
$$ plain form
13292 27942 32796 40558 54771 67327 88971 99282 123937 186043 283091 397695 512499 641263
13280 641263 746720 813235 821496 767933 666886 527147 410525 310460 220152 166582 135192
13269 135192 115264 96060 78867 60907 42527 33023 17967 16070 22708 15632 18500 23108 2280
13256 2280 -8734 15274 22586 10145 3682 9028 10017 4183 16502 21304 27785 26974 19902 6021
13242 6021 3889 4952 14548 15747 2668 -19393 -15520 7269 9907 14945 6467 -4090 -7008 -19626
13228 -19626 -24220 -15341 9452 6473 -335 -5970 11604 13520 2174 -12387 -14365 -11623 -10540
13215 -10540 -8124 -3983 31 13271 13636 13715 17261 25392 27535 15674 -4059 -12211 -1428 -1819
13201 -1819 14299 25183 40146 43515 31180 20661 11795 -4036 -4216 633 -17145 -33502 -32506
$$ packed form
13292B7942M854P762J4213J2556K1644J0311K4655O2106R7048J14604J14804J28764
13280F41263J05457O6515Q261n3563j01047j39739j16622j00065r0308n3570l1390
13269A35192j9928j9204j7193j7960j8380r504j5056j897O638p076K868M608k0828
13256B280j1014K4008P312j2441o463N346R89n834J2319M802O481q11p072j3881
13242F021k132J063R596J199j3079k2061L873K2789K638N038q478j0557k918j2618
13228a9626m594Q879K4793k979o808n635J7574J916j1346j4561j978K742J083
13215a0540K416M141M014J3240L65P9L546Q131K143j1861j9733q152J0783l91
13201a819J6118J0884J4963L369j2335j0519q866j5831j80M849j7778j6357R96
$$ plain form
13188 -32506 -20143 -1874 13709 26575 17690 2548 -14257 -13141 -19098 -10947 -10488 -9162 -7848
13175 -7848 -3990 -11926 -10730 -1918 -5400 2201 8947 26535 22632 28972 20466 2950 -1219 10100
13161 10100 12742 718 -18785 -16687 -9258 -6600 -8169 -6875 12260 15316 11505 16829 18645 18324
13147 18324 25196 12345 2545 10308 17164 9045 -2692 9574 1960 -4456 1424 -366 -1504 6723
13133 6723 9174 -3458 7636 2211 74 6345 -5395 -14329 -23442 -14553 -17858 -8882 4509 436
13119 436 -14925 -21057 -19384 -1072 23665 27785 18233 3989 -6984 -14154 -3185 19038 21367
13106 21367 13944 12989 18968 10789 5147 -14791 -18805 -15038 -8768 -3499 -9165 -6719 -12129 -3615
13092 -3615 -27 7457 8319 -148 2758 6135 8067 12406 26159 15841 7520 17198 30382 22676
$$ packed form
13188c2506J2363J8269J5583J2866q885j5142j6805J116n957Q151M59J326J314
13175g848L858p936J196Q812l482P601O746J7588l903O340q506j7516m169J1319
13161A0100K642j2024j9503K098P429K658j569J294J9135L056l811N324J816l21
13147A8324O872j2851r800P763O856q119j1737J2266p614o416N880j790j138Q227
13133F723K451j2632J1094n425k137O271j1740q934r113Q889l305Q976J3391m073
13119D36j5361o132J673J8312K4737M120r552j4244j0973p170J0969K2223K329
13106B1367p423r55N979q179n642j9938m014L767O270N269n666K446n410Q514
13092c615L588P484Q62q467K906L377J932M339J3753j0318q321R678J3184p706
$$ plain form
13078 22676 4710 -6669 1265 -835 -8848 -25076 -15486 -11800 -17593 -11231 -8740 -25157 -43612
13065 -43612 -41402 -41938 -34083 -20408 -25129 -38449 -37055 -37769 -28908 -31799 -33401 -33092 -27452 -27323 -26517
13050 -26517 -16458 -6398 453 -159 744 13302 22613 31140 11017 4513 6003 15991 28860 35053
13036 35053 24212 2603 -7303 655 -5981 -3689 12703 35605 32827 26130 19484 17657 22089
13023 22089 15956 9387 5011 9238 22100 29818 16371 14758 8504 -5696 -3927 9949 9189 14557
13009 14557 10829 11134 -5005 -17858 1609 16058 6256 286 8108 12988 16881 20127 5343
12996 5343 -3042 9237 20186 27050 23597 12240 10122 3129 -2347 -7723 -7463 -7977 -2074 9885
12982 9885 12454 -1755 -13287 -7558 -1037 -4605 -11321 -16010 -17781 -4686 5726 -579 8518 -6185
$$ packed form
13078B2676j7966j1379P934k100q013j6228R590L686n793O362K491j6417j8455
13065d3612K210n36P855J3675m721j3320J394p14Q861k891j602L09N640J29Q06
13050b6517J0059J0060O851o12R03J2558R311Q527k0123o504J490R988J2869O193
13036C5053j0841k1609r906P958o636K292J6392K2902k778o697o646j827M432
13023B2089o133o569m376M227J2862P718j3447j613o254j4200J769J3876p60N368
13009A4557l728L05j6139j2853J9467J4449r802n970P822M880L893L246j4784
12996E343q385J2279J0949O864l453j1357k118o993n476n376K60n14N903J1959
12982I885K569j4209j1532N729O521l568o716m689j771J3095J0412o305R097j4703
$$ plain form
12968 -6185 -15867 -23150 -10526 -8897 -12213 -16707 -3801 10196 16029 9072 -6152 -7963 -908 2227
12954 2227 2601 10117 14015 7834 -1538 -11157 -7627 4880 3110 -1643 -21986 -28647 -13753 -5514
12940 -5514 -21756 -16934 -8644 -3712 -9494 -28686 -22781 5078 9133 4643 439 4344 -1966 -3918
12926 -3918 -1996 -3119 -5740 -7263 1236 -4093 -6599 -16498 -22530 -15729 -6816 -3068 -5146 -4617 -10540
12911 -10540 -14301 -16750 -7125 -6007 2412 2721 7861 1288 -14213 -15884 -2294 1936 2441 5251
12897 5251 -3757 -1648 -1601 -5730 3005 14354 7149 1407 3508 4808 -595 -4555 -1249 -3507 -14738
12882 -14738 -6027 -8800 -12812 -4492 8809 8180 -1979 -11185 -25942 -29914 -26722 -12541 -7675 678
12868 678 -4162 12544 10529 11901 10683 7035 11644 15937 22321 27660 13869 10347 6177 6562 14751
$$ packed form
12968f185r682p283J2624J629l316m494J2906J3997N833o957j5224j811P055L135
12954B227L74P516L898o181r372r619L530J2507j770m753k0343o661J4894Q239
12940e514j6242M822Q290M932n782j9192N905K7859M055m490m204L905o310j952
12926c918J922j123k621j523Q499n329k506r899o032O801Q913L748k078N29n923
12911a0540l761k449R625J118Q419L09N140o573j5501j671J3590M230N05K810
12897E251r008K109M7m129Q735J1349p205n742K101J300n403l960L306k258j1231
12882a4738Q711k773m012Q320J3301o29j0159r206j4757l972L192J4181M866Q353
12868F78m840J6706k015J372j218l648M609M293O384N339j3791l522m170L85Q189
$$ plain form
12853 14751 10912 -2767 -7536 -21928 -13725 -5794 -1764 3746 8204 1415 4952 27475 33430 32066
12839 32066 3729 -30380 -33324 -31303 -13664 -11728 -11518 -11639 -14493 -18344 -22568 -15460 -7324 -3036
12825 -3036 5656 3479 -3477 -3759 -658 2464 2595 -7884 -15094 -1714 2679 8169 10372 12109 9971
12810 9971 10519 7001 21871 20331 2907 7151 3228 -4480 -15620 -6250 -1151 6048 17486 14149
12796 14149 9160 12945 19331 861 -1828 2205 -11830 -19900 -12496 -23623 -23145 -16786 -15592 -3345
12782 -3345 4471 10122 8576 17026 19939 24025 8017 3592 -5311 -4280 -6403 -8573 -16730 -21888
12768 -21888 -11074 -6715 -138 10242 19161 10247 3395 3426 2246 1497 -12070 -12931 -4703 5003 7653
12753 7653 4226 15256 21493 12311 16003 6005 -11384 -10534 -11312 -6787 -10548 -15054 -11319 -8526 -10762
$$ packed form
12853A4751l839j3679m769j4392Q203P931M030N510M458o789L537K2523N955j364
12839C2066k8337l4109k944K021J7639J936K10j21k854l851m224P108Q136M288
12825c036Q692k177o956k82L101L122J31j0479p210J3380M393N490K203J737k138
12810I971N48l518J4870j540j7424M244l923p708j1140R370N099P199J1438l337
12796A4149m989L785O386j8470k689M033j4035q070P404j1127M78O359J194J2247
12782c345P816N651j546Q450K913M086j6008m425q903J031k123k170q157n158
12768b1888J0814M359O577J0380Q919q914o852L1j180p49j3567q61Q228R706K650
12753G653l427J1030O237r182L692r998j7389Q50p78M525l761m506L735K793k236
$$ plain form
12738 -10762 -18820 -16718 -14710 -5754 -18154 -40251 -52978 -42353 -33598 -27123 -26883 -17384 -22955 -17298
12724 -17298 -18407 -31579 -37650 -10734 9659 13708 131 -8291 -13960 -4306 -1011 5239 1002
12711 1002 1037 1050 -196 -5899 -3684 -4661 -14441 -29558 -31161 -20838 -18291 5911 28800 10036 -14894
12696 -14894 3304 5127 2591 -9637 -3836 -1033 4521 2944 -7393 -20655 -25059 -15329 -4072
12683 -4072 -565 -5035 -9738 -9341 -24444 -17026 -4507 4783 9273 11807 11250 3219 -6296 1507 1578
12668 1578 -4128 -293 2417 15992 21113 17905 7111 -1912 -12437 -9126 -625 13981 12260 -1506
12654 -1506 -10460 -16751 -7498 -103 7032 -5007 -13543 -12607 -10165 -9801 -9058 1080 15160 16749 12335
12639 12335 8817 6165 6392 -7012 -8434 -11954 -13996 -17643 -17437 -10883 -8526 -18705 -20628 -21659
$$ packed form
12738a0762q058K102K008Q956j2400k2097j2727J0625Q755O475K40R499n571N657
12724a7298j109j3172o071K6916K0393M049j3577q422n669R654L295O250m237
12711A002L5J3j246n703K215r77r780j5117j603J0323K547K4202K2889j8764k4930
12696a4894J8198J823k536j2228N801K803N554j577j0337j3262m404R730J1257
12683d072L507m470m703L97j5103P418J2519R290M490K534n57q031r515P803P1
12668A578n706L835K710J3575N121l208j0794r023j0525L311Q501J4606j721j3766
12654a506q954o291R253P395P135j2039q536R36K442L64P43J0138J4080J589m414
12639A2335l518k652K27j3404j422l520k042l647K06O554K357j0179j923j031
$$ plain form
12625 -21659 -20981 -20591 -25344 -15883 -12884 -18161 -16639 -6169 -9258 6211 8173 -1552 -3260 20802
12611 20802 41342 30929 5594 -2052 -4101 5792 9733 -590 -13873 -16834 -5336 8900 2881
12598 2881 -589 -4781 1447 8707 13298 22107 25041 14128 -5107 -8315 -9890 -20394 -25372 -19171
12584 -19171 -9930 -2956 2004 10256 21116 27899 24138 14547 1752 3283 23483 19131 1392
12571 1392 381 -11750 -12927 -2271 5991 5532 13440 18401 12734 25256 26546 25140 23230 19380
12557 19380 29961 21135 10387 22087 28331 17106 14544 21480 15320 4574 -6985 -19866 -12584
12544 -12584 -2560 6571 21483 21818 22945 36436 41717 30228 18382 38950 58419 62986 49744
12531 49744 39280 34536 16953 -1179 13826 33998 37767 30762 14098 15260 24146 23689 8563
$$ packed form
12625b1659O78L90m753R461K999n277J522J0470l089J5469J962r725j708K4062
12611B0802K0540j0413k5335p646k049R893L941j0323j3283k961J1498J4236o019
12598B881l470m192O228P260M591Q809K934j0913j9235l208j575j0504m978O201
12584a9171R241O974M960Q252J0860O783l761r591j2795J531K0200m352j7739
12571A392j011j2131j177J0656Q262m59P908M961n667J2522J290j406j910l850
12557A9380J0581q826j0748J1700O244j1225k562O936o160j0746j1559j2881P282
12544a2584J0024R131J4912L35J127J3491N281j1489j1846K0568J9469M567j3242
12531D9744j0464m744j7583j8132J5005K0172L769p005j6664J162Q886m57j5126
$$ plain form
12518 8563 6511 18179 20806 27360 43294 34751 24073 25137 21539 21584 30509 36986 41908 41374 35721
12503 35721 20189 7823 6076 19660 29373 33744 17124 7348 21247 18362 23111 22661 11685
12490 11685 -1213 1218 7999 14151 33172 30862 11763 -526 7133 7516 9847 16678 24502 29414
12476 29414 15759 4744 338 4153 8599 23497 27675 28013 26122 29002 36953 33525 30340 20269
12462 20269 27161 36693 39603 44989 39458 35844 16954 5932 -181 -11725 -31230 -19108 -10722
12449 -10722 1775 3626 -6300 -6653 4104 18501 22475 13036 1287 -3678 -4549 -7062 -2507 -6613
12435 -6613 -10728 -12859 -9092 400 14499 14007 24334 20521 18429 12319 13897 861 4394 18245
12421 18245 18366 12522 18678 26067 25612 22413 3042 -12533 -19004 -23873 -17977 -5408 3303 20948
$$ packed form
12518H563k052J1668K627O554J5934q543j0678J064l598M5Q925O477M922n34n653
12503C5721j5532j2366j747J3584R713M371j6620r776J3899k885M749m50j0976
12490A1685j2898K431O781O152J9021k310j9099j2289P659L83K331O831P824M912
12476B9414j3655j1015m406L815M446J4898M178L38j891K880P951l428l185j0071
12462B0269O892R532K910N386n531l614j8890j1022o113j1544j9505J2122Q386
12449a0722J2497J851r926l53J0757J4397L974r439j1749m965q71k513M555m106
12435f613m115k131L767R492J4099m92J0327l813k092o110J578j3036L533J3851
12421A8245J21n844O156P389m55l199j9371j5575o471m869N896J2569Q711J7645
$$ plain form
12407 20948 17329 3115 -14869 -10964 -15547 -5755 2401 3635 4657 9166 4946 869 -8978 -8495
12393 -8495 -17050 -11476 12684 32014 24411 19829 20128 13304 6869 11363 8549 7447 -4693 -4646 16782
12378 16782 17975 19019 18613 21614 10855 -9768 -20954 -1701 6145 -2567 -7808 4513 13452
12365 13452 3859 77 3923 -9270 -9407 2173 8226 4604 5120 1235 -6289 -10882 -19283 -17654
12351 -17654 8955 18966 -1073 -21237 -21588 -25933 -27302 -24877 -20914 -14477 1969 3687 -7763
12338 -7763 3257 -4237 -14671 -10608 -6033 -8644 -11402 -13747 -10219 -13506 -9368 2023 -6372 -17816
12324 -17816 -13793 -17442 4295 17424 6666 10168 7396 5735 6135 7440 427 -3359 960 6309
12310 6309 11476 7586 -576 -1877 -3602 -5128 108 -3624 5003 8018 6135 -480 -5184 -2622 1405
$$ packed form
12407B0948l619j4214j7984L905m583R792Q156J234J022M509m220m077r847M83
12393h495q555N574K4160J9330p603m582K99o824o435M494k814j102j2140M7K1428
12378A6782J193J044m06L001j0759k0623j1186J9253P846q712n241J2321Q939
12365A3452r593l782L846j3193j37J1580O053l622N16l885p524m593q401J629
12351a7654K6609J0011k0039k0164l51m345j369K425L963O437J6446J718j1450
12338g763J1020p494j0434M063M575k611k758k345L528l287M138J1391q395j1444
12324a7816M023l649K1737J3129j0758L502k772j661M00J305p013l786M319N349
12310F309N167l890q162j301j725j526N236l732Q627L015j883o615m704K562M027
$$ plain form
12295 1405 10059 30386 19230 20892 10467 8914 3550 -8274 4095 26371 30379 30492 20226
12282 20226 14226 -5135 -397 1795 6082 815 -8435 -4566 -12650 4393 6444 -7558 -13157 -16078
12268 -16078 -15751 -19591 -7619 -1955 -1304 -16479 -29627 -27858 -9421 -7938 -12735 4838 19019
12255 19019 21657 12800 -450 7784 13750 27252 21606 22675 25258 17370 693 -14215 -14662 -1817
12241 -1817 7190 16190 22516 19238 13848 17566 9910 18753 12392 -1348 -5737 -4397 1098 -6435
12227 -6435 -7851 -12510 -5609 -6963 -11204 -23664 -33244 -36577 -25633 -9423 -9952 -4619 3780 7403
12213 7403 3757 3092 21454 15489 26327 18003 -5000 -13732 -11414 382 -5862 11686 22134
12200 22134 26468 19184 14608 12790 14093 8478 2232 11133 22556 37273 29381 35387 40459 52193
$$ packed form
12295A405Q654K0327j1156J662j0425j553n364j1824J2369K2276M008J13j0266
12282B0226o000j9361M738K192M287n267r250L869q084J7043K051j4002n599k921
12268a6078L27l840J1972N664O51j5175j3148J769J8437J483m797J7573J4181
12255A9019K638q857j3250Q234N966J3502n646J069K583p888j6677j4908m47J2845
12241a817R007R000O326l278n390L718p656Q843o361j3740m389J340N495p533
12227f435j416m659O901j354m241j2460r580l333J0944J6210n29N333Q399L623
12213G403l646o65J8362n965J0838q324k3003q732K318J1796o244J7548J0448
12200B2134M334p284m576j818J303n615o246Q901J1423J4717p892O006N072J1734
$$ plain form
12186 52193 83344 100523 134358 193895 293636 421358 528875 560512 491222 374091 252953
12175 252953 171690 120274 97666 72662 61148 63648 47416 41349 34074 28349 36944 32076 26402
12162 26402 11994 1052 22646 35883 18026 13342 19765 24260 27018 35260 40660 31591 25110
12149 25110 36847 50960 67272 81575 106946 129051 141010 169781 221518 303347 450492
12138 450492 703414 1082545 1501162 1738908 1619053 1236510 840916 567780 392290 281041
12128 281041 204676 154476 126306 109079 94678 75793 57684 45205 40313 39192 33030 34869
12116 34869 31508 27117 27146 22843 23792 29001 39709 32678 40177 53991 61136 63562 49209 47490
12102 47490 73935 109214 132126 144104 157136 197036 255484 366497 559197 888988 1316669
$$ packed form
12186E2193L1151J7179L3835N9537R9741J27722J07517L1637o9290j17131j21138
12175B52953q1263n1416k2608k5004j1514K500j6232o067p275n725Q595m868n674
12162B6402j4408j0942K1594J3237j7857m684O423M495K758Q242N400r069o481
12149B5110J1737J4113J6312J4303K5371K2105J1959K8771N1737Q1829J47145
12138D50492K52922L79131M18617K37746j19855l82543l95594k73136j75490j11249
12128B81041p6365n0200k8170j7227j4401j8885j8109j2479m892j121o162J839
12116C4869l361m391K9m303R49N209J0708p031P499J3814P145K426j4353j719
12102D7490K6445L5279K2912J1978J3032L9900N8448J11013J92700L29791M27681
$$ plain form
12091 1316669 1673652 1724080 1425378 1003129 664822 439710 305544 222410 172446 148085
12081 148085 128027 116727 100774 74874 55031 46102 48083 42309 17214 5655 14896 25550
12069 25550 36002 51969 48958 47009 41969 33946 24070 25308 36008 30385 33845 37647 33098 23982
12055 23982 26088 47294 69317 85505 123414 182249 270394 416257 529802 579746 536119
12044 536119 413162 288958 203100 153699 124538 97510 68697 64133 55111 46104 41800 37376
12032 37376 36379 32912 30539 22867 11431 3774 3673 7858 11543 18255 7328 7288 9059 10227 4385
12017 4385 11029 6155 5147 -3493 5099 1702 3350 1237 4378 12658 10171 4546 16403 26208
12003 26208 12766 14872 20139 18200 -6540 -22064 -21406 -1950 14412 19588 24794 23571 16611
$$ packed form
12091A316669L56983N0428k98702m22249l38307k25112j34166q3134m9964k4361
12081A48085k0058j1300j5953k5900j9843q929J981n774k5095j1559R241J0654
12069B5550J0452J5967l011j949n040q023r876J238J0700n623L460L802m549r116
12055B3982K106K1206K2023J6188L7909N8835Q8145J45863J13545M9944m3627
12044E36119j22957j24204q5858m9401k9161k7028k8813m564r022r007m304m424
12032C7376r97l467k373p672j1436p657j01M185L685O712j0927m0J771J168n842
12017D385O644m874j008q640Q592l397J648k113L141Q280k487n625J1857R805
12003B6208j3442K106N267j939k4740j5524O58J9456J6362N176N206j223o960
$$ plain form
11990 16611 18597 14113 -11915 -26346 -23730 -21244 -11467 -6960 -2454 -762 3337 -528 1290 11073
11976 11073 5541 6085 14910 13881 6767 -77 1041 9477 4995 -175 1829 147 137 8109 5078
11961 5078 10036 15677 -14 11126 1458 -6610 -6076 -11875 -11837 -19555 -16339 -447 9399 15149 20171
11946 20171 23129 18070 406 -1605 -2380 -12426 -14969 -10708 -19474 -26561 -23699 -7927 -1034 8517
11932 8517 13904 -848 -3387 5811 7869 -8230 -12287 -19441 -15204 -9013 -8542 3739 8176 -11131
11918 -11131 -13665 -9393 -13072 -11745 -2231 517 7751 -2400 -7574 15218 23528 24484 15979 -689
11904 -689 -282 17018 18333 13465 11400 5060 8985 9080 17632 2266 -5603 -11622 -19749 -14540 -704
11889 -704 2731 -10476 -16590 -5763 3008 -9793 -6198 -2793 6272 11763 17722 1854 -23309 -34594
$$ packed form
11990A6611J986m484k6028j4431K616K486R777M507M506J692M099l865J818R783
11976A1073n532N44Q825j029p114o844J118Q436m482n170K004j682j0P972l031
11961E078M958N641j5691J1140r668q068N34n799L8p718L216J5892R846N750N022
11946B0171K958n059j7664k011p75j0046k543M261q766p087K862J5772O893R551
11932H517N387j4752k539R198K058j6099m057p154M237O191M71J2281M437j9307
11918a1131k534M272l679J327R514K748P234j0151n174K2792Q310R56q505j6668
11904f89M07J7300J315m868k065o340L925R5Q552j5366p869o019q127N209J3836
11889g04L435j3207o114J0827Q771j2801L595L405R065N491N959j5868k5163j1285
$$ plain form
11875 -34594 -20425 -14343 -6225 -3778 -2882 -3937 -1053 -2362 2122 7123 3069 -8133 -715 110
11861 110 7179 18932 8393 -3189 -12071 8275 1406 -17774 -26153 -4766 9241 13587 6650
11848 6650 4838 7977 -6896 -19073 -12692 -3831 -3412 -13560 -14281 -4508 20297 31278 23896 17635
11834 17635 14008 10841 6395 -7289 -10936 -2326 -10286 -20654 -10287 -3586 -424 16694 21861
11821 21861 19097 8746 5691 6812 -6780 -13847 -17892 -12094 -14745 -24126 -13693 -6897 -18620
11808 -18620 -27773 -28113 -11801 3436 5462 7043 4807 10284 9096 2972 4040 -2457 735 -3914
11794 -3914 -8897 -4762 -360 4958 2386 3434 14336 16446 18816 21510 12647 73 4731 10906
11780 10906 9297 13660 5666 2865 11740 3377 -1573 318 4848 10363 10496 -7464 -11615 -4926
$$ packed form
11875c4594J4169O082Q118K447Q96j055K884j309M484N001m054j1202P418Q25
11861A10P069J1753j0539j1582q882K0346o869j9180q379K1387J4007M346o937
11848F650j812L139j4873j2177O381Q861M19j0148p21R773K4805J0981p382o261
11834A7635l627l167m446j3684l647Q610p960j0368J0367O701L162J7118N167
11821B1861k764j0351l055J121j3592p067m045N798k651r381J0433O796j1723
11808a8620r153l40J6312J5237K026J581k236N477j188o124J068o497L192m649
11794c914m983M135M402N318k572J048J0902K110K370K694q863j2574M658O175
11780A0906j609M363p994k801Q875q363m950J891M530N515J33j7960m151O689
$$ plain form
11766 -4926 -12329 -2147 4070 307 -3919 -5951 -7840 4145 -2960 -6278 1256 9321 13315 24843
11752 24843 23374 29921 33144 28136 25501 23777 10313 -3421 -1106 1917 25252 32183 22049
11739 22049 15453 14979 2352 4062 -4886 -2891 3004 10641 14737 2934 4746 11808 12863 424
11725 424 -10453 -7746 -8348 3055 6479 7669 6940 4613 5413 8333 16456 -764 -6138 -2137 8509
11710 8509 11795 3154 7332 -2143 -3858 4495 -3767 -524 6924 6712 18453 22490 21982 30314 44500
11695 44500 41113 28251 14781 3449 9457 16729 25658 18901 14263 19105 3778 -4670 -7276
11682 -7276 -2238 -801 -6095 10752 10921 2319 9410 -339 -19807 -24210 -26583 -14401 -14716 -6419
11668 -6419 18632 39162 40068 33293 29628 17703 28873 32506 36458 19434 -1886 -2454 -1751 1316
$$ packed form
11766d926p403J0182O217l763m226k032j889J1985p105l318P534Q065L994J1528
11752B4843j469O547L223n008k635j724j3464j3734K315L023K3335O931j0134
11739B2049o596m74j2627J710q948J995N895P637M096j1803J812P062J055j2439
11725D24j0877K707o02J1403L424J190p29k327Q00K920Q123j7220n374M001J0646
11710H509L286q641M178r475j715Q353q262L243P448k12J1741M037n08Q332J4186
11695D4500l387j2862j3470j1332O008P272Q929o757m638M842j5327q448k606
11682g276N038J437n294J6847J69q602P091r749j9468m403k373J2182l15Q297
11668f419K5051K0530R06o775l665j1925J1170L633L952j7024k1320n68P03L067
$$ plain form
11654 1316 -4839 -10712 -9704 -1993 5239 7423 16307 13834 22474 24205 11879 15970 17657 7663
11640 7663 3238 4483 86 2424 638 15506 22332 7984 4021 2430 -14586 -29919 -30020 -31988
11626 -31988 -21724 -15015 -15084 -10731 10286 24810 13073 16978 8042 -7157 -5864 5355 -3594
11613 -3594 252 -5288 -11724 -6701 -7790 -8031 -6395 -6320 -10469 -2461 -6840 -14898 -20888 -21482 -23606 -7600
11597 -7600 10917 23782 19814 4934 -5792 -6519 -2615 -5980 -13989 -5148 5226 5933 5046 3996
11583 3996 2233 -7409 -24069 -22945 -16402 -12915 -4192 563 16959 18945 4873 553 18389 13654
11569 13654 2075 -7138 -16177 -24028 -24122 -6468 5786 3796 3918 6587 223 1868 -1600 7179
11555 7179 5423 9252 8461 -66 6573 4543 1944 4707 14420 14127 17031 9110 -3942 -1391 -1814
$$ packed form
11654A316o155n873J008P711P232K184Q884k473Q640J731j2326M091J687r994
11640G663m425J245m397K338j786J4868O826j4348l963j591j7016j5333j01j968
11626c1988J0264O709o9M353K1017J4524j1737L905q936j5199J293J1219q949
11613c594L846n540o436N023j089k41J636P5m149Q008m379q058n990n94k124J6006
11597g600J8517J2865l968j4880j0726p27L904l365q009Q841J0374P07q87j050
11583C996j763r642j6660J124O543L487Q723M755J6396J986j4072m320J7836m735
11569A3654j1579r213r039p851r4J7654J2254j990J22K669o364J645l468Q779
11555G179j756L829p91q527O639k030k599K763R713k93K904p921j3052K551m23
$$ plain form
11540 -1814 4702 9401 9088 14925 6008 12703 22108 20801 22544 32182 39009 33167 16497 16549 20327
11525 20327 15770 17575 17760 14694 12997 24900 3559 -1831 8660 15345 11170 5159 13125 21403
11511 21403 28324 25372 20899 22449 23281 31558 27325 6704 7689 6126 1858 4180 13022 9683 -5269
11496 -5269 -5279 -3078 -2274 3063 13679 22332 21538 22447 25431 17788 6281 14367 13463 2275 7773
11481 7773 18368 17104 17020 19350 12778 16089 23765 11312 10817 19438 18638 24129 31328 29537 29229
11466 29229 21836 7604 11186 9925 1158 10804 15654 8290 11671 11688 -2870 3855 5195 6136 11887
11451 11887 14936 16805 23310 28320 31518 15241 11915 17164 16520 12052 -7732 -10202 -5805 13975
11437 13975 29895 27147 22126 13959 19170 10247 -727 -17872 -24877 -5443 11022 12638 12896
$$ packed form
11540a814O516M699l13N837q917O695R405j307J743R638O827n842j6670N2L778
11525B0327m557J805J85l066j697J1903k1341n390J0491O685m175o011P966Q278
11511B1403O921k952m473J550Q32Q277m233k0621R85j563m268K322Q842l339j4952
11496e269j0K201Q04N337J0616Q653p94R09K984p643j1507Q086r04j1188N498
11481G773J0595j264q4K330o572L311P676j2453m95Q621q00N491P199j791l08
11466B9229p393j4232L582j261q767R646M850p364L381J7j4558O725J340R41N751
11451A1887L049J869O505N010L198j6277l326N249o44m468j9784k470M397J9780
11437A3975J5920k748n021q167N211q923j0974j7145p005J9434J6465J616K58
$$ plain form
11424 12896 9087 10019 27153 21171 21322 33308 34989 34773 36480 28410 21267 20086 20973 21530 12906
11409 12906 14589 24306 15276 18378 31916 33515 14427 13228 9653 10660 4886 -2054 5907 23447
11395 23447 49171 38308 28740 16830 13950 14049 9543 -3891 -14898 -14707 -3428 7396 -3714
11382 -3714 -8537 -9344 957 16825 31058 40900 48194 32706 10717 11603 2441 -1204 15280 33081
11368 33081 41781 56806 65057 59853 64685 67115 53881 43538 43451 32964 15304 5251 9594
11355 9594 25722 32870 24414 17160 17032 20793 28041 17972 10131 8287 4624 21662 36720 37450
11341 37450 27541 1260 -7522 -1175 16228 16019 795 -439 12719 16584 23495 34915 21142
11328 21142 17974 24059 23449 20775 22656 26862 34995 52912 41224 14862 12752 14974 18610 18494
$$ packed form
11424A2896l809R32J7134n982J51J1986J681k16J707q070p143j181Q87N57q624
11409A2906J683R717r030L102J3538J599j9088j199l575J007n774o940P961J7540
11395B3447K5724j0863r568j1910k880R9m506j3434j1007J91J1279J0824j1110
11382c714m823q07J0301J5868J4233R842P294j5488k1989Q86r162l645J6484J7801
11368C3081Q700J5025Q251n204M832K430j3234j0343q7j0487j7660j0053M343
11355I594J6128P148q456p254j28L761P248j0069p841j844l663J7038J5058P30
11341C7450r909k6281q782O347J7403k09j5224j234J3158L865O911J1420j3773
11328B1142l168O085o10k674J881M206Q133J7917j1688k6362k110K222L636j16
$$ plain form
11314 18494 9659 16773 27600 29632 20458 -569 -7703 -5604 -913 5687 14685 18016 28402 36856
11300 36856 27574 20512 14233 13706 18692 19664 20688 24256 22141 27124 32688 56270 64634 49079
11286 49079 37172 22318 42716 51514 42501 40360 28758 15866 22570 45350 40962 23229 23748
11273 23748 23399 20781 9339 -4021 5282 17559 29447 41006 40477 43866 29119 16100 35350
11260 35350 37495 26771 23502 16273 11431 23642 28646 25413 15678 -10948 -14660 -282 20568
11247 20568 31780 61370 72949 64674 66653 69096 70022 68754 88628 118712 145738 183761 248855
11234 248855 354796 530220 812923 1228625 1623645 1750970 1550144 1135870 751247 490642
11224 490642 349394 278796 216450 171927 150863 124202 98096 93830 79853 82075 81322 60171
$$ packed form
11314A8494q835P114J0827K032r174k1027p134K099M691O600Q998L331J0386Q454
11300C6856r282p062o279n27M986R72J024L568k115M983N564K3582Q364j5555
11286D9079j1907j4854K0398Q798r013k141j1602j2892O704K2780m388j7733N19
11273B3748l49k618j1442j3360R303J2277J1888J1559n29L389j4747j3019J9250
11260C5350K145j0724l269p229m842J2211N004l233r735k6626l712J4378K0850
11247B0568J1212K9590J1579q275J979K443R26j268J9874L0084K7026L8023O5094
11234B48855J05941J75424K82703M15702L95020J27325k00826m14274l84623k60605
11224D90642j41248p0598o2346m4523k1064k6661k6106m266j3977K222p53k1151
$$ plain form
11212 60171 54696 78099 84580 79866 78512 57831 58078 71940 76840 72019 50884 45789 53537 48317
11198 48317 39950 47477 42198 29884 32347 43076 52211 37465 22229 15572 3686 6294 14567
11185 14567 8043 5923 25255 25577 25661 24392 28206 31610 45482 46690 53198 54602 48192 30690
11171 30690 25505 32474 36078 40360 44701 48054 52567 48011 45002 39538 37135 34426 35955 32034
11157 32034 26845 24964 15643 8768 8408 -1066 4384 14167 16412 38186 50688 60911 70552 81309
11143 81309 80029 80655 75253 70916 80709 77373 60879 58512 65427 73512 74872 73909 73937 79392 64115
11128 64115 66121 66152 60321 46419 43857 47455 42483 45009 49608 54169 49324 42047 37453 39852 36591
11113 36591 30086 28219 27309 45186 41238 31703 32739 31677 24085 36233 39508 53138 63822 68148
$$ packed form
11212F0171n475K3403O481m714j354k0681K47J3862M900m821k1135n095P748n220
11198D8317q367P527n279j2314K463J0729R135j4746j5236o657j1886K608Q273
11185A4567o524k120J9332L22Q4j269L814L404J3872J208O508J404o410j7502
11171C0690n185O969L604M282M341L353M513m556l009n464k403k709J529l921
11157C2034n189j881r321o875l60r474N450R783K245K1774J2502J0223R641J0757
11143H1309j280O26n402m337R793l336j6494k367O915Q085J360r63K8N455j5277
11128F4115K006L1n831j3902k562L598m972K526M599M561m845p277m594K399l261
11113C6591o505j867r10J7877l948r535J036j062p592J2148L275J3630J0684M326
$$ plain form
11099 68148 60502 62752 68553 59386 45810 44627 53676 40120 44966 56966 64446 76753 75117
11086 75117 59901 63589 67613 49809 55949 52638 52614 53377 65274 75144 88035 107050 132170 147095
11072 147095 160464 197537 244000 260697 243204 247985 249209 212140 162225 128236 101899 82271
11060 82271 73548 72226 70639 42939 37181 34847 26702 53741 73345 84308 82644 77567 74950
11047 74950 75504 75867 78847 91826 89907 78472 61483 44131 53016 53896 52589 50936 60834 88622
11033 88622 109128 100209 99304 89769 79267 52479 42771 26169 16915 12390 21763 41596 61265
11020 61265 77243 77084 70836 63523 63703 54723 62699 73431 89746 107378 122747 129097 138512 141823
11006 141823 147706 148707 146383 125987 102146 75385 55106 60575 53971 43110 43253 46346 40605
$$ packed form
11099F8148p646K250N801r167j3576j183R049j3556M846J2000P480J2307j636
11086G5117j5216L688M024j7804O140l311k4P63J1897R870J2891J9015K5120J4925
11072A47095J3369L7073M6463J6697j7493M781J224l7069m9915l3989k6337j9628
11060H2271q723j322j587k7700n758k334q145K7039J9604J0963j664n077k617
11047G4950N54L63K980J2979j919j1435j6989j7352Q885Q80j307j653R898K7788
11033H8622K0506q919r05r535j0502k6788r708j6602r254m525R373J9833J9669
11020F1265J5978j59o248p313J80q980P976J0732J6315J7632J5369O350R415L311
11006A41823N883J001k324k0396k3841k6761k0279N469o604j0861J43L093n741
$$ plain form
10993 40605 36865 35265 38781 39762 29776 34964 50711 54597 50022 48668 63339 78644 84821 83412
10979 83412 91461 79709 70994 67608 50932 43471 36353 38747 52406 69684 58026 55509 48494
10966 48494 47560 57042 72373 72613 75613 66047 47237 39239 43279 37952 35491 41717 51517 54684
10952 54684 51775 60925 61017 54634 40203 32141 8655 -48462 -199327 -357803 -426828 -382337 -256627
10939 -256627 -103600 -5159 40683 98317 134014 141564 146460 151755 150130 150386 171837 201488
10927 201488 213269 213353 202902 201864 202289 200919 189869 190316 209940 208472 209007 199341 204979 208509
10913 208509 213676 229923 232951 211207 193006 194842 202016 231433 256937 258372 248696 239135 243614
10900 243614 257209 291293 330846 332919 327754 310062 282490 270990 290328 314733 344225 369214
$$ packed form
10993D0605l740j600L516R81r986N188J5747L886m575j354J4671J5305O177j409
10979H3412Q049j1752q715l386j6676p461p118K394J3659J7278j1658k517p015
10966D8494r34R482J5331K40L000r566j8810p998M040n327k461O226R800L167
10952E4684k909R150R2o383j4431q062k3486n7117j50865j58476o9025M4491J25710
10939b56627J53027R8441M5842N7634L5697P550M896N295j625K56K1451K9651
10927B01488J1781Q4j0451j038M25j370j1050M47J9624j468N35r666N638L530
10913B08509N167J6247L028k1744j8201J836P174K9417K5504J435r676r561M479
10900B43614J3595L4084L9553K073n165j7692k7572j1500J9338K4405K9492K4989
$$ plain form
10888 369214 375234 374276 385691 386157 387058 379313 375359 382790 392688 418257 456205 477537 485946 482027
10874 482027 508995 535475 554963 590747 618687 624946 641228 660021 695531 727416 757197 779641
10862 779641 792872 815131 837261 863818 907754 940097 963053 1003044 1065157 1157692 1261846
10851 1261846 1368657 1501371 1654747 1818364 1961217 2046691 2122276 2281427 2548855 2946500
10841 2946500 3570310 4337308 4911467 5107180 4984445 4800880 4738924 4848514 5142270 5609977
10831 5609977 6288268 7226483 8428109 9874540 11706966 14159242 17578417 22493536
10823 22493536 29700341 40638616 58272379 88523458 140946241 221084255 304717048
10816 304717048 340461426 303315561 221576766 146721187 96810520 66200170 47282767
$$ packed form
10888C69214O020r58J1415M66R01p745l954P431R898K5569L7948K1332Q409l919
10874D82027K6968K6480J9488L5784K7940O259J6282J8793L5510L1885K9781K2444
10862G79641J3231K2259K2130K6557M3936L2343K2956L9991O2113R2535J04154
10851A261846J06811J32714J53376J63617J42853Q5474P5585J59151K67428L97645
10841B946500O23810P66998N74159J95713j22735j83565o1956J09590K93756M67707
10831E609977O78291R38215J201626J446431J832426K452276L419175M915119
10823B2493536P206805J0938275J7633763L0251079N2422783Q0138014Q3632793
10816C04717048L5744378l7145865q1738795p4855579m9910667l0610350j8917403
$$ plain form
10809 47282767 35124162 26858978 20960156 16649026 13389499 10939603 9137564 7830916
10801 7830916 6821158 5997045 5297681 4702950 4228635 3900010 3687515 3633418 3791586
10792 3791586 4033633 4053283 3653927 3025853 2476548 2076330 1764789 1530374 1392837 1293142
10782 1293142 1221993 1163679 1110109 1048973 994649 950493 889220 823500 774785 739673 686220
10771 686220 627526 573511 533996 486461 465086 463252 457911 446623 430779 406040 387952 376153
10759 376153 370871 359482 352061 330678 312037 289947 278596 271102 268050 275694 257691 240404
10747 240404 223773 209745 210549 207191 194212 178344 173453 190351 196674 178690 152326 111591
10735 111591 96452 98888 103042 109856 108804 106875 106167 116248 122363 124039 134444 126490 108622
$$ packed form
10809D7282767j2158605q265184n898822m311130l259527k449896j802039j306648
10801G830916j009758q24113o99364n94731m74315l28625k12495n4097J58168
10792C791586K42047J9650l99356o28074n49305m00218l11541k34415j37537r9695
10782A293142p1149n8314n3570o1136n4324m4156o1273o5720m8715l5112n3453
10771F86220n8694n4015l9515m7535k1375j834n341j1288j5844k4739j8088j1799
10759C76153n282j1389p421k1383j8641k2090j1351p494l052P644j8003j7287
10747B40404j6631j4028Q04l358j2979j5868m891J6898O323j7984k6364m0735
10735A11591j5139K436M154O814j052j929p08J0081O115J676J0405p954j7868
$$ plain form
10722 108622 90738 89086 93033 102812 80616 54288 48650 53710 50218 67233 74201 51458 31067
10709 31067 18109 6013 -2208 -6807 -790 15557 29866 36212 29699 27337 23897 25271 32163
10696 32163 48983 77151 134292 234915 380596 528455 635259 636845 543479 444673 373614
10685 373614 324843 284928 247455 203588 180316 175630 177448 162251 156777 159815 152264 135710
10673 135710 121436 110039 101131 91148 78644 78168 75468 78573 85826 98691 97884 85200 90634
10660 90634 83326 75487 79167 75395 62819 44278 41512 39541 52632 60603 61357 57539 51021 46800
10646 46800 42185 63926 81045 80416 86934 77980 66423 67277 56865 46911 47434 36274 32542 38732
10632 38732 39925 25854 -11625 -45428 -73143 -88156 -93787 -86237 -73622 -64052 -55812 -54872 -40865
$$ packed form
10722A08622j7884j652L947R779k2196k6328n638N060l492J7015O968k2743k0391
10709C1067j2958j2096q221m599O017J6347J4309O346o513k362l440J374O892
10696C2163J6820K8168N7141J00623J45681J47859J06804J586r3366r8806p1059
10685C73614m8771l9915l7473m3867k3272m686J818j5197n474L038p551j6554
10673A35710j4274j1397q908r983j2504m76k700L105P253J2865q07j2684N434
10660I0634p308p839L680l772j2576j8541k766j971J3091P971P54l818o518m221
10646D6800m615K1741J7119o29O518q954j1557Q54j0412r954N23j1160l732O190
10632C8732J193j4071l7479l3803k7715j5013n631P550J2615R570Q240R40J4007
$$ plain form
10619 -40865 -17294 -5015 -6876 -2393 2102 -7136 -16233 -24021 -3821 17240 26829 17092 -5003
10606 -5003 -8880 -4844 3368 12163 -6107 -28054 -39861 -33804 -35740 -31081 -19711 -6282 8536
10593 8536 24082 17903 6566 -16480 -39321 -53370 -60665 -39515 -26531 -25341 -12743 -7922 -172
10580 -172 10696 7678 11644 4298 1761 2813 9377 13877 19187 4929 -7376 -18305 -9863 10833
10566 10833 19903 12141 7780 23421 24352 5208 -15198 -27404 -17249 -21556 -19311 -6564 16821
10553 16821 13455 11582 18861 7194 12235 19963 5401 -16125 -28335 -37230 -44828 -56018 -51717
10540 -51717 -30464 -18044 -16274 -21257 -25863 -32312 -27128 -21726 -21774 -8939 -15268 -23298 -25840 -26353
10526 -26353 -8974 -3884 -12677 -18228 -15478 -6734 2439 8756 4785 -7602 -14341 -10697 -133 7674
$$ packed form
10619d0865K3571J2279j861M483M495r238r097p788K0200K1061R589r737k2095
10606e003l877M036Q212Q795j8270k1947j1807O057j936M659J1370J3429J4818
10593H536J5546o179j1337k3046k2841j4049p295K1150J2984J190J2598M821P750
10580a72J0868l018L966p346k537J052O564M500N310j4258j2305j0929Q442K0696
10566A0833R070p762m361J5641R31j9144k0406j2206J0155m307K245J2747K3385
10553A6821l366j873P279j1667N041P728j4562k1526j2210q895p598j1190M301
10540e1717K1253J2420J770m983m606o449N184N402m8J2835o329q030k542n13
10526b6353J7379N090q793n551K750Q744R173O317l971j2387o739L644J0564P807
$$ plain form
10512 7674 560 -14314 -29359 -17803 -7990 -7333 6495 8738 -6231 -10943 -18631 -40186 -53885
10499 -53885 -40578 -34310 -32809 -24692 -30752 -41263 -25439 -11927 -16321 -41409 -47077 -48408 -72002
10486 -72002 -58246 -21439 9245 35846 48905 40654 26246 20595 22517 30953 25485 4304 -3577
10473 -3577 -6263 -13736 -17371 -13092 -9584 -4318 12211 16076 -2028 -6825 -8688 -2836 -12227 -23830
10459 -23830 -29601 -26102 -21367 -21374 -13084 194 12499 4265 -5117 2842 -3554 -3822 -296 6170 1909
10444 1909 254 -6938 -5276 7895 5814 7192 -14971 -15255 -6381 -17330 -6696 1684 -2935 -793
10430 -793 3856 5230 -8324 -9909 -9904 4394 16500 20208 24362 13482 10759 15539 15064 -3836 -3663
10415 -3663 -5622 -2210 16260 21943 17121 25578 37163 53041 75721 92416 113825 150386 210603
$$ packed form
10512G674p114j4874j5045J1556R813O57J3828K243j4969m712p688k1555j3699
10499e3885J3307O268J501Q117o060j0511J5824J3512m394k5088n668j331k3594
10486g2002J3756L6807L0684K6601J3059q251j4408n651J922Q436n468k1181p881
10473c577k686p473l635M279L508N266J6529L865j8104m797j863N852r391j1603
10459b3830n771L499M735pQ290J3278J2305q234r382P959o396k68L526O466m261
10444A909j655p192J662J3171k081J378k2163k84Q874j0949J0634Q380m619K142
10430g93M649J374j3554j585NJ4298J2106L708M154j0880k723M780m75j8900J73
10415c663j959L412J8470N683m822Q457J1585J5878K2680J6695K1409L6561O0217
$$ plain form
10402 210603 318792 499842 784723 1186554 1587234 1728382 1499142 1077521 716768 469208
10392 469208 321161 228620 173544 128220 80836 57079 36786 23525 28972 42696 40621 29276
10380 29276 28578 21647 21721 30976 37594 36110 42192 51205 53625 38114 17054 5996 5183 6278 12254
10365 12254 18921 26419 31061 37058 40938 27202 9516 5219 4190 -766 -14707 -14055 -14415 -16432
10351 -16432 -20454 -25717 -18610 -10443 -25122 -28090 -18181 -4979 -1539 -14580 -10141 -1187 8710 2636
10337 2636 -17044 -20642 -18687 -20593 -19415 -5719 6139 17264 13888 4717 9371 1467 -9081
10324 -9081 1884 7945 -2951 -5619 -335 2850 -3426 -8907 -8592 6124 9966 -2926 -1831 -841
10310 -841 2952 12186 8258 2965 5682 3558 2972 12534 27179 35113 37604 29305 26491 13984 4163
$$ packed form
10402B10603J08189J81050K84881M01831M00680J41148k29240m21621l60753k47560
10392D69208j48047r2541n5076m5324m7384k3757k0293j3261N447J3724k075j1345
10380B9276o98o931P4R255O618j484O082R013K420j5511k1060j1058q13J095N976
10365A2254O667P498M642N997L880j3736j7686m297j029m956j3941O52l60k017
10351a6432m022n263P107Q167j4679k968R909J3202L440j3041M439Q954R897o074
10337B636j9680l598J955j906J178J3696J1858J1125l376r171M654p904j0548
10324i081J0965O061j0896k668N284L185o276n481L15J4716L842j2892J095R90
10310h41L793R234l928n293K717k124n86R562J4645P934K491q299k814j2507r821
$$ plain form
10295 4163 11304 16885 16259 11968 31105 34738 19463 23890 28344 13825 -5582 -6338 -5051 -9622
10281 -9622 -8336 -1061 -13367 -16642 -3295 1422 592 15959 27810 31195 22148 23064 17746 527
10267 527 -11760 -15337 -4943 12472 -1509 -32801 -32667 -20157 -4180 -551 -7034 -13937 -15105
10254 -15105 -22377 -20054 -15367 -5485 -7923 -2333 -2244 125 6779 14608 10593 -2037 1580 2672 -5800
10239 -5800 -7374 4560 14699 7753 -5015 -28570 -24105 -594 13976 3277 8196 7186 -3620
10226 -3620 -5557 -10568 -12049 -13511 -17922 -36473 -39923 -41500 -17270 -12909 -15981 -14548 -10508 -16376
10212 -16376 -16016 -7019 -14900 -16852 -7854 3719 -11742 -12231 -13388 -357 1413 2363 -1361 -1489 1085
10197 1085 1945 -13269 -1760 17799 13346 -2580 -673 -3253 1641 4586 -6519 -3867 18971
$$ packed form
10295D163P141N581o26m291J9137L633j5275M427M454j4519j9407p56J287m571
10281i622J286P275j2306l275J3347M717q30J5367J1851L385r047R16n318j7219
10267E27j2287l577J0394J7415j3981l1292J34J2510J5977L629o483o903j168
10254a5105p272K323M687R882k438N590Q9K369O654P829m015j2630L617J092q472
10239e800j574J1934J0139o946j2768k3555M465K3511J4570j0699M919j010j0806
10226c620j937n011j481j462m411j8551l450j577K4230M361l072J433M040n868
10212a6376L60Q997p881j952Q998J1573j5461m89j157J3031J770R50l724j28K574
10197A085Q60j5214J1509J9559m453j5926J907k580M894K945j1105K652K2838
$$ plain form
10184 18971 16978 11626 11840 6088 -6524 -85 4088 740 -2140 -4275 -13161 -9863 6627 4766
10170 4766 -16497 -16914 -18076 -19901 -32766 -38525 -36581 -32618 -22224 -14822 -13809 -21221 -25690 -22875
10156 -22875 -22478 -22735 -13092 -17029 -12542 -2533 3541 9425 13138 -4434 -15138 -7941 -17670 -21705
10142 -21705 -37094 -43317 -30867 -25494 -31061 -28976 -23089 -13673 -7153 995 -2019 -7594 -1078 -5410
10128 -5410 -14965 -15431 -20821 -30497 -6316 6756 -17407 -27207 -30398 -33044 -36320 -28895 -24800 -17682
10114 -17682 -9853 2304 13663 15756 15138 -13962 -30767 -22025 -18211 -22409 -20617 -32737 -34732
10101 -34732 -29128 -24633 -22366 -23842 -12901 -6690 -481 7737 16609 9229 -5043 -11178 -7141 -5558
10087 -5558 -17247 -21930 -21525 -16325 -13000 -10212 -7026 -6405 17739 16284 -5634 -18716 -33300 -38384
$$ packed form
10184A8971j993n352K14n752j2612O439M173l348k880k135q886L298J6490j861
10170D766k1263m17j162j825j2865n759J944L963J0394P402J013p412m469K815
10156b2875L97k57R643l937M487J0009O074N884L713j7572j0704P197r729m035
10142b1705j5389o223J2450N373n567K085N887R416O520Q148l014n575O516m332
10128e410r555m66n390r676K4181J3072k4163r800l191k646l276P425M095P118
10114a7682P829J2157J1359K093o18k9100j6805Q742L814m198J792j2120j995
10101c4732N604M495K267j476J0941O211O209Q218Q872p380j4272o135M037J583
10087e558j1689m683M05N200L325K788L186O21K4144j455k1918j3082j4584n084
$$ plain form
10073 -38384 -27397 -37658 -31862 -19213 -14857 -8082 -13744 -5073 7496 10047 3678 2613 -4220
10060 -4220 -5041 2737 -1669 -13647 -18294 -24437 -19244 -27322 -38154 -39897 -30544 -20772 -12772 -19071
10046 -19071 -9627 -456 -258 786 -15434 -17732 -4718 2666 3164 7493 1328 -8732 -12590 -6875
10032 -6875 -4324 -16581 -20589 -16604 -3529 -3932 -17793 -29414 -29197 -28102 -23938 -15659 -16628 -15663 -5289
10017 -5289 -2057 -19147 -16000 -10435 -3185 6125 7077 -9757 -32545 -28872 -28413 -25758 -10792 -5920
10003 -5920 -3829 -12760 -8634 -4335 -9039 -8922 565 426 -14366 -15732 -12224 3091 25105 52656
9989 52656 76048 94647 82973 67486 51733 44654 36225 15526 8214 5228 -1532 -20737 -20435
9976 -20435 -6737 -2745 -1743 -11028 4781 21193 14090 14070 20560 5173 -5787 2416 957 -19594
$$ packed form
10073c8384J0987j0261N796J2649M356O775n662Q671J2569K551o369j065o833
10060d220q21P778m406j1978m647o143N193q078j0832j743R353R772Q000o299
10046a9071R444R171J98J044j6220k298J3014P384M98M329o165j0060l858N715
10032f875K551j2257m008L985J3075m03j3861j1621K17J095M164Q279r69R65J0374
10017e289L232j7090L147N565P250R310R52j6834k2788L673M59K655J4966M872
10003e920K091q931M126M299m704J17R487j39j4792j366L508J5315K2014K7551
9989E2656K3392J8599j1674j5487j5753p079q429k0699p312k986o760j9205L02
9976b0435J3698L992J002r285J5809J6412p103k0O490j5387j0960Q203j459k0551
$$ plain form
9962 -19594 -40298 -27928 -20991 -25154 -16415 -10553 -11939 -2875 13317 9088 -3107 -3481 9770 12518
9948 12518 4327 -2854 -6796 364 10003 12414 -13435 -16656 -6666 -7478 -11482 -1640 8412 15347
9934 15347 16187 8113 -10606 -15069 -12923 -10976 4856 1395 519 -12812 -31895 -36361 -35247 -41156
9920 -41156 -31328 -15818 -20493 -15840 -14328 -12888 -16202 -13166 -10375 -25788 -38680 -26503 -12073
9907 -12073 142 -19211 -36016 -17688 -4379 -8850 -10398 7132 441 -1178 -3194 -18923 -26122
9894 -26122 -29367 -29263 -22176 -31710 -22143 -15151 -16946 -22379 -20099 -18872 -30187 -24024 -23462 -16804 -10695
9879 -10695 -22438 -46378 -39923 -21727 -12176 8208 8452 9884 -7396 -16514 -10351 -12135 -11431 -16713
9865 -16713 -14037 5646 1406 -5134 1852 -3940 -13750 -23027 -20908 -13387 4865 7641 10088 18750
$$ packed form
9962a9594k0704J2370O937m163Q739N862j386R064J6192m229j2195l74J3251K748
9948A2518q191p181l942P160R639K411k5849l221R990q12m004R842J0052O935
9934A5347Q40q074j8719m463K146J947J5832l461q76j3331j9083m466J114n909
9920d1156R828J5510m675M653J512J440l314L036K791j5413j2892J2177J4430
9907a2073J2215j9353j6805J8328J3309m471j548J7530o691j619k016j5729p199
9894b6122l245J04P087r534R567O992j795n433K280J227j1315O163N62O658O109
9879a0695j1743k3940O455J8196R551K0384K44J432j7280r118O163j784P04n282
9865a6713K676J9683m240o540O986n792r810r277K119P521J8252K776K447Q662
$$ plain form
9851 18750 11597 2336 -15416 -14784 -15075 -8366 2895 3043 3713 -13918 -14759 -17774 -11756 -16037 -12502
9836 -12502 372 -5824 -24128 -27847 -20894 -14911 6466 5514 459 8436 -5706 -15284 -19389 -20770
9822 -20770 -17700 -12107 3177 -2609 -6119 2591 2961 8467 13913 13725 -10111 -7160 4722 8251
9808 8251 4291 7415 4012 -7712 -8059 4197 5567 17312 18061 7283 4720 -8012 -13256 8624
9794 8624 12444 131 -10299 -10485 -8789 -8651 -20254 -16451 2503 8749 -2519 9687 24046 31267
9780 31267 25231 20121 4041 -19391 -24221 -8057 3205 4445 -8042 -17452 -3685 10279 10322
9767 10322 4922 -11287 -20858 -19698 -7974 -17124 -26731 -22501 -19042 -13916 -13626 -21657 -14949 -13619
9753 -13619 -8560 -5345 -5326 -16182 -19257 -22202 -18023 -9566 -17231 -22292 -21877 -14014 -9053 -22702 -39969
$$ packed form
9851A8750p153r261j7752O32k91O709J1261J48O70j7631q41l015O018m281L535
9836a2502J2874o196j8304l719O953N983K1377r52n055P977j4142r578m105j381
9822b0770L070N593J5284n786l510Q710L70N506N446j88k3836K951J1882L529
9808H251l960L124l403j1724l47J2256J370J1745P49j0778k563j2732n244K1880
9794H624L820j2313j0430j86J696J38j1603L803J8954O246j1268J2206J4359P221
9780C1267o036n110j6080k3432m830J6164J1262J240j2487r410J3767J3964M3
9767A0322n400j6209r571J160J1724r150r607M230L459N126K90q031O708J330
9753a3619N059L215J9j0856l075k945M179Q457p665n061M15P863M961j3649j7267
$$ plain form
9738 -39969 -31938 -12173 -2078 8841 22296 13756 -820 -9452 -21497 -15662 -5201 -15092 -22007
9725 -22007 -26654 -28256 -16203 -9282 -6866 -13933 -13512 -11036 -24872 -20415 -21872 -27056 -13030 -12064
9711 -12064 -17896 -17565 -23250 -13466 -6667 1720 -6200 -21720 -31255 -27557 -13492 -7204 8537 7068
9697 7068 -4162 -5454 -6220 -9755 4731 8369 -9892 -9977 -2029 -3398 -4110 986 8015 12241 21137
9682 21137 10673 -7298 -2943 4646 1538 1184 -13005 -8089 -2635 -2226 -12605 -7606 -6186 -18247
9668 -18247 -5324 4273 6172 -9536 -1650 14063 18427 7223 7162 16165 19622 17560 27736 24681
9654 24681 28915 31533 25170 22452 19980 14901 21443 24078 14134 6564 10984 3721 -17453 -12858
9640 -12858 -19497 -25630 -14474 -7646 -16295 -14767 -17041 -6141 7918 566 -4014 -4184 7202 8084
$$ packed form
9738c9969Q031J9765J0095J0919J3455q540j4576q632j2045N835J0461r891o915
9725b2007m647j602J2053O921K416p067M21K476j3836M457j457n184J4026R66
9711a2064n832L31n685R784O799Q387p920j5520r535L698J4065O288J5741j469
9697G068j1230j292p66l535J4486L638j8261q5P948j369p12N096P029M226Q896
9682B1137j0464j7971M355P589l108l54j4189M916N454M09j0379M999J420j2061
9668a8247J2923R597J899j5708P886J5713M364j1204o1R003L457k062J0176l055
9654B4681M234K618o363k718k472n079O542K635r944p570M420p263k1174M595
9640a2858o639o133J1156O828q649J528k274J0900J4059p352m580j70J1386Q82
$$ plain form
9626 8084 -7565 -21757 -15451 -2030 6527 9544 19287 35712 44923 45836 53416 51945 41015 21014
9612 21014 13486 7719 13343 13220 13444 19748 22293 9627 4903 7287 7058 5098 -5850 -6973 1254
9597 1254 5642 -367 9200 18276 6370 8400 651 -4238 8606 12789 12402 5065 2358 13558
9583 13558 11398 11126 29319 35124 27360 20848 40223 56077 42260 27627 13219 3582 -4035
9570 -4035 -2862 -4190 122 -5512 -19208 -23696 -24724 -12150 -10697 -23810 -29764 -37554 -32475 -17772
9556 -17772 -11058 -13727 -9566 -3207 -2110 -5509 1481 -9122 -28099 -34254 -20726 -5816 -22312
9543 -22312 -31312 -25982 -18857 -25158 -22419 -1882 -5134 10117 6015 12467 17715 14743 21654 4024
9529 4024 -6357 5218 2203 -4869 296 7072 -4272 -120 8433 17000 13056 -2523 -17322 -22337
$$ packed form
9626H084j5649j4192O306J3421Q557L017R743J6425R211R13P580j471j0930k0001
9612B1014p528n767N624j23K24O304K545j2666m724K384k29j960j0948j123Q227
9597A254M388o009R567R076j1906K030p749m889J2844M183l87p337k707J1200
9583A3558k160k72J8193N805p764o512J9375J5854j3817j4633j4408r637p617
9570d035J173j328M312n634j3696m488j028J2574J453j3113n954p790N079J4703
9556a7772O714k669M161O359J097l399O990j0603j8977o155J3528J4910j6496
9543b2312r000N330P125o301K739K0537l252J5251m102O452N248k972O911j7630
9529D024j0381J1575l015p072N165O776j1344M152Q553Q567l944j5579j4799n015
$$ plain form
9515 -22337 -14244 -18229 -2187 -6691 -14538 -6457 -4351 -5123 17019 11489 4833 7076 12570 14530
9501 14530 7316 3280 -14035 -10839 -3555 5975 16290 3483 -2785 -6724 -1174 -5826 -11816 -6282
9487 -6282 -2688 -13395 -15369 -1332 472 -10533 -29599 -31479 -25378 -26248 -17886 -10607 -18329 -17298
9473 -17298 -4125 -1170 12178 19760 17317 8426 4465 -211 -851 11224 18366 6262 -3228 -5471
9459 -5471 9188 4687 -15482 -8018 -7330 4508 317 -2894 3487 -2684 -6846 -5433 -12505 -13662
9445 -13662 -22127 -16960 -1939 4614 3223 1873 -9984 -14131 -9579 -7752 -11059 -11788 -8876 -6781
9431 -6781 -10086 -5642 7060 1881 -10324 -2031 -7370 -22885 -23706 -18669 -23923 -31903 -37942 -37438 -22465
9416 -22465 -6349 -577 5882 -4137 -8709 -9052 -6947 -7327 -15998 -11706 -6310 4317 14390 13225
$$ packed form
9515b2337Q093l985J6042m504p847Q081K106p72K2142n530o656K243N494J960
9501A4530p214m036j7315L196P284R530J0315j2807o268l939N550m652n990N534
9487f282L594j0707j974J4037J804j1005j9066j880O101q70Q362P279p722J031
9473a7298J3173K955J3348P582k443q891l961m676o40J2075P142j2104r490k243
9459e471J4659m501k0169P464O88J1838m191l211O381o171m162J413p072j157
9445a3662q465N167J5021O553j391j350j1857m147M552J827l307p29K912K095
9431f781l305M444J2702n179j2205Q293n339j5515q21N037n254p980o039N04J4973
9416b2465J6116N772O459j0019m572l43K105l80q671M292N396J0627J0073j165
$$ plain form
9402 13225 12915 6387 -4471 -14741 -8476 -8832 -11049 3220 19990 27287 14610 2672 16679
9389 16679 22284 20766 5355 -5333 -12293 -4642 537 -3389 -23786 -26740 -12491 5656 -1415
9376 -1415 -9119 7523 21385 22299 20998 9069 -6446 4579 8150 7636 -1826 -351 18216 11192
9362 11192 -4608 -4226 -10652 -5020 14602 22154 10807 5165 5440 -18835 -18399 -1577 -6754 -22941
9348 -22941 -33956 -26614 -5542 8631 139 -11642 -16281 5488 8549 1641 -12880 -11172 -7779
9335 -7779 -6735 -8888 -2636 5913 15209 538 -7164 -83 11062 18424 19075 3953 14379 13333
9321 13333 3793 -3378 -9480 -10921 4130 -3437 -9869 553 19123 21953 10195 1837 9020 16391
9307 16391 19534 19478 10873 14528 7909 -14096 -17065 -7949 -16656 -2793 -7330 -18878 -16985 -18989
$$ packed form
9402A3225l10o528j0858j0270O265l56k217J4269J6770P297j2677j1938J4007
9389A6679N605j518j5411j0688o960P651N179l926k0397k954J4249J8147p071
9376a415p704J6642J3862R14j301j1929j5515J1025L571n14r462J475J8567p024
9362A1192j5800L82o426N632J9622P552j1347n642K75k4275M36J6822n177j6187
9348b2941j1015P342K1072J4173q492j1781m639K1769L061o908j4521J708L393
9335g779J044k153O252Q549R296j4671p702P081J1145P362O51j5122J0426j046
9321A3333r540p171o102j441J5051p567o432J0422J8570K830j1758q358P183P371
9307A6391L143n6q605L655o619k2005k969R116q707J3863m537j1548J893k004
$$ plain form
9293 -18989 -17813 898 -1421 -19076 -22068 -5576 5176 20424 4836 -15348 -12992 -7313 3098
9280 3098 9805 19263 10481 -3922 -1961 -2996 8368 12107 1993 9697 15640 20123 20054 23399 24271
9265 24271 18223 17892 23454 28851 17475 5823 6475 17126 27213 23684 14433 26016 23577 22168
9251 22168 11720 806 3162 -2671 6738 17753 22256 27564 42959 32512 34252 43872 48013
9238 48013 41083 49008 38590 26909 21922 17370 25859 41811 51672 59625 64161 83340 72870
9225 72870 65070 62365 73071 62762 64768 60527 64481 65586 88035 94839 102288 83567 86007 101109
9211 101109 97866 108485 126918 153007 158749 160996 169169 194700 203854 204301 215653 246555 269062
9198 269062 275780 297412 337890 367599 396587 438880 482508 537731 600107 676070 771327 886536
$$ packed form
9293a8989J176J8711k319j7655k992J6492J0752J5248j5588k0184K356N679J0411
9280C098O707R458q782j4403J961j035J1364L739j0114P704N943M483o9L345Q72
9265B4271o048l31N562N397j1376j1652O52J0651J0087l529r251J1583k439j409
9251B2168j0448j0914K356n833R409J1015M503N308J5395j0447J740R620M141
9238D8013o930P925j0418j1681m987m552Q489J5952R861P953M536J9179j0470
9225G2870p800k705J0706j0309K006m241L954J105K2449O804P449j8721K440J5102
9211A01109l243J0619J8433K6089N742K247Q173K5531R154M47J1352L0902K2507
9198B69062O718K1632M0478K9709K8988M2293M3628N5223O2376P5963R5257J15209
$$ plain form
9186 886536 1020381 1193946 1406025 1685540 2055348 2514466 3130709 3977610 5069664 6360218
9176 6360218 7732258 8823417 9300260 8973910 7983432 6704696 5432510 4328346 3447881
9167 3447881 2771429 2248405 1847323 1533601 1276508 1085471 948030 816715 713944 638250
9157 638250 551032 496163 463202 415496 374733 344017 303435 264616 242290 229238 225552 213433
9145 213433 192435 179992 168075 157377 160622 157289 139399 122336 116926 98090 99594 100362 101760
9132 101760 91779 77253 69232 63317 69437 65163 47541 40898 45443 47274 45266 45688 48251 40145
9118 40145 33213 28589 35333 34504 28616 28405 35907 32057 36556 31190 36922 30071 28640 31127 44207
9103 44207 41646 44661 45947 37902 25895 28273 36270 35392 32873 39247 27020 29548 31492 32425 26380
$$ packed form
9186H86536J33845J73565K12079K79515L69808M59118O16243Q46901J092054J290554
9176F360218J372040J091159M76843l26350r90478j278736j272186j104164q80465
9167C447881o76452n23024m01082l13722k57093j91037j37441j31315j02771p5694
9157F38250q7218n4869l2961m7706m0763l0716m0582l8819k2326j3052l686j2119
9145B13433k0998j2443j1917j0698L245l333j7890j7063n410j8836J504P68J398
9132A01760r981j4526q021n915O120m274j7622o643M545J831k008M22K563q106
9118D0145o932m624O744q29n888k11P502l850M499n366N732o851j431K487J3080
9103D4207k561L015J286q045j2007K378P997q78k519O374j2227K528J944R33o045
$$ plain form
9088 26380 17821 16217 2163 -4491 -6447 3839 19558 21513 -5203 -11997 -4597 6096 20611
9075 20611 23957 19690 409 -2570 6922 12055 10934 11612 1919 2713 6289 2465 5677 12657 -4558
9060 -4558 1411 -244 -3945 8082 15064 16849 -2470 -16785 -1184 19482 13139 4860 95 828
9046 828 6727 7214 2625 -2146 -1128 6713 -11799 -12566 -14238 -8503 -15247 -11603 -7492 -13451 -7180
9031 -7180 -12220 -8198 13861 19878 6239 -1767 5351 586 1070 13940 11193 8710 194 -6984
9017 -6984 -5432 8631 12477 18489 20292 12824 3888 4177 5681 4793 2884 -2823 2893 9730 6169
9002 6169 -4715 -10990 -1156 14233 11352 -10283 -9152 71 -1196 24 -9025 -5674 -288 -4633
8988 -4633 7682 16213 9778 3581 -7866 -2248 20902 22279 11334 21267 12305 -16541 -25262 -16173
$$ packed form
9088B6380q559j604j4054o654j956J0286J5719J955k6716o794P400J0693J4515
9075B0611L346m267j9281k979R492N133j121O78r693P94L576l824L212O980j7215
9060d558N969j655l701J2027O982J785j9319j4315J5601K0666o343q279m765P33
9046H28N899M87m589m771J018P841j8512p67j672N735o744L644M111n959O271
9031g180n040M022K2059O017j3639q006P118m765M84J2870k747k483q516p178
9017f984J552J4063L846O012J803p468q936K89J504q88j909n707N716O837l561
9002F169j0884o275R834J5389k881k1635J131R223j267J220r049L351N386m345
8988d633J2315Q531o435o197j1447N618K3150J377j0945R933q962k8846q721R089
$$ plain form
8974 -16173 -4747 7503 7729 12952 35699 31182 10188 -3014 -7494 1519 3764 -2389 -3847 3435
8960 3435 3868 -5205 -7912 -15614 -24834 -27149 -18314 -17198 -18716 -21847 -27088 -8059 -17207 -21257 -20128
8945 -20128 -28203 -28003 -23169 -16842 -17326 -13344 -1014 12820 4730 -440 -12208 -6512 -2303 -18949
8931 -18949 -4596 20733 21835 329 -6372 -1025 145 -7514 -9771 -6474 -17696 -8097 8499
8918 8499 4050 4302 20718 20416 29833 35932 37382 30688 3009 -12945 -3421 3831 -1516 309 19289
8903 19289 23165 18494 9060 -5768 -13091 -5271 -983 -17098 -28686 -41193 -28961 -15264 -3945
8890 -3945 -7008 -30 11345 13540 7903 6657 7422 1850 -5095 -1956 4077 11056 24274 15699 21441
8875 21441 28345 43241 78770 93977 83159 58539 44067 39624 18621 153 -11575 -17830
$$ packed form
8974a6173J1426J2250K26N223K2747m517k0994j3202m480R013K245o153j458P282
8960C435M33r073k707p702r220k315Q835J116j518l131n241J9029r148m050J129
8945b0128q075K00M834O327m84L982J2330J3834q090n170j1768N696M209j6646
8931a8949J4353K5329J102k1506o701N347J170p659k257L297j1222R599J6596
8918H499m449K52J6416l02R417O099J450o694k7679j5954R524P252n347J825J8980
8903A9289L876m671r434j4828p323P820M288j6115j1588j2507J2232J3697J1319
8890c945l063O978J1375K195n637j246P65n572o945L139O033O979J3218q575N742
8875B1441O904J4896L5529J5207j0818k4620j4472m443k1003j8468j1728o255
$$ plain form
8863 -17830 -17319 -18603 -10142 -1459 1031 686 3115 -3624 -16082 -11249 -9665 1950 13772 22212
8849 22212 17359 -872 -6665 -18737 -18884 -8489 -4387 -6238 -16819 -23317 -28590 -25567 -26867 -16363
8835 -16363 -1866 9308 23134 8011 -2198 -2182 16644 31681 31229 4950 12308 18625 10549
8822 10549 14871 18017 9438 -2011 -14432 -19360 -22575 -19124 -4272 -17394 -15883 -14372 -4237
8809 -4237 3337 -7593 -10060 -21508 -19741 -11135 -6032 -15448 -21113 -11609 -8283 -8253 -2422 8096 12297
8794 12297 5136 -7071 -9114 2652 582 -655 -15349 2519 11844 3739 -10904 -1937 -4083
8781 -4083 -5931 8024 9458 479 -13902 -8093 -2985 -2314 -8772 -8890 -4948 3205 21059 27758 12021
8766 12021 -4482 -15582 -2650 3521 -10171 3066 3624 1911 17880 20046 5792 -18990 -31101
$$ packed form
8863a7830N11j284Q461Q683K490l45K429o739j2458M833J584J1615J1822Q440
8849B2212m853j8231n793j2072j47J0395M102j851j0581o498n273L023j300J0504
8835a6363J4497J1174J3826j5123j0209J6J8826J5037m52k6279P358O317q076
8822A0549M322L146q579j1449j2421m928l215L451J4852j3122J511J511J0135
8809d237P574j0930k467j1448J767Q606N103r416n665R504L326L0N831J0518M201
8794A2297p161j2207k043J1766k070j237j4694J7868R325q105j4643Q967k146
8781d083j848J3955J434q979j4381N809N108O71o458j18L942Q153J7854O699j5737
8766A2021j6503j1100J2932O171j3692J3237N58j713J5969K166j4254k4782j2111
$$ plain form
8753 -31101 -32411 -35415 -25570 -13171 -5459 458 -10121 -9546 -10016 -10351 -3325 -9516 -15399 -21973 -12079
8738 -12079 2989 4158 -215 7726 1932 684 -604 -4273 1061 11960 14177 8340 -9618 -23602
8724 -23602 -10248 -5203 2229 5988 -728 -5098 5807 9689 12924 11733 14247 4468 14444 6929
8710 6929 -12271 -16886 -2793 17415 11156 4444 6404 13522 12000 -6705 -2701 12717 26109
8697 26109 25165 28400 26243 25235 32173 22453 15040 1398 -9059 -10906 -1140 10512 4407 6086
8683 6086 13071 23340 4414 787 11916 32115 22744 6902 -6079 -1372 5283 12206 22368
8670 22368 25922 37160 35094 18365 13818 35802 37821 21727 27670 29084 19091 18146 18075 21755
8656 21755 19778 7027 10193 30930 33943 34653 16760 17100 19866 18077 14552 7232 12242 14930
$$ packed form
8753c1101j310l004R845J2399P712N917j0579N75m70l35P026o191n883o574R894
8738a2079J5068J169m373P941n794j248j288l669N334J0899K217n837j7958j3984
8724b3602J3354N045P432L759o716m370J0905L882L235j191K514r779R976p515
8710F929j9200m615J4093K0208o259o712J960P118j522j8705M004J5418J3392
8697B6109r44L235k157j008O938r720p413j3642j0457j847R766J1652o105J679
8683F086O985J0269j8926l627J1129K0199r371j5842j2981M707O655O923J0162
8670B2368L554J1238k066j6729m547K1984K019j6094N943J414r993r45p1L680
8656B1755j977j2751L166K0737L013P10j7893L40K766j789l525p320N010K688
$$ plain form
8642 14930 19347 7141 12205 21398 30930 27074 27981 25217 40847 34934 30018 35909 44076 34730
8628 34730 17902 15003 26300 48741 59783 62362 45671 44017 63223 110441 147469 148194 116202
8615 116202 86148 67812 66939 52894 28970 11879 4254 16948 34634 28875 25192 32962 30712
8602 30712 30589 41644 45363 48301 53207 75852 74845 72542 72828 72792 71378 72813 73080 55008 52140
8587 52140 53349 49097 45127 39152 37120 43096 58433 66987 66816 85941 112059 143075 206085 279170
8573 279170 323011 336454 314078 296291 306470 360028 525045 813253 1231378 1672013 1865369
8562 1865369 1697306 1272854 845252 558329 396463 286038 210395 169436 142142 115636
8552 115636 92578 86763 71066 64250 55713 36445 40571 58722 74644 65425 68777 66723 50195
$$ packed form
8642A4930M417j2206N064R193R532l856R07k764J5630n913m916N891Q167r346
8628C4730j6828k899J1297K2441J1042K579j6691j654J9206M7218L7028P25l1992
8615A16202l0054j8336q73j4045k3924j7091p625J2694J7686n759l683P770k250
8602C0712j23J1055L719K938M906K2645j007k303K86l6j414J435K67j8072k868
8587E2140J209m252l970n975k032N976J5337Q554j71J9125K6118L1016O3010P3085
8573B79170M3841J3443k2376j7787J0179N3558J65017K88208M18125M40635J93356
8562A865369j68063m24452m27602k86923j61866j10425p5643m0959k7294k6506
8552A15636k3058n815j5697o816q537j9268M126J8151J5922r219L352k054j6528
$$ plain form
8539 50195 57969 50340 51126 65727 80149 102627 135285 157781 177607 213833 244850 276121 293018
8526 293018 313916 378279 523090 775871 1212820 1965856 2936349 3619674 3564360 2802141
8516 2802141 1902748 1256569 841292 570330 401388 297595 243425 211699 183747 150266
8506 150266 116770 97904 76991 69195 57155 47519 50978 62807 55806 57379 48373 16837 18238
8493 18238 26905 43962 56802 60195 57360 58140 68227 88267 85383 90995 90626 111318 148479 211373
8479 211373 301925 473436 775962 1203364 1622659 1772184 1546156 1119948 737736 475830
8469 475830 307940 214794 177110 164704 140890 102071 73018 58927 63574 69681 54236 41134
8457 41134 32525 10984 260 5099 1322 4770 24023 21423 6199 7692 -3812 -8175 1579
$$ packed form
8539E0195P774p629P86J4601J4422K2478L2658K2496J9826L6226L1017L1271J6897
8526B93018K0898O4363J44811K52781M36949P53036R70493O83325n5314p62219
8516B802141q99393o46179m15277k70962j68942j03793n4170l1726k7952l3481
8506A50266l3496j8866k0913p796j2040r636L459J1829p001J573r006l1536J401
8493A8238Q667J7057J2840L393k835P80J0087K0040k884N612l69K0692L7161O2894
8479B11373R0552J71511L02526M27402M19295J49525k26028m26208l82212k61906
8469D75830j67890r3146l7684j2406k3814l8819k9053j4091M647O107j5445j3102
8457D1134q609k1541j0724M839l777L448J9253k600j5224J493j1504m363R754
$$ plain form
8444 1579 -498 -4876 -9944 -2285 19008 28211 21832 8701 2828 3529 2038 3784 -20894 -34710
8430 -34710 -31525 -26841 -34000 -40182 -35505 -19717 -10594 2226 17316 9535 4287 -4339 -2404 123
8416 123 -19059 -27754 -29057 -23137 -7485 2805 10286 5964 -4582 -9489 7079 28736 24916 5393
8402 5393 1160 764 19032 17589 1117 23151 14389 6755 34512 24303 23584 8575 -3196 5054
8388 5054 10144 -5146 -22868 -12852 7747 15598 16286 3829 -10005 -11288 -2380 3578 -6271 -197
8374 -197 -9272 -7142 -6569 -28 -10586 -11664 -10279 -19737 -8133 718 -3103 -8651 -5105 -7753 3207
8359 3207 24595 28761 23163 -2610 -12597 -9606 -505 2760 20555 8193 12335 10204 -222 8329
8345 8329 22679 15682 9562 17068 10828 7037 -4172 959 -4970 -10124 -1846 -10486 -11699 -1049
$$ packed form
8444A579k077m378n068P659K1293R203o379j3131n873P01j491J746k4678j3816
8430c4710L185M684p159o182M677J5788R123J2820J5090p781n248q626J935K527
8416A23j9182q695j303N920J5652J0290P481m322j0546m907J6568K1657l820j9523
8402E393m233l96J8268j443j6472K2034q762p634K7757j0209p19j5009j1771Q250
8388E054N090j5290j7722J0016K0599P851O88j2457j3834j283Q908N958r849O074
8374a97r075K130N73O541j0558j078J385r458J1604Q851l821n548L546k648J0960
8359C207K1388M166n598k5773r987K991R101L265J7795j2362M142k131j0426Q551
8345H329J4350o997o120P506o240l791j1209N131n929n154Q278q640j213J0650
$$ plain form
8331 -1049 748 -5719 7730 11307 4972 9577 7704 8353 4787 -1179 -10202 -31002 -37975 -30731 -25064
8316 -25064 -7960 378 -725 289 -6139 -5551 -2850 441 -15012 -13703 -6195 -9318 -3131 -14787
8302 -14787 -13548 -9920 -16368 -16466 -8273 8407 5772 6432 1600 -4884 -13637 -27317 -4335 7486
8288 7486 13547 7858 -1958 3273 7945 4841 397 -7130 5384 11261 -6610 -17378 -32239 -22984
8274 -22984 -10744 -7227 -1164 -15883 -23679 -11998 -20551 -17842 -25472 -34512 -28060 -22209 -12926 7700
8260 7700 10081 -11175 -23133 -26865 -19498 -19637 -22419 -19356 -15610 -7392 -1276 -901 -8413 633 -2085
8245 -2085 -10234 -28733 -29305 -12284 -6374 -6163 8624 14185 8203 2516 -10635 -15090 -6534 -7356 -1567
8230 -1567 -3218 -2667 9622 7977 -8200 -23794 -18092 -4245 254 4286 -4877 -13833 -24990 -13526
$$ packed form
8331a049J797o467J3449L577o335M605j873O49l566n966r023k0800o973P244N667
8316b5064J7104Q338j103J014o428N88K701L291j5453J309P508l123O187j1656
8302a4787J239L628o448r8Q193J6680k635O60m832o484q753j3680K2982J1821
8288G486O061n689r816N231M672l104m444p527J2514N877j7871j0768j4861R255
8274b2984J2240L517O063j4719p796J1681q553K709p630r040O452N851R283K0626
8260G700K381k1256j1958l732P367j39k782L063L746Q218O116L75p512R046k718
8245b085q149j8499n72J7021N910K11J4787N561n982n687j3151m455Q556q22N789
8230a567j651N51J2289j645j6177j5594N702J3847M499M032r163q956j1157J1464
$$ plain form
8216 -13526 -12072 -19283 -17763 -7837 -2638 -1288 -6401 276 5450 5183 9731 9391 -4244 -20152 -2830
8201 -2830 3181 2147 -8552 -9180 -17455 -23776 -14052 -1502 6756 19950 21248 5205 -8173 -8835
8187 -8835 3424 7066 17599 27227 16466 12768 -5475 -6887 -4352 -14029 -20327 -23354 -20288 -25932
8173 -25932 -21602 -5440 4251 8066 7427 -492 12491 20102 15671 14505 16510 31206 27048 17064
8159 17064 26578 25320 13418 -2632 -12166 -15136 -27077 -34911 -28528 -27558 -17402 -19698 -32670 -27404
8145 -27404 -35748 -29233 -8164 -5360 -13506 -1991 5468 2436 -545 -13124 -23740 -24092 -29319 -22771
8131 -22771 -14421 -5427 -7252 -1788 8546 3824 5568 9412 5830 5066 -7927 -14350 -10689 -3569
8117 -3569 13003 6321 -6672 -11551 -9635 -8746 -13728 -15063 -14323 -17140 -922 8653 5039 1797 -1032
$$ packed form
8216a3526J454p211J520R926N199J350n113O677N174k67M548l40j3635j5908J7322
8201b830O011j034j0699o28q275o321R724J2550Q258J3194J298j6043j3378o62
8187h835J2259L642J0533R628j0761l698j8243j412K535r677o298l027L066n644
8173b5932M330J6162R691L815o39p919J2983P611m431j166K005J4696m158r984
8159A7064R514j258j1902j6050r534k970j1941p834O383R70J0156k296j2972N266
8145b7404q344O515K1069K804q146J1515P459l032k981j2579j0616l52n227O548
8131b2771Q350Q994j825N464J0334m722J744L844l582p64j2993o423L661P120
8117c569J6572o682j2993m879J916Q89m982j335P40k817J6218R575l614l242k829
$$ plain form
8102 -1032 -8495 -17599 -6116 8416 10795 -4546 2340 3348 -24454 -5096 8620 1887 -11510
8089 -11510 -20669 -10488 -2697 -11749 -14176 -11267 3158 11831 14891 387 -6253 -30115 -21082 -10949
8075 -10949 -5680 -3672 -5720 -16355 -14046 -7834 -7635 4293 -768 -8786 -9479 -14480 -13961 -6803 -9750
8060 -9750 -22406 -26467 -16508 3476 7871 7599 9963 4505 4141 -6460 -6006 -9613 -14225 -10137 -2186
8045 -2186 -903 -12487 -15630 -16228 -14601 -5087 -2941 -13851 -24395 -18400 -8198 -4182 -9073 6658
8031 6658 5368 -8326 -13675 -12025 -16622 -18146 -22042 -13988 -12426 -1825 5754 -12809 -12887 -12062 2288
8016 2288 -2925 -8690 5634 12701 6928 -4335 -4596 998 -9521 -9424 6828 -3504 -6442 -8536
8002 -8536 2091 -2430 -5942 -5289 -7525 -218 3207 12858 23179 13224 6622 9243 16101 14981 -3790
$$ packed form
8102a032p463r104J1483J4532K379j5341O886J008k7802J9358J3716o733j3397
8089a1510r159J0181P791r052k427K909J4425Q673L060j4504o640k3862R033J0133
8075a0949N269K008k048j0635K309O212J99J1928n061q018o93n001N19P158k947
8060i750j2656m061R959J9984M395k72K364n458l64j0601M54l607m612M088P951
8045b186J283j1584l143n98J627R514K146j0910j0544N995J0202M016m891J5731
8031F658j290j3694n349J650m597j524l896Q054J562J0601P579j8563p8Q25J4350
8016B288n213n765J4324P067n773j1263k61N594j0519R7J6252j0332k938k094
8002h536J0627m521l512O53k236P307L425R651J0321r955o602K621O858j120j8771
$$ plain form
7987 -3790 -320 4575 -9003 -20056 -21805 -19017 -15208 -26593 -23826 -26595 -20293 -7960 3175 9618
7973 9618 11562 -4128 -16998 -15590 -6335 -7073 -6507 8434 21992 17657 30914 25512 22291 24893
7959 24893 8053 -5508 -4562 10764 15380 18931 13105 18884 18372 13332 19843 11249 8522 10262
7945 10262 21608 15488 -1869 -12752 -2607 -3540 4989 6955 -121 -7595 -17482 -25154 -4465 16739
7931 16739 9512 -6243 789 12143 17003 7680 3531 -5784 -11524 -10995 -13840 -17290 -12736 -12741 -10641
7916 -10641 -3114 14539 26211 36968 20877 -574 4631 7576 5494 -2909 -13378 -16561 270
7903 270 5090 20321 8087 -14062 -12701 -19344 -13889 -1827 1058 2596 17447 19677 20303 8562
7889 8562 4026 13104 14322 8043 -11019 -19500 -9432 -13445 -19378 -20034 -23125 -15908 -3557 -3303 -2714
$$ packed form
7987c790L470M895j3578j1053j749K788L809j1385K767k769O302J2333J1135O443
7973I618J944j5690j2870J408R255p38N66J4941J3558m335J3257n402l221K602
7959B4893j6840j3561R46J5326M616L551n826N779n12n040O511q594k727J740
7945A0262J1346o120j7357j0883J0145r33Q529J966p076p474r887p672K0689K1204
7931A6739p227j5755P032J1354M860r323m149r315n740N29k845l450M554nK100
7916a0641P527J7653J1672J0757j6091k1451N205K945k082q403j0469l183J6831
7903B70M820J5231j2234k2149J361o643N455J2062K885J538J4851K230O26j1741
7889H562m536R078J218o279j9062q481J0068m013n933o56l091P217J2351K54N89
$$ plain form
7874 -2714 5284 8678 15158 16191 15783 29610 46776 42478 28713 26575 15566 19152 7625 10129
7860 10129 1823 -12006 -24990 -19792 -15256 -8457 76 19771 24154 24301 7200 -232 -8230 -6856
7846 -6856 -2155 6017 7159 3394 3364 4076 90 -4601 -2672 5156 5371 -1345 5077 21013 19678 10520
7830 10520 -19746 -30090 -12422 -9794 -6150 -536 -6408 4989 3422 -10474 -25199 -24560 -16102
7817 -16102 -13254 -8382 4567 7627 3997 2271 5386 8330 14065 9216 3132 420 6947 1674
7803 1674 -7777 -8709 -17741 -27323 -19657 2479 18557 16118 4782 1059 -3319 -9848 -3562 -9460
7789 -9460 -8702 -12204 -15442 -9910 -4465 -13685 -11441 -15146 -15481 -13474 -16847 -24810 -20507 -2083 -7935
7774 -7935 -15843 -13512 -8162 -6923 -1935 -2300 -16361 -8504 -16405 -35933 -39680 -34154 -32100 -31145 -41903
$$ packed form
7874b714P998L394O480J033m08J3827J7166m298j3765k138j1009L586j1527K504
7860A0129q306j3829j2984N198M536O799Q533J9695M383J47j7101p432p998J374
7846f856M701Q172J142l765l0P12l986m691J929P828K15o716O422J5936j335r158
7830A0520l0266j0344J7668K628L644N614n872J1397j567j3896j4725O39Q458
7817a6102K848M872J2949L060l630j726L115K944N735m849o084k712O527n273
7803A674r451r32r032r582P666K2136J6078k439j1336l723m378o529O286n898
7789i460P58l502l238N532N445r220K244l705l35K007l373p963M303J8424n852
7774g935p908K331N350J239M988l65j4061P857p901j9528l747N526K054R55j0758
$$ plain form
7759 -41903 -33063 -20158 -8745 -4979 -17490 -21563 -7650 732 223 -9864 -15650 -14401 -12227 -9174
7745 -9174 -4614 -5743 3210 19040 27673 5065 -7552 -337 -5463 -1610 -8200 -13802 -11585 -9339
7731 -9339 -20342 -32319 -14241 -4981 -7397 -17452 -10060 -5225 -22725 -20286 2749 2735 -4300 -15819
7717 -15819 -21297 -22543 -19011 -26776 -23027 -19840 -29027 -33291 -19976 -17223 -8242 2173 -4326 -4018
7703 -4018 -8353 -2594 3434 1895 10456 18918 9266 4249 -416 -10482 -6513 15208 21351 4187
7689 4187 -4449 -15258 -7023 -12694 -11629 -7433 -7023 -7594 2834 5076 1887 8894 4610 -2218 -26
7674 -26 -6082 -4300 4684 -5237 -2738 -1390 2046 4281 1404 -6485 -10219 5977 -6355 -9664 403
7659 403 -2555 -4739 9926 14148 -592 -3249 -3159 -6922 -12389 -5794 -4566 -8974 -11554 -14069 -5078
$$ packed form
7759d1903Q840J2905J1413L766j2511m073J3913Q382n09j0087n786J249K174L053
7745i174M560j129Q953J5830Q633k2608j2617P215n126L853o590n602K217K246
7731i339j1003j1977J8078R260k416j0055P392M835j7500K439K3035j4p035j1519
7717a5819n478j246L532p765L749L187r187m264J3315K753Q981J0415o499L08
7703d018m335N759O028j539Q561Q462r652n017m665j0066L969K1721O143j7164
7689D187q636j0809Q235n671J065M196M10n71J0428K242l189P007m284o828K192
7674b6o056J782Q984r921K499J348L436K235k877p889l734J6196j2332l309J0067
7659D03k958k184J4665M222j4740k657R0l763n467O595J228m408k580k515Q991
$$ plain form
7644 -5078 3303 -11213 -11158 -9059 -16999 -33941 -37108 -30299 -4776 9196 -1694 -11104 -17471 -28301
7630 -28301 -18869 -11407 -23935 -23280 -20189 -4047 -4577 -12512 -19225 -21689 -13414 -15833 -20249 -21915 -13335
7615 -13335 -19930 -16870 541 1907 -9202 -3784 1125 143 6005 11506 6750 11078 14112 17220
7601 17220 14827 -1532 -514 6932 1815 -5362 -5539 -1377 3688 -8071 -15937 -9565 1188 14286
7587 14286 4370 -3552 -12651 -15114 -8546 -16161 -23583 -8894 8566 4098 -4169 -4355 5083 -4425
7573 -4425 -15614 -17210 -11677 -12396 -28369 -40884 -29013 -18738 -22003 -10024 -1909 -11881 -15631 -7779
7559 -7779 -9185 -16032 -7519 -27681 -38716 -43140 -34748 -8922 4782 -1450 13370 28843 26637
7546 26637 12408 2462 -6957 -332 -247 1266 -181 -10494 -15668 -7273 -6842 -10575 -11134 -5177 -200
$$ packed form
7644e078Q381j4516N5K099p940j6942l167O809K5523J3972j0890r410o367j0830
7630b8301R432P462j2528O55L091J6142n30p935o713k464Q275k419m416j666Q580
7615a3335o595L060J7411J366j1109N418M909r82N862N501m756M328L034L108
7601A7220k393j6359J018P446n117p177j77M162N065j1759p866O372J0753J3098
7587A4286r916p922r099k463O568p615p422J4689J7460m468q267j86R438r508
7573d425j1189j596N533p19j5973j2515J1871J0275l265J1979Q115r972l750P852
7559g779j406o847Q513k0162j1035m424Q392K5826J3704o232J4820J5473k206
7546B6637j4229r946r419O625Q5J513j447j0313n174Q395M31l733n59N957M977
$$ plain form
7531 -200 6893 7002 -2063 -9243 2876 21570 27344 17550 5016 -3377 -2219 869 -15926 -20864
7517 -20864 -16748 -6226 -15837 -27381 -28308 -20100 -20259 2225 13837 11936 1344 -7235 6887 19771
7503 19771 11508 4744 -554 -10790 -12066 -10583 -7665 -18460 -21605 -20988 -11190 -13543 -10959 503
7489 503 8322 14317 24791 13953 13672 24988 16448 7090 3431 8207 10567 8319 -10778 -15892
7475 -15892 -2744 -3801 -4981 -6251 -14582 -6160 10780 22628 31660 26978 -1831 -28622 -37584
7462 -37584 -34329 -18686 -25344 -25271 -18575 -3107 7656 8848 12341 9480 3175 1626 9904 11818
7448 11818 12787 24399 15717 -5491 -16165 -14634 -22157 -20941 -1040 4366 -7103 -18141 -19448
7435 -19448 -12161 -7536 -15195 -26706 -3726 14265 -3595 -16803 -30365 -18528 -16480 -9833 -2451
$$ packed form
7531b00P093J09r065p180J2119J8694N774r794j2534q393J158L088j6795m938
7517b0864M116J0522r611j1544r27Q208j59K2484J1612j901j0592q579J4122J2884
7503A9771q263o764n298j0236j276J483K918j0795l145O17R798k353K584J1462
7489E03P819N995J0474j0838k81J1316q540r358l659M776K360k248j9097n114
7475a5892J3148j057j180j270q331Q422J6940J1848R032m682k8809k6791q962
7462c7584L255J5643o658P3O696J5468J0763J192L493k861o305j549Q278J914
7448A1818R69J1612q682k1208j0674J531p523J216J9901N406j1469j1038j307
7435a9448P287M625p659j1511K2980J7991j7860j3208j3562J1837K048O647P382
$$ plain form
7422 -2451 -11792 -7547 -6157 -12479 3843 -258 1493 -1235 -9258 -11781 -16439 -2108 -1826 -11616 -11544
7407 -11544 -12502 -15064 -17186 -9903 -2378 752 -3060 -4096 535 8879 5102 772 256 3478 8978
7392 8978 12765 7606 -7726 -9035 4611 10675 3257 -12545 -14434 -10811 1248 2983 2501 -8049
7378 -8049 -7748 -6928 -8600 3442 9639 9722 15957 14921 7364 -5682 -2995 15979 9409 -3677 -8598
7363 -8598 -17841 -17054 -19962 -15690 -7555 -6383 -3431 -9628 -11901 -20523 -22795 -33082 -27868 -29917 -17526
7348 -17526 -14474 -2916 -3805 3375 2098 -5711 1756 -675 -10687 -20010 -6572 6855 2369 -16465
7334 -16465 -15750 -8549 -15115 -16130 -17271 -9847 -8978 -13208 -13968 -6534 -7100 6913 16137 15429 15516 14029
7318 14029 4252 2513 1493 14416 21751 18226 9716 5606 -4418 -9112 -7370 -4277 -2642 -607
$$ packed form
7422b451r341M245J390o322J6322m101J751k728q023k523m658J4331K82r790P2
7407a1544r58k562k122P283P525L130l812j036M631Q344l777m330n16L222N500
7392H978L787n159j5332j309J3646O064p418j5802j889L623J2059J735m82j0550
7378h049L01Q20j672J2042O197Q3O235j036p557j3046K687J8974o570j3086m921
7363h598r243P87k908M272Q135J172K952o197k273q622k272j0287N214k049J2391
7348a7526L052J1558q89P180j277p809P467k431j0012r323J3438J3427m486j8834
7334a6465P15P201o566j015j141P424Q69m230p60P434n66J4013R224p08Q7j487
7318A4029r777j739j020J2923P335l525q510m110j0024m694J742L093J635K035
$$ plain form
7304 -607 3505 -1162 -3411 -17966 -19600 -6569 -8507 -3326 -11869 -11425 -11009 -7693 -2790 -3109 2990
7289 2990 -2953 60 3612 -16375 -14666 -14205 -25774 -16875 -7977 -3741 1539 -9582 -11757 -18736
7275 -18736 -16976 -7752 -12181 -19109 -17835 2728 324 -8181 -11269 -11348 -5873 8036 4679 -36 -2147
7260 -2147 -9019 -13936 7984 13522 1947 -7046 -18375 -11458 3486 22581 23110 4627 -4656 -5408
7246 -5408 -22972 -21300 -1050 5206 3394 7305 13242 27463 27658 14106 8126 11110 4725 -2932
7232 -2932 -714 5525 4973 -2168 -7330 -3771 5502 6487 7817 -19427 -21282 -19431 -24970 -9188 13188
7217 13188 27435 19017 -1954 3238 2805 15593 10175 2126 6878 -10157 -3000 5319 -16907 -33038
7203 -33038 -23720 -14296 -14190 -6643 -7197 -7015 -10801 -22832 -22022 -35568 -25985 -3317 7499 13683 7268
$$ packed form
7304f07M112m667k249j4555j634J3031j938N181q543M44M16L316M903l19O099
7289B990n943L013L552j9987J709M61j1569Q899Q898M236N280j1121k175o979
7275a8736J760R224m429o928J274K0563k404q505l088p9N475J3909l357m715k111
7260b147o872m917K1920N538j1575q993j1329O917J4944J9095N29j8483r283p52
7246e408j7564J672K0250O256j812L911N937J4221J95j3552n980K984o385p657
7232b932K218O239n52p141n162L559R273R85J330k7244j855J851n539J5782K2376
7217A3188J4247q418k0971N192m33J2788n418q049M752j7035P157Q319k2226j6131
7203c3038R318R424J06P547n54J82l786j2031Q10j3546R583K2668J0816O184o415
$$ plain form
7188 7268 3861 9135 -959 3660 -2281 -7318 -6465 -14622 -18562 -19145 -20419 -13187 2816 8300 6563
7173 6563 -9842 -12104 -19161 -25966 -20800 -12712 2682 820 -15459 -19394 -15888 -12567 -17037 -238
7159 -238 13758 2886 1364 -9339 -28738 -42991 -36718 -29442 -24885 -19877 -14461 -11600 -12635 -17890
7145 -17890 -31182 -28099 -17623 -5033 -37 2618 1726 -9037 -13137 2456 -979 -4724 -10893 -21741
7131 -21741 -21531 -20518 -11806 -10668 -5750 -6650 -16269 -16175 -7472 7224 -579 5286 1200 -10858 -4539
7116 -4539 5019 -2200 4661 -4138 -12782 -7470 -9969 -11789 -165 -2766 -9635 9733 4715 2096
7102 2096 -6286 -9008 -10131 -12548 -4246 976 4247 -1841 -7180 3250 14549 15213 27160 23614
7088 23614 14423 6948 -2806 -8501 -1217 -4852 -16329 -22519 -39605 -38770 -29553 -14947 -6368 11235
$$ packed form
7188G268l407N274j0094M619n941n037Q53q157l940n83j274P232J6003N484j737
7173F563j6405k262p057o805N166Q088J5394j862j6279l935L506L321m470J6799
7159b38J3996j0872j522j0703j9399j4253O273P276M557N008N416K861j035n255
7145a7890j3292L083J0476J2590M996K655q92j0763m100J5593l435l745o169j0848
7131b1741K10J013Q712J138M918r00r619R4Q703J4696p803N865m086j2058O319
7116d539R558p219O861q799q644N312k499j820J1624k601o869J9368n018k619
7102B096q382k722j123k417Q302N222L271o088n339J0430J1299O64J1947l546
7088B3614r191p475r754n695P284l635j1477o190j7086Q35R217J4606Q579J7603
$$ plain form
7074 11235 15893 -2835 -4845 -12404 -6079 5406 16330 6693 6257 -7332 -22078 -12222 -12191 -12875
7060 -12875 -6483 -5050 -1811 -10987 -24138 -26658 -9851 -4995 -3516 651 -5858 -14222 -5747 -2832
7046 -2832 -13016 -13095 2152 8147 8013 8060 13089 13266 -4375 -16952 -25442 -21736 8890 7272 1670
7031 1670 14199 6572 10043 21487 14585 -7734 -8504 -5213 1753 10485 14231 11676 -2253 -12360
7017 -12360 -10541 -4805 -1748 -8160 -8426 -9409 -8645 -5952 -4006 -9524 -8030 2449 632 -4741 -16452
7002 -16452 -12749 -8597 4818 9620 -6699 -14091 -25482 -14950 -4556 -1183 -5065 -1886 4832
6989 4832 11135 4556 18057 16377 9007 6799 7318 8357 9532 -9551 -17511 1290 -6828 -24106
6975 -24106 -33907 -41356 -41266 -29342 -3119 15436 18833 -7054 -34364 -23581 -13783 -3995 4597 -5476
$$ packed form
7074A1235M658j8728k010p559O325J1485J0924r637m36j3589j4746R856L1o84
7060a2875O392J433L239r176j3151k520J6807M856J479M167o509q364Q475K915
7046b832j0184p9J5247N995j34M7N029J77j7641j2577q490L706L0626j618n602
7031A670J2529p627L471J1444o902k2319p70L291O966Q732L746k555j3929j0107
7017a2360J819N736L057o412k66r83P64K693J946n518J494J0479j817n373j1711
7002a6452L703M152J3415M802j6319p392j1391J0532J0394L373l882L179O718
6989D832O303o579J3501j680p370k208N19J039J175j9083p960J8801q118j7278
6975b4106r801p449R0J1924K6223J8555L397k5887k7310J0783R798R788Q592j0073
$$ plain form
6961 -5476 1015 -2097 1445 -500 -5355 1792 -13600 -25550 -18385 -11987 -981 3730 8211 4794
6947 4794 -19015 -29580 -16470 441 -1975 -8983 12601 23190 15773 11993 -346 3699 -2539
6934 -2539 6349 14487 11406 9045 -2187 -193 20682 26299 13512 4940 -7867 -9701 -23177 -13261
6920 -13261 5711 7781 5476 12635 7011 -6305 -8432 4148 -1430 -12860 -21046 -10488 11217
6907 11217 25784 21990 9817 4634 2980 -7099 2774 10914 22179 25728 33963 32654 23438 20189
6893 20189 25970 8645 -19913 -14724 -4001 299 11657 12146 13076 28225 31654 18903 18613 15597
6879 15597 16981 12896 20411 23247 19680 17789 20203 20159 26997 14943 8421 21550 41526 56084
6865 56084 95811 144969 151150 122074 88619 61852 43503 38826 33868 34970 35616 22857 20900
$$ packed form
6961e476O491l112L542j945m855P147j5392j1950P165O398J1006M711M481l417
6947D794k3809j0565J3110J6911k416p008K1584J0589p417l780j2339M045o238
6934b539Q888Q138l081k361j1232J994K0875N617j2787q572j2807j834j3476R916
6920a3261J8972K070k305P159n624j3316k127J2580n578j1430q186J0558K1705
6907A1217J4567l794j2173n183j654j0079R873Q140J1265L549Q235j309r216l249
6893B0189N781j7325k8558N189J0723M300J1358M89R30J5149L429j2751k90l016
6879A5597J384m085P515K836l567j891K414m4O838j2054o522J3129J9976J4558
6865E6084L9727M9158O181k9076l3455k6767j8349m677m958J102O46j2759j957
$$ plain form
6852 20900 21247 9559 8382 24685 43224 51194 47974 39541 32452 13471 20944 24749 29351 25397
6838 25397 8930 1702 -3362 734 1947 24311 42427 48805 56751 46952 38796 43309 55498 43400
6824 43400 35051 21487 19365 21833 19920 21825 24984 24008 14930 12340 11029 9475 25965 27810
6810 27810 16924 11896 19955 -2820 -9604 2423 6620 24310 32175 37132 37308 19829 1404
6797 1404 -4981 -2912 -6485 -15259 -13169 2684 7912 -2044 -2944 7994 12204 18935 41370 43212
6783 43212 43287 43536 31528 35217 31224 21521 9215 5610 -3090 3077 2042 29297 34728 29694 32908
6768 32908 20113 18997 27157 37468 36885 32742 32379 26383 28012 42808 66431 89116 97181 85454
6754 85454 73829 62132 65315 84048 109190 122622 135481 163786 187663 200683 210273 220250
$$ packed form
6852B0900L47j1688j177J6303J8539P970l220q433p089j8981P473L805M602l954
6838B5397j6467p228n064M096J213K2364J8116O378P946r799q156M513J2189j2098
6824D3400q349j3564k122K468j913J905L159r76r078k590j311j554J6490J845
6810B7810j0886n028Q059k2775o784J2027M197J7690P865M957J76j7479j8425
6797A404o385K069l573q774K090J5853N228r956r00J0938M210O731K2435J842
6783D3212P5K49j2008L689l993r703j2306l605q700O167j035K7255N431n034L214
6768C2908j2795j116Q160J0311n83m143l63n996J629J4796K3623K2685Q065j1727
6754H5454j1625j1697L183J8733K5142J3432J2859K8305K3877J3020R590R977
$$ plain form
6742 220250 217439 185971 154349 150225 164450 159556 138621 141359 150258 175949 207690 247769 284129
6729 284129 313336 359796 430075 556200 743808 1016384 1438671 2061292 2907727 3796743
6719 3796743 4293258 4038431 3162523 2190945 1470425 993240 699081 501201 362947 274332
6709 274332 225413 164165 124457 121063 112072 95681 85533 80281 90284 87010 80542 87512 109016
6696 109016 134922 137282 124662 99567 74425 53365 41903 37104 40455 35906 37343 30354 21545
6683 21545 23539 9122 8262 15942 16768 9948 5704 5044 -13516 -20866 -23043 -5972 525 738 -6655
6668 -6655 4990 13657 4627 -1537 -5954 -14517 -14879 -2173 -4808 9774 17538 9284 -3526 -6185
6654 -6185 -890 2818 11711 9302 4954 3090 17750 14320 5990 4735 14081 20053 25830 22309 12051
$$ packed form
6742B20250k811l1468l1622m124J4225m894k0935K738Q899K5691L1741M0079L6360
6729B84129K9207M6460P0279J26125J87608K72576M22287O22621Q46435Q89016
6719C796743M96515k54827q75908r71578p20520m77185k94159j97880j38254q8615
6709B74332m8919o1248l9708l394q991j6391j0148n252J0003l274o468O970K1504
6696A09016K5906K360j2620k5095k5142k1060j1462m799L351m549J437o989q809
6683B1545J994j4417q60P680Q26o820m244o60j8560p350k177J7071O497K13p393
6668f655J1645Q667r030o164m417q563l62J2706k635J4582P764q254j2810k659
6654f185N295L708Q893k409m348j864J4660l430q330j255R346N972N777l521j0258
$$ plain form
6639 12051 -3193 -8352 -5915 2212 3895 -3763 -4120 2159 4878 23179 26084 14878 13719 23721
6625 23721 10628 -1658 -9088 -7244 -1033 -14143 -4067 1481 6860 -8789 -23202 -2719 7521
6612 7521 10533 174 8607 7280 -5793 -14719 1224 10102 9954 -5443 3490 4423 -2072 2856
6598 2856 14553 18196 13230 14051 4088 -8321 -7525 -11101 -20797 -19760 -10653 -9360 -17040 -16678 -18471
6583 -18471 17 -18302 -18563 -3770 -3620 863 7106 -6790 -4969 8991 15986 25271 18382 15443
6569 15443 1603 -3046 5249 10546 3526 -2728 -10675 -9599 -5618 -6591 -6164 -2951 -4905 -2175 2496
6554 2496 -2492 -18337 -21539 -24982 -24635 -4635 -13394 -26379 -27635 -22106 -8345 -6210 -9515 -14698
6540 -14698 -14802 -9950 -13456 -22214 -19984 -10224 -9381 -25644 -11874 -13833 -7678 -4932 -8283 -6967 -7370
$$ packed form
6639A2051j5244n159K437Q127J683p658l57O279K719J8301K905j1206j159J0002
6625B3721j3093j2286p430J844O211j3110J0076N548N379j5649j4413K0483J0240
6612G521L012j0359Q433j327j3073q926J5943Q878j48j5397Q933R33o495M928
6598B856J1697L643m966Q21r963j2409P96l576r696J037R107J293p680L62j793
6583a8471J8488j8319k61J4793J50M483O243j3896J821J3960O995R285o889k939
6569A5443j3840m649Q295N297p020o254p947J076L981r73M27L213j954K730M671
6554B496m988j5845l202l443L47K0000q759j2985j256N529J3761K135l305n183
6540a4698j04M852l506q758K230R760Q43j6263J3770j959O155K746l351J316m03
$$ plain form
6525 -7370 -5108 -4134 11195 3528 -14609 -21585 -15531 -2529 1128 -6626 -2797 1567 3377 6883
6511 6883 -6563 -17427 -18247 404 13085 10727 2706 -10980 -5337 -7364 -20227 -16214 -15493 -21073
6497 -21073 -28967 -19723 -4599 -3274 -7592 -22457 -5727 -2737 2603 2206 -11763 -20763 -15734 -6035
6483 -6035 6146 8019 12736 14603 24311 23558 25187 17612 8976 13038 17872 15008 22059 25373 4054
6468 4054 -14177 -24022 -28497 -18077 -11721 -10387 -4430 67 1488 -839 -4489 -3521 -712 -513 -5273
6453 -5273 -13765 -19407 -17079 -5898 5356 11104 6425 12691 10467 631 -6920 -10726 -356 -10374
6439 -10374 -28305 -15648 -27331 -28787 -15099 -4071 -1414 13726 3990 -12670 -23268 -11699
6427 -11699 3149 12651 9308 3083 -17670 -5413 -1649 -369 3443 -7494 -7351 -2778 -1600 7394
$$ packed form
6525g370K262R74J5329p667j8137o976O054J3002L657p754L829M364J810L506
6511F883j3446j0864q20J8651J2681k358q021j3686N643k027j2863M013P21n580
6497b1073p894R244J5124J325m318j4865J6730K990N340l97j3969r000N029R699
6483f035J2181J873M717J867R708p53J629p575q636M062M834k864P051L314k1319
6468D054j8231r845m475J0420O356J334N957M497J421k327l650R68K809J99m760
6453e273q492n642K328J1181J1254N748m679O266k224r836p551l806J0370j0018
6439a0374j7931J2657j1683j456J3688J1028K657J5140r736j6660j0598J1569
6427a1699J4848R502l343o225k0753J2257L764J280L812j0937J43M573J178Q994
$$ plain form
6413 7394 6026 -3585 -13920 -13786 -9693 -22154 -21838 -3351 -4607 -5876 -7200 -6588 -8862 -12916 -15508
6398 -15508 -6157 -7957 -21468 -27111 -17742 -2211 1080 19609 31166 28780 19685 23707 18834 17531
6384 17531 19116 8917 3833 -2605 -26669 -28794 -13143 -14575 -29462 -27805 -23345 -14553 -5939 -16351
6370 -16351 -20403 -4371 3721 -3612 -6684 -12478 -9128 -3784 151 560 2234 -3907 -24118 -24980 -28411
6355 -28411 -34368 -35656 -35995 -29787 -8424 -6459 -2273 3699 -7420 -10815 5516 6524 9081 11533
6341 11533 4187 -4857 1742 9771 4200 -3567 5830 12035 18376 -6873 -10534 -4319 6490 10052
6327 10052 8175 17756 18037 2799 -5757 -10943 -9668 4611 6282 10149 24477 29068 17898 10290
6313 10290 1693 11283 10865 6658 -81 1227 7849 18052 20544 5627 3316 1254 -7106 -6690 4762
$$ packed form
6413G394j368r611j0335J34M093j2461L16J8487j256j269j324O12k274m054k592
6398a5508R351j800j3511n643R369J5531L291J8529J1557k386r095M022m873j303
6384A7531J585j0199n084o438k4064k125J5651j432j4887J657M460Q792Q614j0412
6370a6351m052J6032Q092p333l072n794L350N344L935M09J674o141k0211q62l431
6355b8411n957j288l39O208K1363J965M186N972j1119l395J6331J008K557K452
6341A1533p346r044O599Q029n571p767R397O205O341k5249l661O215J0809L562
6327A0052j877R581K81j5238q556n186J275J4279J671L867J4328M591j1170p608
6313A0290q597R590m18m207o739J308O622J0203K492j4917k311k062q360M16J1452
$$ plain form
6298 4762 206 -8631 -8524 -2710 -8804 -11264 -5437 4888 8119 5997 12972 7291 -3896 -8237 -22921
6283 -22921 -14989 -686 6000 526 -5649 -11457 -16381 -18230 -9102 6148 8699 11283 10687 9305
6269 9305 -16149 -29498 -10220 1084 9778 10628 15116 15809 11604 19153 19976 4731 11869 22804
6255 22804 14003 7670 10660 -5901 -12919 -1922 7780 14554 14220 11587 6264 9735 22871 12329
6241 12329 2586 6286 15517 12603 -2588 -5106 -914 -5655 -7672 -1743 1771 -22081 -14713 -4225
6227 -4225 -12573 -9462 4307 14632 4541 1947 3856 -5290 -4086 -6166 -12617 -14878 -17376 -9032
6213 -9032 993 13545 15938 12189 1939 3520 3997 4302 -3335 -6363 -4608 -20080 -32863 -21143
6199 -21143 -15478 -7998 1937 7772 -10504 -17360 -10626 -20429 -23693 -16066 -13341 2451 2283 -5646
$$ packed form
6298D762m556q837J07N814o094k460N827J0325L231k122O975n681j1187m341j4684
6283b2921P932J4303O686n474o175n808m924j849R128J5250K551K584n96j382
6269I305k5454j3349J9278J1304Q694Q50M488O93m205P549Q23j5245P138J0935
6255B2804q801o333K990j6561p018J0997R702O774l34k633n323L471J3136j0542
6241A2329r743L700R231k914j5191k518M192m741k017N929L514k3852P368J0488
6227d225q348L111J3769J0325j0091k594J909r146J204k080o451k261k498Q344
6213i032J0025J2552K393l749j0250J581M77L05p637l028J755j5472j2783J1720
6199b1143N665P480R935N835j8276o856O734r803l264P627K725J5792j68p929
$$ plain form
6185 -5646 -17805 -23476 -10314 -10415 -3022 -8923 -1662 -14093 -15425 -12032 -7302 -2871 -2505 -13793
6171 -13793 -22000 -27207 -29700 -28068 -31546 -15268 -350 13537 665 -6045 -5076 3797 1145 -6378
6157 -6378 -22285 -23201 -12021 -1300 7888 4474 -9666 -4221 -16907 -15748 -11224 -10397 -10807 -9402
6143 -9402 -6636 -7120 -5361 -3576 -7078 -1265 -805 8856 18976 7346 -928 -12287 -9399 10620
6129 10620 5013 9557 18063 11873 10948 -2916 -12052 -1367 6518 15325 14632 1179 -8026 6703
6115 6703 6681 268 -1623 -5792 -799 2997 8378 14402 18820 20366 23174 17747 5896 9921 -2331
6100 -2331 -14163 -12710 -4355 -17854 -35447 -26170 -13031 27 5918 656 17660 21551 13927
6087 13927 12643 11164 4649 -4428 -235 -2411 1772 8811 12969 16839 17595 20365 12934 -1797 -7447
$$ packed form
6185e646j2159n671J3162j01P393n901P261j2431j332L393M730M431L66j1288
6171a3793q207n207k493J632l478J6278J4918J3887j2872o710R69Q873k652p523
6157f378j5907r16J1180J0721R188l414j4140N445j2686J159M524Q27m10J405
6143i402K766m84J759J785l502N813M60R661J0120j1630q274j1359K888K0019
6129A0620n607M544Q506o190r25j3864r136J0685P885Q807o93j3453r205J4729
6115F703k2o413j891m169M993L796N381O024M418J546K808n427j1851M025j2252
6100b331j1832J453Q355j3499j7593R277J3139J3058N891n262J7004L891p624
6087A3927j284j479o515r077M193k176M183P039M158L870P56K770p431j4731n650
$$ plain form
6072 -7447 -6014 -11293 -18216 -25169 -17424 -3792 3594 -13367 14682 26818 32309 23685 25379 27688
6058 27688 23768 15023 5672 755 856 -6865 -10923 -16318 -10675 8320 2811 -8232 -7835 2423
6044 2423 -1876 -3485 -1518 23 -5584 -13358 -9265 -16790 -21401 -14041 -2573 9243 6862 13565
6030 13565 17535 11629 10038 8976 2924 9342 15929 17878 18780 606 2794 9938 15551 12769 -409
6015 -409 -11197 -13626 -712 10120 -4919 -29911 -38867 -33646 -31400 -27374 -19557 -21652 -17475 -9229
6001 -9229 704 11184 15292 4193 -4063 -5774 -9132 -10626 -21392 -22762 -16404 -6194 -12062 -16777
5987 -16777 -15401 -16872 -13046 -6254 9461 11355 5234 4241 9310 4752 -20807 -32845 -18479 -8474
5973 -8474 562 -6783 -2125 -4133 -24628 -33441 -27528 -25857 -18156 -2929 -723 8707 -320 -1873
$$ packed form
6072g447J433n279o923o953P745J3632P386j6961K8049J2136N491q624J694K309
6058B7688l920q745r351m917J01p721m058n395N643J8995n509j1043L97J0258
6044B423m299j609J967J541n607p774M093p525m611P360J1468J1816k381O703
6030A3565L970n906j591j062o052O418O587J949R02j8174K188P144N613k782j3178
6015d09j0788k429J2914J0832j5039k4992q956N221K246M026P817k095M177Q246
6001i229R933J0480M108j1099q256j711l358j494j0766j370O358J0210n868m715
5987a6777J376j471L826O792J5715J894o121r93N069m558k5559j2038J4366J0005
5973h474R036p345M658k008k0495q813N913J671P701J5227K206R430r027j553
$$ plain form
5959 -1873 -7261 3052 12384 6127 -8156 -18488 -132 7680 -7430 -3517 -1519 8113 -1170 -17265
5945 -17265 -22298 -20174 -10442 915 19214 25029 34193 25494 1165 -1543 16217 18748 -6836
5932 -6836 -5138 1074 3584 -4368 -4140 -2985 -5127 -9086 -10334 2152 4781 10956 12469 5711 3469
5917 3469 5685 682 -3413 -1326 -2359 -5093 1733 9023 21072 30400 28707 32059 19357 171
5903 171 -7562 -18885 -33505 -26108 -2197 7615 1192 2689 -1425 -3073 5189 -11441 -12621 -5671
5889 -5671 6456 6601 10467 11854 5051 -11471 -15132 -12090 -3483 10563 10892 -511 -7949 -11923
5875 -11923 247 15064 14665 6521 -6481 -12456 -10646 -11488 -14066 -19273 -9259 -2448 7640 -2725
5861 -2725 -21997 -39553 -20742 -7243 -12498 -822 18354 26841 36310 35544 20453 7994 80
$$ packed form
5959a873n388J0313R332o257j4283j0332J8356P812j5110L913J998R632r283j6095
5945a7265n033K124R732J1357J8299N815R164q699k4329k708J7760K531k5584
5932f836J698O212K510p952K28J155k142l959j248J2486K629O175J513o758k242
5917C469K216n003m095K087j033k734O826P290J2049R328j693L352j2702j9186
5903A71p733j1323j4620P397K3911R812o423J497m114j648Q262j6630j180O950
5889e671J2127J45L866J387o803j6522l661L042Q607J4046L29j1403p438l974
5875a1923J2170J4817l99q144j3002n975J810q42k578n207J0014O811J0088j0365
5861b725j9272j7556J8811J3499n255J1676J9176Q487R469p66j5091j2459p914
$$ plain form
5848 80 -339 -1945 -6345 -10638 12322 30116 24149 14178 7882 -1445 -3324 -3447 -6507 1008 -7774
5833 -7774 1836 14906 16996 5106 -5184 -434 6444 7918 14017 16224 10774 -49 -12195 -16791
5819 -16791 -25539 -15427 -16634 -11029 -2149 -7111 -6544 -4521 -3475 -1603 -6090 -9688 -15309 -11967 -11374
5804 -11374 -8290 -4677 -7587 -2253 -2635 -11680 -18274 -20036 -17693 -5438 -26812 -37390 -31766 -24538
5790 -24538 -19034 -11282 944 13509 16894 13526 2193 -5580 -11758 -6668 8463 16866 -5321
5777 -5321 -686 2725 3744 -831 -8218 -22417 -19891 -3680 427 4038 10362 8803 -2072 168
5763 168 1277 2160 10520 2610 -1663 -11569 -23184 -13709 172 -1359 1260 -6393 -1009 -1665 -20895
5748 -20895 -14032 -8777 -8606 -6801 -7505 -2237 153 16295 7058 -82 1637 3749 11191 9828 4850
$$ packed form
5848H0m19j606m400m293K2960J7794n967r971o296r327j879j23l060P515q782
5833g774R610J3070K090j1890j0290M750O878J474O099K207n450j0823j2146m596
5819a6791q748J0112j207N605Q880m962N67K023J046J872m487l598n621L342N93
5804a1374L084L613k910N334l82r045o594j762K343J2255k1374j0578N624P228
5790b4538N504P752J2226J2565L385l368j1333p773o178N090J5131Q403k2187
5777e321M635L411J019m575p387j4199K526J6211M107L611O324j559j0875K240
5763A68J109Q83Q360p910m273r906j1615R475J3881j531K619p653N384o56j9230
5748b0895O863N255J71J805p04N268K390J6142r237p140J719K112P442j363m978
$$ plain form
5733 4850 3149 10388 13772 5175 -6466 -595 -4730 -11697 6259 993 -11196 -16491 -26173 -17826
5719 -17826 -5572 890 974 13390 19929 3273 4764 4128 9159 7074 17374 14756 -7631 -21993
5705 -21993 -12857 -12109 -17221 -14761 -21145 -15922 -3959 -1348 5713 15045 6191 4141 5082 6477 12111
5690 12111 12296 11579 -2233 -2328 -1474 -2491 6907 11554 7498 9108 6217 1636 -13461 -12729 65
5675 65 -5267 -12169 2125 7940 18542 4069 6001 14688 21852 16524 1002 10117 9514 892 -6413
5660 -6413 -5581 -10529 297 9789 4600 15019 14366 -5210 -2764 -6442 -18346 -2869 -5548 -5187
5646 -5187 -10235 -5262 13282 -1391 -656 -7077 -6880 1260 -2680 -7220 -3737 -2012 -11170 -24390 -19306
5631 -19306 -5103 -6526 771 -11920 -8110 -1774 -626 -8708 -6493 -1928 631 6982 -4144 -6986
$$ packed form
5733D850j701P239L384q597j1641N871m135o967J7956n266j2189n295r682Q347
5719a7826J2254O462Q4J2416O539j6656J491o36N031k085J0300k618k2387j4362
5705b1993R136P48n112K460o384N223J1963K611P061R332q854k050R41J395N634
5690A2111J85p17j3812r5Q54j017R398M647m056J610k891m581j5097P32J2794
5675F5n332o902J4294N815J0602j4473J932Q687P164n328j5522R115o03q622p305
5660f413Q32m948J0826R492n189J0419o53j9576K446l678j1904J5477k679L61
5646e187n048M973J8544j4673P35o421J97Q140l940m540L483J725r158j3220N084
5631a9306J4203j423P297j2691L810O336J148q082K215M565K559O351j1126k842
$$ plain form
5617 -6986 -14157 -21809 -23064 -11384 -18536 -22101 -28230 -39587 -41471 -27933 -21516 -30250 -29733 -8619
5603 -8619 -13584 -22344 -13237 -7558 -687 -5338 -16456 -21645 -30868 -35272 -23438 -21512 -19897 -20270 -25131
5588 -25131 -20606 -14206 -9733 3927 14982 9996 -921 -6624 -22474 -20076 -2714 823 -1685
5575 -1685 -2225 -5479 -10553 3472 10564 12312 15905 3150 -140 1137 -2382 -9238 -21638 -25253
5561 -25253 -27120 -16335 -4723 -13683 -8885 -13065 -17787 -23682 -26546 -28869 -25459 -11361 2245 -13556
5547 -13556 -13019 -7299 -11665 -15407 -24059 -31729 -18607 -21206 -19711 -17476 -19550 -26585 -14937 6975
5533 6975 14389 2721 5848 17164 13978 -5592 -21247 -27931 -19076 966 11405 17539 18043 13816
5519 13816 12531 18470 4535 -13294 -25011 -20221 -9642 -15497 -12257 -13737 -13313 4311 10852 493
$$ packed form
5617f986p171p652j255J1680p152l565o129j1357j884J3538O417q734N17K1114
5603h619m965q760R107N679O871m651j1118n189r223m404J1834J926J615l73m861
5588b5131M525O400M473J3660J1055m986j0917n703j5850K398J7362L537k508
5575a685n40l254n074J4025P092J748L593j2755l290J277l519o856j2400l615
5561b5253j867J0785J1612q960M798m180m722n895k864k323L410J4098J3606j5801
5547a3556N37N720m366l742q652p670J3122k599J495K235k074p035J1648K1912
5533F975P414j1668L127J1316l186j9570j5655o684Q855K0042J0439O134N04m227
5519A3816j285N939j3935j7829j1717M790J0579n855L240j480M24J7624O541j0359
$$ plain form
5505 493 -15001 -18963 3764 9091 -1627 9353 21798 17490 4740 -806 4369 -9826 -22662
5492 -22662 -20863 -1432 10751 9917 7330 6448 -12073 -11608 5098 9440 7548 18263 16384 3745
5478 3745 19334 25195 6598 -4586 -2630 -3191 -3279 902 -8316 -22126 -23307 -22656 -16866 -10223 -3084
5463 -3084 -15879 -14049 -5997 -13813 -13920 -6948 -10883 -6188 -795 11273 17147 10271 1626 3424 -6029
5448 -6029 1614 187 47 -2994 -12849 -6838 -3087 18046 26948 10661 -8271 -1735 19810 8640
5434 8640 1848 -5404 -3044 -5356 -19254 -750 8273 12391 10908 2810 -7643 -14623 -4872 1889
5420 1889 1551 8937 10870 5375 -999 8705 10200 1832 5616 5972 -1264 -2411 5277 10412 10380 2109
5404 2109 -2236 4758 -617 2133 14023 15724 11000 7288 -4659 -19246 -1925 8168 3243 -8956
$$ packed form
5505D93j5494l962K2727N327j0718J0980J2445m308j2750n546N175j4195j2836
5492b2662J799J9431J2183q34k587q82j8521M65J6706M342j892J0715j879j2639
5478C745J5589N861j8597j1184J956n61q8M181r218j3810j181O51N790O643P139
5463c084j2795J830Q052p816j07O972l935M695N393J2068N874o876q645J798r453
5448f029P643j427j40l041r855O011L751K1133Q902j6287j8932O536K1545j1170
5434H640o792p252K360k312j3898J8504R023M118j483q098j0453o980R751O761
5420A889l38P386J933n495o374R704J495q368L784L56p236j147P688N135l2q271
5404B109m345O994n375K750J1890J701m724l712j1947j4587J7321J0093m925j2199
$$ plain form
5390 -8956 -10362 -17963 -20011 -5573 5131 -5388 -10617 -5823 -14113 -29354 -24663 -15680 -14771 -11655
5376 -11655 -3253 -5187 -14950 -17985 -19076 -17739 -18314 -16822 -18344 -20699 -15014 -6364 4107 -7411
5362 -7411 -10228 -12808 -13659 -18801 -14417 -13214 7200 22257 33476 33515 31666 16781 -1518 -33999
5348 -33999 -33869 -16026 11661 18084 27700 24898 8563 -1512 -8732 -3175 12106 18357 14330 -3853
5334 -3853 5249 15052 16459 8389 22617 21413 15581 1077 1572 8323 16694 11701 10527 13384 10459
5319 10459 13421 9213 -12790 -5650 15257 7897 -5776 2168 -666 1124 12948 1733 -6163
5306 -6163 -10362 -20832 -13351 -21495 -21119 -11722 -5048 6808 10766 9353 13292 628 -9897 -4623
5292 -4623 -20648 -32448 -28430 -17411 -7485 6331 11591 -193 -6400 -7305 -15473 -35402 -20811
$$ packed form
5390h956j406p601k048J4438J0704j0519n229M794q290j5241M691Q983R09L116
5376a1655Q402j934r763l035j091J337n75J492j522k355N685Q650J0471j1518
5362g411k817k580q51n142M384J203K0414J5057J1219L9j849j4885j8299l2481
5348c3999J30J7843K7687O423R616k802j6335j0075p220N557J5281O251m027j8183
5334c853R102R803J407q070J4228j204n832j4504M95O751Q371m993j174K857k925
5319A0459K962m208k2003P140K0907p360j3673P944k834J790J1824j1215p896
5306f163m199j0470P481q144L76R397O674J1856L958j413L939j2664j0525N274
5292d623j6025j1800M018J1019R926J3816N260j1784o207r05q168j9929J4591
$$ plain form
5279 -20811 -2573 -2750 -12475 -8597 -11124 -23514 -29838 -23265 -20104 -16263 -510 1542 -9881 -13720
5265 -13720 -10018 -8346 -7284 -6962 -2397 5928 1540 1664 12363 12450 2712 -4735 2391 9102 -1927
5250 -1927 -7179 -2520 -1244 6303 11122 13067 8903 13760 6041 -5463 -20230 -33195 -33113 -27116 -26544
5235 -26544 -14003 -14385 -17508 -24575 -26689 -21436 -18345 -17873 -1477 -5517 -15417 -16291 -7856 -5357 -9210
5220 -9210 -7142 -5295 2218 10699 15615 13460 -8595 -7869 -5855 -5214 -6514 -6731 783 7621 11839
5205 11839 125 -947 1124 4967 805 3184 -11557 -18390 -26812 -27407 -10131 6505 3182 4555
5191 4555 6020 547 5814 7859 6664 4927 -1235 -4210 14314 16681 10677 14564 31366 30512 21915
5176 21915 9081 -3374 -6674 -4463 -9877 -753 -8542 -15360 7104 4190 1309 740 10709 13567
$$ packed form
5279b0811J8238j77r725L878k527j2390o324O573L161L841J5753K052j1423l839
5265a3720L702J672J062L22M565Q325m388J24J0699Q7r738p447P126O711j1029
5250a927n252M659J276P547M819J945m164M857p719j1504j4767j2965Q2N997N72
5235b6544J2541l82l123p067k114N253L091M72J6396m040r900q74Q435K499l853
5220i210K068J847P513Q481M916k155k2055P26K014O41j300k17P514O838M218
5205A1839j1714j072K071L843m162K379j4741o833q422n95J7276J6636l323J373
5191D555J465n473N267K045j195j737o162k975J8524K367o004L887J6802q54q597
5176B1915j2834j2455l300K211n414R124p789o818K2464k914k881n69R969K858
$$ plain form
5162 13567 9449 10250 5617 7789 9238 17407 13129 15680 8527 -375 -3055 5736 2160 4722 23645
5147 23645 28387 24328 10019 751 -17649 -18588 -22027 -13858 -4267 916 -4208 -13309 -7305 -13677
5133 -13677 -5987 7939 9475 16640 27636 25366 -2267 -8776 -2760 -5168 -1016 9158 2768 -5137
5119 -5137 -4499 -2539 3994 -1377 -16229 -23240 -25960 -2587 7236 16242 12760 6681 -3514 -11441
5105 -11441 -13349 -11426 428 11139 15060 8217 12412 9436 1980 9637 -3736 -7964 -9984 -3508
5091 -3508 -4557 -10625 -6054 -7496 4281 9726 -1747 -6625 7684 16909 15935 13556 -3437 806
5077 806 -16989 -22270 -16024 -12638 -12036 8846 7861 -8492 -15532 -17420 -12684 -10406 -6548 6110 9949
5062 9949 6424 5414 -11607 -3675 10741 16452 4130 -9891 -11962 -6989 10048 5846 -1640 4363
$$ packed form
5162A3567m118Q01m633K172J449Q169m278K551p153q902k680Q791l576K562J8923
5147B3645M742m059j4309r268j8400r39l439Q169R591N183n124r101O004o372
5133a3677P690J3926J536P165J0996k270k7633o509O016k408M152J0174o390p905
5119e137O38J960O533n371j4852p011k720K3373R823R006l482o079j0195p927
5105a1441j908J923J1854J0711L921o843M195k976p456P657j3373m228k020O476
5091c508j049o068M571j442J1777N445j1473m878J4309R225r74k379j6993M243
5077H06j7795n281O246L386O02K0882r85j6353p040j888M736K278L858J2658L839
5062I949l525j010j7021P932J4416N711j2322j4021k071M973J7037m202p486O003
$$ plain form
5048 4363 15426 15612 14977 16261 6129 18333 40308 27351 6459 -1145 9271 12539 19570 21614
5034 21614 8429 5848 14199 1950 1778 14860 22012 20140 23594 6478 -1577 -7256 -1442 -3614
5020 -3614 -11459 -13869 -12411 -10992 -13456 -7457 -24249 -41561 -29372 -16309 -2135 17705 10754
5007 10754 571 438 2420 -7042 -19419 -20067 -12693 -16295 -3775 5511 -5335 -2143 8366 11824
4993 11824 11993 -5878 -16533 -10542 2750 10120 10231 21401 25347 9150 -20305 -29753 -20530 -10603
4979 -10603 -14294 -13128 -7123 -9865 2488 17947 13523 -2586 -3507 2431 15420 20739 18892 -4493
4965 -4493 -17794 -9472 -3323 4533 16082 11706 -8543 2109 7832 13872 10220 7733 15247 7850
4951 7850 1727 8661 6162 1428 9872 1503 2363 -3059 -4796 718 -10476 -12389 -22065 -23455 -7626
$$ packed form
5048D363J1063J86o35J284j0132J2204K1975j2957k0892p604J0416L268P031K044
5034B1614j3185k581Q351j2249j72J3082P152j872L454j7116q055n679N814k172
5020c614p845k410J458J419k464N999j6792j7312J2189J3063J4174J9840o951
5007A0754j0183j33J982r462j2377o48P374l602J2520R286j0846L192J0509L458
4993A1824J69j7871j0655N991J3292P370J11J1170L946j6197k9455r448R223R927
4979a0603l691J166O005k742J2353J5459m424j6109r21N938J2989N319j847k3385
4965d493j3301Q322O149P856J1549m376k0249J0652N723O040l652k487P514p397
4951G850o123O934k499m734Q444q369Q60n422j737N514j1194j913r676j390J5829
$$ plain form
4936 -7626 -1626 -5581 -6310 2005 5697 4736 1363 -7650 -437 -4662 -6320 12397 15552 1149 -16077
4921 -16077 -24864 -10566 -631 -14645 -30209 -21477 -8783 -647 -8541 -9600 1716 14517 14028
4908 14028 2539 -15253 -11494 7778 160 -12317 -10905 -5197 -14128 -13337 -13464 -22266 -19320 -6055
4894 -6055 5576 13514 17103 6092 810 -8495 1839 108 -11235 -16206 -6424 -15765 -18441 -2283
4880 -2283 3258 2990 1746 7860 -3914 -12848 -7634 -5478 -17158 -10783 11151 27324 48049 46191
4866 46191 29312 19854 11224 10589 2855 -6176 -10216 -24333 -26854 -25605 -15417 3290 12341 848
4852 848 -3400 10858 15282 8763 11198 5344 11936 16504 20195 4690 -1218 3992 7202 129 6883
4837 6883 12047 7683 3744 2734 -2310 -3562 6264 9815 -4892 -13061 -13852 -22868 -15837 -17004 -17428
$$ packed form
4936g626O000l955p29Q315L692r61l373r013P213m225j658J8717L155j4403j7226
4921a6077q787J4298R935j4014j5564Q732J2694Q136p894j059J1316J2801m89
4908A4028j1489j7792L759J9272p618j2477J412N708q931P91j27q802K946J3265
4894f055J1631P938L589j1011n282r305J0334j731j1343m971R782r341k676J6158
4880b283N541k68j244O114j1774q934N214K156j1680O375K1934J6173K0725j858
4866D6191j6879r458q630o35p734r031m040j4117k521J249J0188J8707R051j1493
4852H48m248J4258M424o519K435n854O592M568L691j5505n908N210L210p073O754
4837F883N164m364l939j010n044j252R826L551j4707q169p91r016P031j167m24
$$ plain form
4822 -17428 -11689 -6118 -3973 3916 -2262 -15278 -4420 11807 6202 743 9184 11467 16330 13823
4808 13823 8416 -4128 -5563 11426 18971 19441 21298 26742 12351 6469 -1061 -3878 8949 10122
4794 10122 1024 -6645 -7940 -13712 -20170 -23601 -24617 -22588 -13136 -12481 -22037 -14444 7014 15150 3012
4779 3012 -3756 -4623 1069 3174 -430 11133 18382 27547 31465 28025 24280 29072 25335 30807 16458
4764 16458 249 -13482 3183 6947 -5152 -18600 -15982 -19350 -15290 -19859 -17155 -24089 -16975
4751 -16975 -19304 -17008 -16592 -13486 -19718 -15742 -17488 -13973 -21968 -34220 -29945 -20070 -3647 6649
4737 6649 -3034 -20452 -17328 -4180 8572 14811 4422 4027 16127 16247 7982 -4305 -15465 -15712
4723 -15712 -11011 -18129 -13254 -1715 -5854 -9949 -5533 -15418 -8890 4932 4872 15874 15251 7409 9391
$$ packed form
4822a7428N739N571K145P889o178j3016J0858J6227n605n459Q441K283M863k507
4808A3823n407j2544j435J6989P545M70J857N444j4391n882p530k817J2827J173
4794A0122r098p669j295n772o458l431j016K029R452O55r556P593K1458Q136j2138
4779C012o768q67N692K105l604J1563P249R165L918l440l745M792l737N472j4349
4764A6458j6209j3731J6665L764j2099j3448K618l368M060m569K704o934P114
4751a6975k329K296M16L106o232L976j746L515p995j2252M275R875J6423J0296
4737F649r683j7418L124J3148J2752O239j0389l95J2100J20q265j2287j1160k47
4723a5712M701p118M875J1539m139m095M416r885O528J3822o0J1002o23p842J982
$$ plain form
4708 9391 11362 10157 10363 7695 12087 12225 6358 5914 -1817 -1423 11535 13082 5691 -3503 151 1909
4692 1909 882 -5827 -8353 3934 7181 379 -4798 -12011 -8657 -5984 -1785 3033 -740 -5642 -7859
4677 -7859 -9979 -8843 -5601 -754 1322 13181 10950 -6355 -21778 -30611 -25820 -27344 -12679 -2603
4663 -2603 428 824 2425 269 13209 15322 12232 5775 5640 8728 8527 -2516 -3533 -112 10154
4648 10154 19788 19431 6981 -4963 6489 5708 8093 7213 -1492 4902 16829 12297 -5061 -8856
4634 -8856 -3942 2043 11217 18239 19729 20928 24210 3254 2586 689 696 5714 -7976 -27264 -13810
4619 -13810 4871 7186 -801 -17833 -19315 -16739 -7556 5233 5477 2281 4622 6912 1784 -2092
4605 -2092 -1095 -4889 809 6070 -771 -12276 -16117 -10158 -9846 -1820 -7601 -4632 2314 11025 8819
$$ packed form
4708I391J971j205K06k668M392J38n867m44p731L94J2958J547p391r194L654J758
4692A909j027o709k526J2287L247o802n177p213L354K673M199M818l773m902k217
4677g859k120J136L242M847K076J1859k231j7305j5423q833M791j524J4665J0076
4663b603L031L96J601k156J2940K113l090o457j35L088k01j1043j017L421J0266
4648A0154R634l57j2450j1944J1452p81K385q80q705O394J1927m532j7358l795
4634h856M914N985R174P022J490J199L282k0956o68j897PN018j3690j9288J3454
4619a3810J8681K315p987j7032j482K576R183J2789K44l196K341K290n128l876
4605b092R97l794N698N261o841j1505l841N959L12Q026n781K969O946Q711k206
$$ plain form
4590 8819 -10335 -16376 -16092 -17056 -23704 -12493 3096 7132 9435 24438 17886 5908 3728 10444
4576 10444 21413 28703 26117 20231 23450 29036 13419 2183 6482 1342 10861 -2990 -8121 -9128
4562 -9128 -9424 -9361 -5345 737 1815 6148 6445 -7343 -8156 2416 6937 18376 9171 910 3716
4547 3716 7883 -195 4670 7402 3006 9363 2429 2005 -3670 1208 14881 11143 6712 1059 265
4532 265 3368 15789 3855 -9663 -8139 -272 -170 3042 17869 16651 11961 10074 4140 1479
4518 1479 -4339 -14012 -13722 -15180 -17589 -21138 -12841 -14456 -27715 -26246 -22187 -21298 -8201 10178 20155
4503 20155 8076 -8493 -4157 1312 16005 25450 20175 21168 20178 22183 12737 3215 6509 1923
4489 1923 -20647 -24948 -15419 -5038 5138 5222 15843 13755 -5689 -4603 -5499 2384 13943 8491
$$ packed form
4590H819j9154o041K84r64o648J1211J5589M036K303J5003o552j1978k180O716
4576A0444J0969P290k586n886L219N586j5617j1236M299n140R519j3851n131j007
4562i128k96O3M016O082J078M333K97j3788q13J0572M521J1439r205q261K806
4547C716M167q078M865K732m396O357o934m24n675M878J3673l738m431n653p94
4532B65L103J2421j1934j3518J524P867J02L212J4827j218m690j887n934k661
4518A479n818r673K90j458k409l549Q297j615j3259J469M059Q89J3097J8379R977
4503B0155j2079j6569M336N469J4693R445n275R93r90K005r446r522L294m586
4489A923k2570m301R529J0381J0176Q4J0621k088j9444J086q96P883J1559n452
$$ plain form
4475 8491 -4460 -1507 4839 9889 5287 5419 2838 -1975 3044 9266 11563 13491 15168 3631 -23930
4460 -23930 -15391 -10214 271 4631 -3450 -18477 -17650 1458 14403 11934 13257 18962 15519 18033
4446 18033 25089 32493 42187 35780 26078 24941 22323 21464 14010 -10457 -2163 2131 3705 -13514
4432 -13514 -17973 -13067 1542 9872 10539 1341 11736 7640 -304 2288 9062 8726 28963 35293
4418 35293 24134 -1914 -6325 -11311 -574 -2209 -5369 3606 11144 4218 -7295 -11193 -11313 -19673
4404 -19673 -16743 -1 6641 225 3243 6391 20419 25784 28148 29175 19265 9986 18786 17361
4390 17361 9918 16130 18099 21096 12450 6009 -2700 1237 6244 1145 1538 9221 14006 10799 1683
4375 1683 4691 1487 -2350 -4854 -10941 -2395 10908 5036 -2905 -5942 3966 20251 26754 25077
$$ packed form
4475H491j2951K953O346N050m602J32k581m813N019O222K297J928J677j1537k7561
4460b3930Q539N177J0485M360q081j5027Q27J9108J2945k469J323N705l443K514
4446A8033P056P404R694o407r702j137k618q59p454k4467Q294M294J574j7219
4432a3514m459M906J4609Q330O67r198J0395m096p944K592O774l36K0237O330
4418C5293j1159k6048m411m986J0737j635l160Q975P538o926j1513l898j20q360
4404a9673K930J6742O642o416L018L148J4028N365K364J027r910r279Q800j425
4390A7361p443O212J969K997q646o441q709L937N007n099L93P683M785l207r116
4375A683L008l204l837k504o087Q546J3303n872p941l037R908J6285O503j677
$$ plain form
4361 25077 36385 32012 21886 14202 11105 -2932 -11561 -7274 -271 -2071 81 4071 8795 14430
4347 14430 13504 4731 -9178 -11948 1633 -465 -5115 -11545 -13624 3509 9376 13578 3551 -12900
4333 -12900 -11865 10858 4310 -15032 -6331 12287 13129 8522 -1243 -7426 -17412 -23502 -14570 -31003
4319 -31003 -36723 -31287 -11699 -4840 -4504 -6960 -8710 -8566 4779 10329 21616 27655 25059 16620
4305 16620 944 -4092 -2990 -7077 2422 4108 -8312 8374 5084 -6865 -3124 -15211 -9929
4292 -9929 -3381 -9431 -23837 -25452 -23894 -16138 -28914 -34276 -38285 -31718 -25412 -13902 -2119 14439
4278 14439 18796 10669 16356 23976 13096 6078 9469 6658 10500 2173 7850 17902 11951 277
$$ packed form
4361B5077J1308m373j0126p684l097j4037q629M287P003j800K152L990M724N635
4347A4430r26q773j3909k770J3581k098m650o430k079J7133N867M202j0027j6451
4333a2900J035K2723o548j9342Q701J8618Q42m607r765o183r986o090Q932j6433
4319c1003n720N436J9588O859L36k456j750J44J3345N550J1287O039k596q439
4305A6620j5676n036J102m087R499J686j2420J6686l290j1949L741j2087N282
4292i929O548o050j4406j615J558P756j2776n362m009O567O306J1510J1783J6558
4278A4439M357q127N687P620j0880p018L391k811L842q327N677J0052n951j1674
$$ [...]
##END NTUPLES=NMR SPECTRUM
##END=
