##TITLE=Analysis number 309913
Compound Code cc 34846
Book Reference 399/171
Project Code adrs
Chemist Name evam
##JCAMPDX= 6.0         $$ Bruker NMR JCAMP-DX V2.0
##DATA TYPE= NMR SPECTRUM
##DATA CLASS= NTUPLES
##ORIGIN= Bruker BioSpin GmbH
##OWNER= NMR
$$ XWIN-NMR		Version 3.5
$$ Wed Jun  8 09:50:45 2005 GMT Daylight Time (UT+1h)  MAYBRIDGE\NMR@NMR_250MHZ
##.OBSERVE FREQUENCY= 250.131544655141
##.OBSERVE NUCLEUS= ^1H
##.ACQUISITION MODE= SIMULTANEOUS (DQD)
##.ACQUISITION SCHEME= undefined
##.AVERAGES= 16
##.DIGITISER RES= 18
##SPECTROMETER/DATA SYSTEM= dpx250
##.PULSE SEQUENCE= zg30
##.SOLVENT NAME= CDCl3
##.SHIFT REFERENCE= (INTERNAL, CDCl3, 0, 16.455)
##AUDIT TRAIL= $$ (NUMBER, WHEN, WHO, WHERE, WHAT)
$$ ##TITLE= Audit trail, XWIN-NMR		Version 3.5
$$ ##JCAMPDX= 5.01
$$ ##ORIGIN= Bruker BioSpin GmbH
$$ ##OWNER= NMR
$$ C:\u/data/dgb/nmr/ADRS/3920/pdata/1/auditp.txt
$$ ##AUDIT TRAIL=  $$ (NUMBER, WHEN, WHO, WHERE, WHAT)
(   1,<2005-06-08 09:50:23.57 +100>,<MAYBRIDGE\NMR>,<NMR_250MHZ>,
      <created by zg, POWCHK disabled, PULCHK disabled
       configuration hash MD5:
       62 19 C7 07 E1 42 D1 B7 37 6C 3D D0 77 39 F9 E6
       data hash MD5: 64K
       A4 7D 01 7C 6A C6 9D FD 5E 91 3C 79 69 51 B5 A8>)
(   2,<2005-06-08 09:50:37.87 +100>,<MAYBRIDGE\NMR>,<NMR_250MHZ>,
      <Start of raw data processing
       ef LB = 0.3 FT_mod = 6 PKNL = 1 SI = 32K 
       data hash MD5: 32K
       2E 57 3F F8 A7 93 85 1F BA 7A 56 9A 41 1F 3E 09>)
(   3,<2005-06-08 09:50:39.51 +100>,<MAYBRIDGE\NMR>,<NMR_250MHZ>,
      <apk 
       data hash MD5: 32K
       3C F0 C4 72 1C B0 51 50 47 B7 21 01 CF E1 0C 3C>)
(   4,<2005-06-08 09:50:40.18 +100>,<MAYBRIDGE\NMR>,<NMR_250MHZ>,
      <abs ABSG = 5 
       data hash MD5: 32K
       02 15 3A F5 68 52 8D F7 FD FB AC F9 35 EB B6 85>)
$$ ##END=
$$ 
$$ hash MD5
$$ FD 7C FA 66 98 12 CE BB 18 EC 14 0A BD FE 34 32
##$RELAX= 
##$RELAX= 
##$RELAX= 
##$RELAX= 
##$RELAX= 
##$RELAX= 
##$RELAX= 
$$ Bruker specific parameters
$$ --------------------------
##$DU= <C:\u>
##$EXPNO= 3920
##$NAME= <ADRS>
##$PROCNO= 1
##$TYPE= <nmr>
##$USER= <dgb>
##$AMP= (0..31)
100 100 100 100 100 100 100 100 100 100 100 100 100 100 100 100 100 100 
100 100 100 100 100 100 100 100 100 100 100 100 100 100 
##$AQSEQ= 0
##$AQ_mod= 3
##$AUNM= <au_zg>
##$AUTOPOS= <4 >
##$BF1= 250.13
##$BF2= 250.13
##$BF3= 250.13
##$BF4= 250.13
##$BF5= 500.13
##$BF6= 500.13
##$BF7= 500.13
##$BF8= 500.13
##$BYTORDA= 1
##$CFDGTYP= 0
##$CFRGTYP= 5
##$CHEMSTR= <none>
##$CNST= (0..31)
1 1 145 1 1 1 1 1 1 1 1 1 1 1 1 1 1 1 1 1 1 1 1 1 1 1 1 1 1 1 1 1 
##$CPDPRG= <>
##$CPDPRG1= <>
##$CPDPRG2= <>
##$CPDPRG3= <>
##$CPDPRG4= <mlev>
##$CPDPRG5= <mlev>
##$CPDPRG6= <mlev>
##$CPDPRG7= <mlev>
##$CPDPRG8= <mlev>
##$CPDPRGB= <>
##$CPDPRGT= <>
##$D= (0..31)
0 1 0 0 0 0 0 0 0 0.06 0 0 0 0 0 0 0.0002 0 0 0 0 0 0 0 0 0 0 0 0 0 0 
0 
##$DATE= 1118220622
##$DBL= (0..7)
120 120 120 120 120 120 120 120 
##$DBP= (0..7)
150 150 150 150 150 150 150 150 
##$DBP07= 0
##$DBPNAM0= <>
##$DBPNAM1= <>
$$ [...]
##$SUBNAM7= <"">
##$SUBNAM8= <"">
##$SUBNAM9= <"">
##$SW= 20.6930455092707
##$SWIBOX= (0..15)
0 0 3 0 0 0 0 0 0 0 0 0 0 0 0 0 
##$SW_h= 5175.983436853
##$TD= 65536
##$TD0= 1
##$TE= 295.16
##$TE2= 300
##$TE3= 300
##$TEG= 300
##$TL= (0..7)
0 120 120 120 120 120 120 120 
##$TP= (0..7)
150 150 150 150 150 150 150 150 
##$TP07= 0
##$TPNAME0= <>
##$TPNAME1= <>
##$TPNAME2= <>
##$TPNAME3= <>
##$TPNAME4= <>
##$TPNAME5= <>
##$TPNAME6= <>
##$TPNAME7= <>
##$TPOAL= (0..7)
0.5 0.5 0.5 0.5 0.5 0.5 0.5 0.5 
##$TPOFFS= (0..7)
0 0 0 0 0 0 0 0 
##$TUNHIN= 0
##$TUNHOUT= 0
##$TUNXOUT= 0
##$USERA1= <user>
##$USERA2= <user>
##$USERA3= <user>
##$USERA4= <user>
##$USERA5= <user>
##$V9= 5
##$VALIST= <valist>
##$VCLIST= <CCCCCCCCCCCCCCC>
##$VD= 0
##$VDLIST= <DDDDDDDDDDDDDDD>
##$VPLIST= <PPPPPPPPPPPPPPP>
##$VTLIST= <TTTTTTTTTTTTTTT>
##$WBST= 1024
##$WBSW= 4
##$XGAIN= (0..3)
0 0 0 0 
##$XL= 0
##$YL= 0
##$YMAX_a= 482511
##$YMIN_a= -526449
##$ZGOPTNS= <>
##$ZL1= 120
##$ZL2= 120
##$ZL3= 120
##$ZL4= 120
##$ABSF1= 16.45502
##$ABSF2= -4.238152
##$ABSG= 5
##$ABSL= 3
##$ALPHA= 0
##$AQORDER= 0
##$ASSFAC= 0
##$ASSFACI= 0
##$ASSFACX= 0
##$ASSWID= 0
##$AUNMP= <proc_1d>
##$AZFE= 0.1
##$AZFW= 0.1
##$BCFW= 0
##$BC_mod= 0
##$BYTORDP= 0
##$COROFFS= 0
##$CY= 12.5
##$DATMOD= 1
##$DC= 0
##$DFILT= <>
##$DTYPP= 0
##$F1P= 14.0000005364418
##$F2P= -0.99999901652339
##$FCOR= 0.5
##$FTSIZE= 32768
##$FT_mod= 6
##$GAMMA= 0
##$GB= 0
##$INTBC= 1
##$INTSCL= 1
##$ISEN= 128
##$LB= 0.3
##$LEV0= 0
##$LPBIN= 0
##$MAXI= 10000
##$MC2= 0
##$MEAN= 0
##$ME_mod= 0
##$MI= 0
##$NCOEF= 0
##$NC_proc= -3
##$NLEV= 6
##$NOISF1= 0
##$NOISF2= 0
##$NSP= 0
##$NTH_PI= 0
##$NZP= 0
##$OFFSET= 16.45502
##$PC= 1
##$PHC0= -72.50971
##$PHC1= 3.00955
##$PH_mod= 1
##$PKNL= yes
##$PPARMOD= 0
##$PSCAL= 4
##$PSIGN= 0
##$REVERSE= no
##$SF= 250.130016752278
##$SI= 32768
##$SIGF1= 0
##$SIGF2= 0
##$SINO= 400
##$SIOLD= 32768
##$SREGLST= <1H.CDCl3>
##$SSB= 0
##$STSI= 32768
##$STSR= 0
##$SW_p= 5175.98343685301
##$SYMM= 0
##$S_DEV= 0
##$TDeff= 65536
##$TDoff= 0
##$TI= <Analysis number 999999
Compound Code 99
Book Reference 9
Project Code 9>
##$TILT= no
##$TM1= 0
##$TM2= 0
##$TOPLEV= 0
##$USERP1= <user>
##$USERP2= <user>
##$USERP3= <user>
##$USERP4= <user>
##$USERP5= <user>
##$WDW= 1
##$XDIM= 32768
##$YMAX_p= 420641843
##$YMIN_p= -99082
$$ End of Bruker specific parameters
$$ ---------------------------------
##NTUPLES= NMR SPECTRUM
##VAR_NAME=  FREQUENCY,     SPECTRUM/REAL,   SPECTRUM/IMAG
##SYMBOL=    X,             R,               I
##VAR_TYPE=  INDEPENDENT,   DEPENDENT,       DEPENDENT
##VAR_FORM=  AFFN,          ASDF,            ASDF
##VAR_DIM=   32768,         32768,           32768
##UNITS=     HZ,            ARBITRARY UNITS, ARBITRARY UNITS
##FACTOR=    0.157963299565203, 1,           1
##FIRST=     4115.89465451193, 0,            0
##LAST=      -1060.08878234108, 0,           0
##MIN=       -1060.08878234108, -99082,      0
##MAX=       4115.89465451193, 420641843,    0
$$ Real data points
##PAGE= N=1
##DATA TABLE= (X++(R..R)), XYDATA
$$ [...]
16376b0876L60J09K260J3336p229M858m916m885L939j849M271n924K5299J1222
16362A9975j761K70J7913m824j7891o600j0996l106j2758K030p751O526P036K8857
16348A6920l2969j8647M116R177K0042J5953J3821J0057k838j8014P153M390j0719
16335A8442l922l987K970k771l2343j8673N6N509k130k0374J0077R129j1767q21
16321e0605k80Q907J7949L742r387j4037O029J4872K1923l2693k6281j10J4478
16308d5493K125N919L111R691q8J3172k789J2234m18P507L757P067O205l6364
16294a4364J0826Q209N221p142l2927K125j1693N09K3448J2431J5186l6565j339
16281b6075n024M2527K1251j3743j2534o931N741J8272l365k3812k9253j8442
$$ plain form
16376 -20876 -20516 -20407 -18147 -4811 -12040 -7182 -12098 -16983 -13044 -14893 -10622 -16546 8753 19975
16362 19975 18214 18484 36397 31573 13682 7082 -3914 -7020 -19778 -17748 -25499 -18973 -11937 16920
16348 16920 -16049 -34696 -30580 -21403 -1361 14592 28413 38470 35632 17618 24771 29161 18442
16335 18442 14520 10533 13503 10732 -21611 -40284 -40228 -34719 -36849 -57223 -47146 -38017 -49784 -50605
16321 -50605 -50885 -41978 -24029 -20287 -29674 -43711 -37682 -22810 -887 -33580 -59861 -59971 -45493
16308 -45493 -43368 -37449 -34338 -24647 -24735 -11563 -14352 -2118 -2536 4971 8728 15795 22000 -14364
16294 -14364 -3538 4671 9892 2750 -30177 -28052 -39745 -39236 -15788 -3357 11829 -24736 -26075
16281 -26075 -31099 11428 32679 18936 6402 -529 5212 23484 20119 -3693 -32946 -51388
16269e1388J2488Q063n076j3350j4907J3980Q514M052o039J4303p292K0924J8781
16256C053N455j4517o943q741j4594P495J220m667K8734J7403Q55j0057K873P379
16242A4948P992k2505j1672j300J990J5265J9382J1236Q333J995k7158k0801l923
16229f218j4545n094k144m356j8576j719J1523N229J2181J8434p490o819j6863
16216c6457Q979K4155n264k3585M024K7977L610J1369R315k9176n500l89J1930
16203I88L0526Q571l2565k1517P723M9364r617l2397j2837o103O623j5330j7938
16190d4509J1935J8539J055j4311K879K4557L5838R060j8714j3944k570k031J1651
16177A9435r490p871k15j246l2753j6541L7514K6364j0338N655J585J8167k333
$$ plain form
16269 -51388 -38900 -30837 -35913 -49263 -64170 -50190 -41676 -37624 -43663 -29360 -36652 -15728 3053
16256 3053 8508 -6009 -12952 -21693 -36287 -28792 -27572 -32239 -3505 13898 14753 4696 7569 14948
16242 14948 22940 435 -11237 -12537 -10547 4718 24100 35336 43669 45664 18506 -2295 -6218
16229 -6218 -20763 -25857 -28001 -32357 -50933 -52652 -41129 -35900 -23719 -5285 -12775 -19594 -36457
16216 -36457 -27478 -3323 -8587 -32172 -28148 -171 3439 14808 24123 -5053 -10553 -10942 988
16203 988 31514 40085 7520 -13997 -6274 43090 33473 1076 -11761 -17864 -11241 -26571 -44509
16190 -44509 -32574 -14035 -12980 -27291 -24412 145 35983 45043 26329 12385 9815 7784 19435
16177 19435 9945 2074 1859 613 -32140 -48681 -11167 15197 4859 10514 12099 30266 27933
16164B7933l035j5849p269J5619M093k2646j4637O201K826R781r861m2927k3535
16151g3306J3994K9342J0054L4461j5254k1104L194K0129J2680R910K6876o317
16139D4659k8970l4420l5511P320k269J0132K383o575J8993J2044j7540j9931
16127d9685J7719q3r024q552R337M3163o145k277l868N345K3292J3769m1947k8874
16113c7830m532L5724L1934O553l1132l8977J0476J9390K3057J8367l7417j4571
16101a8958K0723J0884j8063k9851k3973q375l574L772O660N153J3101K5562o56
16088a7595q833L7947j2189k7112N847k35m790K5902J5288N888k8817k0631R859
16075a9471J1411K6640j7560k5674p586L0618L038Q191k0507j9637J0565N961
$$ plain form
16164 27933 24898 9049 1780 17399 21492 -1154 -15791 -9590 -6764 3017 -6844 -49771 -73306
16151 -73306 -59312 -29970 -19916 14545 -709 -21813 -18619 1510 14190 24100 50976 44659
16139 44659 15689 -18731 -54242 -46922 -49191 -39059 -36676 -43251 -24258 -12214 -29754 -49685
16127 -49685 -31966 -32049 -41073 -49625 -40288 2875 -3270 -5547 -9415 -4070 19222 32991 -8956 -37830
16113 -37830 -42362 -6638 25296 31849 717 -38260 -27784 -8394 14663 33030 -4387 -18958
16101 -18958 1765 12649 -5414 -35265 -59238 -67613 -71187 -67415 -60755 -55602 -42501 -16939 -17595
16088 -17595 -26428 11519 -670 -27782 -21935 -22170 -26960 -1058 14230 20118 -8699 -29330 -19471
16075 -19471 -8060 18580 1020 -24654 -32240 -1622 1416 9607 -10900 -30537 -19972 -14011
16063a4011k7509n213j5294J2862J4510K1563J4349j000K3039j2826O327J2140
16051B8937j1671j5332J0043M795J8250n2696Q353L4953o142j3155N417J1404
16039B3156j4862l713J0150j0192J259J0322j3105r88Q162J2092L143j040K32
16026B4616j6740l7455J995j9799P838K7603j7446j0227O409o173N672J2473o379
16013b7613P791m205m966j6223Q646K5475J245O408N532L332J2142o443k1816
16000a0695O46l262j9504R174L2839j5454j3466l0652k172R480K5276J1836Q026
15987B072j0723K11j7524r3J0589M359J2825M3827p846k4238j4773k0502j4549
15974c6365r523J4242K5315N327k0340P855J8401J7265j445o68K272o832k910
$$ plain form
16063 -14011 -41520 -46733 -62027 -49165 -34655 -13092 1257 257 23296 10470 16797 28937
16051 28937 17266 1934 11977 16772 35022 -17674 -9321 25632 19490 6335 11752 23156
16039 23156 8294 4581 14731 4539 5798 16120 3015 2027 10189 22281 25424 24384 24616
16026 24616 7876 -29579 -27584 -47383 -39545 -11942 -29388 -39615 -33206 -39379 -33707 -21234 -27613
16013 -27613 -19822 -24027 -28993 -45216 -36570 -11095 -9850 -3442 2090 5422 17564 11121 -10695
16000 -10695 -10049 -13311 -32815 -23641 9198 -6256 -19722 -50374 -52546 -43066 -17790 -5954 2072
15987 2072 -8651 -8440 -25964 -26057 -15468 -11109 1716 45543 37697 13459 -1314 -21816 -36365
15974 -36365 -45888 -31646 -6331 -1004 -21344 -13489 4912 22177 20732 20064 22336 15504 12594
15961A2594J2121n49o840n680R302m785r160j8598j2698j2058m249m790j543r65
15947d7898P658j085n68J0150O374N676J5345J6255M2814n389p236l1591N118
15934A5623L8707K741l6922j6759R519Q104P341k0201k5364K6471J1181j1706
15922H735R486K20m624l1657J1326o923j0427K906k922j2763P192q974j859k306
15908d2590K9901K5861J5259K741j0415N368k9544j5208k074O22j2282K8269J3067
15895H975j4942j2976r626J693Q781K127K0793K4751R01l7159k8096Q920L2139
15882F281n97k2862m278M3947J0349j2967j5228m109N147j1036j4277J3507N796
15869c27j0345J8146J0898j2630o685J716J0603r300r329k2965p692J9763K7996
$$ plain form
15961 12594 24715 24166 17326 11646 20948 16163 7003 -11595 -24293 -36351 -40600 -45390 -46933 -47898
15947 -47898 -40240 -41325 -41893 -31743 -25369 -19693 -4348 11907 54721 49332 42096 10505 15623
15934 15623 54330 57071 20149 3390 12909 21013 28354 8153 -17211 9260 20441 8735
15922 8735 18221 18441 13817 -17840 -6514 -13437 -23864 -20958 -23880 -36643 -29451 -38425 -40284 -42590
15908 -42590 -12689 13172 28431 31172 20757 26125 -3419 -18627 -20701 -20079 -32361 -4092 8975
15895 8975 -5967 -18943 -28569 -26876 -18095 -15968 4825 29576 30477 -6682 -34778 -25858 6281
15882 6281 5684 -17178 -21456 22491 32840 19873 4645 536 5683 -5353 -19630 -6123 -327
15869 -327 -10672 7474 18372 5742 -943 773 11376 2076 -7253 -30218 -37910 -18147 9849
15856I849J5564q224m809J1914j9623k2414k231L2449Q242j5479k3893j4721J1684
15843b1692n568j7138L2874L8612o472j294k5212j9599j2718q349J311K6420M5722
15830B6897J2185j6666l318k1910j4543l125M987j9122J47j426J3535K9591K4425
15817C1657j834k1584p113q426j8875k7666j192L4979K2613K7917k0202r588M5160
15804D5846K4322r458j0804k1086k616k7160j2229J2259J5512j8720p446K19j5845
15791b7206k585O118l848j3799J8695J1337L69n674n693J7328o347J2405M211
15778E311o325m4800j5310K0491L5530J0456L973J3406k641r509j474j0268j2555
15765a3715K4255o549k3796Q445j925Q201q89k0413N449K233J3260m31N505l9637
$$ plain form
15856 9849 25413 17189 12380 24294 4671 -17743 -19974 12475 20717 5238 -18655 -33376 -21692
15843 -21692 -27260 -44398 -11524 27088 20616 19322 -5890 -25489 -38207 -46556 -45245 -18825 26897
15830 26897 39082 22416 19098 -2812 -17355 -20480 -15493 -34615 -34468 -35894 -22359 7232 31657
15817 31657 29823 8239 1126 -7300 -26175 -53841 -55033 -20054 2559 30476 10274 686 45846
15804 45846 70168 60710 49906 28820 26204 -956 -13185 -926 14586 -4134 -11580 -11361 -27206
15791 -27206 -29791 -23673 -27521 -41320 -22625 -11288 -10919 -16593 -22286 -4958 -11305 1100 5311
15778 5311 -1014 -45814 -61124 -40633 -5103 5353 9326 22732 20091 10582 9108 -1160 -13715
15765 -13715 10540 3991 -19805 -11360 -13285 -5084 -5973 -26386 -20937 -18704 -5444 -5875 -370 -40007
15751d0007l5504L029k308Q598R625M1416j2686o473M742R819J355o726K7565
15738B445J9665j1391K664K5451q604j945k2837n1492m557K7484J1635j2756L4202
15725I964J0709l448q731K889k998N303m360j948p666j9281N100J6448j286J6105
15711A6800k520j5953j2958j5880K5429P63r99m622O584K9787L537j0670l5417
15698a6119J6418L5359K7651l7j4061k0151k1596N261N39Q714j0162k250j6628
15685g062j704j2801l1534R842Q439J2318n332j801N445K6726j476j2206M518
15672f628L5725j3278j6067j815j0107O489J5974R20r101j2615n588K3759Q81
15659H549l0669j1361J6460q675q476j636R326k852L672K6267J7616K0407m874
$$ plain form
15751 -40007 -75511 -72482 -74790 -66192 -56567 -15151 -27837 -34310 -29568 -19749 -18394 -25120 2445
15738 2445 22110 10719 13383 38834 30230 28285 5448 -46044 -50601 -23117 -11482 -24238 9964
15725 9964 20673 17225 8494 11383 8385 13688 9328 7380 -286 -19567 -14467 1981 695 16800
15711 16800 14280 -1673 -14631 -30511 -5082 -4319 -5318 -9940 -3356 26431 29968 19298 -16119
15698 -16119 299 35658 63309 63272 49211 29060 7464 12725 13264 21978 11816 9566 -7062
15685 -7062 -8766 -21567 -53101 -43259 -34820 -22502 -27834 -29635 -24190 2536 1060 -11146 -6628
15672 -6628 29097 15819 -248 -2063 -12170 -5681 10293 11213 2112 -10503 -16091 7668 8549
15659 8549 -22120 -33481 -17021 -25696 -34172 -35808 -26482 -29334 -25662 605 18221 38628 33754
15646C3754l0496j7366j0096k4435J5057L6060o090k6120M457J1473o742J0898
15634i646K371M176l289P879J5306q915k5036j5103j7275K8011K4690j6374j8610
15621c1815N292j0320L464K8430o705k1264j784l320K8369O207j2348J4565j342
15608b571q660o830j4293J0218Q773J3125Q349p591j1145q694J2892M785J3390
15595A1748L0248J1314k1722P627K7197N169j1329j4776l699q766q370r718j3797
15582A126J691K3893Q583P739r434k5060j67J9413r751j2997k2291R114Q128n954
15568e967j8691j3639K3540J6817P036j1089q824Q1K969K1435J0156m112k4567
15555d855r601j0490o279m3P310j65K830J7929J5219L6765j526l7196K686k072
$$ plain form
15646 33754 3258 -14108 -24204 -48639 -33582 2478 -3612 -29732 -25275 -13802 -20544 -9646
15634 -9646 -7275 -3099 -6388 1491 16797 7882 -17154 -32257 -49532 -21521 3169 -13205 -31815
15621 -31815 -26523 -36843 -33379 -4949 -11654 -32918 -34702 -38022 -9653 -3446 -15794 -1229 -2571
15608 -2571 -11231 -18061 -32354 -22136 -13363 -238 8111 520 -10625 -19319 -6427 -1642 11748
15595 11748 41996 53310 31588 39215 66412 71581 60252 45476 41777 33011 24641 14923 1126
15582 1126 2817 26710 35293 43032 33598 8538 8371 27784 18033 5036 -17255 -8141 -13 -5967
15568 -5967 -24658 -38297 -14757 2060 9096 -1993 -10817 -10736 -7767 13668 23824 19712 -4855
15555 -4855 -14456 -24946 -31225 -31268 -23958 -24123 -21293 -3364 11855 48620 47094 9898 12584 10512
15541A0512j0646K518J7595q303K883p58q317Q99l6996k8340J4631L860K970J4386
15527b3106N883n892j0602n764J427J6071J9578K1346O444j8646j8246j7736J387
15514b7856N379O620r730Q218N6200K227J3901J2057k683n9774j6869n617j001
15501a8928k301m462J0875R440P895N4k744n867p901n079J541r712r780L5646
15487a323L889N929K0230j6919l561K8729J3475k7204q842j4859R186M596K9772
15474D3098p346l0555r543J5927j8230j8835K5132J7704L100j9648J1901j3512
15462h07j0119K474K1757M204j2457J808K7115j705k6261l495J2296j8135j0286
15449a3611O882j799Q444j0927j5620K1475L207j337Q284j6688k4390J8228M423
$$ plain form
15541 10512 -134 2384 19979 11676 14559 13801 5484 6383 -30613 -58953 -44322 -40462 -37492 -23106
15527 -23106 -17223 -23115 -33717 -39481 -38054 -21983 -2405 18941 25385 6739 -11507 -29243 -27856
15514 -27856 -22477 -15857 -25587 -17369 38831 41058 54959 67016 64333 4559 -12310 -17927 -18928
15501 -18928 -21229 -25691 -14816 -5376 2519 2573 -171 -6038 -13939 -19018 -17477 -27189 -36969 -1323
15487 -1323 2566 8495 28725 11806 8245 36974 50449 23245 14403 -456 8730 13326 43098
15474 43098 35752 5197 -4346 11581 -6649 -25484 -352 17352 20452 804 12705 -807
15462 -807 -10926 -8452 13305 17509 5052 6860 33975 32270 6009 2514 14810 -3325 -13611
15449 -13611 -6729 -8528 -84 -11011 -26631 -5156 -1949 -3286 4998 -11690 -36080 -17852 -13429
15436a3429l242q850J0599J7401K2134m970K159j6851l3443k1786o825O919J2995
15423c7189Q471p037R399J2641J4267J7861j6391m400J2098o639J2958J2586K451
15410C1076j3598k2379O49J5415r776m3383J2063L3406l948l5646l057K7338P971
15397c869q866L72j6076k2128K299M312K6219P235o829Q664O053J2260J0915K06
15383B0767o989k6553r51q549P319j0683K123J7101L3102J9249k3237j8188j1878
15370g367J2582n517j3906p83j940j7507J4906K6904K1080p09j6533j4671J8308
15357A4847j1563j1129L854K4753k7309k3445j4749O646K2053O455K111j1041
15345a8517J3137k3419j6853L195M0028L5325j1199k498K520N014m019J6221j3371
$$ plain form
15436 -13429 -16671 -25521 -14922 2479 24613 19643 21802 4951 -28492 -50278 -57103 -50184 -37189
15423 -37189 -28718 -35755 -26356 -13715 552 18413 2022 -2378 9720 3081 16039 28625 31076
15410 31076 17478 -4901 -4252 11163 1387 -41996 -29933 3473 -475 -36121 -39178 -11840 -3869
15397 -3869 -12735 -12363 -28439 -50567 -48268 -43956 -17737 -10502 -17331 -8667 -2614 9646 20561 20767
15383 20767 13778 -12775 -13726 -22275 -14956 -25639 -23516 -6415 26687 45936 22699 4511 -7367
15370 -7367 5215 -302 -14208 -14991 -16931 -34438 -19532 7372 28452 27743 11210 -3461 14847
15357 14847 3284 -7845 -3991 20762 -6547 -29992 -44741 -38095 -16042 -9587 -7476 -18517
15345 -18517 -5380 -28799 -45652 -42457 -2429 32896 21697 19199 21719 26733 22714 38935 25564
15332B5564l1361O464m696k1450l918K3011J2703O261k6911l013K4297J4515J3133
15319C4599R064j5261j7675j0473L400j3517m98l337K0718J125j8419j1913J4742
15306g445J4816j3750K1473K0450j7955m5786k7393R158K8438J4k76L0700k0914
15293h470K1309n34O940o18J429l115l1999m488r997N237J6480J7312J5617Q278
15279C3381p886j7130M014m293P498J4910R774K3509r829j3665j0178r513m002
15266A6590L318j4179p221R093o125k1595q471j1754Q466J5544J5165l669j8693
15253b3531k6886j0526m350M5985K3568k399L4349J2846j4390J0014R356j981
15241E2055j8644j7560j6566M290J7417j4583K094k420k4232K929j8764Q075k937
$$ plain form
15332 25564 -5797 667 -4029 -25479 -29397 -6386 6317 12578 -14333 -17346 6951 21466 34599
15319 34599 43663 28402 10727 254 3654 -9863 -10361 -13698 7020 8145 -10274 -22187 -7445
15306 -7445 7371 -6379 15094 35544 17589 -28197 -55590 -46432 -17994 -17980 -18256 12444 -8470
15293 -8470 12839 12305 19245 18627 20056 16941 -15058 -19546 -29543 -24306 -7826 9486 25103 33381
15279 33381 25495 8365 12379 8086 15584 30494 40268 63777 53948 40283 30105 20592 16590
15266 16590 19908 5729 -1492 7601 1476 -20119 -28590 -40344 -31878 -16334 -1169 -4838 -23531
15253 -23531 -50417 -60943 -65293 -19308 4260 1861 36210 49056 34666 44680 54036 52055
15241 52055 33411 15851 -715 3575 20992 6409 8503 6083 -18149 -15220 -33984 -25909 -28846
15228b8846j9220J1806Q142K425K0636J8191k9942j1643O556O717l506k011k072
15215b2767p862K69Q803K2776K2611k6786r585m132K7443K4462M434j4343q66
15202B4457j727j3145k6314J4741K5343j9042l561k545L10j7315L2280p901k7599
15189b2018J7965J623j4477k6303N726L3190K7044N146o745l771R446k9654q310
15176a1138k3527J3572L8r316J0922K0436J6079J3096k0399j259j5272M210j2333
15163a4891k3472K227J6034J6135l279M648J3122j2575o395J297j4763J9259K1479
15150A8826J0520l001q107n670r52q186l331J1335k2001j8378J051K2788K7761
15137B2655J7445k1532j9582l556J2361l213j300M945q393j9964M003j391J171
$$ plain form
15228 -28846 -48066 -36260 -28118 -25693 -5057 13134 -16808 -28451 -21895 -15178 -18684 -20695 -22767
15215 -22767 -30629 -30360 -21557 1219 23830 -2956 -12541 -16673 10770 35232 39666 25323 24457
15202 24457 22730 9585 -16729 -1988 23355 4313 752 -1793 -1483 -18798 13482 5581 -22018
15189 -22018 -4053 -2430 -16907 -43210 -37484 -4294 22750 27896 21151 17380 26826 -2828 -11138
15176 -11138 -34665 -21093 -21055 -30371 -19449 987 17066 30162 9763 8504 -6768 -2558 -14891
15163 -14891 -38363 -36136 -20102 -3967 -7246 -2598 10524 -2051 -8446 -7149 -21912 -2653 18826
15150 18826 29346 26345 18238 12568 11616 3430 99 11434 -10567 -28945 -27894 -5106 22655
15137 22655 40100 18568 -1014 -4570 7791 4578 3278 8223 -170 -20134 -16131 -17522 -16351
15124a6351L468j5748J7249K262R586l467j796j0496p330m312K2680O009j3822
15111a2068J0744L1976J836k9652p498J0464k8796p905P102k6017M28K3956J6068
15098i362Q756j7558j2049k602J6986L6019J9435j91k1858j5737N783J335j7562
15085h605P161J923l908J3457N584K357m618K0278j6878j4028J8171K5815O137
15072E2846l338k1168m4412j4951K4942K4276p857k7535J2768l599J2507k4772
15060b0293m5427l184K4131J197R45K0674Q253K5097r90r539r456K460q71P19
15046f284K3822K927o988m0000m556J9359j871K9398l338J4923L134k4763k4816
15033a9053l3856N113J3812l375j025Q523j1732j2659P234N418K8495K4028k382
$$ plain form
15124 -16351 -12883 -28631 -11382 -9120 466 -3001 -4797 -15293 -22623 -26935 -4255 1754 -12068
15111 -12068 -1324 30652 32488 2836 -4662 5802 -22994 -30899 -23797 -49814 -49386 -25430 -9362
15098 -9362 -606 -18164 -30213 -32815 -15829 20190 39625 39434 17576 1839 7622 8957 -8605
15085 -8605 -1444 479 -3429 10028 15612 17969 13351 33629 16751 2723 20894 46709 52846
15072 52846 49508 28340 -16072 -31023 -6081 18195 10338 -17197 -4429 -8028 4479 -20293
15060 -20293 -65720 -68904 -44773 -43576 -42631 -21957 -13704 11393 10403 864 -8592 -6132 -7003 -6284
15046 -6284 17538 20465 13477 -26523 -31079 -11720 -13591 15807 12469 27392 30526 5763 -19053
15033 -19053 -52909 -47796 -33984 -37359 -38384 -29861 -41593 -54252 -47018 -41600 -13105 10923 8541
15020H541m046Q931r552q641J5320J0159K242j0384k9007q216L9906J8155K1999
15007E5407K8105j6594k028P680M524l016m638N122n131R791J4653L2497Q0121
14994B06493J06082J71117K70725M43572Q03574J133726Q6688r36852q11547n20502
14984I53076k89888j65398r5799r3237p1590m8776k1586j7118l4437Q001K0228
14973A43476j948J2104K6966k580l9603p586J1921k3094l0596J4334K7026K6717
14961A57137J5302l1010l5359o025J1580Q414j9014m020N245L0309K2949L4347
14949A89855k2238K849K7183J5909l8008m1244j6719p916L2586J3321k1208j5753
14937A18617k6083j9106j1311R253L667k882j674j1898j064m703j5953J3307J0354
$$ plain form
15020 8541 4495 13426 3874 -4767 10553 20712 22954 12570 -16437 -24653 15253 33408 55407
15007 55407 83512 66918 64890 72570 77094 74078 69440 74562 69431 79222 93875 126372 206493
14994 206493 312575 483692 754417 1197989 2001563 3135289 3221977 2285125 1473578 953076
14984 953076 663188 497790 401991 308754 237164 188388 166802 149684 115247 123248 143476
14973 143476 141528 153632 180598 178018 138415 130829 142750 119656 89060 103394 130420 157137
14961 157137 172439 141429 106070 100045 111625 120039 101025 97005 102250 132559 155508 189855
14949 189855 167617 170466 197649 213558 175550 134306 117587 109671 142257 155578 134370 118617
14937 118617 92534 73428 62117 71370 75037 72155 70481 58583 57519 52816 36863 50170 60524
14924F0524j5477k944J6932J7156Q930k3834k6416n701J4736J2795J2179k4294
14912D4586m154p388r522Q462j1123k4357l3326K2447L2332O905J1877Q358J4207
14899E9304Q592k2361j2488k6662k1727J6677K6166M806P789K856l851q770j1228
14886A9103K345N499r748l5013p932J822K3512J0960j1078J0797P250J4375R99
14873C2891m458j9097l4661j3913k7788M108M8406L9422q234o082J3586j1842
14861A2338j6259j1642q133P363L819j8514j85J3166O999j2826o702O394O594
14848a7588j504J2615j5112J4159j3376j6630j268N423K3252n154j2679j8326
14836d6188j1232J4272J5429J3025J2055J6213L2855n282k2197P676M869j3209
$$ plain form
14924 60524 45047 42103 59035 76191 85121 61287 34871 29170 43906 56701 68880 44586
14912 44586 40432 33044 23522 31984 20861 -3496 -36822 -14375 17957 24862 36739 45097 59304
14899 59304 67896 45535 33047 6385 -15342 1335 27501 32307 40096 42952 39101 30331 19103
14886 19103 21448 26947 17199 -17814 -25746 -23924 -412 10548 -530 10267 17517 31892 32891
14873 32891 28433 9336 -25325 -39238 -67026 -62918 -14512 24910 16676 10594 24180 12338
14861 12338 -3921 -15563 -23696 -16333 -12514 -31028 -31213 -18047 -11048 -23874 -30576 -24182 -17588
14848 -17588 -19092 -6477 -21589 -7430 -20806 -37436 -38704 -33281 -10029 -15183 -27862 -46188
14836 -46188 -57420 -43148 -27719 -14694 -2639 13574 46429 41147 18950 26626 31495 18286
14824A8286n092k866R584J3194m894k0990K2134L419k1275J4895m304O62j8649
14811D104R849o061J2721J1420l8550j3271R224o774k4861P308J912k6J1213K2982
14797A190J5586k8639l2539M745J6217Q975q832J6031K8522J3503K1046R953l3296
14784C2462k4874k0441p145Q507P289j0718J9392N585j5536L082m706J875P047
14771A819j7827K5813L310n674j8941j1959L877n601j2056O768M459N55J0166
14758a5291K5960n667k1032o94O525K3284j9564j6060K1393J6370m559p547P357
14745A0475J4378j0787P449l2198K23O215J0765M869k6343n731J4557M810o240
14732g558q311J8835J4681P335j4926O491j727j6408L590J4527j060r157j1217
$$ plain form
14824 18286 13194 10328 19912 33106 28212 7222 29356 32775 11500 26395 22091 22753 4104
14811 4104 13953 7892 20613 32033 -6517 -19788 -10564 -17338 -42199 -34891 -32979 -33005 -21792 1190
14797 1190 16776 -11863 -44402 -39657 -23440 -14465 -23297 -7266 21256 34759 55805 65758 32462
14784 32462 7588 -12853 -19998 -11491 -4202 -14920 4472 10057 -5479 -2397 -7103 -5228 1819
14771 1819 -16008 9805 13115 7441 -11500 -23459 -19582 -25183 -37239 -30471 -26012 -25457 -15291
14758 -15291 10669 5002 -16030 -16724 -10199 13085 -6479 -22539 -1146 15224 10665 3118 10475
14745 10475 24853 14066 21515 -10683 -10460 -4245 6520 11389 -14954 -20685 -6128 -1318 -7558
14732 -7558 -15869 2966 17647 24982 10056 16547 14820 -1588 2002 16529 15469 6312 -4905
14719d905k1404J5551J6636J3760o073m418k3841k8058J3765O221K2007m735J7211
14706A1717J2754m657n165j0267o924j5937J0667K2227Q899k0782l1108j9485
14694d8061M662K9599j0072j8397L2544R212J28N313j0328p184p616k508n739
14681b8447J2837Q615l536j1531J686L3742n495o28k555R713L1651l5J0343J0864
14667F7224m1349m1531N204J8302q152j1490j1598k2819J3427K0249P548Q503
14655C518J125J4897J833L492k0059l0301l8205m102J499J9356J5438K3299J0054
14642A844J8797O098J7320j3115j3060q808O736k4193m523l573k2977K2105J7141
14629b08r504O79k40L330J7208K9385j2542l1639J7536J2549j9987J5862j435
$$ plain form
14719 -4905 -26309 -10758 5878 19638 13565 9147 -14694 -42752 -28987 -22766 -759 -5494 11717
14706 11717 24471 19814 14649 4382 -2542 -18479 -7812 14415 23314 2532 -28576 -48061
14694 -48061 -43399 -13800 -23872 -42269 -9725 -513 -385 4928 -5400 -12584 -20200 -22708 -28447
14681 -28447 -15610 -6995 -10531 -22062 -20376 13366 7871 7243 4688 14401 46052 46017 56360 67224
14667 67224 25875 -15656 -10452 7850 -302 -11792 -23390 -46209 -32782 -12533 -4985 3518
14655 3518 4643 19540 21373 24865 4806 -25495 -63700 -67802 -66303 -46947 -31509 -8210 1844
14642 1844 20641 26739 44059 30944 17884 9076 15812 -8381 -12904 -16477 -39454 -17349 -208
14629 -208 -9712 -9033 -9273 -5943 11265 40650 28108 -3531 14005 26554 6567 22429 20994
14616B0994j5105O041J9250J7975j5448k7430n889j4479P287K485l5784j9486
14604e9589O221J2433K0035p808J6832J328J1187M423k2838k2839l959M1484L8924
14591C5834P888j7901p164J1515M94J2250M725l1282k7531J6399O34j0286M186
14578b39K7103J1532k302L470j3866k444r663j4556j8817J862J8267r635l801
14565a3089L089j2420j266J5572N996j7266J0738r345o083K2918j6580k7130m287
14552d9153K7528L3094K2595j1128j1081k5949J1400M8672J4737j7817j8722r59
14540B3217Q119M990k3252k8369j3718N153Q56L2290o39j6446K72q083j490K0302
14526C202L1750J0647j2550n331k5008k4081J4706K2773J7249k585j7748p641
$$ plain form
14616 20994 5889 11930 31180 49155 33707 6277 388 -14091 -6804 -4319 -40103 -59589
14604 -59589 -53368 -40935 -20900 -28708 -11876 -10548 639 5062 -17776 -40615 -44574 -3090 35834
14591 35834 43722 25821 18657 30172 30666 42916 47641 16359 -11172 5227 5861 -4425 -239
14578 -239 26864 38396 36094 39564 25698 23254 13591 -965 -19782 -17920 347 -9288 -13089
14565 -13089 -10000 -22420 -23686 -8114 -2118 -19384 -8646 -17991 -24074 -1156 -17736 -44866 -49153
14552 -49153 -21625 11469 34064 22936 11855 -14094 -2694 45978 60715 42898 24176 23217
14540 23217 31336 36326 13074 -15295 -29013 -23860 -23004 9286 8647 -7799 -7527 -15610 -17100 3202
14526 3202 34952 45599 33049 27718 2710 -21371 -6665 16108 33357 30772 13024 5383
14514E383n84r376P497M817J2068o916j0050k3249J2028K9936j865k386J7306
14501C4609O716k2918k4023j3758r975k843J9581J7793j2908J389P239J1446j3283
14488i35k4301M496L9562J3956l1299n576n814k5776Q467L6874R197j3575K8930
14475C4206k1165k1699Q327M165P016j6778N703k20M942j7695l6137j5099K1467
14462d2967L4819L418n358K6323J6601l2122k7102P087J6681k875J4745j531k3877
14449a6158k5876P70K0811m7O558q765k9726J3141J9800r454l702m627n09K0368
14435a7416R941r881o22P500m661l662k0558K0203J5363P076J478Q756P204O730
14421B7451j4891k2089P579K063j3016M890J7008o546r370N96p506M240K560R926
$$ plain form
14514 5383 4799 -4577 2920 7737 19805 12889 2839 -20410 -8382 21554 19689 17303 34609
14501 34609 41325 18407 -5616 -19374 -29349 -32192 -12611 5182 -7726 -6337 902 12348 -935
14488 -935 -25236 -20740 18822 32778 1479 -4097 -9911 -35687 -27220 9654 18851 5276 34206
14475 34206 13041 -8658 -331 3834 10850 -5928 -225 -445 4497 -13198 -49335 -64434 -42967
14462 -42967 -8148 -4730 -10088 16235 32836 714 -26388 -19301 -2620 -5495 9250 7719 -16158
14449 -16158 -42034 -41264 -20453 -20500 -13942 -22707 -52433 -39292 -19492 -28946 -32648 -37275 -37784 -17416
14435 -17416 -7475 -17356 -17978 -10478 -15139 -18801 -39359 -19156 -3793 3283 4761 13517 20721 27451
14421 27451 12560 -9529 -1950 113 -12903 -8013 8995 2449 -6921 -6325 -13831 -9591 -7031 2895
14407B895m010p207k0371k0641J5916P019q289O629R300j1083j6920j9004J9995
14394d5771j7058J3479K092P988K7249N844j0510J201J0904o284j962M031L6862
14381B8065j469j6918j2096k490J0798p804N266p944k3461o139K1913L658j2729
14368b1350j9902j4777J1522J2455L126J1794O839k3450J6961J8448n075M593
14356A184R852R014r23l029q218J8773O942j5019j8766j2976k5445J369L4361
14343b881K5199j5743p078K307J4287j710j1499J7966j446k0521p14j6577n043
14330b3453J2067j5797k2382l534j3290J6226K1744J9303j2830N478k2050j321
14318c9839J7157J1110Q09Q70J5177r048O740J2464k7843O378J7109L2646q786
$$ plain form
14407 2895 -1115 -8322 -28693 -49334 -33418 -26399 -34688 -28059 -18759 -29842 -46762 -65766 -45771
14394 -45771 -62829 -49350 -47258 -39270 -12021 -6177 -16687 -15486 -4582 -10866 -12828 -8797 28065
14381 28065 26596 9678 -2418 -4908 5890 -1914 3352 -4592 -28053 -34192 -12279 -8621 -21350
14368 -21350 -41252 -56029 -44507 -32052 -28926 -17132 -10293 -33743 -16782 1666 -3409 1184
14356 1184 11036 20050 19127 16098 7880 26653 33595 18576 -190 -13166 -38611 -37242 -2881
14343 -2881 22318 6575 -503 1804 16091 14381 2882 20848 19402 -1119 -1833 -18410 -23453
14330 -23453 -11386 -27183 -49565 -53099 -66389 -50163 -28419 -9116 -21946 -16468 -38518 -39839
14318 -39839 -22682 -11572 -10763 -9893 5284 -3764 2976 15440 -12403 -6025 11084 43730 34944
14305C4944n472q315m598q668o70j6109M397J3738K6537k5155o281n638k9577
14292c0867K3370M972j9382J1830K0226k746J5107p609j3021j1199m537o02o550
14279b1008q893l427M945L1044o608p759k983J7857O823l1311M075j9019l1978
14266f8242O789K8053L370N431M124K7336Q684l3674k3714O253L669P197K4364
14253c60l3243j7841J2069m034m858J2616K094k579m965K297n947J3547K8340
14240b864J6936J250j1361l029k2827k53k9885j1121L5083M0428P53j3417k7721
14227b8028j7527m9187j106L3272K2968j148k6187l532J7450L3528L2824J2533
14215B5860j0592k4646R823K0541Q878o655J0992J0491J485j9056j0468k3478
$$ plain form
14305 34944 29472 21157 16559 7891 7221 -8888 -4491 9247 35784 10629 4348 -1290 -30867
14292 -30867 -7497 -2525 -21907 -10077 10149 7403 22510 14901 1880 -9319 -13856 -14458 -21008
14279 -21008 -29901 -33328 -28383 2661 -3947 -11706 -14689 3168 9991 -21320 -17245 -36264 -68242
14266 -68242 -61453 -33400 -30030 -24599 -20475 6861 15545 -18129 -41843 -35590 -31921 -24724 -360
14253 -360 -33603 -51444 -39375 -43409 -48267 -35651 -33557 -36136 -41101 -38804 -44751 -31204 -2864
14240 -2864 14072 15322 3961 932 -21895 -22148 -52033 -63154 -28071 12357 13110 -307 -28028
14227 -28028 -45555 -94742 -95848 -62576 -39608 -40756 -66943 -70475 -53025 -19497 13327 25860
14215 25860 15268 -9378 445 20986 29864 23209 34201 44692 46177 27121 16653 -6825
14203f825j5134R17J8607L8287N939l2672j6570j4635k1638L4271m754m5454J2359
14190d7302O4918K1321j9800l5697k3760J0255K3197O617K2389j906j6547J7736
14178B1421M924O416l083k854K184n577P492p651l4695J3519K8333l2692J0648
14165H385j4774k6985K1467J2050o817K5314J3043l355m4411j6963J8079K6352
14153A1385Q388l0820j2018n449j6541Q949J303P751J2077L6099L778m5301j7303
14140c7702l397m588J6833L119J5432r398J212K2778O903j7509J1669j0633j7403
14127b2684m908J6547Q995L854N800r741Q533o731M702J5380j6232j4009J905
14114h589q237J4744K2808K1195k4210q72k0554J2130K7564j1568j2515k300l087
$$ plain form
14203 -6825 -21959 -21042 -2435 35852 41791 9119 -7451 -22086 -43724 -9453 -14207 -59661 -47302
14190 -47302 17616 38937 19137 -16560 -40320 -30065 -6868 -251 22138 20232 3685 21421
14178 21421 26345 32761 29678 26824 29008 23431 30923 23272 -11423 2096 30429 -2263 8385
14165 8385 -6389 -33374 -11907 143 -6674 18640 31683 28328 -16083 -33046 -14967 11385
14153 11385 19773 -11047 -23065 -28514 -45055 -36106 -34803 -27052 -14975 21124 24902 -20399 -37702
14140 -37702 -41099 -45687 -28854 -25735 -10303 -19701 -18489 4289 11192 -6317 5352 -5281 -22684
14127 -22684 -27592 -11045 -2050 1804 7604 -2137 6396 -335 4367 19747 3515 -10494 -8589
14114 -8589 -16826 -2082 20726 41921 17711 16839 -3715 8415 35979 24411 11896 9596 6509
14101F509l248J730J6378j814K723o947K291r463N547p156J9967m986m040k008
14087A5483p900j6088j9874K077J0044P856q92q113J8016J0940q451m466J1943
14074A0575j1729J5503K2306M344j3346m3166R094L0078L4123q605n2567j1416
14062a4806Q917K3198K7126j2120Q569J254k0652k1215P321J4896k3907k8689
14050c0108P812J936r279j0219J3330r014Q658o974r390J4408l130J8461P240
14037f269J1632k956j8224O193R144J52O732k1339k6545L91k3160N609K7108L2538
14023A006J3430q63j7897j7436o255J0757J3965k0107j5304j429K7585k660K366
14010a2842K4152j7112N60k81J3391J9458m186j0759k2140N806k358P366K2784
$$ plain form
14101 6509 3261 4991 21369 19555 22278 15331 17622 8159 13706 6550 26517 21531 17491 15483
14087 15483 7583 -8505 -28379 -26302 -16258 -8402 -9294 -17407 609 11549 3098 -1368 10575
14074 10575 -1154 14349 36655 40999 27653 -15513 -6419 23659 57782 49177 -3390 -14806
14062 -14806 -5889 17309 44435 32315 40884 42138 21486 271 7592 22488 -1419 -30108
14050 -30108 -22296 -20360 -29639 -39858 -26528 -35542 -26884 -33858 -43248 -28840 -31970 -13509 -6269
14037 -6269 5363 2407 -15817 -9624 -480 -328 6404 -14935 -41480 -41089 -64249 -58640 -31532 1006
14023 1006 14436 13573 -4324 -21760 -28015 -17258 -3293 -23400 -38704 -40133 -12548 -15208 -12842
14010 -12842 11310 -5802 -5242 -5523 7868 27326 23140 12381 -9759 -3953 -6311 1055 23839
13997B3839K0004r749l539j1685k1479j322K1358M7824K8966o747K5338M4009
13985A56817K5035J0252p086j4349j4367j9605j0542l2637m2476J9729p940l145
13973E9686n375P546J6389J6025l5247r78K5547Q826J5987n002J1278J8661K9843
13960A63186N3980Q9048O9288N3163L4489N8834P2754K5392j8397J0408Q503n5914
13948E64734k8357m4341q3608p8706n7449k0902k2324l6538j6114k7459k9628
13937A19308k326j0611j0902J5578N665j990j2390J8380K2008k4386n2227j0554
13925E5553L1269N53p460r083J9151j0601J3329Q518r96J0716K4435K7439m694
13912A58129j6460j033j7874q517k3820l397q44J6679O696l556j3175l924j5512
$$ plain form
13997 23839 43843 34094 30555 18870 -2609 -3931 17427 65251 94217 87470 112808 156817
13985 156817 181852 192104 185018 170669 156302 136697 126155 93518 51042 70771 62831 59686
13973 59686 54311 61857 78246 94271 59024 58046 83593 92419 108406 103404 114682 133343 163186
13960 163186 217166 306214 375502 428665 463154 521988 594742 620134 601737 612145 620648 564734
13948 564734 536377 492036 408428 329722 272273 251371 229047 192509 176395 148936 119308
13937 119308 116982 106371 95469 111047 116712 114722 102332 120712 142720 118334 66107 55553
13925 55553 86822 87375 79915 70832 89983 79382 92711 101229 100233 110949 135384 162823 158129
13912 158129 141669 140636 122762 114245 90425 87028 86184 102863 109559 106003 92828 88904 73392
13899G3392j9618k2672M323J0138P071j2160J3583q563j3285r187J83P310j5750
13886A4765k8451K6778K2904KM9J6457M000K048q016j9856K7235Q129k3040l999
13872C9005R936K0188M5746K4900L485j0087Q413M5384M2758K4510K0283K1080
13860B95601K6628J7728j8821j9226l833l333l2111j1920l4841k4410l7549l6893
13848A17020K818j0253o942j8598l1246j2995p909o187n712j734M407O859K2248
13835E1776j269j6300j9784j1170j4566R609J0736m964J5952K0748J970L6553
13823G9291l000l481J4468O234l0051k9033o078k3712o816K6913j1915J6210M068
13810C3098q416J6999J7976j6114J925n0K5484J0081j4141l7251k6310j1194j1398
$$ plain form
13899 73392 53774 31102 35425 45563 52634 40474 54057 45494 32209 23022 23205 30515 14765
13886 14765 -13686 13092 35996 35998 36047 52504 56504 58552 50536 30680 57915 66044 43004 39005
13872 39005 48941 69129 114875 139775 143260 133173 141586 186970 229728 254238 274521 295601
13860 295601 322229 339957 321136 301910 298077 294744 262633 250713 215872 191462 153913 117020
13848 117020 119838 109585 102643 84045 52799 39804 31895 25708 19996 18262 22669 29528 51776
13835 51776 50507 34207 14423 3253 -11313 -1704 9032 4068 20020 40768 42738 79291
13823 79291 76291 72810 87278 93512 63461 34428 28350 4638 -2178 24735 12820 29030 33098
13810 33098 24682 41681 59657 43543 45468 45418 70902 80983 66842 29591 3281 -7913 -19311
13797a9311k639K8809K774j0192J924K0175K0955J345R007l735k8816k315J6650
13784C4631m774k350J592j1147Q498Q162n881p887K470j7817N767K1267r031l159
13770B0341m015J6799R44Q237K7472l58l4176j9294m706k254J8552J4419n027
13757C6934j2070J225O645J318R352K5713k4221k3351j6786K0327p355J5562P309
13744D0602j1459l139M062j2049j5152K5591J5631m7849l6846p724J47K206K7394
13731a8585K6092K0231l4658k4752j7542R529M4555M1174p389j1765l4067N976
13719a201J5707R472m638Q453L830L049l4628j5669R563J8085r644J4492L319
13706B0190k1216j9201K2503L1120j4138r007K372N967k5572j8216J8246K7955
$$ plain form
13797 -19311 -21950 6859 9633 -559 1365 21540 42495 43840 52847 49112 20296 17981 34631
13784 34631 29857 27507 29099 17952 26450 34612 28731 20844 23314 5497 11264 32531 23500 20341
13770 20341 16326 33125 34069 42306 69778 69420 35244 15950 11244 8990 27542 41961 36934
13757 36934 24864 26089 32734 34052 43404 69117 44896 21545 4759 25086 17731 33293 40602
13744 40602 29143 26004 30066 18017 2865 28456 44087 -3762 -40608 -48332 -48185 -45979 -18585
13731 -18585 7507 27738 -6920 -31672 -49214 -39685 4870 46044 38655 26890 -7177 -1201
13719 -1201 14506 23978 19340 27793 31623 34672 44 -15625 -6062 12023 2379 16871 20190
13706 20190 -1026 -20227 2276 33396 19258 10251 12623 18590 -6982 -25198 -6952 21003
13694B1003J0351k281J7233j6634n698L541K872k0k123k2189J648Q918O449j7270
13680E800j8231j361K4637L0295L38k5752k35j665P870J0386O108k6356j463l661
13666F710p449O142J0346l852l1069k6211l63J4976J5533J0125l002J3114K1015
13653B6015K0p906K0471n59k9228m3180o21K9322L0721J2708L171J0703j8592
13640C3045j1614K182K3128n67L589j4340j6665m224k1454k4129J1089J8034m819
13627f745o548j8960K1137J1201j3283J5877j0540m0787J6814L9405k0739M459
13615h709J630p593K3759J19j038J285K661j1011J3014R450n76J9629k492J1970
13601E2098j4329j7308j4714k1868P715k898l768l1168K5535L5884k990J6588
$$ plain form
13694 21003 31354 29073 46306 29672 23974 27515 30387 30367 28244 6055 7703 16621 23070 5800
13680 5800 -12431 -13792 10845 41140 41478 15726 15491 13826 21696 32082 38190 11834 10371 6710
13666 6710 -739 5403 15749 11897 -19172 -45383 -45746 -30770 -15237 -5112 -8114 5000 26015
13653 26015 26035 18129 38600 38041 8813 -34367 -34988 -5666 25055 37763 40934 51637 33045
13640 33045 21431 23613 46741 46174 49763 35423 18758 14534 -6920 -31049 -19960 -1926 -6745
13627 -6745 -13293 -32253 -11116 85 -13198 2679 -7861 -48648 -31834 7571 -13168 -8709
13615 -8709 -7079 -14672 9087 9206 8168 9453 12114 1103 14117 23567 22991 42620 40128 52098
13601 52098 37769 20461 5747 -16121 -8406 -11304 -15072 -46240 -20705 15179 12189 28777
13589B8777j9322j6540O945j0058J667N495R653l675o532k917L9937l140j2790
13576A7500j1770J1360P847j8309j5022k942m767L9838j328j6891j68J7049O395
13563B8792l244K078O180P301J0095k4016J488L683J1827l3289o898J0840n52
13550A4285P927J7770M471n3277j0231K4804J5966K4436O103l1850k2253P558
13538E709M290K56j874J2610p344Q851K095N8O17R117p876k5856j2085j0985J3271
13523i146R003j0559o820J2019J6871m445m24K0463J6091N847m373R773P88k0294
13509C4794l6219N137O774r904J4164k103M158l791o213K836j1571p988J3458
13496C532K7227j016j9139j366L7894p564k9160l992J0091J5843l660N560m504
$$ plain form
13589 28777 9455 -7085 -140 -10198 -8531 -3036 6617 2942 -3590 -6507 33430 30290 17500
13576 17500 5730 17090 24937 6628 -8394 -11336 -16103 23735 22407 5516 5348 22397 28792
13563 28792 25548 27626 33806 41107 51202 27186 28674 32357 44184 10895 3997 14837 14285
13550 14285 22212 39982 44453 -8824 -19055 5749 21715 46151 52254 20404 -1849 5709
13538 5709 9999 10255 8381 20991 13647 22498 24593 24651 25268 34385 26509 653 -11432 -22417 -9146
13523 -9146 -143 -10702 -17522 -5503 11368 6923 6499 26962 43053 48900 44527 54300 55088 34794
13509 34794 -1425 3712 10486 582 14746 12643 16801 13010 6797 9633 -1938 -9926 3532
13496 3532 30759 29743 10604 9238 47132 39568 10408 6416 16507 32350 28690 34250 29746
13483B9746k9964k0943P476J273k6548p550K5339K7282P40j3380J4149j3321l2068
13470c7769k6585M424L005M1265J4591Q92j3233m219J3687Q187J1985L72j3080
13457C522N644P631j1935K2255p640l3553k0480J6232o067R567j1199j6914K1561
13444b1376L7263J7236J2298k018k3084n32J5819l813k3812p887j3857J431K1463
13431I131R803j9736r882n804L922N80K0205Q091j4523j2542k1597K0284J9712
13418G644n562J5181j2540p089M590K2309m642r435R548K4651l190l4022N198
13405A2641M877J5758N7868p448k8631J1338j518J983j738k1373r794l7832n306
13392i175o203N187J7965P505q534j8472M816p365J022R494K0268l767k3124j8249
$$ plain form
13483 29746 -218 -21161 -13685 -12412 -38960 -46510 -21171 6111 6851 -6529 7620 -5701 -37769
13470 -37769 -64354 -59930 -56925 -15660 -1069 -177 -13410 -17629 -3942 4245 16230 16602 3522
13457 3522 9166 16797 4862 27117 19477 -14076 -34556 -18324 -24391 -14824 -26023 -42937 -21376
13444 -21376 15887 33123 45421 43403 20319 19787 35606 31793 7981 94 -13763 -12332 9131
13431 9131 18934 -802 -10684 -16488 -12566 -11986 8219 16310 1787 -10755 -32352 -12068 7644
13418 7644 2082 17263 4723 -2366 2224 24533 19891 10456 20004 44655 41465 7443 12641
13405 12641 17518 33276 91144 83696 55065 66403 64885 66868 65130 43757 33963 -3869 -9175
13392 -9175 -15378 -10191 7774 15279 6745 -11727 -6911 -14276 -13254 -3760 16508 12741 -10383 -28632
13378b8632J0586K929j0462l499O078o766M925j4742J1080J8527J0426j7337R168
13365g719K5293R035k9037l346J8938j7862J1621K1642q555k1512k1560L6367
13353A3305J9368k4566K997Q897O069O005J3152j3790j8229m703l8756r86K4487
13340f750k5027J3521K4445J989O412o597q549P682l848o266J3954j0806m027
13327c867j1717K4911J3230J1954r584k5545J9814O286j0816j5525k7623J649
13315b6833L8957J6841n338M924j6911J3090J5794n532k062j0175O713J0420K901
13302D2789k9838l846k38j1268p509j4147P520K9261J0292R15j606O722j1783
13289A7264j7538J2704k068j4086q412K5171L1043k6793j4499j807P679K1766
$$ plain form
13378 -28632 -18046 -15117 -25579 -29078 -23000 -29766 -24841 -39583 -28503 -9976 450 -16887 -7719
13365 -7719 17574 26609 -2428 -5774 13164 -4698 6923 28565 20010 -1502 -23062 13305
13353 13305 32673 8107 11104 20001 26070 32075 45227 31437 13208 8505 -30251 -31237 -6750
13340 -6750 -31777 -18256 6189 8178 14590 7993 -556 7126 3278 -2988 10966 160 -3867
13327 -3867 -15584 9327 22557 34511 24927 -618 19196 25482 14666 -859 -28482 -26833
13315 -26833 12124 28965 23627 28551 11640 24730 40524 34992 32930 22755 29468 39888 42789
13302 42789 12951 9105 8867 -2401 -9910 -24057 -16537 12724 23016 23931 22325 29047 17264
13289 17264 -274 12430 10362 -3724 -12136 13035 44078 17285 2786 979 8658 30424
13277C0424P317N09m718o408k516j8743K798L169J7529k2850k256N807k3340r937
13263b3215J865m660k517J6761o728J8510L4258K9142J8299o735j8188k4601j8904
13250A3287L1691j795k8357O676m038K741J0877o214q055j8455j7600K3503Q532
13237A2793k6209P728R036j1970K1382M730M934J3533j9021J396K4641R084n253
13224D6804M755j1351q364j8706M185K7096M804r86l5822K1832J5097M124j3822
13211C9646J0223k9335k6768k4417N765K4603M524J2599J184M285Q212J5894l4805
13198A1610j7584K5298j6409m773j2636R620L2167K8368K7533P079Q178J1514
13186A09965k8415m5397j2883R006k5291j9559L3531P117j5277r955m573J4531
$$ plain form
13277 30424 37741 38250 33532 27124 24608 5865 8663 11832 29361 6511 4255 10062 -13278 -23215
13263 -23215 -21350 -26010 -28527 -11766 -18494 16 34274 63416 81715 74980 56792 32191 13287
13250 13287 44978 43183 14826 21502 17464 20205 31082 24868 16813 -1642 -19242 4261 12793
13237 12793 -13416 -5688 3348 -8622 12760 17490 22424 35957 16936 18332 42973 52057 46804
13224 46804 51559 40208 31844 13138 17323 44419 49223 48237 12415 34247 49344 53468 39646
13211 39646 49869 20534 -6234 -30651 -24886 -283 4241 16840 18024 22309 30521 46415 11610
13198 11610 -5974 19324 2915 -1858 -14494 -4874 27293 55661 83194 90273 98451 109965
13186 109965 81550 36153 23270 32276 6985 -12574 20957 28074 12797 2842 -1731 12800
13174A2800J4246k441J098j1768j9395K1059J8588o63j1584j3964J4762K8966
13162E1704k3874k4326R327M0559J035l1142p951J2252Q077J7835L2134J1494
13150I7124J1282o319P169M3540P8208Q4347N4795M857p8112q1396n2577k3328
13138A39590k7685m428j0213j1781p867n85M869k8008m1397j5698L5554J9944
13126E2295J3898j1339m1114l6123J5713J64j3774j9751L868M9765K2082j6697
13114A8987l3618j0890K8386o252R72M7244K6589k2055M491J1753K2696J7734
13102A06037M6522M9615N1939O9586L749m6683o1354n7961l7552j3374k771k3518
13090H4235n487l236l420K016J8080P021K0274O585l3345k7437j2179M0040k077
$$ plain form
13174 12800 27046 24605 25703 13935 -5460 15599 34187 33524 21940 7976 22738 51704
13162 51704 27830 3504 12831 53390 54425 23283 15332 27584 35661 53496 85630 97124
13150 97124 108406 102087 109256 152796 231004 315351 370146 375003 296891 215495 162918 139590
13138 139590 111905 107477 97264 85483 77616 77031 81900 53892 12495 -3203 32351 52295
13126 52295 66193 54854 13740 -22383 -6670 -6506 -20280 -40031 -36163 13602 35684 18987
13114 18987 -14631 -25521 2865 -3387 -2415 44829 71418 49363 53854 65607 88303 106037
13102 106037 152559 202174 254113 323699 327448 280765 219411 161450 123898 110524 107753 84235
13090 84235 78748 75512 72092 74108 92188 99209 119483 126068 92723 65286 53107 93147 91070
13077I1070j1988L4355n39r644J0175n121O026K9724L0527K6726O1221M6357M3580
13064C52469N9029N3138Q3345J00101Q3112O3403n383k0619j8981n3245m7240
13053F49129q7029q2027q3434o6428m0724l6569k6319k0421r435m633J9334k8038
13041A83406n0239k2192M861Q210Q223J4389j9251l8036k9178n0J2182K0817J1688
13028A04830j3711o355J2088j3268L4250J6819j5183p361L7236J0542M62l5267
13016A25082j7450j6695J8292J9013K2673j236j2317q693l1583k2660K0742L592
13004I8760j1120K264N811J1018M515J0996o65n0950j8812Q793q030k2385K0293
12991E0488M3064J2745n674L696j3380k6184j0983L91R782n101j716j992j4126
$$ plain form
13077 91070 79082 113437 112898 103254 113429 108308 114334 144058 174585 201311 262532 308889 352469
13064 352469 411498 464636 547981 648082 731194 794597 789214 768595 749614 696369 649129
13053 649129 562100 480073 396639 330211 289487 252918 226599 206178 196743 192110 211444 183406
13041 183406 133167 110975 115836 124046 132269 146658 127407 89371 60193 60143 72325 93142 104830
13028 104830 91119 84764 96852 83584 117834 134653 119470 112109 149345 159887 160349 125082
13016 125082 107632 90937 109229 128242 150915 149679 137362 128669 97086 74426 95168 98760
13004 98760 87640 89904 95715 106733 111248 122244 121579 70629 51817 60610 52580 30195 50488
12991 50488 93552 106297 100623 104319 90939 64755 53772 54163 63945 58844 57128 55136 41010
12978D1010R184J5333n258j8400j2094p387J3617K0949l017j2805L5373L6008
12966A12513J3335m720K1967n270j518K0869L8748R779l397j748r806k7058l9277
12953A24417l4342j9593j3068k1622o601N952L4493k7473k5270N890J5303L547
12941D1633R097P415m357k1539m587J3358L629J4766p061n973J052N988m901l0166
12927A8354J7317J9753R447J1773L5335K6824J6278j1464l6258j208l4953l1397
12915C9801O464J3206r289J1275l430J5856P823J930l087N272R528l1270k0066
12902D4013J6156K1721R274J3331J3302P890j0763O96J2244n051J3507J2111K795
12889A51226j0893r497j0375M74p378l2570j1943n294k5106j4676R854L0790J1400
$$ plain form
12978 41010 50194 65527 60269 41869 29775 22388 36005 56954 53937 41132 76505 112513
12966 112513 125848 121128 143095 137825 136307 157176 195924 205703 202306 200558 190752 163694 124417
12953 124417 90075 70482 57414 35792 29191 35143 69636 42163 16893 22783 38086 41633
12941 41633 50730 58145 53788 32249 27662 41020 44649 59415 52354 46381 47433 53421 48520 18354
12927 18354 35671 55424 64871 76644 111979 138803 155081 143617 107359 106151 71198 39801
12915 39801 46265 59471 50182 61457 58027 73883 81706 83636 80549 85821 95349 64079 44013
12902 44013 60169 81890 91164 104495 117797 125687 114924 115620 127864 122813 136320 148431 151226
12889 151226 140333 130836 120461 120935 113557 80987 69044 63750 38644 23968 33822 64612 76012
12876G6012k4770j7699J7563O417K5571m38l7119j8835r348O338K6254J0415L1895
12863I2256Q413j4960l798K3681j0025k22p176l0472j7395j1693j2728O4l617
12850A2328N948L3235K8923J3029P567j3239n484l77k2767n800j4457q628P967
12837C8245n982K1006K9748r965l2422k4044o480K0011P097k8521J1766J3332
12825C3791J2593L5245L2445J3419m788j4678k902L4989m028m2373q364j523O57
12812H4483o14l4745q436k566L7652K0886k4408N440J3953k1297l5780O889M317
12799D5774k549L9544O019L3325J0966j6217m120j701N036p724J0969M678o642
12786A17358J8379j6463K5638J4123p38J372j9473n150J3057J6692m070k751K8202
$$ plain form
12876 76012 51242 33543 51106 57523 83094 82656 45537 26702 17354 23692 49946 60361 92256
12863 92256 100669 85709 81911 105592 95567 95345 88169 57697 40302 28609 15881 15945 12328
12850 12328 18276 51511 80434 93463 101030 87791 82307 81930 59163 53363 38906 30278 38245
12837 38245 32263 53269 83017 73052 40630 16586 10106 30117 37214 8693 20459 33791
12825 33791 46384 81629 114074 127493 122705 108027 105125 140114 136086 93713 85349 83826 84483
12812 84483 83869 49124 40688 38122 75774 96660 72252 77692 91645 70348 34568 41457 45774
12799 45774 43225 82769 88788 122113 133079 116862 112742 111041 116077 108353 119322 124000 117358
12786 117358 135737 119274 144912 159035 158297 159669 140196 135046 148103 164795 160725 157974 186176
12773A86176J3847J6331L2525J3690Q592r89q028j5207q180J9402o561m3876j4851
12760A92871J977K2248q066j4735j3934j595M253j6098l2719Q262P447l134R723
12747A56500k425j4594K893O772J0408n51Q092L4031J3044R20J2704J6996K9030
12734B73820j1762L89J3434p476j963N0792J9982K5564J4435l8709k5831j5915
12722B96760J207N766M1361J4773N793j5725M194K7617M2121J162L0313K4804
12710D80146q092j4618K9326J2463J9558K0386J4577R622M7720K7020r389Q032
12698F36751Q652J8024P6699R708K704N085J0608M2727J7531M1359M0107K8827
12686I38782L208K9577L5736j0821L0080L3753J3242K6287L2674O0875P2901Q0535
$$ plain form
12773 186176 200023 216354 248879 262569 271161 270172 262144 246937 238757 258159 251598 207722 192871
12760 192871 194848 217096 209030 194295 180361 178766 183019 166921 134202 142464 149911 146777 156500
12747 156500 154075 139481 142374 149146 159554 159003 167095 201126 214170 215090 227794 244790 273820
12734 273820 262058 262447 275881 268405 266442 317234 337216 362780 377215 338506 312675 296760
12722 296760 297967 303733 345094 359867 365660 349935 354129 381746 423867 425029 455342 480146
12710 480146 472054 457436 486762 499225 518783 539169 553746 563368 611088 638108 628719 636751
12698 636751 645403 663427 740126 749834 752538 757623 768231 810958 828489 869848 909955 938782
12686 938782 941990 971567 1007303 996482 1026562 1060315 1073557 1099844 1132518 1193393 1266294 1346829
12674A346829Q7860R5180P4387O1532N8191P8912J41302J60070J31144J75923
12664B411330K07497K34090L02652L73321M48180N48949O79680P90816Q75972
12655F872487R55300J076120J221510J367257J645990K111847K881560M113544
12647B2245615N953647Q423683J1216822J3630733J5177646J5651554J4858015
12640A07157715J2847622R343116M406706j261285o526735j0506547j3046699
12633A02413893j4380985j4544260j3550065j1549475r005015o625959m763979
12626B7994155l428476k507918j877657j429380j183825r98410q47716p19030
12618A5001743o04726m95478l74929k43455j36245j9477N7478J25590J72023J94096
$$ plain form
12674 1346829 1434689 1529869 1604256 1665788 1723979 1802891 1944193 2104263 2235407 2411330
12664 2411330 2618827 2852917 3155569 3528890 3977070 4526019 5205699 5996515 6872487
12655 6872487 7827787 8903907 10125417 11492674 13138664 15250511 18132071 22245615
12647 22245615 28199262 36622945 47839767 61470500 76648146 92299700 107157715
12640 107157715 120005337 129348453 133755159 132493874 125967139 115460592 102413893
12633 102413893 88032908 73488648 59938583 48389108 39384093 32758134 27994155
12626 27994155 24565679 22057761 20180104 18750724 17566899 16568489 15720773 15001743
12618 15001743 14397017 13901539 13526610 13283155 13146910 13127433 13184911 13310501 13482524 13676620
12608A3676620K54317K77993K91579K95771K81718L00820K97366K67293J69447
12599A6112924J16112O3363n9701j25765j88245k43315k65728k86797l07916l33892
12589A4481040l76262m09084m25318m32221m54043m71015m86249n13272n11520
12580A0402056n09658m93916n07813m34187l93274l75421l60702l49786l22772
12571F654527l05769k72007k47646k52682k50941k22980k04526k03340k08655
12562D485981k16332j71824j52521j52666j37640j30577j30432j30117j00722
12553C163150j13471p7057o4464r0954j01038q9748j02467q1881p9804q3766r9672
12542B178828r1677q3546o6381n5483m9122m2600q0581p2236m3272k8313n6081
$$ plain form
12608 13676620 13930937 14208930 14500509 14796280 15077998 15378818 15676184 15943477 16112924
12599 16112924 16229036 16292399 16232698 16106933 15918688 15675373 15409645 15122848 14814932 14481040
12589 14481040 14104778 13695694 13270376 12838155 12384112 11913097 11426848 10913576 10402056
12580 10402056 9892398 9398482 8890669 8456482 8063208 7687787 7327085 6977299 6654527
12571 6654527 6348758 6076751 5829105 5576423 5325482 5102502 4897976 4694636 4485981
12562 4485981 4269649 4097825 3945304 3792638 3654998 3524421 3393989 3263872 3163150
12553 3163150 3049679 2972622 2908158 2817204 2716166 2626418 2523951 2442070 2362266 2278500 2178828
12542 2178828 2087151 2003605 1937224 1881741 1832619 1790019 1709438 1637202 1593930 1565617 1509536
12531A509536o9090n9777l7102m0194n9291m7259l3433m4087m4645k2314Q937
12520A061281p638J1289J98q161l1831k1914j7732K437j1520m0473o9861l7529
12508H28546l3984m1896k8952m5037l1105p993r831j7926k3878o733J3823j0668
12496E84366l7644j8960p907k4949k1363R654L471k5544j4306m2761O357j041
12484D09373r056j2566k2025j3062J6422L3430M403k7546j1057j4521j110j4616
12472C38069o608Q32J1566K1446J8194P35j9466j398P543j7426j4603M861q762
12459C34983J709O435P233K4922J1774N376M5408N1342J6647L566L2562O4708
12447F06665N6365L9691M2377K4098K6655N4726L8271P8422P9650Q3150J40091
$$ plain form
12531 1509536 1440446 1380669 1343567 1303373 1244082 1196823 1163390 1119303 1074658 1052344 1061281
12520 1061281 1053643 1064932 1065130 1056969 1025138 1003224 985492 987929 976409 935936 866075 828546
12508 828546 794562 752666 723714 678677 647572 639579 629748 611822 587944 581211 595034 584366
12496 584366 546722 527762 519855 494906 473543 483197 486668 461124 446818 404057 410414 409373
12484 409373 400317 387751 365726 352664 369086 402516 406919 379373 368316 353795 352685 338069
12472 338069 331461 332293 343859 365305 383499 384234 364768 363370 370913 353487 338884 343745 334983
12459 334983 336692 343127 350360 375282 387056 392432 437840 489182 505829 509395 541957 606665
12447 606665 663030 702721 745098 769196 795851 850577 888848 967270 1046920 1130070 1270161
12436A270161J80901K43781L21792L15516L02783L42354K92158K21277J56045
12427C646768K9950n9493j49431k18686k69767l05130l05305k91614k61936k18504
12417A596852j78050j47461j02234j06060p5647n1222n7648k6531n3266m1280
12407G57453j1067n3591k8608j9721k7582p10O049j0297r539j415J3301K3375
12395F37648q459l2490m652J8895K7862L0677K8664l909r579m724j1458l8412
12383F30063q372J1997l2771l4581j728j4286o646k6364j9691k5241K2053j665
12371D92768j727P465l6752k2530k5955m0917r424j7645j9357l259k3820j5789
12359B83058j5388M328O323q215r715J332j229l131j2711Q23r600m2502k6711
$$ plain form
12436 1270161 1451062 1694843 2016635 2332151 2634934 2977288 3269446 3490723 3646768
12427 3646768 3676718 3617225 3467794 3249108 2979341 2674211 2368906 2077292 1815356 1596852
12417 1596852 1418802 1271341 1169107 1063047 987400 936178 878530 851999 798733 757453
12407 757453 746386 692795 664187 644466 616884 616174 622223 611926 602387 600972 614273 637648
12395 637648 629189 596699 592047 610942 638804 669481 698145 694236 684657 679933 668475 630063
12383 630063 621691 633688 600917 566336 564608 550322 543676 517312 497621 472380 494433 492768
12371 492768 491041 498506 461754 439224 413269 372352 362928 345283 325926 322667 298847 283058
12359 283058 267670 271998 278321 270106 260391 261723 260494 257363 244652 245475 235875 193373 166662
12346A66662k7006K4591K8676l4977j5287R654Q484J6498j6097k0427l0303k583
12334A07885K3475J1628Q163L171M921q599r133k7688k2350n372k0792r068K279
12321E8520l3757n9536l329L9791J38l6030K003n254K2827J0518L0635K1535j6315
12308C1746o161L0608N942o893m938J7847J4319k6694l145J9398K4050K1974N536
12295A23589P749l1980m2113M185O16K2947L837J248K1274j5721o551r654J0450
12282H9876K6258j3795J4039J0055k0058K416p992J6359m388j0694k9704j4082
12270E8290n501K423J7766R550j9252K0165j1402l325J7815j0217k4297K2665
12258G4680o441j502K232j160j7410Q33k047o099l094j3594J63j1213J9041Q876
$$ plain form
12346 166662 139656 164247 192923 157946 142659 152313 160797 177295 161198 140771 110468 107885
12334 107885 131360 142988 151151 154322 159243 150644 141511 113823 91473 86101 65309 56241 58520
12321 58520 24763 -34773 -38102 1689 1827 -34203 -32200 -37454 -14627 -4109 26526 48061 31746
12308 31746 25585 56193 62135 55242 50304 68151 82470 55776 52631 72029 96079 118053 123589
12295 123589 131338 99358 57245 61430 62046 84993 88830 90078 111352 95631 89080 79426 89876
12282 89876 116134 102339 116378 126433 106375 108791 100799 117158 112770 102076 72372 58290
12270 58290 52789 55212 72978 82528 63276 83441 72039 68714 86529 76312 52015 74680
12258 74680 68239 66737 68969 67809 50399 51232 49185 43086 39992 26398 26561 15348 34389 43265
12244D3265J4948J5226J6869J0324j3035J3298j4503k97Q792o286K776j1844O458
12231H5991P026N852j8125M611P331o1K574p587K2931M6791K8716L2349N8642
12218B77041M1404M8785O8636Q0052J08948M9727L4667K9334j8401l3694m2990
12207F43509o9094o9422n7289m9049m7222l5394o935j435P34l1460k9754j2309
12195B34880p93j4370k8632k8795K333K324m330j7730Q332m833r9j3820j5990
12182A18477M164k165M373J2019K2537K0843N601n910m564J3565J350M507m5285
12169A49512k8224L744N927M20l85j6510j8426n39j4997J43L1177K3069L233j4196
12155A23948k0587R767J0300r848M467m549j1773J643L171L5926J5074j8523m743
$$ plain form
12244 43265 58213 73439 90308 100632 87597 100895 86392 86095 94887 88601 91377 79533 85991
12231 85991 93017 98869 80744 85355 92686 92625 95199 87612 110543 157334 186050 218399 277041
12218 277041 318445 367230 435866 515918 624866 674593 709260 738594 720193 686499 643509
12207 643509 574415 504993 447704 398655 351433 316039 309104 307669 308403 276943 247189 234880
12195 234880 234087 219717 191085 162290 164623 166947 162617 144887 153219 148386 148287 134467 118477
12182 118477 122641 120476 124849 136868 159405 180248 185849 179939 175375 188940 190290 194797 149512
12169 149512 121288 125032 130959 131379 130994 114484 96058 95519 80522 80665 111842 134911 138144 123948
12155 123948 103361 113128 123428 113580 118047 113498 101725 103368 106539 142465 157539 139016 134273
12142A34273k5419j3668K0280j1546n773j1593m4792J1338M360L0199O782p612
12130H6829J5020j89m2444J699J3685j2170J7016K2941p392j0603K3025J0481
12118A17898k8911p605m851N455J0863M091j9855k230P171K0104L8336P5824Q1650
12105B97940R7597J05364R2775J00717J04245J03174Q0425P71m2002m8628p5191
12094H17187q9808j13708j01025j00395q4424l3377l5534k1235k7397l1836o111
12083A72337J5931J8789j1128k7093m1493l0847q511l510J5858L4477m660j6915
12071A13235j2490Q349k1802o828O105Q132m348j1391J7258J7906L485l739l283
12058A10589L6311J2256j5847k2909J8258P642N136k8057M999J1225j0957j3453
$$ plain form
12142 134273 108854 95186 115466 103920 98147 86554 41762 53100 57460 87659 94441 86829
12130 86829 101849 101660 59216 60915 74600 62430 79446 102387 94995 84392 107417 117898
12118 117898 88987 81382 76531 81986 92849 96940 77085 74855 82026 102130 140466 216290 297940
12105 297940 395537 500901 593676 694393 798638 901812 982237 983008 941006 892378 817187
12094 817187 727379 613671 512646 412251 327827 294450 258916 237681 210284 178448 172337
12083 172337 188268 207057 195929 168836 127343 96496 87985 84475 100333 134810 130150 113235
12071 113235 100745 109094 87292 80464 86569 94701 90353 78962 96220 114126 117611 113872 110589
12058 110589 146900 159156 143309 120400 138658 146300 151436 123379 128378 139603 128646 115193
12046A15193l962O336o387r342r735k3924Q252K2970L3187J0294l778l1375p202
12033A00527J6474j7880j7188L189O722q170p272k811k9319j326j183M975r516
12020C7222j1896R793K3548J4022O055j7016o163O747J3491j6988k5432J5468
12008D8851J0351P866m197j6115j1639J2435K311o102k235q484n748k1585n146
11995E63J120K399j0209j5292J9498K3082L2499n082n8568p493J1273Q5J3786
11982G661L641M366J0519r025J971K6021k084j7954k2404j0345J1467o115m029
11969f310q757K3214J676K2752N397l9065L3286J5073j2289N382L478O163J001
11956E1001O467j8314M701r310J905M225R830l020j4556N20P079l5999r137K346
$$ plain form
12046 115193 111231 117567 111180 101838 92103 68179 76431 99401 132588 142882 139104 107729 100527
12033 100527 117001 99121 81933 85122 91844 83674 76402 73591 44272 42946 41763 46738 37222
12020 37222 25326 35119 58667 72689 78744 61728 55565 62312 75803 58815 33383 48851
12008 48851 59202 67068 62871 46756 35117 47552 49863 43761 41526 33042 27294 5709 563
11995 563 1683 4082 -6127 -21419 -1921 21161 53660 48578 -9990 -17483 -6210 -6125 7661
11982 7661 11302 15668 26187 17162 19133 45154 43070 25116 2712 -7633 3834 -2281 -6310
11969 -6310 -15067 8147 9823 32575 37972 -1093 32193 47266 34977 40359 43837 50000 51001
11956 51001 57468 39154 43855 34545 36450 40675 50505 47485 32929 33449 40528 4529 -4608 -2262
11942b262O406R130J1817K2182J0725j1518N054j6233k3404R891j0467J0729J0089
11929C2139j5419j6387K7478L1998J5728p759j9057j562l5683k1005K036K6975
11917A9482J2307j1343J1256l355O270j0745m1108j923J8568m34N306J5817O102
11904B6200K823k8655q347j3061R226r246P820J8377o784n188j8841k876K3459
11891e093J227j7159R194N905J318J3030M731k6947l2696j1178K1886L2163K8397
11878B4778J4984j2808j9383k1960R122j1339K3762j9042m695L432Q4p027K252
11865a7840q535L9351J0157j5680J9763m844m297p63k0057L405J8948N295J7750
11852D2653J8478m328j1245k5408j2164K6622K9045k2873k0568k2997L027J7578
$$ plain form
11942 -2262 4144 13274 25091 47273 57998 46480 51534 35301 11897 21788 11321 22050 32139
11929 32139 16720 333 27811 59809 75537 67778 48721 47159 11476 -9529 -7493 19482
11917 19482 31789 20446 31702 28347 34617 23872 -17236 -19159 -591 -1025 4281 20098 26200
11904 26200 29023 368 -7979 -21040 -11814 -21060 -13240 5137 -1647 -6835 -25676 -28552 -5093
11891 -5093 -3866 -21025 -11831 -5926 -4608 8422 13153 -13794 -46490 -57668 -35782 -3619 24778
11878 24778 39762 26954 7571 -14389 -5267 -16606 7156 -11886 -16581 -13149 -13065 -20092 -17840
11865 -17840 -26375 12976 23133 7453 27216 22372 18075 17312 -2745 660 19608 24903 42653
11852 42653 61131 56803 45558 20150 7986 34608 63653 40780 20212 -2785 242 17820
11840A7820R655Q941J2348J6909k4832k3961L356j9186j99P248L1492J7527k6680
11827C0438k603N28k9475j5599l2852j4203J0337K5794J6957Q485o614q824p736
11814b5367J9866K8890q571k1177L225J9979J5516j6122o433n367l122k3291K3371
11801A397K0632P422l307j8744J0776j8501j8737j2846K2520K089j4944J0924
11789a1319K1686J5647l688J8574q520j7802j9656j5717J7205J8232p519J8501
11777B5624m497k7023j2423J4705J3501J2698j3205k4742p775M041J0696J6029
11765G629Q66j5611n541J7373K471P403N781J0605J7338j0053k419j5338r184
11752A1320J888P71L8756K1252j8870j5640Q901k1420m0259J214K4679K0112J1098
$$ plain form
11840 17820 27475 36416 48764 65673 40841 16880 20236 1050 851 8099 39591 57118 30438
11827 30438 27835 28363 -1112 -16711 -49563 -63766 -53429 -27635 -10678 -2193 -8807 -17631 -25367
11814 -25367 -5501 23389 14818 -6359 -3134 16845 32361 16239 9806 4439 1317 -21974 1397
11801 1397 22029 29451 26144 7400 18176 -325 -19062 -31908 -9388 -7299 -22243 -11319
11789 -11319 10367 26014 22326 40900 32380 14578 -5078 -20795 -3590 14642 7123 25624
11777 25624 21127 -5896 -18319 -3614 9887 22585 9380 -15362 -23137 -19096 -8400 7629
11765 7629 8495 -7116 -12657 4716 7187 14590 20371 30976 48314 38261 35842 20504 11320
11752 11320 13208 13979 52735 73987 55117 39477 48378 26958 -13301 -12087 12592 32704 43802
11739D3802k300j1712l7812j9184K8101j6613m784K7220K6824M24n396k2572O840
11726A2838J4872p394M362O173q615l8982j8471J1998j6636J4232K3553m860j1381
11713a8311L0183J6838j6296j1214o684l090K4706l815k086J610J1751Q82k62
11700B4212K5389M634j0654J7810j2205j7731J3708n752j025J5650k6325n2M323
11687C1982l418p269Q589N92L274J1892J2757J589q166q580J259p491N838Q497
11673E1345R701M100j174o517L776j7322j8038P040k0124l4816j1000J6342j2124
11660b8811k715K585J2118J9866J1598j9819J1271J0146R24K826r38J4434J3309
11647D6794K396k7239m578R489K4781k1012j027k1664l4286J3882R391J1678R910
$$ plain form
11739 43802 41502 29790 -8022 -27206 895 -15718 -20502 6718 33542 33966 28570 5998 12838
11726 12838 27710 20316 24678 30851 22236 -16746 -35217 -23219 -39855 -25623 -2070 -6930 -18311
11713 -18311 11872 28710 12414 1200 -5484 -8574 16132 12317 10231 11841 23592 24474 24212
11700 24212 49601 54235 43581 61391 49186 31455 45163 39411 38386 54036 27711 27659 31982
11687 31982 28564 21295 29884 30476 33750 45642 58399 59988 51822 43242 44501 37010 42848 51345
11673 51345 61046 65146 63972 57455 61231 43909 25871 32911 12787 -22029 -33029 -16687 -28811
11660 -28811 -31526 -28941 -16823 3043 14641 -5178 6093 16239 17163 19989 19051 33485 46794
11647 46794 49190 21951 17373 26862 51643 30631 29604 7940 -26346 -12464 -3073 8605 18515
11634A8515q309J8351L6482j6832K213p050n821j4342l564L7215J3623k071k0636
11621D7774j3455n14J0056Q682o140j5756O018R137j8705k3950j577Q335l039
11608F866j1874q677r811J5726J4913o129j3672m339J4339J4905j194l905K3253
11595C0401J4892j9903R440K0106k4962k0947J1997K9567K5462J0758k210k1135
11583F3466j7459k1117k3778K6197K3227j5790j4651K445P397M142N4076J1994
11571A00149l7218k6966p518Q76j1525j1936J0467l552K0866J0761j4913r163
11559B0328K910k3219k1595O532J4724M1628J6706j3169l570J0594j9619M683
11547C6933n514K8423n000j3350j7936j3464J2688k35j2472K1354K1202r677k0822
$$ plain form
11634 18515 10206 28557 65039 48207 50420 43370 37549 23207 19643 56858 70481 68410 47774
11621 47774 34319 33805 43861 52543 46403 30647 36665 45802 27097 3147 1570 9905 6866
11608 6866 -5008 -13685 -23496 -7770 7143 1014 -12658 -16997 -2658 12247 11053 7148 30401
11595 30401 45293 25390 34830 54936 29974 9027 21024 50591 76053 86811 84601 63466
11583 63466 46007 24890 1112 27309 50536 34746 20095 22540 29937 34079 88155 100149
11571 100149 62931 35965 28447 29323 17798 5862 16329 12777 33643 44404 29491 20328
11559 20328 23238 19 -21576 -15044 -320 41308 58014 44845 41275 51869 32250 36933
11547 36933 31419 59842 54842 41492 23556 10092 22780 22545 10073 31427 52629 42952 22130
11534B2130K9052J2710m396M225k358N81J2966R953M251j3974m1253k7399R545
11521A6033m332k3028N462J4679o768j0368q008p593K2107K0664J9716J366N305
11508D5235K0767j3281j5022j5253J3528K43L237L293j8832j8102J5780L4329
11496E5922J6964j5466j2446J214j0013j7036j6012m988k546L412O588K7791K4462
11483E7846N499K1314k3892m2060k846J1230j8557P290K2262K436q003r728K5568
11470D8359N3549J7501k0286L74j0264Q387O684m450K848j1179K1038M3993J1701
11457A68255k9045j0895K2019L6686J9514L1257K3841M6626J4814M5335R7646
11446D66053R8670J51041J64632K19572K93826L42286L35907K47121N7208j41589
$$ plain form
11534 22130 51182 63892 59496 63721 61363 61944 74910 84863 89114 75140 33887 6488 16033
11521 16033 11701 -11327 -5865 8814 2046 -8322 -16330 -23923 -1816 18848 38564 39930 45235
11508 45235 66002 52721 37699 22446 35974 36217 39454 42747 23915 5813 21593 55922
11496 55922 72886 57420 44974 46188 36175 19139 3127 -1861 -4407 -995 5593 33384 57846
11483 57846 63345 84659 60767 18707 15861 27091 8534 15824 38086 40522 32519 22791 48359
11470 48359 101908 119409 99123 99497 89233 97620 104304 99854 102702 91523 112561 156554 168255
11457 168255 139210 128315 150334 187020 206534 237791 261632 308258 323072 368407 466053
11446 466053 564723 715764 880396 1099968 1393794 1736080 2071987 2319108 2376316 2234727
11436B234727k87810l08759k79698k48729k04197j56418r2320p1658o2137m2142
11426D80859n6594n3401k7280j0556k1747r646n576j7386j9978j5023K1295L4366
11414B99333N34k1150k9072k4229j2877M9043K2288j1708K1303J0396n403j7076
11402B81382p041j4912O34K4436O395j2471P224K2868j4558k5963j7439k510J785
11389B49830p937j2761R662j554j6420M04L2061k2505k8533L398j5623j0813N027
11376A84236J617j6016o381K260o565J8894J3057j5228j1539k242k5367l5059
11364A01667J4552J7540L9814J8468r062k3969k2796k2055m708R063l9046o653
11352G2815q814N70K4718J0683k3808n221K5669L82K1039j3410m798l311J1396
$$ plain form
11436 2234727 1946917 1638158 1358460 1109731 905534 749116 656796 585138 523001 480859
11426 480859 424265 370864 343584 333028 311281 301635 296059 278673 258695 243672 264967 299333
11414 299333 299867 278717 249645 225416 212539 261582 283870 272162 293465 303861 298458 281382
11402 281382 274341 259429 260063 284499 290894 278423 285647 308515 293957 267994 250555 248045 249830
11389 249830 241893 229132 238794 237240 220820 221224 253285 230780 202247 205645 190022 179209 184236
11376 184236 185853 169837 163456 165716 159151 178045 191102 175874 164335 162093 136726 101667
11364 101667 116219 133759 173573 192041 182979 159010 136214 114159 109451 118514 79468 72815
11352 72815 64001 64571 89289 99972 76164 70943 96612 96994 118033 104623 99825 96514 107910
11339A07910J9995j8066o980n937L91q130M449n846J3150J2992k1093J9052J4233
11326A26120L098J1772O573j2769p599M41p283l28O100j3987K5916J7454j8435
11313A37073o028k4016J2378N6383N5706O5839M7562Q7159R6048R2493Q0669K6342
11301G27608L667j4831n5188j06962j02105q3026m8267l9594n3515j9895L547
11290B11439k8165J0072N4130N374l835j3106J1810K1906M8044Q6554R8264J30466
11278F32953K09455K66572K53601J74178j9069j78314k51616k31923j91846j61181
11268E02810j02932l8485l7952j1130k3854j8857N717K5470K796m0986m2917l765
11256B15915K1307r973r768k463J5665J9651J7614j3223j1945L530K5459R891
$$ plain form
11339 107910 127905 109839 102859 96922 97313 89183 93632 87786 100936 113928 92835 111887 126120
11326 126120 129218 140990 147563 134794 127195 127636 120353 120025 126125 112138 138054 155508 137073
11313 137073 131045 107029 119407 175790 231496 297335 344897 432056 528104 620597 701266 727608
11301 727608 731275 716444 661256 554294 452189 369163 320896 281302 227787 207892 211439
11290 211439 183274 193346 247476 252850 249015 235909 247719 269625 317669 404223 502487 632953
11278 632953 842408 1108980 1362581 1536759 1517690 1339376 1087760 855837 663991 502810
11268 502810 399878 361393 323441 312311 288457 269600 275317 300787 303583 262597 219680 215915
11256 215915 237222 227249 217481 215018 230683 250334 267948 254725 242780 246310 271769 281660
11244B81660p006k4093l4918m121J2131K5250j206K688q2k061j53k257k3012q116
11230B14704p826k4384j1865J3213J2971J5681R532N291r987K3694O7313K6748
11218C35085K3605N9358J02937J73099K39224L26860N27266M77376j19081m92575
11208A653154m38058k70769j62012j54873j22030o6286n4702n7715j4973l8051
11198B73685k1305k6011m6394l5148J4724q288r420p775j6139K1629K7231K9813
11186A96602R805r91K7521p964j4222J5024L4677J3166j4983p518J1492O335k4809
11173B44135q917K8422K3079k801j8554j4259j3716K3083K2690o212L138J219
11161B81307n445j7160j1100j6366k1867K268J0846N162R099L456j7677j8309
$$ plain form
11244 281660 274654 250561 215643 211522 223653 248903 247697 250385 250303 248242 248089 245832 222820 214704
11230 214704 206878 182494 170629 183842 196813 212494 222026 227317 217330 241024 308337 335085
11218 335085 358690 418048 520985 694084 933308 1260168 1787434 2264810 2145729 1653154
11208 1653154 1215096 944327 782315 627442 505412 439126 384424 326709 311736 273685
11198 273685 252380 226369 179975 144827 159551 151263 141843 134068 117929 139558 166789 196602
11186 196602 206407 205416 232937 224973 210751 225775 260452 273618 258635 251117 262609 268944 244135
11173 244135 235218 263640 286719 283918 265364 251105 237389 260472 283162 276950 280088 281307
11161 281307 275862 258702 247602 231236 209369 211637 222483 227645 236744 240200 222523 204214
11149B04214o254K4032R137o984j0163l1203j2784j4030k1265N496L1837k184
11137A69849k120j8042j5715r613j6610J5885L9905J9298m364j420K4997J2674
11125B14724J5324J0962J4563M0719M4245O8086Q9531M8692n4333j08846j39232
11114B44435r6107m7670k2615N768J1126j6155k0744j3324L017J5293K2823J6951
11102A02798k429l0129r430K2993k373r588K7525K9054K5066O655J0092K0322
11090A90556N999j7710k2335m0150l1362J5282M0274N7115O3900J0264l6639l9097
11078A96097k3667j4733o870p556l46p360n394j5211J6280J0652j1446Q011k0882
11065A17575J7782O338M289N633M606P995P638L9730L4212L2848J2244M0201M1683
$$ plain form
11149 204214 197960 221992 231129 224145 213982 182779 169995 155965 134700 140196 172033 169849
11137 169849 167729 149687 133972 124359 107749 123634 163539 182837 178473 177053 202050 214724
11125 214724 230048 241010 255573 296292 340537 408623 498154 546846 492513 383667 244435
11114 244435 148328 100658 78043 83811 94937 78782 58038 44714 47731 63024 85847 102798
11102 102798 100369 70240 60810 83803 81430 71842 99367 128421 153487 160142 170234 190556
11090 190556 196555 178845 156510 116360 84998 100280 140554 197669 261569 271833 235194 196097
11078 196097 172430 157697 150827 143271 142925 135565 130171 114960 131240 141892 130446 138457 117575
11065 117575 135357 141695 145984 151617 156223 164218 171856 211586 245798 278646 290890 331091 372774
11052C72774N0650K4867k6247p8715n7790l7615k4848l4695j3149Q73K5953J5701
11040B17759k2716k7424o762j8250j2224K7216O806k46L011K249l167j9148j0031
11027A37073K0607J8638K3936j8155j0629j2125J563k234J8528P260K532o469
11015A80525p198O495j8682k5630K4245r613o638q96j0890N789L370n076N764
11002A41565J5005k958p102j4146J2780P796n3257o2567N885M8508N8155Q422
10990A58086N185J7972k551q197m6666M405l264J5418M6209M5668K9816K4863
10978B86944K4911m255r645n0020m1537j9098k5810K0001L617l422j8567K4896
10966A88015L0184K3149K8575J082n721j9172j3319j731j8989k0602r887m067
$$ plain form
11052 372774 423424 448291 422044 343329 285539 247924 223076 188381 175232 176105 202058 217759
11040 217759 195043 167619 160857 142607 130383 157599 164405 164159 167170 169419 166252 147104 137073
11027 137073 157680 176318 200254 182099 171470 159345 160908 158674 177202 184462 186994 180525
11015 180525 173327 179822 161140 135510 159755 150142 143504 142608 131718 137507 140877 135801 141565
11002 141565 156570 153612 146510 132364 145144 152940 99683 37116 43001 91509 149664 158086
10990 158086 163271 181243 178692 170495 123829 128234 124970 140388 186597 232265 262081 286944
10978 286944 311855 307600 297955 247935 206398 187300 161490 181491 185108 181686 163119 188015
10966 188015 218199 241348 269923 271005 265284 246112 232793 231062 212073 191471 181584 177517
10954A77517K3472K8605J4311K8958L1761J2160l692l714J8710J0553o553n61
10942C31527M7653P3884Q8630J03644J57867K45299L51431L85418K31262p5669
10932A940946k73522l09431k28159j44445r8486n0230j7477j7043j6938q8356
10922F96859j17155o1502n4556k7604j2018m71l7412m0955J0433J7158j0772Q517
10910C70522j528K589k083R08J0012r496l981j5838q643K6211K1511j7903J9450
10897C91731M7018K5234J8708J2171J2744J1237J3574R558k153K4518L8400N2841
10885F55581Q605l0955o049n852l433j6524Q258M823K1306K6832K2372l265m985
10872F76714M6053J5567K0867L4286r35L0216N6206N1331L3421j0228K3002N6795
$$ plain form
10954 177517 200989 229594 243905 272863 304624 316784 313092 309378 328088 338641 332088 331527
10942 331527 379180 453064 541694 645338 803205 1048504 1399935 1785353 2016615 1940946
10932 1940946 1667424 1357993 1129834 985389 886903 836673 819196 802153 785215 696859
10922 696859 579704 518202 463646 436042 424024 423553 386141 345186 355619 372777 362005 370522
10910 370522 368994 371583 369500 370408 380420 370924 366943 351105 342462 368673 390184 372281 391731
10897 391731 438749 463983 482691 494862 507606 518843 532417 541975 539822 564340 602740 655581
10885 655581 664186 633231 627182 621330 617897 601373 609631 614454 635760 662592 684964 681699 676714
10872 676714 722767 738334 759201 793487 792552 822768 878974 930305 963726 953498 976500 1033295
10860A033295K5684j0675J4906K0254Q320K0833P9454L8625m114j3175K8174M9942
10848A291523P4129M6672K1663K4813N1829Q1054M8903M2995L9429N9500J33106
10837A915616J76930K09544J55441M5837q27k0303k8243N088O8792J38371K57465
10826B923711L32130M79747N53785N74123P22635O89212Q4095k05205k8875K84678
10816F410036N55892P85146P90500Q14850J020300J172871J368619J757946K533016
10807A7209176L911246N815510Q401202J2073740J8440319K9984205M8977633
10800A44813031P7922345J12775065Q5131402m1097266r9956595q2555459n5036981
10793A41995542l6910844k5028504j7078105j2063600q791279o493158n007003
$$ plain form
10860 1033295 1058979 1048304 1063210 1083464 1091784 1112617 1192071 1230696 1226582 1213407 1241581 1291523
10848 1291523 1365652 1412324 1433987 1458800 1510629 1591683 1640586 1683581 1723010 1782510 1915616
10837 1915616 2092546 2302090 2457531 2503368 2502541 2482238 2453995 2459083 2527875 2666246 2923711
10826 2923711 3255841 3735588 4289373 4863496 5586131 6275343 6359438 6154233 6125358 6410036
10816 6410036 6965928 7751074 8541574 9356424 10376724 11549595 12918214 14676160 17209176
10807 17209176 21120422 26935932 35337134 47410874 65851193 95835398 144813031
10800 144813031 222735376 335510441 420641843 379544577 279587982 197032523 141995542
10793 141995542 105084698 80056194 62978089 50914489 42123210 35630052 30623049
10786C0623049l815899k791655j951955j243434q10913o01620l86542k08477r8942
10777A8713612L8552J83349M50159P40309O70039J36009m6655J44696K95473L65898
10767B1691441M15960M75429M79760N20480O36300O80610O78206O88486N43839
10758B6810511L02493m8076l40534n59189p48609q24309p24914n86003m26890
10749B2854480l03144l25164m75159o47867r00681j044988j076125j025768r36153
10740A6119431q62941q36812p75841o95686o91518o04335n29829n30853n29958
10731A0061658m94901m42732l69332l74598l52813l31335l24742l25347l02063
10722F743795k37988k31394k57014k46941j85539k19916k56432k24319k20123
$$ plain form
10786 30623049 26807150 24015495 22063540 20820106 20009193 19407573 19021031 18812554 18713612
10777 18713612 18752164 18935513 19385672 20125981 20796020 20932029 20885374 21030070 21325543 21691441
10767 21691441 22107401 22582830 23062590 23583070 24219370 24899980 25578186 26266672 26810511
10758 26810511 27113004 27064928 26724394 26165205 25416596 24592287 23867373 23281370 22854480
10749 22854480 22551336 22226172 21751013 21103146 20202465 19157477 18081352 17055584 16119431
10740 16119431 15256490 14419678 13643837 12948151 12256633 11652298 11122469 10591616 10061658
10731 10061658 9566757 9124025 8754693 8380095 8027282 7695947 7371205 7045858 6743795
10722 6743795 6505807 6274413 6017399 5770458 5584919 5365003 5108571 4884252 4664129
10713D664129k43095k44328j68074j52820j45759r5901r3319r9764r4879j29838
10703C196352j26319p8129r0587j08109n3305k0648n7222o4759l3264o4349j12344
10692B387317j40143j34661j00211p7523m7872n2534m4865n3506l6114n2594m5377
10681A601917l141K7517M6268J5105n180J0234P592l0510p7240n0124o6255j17849
10669A358334p8002n4628m3094k7446n5056l5618m9849m5791l7484j3416R60j1128
10657I07782K3521l56q085R76l1527m4518j1727Q363P470j3445k2905L1077L7575
10644H84201K1593L5863K3955K8707n6563p7284p5876o7695l6521l2009l3468
10633F14903o279L1192K8352j4764J2364J0312P130J7256k1156k748n194k5131
$$ plain form
10713 4664129 4421034 4176706 4008632 3855812 3710053 3614152 3520833 3421069 3326190 3196352
10703 3196352 3070033 2991904 2901317 2793208 2739903 2719255 2662033 2597274 2564010 2499661 2387317
10692 2387317 2247174 2112513 2012302 1934779 1886907 1834373 1789508 1736002 1699888 1647294 1601917
10681 1601917 1598776 1626293 1672561 1687666 1682486 1692720 1700312 1669802 1592562 1542438 1476183 1358334
10669 1358334 1280332 1225704 1182610 1155164 1100108 1064490 1014641 968850 931366 917950 918910 907782
10657 907782 931303 930947 922862 923838 892311 847793 836066 844429 851899 838454 815549 846626 884201
10644 884201 905794 941657 965612 994319 937756 860472 784596 716901 680380 648371 614903
10633 614903 608624 639816 668168 653404 665768 676080 683210 700466 679310 676562 671368 646237
10621F46237l4926m8961l0193L551O058M2430L5005M4034N0666P2578L6479k184
10609H20774k542m783L276K1227M4979J9000N0597O6522L5701k9865n5321l8191
10597I31374k70K089J36M9060N8868N4244K2672R329m507M862j573k197q112J368
10583A117343J8479N1270N7624M0083K8574K6524J4876J217N980L4790M9525L4269
10571A480554K1906L0240o096k1542L239J3234M7718L1754R076K9737O1336M1971
10559A743127L8687L6547J7577K4147M2787M2402R0707J16732J33025J45465R9002
10548B530205O3632M5179Q5746J04875J50377K02390K39394K53734L09519L26083
10538D311134L64867M01337N22935O50934Q52783R92794R92670Q64207Q37582
$$ plain form
10621 646237 611311 562350 532157 535708 541766 584196 619201 663235 713901 786479 822958 820774
10609 820774 818232 813449 816725 837952 882931 901931 952528 1019050 1054751 1024886 969565 931374
10597 931374 931104 933193 933329 982389 1041257 1095501 1118173 1127502 1122995 1127857 1126284 1124087 1115975 1117343
10583 1117343 1135822 1187092 1244716 1284799 1313373 1339897 1354773 1355990 1361970 1396760 1446285 1480554
10571 1480554 1502460 1532700 1526604 1505062 1508301 1521535 1569253 1601007 1610083 1639820 1701156 1743127
10559 1743127 1781814 1818361 1835938 1860085 1902872 1945274 2035981 2152713 2285738 2431203 2530205
10548 2530205 2593837 2639016 2724762 2829637 2980014 3182404 3421798 3675532 3985051 4311134
10538 4311134 4676001 5077338 5600273 6251207 7103990 8096784 9089454 9953661 10791243
10529A0791243J004138J283788J628121K103132K836216M043601N808711Q326848
10521C7825798J2009734J7784161K7024630M0988721N9414874P4180967N9011511
10514C28240396J77216n4345007o7359129n5105655l8954225k6620294j8269521
10507F7763781j2852966r319270o949178n282167m021745k972072k106069j392651
10499B2867663q42163m73851l56886m98124o09928n90812m08879k33500p6515
10490A8777005J14520K10256L58428M71700N13793N41260M60700M08610M08480
10481B2264752M22647M45972M26817M60581N87578N51693L28990P4405k20504
10472B5342931m33896n91300o93840o72828n72775m18703l72004l99784m80077
$$ plain form
10529 10791243 11795381 13079169 14707290 16810422 19646638 23690239 29498950 37825798
10521 37825798 49835532 67619693 94644323 135633044 195047918 269228885 328240396
10514 328240396 328417612 274072605 206713476 151607821 112653596 86033302 67763781
10507 67763781 54910815 45591545 38642367 33360200 29338455 26366383 24260314 22867663
10499 22867663 22025500 21551649 21194763 20696639 20086711 19495899 19087020 18853520 18777005
10490 18777005 18891525 19101781 19460209 19931909 20445702 20986962 21447662 21856272 22264752
10481 22264752 22687399 23133371 23560188 24020769 24608347 25160040 25489030 25563435 25342931
10472 25342931 24909035 24317735 23623895 22951067 22378292 21959589 21587585 21187801 20707724
10463B0707724n92052p23718q92161r50839r27476q85862q53226q07004p24465
10454A3350921o64450o24685n86190n63688n40439m88703m62101m31971l86690
10445H602004l28084l38769l42819l02355k98492k96097k77417k57861k11220
10436E948890k16401k41259k19979k05638k07551k19626k17592j86110j86137
10427D048597j84251j53551j23457j15445j11465j02713j01470q1604j17610j11937
10417B845094r2447j07490r8828m8747q2560n5699p0367r3199q7755n8192o5801
10406A984009o7169o0786p0288l6377k5127l8272n6530l2890k755m827j624n300
10394A582064k4716J973k340r684j9196j6558k2947j2139k8860n279M4650J43993
$$ plain form
10463 20707724 20115672 19391954 18499793 17548954 16621478 15735616 14882390 14075386 13350921
10454 13350921 12686471 12061786 11475596 10911908 10371469 9882766 9420665 8988694 8602004
10445 8602004 8273920 7935151 7592332 7289977 6991485 6695388 6417971 6160110 5948890
10436 5948890 5732489 5491230 5271251 5065613 4858062 4638436 4420844 4234734 4048597
10427 4048597 3864346 3710795 3587338 3471893 3360428 3257715 3156245 3074641 2957031 2845094
10417 2845094 2752647 2645157 2546329 2497582 2415022 2359323 2288956 2195757 2108002 2049810 1984009
10406 1984009 1916840 1856054 1785766 1749389 1724262 1685990 1629460 1596570 1593815 1588988 1587364 1582064
10394 1582064 1557348 1559321 1556981 1547297 1528101 1511543 1488596 1476457 1447597 1442318 1486968 1630961
10382A630961K58554L85663M97044J60446l68549m90732l87240k51999j93303
10373A240845j23332q1134p9774n7113n3601o4023n0826m9576l3176o412j603
10362F40275R640k2428l0022m318J0056K666J3259k0179l9275k9200l2443k4957
10350D73074l4670j6815P089M5333K9935j453J8466J6423K0910L8578J2081j1117
10338E97834p772r991m4133l8531k97J6181K2595M2076K8337K1688J4303Q70j7037
10325F26123p896l346k540L733M682k0026j3159M075L48k7633p39k4483k6469
10312E12670l2018J8545j025o848o501j1597K3485J9234j47j3500l3577j5550
10300D53171j7347j2944j6551r588o834P04l322m403k4509k2756r497J578k176
$$ plain form
10382 1630961 1889515 2275178 2772222 2932668 2564119 2073387 1686147 1434148 1240845
10373 1240845 1117513 1036379 956605 899492 845891 781868 731042 681466 648290 641878 640275
10362 640275 649915 627487 597465 593147 603203 605869 619128 598949 559674 530474 498031 473074
10350 473074 438404 421589 428678 474011 503946 502493 520959 537382 558292 596870 608951 597834
10338 597834 590062 580071 535938 497407 497110 513291 535886 577962 606299 627987 642290 643160 626123
10325 626123 618227 614881 612341 616074 620756 600730 587571 591646 591994 564361 563622 539139 512670
10312 512670 480652 499197 498172 491324 484823 473226 496711 515945 515798 502298 468721 453171
10300 453171 435824 422880 406329 396741 389907 390611 387289 382886 358377 335621 326124 327702 325526
10287C25526j1353j0535J870Q437Q175l0805k2868k143R887J0013j7838k9076
10275B39290k2511J7880K7370R511l053M21k523J947q77m175k1454j594K2334
10262B62566K812j0325n483j6306l5405n683m990J3252m201j9550M793j1068m519
10249A65893k0685J558J7936k093j5507l79J5263P596p818j5727k4129O271J6579
10236A44758L2598K897l5302M225K2797k3207j5818k625N953k677n923j3170j785
10223A12721L1439J3563k8531o910K9969J4019k1121N765J5651P830N259N114
10211A84768P283k0655J6991J489K7451J5956k1366l728K0503J6078L647k0986
10199B27431l8076k2612k4619n5419r2436k7561Q0924J02235P9832P2650R0258
$$ plain form
10287 325526 314173 303638 305508 313945 322120 291315 268447 266304 276191 286204 268366 239290
10275 239290 216779 234659 262029 271540 268487 268908 266385 268332 267455 263280 241826 240232 262566
10262 262566 265378 255053 249570 233264 197859 192176 187186 200438 196237 176687 181480 170412 165893
10249 165893 145208 146766 164702 162609 147102 146723 161986 169582 161764 146037 121908 128179 144758
10236 144758 177356 180253 144951 149176 171973 148766 132948 130323 136276 133599 127676 114506 112721
10223 112721 144160 157723 129192 122282 152251 166270 145149 150914 166565 174395 179654 184768
10211 184768 192051 171396 188387 189876 217327 233283 211917 208189 228692 244770 248417 227431
10199 227431 189355 166743 142124 86705 -5731 -33292 47632 149867 229699 302349 392607
10188C92607J02885J16700J14412J17592J96388L13831L82003M96966P47844R94804
10178C976032J056296O65076R092l79985l28066j2079L69328P11246R13410Q10841
10168G791191L06419l38979q63830j104081j057242q64641p04785m91411l77807
10159B294834l02134k30022j89399j44326j07518n8596o7001l7968m4551o9766
10149A043553n2217j1926K945n076K0573K0827n985J4011j6148J3303L730J0683
10137A038273L0030K1169K625j1128P612K2630l537N798O626j1591j3489l064
10125A091954o934j5152k5274m1029l9315l0981k3887l171M761k0206l4524l9385
10113H16857j7680j6565l5290j4997j6481l3387l819j4512n8190k8449J7994k2409
$$ plain form
10188 392607 495492 612192 726604 844196 1040584 1354415 1736418 2233384 2981228 3976032
10178 3976032 5032328 5697404 5706496 5326511 4998445 4986366 5355694 6066940 6980350 7791191
10168 7791191 8097610 7758631 6894801 5790720 4733478 3868837 3164052 2672641 2294834
10159 2294834 1992700 1762678 1573279 1428953 1321435 1262839 1195838 1157870 1113319 1043553
10149 1043553 991336 979410 982355 977279 997852 1018679 1012694 1026705 1010557 1023860 1027590 1038273
10137 1038273 1068303 1089472 1092097 1080969 1088581 1111211 1107674 1113472 1120098 1108507 1095018 1091954
10125 1091954 1085020 1069868 1044594 1003565 964250 933269 909382 906211 910972 890766 856242 816857
10113 816857 799177 782612 747322 732325 715844 682457 678638 664126 605936 577487 595481 573072
10101E73072j1508J5061P31L4103P7392R9729P8473J50739J84220K24894K87986
10090A714892L02283J17951j67577l38646l26164k72245j98568j42670r8750m1088
10080E49418n3346m0555n1738n3536K17K4358k722m5643k0451k0511j009K9536
10068C14018K5502R715K6416O5440R7985J63143K13881K75190K88914J59921l2967
10057A607158j83417k42082k07004j95421j19272r0469m6648l6063j1499j3684
10047D61599n6469j2943L726k3851m1876k9090P78L4132J9238M365K6679P1807
10035D58095O4011m9953o9694k0471M2684N1124L6408N9420R4085R6554Q3776
10024H46039L9902L6238J9806o2397r8064j18369r2539o4162o5544m6281l9027
$$ plain form
10101 573072 561564 576625 577356 611459 688851 788580 867053 1017792 1202012 1426906 1714892
10090 1714892 2017175 2135126 1967549 1628903 1302739 1030494 831926 689256 590506 549418
10080 549418 496072 455517 403779 350243 350460 374818 372096 326453 306002 285491 284482 314018
10068 314018 339520 349235 375651 441091 539076 702219 916100 1191290 1480204 1640125 1607158
10057 1607158 1423741 1181659 974655 779234 659962 569493 522845 486782 475283 461599
10047 461599 405130 392187 395913 372062 330186 301096 301874 336006 355244 359609 386288 458095
10035 458095 522106 472153 402459 381988 424672 475796 512204 571624 665709 762263 846039
10024 846039 885941 922179 941985 879588 781524 663155 570616 506454 440910 394629 355602
10013C55602m3985k3064k2784j4949j4432O885J6593j4929k3137j2507k4805k4545
10001A59943K1293K0105q796j5404Q827n380K0053p508j7069q504p397n623j6650
9988A37890M498o69J8518m076p24m889j115P574J1206N579M387j9967k2566J679
9974A37325k422l0785J1120K0270k8793j3985p028k323o7J2422K972K760l279
9961I8187l374J9522k1258j4030l822K6370k9047L481J1591j4852j6240k0464
9949C6064l5204j9190l817M7227L7189J8101n797k1793o718j8493j0863n1324
9937c4618p158R553J687K9782L0339j5524j0907J4397n506k256J7407k2852M265
9924H609L0372M2704n286l6181l035J4709R882J9394j4520k3892m792O254n636
$$ plain form
10013 355602 311617 288553 265769 250820 236388 243273 259866 244937 221800 209293 184488 159943
10001 159943 181236 201341 192545 177141 185968 180588 200641 193133 176064 167560 160163 154540 137890
9988 137890 142388 141719 160237 156161 155437 150548 149433 157007 168213 173792 178179 158212 135646 137325
9974 137325 134903 104118 115238 135508 106715 92730 85702 83379 83312 95734 98706 101466 98187
9961 98187 94813 114335 93077 79047 75225 101595 72548 76029 87620 72768 56528 36064
9949 36064 860 -18330 -22147 25080 62269 80370 74573 52780 46062 27569 16706 -34618
9937 -34618 -41776 -32223 -30536 -754 29585 14061 3154 17551 12045 9789 27196 4344 8609
9924 8609 38981 81685 76399 40218 37183 51892 61774 81168 66648 42756 37964 44218 38582
9911C8582P173p22j2477l936J5675J0613J5754m227R36o655L3393J7591j7089
9898I4611p748l562j6936K0931L4410J2509M161k8748k5258j0252R93o626j0892
9885E7593k3951j2130L4230K0666L562o904l873M519J849j66k1261p243K1027
9872F7918K2788k408j8073J1273M33k9273J6243J8920j9167m1593j9516J3216
9860B0761J2153J336J1261j9103k101k7891j7960K4176o46j3181K8601J8745j14
9847C6037P745J0752Q387K4977K4703K9725P1292Q2550J56383K99140L86001K59237
9835A396929n9604l10734l10965k58377j65487q1202m1178m5481K644J5853K0340
9824A62738K304m3508n3627l6457J5133K2154L1455Q130n039J8273O691J0051
$$ plain form
9911 38582 45755 45033 32556 28620 44295 54908 70662 66435 67371 60716 94109 111700 94611
9898 94611 86863 83301 66365 87296 121706 134215 138376 109628 84370 74118 75111 68485 57593
9885 57593 33642 21512 55742 76408 79970 73066 69193 73712 75561 75395 54134 46891 67918
9872 67918 90706 88298 70225 81498 81931 52658 68901 87821 68654 27061 7545 20761
9860 20761 32914 34250 45511 26408 24307 -3584 -21544 2632 1986 -11195 17406 36151 36037
9847 36037 43782 54534 62921 87898 112601 142326 213618 296168 452551 751691 1137692 1396929
9835 1396929 1337325 1026591 715626 457249 291762 210560 169382 123901 126545 142398 162738
9824 162738 165042 121534 67907 31450 46583 68737 100192 108322 103283 121556 128247 138298
9812A38298j4028k0891l730R897R865K0898j6159k3055j4471k866r416K2600L2916
9799A29858J595L718q357l506p620P226J1321l366l457k3980l2938r359m373J3403
9785G0165L5734L5802p659p712R696J3224J9079J7228l775K5312K7264K5142N237
9772B64737J1069P3237O1597P5088J35270J64080J96581L11726M70192O62787
9762B426364Q57820Q03717K41167m65190p92584p04637n39021m50271l04953j95346
9752H77066j07794q2738r2005n5818m0442l3958l1805m9224m696J352L034j6819
9740C66153Q2j0952m0742j502q630j3979p744K3431j1402J9153K6437j5j4622
9727C25668j8239K5692J0872J9964K3970m920J159K4241q595k6457p904R234j6942
$$ plain form
9812 138298 124270 103379 99649 109546 119411 140309 124150 101095 86624 83758 74342 96942 129858
9799 129858 131453 135171 126814 123308 115688 122914 134235 130869 127412 103432 70494 61135 56762 70165
9785 70165 105899 141701 134042 126330 136026 149250 168329 185557 181782 207094 234358 259500 264737
9772 264737 275806 349043 410640 485728 620998 785078 981659 1293385 1763577 2426364
9762 2426364 3284184 4087901 4329068 3863878 3071294 2366657 1827636 1377365 1072412 877066
9752 877066 769272 686534 594529 538711 498269 464311 432506 383282 378586 379938 382972 366153
9740 366153 366235 355283 314541 313039 304409 290430 282686 306117 294715 313868 340305 340290 325668
9727 325668 307429 333121 343993 363957 387927 383007 384166 408407 399812 373355 365451 374685 357743
9714C57743j9460j4427k405j8079P250k091q117l1098j1473L843k6068j1398J2726
9701B36946l3686l9164k2869j3948j3637K0734M065j6961J7711j5795j7434L557
9689A09519J1011R76M221k5183J043O80L859j9953l5515R524Q064q832j6901o605
9675C5908K8056J0166O597o550j0701o684L859J9179J2933j0359r309j6919O732
9662F2908j979o769j5123r158J5992J5205M39j6612J4244J8561N637j6006q334
9649E9005j4738k4006K0386q214M375j8764O739K526J0198J2528M855J96J7891
9636G2977j8522m2663p269J4424J2890j5178j4275Q317K484J0771J8655J3088
9624E5699n705M854p554O016m30k4720k4652J6542K3719j7052k2156R872j7348
$$ plain form
9714 357743 338283 323856 321451 303372 310622 308531 300414 269316 257843 261686 235618 224220 236946
9701 236946 203260 164096 141227 127279 113642 134376 138441 121480 139191 123396 105962 109519
9689 109519 120530 121506 125727 100544 101587 102267 106126 86173 50658 60182 68246 59414 42513 35908
9675 35908 63964 74130 80727 74177 63476 56792 60651 79830 92763 82404 73095 56176 62908
9662 62908 60929 54160 39037 29879 45871 61076 61515 44903 59147 77708 83345 67339 59005
9649 59005 44267 20261 40647 32433 36808 18044 24783 27309 37507 50035 54890 55086 72977
9636 72977 54455 11792 4523 18947 31837 16659 2384 10701 13185 23956 42611 55699
9624 55699 49994 54848 47294 53310 52880 28160 3508 20050 43769 26717 4561 14433 -2915
9611b915j9570Q741M553R294L794q975q602J6841J7074M136q806j5040l092J1587
9597I020J0494K0291M404J193M06p203p417j5030j919J8374k492k542Q430Q223
9583D4232p059j454k3197j0448J4602K484N023j3465k4569K0593N647r605o148
9570c364j0178K044O257J6948j4022o912J6675p191J807J6198O337J0758J9926
9557E5283P521l7757k9177K9635K5491K3773P42r343J1545j1954m3792k4775J4004
9544A1196L0314J8068j78j8379j5688J5369j201J3086j0293r736n797O300J9585
9531E2646r347R020L551j8209q883J5732J8388J5461J9420j6409j3790J7811p89
9518H4602J743j0667L803r539k5824j644k4383O955N273k0154j0364J9718L798
$$ plain form
9611 -2915 -22485 -13744 -9191 103 3897 -5078 -13680 3161 20235 24371 15565 525 -2567 9020
9597 9020 19514 39805 44209 45402 45808 38605 31188 16158 14239 32613 30121 27579 36009 44232
9583 44232 37173 35719 12522 2074 16676 19160 24183 10718 -13851 6742 12389 2784 -3364
9570 -3364 -13542 -11498 -5241 11707 -2315 -9227 7448 257 2064 18262 24599 35357 55283
9557 55283 62804 25047 -4130 25505 50996 74769 75511 66168 77713 65759 21967 -2808 11196
9544 11196 41510 59578 59400 41021 25333 40702 39501 52587 42294 32558 26761 33061 52646
9531 52646 43299 52319 55870 37661 28778 44510 62898 78359 97779 81370 67580 85391 84602
9518 84602 86345 75678 79481 69942 44118 42474 18091 25046 30319 10165 -199 19519 23317
9505B3317K5211Q53j5226j3082k0526p709J0217j2132J9892k798l4747P850M1267
9492B2387P887Q003k52N685K0033K047q514j3973k1823k3421J7917Q185J6788
9479D0949J3692j0071p606o368k3380K8810K6104k5818l0070J2492J9529j065
9467C7198r802J4346K6994K418p336j2600p358k7314k584K8126K1227j908M1537
9454A02944J1866j8503p030j255J4326l836J3477K4826Q98n516j0300l0959l1435
9441E9503j5224q599j798l614l077q482K6576L5221J6446m069l1467k0291K1486
9428F2611J0347K4870N808k3368m651r22O870k2823l663L3542m974k9775J1959
9415F5831J7285p181o656k4192k3013j9349Q581K405L8185J1400N848j7488q389
$$ plain form
9505 23317 48528 49381 34155 21073 547 -7162 3055 -9077 10815 8017 -26730 -18880 22387
9492 22387 30274 38277 38025 43710 63743 65790 57276 43303 21480 -1941 15976 24161 40949
9479 40949 54641 44570 36964 30596 7216 36026 62130 36312 6242 18734 38263 37198
9467 37198 27396 41742 68736 71154 63818 51218 43860 16546 13962 42088 63315 61407 102944
9454 102944 114810 96307 89277 88022 102348 98512 111989 136815 137713 132197 121897 90938 59503
9441 59503 44279 35680 33882 30268 27191 18709 45285 80506 96952 92883 61416 41125 62611
9428 62611 72958 97828 103636 80268 75617 74695 81565 58742 55079 88621 83647 53872 65831
9415 65831 83116 75935 69279 45087 22074 2725 11306 13711 51896 63296 69144 51656 43267
9402D3267k3831L562K1207k7594n292N090k6592J3413K3341J7926J3543K2077
9390H0117k2157k1867r603N103O666m291j7743q247Q546K8822L8960n508L226
9377H2024L4569K4363k6860k5554j289o917j3020N570M577J9395N582j1790n355
9364H5295r122K7878R219O798j0725L554J85R68M690K0743P192l240j2784m238
9350A26413J6876L856J028j1332m514J2165J0674J5995j5141Q33j1927N160K9865
9337A79951n53J4538J3614N952j3047k9779n126L8495K1729L217j3533k7705j0645
9324A77108M392L0106P688j2553o551M462k56l3640K7642K0664k2425M40n711
9311A91366N395j506j5256m058J1732Q745J4894l87P286K8347j5827k1332j0616
$$ plain form
9402 43267 19436 22998 44205 16611 11319 16409 -10183 3230 26571 44497 58040 80117
9390 80117 57960 36093 26490 31593 38259 33968 16225 7978 16524 45346 84306 78798 82024
9377 82024 116593 140956 114096 88542 87253 80336 67316 72886 77463 96858 102440 90650 85295
9364 85295 76173 104051 113270 120068 109343 112897 113082 114050 118740 139483 146675 143435 130651 126413
9350 126413 143289 147145 148173 136841 132327 144492 155166 171161 156020 156853 144926 150086 179951
9337 179951 179398 193936 207550 213502 200455 170676 165550 204045 225774 228991 215458 187753 177108
9324 177108 181500 211606 219294 206741 200190 204652 204396 170756 198398 219062 196637 197077 191366
9311 191366 196761 195255 179999 175941 187673 196418 211312 210925 218211 246558 230731 209399 198783
9298A98783J1827K1765M267p890K070Q039K621L1506L0674j2353O540J6275O966
9285C21090m768j9954J4941K6145o99n899J8751J7949P54K118p65J4667O096K8121
9271D18547K8590L5829K8824L0653K8752l296Q158L1092Jj0326r760K8717L3023
9258F48804L3087J6821O628J4586R109M8767L3411K6426N1699J0248k2585Q12
9246H77813O3933O1975J8067K1861L6525J3302N0329K9008K2334M9334P2697R5916
9234A413094Q8241O9383N9824O7805R1035R9921R9543J04855J26938J36372J50115
9223B507126J78248J72821K00347K29301K65191L07134L37128L75706M13702N04940
9213E491644O12093O91370Q18329R81059J151249J421261J732899K109568K607668
$$ plain form
9298 198783 210610 232375 236642 228752 230822 238861 241482 272988 303662 291309 297849 314124 321090
9285 321090 316322 296368 311309 337454 336755 330856 349607 367556 368310 370428 369663 384330 390426 418547
9271 418547 447137 482966 511790 542443 571195 567899 576057 607149 607150 596824 587064 615781 648804
9258 648804 681891 698712 705340 719926 729035 777802 811213 837639 889338 899586 877001 877813
9246 877813 941746 1003721 1021788 1043649 1080174 1093476 1143805 1172813 1195147 1244481 1317178 1413094
9234 1413094 1501335 1570718 1630542 1698347 1789382 1889303 1988846 2093701 2220639 2357011 2507126
9223 2507126 2685374 2858195 3058542 3287843 3553034 3860168 4197296 4573002 4986704 5491644
9213 5491644 6103737 6795107 7613436 8594495 9745744 11167005 12899904 15009472 17617140
9204A7617140L225736M087494N064670O127192P070999P633471P321592N524515
9196F3672809K311726j516186m746764o586423p032173o600303n754621m820400
9188B8927665l938924l233401k620127k147507j769220j418895j153099r04975
9180A1741517p25740o24312n24796m00568l23565k67123k29316j75685j25246
9171H345166p7518k9679k0710P378N7693N2652N4588O8390N6939P2335J02160
9160H689394Q6144O3756M1919K4110j2246m6715q5313j31613j67094j41742j34363
9149H186237j80364j74905j70853k22663k32755k22244k41392k45916k46138k46984
9139F002023k54923k59417k55977k53358k26453j96372j79210j73679j63628j63436
$$ plain form
9204 17617140 20842876 24930370 29995040 36122232 43193231 50826702 58148294 63672809
9196 63672809 65984535 64468349 59721585 53135162 46102989 39502686 33748065 28927665
9188 28927665 24988741 21755340 19135213 16987706 15218486 13799591 12646492 11741517
9180 11741517 11015777 10391465 9866669 9466101 9142536 8875413 8646097 8470412 8345166
9171 8345166 8267648 8237969 8217259 8224637 8282330 8334982 8389570 8457960 8514899 8587234 8689394
9160 8689394 8775538 8839294 8881213 8905323 8893077 8846362 8761049 8629436 8462342 8320600 8186237
9149 8186237 8005873 7830968 7660115 7437452 7204697 6982453 6741061 6495145 6249007 6002023
9139 6002023 5747100 5487683 5231706 4978348 4751895 4555523 4376313 4202634 4039006 3875570
9129C875570j59354j47321j23155j48280j49419j01143j05327j45515j30332j23955
9119B541769j01043p4762q1327o6184o8491o7288r2499j06686q2628n8116p5798
9108A666947o2705n8559l9163k8813m9685o7222n1770m2551l2407l7271k1294
9097A175507j8108l1083n7222p7727l1231o885l1342l0941l2827j9649k255k2113
9085H14124n6529k2902o51j561q906p855p477j3804j6998j1667l1623j3383O898
9072F27666p285l5933j3538n042Q417k0985l4800n0647k6902l1119j9281j9738
9060C70813n562J9311J5963J8962k518l2139l3126k3472K058N610l6062J3084
9048C12922j870j1161j0371p495J9788J344r832l0470k1645J8807K0750J778j8573
$$ plain form
9129 3875570 3716216 3568895 3445740 3297460 3148041 3046898 2941571 2796056 2665724 2541769
9119 2541769 2440726 2365964 2284637 2218453 2149962 2082674 1990175 1883489 1800861 1742745 1666947
9108 1666947 1604242 1545683 1506520 1477707 1428022 1360800 1309030 1266479 1234072 1196801 1175507
9097 1175507 1157399 1126316 1069094 991367 960136 953251 921909 890968 858141 838492 836237 814124
9085 814124 757595 734693 734042 732481 723575 715720 708243 694439 677441 665774 634151 620768 627666
9072 627666 620381 584448 570910 565868 574285 553300 518500 467853 440951 409832 390551 370813
9060 370813 365251 384562 400525 419487 416969 384830 351704 328232 330290 335900 299838 312922
9048 312922 311052 299891 289520 282025 301813 303157 293325 262855 241210 260017 280767 282545 263972
9035B63972k4747k3386j6974K3417p352j9448n190j6594J4483J0209P505K859
9023B08754n32k849K0809K628l3354l1613r147J6429K7215J0196N948k1220j1731
9010A81533K3022J2386q701q703k5580j7351O137J2901q05j0651K6735P396l98
8997A97921o843J4696J8921J649n953j805j1505R291j6757k1667K3638K9425P872
8984B38883j1324m2162j8417k2150j9609J0210M31j10L6908J8720k170k5218k1153
8971A42839J9234L647k4984j0087j0684J7349J5827j0214j2707n749Q304m442
8959A28333l4412n526J7702Q613j0911p280J8538k0812j0843L5435j0235J497
8947A10099l154k2147j6788l105k849K706J758R453K7105k9318k0862J2886M180
$$ plain form
9035 263972 239225 215839 198865 222282 214930 195482 190292 173698 188181 198390 205895 208754
9023 208754 208222 205373 226182 228810 195456 163843 154696 171125 198340 208536 214484 193264 181533
9010 181533 204555 216941 208240 199537 173957 156606 162743 175644 174839 164188 190923 198319 197921
8997 197921 191078 205774 224695 226344 220391 218586 207081 216372 199615 177948 201586 231011 238883
8984 238883 227559 185397 166980 144830 125221 135431 135862 135752 172660 191380 189210 163992 142839
8971 142839 162073 165720 140736 130649 119965 137314 153141 142927 130220 124471 132775 128333
8959 128333 93921 88395 106097 114710 103799 96519 115057 94245 83402 118837 108602 110099
8947 110099 106945 84798 68010 64905 62056 64762 66520 75973 103078 73760 52898 65784 69964
8934F9964q99K2525O698L714q26k8632P434J9559j4357k3704J99Q934L0925r367
8920I2167m392M011j5753k5503j8736J1694K3375M749j0902R038j4593J3186J8251
8907H6592n475N638K1898k6571j6575k0209k9292k4030k0182J2845L1721J1647
8895B8007j5196l61J4613n562k0424M055K1177P669J4353M777k4869j5881K4359
8882C6717K7924j5252m6406k8071K219Q672L126j625q295j5100O713K8829K5960
8869B5411j0248j8928j9707L0467M1616J4843q059M363j5556k5827O069M345j1806
8856A6983J0913L6640L9613L0254j9063k5229k8723j605k670l2016k630o126r015
8843G326J6148P32J5024m266l784N145L5357k738j3033P016l6079l5949r274R241
$$ plain form
8934 69964 69065 91590 98288 102002 101176 72544 79978 99537 85180 61476 61675 70609 101534 92167
8920 92167 87775 91786 76033 50530 31794 43488 66863 71612 60710 69748 55155 68341 86592
8907 86592 81117 86755 108653 82082 65507 45298 16006 -8024 -28206 -15361 16360 28007
8895 28007 12811 12450 27063 21501 1077 5132 26309 33978 48331 53108 28239 12358 36717
8882 36717 64641 49389 2983 -25088 -22869 -14197 -11071 -12696 -20991 -36091 -29378 -549 25411
8869 25411 15163 -3765 -23472 6995 48611 63454 55395 59758 44202 18375 24444 28789 16983
8856 16983 27896 64536 104149 134403 115340 90111 61388 59783 57113 25097 22467 16341 7326
8843 7326 23474 24206 39230 34964 31180 36325 71682 68944 55911 62927 26848 -9101 -18375 -9134
8829i134K4642j0966k1135k6120j4453J8854P003P468J8077n26J5593J1538J3666
8816C4507M676k0687j3173K3406K0039j0512j6463j2436J3233p010o190N539K6914
8803D1843J1096o693j4903k845L6087N522l3303k3099r461J3042k117j2142j6909
8790a3882p073j435l014K1446L8142p025k1010o571R470R623o607O610k3409N133
8776C98K2185M550r677m646k312m946K5984j1865k6681J2120l38j5019J5466r668
8762d449k5878L104K2250R754J4070K0790Q578q853q531p129k080K1316N736j4308
8748C4370n486m192k7496k1320P341K943p945k5817J8460L1826J2922j5838j064
8735a296k619J4005J2138J1152j1170k5344K8735l394n58p162J6705j0010m509
$$ plain form
8829 -9134 15508 4542 -16593 -42713 -57166 -38312 -31309 -23841 -5764 -6290 9303 20841 34507
8816 34507 39183 18496 5323 28729 48768 38256 21793 9357 22590 15580 9390 14929 41843
8803 41843 52939 46246 31343 28498 64585 70107 36804 13705 4244 17286 15169 3027 -13882
8790 -13882 -20955 -22390 -25404 -3958 34184 27159 6149 -422 9048 18671 12064 18674 -4735 398
8776 398 22583 27133 17456 12810 10498 5552 31536 19671 -7010 5110 4772 -10247 5219 -4449
8762 -4449 -30327 -27223 -4973 4781 18851 39641 48219 39366 30835 23706 21626 42942 48678 34370
8748 34370 28884 24692 -2804 -24124 -16783 -13840 -21785 -47602 -29142 2684 15606 -232 -1296
8735 -1296 -3915 10090 22228 33380 22210 -3134 25601 22207 21649 14487 31192 21182 16673
8722A6673m1450l1206m19j9031J3202J8842q912J439Q857J5061K7581j0011p507
8709a6881Q308L7446J2666m6438k8203o702N407K1618K4493K2324j0529k996o808
8696A3705k6685j7159K973j1206J890L4962q914j0303R760J1341m542j18P678
8683C382J4228J1078l49j2434J8365L352L336q347N852K5879j1017J6613j0529
8670E9409L470k520L31k1596j7865j7918j3918J0302n188l1528P909K3453J7142
8657A1483J4991o636J6260o643o39J7665m65p850m8111r746N470o855K4616J2816
8643A6356j941J6712L1119L5589L94K7484P6872R0490R3571L5087j03982r8292
8631B19459m4034m6257j2839P189j0032l1085j5489J3253R841Q825k3102m04m434
$$ plain form
8722 16673 -24777 -55983 -56402 -75433 -62231 -43389 -52301 -50862 -42005 -26944 637 -9374 -16881
8709 -16881 -8573 28873 41539 -4899 -33102 -39804 -34397 -12779 11714 34038 23509 20513 13705
8696 13705 -12980 -30139 -27166 -38372 -36482 -1520 -10434 -20737 -10977 364 -4178 -4296 3382
8683 3382 17610 28688 28339 15905 34270 37622 40958 32611 38463 64342 53325 69938 59409
8670 59409 62879 60359 60690 39094 21229 3311 -10607 -305 -5493 -37021 -29112 -5659 11483
8657 11483 26474 19838 36098 29455 28816 46481 46016 38166 -9945 -19691 -14221 -21076 3540 16356
8643 16356 14415 31127 62246 97835 98229 125713 202585 293075 386646 421733 317751 219459
8631 219459 175425 129168 116329 123518 113486 82401 66912 80165 90006 98831 75729 75325 70891
8618G0891m688Q660k4779j8335R86M0061J2824j015J995j4233J0958k5237l7049
8605B1039L846J4757m748M024J0069J2020L4773M3298K2348K058K0523J5598M9059
8592B48664J10617J80290K33523J01481j68881j91910j16610o6806m8160k8289
8582B53919j9821O381o971n3469k954k0437k1061j7267K128K8144l77j4400j9130
8569A14685k0491j7358o824J8426J3208K1243K840k0694Q254J4142m133j3546
8557A09752j3038J0137J5242Q087R122o049j5741J8135p468R170M3313Q5236J09180
8544C75078O5461n7024j10038r4827k9742j1699k4467j6624R39l1420k1314j2203
8532C2120m933o738J5521L5838k622l2698J0186K320R165J3568m481J1073K676
$$ plain form
8618 70891 66203 74863 50084 31749 32735 72796 85620 84605 86600 72367 83325 58088 21039
8605 21039 24885 39642 34894 38918 48987 61007 95780 139078 161426 163484 184007 199605 248664
8592 248664 359281 539571 773094 874575 705694 513784 397174 330368 282208 253919
8582 253919 234098 240479 233508 180039 177085 156648 135587 118320 120448 148592 148215 133815 114685
8569 114685 94194 76836 70012 88438 101646 122889 125729 105035 113289 127431 123298 109752
8557 109752 96714 106851 122093 130180 139302 133253 117512 135647 128179 137349 180662 265898 375078
8544 375078 440539 383515 273477 178650 148908 137209 112742 96118 97057 65637 44323 32120
8532 32120 27187 20449 35970 71808 69186 36488 46674 48994 58159 71727 67246 78319 80995
8519H0995j4809m011L374j3781j971q192k918J7450J6586m438K5687Q493m2046
8506F0419j1480J369k9574l7444J6036J3887J2899P302r08J9241J8158k1239m5553
8493C113l655K2068j3590k793j3332P868N692P486J1747l296L723k158l0328k0996
8479b8451J4927O802O263J7787k6776O317J2426O502q696J0547j1146r929M8232
8466D4805N0825l966j1807k0857k9212k3580j2298r343j17n388K0392K0598J4853
8453C4905k887N567j3923j2349j1966J092Q802j526K0926O82J370k9700l2716
8440c1723J7881J6421M076k0902j6993P893L742K2995j5949k4278K407j1910j1934
8427e8274K513K8189K676k0410J2981J6168N0881J57j2950k2252k3307J7411Q275
$$ plain form
8519 80995 66186 62175 65549 51768 49797 41605 38687 56137 72723 68285 93972 102465 60419
8506 60419 48939 50308 20734 -16710 -674 13213 26112 33414 32506 51747 69905 48666 3113
8493 3113 -542 21526 7936 5143 -8189 -321 5371 12857 24604 21308 25031 22873 -7455 -28451
8479 -28451 -13524 -6722 -459 17328 -9448 -3131 9295 15797 7101 17648 6502 -3427 44805
8466 44805 95630 91664 79857 59000 29788 6208 -6090 -15433 -15550 -20938 -546 20052 34905
8453 34905 32018 37585 23662 11313 -653 439 9241 7715 28641 29323 30693 993 -31723
8440 -31723 -13842 2579 6655 -14247 -31240 -23347 -19605 3390 -12559 -36837 -34430 -46340 -58274
8427 -58274 -55761 -27572 -24896 -45306 -32325 -16157 34724 34881 21931 -321 -23628 -6217 2058
8414B058k253O969j475M50j950p709M2310q088l0001R716K9853J5944J2222L4255
8400A02301N145j4433r715k5234J0008P876l2883l2630O459L699M652j9661J2656
8387A8240K4222j605O625k2792q342n417l559K4640J7139l6421j2919J5761K2233
8374C7805P785j3327J443K190l7631m4461q09L9187J9919J0270m13j0190J2716
8361B4484J8508L1545J7315K1765J3599J9567K8378j5459k6861l1718l3174Q481
8349G6430j2321j5647M141L3595j6635k3187n78j6768l1499J2285P550l348J7041
8336C1059K4961r588p466J1414P885O287k2832j7282l0009J379J0474P498J7532
8323C1312k1680j6714k0646J2034M381m506N084J5784k516j167L9972L3557R877
$$ plain form
8414 2058 -195 6774 5299 5749 3799 -3910 38400 30312 311 10027 39880 55824 68046 102301
8400 102301 107446 93013 83298 58064 68072 75948 43065 10435 16894 20593 25245 5584 18240
8387 18240 42462 40857 47482 24690 16348 10931 7372 32012 49151 12730 -189 15572 37805
8374 37805 45590 32263 33706 35896 -1735 -46196 -47005 -7818 12101 22371 21958 11768 24484
8361 24484 42992 74537 91852 113617 127216 146783 175161 159702 132841 101123 67949 76430
8349 76430 64109 48462 52603 86198 69563 46376 45798 29030 -2469 9816 17366 14018 31059
8336 31059 56020 46432 38966 50380 58265 64552 41720 24438 -5571 -4192 6282 13780 31312
8323 31312 9632 -7082 -27728 -15694 -11313 -15819 -10735 5049 2533 1366 41338 74895 84772
8310H4772r21j1133m9021l1576o591J757J7286K81k5426M654L4229l439J5170
8297C0042j1191o774j831j209j7698L548R640J7578J7211l524j5552j3490k289
8284D461n093l1574n783L1259l942J9923K1010J5628J1319j9353l0870l720O685
8271I950p85K616J4708j6337k2786j9479K2850J9299j6843j6469j266R784J0027
8258d731N504J3676k601J1369K0027j4219m3827k6297J2562L3737K5804n447L557
8245B9114J8815k0827k9598P785J7130L0073j4607k1309K5304j0622k8866P08
8233C100L3160o696k8964l1648P212K5921P745Q842n537k1839M239P345k529j7985
8219a7634j8293J2873l246k4726l843M1277K2655L003k2728r430j4136L403R511
$$ plain form
8310 84772 83851 72718 23697 -7879 -14470 -12713 4573 4854 -20572 -15918 18311 14872 30042
8297 30042 18851 12077 10246 9037 -8661 -5113 4527 22105 39316 35792 20240 6750 4461
8284 4461 -632 -32206 -37989 -6730 -10672 9251 30261 45889 57208 37855 6985 3265 9950
8271 9950 9165 11781 26489 10152 -12634 -32113 -9263 10036 -6807 -23276 -24542 -14758 -4731
8258 -4731 773 14449 11848 23217 43244 29025 -14802 -41099 -28537 5200 31004 25557 29114
8245 29114 47929 27102 -2496 5289 22419 52492 37885 16576 41880 31258 2392 3100
8233 3100 36260 29564 600 -31048 -23836 2085 9830 18672 13135 -8704 -4465 2880 351 -17634
8219 -17634 -35927 -23054 -26300 -51026 -54869 -13592 9063 12066 -10662 -20092 -34228 -30825 -21314
8206b1314r801K285J6402j868j7631J03J6256J366j2046J0867J4634r210L3524
8193B3567N153j3302q515J238K309J700j1435k7450J9323J7887K5928K3182R652
8180F9237k4329K293q281l679k9302o509k6263r963R973L3209j8643k8503M956
8167c5804K1662J4855p949N703m757j8937j4385m653L6271j4781j2781K4592j918
8154a2882R066K365k1781l8728j4397L2239L2698o13K2432P953l35j673k9305
8141a2961j3136J4432l874J0070p625J3777K1212q492j7966j7130j2622J3834
8129b0481J9906p918q325L712P501N11k1662Q672k693K6842J8680l147j6239K1650
8115B7009m92k0496J420l260r918N95K2279m637j4462J4225J7341l4643p213J5823
$$ plain form
8206 -21314 -31115 -28830 -12428 -14296 -31927 -31824 -15568 -14202 -26248 -15381 -747 -9957 23567
8193 23567 28720 15418 6903 8141 10450 12150 715 -26735 -7412 10475 36403 59585 69237
8180 69237 44908 47201 38920 35241 5939 -570 -26833 -36796 -26823 6386 -12257 -40760 -35804
8167 -35804 -14142 713 -7236 -1533 -6290 -25227 -39612 -44265 -7994 -22775 -35556 -10964 -12882
8154 -12882 -3816 -1451 -23232 -61960 -76357 -44118 -11420 -12033 10399 18352 18017 16344 -12961
8141 -12961 -26097 -11665 -15539 -5469 -13094 683 21895 13403 -4563 -21693 -34315 -20481
8129 -20481 -575 -8493 -16818 -13106 -5605 -5094 -26756 -18084 -20777 6065 24745 21598 5359 27009
8115 27009 26517 6021 7441 4181 -5737 -5142 17137 12500 -1962 12263 29604 -5039 -12252 3571
8101C571J4590k484O888j8193J5284j6000n5559J2969J7965K1094j0649j2327
8089b2851r119P832J2203M378j496K3172j6162M920J1685p003j2186k1223k8363
8076e4213q008J8385L1157L2739m418k6218n458L071O528J1434K764r817o097
8063h151p660j7583j6662j506L1748K4257J9107l566j0063J1960J9142K7789L97
8050F9209k0549j3705k7660P304k4006J299J2216j1468R272P129r829j2186Q342
8037d632j7601j2481M476J1688l0538r442O829Q347Q127K5629N283k2978k7670
8024e4963J7175L3221J4604J3523k4236j1267J843l411L05L7954J8772m0023j2095
8011h598j9289M171N458j4379L139J9725j858K2247L9128J7996k8119j0172J3550
$$ plain form
8101 3571 18161 15677 22565 4372 19656 3656 -51903 -38934 -20969 125 -10524 -22851
8089 -22851 -31970 -24138 -11935 -7557 -9053 14119 -2043 2877 14562 7559 -4627 -25850 -54213
8076 -54213 -62221 -43836 -12679 20060 15642 -10576 -16034 -12963 -6435 4999 7763 -2054 -8151
8063 -8151 -15811 -33394 -50056 -51562 -19814 4443 23550 19984 9921 21881 41023 68812 69209
8050 69209 48660 34955 7295 14599 -9407 -8108 4108 -7360 1912 9041 -788 -12974 -4632
8037 -4632 -22233 -34714 -30238 -18550 -49088 -58530 -51701 -43354 -35227 -9598 -4315 -27293 -54963
8024 -54963 -37788 -4567 10037 23560 -676 -11943 -10100 -13511 -13206 24748 43520 3497 -8598
8011 -8598 -27887 -23716 -18258 -32637 -29498 -9773 -11631 10616 49744 67740 39621 29449 42999
7998D2999l90j434Q82k9638O473L8694N988j6224l0868k0317K2997L3103p328
7985D4937l5883K2811k92k8240p423O244J8991J2005K410K1520K1014k1567K5332
7972H1859K3496k1500l3649J77m015K4135r52j0459n564l1574j2303K1039m991
7959B5699m29n666J5869K1665R25k2004j0633J2366j5332J947L8468K3624m041
7946H2458j3919m968K999j5972j0227L3615J4605Q413j5342l9392p412j379P431
7933D0910J0023Q900j8388J0548k2710l8356m264P456K2387J1737p23r038k3994
7920e512Q026j1910j8507J5257L1267l503j2728k393R592K1473O470m284m808
7907B8440m830N316J8189L788j3800K688J0498k3304j253J1484l62Q993J2489
$$ plain form
7998 42999 42609 41175 42057 12419 18892 57586 63574 47350 16482 -3835 19162 52265 44937
7985 44937 9054 31865 31573 3333 -4090 2154 21145 33150 35560 57080 78094 56527 81859
7972 81859 105355 83855 50206 50383 46368 70503 69551 59092 53528 21954 9651 30690 25699
7959 25699 25270 19604 35473 57138 58063 36059 25426 37792 22460 24407 62875 86499 82458
7946 82458 68539 63571 66570 50598 40371 73986 88591 97004 81662 42270 34858 33479 40910
7933 40910 50933 59833 41445 51993 29283 -9073 -13337 -5881 16506 28243 27520 18482 -5512
7920 -5512 2514 -9396 -27903 -12646 18621 15118 2390 -3 9589 31062 37532 33248 28440
7907 28440 23610 28926 47115 50903 37103 39791 50289 26985 25732 37216 36854 45847 58336
7894E8336m372j6196k8318k1841q966L794J6077J4816J8608l858l886K4611j0092
7881C8713l3995L770j3323J2997L210P966J0046j1508j2195J2496L2488j5165
7869C5500m7192l0652Q154K0122K4902J852Q954l586o403q433p747k2284J1630
7856a5183P327l577r199L635J7184J7054j5440J4338L488j5434m270J572j695
7843b00j5870J6085p223K1106r892J0572L1971M499j6689o543q380k257k013q587
7829F579L689n401j0644J9154Q923r888R145N467k3043R874M565p955l637N385
7815A2213J4722j4981l8310j0649j986l1352K427K9370K3834k8677o612R082K8367
7802a2552J8359J0343N011l053k914m1641O332l270k6960J2236r32J0426R294
$$ plain form
7894 58336 53964 37768 9450 -12391 -21357 -17563 -1486 13330 31938 28080 24194 48805 38713
7881 38713 4718 8488 -4835 8162 11372 19338 29384 17876 5681 18177 50665 35500
7869 35500 -11692 -42344 -34190 -14068 10834 12686 21640 18054 11651 3218 -4529 -26813 -15183
7856 -15183 -7856 -11433 -20632 -16997 187 17241 1801 16139 19627 4193 -77 1495 -200
7843 -200 -16070 15 -7208 13898 4006 14578 46549 51048 34359 27816 19436 17179 15166 6579
7829 6579 10268 4867 -5777 13377 22300 12412 21557 27024 3981 13855 18420 10465 6828 12213
7815 12213 26935 11954 -26356 -37005 -38991 -70343 -67916 -38546 -14712 -43389 -50001 -40919 -12552
7802 -12552 5807 16150 21161 18108 15194 -26447 -20115 -23385 -50345 -38109 -39041 -28615 -19321
7789a9321l986J0641J6881L4489J0192j5130j656O783j547k8398r775J4024j4418
7776a221k5289j0362M028m887K4358J0781j1682J1067j4878q744J0593p964N680
7763a8520j2965m562k780J5418K6916L4056q752m1620M800K0585l176m2738j3239
7750d6577Q076L456l086Q547R133k2947K1378K0856j4173L897L851J0211j320
7737A302m842p824P959P421J5813j7111o363l8873o587K6965K8450P587l837M581
7723A4641N290K6109j2133k3511n249J6867K65j563J0992o042n971J1296J8518
7710D9509J4728j1215l3904k2354m709J423k561n834k1707K3723L8718j054m2977
7697a8214N874Q810j3942M482J6078n84j2884m874K5668n039k4885M664J9399
$$ plain form
7789 -19321 -23307 -12666 4215 38704 48896 33766 32110 38893 37346 8948 -827 13197 -1221
7776 -1221 -26510 -36872 -32844 -37731 -13373 -2592 -14274 -3207 -18085 -26829 -16236 -24200 -18520
7763 -18520 -31485 -36047 -38827 -23409 3507 37563 28811 -12809 -8009 12576 9400 -33338 -46577
7750 -46577 -38501 -35045 -38131 -29584 -20451 -43398 -22020 -1164 -15337 -11440 -7589 2622 1302
7737 1302 -3540 -11364 -3405 4016 19829 2718 -3645 -42518 -49105 -22140 6310 13897 10060 14641
7723 14641 19931 46040 33907 10396 5147 22014 22279 20716 31708 25666 19695 30991 49509
7710 49509 64237 53022 19118 -3236 -7945 -6522 -9083 -14917 -36624 -12901 25817 24763 -18214
7697 -18214 -12340 -3530 -17472 -12990 3088 2504 -10380 -15254 10414 5375 -19510 -14846 4553
7684D553q96p673k8272j3812o986R86J8340P862J9989o999p474L092K1772K4002
7670B8484N44j4265j2253j8205j1993Q369J5735R080J1639l550j0130p034J4069
7657A0490p3j8171m3691n06J7332p44J825k9293k6612P031K676J6553J3086j3319
7643f3416n181J9875M9542N925j5582J6547N24Q284n185O404Q956k4535L645L526
7629I329q441p596k256J4341p876j3653K269Q989r698J745K2450P253K838m5271
7615b5577j2596L157j2326J0518J2728N659L786M797L3770k7433j8319J0156n384
7602a7064K53l150L618J9636J9668Q604k6439l3782k1122j423m223Q21J7948K2361
7588a4294l058j1232k751K8909K6200l4100k1050N523K680p831M799K2055L463
$$ plain form
7684 4553 3657 -4016 -32288 -46100 -53086 -52100 -33760 -25898 -5909 -12908 -20382 -17290 4482 28484
7670 28484 29028 14763 2510 -15695 -27688 -19319 -3584 5496 17135 13585 3455 -3579 10490
7657 10490 10417 -7754 -51445 -51951 -34619 -35363 -33538 -62831 -89443 -82412 -79736 -63183 -50097 -63416
7643 -63416 -68597 -48722 820 6745 -8837 7710 8234 16518 11333 17737 26693 2158 5803 9329
7629 9329 888 -6708 -8964 5377 -2499 -16152 -13883 -4894 -14592 -12847 9603 16856 19694 -25577
7615 -25577 -38173 -35016 -47342 -36824 -24096 -18437 -14651 -9854 23916 -3517 -21836 -11680 -17064
7602 -17064 -16811 -19961 -16343 3293 22961 31565 5126 -28656 -49778 -51201 -55424 -54603 -36655 -14294
7588 -14294 -17352 -28584 -31335 -2426 23774 -10326 -31376 -25853 -23173 -31004 -26205 -4150 -687
7575f87o587j4275j0659N155J2005R836M028k0160J806R28k2584j5821J0416j21
7561d6720O955P854j7240k0269J3189n380J3177K385K962K8752r998k2186j840
7548d8359K7850L9829L635k9211k7775k481p62p715R173o963J812K067M4102L0249
7534C5451k3320k0522J289k562N271K2743k2736k0051J2592L8906P698k5759L141
7521A2141L117l2049O314J0245J143K113J4268J0556L368o895j4047r903J1901
7508A2272R683r280k3474p970j8634j9357J0748K4751K6143k3175j0215K1084
7496g424N62p40R716M776k901k516l535m916r330k572k4825n415K6801K1552l895
7481d662r949r450o779l752P459j8295r455J5924L5926J3207j1155j5498k092
$$ plain form
7575 -687 -7274 -21549 -32208 -27053 -15048 -5212 -1184 -21344 -19538 -18610 -41194 -57015 -46599 -46720
7561 -46720 -39765 -31911 -49151 -69420 -56231 -61611 -48434 -46049 -43087 -14335 -24333 -46519 -48359
7548 -48359 -20509 19320 22955 -6256 -34031 -36512 -37274 -44989 -35816 -42779 -40967 -38900 5202 35451
7534 35451 12131 -8391 -7102 -9664 -4393 18350 -4386 -24437 -11845 27061 34759 9000 12141
7521 12141 15258 -16791 -10477 -232 911 3024 17292 27848 31216 24321 10274 371 12272
7508 12272 21955 12675 -10799 -18769 -37403 -56760 -46012 -21261 4882 -18293 -28508 -7424
7496 -7424 -6862 -7602 2114 6890 3989 1473 -2062 -6978 -16308 -18880 -43705 -49120 -22319 -767 -4662
7481 -4662 -14611 -24061 -30840 -34592 -27133 -45428 -54883 -38959 -3033 10174 -981 -16479 -18571
7468a8571K5505o35M062k911j9671l214j0120K166L0281L853k0056J0963k177
7455e25M320j206J0352J0543j2748M912k837r312l3590L297J4609l3352j1151
7442e6688J4858J450M568J4732K144N275l438J0803R292q404j0586J1884L0877
7429B6767P588k4026k2347J044K1580k2744o621l064j9478j4784O366j1420J912
7416e9227Q587K2522K713l078l692k2006j0812L3043P504O279k533k0843L0695
7403a0848K1931o12k7899k6214R425J3010K063N665j2062j7403R191o485r122
7390d9360J1927j945m636P630K3065L52J1682J6709j9479K741j3070R870K6213
7377B1699k3166k6334R430q588q937p864J367K6859J7201P217P611M315j833k3780
$$ plain form
7468 -18571 6934 6299 10361 7450 -12221 -15435 -25555 -23389 6892 10745 -9311 1652 -525
7455 -525 3795 2589 12941 23484 10736 15648 12811 3499 -30091 -26794 -12185 -45537 -56688
7442 -56688 -41830 -40380 -35812 -21080 -18936 -13661 -17099 -6296 2996 -5408 -15994 -4110 26767
7429 26767 34355 10329 -12018 -10974 10606 -12138 -18759 -21823 -41301 -56085 -49719 -61139 -59227
7416 -59227 -50640 -28118 -25405 -28483 -32175 -54181 -64993 -31950 -24446 -18167 -20700 -41543 -10848
7403 -10848 11083 10471 -17428 -43642 -34217 -21207 -19144 -13479 -25541 -42944 -33753 -40238 -49360
7390 -49360 -37433 -39378 -44014 -36384 -13319 -12967 -1285 15424 -4055 -1314 -14384 -4514 21699
7377 21699 -1467 -27801 -18371 -26959 -35896 -43760 -42393 -15534 1667 8884 16495 20810 18977 -4803
7363d803o837K285j0875k0184J3522k7141M712L026O29P033o820o011R174K0393
7349b1897R729K3452J5120j7481j2753j0659m2898m341J1980j5969l096J7764
7337e1049K3585k546J4087O745M168K3110l0221l7332N188J1934L7595J0758l6504
7324b0482j7372J9485K1539P749j8139R181p229j3264K8389J6692j7285Q221P818
7311B5303j6113j3633q931j7857j2619J8204L3079K0384j4964m2409j1064K4527
7299a6093n853P033k0209P39J0416K2107P004j5782j4345J1824J9703K3825k0756
7286I613k317k4097j6349M252m371J0552J1277J1119r012o384Q44q964k1474j2826
7272e8137j3728K501j5223L2465N8177k053l8401k994J1460k586J0561j4189m491
$$ plain form
7363 -4803 -11640 -9355 -20230 -40414 -26892 -54033 -49321 -46295 -45666 -38633 -45453 -51464 -42290 -21897
7349 -21897 -12168 11284 26404 8923 -3830 -14489 -57387 -61728 -49748 -65717 -68813 -51049
7337 -51049 -27464 -30010 -15923 -9178 -5010 18100 -12121 -49453 -44265 -32331 5264 16022 -20482
7324 -20482 -37854 -18369 3170 10919 -7220 1961 -5268 -18532 9857 26549 9264 17485 25303
7311 25303 9190 -4443 -13374 -31231 -43850 -25646 7433 27817 12853 -29556 -40620 -16093
7299 -16093 -21946 -14913 -35122 -34383 -23967 -1860 5144 -10638 -24983 -13159 6544 30369 9613
7286 9613 7296 -16801 -33150 -28898 -33269 -22717 -11440 -321 -9333 -15717 -14873 -23837 -45311 -58137
7272 -58137 -71865 -69364 -84587 -52122 6055 4002 -34399 -37393 -25933 -28519 -17958 -32147 -36638
7259c6638J9527N675j6294o988Q86n070n740M089j6396j7429P094K2881L6583
7246g820L1463o830l2839k8675j8508K6076J1598K9343K0598K4205j2275j8122
7234A8214m872R617p804n975n186j1919Q883O579k791j3883k6002J9010J4886
7221a243q830o329J818q358j3500M793M80m735J8796J4416J9645n841k0506K0114
7207A0720K8309j3263j7797k903k9076r801J0275J5474K2620j2684o004J212p401
7194a0319p896M065K902J418M847j3779l284r619p567J3292L139O842P705r41
7180i195l5030R678j3301Q796R493J2944K6695J1648l5937k980J7786J1540K1372
7167C3509K492n181K975r134l862k3771p69k3703k0391J1276K9680J7807m968
$$ plain form
7259 -36638 -17111 -11436 -27730 -34718 -33832 -38902 -44642 -40553 -56949 -74378 -67284 -44403 -7820
7246 -7820 23643 16813 -16026 -44701 -63209 -37133 -25535 3808 24406 48611 36336 18214
7234 18214 13342 22959 15155 9180 3994 -7925 958 7537 4746 -9137 -35139 -16129 -1243
7221 -1243 -10073 -16402 -14584 -22942 -36442 -31649 -31169 -35904 -17108 -2692 16953 11112 -9394 10720
7207 10720 39029 25766 7969 5066 -24010 -33811 -23536 -8062 14558 1874 -4130 -2918 -10319
7194 -10319 -18215 -14150 -11248 -9830 -4983 -18762 -22046 -31665 -39232 -25940 -22801 -15959 -8254 -9195
7180 -9195 -44225 -34547 -47848 -39052 -29559 -16615 10080 21728 -14209 -17189 597 12137 33509
7167 33509 36001 30820 33795 24661 20799 -2972 -3741 -27444 -47835 -36559 -6879 10928 5960
7154E960k2114o443q61l0748M777K9337J481n167M1985L783k3435l774Q687L898
7140G366N3k1977n953n536k0812j6643J8836K1069k748J2640L5645K915l453k7172
7126e770l0222O183k1698j0097K9427K2335J9381R669R009j6687j5202J3375j2251
7113b548k5794j7550K1203j5011k4223J7561K4874K5175J1248N872j4283k2289
7101a5765j8756J7391J5606j1453j0256k4371J5098K4669r644l0360n87J546n77
7088d7459J643K4526L466J7915O283J4167j3164l323J3214O034O846j9970j7642
7075g464j2832J9372k0244J136L0508K9188j938l0736m2146j9333O936J7510L3811
7062C768J7118L5657k039j6550j9323p135J170L7704j9617k221J5722j8518J908
$$ plain form
7154 5960 -16154 -22597 -23458 -54206 -49429 -20092 -18611 -23778 18207 21990 -1445 -5219 3468 7366
7140 7366 7419 -14558 -20511 -26047 -46859 -63502 -44666 -23597 -26345 -13705 21940 24855 21402 -5770
7126 -5770 -35992 -29809 -51507 -61604 -32177 -9842 9539 19208 28217 11530 -3672 9703 -2548
7113 -2548 -28342 -45892 -24689 -39700 -63923 -46362 -21488 3687 14935 20807 6524 -15765
7101 -15765 -34521 -17130 -1524 -12977 -23233 -47604 -32506 -7837 -17481 -47841 -48428 -46882 -47459
7088 -47459 -45816 -21290 -17824 91 6374 20541 7377 4054 17268 23302 30148 10178 -7464
7075 -7464 -20296 -924 -21168 -20032 10476 39664 37726 6990 -35156 -54489 -47553 -30043 3768
7062 3768 20886 56543 54504 37954 18631 11496 12666 50370 30753 28532 44254 25736 27644
7049B7644K27o056l609k4001j1879o864m87J7971P842K1074L4359L0187m568l6549
7035D5291l0397j4005J7736p885k4792j863L811l9777k3918J6927L4146j150j3106
7022c8982K5122L493Q568j1102J5166L704O315R062j3808j9462j3388j2819o856
7009d4987j1716J3686J0615N049J1498K4599K1360r239l893k4125k1600K3051
6997e702M3234j3487k7785O166J8547k424N543J0233j6673k0338J8795J6744j5257
6984A7596J276l814j2476J8903J5122R83l1033k036N997n486m641m866K814P25
6970i36R304L146J445o180O240K3005n045j8342N337k8809n1898J5810K9126J9235
6956A438J2578j8375j6563K1278L251m705j676K7065O699K1840J6572j2644n408
$$ plain form
7049 27644 27871 21815 18206 -5795 -17674 -24538 -25025 -7054 788 21862 56221 86408 81840 45291
7035 45291 14894 889 18625 10740 -14052 -15915 -12104 -51881 -75799 -58872 -24726 -25876 -38982
7022 -38982 -13860 -10367 -1799 -12901 2265 5969 12284 21346 7538 -11924 -25312 -38131 -44987
7009 -44987 -56703 -43017 -32402 -27353 -15855 8744 30104 20865 16972 -7153 -28753 -5702
6997 -5702 37532 24045 -3740 2426 20973 18549 24092 34325 17652 -2686 16109 32853 17596
6984 17596 18872 15058 2582 21485 36607 37590 6557 4521 10518 5032 391 -4475 -1661 -936
6970 -936 8368 11514 12959 6779 13019 36024 30979 12637 17974 -10835 -62733 -46923 -17797 1438
6956 1438 14016 -4359 -20922 356 3607 -1098 -2774 24291 30990 52830 69402 56758 51350
6943E1350k6811K703j036k2306p142k2706l2051k0057K0843J414K7499K2227P663
6930A590j9318k0760P33K0690N937J3381j0309L825J4119m749P24j0393m066n035
6916a3631r545j058J7227J6028J1j8445J987R455o941J224j0883l891J4756K7323
6902B3617J1181J1643N42l3094q414M694J48n967J2288J5886o711j7394P310N781
6888B1510L483J5806p143j7041j6010r18j1397J5219J2523k462J1337J521J1614
6875C8042j2210k0883k0427L687P403J393j6976j6619J0729J4192J3879J4472
6863A6682j454j1673J1481J0359J712j943r828R314K2155j1710k5726p891N01
6850A979j0293j1211o511J5577J4890K8451j8949k5871Q650r642K0829K0002N571
$$ plain form
6943 51350 24539 27242 26206 3900 -3242 -25948 -57999 -78056 -57213 -55799 -28300 -6073 1590
6930 1590 -17728 -38488 -37755 -17065 -11128 2253 -8056 -4231 9888 5139 5863 -4530 -8596 -13631
6916 -13631 -23176 -24234 -7007 9021 9032 -9413 -7426 2029 -4912 -3688 -14571 -18462 -3706 23617
6902 23617 34798 46441 46983 13889 5475 10169 10317 4350 16638 32524 25813 8419 15729 21510
6888 21510 24993 40799 33656 16615 605 -313 -11710 3509 16032 13570 24907 26428 38042
6875 38042 25832 4949 -15478 -11791 -4388 -2995 -19971 -36590 -25861 -11669 2210 16682
6863 16682 15228 3555 15036 25395 27107 25164 15336 24650 46805 35095 9369 1478 1979
6850 1979 -8314 -19525 -26036 -10459 4431 32882 13933 -11938 -3288 -12930 7899 27901 33472
6837C3472O569j3904k6341R568J3964j3020l8151j5926K3557k176J6717J3183
6825G512k7388N873j7886k825J9937L29r227K6601K6792M957l8673P451n157n300
6811g004K5131j1010p411J5600J2300O491k5996n423K2937p973J0449j0549r799
6798G743K8082m909m3883k2790k9082J3896K5818m567j8067K1497L3366r718j0664
6785a3278J9211J8926J3328j9765o549M254j3645k5207L787J1579j1042L1972
6773A3571k469o651n472P006J8403O412l903j1173j0845j5575R268J6295o183
6760H684j1531J3813J9736K330o197N194j0551j8559j2500K5548K4874K2014k0693
6747D2162o251L687K0026K80J5348j55J4944J5200J5593K4601L5644J9621L4639
$$ plain form
6837 33472 40041 26137 -204 9364 23328 10308 -27843 -43769 -20212 -22388 -5671 7512
6825 7512 -19876 -14003 -31889 -34714 -14777 -14448 -23675 2926 29718 34675 -3998 3453 -1704 -7004
6811 -7004 18127 7117 -294 15306 27606 34097 8101 2678 25615 17642 28091 17542 7743
6798 7743 35825 30916 -12967 -35757 -64839 -50943 -25125 -29692 -47759 -26262 7104 -2614 -13278
6785 -13278 5933 24859 38187 18422 11873 16127 2482 -22725 -18938 -7359 -18401 13571
6773 13571 11102 4451 -1021 5985 24388 30800 26897 15724 4879 -10696 -1428 14867 8684
6760 8684 -2847 10966 30702 33032 26835 32029 21478 2919 -9581 15967 40841 62855 42162
6747 42162 35911 39598 59624 59904 75252 75097 90041 105241 120834 145435 181079 200700 235339
6734B35339j7035m4739j4618j0962J7176k1756l0156J9525L9159P55L2067L1487
6722B36242N4184N0596P4519J20375J80919K72566L96560O03477R06735J327454
6712D223627J500931M92472j079844j457683j152270p31930m33532l01635j96475
6703H63661j34409j03741j06170q1984o4736m4146j9915O783j3449O918Q256J810
6691C18878J6822M0559L6287n257l2098k1885Q345k2570k4157R498K5559J0239
6679C60220J5808K7519k2651K5895J1440J2128K3194K5678J1421k5249k4176p838
6667D33389m741j6473k4786j2585j3062P586j7632p538l170l6681j4317N912k3097
6654B72805J1921M09n8189l3292k4644L682J5301l742m3290Q298k438O201j2051
$$ plain form
6734 235339 218304 173565 158947 147985 165161 143405 113249 132774 171933 172688 204755 236242
6722 236242 290426 341022 415541 535916 716835 989401 1385961 1989438 2896173 4223627
6712 4223627 5724558 6217030 5137186 3679503 2527233 1795303 1361771 1060136 863661
6703 863661 729252 625511 519341 437357 372621 328475 308560 315343 301894 308812 317068 318878
6691 318878 335700 376259 412546 407289 375191 353306 361651 339081 314924 324422 349981 360220
6679 360220 376028 403547 380896 406791 418231 430359 453553 479231 490652 465403 441227 433389
6667 433389 428648 412175 387389 374804 361742 369328 351696 344158 340988 304307 289990 295902 272805
6654 272805 284726 285135 226946 193654 169010 172692 187993 184251 140961 149259 146821 153022 140971
6641A40971k7459k3911k3957J0447J9586j0293k1202L4040J4111j2191j5971J6246
6629A00417p758m6465J4854J365j2191n785O179J1597j8617j6631j4623K0033
6617C2375K2971n718p135K2407J4528J766l0300j8313j065j8091r683j5527R482
6604b303J995j2608J7757J8794J2301o898o141Q062l3233j0510r710K1410J6349
6591A5265K685K813j7245j7132N701J0123Q738Q824j1094j3897K586J5091q192
6578D266k9265Q300l077J0299K3833O718j2547K6k771J6446j610k557k4223K3510
6564A7348K0693j5814M077L259p424k5247p366j7670N30r527k519M020j948k054
6550c9642K2162J1134R499R345N60n332k451k307N82k7070k1112l800L1336K5513
$$ plain form
6641 140971 113512 89601 65644 76091 95677 85384 64182 98222 112333 100142 84171 100417
6629 100417 92659 46194 61048 62413 50222 44437 50616 62213 43596 26965 12342 32375
6617 32375 55346 49628 42493 64900 79428 81194 50894 32581 31516 13425 3742 -11785 -2303
6604 -2303 -308 -12916 4841 23635 35936 29038 22897 30959 -2274 -12784 -22494 -1084 15265
6591 15265 17950 20763 3518 -13614 -7913 2210 10948 19772 8678 -5219 -2633 12458 4266
6578 4266 -24999 -16699 -19776 -9477 14356 21074 8527 8553 5782 22228 20618 18061 -6162 17348
6564 17348 38041 22227 26304 29563 22139 -3108 -10474 -28144 -27614 -37141 -39660 -35640 -37588 -39642
6550 -39642 -17480 -6346 3153 12498 13058 7726 5275 2968 3550 -23520 -44632 -48432 -17096 8417
6536H417m627k0807P200J0735l5857j9975J3837J1830K007q622P198J0415L538
6523a4711k0888J2247K6178j129j1697j2626q343Q149L1631k550k2899O813q456
6510a8281K300m671J2670O995k8946n54J2390J8827j4561k8872L520P996Q67k355
6496c2675Q172J1989J0782j1250K624Q762K5819P888o423k8598k6560K977K551
6483b3942j0789q285K3729o9r541O625k5073K3013M74j4572j0045L4131J4096
6470b48Q97J7102P890j7816j3342m093M664J344j6106o948P165J0922P615N371
6456D417j9360j2916o090J393j584K704R006p99J0867N601l576N016l5571k3435
6442f4327m300R060K5977P968J4676r071P853J4790j2618k1802j1657J4920J8882
$$ plain form
6536 8417 3790 -17017 -9817 918 -34939 -54914 -41077 -29247 -27240 -35862 -28664 -18249 -14711
6523 -14711 -35599 -23352 2826 1697 -10000 -22626 -30969 -22820 8811 6261 -16638 -9825 -18281
6510 -18281 -15981 -20652 -7982 -987 -29933 -30487 -18097 730 -13831 -42703 -39183 -31187 -30320 -32675
6496 -32675 -24503 -12514 -1732 -12982 -10358 -1596 24223 32111 25688 -2910 -29470 -26493 -23942
6483 -23942 -34731 -43016 -19287 -19356 -28897 -22272 -47345 -24332 -23858 -38430 -48475 -14344 -248
6470 -248 649 17751 25641 7825 -5517 -9610 -4946 -3602 -19708 -26656 -19491 -8569 -954 4417
6456 4417 -14943 -27859 -33949 -32556 -34140 -31436 -22430 -23229 -12362 -6761 -10337 -5321 -40892 -64327
6442 -64327 -68627 -59567 -33590 -25622 -10946 -20017 -12164 2626 -9992 -31794 -43451 -28531 -9649
6429i649J8480J9895J4490k1705O560M1778Q478q425o555j0709J41j5136m9974
6416a2331k8853K575J9230N687Q655j5993J6552j356j6266n244j1149j0789J4983
6403c4299j4J9144J0617J5805k7476r367O089j4748j6476K4948J0180q555k91
6390b4443r665q116O783J2281J6645o99R64K2057n690k0909K7387J541q150K2672
6376C2658j4807J754L766k0483j2100O477J6111r98q235j1736k844K4185K035
6363A5783M852m395L328k2306k1332J1899r806J1575Q554j785m85n645k3395J5074
6349a8084J2992l490k5113k4744j1326L0516K9291r066k445n460l2667K897L3002
6336b3697r346P496K1057O243J8132o715j8615j3229O980P064n317R229J2432
$$ plain form
6429 -9649 8831 28726 43216 21511 28071 69849 78327 69902 63347 52638 52779 37643 -12331
6416 -12331 -41184 -38609 -19379 -13692 -5037 -21030 -4478 -5834 -22100 -27344 -38493 -49282 -34299
6403 -34299 -34313 -15169 -4552 11253 -16223 -25590 -19501 -34249 -50725 -25777 -15597 -24152 -24443
6390 -24443 -34108 -42224 -35441 -23160 -6515 -7214 -6250 15807 10117 -10792 16595 18136 9986 32658
6376 32658 17851 19605 23371 2888 -9212 -2735 13376 12378 4143 -7593 -10437 13748 15783
6363 15783 20635 16240 19568 -2738 -24070 -12171 -21977 -10402 -1848 -3633 -4118 -9763 -33158 -18084
6349 -18084 -5092 -8582 -33695 -58439 -69765 -39249 -9958 -19024 -21469 -26929 -59596 -56699 -23697
6336 -23697 -33043 -25547 -4490 1753 19885 13170 -5445 -18674 -11694 -4630 -9947 -718 11714
6323A1714o399L031J2867l345l0654j8640P774K7140L058r71k1840l9722N880
6310e0107K0716m85l067O6K0890P338j8752N536P37j3677l19O357P279K9029K0770
6295C2311m723p574l8027j1425K6060J9558J3966n759k0088j0858J124J1543M445
6282A0553l097j3864n901L789n689j90K0740J0991K3160J954l6317j6133L2002
6269B1998J3185P197J2681M554j1440K307k2892k194K385l1321n249K2592K489
6256A6292M563k2420j876M406L295J2472o079m237J6830j8335p857j9157r897
6243c2000O1J7483o999k017n711J867P054M999K9501J50k2758k0255r19j6022
6229d5566q612K4495L0442k4408Q063K6907r716j61k418L716j2939L421k002l356
$$ plain form
6323 11714 5315 8346 21213 17868 -12786 -31426 -23652 3488 6546 5575 -16265 -55987 -50107
6310 -50107 -29391 -29876 -32943 -32877 -11987 -4649 -23401 -17865 -17128 -30805 -31124 -24767 -17488 11541 32311
6295 32311 27588 20014 -18013 -29438 -3378 16180 30146 24387 4299 -6559 -5435 6108 10553
6282 10553 7456 -6408 -12309 -8520 -14209 -14399 6341 17332 40492 42446 6129 -10004 21998
6269 21998 35183 42380 55061 59615 48175 50482 27590 25396 27781 -3540 -8789 13803 16292
6256 16292 20855 -1565 -3441 965 4260 16732 10653 6416 23246 4911 -2946 -22103 -32000
6243 -32000 -31939 -14456 -21455 -23472 -29183 -27316 -20262 -15263 14238 14388 -8370 -28625 -29544 -45566
6229 -45566 -54178 -29683 759 -23649 -15586 11321 1605 1444 -974 2742 -10197 -6776 -8778 -12134
6215a2134l641L680L8790j5185P186k006k1201L728J5669J4993R2N903M197j5276
6201B4795n269Q028j4176k2686r447K0990L15k0022Q165j4479j5803K2637J7278
6188C26l481m214r838l318M414R330o765j0530L484Q529J0953J4891J5248j6831
6174A2198M897K6672N932l1544j1918O773q127r353q400P395K4507M879j924k3806
6160a819L1752L2419m788l0565n2861j2315L689Q628M2k0309j1385J7573L7251
6147b688J7915j463j2415k1386n613M684P549j691M184P956J2141o692o588K0381
6133A6274P764R015o075l9515o594L598j5034O999J5440J959K9026q019n5092
6120d0254j5042L3636J4092k6037j660J9334J8677N4J505j9791j0962K4519P173
$$ plain form
6215 -12134 -15775 -12095 26695 11510 18696 16690 -4511 -783 14886 29879 29971 35874 40071 24795
6201 24795 19526 27554 13378 -9308 -18755 2235 2550 -17472 -9307 -23786 -39589 -16952 326
6188 326 -3155 -7369 -17207 -20525 -16111 -6781 -13546 -24076 -20592 -12063 -1110 13781 29029 12198
6174 12198 17095 43767 49699 18155 6237 13010 4883 -4470 -12870 -5475 19032 23911 21987 -1819
6160 -1819 29933 62352 57564 26999 -25862 -38177 -34488 -25860 -25818 -46127 -57512 -39939 -2688
6147 -2688 15227 13764 1349 -20037 -25650 -20966 -13417 -15108 -10924 -2968 9173 2481 -4107 16274
6133 16274 24038 33053 26978 -12537 -19131 -15533 -30567 -23568 -8128 -6169 22857 14838 -40254
6120 -40254 -55296 -21660 -7568 -33605 -35265 -15931 2746 2800 4305 -15486 -26448 -1929 5244
6107E244J0353J3693K592j7266L655j2033j9259J2332K6758R051j8858k3809q121
6094a5668J0154l651K924J7502q716K5594m721l7462n797o956K3312K4854j4415
6081F954L544K6502p707k2240j5258J0297m740k2854o413j6519j7310L2477M2620
6068I353K5643R071j2343O04k3329j7874j3673r786K236M231j6084J0491Q745
6055b2715K8152L1721K4319K417n0982k0301J249O986K5498r687k8603q86J3059
6042B27L53J4010K05L137k2274P120r678J4442P957r509r251J8356k1856j1042
6028a7803J0290L3569N255j4870j8614j965o613q415J9019m944m4256q681N352
6015e2676K1545K2486q439j7459K7301o536k6365K3919N794J2164k725l3314M856
$$ plain form
6107 5244 15597 29290 31882 14616 18271 6238 -13021 -689 26069 35120 16262 -7547 -15668
6094 -15668 -5514 -9165 -6241 11261 2545 28139 23418 -14044 -19841 -26797 -3485 21369 6954
6081 6954 10498 37000 29293 7053 -8205 2092 -2648 -25502 -31915 -48434 -65744 -33267 9353
6068 9353 34996 44067 31724 32328 8999 -8875 -22548 -32334 -30098 -25867 -41951 -31460 -22715
6055 -22715 5437 37158 61477 63894 12912 -7389 -6140 846 26344 16657 -11946 -12832 227
6042 227 580 14590 14795 17932 -4342 2778 -6900 7542 15499 5990 -3261 15095 -6761 -17803
6028 -17803 -7513 26056 31311 16441 -2173 -4138 -10751 -19166 -147 -5091 -49347 -58028 -52676
6015 -52676 -31131 -8645 -17084 -34543 -7242 -13778 -40143 -16224 -10430 1734 -991 -34305 -29449
6002b9449Q354j9252P037K445N744J281j518O810k4039j3497J5449J6506K0770
5989c359J3439J034K102k2639j8624R231J7861J232k946j8266k5517P677l632
5976d2407J5463K4863J0635k513k0963j1498J217J3008j3777K1293n466l2369
5964d2514J787O569J8477n896r492M924j2038j1971q02J1033j8215p841L7920
5951b8059M7963m053j7931k8702k1864K8825J5480n435K9203J5254n062J494N730
5938C2843j831k141r097r12k7616O092j4068j1885L7105R468j2952l0915K7962
5925B053K2620N389j1809j0798K618j2729k1220O793P750J2863Q476m694J6706
5912B4018J4434j4862r921L47l400R957p523j8254j2055j028K3392J6570k330
$$ plain form
6002 -29449 -21095 -40347 -33310 -30865 -25121 -23840 -25358 -18548 -42587 -56084 -40635 -24129 -3359
5989 -3359 10080 11114 13216 -9423 -28047 -18816 -955 277 -2669 -20935 -46452 -38775 -42407
5976 -42407 -26944 -2081 8554 6041 -14922 -26420 -25203 -12195 -25972 -4679 -10145 -42514
5964 -42514 -40727 -34158 -15681 -21577 -31069 -26145 -38183 -50154 -50956 -39923 -58138 -65979 -28059
5951 -28059 19904 15851 -2080 -30782 -52646 -23821 -8341 -13776 15427 30681 25619 27113 32843
5938 32843 31012 28871 19774 18862 -8754 -2662 -16730 -28615 8490 17958 5006 -25909 2053
5925 2053 24673 30062 18253 7455 10073 -2656 -23876 -17083 -9333 3530 12006 7312 24018
5912 24018 38452 23590 13669 14016 10616 20573 13050 -5204 -17259 -18287 5105 21675 19345
5899A9345k4072j3603k2299n696K1002j288m191J5478k5435j5885M272J4110K1121
5886a7141j837R604p105k7910K586L393J5275R206r784r941k1071j1407M325L0847
5872c0960K8544L499j7329l9155j0200K0524Q805J9175j0028l818J2639J3208
5860e096l3293J0846K0107O404l413J1283L2789k8970m4567j1622j7551o395L3955
5847c5523J9660k1989r016J6387l3313L936J3762K9519J7229k995J887j4696m230
5834a9382K3622N829j8940M981N033j3143L655K137l1018J0730K0199J1387j6703
5821a1613J3521l8302j8480J5201P809J3290n253K732l798O152j657N833R095
5808e470J9824p341j6152o291K5810J6003j9923j8529k899J9497J8280j5555L805
$$ plain form
5899 19345 -4727 -18330 -40629 -46325 -25323 -26611 -30802 -15324 -40759 -56644 -52372 -38262 -17141
5886 -17141 -18978 -9374 -16479 -44389 -41803 -38410 -23135 -13929 -23713 -33654 -54725 -66132 -61807 -30960
5872 -30960 -2416 1083 -16246 -55401 -65601 -45077 -36272 -17097 -27125 -30943 -18304 -5096
5860 -5096 -38389 -27543 -7436 -1032 -4445 6838 39627 10657 -33910 -45532 -63083 -69478 -35523
5847 -35523 -15863 -37852 -46868 -30481 -63794 -59858 -46096 -16577 652 -2343 -456 -15152 -19382
5834 -19382 4240 10069 -8871 -3890 1143 -12000 -8345 -6208 -37226 -26496 -6297 5090 -11613
5821 -11613 1908 -36394 -54874 -39673 -31864 -18574 -23827 -21095 -24893 -18741 -20398 -14565 -5470
5808 -5470 14354 7013 -9139 -15430 10380 26383 6460 -12069 -14968 4529 22809 7254 11059
5795A1059K860m520k6725j6631K3498K5034K556k393N015p257k6346l5870r230
5782e8950K4808k676j502n990o345n059J0166J9410Q458M435J3895l042o545K9223
5768B0286j7337J6945J5756r016k3498j3301J1135n834l2058l382Q276j9395J1465
5755c9958Q062J6735j4436j60O83L192j2168K715K6580K253j6482j104K4867K3882
5741B4661j979l1008j2112M968K2514q260N00k0915j1674K5828J2032j3099J3355
5728D811M5839Q094l5799j6156K700k5521L372J2938j2466q025j36J5132M274
5715i43J3441p180l5477l4117J9932K8434J6448K646j5112L1755j840J700l079
5702A6608l9045J9623K1554J3384m488j7884l1149n74J5948r51n413Q949k208
$$ plain form
5795 11059 13919 9399 -17326 -33957 -10459 14575 17131 14738 19753 12496 -13850 -49720 -58950
5782 -58950 -34142 -36818 -38320 -44310 -50655 -55714 -45548 -26138 -17680 -13245 650 -2392 -8937 20286
5768 20286 2949 19894 35650 26634 3136 -10165 970 -4864 -36922 -40304 -32028 -51423 -39958
5755 -39958 -31896 -15161 -29597 -29757 -29074 -25882 -38050 -35335 -8755 -6502 -22984 -24088 779 24661
5741 24661 22682 -8326 -20438 -15470 7044 -1216 -716 -21631 -33305 -7477 4555 -8544 4811
5728 4811 50650 58744 22945 6789 9489 -16032 -12660 278 -12188 -20213 -20349 -5217 -943
5715 -943 12498 5318 -30159 -64276 -44344 -15910 538 3184 -11928 19827 17987 19687 16608
5702 16608 -22437 -2814 18740 32124 27636 9752 -21397 -21971 -6023 -6974 -12387 -3438 -5646
5689e646j1272J1533K7436o356l121Q105k334k8286Q10j6177L3349J1886l0118
5676a0191m879k2008j3166m886K4628k426j5798Q218P601r094J1834M50p953L228
5662c4442K98J167o084Q514J2370J8689J4877L736j6706o216j2843n298J4222
5649g716J0662q002o53n605j5451j5688L31K7529L3294j7445j1398K832J2108
5636D798J0297J545J1129Q979k9126m664r43L780J775K0926N622j795r715j5111
5622G497J1483P730j1928k9604j5020j6915L391K8415L98j2820j4891k366K9099
5609a5531N682N419j2851j2150j8284K5942N9599K4299j0125k6310Q711j1121
5597B3280j4474o558J7103o91k8587k6062j1823J2404J5386K1305P445o450L429
$$ plain form
5689 -5646 -16918 -5385 22051 15695 12574 20679 18345 -9941 -9131 -25308 8041 19927 -10191
5676 -10191 -15070 -37078 -50244 -55130 -30502 -32928 -48726 -40508 -32907 -42001 -30167 -29717 -37670 -34442
5662 -34442 -34144 -32977 -39061 -30547 -18177 512 15389 19125 2419 -3797 -16640 -21938 -7716
5649 -7716 2946 -5056 -5709 -11314 -26765 -42453 -42122 -14593 18701 1256 -10142 -7310 4798
5636 4798 15095 16640 27769 36748 7622 2958 2015 5795 7570 28496 34118 32323 22608 7497
5622 7497 18980 26710 14782 -14822 -29842 -46757 -43366 -14951 -14553 -27373 -42264 -44630 -15531
5609 -15531 -9849 -4430 -17281 -29431 -47715 -21773 37826 62125 52000 25690 34401 23280
5597 23280 8806 2248 19351 18660 -9927 -35989 -47812 -35408 -20022 1283 8728 2278 5707
5584E707l0804R28J5620J1016j2361J9113M786j1528o578j3051l2925k5672j1460
5571h7209j1873O618K4539M8331J7642O124J7455J6609m9533j8375m796J7431
5559a7037J3560k4050j6858J1945J4343L230j7868j1204J6854O805J3248J8669
5547A1637J9212M0056k7597l9560k2357k4812R119K8561K124J2829r044k8077
5535b7909j347K190J608j5404r956K1156p813k392q73k5293o851Q067Q058Q195
5521d8564J6025M0485O265k2235K291M915Q776K7945j8667k6435K2513M08R063
5508B2785l0917k4800K4119q447J0125j3131j7550N067n102R307K173K157N403
5495a8811j4717p054N304O49j611j0773k3204k957J7182L917K7636O507p630J6951
$$ plain form
5584 5707 -25097 -24169 -8549 2467 -9894 9219 14005 2477 -4101 -17152 -50077 -75749 -87209
5571 -87209 -99082 -92464 -67925 -19594 -1952 4172 21627 38236 -11297 -29672 -34468 -17037
5559 -17037 -3477 -27527 -44385 -32440 -18097 -14867 -32735 -43939 -27085 -20280 -7032 11637
5547 11637 30849 70905 43308 3748 -18609 -43421 -34302 -5741 -3617 9212 168 -27909
5535 -27909 -29256 -27066 -25458 -40862 -50818 -29662 -37475 -39867 -40740 -66033 -72884 -64817 -56759 -48564
5521 -48564 -32539 7946 14211 -8024 -5733 -818 7958 35903 17236 -9199 13314 13722 22785
5508 22785 -8132 -32932 -8813 -17260 -7135 -20266 -37816 -32749 -37851 -28544 -26371 -24214 -18811
5495 -18811 -33528 -40582 -35278 -34629 -36240 -47013 -70217 -73174 -55992 -52075 -24439 -17932 -25562 -8611
5481h611M023J6349J2984J6416m603k0156k1298j8470q949J3809Q113J6736P134
5468A3477l4791j9910J8410O079j5L988K904j2006q990J1094J1997m854o377J2912
5454f082Q989k198N320K0785j553N566K498O875j4117n3221j4505K1319J4732
5441e592K3816j7081P491j626J5741p400j832j4245j1642j4953j0434M819J2173
5428b0765J3307J4809q821p732J7826J3704M881l1852k3594k6175j5667K9728
5416d0351K9476Q957J2867P420o478m236l318N282j1362J2707k555j2245j6395
5403b0231K984j1880M441J5144l634L6728r151J2393j5375p42J2331r088L91p704
5389F607n462k822l0598k1182j513J1992M822O414J3343m088k3007j994n813l211
$$ plain form
5481 -8611 -4588 11761 24745 41161 36558 16402 -4896 -23366 -32315 -18506 -10393 6343 13477
5468 13477 -21314 -41224 -22814 -16735 -16750 -12762 -9858 -21864 -30854 -19760 -7763 -12617 -18994 -6082
5454 -6082 2907 709 6029 26814 25261 30827 33325 40200 26083 -27138 -41643 -20324 -5592
5441 -5592 18224 1143 8634 7008 22749 15349 13517 -728 -12370 -27323 -37757 -32938 -20765
5428 -20765 -7458 7351 -1470 -9202 8624 22328 27209 -4643 -28237 -54412 -70079 -40351
5416 -40351 -10875 -1918 10949 18369 11891 7655 4337 9619 -1743 10964 8409 -3836 -20231
5403 -20231 -17247 -29127 -24686 -9542 -13176 23552 14401 26794 11419 10677 23008 13920 14311 6607
5389 6607 1145 -1677 -32275 -53457 -54970 -42978 -38156 -31742 -18399 -22487 -45494 -47488 -53301 -56512
5375e6512R128K0252J1548j2788J3482o076k904J5470O340l781M974L874l085
5362g8k765Q226M167j0781J4735P813p929j4026R564j3168K253O329J0816Q759
5348B3915q086M897n265j7124M89k143j6969r546Q988J6079O680j0470O492J3351
5334A1288J8684n622k7034M917K844l2411j4534j3440m125L1989K5804L0855N841
5321C5056j1371k4623n413J4885O717K1968L878q20K1461P596K5798j1104n9693
5308B4335l815K4927J3846k0730k2705j9446R6L000K3138r24k5168n743p992K3010
5294E829j480j8766J492K4665K6801J694k3862r040J0171j2778l4215j8392J5097
5281c2784K4230N258K0238M34j6881K1790J0912J2515P186m800J10p840j9949
$$ plain form
5375 -56512 -47384 -27132 -15584 -28372 -14890 -20966 -23870 -8400 -2060 -5841 -867 3007 -78
5362 -78 -2843 5383 9550 -1231 13504 21317 13388 -638 8926 -4242 -1989 4340 15156 23915
5348 23915 15829 20726 15461 -1663 -1174 -3317 -20286 -29832 -20844 -4765 1915 -8555 -2063 11288
5334 11288 29972 24350 -2684 2233 5077 -27334 -41868 -55308 -59433 -27444 -1640 29215 35056
5321 35056 23685 -938 -6351 8534 15251 37219 41097 40277 61738 69334 95132 84028 24335
5308 24335 20520 45447 59293 38563 15858 -3588 -3492 -492 22646 21722 -3446 -9189 -17181 5829
5294 5829 4349 -14417 -12925 11740 38541 40235 16373 7333 17504 4726 -29489 -47881 -32784
5281 -32784 -8554 -3296 16942 17376 495 22285 33197 45712 52898 48098 48208 40368 20419
5268B0419K202J6662o758L578J0207m553J1391q757j4189j6205k2489j3406j8971
5255d0869K597J9712N406M022P830j8782q908p10j633j864J1006Q303J0213j2136
5241a5813N175l402J06J3164L0791q531k6512j0440Q456j3072j2637j143K0083
5228a3775o707K4727L1110j6907J8408m264j3564j6129j7359J1476K8169L774
5216B8959k165j5722n111l569j1331o805k3191K3827J4620q675K1996p111M067
5203I789L6600J4766j2141k5018j4888j866N594J1512J6456J7157j5633j09r033
5190C3186J0379M808k2644j5198K0903q294k0730K607j2757J2223n025o451P331
5177C38K4826p766J0575K5848j1185j9596j1863L373j08N577M332J8047N336k1700
$$ plain form
5268 20419 22621 39283 32525 36103 46310 41757 53148 44391 30202 13997 -8492 -21898 -40869
5255 -40869 -38272 -18560 -13154 -9132 -1302 -20084 -28992 -29702 -31335 -33199 -22193 -13890 -3677 -15813
5241 -15813 -10638 -14040 -13934 -770 30021 21490 -5022 -15462 -7006 -20078 -32715 -33858 -13775
5228 -13775 -20482 4245 35355 18448 36856 32592 19028 2899 -14460 -2984 25185 28959
5216 28959 26794 11072 5961 2392 -8939 -15744 -38935 -15108 -488 -9163 12833 5722 9789
5203 9789 46389 61155 49014 23996 9108 7242 12836 24348 40804 57961 42328 42219 33186
5190 33186 43565 48373 25729 10531 31434 23140 2410 5017 -7740 4483 -542 -6993 338
5177 338 25164 17398 27973 53821 42636 23040 11177 14550 14442 20019 24351 42398 47734 26034
5163B6034j189K779p01k0647l1042R431P266j826l89J885j2099k1817N319Q596
5149b8400K5397J8901Q89k3616l6063K4174L3643l039J367j7520q264Q7M892k324
5135i876J5269L3220R625j6267j8067l0216M4j3096r682m39J1139r699m904K2800
5121b0149R431j1589J790K8343M272l191P17R774K578j854k0423j3169L362j7422
5107b7530P618J3062M3327l172Q300j0344l3386k6659J4510J0136k0494M916K904
5094a6812N537K6409j0452k0559M898J0178j5880j0440l22J6772J7185O833p075
5081F272Q750l2757j7286r530r311P980K0185L6408j0787l407R416k538J5089
5068A8484r280q438l0235r445N572o693Q327O429L262l1139J1766J0175K217L814
$$ plain form
5163 26034 24845 27624 26923 6276 -24766 -15335 -8069 -9895 -10284 -8399 -20498 -42315 -36996 -28400
5149 -28400 -3003 15898 16787 -6829 -42892 -18718 14925 11886 13253 -4267 -12531 -12444 -7552 -9876
5135 -9876 5393 38613 48238 31971 13904 -16312 -16268 -29364 -39046 -39485 -28346 -38045 -42949 -20149
5121 -20149 -10718 -22307 -20517 7826 12098 8907 9624 19398 21976 20122 -301 -13470 -10108 -27530
5107 -27530 -19912 -6850 36477 33305 41605 31261 -2125 -28784 -14274 -4138 -24632 -19716 -16812
5094 -16812 -11275 15134 4682 -15877 -10979 -801 -16681 -27121 -27443 -10671 6514 13347 6272
5081 6272 15022 -17735 -35021 -44551 -53862 -45882 -25697 10711 -76 -3483 5933 3395 18484
5068 18484 9204 766 -29469 -38914 -33342 -40035 -31708 -25279 -22017 -53156 -41390 -31215 -28998 -25184
5054b5184K8206N994J4156N895q349k1355k012K06k7066j6677J3783J0223R336
5041a2844k234K1953J4552q407K413q273J8171P946l2568j8242k204l870J9950
5028c657J3170j4576J9625O583j6701k2789j0210j1067J6446K697j2002K0454
5016a2027K0579P809J5584l697k1591j5455j6126o27k36L6674J2964j8688q021
5003b858q5o763L8332L0078m9228j5798J3898m004p570Q920K182n315j4406R372
4989c245J3270j2842l2943l1898k0235Q333L8249J0500k264K0823N404j218J918
4976f148j0423m856J6692K7729l762q102o712L58J4407j6006k0494m538J9354
4963b501J912Q188J647j5112J3973N372j9400j2523J0644q137j3098K2218J7551
$$ plain form
5054 -25184 3022 9016 23172 29067 20718 -637 -2649 -2443 -29509 -46186 -32403 -22180 -12844
5041 -12844 -15078 6875 21427 13020 15433 7160 25331 33277 709 -17533 -19737 -23607 -3657
5028 -3657 9513 -5063 14562 21145 4444 -18345 -28555 -39622 -23176 -20479 -32481 -12027
5016 -12027 8552 16361 31945 28248 6657 -8798 -24924 -25551 -25787 10887 23851 5163 -2858
5003 -2858 -2943 -9706 28626 58704 9476 -6322 7576 3572 -3998 4922 7104 1789 -12617 -3245
4989 -3245 10025 -2817 -35760 -67658 -87893 -79560 -41311 -30811 -33075 -12252 -6848 -8066 -6148
4976 -6148 -16571 -21427 -4735 22994 19232 11130 4418 4776 19183 3177 -17317 -21855 -2501
4963 -2501 -589 7599 9246 -5866 8107 13479 -5921 -18444 -7800 -15937 -29035 -6817 10734
4950A0734K612p031k996q084j8289K343J8065k2142m704M01j4043K1549L4811
4937A3226j0633k8480k0772N547P666K1066k301J2442L1416M275k308P697k4113
4924A4728J3705N187n098K448J020J471j6208k8035P077K3596J7763j9716j3054
4911D884M4O428r075k9008r864L3754j0029k1109n923p590P504O522J8409L1842
4897A6789o313Q151N31l899l783n413j3110L097K2587o302M084J274j2053k1152
4883a5512j2426L753L5936J3988j4676n0594k7748N890J8100K2836J0125k381
4871a2709J9106p346r87L0723j7970k075L488j7541o522q014n002j0121L5K2923
4857a2012J3551j1209l46q212m206N421O80N358P695P567j1652j9187K4318N008
$$ plain form
4950 10734 13346 6315 3319 -4765 -23054 -20711 -2646 -24788 -29492 -29091 -43134 -21585 13226
4937 13226 2593 -25887 -46659 -41112 -33446 -12380 -14681 -2239 29177 33452 31144 38841 14728
4924 14728 28433 33620 28522 30970 31990 33461 17253 -10782 -3705 19891 37654 17938 4884
4911 4884 4928 11356 2281 -26727 -36591 -2837 -12866 -33975 -39898 -47488 -39984 -33462 -15053 16789
4897 16789 10476 18627 19158 15259 11476 6063 -7047 -3950 18637 12335 16419 17693 5640 -15512
4883 -15512 -27938 -24185 11751 25739 11063 -39531 -67279 -61389 -43289 -20453 -10328 -12709
4871 -12709 6397 -949 -1936 28787 10817 8742 12230 -5311 -11833 -19847 -24849 -34970 -34935 -12012
4857 -12012 1539 -9670 -10016 -18228 -22434 -17013 -16333 -10975 -3280 4287 -7365 -26552 -2234 2774
4843B774L5991l851l4326k6640k4228J1262K1165N588n171m600k020L19m38K5492
4829A317J7416m157R570k5198j712j621j9275N638J759o807J9701j4390j0870
4816b8629O433j491K1238J2923N238j2296J3674N157o7j7973L8k4706k5373N451
4802d0383o894P349n691J0068J1036K0622K8119j0164K807K0200L890q71J5748
4789E5836k492j3540l490J3233j0150l0748k1523J0575L9420l939N323M1r538
4776B9008j788k4150Q533j7453j7353j6422k9081l108K2896L3187J5337M892Q186
4763A2684n395l217k0602j5610P988L9030J0802n5584j3515l0420j414L3268N851
4750c6134p81K4763L3843Q967j7213k9914J1454J3922k697J6125O656j1111j9922
$$ plain form
4843 2774 38765 34914 588 -26052 -50280 -39018 -17853 -12265 -17436 -22036 -24056 -23737 -24175 1317
4829 1317 18733 14576 24146 -1052 -2764 -4385 -23660 -18022 -16263 -23070 -3369 -17759 -28629
4816 -28629 -22196 -23687 -2449 10474 15712 3416 17090 22247 22180 4207 4245 -20461 -45834 -40383
4802 -40383 -47277 -39928 -45619 -35551 -24515 -3893 24226 14062 16869 37069 40959 40088 55836
4789 55836 53344 39804 36314 49547 39397 8649 -12874 -2299 37121 33182 38505 38546 29008
4776 29008 27220 3070 11603 -5850 -23203 -39625 -68706 -71814 -48918 -15731 -394 4498 12684
4763 12684 7289 4072 -16530 -32140 -24152 14878 25680 -29904 -43419 -73839 -75253 -41985 -36134
4750 -36134 -36915 -12152 21691 30658 13445 -16469 -5015 8907 6210 22335 28991 17880 -2042
4737b042j046j9512k8668O710J0791J2676r838p859J2731O345J3190M040M176
4724A694Q865r580o704K1495L3540l737j6869o141J4054j0539j1152K449j4930
4711B445l6059j5456J2233J2013j2560J7436n204j7313L5597N2606j1346l7961
4699c569j9502n343M42J1249K2766P952j4818n494J619J2220J1082n372j0649
4686B583k3646O063K2049J5949q222p467J2754L3751o976k8269k4714q025L645
4673a0525m899M072k1511q639M2786l843j6743K2649K4028m249k6521m1045j6229
4660f0669k1273j884L8607J4542k3817j025L1261K3069R023K746l71n077K634
4647G766k3087K8073K9856k0650m893o887l3932q326K0448L1289j0336j0600M838
$$ plain form
4737 -2042 -3088 -22600 -51268 -44558 -33767 -21091 -30929 -38788 -26057 -19712 -6522 -2482 1694
4724 1694 10559 979 -5725 15770 49310 45573 28704 22563 36617 26078 14926 17375 2445
4711 2445 -33614 -49070 -36837 -24824 -37384 -19948 -25152 -42465 -6868 45738 34392 -3569
4699 -3569 -23071 -28414 -27972 -16723 6043 13995 -823 -6317 -4698 7522 18604 13232 2583
4686 2583 -21063 -15000 7049 22998 14776 7309 20063 53814 46838 18569 -6145 -14170 -10525
4673 -10525 -15424 -11352 -32863 -41502 1284 -2559 -19302 3347 27375 23126 -3395 -44440 -60669
4660 -60669 -81942 -83826 -45219 -30677 -54494 -55519 -24258 -1189 7834 10580 10209 5132 7766
4647 7766 -15321 12752 42608 21958 17065 10178 -23754 -32080 -11632 19657 9321 -1279 3559
4634C559J4392m93k9293N936Q691k2419k7116O182K2259J4357q506n737K0784
4621B596m81q033P229K1923J662j9282q993O722O054J2870P493j1495n827k15
4607A2223o571M684j342j1793j8180K6389L0609j1545P616m792j0396m609j4881
4594b588L347N209P153O580r69N492k9195j2994Q295K1285J6989n562J1858l570
4580C1330M228J4388P901j4927j4111k8628M984j7169J5055K9248K4223O800k1579
4567D1743n906j2089k900j0434r574j2059Q050K2987O916j8142P37J7953p145
4554B0137J456R280l30j7871k6999m275O519j2794L802J2440k479k2233K7865
4541e482K5225J4323k8263j3450O908R335k8943J8380L9813j803J8165J30k5545
$$ plain form
4634 3559 17951 17458 -11835 -5899 2792 -19627 -46743 -40561 -18302 -3945 -12451 -18188 2596
4621 2596 2115 -5918 1311 23234 24896 5614 -3379 3343 9397 22267 29760 18265 12438 12223
4607 12223 5652 10336 8994 -2799 -20979 5410 36019 24474 32090 27298 16902 12293 -2588
4594 -2588 759 5968 13121 19701 18732 24224 -4971 -17965 -9670 11615 28604 23042 34900 31330
4580 31330 35558 49946 57847 42920 28809 181 5165 -12004 3051 32299 56522 63322 41743
4567 41743 35837 23748 20848 10414 840 -11219 -3169 19818 26734 8592 9329 27282 20137
4554 20137 21593 30873 30543 12672 -14327 -18602 -12083 -24877 -21075 -8635 -11114 -33347 -5482
4541 -5482 19743 34066 5803 -7647 -739 8596 -20347 -1967 37846 36043 54208 54338 28793
4528B8793P295o773k8377j16q994j2188J1928J0766N510j1536r769j0900n43J3116
4514a1788p526j0159k992L745L1171P435j3309o655j6579j0779J545J9404J3870
4501b617q54J056M474J4848P519k2334l710r401K6927l352n828k1650K334j4274
4487b6862L464K9320j9189j0760J8347J9351r535k031J9714j2896M403p486k3643
4474a7803j4921J7274J4247O362k3318N570r713L0079j5415J5409J4068n779q550
$$ plain form
4528 28793 36088 29315 938 822 -8172 -20360 -8432 2334 7844 -3692 -13461 -24361 -24904 -11788
4514 -11788 -19314 -29473 -32465 -28720 2451 9886 -3423 -10078 -26657 -37436 -35891 -16487 -2617
4501 -2617 -3471 -2415 2059 16907 24426 2092 -1618 -11019 15908 12556 6728 -14922 -12588 -26862
4487 -26862 -23398 5922 -13267 -24027 -5680 13671 4136 2105 21819 8923 13326 5840 -17803
4474 -17803 -32724 -15450 -1203 5159 -18159 -12589 -22302 7777 -7638 7771 21839 16060 7510
$$ [...]
##END NTUPLES=NMR SPECTRUM
##END=
