##TITLE=Analysis number 307325
Compound Code cc 35446
Book Reference 419/96
Project Code adrs
Chemist Name anns
##JCAMPDX= 6.0         $$ Bruker NMR JCAMP-DX V2.0
##DATA TYPE= NMR SPECTRUM
##DATA CLASS= NTUPLES
##ORIGIN= Bruker BioSpin GmbH
##OWNER= NMR
$$ XWIN-NMR		Version 3.5
$$ Wed Apr 27 13:11:29 2005 GMT Daylight Time (UT+1h)  MAYBRIDGE\NMR@NMR_250MHZ
##.OBSERVE FREQUENCY= 250.131544655141
##.OBSERVE NUCLEUS= ^1H
##.ACQUISITION MODE= SIMULTANEOUS (DQD)
##.ACQUISITION SCHEME= undefined
##.AVERAGES= 16
##.DIGITISER RES= 18
##SPECTROMETER/DATA SYSTEM= dpx250
##.PULSE SEQUENCE= zg30
##.SOLVENT NAME= CDCl3
##.SHIFT REFERENCE= (INTERNAL, CDCl3, 0, 16.522)
##AUDIT TRAIL= $$ (NUMBER, WHEN, WHO, WHERE, WHAT)
$$ ##TITLE= Audit trail, XWIN-NMR		Version 3.5
$$ ##JCAMPDX= 5.01
$$ ##ORIGIN= Bruker BioSpin GmbH
$$ ##OWNER= NMR
$$ C:\u/data/dgb/nmr/ADRS/2330/pdata/1/auditp.txt
$$ ##AUDIT TRAIL=  $$ (NUMBER, WHEN, WHO, WHERE, WHAT)
(   1,<2005-04-27 13:11:11.42 +100>,<MAYBRIDGE\NMR>,<NMR_250MHZ>,
      <created by zg, POWCHK disabled, PULCHK disabled
       configuration hash MD5:
       62 19 C7 07 E1 42 D1 B7 37 6C 3D D0 77 39 F9 E6
       data hash MD5: 64K
       9E 68 35 83 E4 C0 48 F3 B2 7E 92 66 38 9C 68 37>)
(   2,<2005-04-27 13:11:21.62 +100>,<MAYBRIDGE\NMR>,<NMR_250MHZ>,
      <Start of raw data processing
       ef LB = 0.3 FT_mod = 6 PKNL = 1 SI = 32K 
       data hash MD5: 32K
       1C AA 70 D5 CE 58 04 27 D4 FB 78 56 75 0F 4A 33>)
(   3,<2005-04-27 13:11:23.62 +100>,<MAYBRIDGE\NMR>,<NMR_250MHZ>,
      <apk 
       data hash MD5: 32K
       5D E4 92 94 95 8B F7 A9 54 07 FC 29 50 FA D8 5E>)
(   4,<2005-04-27 13:11:24.37 +100>,<MAYBRIDGE\NMR>,<NMR_250MHZ>,
      <abs ABSG = 5 
       data hash MD5: 32K
       F5 EA D2 72 24 4C 46 D9 C2 61 8D FB 91 EE A2 36>)
$$ ##END=
$$ 
$$ hash MD5
$$ E3 68 D1 EF 7E 52 2E 08 5F 64 C4 D1 0A D3 42 11
##$RELAX= 
##$RELAX= 
##$RELAX= 
##$RELAX= 
##$RELAX= 
##$RELAX= 
##$RELAX= 
$$ Bruker specific parameters
$$ --------------------------
##$DU= <C:\u>
##$EXPNO= 2330
##$NAME= <ADRS>
##$PROCNO= 1
##$TYPE= <nmr>
##$USER= <dgb>
##$AMP= (0..31)
100 100 100 100 100 100 100 100 100 100 100 100 100 100 100 100 100 100 
100 100 100 100 100 100 100 100 100 100 100 100 100 100 
##$AQSEQ= 0
##$AQ_mod= 3
##$AUNM= <au_zg>
##$AUTOPOS= <28 >
##$BF1= 250.13
##$BF2= 250.13
##$BF3= 250.13
##$BF4= 250.13
##$BF5= 500.13
##$BF6= 500.13
##$BF7= 500.13
##$BF8= 500.13
##$BYTORDA= 1
##$CFDGTYP= 0
##$CFRGTYP= 5
##$CHEMSTR= <none>
##$CNST= (0..31)
1 1 145 1 1 1 1 1 1 1 1 1 1 1 1 1 1 1 1 1 1 1 1 1 1 1 1 1 1 1 1 1 
##$CPDPRG= <>
##$CPDPRG1= <>
##$CPDPRG2= <>
##$CPDPRG3= <>
##$CPDPRG4= <mlev>
##$CPDPRG5= <mlev>
##$CPDPRG6= <mlev>
##$CPDPRG7= <mlev>
##$CPDPRG8= <mlev>
##$CPDPRGB= <>
##$CPDPRGT= <>
##$D= (0..31)
0 1 0 0 0 0 0 0 0 0.06 0 0 0 0 0 0 0.0002 0 0 0 0 0 0 0 0 0 0 0 0 0 0 
0 
##$DATE= 1114603870
##$DBL= (0..7)
120 120 120 120 120 120 120 120 
##$DBP= (0..7)
150 150 150 150 150 150 150 150 
##$DBP07= 0
##$DBPNAM0= <>
##$DBPNAM1= <>
$$ [...]
##$SUBNAM7= <"">
##$SUBNAM8= <"">
##$SUBNAM9= <"">
##$SW= 20.6930455092707
##$SWIBOX= (0..15)
0 0 3 0 0 0 0 0 0 0 0 0 0 0 0 0 
##$SW_h= 5175.983436853
##$TD= 65536
##$TD0= 1
##$TE= 297.16
##$TE2= 300
##$TE3= 300
##$TEG= 300
##$TL= (0..7)
0 120 120 120 120 120 120 120 
##$TP= (0..7)
150 150 150 150 150 150 150 150 
##$TP07= 0
##$TPNAME0= <>
##$TPNAME1= <>
##$TPNAME2= <>
##$TPNAME3= <>
##$TPNAME4= <>
##$TPNAME5= <>
##$TPNAME6= <>
##$TPNAME7= <>
##$TPOAL= (0..7)
0.5 0.5 0.5 0.5 0.5 0.5 0.5 0.5 
##$TPOFFS= (0..7)
0 0 0 0 0 0 0 0 
##$TUNHIN= 0
##$TUNHOUT= 0
##$TUNXOUT= 0
##$USERA1= <user>
##$USERA2= <user>
##$USERA3= <user>
##$USERA4= <user>
##$USERA5= <user>
##$V9= 5
##$VALIST= <valist>
##$VCLIST= <CCCCCCCCCCCCCCC>
##$VD= 0
##$VDLIST= <DDDDDDDDDDDDDDD>
##$VPLIST= <PPPPPPPPPPPPPPP>
##$VTLIST= <TTTTTTTTTTTTTTT>
##$WBST= 1024
##$WBSW= 4
##$XGAIN= (0..3)
0 0 0 0 
##$XL= 0
##$YL= 0
##$YMAX_a= 526861
##$YMIN_a= -490823
##$ZGOPTNS= <>
##$ZL1= 120
##$ZL2= 120
##$ZL3= 120
##$ZL4= 120
##$ABSF1= 16.522
##$ABSF2= -4.171173
##$ABSG= 5
##$ABSL= 3
##$ALPHA= 0
##$AQORDER= 0
##$ASSFAC= 0
##$ASSFACI= 0
##$ASSFACX= 0
##$ASSWID= 0
##$AUNMP= <proc_1d>
##$AZFE= 0.1
##$AZFW= 0.1
##$BCFW= 0
##$BC_mod= 0
##$BYTORDP= 0
##$COROFFS= 0
##$CY= 12.5
##$DATMOD= 1
##$DC= 0
##$DFILT= <>
##$DTYPP= 0
##$F1P= 14.0000005364418
##$F2P= -0.99999901652339
##$FCOR= 0.5
##$FTSIZE= 32768
##$FT_mod= 6
##$GAMMA= 0
##$GB= 0
##$INTBC= 1
##$INTSCL= 1
##$ISEN= 128
##$LB= 0.3
##$LEV0= 0
##$LPBIN= 0
##$MAXI= 10000
##$MC2= 0
##$MEAN= 0
##$ME_mod= 0
##$MI= 0
##$NCOEF= 0
##$NC_proc= -3
##$NLEV= 6
##$NOISF1= 0
##$NOISF2= 0
##$NSP= 0
##$NTH_PI= 0
##$NZP= 0
##$OFFSET= 16.522
##$PC= 1
##$PHC0= -81.91747
##$PHC1= 10.75739
##$PH_mod= 1
##$PKNL= yes
##$PPARMOD= 0
##$PSCAL= 4
##$PSIGN= 0
##$REVERSE= no
##$SF= 250.13
##$SI= 32768
##$SIGF1= 0
##$SIGF2= 0
##$SINO= 400
##$SIOLD= 32768
##$SREGLST= <1H.CDCl3>
##$SSB= 0
##$STSI= 32768
##$STSR= 0
##$SW_p= 5175.98343685301
##$SYMM= 0
##$S_DEV= 0
##$TDeff= 65536
##$TDoff= 0
##$TI= <Analysis number 999999
Compound Code 99
Book Reference 9
Project Code 9>
##$TILT= no
##$TM1= 0
##$TM2= 0
##$TOPLEV= 0
##$USERP1= <user>
##$USERP2= <user>
##$USERP3= <user>
##$USERP4= <user>
##$USERP5= <user>
##$WDW= 1
##$XDIM= 32768
##$YMAX_p= 342739188
##$YMIN_p= -57090
$$ End of Bruker specific parameters
$$ ---------------------------------
##NTUPLES= NMR SPECTRUM
##VAR_NAME=  FREQUENCY,     SPECTRUM/REAL,   SPECTRUM/IMAG
##SYMBOL=    X,             R,               I
##VAR_TYPE=  INDEPENDENT,   DEPENDENT,       DEPENDENT
##VAR_FORM=  AFFN,          ASDF,            ASDF
##VAR_DIM=   32768,         32768,           32768
##UNITS=     HZ,            ARBITRARY UNITS, ARBITRARY UNITS
##FACTOR=    0.157963299565203, 1,           1
##FIRST=     4132.6476996994, 0,             0
##LAST=      -1043.33573715361, 0,           0
##MIN=       -1043.33573715361, -57090,      0
##MAX=       4132.6476996994, 342739188,     0
$$ Real data points
##PAGE= N=1
##DATA TABLE= (X++(R..R)), XYDATA
$$ [...]
$$ plain form
16752 -28889 -25303 -32845 -45442 -38933 -27448 -24960 -24602 -18660 -19117 -249 27 -13091 -19627 -22512
16738 -22512 -19822 -16512 -11284 -12042 -12053 -20146 -24124 -24469 -22281 -25407 -11158 -13529 -15485 -15985 -22398
16723 -22398 -22057 -35012 -28247 -21489 -13511 -11133 -15043 -7814 -4825 -10999 -11589 -11346 -13127 -11994 -7901
16708 -7901 -6120 -10319 -987 -7590 -8793 1704 -6663 -4658 8814 193 -9268 -7930 1653 11823
16694 11823 7813 8278 13141 10834 -1593 -16765 -18224 -11121 -6217 -2023 -6261 -26934 -29444 -29760
16680 -29760 -24693 -20357 -17786 -6858 1034 -4850 -3554 -19287 -26339 -15792 -3211 9849 -4099
16667 -4099 -4355 -4616 -15480 -20083 -15369 -10542 -7509 -4320 -13070 -16048 -3112 -16310 -9836 2828
16653 2828 1872 -16137 -20387 -24986 -31729 -31364 -21185 -12043 -5273 -10958 -16030 -24985 -38038 -36970
$$ packed form
16752b8889L586p542j2597O509J1485K488L58N942m57J8868K76j3118o536k885
16738b2512K690L310N228p58j1q093l978l45K188l126J4249k371j956n00o413
16723b2398L41j2955O765O758P978K378l910P229K989o174n90K43j781J133M093
16708g901J781m199R332o603j203J0497q367K005J3472q621r461J338R583J0170
16694A1823m010M65M863k307j2427j5172j459P103M904M194m238k0673k510l16
16680b9760N067M336K571J0928P892n884J296j5733p052J0547J2581J3060j3948
16667d099k56k61j0864m603M714M827L033L189q750k978J2936j3198O474J2664
16653B828r56j8009m250m599o743L65J0179R142O770n685n072q955j3053J068
$$ plain form
16639 -36970 -32401 -30915 -25898 -32221 -15174 -8510 -1678 -477 -261 -2787 -2081 -6667 -2872 8788
16625 8788 1819 -7691 -12229 -20864 -21170 -10297 -10307 -7883 -11926 -15363 -7911 -10022 -9048 14682 15945
16610 15945 5020 6679 2263 -12277 -29154 -31745 -34046 -32300 -28721 -26709 -45009 -50616 -49801 -37129
16596 -37129 -23891 -15858 1809 -6290 -20966 -21945 -13586 -25681 -38644 -33985 -24494 -32667 -41728
16583 -41728 -35960 -29008 -39929 -36243 -17238 -7768 -8927 -2046 -5368 -12532 -20262 -16160 -7690 2640
16569 2640 6225 10500 8767 4220 -1424 -7170 -11307 -2361 11678 12605 -1646 -7944 -12672 -2269
16555 -2269 -7269 -16342 -14788 -4064 -5556 -20111 -19150 -13663 -13790 -6208 -11370 -11072 2154 3081 -6066
16540 -6066 -8196 -13676 -17524 -13877 -18407 -21040 -24762 -27388 -26339 -22258 -15532 6913 3503 -26805
$$ packed form
16639c6970M569J486N017o323J7047O664O832J201K16k526P06m586L795J1660
16625H788o969r510m538q635l06J0873j0K424m043l437P452k111R74K3730J263
16610A5945j0925J659m416j4540j6877k591k301J746L579K012j8300n607Q15J2672
16596c7129J3238Q033J7667q099j4676r79Q359j2095j2963M659R491q173r061
16583d1728N768O952j0921L686J9005R470j159O881l322p164p730M102Q470J0330
16569B640L585M275j733m547n644n746m137Q946J4039R27j4251o298m728J0403
16555b269n000r073J554J0724j492j4555R61N487j27P582n162K98J3226R27r147
16540f066k130n480l848L647m530k633l722k626J049M081O726K2445l410l0308
$$ plain form
16526 -26805 -33931 -29119 -29002 -23325 -15678 -4816 -6178 -15505 -20930 -7951 1957 -9258 -15204 -27026
16512 -27026 -32037 -34125 -25787 -7460 -14913 -23750 -29624 -34128 -30744 -20560 -10680 -10168 -5454 -3746
16498 -3746 -5042 -16036 -22476 -18405 -27194 -26472 -26691 -8523 -3862 -20663 -24514 -19144 -24312 -11437
16484 -11437 -7067 -5916 -5728 -6570 618 13757 17657 3660 -10468 -24182 -16519 -8522 6671 2635
16470 2635 -130 -9256 -13352 -18255 -18352 -18008 -20342 -21132 -19288 -19701 -15306 -15392 -14475 -6454 -19125 -16583
16454 -16583 -11407 -15303 -16908 -7686 534 8268 6515 -626 -7091 -9348 -30835 -29928 -17728 -15703
16440 -15703 -14860 -20618 -15700 -2757 11168 -77 -3770 -10931 -3599 -6486 -140 9024 6099 1061
16426 1061 -1681 -3920 -16292 -23461 -22967 -19770 -20701 -34607 -29627 -30313 -20704 -5745 118 -956 -14181
$$ packed form
16526b6805p126M812J17N677P647J0862j362r327n425J2979R908j1215n946j1822
16512b7026n011k088Q338J8327p453q837n874m504L384J0184R880N12M714J708
16498c746j296j0994o440M071q789P22k19J8168M661j6801l851N370n168J2875
16484a1437M370J151J88q42P188J3139L900j3997j4128j3714P663P997J5193m036
16470B635k765r126m096m903r7L44k334p90J844m13M395q6R17Q021j2671K542
16454a6583N176l896j605R222Q220P734j753p141o465k257k1487R07J2200K025
16440a5703Q43n758M918J2943J3925j1245l693p161P332k887O346R164k925n038
16426A061k742k239j2372p169M94L197r31j3906M980o86R609J4959N863j074j3225
$$ plain form
16411 -14181 -14780 -14623 -15294 1295 8650 -13487 -33373 -21539 -21253 -18418 -15369 -20549 -19911 4857
16397 4857 7503 -1854 246 -1123 -10883 -9819 -9664 -6338 -2018 5887 -1277 -11769 -17487 -14120 -10420
16382 -10420 -121 5643 -1168 -3148 5048 2498 -2082 3156 2018 7268 9504 -6649 -13932 -961
16368 -961 13366 12731 13531 16403 22833 11607 6914 8802 -1680 -11641 -19791 -32004 -26902 -31342
16354 -31342 -24482 -25099 -29737 -26727 -15894 -14767 -18452 -19062 -8033 656 6029 216 -2788 3764
16340 3764 -2646 -23709 -15967 -2760 -3761 -10446 -18347 -21851 -10445 -5362 -995 -7692 -4364 -16307
16326 -16307 -19149 -19491 -18469 -33611 -39284 -28550 -2212 5895 -10801 -23921 -5138 4389 -15164
16313 -15164 -16654 -18923 -23848 -14946 -3860 286 3653 1537 -15544 -25003 -21911 -7059 7604
$$ packed form
16411a4181n99J57o71J6589P355k2137j9886J1834K86K835L049n180O38K4768
16397D857K646r357K100j369r760J064J55L326M320P905p164j0492n718L367L700
16382a0420J0299N764o811j980Q196k550m580N238j138N250K236j6153p283J2971
16368i61J4327o35Q00K872O430j1226m693J888j0482r961q150j2213N102m440
16354c1342O860o17m638L010J0833J127l685o10J1029Q689N373n813l004O552
16340C764o410k1063P742J3207j001o685p901l504J1406N083M367o697L328j1943
16326a6307k842l42J022j5142n673J0734K6338Q107j6696j3120J8783R527j9553
16313a5164j490k269m925Q902J1086M146L367k116j7081r459L092J4852J4663
$$ plain form
16300 7604 -4507 -10926 -9204 -200 5210 -5300 -8896 -17062 -14989 1252 13058 8340 4132 7476
16286 7476 498 -7605 -12320 -18421 -14836 -3509 -3924 5244 -2856 -489 6498 8797 2285 -10384
16272 -10384 -3693 1254 2924 12941 20131 11784 1652 -4469 -9749 -21468 -31768 -41466 -35574
16259 -35574 -29691 -26113 -25067 -15770 -25311 -15341 -13820 -25302 -8047 2337 6280 2935 -5976 -6563
16245 -6563 -15985 -5709 -7860 -13186 -6465 -12313 -7725 2415 -2004 -4940 -8082 -29150 -35365 -30072
16231 -30072 -20888 -16702 -13363 -8769 -1089 271 -3616 694 4395 -12217 -1446 -7158 -16447 -11558
16217 -11558 -2821 -2647 -5517 1904 -9335 -9890 -8057 -19402 -23689 -28333 -34798 -30905 -14031 -8720
16203 -8720 -10728 -19020 -14634 -9291 -13254 -16289 -17787 -25837 -22250 -22702 -20087 -12210 -9356 -8959 -9236
$$ packed form
16300G604j2111o419J722R004N410j0510l596q166K073J6241J1806m718m208L344
16286G476o978q103m715o101L585J1327m15R168q100K367O987K299o512j2669
16272a0384O691M947J670J0017P190q347j0132o121n280j1719j0300r698N892
16259c5574N883L578J046R297r541R970J521j1482J7255J0384L943l345q911n87
16245f563r422J0276k151n326O721n848M588J0140m419k936l142k1068o215N293
16231c0072R184M186L339M594P680J360l887M310L701j6612J0771n712r289M889
16217a1558Q737J74k870P421j1239n55J833j1345m287m644o465L893J6874N311
16203h720k008q292M386N343l963l035j498q050L587m52K615P877K854L97k77
$$ plain form
16188 -9236 -15064 -18074 -15482 -6929 -541 265 -10012 -14926 -3697 -954 -13621 -16708 -12323 -4515
16174 -4515 -985 -1395 10159 18214 6703 32159 39196 29901 24312 21191 7627 10976 6122 -3781
16160 -3781 4281 -1450 1717 2255 7139 -1554 -18576 -17710 -13447 -837 3184 8471 16863 24502 18025
16145 18025 7413 -1761 3444 -1875 -13498 -21560 -15535 -3077 2530 -12015 -23448 -18548 -22832
16132 -22832 -37932 -34787 -28052 -19301 -15006 -7341 -15273 -16061 -9611 -3925 885 -11594 -6800 -805
16118 -805 18668 24838 13760 9517 315 -6817 -7372 -4674 -12395 -17310 -21747 -26962 -21690 -5851
16104 -5851 -1436 -12907 -19697 -22151 -15669 -4726 -8147 -7726 -19543 -3826 3602 -10125 -5675 -2045
16090 -2045 -3686 -11679 -23482 -24498 -9829 -5004 -2361 -19408 -34076 -26254 -18876 -5667 -3199
$$ packed form
16188i236n828l010K592Q553O388Q06j0277m914J1229K743j2667l087M385P808
16174d515L530m10J1554Q055j1511K5456P037r295n589l121j3564L349m854r903
16160c781Q062n731L167N38M884q693j7022Q66M263J2610M021N287Q392P639o477
16145A8025j0612r174N205n319j1623q062O025J2458N607j4545j1433M900m284
16132b2832j5100L145O735Q751M295P665p932p88O450N686M810j2479M794N995
16118h05J9473O170j1078m243r202p132n55K698p721m915m437n215N272J5839
16104e851M415j1471o790k454O482J0943l421M21j1817J5717P428j3727M450L630
16090b045j641p993j1803j016J4669M825K643j7047j4668P822P378J3209K468
$$ plain form
16077 -3199 -3785 -3236 1089 6036 5236 112 719 -3818 -10401 -23674 -37623 -36756 -32445 -29354 -24099
16062 -24099 -21050 -20623 -10870 -5871 -12643 -15451 -13582 -4548 3103 -2458 -3371 -12487 -14490 -22651 -13907
16047 -13907 -8355 -9605 -15771 -4532 1156 -2016 5641 1842 -6205 -13601 -12247 -1211 -10825 -20523
16033 -20523 -18708 -17351 -28352 -40030 -33628 -24700 -24813 -36877 -31648 -26310 -27294 -21497 -6072 -6721
16019 -6721 -13790 -19535 -6079 -2805 -4609 2048 10914 6985 4581 4555 -542 -9022 -13711 -14010 -143
16004 -143 8672 -2661 -9672 4076 6426 -5435 -15776 -29512 -22590 -11541 -1751 -4755 -18959
15991 -18959 -22040 -26668 -29667 -45193 -56270 -57090 -38457 -24981 -16783 -12947 -3342 -15645 -15065 -17943
15977 -17943 -22871 -11901 -14432 -15598 -16208 -34451 -22198 3313 11046 5571 -10924 -16146 -5538
$$ packed form
16077c199n86N49M325M947q00n124O07m537o583j3273j3949Q67M311L091N255
16062b4099L049M27R753M999o772k808J869R034P651n561r13r116k003q161Q744
16047a3907N552j250o166J1239N688l172P657l799q047p396J354J1036r614r698
16033b0523J815J357j1001j1678O402Q928j13j2064N229N338r84N797J5425o49
16019f721p069n745J3456L274j804O657Q866l929k404k6n097q480m689k99J3867
16004a43Q815j1333p011J3748K350j1861j0341j3736O922J1049R790l004j4204
15991a8959l081m628k999j5526j1077q20J8633J3476Q198L836R605j2303N80k878
15977a7943m928J0970k531j166o10j8243J2253K5511P733n475j6495n222J0608
$$ plain form
15964 -5538 -3934 7133 17293 10635 -12291 -13553 1087 11801 4323 -6835 -8888 -7275 -20765
15951 -20765 -21822 -12134 -2569 -11010 -18241 -17974 -13377 -21987 -18385 -19592 -25473 -9377 -11717 -8271
15937 -8271 -15902 -15317 -10170 -10481 -16318 -7625 3278 14628 10258 -1605 -3720 13026 13987 14481 14453
15922 14453 12433 13077 4676 9282 5413 4798 13541 24846 28261 25477 19629 21657 37198 43879
15908 43879 35306 36625 35000 15762 24275 35645 32516 21292 40524 58445 59842 59197 62471
15895 62471 72918 91900 112738 121414 129441 151417 153255 147213 131536 132686 128357 127647 116949
15882 116949 105337 92524 96649 82687 66522 65927 59224 55418 47765 41120 44000 46274 39486
15869 39486 27114 27598 30700 13179 14669 19206 25495 28773 22784 15432 16067 27352 22356 18162
$$ packed form
15964e538J604J1067J0160o658k2926j262J4640J0714p478j1158k053J613j3490
15951b0765j057R688R565q441p231K67M597q610L602j207n881J6096k340L446
15937h271p631N85N147l11n837Q693J0903J1350m370j1863k115J6746R61M94k8
15922A4453k020O44q401M606l869o15Q743J1305L415k784n848K028J5541O681
15908D3879q573J319j625j9238Q513J1370l129j1224J9232J7921J397o45L274
15895F2471J0447J8982K0838Q676Q027K1976J838o042j5677J150m329p10j0698
15882A16949j1612j2813M125j3962j6165n95o703l806p653o645K880K274o788
15869C9486j2372M84L102j7521J490M537O289L278n989p352O35J1285m996m194
$$ plain form
15855 18162 15185 19870 18278 14551 19727 20474 11350 7264 4194 10500 16018 13359 8086 5255 3261
15840 3261 8498 -2193 -9453 -19373 -22905 -16023 -10102 5636 13416 15592 17275 16072 19873 23700
15826 23700 15358 3849 1624 8760 16006 7039 6517 2673 5320 621 8434 15617 14684 14029 20357
15811 20357 25342 23023 24168 25588 32798 24230 22185 19362 14436 2993 8759 17980 19952 21310
15797 21310 21131 13216 7416 7181 1163 -6990 -6926 -5999 -324 5536 15097 17648 11048 8987 13350 8418
15781 8418 2698 5554 11268 29963 21520 9489 5566 4741 21989 10839 -5132 -5800 8002 22385
15767 22385 32335 17828 13452 21870 25462 18375 14881 16494 7880 3071 276 6149 6148 14393 10930
15752 10930 10721 8153 9102 17467 17981 17837 25862 15732 14306 13879 6979 12210 16504 7859 6520
$$ packed form
15855A8162k977M685j592l727N176P47r124m086l070O306N518k659n273k831j994
15840C261N237j0691p260r920l532O882N921J5738P780K176J683j203L801L827
15826B3700q342j1509k225P136P246q967n22l844K647m699P813P183r33o55O328
15811B0357M985k319J145J420P210q568k045k823m926j1443N766R221J972J358
15797B1310j79p915n800k35o018q153O4R27N675N860R561K551o600k061M363m932
15781H418n720K856N714J8695q443j2031l923q25J7248j1150j5971o68J3802J4383
15767B2385R950j4507m376Q418L592p087l494J613q614m809k795N873jQ245l463
15752A0930k09k568R49Q365N14j44Q025j0130j426m27o900N231M294q645j339
$$ plain form
15737 6520 7906 14159 11142 7811 11109 -358 -11740 -11281 3987 7942 17953 16796 4558 -3645
15723 -3645 -1862 -1718 -1680 -4076 8245 10980 10344 -6008 -11895 -13268 -21825 -8434 -4538 7801 13834
15708 13834 8369 9359 22273 24190 22441 16286 12880 17317 21695 20360 19820 18178 19394 10862 2446
15693 2446 1455 4152 2526 2165 3632 3124 8131 5755 -5589 -4000 3485 2397 95 3515 11786
15678 11786 10644 5585 24999 22360 17697 631 -11807 -16572 -6223 2818 -3200 -13907 -8896
15665 -8896 -14074 -22699 -21336 -8645 -22137 -8885 9115 5860 2330 -5593 -3083 5702 6225 -2157
15651 -2157 -6154 9995 15244 3320 -8128 -8416 6383 14435 10925 -1779 -8009 -14425 -3653
15638 -3653 -7002 -7710 -20483 -26098 -21315 -22937 -22130 -16346 -6121 2257 2962 -10116 -16145 -12785 -9369
$$ packed form
15737F520J386O253l017l331L298j1467j1382M59J5268L955J0011j157j2238q203
15723c645J783J44L8k396J2321K735o36j6352n887j373q557J3391L896J2339O033
15708A3834n465R90J2914J917j749o155l406M437M378j335n40j642J216q532q416
15693B446r91K697j626l61J467n08N007k376j1344J589P485j088k302L420Q271
15678A1786j142n059J9414k639m663j7066j2438m765J0349R041o018j0707N011
15665h896n178q625J363J2691j3492J3252J8000l255l530p923K510Q785N23q382
15651b157l997J6149N249j1924j1448k88J4799Q052l510j2704o230o416J0772
15638c653l349p08j2773n615M783j622Q07N784J0225Q378P05j3078o029L360L416
$$ plain form
15623 -9369 -18134 -14930 574 13063 14382 562 -10038 -18148 -7622 2675 5893 8788 16735
15610 16735 23866 22831 20158 24194 7920 -12331 -15110 -6334 -233 3202 402 -6398 -11336 -3971
15596 -3971 1628 6970 16998 17620 19548 15173 2402 3349 -8225 -22008 -27719 -5491 -9229 -19438
15582 -19438 -16715 -15783 -10904 13072 16330 759 375 6089 -3409 -6076 1868 -7888 -8683 7369
15568 7369 -6415 -14996 -15279 -4914 6530 12127 19278 12460 13506 6040 7221 13148 13520 9318
15554 9318 -13144 -11187 -11236 -9347 667 -10766 -2070 5082 3044 16696 24490 19 -20796 -34574
15540 -34574 -24132 -16570 -7679 1416 12617 23159 19129 969 -12760 -23313 -27064 -8141 6165
15527 6165 10095 13111 6185 -5810 -10608 -5898 -6381 -24423 -19281 -8473 -2376 931 -9683 -3255
$$ packed form
15623i369q765L204J5504J2489J319j3820j0600q110J0526J0297L218K895P947
15610A6735P131j035k673M036j6274k0251k779Q776O101L435k800o800m938P365
15596c971N599N342J0028O22J928m375j2771R47j1574j3783n711K2228l738j0209
15582a9438K723R32M879K3976L258j5571l84N714r498k667P944r756p95J6052
15568G369j3784q581k83J0365J1444N597P151o818J046p466J181N927L72m202
15554I318k2462J957m9J889J0014j1433Q696P152k038J3652P794k4471k0815j3778
15540c4574J0442P562Q891R095J1201J0542m030j8160j3729j0553l751J8923J4306
15527F165L930L016o926j1995m798M710m83j8042N142J0808O097L307j0614O428
$$ plain form
15513 -3255 4419 -11110 -20425 -18043 -18244 -24631 -15092 -8261 3679 23898 24062 28407 27940 -5928
15499 -5928 -8500 5760 5038 7000 10497 379 -3349 142 -3529 -8074 -9337 -13776 -16663 -17603 -12553
15484 -12553 -5637 2 5306 -8393 -14958 -7177 -10732 -8155 -13263 -14815 -25222 -29594 -20173 -16307
15470 -16307 -22804 -28148 -29266 -31335 -20643 -2813 21087 24142 7332 910 1833 -26 -6539 -14410
15456 -14410 -350 4136 -18054 -20124 -9959 -9487 -8592 -16903 -14354 -8701 -4671 -1899 -849 4935
15442 4935 5623 3640 1699 6367 11483 21502 21861 15020 5341 4151 -3602 -23626 -19175 -6317
15428 -6317 -2713 -4923 7582 4520 5252 2327 -8009 -4184 -2831 -8842 -20615 -10325 1271 -6073
15414 -6073 -18923 -30202 -17907 -910 -7080 -15567 -28626 -39294 -22972 -11655 6520 18622
$$ packed form
15513c255P674j5529r315K382k01o387R539O831J1940K0219J64M345m67l3868
15499e928k572J4260p22J962L497j0118l728L491l671m545j263m439k887r40N050
15484a2553O916N639N304j3699o565P781l555K577n108j552j0407m372R421L866
15470a6307o497n344j118k069J0692J7830K3900L055j6810o422R23j859o513p871
15456a4410J4060M486k2190k070J0165M72Q95q311K549N653M030K772J050N784
15442D935O88j983j941M668N116J0019L59o841r679j190p753k0024M451J2858
15428f317L604k210J2505l062P32k925j0336L825J353o011j1773J0290J1596p344
15414f073j2850j1279J2295J6997o170q487j3059j0668J6322J1317J8175J2102
$$ plain form
15402 18622 13230 15090 4733 -1056 -1495 5984 11340 2422 -1393 -2751 -5021 -6379 7011 6347
15388 6347 -8373 -12789 -15826 -15085 -11423 -9850 -1721 -10981 -11503 -17352 -19822 -14474 -11977 -12933 -1350
15373 -1350 4625 -2418 -15285 -17020 -4883 5276 8865 15287 12664 -2196 -17262 -31279 -20798
15360 -20798 -5025 -3234 10001 11301 11056 -1682 -12836 -15790 -17186 -12214 1301 2647 -709
15347 -709 -12332 -20479 -23262 -12947 1191 8171 7430 6119 5543 11081 16467 19378 9477 3893 -4499
15332 -4499 -19872 -17881 -13025 -13075 -3999 6770 11405 25637 22270 2150 -1565 -1452 13758 10092
15318 10092 -7814 -12654 -12661 -5007 11969 11419 2253 -2253 -12213 -9206 3507 8198 2989 -280 -2711
15303 -2711 1527 4689 6274 2467 13881 8025 2019 3276 -2070 1565 -1059 6674 5427 8331
$$ packed form
15402A8622n392J860j0357n789m39P479N356q918l815j358k270j358J3390o64
15388F347j4720m416l037P41L662J573Q129r260n22n849k470N348K497r56J1583
15373a350N975p043j2867j735J2137J0159L589O422k623j4860j5066j4017J0481
15360b0798J5773J791J3235J300k45j2738j1154k954j396M972J3515J346l356
15347g09j1623q147k783J0315J4138O980p41j311n76N538N386K911r901n584q392
15332d499j5373J991M856n0R076J0769M635J4232l367k0120l715J13J5210l666
15318A0092j7906m840pP654J6976n50r166m506r960L007J2713M691n209l269k431
15303b711M238L162J585l807J1414n856o006J257n346L635k624P733j247K904
$$ plain form
15289 8331 15115 4082 2781 2948 603 -200 1657 -96 17420 20447 16592 11547 14295 12760 7863
15274 7863 9304 20289 12584 -456 -2209 8102 6034 193 -1649 -3956 -12550 -27979 -27127 -14912
15260 -14912 -12949 1019 13687 20811 30323 33113 34321 22448 25695 31909 40373 42425 46831 58961
15246 58961 81583 105391 126968 148863 161049 182543 190926 188572 194997 194069 185886 169482 151029
15233 151029 129046 117467 104813 85303 67178 58530 56514 56319 41179 34973 32534 29375 34064
15220 34064 48387 46784 46547 46663 36123 13896 14778 10459 -4716 -7903 5506 17845 25608 17087
15206 17087 12548 6968 6036 -4312 -3640 15613 6420 -6898 -3924 -108 -3695 -12480 -18069 -19550
15192 -19550 -17658 -9834 -9609 -11583 -15268 -1384 -472 -7423 -1051 6725 7092 7491 12934 26343 23121
$$ packed form
15289H331O784j1033j301J67k345q03J857j753J7516L027l855n045K748j535m897
15274G863J441J0985p705j3040j753J0311k068n841j842k307q594j5429Q52J2215
15260a4912J963J3968J2668P124R512K790J208j1873L247O214Q464K052M406J2130
15246E8961K2622K3808K1577K1895J2186K1494Q383k354O425r28q183j6404j8453
15233A51029k1983j1579j2654j9510j8125q648k016j95j5140o206k439l159M689
15220C4064J4323j603k37J16j0540k2227Q82m319j5175l187J3409J2339P763q521
15206A7087m539n580r32j0348O72J9253r193j3318K974L816l587q785n589j481
15192a9550J892P824K25j974l685J3884R12o951O372P776L67L99N443J3409l222
$$ plain form
15177 23121 -1282 -12719 -10567 -4945 12752 2133 -10269 -10172 797 14463 15312 8004 11008
15164 11008 5213 9874 6638 -5347 -6366 -3091 -6512 -15382 -25014 -10491 3290 779 -16023
15151 -16023 -22594 -14894 -15761 -21241 -9939 -9493 -15653 -13265 2094 5575 6929 3412 -13075 -3879
15137 -3879 2554 4159 3521 -8250 -25011 -21028 -9442 -6805 -6960 -20026 -20060 -18914 -14343 -1559
15123 -1559 6341 2281 3287 1871 -42 2246 7170 17432 17130 2788 -8977 -4864 -15785 -12186
15109 -12186 -1593 -682 -18743 -22270 -7271 -3844 -6447 -335 -9648 -20310 -25113 -11943 4977
15096 4977 18062 -1032 -15082 -18809 -19531 -20001 -18249 -17132 1292 -6111 -21100 -21978 -15145 -1141
15082 -1141 -9699 -15117 -12772 -9965 -22056 -18927 -17864 -16773 -14900 -23635 -16768 -20629 -31165 -28022
$$ packed form
15177B3121k4403j1437K152N622J7697j0619j2402R7J0969J3666Q49p308L004
15164A1008n795M661l236j1985j019L275l421q870r632J4523J3781k511j6802
15151a6023o571P700q67n480J1302M46o160K388J5359L481J354l517j6487R196
15137c879O433J605o38j1771j6761L983J1586K637j55j3066l4J146M571J2784
15123a559P900m060J006j416j913K288M924J0262l02j4342j1765M113j0921L599
15109a2186J0593R11j8061l527J4999L427k603O112r313j0662m803J3170J6920
15096D977J3085j9094j4050l727p22m70J752J117J8424p403j4989q78O833J4004
15082a141q558n418K345K807j2091L129J063J091J873q735O867l861j0536L143
$$ plain form
15068 -28022 -17136 -11427 -12181 -952 1263 -2750 -16108 -29270 -37789 -27168 -20959 -20157 -17896 -18041
15054 -18041 -17558 -9074 -13751 -17735 -21626 -31848 -32884 -27517 -12759 -7353 -12535 -8240 -4275 -10620
15040 -10620 -12448 -21481 -24529 -11684 -9990 -14159 -12033 -21301 -18643 -19167 -19757 -21184 -8338 -17926
15026 -17926 -19915 -18887 -11674 -14868 -8742 -16532 -19339 -16498 -16034 -23379 -24350 -12751 -10192 -11414 -16088
15011 -16088 -12907 -8685 -11488 -10870 750 -5955 -19008 -25490 -20862 -12810 -6443 -9643 447 1758
14997 1758 -233 -3184 -14385 -19961 -10318 3075 5893 11281 -3328 -14845 -3164 -1748 -7242
14984 -7242 -9697 -9670 -15332 -11834 -9158 1612 11048 5935 -11923 -17298 -20945 -22763 -23316 -12305 -2245
14969 -2245 -2511 -4018 -3337 -4961 -9468 -6332 -3963 -667 3818 7957 -5593 -3268 8495 -695 -3668
$$ packed form
15068b8022J0886N709p54J1229K215m013j3358j3162q519J0621O209Q02K261j45
15054a8041M83Q484m677l984l891j0222j036N367J4758N406n182M295L965o345
15040a0620j828r033l048J2845J694m169K126r268K658n24n90j427J2846r588
15026a7926j989J028P213l194O126p790k807K841M64p345r71J1599K559j222m674
15011a6088L181M222k803O18J1620o705j3053o482M628Q052O367l200J0090J311
14997A758j991k951j1201n576R643J3393K818N388j4609j1517J1681J416n494
14984g242k455K7n662L498K676J0770R436n113j7858n375l647j818n53J1011J0060
14969b245k66j507O81j624m507L136K369L296M485M139j3550K325J1763r190k973
$$ plain form
14954 -3668 -14549 -19788 -10320 1066 -7497 -1056 3369 -8578 -18567 -23276 -23143 -6310 -889 -19284
14940 -19284 -20982 -18354 -31562 -42703 -33866 -20213 -14995 -17026 -13183 -15263 -17441 -5083 -5764 -5805
14926 -5805 -4557 -7521 -4593 -13354 -23706 -38093 -22836 -16818 -14336 -1935 -7641 -22203 -13619
14913 -13619 -8379 431 -6390 -2537 2484 7831 -11506 -10271 -6418 -6948 8460 7815 2160 10652
14899 10652 5758 9216 -13209 -21488 -19294 -20471 -12694 3646 -8260 -15809 -2379 -198 -770 -536
14885 -536 -14430 -24889 -17569 -13624 -10610 -5527 -11437 -15633 -10865 877 -3805 -11218 -1220 11426
14871 11426 6619 -3754 -2184 -12530 -1030 -2720 -18022 -16343 -38253 -41813 -34580 -36359 -33275
14858 -33275 -31248 -21455 -24183 -29794 -13008 4612 4231 6519 9494 13065 9687 409 -15640 -28780
$$ packed form
14954c668j0881n239R468J1386q563O441M425j1947r989m709J33J6833N421j8395
14940a9284j698K628j3208j1141Q837J3653N218k031L843k080k178J2358o81m1
14926e805J248k964K928q761j0352j4387J5257O018K482J2401n706j4562Q584
14913a3619N240Q810o821L853N021N347j9337J235L853n30J5408o45n655Q492
14899A0652m894L458k2425q279K194j177P777J6340j1906p549J3430K181n72K34
14885e36j3894j0459P320L945L014N083n910m196M768J1742m682p413R998J2646
14871A1426m807j0373J570j0346J1500j690j5302J679k1910l560P233j779L084
14858c3275K027R793k728n611J6786J7620l81K288K975L571l378r278j6049j3140
$$ plain form
14844 -28780 -34312 -34937 -16395 -2252 -1996 3480 -4778 -9582 -21375 -30041 -23700 -456 8704 7196
14830 7196 -10335 -31672 -40587 -28782 -27556 -17874 -18552 -10900 -10194 -27503 -35064 -23401 -13452 -28441
14816 -28441 -35620 -21876 -13590 -25383 -34536 -31166 -13904 -6372 -7782 -11370 -12493 -13031 -13739 -15697
14802 -15697 -14133 1286 14937 11390 3658 10854 4983 -293 -2369 -5801 -16828 -10668 5062
14789 5062 14652 4184 -19509 -36369 -30555 -10689 1073 13854 11557 5479 9000 13092 27021
14776 27021 16189 6494 12058 16348 10808 2811 5318 6287 -1505 -4987 -6624 -8957 -3883 -9067
14762 -9067 -6596 -4300 -12070 -10407 -17443 -16179 -8979 -1856 -9518 -14465 -6858 -5333 -4058 102 6832
14747 6832 4541 232 1073 2518 -20196 -15152 -5803 -18067 -11638 -7865 -15111 -15831 -16476 -11078 1165
$$ packed form
14844b8780n532o25J8542J4143K56N476q258m804j1793q666O341K3244R160j508
14830G196j7531k1337q915J1805J226R682o78P652P06j7309p561J1663R949j4989
14816b8441p179J3744Q286j1793r153L370J7262P532j410l588j123n38p08j958
14802a5697J564J5419J3651l547p732P196n871n276k076l432j1027O160J5730
14789E062R590j0468k3693j6860N814J9866J1762J2781k297o078L521M092J3929
14776B7021j0832r695N564M290n540p997K507R69p792l482j637k333N074n184
14762i067K471K296p770J663p036J264P200P123p662m947P607J525J275M160O730
14747F832k291m309Q41J445k2714N044R349j2264O429L773p246p20o45N398J2243
$$ plain form
14732 1165 8928 8363 7350 11809 14128 3078 3952 8308 12961 3786 -5957 -6613 -5532 -14110 -5957
14717 -5957 -13399 -9427 -6340 -8729 -13904 -18627 -12043 -18614 -22554 -22215 -13682 -14971 414 4167 -7515
14702 -7515 -8115 -19103 -34944 -35809 -31400 -23203 -24669 -13785 -17572 -16990 -13344 -2830 -40 12074
14688 12074 12428 17715 10621 -10751 -15221 -12441 -2504 1180 -7977 4938 4101 395 -7681 -4297
14674 -4297 3855 1724 -4171 -18820 -24450 -27636 -12917 6106 3773 -11659 -16382 -18384 -8735 9427
14660 9427 -6716 -26237 -28626 -37832 -32076 -22489 -19359 -30851 -39537 -27922 -11599 -12437 -20042 -14568
14646 -14568 -8768 -3813 10719 10977 -423 3542 -1897 -20578 -26609 -28474 -24041 -15429 -25673 -18673
14632 -18673 -5223 -8158 -12077 -9999 -9724 -18247 -26148 -15947 -3865 -6215 -4280 -19584 -23646 -20346
$$ packed form
14732A165P763n65j013M459K319j1050Q74M356M653r175r743o56J081q578Q153
14717e957p442L972L087k389n175m723O584o571l940L39Q533j289J5385L753j1682
14702g515o00j0988j5841q65M409Q197j466J0884l787N82L646J0514K790J2114
14688A2074L54N287p094k1372m470K780R937L684r157J2915q37l706q076L384
14674d297Q152k131n895j4649n630l186J4719J9023k333j5432m723k002R649J8162
14660I427j6143j9521k389r206N756R587L130j1492q686J1615J6323q38p605N474
14646a4568N800M955J4532K58j1400L965n439j8681o031j865M433Q612j0244P000
14632a8673J3450k935l919K078K75q523p901J0201J2082k350J935j5304m062L300
$$ plain form
14618 -20346 -10369 2470 -9421 -8336 -10763 -11826 -10785 -1804 -3320 -11555 -19080 -20404 -1388 11376
14604 11376 -2822 -20799 -26733 -23085 -27721 -29615 -16457 -6350 -1949 5369 -7538 -22343 -32159
14591 -32159 -23072 -12862 -5338 -3157 -3449 -12784 -5466 10976 14740 6525 7732 7419 10078 9262 19972
14576 19972 14470 1699 -7174 -16793 -8909 -1079 3360 6335 4005 -5666 -20172 -33005 -26743 -16357
14562 -16357 -21595 -9837 7647 1582 -7890 -8528 -11284 -13779 -18547 -41398 -25206 -6697 -14916
14549 -14916 -18656 -8072 12597 16871 -1607 -8630 -24186 -25810 -28652 -47617 -42792 -37760 -35611
14536 -35611 -28965 -16637 -10961 3381 10031 16601 21523 16315 5510 -10040 -18871 -24389 -14940
14523 -14940 5810 -4038 -18648 -10562 -6618 1286 10269 2866 -4161 -2618 11846 15036 7324 5248
$$ packed form
14618b0346R977J2839j1891J085k427j063J041Q981j516q235p525j324J9016J2764
14604A1376j4198j7977n934L648m636j894J3158J0107M401P318j2907j4805r816
14591c2159R087J0210P524K181k92r335P318J6442L764q215J207l13K659q16J0710
14576A9972n502j2771q873r619P884P830M439K975k330r671j4506j2833O262J0386
14562a6357n238J1758J7484o065r472o38k756k495m768k2851J6192J8509q219
14549a4916l740J0584K0669M274j8478p023j5556j624k842j8965M825N032K149
14536c5611O646J2328N676J4342O650O570M922n208j0805j5550q831n518R449
14523a4940K0750r848j4610Q086L944P904Q983p403p027J543J4464L190p712k076
$$ plain form
14509 5248 3158 5364 5234 8468 -233 -6009 -23153 -17712 -18175 -10925 -2364 -203 -5295 -8910 -1074
14494 -1074 -6442 -15243 -16332 111 1463 4386 2319 -13909 -2824 5798 -1933 -7795 -13337 -9785
14480 -9785 -17706 -9262 -13903 -21775 -14567 -12394 -15395 -9242 -4307 -19602 -11554 -2085 1537 -805
14466 -805 530 3265 -3770 -10345 -24076 -21549 -14642 -17107 -17615 -12375 -2632 -8579 -32129 -29256 -12188
14451 -12188 -10062 -22206 -11824 2375 6012 -5264 -16461 -10768 -1029 -2980 -20051 -31457 -27794
14438 -27794 -19073 -33162 -36447 -36549 -31454 -22314 -21432 -17497 -10735 -23066 -17739 -23447 -32258 -26843
14424 -26843 -18256 -22305 -24891 -16283 -8814 -8308 -20694 -21240 -20755 -12622 4098 3374 -7049 -13935 -8161
14409 -8161 2674 -14729 -28070 -31261 -24307 1647 515 3088 9479 19007 21953 7483 -11268
$$ packed form
14509E248k090K206j30L234q701n776j7144N441m63P250Q561K161n092l615P836
14494a074n368q801j089J6443J352K923k067j6228J1085Q622p731n862n542L552
14480i785p921Q444m641p872P208K173l001O153M935j5295Q048R469L622k342
14466h05J335K735p035o575j3731K527O907k465n08N240R743n947k3550K873J7068
14451a2188K126j2144J0382J4199L637j1276j1197N693R739j951j7071j1406L663
14438b7794Q721j4089l285j02N095R140Q82L935O762j2331N327n708q811N415
14424b6843Q587m049k586Q608P469N06j2386n46M85Q133J6720p24j0423o886N774
14409h161J0835j7403j3341l191O954K5954j132K573O391R528K946j4470j8751
$$ plain form
14396 -11268 -11535 -6999 -11909 -11118 -8129 -13353 -17574 -9259 -13820 -7915 -4442 -2332 -503 -12045 -5151
14381 -5151 3370 3228 -6512 -1557 3169 2431 4168 -5359 -8679 -6666 5758 4505 -5681 -12193 -15104
14366 -15104 -10706 -15474 -15099 -19723 -17148 -25835 -33259 -38606 -33487 -21158 -24120 -17319 -12366 -5229
14352 -5229 -16331 -3097 5957 -414 -4025 -5033 -5259 -9802 -27315 -23948 -29830 -37623 -23071 -10824
14338 -10824 8964 6618 9355 7437 -9073 -11111 -412 10786 21865 16962 7812 5342 -156
14325 -156 -3504 -2521 -8796 -3991 125 -5413 -680 11907 26533 17314 3778 -4817 -6726 -1701
14311 -1701 -7485 -9481 -6396 -2093 -2936 12898 12748 -8440 -13189 -4865 -16099 -19078 -18473 -18373 -17249
14296 -17249 -26463 -15779 -1656 -8659 -13136 4789 3885 -9792 -20236 -19361 -7239 -5382 5044
$$ packed form
14396a1268k67M536m910P91K989n224m221Q315m561N905L473K110J829j1542O894
14381e151Q521j42r740M955M726p38J737r527l320K013J2424j253j0186o512k911
14366a5104M398m768L75m624K575q687p424n347N119J2329k962O801M953P137
14352e229j1102J3234R054o371l611j008k26m543j7513L367n882p793J4552J2247
14338a0824J9788k346K737j918j6510k038J0699J1198J1079m903r150k470n498
14325a56l348R83o275M805M116n538M733J2587J4626r219j3536q595j909N025
14311a701n784j996L085M303q43J5834j50k1188m749Q324j1234k979O05J00J124
14296a7249r214J0684J4123p003m477J7925r04j3677j0444Q75J2122J857J0426
$$ plain form
14283 5044 3373 -10786 -6150 8786 -777 -13515 -13063 -11957 -12689 634 11713 56 -14020
14270 -14020 -7001 -4627 -6662 -3637 -217 19469 21927 11503 5165 3987 3741 3685 -1428 -13806
14256 -13806 -13115 2793 15 -3544 18214 18282 12324 13645 20747 13678 3426 3810 3119 -11048 -14901
14241 -14901 -16933 -23955 -25301 -17422 -22875 -20636 -6160 -2962 -303 13561 23656 31841 25596 12052
14227 12052 1084 -4752 -11209 -10009 -3142 3548 5723 -704 5201 7700 16379 11975 17224 18456
14213 18456 12260 14072 13729 7112 5476 9510 8326 13827 20201 19493 24380 24024 20399 26279 32552
14198 32552 25616 15897 18306 16646 15208 17092 17082 18759 25899 29027 24401 8416 2488 3886 7888
14183 7888 12669 28595 26458 35096 43310 32803 14401 13991 29354 42862 43982 52740 65451
$$ packed form
14283E044j671j4159M636J4936r563j2738M52J106p32J3323J1079j1657j4076
14270a4020P019K374k035L025L420J9686K458j0424o338j178k46n6n113j2378
14256a3806O91J5908k778l559K1758O8n958J321P102p069j0252L84o91j4167l853
14241a4901k032p022j346P879n453K239J4476L198K659J3864J0095Q185o245j3544
14227A2052j0968n836o457J200O867O690K175o427N905K499Q679m404N249J232
14213A8456o196J812l43o617j636M034j184N501O374p08M887l56l625N880O273
14198C2552o936r719K409j660j438J884j0J677P140L128m626j5985n928J398M002
14183G888M781J5926k137Q638Q214j0507j8402m10J5363J3508J120Q758J2711
$$ plain form
14170 65451 74651 74884 75263 68430 62693 67087 70633 70505 79763 97917 94287 103487 107524 110775 127982
14155 127982 139220 160401 205306 235115 261936 303705 350256 412098 484121 558546 663468
14144 663468 814741 993651 1208538 1474147 1772125 2099380 2429377 2725106 2972476 3156680
14134 3156680 3246333 3243283 3151254 2981995 2749800 2485658 2217661 1945672 1690899 1468287
14124 1468287 1296594 1151830 1035740 943763 864875 799667 723994 636092 582334 541022 490263
14113 490263 455456 417058 391542 376334 352251 320501 304771 299934 292577 273073 265010 252751
14101 252751 238103 232879 215221 213524 203204 189301 193610 200425 199139 201541 194077 200427 197134
14088 197134 191187 190288 197138 198668 196858 195870 205466 205703 195685 179107 164865 169608 183404 199527
$$ packed form
14170F5451R200K33L79o833n737M394L546j28R258J8154l630R200M037L251J7207
14155A27982J1238K1181M4905K9809K6821M1769M6551O1842P2023P4425J04922
14144F63468J51273J78910K14887K65609K97978L27255L29997K95729K47370J84204
14134C156680Q9653l050r2029j69259k32195k64142k67997k71989k54773k22612
14124A468287j71693j44764j16090r1977p8888o5208p5673q7902n3758m1312n0759
14113D90263l4807l8398k5516j5208k4083l1750j5730m837p357j9504q063j2259
14101B52751j4648n224j7658j697j0320j3903M309O815j286K402p464O350l293
14088A97134n947q99O850J530j810r88R596K37j0018j6578j4242M743J3796J6123
$$ plain form
14074 199527 203464 201101 198171 200201 203834 203769 200587 198104 190634 173784 184729 191264 192613 192533 207007
14059 207007 215082 207725 203645 214964 210306 198804 197083 201310 213959 230656 225019 215493 223764
14046 223764 212897 200136 206119 212698 213974 216746 219804 214704 212563 214939 213473 215977 223820 233218
14032 233218 223867 225551 227506 216660 204168 202942 212115 197002 196503 197096 193919 187018 189766 189797
14018 189797 191160 198072 217854 212367 207220 197585 195624 194682 178639 183851 192374 187500 187576 175285
14004 175285 168116 177976 178239 171813 170477 161753 156631 150275 146682 153692 145595 145808 158038 171505
13990 171505 166709 159588 150111 158106 166611 151461 149508 145535 142735 125712 113693 118792 116669
13977 116669 110217 106351 114003 120307 123653 119772 106041 95485 93975 90815 88246 85800 83791 88655
$$ packed form
14074A99527L937k363k930K030L633o5l182k483p470j6850J0945O535J349q0J4474
14059B07007Q075p357m080J1319m658j1502j721M227J2649J6697n637r526Q271
14046B23764j0867j2761N983O579J276K772L058n100k141K376j466K504P843R398
14032B33218r351J684J955j0846j2492j226R173j5113m99N93l177o901K748L1
14018A89797J363O912J9782n487n147r635j961r42j6043N212Q523m874P6j2291
14004A75285p169R860K63o426j336q724n122o356l593P010q097K13J2230J3467
13990A71505m796p121r477P995Q505j5150j953l973k800j7023j2019N099k123
13977A16669o452l866P652O304L346l881j3731j0556j510l160k569k446k009M864
$$ plain form
13963 88655 93880 96326 87376 82361 62900 55868 62779 68298 55026 54012 58160 65609 78534 76167
13949 76167 62191 49163 56397 65809 59108 54136 63822 70918 74345 71981 63940 58933 51252 60122
13935 60122 80866 65886 49649 41584 42079 51106 52896 50256 43382 32532 16073 21571 35568
13922 35568 32343 35912 37899 37799 41167 37230 43036 38426 35111 31915 26291 6178 4865 16051
13908 16051 19824 12409 24814 31646 35706 31099 17233 16177 14606 7619 9833 18691 10863 11845
13894 11845 8659 2112 -1982 -6536 -12350 -2522 10851 7569 -370 -316 8404 15452 35243 42874
13880 42874 28276 9547 -3112 275 2665 7806 31357 27665 32846 38118 39555 28251 21557
13867 21557 11834 11747 13355 10275 6599 780 6302 14796 24988 29748 29948 26846 25916 27273 20175
$$ packed form
13963H8655N225K446q950n015j9461p032O911N519j3272j014M148P449J2925k367
13949G6167j3976j3028P234R412o701m972R686P096L427k364q041n007p681Q870
13935F0122K0744j4980j6237q065M95R027J790k640o874j0850j6459N498J3997
13922C5568l225L569J987j00L368l937N806m610l315l196n624k0113j313J1186
13908A6051L773p415J2405O832M060m607j3866j056j571o987K214Q858p828R82
13894A1845l186o547m094m554n814R828J3373l282p939N4Q720P048J9791P631
13880D2874j4598j8729j2659L387K390N141K3551l692N181N272J437j1304o694
13867B1557r723q7J608l080l676n819N522Q494J0192M760K00l102r30J357p098
$$ plain form
13852 20175 20026 8998 10263 24910 35958 33426 22038 27068 39902 32554 16630 1418 15599
13839 15599 25412 24981 16648 17426 26285 30480 29614 18999 18768 27621 22335 11229 27100 35485 40058
13824 40058 19671 8247 9349 13718 22755 18410 34491 43663 34769 21688 18064 9691 -733
13811 -733 22523 23988 11447 12562 19353 10709 559 1321 21309 25961 10841 8292 14394 6133
13797 6133 -6398 -18497 -10965 199 8164 9080 15190 27422 25693 25005 15648 3613 -4037 -16498
13783 -16498 -9527 -3927 -7950 -1828 3243 9009 10696 1078 -3377 -2616 -4501 1810 9708 4191 -8420
13768 -8420 12501 34340 24225 14992 10584 9435 6073 7844 14150 21056 24329 10495 1950 -319
13754 -319 -6059 1157 -6011 -18381 -11314 -7012 -3659 -7311 -7137 -16150 -16243 -12401 -1914 5798 16209
$$ packed form
13852B0175j49j1028J265J4647J1048k532j1388N030J2834p348j5924j5212J4181
13839A5599R813m31q333P78Q859M195q66j0615k31Q853n286j1106J5871Q385M573
13824D0058k0387j1424J102M369R037m345J6081R172q894j3081l624q373j0424
13811g33K3256J465j2541J115O791q644j0150P62J9988M652j5120k549O102q261
13797F133j2531j2099P532J1164P965R16O110J2232j729o88r357j2035p650j2461
13783a6498O971N600m023O122N071N766J687r618m455P61j885O311P898n517j2611
13768h420K0921K1839j0115r233m408j149l362J771O306O906L273j3834q545k269
13754c19n740P216p168j2370P067M302L353l652J74r013r3L842J0487P712J0411
$$ plain form
13739 16209 13560 6128 71 -1919 -9407 -17632 -22865 -18057 -6116 -18749 -24530 -4031 851 7524
13725 7524 1122 -3924 -11287 -20422 -9540 -4086 -10178 -9062 -9527 -13388 -15774 -16937 -12416 -16810 -12171
13710 -12171 2825 1785 -6546 -11520 -1745 4591 7827 5692 9583 15831 8303 -4356 2954 16261
13696 16261 22520 14567 2129 2251 6867 10063 6730 14409 27398 10169 -5178 -2377 9349
13683 9349 13260 21793 29777 19807 11247 -6881 -3618 11601 9967 9385 18671 16802 625 4854
13669 4854 6175 12814 6505 -788 -3515 758 3659 4394 -591 -1211 867 11779 11633 7945 -4232
13654 -4232 -14518 -9282 6836 19368 25638 20620 16796 21016 11221 11686 20743 26583 18894 7991
13640 7991 7506 905 11379 14998 7119 7200 13528 16551 10852 5216 -6205 -10023 -8835 7389 11116
$$ packed form
13739A6209k649p432o057j990p488q225n233M808J1941j2633n781K0499M882O673
13725G524o402n046p363r135J0882N454o092J116m65l861k386j163M521m394M639
13710a2171J4996j040q331m974R775O336L236k135L891O248p528j2659P310J3307
13696A6261O259p953j2438J22M616L196l333P679J2989j7229j5347K801J1726
13683I349L911Q533P984r970q560j8128L263J5219j634n82R286j869j6177M229
13669D854J321O639o309p293k727M273K901P35m985o20K078J0912j46l688j2177
13654d232j0286N236J6118J2532O270n018l824M220r795M65R057N840p689j0903
13640G991m85o601J0474L619p879Q1O328L023n699n636j1421l818J188J6224L727
$$ plain form
13625 11116 12724 21263 15491 12620 17198 20849 19180 9717 3354 3216 663 7931 16216 16607 17308
13610 17308 10368 3195 1274 -10010 -17939 -6259 -14587 -13237 -924 10605 14158 -4129 -12247
13597 -12247 -238 2100 -1534 -5717 -5433 -561 8672 16205 15748 14325 8685 13578 14720 10026 4205
13582 4205 -1262 2954 1053 -7599 -3653 -8306 -9993 -9566 -6471 4066 8065 -3404 -11446 -12093 4696
13567 4696 2418 -11101 -4262 3055 2800 8507 17557 15639 18573 29042 28532 12973 11555 8290
13553 8290 9280 -2893 -19790 -33938 -29993 -8240 -10141 -22282 -24158 -29838 -21617 -10769 149
13540 149 -1217 3609 7542 20086 23107 30696 12980 5414 1415 2582 3480 5619 1789 14815
13526 14815 19466 11051 -10914 -16594 -24860 -34002 -23320 -17190 -7319 4427 21550 32745 39264
$$ packed form
13625A1116J608Q539n772k871M578L651j669r463o363j38k553P268Q285L91P01
13610A7308o940p173j921j1284p929J1680q328J350J2313J1529L553j8287q118
13597a2247J2009K338l634m183K84M872R233P533m57j423n640M893J142m694n821
13582D205n467M216j901q652L946m653j687M27L095J0537L999j1469q042o47J6789
13567D696k278j3519O839P317k55N707R050j918K934J0469n10j5559j418l265
13553H290R90j2173j6897j4148L945K1753j901j2141j876n680Q221J0848J0918
13540A49j366M826L933J2544L021P589j7716p566l999J167Q98K139l830J3026
13526A4815M651q415k1965n680q266r142J0682O130R871J1746J7123J1195O519
$$ plain form
13513 39264 16492 -2820 -8294 -7026 5755 13658 16223 10175 12830 16253 3311 -7895 3254
13500 3254 11441 9220 12164 11134 15146 10947 9876 5406 15284 1509 -698 7420 14001 24434
13486 24434 34370 29955 23319 38407 34380 21814 28073 42822 52016 51220 56675 73009 91043
13473 91043 99705 128960 151202 193089 228081 261958 299186 334948 364964 400028 414886 428311
13461 428311 424690 405664 385748 371068 348812 322933 302323 270623 255665 267614 269588 275624
13449 275624 286936 311588 348884 369909 394742 420055 444007 455203 458161 433444 394048 362104
13437 362104 339453 303959 265509 235179 212418 185496 165627 151749 144421 136901 112037 89562
13425 89562 89530 95546 94231 92953 79776 73277 66287 62092 60186 51156 47237 37981 32440 31285 34035
$$ packed form
13513C9264k2772j9312n474J268J2781P903K565o048K655L423j2942j1206J1149
13500C254Q187k221K944j030M012m199j071m470R878j3775k207Q118O581J0433
13486B4434R936m415o636J5088m027j2566O259J4749R194p96N455J6334J8034
13473I1043Q662K9255K2242M1887L4992L3877L7228L5762L0016L5064J4858J3425
13461D28311l621j9026j9916j4680k2256k5879k0610l1700j4958J1949J974O036
13449B75624J1312K4652L7296K1025K4833K5313K3952J1196K958k4717l9396l1944
13437C62104k2651l5494l8450l0330k2761k6922j9869j3878p328p520k4864k2475
13425H9562l2O016j315j278j3177o499o990m195j906r030l919r256n541j155K750
$$ plain form
13410 34035 26570 25919 27734 38973 39378 41955 43735 35306 16949 15105 34648 30740 17387 10710
13396 10710 23250 46471 45682 55826 64551 53458 67412 83819 97066 115921 138029 153650
13384 153650 170382 199239 241428 292754 343504 391804 434586 491697 504178 509524 504952 475869
13372 475869 450850 430036 409238 381610 354698 336498 338452 332634 324228 325159 339911 381780
13360 381780 415175 435851 460007 488270 513884 535856 525587 500688 476779 453916 417224
13349 417224 388251 364988 331164 283709 251767 237131 214471 177607 157504 143690 129988
13338 129988 126860 124925 111134 96097 88480 83743 65643 61768 64581 62916 49067 42774 56535
13325 56535 52411 50314 59618 63175 62519 61453 66022 65893 57941 54052 43194 47960 26330 7482
$$ packed form
13410C4035p465o51J815J1239M05K577J780q429j8357j844J9543l908j3353o677
13396A0710J2540K3221p89J0144Q725j1093J3954J6407J3247J8855K2108J5621
13384A53650J6732K8857M2189N1326N0750M8300M2782N7111J2481N346m572k9083
13372D75869k5019k0814k0798k7628k6912j8200J954n818q406R31J4752M1869
13360C81780L3395K0676K4156K8263K5614K1972j0269k4899k3909k2863l6692
13349D17224k8973k3263l3824m7455l1942j4636k2660l6864k0103j3814j3702
13338A29988l128j935j3791j5037p617m737j8100l875K813j665j3849o293J3761
13325E6535m124k097R304L557o56j066M569j29p952l889j0858M766k1630j8848
$$ plain form
13311 7482 15648 21749 22659 37192 36954 30323 18511 15825 20689 22736 22112 25590 23816 20598 15982
13296 15982 10318 17953 33943 32962 27694 21716 19280 25501 29837 25726 25803 25139 32593 34317 41946
13281 41946 33013 24330 17853 14546 14221 15391 22155 39854 48327 44865 40178 43855 33275 26744
13267 26744 23909 16129 14634 19290 38344 47805 48810 44092 30041 24679 28407 36238 34177 37801
13253 37801 33596 39231 34142 19650 19840 32465 23375 24837 33079 40014 35374 38254 41743 33359
13239 33359 20974 14790 22539 32162 48344 45591 37639 39271 36413 32013 38575 52250 60922 69502
13225 69502 54893 32006 22585 34036 34932 28690 16018 20047 27178 31114 25624 16946 17438 24374
13211 24374 31350 43352 48254 37792 33464 30773 24987 23337 19687 29691 44100 39558 23078
$$ packed form
13311G482Q166O101R10J4533k38o631j1812k686M864K047o24L478j774l218m616
13296A5982n664P635J5990r81n268n978k436O221M336m111P7o64P454J724P629
13281D1946q933q683o477l307l25J170O764J7699Q473l462m687L677j0580o531
13267B6744k835p780j495M656J9054R461J005m718j4051n362L728P831k061L624
13253C7801m205N635n089j4492J90J2625r090J462Q242O935m640K880L489q384
13239C3359j2385o184P749R623J6182k753p952J632k858m400O562J3675Q672Q580
13225F9502j4609k2887r421J1451Q96o242j2672M029P131L936n490q678M92O936
13211B4374O976J2002M902j0462m328k691n786j650l650J0004J4409m542j6480
$$ plain form
13198 23078 20246 30157 33621 24551 30688 36839 26401 12128 5300 16352 16026 11557 10901 442
13184 442 2164 14526 16396 12245 18794 25226 20865 38718 44402 65741 82131 94550 94346 82632
13170 82632 73308 58647 43914 36480 44172 49774 45852 53848 49252 57004 57227 33174 29932 29327
13156 29327 19185 25005 35413 41290 36891 33021 27266 41356 46620 43825 47998 35199 29156
13143 29156 34746 35022 40875 49330 55781 55412 55459 44175 44235 71330 103310 122594 138570 153147
13129 153147 158010 165484 169148 148595 111195 81735 67813 56938 56138 48996 45419 39805 40776
13116 40776 49225 46955 50309 37373 26493 33388 44214 51240 39436 28093 27983 34405 31438
13103 31438 29511 33333 50175 53881 36454 28236 36113 44044 43483 46113 43779 45385 41328 40729
$$ packed form
13198B3078k832R911L464r070O137O151j0438j4273o828J1052l26m469o56j0459
13184D42J722J2362J870m151O549O432m361J7853N684K1339J6390J2419k04j1714
13170H2632r324j4661j4733p434P692N602l922P996m596P752K23k4053l242o05
13156B9327j0142N820J0408N877m399l870n755J4090N264k795M173j2799o043
13143B9156N590K76N853Q455O451l69M7j1284O0K7095L1980J9284J5976J4577
13129A53147M863P474L664k0553l7400k9460j3922j0875q00p142l577n614R71
13116D0776Q449k270L354j2936j0880O895J0826P026j1804j1343j10O422k967
13103C1438j927L822J6842L706j7427q218P877P931n61K630k334J606m057n99
$$ plain form
13089 40729 48628 60765 88889 122842 138670 149766 171336 167887 143305 128650 106971 90844
13077 90844 66314 55205 57310 56988 60060 64706 72567 72981 62758 42260 34673 44521 58357 65098
13063 65098 65387 71163 68484 69745 78310 95971 121930 140873 158596 190323 230339 265040 290701
13050 290701 351209 427424 518732 612043 697442 770553 816865 841592 846322 833579 799669 752830
13038 752830 682584 601574 534633 467322 408331 357671 314047 277408 252600 222278 194259
13027 194259 189964 180735 155241 135773 121828 112948 104648 101350 95090 75810 71250 68961 59434
13014 59434 63157 71385 77783 61952 55952 44476 37319 32729 26737 18131 19630 16807 19415 19251
13000 19251 21024 23576 13070 11304 8163 -4310 -8028 5957 22648 29341 36668 33899 25462
$$ packed form
13089D0729P899J2137K8124L3953J5828J1096K1570l449k4582j4655k1679j6127
13077I0844k4530j1109K105l22L072M646P861M14j0223k0498p587R848J3836O741
13063F5098K89N776k679J261Q565J7661K5959J8943J7723L1727M0016L4701K5661
13050B90701O0508P6215R1308R3311Q5399P3111M6312K4727M730j2743l3910m6839
13038G52830p0246q1010o6941o7311n8991n0660m3624l6639k4808l0322k8019
13027A94259m295r229k5494j9468j3945q880q300l298o260j9280m560k289r527
13014E9434L723Q228O398j5831o000j1476p157m590n992q606J499k823K608j64
13000A9251J773K552j0506j766l141j2473l718J3985J6691O693P327k769q437
$$ plain form
12987 25462 29932 25993 18305 9432 9733 -3531 -6452 -8125 6164 2326 247 10928 7423 1601
12973 1601 -985 -6989 1529 14506 9765 8082 10854 18865 33150 33194 36109 34046 36139 44087 40789
12958 40789 38470 37757 28674 13270 7956 6836 16579 27600 33131 42613 31842 11280 4566 15253
12944 15253 21425 23561 24169 26621 30382 24665 8487 21726 32738 45262 44470 30872 22493 17461
12930 17461 17878 19363 16712 19407 15709 5510 -5099 -4021 -3307 -1549 1072 -6265 -4763 3601
12916 3601 16327 20542 18453 13813 11849 9405 6959 -1956 1792 3977 -5347 -12084 -2746 6974
12902 6974 11099 2282 1087 25035 39003 28273 17677 20514 34155 31016 33450 30891 28380
12889 28380 30531 45735 56876 67195 91652 98982 114776 132209 151333 145868 135684 160175
$$ packed form
12987B5462M470l939p688q873L01j3264k921j673J4289l838k079J0681l505n822
12973A601k586o004Q518J2977m741j683K772Q011J4285M4K915k063K093P948l298
12958D0789k319p13r083j5404n314j120R743J1021N531R482j0771k0562o714J0687
12944A5253O172K136O08K452L761n717j6178J3239J1012J2524p92j3598q379n032
12930A7461M17J485k651K695l698j0199j0609J078P14J758K621p337J502Q364
12916C601J2726M215k089m640j964k444k446q915L748K185r324o737R338R720
12902F974M125q817j195K3948J3968j0730j0596K837J3641l139K434k559k511
12889B8380K151J5204J1141J0319K4457P330J5794J7433J9124n465j0184K4491
$$ plain form
12877 160175 165358 162277 162176 150403 137224 124337 114413 106063 86934 68925 62881 56150 43909
12864 43909 38023 41664 42071 43378 43967 50920 59558 42929 35457 32060 31939 24092 -1034 -6981 9856
12849 9856 22543 19508 17022 7765 6279 4672 5878 5440 560 -1642 -5418 61 -144 2591 -5461
12834 -5461 -7869 2614 9488 19502 29300 27789 14350 9143 26819 34070 38444 38699 26092 21334
12820 21334 12425 16476 35085 52282 67432 68521 62058 53758 57832 79478 82373 73390 65953
12807 65953 68758 73893 74224 77300 74361 73394 79146 76222 74386 69887 68241 58031 55185 56359 63370
12792 63370 65285 52636 55215 58533 63380 75748 71064 60830 58414 59525 68193 75912 68897 63961
12778 63961 55560 54830 57360 66073 69282 75476 77636 77676 71065 76530 102014 110653 99214 103422 121124
$$ packed form
12877A60175N183l081j01j1773j3179j2887r924q350j9129j8009o044o731j2241
12864D3909n886L641M07J307N89O953Q638j6629p472l397j21p847k5126n947J6837
12849I856J2687l035k486r257j486j607J206m38m880k202l776N479k05K735q052
12834e461k408J0483O874J0014R798j511j3439n207J7676P251M374K55j2607m758
12820B1334q909M051J8609J7197J5150J089o463q300M074K1646K895q983p437
12807F5953K805N135L31L076k939r67N752k924j836m499j646j0210k846J174P011
12792F3370J915j2649K579L318M847J2368m684j0234k416J111Q668P719p015m936
12778F3961q401p30K530Q713L209O194K160M0o611N465K5484Q639j1439M208J7702
$$ plain form
12763 121124 128063 139814 143966 151225 171540 184254 198620 204660 212242 228068 223483 210137 210282
12750 210282 216745 205730 188417 165443 148853 137693 125010 128667 131423 139620 156451 164620
12738 164620 172427 173541 182039 181943 176767 185518 203999 214544 230702 241045 233986 225906 222834 223639
12724 223639 228603 236184 242714 256125 245831 244231 249139 236069 241043 243124 240691 223201 218479
12711 218479 226207 221132 214558 225088 235443 242604 245867 243971 244122 255289 251157 250214 267623 291610
12697 291610 310256 314428 314819 324811 325286 342959 357128 363560 369822 361700 375815 388137 399431
12684 399431 409383 433619 446833 467935 491256 504727 506543 514197 527868 546839 562897 586435
12672 586435 620885 637916 669404 732192 793087 841791 892524 971946 1046611 1114225 1196033
$$ packed form
12763A21124O939J1751M152P259K0315J2714J4366O040P582J5826m585j3346J45
12750B10282O463j1015j7313k2974j6590j1160j2683L657K756Q197J6831Q169
12738A64620P807J114Q498r6n176Q751J8481J0545J6158J0343p059q080l072Q05
12724B23639M964P581O530J3411j0294j600M908j3070M974K081k433j7490m722
12711B18479P728n075o574J0530J0355P161L263j896J51J1167m132r43J7409K3987
12697B91610J8646M172L91R992M75J7673J4169O432O262q122J4115J2322J1294
12684C99431R952K4236J3214K1102K3321J3471J816P654J3671J8971J6058K3538
12672E86435L4450J7031L1488O2788O0895M8704N0733P9422P4665O7614Q1808
$$ plain form
12661 1196033 1269852 1341250 1396198 1479273 1587826 1698808 1817055 1954484 2107463 2275319
12651 2275319 2466827 2702205 2970407 3280161 3654295 4122426 4692103 5385694 6229960
12642 6229960 7247400 8433751 9813289 11431396 13319559 15534997 18185533 21447974
12634 21447974 25593045 31035928 38297344 47909833 60170048 74884877 91379736 108623101
12626 108623101 125279689 139869168 150863477 157014787 157707622 153082719 143962529 131596029
12618 131596029 117396816 102736606 88807192 76429525 65997493 57576741 50885680
12611 50885680 45444643 40863804 36848397 33221057 29905107 26860687 24079308 21540646
12603 21540646 19265876 17227951 15400374 13793067 12396920 11177225 10106558 9188276
$$ packed form
12661A196033P3819P1398N4948Q3075J08553J10982J18247J37429J52979J67856
12651B275319J91508K35378K68202L09754L74134M68131N69677O93591Q44266
12642F229960J017440J186351J379538J618107J888163K215438K650536L262441
12634B1447974M145071N442883P261416R612489J2260215J4714829J6494859J7243365
12626A08623101J6656588J4589479J0994309O151310O92835m624903r120190j2366500
12618A31596029j4199213j4660210j3929414j2377667j0432032q420752o691061
12611E0885680n441037m580839m015407l627340l315950l044420k781379k538662
12603B1540646k274770k037925j827577j607307j396147j219695j070667r18282
$$ plain form
12595 9188276 8385741 7664152 7019000 6443891 5912128 5436874 5011967 4600056 4232684
12586 4232684 3915220 3646127 3409341 3187028 2997582 2817816 2650010 2504244 2379746
12577 2379746 2254396 2141346 2049592 1963914 1871862 1774977 1680069 1606961 1526446 1440930 1372805
12566 1372805 1311063 1258053 1207536 1144662 1099302 1050628 991578 953861 923008 891426 861456
12555 861456 828121 786560 753455 722896 690721 670453 643449 612616 598241 595184 585890 582134
12543 582134 576639 562071 555146 537314 537322 546125 546821 533402 514086 528905 542694 540057 522608
12530 522608 514919 517093 528592 559968 591719 631411 669719 683327 680418 648012 626615 613057
12518 613057 603019 588424 579175 564000 563326 554226 548803 535470 520869 514926 506530 501930 498250
$$ packed form
12595I188276q02535p21589o45152n75109n31763m75254m24907m11911l67372
12586D232684l17464k69093k36786k22313j89446j79766j67806j45766j24498
12577B379746j25350j13050r1754q5678r2052r6885r4908p3108q0515q5516o8125
12566A372805o1742n3010n0517o2874m5360m8674n9050l7717l0853l1582k9970
12555H61456l3335m1561l3105l0559l2175k0268k7004l0833j4375l057r294l756
12543E82134n495j4568o925j7832QQ803O96j3419j9316J4819J3789k637j7449
12530E22608p689K174J1499L1376L1751L9692L8308J3608k909l2406k1397j3558
12518F13057j0038j4595r249j5175o74r100n423j3333j4601n943q396m600l680
$$ plain form
12505 498250 502505 496695 497925 513603 538500 558652 580083 600443 620627 628745 635569 634987 643273
12492 643273 675893 691964 711506 730401 754085 771975 776672 800464 808563 817241 840853 861876
12480 861876 879217 893842 880799 848944 809205 766752 719698 673620 620928 575538 545469
12469 545469 517278 493784 463351 444781 428784 422736 400311 384364 375039 355483 348268 336050
12457 336050 327796 318212 298766 284520 285633 277326 257723 236604 221829 230280 224679 224100 224839
12444 224839 218541 193018 174746 157790 167631 168667 161065 154424 159979 166077 156133 159976 168858
12431 168858 147097 134636 117944 112874 113312 102832 100627 109329 117653 120180 118816 109728 109274 106567
12417 106567 105547 101645 93750 96460 97693 101458 107681 111419 106553 110783 105366 99994 93578 101587
$$ packed form
12505D98250M255n810J230J5678K4897K0152K1431K0360K0184Q118O824n82Q286
12492F43273L2620J6071J9542J8895K3684J7890M697K3792Q099Q678K3612K1023
12480H61876J7341J4625j3043l1855l9739m2453m7054m6078n2692m5390l0069
12469E45469k8191k3494l0433j8570j5997o048k2425j5947r325j9556p215j2218
12457C36050q254r584j9446j4246J113q307j9603k1119j4775Q451n601n79P39
12444B24839o298k5523j8272j6956R841J036p602o641N555O098r944L843Q882
12431A68858k1761j2461j6692n070M38j0480k205Q702Q324K527j364r088m54k707
12417A06567j020l902p895K710J233L765O223L738m866M230n417n372o416Q009
$$ plain form
12403 101587 105947 115973 129087 115456 95078 87736 95121 95390 101752 123201 120067 113804 107573
12390 107573 109258 122155 122927 122660 116048 114177 103810 96958 113933 132808 146301 157534 170119
12377 170119 159157 146468 151065 167048 184645 175929 194064 226972 247378 274858 309305 352440
12365 352440 404692 474061 560309 647310 709647 742402 768358 773374 765253 723227 681138 645795
12353 645795 600833 567371 536480 524951 520983 520859 537556 544429 526257 497762 480214 442352
12341 442352 404523 379936 359609 338207 319593 304399 306697 308324 309955 319651 333406 317375
12329 317375 296804 299477 289461 288621 301511 309256 309693 302161 297399 280210 265177 253941 240945
12316 240945 242742 240629 236577 232829 241368 246312 265274 290109 302918 321316 362176 416331 469994
$$ packed form
12403A01587M360J0026J3114j3631k0378p342P385K69O362K1449l134o263o231
12390A07573J685J2897P72k67o612j871j0367o852J6975J8875J3493J1233J2585
12377A70119j0962j2689M597J5983J7597q716J8135L2908K0406K7480L4447M3135
12365C52440N2252O9369Q6248Q7001O2337L2755K5956N016q121m2026m2089l5343
12353F45795m4962l3462l0891j1529l968j24J6697O873j8172k8495j7548l7862
12341D42352l7829k4587k0327k1402j8614j5194K298J627J631R696J3755j6031
12329C17375k0571K673j0016q40J2890P745M37p532m762j7189j5033j1236j2996
12316B40945J797k113m052l748Q539M944J8962K4835J2809J8398M0860N4155N3663
$$ plain form
12303 469994 531532 594197 657372 723526 745763 751116 742697 704759 656821 599371 532229 477170
12291 477170 444474 412526 365175 331847 291560 261787 265893 255175 244829 251513 268438 285443
12279 285443 306927 344929 387852 445827 505523 549928 565323 572580 560165 526080 483213 447039
12267 447039 402069 354906 322719 293258 272108 242930 227305 213642 205648 194599 167910 155281
12255 155281 152817 150282 142262 133996 126841 120850 118710 110070 100518 91655 89519 95090 76108 73652
12241 73652 78525 72515 63482 67348 68857 57427 74934 81107 85580 95967 100051 109334 112444 112719
12227 112719 107423 120534 125299 132419 146798 149151 150625 172548 211714 244184 290019 326177
12215 326177 384434 448850 522377 566408 581752 594051 596126 590068 569752 550986 543357 574689
$$ packed form
12303D69994O1538O2665O3175O6154K2237N353q419l7938m7938n7450o7142n5059
12291D77170l2696l1948m7351l3328m0287k9773M106j0718j0346O684J6925J7005
12279B85443K1484L8002M2923N7975N9696M4405J5395P257j2415l4085m2867l6174
12267D47039m4970m7163l2187k9461k1150k9178j5625j3663p994j1049k6689j2629
12255A55281k464k535q020q266p155n991k140q640r552q863k136N571j8982k456
12241G3652M873o010r033L866J509j1430J7507O173M473J0387M084R283L110K75
12227A12719n296J3111M765P120J4379K353J474K1923L9166L2470M5835L6158
12215C26177N8257O4416P3527M4031J5344J2299K075o058k0316j8766p629L1332
$$ plain form
12203 574689 622790 687206 749766 824140 892050 933517 945896 944091 921489 882695 816278 744246
12191 744246 667489 590874 517379 456741 385956 336683 312125 288990 265835 240212 220692
12180 220692 192608 172690 163271 166217 150314 131849 129619 125943 121302 116038 107967 100690 88853
12167 88853 82412 64860 57728 65986 65167 52760 48815 52138 58603 69895 75956 73763 54807 47159
12153 47159 39721 44903 43154 35460 38183 41804 51285 55501 37555 32021 30455 23266 27262 32333
12139 32333 25741 26602 37487 33728 26502 17097 20613 26068 35824 43853 47265 51126 46091 32937
12125 32937 21011 18911 14281 20840 19060 25468 39137 36699 18280 13350 8721 8366 20276 40698
12111 40698 48279 59090 51415 43978 37442 35684 39902 36143 38900 37107 33172 33673 34874 29158
$$ packed form
12203E74689M8101O4416O2560P4374O7910M1467J2379j805k2602l8794o6417p2032
12191G44246p6757p6615p3495o0638p0785m9273k4558k3135k3155k5623j9520
12180B20692k8084j9918r419K946j5903j8465k230l676m641n264q071p277j1837
12167H8853o441j7552p132Q258q19j2407l945L323O465J1292O061k193j8956p648
12153D7159p438N182j749p694K723L621R481M216j7946n534j566p189L996N071
12139C2333o592Q61J0885l759p226r405L516N455R756Q029L412L861n035j3154
12125C2937j1926k100m630O559j780O408J3669k438j8419m930m629l55J1910K0422
12111D0698P581J0811p675p437o536j758M218l759K757j793l935N01J201n716
$$ plain form
12097 29158 36926 57986 61127 65474 83713 89253 72510 64675 64729 68806 77174 85270 65261 61161
12083 61161 82491 77558 73351 75645 68087 67717 58343 65635 77765 78339 65748 68474 75456 77671
12069 77671 75630 72311 65770 58899 50746 54993 53057 62964 52575 49329 42748 45180 55791 37839
12055 37839 37148 48870 52592 45689 56833 51224 38205 44662 60190 44062 26569 15904 10864
12042 10864 13615 23376 23817 22461 19294 17264 20645 14283 12792 24751 25093 29808 16336 10232
12028 10232 16663 44863 52052 38471 37764 51989 36943 26618 17239 10829 20969 35257 13997
12015 13997 -9259 -3512 1447 -1130 -14269 -11612 1881 10245 16639 15777 10380 24001 25018 21622
12001 21622 20925 19716 16495 24095 25557 12420 10100 16068 21249 31477 38483 39403 24976 17221
$$ packed form
12097B9158P768K1060L141M347J8239N540j6743p835N4M077Q368Q096k0009m100
12083F1161K1330m933m207K294p558l70r374P292J2130N74j2591K726O982K215
12069G7671k041l319o541o871q153M247j936R907j0389l246o581K432J0611j7952
12055C7839o91J1722L722o903J1144n609j3019O457J5528j6128j7493j0665n040
12042A0864K751R761M41j356l167k030L381o362j491J1959L42M715j3472o104
12028A0232O431K8200P189j3581p07J4225j5046j0325r379o410J0140J4288k1260
12015A3997k3256N747M959k577j3139K657J3493Q364O394q62n397J3621J017l396
12001B1622o97j209l221P600J462j3137k320N968N181J0228P006R20j4427p755
$$ plain form
11987 17221 3183 -9987 -10726 4683 13796 16526 15699 -2640 -21200 -20050 -13681 -10381 -8145 -4425
11973 -4425 3768 6153 3103 8199 11414 13663 12504 -3673 -17067 -3501 -2806 -8172 -3232 14056
11959 14056 19028 20292 18433 17646 28552 33735 38331 45523 38937 33871 43036 52386 38816 29175
11945 29175 23218 26079 20172 11635 17131 11457 -1617 7362 13886 -1369 -11679 -403 -8872
11932 -8872 -3138 15489 9715 8261 3841 3124 1822 -3481 -9364 3316 8087 3638 -1585 5380
11918 5380 12320 11985 13575 15494 6951 15879 20605 20377 18806 11280 12597 22760 19695 59 -2197
11903 -2197 10742 9032 18405 7513 9947 11156 11581 18698 18844 9881 7861 -691 4986 19216
11889 19216 7638 -321 -4082 -6480 1853 7301 3918 -2428 -722 10812 8273 8251 2416 -2000
$$ packed form
11987A7221j4038j3170p39J5409R113K730q27j8339j8560J150O369L300K236L720
11973d425Q193K385l050N096L215K249j159j6177j3394J3566O95n366M940J7288
11959A4056M972J264j859p87J0906N183M596P192o586n066R165R350j3570r641
11945B9175n957K861n907q537N496n674j3074Q979O524j5255j0310J1276q469
11932h872N734J8627n774j454m420p17j302n303n883J2680M771m449n223O965
11918E380O940l35J590J919q543Q928M726k28j571p526J317J0163l065j9636k256
11903b197J2939j710R373j0892K434J209M25P117J46q963k020q552N677J4230
11889A9216j1578p959l761k398Q333N448l383o346J706J1534k539k2n835m416
$$ plain form
11875 -2000 3189 -14035 -21024 -20756 -21642 -25764 -13164 -8592 -6797 1768 -2966 -4815 -10551 -1771 1881
11860 1881 1257 -3767 -2376 12406 26668 20722 13848 13428 15180 5079 -2982 4876 18021 19718
11846 19718 13359 9911 4773 -10855 -25071 -22902 -6745 -13265 -14562 -19364 -10066 -5382 -5331 -777
11832 -777 -6866 -15775 -13254 -5759 -6209 -5626 -8792 -670 5785 17625 21433 15994 7270 4983 21246
11817 21246 15093 1605 -5904 -81 -14652 -20125 -12437 -3533 -5450 5199 1189 -12814 -12125 -4473
11803 -4473 -2079 583 6954 -1165 -1470 -4289 -8321 2368 3065 -5373 -12255 -9603 -2967 1937 -6808
11788 -6808 -3130 -7794 -12530 -12171 3104 9078 22901 31178 29415 30160 30830 28449 9626 7993 6746
11773 6746 3422 6841 12142 8603 -19267 -30645 -31223 -24319 -3715 12076 18848 11793 5391 480
$$ packed form
11875b000N189j7224o989K68q86m122J2600M572J795Q565m734j849n736Q780L652
11860A881o24n024J391J4782J4262n946o874m20J752j0101q061P858J3145J697
11846A9718o359l448n138j5628j4216K169J6157o520j297m802R298M684N1M554
11832g77o089q909K521P495m50N83l166Q122O455J1840L808n439q724k287J6263
11817B1246o153j3488p509N823j4571n473P688Q904j917J0649m010j4003O89P652
11803d473K394K662O371q119l05k819m032J0689O97q438o882K652O636M904q745
11788f808L678m664m736L59J5275N974J3823Q277j763P45O70k381j8823j633j247
11773F746l324L419N301l539k7870j1378n78O904K0604J5791O772p055o402m911
$$ plain form
11759 480 3190 12969 10971 4898 547 5506 -1537 3654 2859 364 -1300 -8075 -7259 -6197 -3726
11744 -3726 2914 4941 -3803 -9817 -6633 1740 -2589 -14022 -19602 -9462 -6983 -10894 -18672 -27411
11730 -27411 -23309 -10760 -12042 -12048 -11305 -13511 -12878 -2814 4490 -6215 -25944 -26338 -13481 -6180 7171
11715 7171 16943 15506 2478 815 3686 -499 668 12047 10819 4557 3218 -3430 8887 11450
11701 11450 6693 5970 -8619 -6653 -11690 -12296 -14554 -14886 -2768 -4775 -2312 -10916 -9274 -7848 -3491
11686 -3491 1598 12269 20930 10483 2870 5268 8419 11223 -226 899 12457 35248 40989
11673 40989 40678 33181 26846 21636 1927 -4184 -1941 -7469 -5841 10289 2905 -8969 -7960 -19861
11659 -19861 -15086 -4930 -1840 -13108 -22495 -12588 -18056 -5841 -510 -1316 -8298 -3501 -138 3000
$$ packed form
11759D80K710R779j998o073m351M959p043N191p95k495j664o775Q16J062K471
11744c726O640K027q744o014L184Q373m329j1433n580J0140K479l911p778q739
11730b7411M102J2549j282oP43k206O33J0064P304j0705j9729l94J2857P301J3351
11715G171R772j437j3028j663K871m185J167J1379j228o262j339o648J2317K563
11701A1450m757p23j4589J966n037o06k258l32J2118k007K463q604J642J426M357
11686c491N089J0671Q661j0447p613K398L151K804j1449J125J1558K2791N741
11673D0989l11p497o335n210j9709o111K243n528J628J6130p384j1874J009j1901
11659a9861M775J0156L090j1268r387R907n468J2215N331q06o982M797L363L138
$$ plain form
11645 3000 6296 16125 16453 -5935 -5076 4540 3751 809 -1626 -9498 -15547 -1672 11816 10496 12223
11630 12223 11678 10502 9833 -3036 -7385 2409 -4435 -990 -6362 -8550 6338 12199 19954 15002
11616 15002 6123 3571 7787 2502 -7037 -6179 -14027 -13073 -19317 -11517 -8927 -22321 -17338 -9241 -11847
11601 -11847 -5892 5746 310 -7732 -7683 -4387 -9761 -20176 -34074 -23002 -20392 -17097 -11488 -9063
11587 -9063 -14088 -13064 -7542 -14826 -16100 -6293 -6069 -10048 -13071 -19016 -17235 -27422 -27259 -17907 -10616
11572 -10616 -20528 -27828 -21075 -14960 -6761 -3906 -5622 5850 -1299 -5525 -5621 -1718 -11854 -5070
11558 -5070 8132 4481 -2985 3853 4293 -7626 -11849 -9672 -12262 -14360 -8339 -15999 -10603 11022
11544 11022 27469 36553 28899 9734 -3397 -12299 7779 18784 21717 23666 14550 8440 14895
$$ packed form
11645C000L296R829L28k2388Q59R616p89k942k435p872o049J3875J3488j320J727
11630A2223n45j176o69j2869m349R794o844L445n372k188J4888N861P755m952
11616A5002q879k552M216n285r539Q58p848R54o244P800K590j3394M983Q097k606
11601a1847N955J1638n436q042M9L296n374j0415j3898J1072K610L295N609K425
11587i063n025J024N522p284j274R807K24l979l023n945J781j0187J63R352P291
11572a0616r912p300O753O115Q199K855j716J1472p149m226r6L903j0136O784
11558e070J3202l651p466O838M40j1919m223K177k590k098O021p660N396K1625
11544A1022J6447R084p654j9165j3131q902K0078J1005K933J949r116o110O455
$$ plain form
11531 14895 14414 10577 7957 -9426 -9049 15505 17943 3021 7408 10996 -4867 -2145 -634 9713
11517 9713 21327 21731 6193 675 10977 19899 30006 32818 14727 2920 6514 9499 10749
11504 10749 26047 28139 23933 21956 15000 16352 19465 22118 21101 20006 24496 26348 21754 15582
11490 15582 14828 20346 11254 21879 33186 17340 19400 24176 31163 29253 13962 6788 16229 12554
11476 12554 11992 7344 -413 -15933 -10320 -7703 -5923 -15969 -27542 -15489 -8141 -12242 -12074 1805
11462 1805 5602 -2993 9654 9592 -4077 -16739 -1130 -91 5694 2830 6788 23740 17155 13685
11448 13685 17868 13879 17048 14130 -3880 2233 11372 -7101 -19034 -11966 3237 5365 -8237
11435 -8237 -3408 -10866 -11571 -8686 -3775 -6534 -802 11608 7857 -11512 -15189 -16967 -5002 9914
$$ packed form
11531A4895m81l837k620j7383L77K4554K438j4922M387L588j5863K722J511J0347
11517I713J1614M04j5538n518J0302Q922J0107K812j8091j1807L594K985J250
11504A0749J5298K092m206j977o956J352L113K653j017j095M490J852m594o172
11490A5582p54N518r092J0625J1307j5846K060M776O987j910j5291p174R441l675
11476A2554n62m648p757j5520N613K617J780j0046j1573J2053P348m101J68J3879
11462A805L797q595J2647o2j3669j2662J5609J039N785k864L958J6952o585l470
11448A3685M183l989L169k918j8010O113R139j8473j1933P068J5203K128j3602
11435h237M829p458p05K885M911k759N732J2410l751j9369l677j778J1965J4916
$$ plain form
11421 9914 12077 7924 -1409 -6952 6426 12909 5941 4790 -4075 -3957 -10179 -12302 -13073 -15210 -23637
11406 -23637 -25046 -23604 -32719 -23937 -8632 -21314 -18700 -13435 3205 3410 -14333 -20129 -13519 1099
11392 1099 4186 4051 8108 4046 -13544 -13958 -21454 -24341 -16103 -6425 7980 2656 -1052 16294
11378 16294 20541 15382 13669 -2842 -12589 -15608 -9062 622 -1687 -13202 -21575 -18444 -15079 -15420
11364 -15420 -10820 -9104 -3292 1915 2175 2904 9646 7551 -4598 -7640 -8379 -9697 -18624 -29372 -25888
11349 -25888 -11940 -15547 -11564 6703 8753 -3592 -2780 -4897 -15252 -20342 -10273 -12133 -15928
11336 -15928 -15322 -11780 -4218 -5773 -11385 -14791 -11752 -6332 6191 4074 -1813 -558 -9740 774
11322 774 3033 -6147 -2691 -11023 -12225 -13065 -15746 -17088 -11924 -3706 -10097 -11909 -2508 6918 13589
$$ packed form
11421I914K163m153r333n543J3378O483o968j151q865J18o222k123p71k137q427
11406b3637j409J442r115Q782J5305j2682K614N265J6640K05j7743n796O610J4618
11392A099L087j35M057m062j7590m14p496k887Q238R678J4405n324l708J7346
11378A6294M247n159j713j6511r747l019O546R684k309j1515q373L131L365l41
11364a5420M600J716N812N207K60P29O742k095j2149l042p39j318q927j0748L484
11349b5888J3948l607L983J8267K050j2345Q12k117j0355n090J0069j860l795
11336a5928O06L542P562j555n612l406L039N420J2523k117n887J255r182J0514
11322G74K259r180L456q332j202q40k681j342N164Q218o391j812R401R426O671
$$ plain form
11307 13589 4724 6347 20235 24753 19581 16798 17705 12758 7512 12137 -1252 -5016 7550 29443
11293 29443 47172 61760 65532 71294 61689 48625 49384 54336 45191 43133 27761 17098 10199
11280 10199 12275 8751 5852 -21 8168 14574 21761 25786 23863 11534 696 -19959 -15202 191
11266 191 -5881 -10301 -14450 -3143 -2458 -8558 -5641 7312 23330 7852 3445 -4205 -1398 11571
11252 11571 4631 9802 18179 21642 19925 19561 23688 41454 31874 24965 22608 24382 33378 43000
11238 43000 38612 31664 30389 19561 18752 30676 47126 48285 53990 47897 43440 36835 37214 42275
11224 42275 42747 48338 36468 35730 39982 32546 24214 23061 16246 10276 13871 13313 21809 25745 31119
11209 31119 31739 29322 21022 6072 13618 16926 18156 13965 12486 8233 7760 6410 13396 21376 19179
$$ packed form
11307A3589q865J623J3888M518n172k783R07m947n246M625j3389l764J2566K1893
11293B9443J7729J4588L772N762r605j3064P59M952r145k058j5372j0663o899
11280A0199K076l524k899n873Q189O406P187M025j923j2329j0838k0655M757J5393
11266A91o072m420m149J1307O85o100K917J2953J6018j5478m407p650K807J2969
11252A1571o940N171Q377L463j717l64M127J7766r580o909k357J774Q996R622
11238D3000m388o948j275j0828q09J1924J6450J159N705o093m457o605L79N061
11224D2275M72N591j1870p38M252p436q332j153o815n970L595n58Q496L936N374
11209C1119O20k417q300j4950P546L308J230m191j479m253m73j350O986P980k197
$$ plain form
11194 19179 16383 20906 21577 24141 20429 3411 -6127 -7267 2129 -3774 -9687 2881 1795 -7734
11180 -7734 -141 14305 12162 2633 8493 13975 11731 18335 17280 4020 6386 11771 13090 7331
11166 7331 -11943 -18827 -8021 -5243 5380 17967 7935 -1269 -5085 -2243 1308 10144 18044
11153 18044 20693 24007 21924 16033 7462 5852 8817 10625 12151 11848 20487 14045 7828 1505 -5531
11138 -5531 2189 11383 6392 -10093 -12017 -16331 -19676 -16092 -27932 -30310 -30848 -33963 -25608 -4524
11124 -4524 -17624 -23945 -17099 -10122 5398 12374 -531 1188 -7084 -10842 -22175 -24158 3609
11111 3609 17005 10602 9702 3489 -4314 7336 11776 15325 14385 8472 4137 5927 10151 16593 12619
11096 12619 9018 -159 -1429 -1168 -2535 -2056 4349 -2787 -10620 -5802 -17094 -21549 -27032 -11948
$$ packed form
11194A9179k796M523O71K564l712j7018r538j140R396n903n913J2568j086r529
11180g734P593J4446k143r529N860N482k244O604j055j3260K366N385J319n759
11166G331j9274o884J0806K778J0623J2587j0032r204l816K842L551Q836P900
11153A8044K649L314k083n891q571j610K965J808J526l03Q639o442o217o323p036
11138e531P720R194m991j6485j924m314l345L584j1840k378n38l115Q355K1084
11124d524j3100o321O846O977J5520O976j2905J719q272l758j1333j983K7767
11111C609J3396o403r00o213p803J1650M440L549r40n913m335J790M224O442l974
11096A2619l601r177j270K61j367M79O405p136p833M818j1292m455n483J5084
$$ plain form
11082 -11948 -17438 -21722 -22238 -23439 -19107 -28543 -43375 -41247 -35492 -15581 -11076 -12201 -9821 3892
11068 3892 5676 1478 3154 3554 11637 6249 2439 -6049 -4967 -19475 -9830 -9516 -16098 -9658 -5487
11053 -5487 -6205 -5117 -7311 -2809 2676 11942 21927 12824 12572 6393 -5659 13091 23089 20151 14286
11038 14286 24068 47011 52977 62097 94940 133375 181605 226682 282490 369092 474157 563946
11026 563946 629678 677668 663668 611802 538816 452831 380808 321073 262052 220117 192406
11015 192406 168455 165522 155539 133391 122606 119592 117982 112949 104563 112109 119747 120576 126122 134555
11001 134555 172695 233248 310958 416343 519235 594367 642416 650471 611837 555188 482741
10990 482741 394375 309896 243304 202086 178783 177519 176951 165198 152603 134158 121074 102321
$$ packed form
11082a1948n490m284n16j201M332r436j4832K128N755J9911M505j125K380J3713
11068C892J784m198J676M00Q083n388l810q488J082j4508R645L14o582O440M171
11053e487p18J088k194M502N485R266R985r103k52o179j2052J8750R998k938n865
11038A4286R782K2943N966R120L2843L8435M8230M5077N5808Q6602J05065Q9789
11026E63946O5732M7990j4000n1866p2986q5985p2023n9735n9021m1935k7711
11015A92406k3951k933r983k2148j0785l014j610n033q386P546P638Q29N546Q433
11001A34555L8140O0553P7710J05385J02892P5132M8049Q055l8634n6649p2447
10990D82741q8366q4479o6592m1218k3303j264n68j1753j2595j8445j3084j8753
$$ plain form
10978 102321 78477 66977 62202 62464 56333 46248 34886 38846 32740 30105 40373 68543 79437
10965 79437 62621 69995 83812 76876 71272 66930 63456 66943 72589 79984 72387 77376 98020 112884
10951 112884 121033 141407 170298 215524 264652 329819 415072 516250 657972 887325 1182736
10940 1182736 1510671 1726278 1770234 1665336 1429558 1137510 888493 723727 622535 546734
10930 546734 509641 468057 409334 361276 317110 279066 251832 223430 192693 169653 145520
10919 145520 114863 99139 82272 83176 88550 84273 84387 80368 68055 57274 52361 38844 25633
10906 25633 32541 33255 26519 27931 17816 12650 14466 8289 8139 5336 -4355 -10123 -7739 6947
10892 6947 16372 20991 13936 -721 -11400 -5478 7994 9108 21725 23102 16338 20102 22396 32136
$$ packed form
10978A02321k3844j1500m775K62o131j0085j1362L960o106k635J0268K8170J0894
10965G9437j6816P374J3817o936n604m342l474L487N646P395p597M989K0644J4864
10951A12884Q149K0374K8891M5226M9128O5167Q5253J01178J41722K29353K95411
10940A182736L27935K15607M3956j04898k35778k92048k49017j64766j01192p5801
10930E46734l7093m1584n8723m8058m4166l8044k7234k8402l0737k3040k4133
10919A45520l0657j5724j6867R04N374m277J14m019j2313j0781m913j3517j3211
10906B5633O908P14o736J412j0115n166J816o177j50k803r691n768K384J4686
10892F947R425M619p055j4657j0679N922J3472J114J2617J377o764L764K294R740
$$ plain form
10878 32136 25137 14361 8822 -6230 -25274 -26423 -15269 -21872 -22726 -21840 -21261 -7457 2678 6319
10864 6319 23954 43125 49085 47971 49637 41193 24560 23008 24500 28985 23108 26783 20681 14567
10850 14567 13361 9436 11242 4462 -5529 -7501 -7 6037 10838 7059 6104 2469 11194 5520 7142
10835 7142 4421 5715 -784 3862 -1148 8417 10711 3116 -11180 -25342 -24409 -18961 -24693 -19622
10821 -19622 -17068 -3293 16246 13848 9778 6369 -385 -499 -6986 -13452 -28788 -27478 -15887 11609
10807 11609 13241 13289 5954 6229 9691 11094 11586 18992 26195 22652 17281 14525 14458 19768 19463 28729
10791 28729 29204 33530 42963 47411 37323 46150 73153 88616 103932 113152 128224 127937 126883 129480
10777 129480 169303 220779 267882 291574 299717 295202 270115 231095 195574 157668 134182 118894
$$ packed form
10878C2136o999j0776n539j5052j9044j149J1154o603q54Q86N79J3804J0135L641
10864F319J7635J9171N960j114J666q444j6633j552J492M485n877L675o102o114
10850A4567j206l925J806o780r991j972P494O044M801l779r55l635Q725n674J622
10835G142k721J294o499M646n010R565K294p595j4296j4162R33N448n732N071
10821a9622K554J3775J9539k398m070l409o754j14o487o466j5336J310J1591K7496
10807A1609J632M8p335K75L462J403M92P406P203l543n371k756o7N310l05R266
10791B8729M75M326R433M448j0088Q827K7003J5463J5316R220J5072k87j054K597
10777A29480L9823N1476M7103K3692Q143m515k5087l9020l5521l7906k3486j5288
$$ plain form
10765 118894 106364 88283 83166 77310 82857 91492 96038 90765 85917 82713 84166 80624 71159 56558
10751 56558 37298 21182 6598 -5758 -22182 -14471 2829 10436 2147 3189 20106 29433 24298
10738 24298 8845 -13350 -8491 -3006 -14684 -28799 -29701 -18494 -8425 5302 20599 39402
10726 39402 45911 25580 4698 19153 31788 24345 41792 43255 40658 43879 48470 56767 56861 72250
10712 72250 73041 58768 54564 67236 81571 98925 117783 125266 121099 134382 136286 125975 105822
10699 105822 97352 96746 118424 108659 91960 90787 85968 87104 102480 117598 109527 96420 85993
10686 85993 68055 55215 42952 46517 48614 56370 56242 58178 85631 100990 114522 120285 106467
10673 106467 101753 106673 111857 122260 138100 152502 163366 174503 186465 213109 247870 268012
$$ packed form
10765A18894j2530j8081n117n856N547Q635M546n273m848l204J453l542r465j4601
10751E6558j9260j6116j4584j2356j6424P711J7300P607q289J042J6917R327n135
10738B4298j5453k2195M859N485j1678j4115r02J1207J0069J3727J5297J8803
10726C9402O509k0331k0882J4455J2635p443J7447J463k597L221M591Q297R4J5389
10712G2250P91j4273m204J2672J4335J7354J8858P483m167J3283J904j0311k0153
10699A05822q470o06K1678r765j6699j173m819J136J5376J5118q071j3107j0427
10686H5993j7938j2840j2263L565K097P756j28J936K7453J5359J3532N763j3818
10673A06467m714M920N184J0403J5840J4402J0864J1137J1962K6644L4761K0142
$$ plain form
10661 268012 288277 329221 365400 398968 437962 467357 491918 512382 536973 567053 598658
10650 598658 632256 634374 557924 445791 355375 319868 279676 244191 229531 247540 253468 251320
10638 251320 265699 263882 276224 293314 296510 316653 341518 365569 388246 399416 412577 431844
10626 431844 452736 480494 497372 529547 573488 619491 663277 694938 708713 738276 762104
10615 762104 769680 762624 747612 713910 662701 634353 600473 564886 534724 509382 503636 494185
10603 494185 478437 468684 462107 441479 436121 440138 446079 449987 464688 485828 500807 506553 529430
10590 529430 539256 540562 548705 546649 558141 564638 568206 580839 617648 646207 665771 704846 744002
10577 744002 790210 817966 845856 855119 850237 843442 830453 812144 799898 808541 834070 873891
$$ packed form
10661B68012K0265M0944L6179L3568L8994K9395K4561K0464K4591L0080L1605
10650E98658L3598K118p6450j12133r0416l5507m0192l5485j4660J8009N928k148
10638B51320J4379j817J2342J7090L196K0143K4865K4051K2677J1170J3161J9267
10626D31844K0892K7758J6878L2175M3941M6003M3786L1661J3775K9563K3828
10615G62104P576p056j5012l3702n1209k8348l3880l5587l0162k5342n746r451
10603D94185j5748r753o577k0628n358M017N941L908J4701K1140J4979N746K2877
10590E29430R826J306Q143k056J1492O497L568J2633L6809K8559J9564L9075L9156
10577G44002M6208K7756K7890R263m882o795j2989j8309j2246Q643K5529L9821
$$ plain form
10565 873891 934382 1021401 1104329 1194097 1269634 1340002 1392085 1440620 1485248 1527130 1581388
10554 1581388 1664056 1781393 1917607 2070548 2254158 2466605 2707364 2986685 3310389 3691751
10544 3691751 4106361 4554086 5080859 5746418 6616230 7684230 8863853 10083399 11390618
10535 11390618 12868921 14692646 17147413 20565393 25241496 31337301 38903633 48199726
10527 48199726 59960121 75722401 98206944 131603609 180845464 246103275 309663467
10520 309663467 342739188 340542037 310451126 257426631 200688941 157873977 130479721
10513 130479721 112968338 100156694 89387539 80069536 72051962 65106534 58873872
10506 58873872 53075702 47722352 42966230 38769513 34959653 31441382 28178024 25173703
$$ packed form
10565H73891O0491Q7019Q2928Q9768P5537P0368N2083M8535M4628M1882N4258
10554A581388Q2668J17337J36214J52941J83610K12447K40759K79321L23704L81362
10544C691751M14610M47725N26773O65559Q69812J068000J179623J219546J307219
10535A1390618J478303J823725K454767L417980M676103O095805P566332R296093
10527D8199726J1760395J5762280K2484543L3396665M9241855O5257811O3560192
10520C09663467L3075721k197151l0090911n3024495n6737690m2814964k7394256
10513A30479721j7511383j2811644j0769155r318003q017574o945428o232662
10506E8873872n798170n353350m756122m196717l809860l518271l263358l004321
$$ plain form
10498 25173703 22498125 20175705 18187628 16505994 15061583 13808035 12694811 11692064
10490 11692064 10764632 9937115 9195166 8514688 7903160 7377851 6919124 6524895 6185730
10481 6185730 5881837 5620746 5401795 5241823 5136362 5099763 5124214 5224141 5397616 5585021
10471 5585021 5767598 5876836 5902157 5803490 5576423 5238673 4868840 4504416 4178298 3872263
10461 3872263 3597689 3375810 3196440 3056294 2944523 2866945 2834982 2847098 2907978 3038421
10451 3038421 3176794 3222387 3159296 2963289 2685516 2397821 2171644 1993643 1854952 1754134
10441 1754134 1679918 1598217 1518238 1443635 1379455 1327947 1280958 1250716 1201949 1161241 1113724
10430 1113724 1073827 1047752 1030907 1006499 981452 954615 922507 875599 842957 825546 811681
$$ packed form
10498B5173703k675578k322420j988077j681634j444411j253548j113224j002747
10490A1692064r27432q27517p41949o80478o11528n25309m58727l94229l39165
10481F185730l03893k61091k18951j59972j05461l6599K4451R9927J73475J87405
10471E585021J82577J09238K5321r8667k27067l37750l69833l64424l26118l06035
10461C872263k74574k21879j79370j40146j11771p7578l1963J2116O0880J30443
10451C038421J38373M5593o3091j96007k77773k87695k26177j78001j38691j00818
10441A754134p4216q1701p9979p4603o4180n1508m6989l0242m8767m0708m7517
10430A113724l9897k6075j6845k4408k5047k6837l2108m6908l2642j7411j3865
$$ plain form
10419 811681 799854 785437 778512 765995 769482 760110 744486 728049 708684 694756 675467 669478
10407 669478 668582 660652 657936 670521 681006 703215 730285 744020 756627 780271 845831 920205
10395 920205 1010906 1058552 1003739 870185 737052 649124 608579 598977 598615 600225 602466 593126
10383 593126 590599 594475 575195 569022 575134 572445 568454 565990 573429 561946 558833 562183 580682
10370 580682 588290 585458 561040 541834 549884 561514 557281 540000 536155 534381 518992 501267 490252
10357 490252 491774 482640 461806 446664 426856 407005 397812 400522 395408 383811 372509 360342
10345 360342 344010 340347 333413 331640 326118 320062 305765 288471 287450 293291 289680 282744 288482
10332 288482 301203 295322 278803 275120 263046 264838 252403 248745 248177 250676 259199 265780 274310
$$ packed form
10419H11681j1827j4417o925j2517L487r372j5624j6437j9365j3928j9289n989
10407F69478q96p930k716J2585J0485K2209K7070J3735J2607K3644O5560P4374
10395I20205R0701M7646n4813j33554j33133q7928m0545r602l62J610K241r340
10383E93126k527L876j9280o173O112k689l991k464P439j1483l113L350J8499
10370E80682P608k832k4418j9206Q050J1630m233j7281l845j774j5389j7725j1015
10357D90252J522r134k0834j5142j9808j9851r193K710n114j1597j1302j2167
10345C60342j6332l663o934j773n522o056j4297j7294j021N841l611o936N738
10332B88482J2721n881j6519l683j2074J792j2435l658n68K499Q523O581Q530
$$ plain form
10319 274310 281077 280811 266715 257960 256948 247707 238226 233298 227516 234262 240643 240000 241284 256903
10305 256903 261612 258977 250074 258047 265026 234499 210580 223180 240141 255357 268109 272812 290538
10292 290538 305817 322029 351453 358460 352337 334613 295275 262547 241385 229223 219044 221373
10280 221373 229619 232324 241825 256848 263690 254702 243027 238983 234158 247964 261032 262519 232619
10267 232619 219518 221311 221406 222830 222521 215424 210765 216401 217837 217413 212480 212552 220463 217820 219590
10252 219590 223381 238499 235202 234455 237207 241431 244252 251891 249626 249417 252962 264646 275286 290359
10238 290359 319434 350277 368285 409997 469170 533293 609756 716743 834295 901289 917952
10227 917952 883027 801083 694192 591381 512878 483543 456981 425220 391851 375517 357210
$$ packed form
10319B74310O767k66j4096q755j012r241r481m928n782O746O381o43J284J5619
10305B56903M709k635q903P973O979l0527k3919J2600J6961J5216J2752M703J7726
10292B90538J5279J6212K9424P007o123j7724l9338l2728k1162j2162j0179K329
10280B21373Q246K705R501J5023O842q988j1675m044m825J3806J3068J487k9900
10267B32619j3101J793R5J424l09p097m659N636J436m24m933P2P911k643J770
10252B19590L791J5118l297p47K752M224K821P639k265k09L545J1684J0640J5073
10238B90359K9075L0843J8008M1712N9173O4123P6463J06987J17552O6994J6663
10227I17952l4925q1944j06891j02811p8503k9335k6562l1761l3369j6334j8307
$$ plain form
10216 357210 334740 313973 301848 296368 281763 255946 243662 240151 232313 233997 215727 190025
10204 190025 184931 190617 197422 211632 225674 234862 228570 217405 224643 240546 246744 245327 243507
10191 243507 260657 266308 273366 299759 343559 383463 420487 450977 477833 500251 495877 473464
10179 473464 433935 398444 363604 338159 321406 327538 317307 293348 283409 272142 260924 262952
10167 262952 254179 248656 248154 236225 224953 230661 226593 229981 232242 252171 266351 271477 273093
10154 273093 273238 271548 267998 249648 233897 233972 230140 228552 226618 226592 224122 215268 207702 203718 210876
10139 210876 197267 181958 168124 164123 179696 177415 178268 179066 179103 171232 166475 166653 179537 175373
10125 175373 181316 185959 193528 192966 185880 184736 186282 188430 184193 203590 217125 227532 238022
$$ packed form
10216C57210k2470k0767j2125n480j4605k5817j2284l511p838J684j8270k5702
10204A90025n094N686O805J4210J4042R188o292j1165P238J5903O198j417j820
10191B43507J7150N651P058K6393M3800L9904L7024L0490K6856K2418m374k2413
10179D73464l9529l5491l4840k5445j6753O132j0231k3959r939j1267j1218K028
10167B62952q773n523n02j1929j1272N708m068L388K261J9929J4180N126J616
10154B73093J45j690l550j8350j5751P5l832j588j934k6k470q854p566l984P158
10139B10876j3609j5309j3834m001J5573k281Q53P98L7p871m757J78J2884m164
10125A75373N943M643P569n62p086j144J546K148m237J9397J3535J0407J0490
$$ plain form
10112 238022 233578 230677 250085 269942 289683 321815 360475 402485 452222 521895 612201 721996
10100 721996 850641 1049667 1314396 1625459 1934691 2102038 2087261 1934201 1662699 1364055
10090 1364055 1114048 948193 850878 766243 703202 653509 607519 560463 505823 465979 428053
10079 428053 396539 353195 330740 316245 312968 307849 301193 276108 254579 260217 262571 239899
10067 239899 233618 231024 226265 236682 245277 229366 222039 221948 206092 188819 185972 193782 210890
10054 210890 233232 245486 243913 259028 266901 281578 293183 318286 336267 337594 348744 360242
10042 360242 368323 396024 427370 462773 522630 616347 723544 836593 939112 1003803 1019186
10031 1019186 959654 851669 731797 643105 578457 525334 484004 455338 427244 408590 385470
$$ packed form
10112B38022m444k901J9408J9857J9741L2132L8660M2010M9737O9673R0306J09795
10100G21996J28645J99026K64729L11063L09232J67347j4777j53060k71502k98644
10090A364055k50007j65855r7315q4635o3041m9693m5990m7056n4640l9844l7926
10079D28053l1514m3344k2455j4495l277n119o656k5085k1529N638K354k2672
10067B39899o281k594m759J0417Q595j5911p327r1j5856j7273k847P810J7108
10054B10890K2342J2254j573J5115P873J4677J1605K5103J7981J327J1150J1498
10042C60242Q081K7701L1346L5403N9857R3717J07197J13049J02519O4691J5383
10031A019186n9532j07985j19872q8692o4648n3123m1330k8666k8094j8654k3120
$$ plain form
10020 385470 367425 352044 326121 302410 282612 264464 253346 248776 240831 231495 229111 226056
10008 226056 211953 209935 211895 208699 200762 186578 182918 188625 197539 189833 176887 175938 164973
9995 164973 168188 165012 154529 152676 159037 165954 166172 168400 155550 161537 162009 148426 142516 140079
9981 140079 138280 138116 151441 155394 156706 155199 162508 173643 181380 164813 158062 161143 166025 161154
9967 161154 167165 176456 172451 169575 166073 163270 168314 186928 185768 184030 178354 173493 172273 177675
9953 177675 181878 184484 182610 173012 166076 165927 181673 179807 165885 172607 184314 177636 162330 146539
9939 146539 145565 146907 150900 154240 158722 156547 152198 154756 166014 176065 166296 154372 150812 162203
9925 162203 182991 189169 169125 162436 156795 136050 122446 117000 119302 122821 121676 128616 149092
$$ packed form
10020C85470j8045j5381k5923k3711j9798j8148j1118m570p945r336k384l055
10008B26056j4103k018J960l196p937j4184l660N707Q914p706j2946r49j0965
9995A64973L215l176j0483j853O361O917K18K228j2850N987M72j3583n910k437
9981A40079j799j64J3325L953J312j507P309J1135P737j6567o751L081M882m871
9967A61154O011R291m005k876l502k803N044J8614j160j738n676m861j220N402
9953A77675M203K606j874r598o936j49J5746j866j3922O722J1707o678j5306j5791
9939A46539r74J342L993L340M482k175m349K558J1258J0051r769j1924l560J1391
9925A62203K0788O178k0044o689n641k0745j3604n446K302L519j145O940K0476
$$ plain form
9912 149092 166325 159822 141054 141745 148170 152398 166732 159543 145749 152506 143773 137024 138215 128465
9898 128465 129783 144072 157740 148174 151694 159087 155468 160779 150064 155768 154195 163259 164981 164929
9884 164929 171411 169100 162583 157317 160452 149311 150789 166417 160267 151579 138007 131276 144553
9871 144553 158113 159768 157586 144130 129414 133553 129633 127834 139369 139973 140520 155147 168175
9858 168175 168590 156083 143793 147292 147776 136066 144881 141354 140784 159434 173325 159628 159945 159856
9844 159856 160055 150204 137529 132952 134793 141130 138873 149636 152660 157197 153834 162239 171773 165108
9830 165108 161084 157357 157557 176703 200936 221560 241517 262373 277121 320048 411184 535208
9818 535208 666740 779354 819870 796000 703614 577375 469600 399834 351019 333513 327251
$$ packed form
9912A49092J7233o503j8768O91O425M228J4334p189j3794O757q733o749J191r750
9898A28465J318J4289J3668r566L520P393l619N311j0715N704j573R064J722n2
9884A64929O482k311o517n266L135j1141J478J5628o150q688j3572o731J3277
9871A44553J3560J655k182j3456j4716M139l920j799J1535O04N47J4627J3028
9858A68175M15j2507j2290L499M84j1710Q815l527n70J8650J3891j3697L17q9
9844A59856J99r851j2675m577J841O337k257J0763L024M537l363Q405R534o665
9830A65108m024l727K00J9146K4233K0624J9957K0856J4748M2927R1136J24024
9818E35208J31532J12614M0516k3870r2386j26239j07775o9766m8815j7506o262
$$ plain form
9807 327251 319707 289939 249128 245373 252932 253982 236936 229978 234741 227181 216715 205637 189509
9794 189509 176128 159070 159799 168865 185461 200221 203178 191333 182960 187785 187957 180965 178883 169126
9780 169126 170787 184959 184736 166203 160653 159387 148654 143652 138630 149393 157520 157875 178218 186232
9766 186232 181509 177390 169351 165541 168923 156899 161945 162915 159973 161155 168881 171276 170110 164415
9752 164415 166683 160916 159397 158309 171897 184182 167294 150698 149771 150108 147055 148497 153400 149064
9738 149064 160627 165555 166178 167176 173333 184425 180784 174915 166944 168758 169266 161111 159045 160363 159693
9723 159693 167664 177615 180035 184074 208137 219289 227318 251043 278075 305266 356038 426197 521359
9710 521359 652054 817479 1005853 1185081 1334599 1429506 1449259 1402046 1288655 1146092
$$ packed form
9807C27251p544k9768m0811l755P559J050j7046o958M763p560j0466j1078j6128
9794A89509j3381j7058P29R066J6596J4760K957j1845q373M825J72o992k082r757
9780A69126J661J4172k23j8533n550j266j0733n002n022J0763Q127L55K0343Q014
9766A86232m723m119q039l810L382j2024N046R70k942J182P726K395j166n695
9752A64415K268n767j519j088J3588J2285j6888j6596r27L37l053J442M903m336
9738A49064J1563M928O23R98O157J1092l641n869p971J814N08q155k066J318o70
9723A59693P971R951K420M039K4063J1152Q029K3725K7032K7191N0772P0159R5162
9710E21359J30695J65425J88374J79228J49518R4907J9753m7213j13391j42563
$$ plain form
9700 1146092 990286 847820 725569 625154 566705 533898 505097 466548 431430 402211 365912
9689 365912 325359 305309 294789 286683 274856 264812 258119 240507 227791 225335 223790 232854 227821
9676 227821 220013 206442 212852 216694 217657 209721 193740 199225 217671 219902 201421 192953 185201 183299
9662 183299 189103 188843 194158 173902 153168 155123 166124 169393 164412 169799 169865 178931 181441 178648
9648 178648 181298 192277 180186 169094 160670 153957 169864 183172 191841 184736 171414 169864 174398
9635 174398 181820 195923 212698 200220 176767 163838 180730 177067 166017 166604 175706 186283 193210
9622 193210 185963 174594 172708 180142 196240 191523 186578 192586 198810 197983 200171 208082 210841 201531
9608 201531 187063 186877 178684 183448 188091 188838 186570 172699 180215 202085 224045 203633 188455
$$ packed form
9700A146092j55806j42466j22251j00415n8449l2807k8801l8549l5118k9219l6299
9689C65912m0553k0050j0520q106j1827j0044o693j7612j2716k456j545R064n033
9676B27821p808j3571O410L842R63p936j5981N485J8446K231j8481q468p752j902
9662A83299N804k60N315k0256k0734J955J1001L269m981N387O6R066K510k793
9648A78648K650J0979j2091j1092q424o713J5907J3308Q669p105j3322j550M534
9635A74398P422J4103J6775j2478k3453j2929J6892l663j1050N87R102J0577O927
9622A93210p247j1369j886P434J6098m717m945O008O224q27K188P911K759r310
9608B01531j4468j86q193M764M643P47k268j3871P516K1870K1960k0412j5178
$$ plain form
9595 188455 190589 187634 183110 174008 175297 179178 190059 184419 167241 163265 164482 169368 173605 176337
9581 176337 181580 185986 193428 188494 183629 188244 199563 182104 177399 192569 190454 194131 204750
9568 204750 197487 183487 176560 181838 187397 178436 175669 185148 188351 188074 184160 183151 196456 201660
9554 201660 189491 191706 194105 193197 188212 190761 201558 203812 191862 179411 185600 196516 194140
9541 194140 199174 206399 207872 210155 210729 218755 221357 219355 201099 194777 193130 192898 202547 207837 205422
9526 205422 207361 207207 204709 195710 197029 204830 201213 195040 189776 179745 192667 197980 195543 209576
9512 209576 212410 227787 239233 238948 232567 230180 217902 213693 206233 206508 218206 216750 200631 197488
9498 197488 202585 209161 212236 218211 213481 215165 218537 226087 224906 221925 212394 213072 205836 203847 209111
$$ packed form
9595A88455K134k955m524r102J289L881J0881n640j7178l976J217M886M237K732
9581A76337N243M406P442m934m865M615J1319j7459m705J5170k115L677J0619
9568B04750p263j4000o927N278N559q961k767R479L203k77l914j009J3305N204
9554B01660j2169K215K399r08m985K549J0797K254j1950j2451O189J0916k376
9541A94140N034P225J473K283N74Q026K602k002j8256o322j647k32R649N290k415
9526B05422J939j54k498q999J319P801l617o173n264j0031J2922N313k437J4033
9512B09576K834J5377J1446k85o381k387j2278m209p460K75J1698j456j6119l143
9498A97488N097O576L075N975m730J684L372P550j181k981r531O78p236j989N264
$$ plain form
9483 209111 206059 208798 221430 220209 220605 228476 226802 208193 202871 202523 205136 208017 211549 215824
9469 215824 220869 219708 214149 215209 225826 232519 211315 199488 194126 208647 214666 219892 207512
9456 207512 210318 207088 217897 226674 228316 224713 218825 212043 211718 212166 210160 215626 230485 237898
9442 237898 232552 226991 231630 225834 237968 239560 220880 225858 240183 231893 229312 242207 250161
9429 250161 249024 233312 226468 231554 238644 242297 249471 255255 248106 254410 259714 263680 264567 261922
9415 261922 264119 259701 254489 251871 249305 247779 255449 263666 258479 256117 268352 269289 260964 255849
9401 255849 245879 237380 240926 245901 251072 260003 263197 252358 255925 263833 266114 258045 244050 241260
9387 241260 250353 247702 259725 260073 264681 266249 272771 272725 269056 268829 274414 285767 274116 266608 274946
$$ packed form
9483B09111l052K739J2632j221L96P871j674j8609n322l48K613K881L532M275
9469B15824N045j161n559J060J0617O693k1204j1827n362J4521O019N226j2380
9456B07512K806l230J0809Q777J642l603n888o782l25M48k006N466J4859P413
9442B37898n346n561M639n796J2134J592j8680M978J4325q290k581J2895P954
9429B50161j137j5712o844N086P090L653P174N784p149O304N304L966Q87k645
9415B61922K197m418n212k618k566j526P670Q217n187k362J2235R37q325n115
9401B55849r970q499L546M975N171Q931L194j0839L567P908K281q069j3995k790
9387B41260R093k651J2023L48M608J568O522m6l669k27N585J1353j1651p508Q338
$$ plain form
9372 274946 281286 280964 288808 292105 290922 282615 276781 271900 270723 283913 291907 287610 288005 287113 297973
9357 297973 300596 306447 292982 284673 276770 284412 286064 272784 280100 300598 306114 304185 317963
9344 317963 323225 322719 334664 332272 327200 320564 318394 320851 318045 332119 320490 308078 314202 326932
9330 326932 324084 311416 312829 319361 328781 333878 331191 322682 315599 301945 306776 310774 298518 298195
9316 298195 308011 321109 335438 340274 352447 349582 351725 349904 352845 368505 374164 375001 381180 381369
9302 381369 370722 364137 359956 353602 360980 368923 365058 362847 371455 370433 373716 375498 371065 372536
9288 372536 369108 369370 365357 370168 389177 398659 389607 379607 379175 388490 390595 382326 377164 388306
9274 388306 400545 408538 413771 405514 399347 400502 411009 407549 404434 401046 407847 412252 416604 432140
$$ packed form
9372B74946O340l22P844L297j183q307n834m881j177J3190P994m297L95q92J0860
9357B97973K623N851j3465q309p903P642J652j3280P316K0498N516j929J3778
9344C17963N262n06J1945k392n072o636k170K457k806J4074j1629j2412O124J2730
9330C26932k848j2668J413O532R420N097k687q509p083j3654M831L998j2256l23
9316B98195R816J3098J4329M836J2173k865K143j821K941J5660N659Q37O179J89
9302C81369j0647o585m181o354P378P943l865k211Q608j022L283J782m433J471
9288C72536l428K62m013M811J9009R482r052j0000m32R315K105q269n162J1142
9274C88306J2239P993N233q257o167J155J0507l460l115l388O801M405M352J5536
$$ plain form
9260 432140 444490 448343 442201 444421 450865 436553 430864 437077 441961 447553 461164 464683 466367 459676
9246 459676 468381 482591 494595 486428 487800 486067 488750 510095 514098 509690 507889 515251 508311 510684
9232 510684 509027 513816 509955 506868 519307 520785 521659 523357 519527 517339 524908 540346 550431 542234
9218 542234 548034 555517 561926 551769 555536 566206 575852 579344 575132 581662 592825 598010 593869 593801
9204 593801 597583 605309 612855 610534 609864 616919 626622 632231 629208 621450 626229 630863 636990 645049 652420
9189 652420 675937 694376 691525 689168 698640 703702 698943 693252 706316 728797 733940 748992 764973
9176 764973 752775 751886 765330 772400 775265 782466 783580 774564 774235 789733 798833 810889 820448 831149
9162 831149 841641 849865 860552 872525 871032 870917 880415 877078 876345 889349 905633 925095 940640
$$ packed form
9260D32140J2350L853o142K220O444j4312n689O213M884N592J3611L519J684o691
9246D59676Q705J4210J2004q167J372j733K683K1345M003m408j801P362o940K373
9232E10684j657M789l861l087J2439J478Q74J698l830k188P569J5438J0085q197
9218E42234N800P483O409j0157L767J0670R646L492m212O530J1163N185m141o8
9204E93801L782P726P546k321o70P055R703N609l023p758M779M634O127Q059P371
9189F52420K3517J8439k851k357R472N062m759n691J3064K2481N143J5052J5981
9176G64973j2198q89J3444P070K865P201J114r016l29J5498R100J2056R559J0701
9162H31149J0492Q224J0687J1973j493j15R498l337p33J3004J6284J9462J5545
$$ plain form
9149 940640 959034 970857 980718 990627 1002337 1014953 1018100 1018296 1021921 1037642 1048509 1051497 1066005
9136 1066005 1069223 1072219 1078283 1102629 1116922 1123559 1123787 1141778 1170269 1186867 1178794 1189766 1197898
9123 1197898 1221069 1243557 1253884 1276700 1291750 1300238 1304639 1313671 1330031 1351994 1354220 1359768
9111 1359768 1376726 1388743 1410703 1436777 1452333 1461850 1491062 1522554 1541090 1556832 1565384 1576805
9099 1576805 1592271 1622075 1653499 1677241 1710140 1737555 1753977 1778543 1798578 1818414 1838819
9088 1838819 1851488 1878260 1911194 1934432 1952451 1976442 2003620 2036980 2060581 2093332 2118902
9077 2118902 2147083 2186255 2226888 2263405 2290784 2322454 2368213 2404908 2446256 2485512 2510488
9066 2510488 2531048 2576689 2630953 2671958 2707713 2747171 2796136 2851920 2899917 2932952 2986965
$$ packed form
9149I40640J8394J1823R861R909J1710J2616L147J96L625J5721J0867K988J4508
9136A066005L218K996O064K4346J4293O637K28J7991K8491J6598q073J0972Q132
9123A197898K3171K2488J0327K2816J5050Q488M401R032J6360K1963K226N548
9111A359768J6958J2017K1960K6074J5556R517K9212L1492J8536J5742Q552J1421
9099A576805J5466K9804L1424K3742L2899K7415J6422K4566K0035J9836K0405
9088A838819J2669K6772L2934K3238J8019K3991K7178L3360K3601L2751K5570
9077B118902K8181L9172M0633L6517K7379L1670M5759L6695M1348L9256K4976
9066B510488K0560M5641N4264M1005L5755L9458M8965N5784M7997L3035N4013
$$ plain form
9055 2986965 3029028 3070673 3125803 3179397 3235478 3287763 3341026 3379775 3436932 3513656 3583736
9044 3583736 3642416 3702352 3771137 3835368 3881031 3938198 4010211 4082416 4149630 4227046 4316869
9033 4316869 4400426 4490884 4588877 4681737 4770311 4852107 4932403 5018101 5095527 5172672 5252153
9022 5252153 5340220 5453193 5583381 5691433 5792583 5895500 6009567 6117886 6232349 6341445
9012 6341445 6443209 6539313 6657413 6781623 6896295 7005600 7113150 7214845 7350249 7470546
9002 7470546 7591563 7701782 7823258 7947351 8067442 8194341 8314434 8418224 8529658 8645214
8992 8645214 8749465 8836968 8949367 9047425 9137857 9227671 9320553 9412521 9495149 9575966 9657880
8981 9657880 9712523 9775165 9824831 9870098 9911291 9959944 10001544 10031542 10046992 10067892 10085276
$$ packed form
9055B986965M2063M1645N5130N3594N6081N2285N3263L8749N7157P6724P0080
9044C583736N8680N9936O8785O4231M5663N7167P2013P2205O7214P7416Q9823
9033D316869Q3557R0458R7993R2860Q8574Q1796Q0296Q5698P7426P7145P9481
9022E252153Q8067J12973J30188J08052J01150J02917J14067J08319J14463J09096
9012F341445J01764R6104J18100J24210J14672J09305J07550J01695J35404J20297
9002G470546J21017J10219J21476J24093J20091J26899J20093J03790J11434J15556
8992H645214J04251Q7503J12399R8058R0432Q9814R2882R1968Q2628Q0817Q1914
8981I657880N4643O2642M9666M5267M1193M8653M1600K9998J5450K0900J7384
$$ plain form
8970 10085276 10080485 10073351 10057388 10044660 10017720 9993599 9973902 9937661 9891313 9854524 9791915 9731818
8958 9731818 9666900 9596581 9510704 9431021 9356963 9266087 9157534 9056142 8962121 8867127 8769457
8947 8769457 8661674 8561829 8455041 8335382 8215974 8087985 7970479 7862294 7760713 7665305
8937 7665305 7555905 7423165 7306694 7192597 7083071 6966852 6848562 6728673 6625960 6521573
8927 6521573 6411302 6313900 6209055 6112631 6019350 5919626 5822690 5708771 5600361 5512710 5408643
8916 5408643 5318305 5222183 5126166 5042597 4950239 4857881 4766735 4693059 4621599 4548739 4465653
8905 4465653 4384496 4313809 4255512 4184799 4125042 4058751 3976976 3912037 3851376 3785605 3719379
8894 3719379 3652805 3584961 3512227 3469813 3431404 3370895 3324856 3264272 3204514 3152460 3106598
$$ packed form
8970A0085276m791p134j5963j2728k6940k4121j9697l6241m6348l6789o2609o0097
8958I731818o4918p0319q5877p9683p4058r0876j08553j01392r4021r4994r7670
8947H769457j07783r9845j06788j19659j19408j27989j17506j08185j01581r5408
8937G665305j09400j32740j16471j14097j09526j16219j18290j19889j02713j04387
8927F521573j10271r7402j04845r6424r3281r9724r6936j13919j08410q7651j04067
8916E408643r0338r6122r6017q3569r2358r2358r1146p3676p1460p2860q3086
8905D465653q1157p0687n8297p0713n9757o6291q1775o4939o0661o5771o6226
8894C719379o6574o7844p2734m2414l8409o0509m6039o0584n9758n2054m5862
$$ plain form
8883 3106598 3063007 3017704 2971583 2923675 2881224 2843805 2814405 2763302 2718523 2671898 2621887
8872 2621887 2596731 2566120 2518274 2486701 2463133 2406669 2365695 2343577 2315752 2293410 2266990
8861 2266990 2231687 2198584 2164600 2127591 2097341 2069982 2033835 2015917 2000921 1972857 1957801
8850 1957801 1927136 1906142 1877414 1845557 1820231 1795044 1767187 1757524 1744889 1722538 1706450 1698865
8838 1698865 1685798 1659593 1622751 1594260 1567771 1548489 1527103 1511801 1500087 1483482 1480000 1472782
8826 1472782 1444328 1417113 1403211 1386937 1373914 1367437 1351351 1333690 1310641 1314840 1294884 1275181
8814 1275181 1261555 1242569 1235938 1231983 1235795 1226774 1220318 1199375 1183027 1176714 1174841 1163520 1152640
8801 1152640 1142409 1148145 1145308 1113323 1081367 1071652 1065499 1062625 1062242 1055370 1032387 1022796 1011146
$$ packed form
8883C106598m3591m5303m6121m7908m2451l7419k9400n1103m4779m6625n0011
8872B621887k5156l0611m7846l1573k3568n6464m0974k2118k7825k2342k6420
8861B266990l5303l3103l3984l7009l0250k7359l6147j7918j4996k8064j5056
8850A957801l0665k0994k8728l1857k5326k5187k7857r663j2635k2351j6088p585
8838A698865j3067k6205l6842k8491k6489j9282k1386j5302j1714j6605l482p218
8826A472782k8454k7215j3902j6274j3023o477j6086j7661k3049M199j9956j9703
8814A275181j3626j8986o631l955L812r021o456k0943j6348o313j873j1321j0880
8801A152640j0231N736k837l1985l1956r715o153k874l83o872k2983r591j1650
$$ plain form
8788 1011146 1008608 991741 972484 957028 939869 928880 931975 915016 898808 894583 891748 898107
8776 898107 898405 888601 882163 863840 855509 838774 837065 834543 827393 828901 835920 830778 827230 835366
8762 835366 839401 838918 833375 820634 809027 796839 788538 766672 758638 766863 758110 744463 721270
8749 721270 711728 704361 704070 706146 690395 679546 666922 659809 659988 656261 669156 669022 650704 643510
8735 643510 638989 637968 641604 639080 630353 624407 613079 612957 611985 605223 592575 591408 595014 595693 598670
8720 598670 578266 587005 583018 580931 567025 551078 550116 564289 577541 564813 559434 561173 581498
8707 581498 585464 565739 540070 523139 519235 525877 520439 513310 515457 515837 495564 476455 477880
8694 477880 489021 494843 484098 479408 474420 460230 447606 451177 450050 462952 455755 449243 465333
$$ packed form
8788A011146k538j6867j9257j5456j7159j0989L095j6959j6208m225k835O359
8776H98107K98r804o438j8323q331j6735j709k522p150J508P019n142l548Q136
8762H35366M035m83n543j2741j1607j2188q301k1866q034Q225q753j3647k3193
8749G21270r542p367k91K076j5751j0849j2624p113J79l727J2895j34j8318p194
8735F43510m521j021L636k524q727n946j1328j22r72o762j2648j167L606O79K977
8720E98670k0404Q739l987k087j3906j5947r62J4173J3252j2728n379J739K0325
8707E81498L966j9725k5669j6931l904O642n438p129K147L80k0273j9109J425
8694D77880J1141N822j0745m690m988j4190j2624L571j127J2902p197o512J6090
$$ plain form
8681 465333 475520 469276 462311 450549 443059 429795 424683 432288 433292 439234 441560 433239 419997
8668 419997 426365 427768 422000 409204 397524 396278 406446 421275 421695 411980 407352 417907 422271
8655 422271 413171 404558 405917 396448 393705 387905 383514 398259 420189 415304 392314 371867 360825
8642 360825 365687 364777 367491 379722 370593 353216 354691 357063 365850 372139 374685 370794 367203 365804
8628 365804 362317 368843 368874 371320 387286 402155 412753 445907 475919 492236 504846 509158 500400
8615 500400 466116 437134 411923 395644 389490 380206 373251 366903 364764 359927 336704 328630 321466
8602 321466 303016 295228 303380 306428 310216 319262 322529 327864 334547 336883 323069 308299 315126 328055
8588 328055 323674 325481 330585 331256 324255 326789 335089 351839 359442 369169 388515 412881 449817 504729
$$ packed form
8681D65333J0187o244o965j1762p490j3264n112P605J004N942K326q321j3242
8668D19997O368J403n768j2796j1680j246J0168J4829M20r715m628J0555M364
8655D22271r100q613J359r469k743n800m391J4745K1930m885k2990k0447j1042
8642C60825M862r10K714J2231r129j7377J475K372Q787O289K546l891l591j399
8628C65804l487O526L1K446J5966J4869J0598L3154L0012J6317J2610M312q758
8615E00400l4284k8982k5211j6279o154r284o955o348k139m837k3223q074p164
8602C21466j8450p788Q152L048L788R046L267N335O683K336j3814j4770O827J2929
8588C28055m381J807N104O71p001K534Q300J6750P603R727J9346K4366L6936N4912
$$ plain form
8574 504729 577103 612661 614874 598427 537948 463519 411902 386099 367674 363576 347602 328690
8562 328690 326624 324204 321310 319734 313375 303279 296391 292848 276834 265483 265476 253667 248782 272092
8548 272092 284567 282676 278981 286326 301835 298730 293540 294969 296239 290783 281806 285921 289626 289058
8534 289058 276613 278842 294297 303313 314117 337026 378762 379962 364808 343198 304624 278044
8522 278044 276795 278131 270504 256877 258862 257942 262462 253333 255866 243925 246627 246175 242947 244719
8508 244719 238709 234204 234607 230806 221464 214118 206826 211928 222582 239736 250384 250474 257594 243381
8494 243381 229172 211780 204140 210113 209839 205065 204855 199844 197537 197445 201481 208430 208090 212854 204333
8479 204333 195133 184772 188237 182917 184811 180989 175016 180011 185408 186819 193642 194404 178291 175057
$$ packed form
8574E04729P2374L5558K213j6447o0479p4429n1617k5803j8425m098j5974j8912
8562C28690k066k420k894j576o359j0096o888l543j6014j1351pj1809m885K3310
8548B72092J2475j891l695P345J5509l105n190J429J270n456q977M115L705n68
8534B89058j2445K229J5455R016J0804K2909M1736J200j5154k1610l8574k6580
8522B78044j249J336p627j3627J985r20M520r129K533j1941K702m52l228J772
8508B44719o010m505M03l801r342p346p292N102J0654J7154J0648R0P120j4213
8494B43381j4209j7392p640N973k74m774k10n011k307r2M036O949l40M764q521
8479B04333r200j0361L465n320J894l822n973M995N397J411O823P62j6113l234
$$ plain form
8465 175057 169399 171138 170709 165927 167334 159875 157544 158490 155419 153622 164715 169802 157658 146407
8451 146407 151314 151887 167923 174126 170885 161771 156880 152769 146297 152659 143828 149078 152030 149251
8437 149251 151666 157015 163706 157556 152759 151794 140590 142236 160542 165165 165509 156104 140483 145324
8423 145324 151745 166520 171129 174486 169444 191285 216850 213307 212423 224409 206953 180975 175272
8410 175272 165487 157665 138962 138402 149894 145946 143960 137643 139878 150432 148198 135457 134139 138330
8396 138330 135436 134282 130233 132186 138434 131631 127679 123954 131796 126290 129872 130898 140027 140520 137054
8381 137054 139165 133719 128398 136022 144508 143881 140678 144038 150753 148893 137175 125212 116364 123553
8367 123553 133040 132207 130942 130591 134542 136817 142877 139706 137813 123053 116197 117073 121395 119010 116490
$$ packed form
8465A75057n658J739m29m782J407p459k331R46l071j797J1093N087j2144j1251
8451A46407M907N73J6036O203l241r114m891m111o472O362q831N250K952k779
8437A49251K415N349O691o150m797r65j1204J646J8306M623L44r405j5621M841
8423A45324O421J4775M609L357n042K1841K5565l543q84J1986j7456k5978n703
8410A75272r785p822j8703n60J1492l948j986o317K235J0554k234j2741j318M191
8396A38330k894j154m049J953O248o803l952l725P842n506L582J026R129M93l466
8381A37054K111n446n321P624Q486o27l203L360O715j860j1718j1963q848P189
8367A23553R487q33j265l51L951K275O060l171j893j4760o856Q76M322k385k520
$$ plain form
8352 116490 122701 127231 130940 120352 113270 121077 126652 123019 118197 127408 126161 124175 124082 121643 119665
8337 119665 126006 134767 135787 131530 132733 130408 128576 128403 128349 129808 131607 125606 125158 121445 122393 131053
8321 131053 131255 127248 129781 129742 131460 121516 123619 124198 128244 131117 114880 104608 102344 109967 117396
8306 117396 131658 133567 116927 127794 128636 118622 123028 127295 113914 101851 113647 119980 125314
8293 125314 118905 113399 106637 103188 97184 97866 97572 105373 110262 101787 105742 105224 118019 110379 97851
8278 97851 91145 85646 94764 93453 95177 94667 102668 102168 101441 111662 119887 118174 120767 102083 90447
8263 90447 88433 96673 97078 95410 90199 91393 95211 97900 95781 98064 98496 107339 109577 103270 92966
8248 92966 89135 90181 91238 101917 95790 96998 93660 96378 103063 100115 94841 86525 88492 88254 76387
$$ packed form
8352A16490O211M530L709j0588p082P807N575l633m822R211j247j986r3k439j978
8337A19665O341Q761J020m257J203k325j832j73n4J459J799o001m48l713R48Q660
8321A31053K02m007K533l9J718r944K103N79M046K873j6237j0272k264P623P429
8306A17396J4262J909j6640J0867Q42j0014M406M267j3381j2063J1796O333N334
8293A25314o409n506o762l449o004O82k94P801M889q475L955n18J2795p640j2528
8278I7851o706n499R118j311J724n10Q001n00p27J0221Q225j713K593j8684j1636
8263I0447k014Q240M05j668n211J194L818K689k119K283M32Q843K238o307j0304
8248I2966l831J046J057J0679o127J208l338K718O685k948n274q316J967k38j1867
$$ plain form
8233 76387 77573 93462 107359 113808 112198 107881 88105 92075 100205 110699 103685 95055 84192
8220 84192 72890 67769 90441 78575 88290 105744 98206 84929 81220 72365 81508 89859 91030
8207 91030 85329 87680 90540 76471 61281 54249 58784 65993 76784 59411 55459 67473 63811
8194 63811 64854 71980 74845 80202 75612 65750 50190 59602 70643 66678 66285 73412 76429 79669
8180 79669 85786 97214 91973 93210 77284 74982 69097 67027 68728 83353 103270 96955 89473 90521
8166 90521 83343 76622 85514 80546 67368 77331 82437 76328 72268 78906 71980 65101 60489 66271
8152 66271 78447 73997 81441 91729 87533 84778 85564 83903 69714 77677 87055 101695 98690 102698
8138 102698 94196 82333 74796 74750 70303 72986 81067 77844 80598 88892 74030 69666 69151 72894 80925
$$ packed form
8233G6387J186J5889J3897O449j610m317j9776L970Q130J0494p014q630j0863
8220H4192j1302n121K2672j1866R715J7454p538j3277l709q855R143Q351J171
8207I1030n701K351K860j4069j5190p032M535P209J0791j7373l952J2014l662
8194F3811J043P126K865N357m590r862j5560R412J1041l965l93P127L017L240
8180G9669O117J1428n241J237j5926k302n885k070J701J4625J9917o315p482J048
8166I0521p178o721Q892m968j3178R963N106o109m060O638o926o879m612N782
8152F6271J2176m450P444J0288m196k755P86j661j4189P963R378J4640l005M008
8138A02698q502j1863p537m6m447K683Q081l223K754Q294j4862m364n15L743Q031
$$ plain form
8123 80925 84737 88651 102204 106874 103401 95308 75326 60746 54109 53269 68921 76642 83031 96384
8109 96384 81805 72593 72896 67667 70840 73760 86887 95525 92370 94325 97722 95066 102360 105384
8095 105384 90371 72024 77158 76331 87625 91529 84256 74007 86797 81635 70964 64864 68154
8082 68154 76811 84986 97849 98078 89969 68733 69723 76854 72554 64356 65183 70268 83408 96941
8068 96941 119495 121042 117506 111521 110951 108421 92757 75621 80454 79909 73567 68811 59185 55243
8054 55243 61864 59244 60919 69379 79346 75995 75096 80808 83072 82325 78166 73049 74328 72282 66149
8039 66149 73085 83492 76940 70365 68912 77895 79877 77066 73786 74004 72000 70978 75300 90620
8025 90620 117165 115677 118862 113456 95040 88585 81464 73878 74507 76632 71623 57551 64632 66614
$$ packed form
8123H0925L812L914J3553M670l473q093j9982j4580o637q40J5652P721O389J3353
8109I6384j4579r212L03n229L173K920J3127Q638l155J955L397k656P294L024
8095A05384j5013j8347N134q27J1294L904p273j0249J2790n162j0671o100L290
8082F8154Q657Q175J2863K29q109k1236R90P131m300q198Q27N085J3140J3533
8068I6941K2554J547l536n985n70k530j5664j7136M833n45o342m756r626l942
8054E5243O621k620J675Q460R967l351q99N712K264p47m159n117J279k046o133
8039F6149O936J0407o552o575j453Q983J982k811l280K18k004j022M322J5320
8025I0620K6545j488L185n406j8416o455p121p586O29K125n009j4072P081J982
$$ plain form
8011 66614 74596 71680 74568 79411 72685 65382 65175 65240 60984 52356 57501 63734 68030 71667 78374
7996 78374 77047 62731 54819 56681 60222 63222 60925 65419 65647 56627 60266 90550 95113 82291
7982 82291 74101 66231 70829 76035 74771 71767 78892 83642 83979 73288 67794 70062 61303 67250 68132
7967 68132 69196 72122 71871 69690 62301 68042 72090 65309 62535 66016 77588 76189 71920 59058
7953 59058 63962 65010 61253 62598 60384 55513 50077 25924 24798 42159 56900 45288 43577 54594
7939 54594 75753 81749 64654 53958 56873 74214 65896 60582 55146 63210 68387 71898 67634 46125
7925 46125 40058 46790 67123 79822 70760 56467 59234 71015 80632 79164 67918 60785 58952
7912 58952 63164 73888 85423 72887 64489 68392 70859 79164 63259 55697 71933 74900 70433
$$ packed form
8011F6614P982k916K888M843o726p303k07O5m256q628N145O233M296L637O707
7996G8374j327j4316p912J862L541L000k297M494K28r020L639L0284M563j2822
7982H2291q190p870M598N206j264l004P125M750L37j0691n494K268q759N947Q82
7967F8132J064K926k51k181p389N741M048o781k774L481J1572j399m269j2862
7953E9058M904J048l757J345k214m871n436k4153j126J7361J4741j1612j711J1017
7939E4594K1159N996j7095j0696K915J7341q318n314n436Q064N177L511m264k1509
7925D6125o067O732K0333J2699r062j4293K767J1781R617j468j1246p133j833
7912E8952M212J0724J1535j2536q398L903K467Q305j5905p562J6236K967m467
$$ plain form
7899 70433 61144 51705 53384 58553 70948 71726 80556 70225 71172 59652 58605 55079 46683 50086
7885 50086 46286 49553 42395 47018 39400 32966 49344 50762 35580 49517 48844 44584 60432 77245
7871 77245 65799 51822 45537 55256 50983 60211 55906 53542 71419 78496 66670 56424 50212
7858 50212 54658 65757 60516 60328 55425 53625 49405 43388 45784 52419 63570 55392 55344 54459 46970
7843 46970 41510 60869 69910 59047 43961 40425 39101 29149 32280 24504 18746 21388 54148 66173
7829 66173 60978 52533 43140 40128 42312 46361 45954 42988 41317 34319 22229 27552 41037 33448
7815 33448 37121 38050 32474 25748 32371 44193 54110 52063 45109 49369 35267 35354 47057 52234 27995
7800 27995 25564 30078 42376 49168 52781 48691 40186 27954 31987 31610 25429 34823 43176 32068
$$ packed form
7899G0433r289r439J679N169J2395P78Q830j0331R47j1520j047l526q396L403
7885E0086l800L267p158M623p618o434J6378J418j5182J3937o73m260J5848J6813
7871G7245j1446j3977o285R719m273R228m305k364J7877P077j1826j0246o212
7858E0212M446J1099n241j88m903j800m220o017K396O635J1151q178m8q85p489
7843D6970n460J9359R041j0863j5086l536j324r952L131p776n758K642L2760J2025
7829F6173n195q445r393l012K184M049m07k966j671o998j2090N323J3485p589
7815C3448L673R29n576o726O623J1822R917k047o954M260j4102Q7J1703N177k4239
7800B7995k431M514J2298O792L613m090q505j2232M033l77o181R394Q353j1108
$$ plain form
7786 32068 22344 28727 36099 40560 46275 50479 52370 42707 31618 33392 40285 44549 45685 33875
7772 33875 32986 34833 24056 23491 31256 35567 41146 38529 39519 47677 54814 56591 63902 57755 39345
7757 39345 34852 32826 37925 35163 20047 24233 21665 4345 3502 11120 20110 24735 24525 20041 26623
7742 26623 31171 27290 12387 11476 24667 40251 39529 26137 20762 12763 18315 24210 17316 26007
7728 26007 31822 36820 39579 43039 44643 38901 35844 35539 42313 42205 31906 30049 34255 20827 16964
7713 16964 11461 25782 24348 27703 24000 20847 24135 23432 39343 42839 25918 6315 10814 20917
7699 20917 27977 27742 40555 51905 52744 45476 40990 53619 47973 45668 40308 25811 31474 30868
7685 30868 22690 19544 23146 21502 11704 2330 15089 16862 14001 29645 46787 55260 67079 69070
$$ packed form
7786C2068r724O383P372M461N715M204J891r663j1089J774O893M264J136j1810
7772C3875q89J847j0777n65P765M311N579k617R90Q158P137J777P311o147j8410
7757C9345m493k026N099k762j5116M186k568j7320q43P618Q990M625k10m484O582
7742B6623M548l881j4903r11J3191J5584p22j3392n375p999N552N895o894Q691
7728B6007N815M998K759L460J604n742l057l05O774j08j0299j857M206j3428l863
7713A6964n503J4321j434L355l703l153L288p03J5911L496j6921j9603M499J0103
7699B0917P060k35J2813J1350Q39p268m486J2629n646k305n360j4497N663o06
7685C0868q178l146L602j644r798r374J2759J773k861J5644J7142Q473J1819J991
$$ plain form
7671 69070 68008 60122 47329 38358 33859 19854 22260 34745 31225 20836 34097 43006 20909
7658 20909 9145 9762 18006 24245 31434 38075 36613 28298 28824 29333 30236 31677 25077 23401 33092
7643 33092 39758 26699 31404 38647 37279 36541 43746 48993 46345 44615 42401 38703 31951 23946 25401
7628 25401 40503 41953 27062 15790 17232 13000 17755 22621 22542 23154 31182 34195 31271 23977 12092
7613 12092 8336 10851 6571 11336 14688 28826 28388 24479 32487 29242 21600 26508 32609 22059
7599 22059 29706 35638 27725 20186 19495 17258 24129 26620 14356 4317 -2184 2410 19266 19396
7585 19396 15033 22617 27398 34350 21009 16471 22844 18018 18655 12784 1805 11181 15930 13661
7571 13661 5945 9521 11473 9214 15959 29839 48697 51406 45622 36066 29511 36403 29717 18926
$$ packed form
7671F9070j062p886j2793q971m499j4005K406J2485l520j0389J3261Q909k2097
7658B0909j1764O17Q244O239P189O641j462q315N26N09R03J441o600j676R691
7643C3092O666j3059M705P243j368p38P205N247k648j730k214l698o752q005J455
7628B5401J5102J450j4891j1272J442m232M755M866p9O12Q028L013k924p294j1885
7613A2092l756K515m280M765L352J4138m38l909Q008l245p642M908O101j0550
7599B2059P647N932p913p539o91k237O871K491j2264j0039o501M594J6856J30
7585A9396m363P584M781O952j3341m538O373m826O37n871j0979R376M749k269
7571A3661p716L576J952k259O745J3880J8858K709n784r556o555O892o686j0791
$$ plain form
7557 18926 10979 1245 658 17686 18673 6109 1021 4976 14115 22371 33594 48212 45898 48794
7543 48794 39352 29544 22727 19803 25954 30367 30495 31170 30898 20784 16694 16996 22738 18781 13206
7528 13206 20446 38900 53064 55582 47077 43567 36884 23271 27255 41701 43372 36180 32671 42581
7514 42581 26430 8793 -4869 -4780 -7195 -5687 8986 19573 28128 31158 26535 39977 37578 20927
7500 20927 -4614 -21698 -12821 955 16410 30307 26302 28085 47789 48502 42476 44771 51890
7487 51890 43776 17813 12099 20577 13997 -1537 3581 -9 20243 30506 22713 29107 24124 22903
7473 22903 17240 12253 19801 23164 40068 43624 42984 43145 35619 28573 17839 9866 8446 9796 15292
7458 15292 24380 25144 22086 30243 29240 22747 8188 -177 1707 11079 21597 20083 8988 8519
$$ packed form
7557A8926p947r734n87J7028R87j2564n088L955R139Q256J1223J4618k314K896
7543D8794r442r808o817k924O151M413J28O75k72j0114m090L02N742l957n575
7528A3206P240J8454J4164K518q505l510o683j3613L984J4446J671p192l509R910
7514D2581j6151j7637j3662Q9k415J508J4673J0587Q555L030m623J3442k399j6651
7500B0927k5541j7084Q877J3776J5455J3897m005J783J9704P13o026K295P119
7487E1890q114k5963n714Q478o580j5534N118l590K0252J0263p793O394m983j221
7473B2903n663m987P548L363J6904L556o40J61p526p046j0734p973j420J350N496
7458A5292R088P64l058Q157j003o493j4559q365J884R372J0518j514j1095m69
$$ plain form
7444 8519 2955 10740 14909 17785 10676 18119 17347 8951 22606 36939 32489 24766 25247 12902 3679
7429 3679 9750 7302 659 5209 9953 14143 27575 38563 34014 37548 36383 35077 29220 27868
7415 27868 37705 27749 28921 35228 21024 9506 17398 16810 17661 38948 35808 36026 47847 48307 35692
7400 35692 26654 24707 33882 26733 12233 14840 29767 31472 24420 25847 19104 8008 9321 2797
7386 2797 5462 3723 10169 21848 22486 9578 11145 13063 16288 6796 6129 17967 25179 15599 9676
7371 9676 10229 15566 17852 12988 19571 18894 11065 10569 22214 32000 26214 8766 3164 11838 17658
7356 17658 26533 35436 32638 23477 29295 16346 6151 9215 12061 4397 -453 -9731 -9674 -11901 -8398
7341 -8398 -7861 -16182 -9104 -2858 6781 9127 -3544 7675 17185 12157 8184 10081 11557 3230 1025
$$ packed form
7444H519n564P785M169K876p109P443p72q396J3655J4333m450p723M81j2345r223
7429C679O071k448o643M550M744M190J3432J0988m549L534j165j306n857j352
7415B7868R837r956J172O307j4204j1518P892n88Q51K1287l140K18J1821M60j2615
7400C5692r038j947R175p149j4500K607J4927J705p052J427o743j1096J313o524
7386B797K665j739O446J1679O38j2908J567J918L225r492o67J1838P212r580n923
7371I676N53N337K286m864O583o77p829m96J1645R786n786j7448n602Q674N820
7356A7658Q875Q903k798r161N818j2949j0195L064K846p664m850r278N7k227L503
7341h398N37q321P078O246R639K346j2671J1219R510n028l973J897J476q327k205
$$ plain form
7326 1025 11710 21059 31957 43192 45870 39427 29633 12943 -565 2768 8891 6671 8419 11189
7312 11189 8700 19173 26155 15303 21356 20895 18645 2549 -1692 6440 13436 15840 20399 24784
7298 24784 28456 27574 22949 13890 9701 16064 25508 8326 -3585 14855 10723 10539 9975 4818 6701
7283 6701 3445 13998 20884 20662 8433 990 5356 -205 6669 22483 16013 13309 -229 4590
7269 4590 29765 30130 27224 30282 30876 26792 27011 5066 -1814 -1142 5595 6522 2168 4967 -1164 -4422
7253 -4422 6269 24052 25455 32590 20595 10030 20102 24884 22337 12807 17367 14331 7314 13494
7239 13494 22138 18784 8046 10709 15504 19387 23108 29239 26404 11735 1845 -1016 -7369 -765
7225 -765 5591 3908 10891 16232 18600 16557 5314 8223 16403 19095 15390 10099 16169 16803 16061
$$ packed form
7326A025J0685R349J0898J1235K678o443r794j6690j3508L333O123k220J748K770
7312A1189k489J0473O982j0852O053m61k250j6096m241Q132O996K404M559M385
7298B4784L672q82m625r059m189O363R444j7182j1911J8440m132j84n64n157J883
7283F701l256J0553O886k22j2229p443M366n561O874J5814o470k704j3538M819
7269D590K5175L65k906L058N94m084K19k1945o880O72O737R27m354K799o131l258
7253d422J0691J7783J403P135j1995j0565J0072M782k547r530M560l036p017O180
7239A3494Q644l354j0738K663M795L883L721O131k835j4669r890k861o353O604
7225g65O356j683O983N341K368k043j1243K909Q180K692l705n291O070O34p42
$$ plain form
7210 16061 12626 6624 8049 3938 620 4698 7782 2160 9919 11842 8419 12234 7556 4765 15066
7195 15066 27871 25548 11271 8065 9183 10612 8180 12852 6669 4420 6382 8435 -2659 17930
7181 17930 26919 22416 8219 -1043 -9305 -7777 -6576 -11904 -6161 8263 17537 18482 18869 17111 23008
7166 23008 28458 30434 17044 7576 11569 11815 9506 16440 30913 27001 25997 14250 17758 17961
7152 17961 25538 32561 50107 45365 24860 3977 -7539 -6310 -4755 -9593 -324 3139 2859 267
7138 267 2306 12046 22485 12948 -4743 -4236 19870 30784 23413 26406 37229 21448 21673 28366
7124 28366 25129 31584 38906 11817 6951 10737 13649 22772 33989 32937 24076 28641 25402 21664
7110 21664 26838 25764 16786 9068 -14061 -10900 -838 3383 183 -3343 -12645 -14512 -8455 -9880
$$ packed form
7210A6061l435o002J425m111l318M078L084n622P759J923l423L815m678k791J0301
7195A5066J2805k323j4277l206J118J429k432M672o183k249J962K053j1094K0589
7181A7930Q989m503j4197r262q262J528J201n328N743J4424R274R45L87j758N897
7166B3008N450J976j3390r468L993K46k309O934J4473l912j004j1747L508K03
7152A7961P577P023J7546m742k0505k0883j1516J229J555m838R269L463k80k592
7138B67K039R740J0439r537j7691N07K4106J0914p371K993J0823j5781K25O693
7124B8366l237O455P322k7089m866L786K912R123J1217j052q861M565l239l738
7110B1664N174j074q978p718k3129L161J0062M221l200l526r302j867O057j425
$$ plain form
7096 -9880 5588 18182 30970 21375 17356 6643 16641 30160 19607 -4283 -7958 1867 4955
7083 4955 -11712 -13281 3451 5923 4647 13235 16069 19245 26042 19248 7715 10131 178 -6647
7069 -6647 -7760 -2055 12275 11247 8582 16596 8094 7002 14970 22805 31824 24913 17944 3219
7055 3219 -6678 7902 12701 22589 29152 19785 1044 -11284 -22836 -12681 -2625 -14580 -7559
7042 -7559 -3972 -6731 -4910 7845 15552 3932 933 11203 9659 10264 17721 14284 -670 -13000
7028 -13000 -14199 -4920 -1159 935 1304 7829 7645 -4105 -2372 13040 21454 29206 21672 19187 8816
7013 8816 -747 -3118 -1829 6238 18415 19914 11005 5790 14284 21770 16520 7789 140 -2879 2269
6998 2269 4489 11475 16628 23179 26409 18056 23650 14619 1 9333 14529 10738 2324 -1952 -9690
$$ packed form
7096i880J5468J2594J2788r595m019j0713R998J3519j0553k3890l675R825L088
7083D955j6667j569J6732K472j276Q588K834L176O797o794j1533K416r953o825
7069f647j113N705J4330j028k665Q014q502j092P968P835R019o911o969j4725
7055C219r897J4580M799R888O563r367j8741j2328j1552J0155J0056j1955P021
7042g559L587k759J821J2755P707j1620k999J0270j544O05P457l437j4954j2330
7028a3000j199R279L761K094L69O525j84j1750J733J5412Q414P752p534k485j0371
7013H816r563k371J289Q067J2177J499q909n215Q494P486n250q731p649l019N148
6998B269K220O986N153O551L230q353N594r031j4618R332N196l791q414m276p738
$$ plain form
6983 -9690 -4754 13570 8317 1109 8506 9875 7338 9969 6991 7076 12567 20248 15370 -194 -4779
6968 -4779 -11162 -307 9232 5491 4397 -3430 603 7033 10171 4618 11354 20207 15241 7051 232
6953 232 3794 -4851 -1087 11633 24661 26276 8393 4122 11635 11456 9414 19135 17787 23277 33669
6938 33669 17545 1939 -6580 -8613 6430 10485 5893 7002 20384 10053 -6093 -5167 12092
6925 12092 17307 27317 30525 27523 20262 15374 -1082 1182 13524 8180 -4815 -7787 3775
6912 3775 8314 9842 10313 15474 3446 -5396 14471 22543 15682 12537 8682 8754 21745 23358 12076
6897 12076 5857 3782 5003 -13678 -28472 -21428 -2815 8800 -1595 -5663 284 9957 13249
6884 13249 11397 13062 22623 31649 24386 15150 13878 13850 7217 4970 3426 -5771 -2089 -2288 -1861 6760
$$ packed form
6983i690M936J8324n253p208P397J369k537K631k978Q5N491P681m878j5564m585
6968d779o383J0855R539l741j094p827M033O430L138n553O736Q853m966q190o819
6953B32L562q645L764J2720J3028J615j7883m271P513j79k042R721j348N490J0392
6938C3669j6124j5606q519k033J5043M055m592J109J3382j0331j6146R26J7259
6925A2092N215J0010L208l002p261m888j6456K264J2342n344j2995k972J1562
6912C775M539J528M71N161j2028q842J9867Q072o861l145l855P2J2991J613j1282
6897A2076o219k075J221j8681j4794P044J8613J1615j0395m068N947R673L292
6884A3249j852J665R561R026p263r236j272k8o633k247j544r197L682j99M27Q621
$$ plain form
6868 6760 10496 8748 8210 17665 20020 21751 25591 33491 33574 38411 36023 32145 20560 16115 13815
6853 13815 21400 21093 8732 5927 1566 1082 20163 39050 29369 26690 35246 33867 22202 17920
6839 17920 17035 29609 28252 22926 16099 11940 15681 15081 29507 37772 38629 24132 13562 2008
6825 2008 3151 9786 3119 -3483 -8981 -5442 4449 3199 -7294 -16001 -11177 2662 3405 9114 -4751
6810 -4751 -2639 8449 5433 17797 21603 17106 19051 8491 -1417 7245 22349 36773 38352 26749
6796 26749 18016 22778 25620 28984 23722 601 -8649 -20796 -20835 -16152 -12125 -3739 -7742 -16879 -20517
6781 -20517 -8682 10024 10298 12329 10458 16382 12808 3945 -6707 -7098 -19783 -7968 -8816 -3425
6767 -3425 -10751 -7200 2838 -1080 -7484 -19127 -8440 10690 5113 10267 13665 12455 -14219 -28487
$$ packed form
6868F760L736j748n38R455K355J731L840P900Q3M837k388l878j1585m445k300
6853A3815P585l07j2361k805m361m84J9081J8887r681k679Q556j379j1665m282
6839A7920q85J2574j357n326o827m159L741o00J4426Q265Q57j4497j0570j1554
6825B008J143O635o667o602n498L539R891j250j0493q707M824J3839P43N709j3865
6810d751K112J1088l016J2364L806m497J945j0560r908Q662J5104J4424J579j1603
6796B6749q733M762K842L364n262k3121r250j2147l9M683M027Q386m003r137l638
6781b0517J1835J8706K74K031j871N924l574q863j0652l91j2685J1815q48N391
6767c425p326L551J0038l918o404j1643J0687J9130n577N154L398j210k6674j4268
$$ plain form
6753 -28487 -23561 -15064 -5672 -10629 -5171 -2277 -644 4366 5420 -1215 -1510 4194 -7465 -19555
6739 -19555 -22197 -23180 -14678 4569 7600 2239 5152 -2286 -4564 476 20554 24947 29901 27785
6725 27785 21208 4662 10015 -2182 -3358 6144 14501 23880 22889 25422 23860 40522 49002 51291
6711 51291 60298 55857 41468 30862 27245 20971 26763 20877 4733 3580 1318 16976 18524 7541
6697 7541 7861 905 1559 15804 16303 14692 8891 7380 4786 -3837 -2686 -10584 -16639 -7456 -4234
6682 -4234 2431 -560 -5077 -9398 -13051 -11198 -12760 -11562 -3939 -11961 -4946 4678 871 -8392 -6169
6667 -6169 -1423 13822 15280 27075 23257 14794 9411 4874 821 4907 -3942 760 10515 15099
6653 15099 13539 13567 21093 26744 24772 19196 -2284 -11312 -4505 12480 12415 -3617 -9310 -1270 8124
$$ packed form
6753b8487M926Q497R392m957N458K894J633N010J054o635k95N704j1659j2090
6739a9555k642r83Q502J9247L031n361K913p438k278N040K0078M393M954k116
6725B7785o577j6546N353j2197j176R502Q357R379r91K533j562J6662Q480K289
6711E1291R007m441j4389j0606l617o274N792n886j6144j153k262J5658J548j0983
6697G541L20o956O54J4245M99j611n801j511k594q623J151p898o055R183L222
6682d234O665k991m517m321l653J853j562J198P623q022P015R624l807r263K223
6667f169M746J5245J458J1795l818q463n383m537m053M086q849M702R755M584
6653A5099j560K8P526N651j972n576k1480r028O807J6985o5j6032n693Q040R394
$$ plain form
6638 8124 1382 -11405 -9277 80 -10407 -9467 -3301 -6858 -11717 -13265 -18680 -1971 4455 3001
6624 3001 5829 -3325 -15500 -22378 -29790 -21667 -14426 -16133 -9400 6495 13431 -2805 -8247 -4617
6610 -4617 -4053 -13334 -24369 -31744 -24999 -7926 -253 548 9212 20579 29222 40956 38919 25574
6596 25574 7849 283 -10645 7200 22555 17750 6196 8981 10573 25879 26355 18510 5186
6583 5186 1471 -8099 -12011 -10252 -4542 8261 1676 -7025 -16028 2043 12663 4238 4532 8443
6569 8443 6348 3916 3016 8751 12121 -2114 -19796 -20218 -11242 -9854 -12197 -12587 -2340 6529 9235
6554 9235 17568 17398 15574 14078 11380 11559 11572 1134 -10866 -13504 4124 17324 21448 18092 8386
6539 8386 8864 5992 3440 1569 -2801 -1535 3959 -4229 -11881 -98 9357 18122 22465 17303 5433
$$ packed form
6638H124o742j2787K128R357j0487R40O166l557m859j548n415J6709O426j454
6624C001K828r154j2175o878p412Q123P241j707O733J5895O936j6236n442L630
6610d617N64r281j1035p375O745J7073P673Q01Q664J1367Q643J1734k037j3345
6596B5574j7725p566j0928J7845J5355m805j1554K785J592J5306M76p845j3324
6583E186l715r570l912J759N710J2803o585q701r003J8071J0620q425K94L911
6569H443k095k432r00N735L370j4235j7682m22Q976J388k343l90J0247Q869K706
6554I235Q333j70j824j496k698J79J3j0438j2000k638J7628J3200M124l356r706
6539H386M78k872k552j871m370J266N494q188p652J1783R455Q765M343n162j1870
$$ plain form
6524 5433 -498 -14164 -26412 -27243 -20088 -9333 9943 4611 -4364 124 2798 6373 6302 1656 486
6509 486 -2801 5752 16446 22220 17721 7468 1326 9517 4907 -4679 -8698 931 16186 11406
6495 11406 12421 11173 1688 -10532 -7481 1113 5449 6930 -7365 -5621 6434 -4461 -1375 10821
6481 10821 6717 -16107 -22211 -7602 -14730 1090 10962 10631 12369 3977 3803 349 12471 12859
6467 12859 13101 17945 -160 -556 -4269 -12093 -8971 5160 16566 14527 16925 19211 2065 -8283
6453 -8283 -8819 -6105 -4232 8847 2449 3012 8552 6144 10916 8216 8120 -1041 -1925 4433 -1371 -8768
6437 -8768 -5390 10885 13431 9040 4514 10403 15355 10494 4497 9347 6469 11804 22765 21421
6423 21421 5402 -8020 6789 14489 8165 11546 12782 5178 1976 2958 1284 249 3031 -1797
$$ packed form
6524E433n931j3666j2248q31P155J0755J9276n332q975M488K674L575p1m646j170
6509D86l287Q553J0694N774m499j0253o142Q191m610r586m019R629J5255m780
6495A1406J015j248r485j2220L051Q594M336J481j4295J744J2055j0895L086J2196
6481A0821m104k2824o104J4609p128J5820R872l31J738q392j74l454J2122L88
6467A2859K42M844j8105l96l713p824L122J4131J1406k039K398K286j7146j0348
6453h283n36K714J873J3079o398N63N540k408M772k700r6r161q84O358n804p397
6437h768L378J6275K546m391m526N889M952m861n997M850k878N335J0961j344
6423B1421j6019j3422J4809P700o324L381J236p604l202R82j674j035K782m828
$$ plain form
6409 -1797 8252 16421 12552 15738 21625 29971 23611 26790 24555 24364 16668 12558 13875 14599 11511
6394 11511 8967 6665 11057 10596 -109 2053 10676 18206 13716 2852 4220 20419 24944 17037
6380 17037 22028 20027 22468 25899 18154 11020 4619 17171 26857 17189 15394 17823 18899 19372 21857
6365 21857 17902 6221 8520 11508 1504 7986 9434 5285 7107 10695 7605 16826 16791 4540
6351 4540 -5543 -6545 -11131 5131 3126 5973 1712 3392 9971 19982 22868 19286 15309 15262 10857
6336 10857 1811 138 -2468 -9677 -16183 -8943 12526 28294 21330 5936 8971 11851 17423 8502
6322 8502 9389 11964 4224 -10616 1086 6338 4333 12974 16219 -5867 -14532 5836 9299 23075
6308 23075 22003 15182 26708 26273 17764 24882 24891 19661 26623 18755 2964 2013 18614 17617 1785
$$ packed form
6409a797J0049Q169l869L186N887Q346o360L179k235j91p696m110J317P24l088
6394A1511k544k302M392m61j0705K162Q623P530m490j0864J368J6199M525p907
6380A7037M991k001K441L431p745p134o401J2552R686r668j795K429J076M73K485
6365B1857l955j1681K299K988j0004O482J448m149J822L588l090R221l5j2251
6351D540j0083j002m586J6262k005K847m261J680O579J0011K886l582l977m7m405
6336A0857r046j673k606p209o506P240K1469J5768o964j5394L035K880N572q921
6322H502Q87K575p740j4840J1702N252k005Q641L245k2086q665K0368L463J3776
6308B3075j072o821J1526m35q509P118Rn230O962p868j5791r51J6601r97j5832
$$ plain form
6293 1785 -1434 7695 898 -5955 -2855 2296 -3063 -5358 3767 7053 -1190 5758 3243 -985 3655
6278 3655 705 -1001 5394 5850 1888 11221 22688 17512 4720 998 165 -9819 -4765 1556 -3184
6263 -3184 -4097 -5892 -13547 1695 5594 9562 19052 11715 8759 10676 1356 2988 -5522 3003 7318
6248 7318 12392 599 -13548 587 553 -1666 -2784 9190 18890 10534 9656 3441 5780 -4262
6234 -4262 -1577 18244 13588 -4993 -16907 -19763 -9200 78 10215 16724 9098 11020 9953 14517
6220 14517 10428 12585 3834 816 -20320 -24484 -24137 -28510 -26547 -18756 -10216 -15621 -21185 -18476 -14178
6205 -14178 -16659 -23685 -17558 -13040 -2606 -4841 -16352 -21669 -19441 -10109 -6141 -6415 -20340 -22895
6191 -22895 -12055 -463 12862 7994 10509 8891 10344 4059 4742 14844 9822 12181 9500 -2769
$$ packed form
6293A785l219R129o797o853L100N151n359k295R125L286q243O948k515m228M640
6278C655k950j706O395M56l962R333J1467n176j2792l722q33r984N054O321m740
6263c184r13j795p655J5242L899L968R490p337k956J917r320J632q510Q525M315
6248G318N074j1793j4147J4135l4k219j118J1974R700q356q78o215K339j0042
6234d262K685J9821m656j8581j1914k856J0563R278J0137O509p626J922j067M564
6220A4517m089K157q751l018k1136m164L47m373J963P791Q540n405n564K709M298
6205a4178k481p026O127M518J0434k235j1511n317K228R332L968k74j3925k555
6191b2895J0840J1592J3325m868K515j618J453o285O83J0102n022K359k681j2269
$$ plain form
6177 -2769 -15021 -3213 170 4051 20894 18337 22229 20533 17137 17285 21421 19548 9351 4541
6163 4541 11091 24409 15784 14950 12948 19589 16017 20678 23902 10177 15691 16612 17490 13752 7709
6148 7709 644 1746 5836 16428 16985 8145 -3786 -4504 -4781 -5966 1584 9072 2198 -5271 -2536
6133 -2536 8763 5945 -6439 -205 84 -9538 -14831 -13391 -5187 -1390 -571 15147 23898 18386 -3662
6118 -3662 -20013 -14841 10196 14206 4796 3239 14359 403 276 6774 1797 3303 541 -4883
6104 -4883 -18660 -17435 -10142 -15099 -15639 -13135 -10928 -19100 -13427 -5018 108 2305 10357 4515 -6846
6089 -6846 -20761 -19945 -4745 -4171 5809 1970 -9690 -23825 -17664 -8562 -7993 -292 2833 13377
6075 13377 14571 -9659 -14312 -1200 8797 11202 17945 6962 -1324 -7528 -9719 -9747 -5120 -3289
$$ packed form
6177b769j2252J1808L383L881J6843k557L892j696l396J48M136j873j0197m810
6163D541O550J3318q625q34k002O641l572M661L224j3725N514R21Q78l738o043
6148G709p065J102M090J0592N57q840j1931p18k77j185P550P488o874p469K735
6133b536J1299k818j2384O234K89r622n293J440Q204L797Q19J5718Q751n512k2048
6118c662j6351N172K5037M010r410j557J1120j3956j27O498m977J506k762n424
6104d883j3777J225P293m957n40K504K207q172N673Q409N126K197Q052n842j1361
6089f846j3915Q16J5200N74R980l839j1660j4135O161R102N69P701L125J0544
6075A3377J194k4230m653J3112R997K405O743j0983q286o204k191k8M627J831
$$ plain form
6061 -3289 -6777 9268 11494 8258 2021 6182 9939 18414 21137 25490 30406 27317 22182 13237 6224
6046 6224 -370 -9825 -18120 -11459 -6891 -7077 -2201 14080 2209 -2788 7820 -4403 -2472 1388
6032 1388 -7289 -7129 -6218 7004 16103 13086 5214 -1152 -557 -15696 -17502 -9740 -12602 -1973 449
6017 449 -8813 -5946 -1805 8401 5108 -871 7713 12832 7737 -4358 -2658 -1628 7094 15660 7263
6002 7263 13180 5419 6665 18250 21973 14424 -1594 -19042 -6816 5707 9135 1694 11184 20651
5988 20651 18395 5082 -1216 -17802 -21502 -13984 2873 -1176 -1524 3297 4147 2571 14316 15072
5974 15072 4705 -7025 -8227 -10246 -5579 -7747 -6401 -1006 3852 1457 -4419 -684 6751 15266
5960 15266 16558 13370 3314 -5882 228 -3110 -5625 4252 522 -5328 -6104 -9784 -13328 -7155 10034
$$ packed form
6061c289l488J6045K226l236o237M161L757Q475K723M353M916l089n135q945p013
6046F224o594r455q295O661M568j86M876J6281j1871m997J0608j2223J931L860
6032A388q677J60R11J3222R099l017p872o366N95j5139j806P762k862J0629K422
6017D49r262K867M141J0206l293n979Q584N119n095j2095J700J030Q722Q566q397
6002G263N917p761J246J1585L723p549j6018j7448J2226J2523L428p441R490R467
5988B0651k256j3313o298j6586l700P518J6857m049l48M821Q50j576J1745P56
5974A5072j0367j1730j202k019M667k168J346N395M858k395n876L735P435Q515
5960A5266J292l188j0056r196O110l338k515R877l730n850p76l680l544O173J7189
$$ plain form
5945 10034 -2964 -7939 -12617 -21514 -13832 5006 23208 21347 6238 -8835 -11155 -21810 -30304
5932 -30304 -15280 -4143 -3806 -9003 -9623 -7711 -8612 -22200 -27106 -12742 1298 7044 73 -3703
5918 -3703 7184 4613 4818 592 2668 -6842 -17925 -22902 -28469 -14267 -11329 -813 -4142 -16841
5904 -16841 -21387 -12724 4900 20671 13336 5737 803 -11943 -13132 -937 5754 -628 5586 3421
5890 3421 6706 3400 7340 24004 21854 215 -13171 2541 5471 -1489 2026 -6124 -8980 -84
5876 -84 -4754 -11248 -9491 -7629 -503 9475 -52 -494 -2265 -12141 -19387 -10832 4420 -4234 -14920
5861 -14920 -16525 -16480 -12982 3879 14212 5945 -3737 -15082 -5974 -5606 -11201 -6696 -7406 -6005 -2912
5846 -2912 4835 14425 8980 6725 12598 13949 306 -4235 -3225 -16189 -17620 -10583 -546 178
$$ packed form
5945A0034j2998m975m678q897P682J8838J8202j861j5109j5073k320j0655q494
5932c0304J5024J1137L37n197o20J912r01j3588m906J4364J4040N746o971l776
5918c703J0887k571K05m226K076r510j1083m977n567J4202K938J0516l329j2699
5904a6841m546Q663J7624J5771p335p599m934j2746j189J2195O691o382O214k165
5890C421L285l306L940J6664k150k1639j3386J5712K930o960L515q150k856Q896
5876h4m670o494J757J862P126R978r527m42j771r876p246Q555J5252q654j0686
5861a4920j605M5L498J6861J0333q267r682j1345R108L68n595M505p10J401L093
5846b912P747R590n445k255N873J351j3643m541J010j2964j431P037J0037P24
$$ plain form
5832 178 -7425 -10840 -1512 17194 16768 16303 -1003 -3164 -4223 -9279 -7153 1850 10562 26174 6382
5817 6382 -5340 724 -676 -4747 2802 12656 11303 786 -10685 -15564 4199 26596 35582 30418
5803 30418 15718 3118 67 -453 -8695 -17928 -14240 -1280 -338 -5197 -12866 -21737 -12041 -5547
5789 -5547 -11441 -21520 -19996 -9582 2647 -12190 -17828 -22994 -16181 -5857 -13006 -5980 -4133 -9004
5775 -9004 -3022 3598 -11334 -19826 -18508 -16445 -16653 -22810 -24141 -18085 -17863 -15409 -11665 -4857 -10087
5760 -10087 -9185 2822 16994 28246 24587 3132 -6476 -5113 -2174 7374 9321 13876 12359 23348
5746 23348 20537 20833 21676 11443 4154 -2654 -3998 3513 7088 838 2 6689 11609 7543 -3869
5731 -3869 -7578 -14146 -26422 -10386 379 15374 24547 17930 8840 6174 4109 5278 5835 2543
$$ packed form
5832A78p603l415R328J8706m26m65j7306k161j059n056K126R003Q712J5612j9792
5817F382j1722O064j400m071P549R854j353j0517j1471m879J9763K2397Q986n164
5803C0418j4700j2600l051n20q242r233L688J2960R42m859p669q871R696O494
5789e547n894j0079J524J0414J2229j4837n638n166O813J0324p149P026J847m871
5775i004N982O620j4932q492J318K063k08o157j331O056K22K454L744O808n230
5760a0087R02J2007J4172J1252l659k1455r608J363K939R548J947M555j517J0989
5746B3348k811K96Q43j0233p289o808j344P511L575o250q36O687M920m066j1412
5731c869l709o568j2276J6036J0765J4995R173o617r090k666k065J169N57l292
$$ plain form
5717 2543 -1969 349 1015 -1979 -12738 -17490 -22186 -9055 6462 4289 1076 -9318 -16593 -1979
5703 -1979 3867 3749 -3547 4684 11568 10264 3300 -12618 -14663 -23529 -34752 -31118 -29610 -25630 -20997
5688 -20997 -21786 -25683 -18214 -6503 346 -2902 -13223 -24657 -27200 -12453 -6083 -10161 -1579 -2180
5674 -2180 1706 18703 15514 6392 5051 8834 7002 -13334 -19607 -15028 -6548 -9406 -15793 -17166
5660 -17166 -5821 -780 -1048 4481 13839 23432 21344 14862 16827 24021 25574 18683 18448 14557 15694
5645 15694 14844 19955 7667 -2282 -3142 -8606 -3430 -6546 -9127 -6757 -4769 2950 5157 -11164 -20804
5630 -20804 -26253 -36140 -34010 -16014 -14579 -16321 -13712 -6296 -3420 -4994 2425 3595 -1451 -11003
5616 -11003 -7414 -4177 -10288 -7194 8681 15528 13492 14741 7766 -1270 7309 15239 14800 16884 7951
$$ packed form
5717B543m512K318O66k994j0759m752m696J3131J5517k173l213j0394p275J4614
5703a979N846j18p296Q231O884j304o964j5918k045q866j1223L634J508L980M633
5688b0997p89l897P469J1711O849l248j0321j1434k543J4747O370m078Q582o01
5674b180L886J6997l189r122j341L783j832k0336o273M579Q480k858o387j373
5660a7166J1345N041k68N529R358R593k088o482J965P194J553o891k35l891J137
5645A5694q50N111j2288r949q60n464N176l116k581K370J988P719K207j6321r640
5630b0804n449r887K130J7996J435j742K609P416K876j574P419J170n046r552
5616a1003L589L237o111L094J5875O847k036J249o975r036Q579P930m39K084q933
$$ plain form
5601 7951 5944 2713 3732 10675 9254 405 -17 3053 7356 -38 -2654 1682 -2119 -6043 3561
5586 3561 -44 769 -2134 -1965 235 -10830 -17008 -14282 -6366 -402 1477 6248 11437 6793 -9319
5571 -9319 -13322 -16777 -17555 -12913 -23274 -26102 -19813 -13411 -12427 -4154 -1484 -3111 9688 27741 27059
5556 27059 14179 -1996 4407 10029 338 -14192 -15808 -5610 4179 -2070 -7534 -5274 612 -1713
5542 -1713 -10967 -18104 -12521 -9920 -10075 -3888 11133 12228 9835 2635 175 886 -1651 4713 18821
5527 18821 19157 4969 6421 11822 8827 -7260 -11418 11485 19940 10537 2085 1811 15016 14609
5513 14609 22697 19568 10172 9225 -7879 -14192 -10810 1093 2044 -167 3372 5581 -5218 -5091 5973
5498 5973 11947 8157 4243 -7826 -18203 -24280 -24544 -27819 -8679 -1455 -3989 -10880 -6764 -1401
$$ packed form
5601G951k007l231J019O943j421q849m22L070M303p394k616M336l801l924R604
5586C561l605Q13k903J69K200j1065o178K726P916N964J879M771N189m644j6112
5571i319m003l455p78M642j0361k828O289O402R84Q273K670j627J2799J8053o82
5556B7059j2880j6175O403N622r691j4530j616J0198R789o249n464K260N886k325
5542a713r254p137N583K601j55O187J5021J095k393p200k460P11k537O364J4108
5527A8821L36j4188J452N401k995j6087m158K2903Q455r403q452k74J3205m07
5513A4609Q088l129r396r47j7104o313L382J1903R51k211L539K209j0799J27J1064
5498E973N974l790l914j2069j0377o077k64l275J9140P224k534o891M116N363
$$ plain form
5484 -1401 8948 7357 7005 8345 2106 7663 4979 2807 -9515 -17477 -19721 -20328 -10059 -2304 6283
5469 6283 4331 -1519 -9689 -22688 -12028 -3844 -1730 231 4883 5596 -11006 -15891 -13464 -14799
5455 -14799 -13358 -10710 -6404 8641 2409 -1610 -9514 -6912 851 4463 16365 3190 -3136 -1361
5441 -1361 7549 4586 -817 -2860 847 4816 -3741 -4577 5777 -5388 -14677 -11357 -1896 -3810 -5351
5426 -5351 -286 -6014 -4849 -7353 -2533 -1892 -5676 -9474 -3238 15063 15924 16088 13314 5593 3514
5411 3514 4618 1572 -7191 -6189 -6118 -15970 -30896 -36674 -9749 5069 6666 4469 59 14582
5397 14582 7711 4373 -1615 -1732 13961 13603 10404 601 -4417 -5551 -12495 -6317 14874 11731 13978
5382 13978 4268 -5519 -1378 -3299 -4457 -12528 -12786 -7407 -10991 -28278 -24931 -6288 5729 14415
$$ packed form
5484a401J0349j591l52J340o239N557k684k172j2322p962k244o07J0269P755Q587
5469F283j952n850q170j2999J0660Q184K114J961M652P13j6602m885K427j335
5455a4799J441K648M306J5045o232m019p904K602P763L612J1902j3175o326J775
5441a361Q910k963n403k043L707L969q557q36J0354j1165r289L320R461j914j541
5426e351N065n728J165k504M820O41l784l798O236J8301Q61J64k774p721k079
5411C514J104l046q763J002P1r852j4926n778K6925J4818J597k197m410J4523
5397A4582o871l338n988j17J5693l58l199r803n018j134o944O178K1191l143K247
5382A3978r710r787M141j921j158q071k58N379l584j7287L347J8643J2017Q686
$$ plain form
5368 14415 6181 -1148 11616 8139 386 -2394 -1834 10944 10584 1369 1602 9239 7245 -10241 -19901
5353 -19901 -11444 -7522 -9709 -3920 13257 12927 9589 12493 21193 17371 -1676 -6570 -8596 -16832
5339 -16832 -12207 -21293 -29929 -16997 -7357 -2263 4456 11073 9658 5995 1877 5893 14733 15850
5325 15850 4940 -9804 -35660 -32477 -14991 -4941 484 -3486 -919 6040 3461 2391 -1158
5312 -1158 -4304 -11521 -14213 -6611 -2349 -5739 -13623 -9264 -6951 -8963 -2910 4019 -5911 -8437 -6767
5297 -6767 -8849 -3691 -8649 -17878 -20814 -10502 -11915 -11547 -7603 -12405 -2748 7714 16478 6059
5283 6059 -6423 -3936 7252 -3014 -15139 -12262 -3738 1486 2624 5729 1275 13182 17407 12601
5269 12601 -9461 -20283 -30860 -26688 -7584 -9510 -18299 -19605 -7464 -2963 12695 5686 5157
$$ packed form
5368A4415q234p329J2764l477p753k780N60J2778l60r215K33P637j994j7486r660
5353a9901Q457L922k187N789J7177l30l338K904Q700l822j9047m894k026q236
5339a6832M625r086q636J2932R640N094O719O617j415l663m118M016Q840J117
5325A5850j0910j4744k5856L183J7486J0050N425l970K567O959k579j070l549
5312a158l146p217k692P602M262l390p884M359K313k012O053O929r930k526J670
5297f767k082N158m958r229k936J0312j413L68L944m802R657J0462Q764j0419
5283F059j2482K487J1188j0266j2125K877Q524N224J138L105m454J1907M225m806
5269A2601k2062j0822j0577M172J9104j926q789j306J2141M501J5658p009n29
$$ plain form
5256 5157 11780 7833 9003 8487 -5888 -21487 -19987 -21407 -22056 -26141 -23320 -21276 -11618 -4730 6985
5241 6985 7814 6804 5892 1828 9575 8028 2414 -16120 -19671 -17709 -8030 -5136 -14698 -15214 -7022
5226 -7022 -6323 -12602 -11818 -11866 -19963 -22811 -27002 -31806 -22202 -17977 -7927 -8988 -14873 -17641 -7497
5211 -7497 8600 -748 -10103 -6712 -2772 -4047 -6593 -793 -3991 -7610 -4452 -13684 -29020 -27904
5197 -27904 -21533 -6686 2591 -5709 -6499 -13603 -16214 -13513 -8201 -9571 6770 4448 6728 8377
5183 8377 6866 -2794 8987 31601 17011 2058 -4715 917 10532 11823 8899 3886 7457 3160
5169 3160 2174 4174 1466 9553 22178 17355 3258 7153 5415 4554 7542 9938 10754 22319 16610
5154 16610 13901 11395 10633 10213 9783 19284 9976 15801 14305 15729 4217 1757 -2919 -8245 4594
$$ packed form
5256E157O623l947J170n16j4375j5599J500j420o49m085K821K044R658O888J1715
5241F985Q29j010r12m064P747j547n614j8534l551J962R679K894r562n16Q192
5226g022O99o279P84m8q097k848m191m804R604M225J0050j061n885k768J0144
5211g497J6097r348r355L391L940j275k546N800l198l619L158r232j5336J116
5197b7904O371J4847R277q300p90p104k611K701N312j370J6341k322K280J649
5183H377j511r660J1781K2614j4590j4953o773N632R615J291k924n013L571m297
5169C160r86K000k708Q087J2625m823j4097L895j738q61K988K396Q16J1565n709
5154A6610k709k506p62m20m30R501r308N825j496J424j1512k460m676n326J2839
$$ plain form
5139 4594 23960 41495 34366 20464 6936 -6584 -7624 -11479 -9288 -2771 -1109 4652 12461 15752
5125 15752 14814 12257 -8460 -13020 -3904 5033 6916 1719 6944 6251 13849 13025 890 4521 9651
5110 9651 -2129 -3400 -7143 -1424 -4706 -287 4306 6264 3681 -2467 3011 17781 18216 9217 543
5095 543 -2314 -546 -3329 942 5417 8914 7136 -1243 -1299 6634 10563 -1487 5272 7196 -360
5080 -360 -283 10581 12205 6688 2275 4616 5288 -6468 -24603 -25019 -17441 -13521 -17429 -21954 -18064
5065 -18064 -11845 -8792 -1060 -5265 -7640 7626 19212 13423 5818 -2191 -1790 11443 17137 13406
5051 13406 21284 17557 7391 -1882 -7141 -6727 1179 -1078 -20121 -17455 -6401 -822 -4075 -4745
5037 -4745 -1586 10166 929 -4372 -1345 -11144 -14717 -18022 -19108 -21509 -18209 -15101 -5254 -9671 -9307
$$ packed form
5139D594J9366J7535p129j3902j3528j3520j040l855K191O517J662N761P809L291
5125A5752r38k557k0717m560R116Q937J883n197N225o93P598q24j2135L631N130
5110I651j1780j271l743N719l282M419M593J958k583o148N478J4770M35q999q674
5095E43k857J768k783M271M475L497j778q379n6P933L929j2050O759J924p556
5080c60P7J0864J624n517m413K341O72j1756j8135m16P578L920l908m525L890
5065a8064O219L053P732m205k375J5266J1586n789p605q009M01J3233N694l731
5051A3406P878l727j0166r273n259M14P906k257j9043K666J1054N579l253o70
5037d745L159J1752r237n301L027r799l573l305j086k401L300L108R847m417L64
$$ plain form
5022 -9307 -15443 -18072 -21489 -531 -1534 -12448 -10108 -16241 -14298 -6327 -2228 -8764 -5409 -3533
5008 -3533 -2029 -6551 -16910 -25842 -28748 -34456 -27032 -21030 -18221 -10345 -5534 -3441 -1318 -3739 5139
4993 5139 11645 6028 5376 18444 29617 17512 3614 -4696 -899 -6546 -10881 -9068 -16315 -18641
4979 -18641 -11507 -12448 -15277 3148 17568 22275 14444 8934 6286 7578 69 -6930 -12797 -14409
4965 -14409 -13503 -7526 -2764 -10205 -17151 -17778 -2017 7396 5662 10173 8375 3092 -1722 -723 -3535
4950 -3535 -7243 397 4102 8782 2975 -14916 -14341 -9241 -12044 -13269 2988 27779 24773 5924
4936 5924 -16427 -9937 -3820 6121 16823 9256 -5457 -8777 -9599 -10633 -5935 7036 -1691 -7745
4922 -7745 -4968 2801 -1121 -9563 -22066 -7545 -1419 -8554 -25016 -25031 -7754 -539 -12262 -22884
$$ packed form
5022i307o136k629l417K0958j003j0914K340o133J943P971M099o536L355J876
5008c533J504m522j0359q932k906n708P424O002K809P876M811K093K123k421Q878
4993E139O506n617o52J3068J1173j2105j3898q310L797n647m335J813p247k326
4979a8641P134r41k829J8425J4420M707p831n510k648J292p509o999n867j612
4965a4409R06N977M762p441o946o27J5761R413j734M511j798n283m814R99k812
4950c535l708P640L705M680n807j7891N75N100k803j225J6257K4791l006j8849
4936E924k2351O490O117R941J0702p567j4713l320q22j034M698J2971q727o054
4922g745K777P769l922q442j2503J4521O126p135j6462j5J7277P215j1723j0622
$$ plain form
4908 -22884 -21769 -23444 -25018 -4085 2212 -994 -6852 -8909 -24857 -20677 -12760 -21232 -24363 -26128
4894 -26128 -14524 -3823 -8833 -23061 -29375 -40724 -50556 -45000 -38367 -28321 -18183 -2051 -717
4881 -717 -8377 -7026 -12568 -11346 -10832 -25396 -18176 -26546 -32642 -19422 -21670 -11774 -6487 -6263 -9667
4866 -9667 -19068 -37102 -42753 -29150 -16485 -14712 -1317 3624 2619 9860 4841 6279 4917 19667
4852 19667 26230 22298 18445 18075 9593 12481 7617 -7792 -8372 -222 -6616 1274 11303 14720 8098
4837 8098 2580 -2924 -10555 -20037 -13005 3172 17267 5991 2530 5191 10834 14903 8955 7580
4823 7580 6038 5884 9748 1627 1279 -2394 -5862 -8284 -2813 11168 11418 7625 -1198 -5699 -5489 1557
4807 1557 961 11666 14768 12413 15580 18686 20537 22241 9957 8836 4183 1023 1840 -371 -1594
$$ packed form
4908b2884J115j675j574K0933O297l206n858k057j5948M180P917q472l131j765
4894b6128J1604J0701n010j4228o314j1349r832N556O633J0046J0138J6132J334
4881g17p660J351n542J222N14j4564P220q370o096J3220k248R896N287K24l404
4866i667r401j8034n651J3603J2665J773J3395M941j005P241n019J438j362J4750
4852A9667O563l932l853l70q482K888m864j5409n80Q150o394P890J0029L417o622
4837H098n518n504p631r482P032J6177J4095j1276l461K661N643M069n948j375
4823G580j542j54L864q121l48l673l468k422N471J3981K50l793q823m501K10P046
4807A557n96J0705L102k355L167L106J851J704j2284j121m653l160Q17k211j223
$$ plain form
4792 -1594 2442 -6456 -18182 -13780 -3265 -2950 -8989 4135 17873 5094 -1079 -668 -2811 -5296
4778 -5296 -8657 -10379 -6253 192 -9148 -6172 -5830 -4089 -5565 -3479 -279 8426 17267 16189 5012
4763 5012 -6663 -2922 -2676 6402 11755 11076 4108 13943 5885 -3624 -11921 -4790 963 -177 -1388
4748 -1388 9704 4164 -782 -1673 -6089 -6124 -13183 -16458 8155 12314 13036 14364 7189 4585 2836
4733 2836 -7333 -9691 -12398 -1801 -7493 -3693 751 -6788 -4684 -6988 6334 2127 -5044 -1462
4719 -1462 7159 2950 -5342 -7652 -7974 -18491 -29049 -34135 -9845 -16319 -22192 -17235 -8066 2871
4705 2871 4515 1046 5177 425 -10285 -9002 -14392 -6657 6742 5508 2426 -453 -5742 -14602
4691 -14602 -15529 -14966 -13441 -10771 -7817 -8178 3064 10237 9873 -2143 -10976 -8382 -15527 -5129 -253
$$ packed form
4792a594M036q898j1726M402J0515L15o039J3124J3738j2779o173M11k143k485
4778e296l361j722M126O445r340K976L42J741j476K086L200Q705Q841j078j1177
4763E012j1675L741K46R078N353o79o968R835q058r509q297P131N753j140j211
4748a388J1092n540m946q91m416l5p059l275K4613M159P22J328p175k604j749
4733B836j0169k358k707J0597n692L800M444p539K104k304J3322m207p171L582
4719a462Q621m209q292k310l22j0517j0558n086K4290o474n873M957R169J0937
4705B871J644l469M131m752j0710J283n390P735J3399j234l082k879n289q860
4691a4602r27N63J525K670K954l61J1242P173l64j2016q833K594p145J0398M876
$$ plain form
4676 -253 8326 1484 4152 -2367 -4719 -3433 -2374 -3948 -935 -1055 705 3328 -13769 -8169 7676
4661 7676 10933 13505 10528 8255 7666 8480 -5008 -8263 -12436 -13588 3044 17447 9297 -9860
4647 -9860 -17119 -15049 -21897 -22585 -14975 -3617 19391 24906 7977 -911 -8607 -6782 -360 600 946
4632 946 1420 2692 -10757 -38858 -38719 -24799 -26281 -24442 -19688 -23519 -12690 -1146 -5151 -11430
4618 -11430 -16212 -16678 -10486 990 21342 13169 8645 26631 14900 6324 4794 7784 -4421 -5953
4604 -5953 -5265 -14567 -7668 -106 -10126 -20371 -13994 -22244 -8803 -1421 5211 -2721 -4708 -5456 -4905
4589 -4905 329 -909 -10728 -3281 -17316 -16709 -21620 -11737 -3846 -2740 -6715 -9724 -12942 -20645 -16877
4574 -16877 -13758 -7345 -6819 -22769 -17491 -8985 -9845 -10818 -13952 -10863 -8465 4531 476 -11821 -7601
$$ packed form
4676b53Q579o842K668o519k352J286J059j574L013j20J760K623j7097N600J5845
4661G676L257K572k977k273n89Q14j3488l255m173j152J6632J4403q150j9157
4647i860p259K070o848o88P610J1358K3008N515j6929q888p696J825O422R60L46
4632I46M74J272j3449k8101J39J3920j482J839M754l831J0829J1544m005o279
4618a1430m782m66O192J1476K0352q173m524J7986j1731q576j530K990j2205j532
4604e953O88r302O899P562j0020j0245O377q250J3441P382O632p932j987p48N51
4589d905N234j238r819P447j4035O07m911R883P891J106l975l009l218p703L768
4574a6877L119O413N26j5950N278Q506q60r73l134L089K398J2996m055j2297M220
$$ plain form
4559 -7601 -6051 -15888 -11913 -7924 -23714 -27379 -31290 -47094 -50736 -24068 -14421 -15312 -14340 -13642 -2368
4544 -2368 -1849 5542 9344 -5232 -773 10298 17023 19376 4096 -7035 -5179 13291 12622 13684
4530 13684 15234 4737 1733 7881 13579 10953 7077 -6669 -25053 -10978 -1532 -15270 -7372
4517 -7372 1370 -6140 -6928 -8738 -22723 -26420 -16680 -5438 -3797 -19441 -13078 -5 9995 5827
4503 5827 1921 2449 1085 -318 4167 6413 6222 7484 -3867 -16439 -12284 -10828 -12040 -6952 8165
4488 8165 9873 7904 4854 -7651 -8682 -3016 -7329 -13943 -10128 9618 10047 1259 -8579 -20528
4474 -20528 -17735 -16162 -9499 -8434 -7762 -17325 -9747 -17478 -15452 -2621 -4294 -10285 -6592 -6167 -8804
4459 -8804 -23746 -20995 -8429 1265 -15671 -22736 -10744 429 2328 -2390 -11483 -25301 -19283
$$ packed form
4559g601J550r837L975L989j5790l665l911j5804l642K6668R647q91R72O98J1274
4544b368N19P391L802j4576M459J1071O725K353j5280j1131J856J8470o69J062
4530A3684J550j0497l004O148N698k626l876j3746j8384J4075R446j3738P898
4517g372Q742p510p88j810j3985l697R740J1242J641j5644O363J3073J0000m168
4503E827l906N28j364j403M485K246j91J262j1351j2572M155J456j212N088J5117
4488H165J708j969l050j2505j031N666m313o614L815J9746M29q788r838j1949
4474b0528K793J573O663J065O72r563P578p731K026J2831j673n991L693M25k637
4459h804j4942K751J2566R694j6936p065J1992J1173J899m718r093j3818O018
$$ plain form
4446 -19283 -9086 6958 -2009 -24332 -32257 -25669 -15028 -15298 -11753 -8533 -13449 -7524 6087 7596
4432 7596 -26 -9479 -17977 -20046 -13712 -11390 -8679 -7792 -9303 -25131 -23466 -21369 -21010 -26078 -26870
4417 -26870 -19147 -25826 -24134 -18504 -14771 -11244 -14650 -17757 -7846 -4595 1054 -2532 -6282 -1380 -1120
4402 -1120 -197 -4940 -7962 -8322 -14376 -23279 -16376 -8589 11775 17141 9771 1811 2042 -8234 -21265
4387 -21265 -10974 3910 1523 -10264 -31172 -32415 -31586 -22978 -22261 -11068 -5981 -4998 -2078 4125
4373 4125 -686 -8819 -13210 -7383 -2614 10600 2859 -14408 -7866 -14382 -12083 6722 9856 21870
4359 21870 22382 15886 12562 2068 -1114 -11014 -15428 -10015 -9877 -15828 -11865 -18672 -15949 -12722 2308
4344 2308 4143 -1194 -5283 1634 -6468 -7522 -7107 -21407 -24686 -18175 -28283 -37914 -25911 -10563
$$ packed form
4446a9283J0197J6044q967k2323p925O588J0641k70L545L220m916N925J3611J509
4432G596p622r453q498k069O334K322K711Q87j511j5828J665K097L59n068p92
4417b6870P723o679J692N630L733L527l406l107R911L251N649l586l750M902K60
4402a120R23m743l022l60o054q903O903P787K0364N366p370p960K31j0276j3031
4387b1265J0291J4884k387j1787k0908j243Q29Q608P17J1193N087R83K920O203
4373D125m811q133m391N827M769J3214p741j7267O542o516K299J8805L134J2014
4359B1870N12o496l324j0494l182r900m414N413J38n951L963o807K723L227J5030
4344B308J835n337m089O917q102j054M15j4300l279O511j0108r631J2003J5348
$$ plain form
4330 -10563 -5773 -8897 -15135 -6410 -287 -11705 -7372 947 2917 16711 16838 3344 11599 17033
4316 17033 11230 5748 2885 -1916 -4472 -5289 -4149 -9396 -11692 -10036 -13439 7159 4516 970 -7859
4301 -7859 -9537 -9425 -10376 -13516 -8560 -16997 -20658 -16288 -16411 -22423 -14790 -2215 1236 -2489 -12037
4286 -12037 -15162 -9308 -10034 -17585 -20502 -14167 -7475 -7689 -7337 5743 -5667 6038 11190 16840 16592
4271 16592 16324 24887 16798 2906 -9318 -19448 -16356 -8731 -7626 -17915 -13442 -10475 -16939 -36901
4257 -36901 -36052 -27258 -28143 -22815 -13208 -1925 -3504 -11855 3153 10343 4282 -4073 -19 2535 -2461
4242 -2461 -13628 -25581 -17770 -9997 -9382 -5380 2578 -283 -9710 -5771 -14229 -22628 -15341 -13207 -8393
4227 -8393 -8908 -9927 -16659 -23298 -21799 -10423 -4768 -98 -11504 -9692 -4793 -2516 -529 -879 -830
$$ packed form
4330a0563M790l124o238Q725O123j1418M333Q319J970J3794J27j3494Q255N434
4316A7033n803n482k863m801k556q17J140n247k296J656l403K0598k643l546q829
4301g859j678J12r51l140M956q437l661M370j23o012P633J2575L451l725r548
4286a2037l125N854p26p551k917O335O692k14L52J3080j1410J1705N152N650k48
4271A6592k68Q563q089j3892j2224j0130L092P625J105j0289M473K967o464j9962
4257c6901Q49Q794q85N328R607J1283j579q351J5008P190o061q355M054K554m996
4242b461j1167j1953P811P773O15M002P958k861r427L939q458q399P287K134M814
4227h393n15j019o732o639J499J1376N655M670j1406J812M899K277J987l50M9
$$ plain form
4212 -830 -9562 -3030 6512 -12486 -31020 -37362 -23846 -19815 -9054 -6036 -8137 -11183 -16241 -15952
4198 -15952 -12362 -25797 -22051 -15446 444 5901 1831 -3976 -8703 2943 2312 -1881 13224 12138
4184 12138 -127 -11040 -14768 -23882 -27541 -24573 -21084 -10134 -10576 -11576 -2310 3291 4524 1895
4170 1895 -1423 -2375 86 -3978 -8040 -18934 -21799 -6221 -8307 4388 11146 9660 13452 2531
$$ packed form
4212h30q732O532R542j8998j8534o342J3516M031J0761L018k101l046n058K89
4198a5952L590j3435L746O605J5890N457m070n807m727J1646o31m193J5105j086
4184A2138j2265j0913l728r114l659K968L489J0950m42j000R266N601J233k629
4170A895l318r52K461m064m062j0894k865J5578k086J2695O758j486L792j0921
$$ [...]
##END NTUPLES=NMR SPECTRUM
##END=
