##TITLE=Analysis number 307150
Compound Code cc 35504
Book Reference 413/114
Chemist Name stevem
##JCAMPDX= 6.0         $$ Bruker NMR JCAMP-DX V2.0
##DATA TYPE= NMR SPECTRUM
##DATA CLASS= NTUPLES
##ORIGIN= Bruker BioSpin GmbH
##OWNER= NMR
$$ XWIN-NMR		Version 3.5
$$ Thu Apr 21 14:29:22 2005 GMT Daylight Time (UT+1h)  MAYBRIDGE\NMR@NMR_250MHZ
##.OBSERVE FREQUENCY= 250.131544655141
##.OBSERVE NUCLEUS= ^1H
##.ACQUISITION MODE= SIMULTANEOUS (DQD)
##.ACQUISITION SCHEME= undefined
##.AVERAGES= 16
##.DIGITISER RES= 18
##SPECTROMETER/DATA SYSTEM= dpx250
##.PULSE SEQUENCE= zg30
##.SOLVENT NAME= CDCl3
##.SHIFT REFERENCE= (INTERNAL, CDCl3, 0, 16.522)
##AUDIT TRAIL= $$ (NUMBER, WHEN, WHO, WHERE, WHAT)
$$ ##TITLE= Audit trail, XWIN-NMR		Version 3.5
$$ ##JCAMPDX= 5.01
$$ ##ORIGIN= Bruker BioSpin GmbH
$$ ##OWNER= NMR
$$ C:\u/data/dgb/nmr/ADRS/2030/pdata/1/auditp.txt
$$ ##AUDIT TRAIL=  $$ (NUMBER, WHEN, WHO, WHERE, WHAT)
(   1,<2005-04-21 14:29:02.91 +100>,<MAYBRIDGE\NMR>,<NMR_250MHZ>,
      <created by zg, POWCHK disabled, PULCHK disabled
       configuration hash MD5:
       62 19 C7 07 E1 42 D1 B7 37 6C 3D D0 77 39 F9 E6
       data hash MD5: 64K
       9A 9E 37 8B 4C 43 44 73 44 17 C2 5A F8 49 A3 BD>)
(   2,<2005-04-21 14:29:14.19 +100>,<MAYBRIDGE\NMR>,<NMR_250MHZ>,
      <Start of raw data processing
       ef LB = 0.3 FT_mod = 6 PKNL = 1 SI = 32K 
       data hash MD5: 32K
       ED 7B 1C F2 E1 20 57 A8 DE 46 AB A2 FD 0B 72 5F>)
(   3,<2005-04-21 14:29:16.07 +100>,<MAYBRIDGE\NMR>,<NMR_250MHZ>,
      <apk 
       data hash MD5: 32K
       8D 38 36 52 4A 1C 7F BE BB F5 47 59 A3 B0 77 ED>)
(   4,<2005-04-21 14:29:16.79 +100>,<MAYBRIDGE\NMR>,<NMR_250MHZ>,
      <abs ABSG = 5 
       data hash MD5: 32K
       23 AA 18 45 90 55 24 E8 17 83 F8 7E EE C4 13 9C>)
$$ ##END=
$$ 
$$ hash MD5
$$ A7 F8 EA 32 AE E5 71 CA 69 92 B9 9F D2 32 0C 9E
##$RELAX= 
##$RELAX= 
##$RELAX= 
##$RELAX= 
##$RELAX= 
##$RELAX= 
##$RELAX= 
$$ Bruker specific parameters
$$ --------------------------
##$DU= <C:\u>
##$EXPNO= 2030
##$NAME= <ADRS>
##$PROCNO= 1
##$TYPE= <nmr>
##$USER= <dgb>
##$AMP= (0..31)
100 100 100 100 100 100 100 100 100 100 100 100 100 100 100 100 100 100 
100 100 100 100 100 100 100 100 100 100 100 100 100 100 
##$AQSEQ= 0
##$AQ_mod= 3
##$AUNM= <au_zg>
##$AUTOPOS= <2 >
##$BF1= 250.13
##$BF2= 250.13
##$BF3= 250.13
##$BF4= 250.13
##$BF5= 500.13
##$BF6= 500.13
##$BF7= 500.13
##$BF8= 500.13
##$BYTORDA= 1
##$CFDGTYP= 0
##$CFRGTYP= 5
##$CHEMSTR= <none>
##$CNST= (0..31)
1 1 145 1 1 1 1 1 1 1 1 1 1 1 1 1 1 1 1 1 1 1 1 1 1 1 1 1 1 1 1 1 
##$CPDPRG= <>
##$CPDPRG1= <>
##$CPDPRG2= <>
##$CPDPRG3= <>
##$CPDPRG4= <mlev>
##$CPDPRG5= <mlev>
##$CPDPRG6= <mlev>
##$CPDPRG7= <mlev>
##$CPDPRG8= <mlev>
##$CPDPRGB= <>
##$CPDPRGT= <>
##$D= (0..31)
0 1 0 0 0 0 0 0 0 0.06 0 0 0 0 0 0 0.0002 0 0 0 0 0 0 0 0 0 0 0 0 0 0 
0 
##$DATE= 1114090142
##$DBL= (0..7)
120 120 120 120 120 120 120 120 
##$DBP= (0..7)
150 150 150 150 150 150 150 150 
##$DBP07= 0
##$DBPNAM0= <>
##$DBPNAM1= <>
##$DBPNAM2= <>
$$ [...]
##$SUBNAM7= <"">
##$SUBNAM8= <"">
##$SUBNAM9= <"">
##$SW= 20.6930455092707
##$SWIBOX= (0..15)
0 0 3 0 0 0 0 0 0 0 0 0 0 0 0 0 
##$SW_h= 5175.983436853
##$TD= 65536
##$TD0= 1
##$TE= 295.16
##$TE2= 300
##$TE3= 300
##$TEG= 300
##$TL= (0..7)
0 120 120 120 120 120 120 120 
##$TP= (0..7)
150 150 150 150 150 150 150 150 
##$TP07= 0
##$TPNAME0= <>
##$TPNAME1= <>
##$TPNAME2= <>
##$TPNAME3= <>
##$TPNAME4= <>
##$TPNAME5= <>
##$TPNAME6= <>
##$TPNAME7= <>
##$TPOAL= (0..7)
0.5 0.5 0.5 0.5 0.5 0.5 0.5 0.5 
##$TPOFFS= (0..7)
0 0 0 0 0 0 0 0 
##$TUNHIN= 0
##$TUNHOUT= 0
##$TUNXOUT= 0
##$USERA1= <user>
##$USERA2= <user>
##$USERA3= <user>
##$USERA4= <user>
##$USERA5= <user>
##$V9= 5
##$VALIST= <valist>
##$VCLIST= <CCCCCCCCCCCCCCC>
##$VD= 0
##$VDLIST= <DDDDDDDDDDDDDDD>
##$VPLIST= <PPPPPPPPPPPPPPP>
##$VTLIST= <TTTTTTTTTTTTTTT>
##$WBST= 1024
##$WBSW= 4
##$XGAIN= (0..3)
0 0 0 0 
##$XL= 0
##$YL= 0
##$YMAX_a= 482656
##$YMIN_a= -337442
##$ZGOPTNS= <>
##$ZL1= 120
##$ZL2= 120
##$ZL3= 120
##$ZL4= 120
##$ABSF1= 16.522
##$ABSF2= -4.171173
##$ABSG= 5
##$ABSL= 3
##$ALPHA= 0
##$AQORDER= 0
##$ASSFAC= 0
##$ASSFACI= 0
##$ASSFACX= 0
##$ASSWID= 0
##$AUNMP= <proc_1d>
##$AZFE= 0.1
##$AZFW= 0.1
##$BCFW= 0
##$BC_mod= 0
##$BYTORDP= 0
##$COROFFS= 0
##$CY= 12.5
##$DATMOD= 1
##$DC= 0
##$DFILT= <>
##$DTYPP= 0
##$F1P= 14.0000005364418
##$F2P= -0.99999901652339
##$FCOR= 0.5
##$FTSIZE= 32768
##$FT_mod= 6
##$GAMMA= 0
##$GB= 0
##$INTBC= 1
##$INTSCL= 1
##$ISEN= 128
##$LB= 0.3
##$LEV0= 0
##$LPBIN= 0
##$MAXI= 10000
##$MC2= 0
##$MEAN= 0
##$ME_mod= 0
##$MI= 0
##$NCOEF= 0
##$NC_proc= -5
##$NLEV= 6
##$NOISF1= 0
##$NOISF2= 0
##$NSP= 0
##$NTH_PI= 0
##$NZP= 0
##$OFFSET= 16.522
##$PC= 1
##$PHC0= -74.49729
##$PHC1= 8.421227
##$PH_mod= 1
##$PKNL= yes
##$PPARMOD= 0
##$PSCAL= 4
##$PSIGN= 0
##$REVERSE= no
##$SF= 250.13
##$SI= 32768
##$SIGF1= 0
##$SIGF2= 0
##$SINO= 400
##$SIOLD= 32768
##$SREGLST= <1H.CDCl3>
##$SSB= 0
##$STSI= 32768
##$STSR= 0
##$SW_p= 5175.98343685301
##$SYMM= 0
##$S_DEV= 0
##$TDeff= 65536
##$TDoff= 0
##$TI= <Analysis number 999999
Compound Code 99
Book Reference 9
Project Code 9>
##$TILT= no
##$TM1= 0
##$TM2= 0
##$TOPLEV= 0
##$USERP1= <user>
##$USERP2= <user>
##$USERP3= <user>
##$USERP4= <user>
##$USERP5= <user>
##$WDW= 1
##$XDIM= 32768
##$YMAX_p= 473926188
##$YMIN_p= -377796
$$ End of Bruker specific parameters
$$ ---------------------------------
##NTUPLES= NMR SPECTRUM
##VAR_NAME=  FREQUENCY,     SPECTRUM/REAL,   SPECTRUM/IMAG
##SYMBOL=    X,             R,               I
##VAR_TYPE=  INDEPENDENT,   DEPENDENT,       DEPENDENT
##VAR_FORM=  AFFN,          ASDF,            ASDF
##VAR_DIM=   32768,         32768,           32768
##UNITS=     HZ,            ARBITRARY UNITS, ARBITRARY UNITS
##FACTOR=    0.157963299565203, 1,           1
##FIRST=     4132.6476996994, 0,             0
##LAST=      -1043.33573715361, 0,           0
##MIN=       -1043.33573715361, -377796,     0
##MAX=       4132.6476996994, 473926188,     0
$$ Real data points
##PAGE= N=1
##DATA TABLE= (X++(R..R)), XYDATA
$$ [...]
$$ plain form
28552 -60160 -65084 -55368 -87507 -81928 -64053 -56988 -52003 -73956 -55505 -73662 -44431 -42135 16782
28539 16782 -3780 -15255 6400 -20293 -37498 -17506 -19540 -56816 -44155 9577 36956 74157
28527 74157 73533 42171 83340 76978 40996 35553 -98 -36464 -26043 -27688 -17650 28049 72972
28514 72972 75725 4740 -73667 -89337 -56212 -97023 -77261 -73292 -42342 -33670 29344 44679
28502 44679 13683 32552 42465 42923 4902 25945 21267 18834 18156 22935 -22900 -65458 -603
28489 -603 35390 1665 -11998 -16991 6593 -4220 36943 21656 -11497 4279 -19742 -28419
28477 -28419 14070 8116 48595 23888 336 14032 28651 63854 56019 -370 -20378 -42638
28465 -42638 -84252 -68760 -41620 -52929 -41118 -17666 -27 1166 -43308 -40673 -46143 -32338
$$ packed form
28552f0160m924R716l2139N579J7875P065M985k1953J8451j8157K9231K296N8917
28539A6782k0562j1475K1655k6693j7205J9992k034l7276J2661N3732K7379L7201
28527G4157o24l1362M1169o362l5982n443l5651l6366J0421j645J0038M5699M4923
28514G2972K753p0985p8407j5670L3125m0811J9762L969L0950Q672O3014J5335
28502D4679l0996J8869R913M58l8021K1043m678k433o78M779m5835m2558O4855
28489f03L5993l3725j3663m993K3584j0813M1163j5287l3153J5776k4021q677
28477b8419M2489n954M0479k4707k3552J3696J4619L5203p835n6389k0008k2260
28465d2638m1614J5492K7140j1309J1811K3452J7639J193m4474K635n470J3805
$$ plain form
28453 -32338 22931 42586 5907 -37601 -6383 33462 62058 52916 28885 33414 25961 -22045
28441 -22045 -31395 81030 122052 105310 102492 48067 -13206 76 72797 30526 3144 34458
28429 34458 36512 75118 117021 69540 9016 -23082 -20040 39343 -913 -15743 -22415 -39671
28417 -39671 -35581 -66003 -62017 -45176 -40475 -25717 -29620 35591 59178 18924 28865 73060 13671
28404 13671 1640 30199 40185 19857 12086 20714 -25288 -44167 -12399 20456 233 15005
28392 15005 24038 44476 105751 73819 -23760 -9913 47049 53972 59139 51343 66590 105132
28380 105132 88380 -14934 -33731 -11005 32636 21072 11510 27948 46104 38420 36961 24248
28368 24248 -36454 -38495 -14078 34107 67162 62658 7337 27365 45715 39336 34582 34192 579
$$ packed form
28453c2338N5269J9655l6679m3508L1218L9845K8596r142k4031M529p453m8006
28441b2045r350J12425M1022j6742k818n4425o1273J3282P2721m2271k7382L1314
28429C4458K054L8606M1903m7481o0524l2098L042N9383m0256j4830o672j7256
28417c9671M090l0422L986J6841M701J4758l903O5211K3587m0254R941M4195n9389
28404A3671j2031K8559R986k0328p771Q628m6002j8879L1768L2855k0223J4772
28392A5005R033K0438O1275l1932r7579J3847N6962O923N167p796J5247L8542
28380A05132j6752j03314j8797K2726M3641j1564r562J6438J8156p684j459j2713
28368B4248o0702k041K4417M8185L3055m504n5321K0028J8350o379m754l90l3613
$$ plain form
28355 579 -59231 -47460 -14293 -21814 -14295 -27803 -73647 -58816 -1459 45475 26284 -17036
28343 -17036 -39765 6623 -12760 -36057 -27666 -39717 8243 34124 51566 63393 25860 9333
28331 9333 4192 34510 6202 -64007 -51741 -2356 -10847 1335 23471 15763 6053 -48836 -36564
28318 -36564 27141 26786 60919 70518 59912 52442 27154 19301 40581 89614 107969 25139 -16752
28305 -16752 -28609 -15381 27631 -474 -21448 -63604 -69394 -16022 13554 54823 79793 31559
28293 31559 25243 78622 60932 3712 27658 24771 39423 -14089 -52897 -49142 -3103 24736
28281 24736 -1524 22747 32381 -24816 -48853 -48956 -73815 -55583 -53393 -78506 -62147 -4469
28269 -4469 9288 -1424 27500 37721 67863 100590 80599 50851 24410 55252 40175 68595
$$ packed form
28355E79n9810J1771L3167p521P519j3508m5844J4831N7357M6934j9191m3320
28343a7036k2729M6388j9383k3297Q391j2051M7960K5881J7442J1827l7533j6527
28331I333n141L0318k8308p0209J2266M9385q491J2182K2136p708r710n4889J2272
28318c6564O3705l55L4133R599j0606p470k5288p853K1280M9033J8355q2830m1891
28305a6752j1857J3228M3012k8105k0974m2156n790N3372K9576M1269K4970m8234
28293C1559o316N3379j7690n7220K3946k887J4652n3512l8808L755M6039K7839
28281B4736k6260K4271R634n7197k4037j03k4859J8232K190k5113J6359N7678
28269d469J3757j0712K8924J0221L0142L2727j9991k9748k6441L0842j5077K8420
$$ plain form
28257 68595 89053 95271 90764 101265 167167 133705 116222 99125 51054 37407 44055 48484
28245 48484 9743 17533 72921 91111 38045 17434 33374 56035 67144 70363 68769 55277
28233 55277 61276 110553 91720 69583 68968 71978 105723 62555 -7576 -21520 -3187 -53584
28221 -53584 -94210 -109293 -66788 -8031 5754 -12203 71343 106818 86521 93557 74673 62730
28209 62730 59977 30518 -4873 -56977 -49911 -22392 -26917 1519 36212 61100 85190 29556
28197 29556 -86772 -97389 -82827 -84571 -93272 -68139 -39751 16033 58697 62283 9668 9913
28185 9913 36662 -14445 -51069 -78103 -58511 -39973 -1678 24920 73943 45092 17215 -9472
28173 -9472 -46583 -58643 -85706 -111320 -76552 -20531 -28538 -50317 -53461 -80041 -49157 -23354
$$ packed form
28257F8595K0458O218m507J0501O5902l3462j7483j7097m8071j3647O648M429
28245D8484l8741P790N5388J8190n3066k0611J5940K2661J1109L219j594j3492
28233E5277N999M9277j8833k2137o15L010L3745m3168p0131j3944J8333n0397
28221e3584m0626j5083M2505N8757J3785j7957Q3546L5475k0297P036j8884j1943
28209F2730k753k9459l5391n2104P066K7519m525K8436L4693K4888K4090n5634
28197B9556j16328j0617J4562j744q701K5133K8388N5784M2664L586n2615K45
28185I913K6749n1107l6624k7034J9592J8538L8295K6598M9023k8851k7877k6687
28173i472l7111j2060k7063k5614L4768N6021q007k1779l144k6580L0884K5803
$$ plain form
28161 -23354 -41368 -33439 -9207 -27027 -9579 4726 11777 -74086 -66497 6451 19927 247
28149 247 43459 30977 25792 22070 15323 -22011 -72442 -32555 -52055 -51842 -37285 -68847 -31120
28136 -31120 44543 97155 16953 -13295 21066 15727 -35474 -75582 -138289 -138247 -158659 -122020
28124 -122020 -85216 -107268 -75854 -22213 -93839 -164823 -139174 -90304 -25527 -17320 -28742 -8453
28112 -8453 31705 58440 31763 21739 23497 32705 -19248 -45547 -41118 -75990 -30228 32754
28100 32754 84966 27994 -91106 -118390 -40095 16499 15550 -32498 -45739 -72806 15934 62587
28088 62587 51553 24659 69720 109104 66640 81279 81220 26179 -17869 -50075 -50352 -12422 -26622
28075 -26622 -10840 -16052 2128 -4163 20309 84681 117214 100757 139367 130246 47518 46388
$$ packed form
28161b3354j8014P929K4232j7820J7448J4305P051q5863P589P2948J3476j9680
28149B47M3212j2482n185l722o747l7334n0431L9887j9500K13J4557l1562L7727
28136c1120P5663N2612q0202l0248L4361n339n1201m0108o2707M2k0412L6639
28124a22020L6804k2052L1414N3641p1626p0984K5649M8870O4777Q207j1422K0289
28112h453M0158K6735k6677j0024J758R208n1953k6299M429l4872M5762O2982
28100C2754N2212n6972j19100k7284P8295N6594r49m8048j3241k7067Q8740M6653
28088F2587j1034k6894M5061L9384m2464J4639n9n5041m4048l2206k77L7930j4200
28075b6622J5782n212J8180o291K4472O4372L2533j6457L8610r121q2728j130
$$ plain form
28063 46388 71961 14636 -22785 30917 36532 55768 53007 62930 73220 48321 790 -12097
28051 -12097 -13444 13775 9667 723 69027 142756 119778 64572 30049 47578 73587 31507
28039 31507 5628 -6581 33282 15975 -4749 720 -10609 -14844 -43027 -18330 -8600 39453
28027 39453 54619 57842 65825 42847 28674 6311 -41 -4634 28204 91724 77489 80887 49671
28014 49671 35605 62742 97507 88130 57460 33496 21515 17433 -14508 -33581 -44410 -32866
28002 -32866 -26949 62664 130227 124625 54654 -16091 -1879 -1188 -479 1396 34781 15841 11183
27989 11183 41605 23016 31864 5340 -48072 -49144 -30346 -31130 -9320 12497 28368 23876 38326
27976 38326 44409 2783 -23039 -7061 55312 76336 48773 16136 6298 -31710 -45698 -3485
$$ packed form
28063D6388K5573n7325l7421N3702N615J9236k761R923J0290k4899m7531j2887
28051a2097j347K7219m108q944O8304P3729k2978n5206l4523J7529K6009m2080
28039C1507k5879j2209L9863j7307k0724N469j1329m235k8183K4697R730M8053
28027C9453J5166L223P983k2978j4173k2363o352m593L2838O3520j4235L398l1216
28014D9671j4066K7137L4765r377l0670k3964j1981m082l1941j9073j0829J1544
28002c2866N917Q9613O7563n602o9971p0745J4212O91P09J875L3385j8940m658
27989A1183L0422j8589Q848k6524n3412j072J8798p84K1810K1817J5871m492J4450
27976C8326O083m1626k5822J5978O2373K1024k7563l2637r838l8008j3988M2213
$$ plain form
27964 -3485 -14442 10362 64002 41935 -17269 -21649 13816 -30559 -90564 -109438 -70429 -10426
27952 -10426 29534 31569 44414 36605 51128 69780 46062 -50592 -85686 -30392 41319 55394
27940 55394 52880 35268 44888 56601 24943 43045 68815 59438 -14644 -27457 -18240 -19136 -50009
27927 -50009 -68499 14985 47252 61174 81087 124664 90348 -9919 -78708 -64560 8064
27916 8064 83829 74921 82516 35552 44215 58838 60236 19865 22810 45056 37228 47827 8674
27903 8674 -18844 27719 27683 -1080 19010 61149 77019 96277 62285 32436 -6096 -26786
27891 -26786 -4662 38208 67087 24993 -13834 15103 -35982 -43670 -74136 -64409 -26579 14536
27879 14536 40684 -1559 -13565 25721 88258 110499 43914 23586 8158 16207 67276 36548
$$ packed form
27964c485j0957K4804N3640k2067n9204m380L5465m4375o0005j8874L9009O0003
27952a0426L9960K035J2845p809J4523J8652k3718r6654l5094N5294P1711J4075
27940E5394k514j7612R620J1713l1658J8102K5770r377p4082j2813R217q96l0873
27927e0009j8490Q3484L2267J3922J9913M3577l4316j00267o8789J4148P2624
27916H064P5765q908P595m6964Q663J4623J398m0371K945K2246p828J0599l9153
27903H674k7518M6563l6k8763K0090M2139J5870J9258l3992k9849l8532k0690
27891b6786K2124M2870K8879m2094l8827K8937n1085p688l0466R727L7830M1115
27879A4536K6148m2243j2006L9286O2537K2241o6585k0328j5428Q049N1069l0728
$$ plain form
27867 36548 31523 56251 62326 77785 71032 49121 18564 27070 -20455 -12845 17211 -35347 -29280
27854 -29280 -56588 -54061 -50282 -24939 30271 60167 59087 16153 18988 -6556 -21191 -56580
27842 -56580 -20101 -5637 -33125 -51942 -92560 -48024 -917 -3594 -22802 -42729 -14813 7941
27830 7941 17028 42196 65707 78204 33293 56007 107943 101757 53764 42720 57611 56106
27818 56106 87132 78685 540 -36078 -17207 52333 63414 30191 39321 -47790 -75225 -70752
27806 -70752 -76050 -66986 -42949 -41580 19155 54040 30652 52134 41930 -39044 -87281 -20277
27794 -20277 30906 69032 50468 11068 -12485 64166 45093 -12239 -32303 -42352 -34403 16589
27782 16589 83714 61519 -36075 -37061 17319 -6053 -29337 -70440 -64318 -69402 -46942 -33387
$$ packed form
27867C6548n025K4728O075J5459o753k1911l0557Q506m7525P610L0056n2558O067
27854b9280k7308K527L779K5343N5210K9896j080m2934K835k5544j4635l5389
27842e6580L6479J4464k7488j8817m0618M4536M7107k677j9208j9927K7916K2754
27830G941R087K5168K3511J2497m4911K2714N1936o186m7993j1044J4891j505
27818E6106L1026q447p8145l6618J8871O9540J1081l3223R130q7111k7435M473
27806g0752n298R064K4037J369O0735L4885k3388K1482j0204q0974m8237O7004
27794b0277N1183L8126j8564l9400k3553P6651j9073n7332k0064j0049P949N0992
27782A6589O7125k2195r7594r86N4380k3372k3284m1103O122n084K2460J3555
$$ plain form
27770 -33387 -37806 34315 102761 37582 -8555 -14163 -4764 17859 22020 6143 -25144 -73973
27758 -73973 -12189 67448 72102 54860 5288 -30175 -66035 -50220 11965 23690 59338 61525
27746 61525 41387 4862 27041 100118 83363 41798 27604 67146 79757 29745 -18251 -25612
27734 -25612 -18884 17938 50899 30689 -343 8279 22498 36508 16476 -18928 4435 -38934
27722 -38934 -37656 -2412 -21620 -49354 -9005 21778 10748 -36164 -21929 -29124 -23501 -52869
27710 -52869 -3814 56576 25518 -45790 -101278 -130708 -106813 -66292 -84141 -112413 -99560 -56377
27698 -56377 -24498 -20553 -53524 -90916 -60883 -97202 -94047 -68412 -35420 -24990 -32662 -72562
27686 -72562 -53493 -7120 -5196 20618 43006 77195 85901 33432 2052 30233 27352 -2335
$$ packed form
27770c3387m419P2121O8446o5179m6137n608R399K2623M161j5877l1287m8829
27758g3973O1784P9637M654j7242m9572l5463l5860J5815O2185J1725L5648K187
27746F1525k0138l6525K2179P3077j6755m1565j4194L9542J2611n0012m7996p361
27734b5612O728L6822L2961k0210l1032Q622J4219J4010k0032l5404K3363m3369
27722c8934J278L5244j9208k7734M0349L0783j1030m6912J4235p195N623k9368
27710e2869M9055O0390l1058p1308n5488k9430K3895M0521j7849k8272J2853M3183
27698e6377L1879L945l2971l7392L0033l6319L155K5635L2992J0430p672l9900
27686g2562J9069M6373J924K5814K2388L4189Q706n2469l1380K8181k881k9687
$$ plain form
27674 -2335 11212 47271 62081 41737 44352 69036 60821 39812 62172 43706 36194 25603
27662 25603 93951 160803 178666 138578 96937 65173 70432 110176 86664 38177 -7171 19077
27650 19077 11348 -37 13932 2875 -14179 -25904 -15811 -99792 -138307 -77063 6033 -10561
27638 -10561 -63730 -41426 -29531 8145 23864 16483 17336 -32988 -48922 -113469 -115948 -49153
27626 -49153 -57618 -70556 -20212 55732 87101 108663 70236 -17992 -15216 28881 4033 26283
27614 26283 9225 -13941 -59709 -121562 -108648 -50325 -35759 -21111 -19070 9885 -10762 -51881
27602 -51881 -37022 -85469 -98576 -78773 -40422 3399 42694 43136 18112 15227 31192 34788
27590 34788 37908 -22190 -38284 -73493 -32354 20538 4812 -53833 -44492 -14745 21194 24922
$$ packed form
27674b335J3547L6059J4810k0344K615K4684q215k1009K2360j8466p512j0591
27662B5603O8348O6852J7863m0088m1641l1764N259L9744k3512m8487m5348K6248
27650A9077p729j1385J3969j1057j7054j1725J0093q3981l8515O1244Q3096j6594
27638a0561n3169K2304J1895L7676J5719p381Q53n0324j5934o4547k479O6795
27626d9153q465j2938N0344P5944L1369K1562l8427q8228K776M4097k4848K2250
27614B6283j7058k3166m5768o1853J2914N8323J4566J4648K041K8955k0647m1119
27602e1881J4859m8447j3107J9803L8351M3821L9295M42k5024k885J5965L596
27590C4788L120o0098j6094l5209M1139N2892j5726n8645R341K9747L5939L728
$$ plain form
27578 24922 46422 74633 80824 84652 83071 72378 81347 57997 14670 -37195 -70772 -103165
27566 -103165 -80195 -67581 -2674 35899 37403 21356 22354 37552 51618 89065 73782 60455
27554 60455 108360 92013 100697 85434 36637 17289 47122 58841 119490 84785 69720 51222
27542 51222 86354 124021 81722 33132 46155 68016 18933 -21687 -22335 -17952 -10619 -7370 -6794
27529 -6794 -9403 -24745 -58136 -30703 24435 -34693 -42261 -10045 -3391 -29785 -36199 28690 25737
27516 25737 37149 51438 102503 116843 52327 58861 52640 -5416 -14706 -12236 -68830 -74595 -57016
27503 -57016 29035 85299 45044 75333 44352 -32991 -53210 -10981 -48403 -64059 -43451 -66105
27491 -66105 -60451 -24990 4246 2825 804 -11990 13674 7660 -4659 -48965 -25138 8359
$$ packed form
27578B4922K1500K8211O191L828j581j0693Q969k3350m3327n1865l3577l2393
27566a03165K2970J2614O4907L8573J504j6047R98J5198J4066L7447j5283j3327
27554F0455M7905j6347Q684j5263m8797j9348K9833J1719O0649l4705j5065j8498
27542E1222L5132L7667m2299m8590J3023K1861m9083m0620o48M383P333L249N76
27529f794k609j5342l3391K7433N5138n9128p568L2216O654k6394o414O4889k953
27516B5737J1412J4289N1065J4340o4516O534o221n8056r290K470n6594n765J7579
27503e7016Q6051N6264m0255L0289l0981p7343k0219M2229l7422j5656K0608k2654
27491f6105N654L5461K9236j421k021j2794K5664o014j2319m4306K3827L3497
$$ plain form
27479 8359 -42421 -74691 -16548 -35736 -3099 -7348 -36344 -55335 -9466 -50404 -71856 -74208
27467 -74208 -62054 9240 33646 99802 74854 27449 -17064 -29525 -84581 -43115 -8689 19127
27455 19127 66885 60166 47732 22476 -528 15970 -18063 -68490 -51065 -9367 52550 65149
27443 65149 49147 50323 53982 8385 -11299 51981 83841 73644 77388 72677 9263 -32057
27431 -32057 -14252 -19238 -20209 -45945 -27593 -17104 -37525 -4751 -21502 7719 50838 60591
27419 60591 29290 16326 -24376 -15539 14619 24281 58040 69497 18806 -18291 1110 -12176
27407 -12176 23882 24089 -64842 -40568 49343 80014 76622 26032 32777 53055 72981 30850
27395 30850 -29982 -12739 17943 54142 58595 27517 -796 -58160 -53725 5609 -44333 -69229
$$ packed form
27479H359n0780l2270N8143j9188L2637m249k8996j8991M5869m0938k1452k352
27467g4208J2154P1294K4406O6156k4948m7405m4513j2461n5056M1466L4426K7816
27455A9127M7758o719j2434k5256k3004J6498l4033n0427J7425M1698O1917J2599
27443F5149j6002J176L659m5597j9684O3280L1860j0197L744m711o3414m1320
27431c2057J7805m986r71k5736J8352J0489k0421L2774j6751K9221M3119R753
27419F0591l1301j2964m0702Q837L0158R662L3759J1457n0691l7097J9401j3286
27407a2176L6058K07q8931K4274Q9911L0671l392n0590O745K0278J9926m2131
27395C0850o0832J7243L0682L6199M453l1078k8313n7364M435N9334m9942k4896
$$ plain form
27383 -69229 -33328 -18315 -44396 -50466 -52352 -58881 -41079 6076 -4068 -28407 -49749 -56499
27371 -56499 -109029 -86341 -61173 -44105 13265 66000 70286 90850 89916 89455 47120 74867 49705
27358 49705 -2283 23504 108435 126122 71129 50566 26825 -17607 -68655 -26336 -8836 -7648
27346 -7648 -64256 -55204 23186 55138 39203 23472 55012 53535 8031 4291 -4124 11103 10918
27333 10918 -20149 -23732 -56576 -18949 24973 5648 -13169 -5626 -10702 14991 38479 51059
27321 51059 68269 70282 34196 16474 -16536 -29998 28549 40214 20239 12034 -8806 18804
27309 18804 7490 -9843 -20529 1273 37637 -5491 18797 45121 61854 39207 12933 58691
27297 58691 61888 1936 -13831 10035 35216 48440 16645 11963 40480 67286 82481 44084
$$ packed form
27383f9229L5901J5013k6081o070j886o529J7802M7155j0144k4339k1342o750
27371e6499n2530K2688K5168J7068N7370N2735M286K0564r34m61m2335K7747k5162
27358D9705n1988K5787Q4931J7687n4993k0563k3741m4432n1048M2319J7500J188
27346g648n6608R052P8390L1952j5935j5731L1540j477m5504l740q415J5227j85
27333A0918l1067l583l2844L7627M3922j9325j8817P543n076K5693K3488J2580
27321E1059J7210K013l6086j7722l3010j3462N8547J1665j9975q205k0840K7610
27309A8804j1314j7333j0686K1802L6364m3128K4288K6324J6733k2647k6274M5758
27297E8691L197n9952j5767K3866K5181J3224l1795m682K8517K6806J5195l8397
$$ plain form
27285 44084 42830 50408 42286 50328 74615 67698 -3846 -38113 -78409 -121116 -111906 -99838 8932
27272 8932 72989 35213 -32998 -52535 -28783 -5623 9194 -32049 -36777 -1055 2412 -11660
27260 -11660 -43595 -39897 -37604 -29171 -39522 -7747 -41830 -5956 2889 19832 -42402 -69886
27248 -69886 -27577 -11851 -51152 -49523 -40309 -68553 -69969 -30376 -50859 -100937 -45272 -32803
27236 -32803 -69065 -96419 -102762 -59746 -44908 -3409 32972 20772 47950 121708 54004 -40222
27224 -40222 -75288 -10182 43334 29760 17317 -13867 -5211 33597 48176 34160 -1174 -46529
27212 -46529 -47938 -54073 -23775 -41078 -74431 -107267 -52818 9818 21772 43044 88555 85742
27200 85742 65244 46489 25947 63875 52571 55086 -5033 27403 81281 77656 -1262 -97471
$$ packed form
27285D4084j254P578q122Q042K4287o917p1544l4267m0296m2707R210J2068J08770
27272H932O4057l7776o8211j9537K3752K3160J4817m1243m728L5722L467j4072
27260a1660l1935L698K293Q433j0351L1775l4083L5874Q845J6943o2234k7484
27248f9886M2309J5726l9301J629R214k8244j416L9593k0483n0078N5665J2469
27236c2803l6262k7354o343M3016J4838M1499L6381j2200K7178P3758o7704r4226
27224d0222l5066O5106N3516j3574j2443l1184Q656L8808J4579j4016l5334m5355
27212d6529j409o135L0298j7303l3353l2836N4449O2636J1954K1272M5511k813
27200H5742k0498j8755k0542L7928j1304K515o0119L2436N3878l625p8918r6209
$$ plain form
27188 -97471 -117330 -93290 -57516 -53167 -24240 20054 9503 22500 62289 103582 100712 48147
27176 48147 -4274 8961 41302 76586 31711 22118 23307 8803 6560 -37770 -37774 -43226 -69901
27163 -69901 -112318 -81726 -7234 20899 20128 -32370 -51187 -10544 5391 -7632 -4322 -8304
27151 -8304 -11313 -7373 -29713 -23525 28766 763 -47180 -54615 -36444 34647 39663 79715 82452
27138 82452 -11842 -60603 -22231 -16938 -3726 25400 36896 45319 89339 140574 99722 68407
27126 68407 45961 53304 103012 102929 55860 -6321 -24388 -15978 -12313 -16174 24041 68883 36954
27113 36954 7998 -30628 -28722 -40231 -38987 8691 -1337 5236 17161 32738 41748 -7448
27101 -7448 -2510 44679 33109 51255 78935 113645 87176 69861 45006 29847 11763 52271
$$ packed form
27188i7471j9859K4040L5774M349K8927M4294j0551J2997L9789M1293k870n2565
27176D8147n2421J3235L2341L5284m4875r593J189j4504k243m4330mn452k6675
27163f9901m2417L0592P4492K8133p71n2498j8817M0643J5935j3023L310l982
27151h304l009L940k2340O188N2291k8003m7943p435J8171P1091N016M0052K737
27138H2452r4294m8761L8372N293J3212K9126J1496Q423M4020N1235m0852l1315
27126F8407k2446P343M9708q3m7069o2181j8067Q410L665l861M0215M4842l1929
27113C6954k8956l8626J906j1509J244M7678j0028O573J1925J5577R010m9196
27101g448M938M7189j1570J8146K7680L4710k6469j7315k4855j5159j8084M0508
$$ plain form
27089 52271 94053 67418 37057 -37 -766 -47081 -40443 17522 13565 -10754 -4081 -29598 -1854
27076 -1854 14002 -13453 -1723 48227 12341 -1667 -42117 -52847 -27517 -50699 -4963 62724
27064 62724 51629 69577 29436 19552 -14071 -1776 45788 33906 14017 -9431 -29603 92
27052 92 -63174 -130078 -123427 -87989 -56328 -74437 -96986 -38666 4708 10261 -17340 -26743 -24834
27039 -24834 -5492 6118 39619 95023 131580 113430 84643 28111 -11822 893 67248 83713
27027 83713 71528 169271 226250 186144 126561 66414 59489 -5265 -53287 -80286 -112973 -44699
27015 -44699 11239 -12036 8394 23241 28214 60318 11973 -40539 -44653 -56219 -40349 -12253
27003 -12253 -18734 7238 54047 38046 35223 19298 57191 84744 73071 69023 83603 100721
$$ packed form
27089E2271M1782k6635l0361l7094p29m6315O638N7965l957k4319O673k5517K7744
27076a854J5856k7455J1730M9950l5886j4008m0450j0730K5330k3182M5736O7687
27064F2724j1095J7948m0141r884l3623J2295M7564j1882j9889k3448k0172K9695
27052I2o3266o6904O651L5438L1661j8109k2549N8320M3374N553k7601r403J909
27039b4834J9342J1610L3501N5404L6557j8150k8787n6532l9933J2715O6355J6465
27027H3713j2185R7743N6979m0106n9583o0147o925o4754m8022k6999l2687O8274
27015d4699N5938k3275K0430J4847M973L2104m8345n2512m114j1566J5870K8096
27003a2253o481K5972M6809j6001k823j5925L7893K7553j1673m048J4580J7118
$$ plain form
26991 100721 79674 74589 92534 81881 2547 4654 14602 20382 3947 11258 81638 77534 74772
26978 74772 37509 77439 95293 100237 88464 73221 29459 -10100 40198 17458 -22042 -36802
26966 -36802 -33930 -11098 -14021 -33014 4073 69136 75832 35101 -12543 -12365 -16692 -16707 19696
26953 19696 39388 71398 53938 37075 46320 53405 21044 -32417 -4094 -27562 -25013 -14360
26941 -14360 -17656 -646 10606 -11859 3362 -614 -18392 18788 12880 -3144 -31265 -23675
26929 -23675 -52011 -36265 -26812 -23495 3987 -16524 -79291 -75178 -15423 -19339 292 41057
26917 41057 5225 -41518 -1997 -24475 -13873 -7847 22126 595 334 -18337 9559 32820
26905 32820 10679 13200 27164 55696 98921 102870 70370 21173 -6130 2796 1937 -15119 -6819
$$ packed form
26991A00721k1047n085J7945j0653p9334K107R948N780j6435P311P0380m104k762
26978G4772l7263L9930J7854M944j1773j5243m3762l9559N0298k2740l9500j4760
26966c6802K872K2832k923j8993L7087O5063O696m0731m7644J78m327j5L6403
26953A9696J9692L2010j7460j6863R245P085l2361n3461K8323k3468K549J0653
26941a4360l296J7010J1252k2465J5221l976j7778L7180n908j6024k8121P590
26929b3675k8336J5746R453L317K7482k0511o2767M113N9755l916J9631M0765
26917D1057l5832m6743L9521k2478J0602O026K9973k1531k61j8671K7896K3261
26905C2820k2141K521J3964K8532M3225L949l2500m9197k7303Q926q59j7056Q300
$$ plain form
26892 -6819 -9709 -39909 -40155 -56596 -36432 -58259 -54457 -109851 -129707 -113037 -48016 -27081 -27410
26879 -27410 26055 59981 72262 34934 26126 -853 -8960 34538 15167 16482 19614 17175 -16288
26866 -16288 -25077 -44427 -33998 -36178 4208 57134 31771 -2497 34733 37700 21158 8209
26854 8209 5355 -26328 -23708 -2478 13439 -49538 -40901 3132 33780 40121 28116 -65226 -120791
26841 -120791 -122227 -94128 -94287 -46310 16986 5177 -52260 -107590 -120172 -105052 -94819 -62919
26829 -62919 -23447 20292 27960 46064 44155 45116 80561 43772 -27766 -49515 -106458 -68767
26817 -68767 -23104 -27492 -14690 -3789 -6993 19679 18940 -7279 -2837 72284 98434 56724 -6791
26804 -6791 -39572 -45713 -24857 22307 58047 6222 -21364 -20935 327 -11778 44505 62532
$$ packed form
26892f819k890l0200k46j6441K0164k1827L802n5394j9856J6670O5021K0935l29
26879b7410N3465L3926J2281l7328q808k6979q107M3498j9371J315L132k439l3463
26866a6288q789j9350J0429k180M0386N2926k5363l4268L7230K967j6542j2949
26854H209k854l1683K620K1230J5917o2977Q637M4033L0648O341j2005r3342n5565
26841a20791j436K8099j59M7977O3296j1809n7437n5330j2582J5120J0233L1900
26829f2919L9472M3739P668J8104j909R61L5445l6789p1538k1749n6943L7691
26817f8767M5663m388J2802J0901l204K6672p39k6219M442P5121K6150m1710o3515
26804f791l2781o141K0856M7164L5740n1825k7586M29K1262j2105N6283J8027
$$ plain form
26792 62532 56174 28223 -32741 -42729 21794 12744 13831 -3794 -34948 -82732 -32317 -79973
26780 -79973 -60493 1779 13529 89374 42991 35370 48017 15902 -27252 3530 72529 77790
26768 77790 51870 17307 -1715 6472 -58527 -73471 25562 19598 17745 -613 -9949 -31742
26756 -31742 -92321 -96281 849 34170 62815 44379 8827 43834 56894 71993 52451 681
26744 681 -89074 -96175 -68958 -9788 71116 77943 39144 33990 31903 -2591 12585 79758 98695
26731 98695 61482 3738 -23036 10396 91364 112420 113026 116198 74509 29732 -23042 -38945
26719 -38945 -36239 -52576 -49470 -72868 -94810 -31717 26302 540 -21832 -29115 -66196 -105316
26707 -105316 -65612 10898 -2721 -49616 -94644 -81243 -82074 -56409 -44203 17148 2645 -34988
$$ packed form
26792F2532o358k7951o0964r988O4523r050J087j7625l1154m7784N0415m7656
26780g9973J9480O2272J1750P5845m6383p621J2647l2115m3154L0782O8999N261
26768G7790k5920l4563j9022Q187o4999j4944R9033n964j853j8358r336k1793
26756c1742o0579l960R7130L3321K8645j8436l5552L5007J3060J5099j9542n1770
26744F81q9755p101K7217N9170Q0904O827l8799n154k087l4494J5176O7173J8937
26731I8695l7213n7744k6774L3432Q0968K1056O06L172m1689m4777n2774j5903
26719c8945K706j6337L106k3398k1942O3093N8019k5762k2372p283l7081l9120
26707a05316L9704P6510j3619m6895m5028J3401q31K5665J2206O1351j4503l7633
$$ plain form
26695 -34988 -48848 -7563 17722 -5721 -19780 -29056 -16030 -28880 -68625 -60993 11826 14925
26683 14925 24900 18840 14272 -18337 -14216 -47352 -103742 -76950 -74447 -84032 -45738 20604 26055
26670 26055 -37073 -75611 -98782 -29185 -4430 -21561 16092 15678 77460 112228 19781 -4886
26658 -4886 -2441 17540 30654 16558 -26570 -30379 -39583 -30249 -67075 -41281 -3296 22481 10323
26645 10323 35461 88373 91290 70651 69921 76503 25025 -42404 -28476 10861 29991 23766 16366
26632 16366 50633 51782 13512 -56681 -105735 -116777 -136994 -58473 -26051 -15520 -71691 -15603
26620 -15603 86599 120514 130647 64732 -7760 -52173 -48293 -52254 -34824 -43046 -43078 -34848 23211
26607 23211 77542 43590 -19928 -37272 -32981 -48725 3908 5298 -10123 -58537 -104452 -75275
$$ packed form
26695c4988j3860M1285K5285k3443j4059r276J3026j2850l9745P632P2819L099
26683A4925R975o060m568l2609M121l3136n6390K6792K503r585L8294O6342N451
26670B6055o3128l8538k3171O9597K4755j7131L7653m14O1782L4768r2447k4667
26658d886K445J9981J3114j4096m3128l809r204R334l6826K5794L7985K5777j2158
26645A0323K5138N2912K917k0639p30O582n1478o7429J3928L9337J9130o225p400
26632A6366L4267J149l8270p0193m9054j1042k0217P8521L2422J0531n6171N6088
26620a5603J02202L3915J0133o5915p2492m4413L880l961J7430q222l2Q230N8059
26607B3211N4331l3952o3518j7344M291j5744N2633J390j5421m8414m5915K9177
$$ plain form
26595 -75275 -49417 34385 47245 63748 42783 22695 28907 70639 34097 37853 81635 85159
26583 85159 65165 9888 -65393 -60228 -36078 -22476 29482 10591 27068 619 -75273 -46708
26571 -46708 -6207 4760 9517 -18065 -30897 -16337 17992 45615 7037 -8107 42058 10895
26559 10895 -5433 35423 9764 -30729 -27328 12095 14109 -18718 -2497 -10550 -21390 -30356
26547 -30356 -66865 -17769 43733 45993 47672 50994 46683 9176 -34195 -88129 -61170 -52398 -56790
26534 -56790 -75555 -66271 -25890 -35091 -22176 -51317 -25227 -7319 -26685 -66374 -33067 15850
26522 15850 48467 1656 -44228 -58463 -26020 12442 -10066 -12040 3094 -42738 -36703 4671
26510 4671 7557 -6192 -3458 -4487 13545 8105 -19066 18757 29229 34823 26091 39902 -2968
$$ packed form
26595g5275K5858Q3802J2860J6503k0965k0088O212M1732l6542L756M3782L524
26583H5159j9994n5277p5281N165K4150J3602N1958j8891J6477k6449p5892K8565
26571d6708M0501J0967M757k7582j2832J4560L4329K7623l8578j5144N0165l1163
26559A0895j6328M0856k5659m0493L401L9423K014l2827J6221q053j0840q966
26547c0356l6509M9096O1502K260J679L322m311l7507m3371n3934K6959Q772m392
26534e6790j8765R284M0381r201J2915k9141K6090J7908j9366l9689L3307M8917
26522A5850L2617m6811m5884j4235L2443L8462k2508j974J5134m5832O035M1374
26510D671K886j3749K734j029J8032n440k7171L7823J0472N594q732J3811m2870
$$ plain form
26497 -2968 3257 54940 79392 87967 95347 48277 -40913 -61655 -71809 -18497 -23 3344 -7049
26484 -7049 14298 10521 34235 33502 -26515 -27562 -50389 -36140 -48837 -14288 -39788 -15133 -14514
26471 -14514 -40692 -47874 -31111 -34537 -93052 -124518 -150303 -109484 -17302 33455 -32203 -55574
26459 -55574 -15042 10422 29679 48110 20046 -993 -9437 -41607 -78180 -85418 -83893 -67146
26447 -67146 -51717 -42973 -20521 16616 11846 20647 12036 -23598 -60617 -95943 -86183 -42328 15935
26434 15935 -9308 -9491 -61653 -82090 -79586 -93920 -93943 -54413 -49400 -68203 -135123 -135411 -103677
26421 -103677 -35050 23135 40829 13302 -23981 -65830 -51768 -36834 -32803 -10883 -27402 -30738
26409 -30738 -53785 -44780 -56176 -107031 -67948 8336 37870 71435 92249 103035 113276 41317
$$ packed form
26497b968O225N1683K4452Q575P380m7070q9190k0742j0154N3312J8474L367j0393
26484g049K1347l777K3714p33o0017j047k2827J4249j2697L4549k5500K4655O19
26471a4514k6178p182J6763l426n8515l1466k5785M0819R2182N0757o5658k3371
26459e5574M0532K5464J9257J8431k8064k1039q444l2170l6573p238J525J6747
26447f7146J5429Q744K2452L7137m770Q801q611l5634l7019l5326R760M3855N8263
26434A5935k5243j83n2162k0437K504j4334k3L9530N013j8803o6920k88L1734
26421a03677O8627N8185J7694k7527l7283m1849J4062J4934M031K1920j6519l336
26409c0738k3047R005j1396n0855L9083P6284K9534L3565K0814J0786J0241p1959
$$ plain form
26397 41317 -6139 -60684 -94217 -144074 -161636 -109351 -28269 -39476 -48863 -20491 26719 55776
26385 55776 34620 8517 71176 91807 97846 62002 -1692 -13504 -3718 75941 136312 65732
26373 65732 -18736 -87472 -46057 16715 21057 49272 67716 43821 9979 -5912 11758 48107
26361 48107 60495 40947 52065 76688 77065 86037 83778 68362 64220 28168 -6630 -7032 -27543
26348 -27543 -47710 -64079 -35750 27872 46465 110509 104779 64261 27684 -10069 8115 22079
26336 22079 27317 55881 53145 57356 88709 89121 10594 -37645 -37764 -61765 -80315 -88947 -87088
26323 -87088 -68432 -36574 12610 27594 -2290 -16074 10316 44806 41369 17551 -6654 -16974
26311 -16974 24298 25751 23355 30053 1775 8320 1086 -15627 20346 18005 47459 58241 71969
$$ packed form
26397D1317m7456n4545l3533m9857j7562N2285Q1082j1207r387K8372M7210K9057
26385E5776k1156k6103O2659K0631O039l5844o3694j1812R786P9659O0371p0580
26373F5732q4468o8736M1415O2772M342K8215J8444k3895l3842j5891J7670L6349
26361D8107J2388j9548J1118K4623L77Q972k259j5416m142l6052l4798m02k0511
26348b7543k0167j6369K8329O3622J8593O4044n730m0518l6577l7753J8184J3964
26336B2079N238K8564k736M211L1353M12p8527m8239j19k4001j8550q632J859
26323h7088J8656L1858M9184J4984k9884j3784K6390L4490l437k3818k4205j0320
26311a6974M1272J453k396O698k8278O545p234j6713L5973k341K9454J0782J3728
$$ plain form
26298 71969 93047 88969 50001 75592 63760 -25459 -25685 14729 11408 -18638 -13124 17747 41797
26285 41797 57662 52824 70062 35735 63026 93425 123178 161415 169224 145243 97186 48634
26273 48634 39772 62864 74595 63921 79706 75592 67436 95522 122768 117016 151456 93319
26261 93319 -40449 -72939 -17077 10939 23787 -4242 11439 31291 13958 10396 8696 25541
26249 25541 18926 41230 39125 -6736 6620 61999 89356 85884 21022 -20095 -7207 -61820
26237 -61820 -52492 -32681 16968 22710 7427 -7658 -54223 -40661 -3468 4761 11175 -23708
26225 -23708 -94035 -104032 -62253 -94178 -104588 -121017 -104545 -100271 -70373 -71624 -50593 -97795
26213 -97795 -90565 -82179 -89962 -41779 -42053 -20549 -76456 -81746 -55633 -30657 31059 -8819 -71710
$$ packed form
26298G1969K1078m078l8968K5591j1832q9219k26M0414l321l0046N514L0871K4050
26285D1797J5865m838J7238l4327K7291L0399K9753L8237P809k3981m8057m8552
26273D8634q862K3092J1731j0674J5785m114q156K8086K7246n752L4440n8137
26261I3319j33768l2490N5862K8016J2848k8029J5681J9852j7333l562j700J6845
26249B5541o615K2304k105m5861J3356N5379K7357l472o4862m1117J2888n4613
26237f1820R328J9811M9649N742j5283j5085m6565J3562L7193Q229O414l4883
26225b3708p0327r997M1779l1925j0410j6429J6472M274K9898j251K1031m7202
26213i7795P230Q386p783M8183k74K1504n5907n290K6113K4976O1716l9878o2891
$$ plain form
26200 -71710 -35200 -11940 26264 37348 13864 -2892 -14419 -23353 15167 24915 20070 20481 34126
26187 34126 81410 61395 48471 -22574 -57885 -23282 -4032 9557 35882 46723 32526 -10802
26175 -10802 -36280 10983 47138 20022 32443 62538 90033 48571 55673 56404 48407 -9489
26163 -9489 -65406 15555 37261 18897 26162 -70142 -68564 7230 36105 6456 -32993 -22187
26151 -22187 1016 14728 111 -35740 -6016 -2471 9938 2994 -15859 -6078 25358 47767
26139 47767 45794 17763 -23973 -2306 54410 47894 4372 14157 64836 53752 31714 19761
26127 19761 3877 -7902 27463 41922 -13527 -35789 -2931 -22205 -46076 -56457 4296 44800
26115 44800 22223 -4444 4075 8946 26579 17187 30723 70262 76772 87450 107679 131713
$$ packed form
26200g1710L6510K3260L8204J1084k3484j6756j1527q934L8520R748m845M11J3645
26187C4126M7284k0015j2924p1045l5311L4603J9250J3589K6325J0841j4197m3328
26175a0802k5478M7263L6155k7116J2421L0095K7495m1462P102P31p997n7896
26163i489n5917Q0961K1706j8364P265r6304J578P5794K8875k9649l9449J0806
26151b2187K3203J3712j4617l5851K9724L545J2409o944j8853R781L1436K2409
26139D7767j973k8031m1736K1667N6716o516m3522R785N0679j1084k2038j1953
26127A9761j5884j1779L5365J4459n5449k2262L2858j9274k3871j0381O0753M0504
26115D4800k2577k6667Q519M871J7633r392J3536L9539O510J0678K0229K4034
$$ plain form
26103 131713 112658 62728 -7010 -12924 -19235 -54064 -54671 -57025 -60133 -74248 -58310 -18854 -49403
26090 -49403 -43336 -25653 -21372 -17821 10049 22656 39743 32082 32148 5608 -15504 -38528 -50045
26077 -50045 -20486 8379 -53997 -107784 -115366 -131792 -113847 -123847 -104449 -69776 -51434 -86257
26065 -86257 -108868 -80622 -10003 53924 53607 54393 57868 26703 16670 50716 43685 -16314 -24437
26052 -24437 -19717 -45628 -70302 -72697 -23214 -16978 -24887 -50499 -82089 -28073 -67031 -93385
26040 -93385 -97477 -99569 -84050 -71195 -59328 -29810 -23278 -28234 45589 10840 -12326 -6460 -21945
26027 -21945 9378 18651 -19653 23254 95139 147085 125006 63742 20897 -27390 -21966 14611
26015 14611 34985 48609 29128 54739 79383 81221 17910 18115 13789 -13121 -12193 -37149 -34160
$$ packed form
26103A31713j9055m9930o9738n914o311l4829o07k354l108j4115J5938L9456l0549
26090d9403O067J7683M281L551K7870J2607J7087p661O6k6540k1112k3024j1517
26077e0045K9559K8865o2376n3787p582j6426J7945j0000J9398L4673J8342l4823
26065h6257k2611K8246P0619O3927l17P86L475l1165j0033L4046p031n9999q123
26052b4437M720k5911k4674k395M9483O236p909k5612l1590N4016l8958k6354
26040i3385m092k092J5519J2855J1867K9518O532m956P3823l4749k3166N866j5485
26027b1945L1323R273l8304M2907P1885N1946k2079o1264m2845m8287N424L6577
26015A4611K0374J3624j9481K5611K4644J838o3311K05m326k6910R28k4956K989
$$ plain form
26002 -34160 -19546 -5088 -15863 -24376 10055 14294 15116 35666 35599 32264 31340 -7543 -7876 -2151
25988 -2151 38455 44275 44693 59343 47971 78862 62811 89704 63279 49998 50647 42686 65490
25975 65490 86954 52242 3350 -20946 -14620 -9762 33952 24400 -22364 -1424 11401 21336
25963 21336 47988 49167 56764 128829 191003 160847 84605 63924 47077 17513 -68817 -118455
25951 -118455 -130263 -40063 2365 7791 9928 -40357 -93175 -58683 -27836 4100 -4936 -19044
25939 -19044 -21182 -25244 -7588 5622 38630 48772 49640 65910 33012 38112 2465 -7570 -17877
25926 -17877 27011 49963 -5582 1716 -14874 -21106 -57671 -46885 -14018 -72693 -71486 -34778
25914 -34778 -3550 -1075 4278 316 -4319 -85371 -107879 -44920 38918 115127 138802 120939
$$ packed form
26002c4160J4614J4458j0775q513L4431M239Q22K0550o7l335r24l8883l33N725
25988b151M0606N820M18J4650j1372L0891j6051K6893k6425j3281O49p961K2804
25975F5490K1464l4712m8892k4296O326M858M3714r552m6764K0940J2825R935
25963B1336K6652J179P597P2065O2174l0156p6242k0681j6847k9564q6330m9638
25951a18455j1808R0200M2428N426K137n0285n2818L4492L0847L1936r036j4108
25939a9044k138m062J7656J3210L3008J0142Q68J6270l2898N100l5647j0035j0307
25926a7877M4888K2952n5545P298j6590o232l6565J0786L2867n8675J207L6708
25914c4778L1228K475N353l962m635q1052k2508O2959Q3838P6209K3675j7863
$$ plain form
25902 120939 72450 12156 -25598 -13151 47965 85633 49506 45487 65640 54228 -279 29004
25890 29004 81864 97130 62007 7095 -4386 -37030 -75388 -87519 -39405 -34223 -10022 81629
25878 81629 72324 4818 -31651 -89218 -89553 -88576 -30380 -7614 -34430 -43238 -50211 -57250 -24427
25865 -24427 39191 67427 46018 -11576 -26510 -19290 43550 35643 35602 40747 13876 -14861 -23935
25852 -23935 -49309 -75982 -83191 -22092 -12840 -33823 -46308 -40837 -12738 30674 9517 -11237
25840 -11237 -53046 -83461 -71400 -10396 -1122 -14869 -50585 -10091 26287 73952 73078 49495
25828 49495 -14995 -6601 -5771 23934 -2391 22275 -6298 6354 32359 32692 35522 82857 43918
25815 43918 -32627 -74641 -103720 -69911 -39637 -54923 -24189 -43640 -73927 -31564 -39780 -76549
$$ packed form
25902A20939m8489o0294l7754J2447O1116L7668l6127m019K0153j1412n4507K9283
25890B9004N2860J5266l5123n4912j1481l2644l8358j2131M8114N182K4201R1651
25878H1629r305o7506l6469n7567l35R77N8196K2766k6816q808o973p039L2823
25865b4427O3618K8236k1409n7594j4934P220O2840p907m1N145k6871k8737r074
25852b3935k5374k6673p209O1099R252k0983j2485N471K8099M3412k1157k0754
25840a1237m1809l0415J2061O1004R274j3747l5716M0494L6378M7665q74k3583
25828D9495o4490Q394Q30K9705k6325K4666k8573J2652K6005L33K830M7335l8939
25815D3918p6545m2014k9079L3809L0274j5286L0734j9451l0287M2363q216l6769
$$ plain form
25803 -76549 -81588 -508 72784 63493 54298 67458 26755 38860 51222 38981 37542 -11626
25791 -11626 -18837 -3981 5860 25854 34423 36844 62483 5724 24626 52967 50391 62766 70161
25778 70161 116818 98366 60171 42864 51793 44485 19829 9282 -15403 -32957 -37727 7718
25766 7718 77268 103073 63222 47139 31832 35995 17538 18576 -29283 -51202 -42951 -31245
25754 -31245 -43816 5181 66772 111507 107144 36674 -18810 -45187 -39264 -31368 -3400 20375
25742 20375 15524 11270 1009 -12291 18371 27466 23849 -30644 -81997 -80444 2024 24030 -13170
25729 -13170 6820 -28141 -32471 7622 77274 122936 122822 85501 58714 74173 40503 7770
25717 7770 12084 17617 4090 -26835 -36002 -95898 -85757 -39670 -27147 -50565 -65905 -75748 -99699
$$ packed form
25803g6549n039Q1080P3292r291r195J3160m0703J2105J2362j2241j439m9168
25791a1626p211J4856R841J9994Q569K421K5639n6759J8902K8341k576J2375P395
25778G0161M6657j8452l8195j7307Q929p308k4656j0547k4685j7554m770M5445
25766G718O9550K5805l9851j6083j5307M163j8457J038m7859k1919Q251J1706
25754c1245j2571M8997O1591M4735m363p0470n5484k6377N923P896K7968K3775
25742B0375m851m254j0261j3300L0662R095l617n4493n1353J553Q2468K2006l7200
25729a3170J9990l4961m330M0093O9652M5662j14l7321k6787J5459l3670l2733
25717G770M314N533j3527l0925r167n9896J0141M6087J2523k3418j5340r843k3951
$$ plain form
25704 -99699 -131662 -110779 -50393 -25799 -21103 51016 21139 -5776 15763 29103 -13612 -54785
25692 -54785 -86279 -126591 -148712 -118317 -108091 -38692 -35275 -50132 -75568 -114382 -130820 -70120
25680 -70120 -73521 -95330 -58539 -75795 -45306 27661 42094 -12038 -32101 -51190 -24863 -16285
25668 -16285 -61472 -50588 -84370 -72513 -48916 6074 38804 37009 -45101 -48612 -52673 -53119 1777
25655 1777 23960 31546 1285 16183 23445 2209 -5571 11334 2363 -27898 -52647 -47560 -1393
25642 -1393 7323 63776 114583 92489 71262 66863 11858 32902 50144 67953 55052 9387
25630 9387 -4891 -16460 26030 92561 137425 116655 118721 78291 48139 28033 40815 38875
25618 38875 46388 85970 78366 58115 6878 -20219 9002 12743 9841 28403 54112 35919
$$ packed form
25704i9699l1963K0883O0386K4594M696P2119k9877k6915K1539J3340m2715m1173
25692e4785l1494m0312k2121L0395J0226O9399L417j4857k5436l8814j6438O0700
25680g0120l401k1809L6791j7256L0489P2967J4433n4132k0063j9089K6327Q578
25668a6285m5187J0884l3782J1857K3597N4990L2730j795q2110l511m061m46N4896
25655A777K2183P586l0261J4898P262k1236p780J6905q971l0261k4749N087M6167
25642a393Q716N6453N0807k2094k1227m399n5005K1044J7242J7809j2901m5665
25630I387j4278j1569M2490O6531M4864k0770K066m0430l0152k0106J2782j940
25618C8875P513L9582p604k0251n1237k7097K9221L741k902J8562K5709j8193
$$ plain form
25606 35919 12808 60786 91837 120809 104638 57981 6605 31932 67616 22302 -48890 -31628
25594 -31628 3708 -26047 -27068 27672 79273 50459 10211 -51605 -102572 -40824 18375 -6395
25582 -6395 -17641 -47914 -86063 -45388 -30816 -59017 -50582 -71113 -59857 -11086 -1561 -9559
25570 -9559 -43026 -86250 -70590 -24965 -9822 42968 267 -26765 10014 -8707 -35422 -19352
25558 -19352 41389 36949 36275 37114 66711 -7261 -2769 20498 -20233 -107330 -83534 -26487 -20940
25545 -20940 -31391 -42779 -63462 -56061 -37706 -47427 -64015 -78909 -4813 45365 58719 84075
25533 84075 68370 68223 102150 128640 56752 13053 660 -6618 28617 10191 -9290 -24462
25521 -24462 -44861 -65304 -117709 -113339 -90986 -100366 -77307 -75459 -42106 -6844 51524 52760
$$ packed form
25606C5919k3111M7978L1051K8972j6171m6657n1376K5327L5684m5314p1192J7262
25594c1628L5336k9755j021N4740N1601k8814m0248o1816n0967O1748N9199k4770
25582f395j1246l0273l8149M0675J4572k8201Q435k0531J1256M8771R525p998
25570i559l3467m3224J5660M5625J5143N2790m2701k7032L6779j8721k6715J6070
25558a9352O0741m440o74Q39K9597p3972M492K3267m0731q7097K3796N7047N547
25545b0940j0451j1388k0683P401J8355r721j6588j4894P4096N0178J3354K5356
25533H4075j5705j47L3927K6490p1888m3699j2393p278L5235j8426j9481j5172
25521b4462k0399k0443n2405M370K2353r380K3059J848L3353L5262N8368J236
$$ plain form
25509 52760 -15171 -14045 31917 -12154 -25017 -39784 -55055 -61044 -55771 -52508 -40157 -6881
25497 -6881 16089 24703 31408 22418 48254 79932 73945 34794 28674 77830 57891 24420 -15915
25484 -15915 -1828 11023 39158 -131 -62137 -82636 -44311 35579 16856 -33163 -66729 -87033
25472 -87033 -88614 -40900 -14432 -47189 -30532 -5559 10205 26009 -8722 -30456 -21866 -42002
25460 -42002 -5683 30125 46077 37049 17564 25646 22513 22331 60781 91943 100664 104904 115697
25447 115697 106972 76719 56322 49744 18998 -21621 -69211 -59964 -17568 955 -14259 -18374
25435 -18374 -9505 10529 -2542 -27088 -35149 -26077 20271 6834 -42201 -19245 7095 8518
25423 8518 -3078 -324 -32302 -48655 -25599 22210 58729 56452 3328 -32787 -31305 -43064
$$ packed form
25509E2760o7931J126M5962m4071j2863j4767j5271n989N273L263J2351L3276
25497f881K2970Q614O705q990K5836L1678n987l9151o120M9156j9939l3471m0335
25484a5915J4087J2851K8135l9289o2006k0499L8325P9890j8723n0019l3566k0304
25472h7033j581M7714K6468l2757J6657K4973J5764J5804l4731k1734Q590k0136
25460d2002L6319L5808J5952r028j9485Q082l133j82L8450L1162Q721M240J0793
25447A15697q725l0253k0397o578l0746m0619m7590R247M2396J8523j5214m115
25435a8374Q869K0034j3071k4546q061R072M6348j3437m9035K2956K6340J423
25423H518j1596K754l1978j6353K3056M7809L6519k277n3124l6115J482j1759
$$ plain form
25411 -43064 -38389 -29861 -44719 -75009 -96308 -79276 -76516 -3086 4972 -39467 -1386 31850
25399 31850 22453 56741 46980 736 -56922 -21812 -30880 -16384 -22563 -86575 -113643 -101929
25387 -101929 -107673 -46147 -31996 -31713 -18126 -18347 -43365 -40004 -22613 28945 69295 30793 1367
25374 1367 -13653 22419 30967 -4838 8680 26366 -50687 -62938 -45573 -36553 -274 28934
25362 28934 26168 25175 23652 55927 68644 49270 70032 74520 64060 42199 41099 18212 36139
25349 36139 54904 50951 44186 28576 20448 36970 39159 25131 31643 15180 15550 38461 87157
25336 87157 63213 37582 42057 23936 12038 -7070 40632 75776 118642 144091 130362 91403
25324 91403 72306 65066 40529 -18722 -24796 -20442 -16139 -23127 -38607 -37196 5112 41463 14311
$$ packed form
25411d3064M675Q528j4858l0290k1299J7032K760P3430Q058m4439L8081L3236
25399C1850r397L4288r761m6244n7658L5110r068J4496o179o4012k7068J1714
25387a01929n744O1526J4151K83J3587k21k5018L361J7391N1558M0350l8502k9426
25374A367j5020L6072Q548l5805J3518J7686p7053j2251J7365R020L6279K9208
25362B8934k766r93j523L2275J2717j9374K0762M488j0460k1861j100k2887J7927
25349C6139J8765l953o765j5610q128J6522K189j4028O512j6463L70K2911M8696
25336H7157k3944k5631M475j8121j1898j9108M7702L5144M2866K5449j3729l8959
25324I1403j9097p240k4537n9251o074M354M303o988j5480J411M2308L6351k7152
$$ plain form
25311 14311 23190 -17274 -59800 -5809 57683 18101 -24762 -18910 72760 70610 35087 38099
25299 38099 54437 52595 33009 56894 33951 30671 29111 29296 39876 25639 44762 57008 56196
25286 56196 23097 -15278 45386 68358 78621 -1792 -28338 -23465 -18676 -45312 -80650 -75576
25274 -75576 -45131 -14700 -30482 -39507 8697 -6193 -24117 -55809 -70746 -48637 -730 46330
25262 46330 46032 -5141 -38113 -77630 -50807 5140 63605 -7089 7460 77976 92691 60937
25250 60937 -1929 -39812 -125229 -114254 -91071 -83670 -86025 -48213 -40370 -95980 -18656 5954
25238 5954 -44029 -103849 -77058 -75359 -65489 -43264 -92307 -113210 -116434 -76684 -62668 -31202
25226 -31202 -35605 -85117 -65647 -35178 -21298 -19955 -52538 -28015 -6021 -23477 -16570 25024
$$ packed form
25311A4311Q879m0464m2526N3991O3492l9582m2863N852R1670k150l5523L012
25299C8099J6338j842j9586K3885k2943l280j560J85J0580j4237J9123J2246q12
25286E6196l3099l8375O0664K2972J0263q0413k6546M873M789k6636l5338N074
25274g5576L0445L0431j5782r025M8204j4890j7924l1692j4937K2109M7907M7060
25262D6330k98n1173l2972l9517K6823N5947N8465p0694J4549P0516J4715l1754
25250F0937o2866l7883q5417J0975K3183P401k355L7812P843n5610P7324K4610
25238E954m9983n9820K6791J699R870K2225m9043k0903l224L9750J4016L1466
25226c1202m403m9512J9470L0469J3880J343l2583K4523K1994j7456O907M1594
$$ plain form
25214 25024 21422 31313 65782 15692 21167 39364 51641 51850 -19073 -99255 -116368 -95492 -63270
25201 -63270 -24663 7354 1588 30024 7404 6450 8942 35912 35368 33915 -5166 23728 24952
25188 24952 4991 3683 -11021 -50469 -43865 -873 48131 41386 -1036 -71066 -112108 -62759
25176 -62759 -48248 -69735 -59834 -48717 -19423 -46968 -44893 -24009 13721 -14376 2968 32437
25164 32437 33577 18633 -114 3865 28059 23299 21425 27726 32951 40740 29069 -38831 -82334
25151 -82334 -119483 -81466 8470 88636 61485 25755 -163 -6242 17131 29208 87956 37841
25139 37841 2714 1615 11699 -27451 -54318 -10166 -61796 -69253 -112569 -136081 -110764 -61542
25127 -61542 -19701 -34547 -42895 -93327 -63423 -42578 -75751 -89012 -90427 -52105 59202 66848
$$ packed form
25214B5024l602R891L4469n0090N475J8197J2277K09p0923q0182j7113K0876L2222
25201f3270L8607L2017n766K8436k2620r54K492K6970n44j453l9081K8894J224
25188B4952j9961j308j4704l9448O604M2992M9004o745m2422p0030m1042M9349
25176f2759J4511k1487R901J1117K9294k7545K075K0884L7730k8097J7344K9469
25164C2437J140j4944j8747L979K4194m760j874O301N225P789j1671o7900m3503
25151h2334l7149L8017Q9936Q0166k7151l5730k5918o079K3373J2077N8748n0115
25139C7841l5127j099J0084l9150k6867M4152n1630p457m3316k3512K5317M9222
25127f1542M1841j4846q348n0432K9904K0845l3173j3261j415L8322J11307P646
$$ plain form
25115 66848 50750 42537 -27399 -51220 -31225 -11150 -14053 19338 56926 84224 66484 53282
25103 53282 86772 60350 22392 -7501 5717 55317 52345 -4879 20006 39936 -6306 -16389
25091 -16389 26702 23354 71081 112588 34987 -36423 -50212 -74778 -81473 -9434 -7851 -25723
25079 -25723 9898 60187 48279 -10900 -55417 -84055 -40850 -1759 -26929 -31417 -9322 19278
25067 19278 1839 -25091 -4067 -39536 -47529 -30295 -36215 -24642 -29113 -72769 -83977 -66066
25055 -66066 -15175 28011 52645 51794 59550 36386 44118 49024 39234 62301 53228 33906 -53380
25042 -53380 -50903 -48669 -15996 23131 6222 -5750 25447 83807 32005 -40099 -53987 16085
25030 16085 45369 72808 53667 32933 -2159 -42717 -41920 -42621 -34373 9030 70010 63485 59736
$$ packed form
25115F6848j6098q213o9936k3821J9995K0075k903L3391L7588K7298j7740j3202
25103E3282L3490k6422l7958k9893J3218M9600k972n7224K4885J9930m6242j0083
25091a6389M3091l348M7727M1507p7601p1410j3789k4566o695P2039J583j7872
25079b5723L5621N0289j1908n9179m4517k8638M3205L9091k5170m488K2095K8600
25067A9278j7439k6930K1024l5469p993J7234n920J1573m471m3656j1208J7911
25055f6066N0891M3186K4634q51P756k3164P732M906r790K3067r073j9322q7286
25042e3380K477K234L2673L9127j6909j1972L1197N8360n1802p2104j3888P0072
25030A6085K9284K7439j9141k0734l5092m0558P97p01Q248M3403O0980o525l749
$$ plain form
25017 59736 59061 47335 35734 65954 97947 90203 97954 97038 46844 23832 2013 -36314 -8915
25004 -8915 3178 18631 16470 -8252 74780 91608 65575 80810 65334 27880 -762 9971
24992 9971 7484 26426 17824 -65798 -73963 -43830 9793 8075 60023 44742 37046 38206 -495
24979 -495 -32764 -95547 -71961 -39184 -54361 -86860 -77959 -37426 -51368 -66689 -84392 -79921
24967 -79921 -82596 -29837 -12681 -33965 -7904 4060 3859 -19925 -43369 -29280 12418 63679
24955 63679 44096 -17599 -87895 -53870 -18511 -30131 22192 55424 -34896 -46442 9669 33250
24943 33250 33028 20353 -19960 4902 -9721 -20196 -34858 -1946 50675 48041 -9104 -15173
24931 -15173 -29458 -43400 -19948 20365 52141 40464 67722 52772 65547 16336 -56096 -49695
$$ packed form
25017E9736o75j1726j1601L0220L1993p744P751r16n0194k3012k1819l8327K7399
25004h915J2093J5453k161k4722Q3032J6828k6033J5235j5476l7454k8642J0733
24992I971k487J8942q602q3622q165L0133N3623j718N1948j5281p696J160l8701
24979d95l2269o2783K3586L2777j5177l2499Q901M0533j3942j5321j7703M471
24967g9921k675N2759J7156k1284K6061J1964k01k3784k3444J4089M1698N1261
24955F3679j9583o1695p0296L4025L5359j1620N2323L3232r0320j1546N6111K3581
24943C3250k22j2675m0313K4862j4623j0475j4662L2912N2621k634n7145o069
24931a5173j4285j3942K3452M0313L1776j1677K7258j4950J2775m9211p2432O401
$$ plain form
24919 -49695 15033 54143 52177 11951 -14939 18472 28428 1842 20026 -39649 -56586 -28489
24907 -28489 -53070 -76866 -51613 -53445 -80613 -60337 -11884 10282 26331 21621 -10991 -28416
24895 -28416 -27585 24890 -18059 -41346 -25529 -21629 -4897 -39694 12808 84311 94141 49445
24883 49445 38903 82044 89961 100287 64217 -36570 -76435 -9263 -3939 15209 94103 130414
24871 130414 111288 99516 103569 83419 58441 65703 92903 93696 97208 82092 140055 109372
24859 109372 49440 2779 16661 76009 34486 -14755 -32895 -44614 -76357 -80513 -80081 -47804
24847 -47804 -1159 -5989 -11853 -63166 -54054 -36243 17291 15886 8744 31578 85193 51487 9656
24834 9656 14237 51208 52471 34317 29745 -616 -53478 -79619 -5103 22761 -6287 11405
$$ packed form
24919d9695O4728L9110j966m0226k6890L3411R956k6586J8184n9675j6937K8097
24907b8489k4581k3796K5253j832k7168K0276M8453K2166J6049m710l2612j7425
24895b8416Q31N2475m2949k3287J5817L900J6732l4797N2502P1503R830m4696
24883D9445j0542M3141P917J0326l6070j00787l9865O7172N324J9148P8894L6311
24871A30414j9126j1772M053k0150k4978P262K7200P93L512j5116N7963l0683
24859A09372n9932m6661J3882N9348m1523m9241j8140j1719l1743m156M32L2277
24847d7804M6645m830n864n1313R112J7811N3534j405p142K2834N3615l3706m1831
24834I656M581L6971J263j8154m572l0361n2862k6141P4516K7864k9048J7692
$$ plain form
24822 11405 41431 9219 -1433 -29243 -31215 -35609 -12165 -11258 -32152 -72880 -78903 -47456 -35756
24809 -35756 -31849 40111 18555 22522 98214 99581 40322 -11063 -47125 -47494 -4557 -15919 12643
24796 12643 17742 59275 26624 43610 81994 97614 83622 61281 -4885 -35267 4484 34885
24784 34885 50990 4240 -30045 -66202 3740 5805 5698 -8511 -9803 -3567 -21681 -61020 -87072
24771 -87072 -13332 3175 -57128 -73512 -64778 -67888 -65806 -31230 -20137 1998 -424 -9354 -28587
24758 -28587 -3259 -34059 -64296 -82870 -61574 -73053 -43715 -27414 -11937 -20178 -76806 -123979
24746 -123979 -101635 -43645 -34191 -47844 -24227 -5696 -50233 -74333 -81604 -74780 -78924 -5167
24734 -5167 12988 -19221 6617 36462 27657 -29681 -97647 -83544 -72163 -64899 -866 41038
$$ packed form
24822A1405L0026l2212j0652k7810j972m394K3444R07k0894m0728o023L1447J1700
24809c5756L907P1960k1556L967P5692J367n9259n1385l6062l69M2937j1362K8562
24796A2643N099M1533l2651J6986L8384J5620j3992k2341o6166l0382L9751L0401
24784C4885J6105m6750l4285l6157O9942K065j07j4209j292O236j8114l9339k6052
24771h7072P3740J6507o0303j6384Q734l110K082L4576J1093K2135k422q930j9233
24758b8587K5328l0800l0237j8574K1296j1479K9338J6301J5477q241n6628m7173
24746a23979K2344N7990R454j3653K3617J8531m4537k4100p271O824m144P3757
24734e167J8155l2209K5838K9845q805n7338o7966J4103J1381P264O4033M1904
$$ plain form
24722 41038 36080 9629 -7274 11607 -20351 -14276 -31399 -55981 -29975 -40937 -55554 -47066
24710 -47066 -100444 -58727 -18609 8657 6160 -36 42812 20931 -9264 16010 40950 47682
24698 47682 31670 28634 68191 88101 40594 -21868 -15933 -2948 2252 -13828 -15633 8348
24686 8348 22581 3037 36555 54135 44422 46179 72252 24562 -80603 -128247 -95416 2466
24674 2466 35681 -10435 -20691 3015 19877 24441 20504 43891 -22120 -89518 -78933 -75171
24662 -75171 -89057 -86559 -10704 -23884 26588 30830 7850 15814 18456 -3198 -6062 -25385 -35318
24649 -35318 -36089 -41644 5655 36963 41308 38709 40977 18458 3263 10757 42457 56354 55363
24636 55363 37912 22738 19367 12079 13814 -15090 -23136 -9101 -12787 -34037 15717 66222 74213
$$ packed form
24722D1038m958k6451j6903J8881l1958O075j7123k4582K6006j0962j4617Q488
24710d7066n3378M1717M0118K7266k497o196M2848k1881l0195K5274K4940O732
24698D7682j6012l036L9557J9910m7507o2462N935J2985N200j6080j805K3981
24686H348J4233j9544L3518J7580r713J757K6073m7690j05165m7644L2831R7882
24674B466L3215m6116j0256K3706J6862M564l937K3387o6011o7398J0585L762
24662g5171j3886K498P5855j3180N0472M242k2980P964K642k1654k864j9323r933
24649c5318p71n555M7299L1308M345k599K268k2519j5195P494L1700J3897r91
24636E5363j7451j5174l371p288J735k8904q046J4035l686k1250M9754N0505P991
$$ plain form
24623 74213 55657 74836 134309 79119 66909 57010 24154 43285 52240 66281 28310 33875
24611 33875 -11012 -61468 -29153 -64870 -19973 -15430 -84932 -62695 -15549 19777 -17506 -42078
24599 -42078 -46120 -20112 4109 22164 20478 32338 -3630 20406 28608 -1179 25466 22271
24587 22271 19315 -11890 -37955 -46370 -45295 -10503 52494 39419 14598 23349 -31271 19111
24575 19111 57206 37381 28846 -21972 -43466 -44853 -60990 -23430 8926 -8033 11821 -15044
24563 -15044 -28622 29424 49092 68731 56804 57701 39186 10147 20446 16742 46625 95734
24551 95734 36260 -17162 -13343 -25223 49903 81615 6143 8032 -25113 -84512 -69668 -79554
24539 -79554 -59533 11359 -14837 -55295 -76605 -61555 -20414 -3676 -14971 -52639 -63945 -71929
$$ packed form
24623G4213j8556J9179N9473n5190j2210r899l2856J9131Q955J4041l7971N565
24611C3875m4887n0456L2315l5717M4897M543o9502K2237M7146L5326l7283k4572
24599d2078m042K6008K4221J8055j686J1860l5968K4036Q202k9787K6645l195
24587B2271k956l1205k6065q415J075L4792O2997j3075k4821Q751n4620N0382
24575A9111L8095j9825q535n0818k1494j387j6137L7560L2356j6959J9854k6865
24563a5044j3578N8046J9668J9639j1927Q97j8515k9039J0299l704K9883M9109
24551I5734n9474n3422L819j1880P5126L1712p5472J889l3145n9399J4844r886
24539g9554K0021P0892k6196m0458k1310J5050M1141J6738j1295l7668j1306p984
$$ plain form
24527 -71929 -86634 -85368 -37464 -27312 13762 48014 -10881 -37977 -35484 -19821 7260 11875
24515 11875 13452 29536 -46240 -59091 -76964 -39849 -51463 -31696 -25213 -33070 -9476 687
24503 687 -5345 -10678 11975 1129 39391 72596 59359 40946 11340 -46136 -53088 -14389 -13325
24490 -13325 32298 436 -37883 -103921 -86891 -34420 -43184 -56722 -56321 -41910 14802 -12230
24478 -12230 4779 3831 21735 16243 13743 12697 24096 29394 66638 13194 29499 51249 -16340
24465 -16340 -97109 -78728 -20449 4201 37541 53527 51949 29333 28775 15201 10259 23101
24453 23101 44497 34511 -39437 8609 52442 28840 23201 32149 -24581 -62354 -45557 -23144
24441 -23144 -22592 -13394 6446 30472 72037 87109 64428 39967 26067 34709 51646 49754 46550
$$ packed form
24527g1929j4705J266M7904J0152M1074L4252n8895k7096K493J5663K7081M615
24515A1875J577J6084p5776j2851j7873L7115j1614J9767O483p857K3594J0163
24503F87o032n333K2653j0846L8262L3205j3237j8413k9606n7476o952L8699J064
24490a3325M5623l1862l8319o6038J7030N2471q764j3538M01J4411N6712k7032
24478a2230J7009r48J7904n492k500j046J1399N298L7244n3444J6305K1750o7589
24465a6340q0769J8381N8279K4650L3340J5986j578k2616n58j3574m942J2842
24453B3101K1396r986p3948M8046M3833k3602n639Q948n6730l7773J6797K2413
24441b3144N52R198J9840K4026M1565J5072k2681k4461j3900Q642J6937j892l204
$$ plain form
24428 46550 58772 42478 25218 6811 -15769 -9062 -19261 24531 65114 79107 75256 79687
24416 79687 57252 23957 -22800 -11196 -24199 -54205 -54266 19591 28448 -37062 -44988 -22331 -9326
24403 -9326 -8631 -2989 9924 -14362 -104603 -118639 -37697 -20175 -46814 -83576 -71449 -56195
24391 -56195 6532 22555 55447 48047 26764 27727 4578 -69261 -65507 -42422 -63132 -21514
24379 -21514 -6357 -13230 -41290 -81922 -101734 -40831 15821 33979 17260 24334 16711 65951
24367 65951 103302 94344 29920 -16592 -2347 -20132 -42723 -48176 -70485 -23780 15815 27222
24355 27222 33695 29678 23138 26668 13028 8561 -55091 -89455 -4319 5913 16589 15210 -29493
24342 -29493 -51716 -39641 7110 28772 71060 66746 14202 33910 7136 -11281 -182 -24179
$$ packed form
24428D6550J2222j6294j7260j8407k2580O707j0199M3792M0583J3993l851M431
24416G9687k2435l3295m6757J1604j3003l0006o1P3857Q857o5510p926K2657J3005
24403i326O95N642J2913k4286r0241j4036Q0942J7522k6639l6762J2127J5254
24391e6195O2727J6023L2892p400k1283R63k3149p3839L754K3085k0710M1618
24379b1514J5157o873k8060m0632j9812O0903N6652J8158j6719P074p623M9240
24367F5951L7351q958o4424m6512J4245j7785k2591n453k2309M6705L9595J1407
24355B7222O473m017o540L530j3640m467o3652l4364Q5136J0232J0676j379m4703
24342b9493k2223J2075M6751K1662M2288m314n2544J9708k6774j8417J1099k3997
$$ plain form
24330 -24179 -44621 -39176 4848 64877 22004 -57846 -83441 -34680 21893 -174 -16295 -37015
24318 -37015 -46843 -48726 -51692 -62018 -24891 -8646 -38408 -73450 -111971 -56046 2337 24399
24306 24399 -31615 -58168 -24125 19496 -3296 -22021 -39569 -54242 -84828 -74694 -38574 -6151
24294 -6151 55955 21364 -33809 -4292 71427 55701 33429 13672 7849 34443 11865 -21092
24282 -21092 -39493 3388 1751 13788 13104 -27377 -40430 -7083 -3540 -7059 8398 29266 8316
24269 8316 -13053 -4062 1077 11794 -8708 17899 47973 49093 108221 115231 89248 51083 -11503
24256 -11503 -22587 7322 35247 -6660 -15404 -16769 9993 -3930 -51220 -63556 -72321 26832
24244 26832 97978 113152 73113 71925 52347 73588 75504 45149 26204 6033 40546 46476
$$ packed form
24330b4179k0442N445M4024O0029m2873p9850k5595M8761N6573k2067j6121k0720
24318c7015r828j883k966j0326L7127J6245k9762l5042l8521N5925N8383K2062
24306B4399n6014k6553L4043M3621k2792j8725j7548j4673l0586J0134L6120L2423
24294f151O2106l4591n5173K9517P5719j5726k2272j9757n823K6594k2578l2957
24282b1092j8401M2881j637J2037o84m0481j3053L3347L543l519J5457K0868k0950
24269H316k1369Q991N139J0717k0502K6607L0074J120N9128P010k5983l8165o2586
24256a1503j1084K9909K7925m1907q744j365K6762j3923m7290j2336q765R9153
24244B6832P1146J5174m0039j188j9578K1241J916l0355j8945k0171L4513N930
$$ plain form
24232 46476 -7187 -52739 -78392 -45699 -34869 -31248 -37341 -184 -6392 61822 26735 2321
24220 2321 17442 24302 10698 -34585 -80345 -80763 -74198 -102184 -59553 -5447 27104 27989 -6259
24207 -6259 -19333 21362 41818 2831 17427 69853 104349 105851 90601 121107 75294 77758
24195 77758 74027 48054 47683 98707 104919 26324 -35082 -65535 -55482 -17116 -17077 -10054 12073
24182 12073 67667 103542 81823 31274 24985 41906 -12590 -41756 -35516 -27304 -25237 -60542
24170 -60542 -172418 -203499 -186638 -134770 -97254 -57517 -42986 -6529 -9522 -26929 23612 35072
24158 35072 61647 122409 118802 69997 82833 83612 39416 10368 -59183 -99965 -90052 -57372
24146 -57372 -8218 399 -41836 -26061 -54915 -68768 -29609 7872 -65761 -77418 -22462 25343
$$ packed form
24232D6476n3663m5552k5653L2693J0830L621o093L7157o208O8214l5087k4414
24220B321J5121O860j3604m5283m5760m18O565k7986M2631N4106L2551Q85l4248
24207f259j3074M0695K0456l8987J4596N2426L4496J502j5250L0506m5813K464
24195G7758l731k5973l71N1024O212p8595o1406l0453J0053L8366L9P023K2127
24182A2073N5594L5875k1719n0549o289J6921n4496k9166O240Q212K067l5305
24170f0542j11876l1081J6861N1868L7516L9737J4531L6457k993j7407N0541J1460
24158C5072K6575O0762l607m8805J2836P79m4196k9048o9551m0782R913L2680
24146e7372M9154Q617m2235J5775k8854j3853L9159L7481p3633j1657N4956M7805
$$ plain form
24134 25343 50221 57431 14443 -13698 15921 77101 81784 22951 11654 13769 268 26751
24122 26751 3953 -38433 -51465 -8795 43899 10098 22251 15527 22339 46934 45781 52951
24110 52951 39630 7984 43440 33084 15667 27338 -19417 -17604 29354 35319 37159 26635
24098 26635 32466 63848 43141 7536 2431 3748 20 35691 39323 12365 -1312 4926 11949
24085 11949 11626 -4948 -10359 -9812 -72938 -87990 -56409 -44000 -32421 -50948 -60985 -33307 9884
24072 9884 52567 77030 66419 42523 14910 32925 -14997 -19529 10151 8223 -8879 -45690
24060 -45690 -33963 -31758 17004 25624 66693 41699 6151 -16699 35958 59440 86848 63000
24048 63000 31770 24057 62189 68580 30891 -2473 13416 56735 32652 35737 66155 87803
$$ packed form
24134B5343K4878P210m2988k8141K9619O1180M683n8833j1297K115j3501K6483
24122B6751k2798m2386j3032M2670N2694l3801J2153o724O812K4595j153P170
24110E2951j3321l1646L5456j0356j7417J1671m6755J813M6958N965J840j0524
24098B6635N831L1382k0707l5605n105J317l728L5671L632k6958j3677O238P023
24085A1949l23j6574n411N47o3126j5052L1581J2409J1579j8527j0037K7678M3191
24072I884M2683K4463j0611k3896k7613J8015m7922m532K9680j928j7102l6811
24060d5690J1727K205M8762Q620M1069k4994l5548k2850N2657K3482K7408k3848
24048F3000l1230p713L8132O391l7689l3364J5889M3319k4083L085L0418K1648
$$ plain form
24036 87803 89934 49902 -13142 -35317 4981 33267 93489 111824 37429 -40485 -32049 -40477
24024 -40477 17627 43105 27291 21364 33926 -11035 -19955 -18502 -2418 22070 -16068 -44342
24012 -44342 -61551 -77375 -103856 -105206 -77600 -50293 -25186 6281 33157 1326 -60203 -37962
24000 -37962 -13125 -6890 -15899 -49148 -49255 -72692 -111266 -102889 -27535 59283 64881 3214 -9880
23987 -9880 -21665 -25928 -22509 5686 -23160 28071 70831 45182 3724 17920 55399 101676
23975 101676 65544 21027 17019 -21601 -47134 -79157 -57359 -35108 -24545 -31045 -2992 15332
23963 15332 1727 71353 34139 5753 30774 46597 50044 -28527 -25386 15397 4354 5650
23951 5650 -59624 -34121 12328 26776 8525 4361 63969 80450 68155 48359 15830 -23435
$$ packed form
24036H7803K131m0032o3044k2175M0298K8286O0222J8335p4395p7914Q436q428
24024d0477N8104K5478j5814n927J2562m4961q920J453J6084K4488l8138k8274
24012d4342j7209j5824k6481j350K7606K7307K5107L1467K6876l1831o1529K2241
24000c7962K4837O235r009l3249j07k3437l8574Q377P5354Q6818N598o1667j3094
23987i880j1785m263L419K8195k8846N1231M2760k5649m1458J4196L7479M6277
23975A01676l6132m4517m008l8620k5533l2023K1798K2251J0563o500K8053J8324
23963A5332j3605O9626l7214k8386K5021J5823L447p8571L141M0783j1043J296
23951E650o5274K5503M6449J4448j8251m164N9608J6481j2295j9796l2529l9265
$$ plain form
23939 -23435 -58553 21112 62590 61033 41972 44794 39483 -18981 -41272 -32412 -42769 -132031
23927 -132031 -109301 -51936 -72600 -66412 -47204 -24731 -17840 -66975 -96902 -64217 -4023 -4072
23915 -4072 -25152 -23226 -8233 -32678 8005 -24010 -26503 3591 -39293 -47125 -28923 -34332 -6452
23902 -6452 -21659 -71609 -132613 -121441 -121092 -137120 -89291 -86960 -27991 5485 10706 13180 11200
23889 11200 3701 -5664 -12152 -24513 20504 42244 41513 60709 5800 -93581 -61410 23651 27300
23876 27300 7681 8842 -17565 -20284 -49404 -52277 -50496 -57775 -55168 -41484 -639 -25607 -121259
23863 -121259 -134605 -78341 -38923 21144 28371 9111 3419 37274 64540 24058 -30373 -39079
23851 -39079 -30337 -16082 8580 25303 60584 6267 -23387 14738 13401 -29953 -33544 -30056
$$ packed form
23939b3435l5118P9665M1478j557j9061K822n311n8464k2291Q860j0357q9262
23927a32031K2730N7365k0664O188J9208K2473O891m9135k9927L2685O0194m9
23915d072k1080J926J4993k4445M0683l2015k493L0094m2884p832J8202n409K7880
23902f452j5207m9950o1004J1172L49j6028M7829K331N8969L3476N221K474j980
23889A1200p499r365o488j2361M5017K1740p31J9196n4909r9381L2171Q5061L649
23876B7300j9619J161k6407k719k9120k873J781p279K607J3684M0845k4968r5652
23863a21259j3346N6264L9418O0067P227j9260n692L3855K7266m0482n4431q706
23851c9079Q742J4255K4662J6723L5281n4317k9654L8125j337m3354l591L488
$$ plain form
23839 -30056 -34054 -62209 -4029 12497 43607 66089 25583 -6821 -37940 -30647 33691 37659
23827 37659 -20324 -73552 -112184 -84571 -45081 14906 -16928 -51783 -75585 -79701 -61629 -61213
23815 -61213 1499 41924 37013 15697 -48521 -54042 -81681 -110902 -75759 -46643 -46637 -54764 8780
23802 8780 28472 37855 9668 19519 34378 16024 65899 79998 46363 32871 9375 -24899
23790 -24899 -67803 -54701 -15748 -32432 -68336 -37157 4227 2794 14503 -23397 17655 34992
23778 34992 29662 27316 66370 55107 -24928 -19327 3038 -30467 -22272 -5015 -35720 -83884
23766 -83884 -16793 -20204 -54173 -44143 -80122 -73044 -21509 11791 32894 86923 108158 79793
23754 79793 78696 69700 99326 68261 18438 -45 -46002 -36871 56359 117804 75615 67380
$$ packed form
23839c0056l998k8155N8180J6526L1110K2482m0506l2404l1119P293O4338L968
23827C7659n7983n3228l8632K7613L9490N9987l1834l4855k3802m116J8072M16
23815f1213O2712M0425m911k1316o4218n521k7639k9221L5143K9116Oq127O3544
23802H780J9692R383k8187R851J4859j8354M9875J4099l3635j3492k3496l4274
23790b4899m2904J3102L8953j6684l5904L1179M1384j433J1709l7900M1052J7337
23778C4992n330k346L9054j1263q0035N601K2365l3505Q195J7257l0705m8164
23766h3884O7091l411l3969J0030l5979P078N1535L3300K1103N4029K1235k8365
23754G9793j097q996K9626l1065m9823j8483m5957R131R3230O1445m2189q235
$$ plain form
23742 67380 99228 68416 9641 55000 99484 50932 50519 39659 10883 -9062 13777 -1956
23730 -1956 -35317 11394 15659 -24686 -54982 -27229 20197 27595 30602 41778 59746 69517 80331
23717 80331 70427 54189 -4014 9549 44862 55806 1721 -4834 -8221 37941 75459 23771
23705 23771 7993 1631 2711 31079 56910 30144 -10588 16693 42394 57001 78909 67570
23693 67570 38740 -6209 -33691 -2941 23120 50768 11904 -19921 -11701 -1609 10083 44629
23681 44629 63934 40654 5120 27709 52965 19217 -30032 -1756 -5132 20424 24434 36257
23669 36257 38005 39172 5337 11856 31537 44925 4559 49526 105520 18858 -58648 -74397
23657 -74397 -15727 -13466 13449 32685 27882 -22068 -36045 -18255 -60198 -92244 -90480 -58200
$$ packed form
23742F7380L1848l0812n8775M5359M4484m8552m13j0860k8776j9945K2839j5733
23730a956l3361M6711M265m0345l0296K7753M7426P398L007J1176J7968R771J0814
23717H0331r904j6238n8203J3563L5313J0944n4085o555l387M6162L7518n1688
23705B3771j5778o362J080K8368K5831k6766m0732K7281K5701J4607K1908j1339
23693F7570k8830m4949k7482L0750K6061K7648l8864l1825Q220J0092J1692L4546
23681D4629J9305k3280l5534K2589K5256l3748m9249K8276l376K5556M010J1823
23669C6257J748J167l3835O519J9681J3388m0366M4967N5994q6662p7506j5749
23657g4397N8670K261K6915J9236m803m9950j3977J7790m1943l2046J764L2280
$$ plain form
23645 -58200 -20469 -26043 9711 52225 7291 -46229 -69595 -46782 6585 34267 21070 7916
23633 7916 13910 -7077 -58287 -47619 -39521 -24833 -44772 1657 -39866 -2753 49505 112742
23621 112742 109931 75981 55707 36247 43862 43982 53466 39228 12282 -1620 17992 -20200
23609 -20200 -36123 -52998 -7661 52333 30449 4381 53237 59493 40535 44859 75072 108998
23597 108998 105715 73969 26807 3581 29275 33343 -12840 6694 21976 93461 79828 31195
23585 31195 -1536 5202 -85109 -76111 -18560 -32750 -43289 -26169 -2468 -1195 -16035 -34726
23573 -34726 -26113 -16884 -21177 -36872 -22047 2611 14713 -12954 31577 9830 -32192 -67099
23561 -67099 -88051 -35680 20706 29734 70768 84748 123696 94883 32685 72619 55202 68934
$$ packed form
23645e8200L7731n574L5754M2514m4934n3520k3366K2813N3367K7682j3197j3154
23633G916N994k0987n1210J0668Q098J4688j9939M6429m1523L7113N2258O3237
23621A12742k811l3950k0274j9460P615J20R484j4238k6946j3902J9612l8192
23609b0200j5923j6875M5337N9994k1884k6068M8856O256j8958M324L0213L3926
23597A08998l283l1746m7162k3226K5694M068m6183J9534J5282P1485j3633m8633
23585C1195l2731O738r0311Q998N7551j4190j0539J7120K3701J273j4840j8691
23573c4726Q613R229m293j5695J4825K4658J2102k7667M4531k1747m2022l4907
23561f7099k0952N2371N6386R028M1034J3980L8948k8813o2198L9934j7417J3732
$$ plain form
23549 68934 39738 25782 41644 13737 -7209 -10055 -9498 -58998 -87901 -65776 -66297 -51251 -35223
23536 -35223 -44896 -76251 -74780 -61706 -31373 -38126 -47400 -30384 10655 54367 57806 47313 41570
23523 41570 13839 22198 24512 25241 -28731 2310 16932 15147 78991 91421 73390 16429 -21407
23510 -21407 -29695 -48081 -50293 3014 72115 94750 102338 80708 72152 123299 148980 156194 130139
23497 130139 127116 52294 -12660 -15796 20457 7234 48099 54643 67479 20986 -2951 55051
23485 55051 65114 1961 12898 34485 30084 4298 5678 73862 93439 97343 121048 81406
23473 81406 88183 42441 4050 22093 31571 76724 56349 34373 19210 20010 -6880 -4055 5874
23460 5874 -17413 -2771 -18610 16840 48436 13639 7452 29004 24958 42211 30115 -9378
$$ packed form
23549F8934k9196j3956J5862k7907k0946k846N57m9500k8903K2125n21J5046J6028
23536c5223r673l1355J471J3074L0333o753r274J7016M1039M3712L439j0493n743
23523D1570k7731Q359K314P29n3972L1041J4622j785O3844J2430j8031n6961l7836
23510b1407q288j8386k212N3307O9101K2635P588k1630q556N1147K5681P214k6055
23497A30139l023p4822o4954l136L6253j3223M0865O544J2836m6493k3937N8002
23485E5051J0063o3153J0937K1587m401k5786J380O8184J9577L904K3705l9642
23473H1406O777m5742l8391J8043R478M5153k0375k1976j5163Q00k6890K825R929
23460E874k3287J4642j5839L5450L1596l4797o187K1552m046J7253j2096l9493
$$ plain form
23448 -9378 -11348 4881 -69904 -97771 -50587 -37083 -28979 -13113 -20917 58954 101448 113292
23436 113292 29042 21002 30455 15787 -27711 -62943 -50070 -7450 35078 -9085 -16516 49991
23424 49991 116841 149592 154022 200417 153136 104521 88665 112147 52160 -7403 25408 54115
23412 54115 44228 70096 90338 96223 106038 109567 79468 67411 62432 -3083 -4217 -5031 -538
23399 -538 23440 -23642 -44680 -3386 31992 80083 124453 85664 75026 22885 18358 45459
23387 45459 82651 44087 33939 72307 40036 23765 42019 29706 16097 51034 67982 87480
23375 87480 124785 92477 -6759 -11952 23904 76691 94331 133722 126030 78272 59261 93731
23363 93731 95536 80752 89604 52900 65133 37564 24286 80921 114904 114269 100374 97455 94847
$$ packed form
23448i378j970J6229p4785k7867M7184J3504Q104J5866p804P9871M2494J1844
23436A13292q4250q040R453j4668m3498l5232J2873M2620M2528m4163p431O6507
23424D9991O6850L2751M430M6395m7281m8615j5856K3482n9987n9563L2811K8707
23412E4115r887K5868K0242N885R815L529l0099j2057m979o5515j134q14M493
23399e38K3978m7082k1038M1294L5378M8091M4370l8789j0638n2141m527K7101
23387D5459L7192l8564j0148L8368l2271j6271J8254j2313j3609L4937J6948J9498
23375H7480L7305l2308r9236n193L5856N2787J7640L9391p692m7758j9011L4470
23363I3731J805j4784Q852l6704J2233k7569j3278N6635L3983o35j3895k919k608
$$ plain form
23350 94847 101998 97038 156016 139446 44631 733 -4263 12380 45218 25563 58704 72742
23338 72742 59289 158644 227588 225185 178424 148110 133588 130947 162130 172193 152791 160481
23326 160481 117442 78284 65324 67479 96354 122593 166462 190368 221793 263535 333689 376161
23314 376161 399320 392324 407703 460947 561795 757922 995926 1386666 1883247 2371934
23304 2371934 2641729 2599363 2449201 2404222 2488003 2599718 2475301 2060352 1570981 1089932
23294 1089932 846670 724560 637205 587975 533457 450073 367720 297325 287012 279627 199205
23283 199205 208567 241986 219819 160600 139396 94146 92247 87251 82130 101173 106711 78041
23271 78041 77836 86664 92820 33997 -5483 -19708 -20046 -65976 -72044 -46361 -53273 -12527 16098
$$ packed form
23350I4847P151m960N8978j6570r4815m3898m996J6643L2838j9655L3141J4038
23338G2742j3453R9355O8944k403m6761l0314j4522k641L1183J0063j9402P690
23326A60481m3039l9158j2960K155K8875K6239M3869K3906L1425M1742P0154M2472
23314C76161K3159o996J5379N3244J00848J96127K38004L90740M96581M88687
23304B371934K69795m2366j50162m4979Q3781J11715j24417m14949m89371m81049
23294A089932k43262j22110q7355m9230n4518q3384q2353p0395j0313p385q0422
23283A99205R362L3419k2167n9219k1204m5250j899m996n121J9043N538k8670
23271G8041k05Q828O156n8823l9480j4225l38m5930o068K5683o912M0746K8625
$$ plain form
23258 16098 21843 10468 42777 62536 79444 86895 51348 -21158 -23060 -13116 11659 26883
23246 26883 59023 74768 84326 63298 69234 81132 35974 -11978 -26905 -60661 -60249 -25922
23234 -25922 -30698 278 62057 71070 77346 111428 137367 109880 126973 171332 108504 83022
23222 83022 30103 32723 66739 97118 104929 82269 38916 -12040 -35604 -14537 2690 13934
23210 13934 14921 -62481 -68737 -15346 -12462 9174 31045 21050 27177 36240 21059 40030 73098
23197 73098 39092 61451 82360 42695 80557 105732 52335 33329 70222 89305 134106 122879
23185 122879 112389 129613 107374 133093 124213 44646 71336 93940 74574 28139 43663 41609
23173 41609 84018 65506 43891 14743 -164 10624 40746 21063 9525 56160 30837 46363
$$ packed form
23258A6098N745j1375L2309J9759J6908P451l5547p2506j902R944K4775J5224
23246B6883L2140J5745R558k1028N936J1898m5158m7952j4927l3756M12L4327
23234b5922m776L0976O1779R013O276L4082K5939k7487J7093M4359o2828k5482
23222H3022n2919K620L4016L0379P811k2660m3353n0956k3564K1067J7227J1244
23210A3934R87p7402o256N3391K884K1636K1871r995O127R063j5181J8971L3068
23197G3098l4006K2359K0909l9665L7862K5175n3397j9006L6893J9083M4801j1227
23185A22879j0490J7224k2239K5719q880p9567K6690K2604j9366m6435J5524k054
23173D1609M2409j8512k1615k9148j4907J0788L0122j9683j1538M6635k5323J5526
$$ plain form
23161 46363 60076 124815 133651 112751 98979 46329 63330 93301 128336 151442 173110 170619
23149 170619 102824 18399 21380 58485 48413 95452 122148 51536 -5524 -5003 63270 90229
23137 90229 94952 71188 13344 -26005 2576 -4966 11966 50780 74022 60691 49581 17256
23125 17256 -15773 16326 -9523 -16406 26774 35337 24275 63710 88233 97351 61145 23265
23113 23265 29067 59213 102229 88772 67057 63551 66979 -1922 -12646 32125 77075 93355
23101 93355 130987 156350 122452 160638 198402 201061 158843 160767 156553 132436 125043 118116 108994
23088 108994 131656 144764 183972 183464 128329 105973 142659 94209 29075 20223 91980 139501
23076 139501 144169 125984 121995 152974 179834 205109 198694 227142 189848 135049 48895 22635
$$ packed form
23161D6363J3713O4739Q836k0900j3772n2650J7001K9971L5035K3106K1668k491
23149A70619o7795q4425K981L7105j0072M7039K6696p0612n7060N21O8273K6959
23137I0229M723k3764n7844l9349K8581p542J6932L8814K3242j3331j1110l2325
23125A7256l3029L2099k5849o883M3180Q563j1062L9435K4523R118l6206l7880
23113B3265N802L0146M3016j3457k1715l506L428o8901j0724M4771M4950J6280
23101I3355L7632K5363l3898L8186L7764K659m2218J924m214k4117p393o927r122
23088A08994K2662J3108L9208n08n5135k2356L6686m8450o5134q852P1757M7521
23076A39501M668j8185l989L0979K6860K5275o415K8448l7294n4799q6154k6260
$$ plain form
23064 22635 101088 144422 235982 229303 256808 296617 368301 398870 398335 368348 385052 509080
23052 509080 478458 361614 242977 170602 143855 145379 183071 147626 112400 128147 150507
23041 150507 129905 94279 92655 122516 178297 180767 169660 99166 47647 62842 103240 120693
23029 120693 84346 30705 -25363 45865 90804 125084 80764 78120 59618 33307 89358 122848
23017 122848 96685 44277 37139 95513 165010 148189 118930 160896 139500 171610 197880 104371
23005 104371 125390 179708 169750 175537 154568 125630 126783 131417 197655 207683 275931 346168
22993 346168 352880 432278 441077 459118 427005 341653 317559 347740 353785 315208 282450 234058
22981 234058 185318 165800 161907 123169 108146 80686 76640 38108 51913 39782 124495 185746
$$ packed form
23064B2635P8453M3334R1560o679K7505L9809P1684L0569n35k9987J6704J24028
23052E09080l0622j16844j18637p2375k6747J524L7692l5445l5226J5747K2360
23041A50507k0602l5626j624K9861N5781K470j1107p0494n1519J5195M0398J7453
23029A20693l6347n3641n6068P1228M4939L4280m4320k644j8502k6311N6051L3490
23017A22848k6163n2408p138N8374O9497j6821k9259M1966k1396L2110K6270r3509
23005A04371K1019N4318r958N787k0969k8938J153M634O6238J0028O8248P0237
22993C46168O712P9398Q799J8041l2113q5352k4094L0181O045l8577l2758m8392
22981B34058m8740j9518l893l8738j5023k7460m046l8532J3805j2131Q4713O1251
$$ plain form
22969 185746 228554 174347 132392 159457 229210 230026 191333 198329 219864 200105 169941 186316
22957 186316 227401 204088 162186 216513 244507 129753 60400 38611 57302 76608 130265
22946 130265 157098 130925 199090 183055 163808 144810 187974 229748 204974 153498 167718
22935 167718 178645 192605 200096 134809 90469 62469 18431 13059 -15756 -11925 35709 11672
22923 11672 26668 36226 40418 59826 72358 81619 75865 106933 126838 142778 154527 156780 196932
22910 196932 243608 248498 207295 212003 210775 224924 225325 184686 190326 198023 190749 131915 157315
22897 157315 187262 162450 210740 289500 294995 249915 251098 252654 236388 254912 315472 318113
22885 318113 290088 319669 384135 381113 359650 465928 516429 497775 482258 530447 568011
$$ packed form
22969A85746M2808n4207m1955K7065O9753Q16l8693O996K1535j9759l0164J6375
22957A86316M1085k3313m1902N4327K7994j14754o9353k1789J8691J9306N3657
22946A30265K6833k6173O8165j6035j9247j8998M3164M1774k4774n1476J4220
22935A67718J0927J3960P491o5287m4340k8000m4038n372k8815L831M7634k4037
22923A1672J4996R558M192J9408J2532R261n754L1068J9905J5940J1749K253M0152
22910A96932M6676M890m1203M708j228J4149M01m0639N640P697p274n8834K5400
22897A57315K9947k4812M8290P8760N495m5080J183J556j6266J8524O0560K641
22885C18113k8025K9581O4466l022k1463J06278N0501j8654j5517M8189L7564
$$ plain form
22874 568011 613958 673037 700612 722273 745190 787739 808132 941239 1062652 1046330 910795
22863 910795 877035 827770 838894 815335 680497 602890 591664 524497 447695 419266 381844
22852 381844 313433 302581 297728 341930 436132 444597 424447 473931 501760 502595 457964 456406
22840 456406 441686 476358 546108 580791 603300 622960 630722 663184 668319 762614 831004 838623
22828 838623 820831 868515 946950 988645 1000739 995776 1011819 1080848 1216670 1390925 1600821
22817 1600821 1949771 2417960 2873875 3233017 3297866 3101863 3032619 3202310 3412388 3382573
22807 3382573 2986872 2420082 1958622 1712537 1677248 1659814 1671697 1661695 1590046 1641695
22797 1641695 1784441 1843899 1799534 1791458 1804211 1835553 1886044 1928656 1920130 1962653 1982052
$$ packed form
22874E68011M5947N9079K7575K1661K2917M2549K0393J33107J21413j6322j35535
22863I10795l3760m9265J1124k3559j34838p7607j1226o7167p6802k8429l7422
22852C81844o8411j0852m853M4202R4202Q465k0150M9484K7829Q35m4631j558
22840D56406j4720L4672O9750L4683K2509J9660P762L2462N135R4295O8390P619
22828H38623j7792M7684P8435M1695J2094m963J6043O9029J35822J74255K09896
22817A600821L48950M68189M55915L59142O4849j96003o9244J69691K10078k9815
22807C382573l95701n66790m61460k46085l5289j7434J1883j0002p1649N1649
22797A641695J42746N9458m4365q076J2753L1342N0491M2612q526M2523J9399
$$ plain form
22786 1982052 2086703 2238066 2356976 2490671 2580198 2609060 2683379 2732001 2842861 3050113
22776 3050113 3264556 3513797 3733629 3951352 4180244 4508660 4970149 5399673 5834429
22767 5834429 6298581 6876615 7651386 8535920 9562147 10743203 12213371 14108299 16539728
22758 16539728 19589514 23222282 27424427 32049124 37206745 42890816 49171929 56198407
22750 56198407 64185759 73844377 86488366 104561846 131786388 174727821 241669557
22743 241669557 330510681 418717848 473699285 471245880 435420783 424634588 451319573
22736 451319573 473926188 448144156 361786243 259454111 188139884 147772992 123938258
22729 123938258 107620693 95107184 85068220 76867694 69830127 62869957 55567588
$$ packed form
22786A982052J04651J51363J18910J33695Q9527K8862P4319M8622J10860K07252
22776C050113K14443K49241K19832K17723K28892L28416M61489M29524M34756
22767E834429M64152N78034P74771Q84534J026227J181056J470168J894928K431429
22758A6539728L049786L632768M202145M624697N157621N684071O281113P026478
22750E6198407P987352R658618J2643989J8073480K7224542M2941433O6941736
22743B41669557Q8841124Q8207167N4981437k453405l5825097j0786195K6684985
22736D51319573K2606615k5782032q6357913j02332132p1314227m0366892k3834734
22729A23938258j6317565j2513509j0038964q200526p037567o960170p302369
$$ plain form
22722 55567588 48484013 42245398 36953871 32541182 28775754 25568252 22816431 20437421
22714 20437421 18389979 16613165 15039875 13683595 12513349 11405495 10391376 9568936
22706 9568936 8865976 8239130 7642806 7060912 6514856 5993199 5558058 5170068 4703244
22697 4703244 4302842 3978211 3694547 3438373 3169431 2903134 2683353 2497687 2339269
22688 2339269 2138384 1952567 1793915 1683510 1529722 1414850 1314891 1264765 1183286 1180341
22678 1180341 1245802 1259902 1276977 1280498 1288724 1364484 1493537 1681568 1955735 2371452 2894195
22667 2894195 3317456 3366150 3087249 2869029 2923435 3053304 3030342 2682377 2053215 1555939
22657 1555939 1245029 1090298 968134 882373 819740 743456 682628 617647 628626 592809 587917
$$ packed form
22722E5567588p083575o238615n291527m412689l765428l207502k751821k379010
22714B0437421k047442j776814j573290j356280j170246j107854j014119q22440
22706I568936p02960o26846n96324n81894n46056n21657m35141l87990m66824
22697D703244m00402l24631k83664k56174k68942k66297k19781j85666j58418
22688B339269k00885j85817j58652j10405j53788j14872r9959n0126q1479k945
22678A180341O5461J4100J7075L521Q226P5760J29053J88031K74167M15717N22743
22667B894195M23261M8694k78901k18220N4406J29869k2962l47965o29162m97276
22657A555939l10910j54731j22164q5761o2633p6284o0828o4981J0979l5817m892
$$ plain form
22646 587917 610549 601103 532051 466935 441044 423859 460134 507444 513645 523961 511573 465434
22634 465434 414160 425987 412706 392187 428827 471450 468215 423287 385851 342603 328380 332346
22622 332346 357216 367842 406248 444546 452726 513513 574235 607965 545987 520337 508585 487966
22610 487966 481635 437652 399175 299653 177479 167424 195115 164519 92288 87754 120617 180502
22598 180502 174203 181585 151317 60578 60222 79776 135351 135636 118197 86252 51743 10359 -8416
22585 -8416 24198 95957 126506 190252 218941 166785 96088 151915 194415 225091 264826 296975
22573 296975 220214 190823 218175 250538 249919 202222 178730 124168 150653 176672 158048 147033
22561 147033 162034 161402 174907 176371 153253 102955 99229 79824 78028 140566 176690 190851
$$ packed form
22646E87917K2632r446o9052o5116k5891j7185L6275M7310O201J0316j2388m6139
22634D65434n1274J1827j3281k0519L6640M2623l235m4928l7436m3248j4223L966
22622C32346K4870J0626L8406L8298Q180O0787O0722L3730o1978k5650j1752k0619
22610D87966o331m3983l8477r9522j22174j0055K7691l0596p2231m534L2863N9885
22598A80502o299P382l0268r0739l56J9554N5575K85j7439l1945l4509m1384j8775
22585h416L2614P1759L0549O3746K8689n2156p0697N5827M2500L0676L9735L2149
22573B96975p6761k9391K7352L2363o19m7697k3492n4562K6485K6019j8624j1015
22561A47033J5001o32J3505J464k3118n0298l726j9405j796O2538L6124J4161
$$ plain form
22549 190851 194446 203822 227932 154346 54298 65249 52713 -7869 -64796 -62706 -44067 -46409
22537 -46409 -22562 -1884 25803 4064 -13337 -6814 -11451 -33386 20000 59462 45983 18130
22525 18130 48074 32329 -31048 -20403 -24228 1026 22150 8428 16705 -1633 14007 7893
22513 7893 -17054 -26173 58194 67201 52919 73661 87429 102037 70683 2467 -8837 17362
22501 17362 42700 1411 -22764 -43638 -68126 -13321 64387 73659 28374 53350 38497 33238
22489 33238 41579 44617 89492 70582 19335 29263 21950 57696 74113 88441 132313 137759 114610
22476 114610 62034 23151 -54318 -86416 -54589 -43355 -71172 -119944 -108696 -84474 -71537
22465 -71537 -68149 -42503 3708 -41379 -100143 -83691 -43495 -6077 -20883 -11196 40394 -12400
$$ packed form
22549A90851L595R376K4110p3586j00048J0951j2536o0582n6927K090J8639k342
22537d6409K3847K0678K7687k1739j7401O523m637k1935N3386L9462j3479k7853
22525A8130K9944j5745o3377J0645l825K5254K1124j3722Q277j8338J5640o114
22513G893k4947r119Q4367R007j4282K0742J3768J4608l1354o8216j1304K6199
22501A7362K5338m1289k4175k0874k4488N4805P7708R272m5285K4976j4853n259
22489C3238Q341L038M4875j8910n1247R928p313L5746J6417J4328M3872N446k3149
22476A14610n2576l8883p7469l2098L1827J1234k7817m8772J1248K4222J2937
22465g1537L388K5646M6211m5087n8764J6452M0196L7418j4806R687N1590n2794
$$ plain form
22453 -12400 -35157 10835 47876 61290 36626 33470 57139 78773 77840 24504 -67690 -61104
22441 -61104 -53499 -24478 41444 65719 81273 142832 113864 94994 55943 47973 49455 58148
22429 58148 26595 -18324 -66137 -183261 -255516 -253378 -235330 -213092 -303598 -349802 -365082 -377796
22417 -377796 -334521 -254343 -158295 -91197 -113865 -119271 -97824 -127515 -130987 -76383 -54984 -65993
22405 -65993 -92740 -114566 -173503 -158697 -92860 -61563 -96774 -120387 -120143 -118097 -89633 -71100
22393 -71100 -67248 -6023 -28158 -48663 -122024 -140563 -147680 -96540 -72742 -56645 -66384 -99172
22381 -99172 -92004 -83941 -98211 -91939 -90263 -102876 -113821 -140123 -94486 -70624 -44758 9740
22369 9740 -20708 -67487 -79122 -96200 -114681 -99698 -26406 3148 -23396 -29564 -54710 -62065
$$ packed form
22453a2400k2757M5992L7041J3414k4664l156K3669K1634r33n3336r2194O586
22441f1104P605K9021O5922K4275J5554O1559k8968j8870l9051p970J482Q693
22429E8148l1553m4919m7813j17124p2255K138J8048K2238r0506m6204j5280j2714
22417c77796M3275Q0178R6048O7098k2668n406K1447k9691l472N4604K1399j1009
22405f5993k6747k1826n8937J4806O5837L1297l5211k3613K44K046K8464J8533
22393g1100L852O1225k2135k0505p3361j8539p117N1140K3798J6097r739l2788
22381i9172P168Q063j4270O272J676j2613j0945k6302M5637K3862K5866N4498
22369I740l0448m6779j1635j7078j8481J4983P3292K9554k6544o168k5146p355
$$ plain form
22357 -62065 -3543 -16168 -36059 -47345 -21416 -45347 -57968 -89087 -65714 23547 67882 30086
22345 30086 -45996 -36788 -13284 -25967 -69445 -93490 -65529 -53411 -39301 -31999 -44192 -63256
22333 -63256 -50223 -101064 -107029 -53616 -25098 -50129 -30765 19012 8850 -40435 -42449 -64969
22321 -64969 -72353 -31677 -48231 -104513 -150411 -97483 -38726 14636 18969 -21788 -68750 -103408
22309 -103408 -111586 -120036 -108785 -55728 -39684 -81593 -94411 -13947 -10461 -20146 4705 -94930
22297 -94930 -121546 -106518 -132052 -124673 -112923 -73566 -54741 -136302 -142616 -121360 -125759 -127075
22285 -127075 -99479 -95805 -106389 -106842 -123332 -149710 -173003 -107074 -58043 -86259 -83649 -16624
22273 -16624 -22927 -61582 -80030 -39129 -22512 -23901 -17967 -18441 903 17361 22251 47862 36710
$$ packed form
22357f2065N8522j2625j9891j1286K5929k3931j2621l1119K3373Q9261M4335l7796
22345C0086p6082R208K3504j2683m3478k4045K7961J2118J4110P302j2193j9064
22333f3256J3033n0841n965N3413K8518k5031J9364M9777j0162m9285k014k2520
22321f4969p384M0676j6554n6282m5898N2928N8757N3362M333m0757m6962l4658
22309a03408q178q450J1251N3057J6044m1909j2818Q0464L486r685K4851r9635
22297i4930k6616J5028k5534P379J1750L9357J8825q1561o314K1256m399j316
22285a27075K7596L674j0584m53j6490k6378k3293O5929M9031k8216K610O7025
22273a6624o303l8655j8448M0901J6617j389N934m74J9344J6458M890K5611j1152
$$ plain form
22260 36710 17335 -7461 23873 9117 22232 27200 31586 8485 -22840 -27055 -19283 -11071 -21223
22247 -21223 -8356 22101 11977 -32307 -37922 -32099 -4611 11996 -17903 -41242 -21832 -32530
22235 -32530 -54406 -78877 -48443 16297 82329 96742 88238 80436 28409 10865 37013 44539
22223 44539 40411 20484 -5926 -721 13967 5159 30583 117639 184264 211870 276527 311523
22211 311523 364932 417191 425727 497237 681571 973345 1357546 1747711 1995132 2057038 2051381
22200 2051381 2037239 2090970 2037195 1683704 1216757 864830 649200 551205 509490 431541
22190 431541 371705 329466 320329 318643 298086 297265 293817 280407 294824 276681 296372 338300
22178 338300 384149 405638 428893 501768 636025 797712 1101667 1504308 1992521 2388279
$$ packed form
22260C6710j9375k4796L1334j4756J3115M968M386k3101l1325m215P772Q212j0152
22247b1223J2867L0457j0124m4284n615N823K7488J6607k9899k3339J9410j0698
22235c2530k1876k4471L0434O4740O6032J4413q504p802n2027j7544K6148P526
22223D4539m128j9927k6410N205J4688q808K5424Q7056O6625K7606O4657L4996
22211C11523N3409N2259Q536P1510J84334K91774L84201L90165K47421O1906n657
22200B051381j4142N3731n3775l53491m66947l51927k15630r7995m1715p7949
22190D31541n9836m2239r137j686k0557q21l448j3410J4417j8143J9691M1928
22178C38300M5849K1489K3255P2875J34257J61687L03955M02641M88213L95758
$$ plain form
22168 2388279 2570059 2479581 2330708 2350228 2466771 2468554 2156769 1612981 1153813 857442
22158 857442 685190 612792 539221 482237 474394 446382 396083 364293 315463 298163 262053
22147 262053 207847 194702 178739 131189 110328 106143 65943 76865 57807 35339 25851 27549
22135 27549 17499 -3654 -4536 -16668 -69965 -32675 -49506 22782 11127 -28615 -3456 -4761
22123 -4761 -29485 -37495 -22013 15343 48276 13501 41900 55171 12787 18218 41303 9936
22111 9936 -26220 -45146 14100 4639 23849 743 9994 -694 18725 42936 25381 30261
22099 30261 45129 37241 -50597 -113375 -117358 -122591 -169655 -126897 -16263 7809 18612 -10017
22087 -10017 2141 39764 4760 -3627 17417 -400 -40172 -60899 -8816 21360 3882 12820
$$ packed form
22168B388279J81780r0478j48873J9520J16543J783l11785n43788m59168k96371
22158H57442j72252p2398p3571n6984p843k8012n0299l1790m8830j7300l6110
22147B62053n4206j3145j5963m7550k0861m185m0200J0922j9058k2468r488J698
22135B7549j0050k1153q82j2132n3297L7290j6831P2288j1655l9742K5159j305
22123d761k4724q010J5482L7356L2933l4775K8399J3271m2384N431K3085l1367
22111I936l6156j8926N9246r461J9210k3106R251j0688J9419K4211j7555M880
22099C0261J4868p888q7838o2778l983n233m7064M2758J10634K4072J0803k8629
22087a0017J2158L7623l5004q387K1044j7817l9772k0727N2083L0176j7478Q938
$$ plain form
22075 12820 -24520 -31219 -20446 2708 -11559 -54153 -59404 14694 18762 34292 16845 1692
22063 1692 -18414 -56114 -76144 -33678 3543 -15027 -13849 -29859 2721 58178 59462 21102
22051 21102 -12727 -13934 -38865 -21556 -59339 -81812 -58797 -38017 -34529 -35253 -13293 -37756
22039 -37756 -57580 -113902 -93177 -73793 -137641 -164112 -148330 -83686 -17789 19994 -17402 -39986
22027 -39986 -55700 -104667 -120247 -75749 -1502 2538 -62352 -87273 -120316 -170099 -186302 -157696
22015 -157696 -134124 -132433 -135500 -151114 -137000 -106445 -58385 -45255 -10822 -21045 16966 -2645
22003 -2645 -19913 -18536 -19965 -26887 -60375 -77843 -84170 -67848 -45951 -32442 11184 9780 4390
21990 4390 -27291 -43770 -104410 -127543 -144882 -102178 -77083 -95103 -45439 17074 21569 6819
$$ packed form
22075A2820l7340o699J0773K3154j4267m2594n251P4098M068J5530j7447j5153
22063A692k0106l7700k0030M2466L7221j8570J178j6010L2580N5457J284l8360
22051B1102l3829j207k4931J7309l7783k2473K3015K0780L488p24K1960k4463
22039c7756j9824n6322K0725J9384o3848k6471J5782O4644O5897L7783l7396k2584
22027c9986j5714m8967j5580M4498P4247M040o4890k4921l3043m9783j6203K8606
22015a57696K3572J691l067j5614J4114L0555M8060J3130L4433j0223L8011j9611
22003b645j7268J377j429o922l3488j7468o327J6322K1897J3509M3626j404n390
21990D390l1681j6479o0640k3133j7339M2704K5095j8020M9664O2513M495j4750
$$ plain form
21978 6819 -49351 -118876 -108429 -111626 -111446 -93458 -61478 -43050 -13144 -2910 4884 14708 4460
21965 4460 18097 16505 2876 17189 12209 6639 -60195 -45946 4830 -34811 -26903 -12540 -56071
21952 -56071 -81507 -59813 -43434 -51989 -27603 -60218 -106687 -89567 -28501 -77977 -120894 -63732
21940 -63732 -69153 -91166 -76568 -80827 -21945 -14804 -17757 7810 27527 25953 -22459 -1671 -3785
21927 -3785 -9572 15506 56410 20992 3963 -57689 -97427 -46464 -25182 -16555 -20180 13997
21915 13997 31868 13948 -2118 -33187 -69978 -93847 -74102 -98188 -80028 -35660 33311 46809
21903 46809 35613 21220 -21035 -43011 -32520 -69476 -51662 17468 -15163 -776 -31643 -22576
21891 -22576 -22878 -50312 -87770 -88819 -63206 -44063 -64332 -47393 -50403 -32430 -56901 -39023
$$ packed form
21978F819n6170o9525J0447l197J80J7988L1980J8428K9906J0234P794R824j0248
21965D460J3637j592j3629J4313m980n570o6834J4249N0776l9641P908J4363m3531
21952e6071k5436K1694J6379q555K4386l2615m6469J7120O1066m9476m2917N7162
21940f3732n421k2013J4598m259N8882P141k953K5567J9717j574m8412K0788k114
21927c785n787K5078M0904l5418j7029o1652l9738N0963K1282Q627l625L4177
21915A3997J7871j7920j6066l1069l6791k3869J9745k4086J8160M4368O8971J3498
21903D6809j1196j4393m2255k1976J0491l6956J7814O9130l2631J4387l0867R067
21891b2576l02k7434l7458j049K5613J9143k0269J6939l010J7973k4471J7878
$$ plain form
21879 -39023 -56957 -86799 -41052 -5150 35645 55649 59777 58393 66070 42753 38245 -16026
21867 -16026 -25600 -21851 -3006 7050 272 -8006 10130 5273 17899 -8377 -59442 -77160 -82220
21854 -82220 -43733 2038 -869 -8102 -14503 -41379 -13704 -48215 -162240 -197524 -120056 -74780
21842 -74780 -55810 -25661 -103955 -72404 -111534 -86680 -42299 -46228 -64059 -56458 -79889 -85676
21830 -85676 -39732 -5609 10524 54664 11535 -56267 -76168 -90446 -74258 9610 38756 -15671
21818 -15671 -64701 -90951 -84580 -110719 -93728 -80506 -24425 16004 -13375 28710 30610 -21293
21806 -21293 -30494 -30407 7678 -32353 -42323 -51546 -27831 29754 61988 66021 76259 20716 -28131
21793 -28131 -40270 -50223 -59538 -77771 -71136 -60821 -122035 -84308 -8328 -16221 -29644 -673
$$ packed form
21879c9023j7934k9842M5747L5902M0795K0004M128j384P677k3317m508n4271
21867a6026r574L749J8845J0056o778q278J8136m857J2626k6276n1065j7718n060
21854h2220L8487M5771k907p233o401k6876K7675l4511j14025l5284P7468M5276
21842g4780J8970L0149p8294L1551l9130K4854M4381l929j7831P601k3431n787
21830h5676M5944L4123J6133M4140m3129o7802j9901j4278J6188Q3868K9146n4427
21818a5671m9030k6250O371k6139J6991J3222N6081M0429k9379M2085J900n1903
21806b1293r201Q7L8085m0031r970r223K3715N7585L2234M033J0238n5543m8847
21793b8131j2139r953r315j8233O635J0315o1214L7727P5980p893j3423K8971
$$ plain form
21781 -673 35329 25049 34626 14239 -10401 51246 63534 -8093 -53093 -2239 -1504 24648 59541
21768 59541 47259 9132 -26033 -52621 -28751 -66236 -84876 -69580 -88445 -75503 -40022 -25687
21756 -25687 -29166 -36840 -83512 -106740 -112972 -114359 -138997 -141554 -113940 -63881 -42635 -80487 -103554
21743 -103554 -56449 8242 -33201 -86283 -63881 -9937 -18398 -53045 -34375 -12790 -7446 19461
21731 19461 28010 25388 -18580 -89925 -133416 -130882 -71147 4964 33547 14456 -43634 -97200
21719 -97200 -101900 -54666 -28436 -45415 -57506 -29093 -46332 -48973 -83812 -133208 -67903 -11461
21707 -11461 -19117 -54886 -60232 -37699 -63715 -96368 -129003 -102098 -113836 -95866 -9386 56552
21695 56552 61445 39276 9468 -40442 -32310 -10044 4748 -21830 -52649 -58206 -24485 70879
$$ packed form
21781f73L6002j0280R577k0387k4640O1647J2288p1627m5000N0854P35K6152L4893
21768E9541j2282l8127l5165k6588K3870l7485j8640J5296j8865J2942L5481J4335
21756b5687l479p674m6672k3228o232j387k4638k557K7614N0059K1246l7852k3067
21743a03554M7105O4691m1443n3082K2402N3944q461l4647J8670K1585N344K6907
21731A9461Q549k622m3968p1345m3491K534N9735P6111K8583j9091n8090n3566
21719i7200m700M7234K6230j6979j2091K8413j7239k641l4839m9396O5305N6442
21707a1461p656l5769n346K2533k6016l2653l2635K6905j1738J7970Q6480O5938
21695E6552M893k2169k9808m9910Q132K2266J4792k6578l0819n557L3721R5364
$$ plain form
21683 70879 97416 37929 -7196 -23414 -10187 -21352 -53434 -70947 -55911 -18322 -41771 -62301
21671 -62301 -107937 -142812 -116578 -92994 -47514 -29420 -23968 -63339 -111115 -100731 -83316 -84061
21659 -84061 -41765 -17719 2096 -27124 -65922 -94855 -102941 -105037 -55308 4437 -2944 -73060
21647 -73060 -119649 -131827 -92364 -52203 -63336 -48371 -56461 -89047 -108652 -88663 -75041 -81062
21635 -81062 -47153 8569 -50440 -35175 35745 23973 -27152 -14656 14685 -1259 8859 53982
21623 53982 58684 16424 -3374 17799 -16443 -42674 -7471 -52771 -57122 -42659 -22415 -48360
21611 -48360 -84662 -103322 -65066 -96862 -77007 -78141 -129090 -145422 -132738 -84297 -80544 -68671
21599 -68671 -76025 -104098 -132490 -67233 -73865 -115876 -113512 -108508 -68503 -21729 -52496 -22235
$$ packed form
21683G0879K6537n9487m5125j6218J3227j1165l2082j7513J5036L7589k3449k0530
21671f2301m5636l4875K6234K3584M5480J8094N452l9371m7776J0384J7415p45
21659h4061M2296K4046J9815k9220l8798k8933q086k096M9729N9745p381p0116
21647g3060m6589j2178L9463M0161j1133J4965q090l2586j9605J9989J3622o021
21635h1062L3909N5722n9009J5265P0920j1772n1125J2496K9341j5944J0118M5123
21623E3982M702m2260j9798K1173l4242k6231L5203m5300m351J4463K0244k5945
21611d8360l6302j8660L8256l1796J9855j134n0949j6332J2684M8441L753J1873
21599f8671p354k8073k8392O5257o632m2011K364N004M0005M6774l0767L0261
$$ plain form
21587 -22235 -2094 -10871 -1838 -14335 -33801 -69608 -80180 -89390 -46709 -7195 -4825 29387
21575 29387 42820 5128 -29445 -41715 -81626 -66658 -26915 -40156 5113 32967 7494 -45299
21563 -45299 -68100 -105808 -103216 -11096 -12305 5936 6366 -27017 -73339 -79123 -83159 -74846 -15808
21550 -15808 60381 32735 1963 -7594 -75347 -122505 -104964 -79708 -118952 -77480 2278 74653
21538 74653 125983 123974 94695 65976 21824 18525 6214 -59616 -31609 24665 28204 10690
21526 10690 38330 48823 48400 -42901 -76187 -87747 -82635 -86589 -85297 -96994 -18781 18997 100420
21513 100420 110369 39524 36218 89023 23036 -19628 -19256 -31987 -67742 -38775 -60000 -36176
21501 -36176 -26147 -45979 -98828 -72505 -45268 -79167 -88539 -69796 -39805 -62547 -104878 -87957
$$ packed form
21587b2235K0141q777R033j2497j9466l5807j0572r210M2681L9514K370L4212
21575B9387J3433l7692l4573j2270l9911J4968L9743j3241M5269K7854k5473n2793
21563d5299k2801l7708K592R2120j209J8241M30l3383m6322n784m036Q313N9038
21550a5808P6189k7646l0772r557o7753m7158J7541K5256l9244M1472P9758P2375
21538G4653N1330k009k9279k8719m4152l299j2311o5830K8007N6274L539j7514
21526A0690K7640J0493m23r1301l3286j1560N112l954J292j1697P8213L7778Q1423
21513A00420R949p0845l306N2805o5987m2664L72j2731l5755K8967k1225K3824
21501c6176J0029j9832n2849K6323K7237l3899r372J8743K9991k2742m2331J6921
$$ plain form
21489 -87957 -71136 -56578 -20470 -9467 -10394 -45848 2158 -14710 -64052 -120870 -122499 -87563
21477 -87563 -33664 5548 -4049 -84039 -91613 -63656 -72557 -113384 -129935 -45067 34544 49675
21465 49675 35457 63082 44665 32085 41599 83661 26991 24991 69209 47987 24227 -2716
21453 -2716 -7522 -49173 -36869 -32233 -39161 -17507 3032 21409 30831 4637 -22757 -88251 -66685
21440 -66685 -18995 22319 -12956 -9425 -35661 -62332 -33678 12673 20097 34666 52474 13708
21428 13708 -61840 -106995 -95440 -58399 -42446 -23427 -38684 -97891 -85664 -37667 -43880 -16706
21416 -16706 16985 246 120 -22140 -42624 -37675 -58934 -66016 -34930 -38960 -84377 -109153 -109801
21403 -109801 -115012 -96365 -59462 -54175 -23844 -10569 -36828 -83808 -79055 9313 36817 37300
$$ packed form
21489h7957J6821J4558L6108J1003r27l5454M8006j6868m9342n6818j629L4936
21477h7563N3899L9212r597p9990p574K7957q901m0827j6551Q4868P9611J5131
21465D9675j4218K7625j8417j2580R514M2062n6670k000M4218k1222k3760k6943
21453b716m806m1651J2304M636o928K1654K0539J8377R422k6194k7394o5494K1566
21440f6685M7690M1314l5275L531k6236k6671K8654M6351P424J4569J7808l8766
21428A3708p5548m5155J1555L7041J5953J9019j5257n9207J2227M7997o213K7174
21416a6706L3691j6739j26k2260k0484M949k1259p082L1086m030m5417k4776o48
21403a09801n211J8647L6903N287L0331J3275k6259m6980M753Q8368K7504M83
$$ plain form
21391 37300 -19124 -70605 -73423 -93933 -68463 -29921 -45411 -40330 -40275 -58277 -86018 -109855 -94956
21378 -94956 -80777 -48388 -48670 -63240 -31288 -12494 -10568 -25952 -81284 -78674 -66080 -96405
21366 -96405 -141080 -134635 -169867 -157070 -89555 -28250 -26232 -27091 -1917 21052 33004 37564 15170
21353 15170 6891 -29413 -7629 31254 8014 36948 54495 -35581 -70419 -83711 -31256 -12341
21341 -12341 -17562 4088 -14859 -8753 8287 59759 71063 41213 15961 11895 -21399 -15272
21329 -15272 792 156 -72473 -105590 -110695 -47296 7130 -14599 -56930 -89090 -108193 -83679
21317 -83679 -69854 -17588 44822 66856 20514 -15270 6094 -35349 -71943 -59860 -29949 -50136
21305 -50136 -59876 -18716 35544 3492 -14315 -50263 -69455 -28248 -44176 -89770 -100767 -65509
$$ packed form
21391C7300n6424n1481k818k0510K5470L8542j5490N081N5j8002k7741k3837J4899
21378i4956J4179L2389k82j4570L1952J8794J926j5384n5332K610J2594l0325
21366i6405m4675O445l5232J2797O7515O1305K018q59K5174K2969J1952M560k2394
21353A5170q279l6304K1784L8883k3240K8934J7547r0076l4838j3292N2455J8915
21341a2341n221K1650j8947O106J7040N1472J1304k9850k5252m066l3294O127
21329a5272J6064o36p2629l3117n105O3399N4426k1729m2331l2160j9103K4514
21317h3679J3825N2266O2410K2034m6342l5784K1364m1443l6594J2083K9911k0187
21305e0136r740M1160N4260l2052j7807l5948j9192M1207j5928m5594j0997L5258
$$ plain form
21293 -65509 -5283 69134 21823 -41258 -103099 -88238 -70877 -61924 -44624 -15514 -38358 -24147
21281 -24147 347 -31234 -52664 27725 8972 3376 -53497 -92166 -4985 25877 -18461 -4365
21269 -4365 -32448 -31829 -55688 -65312 -66345 -74942 -64023 -88742 -130669 -133533 -163103 -160575 -98416
21256 -98416 344 53326 48866 47679 45990 -17018 -41475 -49754 -31737 2702 -10280 -8685 -7062
21243 -7062 -72020 -116412 -97705 -6751 14815 -13286 -26660 -43112 -31444 -16041 -25051 -50080
21231 -50080 -91652 -26607 26373 64018 44488 64725 44133 18733 -12060 -16521 -45846 3736
21219 3736 15886 -9124 -43381 -1925 27947 14899 -35371 -42824 -81372 -104168 -52789 -26482
21207 -26482 -52718 -51904 -10757 -53404 -59219 -15189 -10389 -1154 11579 -23858 -25778 -3698 -18279
$$ packed form
21293f5509O0226P4417m7311o3081o1841J4861J7361Q953J7300K9110k2844J4211
21281b4147K4494l1581k1430Q0389j8753n596n6873l8669Q7181L0862m4338J4096
21269d365k8083O19k3859r624j033q597J0919k4719m1927k864k9570K528O2159
21256i8416R8760N2982m460j187j689o3008k4457q279J8017L4439j2982J595J623
21243g062o4958m4392J8707R0954K1566k8101j3374j6452J1668J5403r010k5029
21231e0080m1572O5045N2980L7645j9530K0237k0592k5400l0793m461k9325M9582
21219C736J2150k5010l4257M1456K9872j3048n0270p453l8548k2796N1379K6307
21207b6482k6236Q14M1147m2647n815M4030M800R235J2733l5437j920K2080j4581
$$ plain form
21194 -18279 -9702 -38433 -67931 -90833 -82210 -82516 -90848 -121575 -105896 -59199 -4314 2405 2240
21181 2240 -16150 -55517 -53117 -62366 -93360 -92543 -54041 -39549 -65542 -60116 -53030 5281 58115
21168 58115 -31054 -79371 -95265 -72420 -87828 -116138 -64362 7272 4510 -43826 -16285 -8917
21156 -8917 -7932 -33687 -49244 -37444 -30270 -47856 -48975 -3162 -46337 -3444 41846 22266 -63809
21143 -63809 -79527 -75390 -62144 -91773 -110656 -85643 -53333 -51631 -11309 12021 -36638 5516
21131 5516 12155 -13083 -67816 -74709 -29148 -38328 -51865 -47823 -36167 -32394 -14356 -30034 16683
21118 16683 40964 -20899 -24364 -59551 -41022 -22318 -9629 -15626 -80579 -98528 -138625 -148920
21106 -148920 -128795 -86726 -78269 -72074 -23252 21312 18198 15718 8273 -8852 -16902 -21445 21587
$$ packed form
21194a8279Q577k8731k9498k2902Q623l06q332l0727J5679M6697N4885O719j65
21181B240j8390l9367K400r249l0994Q17L8502J4492k5993N426P086N8311N2834
21168E8115q9169m8317j5894K2845j5408k8310N1776P1634k762m8336K7541P368
21156h917R85k5755j5557J1800P174j7586j119M5813m3175M2893M5290j9580q6075
21143f3809j5718M137J3246k9629j8883K5013L2310J702M0322K3330m8659M2154
21131E516O639k5238n4733o893M5561r180j3537M042J1656L773J8038j5678M6717
21118A6683K4281o1863l465l5187J8529J8704J2689n997o4953j7949m0097j0295
21106a48920K0125M2069Q457O195M8822M4564l114k480p445j7125q050m543M3032
$$ plain form
21093 21587 64715 76680 77458 72166 22900 -17796 22454 23850 5358 -34219 5861 45392
21081 45392 4499 -49648 -49568 -47749 -79868 -53754 5561 10809 -21336 -48122 -48625 -88416 -86156
21068 -86156 -90719 -101307 -59948 -59416 -106173 -149310 -135968 -96019 -86946 -46489 -61338 -67347 -73353
21055 -73353 -79584 -80507 -63726 -54357 -47237 35158 36479 -31390 -84792 -100015 -16871 62297 71770
21042 71770 -8321 -28950 -18376 14701 26646 475 37531 49757 34492 58071 63046 55149
21030 55149 -2091 -105230 -56643 11409 15485 16933 -719 -16630 -57136 -19132 -40952 -1162
21018 -1162 21304 40036 39245 26022 -30176 -119842 -128702 -99636 -101825 -138685 -143553 -153578 -131846
21005 -131846 -152573 -134927 -151029 -122287 -25756 22897 -33559 -41504 20891 41414 5688 -68870
$$ packed form
21093B1587M3128J1965P78n292m9266m0696M0250J396j8492l9577M0080L9531
21081D5392m0893n4147Q0J819l2119K6114N9315N248l2145k6786n03l9791K260
21068h6156m563j0588M1359N32m6757m3137J3342L9949R073M0457j4849o009o006
21055g3353o231r23J6781R369P120Q2395J321o7869n3402j5223Q3144P9168R473
21042G1770q0091k0629J0574L3077J1945k6171L7056J2226j5265K3579M975p897
21030E5149n7240j03139M8587O8052M076J448j7652j5911m0506L8004k1820L9790
21018a162K2466J8732p91j3223n6198q9666q860K9066k189l6860m868j0025K1732
21005a31846k0727J7646j6102K8742R6531M8653n6456p945O2395K0523l5726p4558
$$ plain form
20993 -68870 -88867 -35973 20178 55735 40132 -10553 -33630 -99555 -109294 -84393 -26022 13362
20981 13362 595 7295 15036 25614 12329 -3103 -61778 -112466 -134428 -66353 -43314 -19268
20969 -19268 -16577 -82906 -42392 -3830 -1719 -5140 -29056 -71586 -64398 -20723 -66648 -63468 -35673
20956 -35673 -6374 14353 58466 10055 -46088 -42543 -45713 -68197 -68659 -59389 -56179 24269 45514
20943 45514 20756 41327 6146 -30138 -31616 -40206 -68268 -28848 -34446 -43178 -2859 6406 -15665
20930 -15665 -2913 6807 -48079 -78082 -104068 -88522 -70652 -43712 -60511 -38953 -19957 -100323
20918 -100323 -69545 -14229 -14187 -65919 -64660 -37821 -12829 -37771 -56135 -85913 -76897 -89208
20906 -89208 -82378 -112243 -107867 -103057 -62913 -31155 -13063 10933 15481 -23669 -36707 -33998 -33820
$$ packed form
20993f8870j9997N2894N6151L5557j5603n0685k3077o5925r739K4901N8371L9384
20981A3362j2767O700P741J0578j3285j5432n8675n0688k1962O8075K3039K4046
20969a9268K691o6329M0514L8562K111l421k3916m2530P188M3675m5925L180K7795
20956c5673K9299K0727M4113m8411n6143L545l170k2484m62R270L210Q0448K1245
20943D5514k4758K0571l5181l6284j478q590k8062L9420n598q732M0319R265k2071
20930a5665J2752R720n4886l0003k5986J5546J7870K6940j6799K1558J8996q0366
20918a00323L0778N5316M2n1732J259K6839K4992k4942j8364k9778R016j2311
20906h9208O830k9865M376M810M0144L1758J8092K3996M548l9150j3038K709J78
$$ plain form
20893 -33820 -65734 -55105 -32580 -14937 -22382 1585 2097 -27317 -47601 -23523 43152 50883
20881 50883 60244 35969 -5325 -46874 -71369 -64353 11730 37217 1459 24424 15975 20318
20869 20318 2055 -9728 1367 -13185 1719 57124 13024 -8268 15602 24003 -18714 4073
20857 4073 -20856 -47549 -30150 -11749 -564 -22023 -61395 -39048 -61018 -21455 -9252 -32844
20845 -32844 -23907 -30935 -38963 14146 -27137 -66496 -54975 -101351 -122649 -143444 -113414 -112204
20833 -112204 -117612 -81941 -88983 -58845 -43801 25909 8653 -16245 -31535 -14110 7177 21282
20821 21282 40918 30599 -32799 4717 9198 -26795 5598 -28643 -37357 -41225 -30135 -8836
20809 -8836 623 27405 -16457 -58962 -40059 -5587 16121 -3016 -41302 -88488 -24900 27981
$$ packed form
20893c3820l1914J0629K2525J7643p445K3967N12k9414k0284K4078O6675P731
20881E0883R361k4275m1294m1549k4495P016P6083K5487l5758K2965q449M343
20869B0318j8263j1783J1095j4552J4904N5405m4100k1292K3870Q401m2717K2787
20857D073k4929k6693J7399J8401J1185k1459l9372K2347k1970L9563J2203k3592
20845c2844Q937p028q028N3109m1283l9359J1521m6376k1298k0795L0030J210
20833a12204n408L5671p042L0138J5044O9710j7256k4898j5290J7425K1287J4105
20821B1282J9636j0319o3398L7516M481l5993L2393l4241q714l868J1090K1299
20809h836R459K6782m3862m2505J8903L4472K1708j9137l8286m7186O3588N2881
$$ plain form
20797 27981 1790 29078 59086 92470 89593 48547 55967 62511 41053 -5791 -14820 -20654 72524
20784 72524 88645 33266 -22835 -59136 -97588 -63640 -36240 -20838 -30967 -44656 -35598 -54435
20772 -54435 -39725 -208 -1735 -8567 36315 25357 34259 23199 -23354 -69168 -80603 -88971
20760 -88971 -123541 -114580 -108414 -115659 -118590 -120047 -56979 -18059 -24208 -45624 -56916 -8538 -3730
20747 -3730 -47675 -80271 -65438 -42499 -27263 -3997 -26204 -43485 -5530 -15604 -71744 -56326
20735 -56326 -64616 -85072 -66212 -68343 -16704 84069 119937 56952 14217 -5488 -35219 -52789
20723 -52789 -7057 9221 15040 24949 57006 33896 32163 42534 21279 -36758 -64044 1412
20711 1412 32216 -8567 -22874 -79790 -95752 -85334 -66589 -32954 -4542 7850 44754 32437
$$ packed form
20797B7981k6191K7288L0008L3384k877m1046P420O544k1458m6844r029n834R3178
20784G2524J6121n5379n6101l6301l8452L3948K7400J5402j0129j3689R058j8837
20772e4435J4710L9517j527o832M4882j0958Q902j1060m6553m5814j1435q368
20760h8971l4570Q961O166p245k931j457O3068L8920o149k1416j1292M8378M808
20747c730m3945l2596J4833K2939J5236K3266k2207j7281L7955j0074n6140J5418
20735e6326q290k0456J8860k131N1639J00773L5868o2985m2735j9705k9731j7570
20723e2789M5732J6278N819R909L2057k3110j733J0371k1255n8037k7286O5456
20711A412L0804m0783j4307n6916j5962J0418J8745L3635K8412J2392L6904j2317
$$ plain form
20699 32437 42794 69372 14241 25563 17586 15777 -6173 -32248 -8452 -49348 -79187 -75354
20687 -75354 -57682 -15282 -5208 18302 -23168 -30186 -4858 -34644 -52841 -43523 -33801 -58040
20675 -58040 -82702 -82188 -85097 -72566 -85763 -72919 -71040 -95648 -110116 -104891 -78136 -110798 -74064
20662 -74064 -31428 20663 62476 63547 -18892 -109400 -34494 -60220 -40715 14672 -3739 34563
20650 34563 49222 12690 -11676 -61243 -85390 -88422 -56731 -105206 -82960 -40698 19889 -13876
20638 -13876 -44235 -56267 548 -17339 1062 3956 34503 34522 33751 22087 -10777 1319 -38712
20625 -38712 -88955 -91955 -44372 25430 43192 47029 36946 21684 12738 33877 49701 80677
20613 80677 80837 49969 -15314 -49712 -17969 -37174 -61600 -42735 -33098 -33276 -12244 9265 42318
$$ packed form
20699C2437J0357K6578n5131J1322p977j809k1950k6075K3796m0896k9839L833
20687g5354J7672M2400J0074K3510m1470p018K5328k9786j8197R318R722k4239
20675e8040k4662N14k909J2531j3197J2844J879k4608j4468N225K6755l2662L6734
20662g4064M2636N2091M1813J071q2439r0508P4906k5726J9505N5387j8411L8302
20650C4563J4659l6532k4366m9567k4147l032L1691m8475K2246M2262O0587l3765
20638a3876l0359j2032N6815j7887J8401K894L0547J9p71j1664l2864J2096m0031
20625c8712n0243l000M7583O9802J7762L837j0083j5262q946K1139J5824L0976
20613H0677J60l0868o5283l4398L1743j9205k4426J8865R637j78K1032K1509L3053
$$ plain form
20600 42318 6577 -39877 -51586 -67003 -52565 -87745 -58488 -29244 19256 74146 17054 -43256
20588 -43256 -104353 -106117 -58034 -9446 -28731 -20622 6299 -72935 -93645 -11160 62563 43248
20576 43248 49819 53640 3324 3743 43081 32172 3368 7025 12954 -28440 -64438 -55095 -39294
20563 -39294 -61606 -90174 -82148 -43564 -2300 41675 13796 4845 -19728 1746 -12452 -33120
20551 -33120 -17105 24465 35439 -31922 -26197 -7744 -3057 38957 32235 -8274 -40609 -22121
20539 -22121 -40540 21460 -40626 -84310 -42438 -11652 -70122 -63710 -70270 20621 71265 58487
20527 58487 15564 -12278 -52468 -82419 -44190 -35432 -3864 19730 -1947 -14710 -30453 -15543
20515 -15543 14238 73305 59471 7489 6937 31901 36335 62203 91252 61135 44479 36916
$$ packed form
20600D2318l5741m6454j1709j5417J4438l5180K9257K9244M8500N4890n7092o0310
20588d3256o1097j764M8083M8588j9285Q109K6921p9234k0710Q2485P3723j9315
20576D3248O571L821n0316M19L9338j0909k8804L657N929m1394l5998R343J5801
20563c9294k2312k8568Q026L8584M1264M3975k7879q951k4573K1474j4198k0668
20551c3120J6015M1570J0974o7361N725J8453M687M2014o722m0509l2335J8488
20539b2121j8419O2000o2086m3684M1872L0786n8470O412o560R0891N0644j2778
20527E8487m2923k7842m0190k9951L8229Q758L1568K3594k1677j2763j5743J4910
20515a5543K9781N9067j3834n1982n52K4964M434K5868K9049l0117j6656p563
$$ plain form
20503 36916 -21937 -20187 23455 13385 5276 17145 -6296 -83097 -136223 -73194 -74526 -89668
20491 -89668 -39663 -58277 -59674 -71312 -49008 20974 31281 60571 27860 -12243 34152 45502
20479 45502 55319 33832 11955 -7112 -19853 -17038 2692 20422 -4351 1935 18802 -6856
20467 -6856 4299 2317 -31839 -85084 -101419 -49846 41969 63245 35874 -52618 -23342 28426
20455 28426 9042 -7310 -65532 -38296 -21370 -11446 -82652 -105538 -103745 -103475 -71409 -50734
20443 -50734 5576 24309 52590 22582 -17613 -13869 -36311 -32080 -17436 -19251 -48374 -83472
20431 -83472 -59097 -56921 -22652 -3765 26386 37422 10743 -13060 -33073 -2198 26871 -15817
20419 -15817 -37748 -18620 -28872 -54793 -43831 -36171 -11576 33260 42321 4711 18774 -14830
$$ packed form
20503C6916n8853J750M3642j0070q109J1869k3441p6801n3126O3029j332j5142
20491h9668N0005j8614j397j1638K2304O9982J0307K9290l2711m0103M6395J1350
20479D5502R817k1487k1877j9067j2741K815J9730J7730k4773O286J6867k5658
20467f856J1155j982l4156n3245j6335N1573R1815K1276k7371q8492K9276N1768
20455B8426j9384j6352n8222K7236J6926R924p1206k2886J793K70L2066K0675
20443e0734N6310J8733K8281l0008m0195L744k2442M231J4644j815k9123l5098
20431h3472K4375K176L4269J8887L0151J1036k6679k3803k0013L0875K9069m2688
20419a5817k1931J9128j0252k5921J0962P660K4595M4836R061l7610J4063l3604
$$ plain form
20407 -14830 -67078 -20190 -34957 -56122 -85321 -122443 -87429 -82794 -56864 -15247 -27198 -25040
20395 -25040 1926 13669 1198 -42631 -57086 -43540 -39522 -8297 -22584 -46816 -72087 -32834
20383 -32834 -16180 -34111 -35636 -10529 9330 44773 70002 85340 85694 70451 44867 29914
20371 29914 16568 28528 4629 -8343 -7047 5344 12044 66048 100264 63213 19829 8422
20359 8422 -661 -51008 -65918 -31822 -30728 3549 1140 -8113 6816 61467 88635 101843 42023
20346 42023 -6264 -45444 -91854 -78056 -38937 -16080 -26481 12679 -3087 15125 10112 -33661
20334 -33661 -21854 63928 45048 49304 7426 -31798 -35667 -32100 -4043 -1837 -24882 -59401
20322 -59401 -45985 -25791 -42369 -53471 -33676 -28585 -45064 -25016 14013 392 -2300 4832
$$ packed form
20407a4830n2248M6888j4767k1165k9199l7122L5014M635K5930M1617j1951K158
20395b5040K6966J1743j2471m3829j4455J3546M018L1225j4287k4232k5271L9253
20383c2834J6654j7931j525K5107J9859L5443K5229J5338L54j5243k5584j4953
20371B9914j3346J1960k3899j2972J296J2391O700N4004L4216l7051m3384j1407
20359H422r083n0347j4910L4096J094L4277k409r253J4929N4651K7168J3208n9820
20346D2023m8287l9180m6410J3798L9119K2857j0401L9160j5766J8212n013m3773
20334c3661J1807Q5782j8880M256m1878l9224l869L567K8057K206k3045l4519
20322e9401J3416K0194j6578j1102J9795N091j6479K0048L9029j3621k692P132
$$ plain form
20310 4832 -52583 -117213 -76855 -28597 -23258 -48337 -57137 -61503 -76598 -89085 -122329 -114255 -36335
20297 -36335 -5835 10793 3228 -15074 -25085 -31433 -51201 -46086 -35 28442 7884 -1106
20285 -1106 21805 5359 28815 14848 -9143 5266 37585 40726 16851 18052 31090 49251
20273 49251 84969 55586 34128 48895 48474 66075 83291 49734 -12654 -23462 53044 95773
20261 95773 67315 35342 -1905 -40342 -39791 -9061 11586 29435 39508 892 -15751 -11059
20249 -11059 23675 36661 12511 -14048 11569 51658 39953 -11424 -18085 -15567 -3919 30695
20237 30695 64528 100695 59005 13480 -15390 -20591 -590 38615 20600 19290 -3692 -1842
20225 -1842 25174 77645 142667 90235 6383 -25906 -35779 29751 46935 -4926 -62274 -66559
$$ packed form
20310D832n7415o4630M0358M8258N339k5079q800m366j5095j2487l3244Q074P7920
20297c6335L0500J6628p565j8302j0011o348j9768N115M6051K8477k0558q990
20285a106K2911j6446K3456j3967k3991J4409L2319L141k3875J201J3038J8161
20273D9251L5718k9383k1458J4767m21J7601J7216l3557o2388j0808P6506M2729
20261I5773k8458l1973l7247l8437N51L0730K0647J7849J0073l8616j6643M692
20249a1059L4734J2986k4150k6559K5617M0089j1705n1377o661K518J1648L4614
20237C0695L3833L6167m1690m5525k8870n201K0001L9205j8015j310k2982J850
20225a842K7016N2471O5022n2432q3852l2289r873O5530J7184n1861n7348m285
$$ plain form
20213 -66559 -38037 -30830 -27270 -70137 -75908 -26578 15205 -7993 -47264 -36652 -43523 -851
20201 -851 39645 27953 -7500 -36185 -18169 37028 86281 92409 2513 -28147 -13037 28067
20189 28067 17115 19038 46705 52117 13377 -47061 -63995 -114738 -172566 -164595 -162937 -121317
20177 -121317 -12606 74906 123441 67021 -34539 -36812 -15679 -34314 10287 91865 78269
20166 78269 64987 47876 51168 31031 80811 36302 -21860 13556 10188 18651 57910 28189
20154 28189 7919 16278 15179 14267 26604 -6642 -71613 -91099 802 48477 13213 -3554
20142 -3554 -16085 -2972 10923 15070 -1048 -14493 -30304 8604 7068 -27051 10197 -15295
20130 -15295 -79043 -38487 1683 -2870 12818 50018 38341 75455 57312 9869 -38308 -60525
$$ packed form
20213f6559K8522P207L560m2867n771M9330M1783k3198l9271J0612o871M2672
20201h51M0496j1692l5453k8685J8016N5197M9253O128q9896l0660J5110M1104
20189B8067j0952J923K7667N412l8740o0438j6934n0743n7828P971J658M1620
20177a21317J08711Q7512M8535n6420j01560k273K1133j8635M4601Q1578j3596
20166G8269j3282j7111L292k0137M9780m4509n8162L5416l368Q463L9259k9721
20154B8189k0270Q359j099r12J2337l3246o4971j9486R1901M7675l5264j6767
20142c554j2531J3113J3895M147j6118j3445j5811L8908j536l4119L7248k5492
20130a5295o3748M0556M0170m553J5688L7200j1677L7114j8143m7443m8177k2217
$$ plain form
20118 -60525 -91256 -57631 -47648 -62158 -85619 -127420 -113741 -56674 -48482 -25134 8539 27648
20106 27648 -3154 5620 -4588 -86713 -105994 -61106 -14929 -12591 -16509 -37852 -69028 -160265
20094 -160265 -168564 -105577 -45084 -57079 -37282 -18925 -9733 -29572 -44782 -15150 -1759 6196
20082 6196 -15318 -15432 -509 -11286 13570 1294 19819 48924 62222 27585 14740 46366
20070 46366 190 -40956 -61595 -18137 35833 40933 13770 29373 32772 -13843 -3860 -6233
20058 -6233 -788 -3352 20267 -14862 -77102 -35612 -11463 -4976 -36564 -58769 -64249 -6784 -2600
20045 -2600 -41475 -62178 -82528 -72988 -57904 -40148 2319 17268 29030 28584 49277 11213
20033 11213 -36763 -36202 -38871 -57918 -40299 -38495 -60340 -63449 -96948 -61751 -60298 -91780 -73476
$$ packed form
20118f0525l0731L3625R983j4510k3461m1801J3679N7067Q192K3348L3673J9109
20106B7648l0802Q774j0208q2125j9281M4888M6177K338l918k1343l1176r1237
20094a60265q299O2987O0493j1995J9797J8357R192j9839j5210K9632J3391P955
20082F196k1514j14J4923j0777K4856j2276J8525K9105J3298l4637j2845L1626
20070D6366m6176m1146k0639M3458N3970N100k7163J5603L399m6615R983k373
20058f233N445k564K3619l5129o2240M1490K4149O487l1588k2205n480N7465M184
20045b600l8875k0703k0350R540J5084J7756M2467J4949J1762m46K0693l8064
20033A1213m7976N61k669j9047J7619J804k1845l109l3499L5197J453l1482J8304
$$ plain form
20020 -73476 -27487 -68181 -82252 3588 38566 312 20619 76241 85766 88725 66343 61776
20008 61776 20225 -4771 57077 108749 81364 32018 32111 25906 -14659 -25594 3584 60085
19996 60085 28480 -21802 49865 51871 74961 68338 72838 58347 39229 -32748 -47805 25699
19984 25699 53135 51329 65484 26057 25365 -3119 -10616 6523 700 -4516 -7702 18291 70589
19971 70589 62957 43643 3823 -1907 -37725 -53756 17871 53429 36804 20519 24904 38391
19959 38391 53688 61222 32452 20829 -27765 -63928 -28503 1115 -49174 -46817 -21942 28347
19947 28347 41889 51538 67328 66946 49090 82844 94064 80688 64368 71995 61279 71712
19935 71712 39783 43863 68190 109908 96209 13787 -18511 -26557 -2683 18529 66621 111238
$$ packed form
20020g3476M5989m0694j4071Q5840L4978l8254K0307N5622R525K959k2382m567
20008F1776m1551k4996O1848N1672k7385m9346R3o205m0565j0935K9178N6501
19996F0085l1605n0282P1667K006K3090o623M500j4491j9118p1977j5057P3504
19984B5699K7436j806J4155l9427o92k8484p497J7139n823n216l186K5993N2298
19971G0589p632j9314l9820n730l5818j6031P1627L5558j6625j6285M385J3487
19959C8391J5297P534k8770j1623m8594l6163L5425K9618n0289K357K4875N0289
19947B8347J3542R649J5790l82j7856L3754J1220j3376j6320P627j0716J0433
19935G1712l1929M080K4327M1718j3699q2422l2298q046K3874K1212M8092M4617
$$ plain form
19923 111238 101146 68791 -10324 -60829 1504 58606 83542 87705 50812 29369 61812 61846
19911 61846 59884 64189 33946 90965 110108 126166 93866 51197 4555 -8320 -29639 -36146
19899 -36146 -52331 -43603 -33197 50370 53968 45064 11114 -26611 -63862 -10092 35494 87346
19887 87346 111858 66484 28315 532 10742 -6228 18915 4453 5119 -57517 -48524 3117
19875 3117 30163 46418 47878 2544 35946 56597 25900 34621 48804 43957 67660 102026
19863 102026 93046 49764 64839 51947 3477 23117 45761 39901 56632 79205 87237 71552
19851 71552 108195 76418 125556 148655 137481 180179 176058 246250 263642 357035 397593 406075
19839 406075 491731 621754 710657 783717 817824 872062 854988 830702 803398 793030 797062
$$ packed form
19923A11238j0092l2355p9115n0505O2333N7102K4936M163l6893k1443L2443L4
19911F1846j962M305l0243N7019J9143J6058l2300m2669m6642j2875k1319o507
19899c6146j6185Q728J0406Q3567L598q904l3950l7725l7251N3770M5586N1852
19887H7346K4512m5374l8169k7783J0210j6970K5143j4462O66o2636Q993N1641
19875C117K7046J6255J460m5334L3402K0651l0697Q721J4183m847K3703L4366
19863A02026q980m3282J5075j2892m8470J9640K2644n860J6731K2573Q032j5685
19851G1552L6643l1777M9138K3099j1174M2698m121P0192J7392R3393M0558Q482
19839D06075Q5656J30023Q8903P3060L4107N4238j7074k4286k7304j0368M032
$$ plain form
19828 797062 853164 920988 886241 831336 829835 799492 776002 680676 536729 398400 331117
19817 331117 245664 192215 223625 190871 125267 105463 134203 171902 152030 146729 75813 42412
19805 42412 94639 166630 176373 146352 144799 209666 250954 228341 195183 201210 242657 284181
19793 284181 339630 382034 416519 582371 700803 783499 867759 919631 948357 919929 904169
19782 904169 789383 752187 824732 830116 838602 847422 823464 816752 788737 675901 519790 407626
19770 407626 390835 319555 223735 242696 292166 290218 264914 256214 270504 231846 154672 101224
19758 101224 85627 101426 117355 98087 119619 111407 63125 30438 28533 40754 -6601 -20123
19746 -20123 -26729 20574 26382 100888 115627 111984 124178 120204 108127 82658 55012 74394
$$ packed form
19828G97062N6102O7824l4747n4905j501l0343k3490r5326j43947j38329o7283
19817C31117q5453n3449L1410l2754o5604j9804K8740L7699j9872n301p0916l3401
19805D2412N2227P1991R743l0021j553O4867M1288k2613l3158O027M1447M1524
19793B84181N5449M2404L4485J65852J18432Q2696Q4260N1872K8726k8428j5760
19782I04169j14786l7196P2545N384Q486Q820k3958o712k8015j12836j56111j12164
19770D07626j6791p1280r5820J8961M9470j948k5304q700J4290l8658p7174n3448
19758A01224j5597J5799J5929j9268K1532q212m8282l2687j905J2221m7355j3522
19746b0123o606M7303N808P4506J4739l643J2194l974j2077k5469k7646J9382
$$ plain form
19734 74394 85235 29532 30999 58158 12246 -16413 7798 33846 83975 132791 128967 61837
19722 61837 65082 63831 65311 85426 109753 97087 44232 27519 80115 105109 68941 101848
19710 101848 103125 109202 90957 76979 33348 58592 94356 157922 132478 86169 127832 152006
19698 152006 87298 66258 86995 105759 145459 140710 116435 92696 133243 150956 122918 82074
19686 82074 59994 61206 49115 58342 121639 111387 105609 80326 74041 76619 96967 67344 24813
19673 24813 -6031 24930 77307 139458 121973 52024 40204 20772 -1395 77500 102708 85465
19661 85465 94582 95698 76645 66428 57320 27086 25506 76643 107327 118117 106000 161066
19649 161066 170915 155079 123628 82771 109800 123203 89130 111751 188411 258232 307768 442821
$$ packed form
19734G4394J0841n5703J467K7159m5912k8659K4211K6048N0129M8816l824o7130
19722F1837L245j251J480K0115K4327j2666n2855j6713N2596K4994l6168L2907
19710A01848J277O077j8245j3978m3631K5244L5764O3566k5444m6309M1663K4174
19698A52006o4708k1040K0737J8764L9700m749k4275k3739M0547J7713k8038m0844
19686H2074k2080J212j2091R227O3297j0252n778k5283o285K578K0348k9623m2531
19673B4813l0844L0961N2377O2151j7485o9949j1820j9432k2167P8895K5208j7243
19661H5465R117J116j9053j0217r108l0234j580N1137L0684J0790j2117N5066
19649A61066R849j5836l1451m0857K7029J3403l4073K2621P6660O9821M9536J35053
$$ plain form
19637 442821 502357 591827 663994 738472 725843 585254 442620 331650 304225 319223 292132
19626 292132 256992 206039 164007 159167 176356 200087 165509 133632 100489 65370 61726 62510
19614 62510 126163 144356 112021 143319 161928 112668 120610 131043 96282 61931 56105 66499
19602 66499 134513 141792 153890 157200 170623 163684 138291 138513 180496 219435 281686 290467 246129
19589 246129 249839 253202 238854 247394 266950 291574 312403 312597 286154 244672 189077 169289
19577 169289 205394 266335 315737 335285 297602 236667 179149 185287 237967 263625 214977 179646
19565 179646 221903 252757 236035 217087 193914 130606 174066 153043 153835 170891 124183 151585
19553 151585 217696 210294 205015 226403 201826 180190 111529 111873 123894 136585 135391 196600
$$ packed form
19637D42821N9536Q9470P2167P4478j2629j40589j42634j10970k7425J4998k7091
19626B92132l5140n0953m2032m840J7189K3731l4578l1877l3143l5119l644P84
19614F2510O3653J8193l2335L1298J8609m9260P942J0433l4761l4351n826J0394
19602F6499O8014P279J2098L310J3423o939k5393K22M1983L8939O2251Q781m4338
19589B46129L710L363j4348Q540J9556K4624K0829J94k6443m1482n5595j9788
19577A69289L6105O0941M9402J9548l7683o0935n7518O138N2680K5658m8648l5331
19565A79646M2257L0854j6722j8948k3173o3308M3460k1023P92J7056m6708K7402
19553A51585O6111p402n279K1388k4577k1636o8661L44J2021J2691j194O1209
$$ plain form
19541 196600 240197 192012 140483 143338 152196 119746 120095 135213 132523 198609 237558 246470 233385
19528 233385 182753 200312 215626 236856 277431 283860 270433 281052 314478 353881 278546 284366
19516 284366 395513 503542 562227 584815 587378 495439 338408 268229 229141 201058 218778
19505 218778 232131 243149 221783 162698 155918 138629 127766 155747 174913 146753 146196 262932
19493 262932 338364 308204 259674 277282 269828 244563 249171 281901 285627 223155 224192 238946
19481 238946 256807 244267 224595 210504 216117 198095 246040 317979 386844 377749 420950 411832
19469 411832 366844 328095 342589 390286 420887 410833 446249 471117 452277 545644 738912
19458 738912 853044 873645 825468 828207 853060 928402 1028770 1116560 1155440 1100728 1032924
$$ packed form
19541A96600M3597m8185n1529K855Q858l2450L49J5118k690O6086L8949Q912j3085
19528B33385n0632J7559J5314K1230M0575O429j3427J0619L3426L9403p5335N820
19516B84366J11147J08029N8685K2588K563r1939j57031p0179l9088k8083J7720
19505B18778J3353J1018k1366n9085o780j7289j0863K7981J9166k8160n57J16736
19493B62932P5432l0160m8530J7608p454k5265M608L2730L726o2472J037J4754
19481B38946J7861j2540j9672j4091N613j8022M7945P1939O8865r095M3201r118
19469D11832m4988l8749J4494M7697L0601j0054L5416K4868j8840R3367J93268
19458G38912J14132K0601m8177K739K4853P5342J00368Q7790L8880n4712o7804
$$ plain form
19447 1032924 984274 895970 853096 818830 823621 844947 821323 844502 843943 816309 741360 653651
19435 653651 573749 575240 552060 549911 519440 513009 594751 681426 750434 861534 949797 1025442
19423 1025442 1081568 1149037 1187552 1237044 1234896 1140356 1082204 1109413 1172213 1265051 1312347
19412 1312347 1318543 1360909 1456914 1564332 1673969 1711664 1740613 1703025 1640265 1491859 1408506
19401 1408506 1346138 1334680 1386141 1510630 1612777 1692639 1667146 1489210 1343721 1277202
19391 1277202 1237125 1183237 1214807 1180071 1105360 1035798 1001786 982713 967276 948841 1007249
19380 1007249 1059984 1110591 1248664 1428861 1626562 1743447 1776177 1741249 1694668 1583953
19370 1583953 1551981 1564966 1675856 1798294 1912011 2018404 2130142 2159440 2140948 2120847
$$ packed form
19447A032924m8650q8304m2874l4266M791K1326k3624K3179n59k7634p4949q7709
19435F53651p9902J491k3180k149l0471o431Q1742Q6675O9008J11100Q8263P5645
19423A025442N6126O7469L8515M9492k148r4540n8152K7209O2800R2838M7296
19412A312347O196M2366R6005J07418J09637L7695K8949l7588o2760j48406q3353
19401A408506o2368j1458N1461J24489J02147P9862k5493j77936j45489o6519
19391A277202m0077n3888L1570l4736p4711o9562l4012j9073j5437j8435N8408
19380A007249N2735N0607J38073J80197J97701J16885L2730l4928m6581j10715
19370A583953l1972J2985J10890J22438J13717J06393J11738K9298j8492k0101
$$ plain form
19360 2120847 2102912 2125333 2091605 2054599 2119856 2250151 2408047 2603989 2861325 3163236
19350 3163236 3415382 3690646 4000433 4411216 4807678 5190734 5561270 6061405 6669093
19341 6669093 7388149 8300773 9341739 10558601 11959984 13540219 15231647 16944498
19333 16944498 18821084 21075221 23839830 27358487 32270232 39357426 49867859 65523498
19325 65523498 86668340 110025740 129865749 141099134 144135733 145392908 146562050
19318 146562050 142249558 133154200 129664396 137405649 150182266 159005385 158684066 152866096
19310 152866096 146735100 136181315 115244849 89321614 68552153 55401801 47178801
19303 47178801 41843661 38082528 35027224 32490006 30441766 28644642 26824529 25010556
$$ packed form
19360B120847j7935K2421l3728l7006O5257J30295J57896J95942K57336L01911
19350C163236K52146K75264L09787M10783L96462L83056L70536N00135O07688
19341F669093P19056R12624J040966J216862J401383J580235J691428J712851
19333A6944498J876586K254137K764609L518657M911745P087194J0510433J5655639
19325F5523498K1144842K3357400J9840009J1233385L036599J257175J169142
19318A46562050m312492r095358l489804P741253J2776617Q823119l21319n817970
19310A52866096o130996j0553785k0936466k5923235k0769461j3150352q223000
19303D7178801n335140l761133l055304k537218k048240j797124j820113j813973
$$ plain form
19295 25010556 23335196 21985164 21129050 20670306 20530160 20696832 21232259 22239731 23471005
19286 23471005 24735273 26068963 27550056 29497891 32120082 35714557 40879083 48674103
19278 48674103 60574472 78406463 102439294 128734910 150686457 162689667 165447715
19271 165447715 165956012 165216022 157647667 145955506 142516358 152092467 167299701 178364507
19263 178364507 178961307 172317939 164363256 151361160 127303655 98135788 74927795
19256 74927795 60105861 50679340 44384336 39824296 36033380 32712715 29878396 27288956
19248 27288956 24653725 22071961 19691225 17692980 15973023 14441936 13094687 11938379
19240 11938379 11008814 10154707 9411228 8688970 7971912 7357837 6823563 6315001 5870078
$$ packed form
19295B5010556j675360j350032q56114m58744j40146J66672N35427J007472J231274
19286B3471005J264268J333690J481093J947835K622191L594475N164526P795020
19278D8674103J1900369J7831991K4032831K6295616K1951547J2003210K758048
19271A65447715N08297p39990p568355j1692161l439148R576109J5207234J1064806
19263A78364507N96800o643368p954683j3002096k4057505k9167867k3207993
19256G4927795j4821934r426521o295004m560040l790916l320665k834319k589440
19248B7288956k635231k581764k380736j998245j719957j531087j347249j156308
19240A1938379r29565q54107p43479p22258p17058o14075n34274n08562m44923
$$ plain form
19231 5870078 5466226 5112704 4692686 4304732 3939211 3632117 3434758 3323884 3216564
19222 3216564 3033637 2865676 2637561 2380606 2199508 2059333 1941557 1823684 1695745
19213 1695745 1610908 1570755 1497952 1488362 1401237 1302586 1251165 1237861 1206915 1204842 1195091 1209427
19201 1209427 1199352 1220787 1223034 1204492 1212130 1167847 1143737 1156430 1087910 1096003 1095164 1018018
19189 1018018 1024403 1127529 1295030 1396767 1530313 1681368 1743441 1660421 1518118 1439420
19179 1439420 1322249 1253961 1263478 1302333 1383109 1494911 1487432 1404922 1311142 1181004 1014763
19168 1014763 901409 801237 771614 784480 784064 718157 724534 794691 829570 814650 802519
19157 802519 727052 676282 688624 718251 739081 766041 746365 730699 739315 726171 702739 708082
$$ packed form
19231E870078m03852l53522m20018l87954l65521l07094j97359j10874j07320
19222C216564j82927j67961k28115k56955j81098j40175j17776j17873j27939
19213A695745q4837m0153p2803r590q7125r8651n1421j3304l0946k073r751J4336
19201A209427j0075K1435K247j8542P638m4283k4110J2693o8520Q093q39p7146
19189A018018O385J03126J67501J01737J33546J51055O2073q3020j42303p8698
19179A439420j17171o8288R517L8855Q0776J11802p479q2510r3780j30138j66241
19168A014763j13354j00172k9623J2866m16o5907O377P0157L4879j4920j2131
19157H02519p5467n0770J2342K9627K0830K6960j9676j5666Q616j3144k3432N343
$$ plain form
19145 708082 675157 682317 674089 704480 774811 808543 859622 930112 1032403 1137867 1159724
19134 1159724 1205367 1123743 1001706 933743 868321 909311 1005674 1069780 1129025 1111291 1007276
19123 1007276 841250 681353 590499 559626 562854 615336 717383 654354 585172 536049 544043
19112 544043 550693 535565 577515 601573 632960 717294 788887 920636 1064581 1141922 1205606
19101 1205606 1215025 1214221 1235015 1244649 1280991 1292714 1350901 1437894 1439761 1343927 1250543 1114211
19089 1114211 1012729 887115 775075 702404 669250 660538 652901 639806 576118 533078 546683
19078 546683 501049 517944 527657 554955 486069 415587 420681 397567 421480 479560 502647 528624
19066 528624 492404 462432 478242 470805 488455 512637 594005 601448 707720 934479 1143277
$$ packed form
19145G08082l2925P160q228L0391P0331L3732N1079P0490J02291J05464K1857
19134A159724M5643q1624j22037o7963o5422M0990R6363O4106N9245j7734j04015
19123A007276j66026j59897r0854l0873L228N2482J02047o3029o9182m9123P994
19112E44043O650j5128M1950K4058L1387Q4334P1593J31749J43945P7341O3684
19101A205606R419q04K0794R634L6342J1723N8187Q6993J867r5834r3384j36332
19089A114211j01482j25614j12040p2671l3154q712p637j3095o3688m3040J3605
19078E46683m5634J6895R713K7298o8886p0482N094k3114K3913N8080K3087K5977
19066E28624l6220k9972J5810p437J7650K4182Q1368P443J06272K26759K08798
$$ plain form
19055 1143277 1274169 1295922 1372781 1461416 1491514 1489724 1490780 1514804 1527686 1584086 1639601
19044 1639601 1614081 1572110 1596688 1612987 1607551 1630896 1668879 1858994 1984693 1959211 1791699
19033 1791699 1601483 1532505 1604723 1826581 2036885 2113580 1934754 1601966 1302807 1215853
19023 1215853 1173010 1067842 1003370 994114 997065 953440 922162 854591 813793 741286 672469
19012 672469 644230 670000 716942 786404 885769 1044605 1234816 1427972 1567387 1578398 1449129
19001 1449129 1328889 1227147 1242807 1356870 1526897 1642177 1553474 1293289 1079651 969243
18991 969243 941701 970183 1002622 1037185 1042505 1102439 1145932 1093897 1075044 1048978 1039169 1061612
18979 1061612 1116449 1147240 1097815 1061836 1052861 1085497 1055592 1021955 979463 873129 809243
$$ packed form
19055A143277J30892K1753P6859Q8635L0098j790J056K4024J2882N6400N5515
19044A639601k5520m1971K4578J6299n436K3345L7983J90115J25699k5482j67512
19033A791699j90216o8978P2218K21858K10304P6695j78826l32788k99159q6954
19023A215853m2843j05168o4472r256K951m3625l1278o7571m0798p2507o8817
19012F72469k8239K5770M6942O9462R9365J58836J90211J93156J39415J1011j29269
19001A449129j20240j01742J5660J14063J70027J15280q8703k60185k13638j10408
18991I69243k7542K8482L2439L4563N320N9934M3493n2035j8853k6066r809K2443
18979A061612N4837L0791m9425l5979q975L2636k9905l3637m2492j06334o3886
$$ plain form
18968 809243 755277 753990 681539 579341 517380 505734 488220 478453 465762 405910 391862 427701
18956 427701 461162 438913 443504 515318 547641 537365 473315 414036 356783 358030 395805 446561
18944 446561 430731 453259 488216 510373 525885 550125 546768 564241 615545 663985 696182 740290
18932 740290 785698 759575 725236 741584 711422 693670 680995 643456 690911 751725 702235
18921 702235 596711 486136 465120 440302 434508 435361 410717 387271 383676 361632 298704 380903
18909 380903 392778 386619 403234 457180 466425 473176 431084 415192 433524 395724 401505 369054
18897 369054 340702 420983 506977 532224 512804 540925 591932 563151 503052 397937 347030
18886 347030 354780 357639 342284 376933 426717 438183 474538 463919 424160 425559 438291 457642
$$ packed form
18968H09243n3966j287p2451j02198o1961j1646j7514r767j2691n9852j4048L5839
18956D27701L3461k2249M591P1814L2323j0276o4050n9279n7253J247L7775N0756
18944D46561j5830K2528L4957K2157J5512K4240l357J7473N1304M8440L2197M4108
18932G40290M5408k6123l4339J6348l0162j7752j2675l7539M7455O0814m9490
18921G02235j05524j10575k1016k4818n794Q53k4644k3446l595k2044o2928Q2199
18909C80903J1875o159J6615N3946R245O751m2092j5892J8332l7800N781l2451
18897C69054k8352Q0281Q5994K5247j9420K8121N1007k8781o0099j05115n0907
18886C47030P750K859j5355L4649M9784J1466L6355j0619l9759J399J2732J9351
$$ plain form
18874 457642 455643 486679 452062 444561 433719 395195 449726 484659 446795 436063 455278 450759
18862 450759 528267 559901 610793 597413 546227 525686 561288 602333 645363 623148 632470 601731
18850 601731 534002 483918 532415 567320 556011 577216 634071 620320 667737 662212 614229 575995
18838 575995 619233 651902 703708 732655 713906 709250 741744 786458 794735 837268 849394 813954
18826 813954 817396 786781 743282 814572 818089 792806 802508 837313 871568 988442 1038971 1027746
18814 1027746 962739 936835 935984 939816 1041082 1176027 1264577 1430642 1566762 1636710 1697142
18803 1697142 1703451 1677605 1624215 1616617 1681445 1640939 1582088 1611238 1690942 1721388 1684862 1655385
18791 1655385 1648591 1587594 1523949 1421319 1340747 1295769 1251996 1266101 1294558 1297286 1283818
$$ packed form
18874D57642j999L1036l4617p501j0842l8524N4531L4933l7864j0732J9215m519
18862D50759P7508L1634N0892j3380n1186k0541L5602M1045M3030k2215R322l0739
18850F01731o7729n0084M8497L4905j1309K1205N6855j3751M7417n525m7983l8234
18838E75995M3238L2669N1806K8947j8749m656L2494M4714Q277M2533J2126l5440
18826H13954L442l0615m3499P1290L517k5283R702L4805L4255J16874N0529j1225
18814A027746o5007k5904q51L832J01266J34945Q8550J66065J36120O9948O0432
18803A697142O309k5846n3390p598O4828m0506n8851K9150P9704L0446l6526k9477
18791A655385o794o0997o3645j02630q0572m4978m3773J4105K8457K728j3468
$$ plain form
18780 1283818 1322223 1342502 1370560 1369588 1392121 1453867 1611837 1740263 1857772 2017558 2182460
18769 2182460 2328787 2476700 2525753 2517535 2433492 2382541 2366657 2420359 2604548 2913896 3168800
18758 3168800 3425279 3551287 3521920 3550760 3654220 3763484 3802337 3802945 3709660 3756563 4002104
18747 4002104 4336119 4753091 5255900 5703333 6133485 6543700 6951872 7329285 7756327
18738 7756327 8409204 9415758 10976171 13218438 16494452 21400674 28848924 39051237
18730 39051237 49162936 54911381 52536051 42559592 33761092 29812224 29850448 33409449
18722 33409449 40687236 50038143 57172211 57922273 49112982 36345222 27219280 21848743
18714 21848743 18737556 16926426 15719313 14953497 14436835 14004953 13579511 13070762 12599006
$$ packed form
18780A283818L8405K0279K8058r72K2533O1746J57970J28426J17509J59786J64902
18769B182460J46327J47913M9053q218q4043n0951j5884N3702J84189L09348K54904
18758C168800K56479J26008k9367K8840J03460J09264L8853O08r3285M6903K45541
18747D002104L34015M16972N02809M47433M30152M10215M08172L77413M27042
18738G756327O52877J006554J560413K242267L276014M906222P448250J0202313
18730C9051237J0111699N748445k375330r976459q798500l948868L8224L559001
18722C3409449P277787R350907P134068P50062q809291j2767760r125942n370537
18714B1848743l111187j811130j207113p65816n16662m31882m25442n08749m71756
$$ plain form
18705 12599006 12328577 12158217 12076462 12130243 12404851 13013163 13911286 14977080 16249629
18696 16249629 17671866 19217276 20851024 22703789 25171605 28750390 33937351 41545344
18688 41545344 52909114 69053039 87362098 102803011 111161274 112610395 118788722
18681 118788722 132309062 143853884 144526429 132873991 124030782 124074009 126984551 127506429
18673 127506429 127686937 134733087 142952034 141252848 121434218 91921235 69495984 55800810
18665 55800810 47535324 42336074 38636003 35721807 33394632 31488431 29632467 27635834
18657 27635834 25690008 24130090 23051357 22485360 22455460 22942456 23729755 24732420 25755579
18648 25755579 26918236 28201226 29716354 31628007 34393563 38635610 45194940 55090499
$$ packed form
18705A2599006k70429j70360q1755N3781K74608O08312Q98123J065794J272549
18696A6249629J422237J545410J633748J852765K467816L578785N186961P607993
18688D1545344J1363770J6143925J8309059J5440913Q358263J449121O178327
18681A18788722J3520340J1544822O72545j1652438q843209M3227K910542N21878
18673A27506429J80508P046150Q218947j699186j9818630k9512983k2425251j3695174
18665E5800810q265486n199250l700071k914196k327175j906201j855964j996633
18657B7635834j945826j559918j078733n65997k9900M86996P87299J002665J023159
18648B5755579J162657J282990J515128J911653K765556M242047O559330R895559
$$ plain form
18640 55090499 69992456 92779018 125493047 162282282 189011307 191708097 163339455
18633 163339455 126587503 104502904 97746772 103470722 121441626 149600097 177224034
18626 177224034 189936370 175594537 136267609 99090820 75155624 60644653 51476588
18619 51476588 45467451 41343382 38520391 36771013 35676226 34410276 32726986 30794331
18611 30794331 28707742 26860169 25704748 25151780 24951072 24912612 25106699 25875648 26937044
18602 26937044 28078623 29345538 30803363 32776691 35319288 38518101 42677234 48282293
18594 48282293 56200575 67811607 85183816 109719345 138691314 165185278 182830697
18587 182830697 189116147 193188857 198750299 197489272 184657177 176374923 188792893 218235357
$$ packed form
18640E5090499J4901957K2786562L2714029L6789235K6729025K696790k8368642
18633A63339455l6751952k2084599o756132N723950J7970904K8158471K7623937
18626A77224034J2712336j4341833l9326928l7176789k3935196j4510971r168065
18619E1476588o009137m124069k822991j749378j094787j265950j683290j932655
18611C0794331k086589j847573j155421n52968k00708l8460J94087P68949J061396
18602B6937044J141579J266915J457825J973328K542597L198813M159133N605059
18594D8282293P918282J1611032J7372209K4535529K8971969K6493964J7645419
18587A82830697O285450M072710N561442j261027j2832095q282254J2417970K9442464
$$ plain form
18579 218235357 250007809 270272807 269992903 258160958 247765262 229766525 191368674
18572 191368674 144678609 110624191 89969365 77059616 68299265 61848941 56628672
18565 56628672 52196030 48525195 45085512 41603678 38477305 35776372 33382823 31205188
18557 31205188 29518540 28332797 27530213 26991916 26704042 26487314 26367767 26425209 26682361
18548 26682361 27451991 28970991 31418088 35300604 41349778 50768991 65076373 82949926
18540 82949926 99573564 110332691 112203856 110626011 110503345 107004033 95428576 83012418
18532 83012418 79628193 84599298 92692417 99134685 100420354 97617327 95379988 91885003
18524 91885003 82898695 71416546 64852017 64490347 69731759 80728670 95693417 109394451
$$ packed form
18579B18235357L1772452K0264998k79904j1831945j0395696j7998737l8397851
18572A91368674m6690065l4054418k0654826j2909749q760351o450324n220269
18565E6628672m432642l670835l439683l481834l126373k700933k393549k177635
18557C1205188j686648j185743q02584n38297k87874k16728j19547N7442K57152
18548B6682361P69630J519000K447097L882516O049174R419213J4307382J7873553
18540H2949926J6623638J0759127J871165j577845j22666l499312j1575457j2416158
18532H3012418l384225M971105Q093119O442268J285669k803027k237339l494985
18524I1885003q986308j1482149o564529l61670N241412J0996911J4964747J3701034
$$ plain form
18516 109394451 116163723 112933609 107113799 108657584 115214688 119420069 115838865 106094054
18508 106094054 100604573 100739513 100844168 96149594 88302923 84872606 85864048 85924199 80065873
18499 80065873 66830441 53056004 43585578 37650307 33790082 31022209 28923651 27313394
18491 27313394 26102169 25292195 24559242 23898741 23451200 23358913 23632316 24134159 24930071
18482 24930071 26077172 27738926 29941753 32736524 36140450 40622066 47083943 56699357
18474 56699357 69367422 82843501 94523963 102878904 112108807 128110226 146457612
18467 146457612 158368594 158200591 152439007 154624325 164374973 172411733 171119375 162568469
18459 162568469 160376478 166201998 171896942 170793186 165182844 166897736 182311752 210346655
$$ packed form
18516A09394451O769272l230114n819810J543785O557104M205381l581204r744811
18508A06094054n489481J34940J04655m694574p846671l430317R91442O0151n858326
18499H0065873j3235432j3774437r470426n935271l860225k767873k098558j610257
18491B7313394j211225q09974p32953o60501m47541r2287K73403N01843P95912
18482B4930071J147101J661754K202827K794771L403926M481616O461877R615414
18474E6699357J2668065J3476079J1680462Q354941R229903J6001419J8347386
18467A46457612J1910982j68003n761584K185318R750648Q036760j292358q550906
18459A62568469k191991N825520N694944j103756n610342J714892J5414016K8034903
$$ plain form
18451 210346655 242682969 263814165 264375256 234075941 190264022 167215707 168542494
18444 168542494 190010693 220654140 241481594 235597764 192705451 143375899 112322778
18437 112322778 94221259 83117156 76135840 71769052 69102856 67850532 67896482 68408037
18429 68408037 69247768 71626018 76313292 84157390 95263173 108113338 120623507 131816674
18421 131816674 147081253 178113391 226640329 276033136 303746291 291881502 245433134
18414 245433134 212199199 207509613 224227004 254107262 283605663 293531755 263207844
18407 263207844 202943980 151933376 117103734 94607307 79914345 69809137 62449654
18400 62449654 56797624 52399616 48374199 43845810 39518088 35669494 32361917 29535836
$$ packed form
18451B10346655L2336314K1131196N61091l0299315m3811919k3048315J326787
18444A68542494K1468199L0643447K0827454n883830m2892313m9329552l1053121
18437A12322778j8101519j1104103o981316m366788k666196j252324M5950N11555
18429F8408037Q39731K378250M687274P844098J1105783J2850165J2510169J1193167
18421A31816674J5264579L1032138M8526938M9392807K7713155j1864789m6448368
18414B45433134l3233935m689586J6717391K9880258K9498401R926092l0323911
18407B63207844o0263864n1010604l4829642k2496427j4692962j0105208p359483
18400F2449654n652030m398008m025417m528389m327722l848594l307577k826081
$$ plain form
18392 29535836 27059460 24778136 22518870 20450179 18695109 17096321 15611429 14331957
18384 14331957 13297961 12559961 12033575 11527253 10977062 10328317 9616981 8909963 8303045
18375 8303045 7727243 7205738 6660990 6147695 5708948 5355342 5043848 4770723 4567620
18366 4567620 4351737 4060356 3831526 3648267 3510060 3370139 3309107 3196067 3115972 2985868
18356 2985868 2838446 2813554 2844465 2936995 3119254 3334123 3454975 3447984 3313593 3124964
18346 3124964 2979922 2979933 3080763 3215987 3262194 3167813 2953584 2776361 2694101 2581021 2572988
18335 2572988 2537335 2491830 2519754 2583261 2601290 2750533 2915343 3085593 3116796 2975862
18325 2975862 2789184 2700584 2673556 2697705 2760625 2795531 2800278 2668335 2477349 2313560 2191106
$$ packed form
18392B9535836k476376k281324k259266k068691j755070j598788j484892j279472
18384A4331957j033996p38000n26386n06322n50191o48745p11336p07018o06918
18375H303045n75802n21505n44748n13295m38747l53606l11494k73125k03103
18366D567620k15883k91381k28830j83259j38207j39921o1032j13040q0095j30104
18356B985868j47422k4892L0911R2530J82259K14869J20852o991j34391j88629
18346C124964j45042J1J00830J35224M6207r4381k14229j77223q2260j13080q033
18335B572988l5653m5505K7924O3507J8029J49243J64810J70250L1203j40934
18325B975862j86678q8600k7028K4149O2920L4906M747j31943j90986j63789j22454
$$ plain form
18314 2191106 2081618 1929686 1791811 1728914 1699149 1698160 1713066 1760036 1869490 2056866 2227868
18303 2227868 2392825 2523181 2570577 2537550 2489413 2434177 2361830 2318876 2364813 2429304 2540249
18292 2540249 2849659 3182659 3543782 3819704 4010534 4085880 3940511 3560549 3206751 2972996
18282 2972996 2936112 3112665 3376957 3648242 3675313 3445840 3135010 2843174 2632347 2466017
18272 2466017 2396804 2373109 2417953 2490765 2604758 2761130 2912235 2968142 2890755 2778996
18262 2778996 2660623 2635801 2766820 2920282 3008270 3135755 3294845 3412845 3417878 3260715
18252 3260715 3085226 2992788 2933136 2982014 3028467 3102006 3158979 3012053 2790065 2696909 2589087
18241 2589087 2432197 2316298 2253741 2173015 2081578 1961173 1942516 1994910 2053864 2040510 1929979
$$ packed form
18314B191106j09488j51932j37875o2897k9765r89J4906M6970J09454J87376J71002
18303B227868J64957J30356M7396l3027m8137n5236p2347m2954M5937O4491J10945
18292B540249L09410L33000L61123K75922J90830P5346j45369l79962l53798k33755
18282B972996l6884J76553K64292K71285K7071k29473l10830k91836k10827j66330
18272B466017o9213k3695M4844P2812J13993J56372J51105N5907p7387j11759
18262B778996j18373k4822J31019J53462Q7988J27485J59090J18000N033j57163
18252C260715j75489r2438n9652M8878M6453P3539N6973j46926k21988r3156j07822
18241B589087j56890j15899o2557q0726r1437j20405j8657N2394N8954j3354j10531
$$ plain form
18230 1929979 1844143 1822822 1846890 1818826 1765566 1745198 1785990 1759087 1787856 1801834 1756643
18219 1756643 1654198 1505028 1414579 1383882 1410348 1402418 1413902 1466396 1653532 1796862 1844639
18208 1844639 1917879 1910249 1827205 1753029 1643336 1493644 1410589 1379133 1403765 1464027 1537000
18197 1537000 1589447 1543751 1480105 1434602 1363289 1332065 1237042 1144234 1068387 1096830 1080528
18186 1080528 1028869 1043658 1092620 1139635 1134665 1107002 1124584 1099675 1110211 1141479 1189172
18175 1189172 1172256 1173384 1232170 1228462 1135523 1077619 1114177 1174686 1320484 1423891 1533250
18164 1533250 1620399 1685665 1687557 1760498 1935318 2147987 2283899 2200800 2100479 2018046 1929877
18153 1929877 1847773 1775952 1811423 1880010 1969703 1994776 1918039 1764959 1655828 1571471 1528269
$$ packed form
18230A929979q5836k1321K4068k8064n3260k0368M0792k6903K8769J3978m5191
18219A756643j02445j49170r0449l0697K6466p930J1484N2494J87136J43330M7777
18208A844639P3240p630q3044p4176j09693j49692q3055l1456K4632O0262P2973
18197A537000N2447m5696o3646m5503p1313l1224r5023r2808p5847K8443j6302
18186A080528n1659J4789M8962M7015m970k7663J7582k4909J0536L1268M7693
18175A189172j6916J128N8786l708r2939n7904L6558O0509J45798J03407J09359
18164A533250Q7149O5266J892P2941J74820K12669J35912q3099j00321q2433q8169
18153A929877q2104p1821L5471O8587Q9693K5073p6737j53080j09131q4357m3202
$$ plain form
18142 1528269 1616972 1709683 1759515 1770155 1720678 1677701 1625560 1621926 1739352 1864459 1993858
18131 1993858 2048890 2143445 2265512 2411769 2640870 2959934 3432619 4010450 4720555 5563993
18121 5563993 6430068 7287520 8132562 9003376 9996638 11236739 12990951 15779514 20202243
18112 20202243 27525419 39983618 58742309 78305824 89453173 84277867 60523493
18105 60523493 38981437 27197542 20911702 17302423 15069955 13564642 12410277 11597459
18097 11597459 11083831 10248728 9085568 7948592 6997667 6204650 5610913 5221995 4896519
18088 4896519 4652654 4473736 4291487 4134339 3944906 3693117 3491178 3409016 3431622 3621276
18078 3621276 3892662 4168212 4322803 4402878 4405202 4454183 4532842 4532290 4433571 4333806 4178762
$$ packed form
18142A528269Q8703R2711M9832J0640m9477m2977n2141l634J17426J25107J29399
18131A993858N5032R4555J22067J46257K29101L19064M72685N77831P10105Q43438
18121E563993Q66075Q57452Q45042Q70814R93262J240101J754212K788563M422729
18112B0202243P323176J2458199J8758691J9563515J1147349n175306k3754374
18105F0523493k1542056j1783895o285840l609279k232468j505313j154365q12818
18097A1597459n13628q35103j163160j136976r50925p93017n93737l88918l25476
18088D896519k43865j78918j82249j57148j89433k51789k01939q2162K2606J89654
18078C621276K71386K75550J54591Q0075K324M8981P8659n52r8719r9765j55044
$$ plain form
18067 4178762 4012098 3961097 3836416 3667626 3504205 3179538 2745173 2523990 2430099 2286797
18057 2286797 2166006 2165775 2160134 2080368 2039723 2027581 1970812 2002715 1963078 1990188 1963972 1875600
18045 1875600 1859097 1889100 1827206 1733383 1565898 1556939 1543160 1449163 1410659 1424936 1424848 1463054
18033 1463054 1588313 1633427 1627929 1697489 1730194 1781851 1858070 1831532 1827341 1853633 1846049 1819418
18021 1819418 1868013 1951429 2018251 2046303 2052448 2107024 2067182 1935170 1832785 1751502 1676866
18010 1676866 1645744 1630132 1684426 1744730 1823055 1978543 2131285 2361706 2558389 2834368
18000 2834368 3003340 2986528 2931689 3070414 3326713 3729755 4247560 4615801 4705893 4457875
17990 4457875 4161249 4005349 4054103 4157197 4356215 4707755 5165805 5741004 6387197 7088037
$$ packed form
18067D178762j66664n1001j24681j68790j63421l24667m34365k21183r3891j43302
18057B286797j20791k31n641p9766m0645j2142n6769L1903l9637K7110k6216q8372
18045A875600j6503L0003o1894r3823j67485q959j3779r3997l8504J4277q8L8206
18033A463054J25259M5114n498O9560L2705N1657P6219k6538m191K6292p584k6631
18021A819418M8595Q3416O6822K8052O145N4576l9842j32012j02385q1283p4636
18010A676866l1122j5612N4294O0304P8325J55488J52742K30421J96683K75979
18000B834368J68972j6812n4839J38725K56299M03042N17805L68241R0092k48018
17990D457875k96626j55900M8754J03094J99018L51540M58050N75199O46193P00840
$$ plain form
17980 7088037 7841482 8703793 9790000 10973715 12070399 13244859 14651425 16341658
17972 16341658 18219299 20172690 22130031 24195108 26984324 31525168 38963334 51071061
17964 51071061 71023897 102737634 142892170 175897738 185105293 156950121 110028050
17957 110028050 77481486 60242321 51610925 47362917 45517008 44987292 45415733 46534562
17949 46534562 47601778 48305802 49401792 52050489 57272985 66186389 80584218 104037568
17941 104037568 141998385 194055026 243180067 266516308 244492320 183248668 132636959
17934 132636959 106721716 97646544 100851097 116559265 143898317 172324167 187013139
17927 187013139 174603439 134451200 97775335 75869272 63580818 56655259 52792505
$$ packed form
17980G088037P53445Q62311J086207J183715J096684J174460J406566J690233
17972A6341658J877641J953391J957341K065077K789216M540844P438166J2107727
17964E1071061J9952836L1713737M0154536L3005568R207555k8155172m6922071
17957A10028050l2546564j7239165q631396m248008j845909n29716M28441J118829
17949D6534562J067216P04024J095990K648697N222496Q913404J4397829K3453350
17941A04037568L7960817N2056641M9125041K3336241k2023988o1243652n0611709
17934A32636959k5915243r075172L204553J5708168K7339052K8425850J4688972
17927A87013139j2409700m0152239l6675865k1906063j2288454o925559l862754
$$ plain form
17920 52792505 50574435 49265587 48557534 47898612 46989604 46376988 46806656 49161914 54327322
17911 54327322 63832971 80200560 107860590 150334662 198125024 229921410 226627223
17904 226627223 177315461 119365025 83017744 63047236 51624625 44545480 39933685
17897 39933685 36723350 34352075 32402775 29884947 26800331 23848542 21273680 19177501
17889 19177501 17593184 16461042 15515306 14642346 13658366 12501495 11379613 10440314 9475846
17880 9475846 8580443 7873436 7389445 7122571 7052072 6975034 6722424 6316185 5854782 5445988
17870 5445988 5202453 5052220 4921991 4803445 4812399 4870170 5022757 5168887 5385760 5734090
17860 5734090 6096799 6375150 6522756 6686451 6734129 6753580 6920570 7370087 8018287 8709004
$$ packed form
17920E2792505k218070j308848p08053o58922r09008o12616M29668K355258N165408
17911E4327322R505649J6367589K7660030M2474072M7790362L1796386l294187
17904B26627223m9311762n7950436l6347281j9970508j1422611p079145m611795
17897C9933685l210335k371275j949300k517828l084616k951789k574862k096179
17889A9177501j584317j132142r45736q72960r83980j156871j121882r39299r64468
17880I475846q95403p07007m83991k66874p0499p7038k52610m06239m61403m08794
17870E445988k43535j50233j30229j18546Q954N7771J52587J46130K16873L48330
17860E734090L62709K78351J47606J63695M7678J9451J66990M49517O48200O90717
$$ plain form
17850 8709004 9223225 9493800 9498079 9630965 10194932 11152940 12390976 13662643 14689852
17841 14689852 15637785 16944455 18722734 20908469 23530930 26368901 29323485 32470446
17833 32470446 36060151 40689365 47128765 56091608 68934685 88181111 118001819 161707357
17825 161707357 212637520 252502106 262113156 232732985 190862079 170866729 179732867
17818 179732867 211876444 251360512 275212322 263669757 214513422 161139121 126399471
17811 126399471 106775921 95947830 90484671 88932161 91348262 98740387 113355778
17804 113355778 137703561 169913852 199170747 210933818 194447986 159816828 135207427
17797 135207427 131461941 146179700 170600149 189592571 188314433 159268623 118555888
$$ packed form
17850H709004N14221K70575M279J32886N63967R58008J238036J271667J027209
17841A4689852R47933J306670J778279K185735K622461K837971K954584L146961
17833C2470446L589705M629214O439400Q962843J2843077J9246426K9820708M3705538
17825A61707357N0930163L9864586R611050k9380171m1870906j9995350Q866138
17818A79732867L2143577L9484068K3851810j1542565m9156335n3374301l4739650
17811A26399471j9623550j0828091n463159j552510K416101P392125J4615391
17804A13355778K4347783L2210291K9256895J1763071j6485832l4631158k4609401
17797A35207427l745486J4717759K4420449J8992422j278138k9045810m0712735
$$ plain form
17790 118555888 88173466 69572600 57836457 50085408 44687373 40586892 37316290
17783 37316290 34522151 31924960 29135459 26398808 23899478 21622127 19500233 17514360
17775 17514360 15752829 14301427 13239423 12470090 11816436 11187022 10461495 9645602 8780355
17766 8780355 7993373 7338825 6816673 6477166 6174696 5848718 5592044 5259432 4858238
17757 4858238 4533472 4235472 3954665 3738873 3547553 3348039 3093248 2897065 2668914
17748 2668914 2449010 2354839 2348866 2235775 2099460 1983174 1857530 1692486 1548220 1464246
17738 1464246 1450787 1412897 1377387 1331181 1271512 1230532 1237036 1234460 1240595 1220322 1142691 1185017
17726 1185017 1224747 1188292 1103795 1087840 1092420 1073925 1082509 1080313 1019324 984895 973329 950256
$$ packed form
17790A18555888l0382422j8600866j1736143p751049n398035m100481l270602
17783C7316290k794139k597191k789501k736651k499330k277351k121894j985873
17775A7514360j761531j451402j062004p69333o53654o29414p25527q15893q65247
17766H780355p86982o54548n22152l39507l02470l25978k56674l32612m01194
17757D858238l24766k98000k80807k15792j91320j99514k54791j96183k28151
17748B668914k19904r4171n973j13091j36315j16286j25644j65044j44266q3974
17738A464246j3459l7890l5510m6206n9669m0980O504k576O135k0273p7631M2326
17726A185017L9730l6455q4497j5955M580j8495Q584k196o0989l4429j1566k3073
$$ plain form
17714 950256 916206 847077 764181 773346 810967 815398 835601 842766 873635 898114 890565 871751
17702 871751 870815 881567 927426 927666 932925 924955 949140 839918 723886 725012 745857 812986
17690 812986 858756 875758 844990 796910 721057 656785 616554 619417 645136 672980 655175 658562
17678 658562 736643 753308 695203 631239 679813 690215 689581 731925 725475 685210 670647 629870
17666 629870 611087 563656 534146 460732 473912 516494 497363 488951 499631 558339 559054 550487
17654 550487 510703 469372 447323 513719 571705 563068 518421 450461 397768 349491 323375 384499
17642 384499 437018 471871 492536 474011 474786 523408 560438 545521 540583 523481 527275 478196
17630 478196 497316 454256 385264 376810 319451 313575 230047 164521 127749 165473 259926 326044
$$ packed form
17714I50256l4050o9129q2896R165L7621M431K0203P165L0869K4479p549j8814
17702H71751r36J0752M5859K40N259p970K4185j09222j16032J126K0845O7129
17690H12986M5770J7002l0768m8080p5853o4272m0231K863K5719K7844j7805L387
17678F58562P8081J6665n8105o3964M8574J0402o34M2344o450m0265j4563m0777
17666F29870j8783m7431k9510p3414J3180M2582j9131q412J0680N8708P15q567
17654E50487l9784m1331k2049O6396N7986q637m4647o7960n2693m8277k6116O1124
17642C84499N2519L4853K0665j8525P75M8622L7030j4917m938j7102L794m9079
17630D78196J9120m3060o8992q454n7359n876q3528o5526l6772L7724R4453O6118
$$ plain form
17618 326044 333549 361877 415638 407762 297005 199147 153255 222095 270783 282312 301802 291859
17606 291859 262098 243606 225813 217803 259106 338317 353284 354283 373423 377552 401590 423424
17594 423424 490319 487380 357735 189661 75538 41264 82462 143105 223215 331195 350112
17583 350112 231766 183675 185956 187818 193010 271248 334508 392713 409541 360592 328934 348217
17571 348217 348061 278382 237948 262949 328616 359515 396395 491653 544334 504863 464470 446997
17559 446997 390071 294546 297138 275416 277547 281659 267066 216731 161442 155870 162004 172480
17547 172480 169438 148290 234653 280103 353731 406924 370228 389037 418203 304521 221405
17536 221405 228791 240490 278967 281168 288617 310152 263220 213572 206950 238257 277808 343191
$$ packed form
17618C26044P505K8328N3761p876j10757r7858m5892O8840M8688J1529J9490r943
17606B91859k9761j8492j7793q010M1303P9211J4967R99J9140M129K4038K1834
17594D23424O6895k939j29645j68074j14123l4274M1198O0643Q0110J07980J8917
17583C50112j18346m8091K281J862N192P8238O3260N8205J6828m8949l1658J9283
17571C48217j56o9679m0434K5001O5667L0899L6880R5258N2681l9471m0393j7473
17559D46997n6926r5525K592k1722K131M112j4593n0335n5289n572O134J0476
17547A72480l042k1148Q6363M5450P3628N3193l6696J8809K9166j13682q3116
17536B21405P386J1699L8477K201P449K1535m6932m9648o622L1307L9551O5383
$$ plain form
17524 343191 386608 402426 368957 321432 302461 283250 265203 280543 238134 154906 148564 192415
17512 192415 236896 236178 205462 146519 63885 669 38428 101802 73429 55243 50617 27636
17500 27636 -26581 -83209 -72174 -2800 81413 92978 41637 80108 132607 97103 74437 6065
17488 6065 7321 -24491 -61351 -105647 -74548 -26710 37135 97261 61800 -6404 -99114 -150908
17476 -150908 -125377 -100760 -85126 -33847 35433 9819 -1558 11846 20940 40219 42619 16621
17464 16621 25475 16962 39013 37906 38702 52135 71663 24981 29651 16242 32744 36615 97178
$$ packed form
17524C43191M3417J5818l3469m7525j8971j9211j8047J5340m2409q3228o342M3851
17512A92415M4481p18l0716n8943q2634o3216L7759O3374k8373j8186m626k2981
17500B7636n4217n6628J1035O9374Q4213J1565n1341L8471N2499l5504k2666o8372
17488F065J256l1812l6860m4296L1099M7838O3845O0126l5461o8204r2710n1794
17476a50908K5531K4617J5634N1279O9280k5614j1377J3404R094J9279K400k5998
17464A6621Q854q513K2051j107P96J3433J9528m6682M670j3409J6502L871O0563
$$ [...]
##END NTUPLES=NMR SPECTRUM
##END=
