##TITLE=Analysis number 307157
Compound Code cc 35514
Book Reference 413/110
Chemist Name stevem
##JCAMPDX= 6.0         $$ Bruker NMR JCAMP-DX V2.0
##DATA TYPE= NMR SPECTRUM
##DATA CLASS= NTUPLES
##ORIGIN= Bruker BioSpin GmbH
##OWNER= NMR
$$ XWIN-NMR		Version 3.5
$$ Thu Apr 21 14:22:06 2005 GMT Daylight Time (UT+1h)  MAYBRIDGE\NMR@NMR_250MHZ
##.OBSERVE FREQUENCY= 250.131544655141
##.OBSERVE NUCLEUS= ^1H
##.ACQUISITION MODE= SIMULTANEOUS (DQD)
##.ACQUISITION SCHEME= undefined
##.AVERAGES= 16
##.DIGITISER RES= 18
##SPECTROMETER/DATA SYSTEM= dpx250
##.PULSE SEQUENCE= zg30
##.SOLVENT NAME= CDCl3
##.SHIFT REFERENCE= (INTERNAL, CDCl3, 0, 16.522)
##AUDIT TRAIL= $$ (NUMBER, WHEN, WHO, WHERE, WHAT)
$$ ##TITLE= Audit trail, XWIN-NMR		Version 3.5
$$ ##JCAMPDX= 5.01
$$ ##ORIGIN= Bruker BioSpin GmbH
$$ ##OWNER= NMR
$$ C:\u/data/dgb/nmr/ADRS/2020/pdata/1/auditp.txt
$$ ##AUDIT TRAIL=  $$ (NUMBER, WHEN, WHO, WHERE, WHAT)
(   1,<2005-04-21 14:21:45.91 +100>,<MAYBRIDGE\NMR>,<NMR_250MHZ>,
      <created by zg, POWCHK disabled, PULCHK disabled
       configuration hash MD5:
       62 19 C7 07 E1 42 D1 B7 37 6C 3D D0 77 39 F9 E6
       data hash MD5: 64K
       71 F1 78 A5 B8 18 E5 FD 39 AF 0D 01 EF 72 3B 6A>)
(   2,<2005-04-21 14:21:57.23 +100>,<MAYBRIDGE\NMR>,<NMR_250MHZ>,
      <Start of raw data processing
       ef LB = 0.3 FT_mod = 6 PKNL = 1 SI = 32K 
       data hash MD5: 32K
       D3 D6 42 D3 60 F5 74 D7 5E 6C 72 3D 9E D6 AF FB>)
(   3,<2005-04-21 14:21:59.23 +100>,<MAYBRIDGE\NMR>,<NMR_250MHZ>,
      <apk 
       data hash MD5: 32K
       A6 D6 23 8C F8 FB E0 20 F3 F4 95 58 0C 4F 51 99>)
(   4,<2005-04-21 14:22:00.04 +100>,<MAYBRIDGE\NMR>,<NMR_250MHZ>,
      <abs ABSG = 5 
       data hash MD5: 32K
       C0 90 71 82 49 0D 63 45 F2 BE 81 11 86 87 D2 12>)
$$ ##END=
$$ 
$$ hash MD5
$$ 80 D5 8B B7 48 8F 58 FD 40 48 EB 13 77 5C CB EE
##$RELAX= 
##$RELAX= 
##$RELAX= 
##$RELAX= 
##$RELAX= 
##$RELAX= 
##$RELAX= 
$$ Bruker specific parameters
$$ --------------------------
##$DU= <C:\u>
##$EXPNO= 2020
##$NAME= <ADRS>
##$PROCNO= 1
##$TYPE= <nmr>
##$USER= <dgb>
##$AMP= (0..31)
100 100 100 100 100 100 100 100 100 100 100 100 100 100 100 100 100 100 
100 100 100 100 100 100 100 100 100 100 100 100 100 100 
##$AQSEQ= 0
##$AQ_mod= 3
##$AUNM= <au_zg>
##$AUTOPOS= <1 >
##$BF1= 250.13
##$BF2= 250.13
##$BF3= 250.13
##$BF4= 250.13
##$BF5= 500.13
##$BF6= 500.13
##$BF7= 500.13
##$BF8= 500.13
##$BYTORDA= 1
##$CFDGTYP= 0
##$CFRGTYP= 5
##$CHEMSTR= <none>
##$CNST= (0..31)
1 1 145 1 1 1 1 1 1 1 1 1 1 1 1 1 1 1 1 1 1 1 1 1 1 1 1 1 1 1 1 1 
##$CPDPRG= <>
##$CPDPRG1= <>
##$CPDPRG2= <>
##$CPDPRG3= <>
##$CPDPRG4= <mlev>
##$CPDPRG5= <mlev>
##$CPDPRG6= <mlev>
##$CPDPRG7= <mlev>
##$CPDPRG8= <mlev>
##$CPDPRGB= <>
##$CPDPRGT= <>
##$D= (0..31)
0 1 0 0 0 0 0 0 0 0.06 0 0 0 0 0 0 0.0002 0 0 0 0 0 0 0 0 0 0 0 0 0 0 
0 
##$DATE= 1114089704
##$DBL= (0..7)
120 120 120 120 120 120 120 120 
##$DBP= (0..7)
150 150 150 150 150 150 150 150 
##$DBP07= 0
##$DBPNAM0= <>
##$DBPNAM1= <>
##$DBPNAM2= <>
$$ [...]
##$SUBNAM7= <"">
##$SUBNAM8= <"">
##$SUBNAM9= <"">
##$SW= 20.6930455092707
##$SWIBOX= (0..15)
0 0 3 0 0 0 0 0 0 0 0 0 0 0 0 0 
##$SW_h= 5175.983436853
##$TD= 65536
##$TD0= 1
##$TE= 295.16
##$TE2= 300
##$TE3= 300
##$TEG= 300
##$TL= (0..7)
0 120 120 120 120 120 120 120 
##$TP= (0..7)
150 150 150 150 150 150 150 150 
##$TP07= 0
##$TPNAME0= <>
##$TPNAME1= <>
##$TPNAME2= <>
##$TPNAME3= <>
##$TPNAME4= <>
##$TPNAME5= <>
##$TPNAME6= <>
##$TPNAME7= <>
##$TPOAL= (0..7)
0.5 0.5 0.5 0.5 0.5 0.5 0.5 0.5 
##$TPOFFS= (0..7)
0 0 0 0 0 0 0 0 
##$TUNHIN= 0
##$TUNHOUT= 0
##$TUNXOUT= 0
##$USERA1= <user>
##$USERA2= <user>
##$USERA3= <user>
##$USERA4= <user>
##$USERA5= <user>
##$V9= 5
##$VALIST= <valist>
##$VCLIST= <CCCCCCCCCCCCCCC>
##$VD= 0
##$VDLIST= <DDDDDDDDDDDDDDD>
##$VPLIST= <PPPPPPPPPPPPPPP>
##$VTLIST= <TTTTTTTTTTTTTTT>
##$WBST= 1024
##$WBSW= 4
##$XGAIN= (0..3)
0 0 0 0 
##$XL= 0
##$YL= 0
##$YMAX_a= 741726
##$YMIN_a= -634547
##$ZGOPTNS= <>
##$ZL1= 120
##$ZL2= 120
##$ZL3= 120
##$ZL4= 120
##$ABSF1= 16.522
##$ABSF2= -4.171173
##$ABSG= 5
##$ABSL= 3
##$ALPHA= 0
##$AQORDER= 0
##$ASSFAC= 0
##$ASSFACI= 0
##$ASSFACX= 0
##$ASSWID= 0
##$AUNMP= <proc_1d>
##$AZFE= 0.1
##$AZFW= 0.1
##$BCFW= 0
##$BC_mod= 0
##$BYTORDP= 0
##$COROFFS= 0
##$CY= 12.5
##$DATMOD= 1
##$DC= 0
##$DFILT= <>
##$DTYPP= 0
##$F1P= 14.0000005364418
##$F2P= -0.99999901652339
##$FCOR= 0.5
##$FTSIZE= 32768
##$FT_mod= 6
##$GAMMA= 0
##$GB= 0
##$INTBC= 1
##$INTSCL= 1
##$ISEN= 128
##$LB= 0.3
##$LEV0= 0
##$LPBIN= 0
##$MAXI= 10000
##$MC2= 0
##$MEAN= 0
##$ME_mod= 0
##$MI= 0
##$NCOEF= 0
##$NC_proc= -5
##$NLEV= 6
##$NOISF1= 0
##$NOISF2= 0
##$NSP= 0
##$NTH_PI= 0
##$NZP= 0
##$OFFSET= 16.522
##$PC= 1
##$PHC0= -71.02087
##$PHC1= 0.07789507
##$PH_mod= 1
##$PKNL= yes
##$PPARMOD= 0
##$PSCAL= 4
##$PSIGN= 0
##$REVERSE= no
##$SF= 250.13
##$SI= 32768
##$SIGF1= 0
##$SIGF2= 0
##$SINO= 400
##$SIOLD= 32768
##$SREGLST= <1H.CDCl3>
##$SSB= 0
##$STSI= 32768
##$STSR= 0
##$SW_p= 5175.98343685301
##$SYMM= 0
##$S_DEV= 0
##$TDeff= 65536
##$TDoff= 0
##$TI= <Analysis number 999999
Compound Code 99
Book Reference 9
Project Code 9>
##$TILT= no
##$TM1= 0
##$TM2= 0
##$TOPLEV= 0
##$USERP1= <user>
##$USERP2= <user>
##$USERP3= <user>
##$USERP4= <user>
##$USERP5= <user>
##$WDW= 1
##$XDIM= 32768
##$YMAX_p= 490145931
##$YMIN_p= -264933
$$ End of Bruker specific parameters
$$ ---------------------------------
##NTUPLES= NMR SPECTRUM
##VAR_NAME=  FREQUENCY,     SPECTRUM/REAL,   SPECTRUM/IMAG
##SYMBOL=    X,             R,               I
##VAR_TYPE=  INDEPENDENT,   DEPENDENT,       DEPENDENT
##VAR_FORM=  AFFN,          ASDF,            ASDF
##VAR_DIM=   32768,         32768,           32768
##UNITS=     HZ,            ARBITRARY UNITS, ARBITRARY UNITS
##FACTOR=    0.157963299565203, 1,           1
##FIRST=     4132.6476996994, 0,             0
##LAST=      -1043.33573715361, 0,           0
##MIN=       -1043.33573715361, -264933,     0
##MAX=       4132.6476996994, 490145931,     0
$$ Real data points
##PAGE= N=1
##DATA TABLE= (X++(R..R)), XYDATA
$$ [...]
23556f2438M9693K1798j5128q552J2421J2907m8704n1712L8219N8324J4910L962
$$ -62438 -12745 9053 -6075 -14627 -2206 10701 -38003 -89715 -51496 6828 21738 25700
23544B5700N9793Mo5149n817O5365J9202J6064k7820m5625O467n4562k0409P0918
$$ 25700 85493 85497 20348 14531 79896 99098 115162 87342 41717 48184 -6378 -26787 44131
23531D4131M4295k6649n3247k6801l728k7982p1669Q310P9721N4285k0717l2886
$$ 44131 88426 61777 8530 -18271 -21999 -49981 -121650 -113340 -33619 20666 -51 -32937
23519c2937j7164K304N0914O386n642N108k6553l7705N0635J6347o168K5768n0072
$$ -32937 -50101 -47797 3117 9503 3861 8969 -17584 -55289 -4654 11693 5525 31293 -18779
23506a8779J6994P772R649K7764n5921l7620J3746l228m8632m2247L349M5530
$$ -18779 -1785 5987 15636 43400 -12521 -50141 -36395 -39623 -88255 -130502 -127153 -81623
23494h1623R664L758L0608l143M173K0873M5013O1844j1522q1282r9369J0101
$$ -81623 -71959 -68201 -37593 -40736 -36563 -15690 29323 91167 79645 -1637 -101006 -90905
23482i0905J1314O069L2676J6936l2878q1174K1186P7878M7827l274Q349Q671
$$ -90905 -79591 -73522 -40846 -23910 -56788 -137962 -116776 -38898 8929 5655 14004 22675
23470B2675L2093k7387l2293P041P851M2662k984K0145j4546R348m7010r813K6866
$$ 22675 54768 27381 -4912 2129 9980 52642 49658 69803 55257 64605 17595 7782 34648
23457C4648o82n7953m2142o17K9666l8505n2974J6316j352K6085M9920P4443P1321
$$ 34648 33966 -23987 -66129 -66746 -37080 -75585 -128559 -112243 -113595 -87510 -37590 36853 108174
23444A08174k8841m0928N422o0155j7240k696M907L1404k1800j0602l1457M440
$$ 108174 79333 38405 43827 -16328 -33568 -36264 -31357 47 -21753 -32355 -63812 -59372
23432e9372N6048O600J3859o0589J2890l9111o6930N2055J7610l849K3131k0862
$$ -59372 -3324 3276 17135 -43454 -30564 -69675 -136605 -84550 -66940 -70789 -47658 -68520
23420f8520J5466M3370j133n1150m4212l5641J9962K2622M0877L7683K010L6881
$$ -68520 -53054 -9684 -10817 -61967 -106179 -141820 -121858 -99236 -58359 -20676 -18666 18215
23408A8215N986j6594p996J2730j41K9231l4524o8518K2254J9253k3184O1593
$$ 18215 24201 7607 -389 12341 12200 41431 6907 -61611 -39357 -20104 -43288 18305
23396A8305N4304l1820m9793Q123j322j7672P625r891j656K5761l344l1616n229
$$ 18305 72609 40789 -9004 -881 -2203 -19875 -12250 -22141 -23797 1964 -1380 -32996 -38225
23383c8225k7070J4764O7352N3658l4761j9094p65j3961L5036j3748o5010k1794
$$ -38225 -65295 -50531 16821 70479 35718 16624 15859 1898 36934 23186 -41824 -63618
23371f3618O2444j3771j9879L2089L8564K5728r1012p0442j5496M0727M1303M3949
$$ -63618 -1174 -14945 -34824 -2735 35829 61557 -29455 -99897 -115393 -74666 -33363 10586
23359A0586k617n6860K350K7985L8921r346K156K0333P023q3996l2327K0047j3903
$$ 10586 7969 -48891 -46541 -18556 20365 11019 13175 33508 40531 -43465 -75792 -55745 -69648
23346f9648K4007P3903P4003j2041o5788m5115o2079n98L9427M1795l8116M4334
$$ -69648 -45641 28262 102265 90224 24436 -20679 -82758 -83356 -43929 -2134 -40250 4084
23334D084O7018j971j896K1616j3025m5518j0289j4561l7427j1692j913l0480
$$ 4084 71102 69131 67235 88851 75826 30308 20019 5458 -31969 -43661 -45574 -76054
23322g6054R376K9237J6866k4745k7390L7967K0631j8449J4518J6837P217q351
$$ -76054 -66678 -37441 -20575 -45320 -72710 -34743 -14112 -32561 -18043 -1206 6011 -2340
23310b340n2002L5227P475k6676k6894O6459K4822r165P402J2560m0478l9144
$$ -2340 -54342 -19115 -11640 -38316 -65210 1249 26071 16906 24308 36868 -3610 -42754
23298d2754j2163j4280O778O0850j4565O271j3112k9711O9985O1166J2522j7294
$$ -42754 -54917 -69197 -62419 -1569 -16134 -9863 -22975 -52686 17299 78465 90987 73693
23286G3693n8573l1494O0487l6101R582P7184N0087l6535k7854m4756k3231j0674
$$ 73693 15120 -16374 44113 8012 17594 94778 144865 108330 80476 35720 12489 1815
23274A815k5256J3201k8884L6542J5934r078L656j1399l6904k0702m575P859k3390
$$ 1815 -23441 -10240 -39124 -2582 13352 4274 7930 -3469 -40373 -61075 -65650 -57791 -81181
23261h1181K8407J2250l7793k8661q240M4019N4033M2416m9735n7385k4205O1212
$$ -81181 -52774 -40524 -78317 -106978 -115218 -71199 -17166 25250 -24485 -81870 -106075 -44863
23249d4863M7235M3051l9156n535O6083l2576k4021J6753J3633n965J1058J1205
$$ -44863 2372 45423 6267 732 66815 34239 10218 26971 40604 34639 45697 56902
23237E6902l2209k8868P081J7440O400K7550K3424o3226k3274M3646j6815j4818
$$ 56902 24693 -4175 2906 20346 26746 54296 77720 14494 -8780 34866 18051 3233
23225C233K3086m2150m5813m8056j3232M5359J2674M943m606L4995l1152j2578
$$ 3233 26319 -15831 -61644 -109700 -122932 -77573 -64899 -59956 -64562 -29567 -60719 -73297
23213g3297O1607K8196j2892j118m544J1314M1K991m6261m4623L4286o781J4721
$$ -73297 -11690 16506 3614 2496 -2048 9266 9307 12298 -33963 -78586 -44300 -51081 -36360
23200c6360n084m784p744l958K1093O7009o684j9046m4545k1392J8318K0867M7318
$$ -36360 -41444 -46228 -53972 -57930 -36837 30172 23488 4442 -40103 -61495 -43177 -22310 25008
23187B5008j4637L9241N17K239r224J0122r953l2263n2258j2240J7595L6561j3669
$$ 25008 10371 49612 50129 52368 43144 53266 43313 11050 -41208 -53448 -35853 708 -12961
23174a2961l7997J8954R2714K9601k6397J6694m8095l0951l556m3040J0912O7176
$$ -12961 -50958 -32004 60710 90311 63914 80608 32513 1562 -1994 -45034 -34122 33054
23162C3054k3690j443L5462M0173K7753p3455r4448q459J7622p671K3339O055
$$ 33054 9364 7921 43383 83556 111309 37854 -56594 -65053 -47431 -55102 -31763 -25708
23150b5708N441P3497N696n015L3906J5400l1363o4076r1373K7817L3223N6428
$$ -25708 -20267 53230 58926 53911 87817 103217 71854 7778 -83595 -55778 -22555 33873
23138C3873j8143l1651K8727J5335R729p387m0367n2083LN337J2202N4939K5133
$$ 33873 15730 -15921 12806 28141 37870 30483 -9884 -61967 -61964 -56627 -44425 10514 35647
23125C5647j637J0029P148M481R386K0471o4662R429k9910n851J6456J768N6969
$$ 35647 34010 44039 51187 55668 65054 85525 20863 30292 382 -5469 10987 12755 69724
23112F9724k6606r729k8648J4411l580l9522l6921k5805q494J485J0736K0656
$$ 69724 43118 33389 4741 19152 15572 -23950 -60871 -86676 -95170 -93685 -82949 -62293
23100f2293M908L9262N1657k097M33K6504n2771L326k8009J3697Q527m264J6172
$$ -62293 -57385 -18123 33534 31437 31870 58374 5603 8929 -19080 -5383 3144 -1120 15052
23087A5052J4254L0065M681J6285J658l5615o097m3107k7673k3055M3523O836
$$ 15052 29306 59371 64052 80337 81995 46380 40283 -2824 -30497 -53552 -10029 -3193
23075c193k3884n8009O464M4755K4322P1286p050r4l2313m5117n2104j6521M1607
$$ -3193 -27077 -85086 -78622 -33867 -9545 61741 54691 54597 22284 -22833 -74937 -91458 -49851
23062d9851N7812j0746K7171p601p970r181p1860l6603L8291K8639J2509k4896
$$ -49851 7961 -2785 24386 16785 8815 -366 -72226 -108829 -70538 -41899 -29390 -54286
23050e4286j6899M439J0240j8120j8239L0556L301L1624k3724q837M36j2278n865
$$ -54286 -71185 -66746 -56506 -74626 -92865 -62309 -59008 -27384 -51108 -59945 -59509 -71787 -77652
23037g7652J4419n6535k457L8133O1301M4260M4257k5407n3517k7014k7861J2390
$$ -77652 -63233 -119768 -122225 -84092 -22791 21469 65726 40319 -13198 -40212 -68073 -55683
23025e5683K229L2138O3266o3183j13251Q6310P2492o6335j03411L6441M5088
$$ -55683 -53454 -21316 41950 -21233 -134484 -48174 24318 -42017 -145428 -108987 -63899
23014f3899M5353N1627j3617k2854L533k781l838J4968M2800J5958n8574L1210
$$ -63899 -18546 33081 19464 -3390 143 -2638 -6476 8492 51292 67250 8676 39886
23002C9886l1138l1804j9759O771j7700M085M6977K2415r290j2240O2826q404
$$ 39886 8748 -23056 -42815 -36044 -53744 -49659 -2682 19733 10443 -1797 61029 52625
22990E2625m1536k5376K7750l2590l9983K6420r131n9777J8681J5895N1431q804
$$ 52625 11089 -14287 13463 -19127 -59110 -32690 -41821 -101598 -82917 -67022 -15591 -24395
22978b4395m0574j4727J83O75J4393M5709R587O290l0131o0652N5335Q9846p667
$$ -24395 -64969 -79696 -79513 -78838 -64445 -18736 -9149 -2859 -32990 -93642 -38307 51539 43872
22965D3872J7651j2910m52n9843k1901P884k7918n5219J4745Q33L1977k2498p1186
$$ 43872 61523 48613 48161 -11682 -33583 -25699 -53617 -108836 -94091 -93258 -61281 -83779 -154965
22952a54965N738j0994P8181M8709k5328L0141M1674m9832k5118J6965k0289l0262
$$ -154965 -149227 -160221 -82040 -33331 -58659 -28518 13156 -36676 -61794 -44829 -65118 -95380
22940i5380j411K1291J6345J3402L146k3465k3875O01o466J9636N0194Q990k4217
$$ -95380 -96791 -75500 -59155 -45753 -42607 -66072 -89947 -89346 -95812 -76176 -25982 -16992 -41209
22927d1209j8288n357M4616L8507j4464n5835q844J2154J4142n748l0137k011
$$ -41209 -59497 -64854 -20238 18269 3805 -52030 -60874 -48720 -34578 -40326 -70463 -72474
22915g2474k2307j277o2040M001O5960P3184m9347m0799p426K6327L3449R980
$$ -72474 -94781 -96058 -158098 -154097 -88137 -14953 -64300 -105099 -112525 -86198 -52749 -42769
22903d2769l20j1949J3952L6897K7736n1385l4329J5045M654n7016j5139M5484
$$ -42769 -43089 -55038 -41086 -4189 23547 -27838 -62167 -47122 -42468 -99484 -114623 -69139
22891f9139j4413l5664J3555L2306M347j2136M49p395N7748K1191l5594m928K7552
$$ -69139 -83552 -119216 -105661 -73355 -69008 -81144 -80695 -88090 -30342 -9151 -44745 -49673 -22121
22878b2121K961l5942k7674J6106P5121K2668J8831k2066k7899K0711m0385p535
$$ -22121 -19160 -55102 -82776 -66670 8451 31119 49950 27884 -15 20696 -19689 -27224
22866b7224r661l3408K6595R07P0458M5402L635o1519j0947J757m3128j157K7610
$$ -27224 -36885 -70293 -43698 -42791 27667 73069 76704 15185 4238 5995 -37133 -38290 -10680
22853a0680K7506j3801j8102M7639m4762o5477L8992J72L3473M501K4669%K4508
$$ -10680 16826 3025 -15077 32562 -12200 -77677 -38685 -38513 -5040 -539 24130 24130 48638
22840D8638K5461M938p083n7880n1571M268J7041J7599k4286k8685p498J3496
$$ 48638 74099 79037 71954 14074 -37497 -33229 -16188 1411 -22875 -51560 -59058 -45562
22828d5562J3571q961J2900M0426O081p878k7198n602N0269K2681L6013l9418
$$ -45562 -31991 -40952 -28052 12374 18455 10577 -16621 -22223 28046 50727 86740 47322
22816D7322q2774M3984M4317j7355o0552l1762L54O077l5532o298K3527p319n1025
$$ 47322 -35452 8532 52849 35494 -25058 -56820 -56466 -50389 -85921 -92219 -68692 -76011 -127036
22803a27036k4892O7093J00273m652j1696l4904P100k9086k2851J620J9988m889
$$ -127036 -151928 -84835 15438 10786 -910 -35814 -28714 -57800 -80651 -79031 -59043 -63932
22791f3932J6286J8246N624l0931j9980j6398K4519M515O434j5499L6612M7177
$$ -63932 -47646 -29400 -23776 -54707 -74687 -91085 -66566 -62051 -55617 -71116 -34504 12673
22779A2673j0574l2748p609l905O4922j8459m4752M0259P483O746J3525Q43n6529
$$ 12673 2099 -30649 -38258 -42163 22759 4300 -40452 -193 7290 14036 27561 28404 -28125
22766b8125L544N6199L7953n8816o4427k0229J05K795J2248n5050L2684N4131
$$ -28125 -24581 31618 69571 10755 -53672 -73901 -73796 -71001 -58753 -113803 -81119 -26988
22754b6988M9191J8369j7359j6139L0459J0939N669l6k8595j3993j255k0825j6757
$$ -26988 22203 40572 23213 7074 37533 48472 54141 54105 25510 11517 10262 -10563 -27320
22741b7320l5396M4296j508j7297K1700m7717K0343K4858m8114l4755L2297n5
$$ -27320 -62716 -18420 -19928 -37225 -15525 -63242 -42899 -18041 -66155 -100910 -68613 -68668
22729f8668L7471m03J5007k534N463J1768l8205K6230m5924m599l7996k3861M1572
$$ -68668 -31197 -31600 -16593 -19127 -13664 -1896 -40101 -13871 -59795 -64394 -102390 -126251 -84679
22716h4679P6616q489l4587K5187J0904l7232K128j1296N592o2518k9515P1255
$$ -84679 -8063 -16552 -51139 -25952 -15048 -52280 -50152 -61448 -55856 -118374 -147889 -76634
22704g6634M2113o363j1003J9956k0056q307m78J4857O719j8572k5277J8991K8625
$$ -76634 -34521 -40884 -51887 -31931 -51987 -60294 -60772 -45915 -39196 -57768 -83045 -64054 -35429
22691c5429r711K444k7687O80L4872K6408l5492l3890N1629N2857L4784k4237
$$ -35429 -45140 -42696 -70383 -69703 -34831 -8423 -43915 -77805 -26176 26681 61465 37228
22679C7228n1076m5975p4115r775R45M4143M9067J4601L095j130n5084j3885M3790
$$ 37228 -13848 -59823 -133938 -143713 -142768 -98625 -49558 -34957 -31862 -32992 -88076 -101961 -58171
22666e8171M6817N267m3079Q28N571j3108R1M2868O3813n9m0715O835k1883l7184
$$ -58171 -11354 -6087 -49166 -48338 -42767 -55875 -55784 -12916 50897 50838 10123 16958 -4925 -42109
22652d2109m797N3076N028j7198K3824R9124K5447Q216k5717j3080j1931k1006
$$ -42109 -46906 6170 11198 -6000 17824 116948 142395 150611 124894 111814 99883 78877
22640G8877p1613k1530k8083J3827K7687O5562l7283K3368M9684m6738k3839l7410
$$ 78877 7264 -14266 -42349 -28522 -835 64727 27444 50812 100496 53758 29919 -7491
22628g491J1555M0880j6526k2123K7333j6548k3743K8833k3338o6542m2256K242
$$ -7491 4064 44944 28418 6295 33628 17080 -6663 22170 -1168 -67710 -109966 -107724
22616a07724P4059K3248l0567J2187k8953k5931j8338L8516K0251k4748m0841
$$ -107724 -33665 -10417 -40984 -28797 -57750 -83681 -102019 -63503 -43252 -68000 -108841
22605a08841n59M1480M9318K7091n72j4050n865K8971o1410k2094j8042M0701
$$ -108841 -109400 -67920 -18602 8489 7917 -6133 -11998 16973 -44437 -66531 -84573 -43872
22593d3872L8476k106J7688L8897k9492m2943m2262n059L0426K0334Q550R974
$$ -43872 -5396 -7502 10186 49083 19591 -23352 -65614 -70673 -40247 -19913 -11363 -1389
22581a389L8127J8013j4537o6517j8113O2464o852j2244m3372J7285L6283J5208
$$ -1389 36738 54751 40214 -26303 -44416 18048 11196 -1048 -44420 -27135 9148 24356
22569B4356l605l6994k4989J1734L4978J9454l7982k4762L7882j8984J3763j9460
$$ 24356 20751 -16243 -41232 -29498 5480 24934 -13048 -37810 72 -18912 -5149 -24609
22557b4609m729k2670p88Q911q587p092M1872L0361j5330k2998j6308J146n709
$$ -24609 -29338 -52008 -52796 -43885 -52472 -59564 -17692 12669 -2661 -25659 -41967 -40821 -46530
22544d6530k1963K5303O3751R052o376l8626n378P841o995K0943k062O2351K3030
$$ -46530 -68493 -43190 20561 29613 23237 -15389 -20767 -12926 -19921 1022 -1040 61311 84341
22531H4341k3378J2581P077O95m3576O566j0503m1267l8983k0913Q387L1152j7064
$$ 84341 60963 73544 80621 81316 37740 44306 33803 -7464 -46447 -67360 -58973 -27821 -44885
22518d4885n5131j150K9010J3583k2808J9471K5045J7922q348K9207Q079q313
$$ -44885 -100016 -101166 -72156 -58573 -81381 -61910 -36865 -18943 -27291 1916 9995 1682
22506A682l3026n9580N1351L2989q311l5995K0283O638L8620j1785n9937o6303
$$ 1682 -31344 -90924 -39573 -6584 -14895 -50890 -30607 -23969 14651 2866 -57071 -123374
22494a23374J5022Q2704M9072q638j8528l370j2399J8960o718k2759n7106j4852
$$ -123374 -108352 -25648 23424 14786 -3742 -7112 -19511 -551 -7269 -30028 -87134 -101986
22482a01986M0674l6559n3273K4734N3743L6063K0050J062k9865j4083q805J901
$$ -101986 -61312 -97871 -151144 -126410 -72667 -36604 -16554 -15492 -45357 -59440 -68245 -66344
22470f6344K1637J043J2340m510k8347M6960N7310L6757q2870n3570k7977p730
$$ -66344 -44707 -43664 -31324 -35834 -64181 -17221 40089 76846 -6024 -59594 -87571 -95301
22458i5301L5782K3595J0603m0713l2445J0646J5241N3104P9718l3564n6154J7330
$$ -95301 -59519 -35924 -25321 -66034 -98479 -87833 -72592 -19488 60230 26666 -29488 -12158
22446a2158J7408j0922j8562L2188o446K2409j7483j7962j1167J9492m2987k6261
$$ -12158 5250 -5672 -24234 7954 1508 23917 6434 -11528 -22695 -3203 -46190 -72451
22434g2451L6927M3009R726J7777k2105l9745l6006N073L5359p562J4637l309
$$ -72451 -35524 7485 17211 34988 12883 -26862 -62868 -57795 -22436 -29998 -15361 -18670
22422a8670p8650m3403L3354M6447M800P8472J1635j8094n668k8540J2310l9457
$$ -18670 -97320 -140723 -107369 -60922 -56122 22350 33985 15891 10223 -18317 -6007 -45464
22410d5464j9579j4280K1443k3571n698K7557L2473j1727o0946m4413O3196N1174
$$ -45464 -65043 -79323 -57880 -81451 -87149 -59592 -27119 -38846 -99792 -144205 -81009 -29835
22398b9835j0673o6885k3308R953K3161N3476K094o3236J1128R5418N1986n0293
$$ -29835 -40508 -107393 -130701 -120748 -97587 -44111 -42017 -105253 -94125 1293 53279 2986
22386B986l5540J5404k6409p62O374M3229l6349J3198J4503j3836k0445N319J8649
$$ 2986 -32554 -17150 -43559 -44321 -37947 5282 -31067 -17869 -3366 -17202 -37647 -32328 -13679
22373a3679k4298p038q527j143q222n986k348L167K5846l9716Q166N9P2239L2502
$$ -13679 -37977 -45015 -53542 -54685 -62907 -68893 -71241 -68074 -42228 -81944 -73778 -73719 -1480 31022
22359C1022p293J2497L996K324L9776j5849m0672k0699K5987M5681L4997m465
$$ 31022 23729 36226 40222 42546 82322 66473 25801 5102 31089 76770 111767 107302
22347A07302J4637J4671q220o1587j9008m3807L5939J2208q2568K429L1910J1730
$$ 107302 121939 136610 128390 66803 47795 3988 39927 52135 -30433 -28004 3906 15636
22335A5636m0150k0703N2658L5744K4278N209o64r219k6853r7616n7759k9732
$$ 15636 -24514 -45217 7441 43185 67463 72672 72008 62789 35936 -61680 -119439 -149171
22323a49171k736L1392M3827L2744K7003J97J3103K4812k96j9564K6208L4151
$$ -149171 -151907 -120515 -76688 -43944 -16941 -16744 -3641 21171 20875 1311 27519 61670
22311F1670R709L7391L544m4050k8642k9299m8568l5250P622K8323l311J4608
$$ 61670 71379 108770 112314 68264 39622 10323 -38245 -73495 -65873 -37550 -40861 -26253
22299b6253K2528K3243m0433j9093N8798j6724k9191k5908j8622K384O161k0847
$$ -26253 -3725 19518 -20915 -40008 18790 2066 -27125 -53033 -71655 -69271 -63110 -83957
22287h3957R176Q32L6450K9192O774J712n419k6000L8287K8761m41k7274l457
$$ -83957 -74781 -73949 -37499 -8307 -1533 179 -5240 -31240 7047 35808 35367 8093 4636
22274D636l7828j6902N007K3355n2854l6316m6175J7165N6197o891K0683M4592
$$ 4636 -33192 -50094 -45087 -21732 -74586 -110902 -157077 -139912 -83715 -90606 -69923 -25331
22262b5331j0087L6232K971k5933L4554M8456j5455q1684L869p396l199J7595
$$ -25331 -35418 814 3785 -22148 12406 60862 45407 -36277 -32408 -39804 -43003 -25408
22250b5408M616m4515n410L4350K7299l5881j5707L8479L8554k0872l4305J2759
$$ -25408 -20792 -65307 -70717 -36367 -9068 -44949 -60656 -22177 16377 -4495 -38800 -26041
22238b6041q270J0706N373J1633K67k5359j6133L9483j3655K125P0956m416k6175
$$ -26041 -34311 -23605 -18232 -6599 -6332 -31691 -47824 -8341 -21996 -19871 51085 46669 20494
22225B0494l1651K4403k8539N1926q018o7103q4625m64N9762K6375o6502k2752
$$ 20494 -11157 13246 -15293 36633 28615 -38488 -123113 -123577 -63815 -37440 -103942 -126694
22213a26694M6155L7651n384n9929j2921J738R329O2435N8075L5309o001k0735
$$ -126694 -80539 -42888 -48272 -108201 -121122 -119384 -110055 -47620 10455 45764 39763 19028
22201A9028m5727J781J1078J0835L2290K3733o8483l5195J2846k4889L6781O2670
$$ 19028 -26699 -24918 -13840 -3005 29285 53018 -15465 -50660 -37814 -62703 -25922 36748
22189C6748n886k3757M086n1060K091P6161m3443k7665J3890m2957J4498K3534
$$ 36748 30862 7105 11191 -39869 -37778 38383 -5060 -32725 -18835 -61792 -47294 -23760
22177b3760L538q832P072Q86j860n595m794m4418N25J5604J4904N1702J7370o595
$$ -23760 -20222 -29054 -21982 -21096 -22956 -28551 -33345 -77763 -77238 -61634 -46730 4972 22342 15747
22163A5747q838M049m5241q0Q7695n1582o6819m2420q135L8559L6076j569j8730
$$ 15747 6909 10958 -34283 -34363 53332 1750 -65069 -107489 -115624 -77065 -40989 -42558 -61288
22150f1288m831q583Q962N9561K7928j1182N2404o1479m4805L8432K103J2002
$$ -61288 -66119 -74702 -65740 -6179 21749 10567 62971 1492 -43313 -4881 -2778 9224
22138I224J396J8129j1829k6269l632K5744J3586j1331m9219l0980J5475J7264
$$ 9224 10620 28749 16920 -9349 -12981 12763 26349 15018 -34201 -65181 -49706 -32442
22126c2442j8477K0540M3121j1382k6723m1570m8110P093J7394K5541K0305J9344
$$ -32442 -50919 -30379 12742 1360 -25363 -66933 -115043 -107950 -90556 -65015 -44710 -25366
22114b5366j1263n780r838l2149L6076Q1270j4572m6318m21j6386J0578J4687
$$ -25366 -36629 -42409 -52247 -84396 -48320 32950 18378 -27940 -28361 -44747 -34169 -19482
22102a9482K6162K0971o151p465m7616k387J2738o132J3075l2155o833l3068K5005
$$ -19482 6680 27651 21500 14035 -33581 -35968 -23230 -29362 -16287 -48442 -55275 -88343 -63338
22089f3338J5536m0940K5269r710l6493J3302L7336O0342J4941k9406l7176J9160
$$ -63338 -47802 -88742 -63473 -73183 -109676 -96374 -59038 1304 16245 -13161 -50337 -31177
22077c1177m7530N653J6900j5286l4535k899P2781k2060k2575j9030K0605k0842
$$ -31177 -78707 -73054 -56154 -71440 -105975 -108874 -36093 -58153 -80728 -99758 -79153 -99995
22065i9995l608L6726L5776j2121k1399m7306m3824K7185M4542O962k8149N5899
$$ -99995 -103603 -66877 -31101 -43222 -64621 -111927 -155751 -128566 -84024 -77062 -105211 -49312
22053d9312M4292l1522m4648M9343L9474l107m530P5470K7146l4107q7517k4691
$$ -49312 -5020 -36542 -81190 -31847 7627 4520 -10 75460 102606 68499 -19018 -43709
22041d3709j5562L667L6794r617j1957L866k1939j4L8322r4999j1955N8596K4381
$$ -43709 -59271 -55604 -18810 -28427 -40384 -36518 -58457 -58471 -20149 -115148 -127103 -68507 -44126
22028d4126J3928J506j2052O858N1306m9354k8166M1937N9332L006j7988o941
$$ -44126 -30198 -28692 -40744 -33886 17420 -31934 -60100 -18163 41169 44175 26187 19246
22016A9246k0992M592k4658K9795k0669L1676O5569M411l7698n9284k5826j9622
$$ 19246 -1746 2846 -21812 7983 -12686 18990 84559 88970 51272 -8012 -33838 -53460
22004e3460J9271k042K059P081J9363L137m9647P251R256K080j5600J4467L3385
$$ -53460 -34189 -36231 -34172 -27091 -7728 -4591 -54238 -46987 -37731 -35651 -51251 -36784 -3399
21991c399K1136o214j2830K7933m3145j0543M8283L5360J9696j6045o8718m4924
$$ -3399 17737 11523 -1307 26626 -16519 -27062 21221 56581 76277 60232 -8486 -53410
21979e3410M047l8139l272K9397R586M060n9236O3490J13577r886j7234l6107
$$ -53410 -49363 -87502 -90774 -61377 -51791 -47731 -106967 -43477 70100 60214 42980 6873
21967F873j1218J3409j8581J7786l417N64m3589j1319k0450Q884J7933j5242j8512
$$ 6873 -4345 9064 -9517 8269 4852 5416 -38173 -49492 -69942 -61058 -43125 -58367 -76879
21954g6879L8784n387J974k091J7212k695L3935J1011L556J3343J6082r402j7288
$$ -76879 -38095 -43482 -41508 -43599 -26387 -29082 4853 15864 19420 32763 48845 39443 22155
21941B2155o0370q774L3550L6487K986j0142P674N491m5571l1575N6392J1936
$$ 22155 -38215 -46989 -13439 23048 26034 15892 23566 29057 -16514 -48089 8303 20239
21929B0239k2289K1099K4602J7159J5065o4427k840l3379k9072K5365m2382j0506
$$ 20239 -2050 19049 43651 60810 75875 11448 8608 -24771 -53843 -28478 -70860 -81366
21917h1366j9982K481Q811N6587L4950J7316m6916o182l259k6765K2283L7538
$$ -81366 -101348 -98867 -90056 -33469 1481 18797 -28119 -34301 -37560 -64325 -42042 -4504
21905d504j4676k4626N7843K4448l0773k3909k7846K67o064m6604N4466P0511
$$ -4504 -19180 -43806 14037 38485 7712 -16197 -44043 -43776 -49840 -96444 -41978 28533
21893B8533L1744k3981o5442j6079J575j0890j8012J5783N5864O860L8954N2930
$$ 28533 60277 36296 -29146 -45225 -43650 -54540 -72552 -56769 -905 5955 44909 97839
21881I7839l0646n8025J905J4083J1567k8840l8087k3230N1203L6984R640k932
$$ 97839 67193 9168 11073 25156 36723 7883 -30204 -53434 -2231 34753 44393 41461
21869D1461l7337k6263L480k017L376J9859N9613r768J1771j4572j6444k0181
$$ 41461 4124 -22139 -18659 -20676 -17300 2559 62172 52404 64175 49603 33159 12978
21857A2978j7011m4511j1034p400l7743M0711L7902m161k9695l1574J2007J6384
$$ 12978 -4033 -48544 -59578 -66978 -104721 -64010 -26108 -30269 -59964 -91538 -79531 -63147
21845f3147k5655k1821M1384J4932k4726Q984K6147M2747L4637k7983o9317n8725
$$ -63147 -88802 -110623 -69239 -54307 -79033 -70049 -43902 -1155 33482 5499 -63818 -122543
21833a22543J9875J8512R1382n860k5726j5937k3301K4588L3975j1900l5929K1686
$$ -122543 -102668 -84156 7226 1366 -24360 -40297 -63598 -39010 -5035 -16935 -52864 -31178
21821c1178K1060n0393L0841j3779m4394n1205k8824k1419L9771O1916L3036l2351
$$ -31178 -10118 -60511 -29670 -43449 -87843 -139048 -167872 -189291 -149520 -87604 -54568 -86919
21809h6919m5826j1382L2086J8577N1006K91n9248P541R077K3630j3062J2190
$$ -86919 -132745 -144127 -112041 -93464 -42458 -42167 -101415 -93874 -84797 -61167 -74229 -62039
21797f2039K7127J0407j9908J1574j6449n4992L4340L4365j3082j4591J3435J3379
$$ -62039 -34912 -24505 -44413 -32839 -49288 -104280 -69940 -35575 -48657 -63248 -49813 -36434
21785c6434k7592j2732J7782N2398N226K7753j3490k9453j9639l168l640k5919
$$ -36434 -64026 -76758 -58976 -6578 -1352 26401 12911 -16542 -36181 -39349 -42989 -68908
21773f8908P493M6881j7469j5973l843L01j5108L0727n7640K2012K1013M3429
$$ -68908 -61415 -14534 -32003 -47976 -51819 -51518 -66626 -35899 -93539 -71527 -50514 -7085
21761g085N2218j5182o7228O581K5351K0766Q606n7809j4057m9977N52J6598K0479
$$ -7085 45133 29951 -37277 -30696 -5345 15421 24027 -33782 -47839 -97816 -97264 -80666 -60187
21748f0187j3741m691N6467R32l907l62J0569K6941l958Q520j4216M6125J4501
$$ -60187 -73928 -78619 -22152 -21220 -25127 -25489 -14920 12021 8063 16583 2367 48492 62993
21735F2993l1053o574K0896n2177j1458Q4434L8458L5465k1012j04276k0217M448
$$ 62993 31940 25366 46262 -5915 -17373 67061 105519 140984 119972 15696 -4521 -73
21723g3l3510J779J4224K037P172k7333M789k924M0787Q9508j0174L9197J6483
$$ -73 -33583 -31804 -17580 -15543 -8371 -35704 -30915 -33839 6948 96456 86282 125479 141962
21710A41962k8252q1352M866k5423l2473K1249M3228k4197k7535k1242L9206m355
$$ 141962 113710 32358 37224 11801 -20672 577 43805 19608 -7927 -29169 10037 5682
21698E682L0086L1408l9739J7492k3784L0211k100K8077m0186k7169K6211r838
$$ 5682 35768 67176 27437 44929 21145 51356 49256 77333 37147 9978 36189 26351
21686B6351o3547k4101M507K5530R602l421N1661L7154j8576p6995j8310k8104
$$ 26351 -37196 -61297 -56790 -31260 -21658 -25079 26582 63736 45160 -31835 -50145 -78249
21674g8249J2747O899O732l7114j9342k5500O6475O8997J664n9653l3819J8691
$$ -78249 -65502 -58603 -51871 -88985 -108327 -133827 -67352 1645 3309 -56344 -90163 -71472
21662g1472k8314j246L730N1529J1561j0349k033p566j1432J9325N065j3369q253
$$ -71472 -99786 -101032 -97302 -45773 -34212 -44561 -46594 -54160 -65592 -46267 -41202 -54571 -62824
21649f2824J6635K6798j4870p1396P901N6347P1696L3200l068l4263n5728L0565
$$ -62824 -46189 -19391 -34261 -105657 -97756 -41409 30287 63487 60419 26156 -29572 993
21637I93l8625n7558N7250M7097m5751k9246j0579l8713L4384N5471J2119K283
$$ 993 -37632 -95190 -37940 9157 -36594 -65840 -76419 -115132 -80748 -25277 -13158 -10875
21625a0875k3552j2030k8715m6303N5274N8229J6936j0357L2824L821p7845J01
$$ -10875 -34427 -46457 -75172 -121475 -66201 -7972 8964 -1393 31431 35252 -42593 -42492
21613d2492J2327K1900J6487L3515O473k7181l2503L3602K9225m5657m5041K7586
$$ -42492 -30165 -8265 8222 41737 48210 21029 -11474 22128 51353 5696 -39345 -11759
21601a1759j0397J7602m8588n3573k0649L5607L2135k504L9587J0595k2312o4991
$$ -11759 -22156 -4554 -53142 -106715 -127364 -91757 -59622 -62126 -22539 -11944 -34256 -99247
21589i9247l2447J3250L8735r752M0375J9877O936m9595n142j0736j8844J7778
$$ -99247 -131694 -118444 -79709 -89461 -49086 -29209 -22273 -71868 -77010 -87746 -106590 -88812
21577h8812P1961M5865l1430m763J6151n849q160l3944J4900k443o255j5375O385
$$ -88812 -16851 29014 -2416 -7179 8972 3123 -5037 -38981 -24081 -26524 -32779 -48154 -41769
21564d1769R436K7610K8871r050J7886L451m8759M8978j4289o9097l2896Q24l806
$$ -41769 -32333 -4723 24148 15098 32984 36435 -12324 36654 22365 -46732 -79628 -78804 -82610
21551h2610L4570p54n1048j0606J00728O6971m3607r44O529j2233k1989p263Q073
$$ -82610 -48040 -48794 -99842 -110448 -9720 57251 13644 12700 19229 6996 -14993 -22256 -14183
21538a4183J5613K5136j9402m0444L633K0433O3209l8262o3052o5548M1898N3592
$$ -14183 1430 26566 7164 -33280 -29647 -9214 53995 15733 -47319 -112867 -70969 -17377
21526a7377J6664l4412m5142m4196M299K4956n227K5139L0329n3520L1760N5490
$$ -17377 -713 -35125 -80267 -124463 -120164 -95208 -100435 -75296 -44967 -98487 -66727 -11237
21514a1237L9897M5002q017N199n8018r8496k2225J8512l1484J43j1460J8624
$$ -11237 28660 73662 65645 70844 12826 -85670 -107895 -89383 -120867 -120724 -132184 -113560
21502a13560o753j9454M8094O0601K4902m63j8399j6116J2006K5361K4404j3873
$$ -113560 -120313 -139767 -91673 -31072 -6170 -6633 -25032 -41148 -29142 -3781 20623 6750
21490F750k1497o7519j5466J6875K9377M7323L9957j3787l7517o8428L455M8499
$$ 6750 -14747 -82266 -97732 -80857 -51480 -4157 35800 22013 -15504 -83932 -80477 -31978
21478c1978o034k6492N523k190j6705R834L9084n60J7900K3596r952J8177r311
$$ -31978 -38012 -64504 -58981 -61171 -77876 -68042 -28958 -29518 -11618 11978 2026 20203 10892
21465A0892j2481J590M2565j4849m7286p027o0282l009M8281K2477K8736J8292
$$ 10892 -1589 1 42566 27717 -19569 -26596 -86878 -89887 -41606 -19129 9607 27899
21453B7899K5713j1594j7541j0868k6164J3955j8563j6574J675J0019o3530m5846
$$ 27899 53612 42018 24477 13609 -12555 1400 -17163 -33737 -32062 -22043 -85573 -131419
21441a31419R197L8982M7498O7637L3937j1968j070J8993k4699O348m5168j8805
$$ -131419 -122222 -83240 -35742 31895 65832 53864 52794 71787 47088 53436 8268 -10537
21429a0537M3508l749k5441q534j4618l9206j0605K5246L5M008k499J5027L5295
$$ -10537 32971 29222 3781 -4753 -19371 -58577 -69182 -43936 -43901 -39893 -42392 -27365 7930
21416G930m83J8424o848l9547n4672J6266M0661k3162n3732M5171M28r117M6138
$$ 7930 7447 25871 19023 -20524 -75196 -58930 -18269 -41431 -95163 -49992 -49564 -58681 -12543
21403a2543L1986m9353l7394L2074M0928K2171M854m8212J4860M2709N1281j6837
$$ -12543 19443 -29910 -67304 -35230 5698 27869 32723 -15489 -629 42080 93361 76524
21391G6524n3222R795R202r447J2478J5255j34j9511l4990J5802J4491K0678n2493
$$ 76524 23302 33097 42299 32852 45330 60585 60451 40940 5950 21752 36243 56921 4428
21378D428L7248k359m0367j9080N9802l8515l8358n3914N828L7674K1531k4878
$$ 4428 41676 39317 -1050 -20130 39672 1157 -37201 -91115 -85287 -47613 -26082 -50960
21366e0960K4318M5048j6064j3086m4743m294L0504K6354j3107k7557j587k0941
$$ -50960 -26642 18406 2342 -10744 -55487 -59781 -29277 -2923 -16030 -43587 -45174 -66115
21354f6115j2942m3814k7868Q4176M1509J4302p833k3816J0842K5899M3100K6307
$$ -66115 -79057 -122871 -150739 -66563 -25054 -10752 -18585 -42401 -31559 -5660 37440 63747
21342F3747j8753k0930j0651n540k9208O697M1982N9246n7794r0344o7420k0966
$$ 63747 44994 24064 13413 7873 -21335 -14638 27344 86590 28796 -61548 -128968 -149934
21330a49934l4004K2606O4286O6894K8734M5215k4771p1117n0674J6851K5843
$$ -149934 -183938 -161332 -97046 -30152 -1418 43797 19026 -52091 -102765 -85914 -60071
21319f0071K8388K7998J6810j450j1131j6910j907j8703m4459K5132O4454p130
$$ -60071 -31683 -3685 13125 11675 544 -16366 -18273 -36976 -81435 -56303 8151 1021
21307A021l051K9285K4636j6034J7314k4685n3808l1186K9028M6207m6940m5616
$$ 1021 -2030 27255 51891 35857 53171 28486 -25322 -56508 -27480 18727 -28213 -73829
21295g3829l3352r034K1838Q117k0356j9423j051R034K3632J2987j4789K6355
$$ -73829 -107181 -116215 -94377 -86260 -106616 -126039 -127090 -118056 -94424 -81437 -96226 -69871
21283f9871L3896P9840m7o4821k7995n7132o3867L5147O2059O0745J6538K0155
$$ -69871 -35975 43865 43818 -21003 -48998 -106130 -169997 -134850 -72791 -12046 4492 24647
21271B4647J3076k5499p3862j5177k0653j0043o932M4447N3079M1938O897k3603
$$ 24647 37723 12224 -61638 -76815 -97468 -107511 -114443 -69996 -16917 25021 31918 8315
21259H315j7972J8845j3090R34M0179K8171n0564m0406o732K5141L2933K5367
$$ 8315 -9657 9188 -3902 -2968 37211 65382 14818 -25588 -32320 -7179 25754 51121
21247E1121l8809m5692o598O9017R773k4863n091j3576n1k3655p832l784p523
$$ 51121 12312 -33380 -39978 29039 38812 13949 8858 -4718 -4769 -28424 -36256 -40040 -47563
21234d7563Rm679K6773L5044k928Q284J4521J040l6998l5911k6784m618q013K552
$$ -47563 -47554 -52233 -25460 9584 6656 14940 29461 30501 -6497 -42408 -69192 -73810 -81823 -79271
21220g9271K9192K6988J5285J5053m0597k285L1492n1706j4443K8245k7422J1432
$$ -79271 -50079 -23091 -7806 7247 -33350 -35635 -4143 -55849 -70292 -42047 -69469 -58037
21208e8037L0142k1448K6214k3350j3911M4990j16N8369K1098m5946n6097m962
$$ -58037 -27895 -49343 -23129 -46479 -60390 -15400 -15516 42853 63951 18005 -38092 -43054
21196d3054J3114Q844L159q709j0642l7110N4568P1695m8547n2913K226L2296
$$ -43054 -29940 -21096 -17937 -26646 -37288 -74398 -19830 51865 3318 -49595 -47369 -15073
21184a5073O2122n2318j5364j8174n6830k8563M6830M2070O6265l5984j7766M671
$$ -15073 47049 -5269 -20633 -38807 -95637 -124200 -77370 -35300 30965 -5019 -22785 -18114
21172a8114k4342j2243Q099M930M7030K5165k1457k9927m4483L782J7964J3761
$$ -18114 -42456 -54699 -46600 -41670 5360 30525 9068 -20859 -65342 -61560 -43596 -29835
21160b9835k079L2140j7872j8260k0636j468l4439R577P3039L9701q2983k2718
$$ -29835 -31914 226 -17646 -35906 -56542 -58010 -92449 -82872 -9833 29868 -53115 -75833
21148g5833R2726k5135J4354K1394Q271J6826R772l5874k3413R386j7604j7130
$$ -75833 16893 -8242 6112 27506 35777 52603 62375 26501 3088 12474 -5130 -22260
21136b2260k2923k7181L177k8028n0099P7832R0624M866q0194j1251M432L1829
$$ -22260 -45183 -72364 -69187 -97215 -147314 -69482 21142 26008 -54186 -65437 -61005 -29176
21124b9176M0046K5864o3522n2783L2270M1015j5492q053j6658m7537J8579P583
$$ -29176 10870 36734 -26788 -79571 -47301 -6286 -21778 -29831 -46489 -94026 -75447 -67864
21112f7864J4448K1364K9269J3432j420j5807j3415m721n2196R05K5777L6934
$$ -67864 -53416 -32052 -2783 10649 9229 -6578 -19993 -24714 -76910 -76005 -50228 -13294
21100a3294l5469j4030k3454K4988J1242R955k8475j4820L8182M6352K1035n5435
$$ -13294 -48763 -62793 -86247 -61259 -50017 -40062 -68537 -83357 -45175 1177 22212 -33223
21088c3223m4698O5521O246R43J8339K1058M867l2140K5974n97l1989p8097L4579
$$ -33223 -77921 -12400 -6154 -5211 13128 34186 39053 6913 32887 32290 301 -77796 -43217
21075d3217j599l1421j903J9585L1728J8578o4176K7254k1812J5597J5828m669
$$ -43217 -44816 -76237 -78140 -58555 -26827 -8249 -72425 -45171 -66983 -51386 -35558 -40227
21063d0227R785L6595N5067j7870m31m5495m9035n8610M033K7106j4740J0204
$$ -40227 -30442 6153 61220 43350 42919 -2576 -51611 -110221 -106188 -79082 -93822 -83618
21051h3618Q786o20k2383K558N2168O576l4481Q837M4791K4714j037m1404l1317
$$ -83618 -74832 -75452 -97835 -95277 -43109 -36533 -71014 -62177 -17386 7328 6291 -35113 -66430
21038f6430n8111R268J6726L0224k7771J985N0660L3934m6195o5750L402J9878
$$ -66430 -124541 -115273 -98547 -68323 -96094 -94109 -43449 -9515 -55710 -121460 -118058 -98180
21026i8180K0873J5543R262K9336K0069l112k3456j0916n3363q6170K3191M910
$$ -98180 -77307 -61764 -52502 -23166 -3097 -6209 -29665 -40581 -93944 -180114 -156923 -152013
21014a52013J6654K1435K4335M2325L4590L304M0122O244l4493l1098r601n287
$$ -152013 -135359 -113924 -89589 -47264 -12674 -9370 30752 36996 2503 -28595 -38196 -43483
21002d3483l3595r68M2455k0618l461l0721r254J2051J3400k2757K7167M2347
$$ -43483 -77078 -78046 -35591 -56209 -59670 -90391 -99645 -87594 -74194 -96951 -69784 -27437
20990b7437K8707m0929M1528K2608n6416k0551K5276Q607J6763O1244j140o5847
$$ -27437 1270 -39659 1869 24477 -31939 -52490 -27214 -18607 -1844 59400 58260 -7587
20978g587j9819K9372j1231J5779m1225n9063J760m002M2740K4018j4963m6675
$$ -7587 -27406 1966 -9265 6514 -34711 -93774 -92014 -96016 -53276 -29258 -44221 -90896
20966i0896o840N5383J4186k4526O87k9834k375o373p331O761J3647J3363j4803
$$ -90896 -97736 -42353 -28167 -52693 -52006 -81840 -84215 -90588 -97919 -91158 -77511 -64148 -78951
20953g8951M3060k3064l627k421K3314L7973K9676K4854m4071n8513j4156j373
$$ -78951 -35891 -58955 -62582 -65003 -41689 -3716 25960 50814 6743 -51770 -65926 -67299
20941f7299K058K041N2765O6265k31J5167j024l5670l3877L158K0833k8502P207
$$ -67299 -65241 -63200 -10435 55830 55599 70766 69742 34072 195 3353 24186 -4316 2891
20928B891j8370j2629K7431o092j03188j5361O1837J1666L2247N970j3464k4777
$$ 2891 -15479 -28108 -677 -6769 -109957 -125318 -63481 -51815 -19568 -13598 -27062 -51839
20916e1839l0874J880P7600r918r462o611k1745N4142k3377O577r998m0558k3672
$$ -51839 -82713 -80833 -3233 -13151 -22613 -29224 -50969 3173 -20204 -13627 -23625 -64183 -87855
20903h7855J3178N3314Q959m4673l3851M8926O3383K2466k4187q116p762J4816
$$ -87855 -74677 -21363 -12404 -57077 -90928 -42002 21381 43847 19660 11544 3782 18598
20891A8598J8537r940l0761j2992j8909j2782j3420m7457L0340K5401m520k8728
$$ 18598 37135 27195 -3566 -16558 -35467 -48249 -61669 -109126 -78786 -53385 -57905 -86633
20879h6633M4872k4228K1034L223j7512j8407J7590j3254j7569K0635J4192O3682
$$ -86633 -41761 -65989 -44955 -41732 -59244 -77651 -60061 -73315 -90884 -70249 -56057 7625
20867G625J06630k4226j13326l4992K278j9473P6978R891k6105k2410j1943j621
$$ 7625 114255 90029 -23297 -58289 -56011 -75484 1494 11385 -14720 -37130 -49073 -50694
20855e0694j3594N3511K3634J3050j789p4612j9492J6163r416N402Q842K2816
$$ -50694 -64288 -10777 12857 25907 24118 -50494 -69986 -53823 -63239 -57837 -48995 -26179
20843b6179m5178J3160O0087K3400j253l549o495j3254j8804J1393J2229o814
$$ -26179 -71357 -58197 1890 25290 24037 20488 13993 739 -18065 -6672 5557 -1257
20831a257l7295r217n735P331J3300k2994J7309k6504j2700N7487J7664k2111
$$ -1257 -38552 -47769 -53504 -46173 -32873 -55867 -38558 -65062 -77762 -20275 -2611 -24722
20819b4722n976k4179P224J2999l9349K1514K7819K4958r42r136l7422N852K6385
$$ -24722 -30698 -54877 -47653 -34654 -74003 -52489 -24670 288 -654 -9790 -47212 -41360 -14975
20806a4975k2851n318J4838m584N243L7746k9334l5665k3147k5802p619J2590
$$ -14975 -37826 -43144 -28306 -32890 -27647 10099 -19235 -54900 -78047 -103849 -111468 -98878
20794i8878N8087J4256L8351J7763o113r66K4890k0l6388j6267K3416k4448o3949
$$ -98878 -40791 -26535 11816 29579 23466 22500 47390 47370 10982 -5285 18131 -6317 -70266
20781g0266k2570o360l5290R94N0066M747j3939j828L42P8776l587k7181N132
$$ -70266 -92836 -99196 -134486 -133492 -83426 -78679 -92618 -94446 -94104 -15328 -18915 -46096 -40964
20768d0964M9377o344K5646O5965m4218l3523n891J39J9716j4089j39J3981P700
$$ -40964 8413 2069 27715 93680 49462 15939 10048 10187 29903 15814 15675 29656 37356
20755C7356k5548l0737M0813K7110K717M708p4741k9201K6081m4377q053M7118
$$ 37356 11808 -18929 21884 48994 51711 56419 -18322 -47523 -21442 -65819 -73872 -26754
20743b6754j3477M428k6743K4568K219J785r324j9411n464Q356P912P084J2042
$$ -26754 -40231 -35803 -62546 -37978 -35759 -33974 -43298 -62709 -68173 -59817 -51905 -44821 -32779
20730c2779M446J122M1953l007l4041J0182l5337l9727M4196J7248r131j8397
$$ -32779 -28333 -27211 14742 11735 -22306 -12124 -47461 -87188 -42992 -25744 -34875 -53272
20718e3272L908J0422p091J2490k937K3193J6172q328J576L0599K1731n8218k5616
$$ -53272 -49364 -38942 -46033 -33543 -36480 -13287 2885 -5443 -3867 26732 48463 -9755 -35371
20705c5371p1430k9602L1460J6612J8382M851j2952K2263M1153M18R813K4016
$$ -35371 -106801 -136403 -104943 -88331 -69949 -65098 -78050 -55787 -14634 -14216 -4403 19613
20693A9613j183M238j4522m4353m9183K8694O1298L1702K6062o9585k3699K1523
$$ 19613 18430 22668 8146 -36207 -85390 -56696 4602 36304 62366 -7219 -30918 -9395
20681i395L6878J6545l6969l0108k3503k7950n9411K4539L0925M3163L0213M493
$$ -9395 27483 44028 7059 -23049 -46552 -74502 -133913 -109374 -78449 -35286 -5073 -580
20669e80J3631n373J2597k4681j3077K7549M6895K2521m4343k6085J5943j587
$$ -580 13051 7678 20275 -4406 -17483 10066 56961 79482 35139 9054 24997 23410
20657B3410j3141q122K8977L3999k2375j4456l7077j7672L0344K4872L044q8385
$$ 23410 10269 2147 31124 65123 42748 28292 -8785 -26457 3887 28759 31803 -56582
20645e6582p8951k463M344J00757N6060l1394L0653j6094j6667L0597J8636N2127
$$ -56582 -135533 -137996 -133652 -32895 23165 -8229 22424 6330 -10337 20260 38896 91023
20633I1023n5357k4361M2182J2698m2453m9633K34R1403K9507m3118q6594o1672
$$ 91023 35666 11305 53487 66185 23732 -25901 -25667 65736 95243 52125 -34469 -96141
20621i6141j2685J9796o137J2016M2933L1939j0377J7443Q768R961M0157l3951
$$ -96141 -108826 -89030 -95167 -83151 -40218 -8279 -18656 -1213 7555 17516 57673 23722
20609B3722j1639J4590Q680O368j4335M668k5274n3313M9402M7261J3848L048
$$ 23722 12083 26673 35353 41721 27386 32054 6780 -46533 2869 50130 63978 67026
20597F7026k8633j8328M731j3707l9271o016q847K861j9773j6828M096L3816j0473
$$ 67026 38393 20065 24796 11089 -28182 -34198 -43045 -40184 -59957 -76785 -72689 -38873 -49346
20584d9346L2773L8395k595j2262k3749j0985J7464O3465L9932m8563l4095J490
$$ -49346 -16573 21822 19227 6965 -16784 -27769 -10305 53160 93092 44529 10434 11924
20572A1924L1992M0034L1376k4861q2173p0154k7778J4973M6604J5770l4517k9436
$$ 11924 43916 83950 115326 90465 8292 -61862 -89640 -74667 -28063 -12293 -46810 -76246
20560g6246L0867O6817N0811J9456l5123m878l8959l178j0591N260Q163l4552
$$ -76246 -45379 21438 72249 91705 56582 51704 12745 9567 -1024 4236 12399 -22153
20548b2153m749J4675j1465J8055j6967m2304N532j7325L814L3070J4926l7553
$$ -22153 -26902 -12227 -23692 -5637 -22604 -64908 -59376 -76701 -72887 -39817 -24891 -62444
20536f2444q9223k6210K3604J9433O089L1932K2018n757K9653N44L8236K8031
$$ -62444 -151667 -177877 -154273 -134840 -128751 -96819 -74801 -80558 -50905 -50361 -12125 15906
20524A5906p061K308J869k5823k0869M4873j7429j3537j6124Q56N9632N4868K097
$$ 15906 8845 11153 13022 -12801 -33670 11203 -6226 -19763 -35887 -35031 24601 79469 81566
20511H1566m3866k4009J102J9300m9297k0044K8602M6733j2354j8756j7215J2234
$$ 81566 37700 13691 14793 34093 -15204 -35248 -6646 40087 27733 8977 -8238 3996
20499C996O297j456J4561q671j5036j3568k4499M6234j267n0828J7690R060l047
$$ 3996 10293 8837 23398 14727 -309 -13877 -38376 7858 6591 -44237 -26547 -17487 -20534
20486b0534j3062K1483R892K6892K1932M2381o8299O742j370J3963r723K533j1986
$$ -20534 -33596 -12113 -2221 24671 46603 88984 20685 27427 26057 40020 30297 32830 20844
20473B0844j9995j6497J0042P0879J1546K9522j4430l663J6178N1141K8335K959
$$ 20844 849 -15648 -5606 65273 76819 106341 91911 88248 104426 155567 183902 186861
20461A86861K8252J3128p10k5431r42o8816n6329J7425n2238m3126j5534L8247
$$ 186861 215113 228241 227531 202100 201158 132342 76013 93438 41200 -1926 -17460 20787
20449B0787J6872Q4320k3107o2108k1185o745J5769j0299M370l1456o3556J240
$$ 20787 37659 121979 98872 36764 15579 8834 24603 14304 18674 -12782 -76338 -75098
20437g5098M5067l414J713p77J7327L4387m8686m7186K9944P58O636k2157o984
$$ -75098 -30031 -33445 -31732 -32509 -15182 19205 -29481 -76667 -46723 -45965 -39329 -61486 -68470
20424f8470L865K9101J5437j8153k7279L3684J4567k1299J0526J8913k7671j7830
$$ -68470 -64605 -35504 -20067 -38220 -65499 -31815 -17248 -38547 -28021 -9108 -36779 -54609
20412e4609k5091N4875L9572k9955k341L6858L899K5698M9839L2304l0266J2902
$$ -54609 -79700 -24825 14747 -15208 -17549 19309 23208 48906 98745 131049 100783 113685
20400A13685j7691n3601k1281k9781r5228n6904M5669O3973k2514J2181L1174
$$ 113685 95994 42393 21112 -8669 -103897 -160801 -115132 -51159 -73673 -61492 -30318
20389c0318K6046N5632L258o4982K649J6996J0546j2475r1127j5404R202j5876
$$ -30318 -4272 51360 54618 -10364 -7715 9281 19827 7352 -83775 -99179 -89977 -105853
20377a05853o4878N628m707J9466J8145L9204P0715L0743J3765l5892L291l231
$$ -105853 -170731 -165103 -169810 -150344 -132199 -92995 -22280 8463 22228 -13664 -10373 -13604
20365a3604J3608m3047j9811K9438L2966K6715r172k2845P919J3988m0358n8288
$$ -13604 4 -43043 -62854 -33416 -450 26265 17093 -5752 2167 16155 -24203 -82491
20353h2491K3692L2718j1491L8569M7245l6992o4606M1285K0293L0397L8839n233
$$ -82491 -58799 -26081 -37572 997 48242 11250 -53356 -12071 8222 38619 77458 72225
20341G2225m4845o3056j7068J5730L6092l83J4516l3730P8848j7007j363l6056
$$ 72225 27380 -35676 -52744 -37014 -922 -1305 13211 -20519 58329 41322 39959 3903
20329C903m9912Q866m2638l9368K8366M6351K8306j7754k5446j3312K3174n5461
$$ 3903 -46009 -37143 -79781 -119149 -90783 -44432 -16126 -33880 -59326 -72638 -49464 -104925
20317a04925J214Q0738P0772j6647q6711J4761o143k3910O858L1828N564O6874
$$ -104925 -103711 -22973 47799 31152 -55559 -40798 -46941 -70851 -63993 -32165 -26601 40273
20305D0273J6766J5688j7457K9895m538n6196k5035k2157K4166L117o7492q56
$$ 40273 57039 72727 55270 85165 80627 24431 -604 -22761 1405 4522 -62970 -63826
20293f3826K8493L4052N3170J5795k8742k7491m0238J355k5373M491M9300j7737
$$ -63826 -35333 -1281 51889 67684 38942 11451 -28787 -27432 -52805 -48314 986 -16751
20281a6751J8496N4450Q0540o5932m6109n1354K3161M390K8219R880J4437l523
$$ -16751 1745 56195 136735 70803 24694 -26660 -3499 891 29110 38990 53427 49904
20269D9904L435l8385o014m646j2087K2907k866J4262L865n1779k9001K8248P9351
$$ 49904 53339 14954 8940 4294 -7793 15114 12248 26510 30375 -21404 -50405 -22157 57194
20256E7194P7140j1735m7434p7129r792m9585J7451L9860K4800j9125n8204k6161
$$ 57194 134334 122599 75165 -1964 -11756 -61341 -43890 -4030 20770 1645 -56559 -82720
20244h2720J7772M4672L9225j1267j7809O2360m46j8059q526n1228n3916p953
$$ -82720 -64948 -20276 18949 7682 -10127 52233 51787 33728 25202 -26026 -79942 -87895
20232h7895L7119J0682L9276L0204j9864R734P7539k181K4452l5975l8250J121
$$ -87895 -50776 -40094 -818 29386 9522 19256 96795 94614 119066 83091 44841 45962
20220D5962p380P5273J8504N45l0702m4575l6566l7266n501k243J1443k3116M2880
$$ 45962 38582 113855 132359 132904 102202 57627 21061 -16205 -21706 -23949 -12506 -35622 7258
20207G258O770r046k5907M3086l880k8219p860J2659l5534j3086R028R395p402
$$ 7258 14028 4982 -20925 22161 18281 -9938 -17798 -5139 -40673 -53759 -44731 -35336 -42738
20194d2738L8613q011K0405L1893n2911n8326j3620J8713J8490j5309j7544K4377
$$ -42738 -4125 -12136 8269 40162 -12749 -71075 -84695 -65982 -47492 -62801 -80345 -55968
20182e5968K6237L4183p430j1114k1932M0898N3300N4567l8611j9374J2400j9520
$$ -55968 -29731 4452 -2978 -14092 -36024 4874 58174 112741 74130 54756 67156 47636
20170D7636m1562o0810L8040K0067l2651J812N727k3267k0510P1294M4869j5799
$$ 47636 6074 -54736 -16696 3371 -29280 -27468 -21741 -45008 -65518 5776 50645 34846
20158C4846l7949n356j0644p1814m778K5693N1403O9229k2340k4383k4900k7052
$$ 34846 -3103 -8459 -19103 -90917 -95695 -70002 -18599 50630 28290 3907 -20993 -48045
20146d8045m282J598O856l0964j0949P9120O4216K393k9165N2613r536m8462n5145
$$ -48045 -52327 -50729 -43873 -74837 -85786 -6666 57550 59943 30778 83391 73855 25393 -29752
20133b9752o4257J7867N3625K8089p891K2415j653p5571j048m2069l3001M1827
$$ -29752 -94009 -76142 -22517 5572 -2319 20096 18443 -57128 -58176 -100245 -133246 -91419
20121i1419L8372r669L9827K3964K6927m3334l1468J3883L2469J8852j9047J3032
$$ -91419 -53047 -62716 -22889 1075 28002 -15332 -46800 -32917 -448 18404 -643 12389
20109A2389R629M056j3586L3301o343L8091j9979k8079L9991K3526K7404l9475
$$ 12389 22018 26074 12488 45789 39446 77537 57558 29479 69470 92996 120400 80925
20097H0925k3405l8287k1210j9915j6240n9794L0604P2265J3545l778k5134N2082
$$ 80925 57520 19233 -1977 -21892 -38132 -97926 -67322 4943 18488 14710 -10424 41658
20085D1658L1458n4100k7815m0845j9493O7096Q3374M4565o4690o9763k7005K5741
$$ 41658 73116 19016 -8799 -49644 -69137 -2041 81333 125898 61208 -8555 -35560 -9819
20073i819J9851O3059P3800j5159l9266j5893m845j6183j602L883j1917L614O990
$$ -9819 10032 73091 146891 131732 92466 76573 71728 55545 53943 57826 45909 49523 56513
20060E6513M419r409k5120p383K9531J7090l2323l0769K5269M8282J9732J6131
$$ 56513 60932 51523 26403 19020 48551 65641 33318 2549 27818 76100 95832 111963
20048A11963j193m2153k9892k0334n757L4999l2542J8911M6333O7293m359k5395
$$ 111963 110770 68617 38725 18391 12634 47633 15091 34002 80335 147628 143269 117874
20036A17874k2661k3940l7584J8164q508q014j5078K0200j5105n8576o7887M6322
$$ 117874 95213 71273 33689 51853 43345 35331 20253 40453 25348 -33228 -101115 -54793
20024e4793l107N2427N8663R843k0768K3411R814O099p57r1497m34M9667L8948
$$ -54793 -57900 -5473 53190 63033 42265 65676 75490 81589 80832 -10665 -11099 38568 77516
20011G7516J1910K9483n0937o779j2727j2965l0094J2494O4849M1875K1497k2241
$$ 77516 89426 118909 67972 61193 48466 35501 5407 17901 82750 124625 146122 123881
19999A23881n1841k1174r611J5642o116l3504j659j4874J9062L4013J5891j2506
$$ 123881 72040 50866 41255 56897 50781 17277 15618 744 19806 53819 69710 57204
19987E7204L7740J2201l936m8567l4542m7928j0436K0038J4402N0466p068n7617
$$ 57204 94944 107145 103209 54642 20100 -27828 -38264 -18226 -3824 46642 39574 -18043
19975a8043J8121K4307L8366m0743R15L3112l7630m6345q821k4026N4787O1168
$$ -18043 78 24385 62751 22008 22923 56035 18405 -27940 -36761 -60787 -6000 55168
19963E5168k9969m7849k9335K6587K9301N363J9599K4551J1798j4247k8607k7443
$$ 55168 25199 -22650 -51985 -25398 3903 9266 28865 53416 65214 50967 22360 -5083
19951e083j158K2873q255m63L215K9665l6787m977o498M69o510O8549k19j0780
$$ -5083 -6241 16632 8377 7914 11129 40794 4007 -970 -7468 -6999 -13509 55040 54821 44041
19937D4041k3533q7977j7500N52R6549M3315l9088k778j0270p6113m4541K6649
$$ 44041 20508 -67469 -84969 -84417 12132 55447 16359 13581 3311 -72802 -117343 -90694
19925i0694M8789K4197J6414R152j1335p230L5830J051M952J118r3014l8040L0963
$$ -90694 -41905 -17708 -1294 7858 -3477 -10707 25123 26174 31126 32244 -60770 -98810 -67847
19912f7847P1399N8300j4856O370m7402l8196j0601J2722M2135N7330o699o9915
$$ -67847 3552 61852 46996 53366 5964 -32232 -42833 -30111 12024 69354 62655 -7260
19900g260l8447N106L5123k5172p6549l4357J2879K9925N5597k5238j103j109
$$ -7260 -45707 -40601 -5478 -30650 -107199 -141556 -128677 -98752 -43155 -68393 -69496 -70605
19888g0605J9980k8848p530Q937j4653O178L7961k2017K7515O5635K2585q067
$$ -70605 -50625 -79473 -87003 -78066 -92719 -86541 -48580 -70597 -43082 22553 45138 37071
19876C7071J9550P125o357l1836J28N775J3822K348K1972j3624m1994p081Q01
$$ 37071 56621 63746 57389 25553 25681 31456 45278 47626 69598 55974 13980 6899 7700
19863G700o352m5301m6658K262R0564N0713j2561k7489l8194K6473P2880L2243
$$ 7700 1348 -43953 -90611 -88349 2215 52928 40367 12878 -25316 1157 74037 106280
19851A06280k3285r456m1797r5448l5604M8676P8959m0818j8593J8353L7020o72
$$ 106280 82995 73539 31742 -63706 -99310 -50634 28325 -12493 -31086 -12733 24287 23615
19839B3615m3661O425N5622N2473m122K4520l9101K647L0824R98j9214k2140P39
$$ 23615 -20046 -13621 42001 94474 90352 114872 75771 78418 109242 110240 91026 68886 69625
19826F9625l969L3665k3461j7465K4705k4917k712K3598k4573r867j1596j1241
$$ 69625 65656 99321 75860 58395 83100 58183 55471 79069 54496 44629 33033 21792
19814B1792k721j2770l1989M5305N6691J090m090J8723m2561m6414o8466k5534
$$ 21792 19071 6301 -25688 19617 76308 77398 73308 92031 49470 3056 -65410 -90944
19802i0944K0986O2553L1552M6874N5094n0624k0730l8084k9681L0202N2258p3126
$$ -90944 -69958 -7405 24147 71021 126115 75491 54761 16677 -13004 17198 69456 -3670
19790c670j5364m898M766N0063L5943J8861J5850k8545k0192J7602l0420r8L5896
$$ -3670 -19034 -23932 -19166 30897 66840 85701 101551 73006 52814 70416 39996 39898 75794
19777G5794r574o455l9684l3718K365j4811K7897L0318K613M8999m5953q6113
$$ 75794 66220 59765 20081 -13637 -11272 -26083 1814 32132 34745 83744 37791 -48322
19765d8322k4396O4848L8819k2706p292m463J2851K8199r217P019l2202k3205
$$ -48322 -72718 -7870 30949 8243 951 -3512 9339 37538 28321 35340 3138 -20067
19753b0067j339m7536m1898N3404Q5991N2155n3232l654P797k6392m955J0931
$$ -20067 -21406 -68942 -110840 -57436 28555 80710 27478 23824 31621 5229 274 11205
19741A1205j3450k3950M969n259K7409K78O741P1651K7247j8424J183k3348L0121
$$ 11205 -2245 -26195 -21226 -26485 924 1202 7943 79594 106841 88417 89600 66252 96373
19728I6373k2989m2891n9746N410L5157K4234m2043o2161O32L2297N6461K0845
$$ 96373 73384 30493 -29253 -23843 11314 35548 -6495 -68656 -68024 -35727 20734 41579
19716D1579l9309j2986n933J5491P6753L4704P841n4980l0339m6781j0920O2213
$$ 41579 2270 -10716 -16649 -1158 75595 110299 118140 63160 32821 -13960 -24880 37333
19704C7333q902K1633j7188O029l4769J3265k110O499P1702K2218k8813k5190
$$ 37333 28431 50064 32876 38905 4136 17401 15291 21790 93492 115710 86897 61707
19692F1707K9822k5170l1149p141J5365J1251k6911l5052L5434m402j2382J0165
$$ 61707 91529 66359 35210 28069 43434 54685 27774 -7278 28156 23754 11372 21537
19680B1537K0815J92p888k8886q450J4370Q928l917o243r9M6389L9702L2208n175
$$ 21537 42352 42544 34656 5770 -2680 11690 20618 16701 10458 10359 56748 96450 128658 123483
19666A23483l8974r7098r578O5296L7634J2076M976O821l0608l4009J4423q208
$$ 123483 84509 -12589 -22167 43129 80763 92839 97815 104636 74028 40019 54442 46234
19654D6234m4099k1755j03357J0064L8946K3363N5480L2061n2945P067P910q374
$$ 46234 2135 -19620 -122977 -112913 -73967 -50604 4876 36937 -16008 -8941 -1031 -9405
19642i405j932L3499k0651K1241J1496J1178o272j8319J2055k0655K9304M4445
$$ -9405 -11337 22162 1511 22752 34248 45426 39154 20835 32890 12235 41539 85984
19630H5984n468l2489o769L4236K3360j6726K6585J5545m5050n516J4192j1307
$$ 85984 80516 48027 41258 75494 98854 82128 108713 124258 79208 73692 87884 76577
19618G6577l6681q901K2792j9517J5300j182j8672k4756j2802O555j0630k6377
$$ 76577 39896 30995 53787 34270 49570 48388 29716 4960 -7842 -1287 -11917 -38294
19606c8294N289N0072J1629N5926K0449m8339j2630l4697o1557k0563O0192M1788
$$ -38294 -33005 17067 28696 84622 105071 56732 44102 9405 -52152 -72715 -12523 29265
19594B9265N2071J4783p8691k9262K9176K1851M7641K0097m7403k4706j41K3664
$$ 29265 81336 96119 17428 -11834 17342 39193 86834 106931 59528 34822 34681 58345
19582E8345J7596l015L180K6510l3678j6732Q872K7134R688j4353O96j5143n2371
$$ 58345 75941 72926 76106 102616 68938 52206 61078 88212 97900 83547 84243 69100 16729
19569A6729l5190K5903N8994M1716k302K6832J3033j2292l2628l6903k3338m0516
$$ 16729 -18461 7442 66436 108152 105850 132682 145715 133423 100795 63892 40554 38
19557C8R730Q3838o007m3299k0918K4447L3288o458p2312O581k0410m8570J074
$$ 38 9768 93606 87599 44300 23382 47829 81117 74659 2347 8928 -11482 -60052 -58978
19544e8978J3268n1744K3728Q0197L0231k0625j0481O6215N4020k066k3495j2024
$$ -58978 -45710 -97454 -73726 6471 36702 16077 5596 71811 125831 123765 100270 88246
19532H8246J3491l7500k8195j5433L8378M6745k5330j9501l273m90P5316j3773
$$ 88246 101737 64237 36042 20609 58987 105732 80402 60901 57628 57138 132454 118681
19520A18681K075k8115l3148J4862o4k671l4602k6687L3259O257O3372K1013o071
$$ 118681 120756 92641 59493 74355 74291 71620 37018 10331 43590 49847 113219 134232 128161
19507A28161k8718R4N1497j5154M1311J0966L5114N260p3329m0369k7338k2795
$$ 128161 99443 99537 151034 135880 177191 188157 223271 228531 155202 114833 87495 64700
19495F4700L6045L9036j9409o775K3090R259p729l2711L77L0614K6022j4495j9456
$$ 64700 100745 139781 120372 113597 136687 145946 138217 105506 105883 136497 162519 148024 128568
19482A28568j2394L6572k417o5638P894P8710L9460m534m9832j9227j5777K4812
$$ 128568 116174 152746 150329 84691 92585 171295 210755 206221 156389 137162 121385 146197
19470A46197j6800j23791m2451N0376M0509j2860O0672M0257n0015m7550q880
$$ 146197 129397 5606 -36845 13531 54040 41180 101852 142109 92094 44544 35664
19459C5664M9017k330p132N4416J3128K6316N849J2559M7314l0571K53O042m0474
$$ 35664 84681 82351 75219 129635 142763 169079 174928 187487 234801 204230 204483 210525 170051
19446A70051P629P6054K5001J3730J08540L6718L1828J3216R2851J41337J69851
$$ 170051 177680 253734 278735 292465 401005 437723 469551 482767 575618 716955 886806
19435H86806J51972J39061J18477P2584N6054J0592M3703k8133j01989j01673
$$ 886806 1038778 1177839 1296316 1368900 1424954 1435546 1479249 1451116 1349127 1247454
19425A247454j01334j52018j72953j20550o3459o2907p5179m6999j8116k7879
$$ 1247454 1146120 994102 821149 700599 637140 574233 499054 452055 433939 406060
19415D06060k3493l7272o8855r909K5699l8513M104k2334M4918k7874M9084K4176
$$ 406060 382567 345295 276440 266531 292230 253717 257821 235487 280405 252531 301615 325791
19403C25791m4672j2555k637M3449l545M26k4614l3212J0666M0968L6218J8849
$$ 325791 281119 268564 265927 309376 305831 306257 281643 248431 259097 300065 336283 355132
19391C55132M8623j1288J0272O9333J08292N6407M4859J16115J64264J62772J87988
$$ 355132 403755 392467 402739 472072 580364 636771 681630 797745 962009 1124781 1312769
19380A312769J96010J21090P3550J3104j6193p1056p0056j61061j23653j56956
$$ 1312769 1508779 1629869 1703419 1716523 1700330 1629274 1559218 1398157 1274504 1117548
19370A117548j14720j05313q2561j52471j28203k2362m0008n7655k6881J164L1548
$$ 1117548 1002828 897515 814954 662483 534280 511918 471910 414255 387374 388538 420086
19359D20086k0077l589o338m9061j1833k9241m4512n2256k8289L5727l9621M1483
$$ 420086 400009 396420 390082 341021 329188 299947 255435 203179 174890 210617 170996 212479
19347B12479M8218n4899q0891L6600m308R568N173k9261p5903m0552J4715L1246
$$ 212479 260697 205798 124907 161507 157199 166767 171940 142679 66776 26224 40939 72185
19335G2185L6389R2851J6605m6883j6546M1056J1076m256j9321l7648p5688r310
$$ 72185 108574 201425 218030 171147 154601 195657 206733 202477 183156 145508 69820 60510
19323F0510k1953K6161L8409J3069m1073J4008k3503P221R921n690K9237J7012
$$ 60510 38557 64718 103127 116196 75123 89131 65628 72849 82770 77080 106317 123329
19311A23329J9412L1728O736l0179j6273J0871p686n8142j3853K5928K1140J5376
$$ 123329 142741 174469 181205 151026 134753 145624 137938 79796 65943 91871 113011 128387
19299A28387L892m3298r248M2092k9216L258l0460k7954K9350J8123q966o605
$$ 128387 132279 88981 79733 121825 92609 95867 65407 37453 66803 84926 75960 69355
19287F9355L790j8972m1796k549O8751N031j7257j9526l0973m520J2543L5351
$$ 69355 73145 54173 12377 9828 78579 83610 66353 46827 15854 11334 23877 59228
19275E9228K6051K8200j0268j6336k298K5698Q925r695K9611P7713k3856j8856
$$ 59228 85279 113479 103211 86875 84577 110275 119200 109505 139116 216829 192973 174117
19263A74117L8080L0088L233M3224l6694n4440m3310o0128K8700j8322L7284j2001
$$ 174117 212197 242285 245518 288742 252048 197608 154298 94170 122870 104548 141832 129831
19251A29831q0722J5452O5677L4082q839J0799N3146j5702j1413P6666P4120n1771
$$ 129831 49109 64561 130238 164320 155481 166280 219426 203724 192311 268977 343097 291326
19239B91326r2060o4380j9732j7564J5847J0285K101k9561K3776M3467k1688n606
$$ 291326 199266 134886 115154 97590 113437 123722 125823 96262 120038 163505 141817 136211
19227A36211M884N298q922k255l3096m040J7032J371K5170j0175n7315j5749N3024
$$ 136211 141095 146393 137471 135216 102120 98080 115112 116483 141653 131478 74163 58414 111438
19214A11438L5478j3072L9423R3158l1560k4296l4583Q92k0635j4081k8296M7231
$$ 111438 146916 133844 173267 266425 234865 210569 175986 176878 156243 142162 113866 161097
19202A61097L21K0798k754j0950q1350n2905K6243J00586N5087L6313q987m1558
$$ 161097 161418 182216 179462 168512 87162 34257 60500 161086 216173 252486 243499 201941
19190B01941k9755j3939k1090J31K4504J2798m2361L7611J1619m9038n0217k2609
$$ 201941 172186 158247 137157 137288 161792 174590 132229 169840 181459 132421 82204 59595
19178E9595k3332K8148o882L8905J6544J6421J4248P1324K3104r785k9218k5461
$$ 59595 36263 64411 57529 96434 112978 129399 143647 214971 238075 228290 199072 173611
19166A73611j8833L747j5164o2273J0755M6563j9684k2154K082M4354j6579n9591
$$ 173611 154778 158525 143361 81088 91843 138406 118722 96568 98650 143004 126425 66834
19154F6834l9767L4497N7913L9945M2958k8426j7197l2695o5763m2514k2407L2154
$$ 66834 27067 61564 119477 159422 202380 173954 156757 124062 58299 15785 -6622 25532
19142B5532K74L6020M4087L0222k1791M6935M1794J1614M6664m7627j8811L7689
$$ 25532 25806 61826 105913 136135 114344 161279 203073 214687 261351 213724 194913 232602
19130B32602J1205l202j909k6633l2471m5560K309l3139J3261K6138K97n3722
$$ 232602 243807 240605 238696 212063 179592 134032 136341 103202 116463 142601 142898 89176
19118H9176M712k6434Q880M701l3500k11q924N3627P2847m8258p1627l056J3329
$$ 89176 93888 67454 76334 81035 47535 47324 38400 92027 164874 116616 44989 41933 55262
19105E5262L9691L2559O2584J2118L3161k4367l0746n0691p1331J4944J1113K8713
$$ 55262 94953 127512 190096 202214 235375 211008 180262 129571 58240 73184 84297 113010
19093A13010o082N8559J287k471K3042n8228o758M7377l9994p2831M4417P2550
$$ 113010 106928 165487 166774 164303 187345 129117 122359 169736 129742 56911 101328 173878
19081A73878P785J8776p2605m6295k2886K0073K8444m792L61M1807J5944m8882
$$ 173878 181663 200439 127834 81539 58653 78726 107170 102378 102739 144546 160490 111608
19069A11608o7631j3608k3604J1536N5470M8149K5664N7616N484n9424l3373K6686
$$ 111608 43977 30369 6765 18301 73771 121920 147584 205200 210684 151260 117887 144573
19057A44573L2497M2101J9188m6195Q453l3853J3843L3455j1268j18253k3453
$$ 144573 177070 219171 238359 192164 200617 166764 180607 214062 202794 84541 61088
19046F1088O9465R242l9891K5684N2085J4829J6957K1407L5904l8713k7307J1240
$$ 61088 130553 139795 99904 125588 177673 192502 209459 230866 266770 228057 200750 211990
19034B11990k2745Q829M3137j0695K3101K3871l1501l3963R67K940N89J8978L5277
$$ 211990 189245 198074 241211 230516 253617 277488 245987 212024 212991 215931 216520 235498 270775
19021B70775l222L4217j2835j0795l2989m8927M1693P9885M1000M2262K5448L2294
$$ 270775 267553 301770 288935 278140 245151 196224 237917 317802 358802 401064 426512 458806
19009D58806O2244n978K3091J04905M137L2851N1316m6349J0431K8274m3324j9722
$$ 458806 521050 515072 538163 643068 647205 680056 731372 685023 695454 723728 680404 660682
18997F60682O7598M2122N9139j6194l350q5167q7228r4791p4853j22720k9722
$$ 660682 728280 770402 829541 813347 809997 724830 637602 542811 467958 345238 315516
18986C15516l5253n6131M3133L5670J8323P723J6005l3371p4657j3717p033N0799
$$ 315516 280263 224132 267265 302935 321258 328981 344986 311615 236958 223241 216208 267007
18974B67007L1697m8510o9214J1272O5096M7975K9068Q6153L2442l1209k6172
$$ 267007 298704 250194 180980 192252 257348 305323 334391 420544 452986 421777 395605
18963C95605K621L5262k9323K7925P3846P3240P5614J25612R1181O0419M211p798
$$ 395605 398226 433488 404165 432090 505936 579176 654790 780402 871583 932002 936213 928415
18951I28415R204j7185l2232j7770n92O3311O9709L8355K4062m5786j21998j10642
$$ 928415 937619 920434 888202 870432 869840 933151 1002860 1041215 1065277 1019491 897493 786851
18939G86851o2132n3545l5962q2152o4004n4399q2566j704M2761L3938k0421n278
$$ 786851 724719 671174 635212 553060 489056 434657 352091 350387 393148 427086 406665 401387
18927D01387l8014k0648R232l0573l934P018l0920p5778m8141l5982P3850L9257
$$ 401387 363373 342725 351957 321384 317450 324468 293548 217770 169629 133647 207497 246754
18915B46754M5951O3739M0864K0475l1628n5519O719J0714m005p157L2851P699
$$ 246754 292705 356444 397308 417783 386155 330636 337355 348069 344064 336907 369758 377457
18903C77457j6756l1064L166q287k1319M8028k178J9249O8041L6857M6149J32144
$$ 377457 360701 329637 332803 324516 303197 351225 349047 368296 436337 473194 519343 651487
18891F51487Q3530K0654R2183J37533J12139J82904K80790K96017L03267J22741
$$ 651487 735017 755671 847854 985387 1097526 1280430 1561220 1857237 2160504 2283245
18881B283245J7448k01395k07507O7248J87118K41691Q2208m3670k53179m84225
$$ 2283245 2300693 2099298 1891791 1959039 2146157 2387848 2470056 2426386 2173207 1688982
18871A688982m21180k61453j27928m3657m0984p0010l5802J087q1224o2544r525
$$ 1688982 1267802 1006349 878421 834764 793780 723770 687968 689055 607831 545287 535762
18860E35762o7470M1945M4326M8896J95536J54973J27526K01821L84510M48215
$$ 535762 468292 510237 554563 603459 798995 953968 1081494 1283315 1667825 2116040
18850B116040K95684J31412j25324k77625o5306J65288K73046K28317M4563j66978
$$ 2116040 2411724 2543136 2417812 2140187 2074881 2240169 2513215 2741532 2786095 2619117
18840B619117l67072m66997l14188j40579o028N7327k1019p1808j19616j78321
$$ 2619117 2252045 1785048 1470860 1330281 1324253 1381580 1360561 1288753 1169137 990816
18830I90816j53152K305M0289j2592p841k5697k8250n5544l0982k8211j0649p2437
$$ 990816 837664 839969 880258 867666 859825 834128 805878 750334 719352 691141 680492 608055
18818F08055j00040k3609l6454J4540J7840k8581l0846N8987l272j9876o07J9481
$$ 608055 508015 484406 447952 462492 480332 451751 420905 479892 476620 456744 456137 475618
18806D75618k2386j5448P587j5793j3679Q2658O5243l215K8499j9813J6283K1924
$$ 475618 453232 437784 445371 429578 415899 498557 563800 560585 589084 569271 585554 607478
18794F07478R144j1485N9168M5074j2248L738n7805m4322k2213n4253j0667O9968
$$ 607478 616622 605137 664305 709379 697131 700869 643064 598742 576529 522276 511609 581577
18782E81577K6136J4494J1518J2608n5765m4053K2166L5923m0403j4685J4845
$$ 581577 607713 622207 633725 646333 590568 546515 568681 604604 564201 549516 564361
18771E64361M8501R8191J40933J03506k188j9676j18479j33066r2869o8728o9167
$$ 564361 612862 711053 851986 955492 953304 933628 815149 682083 589214 520486 451319
18760D51319L803j8289k1679l6519J3792M7463N5971J2918l7346k4498l0274p928
$$ 451319 455122 436833 415154 378635 392427 439890 495861 508779 471433 446935 416661 408733
18748D08733L6348l1202k6297l0515J4979P8123K2628N2715Q309l1077r7641m0038
$$ 408733 445081 413879 387582 357067 372046 450169 472797 525512 533821 502744 405103 365065
18736C65065K4714L8400k9118M7507Q5458L1586j0128N1895N5891P9633L9198
$$ 365065 389779 428179 399061 446568 532026 563612 553484 605379 661270 740903 780101
18725G80101O7658J34526J66208J95217J60926J37481J29839j8626r4095r0707
$$ 780101 847759 982285 1148493 1343710 1504636 1642117 1771956 1753330 1659235 1568528
18715A568528q4793p0491J5142J13464J45681J81229Q3077n3775j72321k50980
$$ 1568528 1483735 1413244 1428386 1541850 1687531 1868760 1951837 1898062 1725741 1474761
18705A474761k47321j81472j39255j10158l3764n2139n1446k8063l582J6762J4479
$$ 1474761 1227440 1045968 906713 796555 762791 710652 659206 631143 627561 644323 658802
18694F58802j1267k9892k9855j7847j3551j475L9247p921l1952K5163M8148l0559
$$ 658802 647535 617643 587788 569941 556390 554915 594162 586241 554289 579452 627600 597041
18682E97041j966N4132L4901N0051L8758O6930J15333J80509K70684K73892J86232
$$ 597041 595075 649207 684108 734159 772917 839847 955180 1135689 1406373 1680265 1866497
18671A866497R7798n450p4688j05039k12819j22109J4018J21220K25375K00313
$$ 1866497 1964295 1958845 1884157 1779118 1566299 1444190 1458208 1579428 1804803 2005116
18661B005116J27162n5034j69146k00271l13377k52522j64004j03718m5315L1408
$$ 2005116 2132278 2077244 1908098 1707827 1394450 1141928 977924 874206 828891 860299
18651H60299l847q9531j12964m1657N6708K2827k7169j04333q1154K9987P5021
$$ 860299 856452 766921 653957 612300 669008 691835 664666 560333 479179 509166 584187
18640E84187l5411n4106N631L5178o892j0034k9650j5245K661n1775q318K466
$$ 584187 548776 494670 500301 535479 528587 518553 488903 473658 476319 424544 416226 418692
18628D18692k4953j0824L2446L4653k9479p6033p8666L0616J5293q1635o4087
$$ 418692 393739 382915 415361 450014 420535 344502 265836 296452 311745 230110 166023
18617A66023k4906k6846k5895l6459N2835L0411N7395R1727L2387q4135q6566
$$ 166023 141117 114271 88376 51917 104752 135163 192558 284285 316672 232537 145971
18606A45971O2698M9371J55463K72305K70482K92596L36443L32519K45305N1001
$$ 145971 208669 258040 413503 685808 956290 1248886 1585329 1917848 2163153 2214154
18596B214154j35323j55733l3938Q4466J65150J76396K7165j44622k83843l36633
$$ 2214154 2078831 1923098 1889160 1973626 2138776 2315172 2342337 2197715 1913872 1577239
18586A577239k54315j36722j38759q7101p3498j8966Q1875K95676L77652L11664
$$ 1577239 1322924 1186202 1047443 960342 886844 867878 949753 1245429 1623081 1934745
18576A934745J76136R956r4747j40963o9241K48389M12438L34280J40658k5938
$$ 1934745 2110881 2120837 2026090 1885127 1815886 2064275 2476713 2810993 2951651 2925713
18566B925713k74331l24300k70919j69341j05323r0262o6064n1504r0796r0051
$$ 2925713 2651382 2327082 2056163 1886822 1781499 1691237 1625173 1573669 1482873 1392822
18556A392822m0988l0102r3667j17007r0601k6614J411n9186o4395K9232J2503
$$ 1392822 1351834 1321732 1228065 1111058 1020457 993843 995254 936068 871673 900905 913408
18545I13408l7895K0745q023p7713j28426r6387q5844m5197J6257N8116O3219
$$ 913408 875513 896258 888235 810522 682096 585709 499865 454668 470925 529041 592260
18534E92260Q0586R9123J07244J44413J08961o804l6911J8983P5588M1368P4633
$$ 592260 672846 771969 879213 1023626 1132587 1125783 1088872 1107855 1183443 1224811 1299444
18523A299444Q6375K24433K13813J96971J45446O0078o5252j77602r0081q173
$$ 1299444 1385819 1610252 1824065 2021036 2166482 2226560 2161308 1983706 1893625 1885452
18513A885452k071R896m9002o0545j22157j17664j68686n1588L9456l4484j20482
$$ 1885452 1883381 1893277 1844275 1783730 1661573 1543909 1375223 1323635 1363091 1328607 1208125
18502A208125p8397q8980j08672m5006n3584m5477N0026L1420m5941j6674J4767
$$ 1208125 1129728 1040748 932076 887070 833486 788009 838035 869455 823514 806840 821607
18491H21607N97L4524J10910J84528L04901M93344N11373L57512J46325R247k19615
$$ 821607 822204 856728 967638 1152166 1457067 1950411 2461784 2819296 2965621 2974868 2755253
18480B755253k41134r1188J6030j8344K0830Q6961J29226J42994J20028P4817
$$ 2755253 2514119 2422931 2438961 2420617 2441447 2528408 2657634 2800628 2920656 2995473
18470B995473J6879L3076p7592j60515j41740O5871J54330K85421K14718J4241
$$ 2995473 3012352 3045428 2967836 2807321 2665581 2731452 2885782 3171203 3385921 3400162
18460C400162k04702m34454l53179k22899j07994M5247J91889L38405L67999J84517
$$ 3400162 3195460 2761006 2407827 2184928 2076934 2122181 2314070 2652475 3020474 3204991
18450C204991l8532k83052m45809m02431k15800m3406J9348L440N838K8963J9546
$$ 3204991 3166459 2883407 2437598 2035167 1819367 1775961 1795309 1798749 1804587 1833550 1853096
18439A853096P1130P7515J92527K17016K77915L14403L16141K85857L42105L21441
$$ 1853096 1924226 2001741 2194268 2411284 2689199 3003602 3319743 3605600 3947705 4269146
18429D269146J24430p9790k72758l25727j87740j4617P3405j0549j54548l9284
$$ 4269146 4393576 4313786 4041028 3715301 3527561 3512944 3586349 3575800 3421252 3381968
18419C381968Q2879K09631L24992L49743L15629m0841l10040l71030l44188j38837
$$ 3381968 3464847 3674478 3999470 4349213 4664842 4624001 4313961 3942931 3598743 3459906
18409C459906J13961L76368M17868L36337P6626k88590n69524o23809l92994k46496
$$ 3459906 3573867 3950235 4368103 4704440 4781066 4492476 3922952 3299143 2906149 2659653
18399B659653j28165p5460j09841q0501n2688Q429J8488K6854J47140J14876j08445
$$ 2659653 2531488 2456028 2346187 2265686 2212998 2221427 2239915 2266769 2413909 2528785 2420340
18388B420340j60152l5178n0691j10997m3061M3005l1773p2077j6792J04686Q9850
$$ 2420340 2260188 2225010 2174319 2063322 2020261 2063266 2031493 1959416 1942624 2047310 2137160
18377B137160J8877L2089K2377M0673p053j7040m9555J9663J45146L92949N73191
$$ 2137160 2156037 2188126 2210503 2251176 2244123 2227083 2177528 2197191 2342337 2735286 3308477
18366C308477N75664M88398K09190j24077k54327l11782j33451K96172N54948
$$ 3308477 3884141 4372539 4581729 4457652 4203325 3891543 3758092 4054264 4609212
18357D609212N48685M20786J64693j10483l18447n41322n58858l29005j46200
$$ 4609212 5157897 5578683 5743376 5632893 5314446 4773124 4214266 3885261 3739061
18348C739061j46786j69653K5081J34321J14622O7301P6772K2746m0209O5936
$$ 3739061 3592275 3422622 3447703 3582024 3696646 3763947 3840719 3863465 3823256 3889192
18338C889192J50155J25379K38885K19724J72731J51174J34740K37433L07527
$$ 3889192 4039347 4164726 4403611 4623335 4796066 4947240 5081980 5319413 5626940
18329E626940N01722O24019M31742K64808R7259J3935K61715N02012O64936O38633
$$ 5626940 6128662 6752681 7184423 7449231 7546490 7560425 7822140 8324152 8989088 9627721
18319I627721O41063O39089O08244P56703Q55498R43554J088957J305082J895018
$$ 9627721 10268784 10907873 11516117 12272820 13128318 14071872 15160829 16465911 18360929
18310A8360929K907013L940184M715336N244224O118946P607312J1187277J8802119
$$ 18360929 21267942 25208126 29923462 35167686 41286632 48893944 60081221 78883340
18302G8883340L3020544N2088576O6115561N3245233K3678904o562029m2772711
$$ 78883340 111903884 163992460 230108021 283353254 307032158 300470129 257697418
18295B57697418m0533354j691280L4907056N0695108K9907145O7296l7466205
$$ 257697418 217164064 215472784 250379840 301074948 330982093 331049389 293583184
18288B93583184p3697523o3676905l8514390k2424621j3194813p753142m684405
$$ 293583184 219885661 156208756 117694366 95269745 82074932 74321790 69637385
18281F9637385l408131l779750l633107j954700L6130J897216L094553M048712
$$ 69637385 66229254 62449504 58816397 56861697 56897827 58795043 61889596 65938308
18273F5938308N814487R170265J5807665K8868490M9969456P1725479P3827196
$$ 65938308 71752795 80923060 96730725 125599215 175568671 247294150 321121346
18266C21121346M3430064R123151l2961589n7778494k5313338K2528477N5218300
$$ 321121346 364551410 373674561 340712972 282934478 257621140 280149617 335367917
18259C35367917M9332470J4728152k3201059p3480122q7573938n9874879l5574082
$$ 335367917 384700387 399428539 376227480 302747358 215173420 155298541 119724459
18252A19724459k1173306j2999560q344393n887197n579000o248461n986919n062165
$$ 119724459 98551153 85551593 77207200 71320003 65741003 59492542 53505623 48443458
18244D8443458l829102k864382k467607k173767j695165j278004q47293m00911
$$ 48443458 44614356 41749974 39282367 37108600 35413435 34135431 33288138 32887227
18236C2887227K4379L50129J155020K287498L637196N293525P559407J1360245
$$ 32887227 32911606 33261735 34416755 36704253 40341449 45634974 53194381 64554626
18228F4554626J7960279K7559191L7451133L9899997L5340615K7884084Q146679
$$ 64554626 82514905 110074096 147525229 187425226 222765841 250649925 258796604
18221B58796604j2495658j8450360k3172677k1075151r41875K1903507L3146231
$$ 258796604 246300946 227850586 204677909 183602758 182660883 204564390 237710621
18214B37710621L1693831K3935268K5723k6820089l6160471m4898399m6571076
$$ 237710621 269404452 293339720 293365443 266545354 230384883 185486484 138915408
18207A38915408l3398750k0477726j2425913p993408n791058m515883l912049
$$ 138915408 105516658 85038932 72613019 64619611 58828553 54312670 50400621
18200E0400621l702944l426741l103768k773263k285665j896290j323972p47335
$$ 50400621 46697677 43270936 40167168 37393905 35108240 33211950 31887978 31140643
18192C1140643k49583Q4650L50833O76745J052451J511895K286918L248175M522051
$$ 31140643 30891060 30975710 31326543 32003288 33055739 34567634 36854552 40102727 44624778
18183D4624778O321554R049492J3769955K2081969L3445555M3782161M4783808
$$ 44624778 50946332 59995824 73765779 95847748 129293303 173075464 217859272
18176B17859272L9220836L0060452O113848j5333315k0983472k7407086k4081833
$$ 217859272 257080108 287140560 293254408 277921093 256937621 229530535 205448702
18169B05448702q73821K4534999L8128247L6453217K8202105M473221k7669159
$$ 205448702 204574881 229109880 267238127 303691344 331893449 336366670 308697511
18162C08697511m0731272m9699527n4053910m0961587k5610436j5534124r691933
$$ 308697511 267966239 218266712 164212802 123251215 97640779 82106655 72414722
18155G2414722o745831n131449m204497l899459l891169l882840l569995l145839
$$ 72414722 65668891 60537442 56332945 52433486 48542317 44659477 41089482 37943643
18147C7943643k819091k363489j843835j320958r23079n98536l5179L58738M24233
$$ 37943643 35124552 32761063 30917228 29596270 28673191 28074655 28039476 28398214 28822447
18138B8822447L14940P0097k11690J51602Q19744J074576Q12532J12676q63392
$$ 28822447 29137387 29207484 28995794 29147396 29967140 31041716 31854248 31966924 31103532
18129C1103532j826144k085667j542975q41745m69911l58274n38202q22925r03079
$$ 31103532 29277388 27191721 25648746 24807001 24337090 23978816 23440614 22617689 21714610
18120B1714610n75850r0387L19620P84594J257806J853105L184640N778742J0597141
$$ 21714610 21138760 21048373 21367993 22152587 23410393 25263498 28448138 34226880 44824021
18111D4824021J7033504K1630256J5791876M316959q476765k2282316k0557853
$$ 44824021 61857525 83487781 99279657 103596616 95119851 72837535 52279682
18104E2279682j1966452o787042l880969k309608j508649j019887q76754j102209
$$ 52279682 40313230 33526188 29645219 27335611 25826962 24807075 23930321 22828112
18096B2828112r94596o19692l88838n6175M63354Q46953J242380J633683K145520
$$ 22828112 21833516 21213824 20824986 20768811 21232165 22079118 23321498 24955181 27100701
18087B7100701K787804L533402M236460N101415O401566Q953928J4005317K4045575
$$ 27100701 29888505 33421907 37658367 42759782 49161348 58115276 72120593 96166168
18079I6166168M0164658N6892395N8670215L6772027R697202k1717804m2757819
$$ 96166168 136330826 193223221 251893436 288665463 298362665 276644861 233887042
18072B33887042k3371298J2797597L9234965L8266878J5127491j2507262m7420035
$$ 233887042 210515744 223313341 262548306 300815184 315942675 303435413 256015378
18065B56015378o1095359m3182086k2934221r611444j261332N440571J3346781
$$ 256015378 194920019 151737933 128803712 119192268 117930936 123371507 136718288
18058A36718288K5659753M6061519P1368972Q3683344O0432595K1101539k1923309
$$ 136718288 162378041 208439560 279808532 363491876 423924471 445026010 423102701
18051D23102701o3625975n4154786n979097L6624617M8588245K4531551r076743
$$ 423102701 359476726 305321940 299342843 335967460 384555705 409087256 400010513
18044D00010513n2009778q3601095p0933121m4341397k5574566j4230686p243241
$$ 400010513 348000735 264399640 193466519 149125122 123550556 109319870 102076629
18037A02076629k430019J538080O309384J4012762K2124485K2369976J1352891
$$ 102076629 99646610 101184690 107494074 121506836 143631321 166001297 177354188
18030A77354188k054246j8671814k9526122k2742395j0845485q215J0661679K0163860
$$ 177354188 175299942 156628128 127102006 104359611 93514126 93505911 104167590 124331450
18022A24331450K1962422J1388268k519754j8747647l1179445k6639523j6722300
$$ 124331450 146293872 157682140 155162386 136414739 105235294 78595771 61873471
18015F1873471r822958n965652l859615k736347k309040k531944k512363k102386
$$ 61873471 52050513 46084861 42225246 39488899 37179859 34647915 32135552 30033166
18007C0033166j618928j339942j171514r32871p35862m01500o0191K04645M34037
$$ 30033166 28414238 27074296 25902782 24969911 24234049 23832549 23772358 23977003 24411040
17998B4411040P02774J064534J693403K347621K911450L527423M351454N796704
$$ 24411040 25113814 26178348 27871751 30219372 33130822 36658245 41009699 46806403
17990D6806403Q560395J3561648K2088347L3488947M3016967M0934665L1701677
$$ 46806403 55366798 68928446 91016793 124505740 167522707 208457372 240159049
17983B40159049K2893137O989865o507388j0189000j4498097k2113026j3121903
$$ 240159049 263052186 270042051 263534663 253345663 238847566 216734540 203612637
17976B03612637R128745K3325947K3658667J9691734O800848j4839575k4899094
$$ 203612637 212741382 236067329 259725996 279417730 286218578 271379003 246479909
17969B46479909l2204750m2714075l8087608k4112405j3210788o183391k099759
$$ 246479909 214275159 171561084 133473476 109361071 96150283 89966892 87867133
17962H7867133M89934K861441N236614R501274J8781903L6557581O3173207Q7519347
$$ 87867133 88357067 91218508 96455122 105956396 124738299 161295880 224469087 311988434
17954C11988434Q0831978L8253043p520226o6924251r8698649p3379051m3204358
$$ 311988434 392820412 431073455 423553229 356628978 257930329 184551278 141346920
17947A41346920k4184757j2884590n787926j180627Q91240J031635K270762M958844
$$ 141346920 117162163 104277573 98489647 97309020 98200260 99231895 101502657 106461501
17939A06461501R651053J8278242L2213456M9049065O1788464O4306991O3240106
$$ 106461501 116112554 134390796 166604252 215653317 277441781 341748772 404988878
17932D04988878M4537054O84203k4963695m6089899o3055322l6135906N317856
$$ 404988878 449525932 450210135 425246440 379156541 316101219 279965313 285283169
17925B85283169L6036654N1602909N9595537N0545571P082091k9124207n9265450
$$ 285283169 321319823 372922732 432518269 483063840 490145931 461021724 401756274
17918D01756274r3583612q4062332n3445584l1745365j9104261j2506716q716497
$$ 401756274 308172662 224110330 170664746 138919381 119815120 107308404 98591907
17911I8591907o336883n744413n210521l701689j987663j82349K128111N760564
$$ 98591907 92255024 86510611 81300090 77598401 75610738 75428389 77556500 83317064
17903H3317064J2197313K4304429M0970651N2944246M1258628J3330226j5465173
$$ 83317064 95514377 119818806 160789457 213733703 254992331 268322557 252857384
17896B52857384n2116003o0737772m0579013k3583301j3426422p760681m862717
$$ 252857384 200741381 140003609 99424596 75841295 62414873 54654192 49791475
17889D9791475l615587l578594m315926m169611l527404k844419k131258j414479
$$ 49791475 46175888 42597294 38281368 34111757 30584353 27739934 25608676 24194197
17881B4194197r39175o43114m30154n10690p88074p89235p62274p58221m99192
$$ 24194197 23255022 22611908 22181754 21671064 20882990 20093755 19331481 18573260 18074068
17872A8074068j86602q1362o8845j74285m14566o86641q64412j068148j118341
$$ 18074068 17887466 17806104 17737259 17562974 17148408 16461767 15597355 14529207 13410866
17863A3410866r31432o30029m34657k58160j1812K02315M13184M10543J38523
$$ 13410866 12479434 11849405 11414748 11156588 11144776 11347091 11760275 12170818 12309341
17854A2309341k18212o08036r36728j047378r34820o02614l09098j31288j24019
$$ 12309341 12091129 11483093 10546365 9498987 8564167 7961553 7652455 7521167 7397148
17845G397148k10441l51748n57535n58745l34916j51834q3975o1372n8270n6627
$$ 7397148 7186707 6834959 6277424 5718679 5383763 5231929 5147954 5086582 5028312 4971685
17835D971685n960O6059J59546K04882K97622K46620J52813N086l4836q7015j17180
$$ 4971685 4965725 5031784 5191330 5396212 5693834 5940454 6093267 6098353 6063517 5976502 5859322
17824E859322r9433j00433J9610J0400L4445J41578P2975j4962l8295r9866k19559
$$ 5859322 5759889 5659456 5679066 5689466 5723911 5865489 5938464 5923502 5885207 5785341 5565782
17813E565782l34993l80990l73799l34170l63804l71462l44476k25494k07314
$$ 5565782 5230789 4849799 4476000 4141830 3778026 3406564 3062088 2836594 2629280
17804B629280j87746j78784n9841k5377n4304p9174k8651n2279p5945n6695o5565
$$ 2629280 2441534 2262750 2202909 2177532 2123228 2044054 2015403 1963124 1887179 1830484 1764919
17793A764919o4485n8793r2934n8295r9571r4630j27824j17921j10625j39202
$$ 1764919 1700434 1641641 1548707 1490412 1390841 1296211 1168387 1050466 939841 800639
17783H00639l3185P799M4654K716m6985k5739m0259J6223L218J10975P7959K4549
$$ 800639 767454 775253 819907 822623 775638 749899 709640 725863 729081 840056 918015 942564
17771I42564M6952M0579m894K6506l0368k2079m2803l0240R3819P1564K034l5148
$$ 942564 989516 1030095 1025201 1051707 1021339 999260 956457 926217 1020036 1091600 1093634 1058486
17759A058486q9094j17992q9428m3928N8695R6449O6842N1085j2701o7000o9073
$$ 1058486 969392 851400 761972 718044 776739 873188 940030 991115 978414 911414 842341
17748H42341k5710j7965K2498N0831K7128J1880O053L2307L6783O5665o2068q6022
$$ 842341 816631 798666 821164 871995 899123 911003 917056 949363 986146 1051811 989743 903721
17736I03721r8566L1524P0820K9336j5878J6225j4590J1862J3352J30002J74673
$$ 903721 805155 836679 907499 936835 920957 937182 922592 934454 947806 1077808 1252481
17725A252481J87233J01493J48264J44376J22282M1192l835k6639n9894r4799
$$ 1252481 1439714 1541207 1689471 1833847 1956129 1997321 1993486 1966847 1906953 1812154
17715A812154M0353J29416K01147J07853N5987n4476j05213m0074k0245R6139
$$ 1812154 1852507 1981923 2183070 2290923 2346910 2292434 2187221 2147147 2126902 2223041
17705B223041K80466K15144J0484j92995k36809j67817O5928K48466K44569R2432
$$ 2223041 2503507 2718651 2729135 2536140 2299331 2131514 2197442 2445908 2690477 2782909
17695B782909j06040l11877m03220l50237k61088j69470k8695L7155K7304r6048
$$ 2782909 2676869 2364992 1961772 1611535 1350447 1180977 1152282 1189437 1216741 1120693
17685A120693p9662o5397l5531N8390R2342J66578K91609K62779K90915M09462
$$ 1120693 1041031 975634 940103 998493 1090835 1257413 1549022 1811801 2102716 2512178
17675B512178M10605N26219L99958K38846P9989q5145l43133l12337N2192L89318
$$ 2512178 2922783 3449002 3848960 4087806 4167795 4082650 3739517 3427180 3479372 3868690
17665C868690L64415J84801J2634k25562n21411n67984m41426m24391l08316j90640
$$ 3868690 4233105 4417906 4430540 4204978 3683567 3115583 2674157 2249766 1941450 1750810
17655A750810j85116r0879j60648j19993q6860q0800j7300j4151L1460P3277J31634
$$ 1750810 1565694 1474815 1314167 1194174 1107314 1026514 1009214 995063 1026523 1099800 1231434
17644A231434J23374J06673L6074J7062J33272Q9855L2042P7683P0541m9729j06675
$$ 1231434 1354808 1461481 1497555 1514617 1647889 1737744 1769786 1847469 1918010 1868281 1761606
17633A761606j24732j34778j42482j08123n5235n9192L667j5010M3636j5586j33691
$$ 1761606 1636874 1502096 1359614 1251491 1196256 1137064 1140731 1125721 1169357 1153771 1020080
17622A020080n7193L6873R1831J65119J22637J44509L3412l405n5294k0312o210
$$ 1020080 962887 999760 1091591 1256710 1379347 1523856 1557268 1553863 1498569 1478257 1472047
17611A472047L8607J1990L1176J6757J08006J18013j6251r4056j17008o7918l0658
$$ 1472047 1510654 1522644 1553820 1570577 1678583 1796596 1780345 1686289 1569281 1501363 1470705
17600A470705p2092j07897l8522M9711K4239j4504P8802J80337L0593r5680l0046
$$ 1470705 1398613 1290716 1252194 1301905 1326144 1311640 1390442 1570779 1601372 1505692 1475646
17589A475646K6629j7214k1662M3343Q7711L1609m5671l990J4857n6086q4873
$$ 1475646 1502275 1485061 1463399 1506742 1594453 1626062 1580391 1576401 1591258 1535172 1450299
17578A450299j23344m7501p2191p7837m9938p330m363n4933l8660O078O3586P2403
$$ 1450299 1326955 1279454 1207263 1129426 1079488 1072158 1067795 1012862 974202 980280 1043866 1116269
17566A116269N1411L5606M1710Q8471L1821k077j7041L2960O6237J03087K1885
$$ 1116269 1167680 1203286 1244996 1333467 1365288 1363211 1346170 1379130 1445367 1548454 1570339
17555A570339l4341J06596J12922L2292N7662J02058K18045K91373M50684M26493
$$ 1570339 1535998 1642594 1755516 1787808 1845470 1947528 2165573 2456946 2907630 3334123
17545C334123K31337l1420k43423j87547K965J68839K82882K57444p954k68888
$$ 3334123 3565460 3534040 3290617 3103070 3106035 3274874 3557756 3815200 3807246 3538358
17535C538358l69261l52202l07547j94420j06748J424P7893O4395J27892L33712
$$ 3538358 3169097 2816895 2509348 2314928 2208180 2209604 2287497 2351892 2479784 2813496
17525B813496M00467L64025L56281J76922r6112k48181j62802M0288K43284K91017
$$ 2813496 3213963 3577988 3934269 4111191 4015079 3766898 3604096 3644384 3887668 4178685
17515D178685M8116j18147j89466k16399k75558j74299M979K0078m9670K3243
$$ 4178685 4226801 4108654 3919188 3702789 3427231 3252932 3257911 3277989 3228319 3251562
17505C251562J24555R026L0353J15968J56255J81083K58677K98076L69492M22461
$$ 3251562 3376117 3385143 3415496 3531464 3687719 3868802 4127479 4425555 4795047 5217508
17495E217508N12758M59515K87948L09138L47812L64547M14139M87066M89434
$$ 5217508 5730266 6189781 6477729 6786867 7134679 7499226 7913365 8400431 8889865
17486H889865M19849L40507M32159O33130Q94737J243365J761368K402868K983595
$$ 8889865 9309714 9650221 10082380 10715510 11610247 12853612 14614980 17017848 20001443
17477B0001443L734916M765684O458900R666771J5879814K5427371L4354321L3464562
$$ 20001443 23736359 28502043 34960943 44627714 60507528 85934899 120289220 153753782
17469A53753782K0030234N100400j3105614k2154309p171167J5133192L1143324
$$ 153753782 173784016 178884416 165778802 143624493 136453326 151586518 182729842
17462A82729842K8511141J0545775r597937l5725735m7413462l5481454k1905472
$$ 182729842 211240983 221786758 212188821 176463086 129049624 93568170 71662698
17455G1662698j3062224p999700n019800l201668k468906k591938k488705k121245
$$ 71662698 58600474 50600774 45580974 42379306 39910400 37318462 34829757 32708512
17447C2708512j751254j509337j375545j093759o08638k77198k02867k07310j21553
$$ 32708512 30957258 29447921 28072376 26978617 26369979 26092781 25889914 25682604 25561051
17438B5561051j05432M5118M12331Q41189J466350K159660L036249M061675N340493
$$ 25561051 25455619 25500737 25913068 26754257 28220607 30380267 33416516 37478191 42818684
17429D2818684P081023R849831J5043782K4557643L8496965N1891542N2296959
$$ 42818684 49899707 59749538 74793320 99350963 137847928 189739470 242036429
17422B42036429L6899723J2923671j4281793k7875068j3699242J9267728M7961647
$$ 242036429 278936152 291859823 277578030 249702962 236003720 255271448 303233095
17415C03233095N3253070L1838504m935680m5768448p4047183p0966689m7742275
$$ 303233095 356486165 388324669 383388989 337620541 263573358 192606669 144864394
17408A44864394k8466500j6748495r805438n619275l486116k523910j697352k71014
$$ 144864394 116397894 99649399 89843961 84224686 80738570 78214660 76517308 76246294
17400G6246294J466225L610361O166892J0178014J7479334K9599114M4950180
$$ 76246294 77712519 81322880 87489772 97667786 115147120 144746234 189696414
17393A89696414N6499978N5667599M9314814L3767916L343585j2703998j7535384
$$ 189696414 246196392 301863991 351178805 384946721 388290306 375586308 358050924
17386C58050924k3967318j4266280j653092K969548o102852k4052828k8655447
$$ 358050924 334083606 319817326 318164234 321133782 315030930 290978102 262322655
17379B62322655k9694053k9813546j5169298L014394Q817737L138014n263564
$$ 262322655 232628602 202815056 187645758 190660152 199477889 202615903 197352339
17372A97352339j7247374j9702707n292468J2103208K2816339J7686492K859829
$$ 197352339 180104965 160402258 155109790 167212998 190029337 207715829 210575658
17365B10575658j3609674l3873151l8629059k7106552j6304946r526452n825291
$$ 210575658 196965984 163092833 124463774 97357222 81052276 71525824 65700533
17358F5700533l954397l251349l603189m043823l546313k357158q10645P82186
$$ 65700533 61746136 58494787 54891598 50847775 47301462 44944304 44133659 44915845
17350D4915845K247117L719716N503878Q096929J2430090K0222395L1989141M4632881
$$ 44915845 47162962 50882678 56386556 64483485 76913575 97135970 129125111 173757992
17342A73757992M9907949M5493365L6516395J2100180j1455760j6020730j9188454
$$ 173757992 223665941 269159306 305675701 317775881 306320121 290299391 271110937
17335B71110937j1120875M042820R564238N074123j4920712l0332229l5064867
$$ 271110937 259990062 264032882 273597120 278671243 263750531 233418302 198353435
17328A98353435m1317122l7327197k5231487j5932103j0354745p301481n655832
$$ 198353435 157036313 119709116 94477629 78545526 68190781 60889300 55233468
17321E5233468m635566m118354l734842l159266k689351k409641k463783k590935
$$ 55233468 50597902 46479548 42744706 39585440 36896089 34486448 32022665 29431730
17313B9431730k681531k456789k018631j592420j150224r21402r98786j220836
$$ 29431730 26750199 24293410 22274779 20682359 19532135 18610733 17611947 16391111
17305A6391111j537358j580420j490734j118086o86271l70043k07567m5577Q1050
$$ 16391111 14853753 13273333 11782599 10664513 9978242 9608199 9400632 9355055 9436105
17296I436105P8997P0330O1433l1138o1438j37531j77643k24389j81170k07685
$$ 9436105 9515102 9585432 9646865 9615727 9554289 9416758 9239115 9014726 8833556 8625871
17286H625871l50460m29205n56807o58011o77629o18880n77372o30414n31193
$$ 8625871 8275411 7846206 7289399 6631388 5953759 5334879 4757507 4127093 3595900
17277C595900l69891k66719k17742k15636j11239p0813o5304n5678J3979J333
$$ 3595900 3226009 2959290 2741548 2525912 2414673 2343860 2278556 2222878 2236857 2238190
17267B238190K074O5618J14712j9018m5471j19927r8042j8919m2496M598J9649
$$ 2238190 2240264 2305882 2420594 2401576 2356105 2236178 2138136 2119217 2076721 2081319 2100968
17256B100968j01157j49791j10899r5929r5422j26600q1433k8458K9034l8932
$$ 2100968 1999811 1850020 1739121 1643192 1547770 1421170 1339737 1311279 1340313 1301381
17246A301381j1150M122l4372q5875j1996o664L175L2149j3967m151n2053j05608
$$ 1301381 1290231 1294353 1259981 1174106 1162110 1155446 1158621 1190770 1176803 1172652 1120599 1014991
17234A014991m5610L853k181l9336l2171j8853l4940l4917k4479N9115O2208P3952
$$ 1014991 969381 973234 971053 931717 899546 880693 845753 810836 786357 845472 907680 981632
17222I81632R922n7692k0847k7442L1104K6861j3876m4904K0492K233N1673J00337
$$ 981632 991554 933862 913015 885573 916677 943538 929662 884758 905250 907483 959156 1059493
17210A059493N8089J006o3616k9420K3109m7880k8395j3285n3324r9378j01372
$$ 1059493 1117582 1118588 1054972 1025552 1048661 1000781 972386 959101 905777 806399 705027
17199G05027Q43j5110n7968Q050l1815j6988O9641J49886J90981K02716K44408
$$ 705027 705870 690760 632792 640842 609027 592039 661680 811566 1002547 1205263 1449671
17188A449671L53489M54167K70385O6438k22533m12854k08086j08407J3559J70388
$$ 1449671 1803160 2257327 2527712 2594150 2371617 1958763 1750677 1642270 1655829 1826217
17178A826217L21587K79979O5154j54847l71436m51968l57488k24984j55029j13890
$$ 1826217 2147804 2427783 2492937 2338090 1966654 1514686 1157198 932214 777185 663295
17168F63295j15519o0613l8690q7655n0208k5569J1858m1677k9012J1575K7947
$$ 663295 547776 487163 448473 360818 310610 285041 296899 255222 226210 237785 265732
17157B65732N3217P6461J32585P0256l396l467L1432K0384O2551M5280J44186
$$ 265732 318949 395410 527995 598251 594855 591388 622820 643204 705755 751035 895221
17146H95221J69006J57076J01068J74912K76347L30144K92925K25152J55342P4353
$$ 895221 1064227 1221303 1322371 1497283 1773630 2103774 2396699 2621851 2777193 2851546
17136B851546M1207k2864q3262r8647m8008J07939P5268O9843L1336r9460j57740
$$ 2851546 2892753 2869889 2786627 2687980 2639972 2747911 2823179 2893022 2924358 2824898 2667158
17125B667158j89338k63611m17669m33378k50956j87768j13771p2320j56656j07463
$$ 2667158 2477820 2214209 1796540 1363162 1112206 924438 810667 738347 581691 474228
17115D74228k5064O312j8243M172k921Q289L4665N5371M2657K8052j5795p999
$$ 474228 449164 455476 437233 441405 438484 446773 481438 536809 579466 607518 591723 583724
17103E83724K2644N0560O6065Q1685M9000R4489n7957p1236l0252l9419P8884
$$ 583724 606368 656928 722993 804678 853678 948167 890210 818974 788722 749303 828187
17092H28187J85719L35488K87230J12358n1329k26299k78925k21386k2502Q4201
$$ 828187 1013906 1349394 1636624 1748982 1697653 1471354 1192429 971043 948541 1032742
17082A032742J10813K19178K20716J86153l7357k57849k57908j26077n7963r8029
$$ 1032742 1143555 1362733 1583449 1769602 1732245 1474396 1216488 1090411 1032448 934419
17072I34419j01353r0781j6446K1557o6815q6340j8366L6360J6439k6048j1917
$$ 934419 833066 742285 725839 747396 680581 594241 575875 612235 628674 602626 590709
17061E90709k9761o4577j3148L216M2759j5114j7086J3649l2583l1539j8360l1763
$$ 590709 560948 496371 483223 486439 529198 514084 496998 510647 478064 446525 428165 396402
17049C96402L1636J6492l6764p8542n8607j8618m9946k3137j3764J4702n6861
$$ 396402 428038 444530 407766 329224 270617 251999 202053 178916 165152 179854 122993
17038A22993p0039J0931L1715M7769l651K3766K7850L9773l0556K8007J9676O6315
$$ 122993 52954 63885 95600 143369 139718 163484 191334 231107 200551 228558 248234 314549
17026C14549J31494L4683M1166L3042l2692j4165L0842r798l4057n900r939J5204
$$ 314549 446043 480726 521892 554934 522242 508077 538919 529121 495064 489164 479225 494429
17014D94429K6461l4133n8339q3092r3697k9129j8539L502Q9602j517m1561p4681
$$ 494429 520890 486757 428418 345326 251629 222500 203961 207463 297065 295548 253987 179306
17002A79306R249k607l6421o9804N748K1699K0309j1273J739o606l3220l1893
$$ 179306 188555 185948 149527 79723 85471 107170 127479 116206 117945 111339 78119 46226
16990D6226o5066j5576M3137N9566l570l87J8903l4668l1771J7830l7299j8478
$$ 46226 -18840 -34416 8721 68287 64717 64330 83233 48565 16794 34624 -2675 -21153
16978b1153K036J1829O457k0598j3592L4866n213K9724M180j9348l7242L060k1475
$$ -21153 -19117 -7288 -831 -21429 -35021 -155 -5368 24356 28536 9188 -28054 -24994 -46469
16965d6469q154K7719M7514K1215N4547O3997L6452J16901J52634K15458J63444
$$ -46469 -54623 -26904 20610 41825 96372 160369 196821 313722 466356 681814 845258
16954H45258R9668l9964q5330j16693n579M2172J19562M6713L847o7529k31330
$$ 845258 944926 904962 819632 702939 697360 739532 859094 905807 909654 842125 610795
16943F10795j76142r4112o1641q674l3932k0455M877J9411m2737q2203q3540K5707
$$ 610795 434653 340541 278900 270226 236294 215839 220716 240127 197390 115187 31647 57354
16931E7354L2111L0560J0159m3768j7387J0552K9394m7124J8664L9420L2304M4985
$$ 57354 89465 120025 130184 86416 69029 79581 108975 61851 80515 119935 152239 197224
16919A97224m9913k2863L2167L3351k5201K1905O3384J50097K59049K95375L34686
$$ 197224 147311 124448 156615 189966 164765 186670 250054 400151 659200 954575 1289261
16908A289261K73930K09340J04365n2486j26854r6594Q4940J38732J86588K54628
$$ 1289261 1563191 1772531 1876896 1824410 1697556 1600962 1685902 1824634 2011222 2265850
16898B265850J62559O3601R756j40114p4331j15979j68850j27751q6213M913M5947
$$ 2265850 2428409 2492010 2501766 2361652 2287321 2171342 2002492 1874741 1788528 1793441 1839388
16887A839388R8463P170j71962k43535k82127k41993k33644j95118o2441n2452
$$ 1839388 1937851 1945021 1773059 1529524 1247397 1005404 771760 576642 514201 461749
16877D61749l1430m1803n1450m8196p896L7787l4694J8983m5461p7641J7432N6674
$$ 461749 430319 388516 337066 288870 280974 318761 284067 303050 257589 179948 197380 254054
16865B54054Q5311K3014P3122J60408J91575J23929J07602K8703j08415j15824
$$ 254054 339365 362379 435501 595909 787484 911413 1019015 1047718 939303 823479
16855H23479J6342M0086R7022Q8688m347q5160n4808p180Q6160J63188K23435
$$ 823479 839821 879907 976929 1065617 1061270 976110 921302 914122 1000282 1163470 1386905
16844A386905K04848R0762j9795r5111r0967p2914K5889Q9418N4205J1595p5635
$$ 1386905 1591753 1682515 1662720 1567609 1476642 1403728 1429617 1519035 1573240 1584835 1509200
16833A509200k23169k74902k48755j49721j40901p3034K598n2048j4719j5536
$$ 1509200 1286031 1011129 762374 612653 471752 398718 401316 349268 334549 319013
16823C19013o3088l5062m9201m6743r66m278n9095k9895m0830K0300K7148l7519
$$ 319013 255925 220863 171662 124919 123953 119675 60580 30685 -10145 10155 37303 -216
16811b16R565O0936J1045J5944k2004k6552m5403p3926J1976M4801P045K1269
$$ -216 9349 70285 81330 97274 75270 48718 3315 -70611 -58635 -13834 -6789 14480
16799A4480L8497r828o1430k410j0590R715p471l0328o9583J106O1198K5430j5436
$$ 14480 52977 43149 -18281 -20691 -31281 -21566 -29037 -59365 -128948 -127842 -66644 -41214 -56650
16786e6650K3317k7127J6493P786J3204k080K290j8753n2049n5036P148L6386
$$ -56650 -33333 -60460 -43967 -36181 -22977 -25057 -22767 -41520 -93569 -148605 -141457 -105071
16774a05071O5851j3201m5917o7005M685M3287K4411K5057L2057K7520o3266j2688
$$ -105071 -39220 -52421 -98338 -165343 -160658 -117371 -92960 -67903 -35846 -8326 -71592 -84280
16762h4280J2985L28l6937j9899R609M8624O117m560m6172q8246l9284j423K4886
$$ -84280 -71295 -70967 -107904 -127803 -118194 -69570 -63453 -68013 -114185 -202431 -241715 -243138 -218252
16749b18252N9295M2915J0009r0106m5653K867N6978J4751k2185N3517L6850K168
$$ -218252 -158957 -116042 -106033 -196139 -241792 -238925 -181947 -167196 -189381 -135864 -99014 -96846
16737i6846N4739L5635j0928k564n1604p735l3030L3515Q9273J4962o5472k8010
$$ -96846 -42107 -6472 -17400 -19964 -71568 -79303 -112333 -78818 10455 25417 -40055 -68065
16725f8065l703l4456O399j3047J7674P2584j7838j1550J6673l0897o4906k7743
$$ -68065 -71768 -106224 -99825 -112872 -95198 -22614 -40452 -52002 -35329 -66226 -131132 -158875
16713a58875K4950N7104R486J7315q539j3963M5110L1420j2583l5934O698j2563
$$ -158875 -133925 -76821 -67335 -50020 -58559 -72522 -27412 4008 -8575 -44509 -37811 -50374
16701e0374l2634L5767m3982p714m026N4336M2297n5642m6755l266Q399K9902
$$ -50374 -83008 -47241 -91223 -98937 -102963 -48627 -6330 -61972 -108727 -111993 -103594 -73692
16689g3692Q090J2327j0387N7717K281k2736n2883l7001K661M1278K0082K5381
$$ -73692 -65602 -53275 -63662 -5945 -3664 -26400 -79283 -116284 -113623 -72345 -52263 -26882
16677b6882l397q704l7171K8425n3178j7168M5482k4245k3931P0838N2732L3666
$$ -26882 -30279 -38983 -76154 -47729 -100907 -118075 -72593 -96838 -120769 -49931 2801 36467
16665C6467N8148L5327n7419l1720j7233q1526l1293J7263K7541K7253k939k1166
$$ 36467 94615 129942 72523 40803 23570 -57956 -89249 -71986 -44445 -17192 -20131 -41297
16653d1297K8513M6753R865j7580o1040m3520R000L1970j8660j8847k4328J8742
$$ -41297 -12784 33969 43834 26254 -34786 -78306 -69306 -37336 -55996 -74843 -99171 -80429
16641h0429J9773K1170l288p5952j7631n65n876j0816K9131O5206n513l6548m2608
$$ -80429 -60656 -39486 -42774 -118726 -136357 -136922 -142798 -153614 -124483 -59277 -64790 -101338 -143946
16628a43946K0469M0821J3777J3248m1286r361R257k3407k4j6883J7111q948k3074
$$ -143946 -123477 -82656 -68879 -55631 -96917 -106278 -97021 -120428 -120452 -137335 -120224 -129172 -152246
16615a52246j1960O8862O4397j0445m3609r488K4187K1658P4695O791q1860k1399
$$ -152246 -164206 -95344 -30947 -41392 -85001 -94489 -70302 -48644 26051 32842 -49018 -70417
16603g0417L8093m3092K7003M3071N1713K974m4785k2948J181m7155k3402j9068
$$ -70417 -32324 -75416 -48413 -5342 46371 49345 4560 -18388 -17207 -64362 -87764 -106832
16591a06832L5173M2940O301K8411J7361K4906K5855L3265L5239o5040o9044m3352
$$ -106832 -71659 -28719 -22418 5993 23354 48260 74115 107380 142619 77579 8535 -34817
16579c4817k7700J5985K6112J5710l5802m6130j8484P4005M0206P1566K650p3789
$$ -34817 -62517 -46532 -20420 -4710 -40512 -86642 -105126 -31121 9085 80651 83301 9512
16567I512q4131n0080J8058K6202K4185n9169l805L7194J586m9198l4900m222
$$ 9512 -74619 -124699 -106641 -80439 -56254 -115423 -119228 -82034 -80448 -129646 -164546 -168768
16555a68768j5221M8220O5668j5107k286l3672J0527M9561M5156j6473l8215l5497
$$ -168768 -183989 -135769 -70101 -85208 -87494 -121166 -110639 -61078 -15922 -32395 -70610 -106107
16543a06107K7486M7254l0491J070M5491k4701j5489L0339l4930r987j0376k4539
$$ -106107 -78621 -31367 -61858 -60788 -15297 -39998 -55487 -25148 -60078 -70065 -80441 -104980
16531a04980k4488L8421k3222m4353R268N666K3566K1324n614o4792L5564M6885
$$ -104980 -129468 -91047 -114269 -158622 -149354 -143688 -120122 -98798 -104412 -169204 -133640 -86755
16519h6755l4555j6717P594J2685P317k9775l5291k1253O834L0329M2124K4824
$$ -86755 -121310 -138027 -130433 -117748 -110431 -140206 -175497 -196750 -189916 -159587 -117463 -92639
16507i2639J8014J8024J8269k6170m0865O981N0321k2612q0887L1560K2211j3258
$$ -92639 -74625 -56601 -38332 -64502 -105367 -98386 -48065 -70677 -151564 -120004 -97793 -111051
16495a11051o5974J9177N7745L6858j1477l7387J2330k9454p461l7842k2161L4040
$$ -111051 -177025 -157848 -100103 -63245 -74722 -112109 -99779 -129233 -136694 -174536 -196697 -162657
16483a62657K5032l9420L8517K693k1521J3442N9496J0011L7622l2592m5801j2064
$$ -162657 -137625 -177045 -138528 -135835 -157356 -143914 -84418 -74407 -36785 -69377 -115178 -127242
16471a27242J3689m8228j7691K3063j9984j283N4434k0174L944J2658M090K2598
$$ -127242 -113553 -161781 -179472 -156409 -176393 -177676 -123242 -143416 -139472 -126814 -122724 -100126
16459a00126L0629l4383k5445J4256L7286M616l2155L1316M2870p128r6740P8
$$ -100126 -69497 -103880 -129325 -115069 -77783 -73167 -105322 -74006 -31136 -38264 -135004 -134926
16447a34926K1915M9812K4964k407L7777j5145k6631J3337o4236j2913k3101j4222
$$ -134926 -113011 -63199 -38235 -40642 -2865 -18010 -44641 -31304 -95540 -108453 -131554 -145776
16435a45776m0785k4259n4113R212M2918J6832K7433Q312J6117M8541m8106r896
$$ -145776 -186561 -210820 -264933 -255721 -212803 -195971 -168538 -160226 -144109 -95568 -143674 -153570
16423a53570L5471K0005j7858R974o484l2805N7130P2250N595m0505o4234k0637
$$ -153570 -118099 -98094 -115952 -105978 -112462 -145267 -88137 -15887 -10292 -50797 -115031 -135668
16411a35668L3313p229K4499K610r421k7284J0916P2594K8677l6657n5949k8419
$$ -135668 -102355 -109584 -85085 -82475 -91896 -119180 -108264 -35670 -6993 -43650 -99599 -128018
16399a28018J3067J7724j180K0774J1169P02P686J5844j13832m2295J9135P7255
$$ -128018 -114951 -97227 -98407 -77633 -66464 -65762 -58076 -42232 -156064 -198359 -179224 -101969
16387a01969M9661M914l2454l767J8604m0228L329k3574J7028K6259J2652k4432
$$ -101969 -52308 -47394 -79848 -83615 -65011 -105239 -101910 -125484 -108456 -82197 -69545 -93977
16375i3977j6706J4753l991O2082M2010N0232l7225o2004l8380q792l7653j0197
$$ -93977 -110683 -95930 -99921 -37839 4171 54403 17178 -44826 -83206 -91998 -129651 -139848
16363a39848j8866J7543L3475M747k4550k0666L0615K3199l5614J0705L147n4115
$$ -139848 -158714 -141171 -107696 -102949 -127499 -148165 -117550 -94351 -129965 -119260 -116113 -170228
16351a70228L5608o720K7178K4272j1994Q742L8770j2720J7961k6525p558M9410
$$ -170228 -134620 -141340 -114162 -89890 -101884 -93142 -54372 -67092 -49131 -75656 -83214 -33804
16339c3804l7618p1952L2589j4398j1658n3809k0061K1714M5362K3044J8669l3092
$$ -33804 -71422 -143374 -110785 -125183 -136841 -190650 -210711 -188997 -143635 -120591 -101922 -135014
16327a35014l1306j9212l4948J5507L7101K4917M2998j0408j0904L0791Q706l0073
$$ -135014 -166320 -185532 -220480 -204973 -167872 -142955 -99957 -110365 -121269 -90478 -81772 -111845
16315a11845K2032N761K4574m7453l5191L6524k4394J2961J2515k138k764r1696
$$ -111845 -89813 -84052 -59478 -106931 -142122 -105598 -129992 -117031 -104516 -106654 -109418 -201114
16303b01114P692O3954j8932J4625N162p0943L5608M1445K1069J3577J6427K137
$$ -201114 -193422 -129468 -148400 -133775 -128613 -199556 -163948 -122503 -101434 -87857 -71430 -69293
16291f9293j6294k9623K3040K6246n1434j8401M7411K2481K4836j3313J5511k0085
$$ -69293 -85587 -115210 -92170 -65924 -117358 -135759 -88348 -65867 -41031 -54344 -38833 -58918
16279e8918l8566k5829q863L0729o275j0372M4011K9974o815l1825o1935k376
$$ -58918 -97484 -123313 -132176 -101447 -107722 -118094 -74083 -44109 -50924 -82749 -144684 -147060
16267a47060P591J0179k600J2917m2923m668j56M4117J6525K0966p230J7673J1296
$$ -147060 -139469 -129290 -131890 -118973 -161896 -166564 -166720 -122603 -106078 -85112 -92342 -74669 -63373
16254f3373k5867K91q918q882n5684p6254J2401N2678J16805L2316m0567o75P818
$$ -63373 -89240 -88949 -97867 -106749 -162433 -238687 -226286 -173608 -56803 -24487 -65054 -65729 -57911
16241e7911m630k2745k541j114j6774j1292l5100M579m0008j0742M7047N1134
$$ -57911 -62541 -85286 -87827 -88941 -105715 -117007 -152107 -147528 -187536 -198278 -151231 -100097
16229a00097O7249M6756k2421k2188l9973j5487P784L8778J256k4270M8679M8230
$$ -100097 -32848 13908 -8513 -30701 -70674 -86161 -78377 -39599 -38343 -62613 -13934 34296
16217C4296J7862n9968k6784J2282n595m0673o2820j7487N93L6964K8889L0112
$$ 34296 52158 -7810 -34594 -22312 -27907 -68580 -131400 -148887 -148294 -111330 -82441 -52329
16205e2329L428K1237j7040l7112k1275J7869M1731K7785p5757q6253m0495J6637
$$ -52329 -48901 -27664 -44704 -81816 -103091 -85222 -43491 -15706 -91463 -177716 -218211 -201574
16193b01574M7044Q6131M4294J8041K9036l6502m1399m2148j5572j9825J4018
$$ -201574 -154530 -68399 -24105 -6064 22972 -13530 -54929 -97077 -112649 -132474 -118456
16182a18456J4659p092p475m0007J3383P0837j7407p29q274Q89L6830l3097p3861
$$ -118456 -103797 -110889 -118364 -158371 -144988 -74151 -91558 -92287 -100561 -99672 -62842 -95939 -169800
16169a69800k1143N9107l3227J5494P2744q208J8664K1154k1631J6082j4966K4658
$$ -169800 -190943 -131836 -165063 -149569 -76825 -85033 -66369 -45215 -66846 -50764 -65730 -41072
16157d1072q660k3786l0633j7221M8371N3394l567l1128J1730j3805m8919j3538
$$ -41072 -49732 -73518 -104151 -121372 -73001 -19607 -23174 -54302 -42572 -56377 -105296 -118834
16145a18834n235n7966j2604j1276O7759J4808J8117L8972J4997k0200k8028K7365
$$ -118834 -124069 -182035 -194639 -205915 -138156 -123348 -105231 -66259 -51262 -71462 -99490 -72125
16133g2125J1472n0856K074p740k9857j5180J9759J7743K4518N381K0000k2056
$$ -72125 -60653 -111509 -109435 -117175 -147032 -162212 -142453 -124710 -100192 -94811 -74811 -96867
16121i6867m3801K842N1362L1588m068k623l7071k6404K7452L0510m387L7101
$$ -96867 -140668 -137826 -86464 -54876 -58944 -61567 -98638 -125042 -97590 -67080 -71467 -34366
16109c4366N755n9417j6982N9591M4581l8780l909k7806k3970J3542m1792K0321
$$ -34366 -28611 -88028 -105010 -45419 -838 -39618 -43527 -71333 -95303 -81761 -123553 -103232
16097a03232O9322m8551n2432k5874O505p994Q822O8952O356j9447R49K8039m204
$$ -103232 -33910 -82461 -134893 -160767 -154262 -162256 -153434 -84482 -78126 -97573 -96624 -68585 -72789
16084g2789j4754Q037L8006m3160n6391K6168n008j2844R995j392j1964l3283
$$ -72789 -87543 -79506 -41500 -84660 -141051 -114883 -119891 -132735 -122740 -124132 -136096 -169379
16072a69379r381L8558J3824R706K9651K8065J6679J8811M3531j6104k7757K8695
$$ -169379 -178760 -140202 -126378 -116672 -87021 -58956 -42277 -23466 20065 3961 -23796 4899
16060D899l1681r022L787m9690l246J3152M5401K0204m0448J7769J1722l4690
$$ 4899 -26782 -35804 -32017 -81707 -84953 -71801 -26400 -6196 -46644 -28875 -17153 -51843
16048e1843o3801m9069J9932N2392J08091M6871m0110k8517k0793m1190n4747
$$ -51843 -115644 -164713 -144781 -92389 15702 62573 22463 -6054 -26847 -68037 -122784
16037a22784n6164K0126M576L8151P0585L2429m949k8458j5425k7005n1547l5466
$$ -122784 -178948 -158822 -154246 -116095 -45510 -13081 -18030 -46488 -61913 -88918 -140465 -175931
16025a75931J8468L5492J01q888o843K5610N4583K4061R679j5075j8363j3810
$$ -175931 -157463 -121971 -121870 -130758 -137601 -111991 -57408 -33347 -23668 -38743 -57106 -70916
16013g0916O4420r975l2965m981K7811J2605n9353j5325L436J7855k1511m3186
$$ -70916 -6496 -16471 -49436 -54417 -26606 -14001 -73354 -88679 -85243 -67388 -88899 -132085
16001a32085P222J8400m4711j9417k2602M3155Q2928O8636J5341n8105j6782J0331
$$ -132085 -124863 -106463 -151174 -170591 -193193 -150038 -67110 1526 16867 -41238 -58020 -47689
15989d7689N5216K8342m0889j4669q44Q853n566o6053q248K7023l6594L8662M3738
$$ -47689 7527 35869 -5020 -19689 -20533 -11680 -17246 -83299 -91547 -64524 -101118 -62456 -18718
15976a8718J5422J5425l3221o1242j080K8512o082j7923Q5120k9482j02259q176
$$ -18718 -3296 12129 -21092 -82334 -83414 -54902 -60984 -78907 6213 -23269 -125528 -133704
15964a33704O9489J3302M4014L1928M327n9616j174j0763r370l8038J8252N2168
$$ -133704 -64215 -50913 -6899 25029 29356 -30260 -31434 -42197 -51567 -89605 -71353 -19185
15952a9185L7656k5558m2857n3515L5294K607j1834M4100J9232m0597k1659N841
$$ -19185 18471 -7087 -49944 -103459 -68165 -65558 -77392 -33292 -14060 -54657 -76316 -70475
15940g0475K2622k8536j9761m0570K5215n7718O300P9787m693n7218l3982j4143
$$ -70475 -47853 -76389 -96150 -136720 -111505 -169223 -162923 -83136 -87829 -145047 -179029 -193172
15928a93172M265K4752L2994k2985N5857Q2054k4856q033K2807l6211k3077K0046
$$ -193172 -188907 -164155 -131161 -154146 -98289 -16235 -41091 -49124 -26317 -62528 -85605 -65559
15916f5559o273j1255O686m394P506L9011j9206k041l2110l3929J2501O4329K5895
$$ -65559 -71832 -83087 -76401 -80795 -73289 -34278 -53484 -55525 -87635 -121564 -109063 -44734 -18839
15903a8839l234k6958j1609J3910j4154K1376M41R836l6551k0465K5414O1875
$$ -18839 -22073 -49031 -60640 -46730 -60884 -39508 -39067 -29231 -65782 -86247 -60833 1042
15891A042O940p8251m2004J04M3945k2829j2405J103k0549l0765N0420K5391M2733
$$ 1042 7982 -70269 -112273 -112169 -68224 -91053 -103458 -102355 -122904 -153669 -103249 -77858 -35125
15878c5125K6734k4112M144l2488M1775L5845l7497j1134k8505k958n396J2450
$$ -35125 -8391 -32503 -28359 -60847 -19072 16773 -20724 -31858 -60363 -63321 -68717 -56267
15866e6267l5445l0493O216N2966l169J0071o859n5330o1254r531O4890K8785
$$ -56267 -91712 -122205 -115989 -63023 -66192 -56121 -62980 -118310 -179564 -189095 -124205 -95420
15854i5420j0301L1039N4279m2740j3323K8777l0350J5266N129L5105j854l3227
$$ -95420 -105721 -74682 -20403 -63143 -76466 -47689 -78039 -62773 -57644 -22539 -24393 -57620
15842e7620j2568k3701l4432m0615J0920N1805l038l1166J3548L8052j0418R630
$$ -57620 -70188 -93889 -128321 -168936 -158016 -106211 -109249 -140415 -126867 -88815 -99233 -89603
15830h9603R939J325l684J2212P603N414q249L6111l4563l0805j9831m7229K5789
$$ -89603 -79664 -78339 -82023 -69811 -62208 -56794 -65043 -28932 -63495 -94300 -114131 -161360 -135571
15817a35571O3680N3906L3692j0736k8680m7984K3930J269J3731l2840n9000p959
$$ -135571 -71891 -17985 15707 4971 -23709 -71693 -47763 -46494 -32763 -65603 -124603 -132562
15805a32562M8110J1058K3438O6606R894o7100K0890L6303p505n7150K4674j0734
$$ -132562 -84452 -73394 -49956 16650 26544 -40556 -19666 16637 9132 -48018 -23344 -34078
15793c4078j6189p9277J1752L5911m5920J4289M5250K0565k0956M1949R144p296
$$ -34078 -50267 -129544 -117792 -81881 -127801 -113512 -68262 -47697 -68653 -26704 -17560 -24856
15781b4856l047l1313o195M3910J4110n9724j0367N1244R08P61j2156l392K9591
$$ -24856 -27903 -59216 -65411 -21501 -7391 -67115 -77482 -26238 -25330 -24569 -36725 -40117 -10526
15768a0526L109m7070p705J3376l7287k5157J6320N5308L7815m6837r229J6544
$$ -10526 -7417 -54487 -62192 -48816 -86103 -111260 -94940 -39632 -1817 -48654 -57883 -41339
15756d1339O146k6149m3692l4205L5209K3915J5583L5039J1453l5178m9619o102
$$ -41339 -35193 -61342 -105034 -139239 -104030 -80115 -64532 -29493 -18040 -53218 -102837 -108939
15744a08939J8203l8863M306L0453N545o865J7755k6124K1288J6942j5631k9791
$$ -108939 -90736 -129599 -125293 -94840 -89295 -96160 -78405 -104529 -83241 -66299 -81930 -111721
15732a11721J7137O073K7193M4427n2599n9800k635Q2607L5149m4547L372j9783
$$ -111721 -94584 -88511 -61318 -16891 -69490 -129290 -131925 -49318 -14169 -58716 -55344 -75127
15720g5127J4574J7973j0833l273p909J5971M9412O3748n062q2363n4748j541
$$ -75127 -60553 -42580 -53413 -56686 -64595 -48624 788 64536 59474 -22889 -77637 -79178
15708g9178n2983J9416P340K8271O749K125j855N6985K4019n287l8383L253k5268
$$ -79178 -132161 -112745 -105405 -77134 -70385 -68260 -70115 -13130 10889 5602 -32781 -29528 -54796
15695e4796L4877J2982L9467o069j1646n539l867Q666m116K528j4328j0806k1078
$$ -54796 -19919 -6937 32530 26461 14815 9276 5409 14075 9959 12487 -1841 -12647 -33725
15682c3725l1355l3391Q3138M3370K1089j6273l0281l6653j0414Q357K1996M8040
$$ -33725 -65080 -98471 -15333 28037 49126 32853 2572 -34081 -44495 -36138 -14142 33898
15670C3898k1040n8765m9131J6461k5781j0918N693M4699L9030k3041k8739l5330
$$ 33898 12858 -45907 -95038 -78577 -104358 -115276 -109583 -64884 -25854 -48895 -77634 -112964
15658a12964j9998o075K3630K0025k819O7644M0371l3785M8906J6083m6636m4203
$$ -112964 -132962 -139037 -115407 -95382 -98201 -30557 9814 -23971 24935 41018 -5618 -49821
15646d9821k4310N9650L0101K8393n6203o7972k2272O7893K5829J0819j3402o8156
$$ -49821 -74131 -14481 15620 44013 -12190 -80162 -102434 -34541 -8712 2107 -11295 -79451
15634g9451j3038J8006k7995l496K6928J70j3452J2616q161K8424K0020K8498
$$ -79451 -92489 -74483 -102478 -105974 -79046 -78876 -92328 -79712 -87873 -59449 -39429 -10931
15622a0931l9500m7092J2609J051J3395J5076K5865O3885n9624m5740L0245J04754
$$ -10931 -50431 -97523 -84914 -83863 -70468 -55392 -29527 34358 -25266 -71006 -40761 63993
15610F3993K8577k6120k6841L5370k7108r7718O086L682n7086k978L8569J5018
$$ 63993 92570 66450 39609 74979 47871 -49847 -43761 -40079 -97165 -100143 -61574 -46556
15598d6556n0148j7110K9118L4724j805m1002l5878O1325j6500m3676p040P1467
$$ -46556 -96704 -113814 -84696 -49972 -51777 -92779 -128657 -67332 -83832 -127508 -134548 -63081
15586f3081J7944k9595M2603J01862k9096p0860k6500K469P816k1719K0051K955
$$ -63081 -45137 -74732 -32129 69733 40637 -30223 -56723 -54254 -46438 -68157 -48106 -45151
15574d5151n4339m5903L7430M6269K8104K8069r992p4583J3370J2925j3218L8255
$$ -45151 -99490 -145393 -107963 -61694 -33590 -5521 -15513 -90096 -76726 -63801 -77019 -38764
15562c8764L5784q114m182n983J2169l4230k429O402M485j4022j3973l2793j3603
$$ -38764 -2980 -11094 -15276 -21259 -9090 -43320 -45749 -39347 -34862 -48884 -62857 -95650 -109253
15549a09253Q307M6244O5098N952k9112n875M2206L0488j13184j10688O559O3480
$$ -109253 -100946 -54702 10396 16348 -12764 -18639 23567 54055 -59129 -169817 -163258 -99778
15537i9778P1848j7768m4094M3474K0330M2568K9085o8135m2669k402J9917J3234
$$ -99778 -27930 -45698 -89792 -46318 -25988 16580 45665 -22470 -65139 -67541 -47624 -34390
15525c4390J9720q784m4300J8100K2703k274L5416M891K3534m2554p5470m907
$$ -34390 -14670 -23454 -67754 -49654 -26951 -29225 6191 11082 34616 -7938 -83408 -88315
15513h8315j1168O360L4251L9258K9109k9819o8567K391p904R035J2475l3035
$$ -88315 -99483 -93123 -58872 -19614 9495 -20324 -88891 -86500 -94404 -85369 -72894 -105929
15501a05929J259K8300l1958J3361N4075M4311J4296M679l6885k4257k9953K9777
$$ -105929 -104670 -76370 -108328 -94967 -40892 3419 17715 22394 -14491 -38748 -68701 -38924
15489c8924K4356R833n354j6141K8631n2167o7501N7347K4760k5887L3247J4004
$$ -38924 -14568 -4735 -10089 -26230 2401 -49766 -117267 -59920 -35160 -61047 -27800 -13796
15477a3796m2025J4019l5776J0938L371O1462J248o328J690j6559j1162l5735
$$ -13796 -55821 -41802 -77578 -66640 -63269 -1807 -559 -6887 -5197 -21756 -32918 -68653
15465f8653L786J9225O625m92M3562K335q50K5098p626k3203j8243J2529j2760
$$ -68653 -64867 -45642 -39017 -39509 4053 6388 5538 30636 23010 -193 -18436 -5907 -18667
15452a8667j7827o3024O3769K9106k1031j1400k2900j9237J5160O1637Q2619k8945
$$ -18667 -36494 -99518 -35749 -6643 -27674 -39074 -61974 -81211 -66051 -4414 78205 49260
15440D9260k0794r790nJ5405J7870j4501n7296m7619K0324N7635L3697j7118J664
$$ 49260 28466 18676 18671 34076 51946 37445 -19851 -67470 -47146 10489 44186 27068 28732
15427B8732M758o399K3845k1500m1337l6805l8398o8685j8451O6437L7842P563
$$ 28732 33490 27091 50936 29436 -11901 -48706 -87104 -155789 -174240 -107803 -69961 -62398
15415f2398N453J5833p14j0643j0282n0583j052L1778P431L412p667L8586P0653
$$ -62398 -56945 -41112 -41826 -52469 -62751 -113334 -114386 -82608 -75177 -71765 -79432 -40846 29807
15402B9807m4221m4523m8433j8129R3043L1797j7021K5654N3755Q716p2284m2982
$$ 29807 -14414 -58937 -107370 -125499 -32456 -659 -17680 7974 61729 70445 -1839 -44821
15390d4821J1937K4671m6343l9621O165N1173k5073j5651j4938L2540K7959n2158
$$ -44821 -32884 -8213 -54556 -94177 -88012 -36839 -61912 -77563 -92501 -59961 -32002 -84160
15378h4160N050L5577N4746K6644m6714p202l780p220k5126K1958k2998l0288
$$ -84160 -79110 -43533 11213 37857 -8857 -16059 -19839 -27059 -52185 -30227 -53225 -83513
15366h3513Q7347M0969M991m8489r680q871L0080K9027k6278m1809k2768J5331
$$ -83513 3834 44803 49794 1305 -8375 -17246 12834 41861 15583 -26226 -48994 -33663
15354c3663J2991J0862K3602n1389o9160o523L550m438K3814O0158J0021J1311
$$ -33663 -20672 -9810 13792 -37597 -106757 -113280 -109730 -114168 -90354 -30196 -20175 -8864
15342h864J40K0130l1089m7088K9662M5691k654l7813J2160N0874k846J4905R810
$$ -8864 -8724 11406 -19683 -66771 -37109 8582 5928 -31885 -19725 31149 28303 43208 53018
15329E3018Q642m8536l7319J2700k18o6570q1919n190k2325Q8645K2781M896P56
$$ 53018 61660 13124 -24195 -11495 -11713 -78283 -160202 -165392 -187717 -99072 -76291 -71395 -70639
15316g0639k005O509l7565O1814j3053l627k4567M7155L7048m2295r046R868J1329
$$ -70639 -72644 -66135 -103700 -41886 -54939 -58566 -83133 -35978 1070 -41225 -50271 -40403 -29074
15303b9074N510K0303l9550k225J1000N3321N1276n5508q500J8385J7119m8376
$$ -29074 -23564 -3261 -42811 -45036 -34036 19285 70561 15053 6553 24938 42057 -6319
15291f319l3394K0542K0901j0631j9730L0577L7910l9981k4995l6320Q341P258
$$ -6319 -39713 -19171 1730 -8901 -28631 1946 39856 -125 -25120 -61440 -53099 -45841
15279d5841l4714J2392P493J4797J4387j3473j6486L3239Q910o033J783J1606
$$ -45841 -80555 -68163 -60670 -45873 -31486 -44959 -61445 -28206 -19296 -25329 -23546 -11940
15267a1940P3170K3618l8185K2775L717n3051l4277o5380N085N1484J4681J1693
$$ -11940 61230 84848 46663 69438 73155 20104 -14173 -79553 -74468 -22984 -8303 3390
15255C390J4504o162p092j0256K5784J1118j3299k6038m3949m3065J1812L0008
$$ 3390 17894 11732 4640 -5616 20168 31286 17987 -8051 -52000 -95065 -83253 -53245
15243e3245Q573p313N131J1166l5959N5131K9728l2625l5762J3048l1198l1398
$$ -53245 -44672 -51985 -46854 -35688 -71647 -16516 13212 -19413 -55175 -42127 -73325 -104723
15231a04723j636k5584M5597L3588M3104q786q654j3135l0839J2649K813k4425
$$ -104723 -106359 -131943 -86346 -52758 -9654 -18440 -27094 -40229 -71068 -58419 -55606 -80031
15219h0031M748M6483J1638K4944J9621k0899j8979j2517K1997k5721l587o795
$$ -80031 -75283 -28800 -17162 7782 27403 6504 -12475 -24992 -2995 -28716 -32303 -39098
15207c9098J5810m763K6389P847j8978j3151m9489k8881Q355K8938K1208J9390
$$ -39098 -23288 -28051 -1662 6185 -12793 -25944 -75433 -104314 -95959 -67021 -45813 -26423
15195b6423M8111L1095K2690K8511O560m1528q973j3803j4904k3294n1333J7231
$$ -26423 21688 52783 75473 103984 110544 69016 60043 46240 31336 8042 -43291 -26060
15183b6060K6475J577o808m911J5527M3695K299k3229J4197Q722o9035l2853L0227
$$ -26060 415 1992 -4816 -9727 5800 49495 51794 28565 42762 51484 -17551 -50404 -20177
15170b0177M6272o1216p3917K6277N3227M635j1577N2051j982l8833q628O566
$$ -20177 26095 -35121 -109038 -82761 -29534 -24899 -36476 15575 13593 -25240 -33868 -27302
15158b7302r180L1891O820J2673q331L2887p5300l5140R41M4648M6500K5358J5537
$$ -27302 -36482 -4591 2229 14902 6571 39458 -35842 -70982 -70041 -25393 21107 46465 62002
15145F2002m5445o0124O35m9343L3851j4114L368m2258l8051L9543P2884J7401
$$ 62002 16557 -43567 -42932 -92275 -58424 -72538 -69170 -111428 -149479 -109936 -37052 -19651
15133a9651j9128J1789r95k3316K3951N4449k7306J0322l049J2601J8094j34j290
$$ -19651 -38779 -26990 -27985 -51301 -27350 27099 -207 10115 7066 19667 37761 37627 36337
15120C6337n433m6331j2762O5646L7532n712K1341J2519k0801r4348J4729L7143
$$ 36337 30904 -15427 -28189 37457 74989 69277 90618 103137 82336 -12012 2717 39860
15108C9860L7435l200m444n1323m6409k7826K4753L5801l1894j7827J6846j026
$$ 39860 77295 74095 69651 18328 -28081 -55907 -31154 4647 -27247 -45074 -28228 -29254
15096b9254n9345j1511j5080L043L9991M470Q591O305k6072J0881K2675L1533
$$ -29254 -88599 -100110 -115190 -112147 -72156 -67686 -59095 -52790 -78862 -67981 -45306 -13773
15084a3773K2159N4390L7850r756m4416p5239m4788k2851k8021K9646J7421O7354
$$ -13773 8386 62776 100626 90870 46454 -28785 -73573 -96424 -124445 -94799 -77378 -10024
15072a0024l608Q939K3391K3622l5534q938o318o182n3360O100J6074M2521K7869
$$ -10024 -13632 -4693 18698 42320 6786 -2152 -8470 -14652 -68012 -61912 -45838 -3317 24552
15059B4552K3237K3399k7673m9099n0734m9285L956L7943O9435J4022k0926l397
$$ 24552 47789 71188 43515 -5584 -56318 -105603 -101647 -63704 5731 19753 -1173 -4570
15047d570k0358m163N275O5184j7239o6745j1088J6307K213O1217P4911k0224
$$ -4570 -24928 -29091 -23816 41368 24129 -42616 -53704 -37397 -35184 26033 100944 80720
15035H0720k2854p352j8226n4353r1234j6917L9825K8504k3404L9794K4171J2229
$$ 80720 57866 50514 32288 -22065 -113299 -130216 -90391 -61887 -85291 -45497 -21326 -9097
15023i097J8322O8125l7615m6328j5466j6849M387K4994M0768P546N861m628k0515
$$ -9097 9225 77350 39735 -6593 -22059 -38908 -34521 -9527 31241 38787 44648 40020 19505
15010A9505K819M3481m3816m4753K2638j50r522K623k1818j0502J8531k3714J3561
$$ 19505 22324 65805 21989 -22764 -126 -276 -9798 -7175 -28993 -39495 -20964 -44678 -31117
14997c1117j4246l7053J3644P2936L9406j9950J6546K5779Q6464j5545n5105K2946
$$ -31117 -45363 -82416 -68772 4164 43570 23620 40166 65945 152409 136864 81759 104705
14985A04705k590O771n5809m7872r156k5790J7739K7428R2006k5257n4371m2315
$$ 104705 102115 108886 53077 5205 -3951 -29741 -12002 15426 107432 82175 27804 -14511
14973a4511j4925r184R123O2477K7291j2536m256Q230l0523k8965j9875j4045
$$ -14511 -29436 -38620 -29497 32980 60271 47735 43479 51709 21186 -7779 -27654 -41699
14961d1699j4630O6287L7257m2023n5374K5548K1892K5236N6756R733m1838q6225
$$ -41699 -56329 9958 47215 5192 -50182 -24634 -2742 22494 79250 88983 47145 -39080
14949c9080m728P4463J7075j5026L1843J323n9231k9101k4658M0337J9905M7120
$$ -39080 -43808 30655 47730 32704 64547 65870 6639 -22462 -47120 -6783 13122 60242
14937F0242j7905l367J4681j2684k6889m0300P0256P5091M795n5962l4290j2737
$$ 60242 42337 38970 53651 40967 14078 -26222 44034 119125 123920 67958 33668 20931
14925B0931o0275k1298M3490J8979j7694M1286L8855R263p124m9708m4609N6359
$$ 20931 -39344 -60642 -17152 1827 -15867 25419 64274 73537 66413 16705 -27904 28455
14913B8455m96n7337J9124K8181K6218K9958l794o9322P51N8170j3327l1739J8926
$$ 28455 27959 -29378 -10254 17927 44145 74103 70309 987 1738 59908 46581 14842 33768
14900C3768K4667k1030l5640K3385r24J0169K1290k2148J4126l0202p117M8054
$$ 33768 58435 37405 1765 25150 24226 34395 55685 33537 47663 17461 10344 58398
14888E8398k2657k8589p526L4455j6581m1828L8851j100l210Q251j9966L5686
$$ 58398 35741 7152 -374 34081 17500 -24328 14523 13423 10213 18464 -1502 34184
14876C4184L4416j3926J6185M3056J2842j014k5387J599O644j8710k4693j7844
$$ 34184 68600 54674 70859 113915 126757 125743 100356 101955 108599 89889 65196 47352
14864D7352k7484K717R02k5762J5019j3011j7883N5967N7638K0604k8130n8548
$$ 47352 19868 22585 23487 -2275 12744 -267 -18150 37817 95455 116059 87929 29381
14852B9381K6003L4419k3524q7336n111j0575j5298l0099K1450J2508j6961M6068
$$ 29381 55384 89803 66279 -21057 -26168 -36743 -52041 -82140 -60690 -48182 -65143 -19075
14840a9075N3551j6515N509K2210k755l0777k7502L6264O013j5688l4949l9847
$$ -19075 34476 17961 23470 45680 42925 12148 -15354 20910 26923 11235 -23714 -63561
14828f3561N6531L0215L8910J2808L4705j2376o2911n512R305r12j392j6486l8477
$$ -63561 -7030 23185 62095 74903 109608 97232 34321 28809 38114 37202 35810 19324 -19153
14815a9153J7764N6365K0538k87o803Q996j9777M5808J1712J9630r27m8722m2761
$$ -19153 -1389 54976 75514 75227 68424 77420 57643 103451 115163 134793 133866 85144 42383
14802D2383l8572L2774j8968L4793K325l918l3637j2684M2235K7041L1009j2582
$$ 42383 3811 36585 17617 52410 54735 50817 17180 4496 46731 73772 104781 92199
14790I2199M320L0273o2313o7912k7268Q4222O9005J4765M036k6263n0679k1508
$$ 92199 96519 126792 64479 -3433 -30701 53521 122526 137291 141327 115064 64385 42877
14778D2877n3492L73O565L0405o032j2058L596j9614j1643K995K7348J0745k9479
$$ 42877 -10615 -10242 -3677 26728 20696 8638 12234 -7380 -19023 -16028 11320 22065 -7414
14765g414k8918l4831K8453N1882J7555n6551l5711M2149J06141J0710m4408k7287
$$ -7414 -36332 -71163 -42710 9172 26727 -29824 -65535 -23386 82755 93465 49057 21770
14753B1770K7029l1093P579J588k9566n605J63j9351J8410N6286N7167P552Q950
$$ 21770 48799 17706 25285 26873 -2693 -8298 -8135 -27486 -9076 47210 104377 111929 120879
14740A20879l7938l2770K2085l1313j8413J5051k0636J8017L5219j5596J328P75
$$ 120879 82941 50171 72256 40943 22530 37581 16945 34962 70181 54585 55913 56688
14728E6688k8224j3514l000m3058M5747N2886L176O329k7788j2993j686L4190
$$ 56688 28464 14950 11950 -31108 14639 67525 70701 77030 49242 36249 34563 68753
14716F8753j4864o5888k7014L0748M6081K4377j8527m8608l2645n5647P202N0313
$$ 68753 53889 -11999 -39013 -8265 37816 62193 43666 -4942 -37587 -93234 -86032 -35719
14704c5719P6092L4269o9373o862L302l8241l7472N7121N4853j0953Q525L8451
$$ -35719 40373 74642 5269 -1593 1709 -36532 -74004 -16883 37970 27017 35542 73993
14692G3993O1847j4525J3963K0001j6688r582j4306J333L578J9310J2613j5867
$$ 73993 135840 121315 135278 155279 138591 129009 114703 116036 119614 138924 151537 135670
14680A35670k0897o3305l5305K9562L9986m1193k295J2967o125k4994L4657j4962
$$ 135670 114773 51468 16163 45725 85711 44518 42223 55190 49065 24071 58728 43766
14668D3766n821J5199r699j7613J6681Q812l6582j1418J0168O919J1666l7994
$$ 43766 37945 53144 43445 25832 42513 51325 14743 3325 13493 20412 32078 -5916
14656e916L4490l820j3779j3652m951j7051M254O7070j5718j9463j2529K3811
$$ -5916 28574 24754 10975 -2677 -7628 -24679 -20425 46645 30927 11464 -1065 22746
14644B2746L9440k1290n3156N6598M7712O709k8579L716M4383J2375l208j7991
$$ 22746 62186 40896 -12260 44338 92050 98759 70180 73896 118279 130654 127446 109455
14632A09455J1269L0003J9o143m9505o1878k1959N0427M7914J800j1689k362K6297
$$ 109455 120724 150727 150746 144603 95098 33220 11261 61688 109602 111402 99713 97351 123648
14619A23648k1092M362k4390m7241M3269Q824n80r3165o556L2155K4932j7285
$$ 123648 102556 106918 82528 35287 78556 87380 86800 -6365 -12921 19234 44166 26881
14607B6881k9743K3448K1266L8718N933J5597L577q7782m9405j2781J8834O5976
$$ 26881 -2862 20586 41852 80570 86503 102100 105677 17895 -31510 -44291 -25457 40519
14595D0519J1208j6569K8373J0893M4047m022k5994k4007j9526L9774J7418L0877
$$ 40519 51727 35158 63531 74424 118471 114449 88455 64448 44922 84696 102114 132991
14583A32991J6343k4021o0270k0326m141L6699L901l3789k3537j0498J6643L2323
$$ 132991 149334 125313 65043 44717 40576 77275 81176 47387 23850 13352 29995 62318
14571F2318L9694J0624M6095K0636R949l7998j8083q795k9458K735K6319L1352
$$ 62318 102012 112636 158731 179367 189316 151318 133235 124440 94982 97717 124036 155388
14559A55388p292m3535R051n5553m9264J8367P5948L6054j1185j3308L8841R738
$$ 155388 148096 104561 113612 58059 8795 27162 103110 139164 127979 114671 153512 163250
14547A63250K7126q385k919o507k3173o1410Q447k8903J4750P828P988K6454O046
$$ 163250 190376 181991 179072 172565 149392 87982 96429 67526 82276 90104 98092 124546 130592
14534A30592k1034R063j6685l5002J7133L319K2185k7962j2302l9556r880M2000
$$ 130592 109558 118621 101936 66934 84067 87386 109571 81609 69307 29751 19871 61871
14522F1871k1429o0383j7207L9594L8070M5302q135J2355o9702L196L0117K1249
$$ 61871 40442 -19941 -37148 2446 40516 85818 77683 90038 20336 23532 53649 74898
14510G4898O8711J9200l9141r869o0225l4401J3758K2654k905J2478L642m81j2443
$$ 74898 143609 162809 123668 113799 53574 19173 32931 55585 52680 65158 68800 68319 55876
14497E5876l214k8097j2252M3930J7025j1912k0158K3889j322R126r263j435M4701
$$ 55876 52662 24565 12313 56243 73268 61356 41198 65087 63765 72891 63628 62193 106894
14484A06894L7125m666j6817r209L2135o431N503L1946l8389j7114R433J3842
$$ 106894 144019 139353 122536 113327 145462 139031 144534 176480 138091 120977 130410 144252
14472A44252k033l8139l8603j6949R1201J5650j8038m3067k1648J43M5108N4614
$$ 144252 142219 104080 65477 48528 139729 155379 137341 94274 72626 72769 117877 172491
14460A72491Q193m3530o3762Q066K6925M626j207J6236k3379k9738K2794J6252
$$ 172491 180684 137154 73392 81458 108383 113009 111802 128038 104659 74921 97715 113967
14448A13967k6748R722N0522K8341j5380k0157k4110k4126j639L397J9254j745
$$ 113967 87219 96941 147463 175804 160424 140267 116157 92031 90392 93789 113043 111298
14436A11298O1463o510n9805J6603L1937l0003m8758k2687M0825N245K4165j2742
$$ 111298 172761 166251 106446 123049 154986 124983 76225 53538 94363 99608 123773 111031
14424A11031m8835m648J4428K317K0119L5524J5140M0487K1195k7587r439m5621
$$ 111031 62196 57548 71976 74293 94412 129936 145076 185563 206758 179171 169732 124111
14412A24111J5634K9398Q217J72n2048k0966K1253N425Q730J2833m1040J8222
$$ 124111 139745 169143 177360 177532 125484 104518 125771 131196 139926 152759 111719 129941
14400A29941k6068K597M4641l4359m3207k7380J8453K1424P276J1067k8563K2429
$$ 129941 103873 106470 151111 116752 73545 46165 64618 86042 93318 104385 75822 98251
14388I8251K6612j3971M9620M3080k0142J0031J4616K6719j0267m7334L469k2983
$$ 98251 124863 110892 160512 203592 183450 193481 208097 234816 224549 177215 180684 157701
14376A57701q1642k205L3870P0863k3220m7029K2708l835k6552K9253l07Q558
$$ 157701 76059 73854 107724 178587 155367 108338 131046 127211 100659 129912 129605 138163
14364A38163J0107M6471O313k8455k6539l1434J4928j0279J2100K4666M153M9133
$$ 138163 148270 194741 201054 172599 146060 114626 129554 119275 131375 156041 160194 209327
14352B09327J783Q359l2930m5558J7840k5854J7299N2437j8132o4102q0167J6232
$$ 209327 211110 219469 186539 140981 158821 132967 150266 202703 184571 120469 40302 56534
14340E6534M1039j7261K5139M8757J4308l6897m6017J369j9786r968L1214M2950
$$ 56534 97573 80312 105451 154208 168516 131619 85602 86971 67185 57217 88431 131381
14328A31381k0372l1257L3681M2372L0883Q432l7440o4395K8212N1408n6504m2629
$$ 131381 111009 79752 113433 155805 186688 195120 157680 93285 121497 172905 116401 73772
14316G3772Q210M7837L7303J9736j1544j6387p578j72L6509O6788M0216n8351
$$ 73772 81982 129819 167122 186858 175314 158927 151349 151177 187686 254474 294690 236339
14304B36339p7071j7951j9288K4436K1088k8951l1202P625l1048J0562L9430J9445
$$ 236339 159268 141317 122029 146465 167553 138602 107400 115025 83977 94539 133969 153414
14292A53414K603J8620p909l8879J6993k5618k7169L6688P1427J4070l0399J1792
$$ 153414 156017 174637 166728 127849 144842 119224 92055 128743 200170 214240 183841 195633
14280A95633K3757n7916j1649J0428p156J0742K3745m8295n8100J6950J4275N6450
$$ 195633 219390 161474 149825 160253 153097 163839 187584 139289 81189 98139 112414 168864
14268A68864K805m120L1581k4617n3787j4899M1391J9913J7282L7011L8381j5737
$$ 168864 171669 167549 199130 174513 120726 105827 147218 167131 184413 221424 259805 244068
14256B44068l7136j1837J4243J7924q821L2414m229K4594m5299m6597j9525L9943
$$ 244068 206932 195095 209338 227262 218441 250855 246626 271220 225921 179324 159799 199742
14244A99742j3675j3961j8562k2724m2970l7292N5918K6432J5586N9058l879l0130
$$ 199742 186067 172106 153544 130820 87850 50558 106476 132908 148494 207552 203673 173543
14232A73543q268n6244Q117K4299m2350k9500L0067R916k183K5099M594P708L1868
$$ 173543 165275 109031 117148 141447 99097 69597 99664 109580 107397 132496 137090 144798 176666
14219A76666R990L5795L5946l5969l0229K8044l9452n9076J4639j1763j0007L1960
$$ 176666 186656 222451 258397 222428 192199 220243 180791 121715 136354 124591 114584 146544
14207A46544L5270K8803J4323l2262l7796j9228K4132r731p251J6828p653m8556
$$ 146544 181814 210617 224940 192678 154882 135654 159786 150055 142804 159632 151979 103423
14195A03423o651N1402J2970l2075R744J1032l1099j1171k1653N144O8499K6873
$$ 103423 96772 148174 161144 129069 138813 149845 118746 107575 85922 91066 159565 186438
14183A86438l0963l390R327k6778J697j9017O212K0805K8532M979K4985J8924
$$ 186438 155475 152085 161412 134634 136331 117314 123526 144331 172863 177842 202827 221751
14171B21751n1047Q422K8627j7703j2484j9250j3879L2107j6466Q656K693K6594
$$ 221751 170704 179126 207753 190050 177566 158316 144437 176544 160078 168734 171427 198021
14159A98021M2316j3047m8981L320j5700K0657J4552N0903M1157k8791q0069O62
$$ 198021 240337 227290 178309 181629 165929 186586 201138 252041 293198 264407 184338 185000
14147A85000N123n368j2864n5882Q172N0018K9182J2k9594J5229l4055k7926K8754
$$ 185000 190123 184755 171891 116009 124181 174199 203381 203393 173799 189028 154973 127047 155801
14134A55801p247r174N8502K2341j9843n6488J137N2487M4749J3044K5543k9776
$$ 155801 148554 139380 197882 220223 200380 143892 145029 197516 242265 255309 280852 251076
14122B51076J5440j9075m8460O665M3553N9474K6582k3448n0473r106j7384r948
$$ 251076 266516 247441 198981 205646 249199 308673 335255 311807 261334 252228 234844 224896
14110B24896k51P578J5615l547J232J3350o1207q296M2388J2220m6349J2006J3440
$$ 224896 224645 232223 247838 244291 245523 258873 197666 189370 231758 243978 197629 209635 223075
14097B23075k0317K3639N7929l0610m0836K3452K3917l555m526K7507K937R902
$$ 223075 202758 226397 284326 253716 212880 236332 260249 256694 252168 279675 282612 292514
14085B92514N347l7618J0930n0049l7402J0041L2542N1397P8955J5474o4418k7432
$$ 292514 297861 260243 271173 221124 183722 193763 226305 277702 356657 372131 307713 280281
14073B80281L5845L3698J6897l266P0876r043n9206j2249k108M950o5661o9589
$$ 280281 316126 349824 366721 363455 434331 425288 366082 353833 351725 356675 291014 221425
14061B21425L0136N8470M3836l2540Q670J8633L2587l891k0532k9492q693l6488
$$ 221425 251561 310031 353867 321327 329997 348630 381217 377326 356794 327302 318609 282121
14049B82121P2235K4432J0191L0887J0865k471l4984m367N173l1026L0274m556
$$ 282121 354356 378788 388979 419866 430731 428260 393276 388909 394082 363056 393330 388774
14037C88774l5718l4805M0669J2678j2119O583k6162k3950j3255M2997J3324l9834
$$ 388774 353056 318251 358920 371598 359479 366062 339900 315950 302695 345692 359016 319182
14025C19182j437L435M5486n2698n2783p60K5487J3038k1940K7321M8652K0499
$$ 319182 317745 321180 366666 313968 261185 260425 285912 298950 277010 304331 352983 373482
14013C73482l3324k1634L5884k8922j6513N092j3253K8076l1052m1896J0379Q792
$$ 373482 340158 318524 354408 325486 308973 314065 300812 328888 297836 255940 266319 275111
14001B75111j4346J7188P1397K7471j2533K9887o583p008Q602m1320k2774L885
$$ 275111 260765 277953 349350 376821 364288 394175 387592 380584 389186 347866 325092 328977
13989C28977J9939j3923M8703J051K0810j8746J7498j825L4991L7519k1284k7482
$$ 328977 348916 334993 383696 384747 405557 386811 404309 402484 437475 474994 453710 426228
13977D26228m1533k3429K9248L4356M5213k9622p5649j5720L3592M0287L3773
$$ 426228 384695 361266 390514 424870 470083 440461 364812 349092 382684 422971 456744
13966D56744r261o0875n2710l662L3968K1208N313J5482L0469k2657J3626m2917
$$ 456744 447483 386608 333898 330236 364204 385412 390725 406207 436676 414019 427645 384728
13954C84728k1282J8673M706l8941j3027M9941L0540m6193k1028K8816K7581k3947
$$ 384728 363446 382119 386825 347884 334857 384798 415338 369145 348117 376933 404514 380567
13942C80567k4273J0904L6236J0893J502N748k1843L5247k8715P73M8050j7470
$$ 380567 356294 367198 403434 414327 415829 421577 399734 434981 406266 407039 455089 437619
13930D37619k7089k7073K6578L7058L1743q046k2241j9792O454n336n8926n102
$$ 437619 410530 383457 410035 447093 478836 470790 448549 428757 435211 429875 370949 365847
13918C65847j1600k1200M0152N6781j8347l362l70p69q794q191O098P213Q990
$$ 365847 354247 333047 373199 429980 411633 408271 407901 407132 398338 390147 396245 403458 412448
13905D12448p8494k5687P7749L4067j41J9922j1341J0166K2188m3072k4458L900
$$ 412448 333954 308267 386016 420083 419942 439864 428523 438689 460877 417805 393347 397247
13893C97247J6165q290L737l621O6767O7761k9099K0348M11m4951l4964k2156
$$ 397247 413412 405122 408859 405238 472005 539766 510667 531015 531426 486475 451511 429355
13881D29355R140L5580J2001l3812o1923n2391k7586N5953O6468J395K0331L1298
$$ 429355 438495 474075 486076 452264 390341 337950 310364 366317 432785 434180 454511 485809
13869D85809K9855m254j9421L9068k2925l0260J6370L6640L4819J7421N5243o890
$$ 485809 515664 511410 491989 531057 508132 477872 494242 530882 565701 583122 638365 631475
13857F31475m5592l8438K6344m204k0382N651J157m1491J0920J5329j8361q774
$$ 631475 585883 547445 573789 569585 549203 554854 556011 514520 525440 540769 522408 513634
13845E13634L1892r026J7333k0381o9965k1380J0907j429M9527P0526k0097k7177
$$ 513634 545526 536500 553833 533452 463487 442107 453014 451585 501112 571638 551541 524364
13833E24364Q493N966k4611K7688M0693P416o7957k3826P5311l152l2666J4907
$$ 524364 532857 538823 514212 541900 582593 590009 522052 498226 573537 570385 537719 552626
13821E52626N877J1895m3260j2305J5966j2143J5368n9423n3250J8430J1638R482
$$ 552626 558503 570398 527138 514833 530799 518656 534024 474601 421351 439781 451419 460901
13809D60901O507l6110J9860O2684L2757j7458R617j6206k5746j1198J2634j1833
$$ 460901 467408 431298 451158 513842 546599 529141 538758 522552 496806 485608 498242 486409
13797D86409p77k5537r867O386K3016m2783M4097O647J2867L8130l3411L6039
$$ 486409 485632 460095 450228 456614 479630 436847 480944 487591 500458 538588 505177 541216
13785E41216M2480K3048L2649j962q787n7526p6051m0427N613N0245J8516q947
$$ 541216 583696 606744 639393 637431 628644 571118 495067 454640 460253 510498 529014 520067
13773E20067K7815L6657j3828l152N4578J4017l1491m4833j2508j2332j1314J45
$$ 520067 547882 584539 570711 567559 622137 636154 604663 559830 547322 534990 523676 523821
13761E23821M018J7397K7456L564J6441M1458l4269J7847L2049K282nK7855l7290
$$ 523821 527839 545236 572692 576256 592697 634155 599886 617733 649782 652064 652059 679914 642624
13748F42624o0342j2192N6898M3760l9756j1408j6654q02q8981j4186R1274O0717
$$ 642624 582282 570090 626988 670748 630992 619584 602930 602128 513147 498961 590235 650952
13736F50952j8682L7909J1784k2014P490J6583m139j8304k8320J5149M1578n2318
$$ 650952 632270 670179 681963 659949 667439 684022 679883 661579 633259 648408 689986 637668
13724F37668l6428N2143N57j3292N5921J4108m1943l7413l8859N3186k0163m7298
$$ 637668 601240 653383 653940 640648 696569 710677 668734 631321 592462 645648 625485 578187
13712E78187k0090n0409P8760L8549k4772k3453K4510K8670K5560O9996K7429
$$ 578187 558097 507688 586448 624997 600225 576772 601282 629952 655512 725508 752937
13701G52937p9998M711j1978p855L2167J6845n4027j1932j5715K1345O2787k4139
$$ 752937 672939 677650 665672 657817 689984 706829 652802 640870 625155 646500 709287 685148
13689F85148q1205n0715J7009J9847P8620M4349J3943J3547L4603k0905J507M4893
$$ 685148 603943 553228 570237 590084 668704 713053 726996 740543 775146 754241 755748 800641
13677H00641k9141r534l4689R942L3798J2088o0308j0331j3292L4360N8174M2110
$$ 800641 771500 761966 727277 737219 771017 783105 722797 712466 699174 733534 791708 833818
13665H33818j2886p449l8181Q910J7568J2361o4436n151K5622J2779j4446M1698
$$ 833818 820932 813483 775302 784212 801780 814141 749705 744554 770176 782955 768509 810207
13653H10207l3572p2586K4496R563K6293O553N4902M4040m6446k5513N2619N7225
$$ 810207 776635 704049 728545 738108 764401 770954 825856 869896 823450 797937 850556 907781
13641I07781K1171m8693j2589N2019L3904K1745M2974j7895l7473k4910l9699
$$ 907781 928952 880259 867670 919689 953593 975338 1018312 1000417 962944 938034 898335
13630H98335m4007k0672J206L533k0459j4919R3482K0427k1710m8308j9560L044
$$ 898335 854328 833656 834862 838395 817936 803017 896499 916926 895216 846908 827348 830392
13618H30392k9130p741L4828J27359J7371n4682l4019j7443j3226j2554Q226R27
$$ 830392 801262 793521 828349 955708 973079 918397 884378 866935 853709 841155 849381 850308
13606H50308n935k0985M40L1867J0352n4553O513K9005J6982M4788j4805j6499
$$ 850308 844373 823388 823828 855695 866047 811494 818007 847012 863994 908782 893977 877478
13594H77478k6024N680N8173M6186L3061k7484K0977k2257j9017K4940P700K1833
$$ 877478 851454 857134 915307 961493 994554 967070 988047 965790 946773 971713 979413 1001246
13582A001246j279n415n9632r803N03N5194L5937m5359l8701M115q706j2494K8662
$$ 1001246 999967 994552 934920 925117 925620 980814 1016751 971392 932691 936806 928100 915606 944268
13569I44268j5829r126L3514O827J3733k5273L8099P7484M9755J2359l5945n8127
$$ 944268 928439 919313 952827 959654 973387 948114 986213 1063697 1113452 1125811 1089866 1031739
13557A031739O113L8113M5103k4546p298J2634m956m6167O844R039J1246k0342
$$ 1031739 1037852 1075965 1121068 1096522 1089224 1101858 1096902 1050735 1057579 1066618 1077864 1057522
13545A057522L2540k4413j0854K6561K0922M9899J6189M595K7810m4538n2338
$$ 1057522 1090062 1065649 1054795 1081356 1102278 1152177 1168366 1172961 1200771 1156233 1103895
13534A103895m5663J0141l8393l150J4073l709L7199j0137l8722M7177Q6496k765
$$ 1103895 1058232 1068373 1029980 1026830 1040903 1037194 1074393 1064256 1025534 1072711 1159207 1156442
13522A156442J8759J2714N388K6706L2976o6r106K2031L9302J9797k7408m7779
$$ 1156442 1175201 1187915 1193303 1220009 1252985 1252919 1243813 1265844 1305146 1324943 1297535 1249756
13510A249756n7637O6249O1773j336j9771J1902Q426J0711j6160o5644J6398N5605
$$ 1249756 1192119 1258368 1320141 1318805 1299034 1310936 1319362 1330073 1313913 1248269 1264667 1320272
13498A320272K5407m0205m9446N453L0114L4121J2074K4194m4017J4854j3696
$$ 1320272 1345679 1305474 1256028 1261481 1291595 1325716 1337790 1361984 1317967 1332821 1319125
13487A319125m8071L3920M8783M8120K1378l6189o5502M6311L3846k239k8329
$$ 1319125 1271054 1304974 1353757 1401877 1423255 1387066 1321564 1367875 1401721 1399482 1371153
13476A371153M06Q7344J4732n2762K3776L8509k097k4308k7768k755J6898j4283
$$ 1371153 1371559 1458903 1473635 1420873 1444649 1483158 1481061 1456753 1428985 1426230 1443128 1428845
13464A428845O923O307k1511n667L3883O630j0007M1019j859J1224N6517K910
$$ 1428845 1435768 1442075 1420564 1414897 1448780 1455410 1445403 1486422 1484563 1495787 1552304 1555214
13452A555214m2581J1707L2123k325o1949K2914K9784J0025J502N1501N2091N430
$$ 1555214 1512633 1524340 1556463 1554138 1492189 1515103 1544887 1554912 1556414 1607915 1660006 1665436
13440A665436O081q051R035o2160o8817j148K535J774j3654Q2472J7025l3368
$$ 1665436 1671517 1663466 1672501 1610341 1541524 1540376 1542911 1544685 1531031 1613503 1630528 1597160
13428A597160n9971M1211L1156N89L4861L6140J0065J9476L1310m4667m8290j1289
$$ 1597160 1537189 1578400 1609556 1610145 1645006 1681146 1691211 1710687 1741997 1697330 1649040 1637751
13416A637751P6881N8109j9300j6634Q9988M7552m1310p0161n6016J4644J4405
$$ 1637751 1714632 1772741 1753441 1736807 1826795 1874347 1833037 1762876 1706860 1721504 1735909
13405A735909L4844J0047j231l324J0864Q614M2678J314q033N1263M3453j5480
$$ 1735909 1770753 1780800 1779569 1776245 1787109 1795723 1838401 1839715 1831682 1882945 1926398 1910918
13393A910918J0930L227p9470j0568P7609J2680K5855K9415N438m6955J0636J947
$$ 1910918 1921848 1925075 1845605 1835037 1912646 1925326 1951181 1980596 1986034 1939079 1949715 1951662
13381A951662K6129L8808K3687J7532O616p339J6455j3023M3299Q14l6224J6487
$$ 1951662 1977791 2016599 2040286 2057818 2064434 2057095 2073550 2060527 2103826 2104640 2068416 2084903
13369B084903N6112M2709Q569j5338l781P2552q339L762j7388o1868J0052L5020
$$ 2084903 2141015 2183724 2192293 2176955 2173174 2245726 2237387 2241149 2223761 2161893 2171945 2206965
13357B206965J2569k871O711o801Q916K9181J7423P680N5000K2233l5678p057
$$ 2206965 2219534 2216663 2223374 2216573 2225489 2254670 2272093 2279773 2334773 2357006 2321328 2314271
13345B314271J2048K2354O848M180M0895L3281L6234K3270l5442k9722J2775M0054
$$ 2314271 2326319 2348673 2355521 2359701 2400596 2433877 2470111 2493381 2457939 2428217 2440992 2481046
13333B481046K8417r696l9672m5089N7407N7213k065K146J1678J1743N6353K4291
$$ 2481046 2509463 2499767 2460095 2415006 2472413 2529626 2527561 2529707 2541385 2553128 2609481 2633772
13321B633772K6691K7302Q0620l244R551l1713l6458Q988N767J682j7241L6272
$$ 2633772 2660463 2687765 2768385 2765141 2774692 2742979 2706521 2715509 2721276 2722958 2705717 2741989
13309B741989N9204L6914k7081M164k8307M5775Q7226R3283K5357L072K3497N0431
$$ 2741989 2801193 2838107 2811026 2815190 2786883 2832658 2919884 3013167 3038524 3041596 3065093 3115524
13297C115524L684O1327J5825K7983k7341N9613P6703Q2303R4828R1047O9038
$$ 3115524 3119208 3180535 3196360 3224343 3197002 3256615 3333318 3415621 3510449 3601496 3670534
13286C670534O827j9J7380m9111p2435R4099J01127J10744O0458J5454Q7520J07058
$$ 3670534 3677361 3677342 3694722 3645611 3573176 3667275 3768402 3879146 3939604 3955058 4042578 4149636
13274D149636J42543J27903J18439J03271Q8412J29102K41772L71100O30051Q47807
$$ 4149636 4292179 4420082 4538521 4641792 4730204 4859306 5101078 5472178 6102229 6950036
13264F950036Q26594N08354P6864l41813o33973p41362o19540m14715j83323o1976
$$ 6950036 7776630 8284984 8361848 8020035 7386062 6644700 6025160 5610445 5427122 5365146
13254E365146K337k2453M0153l3614l6502K7223J4137M5589P1213O9792J32177
$$ 5365146 5367483 5345030 5385183 5351569 5315067 5342290 5356427 5402016 5473229 5543021 5675198
13243E675198J68754P1232N703p6601o1681O060L449M7450N2524N825k2289P5447
$$ 5675198 5843952 5915184 5920887 5844286 5782605 5788665 5792114 5839564 5892088 5897913 5875624 5951071
13231E951071J16466J56371J68326K63910L92373K98392K78932L95431O55597
$$ 5951071 6067537 6223908 6392234 6656144 7048517 7346909 7625841 8021272 8676869
13222H676869J052886J632731K173418K363090J864471P18264o68126j888567
$$ 8676869 9729755 11362486 13535904 15898994 17763465 18481729 17813603 15925036
13214A5925036k380866k090475j420776p68260l84969k38660j68797q1452j15603
$$ 15925036 13544170 11453695 10032919 9264659 8879690 8641030 8472233 8390781 8275178
13205H275178j10244j04971r8146r7615K2830P8427R4327J29805J58437M794j03224
$$ 8275178 8164934 8059963 7961817 7864202 7887032 7965459 8059786 8189591 8348028 8352822 8249598
13194H249598j40347r6856n5432J0665L5786Q9024J13406J22911J14095J58121
$$ 8249598 8109251 8012395 7956963 7967628 8003414 8092438 8205844 8328755 8442850 8600971
13184H600971K47131K89269L20944L14586L11468M35931O63649R86402J544361
$$ 8600971 8848102 9137371 9458315 9772901 10084369 10520300 11183949 12170351 13714712
13175A3714712K145484K434889K099646J070538l11070j684567k302853k139645
$$ 13714712 15860196 18295085 20394731 21465269 21154199 19469632 17166779 15027134
13167A5027134j588577q95086m30661k37374r1019q1726j45447r2538m9621p6056
$$ 15027134 13438557 12543471 12112810 11875436 11784417 11702691 11557244 11464706 11415085 11339029
13157A1339029J5090M8894M1518K4722R5124J14995R4154O3238K7385Q8181P5842
$$ 11339029 11354119 11403013 11444531 11469253 11564377 11679372 11773526 11836764 11864149 11952330 12028172
13146A2028172O5166J24057J18245J47389J78018J39477Q6606J95582K72941K26472
$$ 12028172 12093338 12217395 12335640 12483029 12661047 12800524 12887130 13082712 13355653 13582125
13136A3582125K28836K27010L01963L77488M69758O40836Q44878R18680Q33364
$$ 13582125 13810961 14037971 14339934 14717422 15187180 15828016 16672894 17591574 18424938
13127A8424938N77645J52534k99955n28766n76962l87639j98089k2882Q0985J28946
$$ 18424938 19002583 19155117 18855162 18326396 17749434 17361795 17163706 17140824 17221809 17350755
13117A7350755J60442J24132J44694J86277K21500K50635K42859K33143K21438
$$ 17350755 17511197 17635329 17780023 17966300 18187800 18438435 18681294 18914437 19135875
13108A9135875K26713K48815K68550K20883J76631L20099L94822L75184L07039
$$ 19135875 19362588 19611403 19879953 20100836 20277467 20597566 20992388 21367572 21674611
13099B1674611K40968L74729L73704L34006L52522L70931M07686L87991L91603
$$ 21674611 21915579 22290308 22664012 22998018 23350540 23721471 24129157 24517148 24908751
13090B4908751L87240L82597L92211M33748M51331M17275L93625M67962N25729
$$ 24908751 25295991 25678588 26070799 26504547 26955878 27373153 27766778 28234740 28760469
13081B8760469M95807N37905N35203N49190N41118O21129O10643N97713N64253
$$ 28760469 29256276 29794181 30329384 30878574 31419692 32040821 32651464 33249177 33813430
13072C3813430O53877O60018O84395O79317O65112O79738P59666Q66832Q46838
$$ 33813430 34467307 35127325 35811720 36491037 37156149 37835887 38595553 39462385 40309223
13063D0309223Q71100Q27420Q90059R28385R51372R31826J006810J017629J070809
$$ 40309223 41180323 42007743 42897802 43826187 44777559 45709385 46716195 47733824 48804633
13054D8804633J115171J143951J126252J161028J208299J242948J307634J361104
$$ 48804633 49919804 51063755 52190007 53351035 54559334 55802282 57109916 58471020
13046E8471020J441975J469638J514440J574401J609494J637612J697384J741005
$$ 58471020 59912995 61382633 62897073 64471474 66080968 67718580 69415964 71156969
13038G1156969J874600J920300J890580K010755K108850K136252K211645K285103
$$ 71156969 73031569 74951869 76842449 78853204 80962054 83098306 85309951 87595054
13030H7595054K377248K503366K574481K608586K682611K858896K883472K931234
$$ 87595054 89972302 92475668 95050149 97658735 100341346 103200242 106083714 109014948
13022A09014948L013519L128573L169080L266214L417494L525876L554878L620320
$$ 109014948 112028467 115157040 118326120 121592334 125009828 128535704 132090582 135710902
13014A35710902L720110L839336L868336L924163M015185M030103M000405M038800
$$ 135710902 139431012 143270348 147138684 151062847 155078032 159108135 163108540 167147340
13006A67147340M071020M079810M035433M022889M023259L907097L756878L693306
$$ 167147340 171218360 175298170 179333603 183356492 187379751 191286848 195043726 198737032
12998A98737032L511126L348725L185191K990590K809708K509992K231819J933532
$$ 198737032 202248158 205596883 208782074 211772664 214582372 217092364 219324183 221257715
12990B21257715J679713J346815J027067O61548L08407K5719l34837o91495j016524
$$ 221257715 222937428 224284243 225311310 225972858 226281265 226306984 225972147 225280652 224264128
12981B24264128j322869j627660j919364k218686k511920k744988k952379l189662
$$ 224264128 222941259 221313599 219394235 217175549 214663629 211918641 208966262 205776600
12973B05776600l321348l523424l616370l739826l917746l933292l999656m076101
$$ 205776600 202455252 198931828 195315458 191575632 187657886 183724594 179724938 175648837
12965A75648837m062320m042649m016356l988899m035639m005768l921133l896587
$$ 175648837 171586517 167543868 163527512 159538613 155502974 151497206 147576073 143679486
12957A43679486l858840l768287l670628l621149l543863l433626l406936l316703
$$ 143679486 139820646 136052359 132381731 128760582 125216719 121783093 118376157 115059454
12949A15059454l174645l088710k996465k881049k885503k835833k741938k597018
$$ 115059454 111884809 108796099 105799634 102918585 100033082 97197249 94455311 91858293
12941I1858293k507560k467817k343887k322053k250373k119107k076701k093529
$$ 91858293 89350733 86882916 84539029 82216976 79966603 77847496 75770795 73677266
12933G3677266j987269j925403j791428j794025j735007j658751j619635j615850
$$ 73677266 71689997 69764594 67973166 66179141 64444134 62785383 61165748 59549898
12925E9549898j502885j411230j381888j433946j349456j284595j196479j182772
$$ 59549898 58047013 56635783 55253895 53819949 52470493 51185898 49989419 48806647
12917D8806647j182531j162364j072456j039763j064211j030954r46186r39018
$$ 48806647 47624116 46461752 45389296 44349533 43285322 42254368 41308182 40369164
12909D0369164r07859q45515q02534q38410p74417p80225o94760o92132p07197
$$ 40369164 39461305 38615790 37813256 36974846 36200429 35420204 34725444 34033312 33326115
12900C3326115o78438o84605o23984o24203o42667o55497o29381n60361m95640
$$ 33326115 32647677 31963072 31339088 30714885 30072218 29416721 28787340 28226979 27731339
12891B7731339m73288m85691m71684m72506n22776n19985m85630m84459m55989
$$ 27731339 27258051 26772360 26300676 25828170 25305394 24785409 24299779 23815320 23359331
12882B3359331l97177l78305l86933m07419l96357l41731l18146l25777l64156
$$ 23359331 22962154 22583849 22196916 21789497 21393140 21051409 20733263 20407486 20043330
12873B0043330m04612l66700k98399k43551k90012k85600k72233k65365k61423
$$ 20043330 19638718 19272018 18973619 18730068 18440056 18154456 17882223 17616858 17355435
12864A7355435k34427k47299k49911j99005k38587l13513k76047k16907k38050
$$ 17355435 17121008 16873709 16623798 16424793 16186206 15872693 15596646 15379739 15141689
12855A5141689k67811k57428k27060k14895j48485k07465k44367k31639j88707
$$ 15141689 14873878 14616450 14389390 14174495 14026010 13818545 13574178 13342539 13153832
12846A3153832k04650j41749k07168j57920j30967j35771j44365k03147k05542
$$ 13153832 12949182 12807433 12600265 12442345 12311378 12175607 12031242 11828095 11622553
12837A1622553j93834j84708k0113j24803j60327j75782j83761j77175j52195
$$ 11622553 11428719 11244011 11223898 11099095 10938768 10762986 10579225 10402050 10249855
12828A0249855q6739m2020r4156j24287j24542j47888j90885j48725r7267q2149
$$ 10249855 10163116 10121096 10026940 9902653 9778111 9630223 9439338 9290613 9193346 9111197
$$ [...]
##END NTUPLES=NMR SPECTRUM
##END=
