##TITLE=Analysis number 307254
Compound Code cc 35546
Book Reference 413/116
Project Code adrs
Chemist Name stevem
##JCAMPDX= 6.0         $$ Bruker NMR JCAMP-DX V2.0
##DATA TYPE= NMR SPECTRUM
##DATA CLASS= NTUPLES
##ORIGIN= Bruker BioSpin GmbH
##OWNER= NMR
$$ XWIN-NMR		Version 3.5
$$ Tue Apr 26 10:24:25 2005 GMT Daylight Time (UT+1h)  MAYBRIDGE\NMR@NMR_250MHZ
##.OBSERVE FREQUENCY= 250.131544655141
##.OBSERVE NUCLEUS= ^1H
##.ACQUISITION MODE= SIMULTANEOUS (DQD)
##.ACQUISITION SCHEME= undefined
##.AVERAGES= 16
##.DIGITISER RES= 18
##SPECTROMETER/DATA SYSTEM= dpx250
##.PULSE SEQUENCE= zg30
##.SOLVENT NAME= CDCl3
##.SHIFT REFERENCE= (INTERNAL, CDCl3, 0, 16.522)
##AUDIT TRAIL= $$ (NUMBER, WHEN, WHO, WHERE, WHAT)
$$ ##TITLE= Audit trail, XWIN-NMR		Version 3.5
$$ ##JCAMPDX= 5.01
$$ ##ORIGIN= Bruker BioSpin GmbH
$$ ##OWNER= NMR
$$ C:\u/data/dgb/nmr/ADRS/2240/pdata/1/auditp.txt
$$ ##AUDIT TRAIL=  $$ (NUMBER, WHEN, WHO, WHERE, WHAT)
(   1,<2005-04-26 10:24:04.87 +100>,<MAYBRIDGE\NMR>,<NMR_250MHZ>,
      <created by zg, POWCHK disabled, PULCHK disabled
       configuration hash MD5:
       62 19 C7 07 E1 42 D1 B7 37 6C 3D D0 77 39 F9 E6
       data hash MD5: 64K
       1D E7 57 C6 60 8B C0 BE 15 8B 5B 62 1A 5F 5E 8D>)
(   2,<2005-04-26 10:24:17.49 +100>,<MAYBRIDGE\NMR>,<NMR_250MHZ>,
      <Start of raw data processing
       ef LB = 0.3 FT_mod = 6 PKNL = 1 SI = 32K 
       data hash MD5: 32K
       43 E8 5C F6 3B BF BF 5F 5B 26 5E BD E7 45 DA 61>)
(   3,<2005-04-26 10:24:19.29 +100>,<MAYBRIDGE\NMR>,<NMR_250MHZ>,
      <apk 
       data hash MD5: 32K
       1F 19 6F A6 4C 66 2C 02 79 B5 2A FF 78 FA 1D 0D>)
(   4,<2005-04-26 10:24:19.98 +100>,<MAYBRIDGE\NMR>,<NMR_250MHZ>,
      <abs ABSG = 5 
       data hash MD5: 32K
       C1 CF 49 04 1B 2E F0 95 B8 89 B2 56 4F 73 D9 7B>)
$$ ##END=
$$ 
$$ hash MD5
$$ B2 F1 16 23 DA 8C 10 D4 0A CB 31 0A 06 37 A8 8D
##$RELAX= 
##$RELAX= 
##$RELAX= 
##$RELAX= 
##$RELAX= 
##$RELAX= 
##$RELAX= 
$$ Bruker specific parameters
$$ --------------------------
##$DU= <C:\u>
##$EXPNO= 2240
##$NAME= <ADRS>
##$PROCNO= 1
##$TYPE= <nmr>
##$USER= <dgb>
##$AMP= (0..31)
100 100 100 100 100 100 100 100 100 100 100 100 100 100 100 100 100 100 
100 100 100 100 100 100 100 100 100 100 100 100 100 100 
##$AQSEQ= 0
##$AQ_mod= 3
##$AUNM= <au_zg>
##$AUTOPOS= <10 >
##$BF1= 250.13
##$BF2= 250.13
##$BF3= 250.13
##$BF4= 250.13
##$BF5= 500.13
##$BF6= 500.13
##$BF7= 500.13
##$BF8= 500.13
##$BYTORDA= 1
##$CFDGTYP= 0
##$CFRGTYP= 5
##$CHEMSTR= <none>
##$CNST= (0..31)
1 1 145 1 1 1 1 1 1 1 1 1 1 1 1 1 1 1 1 1 1 1 1 1 1 1 1 1 1 1 1 1 
##$CPDPRG= <>
##$CPDPRG1= <>
##$CPDPRG2= <>
##$CPDPRG3= <>
##$CPDPRG4= <mlev>
##$CPDPRG5= <mlev>
##$CPDPRG6= <mlev>
##$CPDPRG7= <mlev>
##$CPDPRG8= <mlev>
##$CPDPRGB= <>
##$CPDPRGT= <>
##$D= (0..31)
0 1 0 0 0 0 0 0 0 0.06 0 0 0 0 0 0 0.0002 0 0 0 0 0 0 0 0 0 0 0 0 0 0 
0 
##$DATE= 1114507443
##$DBL= (0..7)
120 120 120 120 120 120 120 120 
##$DBP= (0..7)
150 150 150 150 150 150 150 150 
##$DBP07= 0
##$DBPNAM0= <>
##$DBPNAM1= <>
$$ [...]
##$SUBNAM7= <"">
##$SUBNAM8= <"">
##$SUBNAM9= <"">
##$SW= 20.6930455092707
##$SWIBOX= (0..15)
0 0 3 0 0 0 0 0 0 0 0 0 0 0 0 0 
##$SW_h= 5175.983436853
##$TD= 65536
##$TD0= 1
##$TE= 295.16
##$TE2= 300
##$TE3= 300
##$TEG= 300
##$TL= (0..7)
0 120 120 120 120 120 120 120 
##$TP= (0..7)
150 150 150 150 150 150 150 150 
##$TP07= 0
##$TPNAME0= <>
##$TPNAME1= <>
##$TPNAME2= <>
##$TPNAME3= <>
##$TPNAME4= <>
##$TPNAME5= <>
##$TPNAME6= <>
##$TPNAME7= <>
##$TPOAL= (0..7)
0.5 0.5 0.5 0.5 0.5 0.5 0.5 0.5 
##$TPOFFS= (0..7)
0 0 0 0 0 0 0 0 
##$TUNHIN= 0
##$TUNHOUT= 0
##$TUNXOUT= 0
##$USERA1= <user>
##$USERA2= <user>
##$USERA3= <user>
##$USERA4= <user>
##$USERA5= <user>
##$V9= 5
##$VALIST= <valist>
##$VCLIST= <CCCCCCCCCCCCCCC>
##$VD= 0
##$VDLIST= <DDDDDDDDDDDDDDD>
##$VPLIST= <PPPPPPPPPPPPPPP>
##$VTLIST= <TTTTTTTTTTTTTTT>
##$WBST= 1024
##$WBSW= 4
##$XGAIN= (0..3)
0 0 0 0 
##$XL= 0
##$YL= 0
##$YMAX_a= 322580
##$YMIN_a= -432858
##$ZGOPTNS= <>
##$ZL1= 120
##$ZL2= 120
##$ZL3= 120
##$ZL4= 120
##$ABSF1= 16.522
##$ABSF2= -4.171173
##$ABSG= 5
##$ABSL= 3
##$ALPHA= 0
##$AQORDER= 0
##$ASSFAC= 0
##$ASSFACI= 0
##$ASSFACX= 0
##$ASSWID= 0
##$AUNMP= <proc_1d>
##$AZFE= 0.1
##$AZFW= 0.1
##$BCFW= 0
##$BC_mod= 0
##$BYTORDP= 0
##$COROFFS= 0
##$CY= 12.5
##$DATMOD= 1
##$DC= 0
##$DFILT= <>
##$DTYPP= 0
##$F1P= 14.0000005364418
##$F2P= -0.99999901652339
##$FCOR= 0.5
##$FTSIZE= 32768
##$FT_mod= 6
##$GAMMA= 0
##$GB= 0
##$INTBC= 1
##$INTSCL= 1
##$ISEN= 128
##$LB= 0.3
##$LEV0= 0
##$LPBIN= 0
##$MAXI= 10000
##$MC2= 0
##$MEAN= 0
##$ME_mod= 0
##$MI= 0
##$NCOEF= 0
##$NC_proc= -3
##$NLEV= 6
##$NOISF1= 0
##$NOISF2= 0
##$NSP= 0
##$NTH_PI= 0
##$NZP= 0
##$OFFSET= 16.522
##$PC= 1
##$PHC0= -72.75836
##$PHC1= 2.709037
##$PH_mod= 1
##$PKNL= yes
##$PPARMOD= 0
##$PSCAL= 4
##$PSIGN= 0
##$REVERSE= no
##$SF= 250.13
##$SI= 32768
##$SIGF1= 0
##$SIGF2= 0
##$SINO= 400
##$SIOLD= 32768
##$SREGLST= <1H.CDCl3>
##$SSB= 0
##$STSI= 32768
##$STSR= 0
##$SW_p= 5175.98343685301
##$SYMM= 0
##$S_DEV= 0
##$TDeff= 65536
##$TDoff= 0
##$TI= <Analysis number 999999
Compound Code 99
Book Reference 9
Project Code 9>
##$TILT= no
##$TM1= 0
##$TM2= 0
##$TOPLEV= 0
##$USERP1= <user>
##$USERP2= <user>
##$USERP3= <user>
##$USERP4= <user>
##$USERP5= <user>
##$WDW= 1
##$XDIM= 32768
##$YMAX_p= 330963532
##$YMIN_p= -822013
$$ End of Bruker specific parameters
$$ ---------------------------------
##NTUPLES= NMR SPECTRUM
##VAR_NAME=  FREQUENCY,     SPECTRUM/REAL,   SPECTRUM/IMAG
##SYMBOL=    X,             R,               I
##VAR_TYPE=  INDEPENDENT,   DEPENDENT,       DEPENDENT
##VAR_FORM=  AFFN,          ASDF,            ASDF
##VAR_DIM=   32768,         32768,           32768
##UNITS=     HZ,            ARBITRARY UNITS, ARBITRARY UNITS
##FACTOR=    0.157963299565203, 1,           1
##FIRST=     4132.6476996994, 0,             0
##LAST=      -1043.33573715361, 0,           0
##MIN=       -1043.33573715361, -822013,     0
##MAX=       4132.6476996994, 330963532,     0
$$ Real data points
##PAGE= N=1
##DATA TABLE= (X++(R..R)), XYDATA
$$ [...]
$$ plain form
16349 -22485 -9407 -15990 -12751 -13484 -25621 -22760 -30346 -43809 -40102 -23766 -26653 -42894 -53617
16336 -53617 -48565 -46806 -38711 -28570 -35897 -35993 -47640 -41950 -34582 -13773 -28972 -32406 -25256 -46814
16322 -46814 -64639 -55838 -26567 -20688 -14046 -18474 -8746 3444 5773 8052 13882 -9661 -34248
16309 -34248 -45480 -44992 -38919 -53903 -74196 -71453 -72837 -37756 -29425 -16756 -34681 -57359 -67864
16296 -67864 -42597 -30534 -39274 -24101 -13634 -43435 -66819 -55703 -29003 -39674 -44978 -27118
16284 -27118 -5321 -26672 -27409 -34737 -35932 -43544 -43139 -42634 -31294 -27960 -19779 -16224 -37173 -59625
16270 -59625 -61889 -29742 -33422 -34915 -20676 -18383 -7899 -11444 -14812 -18909 -28568 -29660 -5925
16257 -5925 5440 -4439 -17193 -18828 -18983 -19998 -21844 -17948 9880 30964 33164 26114 33007 16835
$$ packed form
16349b2485J3078o583L239p33j2137K861p586j3463L707J6336k887j6241j0723
16336e3617N052J759Q095J0141p327r6j1647N690P368K0809j5199l434P150k1558
16322d6814j7825Q801K9271N879O642m428R728J2190K329K279N830k3543k4587
16309c4248j1232M88O073j4984k0293K743j384L5081Q331J2669j7925k2678j0505
16296f7864K5267J2063q740J5173J0467k9801k3384J1116K6700j0671n304J7860
16284b7118K1797k1351p37p328j195p612M05N05J1340L334Q181L555k0949k2452
16270e9625k264L2147l680j493J4239K293J0484l545l368m097r659j092K3735
16257e925J1365r879j2754j635j55j015j846L896K7828K1084K200p050O893j6172
$$ plain form
16243 16835 16785 -4273 -22201 -21740 -15615 -14381 -18828 -26350 -31206 -39817 -31486 -9463 -20143 -25202
16229 -25202 -29959 -24679 -27787 -25905 -12956 330 -7919 -13989 -28499 -36792 -20780 -20887 -5877
16216 -5877 11981 -18246 -59131 -51236 -45691 -29762 -36639 -48141 -8582 -16807 -28412 -19500 -17280
16203 -17280 -9339 -2007 -11073 -28768 -30234 -34839 -11418 4607 -28673 -47787 -51392 -38661 -25912
16190 -25912 -5012 -11726 -27592 -31945 -34317 -30791 -38665 -24473 -33286 -45378 -44144 -41283 -32403
16177 -32403 -25546 -34915 -45380 -31761 -15589 -12818 -224 9040 -7845 -10794 -16176 -14746 -22198
16164 -22198 -27702 -24570 -25716 -13590 -28579 -37547 -51123 -56865 -51686 -42621 -50147 -48762 -33884
16151 -33884 -22328 -19501 -13593 760 -15342 -50371 -37434 -36975 -40984 -29138 -37875 -46538 -60794
$$ packed form
16243A6835n0k1058j7928M61O125J234m447p522m856q611Q331K2023j0680n059
16229b5202m757N280l108J882J2949J3286q249o070j4510q293J6012j07J5010
16216e877J7858l0227m0885P895N545J5929o877j1502L9559q225j1605Q912K220
16203a7280P941P332r066j7695j466m605K3421J6025l3280j9114l605J2731J2749
16190b5912K0900o714j5866m353k372L526p874J4192q813j2092J234K861Q880
16177c2403O857r369j0465J3619J6172K771J2594R264j6885k949n382J430p452
16164b2198n504L132j146J2126j4989q968j3576n742N179R065p526J385J4878
16151c3884J1556K827N908J4353j6102l5029J2937M59m009J1846q737q663j4256
$$ plain form
16138 -60794 -59087 -56505 -51080 -38027 -18718 7379 31764 13554 -18274 -22284 -12266 22695
16126 22695 51297 75124 91957 92804 80182 72036 59829 43350 27170 16968 -691 -4983
16114 -4983 -653 -6354 -21773 -10495 13005 23061 22576 -1217 -12411 8633 3731 -832 28167
16101 28167 42713 45220 38947 7846 10299 13877 -20812 -35665 -38263 -31426 -12199 -2624 -2454
16088 -2454 203 -28278 -51407 -65049 -31019 -6120 -26285 -28513 -12209 -26196 -41760 -50963
16076 -50963 -37963 -28252 -3251 -18450 -27886 -28911 -23318 -20660 -24441 -27533 -45166 -51648 -30076
16063 -30076 -2755 -31483 -52994 -59293 -25848 -14300 -16166 -4681 -8941 -16039 -26979 -24366 -52775
16050 -52775 -58528 -44465 -16796 -22124 -15241 2261 15211 -2248 3509 -6227 -29321 -69047 -56974
$$ packed form
16138f0794J707K582N425J3053J9309K6097K4385j8210l1828m010J0018L4961
16126B2695K8602K3827J6833Q47j2622q146j2207j6479j6180j0202j7659m292
16114d983M330n701j5419J1278K3500J0056m85k3793j1194K1044m902m563K8999
16101B8167J4546K507o273l1101K453L578l4689j4853k598O837J9227R575J70
16088b454K657k8481k3129j3642L4030K4899k0165k228J6304j3987j5564r203
16076e0963J3000R711K5001j5199r436j025N593K658l781l092j7633o482K1572
16063c0076K7321k8728k1511o299L3445J1548j866J1485m260p098j0940K613k8409
16050e2775n753J4063K7669n328O883J7502J2950j7459N757r736k3094l9726J2073
$$ plain form
16037 -56974 -31824 -24996 -26011 -31270 -29073 -6167 5736 28116 34788 25711 396 11952 3922
16024 3922 -16478 -12341 -38608 -48498 -30186 -8394 11255 12841 -5886 -22907 -888 18889
16012 18889 19656 1680 -6677 -5727 1611 -781 3320 -2739 -4418 -12372 -2572 -16593 -22089 -20915
15998 -20915 -17907 -6832 -10112 -21539 -16185 -16280 -5937 12666 30764 37663 28154 24288 16142 -11747
15984 -11747 -24614 -36886 -48167 -42135 -21334 -35210 -42596 -61761 -53533 -25914 -19783 -23035 -29774
15971 -29774 -24420 -8546 -25013 -27509 -38045 -35964 -21036 -35458 -37098 -27518 -14742 -17221 1900
15958 1900 10005 3115 -6271 -25321 -17811 -22109 -23901 -34930 -60257 -31709 12562 26795 14188
15945 14188 11545 -13412 -51872 -34466 13887 21283 -9189 -22109 -19820 -30513 -32118 -13346
$$ packed form
16037e6974K5150O828j015n259K197K2906J1903K2380O672r077k5315J1556q030
16024C922k0400M137k6267r890J8312K1792J9649J586j8727j7021K2019J9777
16012A8889P67j7976q357R50P338k392M101o059j679p954R800j4021n496J174
15998b0915L008J1075l280j1427N354r5J0343J8603J8098O899r509l866q146k7889
15984a1747j2867j2272j1281O032K0801j3876p386j9165Q228K7619O131l252o739
15971b9774N354J5874j6467k496j0536K081J4928j4422j640R580J2776k479J9121
15958A900Q105o890r386j9050P510m298j792j1029k5327K8548M4271J4233j2607
15945A4188k643k4957l8460J7406M8353P396l0472j2920K289j0693j605J8772
$$ plain form
15933 -13346 -4856 -13360 -19857 -20982 -44605 -42709 -42756 -25609 -13158 -16740 615 18683 -7643
15920 -7643 -3629 -363 -25027 -42855 -31692 -18981 8440 27797 22959 1572 -14528 6198
15908 6198 10334 -9072 -8204 -32694 -23905 5025 -8482 -24500 -18371 -36861 -55111 -37700 -22332
15895 -22332 -22725 -36612 -61753 -72535 -51465 -42224 -59050 -29670 -4077 5432 22796 -11650
15883 -11650 -56688 -66006 -49962 -28225 -32168 -39276 -33245 -33655 -45512 -50466 -61440 -49663 -16443
15870 -16443 -3035 -3766 5004 -13923 -29375 -49865 -24685 -35056 -41172 -37245 -25767 -2831 16280
15857 16280 -15481 -32467 -17594 -18123 4163 22749 -14541 -39040 -29028 -21305 1190 10281
15845 10281 10882 9303 9841 6155 9049 19534 14897 -19006 -19905 -3759 211 3970 -2417 13114
$$ packed form
15933a3346Q490q504o497j125k3623J896m7J7147J2451l582J7355J8068k6326
15920g643M014L266k4664j7828J1163J2711K7421J9357m838k1387j6100K0726
15908F198M136j9406Q68k4490Q789K8930j3507j6018O129j8490j8250J7411J5368
15895b2332l93j3887k5141j0782K1070R241j6826K9380K5593R509J7364l4446
15883a1650m5038r318J6044K1737l943p108O031m10j1857m954j0974J1777L3220
15870a6443J3408p31Q770j8927j5452k0490K5180j0371o116L927J1478K2936J9111
15857A6280l1761j6986J4873n29K2286J8586l7290k4499J0012P723K2495R091
15845A0281O01j579N38l686K894J0485m637l3903q99J6146L970L759o387J5531
$$ plain form
15831 13114 1748 -6908 -5399 4707 -3602 -18277 -15540 -7157 6087 -12095 -40269 -40236 -31885
15818 -31885 -24554 -21912 -36344 -6346 18596 27174 8659 -7363 -27653 -30367 -6576 14302
15806 14302 5875 -508 -21333 -56034 -50447 -22975 -24043 -25141 -23297 -32895 -10922 -2106 -4044
15793 -4044 -11499 -9053 6570 -6264 -5014 -24627 -23811 -33811 -29824 -14255 2995 2495 -15129
15780 -15129 -44099 -36877 -19548 -35948 -31897 -5586 -4279 -28387 -23457 -28893 -10831 1704 7777
15767 7777 2418 -2172 10570 23322 22012 -20245 -28778 -11647 2702 6602 -5906 -2775 6361
15754 6361 565 -16268 -6800 -11891 -5480 24652 21932 -17890 -35481 -4881 24494 13686 15928
15741 15928 8674 -5867 6504 19877 -2404 -22822 -17436 5010 25000 27519 24326 37707
$$ packed form
15831A3114j1366q656J509J0106q309j4675K737Q383J3244j8182k8174L3Q351
15818c1885P331K642j4432K9998K4942Q578j8515j6022k0290k714K3791K0878
15806A4302q427o383k0825l4701N587K7472j068j098J844r598K1973Q816j938
15793d044p455K446J5623j2834J250j9613Q16j0000L987J5569J7250n00j7624
15780a5129k8970P222J7329j6400M051K6311J307k4108M930n436J8062J2535O073
15767G777n359m590J2742J2752j310m2257q533J7131J4349L900j2508L131R136
15754F361n796j6833R468n091O411L0132k720l9822j7591L0600K9375j0808K242
15741A5928p254j4541J2371J3373k2281k0418N386K2446J9990K519l193J3381
$$ plain form
15729 37707 16337 12622 11552 -8931 -18075 -23891 -37796 -60762 -64783 -59597 -61538 -46522 -35631
15716 -35631 -16010 -10873 -1906 27442 16129 -30701 -34963 -37113 -42103 -26226 -10537 -6910 -15107
15703 -15107 -7168 12230 21995 4123 -7621 534 -8652 -17146 -18629 -32588 -28938 -22036 -7902
15690 -7902 -2450 -2976 -619 21460 22982 24552 14282 -12553 -21375 -1945 4873 -16 15445 36761
15676 36761 28251 10690 6127 7916 19332 27135 -2741 4795 38710 31264 920 -3893 -2100
15663 -2100 20427 11980 9215 -11274 -26375 -44438 -46200 -40204 -23326 -2982 -7033 -2040 -1379
15650 -1379 1082 -20534 -7616 -23039 -38228 1046 30717 37639 29633 -2876 -13013 -2503
15638 -2503 3922 7500 2120 9701 20099 7966 -6856 13327 22525 11652 4033 21412 6583
$$ packed form
15729C7707k1370l715j070k0483r144n816j3905k2966m021N186j941J5016J0891
15716c5631J9621N137Q967K9348j1313m6830m262k150m990J5877J5689L627q197
15703a5107P939J9398R765j7872j1744Q155r186q494j483j3959L650O902J4134
15690g902N452n26K357K2079J522J570j0270k6835q822J9430O818m889J5461K1316
15676C6761q510j7561m563J789J1416P803k9876P536L3915p446l0344m813J793
15663b100K2527q447k765k0489j5101j8063j762N996J6878K0344m051M993O61
15650a379K461k1616J2918j5423j5189L9274K9671O922q006l2509j0137J0510
15638b503O425L578n380P581J0398j2133j4822K0183R198j0873p619J7379j4829
$$ plain form
15625 6583 -7142 -9103 6369 6496 19711 28174 49110 48973 661 -2248 31946 54435 32706
15612 32706 4688 -323 20825 10104 -19777 -22342 -37459 -44682 -46135 -49161 -23950 -12959 81
15599 81 10045 12998 -4403 -22603 -40645 -38362 -15885 -9636 -12750 -15964 -23627 -32831 -50611 -35255
15585 -35255 -1617 10441 -23152 -20624 -9958 -753 20686 29031 16161 25091 24292 6070 -14177
15572 -14177 -21074 -14750 -17391 -9303 -8979 -7122 -4360 -570 -5587 -13234 -1005 -4473 1679 9230
15558 9230 -2017 -18099 1314 -9878 -24350 -17440 -13127 3959 11046 11659 9638 -11905 -20623
15545 -20623 8535 16379 3863 2758 5446 3350 -15335 -13345 -26454 -21665 -11300 -4753 -6795
15532 -6795 -23784 -40619 -36825 -27294 -13041 658 -11842 -1861 10596 26479 25109 17215 12737
$$ packed form
15625F583j3725j961J5472J27J3215Q463K0936j37m8312k909L4194K2489k1729
15612C2706k8018n011K1148j0721k9881k565j5117p223j453l026K5211J0991J3040
15599H1R964K953j7401j8200j8042K283K2477O249l114l214p663r204j7780J5356
15585c5255L3638J2058l3593K528J0666R205K1439Q345j2870Q930p99j8222k0247
15572a4177o897O324k641Q088L24J857K762L790n017p647J2229l468O152P551
15558I230j1247j6082J9413j1192j4472O910M313J7086P087O13k021k1543q718
15545b0623K9158P844j2516j105K688k096j8685J990j3109M789J0365O547k042
15532f795j6989j6835L794R531J4253J3699j2500R981J2457J5883j370p894m478
$$ plain form
15519 12737 -5412 -22828 -22634 -12432 -13291 17515 18242 10536 12248 11720 -9137 -11514 8610 -3792
15505 -3792 -14281 -720 24254 29731 5474 -190 7544 13029 907 -15264 -28538 -34137 -22689
15492 -22689 -32764 -54601 -57296 -25202 -3453 -1518 -19929 -13296 -18655 -7892 -3644 -5190 -6583
15479 -6583 -10477 -22557 -25484 -34230 -24094 995 18462 -1865 -1928 1244 12680 11757 -2959 -31332
15465 -31332 -32729 -7425 -5450 3891 10269 19216 9144 15263 18009 2270 -6206 -11729 -27986
15452 -27986 -51403 -51605 -33512 -12755 -20261 -31010 -26127 -6337 5452 2949 15812 -4522 -1500
15439 -1500 15327 -1474 -27512 -38709 -31893 -44990 -31430 -10527 1146 13367 26400 41842
15427 41842 37030 36772 27950 21652 11509 -2295 -8381 -25779 -27491 -27069 -22464 -23028 -36149 -13987
$$ packed form
15519A2737j8149j7416J94J0202q59L0806P27p706J712n28k0857k377K0124j2402
15505c792j0489J3561K4974N477k4257n664P734N485j2122j6171j3274n599J1448
15492b2689j0075k1837k695L2094K1749J935j8411O633n359J0763M248j546j393
15479f583l894j2080k927q746J0136K5089J7467k0327o3L172J1436r23j4716k8373
15465c1332j397K5304J975R341O378Q947j0072O119K746j5739q476n523j6257
15452b7986k3417k02J8093K0757p506j0749M883J9790J1789k503J2863k0334L022
15439a500J6827j6801k6038j1197O816j3097J3560K0903J1673J2221J3033J5442
15427D1842m812k58q822o298j0143j3804o086j7398j712M22M605n64j3121K2162
$$ plain form
15413 -13987 -4465 -10446 -4225 -9232 -11691 -10158 -27710 -41098 -14703 1583 -22537 -27292 321
15400 321 14815 17861 8996 -5837 -6331 8834 1209 -20147 -23125 -20032 -11145 2255 12916 27046
15386 27046 8686 -4005 -6158 -21657 -17541 -14859 -24063 -35327 -28604 -12530 -13201 -11488 -5824
15373 -5824 -19607 -20401 -28062 -30502 -698 1942 -16609 -6655 7244 11766 -2489 3405 4643 -2444
15359 -2444 -6716 -9227 -3615 7603 -1066 -5170 -23944 -21701 -16790 -1156 -8291 -25341 -34984 -35599
15345 -35599 -19502 -20223 -1136 -6278 -13990 -10529 3704 -11389 -29535 -17186 4873 8702 14687
15332 14687 33721 39466 10243 -16641 -25265 -14243 14406 21191 5993 -1943 4256 9157 7787
15319 7787 15127 10633 -7188 -14898 -6315 8538 3310 -7759 -21245 -15184 -11972 10433 15021
$$ packed form
15413a3987R522n981O221n007k459J533j7552j3388K6395J6286k4120m755K7613
15400C21J4494L046q865j4833m94J5165p625k1356k978L093Q887J3400J0661J4130
15386B7046j8360j2691k153j5499M116K682r204j1264O723J6074o71J713N664
15373e824j3783p94p661k440K9804K640j8551R954J3899M522j4255N894J238p087
15359b444m272k511N612J1218q669m104j8774K243M911J5634p135j7050r643o15
15345c5599J6097p21J9087n142p712L461J4233j5093j8146J2349K2059L829N985
15332A4687J9034N745k9223k6884q624J1022K8649O785j5198p936O199M901j370
15319G787P340m494j7821p710Q583J4853n228j1069j3486O061L212K2405M588
$$ plain form
15306 15021 29324 29499 10570 4853 5371 15032 23083 13517 1509 -30745 -31125 -35574 -27777 -20044
15292 -20044 -29692 -28703 -34207 -28379 -13380 -659 -24639 -34633 -38740 -31662 -27006 -34803 -21466 14584
15278 14584 24752 -2553 16402 28068 40256 41836 32598 11562 -7669 -12741 -14052 -7629 -11059
15265 -11059 -13590 -11101 5010 -2742 903 21823 12838 15229 6111 21230 52360 39189 5609
15252 5609 -21108 -23201 7894 9585 2661 -8517 -15074 -6518 -4908 17468 3419 -1525 -4136
15239 -4136 -845 9668 14295 25496 32979 4497 354 -32421 -55595 -48006 -21558 3673 2008
15226 2008 -10905 -28265 -30462 -17886 -13911 -30842 -38793 -18515 -25295 -49397 -46695 -27814 -16166
15213 -16166 -43336 -25225 -5686 1097 5594 1343 -12103 -20932 -3881 -873 1933 4534 -15893
$$ packed form
15306A5021J4303J75j8929n717N18R661Q051r566j2008l2254l80m449P797P733
15292b0044r648R89n504N828J4999J2721k3980r994m107P078M656p797J3337L6050
15278A4584J0168k7305J8955J1666J2188J580r238k1036j9231n072j311O423l430
15265a1059k531K489J6111p752L645K0920q985K391r118J5119L1130j3171l3580
15252E609k6717k093L1095J691o924j1178o557Q556J610K2376j4049m944k611
15239d136L291J0513M627J1201P483k8482m143l2775k3174P589K6448K5231j665
15226B008j2913j7360k197J2576L975j6931p951K0278o780k4102K702J8881J1648
15213a6166k7170J8111J9539O783M497m251j3446q829J7051L008K806K601k0427
$$ plain form
15200 -15893 -7056 1066 18224 33456 22728 -7416 -26997 -2812 -19273 -32654 -29601 -34129
15188 -34129 -33183 -7243 7759 10930 22815 15347 7578 12414 21266 33217 16633 -7919 -4596
15175 -4596 -5070 -1781 284 -1303 -9326 -21411 -20519 -20653 -20245 -42645 -28446 -10622 -20868 6706
15161 6706 21920 24505 441 2390 19989 14930 8783 -17937 -38695 -27920 -12153 -2852 -7696
15148 -7696 -9341 -12235 -135 11553 12867 9608 -598 -23635 -17899 -8128 -12677 -22019 -13142 2842
15134 2842 -5586 -23343 -53433 -48918 -13636 -7852 -3685 -41677 -36570 -2932 -3749 -26958 -10999
15121 -10999 6096 5037 -1953 -361 8348 6015 16809 19119 13562 2044 -7347 -11553 5131
15108 5131 12539 14471 9934 24431 33594 33758 25801 16801 -1824 4896 3293 -13705 -23791 -12950
$$ packed form
15200a5893Q837Q122J7158J5232j0728l0144j9581K4185j6461j3381L053m528
15188c4129R46K5940J5002L171J1885p468p769M836Q852J1951j6584k4552L323
15175d596m74L289K065j587q023j2085Q92j34M08k2400J4199J7824j0246K7574
15161F706J5214K585k4064J949J7599n059o147k6720k0758J0775J5767R301m844
15148g696j645k894J2100J1688J314l259j0206k3037N736R771m549r342Q877J5984
15134B842q428j7757l0090M515L5282N784M167l7992N107L3638q17k3209J5959
15121a0999J7095j059o990J592Q709k333J0794K310n557j1518r391m206J6684
15108E131P408J932m537J4497R163J64p957r000j8625O720j603j6998j0086J0841
$$ plain form
15094 -12950 -6047 5688 28937 22690 -5160 -11911 -7790 10477 -178 -28863 -49237 -18047
15082 -18047 -23264 -34525 -17917 3051 6458 -16619 -13543 -17957 6580 11215 -5590 23265 21507
15069 21507 5570 2931 5753 -13522 -27335 -4283 -22 8606 9215 14620 15503 8547 11985 15055
15055 15055 12986 -6868 -9827 12122 3636 4355 -4831 -31447 -23149 -14717 3919 4098 9705 15345
15041 15345 2380 -17143 -15972 4712 11929 -10123 -2428 19930 28648 62047 57213 17955 -7791
15028 -7791 -15665 -11482 4672 8805 16107 16014 -660 -37933 -40428 -26604 -14777 -11101 -3057 21760
15014 21760 34762 30609 25237 -3696 -15290 185 6485 -16674 -30512 -23066 -26864 -13621 -3505
15001 -3505 -6842 -5379 15845 28134 37522 35670 10878 4933 32689 30709 11575 699 -11761
$$ packed form
15094a2950O903J1735K3249o247k7850o751M121J8267j0655k8685k0374L1190
15082a8047n217j1261J6608K0968L407k3077L076m414K4537M635j6805K8855j758
15069B1507j5937k639K822j9275j3813K3052M261Q628O09N405Q83o956L438L070
15055A5055k069j9854k959K1949q486P19r186k6616Q298Q432J8636J79N607N640
15041A5345j2965j9523J171K0684P217k2052P695K2358Q718L3399m834l9258k5746
15028g791p874M183J6154M133P302r3j6674l7273k495J3824J1827L676Q044K4817
15014B1760J3002m153n372k8933j1594J5475O300k3159j3838P446l798J3243J0116
15001c505l337J463K1224J2289R388j852k4792n945K7756j980j9134j0876j2460
$$ plain form
14988 -11761 -23627 -30362 -43533 -48629 -32861 -23438 -8996 -9866 -8094 -12237 -49346 -48993 -6765
14975 -6765 11527 8904 -23796 -38205 -29636 -8657 2462 -3797 -28913 -42770 -14286 -5201 -24418
14962 -24418 -19518 8578 19476 19922 3072 -30749 -53406 -37778 -778 -6937 -7375 -17501 6066
14949 6066 21328 -9946 -18476 -6926 11179 20776 1819 -8003 -1140 19760 21267 21224 29587 21373
14935 21373 -7613 -37729 -33969 -16447 -18300 -46964 -38424 -26100 -7552 -12491 -4311 -2675 -2313
14922 -2313 13792 55857 55664 23952 -1715 -755 8515 -9903 -13839 -12436 7927 14589 11915 1339
14908 1339 361 -14870 -9523 3780 13854 18091 1933 -3777 14677 12810 -18260 -20947 -17280
14895 -17280 -7879 -14755 -44467 -45469 -9136 4027 -24613 -33501 -21888 -10618 -24741 -34494 -14535
$$ packed form
14988a1761j1866o735j3171n096J5768R423J4442q70J772m143l7109L53M2228
14975f765J8292k623l2700j4409Q569K0979J1119o259k5116j3857K8484R085j9217
14962b4418M900K8096J0898M46j6850l3821k2657J5628L7000o159m38j0126K3567
14949F066J5262l1274q530J1550J8105R597j8957r822O863K0900J507m3Q363q214
14935B1373k8986l0116L760J7522j853k8664Q540J2324J8548m939Q180J636L62
14922b313J6105M2065j93l1712k5667R60R270j8418l936J403K0363O662k674j0576
14908A339r78j5231N347J3303J0074M237j6158n710J8454j867l1070k687L667
14895a7280R401o876k9712j002L6333J3163k8640q888J1613J1270j4123r753J9959
$$ plain form
14882 -14535 -5639 -13076 -28942 -35097 -25588 -12518 -1818 5364 11577 27653 37660 42379 28296
14869 28296 12989 15668 15119 12089 32842 46398 50623 36271 23639 19149 3888 -3373 31889
14856 31889 46981 25100 10402 8063 1450 -5985 -1045 4671 11430 25101 22203 13944 12187
14843 12187 10429 9898 5381 20896 45621 26908 27323 23288 6316 15409 13486 17373 -1229 -7661
14829 -7661 -16960 60 13959 2888 -12649 -27671 -8974 2350 8237 -764 4560 12641 -1796
14816 -1796 -7231 -2591 765 2903 -15182 -6830 3840 -22069 -29456 -27870 -14210 -6248 19001
14803 19001 33001 27945 2840 -24308 -39844 -53182 -56447 -50669 -61261 -45097 -52995 -49464 -32048
14790 -32048 -33877 -18387 -541 4327 14666 10541 4781 -16841 -16465 -1374 18175 7752 17414
$$ packed form
14882a4535Q896p437j5866o155R509J3070J0700P182O213J6076J0007M719j4083
14869B8296j5307K679n49l030K0753J3556M225j4352j2632m490j5261p261L5262
14856C1889J5092k1881j4698k339o613p435M940N716O759J3671k898q259j757
14843A2187j758n31m517J5515K4725j8713M15m035j6972R093j923L887j8602o432
14829g661r299J7020J3899j1071j5537j5022J8697J1324N887r001N324Q081j4437
14816a796n435M640L356K138j8085Q352J0670k5909p387J586J3660P962K5249
14803A9001J4000n056k5105k7148j5536j3338l265N778j0592J6164p898L531J7416
14790c2048j829J5490J7846M868J0339m125n760k1622L76J5091J9549j0423R662
$$ plain form
14777 17414 -2239 -31041 -27977 -7488 -3793 -21582 -26891 -22503 -11496 -20661 -4070 10618 4595
14764 4595 -3152 10136 8501 -4548 -8488 -11082 7899 7966 8224 14774 25103 -371 -16684 5285
14750 5285 10166 -7078 -712 9747 31792 18274 18242 19762 7993 -11763 -882 -4478 -2197
14737 -2197 1261 10892 10679 5585 9878 14697 4627 -12801 -8784 -791 -8676 -4713 6102 8790
14723 8790 -5164 -127 5563 22708 29507 27454 22860 24545 17968 25358 40700 18468 15069 43084
14709 43084 60052 28620 12252 12469 -6037 -18408 -9603 1248 23457 18022 2371 -14023
14697 -14023 -23473 -25836 -20725 -5087 511 116 3618 -3933 -11307 -12838 15682 11226 11045 13797
14683 13797 14828 16516 17751 21064 28720 4268 -8988 25096 29993 30625 36333 43320 24080 7010
$$ packed form
14777A7414j9653k8802L064K0489L695j7789n309M388J1007r165J6591J4688o023
14764D595p747J3288j635j3049l940k594J8981O7K58O550J0329k5474j6313K1969
14750E285M881j7244O366J0459K2045j3518l2J520j1769j9756J0881l596K281
14737b197L458R631k13n094M293M819j0070j7428M017P993p885L963J0815K688
14723H790j3954N037N690J7145O799k053m594J685o577P390J5342k2232l399K8015
14709D3084J6968l1432j6368K17j8506j2371Q805J0851K2209n435j5651j6394
14697a4023r450k363N111J5638N598l95L502p551p374j531K8520m456j81K752
14683A3797J031J688J235L313P656k4452j3256L4084M897O32N708O987j9240j7070
$$ plain form
14669 7010 -14600 310 2956 7765 10065 15028 -4357 -20121 -16965 -5237 13906 24653 14945
14656 14945 41806 35951 23408 23213 23691 17953 -1124 3102 -6824 -34166 -28490 -851 22922
14643 22922 24178 13649 -3575 -6533 -2421 -977 -14180 -21714 -31338 -19183 22 18540 29415
14630 29415 31923 13725 4542 -6987 5734 9976 -4612 -4405 -7326 -31152 -27844 -2317 20162
14617 20162 32933 8775 -1666 -6007 -8651 -12969 -30209 -28106 -35478 -26403 -166 9274 3605
14604 3605 1931 -12101 -15308 -3056 8224 572 -11726 -13337 10169 27106 -6560 -22969 -18900
14591 -18900 -2972 -6694 4245 20924 20725 17797 16045 23628 33817 13667 6944 30918 42666
14578 42666 53189 51424 35084 32516 17443 18186 23969 37993 45996 43306 30767 31468 18983
$$ packed form
14669G010k1610J4910K646M809K300M963j9385j5764L156J1728J9143J0747r708
14656A4945K6861n855j2543j95M78n738j9077M226r926k7342N676K7639K3773
14643B2922J256j0529j7224k958M112J444j3203p534r624J2155J9205J8518J0875
14630B9415K508j8198r183j1529J2721M242j4588K07k921k3826L308K5527K2479
14617B0162J2771k4158j0441m341k644m318j7240K103p372R075K6237R440n669
14604C605j674j4032l207J2252J1280p652j2298j611K3506J6937l3666j6409M069
14591a8900J5928l722J0939J6679j99k928j752P583J0189k0150o723K3974J1748
14578D2666J0523j765j6340k568j5073P43N783J4024Q003k690j2539P01j2485
$$ plain form
14565 18983 10635 25344 28999 16690 32970 36787 28672 17750 22938 39548 52999 68621 68419
14552 68419 31882 38207 42196 62951 54134 41049 26393 7968 9503 19763 26482 41236 23769
14539 23769 9599 7325 11406 4143 -3793 -8325 -8932 6722 27818 37598 43091 39890 20489 15335
14525 15335 7817 12080 7840 21799 17247 -17399 -20468 -9977 -15283 -4274 485 6481 10465
14512 10465 -16980 -21907 2777 769 -2751 3500 10679 19145 37282 42810 3877 -34864 -23296
14499 -23296 -11419 6298 -2058 -8076 156 -3767 -11921 -6792 3218 21591 27713 33558 38018
14486 38018 21714 -2485 8781 36206 30213 19114 15813 3884 4118 -15516 -3993 -3898 -5899
14473 -5899 17465 19949 37031 38643 11853 21915 41602 32376 33120 19603 1342 1699 -9180
$$ packed form
14565A8983q348J4709L655j2309J6280L817q115j0922N188J6610J3451J5622k02
14552F8419l6537O325L989K0755q817j3085j4656j8425J535J0260O719J4754j7467
14539B3769j4170k274M081p263p936m532o07J5654K1096R780N493l201j9401n154
14525A5335p518M263m240J3959m552l4646l069J0491n306J1009M759N996L984
14512A0465k7445m927K4684k008l520O251P179Q466J8137N528l8933l8741J1568
14499b3296J1877J7717q356o018Q232l923q154N129J0010J8373O122N845M460
14486C8018j6304k4199J1266K7425n993j1099l301j1929K34j9634J1523R5k001
14473e899K3364K484J7082J612k6790J0062J9687r226P44j3517j8261L57j0879
$$ plain form
14460 -9180 -18087 -27265 -23158 -4347 10905 8073 8250 9738 28424 44074 50921 49915 34674 8449
14446 8449 9423 27610 32942 39894 26228 2827 10390 29773 37968 50960 38585 23530 10138
14433 10138 29717 8738 6169 10521 19670 18395 15991 23226 21799 33562 27855 19807 43898
14420 43898 49750 31946 25544 42410 63290 61329 32229 44582 42341 38273 25492 22045 30162
14407 30162 19096 14104 -9320 -6338 19390 44967 57713 52845 23388 -9186 -9024 6635 16456
14394 16456 -2116 -19445 -3620 2521 19615 2847 -5480 -14995 -40648 -34309 -12965 9814
14382 9814 29257 35730 20664 1662 433 12899 32060 42829 41356 44590 33692 16894 20484
14369 20484 38999 51955 66559 60567 39196 11804 12504 7000 -986 1441 20888 17339 19416
$$ packed form
14460i180q907r178M107J8811J5252k832J77J488J8686J5650O847j006j5241k6225
14446H449R74J8187N332O952j3666k3401P563J9383Q195J2992j2375j5055j3392
14433A0138J9579k0979k569M352R149j275k404P235j427J1763n707q048K4091
14420D3898N852j7804o402J6866K0880j961k9100J2353k241m068j2781l447Q117
14407C0162j1066m992k3424K982K5728K5577J2746m868k9457l2574J62J5659R821
14394A6456j8572j7329J5825O141J7094j6768q327r515k5653O339K1344K2779
14382I814J9443O473j5066j9002j229J2466J9161J0769j473L234j0898j6798L590
14369B0484J8515J2956J4604n992k1371k7392P00n504p986K427J9447l549K077
$$ plain form
14356 19416 35727 33394 17951 31379 24595 5388 -13018 -19522 -45079 781 24789 28712
14344 28712 39532 -1589 -23173 -27586 -35153 -23110 -9454 12174 20477 -3645 -4618 21078 28043
14331 28043 26924 35287 45905 38322 32860 28205 15207 10876 41223 50556 23519 20499 14395
14318 14395 15228 35393 23722 15675 13373 23605 17537 34631 26951 17041 714 3460 8677
14305 8677 10850 415 28523 66592 81666 73155 64871 45843 28241 22445 23290 29133 27136
14292 27136 24114 23468 33583 52459 49443 46441 53914 44858 50184 61389 51758 39691 38834 42957
14278 42957 38476 16684 4303 17886 46831 59784 62489 42599 39888 42815 47249 36366 33332
14265 33332 42829 46240 54100 58419 39018 38749 37139 35955 29417 20941 20965 17758 26023 30310 16667
$$ packed form
14356A9416J6311k333j5443J3428o784j9207j8406o504k5557M5860K4008L923
14344B8712J0820m1121k1584m413p567J2043J3656K1628Q303k4122r73K5696O965
14331B8043j119Q363J0618p583n462m655j2998m331L0347R333k7037l020o104
14318A4395Q33K0165j1671q047k302J0232o068J7094p680r910j6327K746N217
14305H677K173j0435K8108L8069J5074q511q284j9028j7602n796Q45N843j997
14292B7136l022o46J0115J8876l016l002P473r056N326J1205r631j2067q57M123
14278D2957m481k1792j2381J3583K8945J2953K705j9890k711K927M434j0883l034
14265C3332R497L411P860M319j9401k69j610j184o538q476K4l207Q265M287j3643
$$ plain form
14250 16667 4897 24409 60476 75534 70872 46264 45995 49835 64466 50611 50310 42285 65049
14237 65049 65148 64334 68199 54171 59595 69994 69486 32877 -1867 -39615 -45476 1407 16360 18541
14223 18541 15393 7604 3663 6456 4918 14239 19578 19005 55100 63775 38536 18894 18430 19442
14209 19442 18115 -3641 -8227 -8745 19025 39919 43524 42017 37696 44006 32496 25674 29400 32789
14195 32789 53117 51166 47205 57166 62171 72343 102823 109536 70767 22248 17507 53114 71058
14182 71058 69896 66629 52325 35109 37754 34626 48265 77309 93391 109126 90162 65756
14170 65756 58034 50598 69205 71743 72594 52019 35715 38859 34714 59864 74502 76493 82562
14157 82562 100460 108331 64196 43375 58702 91798 100232 103151 102249 88379 73869 95651 113121
$$ packed form
14250A6667j1770J9512L6067J5058m662k4608k69L840J4631j3855l01q025K2764
14237F5049R9q14L865j4028N424J0399n08l6609l4744l7748n861M6883J4953K181
14223A8541l148p789l941K793j538R321N339n73L6095Q675k5239j9642m64J012
14209A9442j327k1756m586n18K7770K0894L605j507m321O310j1510o822L726L389
14195C2789K0328j951l961R961N005J0172L0480O713l8769m8519m741L5607J7944
14182G1058j162l267j4304j7216K645l128J3639K9044J6082J5735j8964k4406
14170F5756p722p436J8607K538Q51k0575j6304L144m145K5150J4638J991O069
14157H2562J7898P871m4135k0821J5327L3096Q434K919r02j3870j4510K1782J7470
$$ plain form
14144 113121 128969 146434 145482 157223 175615 180828 174495 199891 213557 220661 219604 214816 241089
14131 241089 259179 238114 240649 282998 311666 346422 399860 467966 529664 603269 687559 749052
14119 749052 829107 956426 1113128 1306595 1589823 2017183 2668620 3574960 4731239 6067760
14109 6067760 7415924 8583005 9455233 9865168 9747810 9177420 8288478 7206377 6059662
14100 6059662 5006141 4080801 3361789 2833634 2424676 2074361 1781825 1534086 1326583
14091 1326583 1144517 983285 846683 734699 629409 559700 502454 442330 382843 321544
14081 321544 280123 256730 223916 206687 190169 158847 148992 130048 119782 136116 131242 94174
14069 94174 48324 43477 61765 67452 72035 66959 57110 41150 40965 44658 39902 31500 34185 39258
$$ packed form
14144A13121J5848J7465r52J1741J8392N213o333K5396J3666P104j057m788K6273
14131B41089J8090k1065K535M2349K8668L4756N3438O8106O1698P3605Q4290O1493
14119G49052Q0055J27319J56702J93467K83228M27360O51437R06340J156279J336521
14109F067760J348164J167081Q72228M09935j17358n70390q88942j082101j146715
14100F059662j053521r25340p19012n28155m08958l50315k92536k47739k07503
14091A326583j82066j61232j36602j11984j05290o9709n7246o0124n9487o1299
14081C21544m1421k3393l2814j7229j6518l1322r855j8944j0266J6334m874l7068
14069I4174m5850m847J8288N687M583n076r849j5960j85L693m756q402K685N073
$$ plain form
14055 39258 39060 30629 47654 65292 47447 17943 18019 29701 29046 17858 28400 41871 57851
14042 57851 60063 40299 17721 2840 7137 4662 13719 29926 14357 11374 37438 57965 58671
14029 58671 60666 46035 56985 81460 93219 117216 157598 206032 246139 274465 285413 255147
14017 255147 229046 223386 195443 167399 126484 99489 88767 88601 85572 61681 49305 28586
14005 28586 28515 37972 39460 27731 48927 67786 56991 52672 50398 49850 47150 44942 57620 60219
13991 60219 53268 70775 51570 36957 39153 35857 39326 41428 24795 6722 -3652 -4348 4698
13978 4698 17643 4165 19098 9143 1287 9634 6730 -5079 -10755 12741 11558 30670 59009
13965 59009 65942 59349 34134 24929 31846 42570 58074 65116 78704 68980 32098 16529 8755
$$ packed form
14055C9258j98q431J7025J7638j7845k9504P6J1682o55j1188J0542J3471J5980
14042E7851K212j9764k2578j4881M297k475R057J6207j5569k983K6064K0527P06
14029E8671J995j4631J0950K4475J1759K3997M0382M8434M0107K8326J0948l0266
14017B55147k6101n660k7943k8044m0915k6995j0722j66l029k3891j2376k0719
14005B8586p1R457J488j1729K1196J8859j0795m319k274n48k700k208J2678K599
13991F0219o951J7507j9205j4613K196l296L469K102j6633j8073j0374o96R046
13978D698J2945j3478J4933r955p856Q347k904j1809n676K3496j183J9112K8339
13965E9009O933o593k5215r205O917J0724J5504P042J3588r724l6882j5569p774
$$ plain form
13952 8755 -8980 -2606 23184 20943 17152 25779 50093 23083 3369 12894 11573 27184 37180
13939 37180 53454 43718 28978 42044 40385 34595 39013 34489 34716 38500 27538 23408 19780 22090
13925 22090 22012 35473 25976 18552 30022 35464 32250 25342 15688 31536 46294 53896 42507 50658
13911 50658 64868 48539 32205 19330 11951 16403 39761 42297 26564 51564 76379 83694
13899 83694 79584 98706 105410 102557 104320 94995 71382 69597 82043 67954 48071 44613 32167
13886 32167 21570 51800 61383 48665 35998 55768 72367 87007 94595 66462 55507 57952
13874 57952 76515 37994 25106 32383 53325 73376 94086 79465 67263 63164 68083 101019
13862 101019 99200 98051 94888 98551 84233 68157 84068 104308 96349 76890 83241 109590 128661
$$ packed form
13952H755j7735O374K5790k241l791Q627K4314k7010j9714R525j321J5611R996
13939C7180J6274r736j4740J3066j659n790M418m524K27L784j0962m130l628K310
13925B2090p8J3461r497p424J1470N442l214o908r654J5848J4758P602j1389Q151
13911E0658J4210j6329j6334j2875p379M452K3358K536j5733K5000K4815P315
13899H3694m110J9122O704k853J763r325k3613j785J2446j4089j9883l458j2446
13886C2167j0597L0230R583j2718j2667J9770J6599J4640P588k8133j0955K445
13874E7952J8563l8521j2888P277K0942K0051K0710j4621j2202m099M919L2936
13862A01019j819j149l163L663j4318j6076J5911K0240p959j9459O351K6349J9071
$$ plain form
13849 128661 118216 124924 140935 155084 167787 187866 202655 241336 297069 320677 331519 366595
13837 366595 395653 425590 448587 434116 397984 368323 367651 340730 331423 323058 335938 342123
13825 342123 377333 396138 438232 477099 527701 596011 666524 713946 717936 701495 681891 647564
13813 647564 607202 561429 482995 425858 363390 298515 259923 220697 201154 166986 130013
13802 130013 119780 127345 89038 80320 74805 76593 99721 94659 96444 79801 68947 42874 21811
13789 21811 15303 16632 12122 18279 22864 31319 40838 49116 88674 85244 106436 101682 96500 75044
13775 75044 82989 92882 100818 114132 118516 116436 127135 128094 116646 128870 130052 148107 159763
13762 159763 159885 164391 167088 188875 233114 266924 334902 412630 505566 588062 660929 755717
$$ packed form
13849A28661j0445O708J6011J4149J2703K0079J4789L8681N5733K3608J0842L5076
13837C66595K9058K9937K2997j4471l6132k9661o72k6921r307q365J2880O185
13825C42123L5210J8805M2094L8867N0602O8310P0513M7422L990j6441j9604l4327
13813F47564m0362m5773p8434n7137o2468o4875l8592l9226j9543l4168l6973
13802A30013j0233P565l8307q718n515J788K3128n062J785j6643j0854k6073k1063
13789B1811o508J329m510O157M585Q455R519Q278L9558l430K1192m754n182k1456
13775G5044P945R893P936J3314M384k080J0699R59j1448J2224J182J8055J1656
13762A59763J22M506K697K1787M4239L3810O7978P7728R2936Q2496P2867R4788
$$ plain form
13750 755717 804571 808739 788310 738382 705510 661568 595933 527119 481095 447396 423112 429626
13738 429626 413850 416005 437103 430204 435999 444308 443786 448922 469836 481583 477264 466623 433078
13725 433078 376794 347082 322479 278615 237546 206939 165407 157582 156132 171577 169492 145580
13713 145580 133232 127504 127472 108883 76795 60847 71723 78346 76313 81825 73022 77883 62374
13700 62374 51938 58750 51589 32360 16225 4102 39919 55633 53958 44708 39632 35861 12875
13687 12875 18285 21566 24865 36125 56244 60494 73278 75151 57338 35168 28950 11851 -6418
13674 -6418 17648 40745 45359 44434 53799 76535 92810 83516 65213 56370 37285 32899 53434
13661 53434 37890 23982 36104 33007 42813 43758 52598 47392 58255 59445 79900 90479 94585
$$ packed form
13750G55717M8854M168k0429m9928l2872m3942o5635o8814m6024l3699k4284O514
13738D29626j5776K155K1098o899N795Q309n22N136K0914J1747m319j0641l3545
13725D33078n6284k9712k4603m3864m1069l0607m1532p825j450J5445k085k3912
13713A45580j2348n728l2j8589l2088j5948J0876O623k033N512q803M861j5509
13700F2374j0436O812p161j9229j6135j2123L5817J5714j675r250n076l771k2986
13687A2875N410L281L299J1260K0119M250J2784J873j7813k2170o218j7099j8269
13674f418K4066K3097M614r25R365K2736J6275r294j8303q843j9085m386K0535
13661E3434j5544j3908J2122l097R806R45Q840n206J0863J190K0455J0579M106
$$ plain form
13648 94585 103166 94246 92240 96288 88227 51033 44584 29476 29286 31308 35474 45817 21542 25733
13634 25733 30014 23975 16736 14353 17753 18989 10460 7021 26394 29679 14945 28586 41856
13621 41856 52517 74536 56641 34604 2887 3410 23572 22882 36422 32178 43343 25151 17988
13608 17988 16062 21549 27673 14779 11874 25308 17968 9552 16624 22800 43300 34408 30831 20362
13594 20362 13866 17665 2049 -15177 -4760 10493 20758 17551 31135 11827 -6935 11694
13582 11694 28807 30786 25652 43864 39865 17329 6557 9181 19526 12323 14672 29637 34592
13569 34592 24843 14637 18445 28327 34551 22817 17753 10536 24402 47663 48358 20575 -17219
13556 -17219 -5665 16086 26748 22858 3892 -9123 3614 31108 53364 39399 38340 22261
$$ packed form
13648I4585Q581q920k006M048q061l7194o449j5108j90K022M166J0343k4275M191
13634B5733M281o039p239k383L400J236q529l439J9373L285j4734J3641J3270
13621D1856J0661K2019j7895k2037l1717N23K0162o90J3540m244J1165j8192p163
13608A7988j926N487O124j2894k905J3434p340q416P072O176K0500q892l577j0469
13594B0362o496L799j5616j7226J0417J5253J0265l207J3584j9308j8762J8629
13582A1694J7113J979n134J8212l999k2536j0772K624J0345p203K349J4965M955
13569C4592r749j0206L808R882O224j1734n064p217J3866K3261O95k7783l7794
13556a7219J1554K1751J0662l890j8966j3015J2737K7494K2256j3965j059j6079
$$ plain form
13544 22261 -4131 -3196 -1287 16386 26463 52526 41182 24034 42660 64368 51034 17869
13532 17869 5824 21695 32480 46229 51122 51949 48280 36945 39247 62624 51190 25809 34095
13519 34095 34335 3311 -14958 -7070 -10445 -5913 10996 33183 35166 31524 63985 81737 67476
13506 67476 63377 42345 47490 39334 28442 21708 36421 30691 19371 16982 10867 -2539 2671
13493 2671 3745 4305 -7151 3530 579 -1023 10167 24086 35164 40350 22909 19375 24127
13480 24127 25517 23354 -1607 8787 35759 50795 49948 34237 20978 26555 38868 43631 54699
13467 54699 50762 41316 43746 48057 49896 19487 -195 -10673 22592 42247 55139 55608 43654
13454 43654 29910 35029 20906 10131 12501 42181 45254 49704 58871 42255 26241 33569 50123
$$ packed form
13544B2261k6392R35J909J7673J0077K6063j1344j7148J8626K1708j3334l3165
13532A7869j2045J5871J0785J3749M893Q27l669j1335K302K3377j1434k5381Q286
13519C4095K40l1024j8269P888l375M532J6909K2187J983l642L2461J7752j4261
13506F7476m099k1032N145q156j0892o734J4713n730j1320k389o115j3406N210
13493B671J074N60j1456J0681k951j602J1190J3919J1078N186j7441l534M752
13480B4127J390k163k4961J0394K6972J5036q47j5711j3259N577J2313M763J1068
13467E4699l937r446K430M311J839l0409j9682j0478L3265J9655J2892M69j1954
13454D3654j3744N119j4123j0775K370K9680L073M450R167j6616j6014P328J6554
$$ plain form
13441 50123 22668 15708 30588 18029 14857 21390 26797 33705 34536 54866 57446 46193 34861
13428 34861 35873 25312 31888 23047 6933 6769 8604 10377 38125 88416 88986 47359 13757
13415 13757 15515 5452 28279 31998 28224 42994 34810 31246 40571 21543 26242 42346 38822
13402 38822 40473 36479 52985 49513 20595 19993 30708 39286 30233 30673 44044 47709 53060 60187
13388 60187 68676 50135 18637 41836 46610 54042 58882 70103 79895 77845 74390 22898 6316
13375 6316 39247 67131 62409 69883 68002 47604 59262 64439 67852 70269 70740 64557 65666 50578
13361 50578 40737 26016 33124 72518 91969 61259 41127 32758 53687 44364 43829 62736 84504
13348 84504 84884 77998 79323 84231 62399 70933 62236 39230 36214 34775 42443 65454 58820 61039
$$ packed form
13441E0123k7455o960J4880j2559l172O533N407O908Q31K0330K580j1253j1332
13428C4861J012j0561O576q841j6114j64J835J773K7748N0291N70m1627l3602
13415A3757J758j0063K2827L719l774J4770q184l564R325j9028M699J6104l524
13402C8822J651l994J6506l472k8918o02J0715Q578r053M40J3371L665N351P127
13388F0187Q489j8541l1498K3199M774P432M840J1221R792k050l455n1492j6582
13375F316L2931K7884m722P474j881k0398J1658N177L413K417M71o183J109j5088
13361E0578r841j4721P108L9394J9451l0710k0132q369K0929r323n35J8907K1768
13348H4504L80o886J325M908k1832Q534q697k3006l016j439P668K3011o634K219
$$ plain form
13334 61039 70572 63400 80108 73161 62086 70601 53426 32646 41518 41316 20814 1917 4848
13321 4848 18106 30209 25474 34959 71808 72126 65376 59719 55088 52704 54026 38776 33167 14507
13307 14507 26293 31964 40641 52253 60595 39889 19464 24956 45241 41169 59080 82024 80880
13294 80880 70118 58170 57981 41376 51015 35576 54068 75061 73914 62441 34074 31256 76497
13281 76497 70863 58615 36844 31035 22034 41511 36082 40008 50586 54710 49731 45502 45514 44440
13267 44440 44939 53578 56923 51216 60415 70743 68390 72981 68033 75351 80170 71149 67053 52585
13253 52585 47629 45630 42395 19672 29808 42100 48184 46680 32893 30377 43537 55718 73454
13240 73454 73869 71624 64905 68799 63104 52306 40343 32981 36514 31597 24802 35571 59638 79341
$$ packed form
13334F1039R533p172J6708o947j1075Q515j7175k0780Q872k02k0502j8897K931
13321D848J3258J2103m735R485L6849L18o750n657m631k384J322j5250n609j8660
13307A4507J1786N671Q677J1612Q342k0706k0425N492K0285m072J7911K2944j144
13294H0880j0762j1948j89j6605R639j5439J8492K0993j147j1473k8367k818M5241
13281G6497n634j2248k1771n809r001J9477n429L926J0578M124m979m229J2j074
13267D4440M99Q639L345n707R199J0328k353M591m948P318M819r021m096j4468
13253E2585m956j999l235k2723J0136J2292O084j504j3787k516J3160J2181J7736
13240G3454M15k245o719L894n695j0798j1963p362L533m917o795J0769K4067J9703
$$ plain form
13226 79341 89132 85459 81580 61021 67018 72545 77375 96290 104100 135733 164986 190882 217633
13213 217633 244598 258869 252610 223189 170424 137965 105967 71207 75921 105465 92302 69688
13201 69688 52481 68648 73892 82904 102251 100589 108645 115569 128952 121187 132088 156986 113178
13188 113178 72214 65827 59980 83547 112996 119357 132883 133095 144156 135741 138458 136641 161623
13175 161623 198249 231145 278334 343330 431715 566664 693414 750113 735755 696925 593637
13164 593637 492353 379437 273528 235037 228048 216490 197097 176962 158711 159620 141872
13153 141872 125707 123809 94550 56453 53041 70312 71679 53118 47864 59718 75121 81784
13141 81784 82175 103176 117448 114746 134964 153853 159598 166965 162475 164528 160880 161803 210803 278750
$$ packed form
13226G9341R791l673l879k0559N997N527M830J8915P810L1633K9253K5896K6751
13213B17633K6965J4271o259k9421n2765l2459l1998l4760M714K9544j3163k2614
13201F9688j7207J6167N244R012J9347j662Q056O924J3383p765J0901K4898m3808
13188A13178m0964o387n847K3567K9449O361J3526K12J1061q415K717j817K4982
13175A61623L6626L2896M7189O4996Q8385J34949J26750N6699j4358l8830j03288
13164E93637j01284j12916j05909l8491o989j1558j9393k0135j8251R09j7748
13153A41872j6165j898k9259l8097l412J7271J367j8561n254J1854J5403O663
13141H1784L91K1001J4272k702K0218J8889N745P367m490K053l648R23M9000O7947
$$ plain form
13127 278750 332092 432780 572171 699731 796277 814224 781896 703506 607904 479509 385794
13116 385794 326528 295125 261970 239185 202150 165105 135091 139911 150105 144406 121344 114955
13104 114955 106238 112027 102415 84456 80308 74996 77482 86581 93176 91994 97254 102158 92005 88405
13090 88405 123792 139508 148135 164534 163601 175939 180264 207883 267054 346339 457321 590006
13078 590006 751564 876082 957805 1041153 1100532 1125180 1086090 988958 860721 755796 632261
13067 632261 527969 453219 380324 328520 287732 261825 256926 258925 235320 199917 167025 131587
13055 131587 122474 141059 134483 126654 98404 93276 112154 97038 64335 49245 58946 48225
13043 48225 37806 34807 44300 41336 28596 34713 56726 73393 66962 42240 34044 41677 62829
$$ packed form
13127B78750N3342J00688J39391J27560R6546J7947l2328p8390r5602j28395r3715
13116C85794n9266l1403l3155k2785l7035l7045l0014M820J0194n699k3062o389
13104A14955q717N789r612j7959m148n312K486R099O595j182N260M904j0153l600
13090H8405L5387J5716Q627J6399r33J2338M325K7619N9171P9285J10982J32685
13078E90006J61558J24518Q1723Q3348N9379K4648l9090r7132j28237j04925j23535
13067F32261j04292p4750p2895n1804m0788k5907m899J999k3605l5403l2892l5438
13055A31587r113J8585o576p829k8250n128J8878j5116l2703j5090R701j0721
13043D8225j0419k999R493k964j2740O117K2013J6667o431k4722q196P633K1152
$$ plain form
13030 62829 73746 58254 55280 51303 44211 38358 63230 42133 28877 28851 31203 33867 53701
13017 53701 40639 35744 26857 30464 21987 608 -5419 -8091 -18632 -11743 24986 19313 15620
13004 15620 18413 12591 33951 25805 26423 27077 40112 36628 -2211 -9535 4646 -13681 -28847
12991 -28847 -18988 -21525 -40796 -54644 -48192 -58846 -72942 -78897 -67162 -63294 -90747 -79461 -74635
12978 -74635 -67024 -63093 -5302 77424 190867 288636 384659 472733 540536 571081 574367 534187
12966 534187 515994 498451 445483 388028 363896 331283 330412 329785 314777 298245 295119 287137 251020
12953 251020 241207 240857 230693 227972 240072 212335 186946 176137 179007 189463 199668 212958
12941 212958 188634 180768 192618 196449 183845 187631 202303 206055 234783 248327 215740 177498
$$ packed form
13030F2829J0917j5492k974l977p092n853K4872k1097j3256k6K352K664J9834
13017E3701j3062m895q887L607q477k1379o027k672j0541O889L6729n673l693
13004A5620K793n822K1360q146O18O54J3035l484l8839p324J4181j8327j5166
12991b8847R859k537j9271j3848O452j0654j4096n955J1735L868k7453J1286M826
12978g4635P611L931N7791Q2726J13443R7769R6023Q8074O7803L0545L286m0180
12966E34187j8193j7543n2968n7455k4132l2613q71o27j5008j6532l126p982l6117
12953B51020r813l50j0164k721J2100k7737k5389j0809K870J0456J0205J3290
12941B12958k4324p866J1850L831j2604L786J4672L752K8728J3544l2587l8242
$$ plain form
12929 177498 156389 184301 203843 206732 209937 201552 205947 199396 208890 217814 221761 225870 207225
12916 207225 197370 187133 176044 172119 189616 197760 206798 211203 222838 271310 281311 287329 261891
12903 261891 256149 252035 262812 259330 243151 242708 233718 223763 210964 193074 191796 192012 195593 195850
12889 195850 200533 218556 208252 192470 188240 175400 185115 193425 188582 192617 197142 215445 217148
12876 217148 209074 203406 209223 216770 221449 244606 270964 242066 213874 182366 167913 190388
12864 190388 196178 179123 177058 189259 192254 214480 215260 215407 205179 191586 225457 235180 238649
12851 238649 234435 239828 238315 220266 227823 247696 258618 275693 296218 286753 282321 267548 238513
12838 238513 227728 211851 220748 234155 222959 203038 197347 196441 175111 159113 173564 161670
$$ packed form
12929A77498k1109K7912J9542K889L205q385M395o551R494Q924L947M109j8645
12916B07225r855j0237j1089l925J7497Q144R038M405J1635M8472J0001O018k5438
12903B61891n742m114J0777l482j6179m43q990r955j2799j7890j278K16L581K57
12889A95850M683J8023j0304j5782m230j2840R715Q310m843M035M525J8303J703
12876B17148q074n668N817P547M679K3157K6358k8898k8192l1508j4453K2475
12864A90388N790j7055k065J2201K995K2226P80J47j0228j3593L3871R723L469
12851B38649m214N393j513j8049P557J9873J0922J7075K0525r465m432j4773k9035
12838B38513j0785j5877Q897J3407j1196j9921n691r06k1330j5998J4451j1894
$$ plain form
12826 161670 156410 170302 174412 202164 204849 176640 154636 167600 159197 153328 179950 215315
12814 215315 249988 215579 191737 178701 178218 169561 179924 231244 262607 256243 264752 277018
12802 277018 273609 279813 288275 265032 273483 285514 301842 305600 324970 305676 294119 295014 304648
12789 304648 315452 308460 300664 313232 334113 343162 375149 428217 477439 495422 498213 516893
12777 516893 517001 487728 469921 460156 427183 391911 378735 365039 361131 379429 401449 406717
12765 406717 422536 422705 434618 421586 417824 414704 409505 393330 393982 392260 416862 426986 437640
12752 437640 427752 428490 444271 453210 484251 510945 528114 545039 535890 491713 485673 487268 467572
12739 467572 496043 497058 489784 513065 539979 541570 555569 571696 563277 560288 558700 575521 589260
$$ packed form
12826A61670n260J3892M110K7752K685k8209k2004J2964q403n869K6622L5365
12814B15315L4673l4409k3842j3036m83q657J0363N1320L1363o364Q509J2266
12802B77018l409O204Q462k3243Q451J2031J6328L758J9370j9294j1557Q95R634
12789C04648J0804o992p796J2568K0881R049L1987N3068M9222J7983K791J8680
12777E16893J08k9273j7807r765l2973l5272j3176j3696l908J8298K2020N268
12765D06717J5819J69J1913j3032l762l120n199j6175O52j722K4602J0124J0654
12752D37640r888P38J5781Q939L1041K6694J7169J6925r149m4177o040J595j9696
12739D67572K8471J015p274K3281K6914J591J3999J6127q419k989j588J6821J3739
$$ plain form
12726 589260 575267 601211 620243 627618 638219 640536 677266 712449 726102 732443 790991 794483
12714 794483 823612 862948 871281 875076 896780 919833 929009 939271 968635 994894 1016557 1048254
12702 1048254 1059835 1091134 1134504 1180774 1215961 1257803 1308597 1350691 1389560 1437023 1503957
12691 1503957 1576245 1632981 1687931 1750489 1830082 1915175 2016213 2117377 2247338 2415649
12681 2415649 2590257 2762466 2952919 3156822 3387848 3654900 3973416 4318554 4758206
12672 4758206 5345308 6053504 6870225 7814980 8897771 10113490 11431592 12855397 14447335
12663 14447335 16268545 18567280 21725039 26264998 32985004 43022509 57560135 77054079
12655 77054079 100369465 124722068 146869448 163834622 172950214 172747354 163785974 148172184
$$ packed form
12726E89260j3993K5944J9032P375J0601K317L6730L5183J3653O341N8548L492
12714G94483K9129L9336Q333L795K1704K3053R176J0262K9364K6259K1663L1697
12702A048254J1581L1299M3370M6270L5187M1842N0794M2094L8869M7463O6934
12691A503957P2288N6736N4950O2558P9593Q5093J01038J01164J29961J68311
12681B415649J74608J72209J90453K03903K31026K67052L18516L45138M39652
12672D758206N87102P08196Q16721R44755J082791J215719J318102J423805J591938
12663A4447335J821210K298735L157759M539959O720006J0037505J4537626J9493944
12655G7054079K3315386K4352603K2147380J6965174R115592k02860q961380j5613790
$$ plain form
12647 148172184 128713064 108038750 88564619 71957828 58824331 48916608 41548005
12640 41548005 35936894 31422140 27563342 24184259 21167165 18432473 15970634 13758027
12632 13758027 11820704 10151396 8723527 7503254 6485963 5623191 4890702 4270753
12624 4270753 3726636 3273648 2900275 2573577 2260363 1989324 1765264 1572413 1410868
12615 1410868 1247708 1096558 963723 865154 779152 690249 632749 593371 535181 487587 451340
12604 451340 429590 371143 321551 290855 254021 238165 216163 201939 196314 190898 165050 170184
12592 170184 148417 127698 120985 115346 115818 108478 79307 60515 50983 39122 25724 68638 81684
12579 81684 77314 70982 76734 78502 55787 32750 58016 85895 69526 60104 56608 43141 39986
$$ packed form
12647A48172184j9459120k0674314j9474131j6606791j3133497r907723p368603
12640D1548005n611111m514754l858798l379083l017094k734692k461839k212607
12632A3758027j937323j669308j427869j220273j017291q62772p32489o19949
12624D270753n44117m52988l73373l26698l13214k71039k24060j92851j61545
12615A410868j63160j51150j32835r8569q6002q8903n7500l9378n8190m7594l6247
12604D51340k1750n8447m9592l0696l6834j5856k2002j4224n625n416k5848N134
12592A70184k1767k0719o713n639M72p340k9171j8792r532j1861j3398M2914J3046
12579H1684m370o332N752J768k2715k3037K5266K7879j6369r422l496j3467l155
$$ plain form
12566 39986 32456 34518 21888 11346 -17423 -32300 -19008 -37771 -40579 -40890 -13867 8306 140
12553 140 4497 33065 53043 60329 45382 55911 52054 41775 34366 39141 51699 54342 88575
12540 88575 102104 108896 93199 62746 42398 40053 52865 91794 120560 121717 106177 125547
12528 125547 139165 162001 173489 162740 153008 131095 71943 37685 28277 17947 10807 6480
12516 6480 -18248 -19305 -7108 27382 56481 38621 -2191 -41331 -53361 -37279 -2938 5447
12504 5447 -6729 -13084 -7306 -9543 6809 34165 47969 62982 68857 53548 51489 59322 69549
12491 69549 69219 69780 67659 73402 66314 64626 35849 12748 11504 6065 35785 62518 74710 71572
12477 71572 68199 54583 37284 51483 66081 89986 110676 134840 153606 174497 195592 220727
$$ packed form
12566C9986p530K062j2630j0542k8769j4877J3292j8763k808l11K7023K2173q166
12553A40M357K8568J9978P286j4947J0529l857j0279p409M775J2558K643L4233
12540H8575J3529O792j5697l0453k0348k345J2812L8929K8766J157j5540J9370
12528A25547J3618K2836J1488j0749r732k1913n9152l4258r408j0330p140m327
12516F480k4728j057J2197L4490K9099j7860m0812l9140j2030J6082L4341Q385
12504E447j2176o355N778k237J6352K7356J3804J5013N875j5309k059P833J0227
12491F9549l30N61k121N743p088j688k8777k3101j244n439K9720K6733J2192l138
12477G1572l373j3616j7299J4199J4598K3905K0690K4164J8766K0891K1095K5135
$$ plain form
12465 220727 248285 306762 359737 423305 469370 485445 466738 429931 381660 333773 281509
12454 281509 202206 177268 170211 160734 149578 156629 158419 183900 207853 227133 286798 396441
12442 396441 489344 563675 610683 605781 607750 604266 598877 639088 673730 681362 650955 602446
12430 602446 510573 409947 343187 310786 294429 299079 331394 338627 349575 371264 417587 495544
12418 495544 604575 782137 1032030 1293142 1476081 1543124 1518669 1433585 1316058 1251862
12408 1251862 1253554 1276787 1274067 1259404 1209787 1185602 1190660 1236535 1355132 1471050 1614855
12397 1614855 1767811 1875090 1887397 1769269 1579987 1357846 1124274 939732 796665 692171
12387 692171 651164 680115 726999 802505 955592 1153967 1320729 1434401 1497336 1547426 1554913
$$ packed form
12465B20727K7558N8477N2975O3568M6065J6075j8707l6807m8271m7887n2264
12454B81509p9303k4938p057r477j1156P051J790K5481K3953J9280N9665J09643
12442C96441R2903P4331M7008m902J969l484n389M0211L4642P632l0407m8509
12430F02446r1873j00626o6760l2401j6357M650L2315P233J0948K1689M6323P7957
12418D95544J09031J77562K49893K61112J82939O7043k4455q5084j17527o4196
12408A251862J692K3233k720j4663m9617k4185N058M5875J18597J15918J43805
12397A614855J52956J07279J2307j18128j89282k22141k33572j84542j43067j04494
12387F92171m1007K8951M6884P5506J53087J98375J66762J13672O2935N0090P487
$$ plain form
12376 1554913 1556068 1624378 1675326 1662435 1545572 1353457 1103293 872610 723564 607977
12366 607977 530544 480765 411841 364479 301644 269284 229588 221139 202648 146571 142448 124467
12354 124467 90082 89768 102906 78073 75666 77001 53569 20730 -3430 -10645 5224 15755
12342 15755 -917 -31379 -73534 -93728 -107796 -131363 -151072 -177668 -208164 -241101 -264663 -220596
12330 -220596 -132299 -35971 71304 211582 345197 426954 515090 573514 623980 671482 694190
12319 694190 744710 810184 914732 1039548 1137385 1239559 1358127 1447623 1485827 1496946 1475535
12308 1475535 1453026 1394202 1341315 1317639 1331772 1404451 1523754 1683000 1819016 1892009 1911185
12297 1911185 1869821 1834358 1840687 1861671 1841259 1740737 1605442 1420180 1196464 1021982
$$ packed form
12376A554913J155O8310N0948j2891j16863j92115k50164k30683j49046j15587
12366F07977p7433m9779o8924m7362o2835l2360l9696q449j8491n6077m123j7981
12354A24467l4385l14J3138k4833k407J335k3432l2839k4160p215J5869J0531
12342A5755j6672l0462m2155k0194j4068k3567j9709k6596l0496l2937k3562M4067
12330b20596Q8297R6328J07275J40278J33615Q1757Q8136N8424N0466M7502K2708
12319F94190N0520O5474J04548J24816R7837J02174J18568Q9496L8204J1119k1411
12308A475535k2509n8824n2887k3676J4133P2679J19303J59246J36016P2993J9176
12297A911185m1364l5463O329K0984k0412j00522j35295j85262k23716j74482
$$ plain form
12287 1021982 922440 840694 793450 775889 789503 843647 964887 1124955 1278111 1337597 1299212
12276 1299212 1237707 1136868 1021455 894850 861491 900184 988031 1106892 1244628 1358703
12266 1358703 1424374 1444537 1459603 1493427 1570539 1698047 1817427 1849296 1762238 1585331 1340325
12255 1340325 1078330 881846 737988 654595 600866 548866 522429 527527 523004 528087 545656
12244 545656 569337 659709 752618 810731 852391 884047 888735 868481 871352 905202 945935 984323
12232 984323 982474 933533 888400 869209 874090 915721 1000075 1098276 1180229 1231169 1257836 1218601
12220 1218601 1120692 999977 890193 782362 690614 629120 576607 502197 450427 424341 404548
12209 404548 393059 370770 359593 328997 271921 252745 259700 269328 268603 254290 260211 279007
$$ packed form
12287A021982r9542q1746m7244j7561J3614N4144J21240J60068J53156N9486l8385
12276A299212o1505j00839j15413j26605l3359L8693Q7847J18861J37736J14075
12266A358703O5671K0163J5066L3824P7112J27508J19380L1869q7058j76907k45006
12255A340325k61995j96484j43858q3393n3729n2000k6437N098m523N083J7569
12244E45656K3681R0372R2909N8113M1660L1656M688k0254K871L3850M0733L8388
12232I84323j849m8941m5133j9191M881M1631Q4354R8201Q1953N0940K6667l9235
12220A218601r7909j20715j09784j07831r1748o1494n2513p4410n1770k6086j9793
12209D04548j1489k2289j1177l0596n7076j9176O955R628p25j4313N921J8796
$$ plain form
12197 279007 268128 234974 222180 223724 210604 211755 212737 199335 192669 169610 152508 160065 138614
12184 138614 135300 144296 152437 168299 165108 180833 171044 157820 175631 170901 163779 158398 141470
12171 141470 136138 124866 143190 149540 127760 117049 121854 131861 131115 148713 154172 154241 164480
12158 164480 198224 192458 153357 135791 124201 134431 136911 132238 140966 156682 162668 157719 142572
12145 142572 135760 132778 106888 106213 109722 110179 119377 124517 125005 121431 116676 120050 102973 97682
12131 97682 111918 119296 116260 118724 125816 138041 143056 140096 124192 96691 99602 106935 127088
12118 127088 150277 130547 121522 115254 107536 96733 112671 120472 129787 117241 122865 135768 127253
12105 127253 102954 90746 82533 103764 116046 119352 91572 94367 85513 86495 110168 132383 150174
$$ packed form
12197B79007j0879l3154j2794J544j3120J151R82j3402o666k3059j7102P557k1451
12184A38614l314Q996Q141J5862l191J5725r789j3224J7811m730p122n381j6928
12171A41470n332j1272J8324O350k1780j0711M805J0007p46J7598N459O9J0239
12158A64480L3744n766l9101j7566j1590J0230K480m673Q728J5716N986m949j5147
12145A42572o812k982k5890o75L509M57R198N140M88l574m755L374j7077n291
12131I7682J4236P378l036K464P092J2225N015k960j5904k7501K911P333K0153
12118A27088K3189j9730r025o268p718j0803J5938P801R315j2546N624J2903q515
12105A27253k4299j2208q213K1231J2282L306k7780K795q854R82K3673K2215J7791
$$ plain form
12092 150174 162454 170489 158365 169140 189486 213667 246096 278323 350739 406440 494842 608872
12080 608872 762018 938887 1120693 1313179 1432743 1485791 1496367 1418107 1297607 1164095
12070 1164095 1003545 849158 710948 593173 490545 419844 377173 336956 283672 252530
12060 252530 218193 227995 226166 213753 175636 154027 131398 104534 117177 139637 144254 150395
12048 150395 135794 125600 121988 125584 126727 95643 81907 82705 83946 76211 62155 37139 74161
12035 74161 85671 68254 66200 61510 59082 44027 63762 81036 72953 62631 65045 57303 61037
12022 61037 71990 78380 90599 102263 123718 132775 128438 141337 149787 154601 146971 143702 121041
12009 121041 133072 135152 132862 134898 139413 128916 133892 156790 181679 213245 243453 246721 265274
$$ packed form
12092A50174J2280Q035j2124J0775K0346K4181L2429L2227P2416N5701Q8402J14030
12080F08872J53146J76869J81806J92486J19564N3048J0576p8260j20500j33512
12070A164095j60550j54387j38210j17775j02628p0701m2671m0217n3284l1142
12060B52530l4337R802j829j2413l8117k1609k2629k6864J2643K2460M617O141
12048A50395j4601j0194l612L596J143l1084j3736P98J241p735j4056k5016L7022
12035G4161J1510j7417k054m690k428j5055J9735J7274q083j0322K414p742L734
12022F1037J0953O390J2219J1664K1455R057m337J2899Q450M814p630l269k2661
12009A21041J2031K080k290K036M515j0497M976K2898K4889L1566L0208L268J8553
$$ plain form
11996 265274 266610 270295 302262 349431 388472 442839 506189 586011 719835 898535 1131706
11985 1131706 1540094 2194000 3258513 4914704 7106154 9082520 9737176 9379692 8483362
11976 8483362 6734323 4772059 3386849 2582095 2159267 1908251 1703087 1489504 1281009
11967 1281009 1081869 911912 801916 703560 619106 548080 469140 398163 372632 350475 312991
11956 312991 294846 287063 297393 312485 326491 357128 377273 396220 381283 337309 256473 196628
11944 196628 171512 162897 151276 145887 124731 87116 77486 79491 77835 70201 84089 54982 58540
11931 58540 76357 50646 34183 28190 52644 50495 42198 18370 16170 6664 -23894 -20672 -9813
11918 -9813 -2634 12132 -6662 -7197 1322 22118 38145 10528 8285 24739 25199 33131 29784 24955
$$ packed form
11996B65274J336L685L1967M7169L9041N4367O3350P9822J33824J78700K33171
11985A131706M08388O53906J064513J656191K191450J976366O54656l57484q96330
11976H483362j749039j962264j385210q04754m22828k51016k05164k13583k08495
11967A281009j99140j69957j09996r8356q4454p1026p8940p0977k5531k2157l7484
11956C12991j8145p783J0330J5092J4006L0637K0145J8947j4937m3974q0836n9845
11944A96628k5116q615j1621n389k1156l7615r630K005j656p634J3888k9107L558
11931E8540J7817k5711j6463n993K4454k149q297k3828k200r506l0558L222J0859
11918i813P179J4766j8794n35Q519K0796J6027k7617k243J6454M60P932l347m829
$$ plain form
11904 24955 20673 15497 2196 5312 3287 -3094 4294 26699 45195 41644 14170 5362 14925
11891 14925 26638 31066 41650 10913 -3389 -13509 13537 21294 -5039 -3338 14063 -960
11879 -960 -6385 -14326 -1199 -42 4664 -14670 -31850 -22004 -4129 3990 3248 -4369 -11748 -22401
11865 -22401 -34147 -18642 -5600 -4822 2095 34043 46427 38151 29412 29877 34196 32611 12902
11852 12902 13172 38260 26518 16439 30044 62870 95115 87519 86020 80847 64286 41358 35245
11839 35245 28805 25413 30221 15467 10932 4131 -904 -7028 -1275 -92 10631 -17697 -25728 -27114
11825 -27114 -37234 -30503 -6790 -2171 -12074 1196 714 3239 14650 2407 11884 25653 24697
11812 24697 11314 5786 9020 10215 29663 56686 29863 11187 29793 39924 14593 1229
$$ packed form
11904B4955m282n176j3301L116k025o381P388K2405J8496l551k7474q808R563
11891A4925J1713M428J0584l0737j4302j0120K7046P757k6333J701J7401j5023
11879i60n425p941J3127J157M706j9334j7180R846J7875Q119p42p617p379j0653
11865b2401j1746J5505J3042P78O917L1948J2384q276q739M65M319j585j9709
11852A2902K70K5088j1742j0079J3605L2826L2245p596j499n173j6561k2928o113
11839C5245o440l392M808j4754m535o801n035o124N753J183J0723k8328q031j386
11825b7114j0120O731K3713M619r903J3270m82K525J1411j2243R477J3769r56
11812B4697j3383n528L234J195J9448K7023k6823j8676J8606J0131k5331j3364
$$ plain form
11800 1229 -1735 -2563 -13918 -11088 -15726 -12035 -15748 -7699 10417 4219 -8541 3311 23446 30053
11786 30053 -3940 -25013 -41855 -42934 -51888 -36678 -672 18351 29607 17001 -12094 -6737
11774 -6737 -14140 3957 -848 -13147 -10280 -21418 -45395 -40952 -25777 -16519 -25693 -32788 -37822
11761 -37822 -29255 -17522 -20542 -39594 -44294 -27615 4703 -4088 -9528 9435 39978 42948 35284
11748 35284 20440 919 3546 7319 12035 8389 11594 16810 15674 26176 51532 63216 40790
11735 40790 20241 33467 34170 25801 22832 -711 -8367 -4249 -13488 -13740 13839 23533 11477 4921
11721 4921 15818 40154 31720 22096 17949 -9001 -39183 -26494 -21112 -20403 -23643 -29387 -33687 -23405
11707 -23405 -10544 7272 22813 8519 -18781 -17462 -16082 -4841 -9981 -24860 -8210 -5469
$$ packed form
11800A229k964q28j1355K830m638L691l713Q049J8116o198j2760J1852K0135O607
11786C0053l3993k1073j6842j079q954J5210L6006J9023J1256j2606k9095N357
11774f737p403J8097m805j2299K867j1138k3977M443J5175R258r174p095n034
11761c7822Q567J1733l020j9052m700J6679L2318q791n440J8963L0543K970p664
11748C5284j4844j9521K627L773M716l646L205N216j136J0502K5356J1684k2426
11735D0790k0549J3226P03q369k969k3543p656M118r239k52K7579R694j2056o556
11721D921J0897K4336q434r624m147k6950l0182J2689N382P09l240n744m300J0282
11707b3405J2861J7816J5541j4294k7300J319J380J1241n140j4879J6650K741
$$ plain form
11695 -5469 7965 18957 10927 4617 -10447 -4357 -261 21998 12652 15313 30308 15874 23805
11682 23805 54864 44550 24160 8307 6278 -3870 -726 10577 -23287 -38608 -26932 -17349
11670 -17349 -9799 -10246 -22199 -42442 -28653 -11341 -5441 -18968 -24993 -3047 10027 -3573 -11803
11657 -11803 -11564 -5708 21043 15536 27749 29828 3092 -14103 -16936 -9059 11262 25525 33187
11644 33187 46346 42904 41365 29197 16816 24092 29647 4217 -11821 149 9047 -1862 -6970
11631 -6970 -6891 -25343 -47727 -19424 -15342 -10704 -2471 7266 15360 -81 -14945 -29895 -30750 -15932
11617 -15932 -4279 -1701 6071 41430 30315 11390 6296 -4136 -11089 -9925 -20732 -25997 -16528
11604 -16528 -4369 -2556 5276 32390 20799 12273 10087 -585 6133 13681 10998 -9227 6176
$$ packed form
11695e469J3434J0992q030o310j5064O090M096K2259r346K661J4995j4434P931
11682B3805L1059j0314k0390j5853k029j0148L144J1303l3864j5321J1676R583
11670a7349P550m47j1953k0243J3789J7312N900j3527o025K1946J3074j3600q230
11657a1803K39N856K6751n507J2213K079k6736j7195k833P877K0321J4263P662
11644C3187J3159l442j539j2168j2381P276N555k5430j6038J1970Q898j0909n108
11631f970P9j8452k2384K8303M082M638Q233R737Q094j5441j4864j4950q55J4818
11617a5932J1653K578P772L5359j1115j8925n094j0432o953J164j0807n265R469
11604a6528J2159J813P832K7114j1591q526k186j0672O718P548k683k0225J5403
$$ plain form
11591 6176 23144 33701 3768 -6790 -19136 -4230 7031 16327 23456 6681 -16628 -17752
11579 -17752 -21916 -23063 -24624 -35059 -19149 -2497 20023 23592 5623 -10982 -27138 -16656
11567 -16656 12331 25431 31290 37756 28297 17751 3650 -4242 3653 15390 -3688 -4359 -7124
11554 -7124 -4770 1873 22774 26177 18067 -7506 -29101 4637 21888 20251 6989 29505 32680
11541 32680 34094 35057 43376 51321 54534 31047 22509 49787 48649 44024 50482 60010 62439 74513
11527 74513 57351 63258 54548 41261 47079 48531 36694 31892 22886 37076 26838 20964 18560
11514 18560 14858 12431 7588 20284 14478 39581 47749 47300 37408 32661 15285 12135 7633 -15941
11500 -15941 -10388 -12201 -14729 -13426 -7503 -9008 24442 32319 9077 7701 2201 23264 25028 37046
$$ packed form
11591F176J6968J0557k9933j0558j2346J4906J1261R296P129j6775k3309j124
11579a7752m164j147j561j0435J5910J6652K2520L569j7969j6605j6156J0482
11567a6656K8987J3100N859O466r459j0546j4101p892P895J1737j9078o71k765
11554g124K354O643K0901L403q110k5573k1595L3738J7251j637j3262K2516L175
11541C2680J414R63Q319P945L213k3487q538K7278j138m625O458R528K429J2074
11527G4513j7162N907q710j3287N818J452j1837m802r006J4190j0238n874k404
11514A8560l702k427m843J2696n806K5103Q168m49r892m747j7376l150m502k3574
11500a5941N553j813k528J303N923j505L3450P877k3242j376n500K1063J764J2018
$$ plain form
11486 37046 32462 32724 38694 46395 31252 -10231 -7568 -6265 1136 6206 27237 26556 28063 23821
11472 23821 17565 12315 16265 37116 51665 36172 26282 30664 32271 23771 17332 11783 -12787
11459 -12787 -18862 -22265 -151 24318 13120 -4517 -2540 22899 21691 3381 -12522 -21859 2801
11446 2801 14837 23962 41193 47584 59358 45575 14887 19751 21467 41540 58943 45486 34726
11433 34726 38255 44955 38800 17514 13015 5379 23467 30981 35233 39571 44000 60456 61090 26870
11419 26870 32715 28500 27987 26028 -112 -19132 -7135 19014 45070 64026 85848 92626 99320
11406 99320 93533 89906 100547 98746 86569 54115 25114 14825 22878 13003 6601 41755 54405
11393 54405 60441 68726 59440 66449 80044 71109 46340 34819 31388 30759 36600 53535 68906
$$ packed form
11486C7046m584K62N970P701j5143m1483K663J303P401N070K1031o81J507m242
11472B3821o256n250L950K0851J4549j5493r890M382J607q500o439n549k4570
11459a2787o075l403K2114K4469j1198j7637J977K5439j208j8310j5903r337K4660
11446B801J2036R125J7231O391J1774j3783l0688M864J716K0073J7403j3457j0760
11433C4726L529O700o155k1286m499p636J8088P514M252M338M429J6456O34l4220
11419B6870N845m215n13j959k6140j9020J1997K6149K6056J8956K1822O778O694
11406I9320n787l627J0641j801j2177l2454k9001j0289Q053r875o402L5154J2650
11393E4405O036Q285r286P009J3595q935k4769j1521l431o29N841J6935J5371
$$ plain form
11380 68906 62602 73857 83858 96236 106051 114865 92296 60319 55126 54517 58746 77209 74350
11367 74350 65196 60283 45862 43221 29924 22139 29282 54834 63391 34443 14419 13813 5624
11354 5624 4568 10506 26190 19214 10776 19984 20254 34608 25151 16795 18622 42701 49190 38150
11340 38150 31825 32062 31774 7533 9711 -617 5165 -4196 -6071 26657 46336 38996 34835 40240
11326 40240 32230 11200 -2812 -26738 -36748 -2752 20397 13731 28017 16570 -9710 -27908
11314 -27908 -12595 -2942 -226 8898 15367 29707 8619 4996 3682 4755 -2084 9290 26797
11301 26797 12655 11928 12428 4190 3346 2637 1126 4813 18874 38888 37914 43100 29892 25984 29529
11286 29529 21743 34830 48478 38534 23806 24015 27987 35530 15954 27989 53816 67702 70751
$$ packed form
11380F8906o304J1255J0001J2378R815Q814k2569l1977n193o09M229J8463k859
11367G4350r154m913j4421k641j3297p785P143K5552Q557k8948k0024o06q189
11354E624j056N938J5684o976q438R208K70J4354r457q356J827K4079O489j1040
11340C8150o325K37k88k4241K178j0328N782r361j875L2728J9679p340m161N405
11326D0240q010k1030j4012k3926j0010L3996K3149o666J4286j1447k6280j8198
11314b7908J5313R653K716R124O469J4340k1088l623j314J073o839J1374J7507
11301B6797j4142p27N00q238q44p09j511L687J4061K0014r74N186j3208l908L545
11286B9529p786J3087J3648r944j4728K09L972P543j9576J2035K5827J3886L049
$$ plain form
11273 70751 54084 50644 38679 13975 3281 22094 27356 38523 30784 37756 48643 37298
11261 37298 28577 41525 33906 40018 57620 51798 58932 75043 64216 50361 51529 47792 39794
11248 39794 38170 26852 9050 10801 36451 64429 57745 55872 52774 40629 24116 26482 35645
11235 35645 67265 77172 73666 92826 75446 47480 43968 38897 26563 46985 59895 30711
11223 30711 10859 29384 33985 30940 30691 33115 41661 39645 53840 52875 66718 76519 66407 79729
11209 79729 90194 77738 63731 55217 56540 46381 64293 61736 44506 71508 72093 79717 80111
11196 80111 62139 36697 34280 34985 62797 76847 67482 60467 59594 59811 36580 22460 34765
11183 34765 41607 26620 22299 18652 30813 46867 53310 22993 24958 23900 39448 56766 43693
$$ packed form
11273G0751j6667l440j1965k4704j0694J8813N262J1167p739O972J0887j1345
11261C7298q721J2948p619O112J7602n822P134J6111j0827j3855J168l737p998
11248C9794j624j1318j7802J751K5650K7978o684j873l098j2145j6513K366R163
11235C5645L1620R907l506J9160j7380k7966l512n071j2334K0422J2910k9184
11223C0711j9852J8525M601l045k49K424Q546k016J4195r65J3843R801j0112J3322
11209G9729J0465j2456j4007q514J323j0159J7912k557j7230K7002N85P624L94
11196H0111j7972k5442k417P05K7812J4050r365p015q73K17k3231j4120J2305
11183C4765O842j4987m321l647J2161J6054O443l0317J965j058J5548J7318j3073
$$ plain form
11170 43693 88715 117546 124171 123375 112068 93754 77753 81700 73476 48998 57560 74681 50591
11157 50591 46422 47322 46176 53792 54427 35176 37781 49297 53190 36528 30380 47212 65397 56237
11143 56237 36890 35969 43683 64274 64030 46201 30294 34590 23712 23145 42467 65626 51975
11130 51975 62246 81765 84614 82118 83308 80325 77869 44526 9613 11009 43123 64238 48665
11117 48665 151 -5688 14569 58269 84538 54119 52166 58081 41357 32273 41989 27989 48283
11104 48283 74132 58978 63602 60521 52944 48272 58011 53482 52184 59691 58242 60459 55290 74908
11090 74908 72546 71906 73492 66625 82886 87908 110655 121077 107855 95933 95937 98091 86374 72838
11076 72838 73069 84559 70634 71985 82404 111221 104336 80856 47757 42783 43494 54466 57988
$$ packed form
11170D3693M5022K8831O625p96j1307j8314j6001L947q224k4478Q562J7121k4090
11157E0591m169R00j146P616O35j9251K605J1516L893j6662o148J6832J8185r160
11143E6237j9347r21P714K0591k44j7829j5907M296j0878n67J9322K3159j3651
11130E1975J0271J9519K849k496J190k983k456l3343l4913J396L2114K1115j5573
11117D8665m8514n839K0257M3700K6269l0419j953N915j6724r084R716j4000K0294
11104D8283K5849j5154M624l081p577m672R739m529j298P507j449K217n169J9618
11090G4908k362o40J586o867J6261N022K2747J0422j3222j1922MK154j1717j3536
11076G2838K31J1490j3925J351J0419K8817o885k3480l3099m974P11J0972L522
$$ plain form
11063 57988 41230 40939 43230 48112 35011 18757 23006 17485 47509 42249 37507 51599 79779
11050 79779 80895 89580 100979 97322 88986 108412 99824 80728 77226 89766 106351 67976 30852
11037 30852 15865 18248 29483 40004 46120 67938 61618 74483 94787 98026 97707 99536 77843
11024 77843 25016 6613 23297 30024 39224 50030 40199 32054 50875 72242 80907 88944 77338
11011 77338 84088 101723 115463 124220 130099 95740 81920 82208 76669 65023 77041 87404 62782
10998 62782 62918 68676 82174 88822 101597 103798 100953 95230 90820 88355 94019 118547 103798 99656
10984 99656 106432 117928 119390 120313 82322 63255 71638 77735 105913 133793 136372 122125 99681
10971 99681 80227 72002 79335 74633 86438 96753 93878 99437 108359 112857 109849 96819 63020
$$ packed form
11063E7988j6758k91K291M882j3101j6254M249n521L0024n260m742J4092K8180
11050G9779J116Q685J1399l657q336J9426q588j9096l502J2540J6585l8375l7124
11037C0852j4987K383J1235J0521O116K1818o320J2865K0304L239l19J829k1693
11024G7843n2827j8403J6684O727R200J0806r831q145J8821K1367Q665Q037j1606
11011G7338O750J7635J3740Q757N879l4359j3820K88n539j1646J2018J0363k4622
10998F2782J36N758J3498O648J2775K201k845n723m410k465N664K4528j4749m142
10984I9656O776J1496J462R23l7991j9067Q383O097K8178K7880K579j4247k2444
10971I9681j9454q225P333m702J1805J0315k875N559Q922M498l008j3030l3799
$$ plain form
10958 63020 58278 83668 100075 94335 91996 91547 102008 80262 80833 99775 103241 95208 105676
10945 105676 109165 103544 112680 143278 155680 147129 133393 134248 115884 91367 94093 88991 105442
10932 105442 125625 109059 74026 63930 63660 61687 66462 92716 114079 99481 86890 90577
10920 90577 78783 70496 99073 99701 91872 101435 110922 102627 92406 81822 68608 67513 68820
10907 68820 81136 115418 145393 166287 158211 139802 142013 164975 189162 176379 164618 149334
10895 149334 118630 100817 100047 101074 108741 86799 74226 92085 108164 89262 96668 99458 107099
10882 107099 125635 140219 154403 168101 173431 188636 181977 161986 139098 135182 124498 104019
10870 104019 94335 97727 129216 131544 146582 143603 144539 137988 118746 110603 114680 160268 176359
$$ packed form
10958F3020m742K5390J6407n740k339m49J0461k1746N71J8942L466q033J0468
10945A05676L489n621R136L0598J2402q551j3736Q55j8364k4517K726n102J6451
10932A05442K0183j6566l5033j0096k70j973M775K6254K1363j4598j2591L687
10920I0577j1794q287K8577O28p829R563R487q295j0221j0584j3214j095J307
10907F8820J2316L4282K9975K0894q076j8409K211K2962K4187j2783j1761j5284
10895A49334l0704j7813p70J027P667k1942j2573J7859J6079j8902P406K790P641
10882A07099J8536J4584J4184J3698N330J5205o659j9991k2888l916j0684k0479
10870A04019r684L392L1489K328J5038k979R36o551j9242q143M077M5588J6091
$$ plain form
10857 176359 197889 236003 287994 355914 454067 609698 796870 1066391 1410785 1677827
10847 1677827 1778094 1752268 1581670 1300767 1007433 773365 617606 530429 471627 403174
10837 403174 346084 305254 287341 267630 271859 258954 229039 193916 172238 164155 152190 144983
10825 144983 145432 149939 116811 108997 107607 99028 95149 91018 100668 80792 75285 76740 85445 76446
10811 76446 58040 55809 36309 44649 68783 56082 61691 77095 77196 65600 57839 59252 23011
10798 23011 218 11680 1264 -1640 10151 20352 29574 17475 25856 25582 26052 35578 51450
10785 51450 39461 50775 60811 57615 47200 57775 37840 23514 25883 41749 42928 30397
10773 30397 -2739 -21843 -21534 -4830 6294 9376 8289 17763 12881 -14868 -45971 -66176 -79077
$$ packed form
10857A76359K1530L8114N1991O7920R8153J55631J87172K69521L44394K67042
10847A677827J00267k5826j70598k80903k93334k34068j55759q7177n8802o8453
10837D03174n7090m0830j7913j9711M229j2905k9915l5123k1678q083j1965p207
10825A44983M49M507l3128p814j390q579l879m131R650j9876n507J455Q705q999
10811G6446j8406k231j9500Q340K4134j2701N609J5404J01j1596p761J413l6241
10798B3011k2793J1462j0416k904J1791J0201R222j2099Q381k74M70R526J5872
10785E1450j1989J1314J0036l196j0415J0575j9935j4326K369J5866J179j2531
10773C0397l3136j9104L09J6704J1124L082j087R474m882k7749l1103k0205j2901
$$ plain form
10760 -79077 -96839 -131144 -149106 -150781 -171779 -171492 -171457 -72018 149530 432457 670831 866611
10748 866611 979894 1015685 972112 889121 837138 788006 719455 664906 605471 558020 509762
10737 509762 471616 459628 460894 420034 424008 414397 398649 374116 353699 356139 360908 366593 357492
10724 357492 335079 317150 293724 290885 276329 284162 306548 310971 283220 286602 268575 254925
10712 254925 261595 269248 266143 257182 252412 255765 267491 282543 277233 262073 262291 272001 285589
10699 285589 276114 271334 298716 312503 326725 337477 342138 301069 272178 278960 306150 328537
10687 328537 350080 386787 420158 446675 467760 491710 495544 492870 464976 439811 409554 402575
10675 402575 368214 317838 319172 304472 294829 306522 311600 319834 306519 319602 312221 339421
$$ packed form
10760g9077j7762l4305j7962j675k0998K87L5R9439K21548K82927K38374J95780
10748H66611J13283L5791m3573q2991n1983m9132o8551n4549n9435m7451m8258
10737E09762l8146j1988J266m0860L974r611j5748k4533k0417K440M769N685r101
10724C57492k2413j7929k3426k839j4556P833K2386M423k7751L382j8027j3650
10712B54925O670P653l105q961m770L353J1726J5052n310j5160K18R710J3588
10699B85589r475m780K7382J3787J4222J0752M661m1069k8891O782K7190K2387
10687C28537K1543L6707L3371K6517K1085K3950L834k674k7894k5165l0257o979
10675D02575l4361n0376J334j4700r643J1693N078Q234j3315J3083p381K7200
$$ plain form
10663 339421 369213 372884 388666 396872 390676 349013 315059 302531 294747 304798 335529 356872
10651 356872 351973 341458 324742 329421 298653 284625 290692 301612 301899 292821 305832 330214 334309
10638 334309 317005 293417 282193 298457 318725 333727 365526 406523 414410 438369 475035 485157
10626 485157 487550 479508 480774 483435 477475 463203 462522 465280 454851 448226 418529 399605 392993
10613 392993 373736 355419 353235 371337 389701 380299 375747 358230 353252 341543 316923 337547
10601 337547 339122 356892 366872 357195 357586 362958 336923 312723 307434 344762 372612 389063 373248
10588 373248 360363 345320 311032 329551 379239 396713 428675 441277 462162 494396 517822
10577 517822 529317 537262 551638 542813 543364 558464 547330 528327 523300 521649 523769 523419 503843
$$ packed form
10663C39421K9792L671J5782Q206o196m1663l3954j2528p784J0051L0731K1343
10651C56872m899j0515j6716M679l0768j4028O067J0920K87r078J3011K4382M095
10638C34309j7304k3588j1224J6264K0268J5002L1799M0997P887K3959L6666J0122
10626D85157K393q042J266K661n960j4272o81K758j0429o625k9697j8924o612
10613C92993j9257j8317k184J8102J8364r402m552j7517m978j1709k4620K0624
10601C37547J575J7770R980r677L91N372k6035k4200n289L7328K7850J6451j5815
10588C73248j2885j5043l4288J8519M9688J7474L1962J2602K0885L2234K3426
10577E17822J1495P945J4376q825N51J5100j1134j9003n027j651K120l50j9576
$$ plain form
10564 503843 502463 525477 582923 633765 668454 707315 762578 836437 885615 896292 876136 805967
10552 805967 701439 644356 625427 635813 662187 650702 613759 593397 605779 624662 627805
10541 627805 624099 637860 638612 615965 619980 631131 647635 654988 655417 648563 663025 667803 676322
10528 676322 684792 719233 749983 770251 793453 813575 807124 820952 846454 852467 846409 839562
10516 839562 822161 794449 779655 779966 795156 836654 862584 881303 900667 932126 965350 1009603
10504 1009603 1058339 1114292 1164219 1183023 1225559 1244812 1249529 1259039 1258378 1283209 1302321 1324808
10492 1324808 1333242 1333584 1338745 1358515 1386185 1424826 1454621 1452643 1480867 1527296 1577887 1624228
10480 1624228 1657456 1711381 1748309 1780008 1832703 1886642 1953950 2010543 2114134 2209883 2319571
$$ packed form
10564E03843j380K3014N7446N0842L4689L8861N5263P3859M9178J0677k0156p0169
10552H05967j04528n7083j8929J0386K6374j1485l6943k0362J2382J8883L143
10541F27805l706J3761P52k2647M015J1151J6504P353M29o854J4462M778Q519
10528F76322Q470L4441L0750K0268K3202K0122o451J3828K5502O013o058o847
10516H39562j7401k7712j4794L11J5190M1498K5930J8719J9364L1459L3224M4253
10504A009603M8736N5953M9927J8804M2536J9253M717R510o61K4831J9112K2487
10492A324808Q434L42N161J9770K7670L8641K9795j978K8224M6429N0591M6341
10480A624228L3228N3925L6928L1699N2695N3939O7308N6593J03591R5749J09688
$$ plain form
10469 2319571 2430797 2496238 2560985 2633080 2737743 2843226 2955420 3098523 3276450 3506647
10459 3506647 3754099 4036008 4324040 4623441 4918826 5279092 5706908 6221726 6867607
10450 6867607 7656748 8586781 9589969 10545503 11411239 12274268 13244974 14416783 16016692
10441 16016692 18233369 21163325 24946004 29958566 36922898 47022357 62190188 85352468
10433 85352468 120534578 171432594 235833230 297635192 330963532 329965939 305903126
10426 305903126 259450790 199529577 147241465 111780679 90073558 76596043 66762265
10419 66762265 57826511 49488072 42182064 36032563 30945160 26791236 23409858 20602809
10411 20602809 18126647 15919374 13955864 12173761 10589604 9222420 8062473 7114286
$$ packed form
10469B319571J11226O5441O4747P2095J04663J05483J12194J43103J77927K30197
10459C506647K47452K81909K88032K99401K95385L60266M27816N14818O45881
10450F867607P89141R30033J003188R55534Q65736Q63029R70706J171809J599909
10441A6016692K216677K929956L782679N012562O964332J0099459J5167831K3162280
10433H5352468L5182110N0898016O4400636O1801962L3328340r97593k4062813
10426C05903126m6452336n9921213n2288112l5460786k1707121j3477515r833778
10419F6762265q935754q338439p306008o149501n087403m153924l381378k807049
10411B0602809k476162k207273j963510j782103j584157j367184j159947r48187
$$ plain form
10403 7114286 6300440 5593146 4966311 4431733 3939897 3501605 3086228 2717092 2372589
10394 2372589 2059393 1799772 1558967 1343012 1186124 1049513 938392 835969 739715 699961
10384 699961 625607 572541 511121 441384 405408 372322 328807 298776 269859 246527 205760
10373 205760 172369 172359 177440 145482 125195 108880 86170 72565 38351 -3282 -22407 -26843
10361 -26843 -26853 -6215 15643 11149 10875 35796 43247 26832 9408 -6533 10744 24863 5659
10348 5659 -4702 -27818 -44626 -35936 -38823 -38819 -20408 -27747 -54793 -72566 -101906 -109484 -114129 -109916
10334 -109916 -103655 -103607 -63573 -31454 -22140 -21474 -21130 -8231 -4790 -28220 -28582 -13211 -16294 8331
10320 8331 -1494 -38709 -46215 -44742 -33337 -27649 -909 7664 9095 13536 52018 87839 109731
$$ packed form
10403G114286q13846p07294o26835n34578m91836m38292m15377l69136l44503
10394B372589l13196k59621k40805k15955j56888j36611j11121j02423r6254l9754
10384F99961p4354n3066o1420o9737l5976l3086m3515l0031k8917k3332m0767
10373B05760l3391j0N081l1958k0287j6315k2710j3605l4214m1633j9125m436
10361b6843j0K0638K1858m494k74K4921P451j6415j7424j5941J7277J4119j9204
10348E659j0361k3116j6808Q690k887MJ8411p339k7046j7773k9340p578m645M213
10334a09916O261M8M0034L2119R314O66L44J2899L441k3430l62J5371l083K4625
10320H331r825l7215p506J473J1405N688K6740Q573J431M441L8482L5821K1892
$$ plain form
10307 109731 149119 183287 217133 237108 241157 190533 127825 87807 43045 6040 -28007 -32307
10295 -32307 -13986 -7577 -13025 -24088 -25866 -20675 -21773 -22039 -16933 3201 20759 20017 1071 -20552
10281 -20552 -41752 -39472 -31579 -45245 -51647 -62073 -51250 -9206 37581 68258 74762 66048 53511
10268 53511 45453 31633 15391 9323 17889 40428 47970 39685 17698 -3828 -33566 -58704 -35637
10255 -35637 -26948 -18319 -25025 -45990 -57323 -60597 -52537 -46244 -47212 -54821 -61029 -47346 -59476 -41569
10241 -41569 -34703 -53572 -41440 -29705 -48055 -52140 -65257 -86805 -61966 -49037 -49220 -47454 -51874
10228 -51874 -59510 -38355 1588 44828 96630 137713 152408 142095 174493 196394 226225 269199
10216 269199 312875 380303 429108 478659 520684 593134 726525 885584 1051928 1261385 1488573
$$ packed form
10307A09731L9388L4168L3846J9975M049n0624o2708m0018m4762l7005l4047m300
10295c2307J8321O409n448j1063j778N191j098k66N106K0134J7558p42j8946k1623
10281b0552k1200K280P893j3666o402j0426J0823M2044M6787L0677O504q714j2537
10268E3511q058j3820j6242o068Q566K2539P542q285k1987k1526k9738k5138K3067
10255c5637Q689Q629o706k0965j1333l274Q060O293r68p609o208J3683j2130J7907
10241d1569O866j8869J2132J1735j8350m085j3117k1548K4839J2929j83J766m420
10228e1874p636K1155L9943M3240N1802M1083J4695j0313L2398K1901K9831M2974
10216B69199M3676O7428M8805M9551M2025P2450J33391J59059J66344K09457K27188
$$ plain form
10205 1488573 1757772 2116809 2491524 2839158 3105806 3245413 3298533 3215482 3021666 2792802
10195 2792802 2556199 2330707 2113242 1883050 1694388 1540201 1444821 1375510 1335368 1266118
10185 1266118 1215274 1162804 1103329 1056763 1047711 1036855 1043708 1073591 1102331 1145846 1205850 1307294
10173 1307294 1417925 1555080 1733580 1939474 2177157 2428649 2699196 2945517 3121860
10164 3121860 3186013 3163845 3041742 2806224 2503249 2192560 1894214 1640716 1398952 1231019
10154 1231019 1096474 974291 884027 808616 749818 696654 655327 611722 591594 611438 641563
10143 641563 693106 755747 812877 963406 1241195 1670903 2303551 3139915 4096072 4939866
10133 4939866 5375741 5331030 4884919 4123805 3240442 2452269 1863862 1454588 1154698 950417
$$ packed form
10205A488573K69199L59037L74715L47634K66648J39607N3120q3051j93816k28864
10195B792802k36603k25492k17465k30192j88662j54187r5380o9311m0142o9250
10185A266118n0844n2470n9475m6566r052j0856O853K9883K8740M3515O0004J01444
10173A307294J10631J37155J78500K05894K37683K51492K70547K46321J76343
10164C121860O4153k2168j22103k35518l02975l10689k98346k53498k41764j67933
10154A231019j34545j22183r0264p5411n8798n3164m1327m3605k0128J9844L0125
10143F41563N1543O2641N7130J50529K77789M29708O32648Q36364R56157Q43794
10133D939866M35875m4711m46111p61114q83363p88173n88407m09274k99890k04281
$$ plain form
10123 950417 788602 633485 505560 382560 277255 157882 34122 -73709 -157846 -247214
10113 -247214 -366015 -523563 -663877 -774891 -822013 -754172 -568667 -351740 -95154 140442
10103 140442 296321 351348 313437 280909 247686 227931 213867 225166 212604 197212 206907
10092 206907 204380 180941 149432 137444 146343 128162 124453 143469 179853 157413 110823 85503
10080 85503 70380 69678 89187 90933 65826 43478 45402 66373 91449 97594 70456 91681 90170
10067 90170 76481 67153 77912 103062 101601 81125 86162 79982 62598 78831 96069 82609
10055 82609 74829 74062 68529 73739 88397 99327 83101 61114 46438 23920 12748 17557 33352
10042 33352 36796 43642 50941 65911 78554 93316 91659 72520 73631 94954 97974 58326 59858
$$ packed form
10123I50417j61815j55117j27925j23000j05305j19373j23760j07831q4137q9368
10113b47214j18801j57548j40314j11014m7122O7841J85505K16927K56586K35596
10103A40442J55879N5027l7911l2528l3223j9755j4064J1299j2562j5392R695
10092B06907k527k3439l1509j1988Q899j8181l709J9016L6384k2440m6590k5320
10080H5503j5123p02J9509J746k5107k2348J924K0971K5076O145k7138K1225j511
10067I0170j3689r328J0759K5150j461k0476N037o180j7384J6233J7238j3460
10055H2609p780p67n533N210J4658J0930j6226k1987j4676k2518j1172M809J5795
10042C3352L444O846P299J4970J2643J4762j657j9139J111K1323L020l9648J532
$$ plain form
10029 59858 96726 94150 59833 57021 85818 102727 118474 132952 122018 132632 119831 123353
10017 123353 153689 143679 158648 199177 247619 286927 333821 429814 580135 779689 1052023
10006 1052023 1385616 1673586 1804833 1768578 1593182 1317087 1036413 797067 626188 518107
9996 518107 455357 406240 346508 298685 268322 224102 205062 186673 146951 142422 176251 172566
9984 172566 133787 112371 114340 94899 51893 41370 48999 75523 78925 67010 80692 71485
9972 71485 29338 8498 3302 4520 -12268 -9788 4331 1946 -21201 -40892 -43135 -34638 -18676
9959 -18676 -21730 -29444 -16044 -490 21090 17055 13651 16032 1580 -7605 9790 34017 40302
9946 40302 73759 108399 162967 222728 295186 361105 424596 455897 431824 402073 356396 290846
$$ packed form
10029E9858L6868k576l4317k812K8797J6909J5747J4478j0934J0614j2801L522
10017A23353L0336j0010J4969M0529M8442L9308M6894R5993J50321J99554K72334
10006A052023L33593K87970J31247l6255j75396k76095k80674k39346j70879j08081
9996E18107o2750m9117n9732m7823l0363m4220j9040j8389l9722m529L3829l685
9984A72566l8779k1416J969j9441m3006j0523P629K6524L402j1915J3682r207
9972G1485m2147k0840n196J218j6788K480J4119k385k3147j9691k243Q497J5962
9959a8676l054p714J3400J5554K1580m035l404K381j4452r185J7395K4227O285
9946D0302L3457L4640N4568N9761P2458O5919O3491L1301k4073k9751m5677o5550
$$ plain form
9934 290846 218155 161812 133668 127242 126199 115117 108378 102677 86748 65830 81772 110155
9922 110155 101086 81504 63928 56734 55856 77306 55764 48143 52291 55141 51325 43700 33661
9909 33661 31487 34942 22295 19709 43558 71019 79308 106162 143996 154073 166636 198886 215908
9896 215908 274242 334052 396992 453724 475447 481996 463908 436236 390028 328564 303387 269553
9884 269553 225136 195231 184036 181999 173103 172152 146756 157103 180917 181236 169211 191285 202354
9871 202354 201505 198760 230466 271773 307442 348847 428916 581111 804920 1145472 1645546
9860 1645546 2297310 2898797 3196557 3167009 2878696 2372027 1777168 1281571 954460 782481
9850 782481 674248 613789 555344 489562 434769 363308 313769 284122 258294 216111 194791
$$ packed form
9934B90846p2691n6343k8144o426j043j1082o739n701j5929k0918J5942K8383
9922A10155r069j9582j7576p194q78K1450k1542p621M148K850l816p625j0039
9909C3661k174L455j2647k586K3849K7461Q289K6854L7834J0077J2563L2250J7022
9896B15908N8334N9810O2940N6732K1723O549j8088k7672m6208o1464k5177l3834
9884B69553m4417k9905j1195k037q896r51k5396J0347K3814L19j2025K2074J1069
9871B02354q49k745L1706M1307L5669M1405Q0069J52195K23809L40552N00074
9860A645546O51764O01487K97760k9548k88313n06669n94859m95597l27111j71979
9850G82481j08233o0459n8445o5782n4793p1461m9539k9647k5828m2183k1320
$$ plain form
9839 194791 168986 152185 149496 162597 155738 144308 133399 105178 84966 71167 48515 42854
9827 42854 50280 48354 52788 61481 67886 62689 69186 48641 9612 -21208 -3344 12558 19685
9814 19685 30062 21921 10427 -2905 -21834 1692 15943 36137 27845 49946 69810 73047
9802 73047 45598 19223 -19720 -16949 -5799 27483 48894 56910 45514 40816 53364 79041
9790 79041 64976 53355 35299 15502 19732 47445 62573 76567 96771 93142 85309 63587
9778 63587 50326 62266 62417 67818 66392 81656 67164 36045 36001 38675 47750 43818 54062 46213
9764 46213 44821 37322 31325 56091 79146 88833 96701 110744 97264 104152 100614 120134 157769
9751 157769 181459 180379 159653 126133 103996 92819 69860 87745 88771 75668 56245 69121
$$ packed form
9839A94791k5805j6801k689J3101o859j1430j0909k8221k0212j3799k2652n661
9827D2854P426j926M434Q693O405n197O497k0545l9029l0820J7864J5902P127
9814A9685J0377q141j1494j3332j8929K3526J4251K0194q292K2101J9864L237
9802G3047k7449k6375l8943K771J1150L3282K1411Q016j1396m698J2548K5677
9790G9041j4065j1621j8056j9797M230K7713J5128J3994K0204l629p833k1722
9778F3587j3261J1940J51N401j426J5264j4492l1119m4K674R075l932J0244p849
9764D6213j392p499n997K4766K3055R687P868J4043j3480O888l538J9520L7635
9751A57769K3690j080k0726l3520k2137j1177k2959J7885J026j3103j9423J2876
$$ plain form
9739 69121 61789 62630 74163 60696 54899 43432 42827 54770 75399 65478 58389 64010 58141 49021
9725 49021 46075 44176 66193 69288 56927 22917 22588 41617 56954 63077 76640 88604 82647
9712 82647 88622 89152 93589 76063 76966 73426 76795 63392 66606 62141 70002 63253 70831 59366
9698 59366 59412 49066 47353 60144 52704 56238 44976 22058 23468 47039 45056 29966 32993 53799
9684 53799 62044 58341 62541 56693 60668 75324 75473 54990 37184 39770 40914 25450 49124 54584
9670 54584 44788 64548 85839 110673 110860 107351 93673 79532 73669 65837 65408 59689 35591 37474
9656 37474 30312 39701 45441 47701 57538 60716 67037 53933 46698 37291 54991 54913 37678 34042
9642 34042 40805 29199 7630 10983 37301 75045 80156 79238 58298 46793 35450 64921 71746
$$ packed form
9739F9121p332Q41J1533j3467n797j1467o05J1943K0629r921p089N621n869r120
9725D9021k946j899K2017L095j2361l4010l29J9029J5337O123J3563J1964n957
9712H2647N975N30M437j7526R03l540L369j3403L214m465P861o749P578j1465
9698E9366M6j0346j713J2791p440L534j1262k2918J410K3571j983j5090L027K0806
9684E3799Q245l703M200n848L975J4656J49k0483j7806K586J144j5464K3674N460
9670E4584r796J9760K1291K4834J87l509j3678j4141n863p832m29n719k4098J883
9656C7474p162R389N740K260R837L178O321j3104p235r407J7700p8j7235l636
9642C4042O763j1606k1569L353K6318L7744N111r18k0940j1505j1343K9471O825
$$ plain form
9629 71746 70165 46900 37592 73638 70591 48520 51024 65486 86829 85100 73050 62011 93718
9616 93718 110770 93289 93986 90695 76211 58260 70068 84718 94909 76725 42737 26756
9604 26756 32772 3743 -9209 12006 14147 23300 54694 72147 75233 61203 64206 71376 67275
9591 67275 66921 78394 77716 67179 70338 79244 99391 78875 54524 62937 63442 58679 47512 60168
9577 60168 85274 120652 108631 95022 90518 93215 80763 72394 81483 98873 98816 104712 84082
9564 84082 78850 100636 110482 111065 109602 104496 103589 105163 104204 95262 84899 70574 64743 61337 58226
9549 58226 64111 69827 59881 55898 67082 93621 81023 63132 55373 62745 73085 75478 69174
9536 69174 100228 89035 79497 89753 92283 104654 139821 131043 113198 107053 123709 127623 148129
$$ packed form
9629G1746j581k3265r308L6046l047k2071K504J4462K1343j729j2050j1039L1707
9616I3718J7052j7481O97l291j4484j7951J1808J4650J0191j8184l3988j5981
9604B6756O016k9029j2952K1215K141R153L1394J7453L086j4030L003P170m101
9591F7275l54J1473o78j0537L159Q906K0147k0516k4351Q413N05m763j1167J2656
9577F0168K5106L5378j2021j3609m504K697j2452q369R089J7390n7N896k0630
9564H4082n232K1786R846N83j463n106r07J574r59q942j0363j4325n831l406l111
9549E8226N885N716r946l983J1184K6539j2598j7891p759P372J0340K393o304
9536F9174L1054j1193r538J0256K530J2371L5167q778j7845o145J6656L914K0506
$$ plain form
9523 148129 155599 132382 124338 130669 126463 121152 100494 80558 85030 85765 91679 89066 87036 72471
9509 72471 87852 111163 103857 113233 121184 120367 94469 80580 86302 106873 115948 124150 109539
9496 109539 94166 98059 75393 82796 88210 98004 117995 112985 110765 111763 113464 104895 84498 78280
9482 78280 102131 109118 102555 94995 98001 102071 119874 149942 143725 123912 127583 116287 122941
9469 122941 103475 110358 130259 137613 150593 153513 143683 136740 137657 145056 113324 102575 118012
9456 118012 135081 143010 146615 115447 90955 115113 145905 148157 144857 151110 156279 145322 131712
9443 131712 153734 165472 146082 132481 116500 105156 107083 103541 104893 122798 120890 103325
9431 103325 87245 100339 107647 111559 96566 112083 122941 128131 121294 125946 140505 140701 130807
$$ packed form
9523A48129P470k3217q044O331m206n311k0658j9936M472P35N914k613k030j4565
9509G2471J5381K3311p306R376P951q17k5898j3889N722K0571R075Q202j4611
9496A09539j5373L893k2666P403N414R794J9991n010k220R98J701q569k0397o218
9482G8280K3851O987o563p560L006M070J7803L0068o217j9813L671j1296O654
9469A22941j9466O883J9901P354J2980K920r830o943R17P399l1732j0749J5437
9456A18012J7069P929L605l1168k4492K4158L0792K252l300O253N169j0957j3610
9443A31712K2022J1738j9390j3601j5981j1344J927l542J352J7905j908j7565
9431A03325j6080J3094P308L912j4993J5517J0858N190o837M652J4559J96r894
$$ plain form
9418 130807 96738 90380 99785 133598 146492 135672 121534 110109 115198 116986 115207 123081 120041
9405 120041 103095 89701 90797 100747 115188 108458 106566 116926 113649 120197 133597 152128 152524
9392 152524 137176 128990 130518 124922 117294 107933 130404 139733 130237 145441 139023 114240 108483
9379 108483 102583 111605 130473 145028 159830 147718 127541 138592 149944 156839 169421 176837
9367 176837 130910 112060 103804 113383 128643 149475 158388 138600 116639 128310 152415 164090
9355 164090 163067 161008 170262 184011 163587 150837 173678 167782 134019 116720 129435 153935
9343 153935 157852 160671 140760 121610 118581 118459 125748 122383 113239 116648 133751 127243 131230 148003
9329 148003 153321 152215 142446 142900 124699 104188 103327 109424 120346 129057 143915 156399 151582 137137
$$ packed form
9418A30807l4069o358R405L3813J2894j0820j4138j1425N089J788j779P874l040
9405A20041j6946j3394J096R950J4441o730j892J0360l277O548J3400J8531L96
9392A52524j5348q186J528n596p628r361K2471R329r496J5204o418k4783n757
9379A08483n900R022J8868J4555J4802j2112k0177J1051J1352O895J2582P416
9367A76837m5927j8850q256R579J5260K0832Q913j9788k1961J1671K4105J1675
9355A64090j023k059R254J3749k0424j2750K2841n896l3763j7299J2715K4500
9343A53935L917K819j9911j9150l029j22P289l365r144L409J7103o508L987J6773
9329A48003N318j106r769M54j8201k0511q61O097J0922Q711J4858J2484m817j4445
$$ plain form
9315 137137 154334 171504 156513 133333 125296 153461 167011 151467 128991 126437 129190 132067
9303 132067 136183 143898 143803 132250 121303 143344 153543 182494 198897 173702 139000 154633 172054
9290 172054 178856 206049 222969 227535 206617 201135 195106 174775 152564 158572 176323 181477 208504
9277 208504 212880 206916 230251 245587 244239 235521 213513 217809 203910 187796 176680 195721 206176
9264 206176 205678 182942 178633 164046 153375 176708 175622 183111 179087 177293 180249 196207 207679
9251 207679 219128 208899 172960 143661 150441 136565 143078 154040 165904 174699 169433 166994 157086
9238 157086 152493 140359 162898 174337 174320 195032 204076 190995 166912 156226 168478 154312 155937
9225 155937 174355 189976 196431 185670 176444 174481 162449 146036 163810 197668 206610 188972
$$ packed form
9315A37137J7197J7170j4991k3180q037K8165J3550j5544k2476k554K753K877
9303A32067M116P715r5j1553j0947K2041J0199K8951J6403k5195l4702J5633J7421
9290A72054O802K7193J6920M566k0918n482o029k0331k2211O008J7751N154K7027
9277B08504M376n964K3335J5336j348q718k2008M296j3899j6114j1116J9041J0455
9264B06176m98k2736m309j4587j0671K3333j086P489m024j794K956J5958J1472
9251B07679J1449j0229l5939k9299O780j3876O513J0962J1864Q795n266k439r908
9238A57086m593j2134K2539J1439j7K0712R044j3081k4083j0686J2252j4166J625
9225A55937J8418J5621O455j0761r226j963j2032j6413J7774L3858Q942j7638
$$ plain form
9213 188972 188406 178585 149021 142876 130340 146201 159817 178611 177779 181673 174226 161104 177565
9200 177565 197362 202706 204894 203443 172187 184246 201260 207688 188129 175316 169065 155116 137689
9187 137689 130319 141599 185993 198046 192539 193139 207576 207555 191514 206866 221338 208421 219560
9174 219560 226285 195901 202539 216349 213478 229078 226408 210876 206714 189092 196939 218686 224929
9161 224929 250337 223619 196122 193057 217173 229192 224167 212236 186993 188056 212117 245154
9149 245154 238600 215919 212307 217248 214458 202720 179543 197371 214993 218750 218384 213326 213315 206488
9135 206488 212984 233393 229709 223613 237980 260975 248776 254197 248995 231025 209081 215642 219607
9122 219607 235713 234249 229941 258431 251637 242063 210009 205524 212187 237236 245405 243869 250113
$$ packed form
9213A88972n66r821k9564o145j2536J5861J3616J8794q32L894p447j3122J6461
9200A77565J9797N344K188j451l1256J2059J7014O428j9559j2813o251j3949j7427
9187A37689p370J1280M4394J2053n507O00J4437k1j6041J5352J4472j2917J1139
9174B19560O725l0384O638J3810k871J5600k670j5532m162j7622P847K1747O243
9161B24929K5408k6718k7497l065K4116J2019n025j1931k5243J063K4061L3037
9149B45154o554k2681l612M941k790j1738k3177J7828J7622L757l66n058j1o827
9135B06488O496K0409l684o096J4367K2995j2199N421n202j7970k1944O561L965
9122B19607J6106j464m308K8490o794r574l2054m485O663K5049Q169j536O244
$$ plain form
9109 250113 257351 254195 260189 255928 235519 250540 272851 261588 253461 230823 212422 229989 245823
9096 245823 243357 242784 256990 263728 265757 260051 260704 220522 203874 208364 232757 247724 234931
9083 234931 203109 227916 235753 242297 237347 239852 230282 236022 256229 260057 236279 231929 220889
9070 220889 237545 232343 233499 248258 244913 240914 251381 250337 254873 255114 245979 271217 264595 273907
9056 273907 287652 302342 305665 286564 255238 262751 268274 261272 281749 299010 330868 330475 321211
9043 321211 304379 286714 282042 268599 265240 260450 248543 265861 297921 310843 305653 302789 287187
9030 287187 276572 283705 317669 343837 329771 307789 308394 313489 319506 314888 339810 339995 346337
9017 346337 334276 342736 342918 334674 311779 345320 374694 386900 358287 359820 368843 373486 363249
$$ packed form
9109B50113P238l156N994m261k0409J5021K2311j1263q127k2638j8401J7567J5834
9096B45823k466n73J4206O738K029n706O53m0182j6648M490K4393J4967j2793
9083B34931l1822K4807P837O544m950K505r570N740K0207L828k3778m350j1040
9070B20889J6656n202J156J4759l345l999J0467j044M536K41r135K5238o622R312
9056B73907J3745J4690L323j9101l1326P513N523p002K0477J7261L1858l93r264
9043C21211j6832j7665m672j3443l359m790j1907J7318L2060J2922n190k864j5602
9030B87187j0615P133L3964K6168j4066k1982O05N095O017m618K4922J85O342
9017C46337j2061Q460J82q244k2895L3541K9374J2206k8613J533R023M643j0237
$$ plain form
9004 363249 357842 339525 337242 358953 356476 333528 322667 342307 350031 352961 380971 367370 359997
8991 359997 360339 372218 385449 400705 401666 380068 361548 366952 383755 390632 404821 402094 397085
8978 397085 397345 405669 408389 396711 402070 403776 412997 429377 446920 457479 476377 474331 461026
8965 461026 453003 455761 453026 462401 472596 473693 462197 438761 423088 421053 436485 467916 477202
8952 477202 473484 461771 456954 455949 475894 477107 486111 504959 508090 498046 500358 507351 487388
8939 487388 488921 481640 492361 515723 544546 539856 536510 507895 499167 495013 486572 501944 512154
8926 512154 554714 561740 555701 542938 555771 603207 632818 623522 594742 563864 580518 612941
8914 612941 604044 611217 617994 620729 634406 641079 655125 655648 658547 655376 647157 624723 613270 611623
$$ packed form
9004C63249n407j8317k283K1711k477k2948j0861J9640P724K930K8010j3601p373
8991C59997L42J1879J3231J5256R61k1598j8520N404J6803O877J4189k727n009
8978C97085K60Q324K720j1678N359J706R221J6380J7543J0559J8898k046j3305
8965D61026q023K758k735R375J0195J097j1496k3436j5673k035J5432L1431R286
8952D77202l718j1713m817j005J9945J213R004J8848L131j0044K312O993j9963
8939D87388J533p281J0721K3362K8823m690l346k8615q728m154q441J5372J0210
8926E12154M2560P026o039j2763J2833M7436K9611r296k8780l0878J6654L2423
8914F12941q897P173O777K735J3677O673J4046N23K899l171q219k2434j1453j647
$$ plain form
8900 611623 614456 632311 646483 637080 622693 662688 692894 683147 709130 716150 694121 697374 705450
8887 705450 697195 716750 701102 700287 701526 679629 702105 715002 727913 735689 753786 753807 762642
8874 762642 773204 805038 814520 825785 834947 841170 828869 838246 854887 859140 867701 876162 883897
8861 883897 891086 903219 898458 888863 906164 901838 906341 927276 920049 926094 927894 943113 951900
8848 951900 957929 953643 972261 976350 964718 954665 962904 962038 968624 981347 986110 995958 1012257
8835 1012257 1022019 1022224 1048100 1077178 1103360 1132342 1156351 1179861 1148307 1129285 1153617 1182404
8823 1182404 1187006 1167786 1173746 1185424 1195600 1216051 1228576 1247754 1259534 1274412 1309574 1348977
8811 1348977 1363602 1362476 1366943 1356461 1360988 1383270 1405180 1458304 1469962 1463312 1479428 1490429
$$ packed form
8900F11623K833J7855J4172r403j4387L9995L0206r747K5983P020k2029L253Q076
8887G05450q255J9555j5648q15J239k1897K2476J2897J2911P776J8097K1Q835
8874G62642J0562L1834R482J1265R162O223j2301R377J6641M253Q561Q461P735
8861H83897P189J2133m761r595J7301m326M503K0935p227O045J800J5219Q787
8848I51900O029m286J8618M089j1632j0053Q239q66O586J2723M763R848J6299
8835A012257R762K05K5876K9078K6182K8982K4009K3510l1554j9022K4332K8787
8823A182404M602j9220N960J1678J0176K0451J2525J9178J1780J4878L5162L9403
8811A348977J4625j126M467j0482M527K2282K1910N3124J1658o650J6116J1001
$$ plain form
8799 1490429 1509674 1539121 1566499 1599100 1606902 1617460 1616100 1637400 1640917 1652066 1648647 1675656
8787 1675656 1697383 1702257 1742993 1814999 1839692 1835660 1849564 1846976 1892372 1910394 1930044 1959126
8775 1959126 2003136 2040586 2068773 2077251 2091590 2131453 2165092 2181719 2200364 2223481 2249405 2277126
8763 2277126 2304388 2338018 2378779 2418544 2464936 2494871 2510499 2534368 2565283 2595723 2649168
8752 2649168 2672690 2706492 2735502 2771525 2825445 2892221 2946491 2980660 3019749 3047304 3079068
8741 3079068 3158501 3222163 3265050 3306690 3354642 3353879 3402124 3459007 3515956 3589995 3627101 3679419
8729 3679419 3734568 3811508 3886340 3953010 4000533 4059267 4129980 4169790 4238493 4299789 4347577
8718 4347577 4415023 4499369 4575488 4651876 4718783 4789430 4854065 4909018 4987761 5090590 5210390
$$ packed form
8799A490429J9245K9447K7378L2601P802J0558j360K1300L517J1149l419K7009
8787A675656K1727M874M0736P2006K4693m032J3904k588M5396J8022J9650K9082
8775A959126M4010L7450K8187Q478J4339L9863L3639J6627J8645K3117K5924K7721
8763B277126K7262L3630M0761L9765M6392K9935J5628K3869L0915L0440N3445
8752B649168K3522L3802K9010L6023N3920O6776N4270L4169L9089K7555L1764
8741C079068P9433O3662M2887M1640M7952p63M8245N6883N6949P4039L7106N2318
8729C679419N5149P6940P4832O6670M7523N8734P0713L9810O8703O1296M7788
8718D347577O7446Q4346P6119P6388O6907P0647O4635N4953P8743J02829J19800
$$ plain form
8707 5210390 5293294 5351342 5421549 5472872 5536784 5640407 5738865 5824218 5889444 5958861 6040590
8696 6040590 6106423 6193003 6277744 6357611 6413120 6474542 6583073 6685095 6760590 6849845 6938453
8685 6938453 7013337 7100402 7188334 7263923 7326093 7382340 7441047 7518380 7582906 7645321 7721763
8674 7721763 7812369 7886110 7917270 7956008 8000269 8053883 8076873 8121697 8167410 8228789 8293348
8663 8293348 8350206 8448547 8568257 8753242 8930369 9008799 9003218 8920056 8757818 8571737 8436496
8652 8436496 8332293 8257260 8190819 8150363 8088413 8041997 7992821 7905696 7829738 7767336 7668498
8641 7668498 7612530 7574984 7507107 7437434 7363340 7299935 7218887 7139577 7064727 6970634 6864250
8630 6864250 6781578 6707465 6632660 6562468 6506377 6462492 6390077 6326072 6273011 6239190 6221458
$$ packed form
8707E210390Q2904N8048P0207N1323O3912J03623R8458Q5353O5226O9417Q1729
8696F040590O5833Q6580Q4741P9867N5509O1422J08531J02022P5495Q9255Q8608
8685F938453P4884Q7065Q7932P5589O2170N6247N8707P7333O4526O2415P6442
8674G721763R0606P3741L1160L8738M4261N3614K2990M4824M5713O1379O4559
8663H293348N6858R8341J19710J84985J77127P8430n581q3162j62238j86081j35241
8652H436496j04203p5033o6441m0456o1950m6416m9176q7125p5958o2402r8838
8641G668498n5968l7546o7877o9673p4094o3405q1048p9310p4850r4093j06384
8630F864250q2672p4113p4805p0192n6091m3885p2415o4005n3061l3821j7732
$$ plain form
8619 6221458 6206862 6215661 6302173 6492662 6784042 7087957 7225707 7115905 6920496 6618875
8609 6618875 6222454 5857619 5584945 5363908 5189651 5049649 4922382 4811321 4678987 4531842
8599 4531842 4429419 4367851 4263957 4155104 4067771 3999520 3907807 3808211 3721674 3655084 3593208
8588 3593208 3532449 3468496 3408952 3357783 3316856 3265162 3204833 3136578 3085444 3071833 3054071
8577 3054071 2999015 2933080 2887956 2863329 2871331 2904120 2964611 3062961 3189028 3263582 3237839
8566 3237839 3180894 3054626 2852560 2669427 2536043 2455631 2410741 2361567 2313342 2271570 2226435
8555 2226435 2182821 2137788 2111682 2062810 2011478 1986711 1961828 1928586 1878067 1836936 1826279
8544 1826279 1810759 1782904 1743261 1713447 1703632 1678075 1673476 1678341 1636890 1595461 1560380 1543608
$$ packed form
8619F221458j4596Q799Q6512J90489K91380L03915J37750j09802j95409l01621
8609F618875l96421l64835k72674k21037j74257j40002j27267j11061j32334j47145
8599D531842j02423o1568j03894j08853q7333o8251r1713r9596q6537o6590o1876
8588C593208o0759o3953n9544n1169m0927n1694o0329o8255n1134j3611j7762
8577C054071n5056o5935m5124k4627Q002L2789O0491R8350J26067P4554k5743
8566C237839n6945j26268k02066j83133j33384q0412m4890m9174m8225m1772m5135
8555B226435m3614m5033k6106m8872n1332k4767k4883l3242n0519m1131j0657
8544A826279j5520k7855l9643k9814r815k5557m599M865m1451m1429l5081j6772
$$ plain form
8532 1543608 1556519 1529688 1493531 1459833 1455938 1439197 1418471 1404729 1367937 1355041 1348109 1340960
8520 1340960 1312278 1287661 1277893 1275526 1259071 1236508 1214981 1200679 1175977 1169394 1161062 1159350
8508 1159350 1156372 1141287 1127196 1109130 1087055 1048229 1061445 1054941 1040018 1009783 969416 948283
8496 948283 956320 948258 978185 968713 940809 915559 901007 880139 878181 882594 866513 856039 869464
8483 869464 869692 854150 817125 808947 797137 803030 797222 788412 780981 779852 794535 785973 753229
8470 753229 729842 724969 706929 703517 706628 692858 653995 677001 705997 700853 704039 683643 659341
8457 659341 649933 653721 651174 635834 625268 615373 612061 600660 607108 599310 600748 617859 594656
8444 594656 573362 566757 550388 546711 550050 563339 552191 564764 566613 548628 542628 515971 519444
$$ packed form
8532A543608J2911k6831l6157l3698l895j6741k0726j3742l6792j2896o932p149
8520A340960k8682k4617r768k367j6455k2563k1527j4302k4702o583q332j712
8508A159350k978j5085j4091j8066k2075l8826J3216o504j4923l0235m0367k1133
8496I48283Q037q062K9927r472k7904k5250j4552k0868j958M413j6081j0474J3425
8483H69464K28j5542l7025q178j1810N893n808q810p431j129J4683q562l2744
8470G53229k3387m873j8040l412L111j3770l8863K3006K8996n144L186k0396k4302
8457F59341r408L788k547j5340j0566r895l312j1401O448p798J438J7111k3203
8444E94656k1294o605j6369l677L339J3289j1148J2573J849j7985o000k6657L473
$$ plain form
8431 519444 534521 531595 520185 511666 506612 493146 493386 484425 476870 507110 493172 489066 476870
8418 476870 447066 446081 453416 449485 453223 445524 432604 425104 444238 449743 442186 427387 424126 410333
8404 410333 393286 391930 385832 421312 421573 395176 395718 409979 387509 368887 362428 347748 367688
8391 367688 377862 405748 397011 371881 358110 373517 348708 354520 369342 361633 354784 355509 380104
8378 380104 370621 372996 353490 344068 356313 346258 361235 366695 341565 347711 368301 361741 338533
8365 338533 361711 351524 348088 353732 340723 321589 307370 287681 273966 281400 288078 303163
8353 303163 311904 320232 311364 274550 266441 257827 261709 268833 284948 265429 247334 260736 283100
8340 283100 266154 268619 253273 247852 246714 263478 259963 271380 275895 277760 281644 305378 321208
$$ packed form
8431E19444J5077k926j1410q519n054j3466K40q961p555L0240j3938m106j2196
8418D76870k9804r85P335l931L738p699j2920p500J9134N505p557j4799l261j3793
8404D10333j7047j356o098L5480K61k6397N42J4261k2470j8622o459j4680J9940
8391C67688J0174K7886q737k5130j3771J5407k4809N812J4822p709o849P25K4595
8378C80104r483K375j9506r422J2245j0055J4977N460k5130O146K0590o560k3208
8365C38533K3178j0187l436N644j3009j9134j4219j9689j3715P434O678J5085
8353C03163Q741Q328q868l6814q109q614L882P124J6115j9519j8095J3402K2364
8340B83100j6946K465j5346n421j138J6764l515J1417M515J865L884K3734J5830
$$ plain form
8327 321208 292964 291432 264896 247507 268287 275214 268438 264078 254398 255693 267643 263012 240310
8314 240310 213905 227220 229328 232471 249100 249292 254181 251241 240132 232120 232204 211432 192854 193410
8300 193410 214873 208589 200445 205822 219042 245069 242555 225676 229129 223368 210963 213463 216282
8287 216282 186576 193939 205630 225088 234973 227227 223688 215290 219643 221165 217974 211375 198956
8274 198956 179448 187263 198815 194020 216061 236857 247092 262760 253174 236467 231497 222960 213076
8261 213076 219577 221291 206866 209327 212097 202358 174940 164852 162795 159461 160726 177775 171399
8248 171399 196936 199079 184627 169848 186220 193493 202284 190839 190276 195594 186931 165974 146148
8235 146148 147683 153898 161912 160120 153516 173037 190653 198391 192959 193093 202644 209870 198846 184109
$$ packed form
8327C21208k8244j532k6536j7389K0780O927o776m360r680J295J1950m631k2702
8314B40310k6405J3315K108L143J6629J92M889k940j1109q012Q4k0772j8578N56
8300A93410K1463o284q144N377J3220K6027k514j6879L453n761j2405K500K819
8287B16282k9706P363J1691J9458R885p746l539q398M353J522l191o599j2419
8274A98956j9508P815J1552m795K2041K0796J0235J5668r586j6707m970q537r884
8261B13076O501J714j4425K461K770r739k7418j0088k057l334J265J7049o376
8248A71399K5537K143j4452j4779J6372P273Q791j1445n63N318q663k0957j9826
8235A46148J535O215Q014j792o604J9521J7616P738n432J34R551P226j1024j4737
$$ plain form
8221 184109 182475 172490 147667 165355 192508 188531 191460 204462 234153 241379 278915 336838 398398
8208 398398 432066 457855 528127 592501 621648 605798 577578 503140 404210 337231 303136 267159
8196 267159 244857 228557 206854 212060 190898 181556 179087 184493 192610 185109 178208 171724 181196
8183 181196 183925 178899 161801 149736 159059 153858 159811 176825 191090 191822 192830 181142 191559
8170 191559 202755 224767 255199 282808 324958 371975 456239 529948 542925 534162 487503 426334
8158 426334 350335 300008 276384 267894 269976 239364 209968 206872 202227 182274 159120 146274
8146 146274 156291 170497 147022 126678 130153 153379 151092 160996 148438 136137 136146 141422 145661
8133 145661 142100 132995 159419 143129 126959 129120 119230 113368 124797 133775 134569 119409 91330
$$ packed form
8221A84109j634r985k4823J7688K7153l977K929J3002K9691P226L7536N7923O1560
8208C98398L3668K5789P0272O4374K9147j5850k8220p4438r8930o6979l4095l5977
8196B67159k2302j6300k1703N206k1162r342k469N406Q117p501o901o484R472
8183A81196K729n026j7098j2065R323n201N953J7014J4265P32J008j1688J0417
8170A91559J1196K2012L0432K7609M2150M7017Q4264P3709J2977q763m6659o1169
8158D26334p5999n0327k3624q490K082l0612k9396l096m645j9953k3154j2846
8146A46274J0017J4206k3475k0344L475K3226k287R904j2558j2301RN276M239
8133A45661l561r105K6424j6290j6170K161r890n862J1429Q978P94j5160k8079
$$ plain form
8120 91330 94420 95486 103568 122442 129351 118525 100032 101451 124536 132164 143432 143231 131016
8107 131016 116329 105629 117453 117163 125347 130935 132183 123449 123983 110229 126781 154785 149222
8094 149222 136392 134333 133068 149249 146868 142449 139923 149243 145630 136703 142306 119842 104972
8081 104972 113607 134059 123268 129199 140907 133997 136290 117293 129731 118019 105150 101205 115923
8068 115923 128700 137546 126579 136080 139225 118789 115873 114711 113953 101394 107452 132360 148175
8055 148175 159802 160180 163449 158634 142766 145096 145979 137882 138677 153575 163010 181830 145771 118921
8041 118921 112108 95191 109687 140286 124492 114187 83393 89013 119645 123363 134283 148487
8029 148487 158528 165461 150086 164797 163025 122297 128354 134256 132927 156018 149846 147400 158269
$$ packed form
8120I1330L090J066Q082J8874O909j0826j8493J419K3085P628J1268k01j2215
8107A31016j4687j0700J1824k90Q184N588J248q734N34j3754J6552K8004n563
8094A49222j2830k059j265J6181k381m419k526R320l613q927N603k2464j4870
8081A04972Q635K0452j0791N931J1708o910K293j8997J2438j1712j2869l945J4718
8068A15923J2777Q846j0967R501L145k0436k916j162p58j2559O058K4908J5815
8055A48175J1627L78L269m815j5868K330Q83q097P95J4898R435J8820l6059k6850
8041A18921o813j6917J4496L0599j5794j0305l0794N620L0632L718J0920J4204
8029A48487J0041O933j5375J4711j772m0728O057N902j329K3091o172k446J0869
$$ plain form
8016 158269 166506 174641 188809 174527 172144 186972 179323 181939 184130 181709 164852 152473 138680
8003 138680 148727 153341 159044 149650 140740 149124 161172 146668 148605 140056 123847 110118 100091
7990 100091 89368 83850 64684 73213 97798 87970 83756 88857 81873 107153 141627 137550 139532
7977 139532 163846 157095 136433 126732 110901 123793 141688 151843 162671 167196 171575 161452
7965 161452 146241 133019 155100 153090 139928 122490 102982 109317 112751 114033 104403 84869 93736
7952 93736 115401 125974 112421 90620 79102 87939 94271 103885 102659 83693 60630 50713 71561
7939 71561 81246 72214 68176 63566 63854 56154 51126 67089 81925 90826 85215 84995 88443 75506
7925 75506 63562 77876 73417 58848 60196 66804 64518 67875 74322 69115 88313 130868 120157
$$ packed form
8016A58269Q237Q135J4168j4282k383J4828p649K616K191k421j6857j2379j3793
8003A38680J0047M614N703r394q910Q384J2048j4504J937q549j6209j3729j0027
7990A00091j0723n518j9166Q529K4585r828m214N101o984K5280L4474m077J982
7977A39532K4314o751k0662r701j5831J2892J7895J0155J0828M525M379j0123
7965A61452j5211j3222K2081k010j3162j7438j9508O335L434J282r630j9534Q867
7952I3736K1665J0573j3553k1801j1518Q837O332R614j226j8966k3063r917K0848
7939G1561R685r032m038m610K88p700n028J5963J4836Q901n611k20L448j2937
7925G5506j1944J4314m459j4569J348O608k286L357O447n207J9198M2555j0711
$$ plain form
7912 120157 100162 83961 74001 60516 41920 23048 23508 14544 27735 46836 56483 63589 66953
7899 66953 53069 32236 25303 45113 65293 53870 26684 32917 30510 26839 29091 30675 32602
7886 32602 17127 2963 22595 42489 58769 34791 18238 15464 32287 29919 48534 63653
7874 63653 40359 26220 55726 50746 32735 33085 33853 46923 56828 47351 50793 65689 58519 58979
7860 58979 51492 42233 20870 12526 1002 -8453 -11785 2393 5158 11334 2753 3392 20675 36175
7846 36175 32833 40482 37286 29000 37881 45161 44777 48518 37460 25561 16017 50342 53111 20233
7832 20233 21256 -2343 -21996 -22800 222 26040 17794 -4499 -14496 -1744 15521 20217 12478
7819 12478 19356 27402 31093 20618 41177 45289 10413 -9853 -13144 -14716 -9567 -501 -11099
$$ packed form
7912A20157j9995j6201r960j3485j8596j8872M60q964J3191J9101R647P106L364
7899F6953j3884k0833o933J9810K0180j1423k7186O233k407l671K252J584J927
7886C2602j5475j4164J9632J9894J6280k3978j6553k774J6823k368J8615J5119
7874F3653k3294j4139K9506m980j8011L50P68J3070R905r477L442J4896p170M60
7860E8979p487r259k1363q344j1524r455l332J4178K765O176q581O39J7283J5500
7846C6175l342P649l196q286Q881P280l84L741j1058j1899r544L4325K769l2878
7832B0233J023k3599j9653q04K3022K5818q246k2293r997J2752J7265M696p739
7819A2478O878Q046L691j0475K0559M112l4876k0266l291j572N149R066j0598
$$ plain form
7806 -11099 -15064 11733 14966 14140 -21163 -14541 6656 -5208 8910 2844 -23306 -13790 14418
7793 14418 10722 -1073 -6530 -25620 -25128 -31846 -12766 22875 46758 49209 22311 23146 3453
7780 3453 3284 -8868 9230 29178 41702 33585 37283 34280 18268 -4239 -2161 12873 20558
7767 20558 16443 5847 24675 58208 48941 24205 736 5108 20136 39429 45614 16579 -5622
7754 -5622 4963 -3005 8134 22702 6331 -2737 9521 4639 -22209 -33911 -8143 -10109 -24186
7741 -24186 -5540 2945 11830 33747 43069 47803 50953 42408 19718 16965 10899 24629 17694 5924
7727 5924 -8921 -12701 -8330 964 -2333 -6515 -724 -9932 -14755 6166 14118 3892 5403 13678
7713 13678 -6037 -10879 -23534 -19573 -5942 -3792 -4461 4247 7779 17145 -14140 -35451 -18268
$$ packed form
7806a1099l965K6797L233q26l5303O622K1197j1864J4118o066k6150R516K8208
7793A4418l696j1795n457j9090M92o718J9080L5641K3883K451k6898Q35j9693
7780C453j69j2152J8098J9948J2524q117L698l003j6012k2507K078J5034P685
7767B0558m115j0596J8828L3533r267k4736k3469M372J5028J9293O185k9035k2201
7754e622J0585p968J1139J4568j6371r068J2258m882k6848j1702K5768j966j4077
7741b4186J8646Q485Q885K1917R322M734L150q545k2690k753o066J3730o935j1770
7727E924j4845l780M371R294l297m182N791r208m823K0921P952j0226J511Q275
7713A3678j9715m842j2655L961J3631K150o69Q708L532R366l1285k1311J7183
$$ plain form
7700 -18268 -33820 -17723 -11915 -17740 -21907 8779 17668 3424 20283 23638 -2983 17961 39067
7687 39067 26495 8799 13771 -5999 -16038 15264 -332 -697 4749 530 -6152 -3745 -1244
7674 -1244 -1104 -2004 11495 10473 21294 24643 36893 48207 58277 52137 49475 37902 29355 28740
7660 28740 -1055 -14414 -31488 -17895 9905 21075 27831 35197 28930 24520 36060 40314 40435
7647 40435 21118 -4361 -511 -4923 -1225 2616 244 -1562 15669 13665 16397 18460 -6248 -24113
7633 -24113 -8803 -8486 -3799 3519 10292 26545 48508 30221 -7592 -25122 -19174 -6534 -1199
7620 -1199 13578 19727 4947 -10335 -12746 -9464 -13489 -10679 8724 15759 34070 35936 34749 28675
7606 28675 2026 -31772 -26953 11742 29840 8964 3837 17591 21241 24089 -347 -14348 -16757
$$ packed form
7700a8268j5552J6097N808n825m167L0686Q889j4244J6859L355k6621K0944K1106
7687C9067j2572j7696M972j9770j0039L1302j5596l65N446m219o682K407K501
7674a244J40r00J3499j022J0821L349J2250J1314J0070o140k662j1573q547o15
7660B8740k9795j3359j7074J3593K7800J1170O756P366o267m410J1540M254J21
7647D0435j9317k5479L850m412L698L841k372j806J7231k004K732K063k4708j7865
7633b4113J5310L17M687P318O773J6253K1963j8287l7813j7530N948J2640N335
7620a199J4777O149j4780j5282k411L282m025K810J9403P035J8311J866j187o074
7606B8675k6649l3798M819L8695J8098k0876n127J3754L650K848k4436j4001k409
$$ plain form
7593 -16757 -22412 -25457 -32563 -33023 -5891 17531 30346 23698 18091 17825 29755 19085 886 -14144
7579 -14144 -14761 -8908 1316 9339 17217 24247 14563 -1224 -14422 -5800 17623 5088 -17610
7566 -17610 -5908 5061 -5203 9592 38941 36628 19330 -7146 -2824 798 -1726 533 14011
7553 14011 25654 3748 -19349 -28973 -31613 -5176 12719 31453 38573 39132 24523 26387 20804
7540 20804 10247 1821 -1238 6757 23235 26665 23886 9971 -5574 -7580 12964 31713 26447
7527 26447 23692 50922 53515 53174 30887 15543 21751 15233 24592 18163 -16192 -29683 -53716
7514 -53716 -44848 -18410 -11019 -2709 10702 19936 11982 14913 3245 -6689 9495 661 -6137 10796
7500 10796 4484 -9863 -14294 -12546 -13081 9204 17219 32718 28214 16170 2293 14314 20740
$$ packed form
7593a6757n655l045p106m60K7132K3422J2815o648n607k66J1930j0670j8199j5030
7579a4144o17N853J0224Q023P878P030r684j5787j3198Q622K3423j2535k2698
7566a7610J1702J0969j0264J4795K9349k313j7298k6476M322L622k524K259J3478
7553A4011J1643k1906k3097r624k640K6437J7895J8734P120N59j4609J864n583
7540B0804j0557q426l059P995J6478L430k779j3915j5545k006K0544J8749n266
7527B6447k755K7230K593l41k2287j5344O208o518R359o429l4355j3491k4033
7514e3716Q868K6438P391Q310J3411R234p954K931j1668r934J6184q834o798J6933
7500A0796o312j4347m431J748n35K2285Q015J5499m504j2044j3877J2021O426
$$ plain form
7487 20740 2741 -13789 -29703 -23471 -26240 -40739 -42979 -32083 -15963 -8993 -4180 -31085 -47712
7474 -47712 -30229 -7709 -12278 -25223 -14283 -4114 -5617 -12314 -11358 -31290 -37933 -26599 -34407
7461 -34407 -42072 -9458 31780 22510 7134 9593 15658 14078 -6547 -2092 32312 51491 45911
7448 45911 27182 20602 22281 13673 33 -10562 -20415 -9514 -6785 -3232 13790 7465 5732
7435 5732 29989 48881 29353 -13916 -27311 -28695 -46170 -58330 -45595 -33186 -16195 1251
7423 1251 1194 5076 15945 14579 -11861 -37505 -39872 -15693 -4352 -7372 -22308 -25640 -32537 -7078
7409 -7078 -4669 -14929 -29935 -5261 1533 -11203 -31333 -27136 -18048 -6769 -3135 10802 18523
7396 18523 15731 2368 -24296 -12509 -21197 -31374 -29868 -25408 -19827 -16332 -23164 -29311 -23507 1504
$$ packed form
7487B0740j7999j6530j5914O232k769j4499k240J0896J6120O970M813k6905j6627
7474d7712J7483K2520m569j2945J0940J0169j503o697R56j9932o643J1334p808
7461c4407p665L2614M1238r270j5376K459O065j580k0625M455L4404J9179n580
7448D5911j8729o580J679q608j3640j0595r853J0901K729L553J7022o325j733
7435E732K4257J8892j9528m3269j3395j384j7475j2160J2735J2409J6991J7446
7423A251n7L882J0869j366k6440k5644k367K4179J1341l020j4936l332o897K5459
7409g078K409j0260j5006K4674O794j2736k0130M197R088J1279L634J3937P721
7396A8523k792j3363k6664J1787q688j0177J506M460N581L495o832o147N804K5011
$$ plain form
7382 1504 7147 5748 864 -21259 -19772 6537 23733 22991 -2172 -33371 -16566 -4993 -24041
7369 -24041 -37202 -43366 -29252 -7321 1046 -12990 -7259 -5810 -7874 -17077 -34233 -30105 -25020
7356 -25020 -5694 5103 1185 -3803 -973 -7385 3584 8913 -12098 -20244 -13524 9982 11837
7343 11837 8268 33698 44964 55634 36395 17669 21720 11060 -6964 -25475 7972 2871
7331 2871 -13165 -5584 -12688 -14504 -9325 -24168 -41290 -50357 -49787 -43327 -26991 1137 -7734 -24724
7317 -24724 -20551 -26582 -34692 -19376 3674 9740 9738 23732 3534 -5362 2779 13787 22619 13440
7303 13440 30260 26671 14467 16854 2388 -24025 -14978 -34628 -36073 -32183 -17694 -28992 -39266
7290 -39266 -30903 -26215 -8130 -5222 -32458 -44532 -57368 -39442 -19345 13182 35699 19525
$$ packed form
7382A504N643j399m884k2123J487K6309J7196p42k5163l1199J6805J1573j9048
7369b4041j3161o164J4114K1931Q367j4036N731J449k064r203j7156M128N085
7356b5020J9326J0797l918m988K830o412J0969N329k1011q146O720K3506J855
7343A1837l569K5430J1266J0670j9239j8726M051j0660j8024j8511L3447n101
7331B871j6036P581p104j816N179j4843j7122r067N70O460J6336K8128q871j6990
7317b4724M173o031q110J5316K3050O066kJ3994k0198q896Q141J1008Q832r179
7303A3440J6820l589j2204K387j4466k6413R047j9650j445L890J4489j1298j0274
7290c9266Q363M688J8085K908k7236j2074j2836J7926K0097L2527K2517j6174
$$ plain form
7278 19525 9398 -20512 -4573 20964 12151 -1474 -21579 -29505 -29140 -20583 -21157 -5586 -8424
7265 -8424 -25969 -13031 1395 -22549 -47070 -26185 -853 10675 5415 -25766 -26420 -18832 -15878
7252 -15878 -44791 -61883 -64786 -51395 -41923 -37494 -26432 -14953 -5895 -1254 18197 24956 18391
7239 18391 38560 27061 -28552 -55841 -52269 -26572 -7653 -13381 -38332 -54317 -39060 -32680
7227 -32680 -16960 -18138 -9621 -21453 -47889 -31960 -10876 1847 -8392 -12850 -40266 -43232 -33137
7214 -33137 -52654 -71284 -64970 -46430 -8838 260 -22875 -601 -569 15560 32405 17146 3370
7201 3370 16227 -7522 -44321 -40520 -43455 -57561 -65287 -64947 -42865 -33348 -23878 -16837 -26194 -50224
7187 -50224 -52109 -36296 -17713 5994 -10208 -27889 -26901 -34585 -44871 -27192 -23442 -25739 -17752
$$ packed form
7278A9525j0127k9910J5939K5537q813j3625k0105p926L65Q557n74J5571k838
7265h424j7545J2938J4426k3944k4521K0885K5332J1528n260l1181o54P588K954
7252a5878k8913j7092k903J3391R472M429J1062J1479R058M641J9451O759o565
7239A8391K0169j1499n5613k7289L572K5697J8919n728k4951j5985J5257O380
7227c2680J5720j178Q517j1832k6436J5929K1084J2723j0239m458k7416k966J0095
7214c3137j9517j8630O314J8540L7592R098k3135K2274L2J6129J6845j5259j3776
7201C370J2857k3749l6799L801k935j4106p726L40K2082R517R470P041r357k4030
7187e0224j885J5813J8583K3707j6202j7681R88p684j0286J7679L750k297P987
$$ plain form
7174 -17752 -20030 -27492 -11402 -18440 -27559 -17212 -21481 -21672 -26189 -26273 -10322 -19385 -31202 -15427
7160 -15427 -21709 -34451 -12633 15041 19773 29328 40495 25014 5976 -9416 4602 -3979 555
7147 555 3988 1523 -15018 -9285 5278 -623 -15653 -8537 6443 26254 22853 12119 13668 20865
7133 20865 30060 7769 7345 23081 -363 -26786 -33860 -7022 4889 -14564 -9695 -12096 -6029
7120 -6029 5376 8791 8987 -4175 -30643 -16944 221 188 -10892 -11719 -14855 -22165 -5829 16743
7106 16743 31922 10194 2016 10654 4936 -7442 -2972 -4832 -7859 -1847 -13197 -23713 -41563
7093 -41563 -39896 -43383 -55989 -51048 -51737 -47114 -45091 -9431 22758 27796 36038 22774 5104 5425
7079 5425 8416 6100 -13323 -17663 -23940 -19447 -14952 -7668 -15435 -30720 -35183 -26042 -30388 -21995
$$ packed form
7174a7752k278p462J6090p038r119J0347m269j91m517q4J5951r063j1817J5775
7160a5427o282j2742K1818K7674M732R555J1167j5481j9038j5392J4018q581M534
7147E55L433k465j6541N733J4563n901j5030P116J4980J9811l401j0734J549P197
7133B0865R195k2291m24J5736k3444k6423p074K6838J1911j9453M869k401O067
7120f029J1405L415J96j3162k6468J3699J7165l3j1080q27l136p310J6336K2572
7106A6743J5179k1728q178Q638n718j2378M470j860l027O012j1350j0516j7850
7093d1563J667l487j2606M941o89M623K023L5660L2189N038Q242j3264j7670L21
7079E425K991k316j9423m340o277M493M495P284p767j5285m463R141m346Q393
$$ plain form
7065 -21995 -16548 -13989 -21309 -8622 -2273 17150 4328 -753 5756 31710 21687 18081 16248
7052 16248 16003 15736 19387 27486 37170 11552 5474 -11939 -2112 -18775 -41242 -21055 -2963 -16741
7038 -16741 -37800 -44162 -23936 -11524 -22214 -40315 -28299 -8635 12667 12458 2261 15981
7026 15981 -3195 -34102 -17346 -17154 -33112 -19038 4898 -9288 -24078 -32822 -44574 -46639 -30113
7013 -30113 -13501 -43296 -53492 -40971 -30138 -31725 -19064 -7480 -2578 -12266 -25850 -36832
7001 -36832 -23395 -25707 -35115 -58437 -47586 -30631 -9029 7943 4145 15140 20525 19604 -2832
6988 -2832 -1581 1640 1323 -7577 -22622 -32693 -21079 -25679 -33260 -38096 -24796 -30893 -29898 -15068
6974 -15068 -11544 -2148 -15326 -20989 9719 -13160 -24328 -36149 -48491 -42338 -2388 10710 -2757
$$ packed form
7065b1995N447K559p320J2687O349J9423j2822n081O509K5954j0023l606j833
7052A6248k45k67L651Q099R684k5618o078j7413R827j6663k2467K0187J8092j3778
7038a6741k1059o362K0226J2412j0690j8101J2016J9664K1302k09j0197J3720
7026A5981j9176l0907J6756J92j5958J4074K3936j4186j4790q744j1752k065J6526
7013c0113J6612k9795j0196J2521J0833j587J2661J1584M902r688j3584j0982
7001c6832J3437k312r408k3322J0851J6955K1602J6972l798J0995N385r21k2436
6988b832J251L221l17q900j5045j0071J1614m600p581m836J3300o097R95J4830
6974a5068L524R396j3178n663L0708k2879j1168j1821j2342O153L9950J3098j3467
$$ plain form
6961 -2757 -9593 -6386 11957 -8293 -16670 2524 6267 -7265 -16616 -35415 -11833 16034 15060
6948 15060 12484 -3144 -20321 -39332 -32319 -37572 -38263 -19133 -11873 -12931 -32614 -42683 -41587
6935 -41587 -47115 -40533 -35447 -38659 -21064 -5783 19691 9532 -10576 -14369 -18314 -25527 -20885
6922 -20885 2771 15171 22311 -3756 -14165 -16003 -10094 -14105 -16499 -50340 -63790 -46514 -43243
6909 -43243 -12404 -18187 -29096 -40853 -25777 -19048 1327 23033 20545 11471 7338 2195 4842
6896 4842 -7926 -10481 -13238 -21463 -1341 -5448 -12764 -13173 -16204 -3964 7682 23027 28331 12174
6882 12174 -3385 -6658 2717 -2300 547 -29894 -51182 -43294 -42455 -25460 -27092 -18449 -11736 -11854
6868 -11854 11074 15910 10564 18666 -9902 -27335 -22870 -27407 -26833 -22852 -27782 -26553 19169 17566
$$ packed form
6961b757o836L207J8343k0250q377J9194L743j3532r351j8799K3582K7867r74
6948A5060k576j5628j7177j9011P013n253o91J9130P260j058j9683j0069J096
6935d1587n528O582N086l212J7595J5281K5474j0159k0108l793l945p213M642
6922b0885K3656J2400P140k6067j0409j838N909m011k394l3841j3450J7276L271
6909d3243L0839n783j0909j1757J5076O729K0375K1706k488r074m133n143K647
6896D842j2768k555k757q225K0122m107p316m09l031J2240J1646J5345N304j6157
6882A2174j5559l273R375n017K847l0441k1288P888Q39J6995j632Q643O713j18
6868a1854K2928M836n346Q102k8568j7433M465m537N74L981m930J229M5722j603
$$ plain form
6854 17566 -36800 -19994 3354 -6461 -25360 -36885 -25330 -27596 -2148 -7043 -3695 2770 15845
6841 15845 22622 31343 24856 8004 5702 11221 10845 5592 20553 35631 24714 20901 31504 12970
6827 12970 -6277 -36366 -38809 -20868 -14586 -8459 4811 1063 -18885 -9254 -24485 -43156 -36446
6814 -36446 10723 28396 40521 34027 23807 28082 31025 36925 27664 45586 48744 35272 9851
6801 9851 -27034 -52982 -61275 -61322 -40133 -40035 -47145 -55561 -45939 -28432 -22272 -33677 -20915 -3608
6787 -3608 -8933 -16837 -8211 -9423 -22356 -2118 28723 44266 57751 53471 24910 9095 6597
6774 6597 5823 -7802 -20158 -18540 -8766 -5698 -140 -1515 536 -12928 -23897 -40814 -14367 -12579
6760 -12579 -3059 -145 21135 16484 -6307 -9088 4494 14904 1172 -7651 2254 -8612 -6902
$$ packed form
6854A7566n4366J6806K3348r815j8899j1525J1555k266K5448m895L348O465J3075
6841A5845O777Q721o487j6852k302N519l76n253J4961J5078j0917l813J0603j8534
6827A2970j9247l0089k443J7941O282O127J3270l748j9948R631j5231j8671O710
6814c6446M7169J7673J2125o494j0220M275K943N900r261J7922L158j3472k5421
6801I851l6885k5948q293m7K1189R8p110q416R622J7507O160j1405J2762J7307
6787c608n325p904Q626j212j2933K0238L0841J5543J3485m280k8561j5815k498
6774F597p74j3625j2356J618R774L068N558j375K051j3464j0969j6917K6447J788
6760a2579R520K914K1280m651k2791k781J3582J0410j3732q823R905j0866J710
$$ plain form
6747 -6902 21944 31785 -2871 -4529 6979 -3485 4785 49813 44318 46849 78116 96073 96950
6734 96950 52260 37115 34756 32112 17798 -4173 -22028 -11266 22324 6555 -10177 -15069
6722 -15069 -1169 10450 3981 16231 -1925 -17480 -1528 -1988 -27047 -25391 -9493 -18355 -18978
6709 -18978 -3369 -27646 -35846 -24402 -36715 -14802 -3367 -16192 -34896 -19340 7000 20163
6697 20163 -11602 -28867 -23915 -18702 -270 -7476 -4233 16568 35836 32105 -6010 -21468 -2775
6684 -2775 4333 13421 30890 20185 14091 11384 -5792 -23508 -21263 -18208 -4615 1544 -8424 -6532
6670 -6532 -21573 -45784 -34318 -11911 1756 7365 -8249 -18982 -31887 -38925 -57960 -47558
6658 -47558 -34915 -47094 -56841 -63258 -35799 -18800 -25134 -21951 -1610 -2267 -18073 -25361 -41742
$$ packed form
6747f902K8846R841l4656j658J1508j0464Q270M5028n495K531L1267J7957Q77
6734I6950m4690j5145k359k644j4314k1971j7855J0762L3590j5769j6732m892
6722a5069J3900J1619o469J2250j8156j5555J5952m60k5059J656J5898q862o23
6709a8978J5609k4277q200J1444j2313K1913J1435j2825j8704J5556K6340J3163
6697B0163l1765j7265M952N213J8432p206L243K0801J9268l731l8115j5458J8693
6684b775P108R088J7469j0705o094k707j7176j7716K245L055J3593O159r968J892
6670f532j5041k4211J1466K2407J3667N609j5614j0733j2905p038j9035J0402
6658d7558J2643j2179r747o417K7459J6999o334L183K0341o57j5806p288j6381
$$ plain form
6645 -41742 -37671 -26490 -26015 -4433 7720 -6976 9361 -19637 -28442 -11849 11719 10847 -686
6632 -686 -13064 -30946 -21188 -22153 -30367 -27936 -6359 6264 3699 -666 -214 -14897 -16024 -28857
6618 -28857 -20257 -23325 -15231 -7445 -11331 -6434 24834 27379 16093 20840 26528 14716 2000 145
6604 145 18628 16511 27828 51445 61466 56796 41915 18845 16076 5070 -8815 -484 -5600
6591 -5600 -21594 -14752 -17662 -17637 5413 23679 12243 -15165 -6601 8011 1069 6309 16621 18679
6577 18679 -4975 5401 17819 17759 -10668 -49831 -43764 -34795 -26666 -28263 -31001 -53018 -73316
6564 -73316 -74193 -31965 -21030 -10049 -11150 -24217 -23593 -16564 -32081 -28712 -9681 5773 11897
6551 11897 -13320 -36026 -36879 -22104 -20646 -12723 -18920 -13372 -15681 -31504 -14999 -14330 13166 35685
$$ packed form
6645d1742M071J1181M75K1582J2153j4696J6337k8998q805J6593K3568q72j1533
6632f86j2378j7882R758r65q214K431K1577J2623k565m365M52j4683j127j2833
6618b8857Q600l068Q094P786l886M897L1268K545j1286M747N688j1812j2716j855
6604A45J8483k117J1317K3617J0021m670j4881k3070k769j1006j3885Q331n116
6591e600j5994O842k910K5K3050J8266j1436k7408Q564J4612o942N240J0312K058
6577A8679k3654J0376J2418o0k8427l9163O067Q969Q129j597k738k2017k0298
6564g3316q77M2228J0935J0981j101j3067O24P029j5517L369J9031J5454O124
6551A1897k5217k2706q53J4775J458P923o197N548k309j5823J6505O69K7496K2519
$$ plain form
6537 35685 45328 38336 16099 25943 15115 5887 1718 12969 33527 28977 20742 5008 -10856
6524 -10856 993 -22182 -20965 -8074 -27887 -62737 -61594 -34535 -33341 -30195 -7355 2782 -7946
6511 -7946 -7194 6263 13019 18511 38879 42415 45794 11355 -22115 -26320 -20898 -10894 3679 10009
6497 10009 20967 32972 7317 -17607 -33065 -27729 -11032 11403 590 -6124 -16945 -58501
6485 -58501 -46414 -21305 -11566 4401 -4775 -23305 -12226 -3239 -15363 -18649 -18746 -12063 -5448 -8565
6471 -8565 -13996 -16768 -24967 -23617 3988 22837 16950 17443 21249 32280 45132 49366 43625 5661
6457 5661 -16563 -12503 -14852 -21589 -13452 -24298 -38609 -40933 -54558 -52225 -21820 -3695 9466
6444 9466 10206 16780 7004 -1928 17014 13464 9776 2231 -3220 -10135 -29236 -33599 -41787 -27739
$$ packed form
6537C5685R643o992k2237R844j0828r228m169J1251K0558m550q235j5734j5864
6524a0856J1849k3175J217J2891j9813l4850J143K7059J194L146K2840J0137j0728
6511g946P52J3457O756N492K0368L536L379l4439l3470m205N422J0004J4573O330
6497A0009J0958J2005k5655k4924j5458N336J6697K2435j0813o714j0821m1556
6485e8501J2087K5109R739J5967r176j8530J1079Q987j2124l286r7O683O615l117
6471h565n431k772q199J350K7605J8849n887M93L806J1031J2852M234n741l7964
6457E661k2224M060k349o737Q137j0846j4311k324j3625K333L0405J8125J3161
6444I466P40O574r776q932J8942l550l688p545n451o915j9101m363q188J4048
$$ plain form
6430 -27739 -11789 6359 -9044 -31230 -17709 20887 17944 -6057 -6318 402 -15008 -42931 -38074
6417 -38074 -9211 7455 -10850 -24313 -25656 -28713 -16014 23127 20537 6879 -6165 -13631 -899
6404 -899 -9723 -17938 2361 11458 2377 -9453 -10927 5693 -13455 -14406 -11532 -6874 17567 35206
6390 35206 30453 5745 1594 -16973 -22665 -30075 -37578 -43633 -19429 3094 14574 19866 11962
6377 11962 20888 43974 29202 11532 9246 26649 1802 -8830 -15139 9080 3853 -23391 -33480
6364 -33480 -46927 -57320 -50457 -41743 -19516 -28019 -13346 -6315 16468 8236 -11367 -9083 3718
6351 3718 10795 -3317 -19835 -22345 -34908 -35855 -30622 -13312 -1998 2942 23340 29868 6328
6338 6328 5930 -4865 -15730 -5752 -2359 -22899 -25288 -25066 -18604 -9747 -7122 12552 30798 21178
$$ packed form
6430b7739J5950J8148j5403k2186J3521L8596k943k4001k61O720j5410k7923M857
6417c8074K8863J6666j8305j3463j343l057J2699L9141k590j3658j3044p466J2732
6404h99q824q215K0299R097r081j1830j474J6620j9148r51K874M658K4441J7639
6390C5206m753k4708m151j8567n692p410p503o055K4204K2523J1480N292p904
6377A1962Q926K3086j4772j7670k286J7403k4847j0632o309K4219n227k7244j0089
6364c3480j3447j0393O863Q714K2227q503J4673P031K2783q232j9603K284J2801
6351C718P077j4112j6518k510j2563r47N233J7310J1314M940K0398O528k3540
6338F328l98j0795j0865R978L393k0540k389K22O462Q857K625J9674J8246r620
$$ plain form
6324 21178 -867 -30598 -20406 -2025 -10104 -47 -18803 -23863 -30486 -19326 -9682 -37 5718
6311 5718 12204 26887 36998 16519 -16220 -37954 -19811 -5482 -7227 -27405 -40043 -22093
6299 -22093 -3228 -546 17869 40905 41115 29636 3502 -4242 -5609 11539 20065 -2631 -20195
6286 -20195 -24353 -9435 -4409 9457 22209 37847 32194 36099 24642 -18866 -36649 -41378 -52330
6273 -52330 -34953 -25619 -21733 -27811 -34650 -10506 17102 -3125 -5699 8756 -10972 -41270 -21420
6260 -21420 -15681 -15233 -22049 -17524 -16057 -9418 -12196 -33159 -30688 -22766 -17925 -25604 -35153 -29683 -35093
6245 -35093 -27254 -29658 -5024 23043 25760 36901 40856 39672 34982 12216 -9744 -34754 -23737
6232 -23737 -8241 -13563 -3385 -15241 -35125 -48502 -33608 -18901 -1466 2091 -14529 -28901
$$ packed form
6324B1178k2045k9731J0192J8381q079J0057j8756n060o623J1160R644R645N755
6311E718O486J4683J0111k0479l2739k1734J8143J4329j745k0178j2638J7950
6299b2093J8865K682J8415K3036K10j1479k6134p744j367J7148Q526k2696j7564
6286b0195m158J4918N026J3866J2752J5638n653L905j1457m3508j7783m729j0952
6273e2330J7377R334L886o078o839K4144K7608k0227k574J4455j9728l0298J9850
6260b1420N739M48o816M525J467O639k778k0963K471P922M841p679r549N470n410
6245c5093P839k404K4634K8067K717J1141L955j184m690k2766k1960k5010J1017
6232b3737J5496n322J0178j1856j9884j3377J4894J4707J7435L557j6620j4372
$$ plain form
6220 -28901 -28966 -5162 -14281 -16041 -15037 -15114 -1345 -27061 -31119 -42887 -30348 -21830 -34233 -39362
6206 -39362 -3661 26395 19350 -274 16167 17439 22103 7116 5767 -3717 -15934 -23429 -23278
6193 -23278 -24552 -32518 -41346 -51871 -38909 -11772 13574 19824 13226 24532 18007 -15820 -30476
6180 -30476 -9282 -6104 -20490 -30935 -23766 -21266 -11297 -6094 5353 -13805 -23452 4506 24990
6167 24990 28496 848 -17018 -14715 -13327 -11189 -11351 -15192 -28220 -30999 -35542 -12208 7010 17823
6153 17823 11130 -615 -4246 2843 -1611 -8294 12468 30007 20799 -2514 -7710 -15819 -19453 -28692
6139 -28692 -2347 11665 18161 17815 19179 23930 22426 27423 45496 36664 25169 24275 -3311 -19539
6125 -19539 -32119 -32829 -4374 1098 -9032 -3985 12358 9805 -13486 -8345 18048 33962 32512
$$ packed form
6220b8901o5K3804r119j760J004p7J3769k5716m058j1768J2539Q518j2403n129
6206c9362L5701L0056p045j9624J6441J272M664j4987j349r484j2217p495J51
6193b3278j274p966q828j0525J2962K7137K5346O250o598J1306o525l3827j4656
6180c0476K1194L178j4386j0445P169K500R969N203J1447j9158r647K7958K0484
6167B4990L506k7648j7866K303J388K138j62l841j3028k779m543K3334J9218J0813
6153A7823o693j1745l631P089m454o683K0762J7539r208k3313n196q109l634r239
6139b8692K6345J4012O496l46J364M751j504M997J8073q832j1495q94k7586j6228
6125a9539j2580p10K8455N472j0130N047J6343k553k3291N141K6393J5914j450
$$ plain form
6112 32512 25355 20069 -470 -32406 -35570 -14110 -4862 -1440 -5488 8636 -390 2153 17793
6099 17793 20583 24407 26561 15205 31714 45683 43875 29586 19465 10134 -3442 -20140 -15196
6086 -15196 -26450 -26392 -27609 -10973 7501 15489 23731 45846 40918 37748 37834 34717 8096 -5265
6072 -5265 821 24032 34173 16268 26433 38745 33799 17560 25620 34343 36625 31920 -4802
6059 -4802 -20052 9846 37554 67656 32380 -1030 -6836 -25212 -38875 -25253 -20582 -18051 357
6046 357 5411 -1522 9364 26552 19028 25243 15756 22668 42175 20284 6539 -22097 -31996 -21057
6032 -21057 -10368 -20923 -15971 -27100 -18658 -7253 23429 34868 16458 -9395 -8366 33086
6020 33086 46825 36455 24001 7430 -26575 -39823 -23492 -6939 6759 11690 6154 -12039
$$ packed form
6112C2512p157n286k0539l1936l164K1460R248L422m048J4124r026K543J5640
6099A7793K790L824K154j1356J6509J3969j808j4289j0121r331j3576j6698M944
6086a5196j1254N8j217J6636J8474P988Q242K2115m928l170Q6l117k6621j3361
6072e265O086K3211J0141j7905J0165J2312m946j6239Q060Q723K282m705l6722
6059d802j5250K9898K7708L0102l5276l3410n806j8376j3663J3622M671K531J8408
6046C57N054o933J0886J7188p524O215r487O912J9507k1891j3745k8636r899J0939
6032b1057J0689j0555M952j1129Q442J1405L0682J1439j8410k5853J029M1452
6020C3086J3739j0370j2454j6571l4005j3248J6331J6553J3698M931n536j8193
$$ plain form
6008 -12039 -18260 -5821 -14628 -15113 -6022 -7475 17132 11697 1669 -20241 -43978 -32770 -17141
5995 -17141 1313 9968 2137 -9177 -41928 -47927 -54345 -48160 -55429 -70113 -52326 -38049 -26945
5982 -26945 -29464 -18063 8104 17534 30292 14507 12557 23897 9235 10061 12126 1859 -1168
5969 -1168 -20008 -14006 -13877 -23386 -22884 -8120 -1776 19096 5002 -16047 -22569 -23773 -20170 -26943
5955 -26943 -22486 -29740 -24888 -12606 -7665 8002 15786 1990 -14113 -24939 -24544 -6249 6781
5942 6781 -24984 -40004 -25525 -146 -1499 -26561 -65513 -54425 -27116 -15699 5484 5820 11698
5929 11698 -2111 -8026 -1468 1096 -19892 -37159 -42425 -35526 -11804 6572 -630 8584 18828
5916 18828 -4468 -45623 -41191 -7426 19210 19795 15280 -7477 -5758 -11580 -37248 -60334 -72263
$$ packed form
6008a2039o221J2439q807m85R091j453K4607n435j0028k1910k3737J1208J5629
5995a7141J8454Q655p831j1314l2751n999o418O185p269j4684J7787J4277J1104
5982b6945k519J1401K6167R430J2758j5785j950J1340j4662Q26K065j0267l027
5969a168j8840O002J29r509N02J4764O344K0872j4094k1049o522j204L603o773
5955b6943M457p254M852J2282M941J5667P784j3796j6103j0826L95J8295J3030
5942F781l1765j5020J4479K5379j353k5062l8952J1088K7309J1417K1183L36N878
5929A1698j3809n915O558K564k0988j7267n266O899K3722J8376p202R214J0244
5916A8828k3296m1155M432L3765K6636N85m515k2757J719n822k5668k3086j1929
$$ plain form
5903 -72263 -52159 -29400 -33093 -9341 -10774 -4008 13474 -12892 -36942 -46265 -42025 -24107 -619
5890 -619 10853 6259 6634 -2718 -19379 -22076 -19970 -26294 -36706 -37130 -22121 -4201 11999 -7428
5876 -7428 -16042 -15043 -24497 -26829 -32572 -57669 -58152 -27754 -19341 -17540 -33571 -35648 -24621 -2805
5862 -2805 36233 29860 16419 18890 25090 -3812 -13506 -26353 -22490 -16990 -8420 -3029 -12644 -6396
5848 -6396 14893 25833 24095 28827 32971 29483 26912 9483 12037 25691 17236 -18734 -30446
5835 -30446 -43262 -52936 -18156 -814 7365 2800 1952 -133 -3071 2372 20527 17625 21985 12280
5821 12280 -21217 -14633 -15624 -9983 3447 -20886 -17615 -5370 -8990 11947 19597 20871 -1102
5808 -1102 -23177 -46234 -48155 -45203 -49858 -34550 -28594 -44083 -33058 -46044 -33694 -12831 -7420
$$ packed form
5903g2263K0104K2759l693K3752j433O766J7482k6366k4050r323M240J7918K3488
5890f19J1472m594L75r352j6661k697K106o324j0412m24J5009J7920J6200j9427
5876g428q614R99r454k332n743k5097m83L0398Q413J801j6031k077J1027K1816
5862b805L9038o373j3441K471O200k8902r694j2847L863N500Q570N391r615O248
5848f396K1289J0940j738M732M144l488k571j7429K554J3654q455l5970j1712
5835c0446j2816r674L4780J7342Q179m565q48k085k938N443J8155k902M360r705
5821A2280l3497O584r91N641J3430k4333L271J2245l620K0937P650J274k1973
5808a102k2075k3057j921K952m655J5308N956j5489J1025j2986J2350K0863N411
$$ plain form
5795 -7420 3794 16317 -6436 -24318 -15914 -23757 -30728 -31155 -17630 3064 22188 13280 8052
5782 8052 5123 9942 -8582 -19754 -5330 3514 -9019 -28540 -22541 -53 3046 3595 9777 13805
5768 13805 8989 22748 26634 15298 11365 13030 24629 5905 -15024 1153 1544 9184 1392
5755 1392 7070 -1321 -36037 -43190 -38149 -40114 -29169 -34000 -40478 -25691 -14550 -10720 -30585 -49916
5741 -49916 -44093 -13731 -27647 -31025 -28284 -8125 -18360 -6118 -448 -17161 -22092 -27056 -36057
5728 -36057 -47166 -48202 -19939 7442 29129 33413 7789 -2012 -29763 -49861 -59447 -34863 -31755
5715 -31755 -37445 -32566 -39671 -22566 30308 17470 -5973 -23941 -24520 -28267 -42776 -51554 -41544
5702 -41544 -23859 -13088 10902 20746 21996 13241 -3570 10233 3764 -19804 -25765 -33268 -23585
$$ packed form
5795g420J1214J2523k2753j7882Q404p843o971m27J3525K0694J9124q908n228
5782H052k929M819j8524j1172J4424Q844j2533j9521N999K2488L099N49O182M028
5768A3805m816J3759L886j1336l933J665J1599j8724k0929J6177L91P640p792
5755A392N678q391l4716p153N041j965J0945m831o478J4787J1141L830j9865j9331
5741d9916N823L0362j3916l378K741K0159j0235J2242N670j6713m931m964r001
5728c6057j1109j036K8263K7381K1687M284k5624r801k7751k0098r586K4584L108
5715c1755n690M879p105J7105N2874j2838k3443j7968n79l747j4509q778J0010
5702d1544J7685J0771K3990R844J250q755j6811J3803o469k3568n961p503R683
$$ plain form
5689 -23585 -14305 1700 1159 -2696 23240 6687 2197 -11022 -15735 -7884 33192 48948 34262
5676 34262 21833 21485 997 -1225 -9972 20376 48882 40517 17204 -12493 -19660 -9936 -4771
5663 -4771 -27130 -36659 -32585 -22190 -10142 -9908 -18637 -9768 -8086 -15786 -22432 -13776 8949 10330
5649 10330 -4790 -10980 -7238 -2980 -9839 -8906 -579 10868 31302 26839 -4470 -9610 15388 20925
5635 20925 11127 7312 152 -14317 -4126 -5415 681 -9271 -13351 -16682 -1992 15741 2365
5622 2365 -25898 -15981 -10751 -29283 -16980 -27440 -24736 -2401 9491 36 -17651 -30776 -36208
5609 -36208 -31798 -22881 -14016 -5252 -9771 868 922 -8038 -34986 -28458 3460 17095 20389 21532
5595 21532 22402 21287 1829 -24012 -16705 -21992 -50497 -53211 -45474 -36024 -31560 -11450 2909 5337
$$ packed form
5689b3585R280J6005n41l855K5936j6553m490j3219m713P851M1076J5756j4686
5676C4262j2429l48k0488k222q747L0348K8506q365k3313k9697p167R724N165
5663d771k2359r529M074J0395J2048K34q729Q869J682p700o646Q656K2725J381
5649A0330j5120o190L742M258o859R33Q327J1447K0434m463l1309n140K4998N537
5635B0925r798l815p160j4469J0191j289O096r952m080l331J4690J7733j3376
5622B365k8263R917N230j8532J2303j0460K704K2335J1892r455j7687j3125n432
5609c6208M410Q917Q865Q764m519J0639N4q960k6948O528L1918J3635L294J143
5595B1532Q70j115j9458k5841P307n287k8505k714P737R450M464K0110J4359K428
$$ plain form
5581 5337 -7235 1166 12251 8428 -13500 -10695 21708 42636 59953 61190 24789 8030 2472
5568 2472 29112 25275 4959 -80 -13236 -40036 -45254 -14290 -8483 -31850 -36844 -11570 -32212
5555 -32212 -19063 -19113 -18291 -6503 11266 22350 31516 27869 12205 -2618 13493 20946 6119
5542 6119 -6113 969 -16451 -44103 -30350 -17805 -1334 -4179 8843 -25169 -30673 -25714 -25122
5529 -25122 -15469 21886 29266 15155 5226 12620 4253 8580 -14666 -44827 -51361 -57812 -54826 -45591
5515 -45591 -28362 -36876 -43142 -33063 -15584 -25520 -16055 -27921 -39169 -31378 -17723 -3796 8321
5502 8321 11257 -19471 -34089 -21044 -11447 -20798 -10841 5447 7741 -10366 -20872 1160 -11292
5489 -11292 -34074 -30379 1716 3193 -3997 7129 29073 33388 22729 18694 -4343 -22993 -13234
$$ packed form
5581E337j2572Q401J1085l823k1928K805L2403K0928J7317J237l6401j6759n558
5568B472K6640l837k0316n039j3156k6800n218L0964N807k3367m994K5274k0642
5555c2212J3149n0Q22J1788J7769J1084R166l647j5664j4823J6111P453j4827
5542F119j2232P082j7420k7652J3753J2545J6471k845J3022l4012n504M959N92
5529b5122R653L7355P380j4111r929P394q367M327k3246l0161o534o451K986R235
5515d5591J7229q514o266J0079J7479r936R465j1866j1248P791J3655J3927J2117
5502H321K936l0728j4618J3045R597r351R957J6288K294j8107j0506K2032j2452
5489a1292k2782L695L2095J477p190J1126K1944M315j0659m035k3037j8650R759
$$ plain form
5476 -13234 -5786 -3365 -12744 -24264 -21730 -32753 -35349 -32137 -25123 -31260 -32985 -22413 -9713 -13651
5462 -13651 -41524 -16622 15164 25123 21479 3019 -1775 5215 15855 9066 -5471 -7864 -4837
5449 -4837 808 -1407 -29248 -25119 -13459 -11084 1270 -11990 -25466 -24492 -14799 -21069 -26765 -25388
5435 -25388 -23162 -8905 -15807 -10380 -7682 5574 17034 8686 1436 -10523 7710 7131 -5396
5422 -5396 -1733 -23900 -24774 -10137 -3450 -6830 -19317 -2853 2583 -29484 -29628 -40632 -21859 -13622
5408 -13622 -14687 -8795 -7926 -2482 4824 -9956 -25363 -22671 566 33928 48588 35542 6313
5395 6313 -14029 -26255 -16189 -7458 -4858 -5786 -20011 -23201 -15004 -8048 8436 -6452 -29713
5382 -29713 -15943 -4320 14339 23957 1631 -14228 -1651 -6569 3035 18577 27982 24973 21936
$$ packed form
5476a3234P448K421r379j1520K534j1023k596L212P014o137j725J0572J2700l938
5462a3651k7873K4902L1786R959l644j8460m794O990J0640o789j4537k393L027
5449d837N645k215k7841M129J1660K375J2354j3260j3476R74R693o270n696J377
5435b5388K226J4257o902N427K698J3256J1460q348p250j1959J8233n79j2527
5422e396L663k2167q74J4637O687l380j2487J6464N436l2067j44j1004J8773Q237
5408a3622j065N892Q69N444P306j4780j5407K692K3237L3362J4660j3046k9229
5395F313k0342j2226J0066Q731K600r28j4225l190Q197O956J6484j4888k3261
5382b9713J3770J1623J8659R618k2326j5859J2577m918R604J5542R405l009l037
$$ plain form
5369 21936 38135 40482 45339 19267 974 -4572 -19421 -7454 -21815 -28120 -38092 -49339 -29354
5356 -29354 -13272 -2777 15743 1967 -42 1055 -1371 -7443 -12480 6339 40810 24861 5153
5343 5153 -7266 6771 -15611 -8763 12030 575 -13110 -45624 -59500 -56277 -37970 -30552 -6448
5330 -6448 -2882 -9304 -1417 4836 15833 14014 -4427 -30385 -49269 -19271 -9599 576 6229
5317 6229 -2490 10843 -2563 10123 17270 16714 25116 12682 -8054 -25021 -7414 5775 -4737
5304 -4737 4926 18758 36028 36302 18885 8488 9448 28586 28637 7673 -1590 -12048 -18875 -19286
5290 -19286 -16565 -4611 -10176 8850 19369 25721 37458 14700 -4548 -205 4043 -8779 -11360
5277 -11360 -23009 -21355 -12267 -21610 -10623 77 21260 25895 -16403 -8395 11206 12358 -8362
$$ packed form
5369B1936J6199K347M857k6072j8293n546j4849J1967j4361o305r972j1247J9985
5356b9354J6082J0495J8520j3776k009J097k426o072n037J8819L4471j5949j9708
5343E153j2419J4037k2382O848K0793j1455j3685l2514j3876L223J8307P418K4104
5330f448L566o422P887O253J0997j819j8441k5958j8884K9998R672J0175N653
5317F229q719J3333j3406J2686P147n56Q402j2434k0736j6967J7607J3189j0512
5304d737R663J3832J7270K74j7417j0397R60J9138N1k0964r263j0458o827m11
5290a9286K721J1954n565J9026J0519O352J1737k2758j9248M343M248j2822k581
5277a1360j1649J654R088r343J0987J0700K1183M635m2298Q008J9601J152k0720
$$ plain form
5264 -8362 -14353 -8909 -18967 2921 -8720 -31447 -43728 -32786 -1813 11224 14295 -2679 25495
5251 25495 35172 19409 11177 22831 37362 24755 49131 73699 51114 34917 13986 -23552
5239 -23552 -13581 6527 13037 12319 -3421 13742 15350 -5240 -9782 -3623 -438 10639 8717 -262
5225 -262 2166 5036 -22695 -45219 -27249 779 7731 -13541 -36504 -35808 -37483 -36481 -9104 -2305
5211 -2305 -9086 -12653 9938 -5299 -25940 -33084 -43599 -39901 -38417 -34692 -27864 -27398 -13027 30531
5197 30531 43840 30088 5320 1758 1930 -14409 54 -354 25072 19883 -14517 -4554 5903
5184 5903 -8660 -18249 -22688 -14775 -5804 -12054 -25182 -13719 -23471 -15072 -14338 -22531 -40317 -50082
5170 -50082 -38106 -17834 -15508 -10514 -11958 -5935 22956 15673 -6742 814 3866 14470 5038
$$ packed form
5264h362n991N444j0058K1888j1641k2727j2281J0942L0973J3037L071j6974K8174
5251B5495R677j5763q232J1654J4531j2607K4376K4568k2585j6197k0931l7538
5239b3552R971K0108O510p18j5740J7163J608k0590m542O159L185J1077j922q979
5225b62K428K870k7731k2524J7970K8028O952k1272k2963O96j675J002K7377O799
5211b305o781l567K2591j5237k0641p144j0515L698J484L725O828M66J4371M3558
5197C0531J3309j3752k4768l562J72j6339J4463m08K5426n189l4400R963J0457
5184E903j4563r589m439P913Q971o250j3128J1463r752Q399P34q193j7786r765
5170e0082J1976K0272K326M994j444O023K8891p283k2415P556L052J0604r432
$$ plain form
5157 5038 -15933 -25648 -16124 -22296 -24476 617 4578 6853 -10763 -32946 -26910 -31851 -21582 -5294
5143 -5294 -16780 -8201 7104 426 -3892 10668 857 4915 8207 27945 39346 31820 -6346
5130 -6346 -14881 -215 19478 20938 14281 -3636 -3696 3770 -17748 -16474 -4335 -12025 -13414 -9978
5116 -9978 -4028 6866 18924 18842 44059 33333 22922 17235 1106 -2042 -510 -20740 -20296 -11813
5102 -11813 10658 33642 -907 -26933 -10533 2347 2970 -21021 -22420 -27802 -34162 -10698 -512
5089 -512 17953 13546 -32128 -51513 -44617 -19431 -4904 -9257 -48276 -78167 -82836 -45475 -30578
5076 -30578 -30292 -16434 -19930 -17983 -9116 4446 4416 25152 14975 -4252 -15620 -23483 -20505 -29589
5062 -29589 -57264 -40621 -29174 -25339 -24523 -14768 -8495 4587 19253 14252 4239 -1251 -9490
$$ packed form
5157E038k0971r715R524o172k180K5093L961K275j7616k2183O036m941J0269J6288
5143e294j1486Q579J5305o678m318J4560r811M058L292J9738J1401p526l8166
5130f346q535J4666J9693J460o657j7917o0P466k1518J274J2139p690j389L436
5116i978N950J0894J2058q2K5217j0726j0411n687j6129l148J532k0230M44Q483
5102a1813K2471K2984l4549k6026J6400J2880O23k3991j399n382o360K3464J0186
5089e12J8465m407m5674j9385O896K5186J4527m353l9019k9891m669L7361J4897
5076c0578K86J3858l496J947Q867J3562l0K0736j0177j9227j1368p863K978r084
5062b9589k7675J6643J1447L835Q16R755O273J3082J4666n001j0013n490q239
$$ plain form
5049 -9490 -25996 -27169 1447 13750 4052 2596 3028 14230 -3725 5392 392 -12385 -9428 20749
5035 20749 31507 1936 -25055 -34322 -26315 -294 6467 -1810 28278 43587 21357 6311 -4914
5022 -4914 3543 23518 -439 -14405 -21901 -26959 -18243 -23227 -41178 -34968 -29351 -21194 2001 25000
5008 25000 21240 24992 20254 14604 18671 4244 -2617 -21064 -26474 -20748 -23716 3148 -1104 -21991
4994 -21991 -4542 20937 29005 -2456 -34572 -32228 -10276 -17969 -18084 -32393 -35689 -31445 -18269
4981 -18269 -12161 -24202 -26034 -2652 -3461 -6353 3848 13243 7638 8900 10278 19513 6308 -19688
4967 -19688 -19214 -17456 -16921 -15144 -15410 -18565 -33 -10439 -14779 -6539 -9437 -16263 -25175 -39091 -27833
4952 -27833 -15881 -9123 -10938 9944 1688 3311 -12311 -20265 -34489 -41879 -49265 -42038 -50008 -44054
$$ packed form
5049i490j6506j173K8616J2303r698j456M32J1202j7955R117n000j2777K957L0177
5035B0749J0758k9571k6991r267Q007K6021O761q277L0088J5309k2230j5046j1225
5022d914Q457J9975k3957j3966p496n058Q716m984j7951O210N617Q157K3195K2999
5008B5000l760L752m738n650M067j4427o861j8447n410N726k968K6864m252k0887
4994b1991J7449K5479Q068l1461l2116K344K1952p693j15j4309l296M244J3176
4981a8269O108j2041j832K3382q09k892J0201R395n605J262J378R235j3205k5996
4967a9688M74J758N35J777k66l155J8532j0406m340Q240k898o826q912j3916J1258
4952b7833J1952O758j815K0882q256J623j5622p954j4224p390p386P227p970N954
$$ plain form
4938 -44054 -49938 -67124 -67507 -43544 -26490 -20494 16753 30933 22461 15398 -3024 -16476 -26157
4925 -26157 -29364 -13500 -8229 -32233 -33082 -13783 -29174 -25616 -5046 -1509 -33214 -30521 -7815
4912 -7815 -7435 -26761 -41450 -41066 -34829 -26938 -6150 10688 36584 15998 -16498 -34486 -35013 -18828
4898 -18828 -2809 20096 19146 15534 6662 952 -7443 2592 24396 18364 -3470 -30067 -19939
4885 -19939 -12966 -14797 -54 -8028 -24618 -15401 14061 29026 9195 -10822 -20294 -4162 32896
4872 32896 27909 24924 26904 15814 2456 8383 -446 -10094 -21941 -31638 -63240 -62650 -22989 -16445
4858 -16445 -27575 -37255 -34818 -31268 -22885 -20503 -23786 -4866 5462 12952 5930 -8095 -3277 17631
4844 17631 31391 15154 4163 -10743 7058 12286 5891 3528 -1418 10365 7502 -2478 -3698
$$ packed form
4938d4054n884j7186l83K3963J7054N996L7247J4180q472p063j8422j3452r681
4925b6157l207J5864N271k4004q49J9299j5391L558K0570L537l1705K693K2706
4912g815L80j9326j4689L84O237P891K0788J6838K5896k0586l2496j7988n27J6185
4898a8828J6019K2905r50l612q872n710q395J0035K1804o032k1834k6597J0128
4885a9939O973j831J4743p974j6590R217K9462J4965j9831k0017r472J6132L7058
4872C2896m987k985J980j1090j3358N927q829r648j1847r697l1602N90L9661O544
4858a6445j1130r680K437L550Q383K382l283J8920J0328P490p022j4025M818K0908
4844A7631J3760j6237j0991j4906J7801N228o395k363m946J1783k863r980j220
$$ plain form
4831 -3698 -8473 -31294 -34431 -25496 -15718 -8920 6121 17337 14235 7645 13513 10913 -7345 -26130
4817 -26130 -14935 6959 -3692 15409 13027 5596 14760 26831 38334 18854 16443 19073 20186
4804 20186 32465 34064 2281 6914 -10525 -4462 13855 32663 42952 21526 7755 -11167
4792 -11167 -9293 8832 20931 20884 33570 33708 29629 23690 35964 28893 38778 55033 39433 21097
4778 21097 20288 25469 19186 7424 -812 8686 3623 -8291 -30187 -39604 -35799 -9015 -17320 -18852
4764 -18852 -19356 3199 17020 26397 37455 40448 18546 16064 14992 25896 18748 3486 5920
4751 5920 -19262 -38347 -50200 -59673 -42667 -46183 -15418 -8071 12707 35286 44449 25365 18961
4738 18961 -5041 -19232 -15512 -6800 -6138 8449 8319 14605 22991 29086 14976 1982 -3517 1066
$$ packed form
4831c698m775k2821l137Q935R778O798J5041J1216l102o590N868k600j8258j8785
4817b6130J1195K1894j0651J9101k382p431R164J2071J1503j9480k411K630J113
4804B0186J2279J599l1783M633j7439O063J8317J8808J0289k1426j3771j8922
4792a1167J874J8125J2099m7J2686J38m079n939J2274p071R885J6255j5600j8336
4778B1097q09N181o283j1762q236R498n063j1914k1896r417L805K6784q305j532
4764a8852n04K2555J3821R377J1058K993k1902k482j072J0904p148j5262K434
4751E920k5182j9085j1853r473J7006l516L0765P347K0778K2579R163j9084o404
4738A8961k4002j4191L720Q712O62J4587j30O286Q386O095j4110j2994n499M583
$$ plain form
4724 1066 -12408 -26672 -1654 18134 -2045 3560 -15729 -18303 -12091 7221 11839 -3489 -2765
4711 -2765 -5643 2086 6792 28766 9183 -2044 2294 -19006 -28248 -28941 -35142 -16098 -5066 -1769
4697 -1769 -17621 -12841 5870 -6110 -17341 -11343 -8355 -26029 -28503 -5534 15937 28406 14520
4684 14520 -4939 147 332 -5347 -27853 -34690 -30798 -25904 -7665 2704 16676 18652 8275
4671 8275 1636 -5608 -1575 -11445 -36091 -38009 -30502 -36014 -49531 -55981 -47955 -27120 -23477 -2376
4657 -2376 25834 24620 17834 28955 28874 27340 8154 9063 18705 20347 21948 29964 39763 19162 12623
4642 12623 15167 7657 -12129 -6969 -8631 1228 -11704 -5471 9474 22334 -3353 15363 12220
4629 12220 -852 -12470 -6003 -5962 -9341 10932 -1804 -17981 -25496 -7263 18220 37798 16371
$$ packed form
4724A066j3474j4264K5018J9788k0179N605j9289k574O212J9312M618j5328P24
4711b765k878P729M706K1974j9583j1227M338k1300r242o93o201J9044J1032L297
4697a769j5852M780J8711j1980j1231N998K988j7674k474K2969K1471J2469j3886
4684A4520j9459N086J85n679k2506o837L892M894J8239J0369J3972J976j0377
4671H275o639p244M033r870k4646j918P507n512j3517o450Q026K0835L643K1101
4657b376K8210j214o786J1121q1j534j9186R09R642J642J601Q016R799k0601o539
4642A2623K544p510j9786N160j662R859j2932O233J4945J2860k5687J8716l143
4629A2220j3072j1618O467M1l379K0273j2736j6177p515J8233K5483J9578k1427
$$ plain form
4616 16371 -3698 -13989 -19665 -17743 -17545 -22280 -28987 -11542 -6154 -8171 -9522 -3158 -10081 -11782
4602 -11782 1419 3381 -16174 -7958 -17509 -39609 -38042 -18221 8296 22544 -9096 -25882 -27517
4589 -27517 -14115 6502 -11153 -4139 10262 -1677 -15948 -1331 -5432 -29195 -32798 -14280
4577 -14280 15421 10875 13031 5753 -13542 -21349 -25844 -33205 2037 15192 -4279 -16230 -41359
4564 -41359 -39731 -29389 -28201 -27616 -15332 -15849 -17447 -9034 -24325 -27139 -2255 2071 24790 45040
4550 45040 21537 7537 10612 14885 -8679 -1 2648 5113 -3130 -17347 -26033 -13135 -9581
4537 -9581 -25220 -17105 9639 10692 2149 -2311 6983 2811 -293 3607 -7856 -4794 -2735 1127
4523 1127 20204 17233 4786 -9844 -2961 -12105 -22579 -17403 -9502 -7617 -24420 -26348 -6023
$$ packed form
4616A6371k0069j0291n676J922J98m735o707J7445N388k017j351O364o923j701
4602a1782J3201J962j9555Q216r551k2100J567J9821K6517J4248l1640j6786j635
4589b7517J3402K0617j7655P014J4401j1939j4271J4617m101k3763l603J8518
4577a4280K9701m546K156p278j9295p807m495p361L5242J3155j9471j1951k5129
4564d1359J628J0342J188N85J2284n17j598Q413j5291k814K4884M326K2719K0250
4550D5040k3503j4000L075M273k3564Q678K649K465q243j4217q686J2898L554
4537i581j5639Q115K6744J053q543m460R294m172l104L900j1463L062K059L862
4523A127J9077k971j2447j4630O883r144j0474N176P901J885j6803j928K0325
$$ plain form
4510 -6023 -15491 -72 -3703 -2059 35300 29655 15094 25085 21838 20676 -10706 -41233 -48041 -38430
4496 -38430 -28004 -12139 -1246 2211 14319 17541 19207 -1789 -2370 -4288 -287 -8108 -17932 -20900
4482 -20900 -18444 -20816 -18015 -22019 4827 19771 11257 7853 13149 -15592 -19640 -29940 -30736 -18083
4468 -18083 1827 -4234 -3910 -6955 -12979 -5129 -8278 -12405 -8177 939 4917 4043 -18743 -17357 -3224
4453 -3224 -10151 -286 5199 16915 20766 22529 -3562 -956 13096 19439 8882 16009 7808 27385
4439 27385 52283 59721 56589 39796 24682 24025 29194 8052 11128 29392 26803 28702 36593 29143
4425 29143 5308 2140 -17237 -20945 1579 13614 9194 -440 -19626 -32899 -40316 -1561 14337
4412 14337 18958 27373 9783 -9464 -6531 9194 13656 27168 14147 -4674 5470 8061 -8417
$$ packed form
4510f023r468J5419l631J644L7359n645j4561R991l247j162l1382l0527o808R611
4496c8430J0426J5865J0893L457J2108L222J666k0996n81j918M001p821r824k968
4482b0900K456k372K801m004K6846J4944q514l404N296k8741m048j0300p96J2653
4468a8083J9910o061L24l045o024P850l149m127M228R116L978q74k2786J386J4133
4453c224o927R865N485J1716L851J763k6091K606J4052O343j0557P127q201J9577
4439B7385K4898P438l132j6793j5114o57N169k1142L076J8264k589J899P891p450
4425B9143k3835l168j9377l708K2524J2035m420r634j9186j3273p417L8755J5898
4412A4337M621Q415j7590j9247K933J5725M462J3512j3021j8821J0144K591j6478
$$ plain form
4399 -8417 -1395 -6573 3406 22693 36593 19450 15013 13515 -8237 -7518 -1402 -22056 -29793 -1359
4385 -1359 4203 -18366 -14364 -28625 -30508 -30425 -30419 -12231 15230 25463 22528 9288 215 11740
4371 11740 29233 49040 34223 5178 24591 39867 30070 21438 26270 17863 6003 -17549 -26388
4358 -26388 -9363 495 -22512 -21840 -5543 -19582 -9495 4083 11535 23547 19231 17348 29971
$$ packed form
4399h417P022n178R979J9287J3900j7143m437j498k1752P19O116k0654p737K8434
4385a359N562k2569M002j4261j883Q3OJ8188K7461J0233k935j3240r073J1525
4371A1740J7493J9807j4817k9045J9413J5276r797q632M832q407j1860k3552q839
4358b6388J7025R858k3007O72J6297j4039J0087J3578P452J2012m316j883J2623
$$ [...]
##END NTUPLES=NMR SPECTRUM
##END=
