##TITLE=Analysis number 307207
Compound Code cc 35646
Book Reference 433/19/4
Project Code adrs
Chemist Name victoriam
##JCAMPDX= 6.0         $$ Bruker NMR JCAMP-DX V2.0
##DATA TYPE= NMR SPECTRUM
##DATA CLASS= NTUPLES
##ORIGIN= Bruker BioSpin GmbH
##OWNER= NMR
$$ XWIN-NMR		Version 3.5
$$ Mon Apr 25 08:55:29 2005 GMT Daylight Time (UT+1h)  MAYBRIDGE\NMR@NMR_250MHZ
##.OBSERVE FREQUENCY= 250.131544655141
##.OBSERVE NUCLEUS= ^1H
##.ACQUISITION MODE= SIMULTANEOUS (DQD)
##.ACQUISITION SCHEME= undefined
##.AVERAGES= 16
##.DIGITISER RES= 18
##SPECTROMETER/DATA SYSTEM= dpx250
##.PULSE SEQUENCE= zg30
##.SOLVENT NAME= CDCl3
##.SHIFT REFERENCE= (INTERNAL, CDCl3, 0, 16.522)
##AUDIT TRAIL= $$ (NUMBER, WHEN, WHO, WHERE, WHAT)
$$ ##TITLE= Audit trail, XWIN-NMR		Version 3.5
$$ ##JCAMPDX= 5.01
$$ ##ORIGIN= Bruker BioSpin GmbH
$$ ##OWNER= NMR
$$ C:\u/data/dgb/nmr/ADRS/2100/pdata/1/auditp.txt
$$ ##AUDIT TRAIL=  $$ (NUMBER, WHEN, WHO, WHERE, WHAT)
(   1,<2005-04-25 08:55:10.87 +100>,<MAYBRIDGE\NMR>,<NMR_250MHZ>,
      <created by zg, POWCHK disabled, PULCHK disabled
       configuration hash MD5:
       62 19 C7 07 E1 42 D1 B7 37 6C 3D D0 77 39 F9 E6
       data hash MD5: 64K
       1B F7 3B 32 A5 D9 B4 A9 22 A6 7A 2F 8A BD 61 FB>)
(   2,<2005-04-25 08:55:21.62 +100>,<MAYBRIDGE\NMR>,<NMR_250MHZ>,
      <Start of raw data processing
       ef LB = 0.3 FT_mod = 6 PKNL = 1 SI = 32K 
       data hash MD5: 32K
       75 F2 19 1E 34 17 CE F0 59 46 C9 FC A3 AF E5 20>)
(   3,<2005-04-25 08:55:23.41 +100>,<MAYBRIDGE\NMR>,<NMR_250MHZ>,
      <apk 
       data hash MD5: 32K
       62 13 10 5E F3 81 06 1E 3F E3 2A 07 4E 21 1C 4A>)
(   4,<2005-04-25 08:55:24.10 +100>,<MAYBRIDGE\NMR>,<NMR_250MHZ>,
      <abs ABSG = 5 
       data hash MD5: 32K
       D5 EF 7E 47 53 FE F8 03 C5 56 80 F8 9F 0C 16 14>)
$$ ##END=
$$ 
$$ hash MD5
$$ 4F B3 9D 57 DD 05 78 1E 3A 30 B9 DB 61 E7 4D DC
##$RELAX= 
##$RELAX= 
##$RELAX= 
##$RELAX= 
##$RELAX= 
##$RELAX= 
##$RELAX= 
$$ Bruker specific parameters
$$ --------------------------
##$DU= <C:\u>
##$EXPNO= 2100
##$NAME= <ADRS>
##$PROCNO= 1
##$TYPE= <nmr>
##$USER= <dgb>
##$AMP= (0..31)
100 100 100 100 100 100 100 100 100 100 100 100 100 100 100 100 100 100 
100 100 100 100 100 100 100 100 100 100 100 100 100 100 
##$AQSEQ= 0
##$AQ_mod= 3
##$AUNM= <au_zg>
##$AUTOPOS= <4 >
##$BF1= 250.13
##$BF2= 250.13
##$BF3= 250.13
##$BF4= 250.13
##$BF5= 500.13
##$BF6= 500.13
##$BF7= 500.13
##$BF8= 500.13
##$BYTORDA= 1
##$CFDGTYP= 0
##$CFRGTYP= 5
##$CHEMSTR= <none>
##$CNST= (0..31)
1 1 145 1 1 1 1 1 1 1 1 1 1 1 1 1 1 1 1 1 1 1 1 1 1 1 1 1 1 1 1 1 
##$CPDPRG= <>
##$CPDPRG1= <>
##$CPDPRG2= <>
##$CPDPRG3= <>
##$CPDPRG4= <mlev>
##$CPDPRG5= <mlev>
##$CPDPRG6= <mlev>
##$CPDPRG7= <mlev>
##$CPDPRG8= <mlev>
##$CPDPRGB= <>
##$CPDPRGT= <>
##$D= (0..31)
0 1 0 0 0 0 0 0 0 0.06 0 0 0 0 0 0 0.0002 0 0 0 0 0 0 0 0 0 0 0 0 0 0 
0 
##$DATE= 1114415710
##$DBL= (0..7)
120 120 120 120 120 120 120 120 
##$DBP= (0..7)
150 150 150 150 150 150 150 150 
##$DBP07= 0
##$DBPNAM0= <>
##$DBPNAM1= <>
$$ [...]
##$SUBNAM7= <"">
##$SUBNAM8= <"">
##$SUBNAM9= <"">
##$SW= 20.6930455092707
##$SWIBOX= (0..15)
0 0 3 0 0 0 0 0 0 0 0 0 0 0 0 0 
##$SW_h= 5175.983436853
##$TD= 65536
##$TD0= 1
##$TE= 295.16
##$TE2= 300
##$TE3= 300
##$TEG= 300
##$TL= (0..7)
0 120 120 120 120 120 120 120 
##$TP= (0..7)
150 150 150 150 150 150 150 150 
##$TP07= 0
##$TPNAME0= <>
##$TPNAME1= <>
##$TPNAME2= <>
##$TPNAME3= <>
##$TPNAME4= <>
##$TPNAME5= <>
##$TPNAME6= <>
##$TPNAME7= <>
##$TPOAL= (0..7)
0.5 0.5 0.5 0.5 0.5 0.5 0.5 0.5 
##$TPOFFS= (0..7)
0 0 0 0 0 0 0 0 
##$TUNHIN= 0
##$TUNHOUT= 0
##$TUNXOUT= 0
##$USERA1= <user>
##$USERA2= <user>
##$USERA3= <user>
##$USERA4= <user>
##$USERA5= <user>
##$V9= 5
##$VALIST= <valist>
##$VCLIST= <CCCCCCCCCCCCCCC>
##$VD= 0
##$VDLIST= <DDDDDDDDDDDDDDD>
##$VPLIST= <PPPPPPPPPPPPPPP>
##$VTLIST= <TTTTTTTTTTTTTTT>
##$WBST= 1024
##$WBSW= 4
##$XGAIN= (0..3)
0 0 0 0 
##$XL= 0
##$YL= 0
##$YMAX_a= 623043
##$YMIN_a= -512420
##$ZGOPTNS= <>
##$ZL1= 120
##$ZL2= 120
##$ZL3= 120
##$ZL4= 120
##$ABSF1= 16.522
##$ABSF2= -4.171173
##$ABSG= 5
##$ABSL= 3
##$ALPHA= 0
##$AQORDER= 0
##$ASSFAC= 0
##$ASSFACI= 0
##$ASSFACX= 0
##$ASSWID= 0
##$AUNMP= <proc_1d>
##$AZFE= 0.1
##$AZFW= 0.1
##$BCFW= 0
##$BC_mod= 0
##$BYTORDP= 0
##$COROFFS= 0
##$CY= 12.5
##$DATMOD= 1
##$DC= 0
##$DFILT= <>
##$DTYPP= 0
##$F1P= 14.0000005364418
##$F2P= -0.99999901652339
##$FCOR= 0.5
##$FTSIZE= 32768
##$FT_mod= 6
##$GAMMA= 0
##$GB= 0
##$INTBC= 1
##$INTSCL= 1
##$ISEN= 128
##$LB= 0.3
##$LEV0= 0
##$LPBIN= 0
##$MAXI= 10000
##$MC2= 0
##$MEAN= 0
##$ME_mod= 0
##$MI= 0
##$NCOEF= 0
##$NC_proc= -3
##$NLEV= 6
##$NOISF1= 0
##$NOISF2= 0
##$NSP= 0
##$NTH_PI= 0
##$NZP= 0
##$OFFSET= 16.522
##$PC= 1
##$PHC0= -76.77702
##$PHC1= 8.871805
##$PH_mod= 1
##$PKNL= yes
##$PPARMOD= 0
##$PSCAL= 4
##$PSIGN= 0
##$REVERSE= no
##$SF= 250.13
##$SI= 32768
##$SIGF1= 0
##$SIGF2= 0
##$SINO= 400
##$SIOLD= 32768
##$SREGLST= <1H.CDCl3>
##$SSB= 0
##$STSI= 32768
##$STSR= 0
##$SW_p= 5175.98343685301
##$SYMM= 0
##$S_DEV= 0
##$TDeff= 65536
##$TDoff= 0
##$TI= <Analysis number 999999
Compound Code 99
Book Reference 9
Project Code 9>
##$TILT= no
##$TM1= 0
##$TM2= 0
##$TOPLEV= 0
##$USERP1= <user>
##$USERP2= <user>
##$USERP3= <user>
##$USERP4= <user>
##$USERP5= <user>
##$WDW= 1
##$XDIM= 32768
##$YMAX_p= 325873601
##$YMIN_p= -65710
$$ End of Bruker specific parameters
$$ ---------------------------------
##NTUPLES= NMR SPECTRUM
##VAR_NAME=  FREQUENCY,     SPECTRUM/REAL,   SPECTRUM/IMAG
##SYMBOL=    X,             R,               I
##VAR_TYPE=  INDEPENDENT,   DEPENDENT,       DEPENDENT
##VAR_FORM=  AFFN,          ASDF,            ASDF
##VAR_DIM=   32768,         32768,           32768
##UNITS=     HZ,            ARBITRARY UNITS, ARBITRARY UNITS
##FACTOR=    0.157963299565203, 1,           1
##FIRST=     4132.6476996994, 0,             0
##LAST=      -1043.33573715361, 0,           0
##MIN=       -1043.33573715361, -65710,      0
##MAX=       4132.6476996994, 325873601,     0
$$ Real data points
##PAGE= N=1
##DATA TABLE= (X++(R..R)), XYDATA
$$ [...]
$$ plain form
16688 -26435 -20831 -33519 -38168 -27043 -39403 -34845 -26809 -27749 -30224 -30800 -34732 -24843 -24288 -22021
16674 -22021 -13758 -11376 -18689 -11840 -9823 -22119 -29821 -27155 -31762 -25002 -20949 -35526 -39323 -35246
16660 -35246 -22234 -11573 -17374 -24048 -25964 -27160 -20885 -20454 -24192 -11989 -16639 -24014 -34548 -44452
16646 -44452 -39104 -17906 -17732 -26427 -29487 -31839 -15283 -14528 -6956 -14199 -31721 -19789 -9755 -15083
16632 -15083 -32815 -37617 -27023 -19489 -8830 -460 -5868 -8577 -13748 -29228 -32428 -29195 -24686
16619 -24686 -14342 -18912 -14195 -16780 -23944 -27424 -13528 -5734 -3523 -18123 -37086 -21120 -6486
16606 -6486 -3036 3166 186 -17232 -30809 -18894 -14945 -9448 5471 5301 -4973 -21082 -20759 -10874
16592 -10874 -17453 -22910 -18383 -31465 -29328 -16703 -14934 -10382 -9739 -9796 -15723 -15390 -23747 -12361 -10173
$$ packed form
16688b6435N604j2688m649J1125j2360M558Q036r40k475n76l932R889N55K267
16674b2021Q263K382p313O849K017j2296p702K666m607O760M053j4577l797M077
16660c5246J3012J0661n801o674j916j196O275M31l738J2203m650p375j0534r904
16646d4452N348K1198J74q695l060k352J6556P55P572p243j7522J1932J0034n328
16632a5083j7732m802J0594P534J0659Q370n408k709n171j5480l200L233M509
16619b4686J0344m570M717k585p164l480J3896P794K211j4600j8963J5966J4634
16606f486L450O202k980j7418j3577J1915L949N497J4919j70j0274j6109L23R885
16592a0874o579n457M527j3082K137J2625J769M552O43n7n927L33q357J1386K188
$$ plain form
16577 -10173 -19857 -40008 -53870 -57353 -44911 -35087 -27633 -23683 -17533 -8012 -18207 -20889 -24884
16564 -24884 -31496 -43993 -41407 -38268 -44033 -52280 -51297 -38576 -36412 -56182 -50654 -45250 -43283 -39645
16550 -39645 -41213 -37040 -36646 -40374 -43354 -40310 -37565 -31808 -31653 -36872 -38234 -39540 -34246 -34404 -37631
16535 -37631 -34494 -30947 -18310 -10409 -21205 -30910 -39290 -37988 -26435 -13047 -15247 -11688 -12154 -7017
16521 -7017 -5564 -11037 -16394 -12710 -2411 61 -297 -10842 -14440 -12093 -21456 -35512 -32754 -29852
16507 -29852 -38133 -16565 -14960 -20315 -15133 -17969 -20192 -14858 -7418 828 -4520 -10052 -24063 -28378
16493 -28378 -20800 -18727 -12275 -12480 -22972 -16931 304 -7451 -19563 -12423 -6676 -13147 -12461 -17384
16479 -17384 -21994 -27189 -18267 -13631 -9073 -16142 -28807 -23179 -14225 -16495 -14630 -7242 -6678 -15299
$$ packed form
16577a0173r684k0151j3862l483J2442R824P454L950O150R521j0195k682l995
16564b4884o612j2497K586L139n765q247R83J2721K164j9770N528N404J967L638
16550c9645j568M173L94l728k980L044K745N757J55n219j362j306N294j58l227
16535c7631L137L547J2637P901j0796r705q380J302J1553J3388k200L559m66N137
16521g017J453n473n357L684J0299K472l58j0545l598K347r363j4056K758K902
16507b9852q281K1568J605n355N182k836k223N334P440Q246n348n532j4011m315
16493b8378P578K073O452k05j0492O041J7235p755j2112P140N747o471O86m923
16479a7384m610n195Q922M636M558p069j2665N628Q954k270J865P388N64q621
$$ plain form
16465 -15299 -20685 -26796 -26360 -23704 -28728 -32566 -20959 -11200 -13474 -18425 -13942 -19572 -35827 -31173
16451 -31173 -32871 -25033 -17293 -19200 -21730 -23936 -31338 -33444 -29626 -31288 -39681 -41132 -25039 -28499
16437 -28499 -29074 -30908 -31918 -22863 -18035 -15340 -6806 -791 657 -6883 -13976 -18658 -10414 -9101 -25084
16422 -25084 -28983 -1399 4677 8826 7873 7292 -9291 -23459 -18734 -18047 -22339 -36967 -39136 -26148
16408 -26148 -24571 -28672 -27207 -25369 -27727 -25716 -24623 -20605 -3521 -683 -7859 -25124 -24833 -26040
16394 -26040 -31846 -22782 -23998 -31576 -37809 -30752 -17877 -13724 -21865 -17504 -10075 -13982 -16283 -19140
16380 -19140 -22207 -24908 -11439 3122 -1513 -7437 -6739 -1408 1503 -4914 -15923 -7068 2236 3741
16366 3741 2404 -10574 -19907 -8184 -14342 -31175 -33566 -27417 -25636 -17437 -15610 -9959 -3994 -11142
$$ packed form
16465a5299n386o111M36K656n024l838J1607R759k274m951M483n630j6255M654
16451c1173j698P838P740j907k530k206p402k106L818j662q393j451J6093l460
16437b8499n75j834j010R055M828K695Q534O015J448p540p093m682Q244J313j5983
16422b5084l899K7584O076M149r53n81j6583j4168M725O87m292j4628k169J2988
16408b6148J577m101J465J838k358K011J093M018J7084K838p176j7265K91j207
16394b6040n806R064j216p578o233P057J2875M153q141M361P429l907k301k857
16380a9140l067k701J3469J4561m635n924O98N331K911o417j1009Q855R304J505
16366C741j337j2978r333J1723o158j6833k391O149J781Q199J827N651N965p148
$$ plain form
16352 -11142 -34663 -40624 -18391 -11523 -8646 -8531 -3358 -12089 -23354 -26729 -28489 -27195 -22442 -14440
16338 -14440 -24733 -18445 -16956 -14975 -21021 -22795 -22547 -14569 -4992 -20555 -8821 -1746 -745 -5156
16324 -5156 -24119 -19771 -8590 -3644 -6923 -8097 -25235 -26930 -27276 -40696 -39667 -26548 -21874 -25958
16310 -25958 -24951 -14866 -16929 -18123 -14720 -17670 -24308 -19808 -23299 -13577 -20447 -25406 -28486 -20606
16296 -20606 -22140 -21591 -17482 -19026 -23209 -37776 -38632 -37923 -30713 -30401 -24798 -17768 -26997 -35738 -39681
16281 -39681 -41963 -33292 -10999 -9523 -22949 -37873 -30814 -25793 -28557 -29312 -24210 -27059 -29609 -29417
16267 -29417 -25268 -24804 -31532 -35389 -31955 -25912 -27120 -26112 -26495 -26378 -24777 -28669 -21444 -17226 -14747
16252 -14747 -20418 -21198 -23697 -33477 -31371 -20329 -20989 -28251 -30689 -37409 -35122 -19645 -17965 -19281
$$ packed form
16352a1142k3521n961K2233O868K877J15N173q731j1265l375j760J294M753Q002
16338a4440j0293O288J489J981o046j774K48P978R577j5563J1734P075J001m411
16324e156j8963M348J1181M946l279j174j7138j695l46j3420J029J3119M674m084
16310b5958J007J0085k063j194L403k950o638M500l491R722o870m959l080P880
16296b0606j534N49M109j544m183j4567q56P09P210L12N603P030r229q741l943
16281c9681k282Q671K2293J476j3426j4924P059N021k764p55N102k849k550J92
16267b9417M149M64o728l857L434O043j208J008l83J17J601l892P225M218K479
16252a4747n671p80k499r780K106J1042o60p262k438o720K287J5477J680j316
$$ plain form
16238 -19281 -35073 -43543 -39040 -30131 -25101 -36734 -31483 -24519 -28910 -34339 -31944 -13499 -9218 -9652
16224 -9652 -18601 -26292 -26575 -17782 -10617 -22528 -38425 -38113 -30000 -14610 -10265 -12180 -12653 -18858 -16724
16209 -16724 -15528 -15039 -10943 -8895 -2966 -6300 -23926 -26514 -33216 -32528 -31023 -33595 -29173 -16017
16195 -16017 -6214 -1614 2201 -2367 -6683 -10233 -11429 -2360 -3667 -119 -7677 -22861 -30010 -31996
16181 -31996 -29105 -18520 -7599 -13262 -15438 4446 3407 -311 -6312 -22372 -32972 -38087 -46978
16168 -46978 -43368 -28389 -10745 -10761 -9541 -18559 -21077 -20602 -20492 -21936 -26920 -31914 -15465 -9909 776
16153 776 558 -1451 -6338 -19074 -28845 -32655 -32377 -27187 -27417 -31261 -32278 -27307 -26548 -31433 -35627 -31970
16137 -31970 -32141 -20864 1017 -5359 -24964 -34760 -36503 -37473 -37824 -35743 -39584 -37044 -31216 -37031
$$ packed form
16238a9281j5792q470M503Q909N030j1633N251O964m391n429K395J8445M281m34
16224i652q949p691k83Q793P165j1911j5897L12Q113J5390M345j915m73o205K134
16209a6724J196M89M096K048N929l334j7626k588o702O88J505k572M422J3156
16195a6017R803M600L815m568m316l550j196R069j307L548p558j5184p149j986
16181c1996K891J0585J0921n663k176J9884j039l718o001j6060j0600n115q891
16168d6978L610J4979J7644j6J220r018k518M75J10j444m984m994J6449N556J0685
16153G76k18k009m887j2736r771l810K78N190k30l844j017M971P59m885m194L657
16137c1970j71J1277K1881o376j9605r796j743r70l51K081l841K540N828n815
$$ plain form
16123 -37031 -33399 -35513 -35698 -38867 -37930 -30819 -23309 -19996 -8897 -5925 -12005 -20230 -31222 -38923
16109 -38923 -45517 -39989 -23723 -16263 -16829 -22428 -25354 -19754 -23530 -19887 -18921 -34000 -46638 -45959
16095 -45959 -40046 -24137 -12529 -7166 -15473 -12282 -11615 -8512 -18409 -28950 -27857 -22908 -21221 -25738
16081 -25738 -31997 -22843 -34026 -42636 -34927 -22827 -14844 -4587 -12366 -35590 -43955 -32100 -19399
16068 -19399 -21588 -27094 -26944 -17983 -5624 -8909 -18745 -20239 -22921 -22525 -23441 -27616 -17626 -17657 -20277
16053 -20277 -24319 -19428 -9096 -12443 -18427 -23000 -32298 -39709 -21156 -12238 -16272 -34363 -38311 -25698
16039 -25698 -19239 -21675 -28747 -31334 -34011 -19836 -25240 -29225 -27935 -30966 -33507 -22122 -9253 -10006
16025 -10006 -3475 5698 838 -3282 3763 -15477 -23050 -30480 -42154 -44225 -33133 -32024 -24259 -12889
$$ packed form
16123c7031L632k114j85l169R37P111P510L313J1099K972o080q225j0992p701
16109c8923o594N528J6266P460n66n599k926N600l776L643R66j5079j2638O79
16095d5959N913J5909J1608N363q307L191O67L103r897j0541J093M949J687m517
16081b5738o259R154j1183q610P709J2100P983J0257p779k3224q365J1855J2701
16068a9399k189n506J50Q961J2359l285r836j494k682L96r16m175R990l1k620
16053b0277m042M891J0332l347n984m573r298p411J8553Q918m034j8091l948J2613
16039b5698O459k436p072k587k677J4175n404l985J290l031k541J1385J2869p53
16025a0006O531R173m860m120P045j9240p573p430j1674k071J1092J109P765J1370
$$ plain form
16011 -12889 -16991 -27146 -25627 -20923 -34063 -44592 -37887 -27401 -29875 -33712 -40897 -37022 -25609
15998 -25609 -22024 -15774 -11060 -7657 167 5136 33 -6699 -17876 -17962 -29201 -33948 -32379 -26690
15984 -26690 -36455 -41946 -37539 -25486 -11936 1430 -3776 -4173 -2276 -13191 -22249 -21755 -18981 -19297
15970 -19297 -30326 -30438 -17330 -11595 -14934 -22863 -23950 -18638 -12276 -13098 -7253 -18738 -37826 -42040
15956 -42040 -39860 -28726 -6844 -6326 -17038 -11691 -6624 1850 3525 -774 -1638 -12344 -13238 -15146
15942 -15146 -4199 -5708 -9837 -7026 1915 -10163 -27893 -37708 -31497 -38602 -25758 -15220 -25888
15929 -25888 -12731 12371 24258 20917 7924 4085 2040 -4635 -8569 3671 4443 572 -15414
15916 -15414 -16783 -16637 -11214 -7771 -11112 -11039 -6141 -3278 1131 -2493 -15446 -8486 -6891 -1043 7365
$$ packed form
16011a2889m102j0155J519M704j3140j0529O705J0486k474l837p185L875J1413
15998b5609L585O250M714L403P824M969n103o732j1177q6j1239m747J569N689
15984b6690r765n491M407J2053J3550J3366n206l97J897j0915r058M94K774l16
15970a9297j1029j12J3108N735l339p929j087N312O362q22N845j1485j9088m214
15956d2040K180J1134K1882N18j0712N347N067Q474J675m299q64j0706q94j908
15942a5146J0947j509m129K811Q941j2078j7730r815O211p105J2844J0538j0668
15929b5888J3157K5102J1887l341j2993l839k045o675l934J2240P72l871j5986
15916a5414j369J46N423L443l341P3M898K863M409l624j2953O960J595N848Q408
$$ plain form
15901 7365 3431 2504 14037 10969 355 -5164 -2707 -2048 8 5659 7135 -10050 -16969 -7862
15887 -7862 -11897 -30728 -34334 -26772 -26303 -24268 -28163 -22967 -21076 -8877 -9139 -7957 -6088 -14234 -6785
15872 -6785 -5734 -14175 -23917 -25097 -16187 -8781 -235 6614 19643 7640 -439 -12881 -21680 -17807
15858 -17807 -15411 -27275 -35576 -38341 -29372 -10570 -11842 -26912 -22240 -16293 -27878 -18587 -5692
15845 -5692 -3593 1255 -9906 -28874 -30185 -22159 -18038 -17427 -19301 -24959 -47690 -50347 -55421 -50537
15831 -50537 -49359 -65043 -59946 -52705 -43374 -26590 -27345 -38967 -30438 -29230 -28030 -15034 -5815 -11966
15817 -11966 -12380 -15938 -9868 -11770 -20352 -22705 -23978 -33610 -28918 -24002 -15828 -7469 -14684 -17808 -12194
15802 -12194 -5222 -12290 -23802 -39120 -41212 -33865 -26365 -25765 -27964 -21357 -11604 -20587 -32232 -34509
$$ packed form
15901G365l934r27J1533l068j0614n519K457O59K056N651J476j7185o919R107
15887g862m035j8831l606P562M69K035l895N196J891J2199k62J182J869q146P449
15872f785J051q441r742j180Q910P406Q546O849J3029j2003q079j2442q799L873
15858a7807K396j1864q301k765Q969J8802j272j5070M672N947j1585R291J2895
15845e692K099M848j1161j8968j311Q026M121O11j874n658k2731k657n074M884
15831e0537J178j5684N097P241R331J6784p55j1622Q529J208J200J2996R219o151
15817a1966m14l558O070j902q582k353j273r632M692M916Q174Q359p215l124N614
15802a2194O972p068j1512j5318k092P347P500O00k199O607R753q983j1645k277
$$ plain form
15788 -34509 -28887 -18823 -25027 -25795 -30633 -31758 -25496 -16967 -17646 -13694 -17714 -8178 -9234 -20616
15774 -20616 -13234 -10082 -14581 -11319 -16167 -17971 -16906 -16835 -18557 -21428 -23105 -35588 -46956 -40677
15760 -40677 -28474 -41084 -49640 -37062 -14219 -10665 -6025 -9676 -9584 -13039 -20502 -25415 -22832 -12249
15746 -12249 1734 10002 13053 -594 -17234 -17597 -21046 -29786 -13501 3569 -4491 -16404 -23674
15733 -23674 -20260 -19004 -24963 -43881 -56202 -42408 -34700 -26799 -17004 -16518 -15191 -9265 -5574 -7775
15719 -7775 -20734 -20253 -17495 -18659 -21970 -24570 -25558 -13660 -4808 -708 -2169 -23673 -33509 -5799
15705 -5799 -3280 5747 22148 9647 -5819 -8188 -26545 -25809 -31270 -43339 -48684 -49374 -32236 -31042
15691 -31042 -23467 -21221 -21066 -20247 -23091 -23324 -24834 -28639 -30121 -38862 -31670 -17569 -10368 -7204 -17509
$$ packed form
15788c4509N622J0064o204p68m838j125O262Q529o79L952m020R536j056j1382
15774b0616P382L152m499L262m848j804J065P1j722k871j677j2483j1368O279
15760d0677J2203j2610q556J2578K2843L554M640l651R2l455p463m913K583J0583
15746a2249J3983Q268L051j3647j6640l63l449q740J6285J7070q060j1913p270
15733b3674L414J256n959j8918j2321J3794P708P901R795M86J327N926L691k201
15719g775j2959M81K758j164l311k600r88J1898Q852M100j461k1504r836K7710
15705e799K519R027J6401j2501j5466k369j8357P36n461j2069n345o90J7138J194
15691c1042P575K246J55Q19k844k33j510l805j482q741P192J4101P201L164j0305
$$ plain form
15676 -17509 -19162 -16034 -19700 -22916 -11093 11397 12020 -1653 1265 -2529 -11626 -19876 -14507 -16475
15662 -16475 -19482 -37873 -33206 -30357 -36107 -27501 -30707 -24493 -13602 -14431 -10298 -5065 -5556 -4950 -14267
15647 -14267 -28097 -15164 -7919 -12401 -16388 -25049 -31338 -16957 -1865 12937 6165 -11944 -14239
15634 -14239 -18619 -17244 -14850 -8897 -3743 -5530 -10989 -15562 -26092 -21827 -16984 -8781 -12940 -13715
15620 -13715 -29323 -29194 -29994 -25018 -12740 -13991 -12940 -11925 -14690 -19728 -32358 -34682 -36063 -39421
15606 -39421 -24461 -23559 -25360 -25199 -23196 -28887 -45180 -45349 -36425 -15186 -3459 -2739 -3970 -10176
15592 -10176 -24478 -23761 -10170 729 4384 -4431 -7631 -8811 -8318 -6120 -7887 -10405 -4408 -6132
15578 -6132 -13899 -24345 -26514 -12068 2952 99 1743 -16104 -12728 5428 -3182 -26269 -23503
$$ packed form
15676a7509j653L128l666l216J1823K2490O23j3673K918l794r097q250N369j968
15662a6475l007j8391M667K849n750Q606l206O214J0891q29M133N233m91O06r317
15647a4267j3830J2933P245m482l987q661o289J4381J5092J4802o772j8109k295
15634a4239m380J375K394N953N154j787n459m573j0530M265M843Q203m159p75
15620a3715j5608J29q00M976J2278j251J051J015k765n038j2630k324j381l358
15606c9421J4960R02j801J61K003n691j6293j69Q924K1239J1727P20j231o206
15592a0176j4302P17J3591J0899L655q815l200j180M93K198j767k518N997j724
15578f132p767j0446k169J4446J5020k853J644j7847L376J8156q610k3087K766
$$ plain form
15565 -23503 -14567 -13270 -17108 -7528 -11190 -6203 -2757 -3930 -12546 -9158 -13216 -18074 -27897 -29962
15551 -29962 -28247 -32365 -26834 -16492 -9499 -14978 -16776 -5445 -1798 -10315 -13659 -25441 -18945 -19911
15537 -19911 -9729 -4389 -3924 -1336 -8846 -16823 -7935 -9724 -1811 -5976 -11378 -10965 -13846 -26907
15523 -26907 -28036 -19359 -18606 -15809 -10686 -24977 -21736 -20494 -24478 -18885 -11268 -3503 3649 14864
15509 14864 16827 9214 1630 -1285 -985 -17988 -12127 -4491 -9735 -16339 -22932 -16612 -9758 -15433
15495 -15433 -26018 -32016 -37585 -36537 -46867 -43094 -39564 -34952 -24685 -33181 -35274 -29658 -26551 -19662
15481 -19662 -5537 -15352 -32609 -46093 -46682 -29124 -9696 -261 -166 -12211 -9690 -4398 -12914 -23480
15467 -23480 -38103 -34109 -21723 -26335 -20511 -12300 2791 -3608 -11290 -16258 -18149 -15352 -20508 -20919
$$ packed form
15565b3503Q936J297l838R580l662M987L446j173q616L388m058m858r823k065
15551b9962J715m118N531J0342O993n479j798J1331L647q517l344j1782O496r66
15537a9911J0182N340M65K588p510p977Q888j789P913m165n402M13k881j3061
15523b6907j129Q677P53K797N123j4291L241J242l984N593P617P765P152J1215
15509A4864J963p613p584k915L00j7003N861P636n244o604o593O320O854n675
15495a5433j0585n998n569J048j0330L773L530M612J0267q496k093N616L107O889
15481a9662J4125r815j7257j3484n89J7558J9428R435R5j2045K521N292q516j0566
15467b3480j4623L994J2386m612N824Q211J5091o399p682m968j891K797n156m11
$$ plain form
15453 -20919 -908 -16262 -27705 -25240 -14574 -4236 -8255 -13657 -6497 495 4496 -14447 -14286
15440 -14286 1302 -7085 -12933 -19837 -19468 -21009 -11820 569 -7536 -12212 -5507 -20825 -26539 -27413
15426 -27413 -29765 -17945 -17495 -10554 -12392 -20640 -25368 -18101 -20955 -18580 -20103 -16628 -16077 -25675 -20552
15411 -20552 -20575 -28289 -34828 -25411 -15339 -24770 -17048 -536 -15783 -24467 -6956 -310 -16825 -19694
15397 -19694 -13153 -12871 -14603 -19849 -21537 -26981 -25060 -23201 -11306 -12987 85 -326 -14313 -28164
15383 -28164 -39588 -40104 -46426 -49816 -46918 -38861 -29099 -16120 -1656 -7537 -28034 -37244 -29648 -24801
15369 -24801 -18070 -18415 -23219 -20835 -35947 -39322 -49343 -36076 -14216 6733 7346 8718 10436 1513
15355 1513 -5467 17 -8986 -7773 6917 3657 4411 190 706 -4285 -1316 -5132 -13793 -16351 -9094
$$ packed form
15453b0919K0011j5354j1443K465J0666J0338m019n402P160O992M001j8943J61
15440a4286J5588q387n848o904L69j541R189J2389q105m676O705j5318n714q74
15426b7413k352J1820M50O941j838q248m728P267k854K375j523L475N51r598N123
15411b0552k3p714o539R417J0072r431P722J6512j5247q684J7511O646j6515k869
15397a9694O541K82j732n246j688n444J921J859J1895j681J3072m11j3987j3851
15383b8164j1424n16o322l390K898Q057R762J2979J4464n881k0497r210P596M847
15369b4801O731l45m804K384j5112l375j0021J3267K1860K0949O13J372J718q923
15355A513o980N484r003J213J4690l260P54m221N16m991K969l816q661k558P257
$$ plain form
15340 -9094 -16936 -18241 -26502 -37810 -34412 -28184 -32657 -23505 -11216 -9058 1960 -8525 -11820 -9231
15326 -9231 -28253 -17442 -7651 -24117 -14087 -9461 -21755 -35584 -37381 -30516 -26184 -6758 2037
15313 2037 -4165 -15724 -17072 -13123 -3766 -7815 -2279 -1306 -9924 6313 3597 -12086 -8179 -6963
15299 -6963 -10459 -23978 -26696 -30279 -22623 -28200 -29143 -25271 -22201 -24959 -25442 -24280 -28483 -18165 -12948
15284 -12948 -11507 -20776 -24825 -16379 -8321 -8202 -5634 -20655 -25470 -28200 -23933 -24690 -17516 -15557 -22897
15269 -22897 -36721 -15899 -1623 477 9730 5987 -11269 -20777 -3175 17328 20755 11607 3462
15256 3462 -2910 -9922 -16319 -24902 -25841 -30006 -24686 -18269 -18115 -9855 3536 14306 12531 17211 10851
15241 10851 6924 14717 7391 -9281 -17348 -10350 -1253 9354 2734 -7157 -1838 -1078 -11351 -15432
$$ packed form
15340i094p842j305q261j1308L398O228m473R152J2289K158J1018j0485l295K589
15326i231j9022J0811R791j6466J0030M626j2294j3829j797O865M332J9426Q795
15313B037o202j1559j348L949R357m049N536R73q618J6237k716j5683L907J216
15299f963l496j3519k718l583P656n577r43L872L070k758m83J162m203J0318N217
15284a2948J441r269m049Q446Q058J19K568j5021m815k730M267p57P174J959p340
15269b2897j3824K0822J4276K100R253l743j7256r508J7602K0503L427r148q145
15256C462o372p012o397q583r39m165N320O417J54Q260J3391J0770j775M680o360
15241A0851l927P793p326j6672q067O998R097J0607o620r891N319P60j0273m081
$$ plain form
15227 -15432 -8100 1229 -11291 -11711 12207 8859 -3706 -8664 -11249 -24351 -15338 -1740 15038
15214 15038 14869 -2062 -10518 -16658 -16353 -8290 -8285 -11973 -12019 -8057 -11684 -17507 -12744 -557 -2346 -13319
15198 -13319 -24593 -25085 -8692 -8352 -18731 -17780 -12376 -17202 -21695 -18721 -25383 -31423 -27617 -21918
15184 -21918 -11169 -4549 -6904 3201 5212 -1179 -6167 -10284 -3362 -11848 -11444 -15590 -11134 -5403
15170 -5403 -12072 -17715 -36748 -35178 -39719 -42029 -40691 -34582 -20044 -16469 -21770 -13457 -12586 -7292
15156 -7292 8200 18793 26711 7785 3078 -2578 5956 -3279 -11936 -15157 -12322 -10225 6017 11563
15142 11563 9140 4421 -9564 -16912 -28245 -36014 -41362 -24429 -12080 6181 7694 -42 1126
15129 1126 -2816 1595 2876 -27063 -34228 -22930 -23254 -29498 -30276 -26997 -18320 -32331 -36434 -23371
$$ packed form
15227a5432P332R329j2520m20K3918l348j2565m958k585j3102R013J3598J6778
15214A5038j69j6931q456o140L05Q063Nl688m6L962l627n823M763J2187j789j0973
15198a3319j1274m92J6393L40j0379R51N404m826m493K974o662o040L806N699
15184b1918J0749O620k355J0105K011o391m988m117O922q486M04m146M456N731
15170e403o669n643j9033J570m541k310J338O109J4538L575n301Q313Q71N294
15156g292J5492J0593P918j8926m707n656Q534r235q657l221K835K097J6242N546
15142A1563k423m719j3985p348j1333p769n348J6933J2349J8261J513p736J168
15129A126l942M411J281k9939p165J1298l24o244p78L279Q677j4011m103J3063
$$ plain form
15115 -23371 -22496 -19793 -10577 -17258 -16398 -7455 4711 -5465 -30565 -29691 -13116 -8843 -8603 -4478
15101 -4478 -7673 -15451 -21164 -20163 -14385 -1102 2200 -1658 -3618 -4701 10701 -2065 -4487 15015
15087 15015 27927 3810 -11565 -5604 -2125 7749 4066 119 1950 -5294 -17233 -18199 3517
15074 3517 13784 -3212 -20424 -19437 -4570 -10012 -8319 -9238 -22765 -24563 -12998 -461 704
15061 704 -9940 -23233 -16635 -14490 -21046 -28380 -26592 -18147 -14313 -17733 -19807 -29941 -25074 -16276
15047 -16276 -16638 -35046 -37237 -33274 -33474 -36219 -34664 -34117 -27673 -23293 -37263 -39901 -29985 -21833 -15538
15032 -15538 -10138 -14814 -17816 -21034 -24669 -37793 -35375 -15085 -16625 -24040 -22486 -8488 -15213 -19000
15018 -19000 -24658 -24195 -20071 -24168 -22096 -14266 -6039 -15948 -12330 -7665 -11246 -11277 -8834 -17408 -16759
$$ packed form
15115b3371Q75K703R216o681Q60Q943J2166j0176k5100Q74J6575M273K40M125
15101d478l195p778n713J001N778J3283L302l858j960j083J5402j2766k422J9502
15087A5015J2912k4117j5375N961L479R874l683l947J831p244j1939r66K1716
15074C517J0267j6996j7212R87J4867n442J693r19j3527j798J1565J2537J165
15061G04j0644j3293O598K145o556p334J788Q445L834l420k074j0134M867Q798
15047a6276l62j8408k191L963k00k745J555N47O444M380j3970k638R916Q152O295
15032a5538N400m676l002l218l635j3124K418K0290j540p415J554J3998o725l787
15018a9000n658M63M124m097K072P830Q227r909L618M665l581l1K443q574O49
$$ plain form
15003 -16759 -11984 -11354 -16528 -18182 -4999 18370 13600 -2553 -13254 -11236 -9017 11029 17229
14990 17229 10972 13086 7994 -3920 -20330 -20387 -3441 1889 -10716 -8634 -7723 -737 6491 -2159
14976 -2159 -4586 -23845 -19263 -18569 -2347 5941 1009 -7932 -27884 -30899 -21427 -13545 -4820 -2896
14962 -2896 -10841 -19017 -27266 -43212 -52014 -37720 -19605 -22215 -23065 -20892 -18225 -21009 -24591 -20206
14948 -20206 -13735 -12677 -482 -12100 -8608 4049 -6058 2733 5029 -5007 -14053 -7189 4003
14935 4003 2111 -10671 -9452 5165 7611 -2737 -1959 1257 -6159 -12888 -14158 -14968 -4828 -1017
14921 -1017 -2666 -6170 -6470 -8389 -7551 2891 1425 -3756 -7605 5307 -2074 -13843 -14314 -17776 -26865
14906 -26865 -20567 -5084 -1985 2973 -8348 -13667 -22068 -25593 -19413 -19170 -24576 -31008 -33465 -32343
$$ packed form
15003a6759M775O30n174j654J3183K3369m770j6153j0701K018K219K0046O200
14990A7229o257K114n092j1914j6410n7J6946N330j2605K082R11O986P228q650
14976b159k427j9259M582O94J6222Q288m932q941j9952l015R472P882Q725J924
14962b896p945q176q249j5946q802J4294J8115k610q50K173K667k784l582M385
14948b0206O471J058J2195j1618L492J2657j0107Q791K296j0036r046O864J1192
14935D003j892j2782J219J4617K446j0348P78L216p416o729j270q10J0140L811
14921a017j649l504l00j919Q38J0442j466n181l849J2912p381j1769m71l462r089
14906b6865O298J5483L099M958j1321n319q401l525O180K43n406o432k457J122
$$ plain form
14892 -32343 -36013 -23542 -24254 -36424 -26226 -19069 -9894 -1282 2388 -6126 -11387 3034 8631 -4322
14878 -4322 -32317 -37218 -38746 -32482 -25759 -23798 -10809 -6716 -5154 -16448 -17277 -13698 -13379 -27084
14864 -27084 -24706 -9556 -5502 4830 5967 -848 -336 -6397 6572 -3422 -16653 -25210 -26415 -20526
14850 -20526 -5614 -9869 -11058 -5104 -73 2800 -16336 -26944 -15758 -4765 -8870 -19716 -18173
14837 -18173 -13590 -15554 -19607 -20320 -16616 -724 -249 7844 8901 -4127 -14006 -14163 -19715 -22095 -28386
14822 -28386 -17096 -25679 -40094 -48355 -34786 -22706 -22957 -14473 -17707 -16343 -18216 -18662 -10574 -12103
14808 -12103 -18296 -27937 -31135 -35160 -27118 -20428 -8118 3564 7482 11659 8989 -3565 -2923 -13444
14794 -13444 -17523 -14439 -3200 11827 14749 15693 10269 9583 -1471 -3292 -10592 -419 4323 686
$$ packed form
14892c2343l670J2471p12j2170J0198P157R175Q612L670q514n261J4421N597j2953
14878d322k7995m901j528O264O723J961J2989M093J562j1294q29L579L19j3705
14864b7084K378J5150M054J0332J137o815N12o061J2969r994j3231q557j205N889
14850b0526J4912m255j189N954N031K873j9136j0608J1186J0993m105j0846J543
14837a8173M583j964m053p13L704J5892M75Q093J057j3028r879j57n552k380o291
14822b8386J1290q583j4415q261J3569J2080k51Q484l234J364j873m46Q088j529
14808a2103o193r641l198m025Q042O690J2310J1682L918M177k670j2554O42j0521
14794a3444m079L084J1239J5027K922R44n424o86j1054j821p300J0173M742l637
$$ plain form
14780 686 -9376 -8308 9451 20793 23866 11037 -351 -10024 -3360 115 -5278 -1603 -5253 -14481
14766 -14481 -12058 -19539 -33278 -15626 -14315 -24261 -17852 -15694 -3162 -3785 -8577 -15228 -14990 -5594
14752 -5594 -11935 -18537 -18331 -20563 -14666 -14375 -19533 -15211 -9886 2967 1764 -5594 -310 13519 4256
14737 4256 -10716 -2644 -2297 -2908 -11115 -17538 -12214 -9560 -19397 -12729 -355 -6714 -8477 -13265 -16394
14722 -16394 -26067 -24407 -25296 -31022 -26109 -24381 -24817 -11238 -7209 -5295 -12993 -14708 -6576 -20726
14708 -20726 -23934 -14378 -6446 -6632 -16768 -36687 -37596 -23188 -11412 -7157 -2631 -2847 -5112 4246
14694 4246 3639 -9441 -10352 -4009 -8847 2105 12602 13997 -6303 -12826 -13252 -19848 -25253 -31951
14680 -31951 -27360 -12257 -5830 -12527 -33387 -47237 -40832 -24540 -22473 -22838 -19075 -23712 -19840 -14529
$$ packed form
14780F86j0062J068J7759J1342L073j2829j1388r673O664L475n393L675l650r228
14766a4481K423p481j3739J7652J311r946O409K158J2532o23m792o651K38R396
14752e594o341o602K06k232N897K91n158M322N325J2853j203p358N284J3829r263
14737D256j4972Q072L47o11q207o423N324K654r837O668J2374o359j763m788l129
14722a6394r673J660q89n726M913J728m36J3579M029J914p698j715Q132j4150
14708b0726l208R556P932j86j0136j9919r09J4408J1776M255M526k16k265R358
14694D246o07j3080r11O343m838J0952J0497J395k0300o523m26o596n405o698
14680c1951M591J5103O427o697k0860j3850O405J6292K067l65L763m637L872N311
$$ plain form
14666 -14529 -16239 -16228 1540 16401 22992 9432 -4449 6097 19877 12007 -2956 4900 16694
14653 16694 22833 10856 2546 10224 11824 16674 14277 25074 16606 7061 5700 1761 674 -12924
14639 -12924 -4298 2051 1000 1611 7131 6682 7760 14934 25801 30041 19600 5105 12060 27875
14625 27875 24449 21099 21956 23039 22471 21396 24975 28832 25749 26739 26530 44642 51085 43389 40090
14610 40090 28580 27886 29958 25644 32541 41543 54935 55990 50765 48707 28784 21404 12632 248
14596 248 12288 14447 15659 37195 47275 36986 19783 13040 7101 1863 12343 27126 17322
14583 17322 9299 -1788 -8473 5894 18757 23010 21314 15077 25441 27941 25046 14915 12151
14570 12151 9522 22002 31392 34529 51474 43182 35851 31082 32165 22349 24063 29380 26836 35680
$$ packed form
14666a4529j710J1J7768J4861O591j3560j3881J0546J3780p870j4963P856J1794
14653A6694O139j1977q310P678J600M850k397J0797q468r545j361l939j087j3598
14639a2924Q626O349j051O11N520m49J078P174J0867M240j0441j4495O955J5815
14625B7875l426l350Q57J083n68j075L579L857l083R90k09J8112O443p696l299
14610D0090j1510o94K072m314O897R002J3392J055n225k058j9923p380q772j2384
14596B48J2040K159J212K1536J0080j0289j7203o743n939n238J0480J4783r804
14583A7322q023j1087o685J4367J2863M253j696o237J0364K500k895j0131k764
14570A2151k629J2480R390L137J6945q292p331m769J083r816J714N317k544Q844
$$ plain form
14556 35680 46417 34900 19703 20834 24179 23158 21811 19226 24266 36920 34140 34177 34023 33644
14542 33644 31080 20736 14771 23864 26913 38306 45248 44828 49534 60157 56919 55019 59620 59503
14528 59503 41349 28699 34046 40373 44326 39390 41839 42790 48560 51511 57948 58291 48215 59209
14514 59209 78246 82091 75008 73554 71935 66777 65586 67531 74767 76250 88072 78380 66177 70494
14500 70494 75035 83041 80059 72337 91929 108904 102749 107934 117143 117642 124512 126163 111872 111160
14486 111160 115192 113881 118590 125981 128894 137959 143032 140276 146745 145503 141271 130400 127595 138759
14472 138759 140816 149830 151626 156988 179663 189071 185885 184557 183368 192052 179532 169293 170954
14459 170954 187817 198433 191973 209797 226707 230731 230209 225901 215686 214734 232526 247498 260798
$$ packed form
14556C5680J0737j1517j5197J131L345j021j347k585N040J2654k780L7j54l79
14542C3644k564j0344n965R093L049J1393O942m20M706J0623l238j900M601j17
14528E9503j8154j2650N347O327L953m936K449R51N770K951O437L43j0076J0994
14514E9209J9037L845p083j454j619n158j191J945P236J483J1822r692j2203M317
14500G0494M541Q006k982p722J9592J6975o155N185R209M99O870J651j4291p12
14486A11160M032j311M709P391K913R065N073k756O469j242m232j0871k805J1164
14472A38759K057R014J796N362K2675R408l186j328j189Q684j2520j0239J661
14459A70954J6863J0616o460J7824J6910M024n22m308j0215r52J7792J4972J3300
$$ plain form
14446 260798 257699 266882 265563 272205 283807 288460 287635 282416 281604 286006 291240 292290 288127 291624
14432 291624 300933 304608 320732 321161 316171 319187 330105 321052 313856 320223 306614 304283 306362 313529
14418 313529 331624 343159 345151 340099 331528 335360 360487 365734 367331 368135 366348 372524 379284 388929
14404 388929 390801 400076 399964 390493 366831 354346 350785 351433 355017 371287 383702 376567 363776
14391 363776 347531 338104 344461 345138 347876 358423 363233 379671 378387 389690 392971 382145 354644
14378 354644 353753 356871 356976 351556 354012 354398 350336 344533 344813 340929 339293 341442 338105 327258 333723
14363 333723 333302 318965 322331 326188 321272 331328 335046 333422 328683 322069 330339 333188 336275 316206
14349 316206 302544 305372 309211 310369 308725 307154 305122 290382 291654 286025 280684 273791 276737 293335
$$ packed form
14446B60798l099R183j319O642J1602M653q25n219q12M402N234J050m163L497
14432B91624R309L675J6124M29m990L016J0918r053p196O367j3609k331K079P167
14418C13529J8095J1535J992n052q571L832K5127N247J597Q04j787O176O760R645
14404C88929J872R275j12r471k3662j2485l561O48L584J6270J2415p135j2791
14391C63776j6245r427O357O77K738J0547M810J6438j284J1303L281j0826k7501
14378C54644q91L118J05n420K456L86m062n803K80l884j636K149l337j0847O465
14363C33723m21j4337L366L857m916J0056L718j624m739o614Q270K849L087k0069
14349C16206j3662K828L839J158j644j571k032j4740J272n629n341o893K946J6598
$$ plain form
14335 293335 284840 268749 256314 255055 261689 256716 259220 261721 255557 260101 259583 250714 253766 246934
14321 246934 234896 230548 218167 211068 214241 212671 205010 188468 173990 183949 198835 204177 200813
14308 200813 193154 184936 174350 163731 168843 166350 166818 159186 162453 161980 139719 136486 142258 137887
14294 137887 142745 152018 158894 152334 142505 136903 129385 125600 125019 120490 117073 103495 102408 112467
14280 112467 109400 98261 92677 94982 97774 105072 110456 106538 102381 100292 96095 85589 78962 68178
14266 68178 75631 72777 74833 76887 73259 70354 64108 60933 56850 66910 68903 65506 71375 61793
14252 61793 61701 58022 65131 70108 64534 56474 46014 50495 56954 63481 58015 51099 63222 68121
14238 68121 53218 46018 46604 45435 43620 55244 59374 44254 48320 64058 59094 55963 55986 56006 62415
$$ packed form
14335B93335q495j6091j2435j259O634m973K504K501o164M544n18q869L052o832
14321B46934j2038m348j2381p099L173j570p661j6542j4478R959J4886N342l364
14308B00813p659q218j0586j0619N112k493M68p632L267m73k2261l233N772m371
14294A37887M858R273O876o560r829n602p518l785n81m529l417j3578j087J0059
14280A12467l067j1139n584K305K792P298N384l918m157k089m197j0506o627j0784
14266F8178P453k854K056K054l628k905o246l175m083J0060J993l397N869r582
14252F1793r2l679P109M977n574q060j0460M481O459O527n466o916J2123M899
14238F8121j4903p200N86j169j815J1624M130j5120M066J5738m964l131K3K0O409
$$ plain form
14223 62415 64504 75224 71771 60149 62917 54305 55513 57497 52108 49686 54705 73060 70368 63215
14209 63215 68214 75373 78806 75825 81017 98483 92751 80861 76509 72564 83198 92934 115945
14196 115945 145858 158061 168427 167457 160629 163446 164519 167468 171394 170507 184675 206102 216204
14183 216204 216352 225547 248669 270505 291484 317853 347207 381583 422096 473194 520206 578593
14171 578593 655523 753183 863803 994118 1135166 1306307 1506388 1721484 1962744 2225891
14161 2225891 2476976 2683080 2852961 2977823 3028212 3013865 2936242 2805612 2627114 2406725
14151 2406725 2177725 1970267 1765913 1570618 1405644 1263776 1132123 1023396 927992 841338
14141 841338 774020 711864 643435 587208 532139 484247 433501 399069 357614 339825 316795
$$ packed form
14223F2415K089J0720l453j1622K768q612J208J984n389k422N019J8355k692p153
14209F3215M999P159L433k981N192J7466n732j1890m352l945J0634R736K3011
14196A15945K9913J2203J0366r70o828K817J073K949L926q87J4168K1427J0102
14183B16204J48R195K3122K1836K0979K6369K9354L4376M0513N1098M7012N8387
14171E78593P6930R7660J10620J30315J41048J71141K00081K15096K41260K63147
14161B225891K51085K06104J69881J24862N0389j4347p7623j30630j78498k20389
14151B406725k29000k07458k04354j95295j64974j41868j31653j08727r5404q6654
14141H41338o7318o2156o8429n6227n5069m7892n0746l4432m1455j7789k3030
$$ plain form
14130 316795 291520 265357 246103 225721 212820 189145 167672 147477 137836 137877 127375 104855
14118 104855 105949 105977 104534 98422 93808 98587 97386 86521 85962 74290 60185 56558 63763 67858
14104 67858 70551 70912 67978 65788 71796 62577 58979 57948 57006 41252 37780 46691 55060 63397 63720
14089 63720 48928 44597 51756 43540 43234 35941 39148 35589 23731 28398 33493 36989 26907 14469
14075 14469 11753 6953 20332 30221 26213 13940 16397 10014 22326 32449 23097 10957 1390
14062 1390 11834 25962 44462 33978 16255 -668 -9388 16144 17315 8748 8745 18725 27299 22022
14048 22022 9757 6149 21900 36382 27408 13839 4140 10999 2129 -6986 -6475 4525 7341
14035 7341 15842 28451 25038 1841 -4138 -4370 9743 17138 5616 -7155 -7271 4727 6175 12765
$$ packed form
14130C16795k5275k6163j9254k0382j2901k3675k1473k0195r641M1j0502k2520
14118A04855J094K8j443o112m614M779j201j0865n59j1672j4105l627P205M095
14104F7858K693L61k934k190O008r219l598j031r42j5754l472Q911Q369Q337L23
14089F3720j4792m331P159q216l06p293L207l559j1858M667N095L496j0082j2438
14075A4469k716m800J3379R889m008j2273K457o383J2312J0123r352j2140r567
14062A390J0444J4128J8500j0484j7723j6923q720K5532J171q567lR980Q574n277
14048B2022j2265l608J5751J4482q974j3569r699O859q870r115N11J1000K816
14035G341Q501J2609l413k3197n979k32J4113P395j1522j2771j16J1998J448O590
$$ plain form
14021 12765 21982 7733 -5470 36 2139 -9193 -10967 702 -3180 297 8693 17736 7622
14008 7622 2458 8145 12939 11474 16976 17183 23914 21963 17788 19061 15026 7125 -4045 -8148 -3391
13993 -3391 -4377 -10674 -15544 -16648 -2358 -2226 -531 1470 -6518 -6286 1640 5067 16407 28755 26662
13978 26662 21593 23484 23926 31863 43783 58864 65317 61652 64759 52067 42681 58078 68318
13965 68318 69004 58077 55994 45243 25298 23299 30956 30978 24772 24096 37920 39750 28092 27647
13951 27647 28094 43831 54939 48111 43877 34925 29604 25813 37434 34362 24929 17658 7761 8482
13937 8482 12935 16568 19308 25179 5844 5426 16091 19125 14994 83 -2773 9758 17832 1606
13923 1606 -526 -1340 2290 -112 -848 -6579 -5955 -3325 -6008 2850 19467 14344 18603 23299 20739
$$ packed form
14021A2765R217j4249j3203N506K103j1332j774J1669l882L477Q396R043j0114
14008G622n164N687M794j465N502K07O731j951m175J273m035p901j1170m103M757
13993c391r86o297m870j104J4290J32J695K001p988K32P926L427J1340J2348k093
13978B6662n069J891M42P937J1920J5081O453l665L107j2692r386J5397J0240
13965F8318O86j0927k083j0751j9945j999P657K2o206o76J3824J830j1658m45
13951B7647M47J5737J1108o828m234q952n321l791J1621l072r433p271r897P21
13937H482M453L633K740N871j9335m18J0665L034m131j4911k856J2531Q074j6226
13923A606k132q14L630k402p36n731O24K630k683Q858J6617n123M259M696k560
$$ plain form
13908 20739 16106 9955 8387 10790 16985 23474 23629 11877 14957 30191 39992 41194 43220 45061
13894 45061 40625 18812 12805 17376 15835 16776 19670 38848 53289 52321 50615 43472 45697 48226
13880 48226 38478 22517 19143 19788 19455 10792 7268 -2996 -2886 7984 29552 28500 24904 29807
13866 29807 35123 26286 13165 1824 8274 24234 30454 27772 45462 62753 51938 33056 27498
13853 27498 23940 28360 37501 41714 44659 51309 46435 45902 54430 66236 61358 62238 66648 65490 61702
13838 61702 55859 58697 66845 69786 72867 68466 64148 68731 70732 70847 77845 75760 71092 62997 56045
13823 56045 55736 55469 45586 46201 51859 50166 56440 53121 44989 45783 42626 38001 27096 6821 4252
13808 4252 10884 19162 22537 13295 2069 3734 10568 17062 27215 29641 17754 -686 -6021 -283
$$ packed form
13908B0739m633o151j568K403O195O489J55j1752L080J5234R801J202K026J841
13894D5061m436k1813o007M571j541R41K894J9178J4441r68j706p143K225K529
13880D8226r748j5961l374O45l33q663l524j0264J10J0870K1568j052l596M903
13866B9807N316q837j3121j1341O450J5960O220k682J7690J7291j0815j8882n558
13853B7498l558M420R141M213K945O650m874n33Q528J1806m878Q80M410j158l788
13838F1702n843K838Q148K941L081m401m318M583K001J15O998k085m668q095o952
13823E6045l09k67r883O15N658j693O274l319q132P94l157m625j0905k0275k569
13808D252O632Q278L375r242j1226J665O834O494J0153K426j1887j8440n335N738
$$ plain form
13794 -283 10757 17179 16450 21124 33877 38510 29547 25395 15500 9617 12755 14498 554 -9571
13780 -9571 -16734 -24447 -20547 -15052 -8870 -3931 428 11263 8131 2081 -3587 3732 2407 -386
13766 -386 -2063 6690 -1738 -5473 7676 5182 11243 18537 15300 20158 9499 1423 3042 -5477
13752 -5477 -995 -5328 -7147 -12271 9397 16547 1777 -951 1262 11977 15232 1357 -3570 5064
13738 5064 7286 6620 6976 -677 -1072 -6032 2074 5211 3899 13844 19942 19095 12392 -3457 3960
13723 3960 -5 -7889 -9181 -13948 -94 4859 6962 17287 7003 14796 39560 43308 26800
13710 26800 22178 34688 43804 47269 31266 14336 9975 13149 14032 8457 6748 5938 1349 16541
13696 16541 17620 18245 18897 24473 26093 14716 -1281 -11507 -12442 -959 7510 14158 23291 13286
$$ packed form
13794b83J1040O422p29M674J2753M633q963m152r895n883L138J743j3944j0125
13780i571p163p713L900N495O182M939M359J0835l132o050n668P319j325k793
13766c86j677Q753q428l735J3149k494O061P294l237M858j0659q076J619q519
13752e477M482m333j819n124K1668P150j4770k728K213J0715L255j3875m927Q634
13738E064K222o66L56p653l95m960Q106L137j312R945O098q47o703j5849P417
13723C960l965p884j292m767J3854M953K103J0325j0284P793K4764L748j6508
13710B6800m622J2510R116L465j6003j6930m361L174Q83n575j709q10m589J5192
13696A6541J079O25O52N576J620j1377j5997j0226r35J1483Q469O648R133j0005
$$ plain form
13682 13286 7493 2808 4330 11126 15135 14349 8986 3332 1525 -1086 -9149 -6552 3215 21086
13668 21086 27876 24531 19082 8850 1030 9916 17894 13738 11339 -260 -6243 -1918 6172 19403
13654 19403 29833 31283 30983 16953 7395 -4742 -5483 -7350 -8014 -4620 6771 10671 6108 7750
13640 7750 19275 17170 16172 23839 14982 8015 18259 22892 9911 15002 13862 25427 36678 31758
13626 31758 27137 16417 24274 22163 16267 16557 13100 17345 8226 -6732 -1196 12863 20877 22532
13612 22532 12434 -3751 -2572 11245 10995 4441 -5653 -7606 1075 6142 10768 12222 7432 122
13598 122 -475 1459 -7856 -8090 4345 5384 1086 -7016 -4028 6715 15854 16160 3389 6564 14024
13583 14024 15571 20206 20905 10881 -4514 -7482 1101 -7553 -12336 -2467 -1714 -16087 -7982 -2942
$$ packed form
13682A3286n793m685J522O796M009p86n363n654j807k611q063K597R767J7871
13668B1086O790l345n449j0232p820Q886P978m156k399j1599n983M325Q090J3231
13654A9403J0430J450l00j4030r558j2137p41j867o64L394J1391L900m563J642
13640G750J1525k105r98P667q857o967J0244M633j2981N091j140J1565J1251m920
13626C1758m621j0720P857k111n896K90l457M245r119j4958N536J4059Q014J655
13612B2532j0098j6185J179J3817k50o554j0094j953Q681N067M626J454m790p310
13598A22n97J934r315k34J2435J039m298q102K988J0743R139L06j2771L175P460
13583A4024J547M635O99j0024j5395k968Q583q654m783R869P53j4373Q105N040
$$ plain form
13569 -2942 -916 7589 11454 14028 12534 -1204 1542 3051 2520 -273 885 10243 18940 27124 21966
13554 21966 27200 34879 34039 22636 12507 8850 5302 7953 23957 27062 26994 26258 24075 25587 19269
13539 19269 16856 4314 10931 13667 16685 25692 24584 17094 21334 20548 20272 25139 28054 24085 27152
13524 27152 27489 24173 33439 53741 59879 66825 49717 50657 79080 89539 98622 116365 132756
13511 132756 137871 151844 177481 205803 221110 258664 294295 339199 390073 455207 513558 569443
13499 569443 627499 681228 724239 739448 742464 739714 731423 705238 664210 625850 594494 563316
13487 563316 548333 543332 555778 562424 577228 602279 635491 675903 703379 736234 766600 780472
13475 780472 773760 740035 699429 668948 623638 567113 515519 458109 398345 360755 336087 306741
$$ packed form
13569b942K026Q505L865K574j494j3738K746J509n31k793J158R358Q697Q184n158
13554B1966N234P679q40j1403j0129l657l548K651J6004L105o8p36k183J512o318
13539A9269k413j2542O617K736L018R007j108p490M240p86k76M867K915l969L067
13524B7152L37l316R266K0302O138O946j7108R40K8423J0459R083J7743J6391
13511A32756N115J3973K5637K8322J5307L7554L5631M4904N0874O5134N8351N5885
13499E69443N8056N3729M3011J5209L016k750q291k6185m1028l8360l1356l1178
13487E63316j4983n001J2446O646J4804K5051L3212M0412K7476L2855L0366J3872
13475G80472o712l3725m0606l0481m5310n6525n1594n7410n9764l7590k4668k9346
$$ plain form
13463 306741 280770 255976 238183 223537 188485 170860 160073 150538 138034 136582 138433 117022
13451 117022 101870 97097 91935 98096 88082 93003 96487 92072 99943 89044 74791 64574 62242
13438 62242 63115 62694 77860 87703 93789 91221 91651 101178 98132 104497 124035 144997 148815 149277 172770
13423 172770 189999 214496 233957 273419 317296 385727 448614 488813 547492 614100 683695
13412 683695 749111 803502 841148 877478 883326 880090 871729 832091 781590 743154 698776 688363
13400 688363 662247 631229 615091 625222 643037 675822 721793 761337 800203 829219 854938
13389 854938 869190 876543 870619 837546 772955 717498 665650 609397 562554 493003 427772 382212
13377 382212 346891 316511 290938 267920 254484 219568 205117 188942 181333 154661 119890 110034
$$ packed form
13463C06741k5971k4794j7793j4646l5052j7625j0787r535j2504j452J851k1411
13451A17022j5152m773n162O161j0014M921L484m415P871j0899j4253j0217k332
13438F2242Q73m21J5166R843O086k568M30R527l046O365J9538K0962L818M62K3493
13423A72770J7229K4497J9461L9462M3877O8431O2887M0199N8679O6608O9595
13412F83695O5416N4391L7646L6330N848l236q361l9638n0501l8436m4378j0413
13400F88363k6116l1018j6138J0131J7815L2785M5971L9544L8866K9016K5719
13389H54938J4252P353n924l3073o4591n5457n1848n6253m6843o9551o5231m5560
13377C82212l5321l0380k5573k3018j3436l4916j4451j6175p609k6672l4771r856
$$ plain form
13365 110034 100937 99921 95961 96288 88972 84463 78944 83470 91275 95670 89315 68423 59936 57909
13351 57909 62069 56882 42616 40040 49595 52730 40641 41197 48339 51702 33921 19587 9649 15023
13337 15023 30902 36695 25566 23559 17685 24898 30607 20707 22152 19661 16483 13298 20950 37177
13323 37177 43832 28684 11606 -2164 7118 5298 5981 -833 -5915 -6087 -7167 -1479 6153 18926
13309 18926 13636 16332 21453 23796 22463 10674 22783 25814 19148 21851 23111 32020 22869 10500
13295 10500 -2201 -2342 16279 5480 856 9268 22942 27260 30570 39781 30324 30802 30862 34020
13281 34020 30111 29355 36496 39584 38878 28231 26306 41568 48189 45635 44034 42219 37018 32328
13267 32328 33604 38931 46399 31379 33689 42536 17943 11423 30642 36232 45063 46327 27076
$$ packed form
13365A10034r097j016l960L27p316m509n519M526P805M395o355k0892q487k027
13351E7909M160n187j4266k576R555L135j2089N56P142L363j7781j4334r938N374
13337A5023J5879N793j1129k007n874P213N709r900J445k491l178l185P652J6227
13323C7177O655j5148j7078j3770R282j820O83o814n082j72j080N688P632J2773
13309A8926n290K696N121K343j333j1789J2109L031o666K703J260Q909r151j2369
13295A0500j2701j41J8621j0799m624Q412J3674M318L310R211r457M78O0L158
13281C4020l909p56P141L088p06j0647j925J5262O621k554j601j815n201m690
13267C2328J276N327P468j5020K310Q847k4593o520J9219N590Q831J264j9251
$$ plain form
13254 27076 15893 17372 16065 3845 -6662 -1283 9565 8328 7000 1230 -730 5139 16387
13241 16387 13884 8464 5412 2150 2465 9479 9370 9272 19386 29124 36529 35663 31926 27146 40866
13226 40866 37902 32676 30863 22460 20400 40405 41799 35496 31482 32352 26083 29474 25076 19886
13212 19886 28130 41256 37482 33559 39305 32102 35162 25189 18122 23843 22224 22222 14007 13996 10703
13197 10703 16879 18721 25829 21193 29473 29949 30963 29493 25543 25861 19915 18361 13127 9621 -1908
13182 -1908 1441 -2147 11975 3812 963 12358 13101 16908 21370 20172 15054 18979 18719 22118 22314
13167 22314 20118 24911 37038 41610 33213 30714 37695 32124 26888 31692 36567 43439 36515 30449
13153 30449 44320 52139 45649 48422 34368 32452 35586 35220 34386 37007 20620 23523 47092 62902
$$ packed form
13254B7076j1183J479j307j2220j0507N379J0848j237j328n770j960N869J1248
13241A6387k503n420l052l262L15P014j09r8J0114R738P405q66l737m780J3720
13226D0866k964n226j813q403k060K0005J394o303m014Q70o269L391m398n190
13212A9886Q244J3126l774l923N746p203L060r973p067N721j619kq215j1l293
13197A0703O176J842P108m636Q280M76J014j470l950L18n946j554n234l506j1529
13182a908L349l588J4122q163k849J1395P43L807M462j198n118L925k60L399J96
13167B2314k196M793J2127M572q397k499O981n571n236M804M875O872o924o066
13153C0449J3871P819o490K773j4054j916L134l66q34K621j6387K903K3569J5810
$$ plain form
13139 62902 50447 41287 43892 56721 44883 26253 22859 21860 36484 42161 29878 24077 46801
13126 46801 67285 68123 57980 62399 52054 60465 59464 57034 49224 40597 41301 40648 31071 36720
13112 36720 50341 52289 68691 68053 55327 31712 25071 35700 42673 44344 45277 55096 53052 49894
13098 49894 65911 88185 96753 98014 114452 117550 131056 134924 132832 145594 162379 199922 225947
13085 225947 250502 302171 349612 416282 478551 557815 643398 735906 815651 850574 862216
13074 862216 864256 846392 802276 738627 659876 589532 522297 467957 419447 380856 356450 330075
13062 330075 298394 259991 242499 228064 214762 189702 162423 149295 142244 150738 142798 116000
13050 116000 106743 107532 87147 67748 69790 78315 80901 79481 73966 63760 56604 63612 62608 57693
$$ packed form
13139F2902j2455r160K605J2829j1838j8630l394r99J4624N677j2283n801K2724
13126D6801K0484Q38j0143M419j0345Q411j001k430p810q627P04o53r577N649
13112C6720J3621J948J6402o38j2726k3615o641J0629O973J671R33R819k044l158
13098D9894J6017K2274Q568J261J6438L098J3506L868k092J2762J6785L7543K6025
13085B25947K4555N1669M7441O6670O2269P9264Q5583R2508P9745L4923J1642
13074H62216K040j7864m4116o3649p8751p0344o7235n4340m8510l8591k4406k6375
13062C30075l1681l8403j7492j4435j3302k5060k7279j3128p051Q494p940k6798
13050A16000r257P89k0385j9399K042Q525K586j420n515j0206p156P008j004m915
$$ plain form
13036 57693 62003 58621 57002 66420 74201 83959 79230 67948 69910 73020 78750 71141 79664 75071
13022 75071 62960 48576 49391 33786 29397 32109 43399 50122 64535 64536 73426 71782 68997 64716
13008 64716 60451 68542 67041 56292 46353 48498 35392 21790 33498 57012 63242 62363 59564
12995 59564 64255 66137 66534 77673 70908 53797 55842 68775 84167 95751 97519 98194 99137 85445
12981 85445 93988 93827 95789 100850 113216 108683 103149 98509 93996 97845 96194 95827 92277 98377 98102
12966 98102 106929 121855 118164 109179 115751 118930 118141 112817 104326 92530 88051 79906 73446 71754
12952 71754 73563 74198 70381 61899 64003 59401 75881 84375 75388 80619 83335 81519 97463 107746
12938 107746 100114 84571 72658 74800 74508 66912 76796 83380 90089 88517 91582 90601 89622 89163 90598
$$ packed form
13036E7693M310l382j619R418P781R758m729j1282J962L110N730p609Q523m593
13022G5071j2111j4384Q15j5605m389K712J1290O723J4413JQ890j644k785m281
13008F4716m265Q091j501j0749r939K145j3106j3602J1708K3514O230q79k799
12995E9564M691J882L97J1139o765j7111K045J2933J5392J1584J768O75R43j3692
12981H5445Q543j61J962N061J2366m533n534m640m513L849j651l67l550O100k75
12966I8102Q827J4926l691q985O572L179p89n324q491j1796m479q145o460j692
12952G1754J809O35l817q482K104m602J6480Q494q987N231K716j816J5944J0283
12938A07746p632j5543j1913K142k92p596R884O584O709j572L065r81r79m59J435
$$ plain form
12923 90598 91307 99433 107801 107412 107779 124595 148078 159880 158978 172846 187050 196213 208857 232524
12909 232524 240979 242036 235020 231337 219466 210893 200011 193342 189530 165483 155701 149726 144502
12896 144502 135412 129570 133097 147137 147411 127393 117587 111304 115923 128912 131011 125416 136645
12883 136645 137197 132734 132223 128607 122770 113911 95330 97604 100597 104406 100827 100165 119373 133270
12869 133270 123533 118525 124433 138984 140987 139696 137316 139590 154721 157364 147189 150678 161073
12856 161073 150513 152129 140420 130775 126125 121355 138202 147268 144400 142339 152921 154128 159774
12843 159774 165575 176723 182432 180210 179858 179951 176974 197804 209520 212724 223624 229007 221258 213639
12829 213639 207974 204884 207117 221246 220225 216418 211198 207789 202861 214096 235844 253288 251344
$$ packed form
12923I0598P09Q126Q368l89L67J6816K3483J1802r02J3868J4204R163J2644K3667
12909B32524Q455J057p016l683j1871q573j0882o669l812k4047r782n975n224
12896A44502r090n842L527J4040K74k0018r806o283M619J2989K099n595J1229
12883A36645N52m463n11l616n837q859j8581K274K993L809l579o62J9208J3897
12869A33270r737n008N908J4551K003j291k380K274J5131K643j0175L489J0395
12856A61073j0560J616j1709r645m650m770J6847R066k868k061J0582J207N646
12843A59774N801J1148N709k222l52R3k977K0830J1716L204J0900N383p749p619
12829B13639n665l090K233J4129j021l807n220l409m928J1235K1748J7444j944
$$ plain form
12816 251344 240313 238574 222201 206267 185774 171536 155715 156099 167943 174572 182185 196490
12804 196490 209335 226993 239258 259511 270796 280141 278538 280698 298766 312857 312861 307959 305699
12791 305699 326314 342415 358673 386892 402522 412309 426876 451893 468193 470451 477263 478228
12779 478228 475915 461730 445724 444652 446315 441905 435412 439848 443651 438218 446125 456991 460322
12766 460322 464204 472266 490768 497136 517287 548594 546315 544627 544695 567390 577346 596457 608243
12753 608243 621704 632050 627045 630644 629622 642201 665057 681582 685353 685105 686605 689730 710034
12740 710034 715773 718740 726533 727811 737578 745923 758750 766657 779042 791694 826935 845984 853482
12727 853482 870518 905805 940683 954485 969510 1003801 1028996 1058081 1077761 1097046 1125916
$$ packed form
12816B51344j1031j739j6373j5934k0493j4238j5821L84J1844O629P613J4305
12804A96490J2845J7658J2265K0253J1285R345j603K160J8068J4091Mm902k260
12791C05699K0615J6101J6258K8219J5630R787J4567K5017J6300K258O812R65
12779D78228k313j4185j6006j072J663m410o493M436L803n433P907J0866L331
12766D60322L882Q062J8502O368K0151L1307k279j688O8K2695R956J9111J1786
12753F08243J3461J0346n005L599j022J2579K2856J6525L771k48J500L125K0304
12740G10034N739K967P793J278R767Q345J2827P907J2385J2652L5241J9049P498
12727H53482J7036L5287L4878J3802J5025L4291K5195K9085J9680J9285K8870
$$ plain form
12716 1125916 1165985 1186072 1217840 1255530 1291731 1348510 1404270 1442746 1488501 1544018 1612754
12705 1612754 1680936 1752668 1837827 1922587 2002084 2099101 2205160 2313257 2429694 2563798
12695 2563798 2706676 2865182 3035182 3218628 3415463 3617158 3839521 4047727 4259076
12686 4259076 4479379 4700769 4956466 5254093 5600884 5999390 6482723 7060828 7746645
12677 7746645 8557918 9485507 10577561 11853733 13300939 14934735 16788791 18897196
12669 18897196 21340607 24222873 27702700 32074603 37714166 45026281 54409253 66073229
12661 66073229 79940393 95513005 111896176 127870068 141936568 152716224 159155101
12654 159155101 160580639 156869698 148555208 136828084 123029467 108459412 94368375
$$ packed form
12716A125916M0069K0087L1768L7690L6201N6779N5760L8476M5755N5517O8736
12705A612754O8182P1732Q5159Q4760P9497R7017J06059J08097J16437J34104
12695B563798J42878J58506J70000J83446J96835K01695K22363K08206K11349
12686D259076K20303K21390K55697K97627L46791L98506M83333N78105O85817
12677G746645Q11273R27589J092054J276172J447206J633796J854056K108405
12669A8897196K443411K882266L479827M371903N639563P312115R382972J1663976
12661F6073229J3867164J5572612J6383171J5973892J4066500J0779656O438877
12654A59155101J425538l710941q314490j1727124j3798617j4570055j4091037
$$ plain form
12647 94368375 81638027 70673768 61539196 54081825 48012383 42980249 38681204 34900955
12639 34900955 31501620 28420031 25618596 23064170 20748744 18655719 16805693 15162536
12631 15162536 13716206 12429106 11271287 10252921 9344749 8529668 7784961 7106526 6502064
12622 6502064 5958780 5476032 5053560 4679779 4359237 4073021 3823583 3616931 3427200
12613 3427200 3257702 3099509 2930139 2789834 2671865 2568490 2471582 2380202 2314432 2240988
12603 2240988 2149302 2067021 1997937 1936546 1868146 1819076 1773650 1714189 1666790 1613872 1573518
12592 1573518 1530733 1480350 1439237 1411144 1364513 1308893 1273313 1231608 1188629 1157037 1121752
12581 1121752 1109186 1091997 1059291 1015643 984584 958030 925980 892544 855422 831398 813437
$$ packed form
12647I4368375j2730348j0964259r134572p457371o069442n032134m299045l780249
12639C4900955l399335l081589k801435k554426k315426k093025j850026j643157
12631A5162536j446330j287100j157819j018366r08172q15081p44707o78435o04462
12622F502064n43284m82748m22472l73781l20542k86216k49438k06652j89731
12613C427200j69498j58193j69370j40305j17969j03375r6908r1380o5770p3444
12603B240988r1686q2281o9084o1391o8400m9070m5426n9461m7399n2918m0354
12592A573518m2785n0383m1113k8093m6631n5620l5580m1705m2979l1592l5285
12581A121752j2566j7189l2706m3648l1059k6554l2050l3436l7122k4024j7961
$$ plain form
12570 813437 779245 749342 739385 715926 698808 691881 674180 648740 642106 637446 625996 614625
12558 614625 610501 609258 617750 606730 600163 603949 595814 588229 586323 574133 565400 556351 548141 542581
12544 542581 549388 541401 531486 524134 536789 544647 533688 533855 520279 521786 531028 541911 545551
12531 545551 554798 556411 551018 565763 571043 560978 532264 515171 507545 491074 474201 459099
12519 459099 450080 436806 419166 419963 413565 389295 373092 379066 385188 378951 368835 363637 384562
12506 384562 392940 393253 391697 392511 405414 414200 404468 383697 365171 350356 324464 311698 291660
12493 291660 276984 254455 240047 236782 236540 234157 229419 215961 200769 199963 190984 176361 178022
12480 178022 177836 173009 167191 148587 144952 142874 148996 161130 169086 169513 160706 163384 157515 163589
$$ packed form
12570H13437l4192k9903r957k3459j7118o927j7701k5440o634m660j1450j1371
12558F14625m124j243Q492j1020o567L786q135p585j906j2190q733r049q210n560
12544E42581O807p987r915p352J2655P858j0959J67j3576J507R242J0883L640
12531E45551R247J613n393J4745N280j0065k8714j7093p626j6471j6873j5102
12519D59099r019j3274j7640P97o398k4270j6203N974O122o237j0116n198K0925
12506C84562Q378L13j556Q14J2903Q786r732k0771j8526j4815k5892j2766k0038
12493B91660j4676k2529j4408l265k42k383m738j3458j5192q06q979j4623J661
12480A78022j86m827n818j8604l635k078O122J2134P956M27q807K678n869O074
$$ plain form
12466 163589 169829 172532 179824 173303 157716 166982 160990 167510 172890 163623 161186 170750 178436 166017
12452 166017 159374 169631 169925 161429 161217 143145 130429 133959 141797 151261 165975 166143 166634 161882
12438 161882 157565 153329 145040 133315 146795 150650 152617 156469 146149 143334 147455 141852 139728
12425 139728 144032 136119 122598 115997 121799 124048 134295 149860 157458 150842 163599 170530 163040
12412 163040 160761 165056 172615 180830 189555 210131 230800 245286 266192 287238 323201 377455
12400 377455 417571 475643 547785 626120 722196 818968 922211 1020445 1095545 1127561 1116097
12389 1116097 1069261 1007757 915138 822674 730747 667812 609543 560302 516525 479245 424784
12378 424784 383334 357834 349477 330791 323875 313556 295807 282983 268471 246628 230512 222452
$$ packed form
12466A63589O240K703P292o521j5587R266n992O520N380r267k437R564P686j2419
12452A66017o643J0257K94q496k12j8072j2716L530P838R464J4714J68M91m752
12438A61882m317m236q289j1725J3480L855J967L852j0320k815M121n603k124
12425A39728M304p913j3521o601N802K249J0247J5565P598o616J2757O931p490
12412A63040k279M295P559Q215Q725K0576K0669J4486K0906K1046L5963N4254
12400C77455M0116N8072P2142P8335R6076R6772J03243R8234P5100L2016j1464
12389A116097m6836o1504r2619r2464r1927o2935n8269m9241m3777l7280n4461
12378D24784m1450k5500q357j8686o916j0319j7749j2824j4512k1843j6116q060
$$ plain form
12366 222452 219201 221880 213938 199394 192407 188099 180752 177308 183154 201490 195809 195173 192797 201752
12352 201752 199039 191276 192851 213739 217434 223018 240221 254363 286557 316749 348254 384207
12340 384207 414066 473013 536009 600005 676454 758491 840663 914217 979980 1026385 1017792 981520
12328 981520 918964 845695 764520 677616 592851 544024 512951 477521 452902 443181 436852 415577
12316 415577 406164 413306 429508 448429 468122 518338 584124 643741 716125 801421 862779 908175
12304 908175 919024 896413 849825 782484 705763 620584 545500 492248 437297 389028 350131
12293 350131 322647 291697 290885 285658 273431 262431 246951 221999 194683 176645 151763 142060
12281 142060 148768 148792 148282 157131 155085 155724 150212 142835 122269 124318 131893 136423 134318 118454 105169
$$ packed form
12366B22452l251K679p942j4544o987m308p347l444N846J8336n681o36k376Q955
12352B01752k713p763J575K0888L695N584J7203J4142L2194L0192L1505L5953
12340C84207K9859N8947O2996O3996P6449Q2037Q2172P3554O5763M6405q593l6272
12328I81520o2556p3269q1175q6904q4765m8827l1073l5430k4619r721o329k1275
12316D15577r413P142J6202J8921J9693N0216O5786N9617P2384Q5296O1358M5396
12304I08175J0849k2611m6588o7341p6721q5179p5084n3252n4951m8269l8897
12293C50131k7484l0950q12n227j2227j1000j5480k4952k7316j8038k4882r703
12281A42060O708K4n10Q849k046O39n512p377k0566K049P575M530k105j5864j3285
$$ plain form
12266 105169 104316 117198 133931 151857 165106 190787 208525 218205 223479 245423 267645 292019
12254 292019 312360 337346 369945 416704 480183 555819 641420 726200 793648 864493 914262
12243 914262 918319 905360 869310 822786 781205 771683 768687 772010 781151 812121 851720 904747
12231 904747 961443 1012071 1043426 1052616 1028433 972921 896028 806839 725922 649526 581018 521236
12219 521236 465250 421777 373077 329150 292917 276264 271755 254395 226784 203322 182420 177728
12207 177728 160801 148511 139891 127106 119158 107775 97965 103866 100100 101148 99022 97654 95986
12194 95986 80325 67502 69880 65692 53528 48913 53922 60295 60861 49759 42508 30690 18582
12181 18582 20627 30573 34094 29731 24461 34322 33948 29499 24422 18376 23077 28474 21804 40266
$$ packed form
12266A05169q53J2882J6733J7926J3249K5681J7738R680N274K1944K2222K4374
12254B92019K0341K4986L2599M6759O3479P5636Q5601Q4780O7448P0845M9769
12243I14262M057j2959l6050m6524m1581r522k996L323R141L0970L9599N3027
12231I04747N6696N0628L1355R190k4183n5512p6893q9189q0917p6396o8508n9782
12219E21236n5986m3473m8700m3927l6233j6653m509j7360k7611k3462k0902m692
12207A77728j6927j2290q620j2785p948j1383r810N901l766J048k126j368j668
12194I5986j5661j2823K378m188j2164m615N009O373N66j1102p251j1818j2108
12181A8582K045R946L521m363n270R861l74m449n077o046M701N397o670J8462
$$ plain form
12167 40266 40500 40547 51963 48532 43489 46333 56984 55201 57354 57415 55408 48394 43815 44390 51829
12152 51829 50669 55289 54176 54125 50514 50532 36650 22287 26140 29505 29976 32090 29422 32345 24894
12137 24894 16097 15142 21683 32245 47218 60643 55268 50591 53317 45698 44714 52624 64555 60444
12123 60444 50203 59517 66044 65799 83933 94131 110207 107376 92768 91771 80370 73800 67968
12110 67968 67416 66582 55550 55183 62768 63277 49117 42766 32565 39220 40158 24928 28686 30800 30817
12095 30817 21900 21173 28524 28725 32081 25557 24705 26121 29901 23035 10957 3578 10250 22052 26426
12080 26426 26470 18073 3194 1698 7816 18478 23262 14362 7001 18608 10560 8138 6961 7102
12066 7102 12958 8285 6929 15224 5305 4341 4177 12900 21736 25117 12844 25211 27051 26799 27944
$$ packed form
12167D0266K34M7J1416l431n043K844J0651j783K153O1k007p014m579N75P439
12152E1829j160M620j113n1l611J8j3882j4363L853L365M71K114k668K923p451
12137B4894q797r55O541J0562J4973J3425n375m677K726p619r84P910J1931m111
12123F0444j0241R314O527k45J8134J0198J6076k831j4608r97j1401o570n832
12110F7968n52q34j1032l67P585N09j4160o351j0201O655R38j5230L758K114J7
12095C0817q917p27P351K01L356o524q52J416L780o866j2078p379O672J1802M374
12080B6426M4q397j4879j496O118J0662M784q900p361J1607q048k422j177J41
12066G102N856m673j356Q295r919r64j64Q723Q836L381j2273J2367J840k52J145
$$ plain form
12051 27944 14529 9455 11834 10093 14502 17422 17167 24787 17261 23104 38047 44429 36323 32749
12037 32749 29547 16099 97 4360 24504 30261 20110 11858 -1528 -12474 -1023 1947 5275
12024 5275 -2866 -238 13550 12804 5575 2403 2084 9138 13610 28305 23661 28689 20283 10782 11337
12009 11337 5854 -3638 -15886 -11206 -3345 1871 3778 -2020 -10733 -864 4974 7293 -4389 -10058
11995 -10058 -8806 -11211 -9367 393 5512 10747 7448 5973 12750 8609 -2387 1187 25268 21429
11981 21429 20888 11830 -301 -4836 -3206 -3130 6029 14877 18357 28221 25524 25058 17667 13265 17599
11966 17599 22370 20643 20241 12331 2533 -8308 -6530 1708 2478 10016 14729 10847 12774 9458 7631
11951 7631 9208 5880 3368 4391 11479 21706 25355 21419 19415 16330 11531 10942 10144 14266 18327
$$ packed form
12051B7944j3415n074K379j741M409K920k55P620p526N843J4943O382q106l574
12037C2749l202j3448j6002M263K0144N757j0151q252j3386j0946J1451K970L328
12024E275q141K628J3788p46p229l172l19P054M472J4695m644N028q406r501N55
12009A1337n483r492j2248M680P861N216J907n798q713R869N838K319j1682n669
11995a0058J252k405J844R760N119N235l299j475O777m141j0996L574K4081l839
11981B1429n41r058j2131m535J630P6R159Q848L480R864k697m66p391m402M334
11966A7599M771j727m02p910r798j0841J778Q238P70P538M713l882J927l316j827
11951G631J577l328k512J023P088J0227L649l936k004l085m799n89p98M122M061
$$ plain form
11936 18327 19957 19089 17330 13961 14788 15568 10598 6058 3665 -6257 4682 9035 3074 8901 15626
11921 15626 15587 12362 3714 10214 2020 13030 16915 10941 17364 20641 7757 7955 16319 16816 -3008
11906 -3008 -3622 13728 14575 1280 -2148 2545 14889 11719 13901 10634 -80 -3056 11801 14224
11892 14224 19631 11949 1762 8977 28459 45704 38976 27767 20980 20097 23543 22647 20170 8932
11878 8932 -479 -3353 -1440 5359 21007 23568 19946 7908 11017 6186 4150 2773 -81 -7292
11864 -7292 -3963 9798 4327 6647 -2359 -12071 -7835 -2633 -588 -1253 2291 -12701 -17347 -2350
11850 -2350 540 7088 12166 1341 -3244 -6907 3574 10481 12136 16724 12844 12456 5850 8861
11836 8861 15131 12272 12720 13333 18621 18651 23359 4349 2921 36860 52886 40086 19615 9602
$$ packed form
11936A8327J630q68j759l369Q27P80m970m540k393r922J0939M353n961N827O725
11921A5626l9l225q648O500q194J1010L885n974O423L277j2884J98Q364M97j9824
11906c008o14J7350Q47j3295l428M693J2344l170K182l267j0714k976J4857K423
11892A4224N407p682j0187P215J9482J7245o728j1209o787q83L446q96k477j1238
11878H932r411k874J913O799J5648K561l622j2038L109m831k036j377k854p211
11864g292L329J3761n471K320r006r712M236N202K045o65L544j4992m646J4997
11850b350K890O548N078j0825m585l663J0481O907J655M588l880l88o606L011
11836H861O270k859M48O13N288L0M708j9010j428L3939J6026j2800k0471j0013
$$ plain form
11822 9602 16708 23925 13871 11187 9757 -4461 -6625 -18018 -24149 -21878 -12633 -9741 -1472 -9696
11808 -9696 -16118 -12275 -11509 -6085 4435 21747 19608 13615 17864 24947 21392 14515 -181 -8393
11794 -8393 -1147 9116 10624 15446 20836 20519 5290 -215 2250 9838 14304 18366 24286 14109
11780 14109 10871 10363 8220 12196 21679 16907 3871 -8148 -15706 -8032 -9703 -7010 -11684 -14745
11766 -14745 -834 7290 -901 -6988 87 5377 -13611 -20470 5070 551 -5824 -53 6021 -3156
11752 -3156 -9921 3155 23764 21307 21909 16280 7085 16289 20622 26794 25736 27884 26352 26003 31905
11737 31905 33127 32939 24786 22618 25235 21291 1348 -419 9406 28197 21849 17087 2972 -11729
11723 -11729 -8921 810 -2226 -2570 1471 10634 6440 634 2851 9912 4316 -2065 1316 6358 3810
$$ packed form
11822I602P106P217j0054k684j430j4218k164j1393o131K271R245K892Q269q224
11808i696o422L843P66N424J0520J7312k139n993M249P083l555o877j4696q212
11794h393P246J0263J508M822N390l17j5229n505K465P588M466M062N920j0177
11780A4109l238n08k143L976R483m772j3036j2019p558P674j671K693m674l061
11766a4745J3911Q124q191o087P075N290j8988o859K5540m519o375N771O074r177
11752c156o765J3076K0609k457O02n629r195R204M333O172j058K148j532l49N902
11737C1905J222j88q153k168K617l944j9943j767R825J8791o348m762j4115j4701
11723a1729K808R731l036l44M041R163m194n806K217P061n596o381L381N042k548
$$ plain form
11708 3810 1285 291 415 8816 -2172 558 -7530 -15341 -10239 -1571 10500 8426 7218 -2315 -11261
11693 -11261 -9348 -21382 -21068 -24120 -8258 3575 13195 20472 17491 4742 15647 12644 3564
11680 3564 2495 8755 13897 7536 -9156 -21310 -14940 -10838 -13199 -8070 460 -4646 -2080 11464
11666 11464 9309 5526 14581 7994 4849 -5739 -19356 -22481 -16975 -17187 -10306 -4171 -125 2649
11652 2649 5747 -4893 -4695 -966 -548 8524 14211 4001 10224 13554 -1757 -6380 -15802 -5872
11638 -5872 -10015 -23777 -9266 -2451 4285 8644 4085 9451 14283 12863 9891 17189 20982 10262
11624 10262 12232 17803 22459 34869 27618 33259 17476 9843 3003 -4454 -6144 -2231 10007 9665
11610 9665 9034 3607 4620 4313 9090 11179 3478 7102 13286 17209 11489 13284 12561 23483 43720
$$ packed form
11708C810k525r94J24Q401j0988K730q088p811N102Q668J2071k074j208r533q946
11693a1261J913j2034L14l052J5862J1833R620P277k981j2749J0905l003r080
11680C564j069O260N142o361j6692j2154O370M102k361N129Q530n106K566J3544
11666A1464k155l783R055o587l145j0588j3617l125N506k12O881O135M046K774
11652B649L098j0640J98L729M18R072N687j0210O223L330j5311m623r422R930
11638e872m143j3762J4511O815O736M359m559N366M832j420k972P298L793j0720
11624A0262J970N571M656J2410p251N641j5783p633o840p457j690L913J2238l42
11610I665o31n427J013l07M777K089p701L624O184L923n720J795p23J0922K0237
$$ plain form
11595 43720 31592 17969 7497 13121 9125 6575 24610 34535 33642 28428 29281 31385 21824 4877
11581 4877 10913 9397 5893 2729 -8886 -14430 -17173 -6167 3951 5542 -4686 -77 -1491 -1819
11567 -1819 -3803 543 12377 16306 13315 9291 24852 26032 13321 5341 -853 -346 13761 13744
11553 13744 21852 26773 27467 25688 16440 8101 7992 15742 19995 21908 20885 22160 23043 21802 32540
11538 32540 28544 19178 19089 24185 20224 14186 12635 18185 17544 18553 14986 12795 8103 9201 19261
11523 19261 23513 16906 20242 16830 13532 13305 17702 20193 30719 34630 30871 23098 32246 48045
11509 48045 59167 53357 48244 46068 44575 28639 25591 7299 -1283 -3569 -410 747 3407 11704
11495 11704 7922 2559 -8931 -5639 7111 18777 20653 13781 18082 19528 20709 10745 18356 16308
$$ packed form
11595D3720j2128j3623j0472N624l996k550J8035R925q93n214Q53K104r561j6947
11581D877O036j516l504l164j1615n544k743J1006J0118J591j0228M609j414l28
11567a819j984M346J1834L929k991m024J5561J180j2711p980o194N07J4107j7
11553A3744Q108M921O94j779r248q339j09P750M253J913j023J275Q83j241J0738
11538C2540l996r366q9N096l961o038j551N550o41J009l567k191m692J098J0060
11523A9261M252o607L336l412l298k27M397K491J0526L911l759p773R148J5799
11509D8045J1122n810n113k176j493j5936l048j8292q582k286L159J157K660Q297
11495A1704l782n363j1490L292J2750J1666J876o872M301J446J181r964P611k048
$$ plain form
11481 16308 17260 4990 2799 -12508 -20786 -14331 -5470 -11581 -12859 -3888 1751 -1235 -9318 -9328 -2637
11466 -2637 -3917 -529 14380 15802 14208 13330 9235 12437 15089 19974 18281 7230 369 -5320
11452 -5320 -3802 -5096 -4155 -7003 -7976 3480 -2684 -9065 -5009 6408 12518 3502 10482 15605 10164
11437 10164 17457 26014 32595 34458 38385 32249 23365 22453 28313 42879 36233 30748 24949 5510
11423 5510 5391 1221 -8960 -842 14396 13398 9993 20682 33450 28712 18180 19560 8442 13049
11409 13049 29556 30873 19342 11466 7155 4633 8054 4786 -4038 1398 137 -4418 -1508 4651
11395 4651 16799 15982 17803 9620 17829 21265 7969 7476 16484 28042 30974 25319 37358 38649
11381 38649 35581 33828 28696 25123 32484 18929 4714 7862 4622 5026 2787 17123 19783 10098
$$ packed form
11481A6308R52j2270k191j5307q278O455Q861o111j278Q971N639k986q083j0O691
11466b637j280L388J4909J422j594q78m095L202K652M885j693j1051o861n689
11452e320J518j294R41k848r73J1456o164o381M056J1417O110r016O980N123n441
11437A0164P293Q557O581J863L927o136q884r12N860J4566o646n485n799j9439
11423E510j19m170j0181Q118J5238r98l405J0689J2768m738j0532J380j1118M607
11409A3049J6507J317j1531p876m311k522L421l268q824N436j261m555K910O159
11395D651J2148q17J821q183Q209L436j3296m93R008J1558K932n655J2039J291
11381C8649l068j753n132l573P361j3555j4215L148l240M04k239J4336K660r685
$$ plain form
11367 10098 11525 17684 28758 30301 10107 -551 -16554 -10161 5806 12570 6969 2579 4550
11354 4550 -13020 -16091 -24831 -16016 -160 13125 8892 3155 8908 5383 13146 35721 53134
11341 53134 55931 42958 31675 33901 32552 19369 21320 22603 20694 15761 29005 29931 27120 23281
11327 23281 25089 4302 -9887 -181 11269 15768 23141 36035 34803 41373 66861 77554 77976
11314 77976 79453 87294 79749 85477 92425 80574 62906 53011 46808 45144 49639 43285 49668 40494
11300 40494 25023 27392 45993 45993 23423 15578 35389 41476 47237 40358 41886 44057 56092 82028
11286 82028 120670 145100 166422 169569 139661 118995 83968 71788 81511 73156 70946 57149
11274 57149 46537 38084 25229 19477 24840 26264 35554 40839 37534 35147 34529 29399 25738 32017
$$ packed form
11367A0098J427O159J1074J543k0194j0658j6003O393J5967O764n601m390J971
11354D550j7570l071q740Q815J5856J3285m233n737N753l525P763K2575J7413
11341E3134K797j2973j1283K226j349j3183J951J283j909m933J3244R26k811l839
11327B3281J808k0787j4189R706J1450M499P373J2894j232O570K5488J0693M22
11314G7976J477P841p545N728O948j1851j7668r895o203j664M495o354O383r174
11300D0494j5471K369J8601%k2570p845J9811O087N761o879J528K171J2035K5936
11286H2028L8642K4430K1322L147k9908k0666l5027j2180R723q355k210j3797
11274E7149j0612q453j2855n752N363J424R290N285l305k387o18n130l661O279
$$ plain form
11260 32017 38731 40337 32879 20905 16995 18655 21054 12639 31952 21865 16741 12031 27614
11247 27614 23773 24664 22865 33213 35648 29864 18705 20185 21421 15207 9607 8999 22696 23243
11233 23243 28932 29600 17526 22114 36429 45229 46810 39232 31778 38265 43789 39347 30443 28402
11219 28402 29813 40739 35759 38351 60474 76779 83714 85627 100780 111575 109181 116781 132346
11206 132346 126664 129328 138437 144692 152378 149473 139643 141573 133592 134950 147687 143553 130237 127810
11192 127810 136117 130717 132507 122488 110609 89388 81362 80479 76737 68552 69966 66456 79701
11179 79701 81420 66828 48639 48210 57674 61914 65708 61431 62996 72415 70647 70258 62474 60316
11165 60316 55350 53995 62422 65325 58813 55437 39193 38939 43309 31210 33703 32480 34476 23020
$$ packed form
11260C2017O714J606p458j1974l910J660K399q415J9313j0087n124m710J5583
11247B7614l841Q91j799J0348K435n784j1159J480J236o214n600o08J3697N47
11233B3243N689O68j2074M588J4315Q800J581p578p454O487N524m442q904k041
11219B8402J411J0926m980K592K2123J6305O935J913J5153J0795k394P600J5565
11206A32346n682K664R109O255P686k905r830J930p981J358J2737m134j3316k427
11192A27810Q307n400J790j0019j1879k1221q026q83l742q185J414l510J3245
11179G9701J719j4592j8189m29R464M240L794m277J565R419j768l89p784k158
11165F0316m966j355Q427K903o512l376j6244k54M370j2099K493j223J996j1456
$$ plain form
11151 23020 28101 30950 26108 34642 30447 22929 15859 25357 36849 37637 11354 8340 21530 34204
11137 34204 37123 27229 23317 33063 26108 16998 19000 28869 29994 33164 36649 34601 36077 32356
11123 32356 30661 34160 32517 34949 22098 12018 20562 26175 32348 37987 36762 43180 55284 55738
11109 55738 45127 26570 8809 2991 7011 28139 38238 36247 29532 32099 40179 36907 26727
11096 26727 14097 11240 23782 30764 35064 22956 20838 20276 14144 23716 33626 41380 41856 36339
11082 36339 35900 20811 12289 22353 40707 53414 60381 58767 48577 51579 44651 47393 48175 44184
11068 44184 44576 44892 52870 64366 58757 32130 24239 7460 -1088 -473 -639 2382 19563 34779
11054 34779 32657 30866 34965 35825 39381 41105 50785 56157 59524 50112 37882 41077 46183 40992
$$ packed form
11151B3020N081K849m842Q534m195p518p070R498J1492P88k6283l014J3190J2674
11137C4204K919r894l912R746o955r110K002R869J125L170L485k048J476l721
11123C2356j695L499j643K432j2851j0080Q544N613O173N639j225O418J2104M54
11109E5738j0611j8557j7761n818M020K1128J0099j991o715K567Q080l272j0180
11096B6727j2630k857J2542O982M300j2108k118n62o132R572R910P754M76n517
11082C6339m39j5089q522J0064J8354J2707O967j614j0190L002o928K742P82l991
11068D4184L92L16P978J1496n609k6627p891j6779q548O15j66L021J7181J5216
11054C4779k122j791M099Q60L556J724R680N372L367r412j2230L195N106n191
$$ plain form
11040 40992 38645 47198 49792 51477 57638 55890 44463 28369 27741 58643 66830 55846 56225 53887
11026 53887 49296 43793 47045 48767 53354 68034 68877 73137 69789 63389 64279 63045 73030 77562 89397
11011 89397 79825 75763 79364 83448 104599 111275 105950 89048 80756 70250 60040 57181 57349 52694
10997 52694 65393 74532 75909 87002 94631 103817 97261 76102 73443 85819 101145 102172 98957
10984 98957 105446 112789 120834 127324 125822 135548 147056 145835 128068 130645 135953 146851 150796 159241
10970 159241 172458 179873 186281 200285 210391 223280 265335 298647 330491 376257 464313 553843
10958 553843 671727 840494 1061144 1318406 1566387 1725267 1773366 1701392 1509609 1272868
10948 1272868 1064037 888319 748661 654574 575745 505892 456815 427905 399439 364678 330976
$$ packed form
11040D0992k347Q553K594J685O161j748j1427j6094o28L0902Q187j0984L79k338
11026E3887m591n503L252J722M587J4680Q43M260l348o400Q90j234R985M532J1835
11011H9397r572m062L601M084K1151O676n325j6902q292j0506j0210k859J68m655
10997E2694J2699R139J377J1093P629R186o556k1159k659J2376J5326J027l215
10984I8957O489P343Q045O490j502R726J1508j221j7767K577N308J0898L945Q445
10970A59241J3217P415O408J4004J0106J2889M2055L3312L1844M5766Q8056Q9530
10958E53843J17884J68767K20650K57262K47981J58880M8099p1974j91783k36741
10948A272868k08831j75718j39658r4087p8829o9853m9077k8910k8466l4761l3702
$$ plain form
10937 330976 316289 297418 283013 269056 252098 222600 203118 192576 182000 162318 149787
10926 149787 147804 143226 137333 134457 128949 119758 122503 106965 98111 112782 122394 111259 108642
10913 108642 101007 103556 119004 123412 125743 126919 116647 98958 99803 109277 118043 128093 129317
10900 129317 122953 122827 122944 112163 104672 109203 109161 105588 111288 106410 88968 72213 63608 64614
10886 64614 65873 61900 70671 76479 81516 87778 98431 95979 96577 91559 88830 97000 112115 123953
10872 123953 131685 133029 128045 116345 98809 109995 126237 138182 127104 120479 106439 102719
10860 102719 100168 113245 114488 113063 111087 105729 100582 104072 121426 136340 149810 168950 191250
10847 191250 200188 205075 204931 201216 181339 151545 139649 139114 134921 113915 107336 109364 115016 108963
$$ packed form
10937C30976j4687j8871j4405j3957j6958k9498j9482j0542j0576j9682j2531
10926A49787j983m578n893k876n508r191K745j5538q854J4671R612j1135k617
10913A08642p635K549J5448M408K331J176j0272j7689Q45R474Q766J0050J224
10900A29317o364j26J17j0781p491M531m2l573N700m878j7442j6755q605J006
10886F4614J259l973Q771N808N037O262J0653k452N98n018k729Q170J5115J1838
10872A23953P732J344m984j1700j7536J1186J6242J1945j1078o625j4040l720
10860A02719k551J3077J243j425j976n358n147L490J7354J4914J3470J9140K2300
10847A91250Q938M887j44l715j9877k9794j1896n35m193k1006o579K028N652o053
$$ plain form
10833 108963 101661 87299 95815 99422 100274 89574 89682 99064 99092 99318 95510 95372 98698 117286 117279 97490
10817 97490 98234 100154 108624 104914 108010 112342 106553 97843 86294 100307 111117 109775 107468 107124
10803 107124 112768 122255 120534 114379 127594 145103 165046 179834 198339 224846 257073 292508
10791 292508 335746 368935 379265 389072 411522 408866 394151 354112 313891 280457 254662 243783
10779 243783 225629 218154 206553 198541 196557 197698 189419 196847 197842 200207 196070 184707 185795 187861
10765 187861 186548 183056 180543 175165 178169 180399 187855 177142 166802 158540 153162 154279 157701 156890
10751 156890 166482 183621 185615 196410 199477 200844 219058 223512 215687 214319 200334 201432 207622
10738 207622 206314 214299 213400 204135 200260 190556 189740 177136 180641 202243 220845 210912 183800 182334
$$ packed form
10833A08963p302j4362Q516L607Q52j0700J08R382K8K26l808j38L326J8588pj9789
10817I7490P44J920Q470l710L096M332n789q710j1549J4013J0810j342k307l44
10803A07124N644R487j721o155J3215J7509J9943J4788J8505K6507L2227L5435
10791B92508M3238L3189J0330R807K2450k656j4715m0039m0221l3434k5795j0879
10779B43783j8154p475j1601q012j984J141q279P428R95K365m137j1363J088K066
10765A87861j313l492k513n378L004K230P456j0713j0340q262n378J117L422q11
10751A56890R592J7139J994J0795L067J367J8214M454p825j368j3985J098O190
10738B07622j308P985q99r265l875r704q16j2604L505K1602J8602r933k7112j466
$$ plain form
10724 182334 199052 228281 235708 248954 274439 290654 302058 304593 299908 292399 296400 299616 293046
10711 293046 305201 303260 294001 278693 270098 290244 291074 292475 294868 293092 300674 301211 311069 321496
10697 321496 328534 332678 320124 313030 304822 283091 240629 196169 174876 167091 162763 157397 171515
10684 171515 223332 250948 282141 308711 340153 350362 366612 397436 407438 416220 403933 410609
10672 410609 430875 447547 443309 445675 454462 473133 504270 546438 620806 673712 696150 702690
10660 702690 693154 662792 637716 614230 585944 560491 543480 540043 546181 550455 560877 565270
10648 565270 578421 583299 588967 602602 630465 665824 690828 718548 743994 760457 782811 784413
10636 784413 779839 784435 806529 808804 816225 822499 836930 852586 868892 879738 890813 915234
$$ packed form
10724A82334J6718K9229P427J3246K5485J6215J1404K535m685p509M001L216o570
10711B93046J2155j941r259j5308q595K0146Q30J401K393j776P582N37R858J0427
10697C21496P038M144j2554p094q208k1731m2462m4460k1293p785m328n366J4118
10684A71515N1817K7616L1193K6570L1442J0209J6250L0824J0002Q782j2287O676
10672D10609K0266J6672m238K366Q787J8671L1137M2168P4368N2906K2438O540
10660G02690r536l0362k5076k3486k8286k5453j7011l437O138M274J0422M393
10648E65270J3151M878N668J3635K7863L5359K5004K7720K5446J6463K2354J602
10636G84413m574M596K2094K275P421O274J4431J5656J6306J0846J1075K4421
$$ plain form
10624 915234 935522 938310 938042 944140 950266 967075 966787 965905 962861 971518 980192 987124 1000161 1026502
10610 1026502 1060809 1100118 1141271 1160884 1179856 1223996 1258499 1276423 1283362 1291279 1327530 1375849
10598 1375849 1405425 1440134 1478973 1526723 1564469 1593127 1642528 1685100 1735868 1789145 1868985
10587 1868985 1955161 2043515 2150791 2245729 2353429 2444392 2539556 2643294 2760377 2892529
10577 2892529 3036435 3194159 3373375 3575606 3799650 4037696 4301777 4603776 4894365
10568 4894365 5186754 5477860 5759416 6044370 6361179 6677270 6985966 7323866 7725775
10559 7725775 8210448 8849080 9666297 10667330 11853646 13233680 14761851 16394440 18143333
10550 18143333 20051015 22224021 24797700 27946149 31910824 36937729 43357216 51607264
$$ packed form
10624I15234K0288K788k68O098O126J6809k88q82l044Q657Q674O932J3037K6341
10610A026502L4307L9309M1153J9613J8972M4140L4503J7924O939P917L6251M8319
10598A375849K9576L4709L8839M7750L7746K8658M9401M2572N0768N3277P9840
10587A868985Q6176Q8354J07276R4938J07700R0963R5164J03738J17083J32152
10577B892529J43906J57724J79216K02231K24044K38046K64081L01999K90589
10568D894365K92389K91106K81556K84954L16809L16091L08696L37900M01909
10559G725775M84673O38632Q17217J001033J186316J380034J528171J632589J748893
10550A8143333J907682K173006K573679L148449L964675N026905O419487Q250048
$$ plain form
10542 51607264 62376643 76723337 96118329 122459419 157573657 201644731 250655333
10535 250655333 295230721 322863584 325873601 305607171 267911237 221880496 178767852
10528 178767852 145363407 121676756 104977127 92593173 82565176 73758979 65785872
10521 65785872 58639163 52390751 47009771 42389160 38368318 34773313 31521767 28569824
10513 28569824 25910921 23580183 21561910 19826078 18356974 17078211 15970287 15042091
10505 15042091 14293255 13712630 13251376 12874964 12541645 12181715 11749191 11246928 10668660
10496 10668660 10038461 9370904 8695252 8074810 7513858 7007664 6560153 6163811 5830124
10487 5830124 5543776 5273132 5036370 4833485 4651257 4494276 4360940 4269455 4201615 4138628
$$ packed form
10542E1607264J0769379J4346694J9394992K6341090L5114238M4071074M9010602
10535B50655333M4575388K7632863L010017k0266430l7695934m6030741m3112644
10528A78767852l3404445k3686651j6699629j2383954j0027997q806197p973107
10521F5785872p146709o248412n380980m620611m020842l595005l251546k951943
10513B8569824k658903k330738k018273j735832j469104j278763j107924r28196
10505A5042091p48836n80625m61254l76412l33319l59930m32524n02263n78268
10496A0668660o30199o67557o75652o20442n60952n06194m47511l96342l33687
10487E830124k86348k70644k36762k02885j82228j56981j33336r1485o7840o2987
$$ plain form
10477 4138628 4105707 4099895 4104580 4117610 4179973 4293695 4462064 4688936 4980192 5324558 5685603
10466 5685603 6056104 6401821 6652463 6738160 6636353 6376650 5994691 5536938 5068142 4614587
10456 4614587 4206876 3853784 3546257 3285391 3036298 2821197 2626955 2446895 2279664
10447 2279664 2138861 2002685 1895485 1799507 1689892 1591663 1521000 1467813 1430884 1390711
10437 1390711 1358544 1319888 1281649 1236013 1200800 1170436 1140634 1115866 1116926 1121667 1142565 1187109
10425 1187109 1215743 1231566 1218102 1192418 1152384 1097158 1059179 1022667 994492 981344 980830 981249
10413 981249 974793 972326 974645 974457 977958 1004714 1036788 1037584 1026938 1003614 953170 899728 846125
10400 846125 802749 766029 721395 694774 679845 666958 646524 631053 622727 613519 603423 606181
$$ packed form
10477D138628l2921n812M685J3030O2363J13722J68369K26872K91256L44366L61045
10466E685603L70501L45717K50642Q5697j01807k59703l81959m57753m68796m53555
10456D614587m07711l53092l07527k60866k49093k15101j94242j80060j67231
10447B279664j40803j36176j07200r5978j09615r8229p0663n3187l6929m0173
10437A390711l2167l8656l8239m5636l5213l0364k9802k4768J060M741K0898M4544
10425A187109K8634J5823j3464k5684m0034n5226l7979l6512k8175j3148n14M19
10413I81249o456k467K319j88L501K6756L2074P96j0646k3324n0444n3442n3603
10400H46125m3376l6720m4634k6621j4929j2887k0434j5471q326r208j0096K758
$$ plain form
10388 606181 608600 622936 644583 675402 708256 723636 735559 743871 745613 732559 712425 678540
10376 678540 618125 564070 526151 479807 445394 415186 403464 406775 404642 411465 415169 408286
10364 408286 398049 389716 381384 379343 375958 367854 341203 318779 313162 305339 301081 294123 279903
10351 279903 264256 263243 265316 270193 278467 289705 305385 325798 334045 338650 338215 336478 327259
10338 327259 321139 318576 312285 304982 321870 328425 333660 327146 315822 294774 288529 282919 291425
10325 291425 291888 277482 256899 237346 236913 245975 256079 250801 256084 259496 267265 283389 297062
10312 297062 273494 260970 261519 267871 277805 277755 270806 254332 248160 247071 237181 231455 229503 221602
10298 221602 217424 215575 230641 234939 237694 227988 224939 227799 232763 227097 228841 240298 240688 236588
$$ packed form
10388F06181K419J4336K1647L0819L2854J5380J1923Q312J742j3054k0134l3885
10376F78540o0415n4055l7919m6344l4413l0208j1722L311k133O823L704o883
10364D08286j0237q333q332k041l385q104k6651k2424n617p823m258o958j4220
10351B79903j5647j013K073M877Q274J1238J5680K0413Q247M605m35j737r219
10338C27259o120k563o291p303J6888O555N235o514j1324k1048o245n610Q506
10325B91425M63j4406k0583j9553m33R062J0104n278N283L412P769J6124J3673
10312B97062k3568j2524N49O352R934n0o949j6474o172j089r890n726j952p901
10298B21602m178j849J5066M298K755r706l049K860M964n666J744J1457L90m100
$$ plain form
10284 236588 219236 224852 215641 202218 215382 221637 201632 196516 198994 198585 191192 189195 189787 188827
10270 188827 203799 214274 217668 225873 244640 252729 245524 236816 237172 233704 225506 224307 224760 224630
10256 224630 211219 192103 186580 190286 186620 196291 197000 197632 199826 194779 185448 181631 186963 182271
10242 182271 183184 189867 196189 171845 154192 160370 165644 150528 152142 168779 177991 175475 180651
10229 180651 188522 190982 185490 174507 159441 157473 140407 120567 104649 102653 121096 124744 126228
10216 126228 131549 156084 161644 146365 138989 146768 161161 148405 151531 149662 146078 163267 169803
10203 169803 151128 132574 157399 184161 203913 206293 195846 189064 189454 200119 222925 239630
10191 239630 274968 305982 345412 395800 459952 526191 569996 571753 552570 504021 456760 405282
$$ packed form
10284B36588j7352N616r211j3423J3164O255k0005n116K478m09p393j997N92r60
10270A88827J4972J0475L394Q205J8767Q089p205q708L56l468q198j199M53j30
10256B24630j3411j9116n523L706l666R671P09O32K194n047r331l817N332m692
10242A82271R13O683O322k4344j7653O178N274j5116J614J6637R212k516N176
10229A80651P871K460n492j0983j5066j968j7066j9840j5918j996J8443L648J484
10216A26228N321K4535N560j5279p376P779J4393j2756L126j869l584J7189O536
10203A69803j8675j8554K4825K6762J9752K380j0447o782L90J0665K2806J6705
10191B39630L5338L1014L9430N0388O4152O6239M3805J757j9183m8549m7261n1478
$$ plain form
10179 405282 351580 310759 278062 254750 228817 228200 225639 219963 214970 209605 195569 185766 171122
10166 171122 159039 160978 169909 163188 157442 161201 168885 167761 170115 161581 158886 165314 157030 161062
10152 161062 167752 167431 162858 164581 171517 166669 159949 160553 152634 151617 166746 175659 181446 187994
10138 187994 187003 192153 189911 198907 201997 203485 220519 236451 254588 263509 280623 300488 321225
10125 321225 335976 344895 353915 365682 374067 382181 400468 440087 512473 594771 691885 811518
10113 811518 980057 1200762 1448876 1685867 1843106 1891138 1801719 1618416 1380962 1148896
10103 1148896 971222 835315 727451 662256 614705 564051 506617 469171 449665 415153 376423
10092 376423 349954 344560 323195 305333 294544 292847 280425 269766 241438 237685 232873 233348 218924
$$ packed form
10179D05282n3702m0821l2697k3312k5933o17k561n676m993n365j4036r803j4644
10166A71122j2083J939Q931o721n746L759P684j124K354q534k695O428q284M032
10152A61062O690l21m573J723O936m848o720O04p919j017J5129Q913N787O548
10138A87994r91N150k242Q996L090J488J7034J5932J8137Q921J7114J9865K0737
10125C21225J4751Q919R020J1767Q385Q114J8287L9619P2386Q2298R7114J19633
10113H11518J68539K20705K48114K36991J57239M8032q9419j83303k37454k32066
10103A148896j77674j35907j07864o5195m7551n0654n7434l7446j9506l4512l8730
10092C76423k6469n394k1365j7862j0789j697j2422j0659k8328l753m812M75j4424
$$ plain form
10079 218924 200131 194713 199131 198832 184844 180222 180592 179086 171565 176372 181909 168543 178554 171384
10065 171384 140711 123428 131277 154369 161061 153910 145399 155075 164923 164929 177836 190325 186693 183329
10051 183329 190109 216886 222317 222945 231910 244496 235256 230549 251622 279144 307272 325223 337527
10038 337527 344892 345882 349389 344608 326782 309833 291542 273152 259612 244876 221555 204549
10026 204549 194841 197501 201820 203104 201642 207800 216849 207934 190992 196372 193646 194330 208915 206014
10012 206014 199871 199789 192227 179486 175867 170112 164378 162069 162655 166817 161796 152394 149024 156985 167800
9997 167800 169165 163026 155856 162854 175307 174592 156537 137713 137954 145304 142561 142927 150848 155896
9983 155896 157747 160630 158216 143321 142125 143004 142741 137169 138769 144300 150517 145490 131960 150655
$$ packed form
10079B18924j8793n418M418k99j3988m622L70j506p521M807N537j3366J0011p170
10065A71384l0673j7283P849K3092O692p151q511R676R848OJ2907J2489l632l364
10051A83329O780K6777N431O28Q965J2586r240m707K1073K7522K8128J7951J2304
10038C37527P365R90L507m781j7826j6949j8291j8390j3540j4736k3321j7006
10026B04549r708K660M319J284j462O158R049q915j6942N380k726O84J4585k901
10012B06014o143q2p562j2741l619n755n734k309N86M162n021r402l370P961J0815
9997A67800J365o139p170O998J2453p15j8055j8824K41P350k743L66P921N048
9983A55896J851K883k414j4895j196Q79k63n572J600N531O217n027j3530J8695
$$ plain form
9969 150655 149979 151898 149887 148026 136667 124121 127912 128597 135855 139696 137261 148207 152480 153395
9955 153395 158546 158636 157872 159232 150219 151626 147012 133782 140190 158036 183639 189195 181377 171174
9941 171174 148066 139251 148051 167746 169816 163967 159341 161678 181164 192030 182413 164374 153431
9928 153431 137766 136234 144600 164363 169959 169877 162103 142724 135518 158473 168641 159208 157790 156322
9914 156322 148790 130427 124815 123205 129212 130864 128817 138309 141829 127965 115177 121621 130812 132916
9900 132916 138510 136956 135434 138959 145189 154280 155104 155312 148517 159231 161309 161898 160810 159727 160825
9885 160825 157225 162530 172960 165931 169501 176948 170600 169155 170869 169051 158995 158981 156674 148718
9871 148718 141729 145434 156544 166138 173589 173465 169994 164134 160343 145553 141478 140195 143041 158222
$$ packed form
9969A50655o76J919k011j861j1359j2546L791O85P258L841k435J0946M273R15
9955A53395N151R0p64J360r013J407m614j3230O408J7846K5603N556p818j0203
9941A71174k3108q815Q800J9695K070n849m626K337J9486J0866r617j8039j0943
9928A53431j5665j532Q366J9763N596q2p774j9379p206K2955J0168r433j418j468
9914A56322p532j8363n612j610O007J652k047R492L520j3864j2788O444R191K104
9900A32916N594j554j522L525O230R091Q24K08o795J0714K078N89j088j083J098
9885A60825l600N305J0430p029L570P447o348j445J714j818j0056j4k307p956
9871A48718o989L705J1110R594P451j24l471n860l791j4790m075j283K846J5181
$$ plain form
9857 158222 172408 178855 181985 185707 187936 183825 179039 189390 191452 174578 168383 168988 163375 164299
9843 164299 158437 153253 160908 171514 177847 177218 169806 170577 164017 164400 161714 150077 144418 162411
9829 162411 163909 157179 174808 174780 175788 177772 163572 159144 175484 181982 183022 181111 179530 174630
9815 174630 173177 181025 180365 178755 184646 176034 170163 162820 159574 152952 155437 156815 161167 156643 164807
9800 164807 170934 169699 181300 183222 183650 186562 187060 179161 170989 163923 156926 163002 160496 165073 173320
9785 173320 156481 153302 159963 176561 176351 188888 182895 185497 180558 176471 179419 181376 184605 186615
9771 186615 187242 166056 159635 146519 144345 155934 160513 168178 175334 175696 180366 176370 171753 165722
9757 165722 165026 177796 177065 178146 174142 163271 160617 169179 181453 186707 181287 178829 173407 184977
$$ packed form
9857A58222J4186O447L130L722K229m111m786J0351K062j6874o195O05n613R24
9843A64299n862n184P655J0606O333o29p412P71o560L83k686j1637n659J7993
9829A62411J498o730J7629k8J008J984j4200m428J6340O498J040j911j581m900
9815A74630j453P848o60j610N891q612n871p343l246o622K485J378M352m524Q164
9800A64807O127j235J1601J922M28K912M98p899q172p066o997O076k506M577Q247
9785A73320j6839l179O661J6598k10J2537n993K602m939m087K948J957L229K010
9771A86615O27k1186o421j3116k174J1589M579P665P156L62M670l996m617o031
9757A65722o96J2770p31J081m004j0871k654Q562J2274N254n420k458n422J1570
$$ plain form
9743 184977 183617 172268 185020 185676 165361 170247 183970 187283 178768 185062 188623 189865 185625 180516
9729 180516 178275 173904 168036 177199 173219 167488 164823 172840 176219 175502 183374 179373 163119 175412
9715 175412 176381 168041 169118 177020 179871 178971 186531 206206 221442 234848 245853 241114 230432 218072
9701 218072 211011 211745 212940 219453 214587 206135 210248 204533 193064 181340 167832 180098 177708 172004
9687 172004 172677 177420 185918 196205 194389 185747 189451 182611 184357 192512 190089 188187 197322 191590
9673 191590 178490 179884 184753 195312 180895 184766 193773 183932 169597 167446 162042 157473 171456
9660 171456 184114 183919 177211 179139 175988 191566 195650 187906 179231 170567 170463 173311 172570 163986 159415
9645 159415 168961 170610 175135 173911 177391 169222 177229 185103 173018 177363 178946 188193 189914 189719
$$ packed form
9743A84977j360j1349J2752O56k0315M886J3723L313q515O294L561J242m240n109
9729A80516k241m371n868R163l980n731k665Q017L379p17P872m001j6254J2293
9715A75412R69q340J077P902K851r00P560J9675J5236J3406J1005m739j0682j2360
9701B18072p061P34J195O513m866q452M113n715j1469j1724j3508J2266k390n704
9687A72004O73M743Q498J0287j816q642L704o840J746Q155k423j902R135n732
9673A91590j3100J394M869J0559j4417L871R007r841j4335k151n404m569J3983
9660A71456J2658j95o708J928l151J5578M084p744q675q664j04K848p41q584m571
9645A59415R546J649M525j224L480q169Q007P874j2085M345J583R247J721j95
$$ plain form
9631 189719 188377 191521 186745 180817 172060 185626 199963 203196 200740 198619 189325 186617 186612 189893 196414
9616 196414 190673 181690 181931 174867 172495 164607 154742 167137 182145 198229 208599 191723 183448
9603 183448 186693 195715 200333 197493 186910 180895 173413 177782 170698 170575 172386 173969 176938 185288
9589 185288 179418 193645 205988 201776 193556 175017 163815 180948 194464 193496 190838 179381 164213
9576 164213 168129 181512 182759 186784 190040 183306 177752 181833 175515 159005 163150 181641 198132
9563 198132 194241 189789 203483 208764 193267 184049 187867 193981 198723 194702 197419 205406 206281 192377
9549 192377 190727 198660 190301 191587 182590 163573 167481 175381 175413 178281 182696 175589 164609 162689
9535 162689 171565 168280 163945 176374 193814 185254 171501 159054 170519 163593 151772 165429 177875
$$ packed form
9631A89719j342L144m776n928q757J3566J4337L233k456k121r294k708nL281O521
9616A96414n741q983K41p064k372p888r865J2395J5008J6084J0370j6876q275
9603A83448L245R022M618k840j0583o015p482M369p084j23J811J583K969Q350
9589A85288n870J4227J2343m212q220j8539j1202J7133J3516r68k658j1457j5168
9576A64213L916J3383J247M025L256o734n554M081o318j6510M145J8491J6491
9563A98132l891m452J3694N281j5497r218L818O114M742m021K717P987Q75j3904
9549A92377j650P933q359J286q997j9017L908P900L2K868M415p107j0980j920
9535A62689Q876l285m335J2429J7440q560j3753j2447J1465o926j1821J3657J2446
$$ plain form
9522 177875 176538 176282 186084 189328 190366 189172 177978 169346 168981 162267 171357 185366 193671 195278
9508 195278 191117 194480 195622 208697 216353 203314 194392 182470 181881 186724 205128 195311 183026
9495 183026 186660 185610 188494 186173 178307 172134 180657 197653 191215 181819 174332 165136 175216 185421
9481 185421 188168 199619 206273 215921 211904 203036 190894 200030 210266 203716 194780 191249 189472 195369
9467 195369 184550 176021 170867 176408 179024 187802 186997 200465 203121 187099 176187 184496 179888 177571
9453 177571 176592 184004 194149 191631 189655 186720 187551 194916 203381 191597 193549 201153 198744 207704
9439 207704 208094 199105 188963 195393 199728 194886 200274 191827 198855 212606 211902 218223 220064 220373 209743
9424 209743 194863 186076 191594 195003 202104 209450 222942 218192 210780 220799 223439 222219 218468 232977
$$ packed form
9522A77875j337k56R802L244J038j194j1194q632l65o714R090J4009Q305J607
9508A95278m161L363J142J3075P656j3039q922j1922n89M843J8404r817j2285
9495A83026L634j050K884k321p866o173Q523J6996o438r396p487r196J0080J0205
9481A85421K747J1451O654R648m017q868j2142R136J0236o550q936l531j777N897
9467A95369j0819q529n154N541K616Q778q05J3468K656j6022j0912Q309m608k317
9453A77571r79P412J0145k518j976k935Q31P365Q465j1784J952P604k409Q960
9439B07704L90q989j0142O430M335m842N388q447P028J3751p04O321J841L09j0630
9424B09743j4880q787N518L409P101P346J3492m750p412J0019K640j220l751J4509
$$ plain form
9410 232977 234236 214571 214216 227628 237210 239326 220512 206475 209327 216066 224792 218826 212643 197204
9396 197204 183422 190267 196736 190699 189944 198651 199604 198463 203126 215741 208018 204973 212188 217197
9382 217197 218925 237241 244612 235520 224855 232078 224036 216479 229557 228162 229035 216262 211968 209928
9368 209928 209046 219813 223395 227829 223003 222145 217171 224273 232981 241471 240229 247361 250158 229462
9354 229462 222078 229400 244429 239245 236729 236892 240543 236827 245843 249836 248876 252968 239278 246611
9340 246611 249122 247031 248297 226663 220931 224124 229339 226559 224506 219850 235883 231491 211360 221466
9326 221466 236814 239934 230096 226953 241289 251243 252117 248913 251307 255400 260004 267487 262510 255007
9312 255007 249787 244877 242656 231013 233082 232996 245064 254283 246980 237973 241597 251697 263024 271210
$$ packed form
9410B32977J259j9665l55J3412R582K116j8814j4037K852O739Q726n966o183j5439
9396A97204j3782O845O469o037p55Q707R53j141M663J2615p723l045P215N009
9382B17197J728J8316P371r092j0665P223q042p557J3078j395Q73j2773m294k040
9368B09928q82J0767L582M434m826q58m974P102Q708Q490j242P132K797k0696
9354B29462p384P322J5029n184k516J63L651l716R016L993r60M092j3690P333
9340B46611K511k091J266k1634n732L193N215k780k053m656J6033m392k0131J0106
9326B21466J5348L120r838l143J4336R954Q74l204K394M093M604P483m977p503
9312B55007n220m910k221j1643K069q6J2068R219p303r007L624J0100J1327Q186
$$ plain form
9298 271210 288318 294644 294265 291376 287887 283294 278910 274444 257167 243709 244831 251003 259769 256456
9284 256456 260172 254259 271356 283195 284095 281934 269384 276199 279479 276914 274248 277964 279050 282892
9270 282892 285662 288084 288896 283971 274672 277274 282995 278902 277051 277809 283554 287032 279576 275649 284704
9255 284704 293440 290649 286452 290295 291101 298363 312173 306488 316015 315044 304106 302380 314104 313209
9241 313209 310369 307184 316977 319173 303950 306816 306079 300096 319608 329413 329271 334175 328297 312291
9227 312291 303598 311678 315404 327231 331672 337681 331815 320319 320734 328721 335798 334837 334131 343219 347840
9212 347840 356542 358331 365767 365469 355672 346652 344993 351298 351634 359712 364778 359699 383092 391732 379792
9197 379792 377243 376241 375173 374399 374298 375662 370172 381405 396050 391653 381923 375365 379034 384838
$$ packed form
9298B71210J7108O326l79k889l489m593m384m466j7277j3458J122O172Q766l313
9284B56456L716n913J7097J1839R00k161j2550O815L280k565k666L716J086L842
9270B82892K770K422Q12m925r299K602N721m093j851P58N745L478p456l927R055
9255B84704Q736k791m197L843Q06P262J3810n685R527r71j0938j726J1724q95
9241C13209k840l185R793K196j5223K866p37n983J9512R805j42M904n878j6006
9227C12291q693Q080L726J1827M441O009n866j1496M15P987P077r61p06R088M621
9212C47840Q702J789P436k98r797r020j659O305L36Q078N066n079K3393Q640j1940
9197C79792k549j002j068p74j01J364n490J1233J4645m397r730o558L669N804
$$ plain form
9183 384838 387795 387867 401913 391794 390977 397999 400274 409497 417010 413193 412139 422905 431564 424000
9169 424000 419611 420129 404767 395705 404284 411031 429047 432936 424197 428087 432703 435959 451926 462193
9155 462193 455201 444054 443078 438593 447160 450715 445993 447654 454638 454414 458242 453620 461572 470458 459377
9140 459377 461378 476928 483831 473088 463901 475220 492431 502756 503848 494776 497488 488528 498769
9127 498769 516359 515283 513330 517225 520295 518990 517583 506904 511092 518581 532489 538788 546922 559287
9113 559287 561024 552119 550769 552455 563084 573833 571559 573226 564886 555017 556983 574540 595915
9100 595915 606468 602775 607861 603483 588225 584916 602169 608683 613784 613439 625561 634394 638259 655458
9086 655458 663411 668527 679144 685068 689800 681848 684756 685647 684998 690195 689576 689473 692523 702908 702544
$$ packed form
9183C84838K957P2J4046j0119q17P022K275R223P513l817j054J0766Q659p564
9169D24000m389N18j5362r062Q579O747J8016L889q739L890M616L256J5967J0267
9155D62193o992j1147r76m485Q567L555m722J661O984k24L828m622P952Q886j1081
9140D59377K001J5550O903j0743r187J1319J7211J0325J092r072K712q960J0241
9127D98769J7590j076j953L895L070j305j407j0679M188P489J3908O299Q134J2365
9113E59287J737q905j350J686J0629J0749k274J667q340r869J966J7557K1375
9100E95915J0553l693N086m378j5258l309J7253O514N101l45J2122Q833L865J7199
9086F55458P953N116J0617N924M732p952K908Q91o49N197o19j03L050J0385l64
$$ plain form
9071 702544 700049 697221 706428 726165 736813 729942 719109 729340 754352 769137 778086 793343 792261
9058 792261 796831 800373 799414 812933 825618 844112 841508 848836 864216 873437 870412 878081 888828
9045 888828 882384 868645 863287 881591 897774 897998 899330 919123 927284 936423 953792 968016 973981
9032 973981 977078 992115 1008171 1023446 1023262 1040830 1055167 1061462 1081343 1086390 1088335 1107365 1124291
9019 1124291 1147998 1161062 1155706 1158311 1173214 1195471 1217188 1231767 1250490 1257032 1274694 1283621
9007 1283621 1290438 1311099 1333587 1344904 1363012 1374630 1394917 1405592 1404631 1423618 1439809 1461111
8995 1461111 1486831 1501848 1525895 1556851 1575749 1593726 1610674 1637695 1650323 1671564 1694070
8984 1694070 1699165 1727600 1750507 1770775 1797059 1835239 1855544 1876055 1900848 1929685 1955629 1976064
$$ packed form
9071G02544k495k828R207J9737J0648o871j0833J0231K5012J4785Q949J5257j082
9058G92261M570L542r59J3519J2685J8494k604P328J5380R221l025P669J0747
9045H88828o444j3739n358J8304J6183K24J332J9793Q161R139J7369J4224N965
9032I73981L097J5037J6056J5275j84J7568J4337O295J9881N047J945J9030J6926
9019A124291K3707J3064n356K605J4903K2257K1717J4579J8723O542J7662Q927
9007A283621O817K0661K2488J1317J8108J1618K0287J0675r61J8987J6191K1302
8995A461111K5720J5017K4047L0956J8898J7977J6948K7021J2628K1241K2506
8984A694070N095K8435K2907K0268K6284L8180K0305K0511K4793K8837K5944K0435
$$ plain form
8972 1976064 1994859 2028992 2069725 2106616 2143764 2179554 2218420 2253625 2283123 2319052 2359615
8961 2359615 2391675 2420625 2455942 2504296 2542451 2582875 2633780 2682918 2738518 2783179 2839110
8950 2839110 2894693 2950034 2991038 3038395 3088034 3134459 3184920 3251939 3315284 3384380 3457385
8939 3457385 3509227 3566287 3627287 3706660 3802865 3899503 3969629 4048063 4134352 4214757 4310300
8928 4310300 4396018 4480269 4572740 4682730 4788150 4887020 4996761 5106924 5206965 5330018
8918 5330018 5445232 5558895 5672392 5794587 5920844 6058930 6206462 6338941 6473239 6618242
8908 6618242 6758879 6902934 7061930 7222419 7376937 7537674 7700612 7872500 8034653 8211636
8898 8211636 8386386 8572372 8731307 8898929 9077849 9268488 9457573 9639899 9814612 9985585
$$ packed form
8972A976064J8795L4133M0733L6891L7148L5790L8866L5205K9498L5929M0563
8961B359615L2060K8950L5317M8354L8155M0424N0905M9138N5600M4661N5931
8950B839110N5583N5341M1004M7357M9639M6425N0461O7019O3345O9096P3005
8939C457385N1842N7060O1000P9373R6205R6638P0126P8434Q6289Q0405R5543
8928D310300Q5718Q4251R2471J09990J05420R8870J09741J10163J00041J23053
8918E330018J15214J13663J13497J22195J26257J38086J47532J32479J34298J45003
8908F618242J40637J44055J58996J60489J54518J60737J62938J71888J62153J76983
8898H211636J74750J85986J58935J67622J78920J90639J89085J82326J74713J70973
$$ plain form
8888 9985585 10161203 10355597 10533053 10695219 10854327 11010592 11168824 11304444 11438277 11557628
8878 11557628 11675919 11794944 11894968 11994689 12081557 12157153 12225425 12279018 12308080 12319112 12331386
8867 12331386 12338536 12337205 12317752 12281865 12235319 12174632 12118312 12039066 11934704 11822174 11697879
8856 11697879 11587531 11464084 11328922 11169407 11018526 10861774 10706777 10556352 10397448
8847 10397448 10224854 10059716 9886507 9724189 9539578 9349188 9172594 8997460 8834803
8838 8834803 8655478 8474223 8300394 8127440 7951215 7779475 7629293 7464630 7309940 7141986
8828 7141986 6981298 6857072 6719274 6575754 6439429 6302607 6170300 6034988 5895855 5773389
8818 5773389 5647565 5515878 5398111 5290389 5183357 5074015 4956115 4845932 4749801 4657065
$$ packed form
8888I985585J75618J94394J77456J62166J59108J56265J58232J35620J33833J19351
8878A1557628J18291J19025J00024R9721Q6868P5596O8272N3593K9062J1032J2274
8867A2331386P150j331j9453l5887m6546o0687n6320p9246j04362j12530j24295
8856A1697879j10348j23447j35162j59515j50881j56752j54997j50425j58904
8847A0397448j72594j65138j73209j62318j84611j90390j76594j75134j62657
8838H834803j79325j81255j73829j72954j76225j71740j50182j64663j54690j67954
8828G141986j60688j24226j37798j43520j36325j36822j32307j35312j39133j22466
8818E773389j25824j31687j17767j07722j07032j09342j17900j10183r6131r2736
$$ plain form
8808 4657065 4560297 4467404 4372602 4289379 4203956 4108519 4035167 3958619 3873084 3782172 3715901
8797 3715901 3653446 3586696 3508369 3448342 3383031 3315960 3257442 3204932 3153823 3094260 3027933
8786 3027933 2974092 2920635 2873657 2827009 2780397 2735088 2690301 2630890 2577273 2537528 2499213
8775 2499213 2464649 2435931 2398774 2359985 2316575 2288570 2251533 2220516 2186270 2123409 2094531
8764 2094531 2082216 2056327 2032939 2007417 1979122 1948321 1903682 1865277 1843935 1817794 1802492
8753 1802492 1772311 1743555 1726958 1694535 1668076 1645734 1627242 1607122 1579831 1559799 1551672 1546975
8741 1546975 1540864 1514016 1504170 1474586 1461571 1444909 1426069 1419196 1393154 1353134 1321402 1306357
8729 1306357 1299128 1286054 1270902 1248660 1221577 1209619 1196620 1185755 1176333 1168267 1157163 1147427
$$ packed form
8808D657065r6768r2893r4802q3223q5423r5437p3352p6548q5535r0912o6271
8797C715901o2455o6750p8327o0027o5311o7071n8518n2510n1109n9563o6327
8786C027933n3841n3457m6978m6648m6612m5309m4787n9411n3617l9745l8315
8775B499213l4564k8718l7157l8789m3410k8005l7037l1017l4246o2861k8878
8764B094531j2315k5889k3388k5522k8295l0801m4639l8405k1342k6141j5302
8753A802492l0181k8756j6597l2423k6459k2342j8492k0120k7291k0032q127m697
8741A546975o111k6848r846k9584j3015j6662j8840o873k6042m0020l1732j5045
8729A306357p229j3074j5152k2242k7083j1958j2999j0865r422q066j1104r736
$$ plain form
8717 1147427 1132367 1117918 1107691 1097930 1092610 1069709 1068896 1056273 1042206 1049440 1033829 1008554
8705 1008554 1001431 995593 975531 971800 972526 951213 926679 920521 910473 894905 864935 859427 867213
8692 867213 857259 855706 852074 846205 838584 832622 823557 817767 812455 798188 802382 797599 784355 778053
8678 778053 773310 760630 745004 724388 718768 723814 715122 708625 709899 718455 705583 700206 691128
8665 691128 681756 675083 676779 661400 652873 660591 645634 640068 648067 649039 644499 630587 606781 599651
8651 599651 609267 611216 598173 593850 590646 589572 586046 595448 611901 611050 608935 611007 586106 581955
8637 581955 573598 560451 558132 556997 541444 539506 537434 520374 500989 500992 510154 522217 532298 521623
8623 521623 516942 508474 504281 507628 510889 519647 495159 488949 487348 485524 489320 476064 476724 478257
$$ packed form
8717A147427j5060j4449j0227r761n320k2901q13j2623j4067P234j5611k5275
8705A008554p123n838k0062l731P26k1313k4534o158j0048j5568k9970n508P786
8692H67213r954j553l632n869p621n962r065n790n312j4267M194m783j3244o302
8678G78053m743j2680j5626k0616n620N046q692o497J274Q556j2872n377r078
8665F91128r372o673J696j5379q527P718j4957n566P999R72m540j3912k3806p130
8651E99651R616J949j3043m323l204j074l526R402J6453q51k115K072k4901m151
8637E81955q357j3147k319j135j5553j938k072j7060j9385LR162J2063J0081j0675
8623E21623m681q468m193L347L261Q758k4488o210j601j824L796j3256O60J533
$$ plain form
8609 478257 471143 470411 472375 463029 470777 475552 459913 437709 438220 449007 446508 437638 430876 425014
8595 425014 423874 409965 406830 410008 415489 421656 427102 436381 440007 438465 433893 431954 442338 442131
8581 442131 435937 430791 436150 457398 473756 484966 485172 480409 476794 472108 469475 463576 451523 436986
8567 436986 420791 409027 400453 405703 396543 380432 358726 343186 353412 349732 339742 322290 314915
8554 314915 316174 330568 338571 338523 326733 332057 341986 338980 325902 308018 295793 304957 318037
8541 318037 326408 320913 302790 306472 309390 299533 309729 320103 305048 307945 306236 304513 292722
8528 292722 297603 295540 301188 298358 290511 294770 281688 263378 250805 269472 280317 273746 271362
8515 271362 269968 269608 265520 263384 258521 256459 258967 248743 232897 226055 227069 230037 241952 230482
$$ packed form
8609D78257p114p32J964r346P748M775j5639k2204N11J0787k499q870o762n862
8595D25014j140j3909l135L178N481O167N446R279L626j542m572j939J0384k07
8581D42131o194n146N359K1248J6358J1210K06m763l615m686k633n899j2053j4537
8567D36986j6195j1764q574N250r160j6111k1706j5540J0226l680r990j7452p375
8554C14915J259J4394Q003m8j1790N324R929l006j3078j7884j2225R164J3080
8541C18037Q371n495j8123L682K918r857J0196J0374j5055K897j709j723j1791
8528B92722M881k063N648k830p847M259j3082j8310j2573J8667J0845o571k384
8515B71362j394l60m088k136m863k062K508j0224j5846o842J014K968J1915j1470
$$ plain form
8501 230482 227911 219464 225964 250506 260631 248927 238155 229833 232209 237393 235985 229206 221534
8488 221534 209688 210095 230626 237408 232899 233882 232982 241688 236978 231182 241377 251939 239208 219465
8474 219465 204001 208519 205804 210196 215854 225217 225180 218308 232840 238571 218681 210311 214012 212919
8460 212919 215993 215791 208067 210831 216784 210499 201323 186017 170554 175897 176275 166545 158705 175920
8446 175920 196622 202967 201135 196600 181905 172282 177815 174603 177481 170663 179930 186238 185996 182193
8432 182193 172988 171654 174278 176399 163142 156535 166088 178839 175745 172973 181325 174177 156272 154936
8418 154936 154118 163466 170469 195105 203928 210481 213375 213777 200971 189902 195096 197081 177433 170845
8404 170845 165998 158082 155286 153627 152365 139099 129460 141139 140756 144003 148055 156885 151704 146941
$$ packed form
8501B30482k571q447O500K4542J0125j1704j0772q322K376N184j408o779p672
8488B21534j1846M07K0531O782m509R83r00Q706m710n796J0195J0562j2731j9743
8474B19465j5464M518k715M392N658R363l7o872J4532N731j9890q370L701j093
8460B12919L074k02p724K764N953o285r176j5306j5463N343L78r730p840J7215
8446A75920K0702O345j832m535j4695r623N533l212K878o818R267O308k42l803
8432A82193r205j334K624K121j3257o607R553J2751l094k772Q352p148j7905j336
8418A54936q18R348P003K4636Q823O553K894M02j2806j1069N194J985j9648o588
8404A70845m847p916k796j659j262j3266r639J1679l83L247M052Q830n181m763
$$ plain form
8390 146941 141218 133521 133791 145154 148829 139065 133746 128442 139329 146311 148050 137885 142114 139715
8376 139715 133770 147667 154011 151153 142551 155888 152503 150869 153930 148081 156004 153672 156489 142661
8362 142661 126151 127850 131143 135347 158565 159489 153660 160856 150312 150890 150598 142120 137056 139439
8348 139439 149055 146215 135920 123509 118477 122267 124811 120056 127247 146677 152416 158455 172138
8335 172138 173508 177437 185528 187211 199840 200334 194088 202696 202287 186168 162069 157955 144721 131361
8321 131361 137826 140805 145189 146203 140034 118526 125746 135880 134566 134260 141141 148228 150783 147893
8307 147893 133748 126449 124708 118747 125227 123674 124541 134031 129950 123357 117393 115307 121354 132093
8293 132093 145477 157683 169208 185699 185055 179818 176159 172999 165344 149815 139378 128460 119467
$$ packed form
8390A46941n723p697K70J1363L675r764n319n304J0887O982J739j0165M229k399
8376A39715n945J3897O344k858q602J3337l385j634L061n849P923k332K817j3828
8362A42661j6510J699L293M204K3218R24n829P196j0544N78k92q478n064K383
8348A39439R616k840j0295j2411n032L790K544m755P191J9430N739O039J3683
8335A72138J370L929Q091J683J2629M94o246Q608m09j6119k4099m114j3234j3360
8321A31361O465K979M384J014o169k1508P220J0134j314l06O881P087K555k890
8307A47893j4145p299j741n961O480j553Q67R490m081o593n964k086O047J0739
8293A32093J3384J2206J1525J6491o44n237l659l160p655j5529j0437j0918q993
$$ plain form
8280 119467 112063 107781 115537 123872 132432 117036 112845 107141 119833 128423 123359 124753 122331 113547
8266 113547 106381 109009 101830 99149 95547 94470 82367 74770 86312 97206 105413 98806 93649 100019
8252 100019 102538 108230 94309 86139 93369 84809 86906 92016 99558 88350 76122 84745 90622 87795
8238 87795 86068 101106 95968 88383 86688 85218 75541 74111 92767 107908 101426 86892 70737
8225 70737 70842 81439 88918 93911 87160 80358 88793 105412 106224 90244 76575 72893 82268 81667
8211 81667 81726 84722 84506 79890 70581 69995 81876 87181 67457 72051 80683 85836 88325 90716 84958
8196 84958 69319 60887 63894 71096 73933 77885 74918 70911 61043 60242 56638 69114 75713 85550
8182 85550 83709 80854 83980 90802 81090 70710 80984 88567 84553 85964 85213 84653 75531 71913 60034
$$ packed form
8280A19467p404m282P756Q335Q560j5396m191n704J2692Q590n064J394k422q784
8266A13547p166K628p179k681l602j077j2103p597J1542J0894Q207o607n157O370
8252A00019K519N692j3921q170P230q560K097N110P542j1208j2228Q623N877k827
8238H7795j727J5038n138p585j695j470r677j430J8656J5141o482j4534j6155
8225G0737J05J0597P479M993o751o802Q435J6619Q12j5980j3669l682R375o01
8211H1667N9K996k16m616r309n86J1881N305j9724M594Q632N153K489K391n758
8196H4958j5639q432L007P202K837L952k967m007r868q01l604J2476O599R837
8182H5550j841k855L126O822r712j0380J0274P583m014J411p51n60r122l618j1879
$$ plain form
8167 60034 69944 72251 78082 84479 69612 69163 77379 84221 81495 64514 65597 77294 79694 78607
8153 78607 73444 84028 92917 87031 79990 88240 89810 77718 54288 56255 75424 76307 66088 60807
8139 60807 65352 74588 68895 56959 56292 66367 57678 52246 60658 54994 65466 73341 75961 84034
8125 84034 70359 52094 50370 56774 64467 57054 59511 64716 66133 56441 62511 67711 68524 61808
8111 61808 62039 62061 52046 56451 62377 52367 64184 60479 59973 68666 68001 66369 65321 85647 84259
8096 84259 75111 69202 69718 55624 46560 51032 51769 54938 53464 67549 69435 70025 71900 64609 60973
8081 60973 55271 49197 35138 31428 47725 70891 53852 31629 49233 62626 77051 82006 89595
8068 89595 88639 84357 85503 81540 66329 43581 42072 54710 55529 67895 73875 55582 50318 66849
$$ packed form
8167F0034R910K307N831O397j4867m49Q216O842k726j6981J083J1697K400j087
8153G8607n163J0584Q889n886p041Q250J570j2092k3430J967J9169Q83j0219n281
8139F0807M545R236n693j1936o67J0075q689n432Q412n664J0472P875K620Q073
8125H4034j3675j8265j724O404P693p413K457N205J417r692O070N200Q13o716
8111F1808K31K2j0015M405N926j0010J1817l705n06Q693o65j632j048K0326j388
8096H4259r148n909N16j4094r064M472P37L169j474J4085J886N90J875p291l636
8081F0973n702o074j4059l710J6297K3166j7039k2223J7604J3393J4425M955P589
8068H9595r56m282J146l963j5211k2748j509J2638Q19J2366N980j8293n264J6531
$$ plain form
8054 66849 61248 61653 56735 68119 70128 60138 60340 75759 71615 66879 74578 70589 53843 49058
8040 49058 48677 54636 53604 54736 56070 53179 53793 48079 42097 47171 53074 50658 49622 53693 55933
8025 55933 48236 50826 60150 80529 95282 80753 69809 63605 68156 68193 75145 70106 69999 75076
8011 75076 72051 69381 71889 79256 83246 75003 78019 75741 65162 73260 73570 80990 86226 93888 96505
7996 96505 80331 80566 78605 67119 65740 63838 67569 65751 67001 62369 57596 58924 60991 55226
7982 55226 57704 63825 64519 76409 81415 74475 60360 49858 55962 55964 43750 42552 46375 42569 37415
7967 37415 53935 50556 41004 44877 44276 42355 58342 61265 61930 70076 76068 68813 58786 56002
7953 56002 70364 72265 76585 73011 74246 66276 58639 52957 53958 54216 66784 65772 76572 84411
$$ packed form
8054F6849n601M05m918J1384K009r990K02J5419m144m736P699l989j6746m785
8040D9058l81N959j032J132J334k891O14n714n982N074N903k416j036M071K240
8025E5933p697K590R324K0379J4753j4529j0944o204M551L7O952n039j07N077
8011G5076l025k670K508P367L990q243L016k278j0579Q098L10P420N236P662K617
7996I6505j6174K35j961j1486j379j902L731j818J250m632m773J328K067n765
7982E5226K478O121O94J1890N006o940j4115j0502O104Kj2214j198L823l806n154
7967C7415J6520l379r552L873o01j921J5987K923O65Q146N992p255j0027k784
7953E6002J4362J901M320l574J235p970p637n682J001K58J2568j012J0800P839
$$ plain form
7939 84411 74281 77063 75628 70250 54303 38556 47796 57557 59378 71197 72619 63343 54117 57167
7925 57167 58725 69002 67952 64532 61222 54663 52533 54062 54724 56283 61783 58368 62509 68587 65572
7910 65572 73036 59325 47349 44293 50522 39557 43387 51271 51827 51921 54323 40617 44526 43031
7896 43031 40864 37341 29078 17943 18794 30764 34717 31784 33205 28590 29308 32191 39664 55909
7882 55909 74092 71555 61429 50835 42663 43502 35998 36647 29568 34031 43836 41032 47179 54086
7868 54086 50877 51457 51747 43430 36371 35930 27836 17416 30122 28646 27946 26045 43510 38521 30021
7853 30021 40173 46366 51212 43985 27417 25434 28873 34815 40894 49159 40596 33626 30958 26444
7839 26444 21780 22964 45818 58473 37973 20320 21529 25286 26702 37635 42088 41378 43730 34397
$$ packed form
7939H4411j0130K782j435n378j5947j5747R240R761J821J1819J422r276r226L050
7925E7167J558J0277j050l420l310o559k130J529O62J559N500l415M141O078l015
7910F5572P464j3711j1976l056O229j0965L830P884N56R4K402j3706L909j495
7896D3031k167l523q263j1135Q51J1970L953k933J421m615P18K883P473J6245
7882E5909J8183k537j0126j0594q172Q39p504O49p079M463R805k804O147O907
7868E4086l209N80K90q317p059m41q094j0420J2706j476p00j901J7465m989q500
7853C0021J0152O193M846p227j6568j983L439N942O079Q265q563o970k668m514
7839B6444m664J184K2854J2655k0500j7653J209L757J416J0933M453p10K352r333
$$ plain form
7825 34397 28826 40317 45357 37729 37908 33619 25276 37670 51023 57363 56189 49926 50207 59726
7811 59726 63354 61481 53191 44010 37858 35520 33340 43767 48585 41084 42090 41759 26481 26528 14698
7796 14698 20307 25179 30383 23823 17656 27553 33172 36096 39695 46112 47630 44107 29589 26975
7782 26975 36162 36706 32863 45210 43036 35039 32909 29908 30623 21720 14741 26329 27876 26122 20913
7767 20913 11291 8707 12569 11038 27875 38524 28628 24285 6471 3087 5199 14311 21525 45511
7753 45511 33226 35208 34095 43151 40514 40959 36071 31890 25211 32588 33104 23704 21563 28038 36291
7738 36291 37105 32385 31128 35710 30808 27033 25678 29052 34477 47365 46053 28622 23117 30480
7724 30480 26379 24033 23836 28384 38823 43305 25770 14049 27087 27705 31768 27076 19776 12559
$$ packed form
7825C4397n571J1491N040p628J79m289q343J2394J3353O340j174o263K81R519
7811E9726L628j873q290r181o152k338k180J0427M818p501J006l31j5278M7j1830
7796A4698N609M872N204o560o167R897N619K924L599O417J518l523j4518k614
7782B6975R187N44l843J2347k174p997k130l001P15q903o979J1588J547j754n209
7767B0913r622k584L862j531J6837J0649r896m343j7814l384K112R112P214K3986
7753D5511j2285J982j113R056k637M45m888m181o679P377N16r400k141O475Q253
7738C6291Q14m720j257M582m902l775j355L374N425J2888j312j7431n505P363
7724C0480m101k346j97M548J0439M482j7535j1721J3038O18M063m692p300p217
$$ plain form
7710 12559 8765 6433 20380 38732 37807 34446 27164 16369 4143 1428 12930 31956 31425 29671
7696 29671 30454 32962 31192 16294 -1850 -1589 -6406 -13177 -13268 -11892 -271 21545 30360 36707 34610
7681 34610 23323 6428 19728 26508 17481 5943 181 939 8549 15432 15511 4623 13898 24728
7667 24728 23863 25754 15161 9431 23298 39022 40072 23960 21843 21132 23008 31245 33545 36304
7653 36304 33257 25886 24728 25532 27424 23512 24836 28013 22690 16446 16655 12422 11583 18310 29474
7638 29474 42241 45699 28066 11577 18787 17354 19161 14376 8754 10236 11374 10789 13163 17988
7624 17988 21435 19266 12566 13940 27351 26306 24394 38717 44303 37304 28844 26150 31054 28910
7610 28910 24047 15023 18210 34947 36558 15987 6660 6211 9875 6608 11248 12256 18662 24091
$$ packed form
7710A2559l794k332J3947J8352r25l361p282j0795j2226k715J1502J9026n31j754
7696B9671P83K508j770j4898j8144K61m817o771r1J376J1621K1816Q815O347k097
7681C4610j1287j6895J3300O780r027j1538n762P58P610O883P9j0888R275J0830
7667B4728q65J891j0593n730J3867J5724J050j6112k117p11J876Q237K300K759
7653C6304l047p371j158Q04J892l912J324L177n323o244K09m233q39O727J1164
7638B9474J2767L458j7633j6489P210j433J807m785n622J482J138n85K374M825
7624A7988L447k169o700J374J3411j045j912J4323N586o999q460k694M904k144
7610B8910m863r024L187J6737J611k0571r327m49L664l267M640J008O406N429
$$ plain form
7596 24091 24488 6660 8123 17744 16598 10208 17528 20164 21730 22357 24999 22460 8207 726 10735
7581 10735 22331 29333 15129 14626 15594 2956 4551 13460 24276 28477 35454 35604 25145 -3737
7567 -3737 -24451 -22025 -11539 -7757 -4116 9353 23985 21905 8103 11664 25436 27148 29200
7554 29200 33407 32966 10973 -1011 10273 12856 -1734 625 8750 15356 27338 29665 15738
7541 15738 23475 27174 17366 15003 14489 8523 25737 36022 29753 36336 33045 27100 18932 11987
7527 11987 14797 22528 38805 52710 38495 31000 29025 27111 28000 16697 21782 17644 11189 7874
7513 7874 12552 18086 20580 22480 22687 32245 32731 30413 24763 20690 -507 -1563 8950 32557 35831
7498 35831 29876 11491 -78 -601 1054 15065 2453 -638 10908 15162 9573 21539 30547
$$ packed form
7596B4091L97j7828J463R621j146o390P320K636J566O27K642k539j4253p481J0009
7581A0735J1596P002j4204n03R68j2638J595Q909J0816M201O977J50j0459k8882
7567c737k0714K426J0486L782L641J3469J4632k080j3802L561J3772J712K052
7554B9200M207m41k1993j1984J1284K583j4590K359Q125O606J1982K327j3927
7541A5738P737L699r808k363n14n966J7214J0285o269O583l291n945q168o945
7527A1987K810P731J6277J3905j4215p495j975j914Q89j1303N085m138o455l315
7513G874M678N534K494J900K07R558M86k318n650m073k1197j056J0513K3607L274
7498C5831n955j8385j1569n23J655J4011j2612l091J1546M254n589J1966R008
$$ plain form
7485 30547 24050 18277 19943 25274 27464 10479 -3913 10316 10832 19990 29728 31025 22151 23109
7471 23109 24347 16336 11363 18623 20586 23279 18998 17455 17219 20812 27428 21986 5634 -14834
7457 -14834 -13388 -5863 15024 18605 22763 21874 23942 21878 30480 39696 23206 6848 5454 -1640
7443 -1640 -1707 -4418 -7241 -9790 4369 12479 20964 18071 7911 13953 19703 6121 -3535 7458
7429 7458 15530 10369 8877 18349 23384 12026 5913 4683 2678 15682 13024 -5334 -12349 -2775
7415 -2775 11057 19241 17942 6135 11265 16251 -59 -8433 -3745 11001 6910 12183 11177 12047
7401 12047 15155 11445 21767 30076 25001 17902 5484 5410 -1607 -5496 656 -10545 -17823 -15937
7387 -15937 7316 7970 -7451 -10229 1786 -1969 -12177 -11677 4463 7287 -111 1216 6412 -3386
$$ packed form
7485C0547o497n773J666N331K190j6985j4392J4229N16R158R738J297q874R58
7471B3109J238q011m973P260J963K693m281j543k36L593O616n442j6352k0468
7457a4834J446P525K0887L581M158q89K068k064Q602R216j6490j6358j394p094
7443a640o7k711k823k549J4159Q110Q485k893j0160O042N750j3582r656J0993
7429G458Q072n161j492R472N035j1358o113j230k005J3004k658j8358p015R574
7415b775J3832Q184j299j1807N130M986j6310q374M688J4746m091N273j006Q70
7401A2047L108l710J0322Q309n075p099j2418p4p017l889O152j1201p278J886
7387a5937K3253O54j5421k778J2015l755j0208N00J6140K824p398J327N196r798
$$ plain form
7373 -3386 -6269 -8479 171 11284 15777 15821 14509 9334 9057 9700 15225 27951 25519 13787 -4564
7358 -4564 -20950 -16523 2791 20181 22271 10025 -18 3914 653 953 7866 14414 17054 17762
7344 17762 -2305 -5774 -2764 -190 -5774 -1264 3783 7806 3112 19602 19904 28282 22345 16876
7330 16876 3264 4233 2202 6506 -6725 5726 18310 4867 11695 25044 21939 14420 13775 13206
7316 13206 7045 8391 5838 -5283 3976 8502 -1853 -11180 6250 7366 10086 2103 1228 -4608
7302 -4608 -12464 -18352 -16388 -6924 -5067 -2687 -1462 -7488 -4763 4326 -1750 1527 2314 5095 7081
7287 7081 2953 1658 -4487 -2982 14361 21035 17936 22629 20947 22144 30258 29323 6775 4849 17582
7272 17582 16100 4417 -3686 -2528 -16060 -21043 -20800 -19767 -10775 -3708 -3566 1707 17109 26364
$$ packed form
7373c386k883k210Q650J1113M493M4j312n175k77O43N525J2726k432j1732j8351
7358d564j6386M427J9314J7390K090j2246j0043L932l261L00O913O548K640P08
7344A7762k0067l469L010K574n584M510N047M023m694J6490L02Q378n937n469
7330A6876j3612R69k031M304j3231J2451J2584j3443O828J3349l105p519o45n69
7316A3206o161J346k553j1121R259M526j0355r327J7430J116K720p983q75n836
7302d608p856n888J964R464J857K380J225o026K725R089o076L277P87K781J986
7287G081m128j295o145J505J7343O674l099M693j682J197Q114r35k2548j926J2733
7272A7582j482j1683q103J158j3532m983K43J033Q992P067J42N273J5402R255
$$ plain form
7258 26364 17391 10696 4228 -25 283 17046 12154 13087 16220 12680 -1240 -2672 14375 17983
7244 17983 11394 12514 8561 16925 11962 1643 -5145 158 3351 9720 -3024 -2939 -12657 -11200 9150
7229 9150 25999 27695 20854 7458 -16566 -1574 977 9586 8453 -689 12171 24417 20879
7216 20879 14891 32869 32003 30529 27467 7669 -8208 -13882 -15975 -12353 -9832 -6871 3241 6343
7202 6343 -2366 -9193 -14567 -16476 -4960 -15690 -7175 10884 5424 4429 -639 6953 16331 14416
7188 14416 -185 2889 13330 7835 4475 12513 25284 20004 26668 26341 25675 20633 20347 17824 25547
7173 25547 16263 9191 -4746 -9586 230 2889 1667 12257 17957 22445 30381 27995 27214 39577
7159 39577 31457 14119 13447 15559 5484 13877 24859 22030 26294 19307 8804 4104 3255 8106
$$ packed form
7258B6364q973o695o468m253L08J6763m892R33L133l540j3920j432J7047L608
7244A7983o589J120l953Q364m963j0319o788N303L193O369j2744Q5r718J457K0350
7229I150J6849J696o841j3396k4024J4992K551Q609j133r142J2860J2246l538
7216B0879n988J7978q66j474l062j9798j5877n674k093L622K521K961J0112L102
7202F343q709o827n374j909J1516j0730Q515J8059n460r95n068P592R378j915
7188A4416j4601L074J0441n495l360Q038J2771n280O664l27o66n042k86k523P723
7173B5547r284p072j3937m840R816K659j222J0590N700M488P936k386p81J2363
7159C9577q120j7338o72K112j0075Q393J0982k829M264o987j0503m700q49M851
$$ plain form
7145 8106 14429 8199 -5786 -14750 -13169 -11678 -14567 -9656 -6583 -7785 -11252 -5848 -9133 -5605 1652
7130 1652 -117 -6479 -5941 601 -3381 1961 7301 -272 2536 5395 -9447 -14280 -4583 9732 21907
7115 21907 19983 10397 3270 17205 7062 3037 2013 3398 7078 1812 -8955 3811 -1253 2701
7101 2701 7943 10103 1979 4294 2937 -1976 2910 909 5848 18762 12172 11014 29435 29439 19387
7086 19387 24259 19567 15692 4755 3078 2915 6326 16512 27877 31180 22181 15492 10950 8727
7072 8727 8251 2507 -1882 20346 31896 23370 15297 18447 18947 650 -8143 -5068 -3976 -4262 -3100
7057 -3100 -15734 -18644 -6680 -623 4444 17086 7743 8745 -5304 -4820 -558 -9091 -1600 13715
7043 13715 15683 5662 4468 10021 -3773 -13495 -12043 -9197 -22605 -23543 -14457 -9516 -9598 -12152 -6773
$$ packed form
7145H106O323o230j3985q964J581J491k889M911L073j202l467N404l285L528P257
7130A652j769o362N38O542l982N342N340p573K808K859j4842m833R697J4315J2175
7115B1907j924r586p127J3935j0143m025j024J385L680n266j0767J2766n064L954
7101B701N242K160q124K315j357m913M886k001M939J2914o590j158J8421Mj0052
7086A9387M872m692l875j0937j677j63L411J0186J1365L303q999o689m542k223
7072H727m76n744m389K2228J1550q526q073L150N00j8297q793L075J092k86J162
7057c100j2634k910J1964O057N067J2642r343J002j4049M84M262q533P491J5315
7043A3715J968j0021j194N553j3794r722J452K846j3408r38R086M941q2k554N379
$$ plain form
7028 -6773 4600 5118 1309 11145 14848 17712 16103 6319 4336 2619 -1860 2576 -10955 -4433 -9310
7013 -9310 -4541 867 -146 -9212 -20779 -18984 -15994 -10775 5032 8820 15866 3939 -3934 -9142
6999 -9142 -14999 -8270 -6748 -19319 -11610 -4679 1233 2605 2167 -244 2061 11165 22143 18031 12477
6984 12477 12404 2228 -6388 -12635 -4130 10667 17306 22430 16123 -9642 -25113 -24278 -8740 -5833
6970 -5833 -5031 8333 10601 17364 10756 5228 6078 317 -2845 -5198 -9269 -12094 -6309 -18254 -10223
6955 -10223 13506 16219 5379 -1574 -4071 4020 317 -3114 1712 2589 -11035 -7724 3668 7108
6941 7108 6900 10064 23271 12309 1004 -11720 -14438 -14470 -12470 -14086 -22733 -23418 -2071 1932 5019
6926 5019 5393 6316 11159 9193 4882 11087 -1272 -5044 -2940 -8217 -338 7252 6160 -2673 -3421
$$ packed form
7028f773J1373N18l809R836L703K864j609r784j983j717m479M436j3531O522m877
7013i310M769N408j013r066j1567J795K990N219J5807L788P046j1927p873n208
6999i142n857O729J522j2571P709O931N912J372m38k411K305R104J0978m112n554
6984A2477p3j0176q616o247Q505J4797O639N124o307k5765j5471Q35J5538K907
6970e833Q02J3364K268O763o608n528Q50n761l162k353m071k825N785j1945Q031
6955a0223K3729K713j0840o953k497Q091l703l431M826Q77j3624L311J1392L440
6941G108k08L164J3207j0962j1305j2724k718l2K000j616q647o85K1347M003L087
6926E019L74R23M843j966m311O205j2359l772K104n277P879P590j092q833p48
$$ plain form
6911 -3421 5847 7110 11824 4900 -3401 1399 -2670 -5284 -999 -6294 -461 2423 6328 1094 -372
6896 -372 3256 2629 6568 -4470 -10410 -15273 -10234 4433 11405 13239 1680 -7889 -7493 -4162 -18534
6881 -18534 -15237 -4171 5116 -1493 2841 12140 5108 6699 4122 4246 1698 -6598 -15687 -4694
6867 -4694 -6750 -21754 -5189 -3274 3162 4160 10636 14387 2206 -1402 6554 9341 3532 -670
6853 -670 1344 2640 4287 14352 21371 17900 24912 25029 14873 16899 33099 44110 38941 35834
6839 35834 25343 14949 4673 5072 7562 4056 4789 11156 -431 2009 6620 8440 3381 2186
6825 2186 -12309 -7569 -620 7490 7735 4834 10871 417 -20635 -3835 -1436 -20434 -23058 -11274
6811 -11274 3537 402 -8786 -11814 -11187 -6799 -8262 -543 2477 818 -5706 -5716 -2870 -13911 -18210
$$ packed form
6911c421R268J263M714o924q301M800m069k614M285n295N833K884L905n234j466
6896c72L628o27L939j1038n940m863N039J4667O972J834j1559r569L96L331j4372
6881a8534L297J1066R287o609M334R299p032J591k577J24k548q296r089J0993
6867d694k056j5004J6565J915O436R98O476L751j2181l608P956K787n809m202
6853f70K014J296J647J0065P019l471P012J17j0156K026J6200J1011n169l107
6839C5834j0491j0394j0276L99K490l506P33O367j1587K440M611J820n059j195
6825B186j4495M740O949Q110K45k901O037j0454k1052J6800K399j8998k624J1784
6811a1274J4811l135r188l028O27M388j463P719L020j659o524j0K846j1041m299
$$ plain form
6796 -18210 -20492 -1161 10366 16280 507 3491 11354 -5327 -17740 -3543 3618 3677 -6014 -2279
6782 -2279 5853 -10319 -15885 -678 4697 702 -14921 -24821 -12246 -6508 7671 2801 6673 11199
6768 11199 5690 -6618 -13049 -9191 -11070 587 4635 12009 19509 17972 19797 10680 1646 -5950
6754 -5950 -9963 -12146 -11574 -17525 -19994 -17526 -6222 -12253 -1326 -8735 -13356 -10569 -2429 -13227
6740 -13227 -12211 2499 17138 13122 -9967 -15333 -12299 -2397 8656 15747 5150 -890 -1302 -10184
6726 -10184 -5112 -3792 -7359 -10475 -19968 -20903 -9127 -8847 -6595 -2169 -6536 -6933 -1154 9578 3746
6711 3746 -4554 -4173 -5433 -11844 -5976 6669 1138 -15395 -13820 -6904 8337 7476 -5748 3052
6697 3052 9152 8025 1638 -7148 287 3801 16100 18731 14674 2001 773 8945 17646 11534
$$ packed form
6796a8210k282J9331J1527N914j5773K984P863j6681j2413J4197P161N9r691L735
6782b279Q132j6172n566J5207N375l995j5623r900J2575N738J4179m870L872M526
6768A1199n509j2308o431L858j879J1657M048P374P500j537J825r117r034p596
6754e950m013k183N72n951k469K468J1304o031J0927p409m621K787Q140j0798
6740a3227J016J4710J4639m016k3089n366L034R902J1053P091j0597o040m12q882
6726a0184N072J320l567l116r493r35J1776K80K252M426m367l97N779J0732n832
6711C746q300L81j260o411N868J2645n531j6533J575O916J5241q61j3224Q800
6697C052O100j127o387q786P435L514J2299K631m057j2673j228Q172Q701o112
$$ plain form
6683 11534 16819 7866 -1363 -4770 -2129 -6907 -5670 2967 12934 4848 -180 17057 16490 11449 3395
6668 3395 12362 21218 25946 16394 10090 9929 -1035 -7664 -9786 2183 684 3713 -6533 -8362
6654 -8362 2430 -5356 -14311 -11337 -9100 -12646 15519 24605 1734 -4915 4329 1116 -5884 3678
6640 3678 15779 18035 13092 10315 -4406 -11017 -5110 8893 16379 14628 16076 17108 17062 18905 11702
6625 11702 15664 23226 12592 1132 5995 -3212 -16649 -1579 7228 795 9182 10077 5380 -2944
6611 -2944 -24313 -31251 -14320 2676 14202 9874 12788 21729 16914 21094 11638 1718 -4225 -2066
6597 -2066 2011 -2083 -5444 -10713 -17604 -11728 -5588 11045 17795 15491 9733 -3514 -12633 -9791
6583 -9791 -9544 -11329 -18924 -19661 -14233 -20118 -12889 -6973 -10863 -5419 -5189 -6727 2609 12429 2772 5718
$$ packed form
6683A1534N285q953r229l407K641m778J237Q637R967q086n028J7237n67n041q054
6668C395Q967Q856M728r552o304j61j0964o629k122J1969j499L029j0246j829
6654h362J0792p786q955K974K237l546K8165R086k2871o649R244l213p000R562
6640C678J2101K256m943k777j4721o611N907J4003P486j751J448J032m6J843p203
6625A1702L962P562j0634j1460M863r207j3437J5070Q807o433Q387Q95m697q324
6611b944k1369o938J6931J6996J1526m328K914Q941m815M180r456r920n943K159
6597b066M077m094l361n269o891N876O140J6633O750k304n758j3247r119K842
6583i791K47j785p595p37N428n885P229N916l890N444K30j538R336R820r657K946
$$ plain form
6567 5718 9558 13609 6851 16316 38222 30304 18800 31005 31141 29614 33873 34312 31287 25255 9244
6552 9244 -3279 -8049 -2484 -2408 -7157 -9913 -9159 -929 -12861 -18244 -10107 -19938 -17761 -7467 -8731
6537 -8731 -11035 -18905 -19436 -11589 -12925 -10326 -7914 -6104 -2977 6481 -3861 -12125 -16474 -17417 -9570
6522 -9570 -23564 -28979 -13692 -2056 884 -3978 -7453 1309 4000 -3027 -2054 11090 3975 13016
6508 13016 7060 9820 5659 -9185 -13673 -11815 -22868 -19330 -1617 -7994 -11217 -7720 -7722 -14747 -7200
6493 -7200 -14295 -16829 -10408 -5081 6229 21473 15917 -1892 5049 10410 -4874 -10465 -1518 1129
6479 1129 -12904 -24200 -23029 -11493 -13520 -725 4078 1652 -8144 -12772 -7202 -6602 6541 17923
6465 17923 4717 -7025 -7221 -6534 -13296 -1680 13970 23702 22555 17021 7965 -10839 -24691 -18117
$$ packed form
6567E718L840M051o758R465K1906p918j1504J2205J36j527M259M39l025o032j6011
6552I244j2523m770N565P6m749k756P54Q230j1932n383Q137r831K177J0294j264
6537h731k304p870n31P847j336K599K412J810L127R458j0342q264m349r43P847
6522i570j3994n415J5287J1636K940m862l475Q762K691p027R73J3144p115R041
6508A3016n956K760m161j4844m488J858j1053L538J7713o377l223L497kp025P547
6493g200p095k534O421N327J1310J5244n556j7809O941N361j5284n591Q947K647
6479A129j4033j1296J171J1536k027J2795M803k426r796m628N570O00J3143J1382
6465A7923j3206j1742j96O87o762J1616J5650R732j147n534r056j8804j3852O574
$$ plain form
6451 -18117 -1428 10439 11212 8347 -904 -9012 -6297 -10109 -6372 2455 -2883 1520 -7273 -6688 -1075
6436 -1075 7528 15142 15242 15162 6752 1834 2757 9352 -5239 -7619 -8899 -3803 -9533 -5057 -1674 -8530
6420 -8530 -7753 -20784 -21538 -8747 -2636 -5027 10718 17784 4486 -4925 -6582 -8861 -10507 -18132
6406 -18132 -15135 -1721 3379 4768 -2416 -16238 -25510 -13643 -15623 -10107 -10841 -6868 -4646 -6452
6392 -6452 -3019 -8745 -11508 -5911 -12556 -19382 -22631 -17314 -26030 -38917 -36892 -20688 -4451 -5470
6378 -5470 -5622 -4789 -6248 1100 5869 11807 15120 16488 17591 15180 5849 2704 2076 959 7102 17547
6362 17547 17479 12586 6721 8612 14177 6324 -10682 -7656 14602 11994 -2829 289 -3777 -13441
6348 -13441 -23916 -18498 -16806 -15233 -12415 -12280 -3059 2112 -7571 -6558 -10563 -18566 -17352 -10092 -2906
$$ packed form
6451a8117J6689J1867P73k865r251q108K715l812L737Q827n338M403q793N85N613
6436a075Q603P614J00q0q410m918R23O595j4591k380j280N096n730M476L383o856
6420h530P77j3031p54J2791O111k391J5745P066j3298r411j657k279j646p625
6406a8132K997J3414N100J389p184j3822r272J1867j980N516p34L973K222j806
6392f452L433n726k763N597o645o826l249N317q716j2887K025J6204J6237j019
6378e470j52Q33j459P348M769N938L313J368J103k411r331l145o28j117O143J0445
6362A7547o8m893n865J891N565p853j7006L026K2258k608j4823L118m066r664
6348a3441j0475N418J692J573K818J35R221N171r683J013m005q003J214P260P186
$$ plain form
6333 -2906 -440 -3150 -7927 -5642 -9896 -18885 -5196 -658 2393 1207 -427 -6448 -5441 -13189 -10619
6318 -10619 -9464 -13784 -22214 -21546 -19010 -14873 -26655 -22440 -13886 -12696 -15452 -6289 12753 14129
6304 14129 12094 14868 17031 16664 25329 16147 4189 1933 2180 -2735 -3847 7842 9787 5335 -7562
6289 -7562 -16790 -3304 8088 22210 25149 20998 17642 11934 8458 9031 -10072 -895 13733 15236
6275 15236 4971 680 1586 5717 3053 15002 4760 2510 8641 11048 4416 172 -6980 -4452
6261 -4452 -9088 -18247 -9863 -825 6313 9978 14818 7360 3834 3202 2711 4511 1596 -1413 1017
6246 1017 7785 2434 2895 1609 -4058 -12742 -13309 -15790 -12101 -5880 -876 -3016 5851 10672 9792 -1158
6230 -1158 -15548 -18180 -22690 -18254 -9744 -566 -173 -3227 -10759 -8574 678 5187 3670 6539 17037
$$ packed form
6333b906K466k710m777K285m254q989J3689M538L051j186j634o021J007p748K570
6318a0619J155m320q430O68K536M137j1782M215Q554J190k756R163J9042J376
6304A4129k035K774K163l67Q665r182j1958k256K47m915j112J1689J945m452j2897
6289g562r228J3486J1392J4122K939m151l356n708l476N73j9103R177J4628J503
6275A5236j0265m291R06M131k664J1949j0242k250O131K407o632m244p152K528
6261d452m636r159Q384R038P138L665M840p458l526o32m91J800k915l009K430
6246A017O768n351M61j286n667q684n67k481L689O221N004k140Q867M821q80j0950
6230a158j4390k632m510M436Q510R178L93l054p532K185R252M509j517K869J0498
$$ plain form
6215 17037 20231 4902 4517 2088 1827 -3471 -10070 -14398 -21827 -24031 -4888 5932 5502 8216 -5626
6200 -5626 -12195 -10362 -3419 1646 2345 20203 20605 14034 22186 11786 -14148 -6845 1140 -2418 -15084
6185 -15084 -12607 -7927 -4785 -13721 -22074 -18324 -5928 -2964 9691 7751 -4253 -11732 -12005 -2831
6171 -2831 -9058 -20484 -25694 -23568 -21713 -10784 -7403 -1466 -2178 -631 5465 2894 -1057 -968 -11239
6156 -11239 -17059 -8274 8217 5279 -10509 -15941 -7759 -5157 -3316 698 -2565 1451 6155 8663
6142 8663 -1378 -5625 -5268 -2825 1716 -1959 -3580 6168 6918 5955 16357 17323 7295 6500 10102
6127 10102 195 -11400 -5202 -6172 -2634 13078 11638 2762 -11784 -16771 -11946 -19937 -18230 -11126
6113 -11126 2419 5689 -8835 -2449 -960 10950 21517 11943 327 -6508 -3029 -14248 -13080
$$ packed form
6215A7037L194j5329l85k429k61n298o599m328p429k204J9143J0820m30K714j3842
6200e626o569J833O943N065O99J7858M02o571Q152j0400k5934P303P985l558j2666
6185a5084K477M680L142q936q353L750J2396K964J2655j940j2004p479k73R174
6171b831o227j1426n210K126J855J0929L381N937p12J547O096k571l951Q9j0271
6156a1239n820Q785J6491k938j5788n432Q182K602J841M014l263M016M704K508
6142H663j0041m247L57K443M541l675j621R748P50r63J0402R66j0028p95L602
6127A0102r907j1595O198r70L538J5712j440q876j4546m987M825p991J707P104
6113a1126J3545L270j4524O386J489J1910J0567r574j1616o835L479j1219J168
$$ plain form
6100 -13080 -15534 -15414 -16710 -15087 -5735 3470 11267 4162 -8920 -11528 -820 5479 1771 -1204
6086 -1204 -2152 -15979 -27997 -23243 -8522 -13157 -13813 -8998 -2110 4313 129 7208 8481 17944 12311
6071 12311 -791 3138 4557 12535 4712 -1228 -7183 -8037 -18574 -18462 -8147 -18593 -21617 -6782
6057 -6782 -11204 -25042 -25395 -16514 -8413 -605 -5433 -14805 -18596 -18930 -24388 -24869 -15148 -11002 -11821 -4365
6041 -4365 -2946 -5066 -5922 -3354 -5985 -8692 -943 14194 20779 11242 -7823 -12911 -18225 -28922
6027 -28922 -23782 -12972 -3358 13368 6755 579 -8136 -14376 -16252 -22175 -20274 -566 9624 3320
6013 3320 15076 12015 2899 -4161 -1990 -236 -3364 -5789 -86 -447 -5985 -11383 -14145 -18388 -12325
5998 -12325 -8225 -11027 -28342 -15898 59 104 -6953 -9120 846 338 -9194 -17844 -20779 -6741
$$ packed form
6100a3080k454J20j296J623R352R205P797p105j3082k608J0708O299l708k975
6086a204r48j3827j2018M754J4721m635o56M815O888O423m184P079J273R463n633
6071A2311j3102L929J419P978p823n940n955q54j0537J12J0315j0446l024J4835
6057f782m422j3838l53Q881Q101P808m828r372l791l34n458m81R721M146q19P456
6041d365J419k120q56K568k631k707P749J5137O585r537j9065n088n314j0697
6027b8922N140J0810R614J6726o613o176q715o240j876n923J901J9708J0190o304
6013C320J1756l061r116p060K171J754l128k425N703l61n538n398k762m243O063
5998a2325M100k802j7315J2444J5957M5p057k167R966n08r532q650k935J4038
$$ plain form
5984 -6741 8905 2399 9203 19053 19867 22404 18403 26978 27177 19472 13671 1190 555 -12826 -19786
5969 -19786 -16945 -6787 -1519 1535 12945 14157 3875 -1370 4511 -122 -6734 -1390 8202 11233
5955 11233 14893 6953 6234 -7176 -10120 -9008 -8014 -11799 -12292 -15911 -13932 -13719 791 14925 14232
5940 14232 14953 8121 7364 22251 25310 25165 16269 14444 17884 4674 -5214 -2925 2611 -2179 -16897
5925 -16897 -14229 -5799 -2320 -2688 -5480 -11959 -17021 -22360 -22224 -8741 4169 10045 254 883 3665
5910 3665 8746 3103 -10283 -2864 -438 -1238 -277 -8512 -10591 -6185 -6445 -15030 -20034 -18521 -12297
5895 -12297 -14812 -20943 -26341 -28908 -11825 1102 5408 7595 -1199 3471 -12810 -13712 -21652 -13234
5881 -13234 -6506 -1721 -3102 3670 -1437 -3037 -10289 -11329 -2375 5621 12887 18929 104 -2818
$$ packed form
5984f741J5646o506O804R850Q14K537m001Q575J99p705n801j2481o35j3381o960
5969a9786K841J0158N268L054J1410J212j0282n245N881m633o612N344R592L031
5955A1233L660p940p19j3410k944J112R94l785m93l619J979K13J4510J4134o93
5940A4232P21o832p57J4887L059j45q896j825L440j3210r888K289N536m790j4718
5925a6897K668Q430L479l68k792o479n062n339J36J3483J2910N876r791O29K782
5910C665N081n643j3386P419K426q00R61q235k079M406k60q585n004J513O224
5895a2297k515o131n398k567J7083J2927M306K187q794M670j6281r02p940Q418
5881a3234O728M785j381O772n107j600p252j040Q954P996P266O042j8825k922
$$ plain form
5867 -2818 -1445 2440 738 6336 7358 7630 12 -15472 -17898 -9933 -7143 -20648 -20914 -13620 1764
5852 1764 3451 4408 1657 -590 -1908 -342 -6628 -10988 -2131 -13243 -15518 -22646 -21028 -11314 -4873
5837 -4873 -5311 1698 3673 -1049 -397 4073 3751 9899 12187 5736 1594 8641 377 -14431 -11794
5822 -11794 988 8220 8996 -7535 -14152 -23191 -19936 -20185 -20596 -11260 -18071 -17657 -15453 -7996 -7320
5807 -7320 -13882 -7986 2995 7996 15201 20930 21838 12120 8933 6483 12514 14964 3774 10040 26676
5792 26676 26201 14758 2134 2265 -1012 -21518 -24176 685 3895 -3801 -12996 -19541 -16174 -11278
5778 -11278 -15518 -13607 -10282 1142 -5177 -3907 13077 9371 -5961 -15110 -23752 -43334 -32528
5765 -32528 -16989 -8978 -8477 -7045 -16367 -21881 -3964 6422 6725 2683 3579 3813 12406 19301 7575
$$ packed form
5867b818J373L885j702N598J022K72p618j5484k426P965K790j3505k66P294J5384
5852A764J687R57k751k247j318J566o286m360Q857j1112k275p128J618R714O441
5837d873m38P009J975m722O52M470l22O148K288o451m142P047q264j4808K637
5822a1794J2782P232P76j6531o617r039L255k49m11R336o811M14K204P457O76
5807g320o562N896J0981N001P205N729R08r718l187k450O031K450j1190O266J6636
5792B6676m75j1443j2624J31l277k0506k658K4861L210p696r195o545L367M896
5778a1278m240J911L325J1424o319J270J6984l706j5332r149q642j9582J0806
5765c2528J5539Q011N01J432r322n514J7917J0386L03m042Q96K34Q593O895j1726
$$ plain form
5750 7575 -3990 -6717 -3373 -1425 -3280 -3855 -3663 -15414 -3639 9070 -190 -1691 1399 554 -11913
5735 -11913 -13279 -11654 -22339 -27235 -26116 -12157 -561 9650 8068 3782 9293 10216 7021 12815
5721 12815 -850 -10659 -2687 7400 -6914 -17424 -11000 -12060 -13589 -7562 -4723 10391 2141
5708 2141 9181 18226 475 2153 -6399 -10902 -1172 6917 -7527 -14485 -13410 -8974 -2335 8057
5694 8057 6475 -4203 -6637 -15232 -16825 -24817 -15300 10910 10501 -5601 -12072 -11958 -25459 -20811
5680 -20811 -24339 -24010 -20150 -6186 255 -8158 -22684 -20633 -11578 -23256 -23882 528 17720 10442
5666 10442 3405 4981 -3247 -10005 -2453 11245 14196 1861 1195 6001 5121 8829 7377 11639 16400
5651 16400 12938 1954 -19177 -31952 -20942 -24721 -22252 -22874 -31829 -26602 -12808 -6399 -14056 -8643
$$ packed form
5750G575j1565k727L344J948j855n75J92j1751J1775J2709r260j501L090q45j2467
5735a1913j366J625j0685m896J119J3959J1596J0211j582m286N511R23l195N794
5721A2815j3665r809P972J0087j4314j0510O424j060j529O027K839J5114q250
5708B141P040R045j7751J678q552m503R730Q089j4444o958J075M436O639J0392
5694H057j582j0678k434q595j593p992R517K6210m09j6102o471J14j3501M648
5680b0811l528L29L860J3964O441q413j4526K051R055j1678o26K4410J7192p278
5666A0442p037J576q228o758P552J3698K951j2335o66M806q80L708j452M262M761
5651A6400l462j0984k1131j2775J1010l779K469o22q955N227J3794O409p657N413
$$ plain form
5637 -8643 -694 119 2484 4430 17629 14398 -3716 -6959 -6390 -3826 -3413 234 -6802 -1100 1398
5622 1398 -12279 -10391 -6243 -1145 2789 -4362 -7819 7475 8628 5213 97 -4341 -4048 -14239
5608 -14239 -25863 -16401 4026 8701 -5844 -14702 -20475 -22394 -14909 -14214 -832 -6158 -2109 4737
5594 4737 3095 9113 14556 4822 -4411 9596 4947 -2117 402 -866 -14867 -23245 -13773 11175
5580 11175 14788 11950 -6683 -14264 -15680 -13604 -6371 1329 4242 9179 15059 14418 13010 13813 16775
5565 16775 27001 8732 -7974 -6241 -5285 -14244 -18217 -16751 -13987 -8541 1305 -820 5759 4274
5551 4274 -16142 -18096 -11150 -7869 939 24 -5650 7015 14015 16060 7833 -6741 -17207 -5139
5537 -5139 -3054 -2647 10207 17211 17173 22547 14765 -269 2351 -8810 -16957 -17469 -23590 -4537 3458
$$ packed form
5637h643P949Q13K365J946J3199l231j8114l243N69K564M13L647p036N702K498
5622A398j3677J888M148N098L934p151l457J5294J153l415n116m438K93j0191
5608a4239j1624R462K0427M675j4545q858n773j919P485O95J3382n326M049O846
5594D737j642O018N443r734r233J4007m649p064K519j268j4001q378R472K4948
5580A1175L613k838j8633p581j416K076P233P700K913M937N880o41j408Q03K962
5565A6775J0226j8269j6706J733R56q959l973J466K764N446R846k125O579j485
5551D274k0416j954O946L281Q808r15n674J2665P000K045q227j4574j0466J2068
5537e139K085M07J2854P004l8N374p782j5034K620j1161q147n12o121J9053P995
$$ plain form
5522 3458 5188 8383 10395 13832 -5660 -19938 -16751 -25121 -16691 -4281 -13865 -4303 -3614 -11274
5508 -11274 -19604 -16817 -1851 6868 4547 6996 9667 2285 3359 9528 7793 -4245 -16218 -7580
5494 -7580 -1004 6798 7851 3886 9590 -4076 -11677 2220 1936 -15724 -21597 -10920 4347 -3671
5480 -3671 -10582 -1274 -8925 -8418 -12488 -2317 2177 2056 8893 14499 4530 -3603 4513 11895 3990
5465 3990 -12987 -20406 -4237 -3845 -8995 -9824 -6323 -25660 -27297 -22136 -22679 -8701 -3920 -11612 -2628
5450 -2628 3177 6480 14257 18458 14019 12898 17029 23976 25897 14293 -6804 -248 6828 8219
5436 8219 7571 8899 7739 7537 2703 3794 21304 10419 8570 7476 867 6090 816 2525 12050
5421 12050 12637 8459 14230 16313 6174 -2617 2869 8085 16286 4230 -3505 -12559 -18872 -21624
$$ packed form
5522C458J730L195K012L437j9492j4278L187q370Q430J2410r584R562O89p660
5508a1274q330K787J4966Q719k321K449K671p382J074O169j735j2038j1973Q638
5494g580O576P802J053l965N704j3666p601J3897k84j7660n873J0677J5267q018
5480c671o911R308p651N07m070J0171M494j21O837N606r969q133Q116P382p905
5465C990j6977p419J6169L92n150q29L501j9337j637N161n43J3978M781p692Q984
5450b628N805L303P777M201m439j121M131O947J921j1604k1097O556P076J391
5436H219o48J328j160k02m834J091J7510j0885j849j094o609N223n274J709R525
5421A2050N87m178N771K083j0139q791N486N216Q201j2056p735r054o313k752
$$ plain form
5407 -21624 -22662 -27647 -27728 -24616 -25603 -27944 -22156 -12221 -2196 747 17295 18058 2279 -4905 -20393
5392 -20393 -19075 -8519 -10202 -8284 -7109 -2668 5576 310 7973 10609 1956 -443 4382 7737
5378 7737 1099 652 -9746 -22033 -21502 -18879 -24994 -20777 -15294 -12109 -5323 -3419 -2687 -4347 -1019
5363 -1019 -6513 -6930 -4000 -14859 -15381 -4300 14052 23379 21024 5474 -425 -4947 -4266 -12122 -24975
5348 -24975 -18139 -21640 -31807 -44723 -43078 -28604 -18326 -19138 -29956 -28818 -13052 -10101 -14332
5335 -14332 -24234 -4824 7138 -2212 -4888 -13854 -19112 -18917 -18105 -24748 -14801 -2153 6907 10644
5321 10644 4550 -2045 -9443 -10114 -148 -2401 -537 -2580 -5665 -19134 -15883 -5126 -9207 -3877
5307 -3877 1020 -9743 -19530 -13764 -14545 -19052 -21211 -26984 -22622 -15298 -13459 -13795 -17490 -11965 2957
$$ packed form
5407b1624j038m985q1L112r87k341N788R935J0025K943J6548P63j5779p184j5488
5392b0393J318J0556j683J918J175M441Q244n266P663K636q653k399M825L355
5378G737o638m47j0398j2287N31K623o115M217N483L185O786J904P32j660L328
5363a019n494m17K930j0859n22J1081J8352R327k355j5550n899m522O81p856j2853
5348b4975O836l501j0167j2916J645J4474J0278q12j0818J138J5766K951m231
5335a4332r902J9410J1962r350k676q966n258J95Q12o643R947J2648R060L737
5321A0644o094o595p398o71R966k253J864k043l085j3469L251J0757m081N330
5307c877M897j0763r787N766p81m507k159n773M362P324J839l36l695N525J4922
$$ plain form
5292 2957 5977 -5935 44 -3756 -11267 -11513 -9665 -7126 -24374 -29658 -18985 -17651 -18373 -11695 -4622
5277 -4622 2148 126 2100 -11942 -10979 -5652 358 4368 -3641 -20033 -20604 -11833 -8642 -21355 -20514
5262 -20514 -18797 -13820 -3470 -5965 -5613 8080 10589 9324 7185 1453 3483 11012 16778 5148
5248 5148 -6611 -19927 -11928 -5047 6594 22897 17906 462 -4193 -4898 -9261 -5047 3026 3394
5234 3394 -11673 -31594 -26546 -21851 -18437 -5887 5706 7830 8794 9551 -3698 -11039 -7940 -11903
5220 -11903 -16933 -28272 -22050 -8889 -9267 -9218 -4121 -10889 -7251 -11979 -12587 -882 -4342 -8673 -10734
5205 -10734 -13417 -16980 -26174 -21054 -5297 2155 9262 23572 15287 -5682 -15226 -7880 -8322 1526
5191 1526 7764 15837 15808 9665 8105 16874 17689 10207 4427 -5252 -12417 -3538 5655 8331 2539 5235
$$ packed form
5292B957L020j1912N979l800p511k46J848K539j7248n284J0673J334p22O678P073
5277d622O770k022J974j4042R63N327O010M010q009j6392n71Q771L191j2713Q41
5262b0514J717M977J0350k495L52J3693K509j265k139n732K030P529N766j1630
5248E148j1759j3316P999O881J1641J6303m991j7444m655p05m363M214Q073L68
5234C394j5067j9921N048M695L414J2550J1593K124R64P57j3249p341L099l963
5220a1903n030j1339O222J3161l78M9N097o768L638m728o08J1705l460m331k061
5205a0734k683l563r194N120J5757P452P107J4310q285k0969r544P346m42R848
5191A526O238Q073k9o143j560Q769Q15p482n780r679p165Q879R193K676n792K696
$$ plain form
5175 5235 2280 -13744 -16757 -21618 -21402 -13002 -1518 -13140 -18730 -9058 2986 -3844 1727 1759 8938
5160 8938 18245 10259 13831 13115 12734 -627 -14548 -10069 -8872 -10082 -4820 -21998 -40082 -28588
5146 -28588 -13120 -23193 -21439 -13748 -15289 -17060 -14832 -20553 -23044 -23592 -28214 -17617 -12777 -29216
5132 -29216 -26121 -12810 -24501 -23716 -5799 6057 6734 4638 18563 19224 7934 -10955 -33828
5119 -33828 -35886 -25095 -32904 -38100 -39893 -37269 -31145 -19410 -13876 2029 4254 385 239 1264
5105 1264 1904 3270 6060 -2661 -5966 477 -8357 -13186 -4847 3024 -419 4213 2755 -4321 5899
5090 5899 13592 7266 11898 6031 11202 19113 19663 8810 13280 -8732 -13730 -480 -8508 -11508
5076 -11508 -7950 -3612 6512 9829 6453 -7579 -1851 -2778 -15279 -15639 -9246 -1460 -9180 -14210
$$ packed form
5175E235k955j6024l013m861K16Q400J1484j1622n590R672J2044o830N571L2P179
5160H938R307p986L572p16l81j3361j3921M479J197j210N262j7178j8084J1494
5146b8588J5468j0073J754P691j541j771K228n721k491n48m622J0597M840j6439
5132b9216L095J3311j1691P85J7917J1856O77k096J3925O61j1290j8889k2873
5119c3828k058J0791p809n196j793K624O124J1735N534J5905K225l869j46J025
5105A264O40J366K790q721l305O443q834m829Q339P871l443M632j458p076J0220
5090E899P693o326M632n867N171P911N50j0853M470k2012m998J3250q028l000
5076a1508L558M338J0124L317l376j4032N728r27j2501l60O393P786p720n030
$$ plain form
5062 -14210 -3413 -4163 -16666 -13706 -2365 -3620 -1384 -8487 -1973 6255 -1289 -4378 -8948 -7387
5048 -7387 -8147 -7308 -1896 5428 13104 25807 24468 13074 1999 -6089 -13755 -3096 3705 1476
5034 1476 -10869 -26215 -18678 -12035 -14379 -8047 7065 7553 -1144 -9929 -9895 -8317 9043 4945 -1376
5019 -1376 1813 -4933 -3292 -3862 3068 8173 -4810 -5269 777 4363 -13492 -26614 -36874 -39940
5005 -39940 -24185 368 11836 13492 9593 -3247 -13397 -11330 -11273 -16619 -9259 -14046 -24451 -15850
4991 -15850 -8581 -26861 -26293 -19338 -16134 -23610 -19440 -4827 6610 2507 11846 40118 47072 42880
4977 42880 36683 28450 23233 15139 19343 8275 8023 5926 1131 -3439 -14995 -21395 -9546 -5270
4963 -5270 15141 23774 17657 10885 10699 12173 8100 -11080 -13311 -2620 -1796 -205 -5960 -6664 1242
$$ packed form
5062a4210J0797p50j2503K960J1341j255K236p103O514Q228p544l089m570J561
5048g387p60Q39N412P324P676J2703j339j1394j1075q088p666J0659O801k229
5034A476j2345j5346P537O643k344O332J5112M88q697q785L4J578J7360m098o321
5019a376L189o746J641n70O930N105j2983m59O046L586j7855j3122j0260l066
5005c9940J5755K4553J1468J656l899j2840j0150K067N7n346P360m787j0405Q601
4991a5850P269j8280N68O955L204p476M170J4613J1437m103R339K8272O954m192
4977D2880o197q233n217q094M204j1068k52k097m795m570j1556o400J1849M276
4963e270K0411Q633o117o772j86J474m073j9180k231J0691Q24J591n755p04P906
$$ plain form
4948 1242 -3302 -13022 -15615 -23617 -27671 -21991 -23093 -24652 -16588 -4948 -11869 -7721 -8314 -1074 5835
4933 5835 15247 21930 6985 7145 -1165 -11473 -10519 -13738 -22019 -15755 -4610 -326 825 -13343
4919 -13343 -14854 -12819 -17952 -23102 -13871 -22703 -18799 -13569 -12236 -13845 -11676 -4132 -5591 -20560
4905 -20560 -10326 -11337 -20256 -22468 -14867 -6565 6169 26954 6368 -8746 4004 12911 -3174
4892 -3174 -13285 -7937 -9730 -29711 -34214 -29193 -19899 -7546 -11608 -7268 6975 -3841 -14000
4879 -14000 -23340 -20171 -19704 -18367 -1924 9776 10089 13692 9906 9728 2622 -13630 -20327 -25199 -23845
4864 -23845 -8424 -6470 -8904 -12402 -4533 9676 27745 22670 16235 11832 -2410 -9041 -15957 -8330
4850 -8330 -13451 -22563 -14317 -7114 4504 11357 8013 -2840 -7087 -2345 784 6823 1732 -6800
$$ packed form
4948A242m544r720k593q002m054N680j102j559Q064J1640o921M148n93P240O909
4933E835R412O683j4945J60q310j0308R54l219q281O264J1145M284J151j4168
4919a3343j511K035n133n150R231q832L904N230J333j609K169P544j459j4969
4905b0560J0234j011q919k212P601Q302J2734K0785k0586j5114J2750Q907j6085
4892c174j0111N348j793j9981m503N021R294J2353m062M340J4243j0816j0159
4879a4000r340L169M67J337J6443J1700L13L603l786j78p106j6252o697m872J354
4864b3845J5421J954k434l498P869J4209J8069n075o435m403j4242o631o916P627
4850h330n121r112Q246P203J1618O853l344j0853m247M742L129O039n091q532
$$ plain form
4836 -6800 -4128 3601 11733 18913 14233 2025 -18204 -17849 4148 9566 867 -3606 9065 14479
4822 14479 3775 -8947 -7105 -4794 230 7352 -12479 -24445 -23575 -14366 -3475 -8907 -5849 -1201
4808 -1201 8339 25604 26171 19875 15077 2790 -5815 -8037 -16735 -25897 -25280 -27783 -31303 -11241 1292
4793 1292 5229 -14275 -10711 -4038 -5920 1104 998 3102 4272 10814 10583 5556 7027 8120 1120
4778 1120 5725 22475 19077 8049 5006 -13297 -12344 2244 -8130 -29559 -33949 -30487 -25912 -19237
4764 -19237 -1310 15523 10959 -2236 -6539 -10521 1918 -5778 -14325 -16594 -3082 3232 84
4751 84 -2651 -1569 4003 -2456 1068 14552 8149 5968 7308 14371 18714 22519 19916 16482 15718
4736 15718 9233 -2576 -9943 -8168 -1887 -6249 -13047 -17109 -18957 -14242 -9396 2560 -2596 -5193
$$ packed form
4836f800K672P729Q132P180m680j2208k0229L55K1997N418q699m473J2671N414
4822A4479j0704j2722J842K311N024P122j9831j1966Q70R209J0891n432L058M648
4808a201R540J7265N67o296m798j2287q605k222q698r162O17k503l520K0062J2533
4793A292L937j9504L564O673j882P024j06K104J170O542k31n027J471J093p000
4778A120M605J6750l398j1028l043j8303R53J4588j0374k1429m390L462M575O675
4764a9237J7927J6833m564j3195m303l982J2439p696q547k269J3512O314l148
4751H4k735J082N572o459L524J3484o403k181J340P063M343L805k603l434p64
4736A5718o485j1809p367J775O281m362o798m062j848M715M846J1956n156k597
$$ plain form
4722 -5193 -2129 -8427 -6898 11805 23086 27058 19248 2917 1752 -5282 -11729 10333 18170 6328
4708 6328 7712 10289 15883 -1400 -14856 -17738 -17123 -5864 10918 11755 14044 15949 1583 -10764
4694 -10764 -10369 -5075 -7619 -9907 -6158 -4726 1330 6920 3698 7210 -1448 -3254 6108 2197 -10490
4679 -10490 5004 11074 -1477 -9107 -3232 9777 10991 -9887 -14275 -18008 -23047 -20709 -18232 -8694
4665 -8694 2707 8497 13863 10230 2648 883 9839 14649 11546 -2896 -4292 13118 2908 -10054
4651 -10054 193 -10523 -21952 -17768 -17774 -8374 -13116 -23606 -33536 -31185 -28867 -16465 -5418 -12520
4637 -12520 -16991 -4431 299 -4582 -15861 -18915 -10613 290 -2947 -5639 -5242 -8176 -6190 -11034
4623 -11034 -3985 -11823 -16292 -8980 -1078 -2296 -4258 -779 -11699 -15582 -2478 3282 487 6400
$$ packed form
4722e193L064o298J529J8703J1281L972p810j6331j165p034o447K2062P837j1842
4708F328J384K577N594j7283j3456k882O15J1259J6782Q37K289J905j4366j2347
4694a0764L95N294k544k288L749J432O056N590l222L512q658j806R362l911j2687
4679a0490J5494O070j2551p630N875J3009J214k0878m388l733n039K338K477R538
4665h694J1401N790N366l633p582j765Q956M810l103j4442j396J7410j0210j2962
4651a0054J0247j0716j1429M184oR400m742j0490r930K351K318J2402J1047p102
4637a2520m471J2560M730m881j1279l054Q302J0903l237k692L97k934J986m844
4623a1034P049p838m469P312P902j218j962L479j0920l883J3104N760k795N913
$$ plain form
4609 6400 5939 215 -10928 -5846 2389 11538 4024 -6853 -12683 1423 -524 -17007 -2955 -9696
4595 -9696 -29958 -31780 -20793 -12502 -12873 -10791 -12612 -20243 -7681 -3097 -6033 -6824 -9322 -7389 -341
4580 -341 5185 8433 12616 10390 6186 5929 3346 -6663 -5002 -8357 -12347 -15694 -15368 3207 16345
4565 16345 17006 7299 -7371 7044 11477 10635 2835 6252 9483 2575 -14108 -20599 -10435 2467
4551 2467 -4537 -6829 -11716 -22650 -3133 12928 196 -12984 -16287 -12083 -15806 687 5303
4538 5303 -2839 4531 7679 -10366 -26526 -22686 -5113 -9396 -17880 -27820 -17572 -4038 -3813 11128
4524 11128 11084 6458 -1110 -3871 -9564 -12058 -18045 -18928 -18454 -16277 -14030 -13587 -10989 -16397 -10410 -8128
4508 -8128 -7751 -8900 -3247 8192 1682 -7131 -24579 -32474 -20360 -14718 -16443 -8596 -10109 385
$$ packed form
4609F400m61n724j1143N082Q235R149p514j0877n830J4106j947j6483J4052o741
4595i696k0262j822J0987Q291l71K082j821p631J2562M584k936p91k498J933P048
4580c41N526L248M183k226m204k57k583j0009J661l355l990l347L26J8575J3138
4565A6345O61r707j4670J4415M433q42p800L417L231o908j6683o491J0164J2902
4551B467p004k292m887j0934J9517J6061j2732j3180l303M204l723J6493M616
4538E303q142P370L148j8045j6160L840J7573m283q484r940J0248J3534K25J4941
4524A1128m4m626p568k761n693k494n987q83M74K177K247M43K598n408N987K282
4508h128L77j149N653J1439o510q813j7448p895J2114N642j725P847j513J0494
$$ plain form
4494 385 -7387 -4416 -445 -119 -1397 -9345 1122 -2966 -7482 -555 11904 8289 11247 5015 640
4479 640 -5627 -3725 -1094 -6482 -12131 -15731 -23435 -27967 -22720 5584 2147 -3594 -4267 -11077 -1023
4464 -1023 10285 8552 -3076 4051 -4197 -2448 -5936 -818 12470 5003 -9246 -8238 -9643 -6143
4450 -6143 -12066 -4624 11711 1507 -7497 -16635 -17177 -26976 -14025 -9413 -9630 -7614 2051 14048
4436 14048 8165 372 9125 3139 -3006 -14895 -6993 -3334 -11053 -13484 -6938 -13903 -16434 -16911 -19530
4421 -19530 -15124 -11101 -4116 7804 17227 10654 5789 335 -15794 -19582 -11923 4726 19488 23009
4407 23009 12329 131 -3089 7510 8158 3011 9749 19936 21739 21606 8702 6705 -2181 -15995
4393 -15995 -17167 2786 17395 14616 784 1003 1621 -8035 -6013 459 8446 3804 1459 4418
$$ packed form
4494C85p772K971L971L26j278p948J0467m088m516O927J2459l615K958o232m375
4479F40o267J902K631n388n649l600p704m532N247K8304l437n741o73o810J0054
4464a023J1308j733j1628P127q248J749l488N118J3288p467j4249J008j405L500
4450f143n923P442J6335j0204r004r138n42r799J2951M612k17K016R665J1997
4436A4048n883p793Q753n986o145j1889P902L659p719k431O546o965k531m77k619
4421a9530M406M023O985J1920R423o573m865n454j6129l788P659J6649J4762L521
4407B3009j0680j2198l220J0599O48n147O738J0187J803j33j2904j997q886j3814
4393a5995j172J9953J4609k779j3832K19O18r656K022O472P987m642k345K959
$$ plain form
4379 4418 18703 22538 20591 11239 3807 3172 6529 5352 4789 6395 5010 10807 11054 3991 5355
4364 5355 4525 -2615 -7014 -9067 -6733 2183 -21626 -20629 -6376 -9211 -11655 -18752 -6805 3644
4350 3644 -3727 -9587 -13686 -17141 -4518 6636 -128 3822 18426 14789 9729 5833 -5233 -6483
4336 -6483 -3071 -5130 -3207 8395 14993 18113 11669 -6713 -9219 -9495 -10851 -6442 -10109 -2575 -10179
4321 -10179 -17726 -10939 -12135 -6868 -10287 -9180 -1968 12893 21611 16340 14071 16513 5136 11195
4307 11195 21908 36960 32706 9538 1923 12237 22903 12506 -4290 -2208 5248 10156 15096
4294 15096 22538 24782 11117 9480 3755 -1377 8097 11518 9955 15285 19328 13574 -3049 -11472
4280 -11472 -16396 -21456 3128 8289 6801 9663 9346 6971 -2424 7507 7315 2380 -10442 -18323 -15245
$$ packed form
4379D418J4285L835j947r352p432o35L357j177n63J606j385N797K47p063J364
4364E355q30p140m399k053K334Q916k3809R97J4253k835k444p097J1947J0449
4350C644p371n860m099l455J2623J1154o764L950J4604l637n060l896j1066j250
4336f483L412k059J923J1602O598L120o444j8382k506k76j356M409l667P534p604
4321a0179p547O787j196N267l419J107P212J4861Q718n271k269K442j1377O059
4307A1195J0713J5052m254k3168p615J0314J0666j0397j6796K082P456M908M940
4294A5096P442K244j3665j637n725n132R474L421j563N330M043n754j6623q423
4280a1472m924n060K4584N161j488K862l17k375r395R931j92m935j2822p881L078
$$ plain form
4265 -15245 -5545 -12556 -23972 -20764 -9729 -12361 -11463 -6535 -8152 -20300 -15256 -10372 -15790 -9259
4251 -9259 -4061 -6298 -8140 1966 15473 20275 22372 33235 37531 21986 10709 4954 6442 1351
4237 1351 -7726 -15794 -14987 -4852 -470 -8391 -22148 -16245 -16820 -27716 -14417 3600 4286 -9903
$$ packed form
4265a5245R700p011j1416L208J1035k632Q98M928j617j2148N044M884n418O531
4251i259N198k237j842J0106J3507M802K097J0863M296j5545j1277n755J488n091
4237A351r077q068Q07J0135M382p921j3757N903n75j0896J3299J8017O86j4189
$$ [...]
##END NTUPLES=NMR SPECTRUM
##END=
