##TITLE=Analysis number 310838
Compound Code cc 35710
Book Reference 397/50/4
Project Code adrs
Chemist Name brucer
##JCAMPDX= 6.0         $$ Bruker NMR JCAMP-DX V2.0
##DATA TYPE= NMR SPECTRUM
##DATA CLASS= NTUPLES
##ORIGIN= Bruker BioSpin GmbH
##OWNER= NMR
$$ XWIN-NMR		Version 3.5
$$ Thu Jun 23 12:57:57 2005 GMT Daylight Time (UT+1h)  MAYBRIDGE\NMR@NMR_250MHZ
##.OBSERVE FREQUENCY= 250.131544655141
##.OBSERVE NUCLEUS= ^1H
##.ACQUISITION MODE= SIMULTANEOUS (DQD)
##.ACQUISITION SCHEME= undefined
##.AVERAGES= 16
##.DIGITISER RES= 18
##SPECTROMETER/DATA SYSTEM= dpx250
##.PULSE SEQUENCE= zg30
##.SOLVENT NAME= CDCl3
##.SHIFT REFERENCE= (INTERNAL, CDCl3, 0, 16.522)
##AUDIT TRAIL= $$ (NUMBER, WHEN, WHO, WHERE, WHAT)
$$ ##TITLE= Audit trail, XWIN-NMR		Version 3.5
$$ ##JCAMPDX= 5.01
$$ ##ORIGIN= Bruker BioSpin GmbH
$$ ##OWNER= NMR
$$ C:\u/data/dgb/nmr/ADRS/4680/pdata/1/auditp.txt
$$ ##AUDIT TRAIL=  $$ (NUMBER, WHEN, WHO, WHERE, WHAT)
(   1,<2005-06-23 12:57:38.80 +100>,<MAYBRIDGE\NMR>,<NMR_250MHZ>,
      <created by zg, POWCHK disabled, PULCHK disabled
       configuration hash MD5:
       62 19 C7 07 E1 42 D1 B7 37 6C 3D D0 77 39 F9 E6
       data hash MD5: 64K
       6B 7B 40 79 32 09 21 35 B3 BA 17 CB 0F 86 F9 47>)
(   2,<2005-06-23 12:57:49.80 +100>,<MAYBRIDGE\NMR>,<NMR_250MHZ>,
      <Start of raw data processing
       ef LB = 0.3 FT_mod = 6 PKNL = 1 SI = 32K 
       data hash MD5: 32K
       46 82 92 6C 81 9B 77 FA FF 70 AD 99 93 E6 2E 55>)
(   3,<2005-06-23 12:57:51.64 +100>,<MAYBRIDGE\NMR>,<NMR_250MHZ>,
      <apk 
       data hash MD5: 32K
       5A A5 5F 31 3E 64 A8 62 9E D4 5D 87 CE 8C FD 9C>)
(   4,<2005-06-23 12:57:52.39 +100>,<MAYBRIDGE\NMR>,<NMR_250MHZ>,
      <abs ABSG = 5 
       data hash MD5: 32K
       99 1C 5C DE 6A BB FB 00 55 68 9F 1C CE 12 6F 9D>)
$$ ##END=
$$ 
$$ hash MD5
$$ C4 A3 09 EE 79 60 71 37 D7 9A F1 5A 5C B4 C6 54
##$RELAX= 
##$RELAX= 
##$RELAX= 
##$RELAX= 
##$RELAX= 
##$RELAX= 
##$RELAX= 
$$ Bruker specific parameters
$$ --------------------------
##$DU= <C:\u>
##$EXPNO= 4680
##$NAME= <ADRS>
##$PROCNO= 1
##$TYPE= <nmr>
##$USER= <dgb>
##$AMP= (0..31)
100 100 100 100 100 100 100 100 100 100 100 100 100 100 100 100 100 100 
100 100 100 100 100 100 100 100 100 100 100 100 100 100 
##$AQSEQ= 0
##$AQ_mod= 3
##$AUNM= <au_zg>
##$AUTOPOS= <19 >
##$BF1= 250.13
##$BF2= 250.13
##$BF3= 250.13
##$BF4= 250.13
##$BF5= 500.13
##$BF6= 500.13
##$BF7= 500.13
##$BF8= 500.13
##$BYTORDA= 1
##$CFDGTYP= 0
##$CFRGTYP= 5
##$CHEMSTR= <none>
##$CNST= (0..31)
1 1 145 1 1 1 1 1 1 1 1 1 1 1 1 1 1 1 1 1 1 1 1 1 1 1 1 1 1 1 1 1 
##$CPDPRG= <>
##$CPDPRG1= <>
##$CPDPRG2= <>
##$CPDPRG3= <>
##$CPDPRG4= <mlev>
##$CPDPRG5= <mlev>
##$CPDPRG6= <mlev>
##$CPDPRG7= <mlev>
##$CPDPRG8= <mlev>
##$CPDPRGB= <>
##$CPDPRGT= <>
##$D= (0..31)
0 1 0 0 0 0 0 0 0 0.06 0 0 0 0 0 0 0.0002 0 0 0 0 0 0 0 0 0 0 0 0 0 0 
0 
##$DATE= 1119527857
##$DBL= (0..7)
120 120 120 120 120 120 120 120 
##$DBP= (0..7)
150 150 150 150 150 150 150 150 
##$DBP07= 0
##$DBPNAM0= <>
##$DBPNAM1= <>
$$ [...]
##$SUBNAM7= <"">
##$SUBNAM8= <"">
##$SUBNAM9= <"">
##$SW= 20.6930455092707
##$SWIBOX= (0..15)
0 0 3 0 0 0 0 0 0 0 0 0 0 0 0 0 
##$SW_h= 5175.983436853
##$TD= 65536
##$TD0= 1
##$TE= 295.16
##$TE2= 300
##$TE3= 300
##$TEG= 300
##$TL= (0..7)
0 120 120 120 120 120 120 120 
##$TP= (0..7)
150 150 150 150 150 150 150 150 
##$TP07= 0
##$TPNAME0= <>
##$TPNAME1= <>
##$TPNAME2= <>
##$TPNAME3= <>
##$TPNAME4= <>
##$TPNAME5= <>
##$TPNAME6= <>
##$TPNAME7= <>
##$TPOAL= (0..7)
0.5 0.5 0.5 0.5 0.5 0.5 0.5 0.5 
##$TPOFFS= (0..7)
0 0 0 0 0 0 0 0 
##$TUNHIN= 0
##$TUNHOUT= 0
##$TUNXOUT= 0
##$USERA1= <user>
##$USERA2= <user>
##$USERA3= <user>
##$USERA4= <user>
##$USERA5= <user>
##$V9= 5
##$VALIST= <valist>
##$VCLIST= <CCCCCCCCCCCCCCC>
##$VD= 0
##$VDLIST= <DDDDDDDDDDDDDDD>
##$VPLIST= <PPPPPPPPPPPPPPP>
##$VTLIST= <TTTTTTTTTTTTTTT>
##$WBST= 1024
##$WBSW= 4
##$XGAIN= (0..3)
0 0 0 0 
##$XL= 0
##$YL= 0
##$YMAX_a= 402177
##$YMIN_a= -319487
##$ZGOPTNS= <>
##$ZL1= 120
##$ZL2= 120
##$ZL3= 120
##$ZL4= 120
##$ABSF1= 16.522
##$ABSF2= -4.171173
##$ABSG= 5
##$ABSL= 3
##$ALPHA= 0
##$AQORDER= 0
##$ASSFAC= 0
##$ASSFACI= 0
##$ASSFACX= 0
##$ASSWID= 0
##$AUNMP= <proc_1d>
##$AZFE= 0.1
##$AZFW= 0.1
##$BCFW= 0
##$BC_mod= 0
##$BYTORDP= 0
##$COROFFS= 0
##$CY= 12.5
##$DATMOD= 1
##$DC= 0
##$DFILT= <>
##$DTYPP= 0
##$F1P= 14.0000005364418
##$F2P= -0.99999901652339
##$FCOR= 0.5
##$FTSIZE= 32768
##$FT_mod= 6
##$GAMMA= 0
##$GB= 0
##$INTBC= 1
##$INTSCL= 1
##$ISEN= 128
##$LB= 0.3
##$LEV0= 0
##$LPBIN= 0
##$MAXI= 10000
##$MC2= 0
##$MEAN= 0
##$ME_mod= 0
##$MI= 0
##$NCOEF= 0
##$NC_proc= -5
##$NLEV= 6
##$NOISF1= 0
##$NOISF2= 0
##$NSP= 0
##$NTH_PI= 0
##$NZP= 0
##$OFFSET= 16.522
##$PC= 1
##$PHC0= -75.08567
##$PHC1= -5.404411
##$PH_mod= 1
##$PKNL= yes
##$PPARMOD= 0
##$PSCAL= 4
##$PSIGN= 0
##$REVERSE= no
##$SF= 250.13
##$SI= 32768
##$SIGF1= 0
##$SIGF2= 0
##$SINO= 400
##$SIOLD= 32768
##$SREGLST= <1H.CDCl3>
##$SSB= 0
##$STSI= 32768
##$STSR= 0
##$SW_p= 5175.98343685301
##$SYMM= 0
##$S_DEV= 0
##$TDeff= 65536
##$TDoff= 0
##$TI= <Analysis number 999999
Compound Code 99
Book Reference 9
Project Code 9>
##$TILT= no
##$TM1= 0
##$TM2= 0
##$TOPLEV= 0
##$USERP1= <user>
##$USERP2= <user>
##$USERP3= <user>
##$USERP4= <user>
##$USERP5= <user>
##$WDW= 1
##$XDIM= 32768
##$YMAX_p= 476922167
##$YMIN_p= -235685
$$ End of Bruker specific parameters
$$ ---------------------------------
##NTUPLES= NMR SPECTRUM
##VAR_NAME=  FREQUENCY,     SPECTRUM/REAL,   SPECTRUM/IMAG
##SYMBOL=    X,             R,               I
##VAR_TYPE=  INDEPENDENT,   DEPENDENT,       DEPENDENT
##VAR_FORM=  AFFN,          ASDF,            ASDF
##VAR_DIM=   32768,         32768,           32768
##UNITS=     HZ,            ARBITRARY UNITS, ARBITRARY UNITS
##FACTOR=    0.157963299565203, 1,           1
##FIRST=     4132.6476996994, 0,             0
##LAST=      -1043.33573715361, 0,           0
##MIN=       -1043.33573715361, -235685,     0
##MAX=       4132.6476996994, 476922167,     0
$$ Real data points
##PAGE= N=1
##DATA TABLE= (X++(R..R)), XYDATA
$$ [...]
24972a08091M7184M0204L4152l4877q124q46N218L1011o866q717J221K1583N9145
24959G2197Q72q379k6107m342k2311j2768Q399J7328j5949P366K996m4086K8014
24946C230M4427j2138k9925p876Q79L944L024J9692l0980n417M9303K4845j4438
24933D8570m295J3831k1360j6772R182R077p753L1148M186m3238k6292J2143m42
24920G985m3288k5502M1127P0608J1000k102j0426k3702l6694O214J5967K6424
24908C7611l3915r801K1360k3235l3711l3544k6971J2365P0717O0564J7710J7600
24896G6750q663k0468n8974m2149k5992K1881L4970K8455Q733j3970k7666j7075
24884d4168p071l8695N6971M7225J6651L2797m5557m8333m5946J9383L4926J9210
$$ y = [-108091, -60907, -20703, 13449, -21428, -29552, -30398, -25180, 5831, -1035, -9752, -8531, 13052, 72197, 73069, 64690, 38583, 34241, 11930, -838, 7561, 24889, 8940, 16306, 19302, -24784, 3230, 47657, 35519, 5594, -2282, -1403, 2541, 5565, 25257, -5723, -11140, 38163, 63008, 48570, 44275, 58106, 36746, 19974, 29156, 38233, 30480, 61628, 65814, 22576, -3716, 8427, 7985, -35303, -60805, -19678, 50930, 61930, 59828, 49402, 25700, -10994, -4780, 11187, 37611, 3696, -6105, 15255, -7980, -41691, -75235, -102206, -89841, -19124, 41440, 59150, 76750, 68087, 47619, -11355, -53504, -79496, -57615, -22645, 5810, 14543, 573, -27093, -44168, -51239, -89934, -32963, 14262, 30913, 63710, 18153, -30180, -76126, -56743, -21817, -2607]
24872b607K8454l3720J4792J3310j6417L8583Q467j372j7345n199M1539N1885
24860A20370M878n9035l2409K8544k6785L9707J9330n8305o062J3805j7703J6917
24848D3252L0403M76m3400J0641o7845J936J9858l7424L2617N9366j5953j52n5395
24835b1620k1178J8653O685m813M683k8319j7397L2234M4189m527o0190l2868
24823h4468R000R16K9994L394K4864L3345K4646K8330J2696l631m374m8634j5618
24810A0460j6343l7993J7676j0251O1195o4048o3745K6790O1354K5089L4481K6118
24798G0783p0008N063K6631K448o551k4684N7L3740Q676m7819m7527P81m3982
24785i2392k8353N481M5670K2805M0708j9267m0092O4682N5245p630l8117q625
$$ y = [-2607, 25847, -7873, 6919, 20229, 3812, 42395, 50862, 49490, 32145, 26946, 68485, 120370, 125248, 66213, 33804, 62348, 35563, 75270, 94600, 36295, 30233, 44038, 26335, 43252, 73655, 74131, 30731, 41372, -26473, -24537, -4679, -42103, -9486, 49880, 33927, 33775, -21620, -42798, -24145, -17460, -22273, -17590, -45909, -63306, -31072, 13117, 8590, -51600, -84468, -75468, -74552, -44558, -41164, -16300, 17045, 41691, 70021, 82717, 79086, 74712, 26078, 10460, -5883, -43876, -26200, -36451, 24744, -39304, -103049, -76259, -14905, 10184, 44665, 70783, 775, 5838, 32469, 34917, 28366, 3682, 3739, 37479, 46155, -1664, -49191, -48410, -92392, -120745, -115264, -69594, -46789, -6081, -25348, -65440, -758, 54487, 46857, 8740, 115]
24773A15n148l7341o1421M9011L8358J9844N595k6090j7333J1871Q569N63N4592
24760D1185J3132j6854j0227o614L4275j1840j7114l3367l941l6248k3688m6441
24748a17742J7476O3978N2178M894o0375L5253J945N045j917K6911k4899k7499
24736b4752k9807k1802K0632J0002j4288N1562J9043l4460L2218O524K0951L1999
24724F7822o5277o3947j3923N5938N9197j9417m59j1875j2394r417L5101L5592
24712E6941J2471k4685m0319k4921O823J903J2408K6927J448p117J3483M813l7893
24699B282J062o3973p0187Q469R1569N7607L4816j7274l5622m378M7419M399n9536
24686c347k8535K0271m1165q612M6122N2750l343n1j4660j66l4929l3147p054
$$ y = [115, -5033, -42374, -103795, -54784, -16426, 3418, 9013, -17077, -34410, -22539, -13970, -13407, 41185, 54317, 37463, 27236, 20622, 54897, 43057, 25943, -7424, -11365, -47613, -71301, -117742, -100266, -36288, 15890, 20784, -39591, -4338, -2393, 2652, 735, 27646, 2747, -24752, -54559, -76361, -55729, -45727, -60015, -8453, 10590, -23870, 8348, 14872, 35823, 67822, 2545, -61402, -75325, -19387, 39810, 20393, 19934, 8059, -4335, -13752, 21349, 56941, 69412, 44727, 4408, -20513, -13690, -11787, 621, 27548, 28996, 21879, 35362, 40175, 2282, 3344, -60629, -130816, -122347, -30778, 26829, 61645, 44371, 8749, 4371, 51790, 56189, -3347, -31882, -11611, -52776, -61388, -15266, 37484, 34141, 34090, 19430, 19264, -15665, -48812, -55866]
24673e5866J2186P4297L5453n469l5178j0022K2924P288K0016k3365P124J4806
24661F4194k7191m6580J4872L5506k1181m4003j9399j1096l5960K2552J5958J6624
24649c5704j5237L6549J3662k197J3040k7592m3082j3258L0811l894l294N5K421
24636d7720j0193j9737J9516K8676k9383m1692j5365L7268J1755m911J5871J4576
24624d1339m2913J3745K774k0210k1069k3495J056M5857L6569M134R403O595N573
24611b3320l0138n9081Q8362O5756L4573J6705q005k4257l0421J8449J3329n425
24599E6527k7159L9326L8762n6505j5178j0814l3367L1817j5185K2201j8536P249
24587A9138j0246l3980o949J0661j9961l2019j6308j4774N6618M0824J7318K0613
$$ y = [-55866, -43680, 30617, 66070, 60601, 25423, 15401, 38325, 45613, 65629, 42264, 49388, 64194, 37003, -9577, 5295, 40801, 19620, -24383, -43782, -54878, -90838, -68286, -52328, -35704, -50941, -14392, -730, -2927, 10113, -17479, -60561, -73819, -43008, -46902, -50196, -50141, -47720, -57913, -77650, -58134, -29458, -58841, -100533, -115898, -78630, -66875, -71786, -55915, -41339, -84252, -70507, -67733, -87943, -109012, -132507, -131451, -85594, -49025, -44891, -35488, -28893, -23320, -53458, -112539, -24177, 41579, 76152, 92857, 84852, 60595, 30174, 48623, 61952, 56527, 29368, 68694, 107456, 50951, 35773, 24959, -8408, 23409, 8224, 30425, 11889, 19138, 8892, -25088, -32037, -21376, -41337, -73356, -89664, -104438, -47820, -6996, 10322, 30935]
24575C0935M0140k3915k5491J5187L6217k2894m2601l8717N3083J2641k9443q423
24563c281J3223l5937J0869k7242l4777m0776J7966m0364L8981M8007M2475L2941
24551B2085O373k2565k8803L1180M2674o2610n9931l1532K971l639O8911K9141
24539e745k832j0910k538J7781l7917k4521r588k9133J1863Q305K0025j9870L0841
24526e4239L8667m1496K1598J2304K8773j453J2706L6202n3415n5605M7433j359
24514i884m5255n276N3760m7275k8686K5498N0589P2467o162n214m5374O481L8558
24501E4227K8081L469m2051n0629M6374j2724r215n9930n741L9062N9384m7510
24489B797l0229J5282Q144J4460Q650o8143j3733L722p717L9882r86j4708j5689
$$ y = [30935, 71075, 47160, 21669, 36856, 73073, 50179, 7578, -31139, 21944, 34585, 5142, -3281, 9942, -25995, -15126, -42368, -77145, -117921, -99955, -140319, -101338, -53331, -10856, 22085, 28458, 5893, -22910, 8270, 50944, -11666, -71597, -103129, -100158, -103797, -34886, -5745, -8577, -19487, -22025, -4244, -42161, -66682, -76270, -105403, -93540, -85235, -65210, -85080, -54239, -15572, -57068, -35470, -23166, 5607, 4154, 16860, 53062, -353, -55958, -8525, -9884, -55139, -60415, -6655, -53930, -82616, -57118, -6529, 65938, 59776, 54562, 9188, 15669, 54227, 82308, 85777, 43726, -6903, 39471, 26747, 17532, -42398, -48139, -9077, 50307, 2797, -27432, -12150, -4006, 10454, 19104, -49039, -62772, -59050, -66767, -26885, -27871, -42579, -58268]
24476e8268k3798J887m0866N4625L9345j4070M3684m4398n5075Q497P040M4494
24464c6903N1178j8374j6663j0427m0018m4138M080O6722K2742J711N8037L4979
24452G2926J2553Q603o7581L7544J7641J266l7047l4909J8063J185N813k6584
24440I473j1225J4027J3227k0708l4016K1944J6714k446J4607L616m2768j8935
24428c6490M4562J145J8970j2506n3807m6321M3048L4874K8695j1121j1675l0807
24416c1433P6576o852o2642K7740L7393j1651k193q410M9779k8318k5093k7397
24404a2501R21N5553l1448j7873P8206J620l2562k2724n4384n973M3002j5671
24392a3834o670K7245K1302n119l1785j3230L3716N511q095j8866K4483m3948
$$ y = [-58268, -82066, -80179, -121045, -66420, -27075, -41145, 2539, -41859, -96934, -88437, -81397, -36903, 14275, -4099, -20762, -31189, -71207, -115345, -111265, -44543, -21801, -20090, 37947, 72926, 85479, 94082, 26501, 64045, 81686, 82952, 45905, 10996, 29059, 30244, 36057, 9473, -1752, 12275, 25502, 4794, -29222, -7278, 9436, 6990, 21597, 25213, -17555, -36490, 8072, 9217, 28187, 15681, -38126, -84447, -41399, -6525, 22170, 11049, -626, -31433, 45143, 38291, -24351, 3389, 40782, 29131, 26938, 18528, 68307, 39989, 14896, -12501, -11580, 43973, 12525, -5348, 72858, 74478, 41916, 19192, -35192, -41165, 1837, -13834, -20504, 6741, 28043, 22924, -8861, -22091, 11625, 17136, 9041, -9825, 14658, -29290]
24380b9290m8306p703K1726N5375L9792J7628m2423n720K3511k067J183N689O3790
24367I3185M1699k6554k9314l8180j1955k4805J9450K7728j356O626O646r003
24355E4167m5407J7438K0402K3365l1005p044k2346m0266K9714l8070l5620K1144
24343e3528N9919N7036r774l5555m3148q765J1796J3941r003p6274l6805M8309
24331h1851K9308J3437J5237M453k0524l6307N6214K8061O1408R308k4484k804
24319E1456o6727m4589k9661M2203N2585m940l5537j3421L4216K4465K4305l3891
24307D64J556j6205K804j7600j2488J9257K1478K6429m7261m0085j7164m5284
24295a24099N5127J04811K1284o5819o7809o870J2405K3340j6694k2883K0218
$$ y = [-29290, -77596, -85299, -63573, -8198, 31594, 49222, 6799, 1079, 24590, 22523, 23706, 29395, 93185, 134884, 108330, 79016, 40836, 28881, 4076, 23526, 51254, 49898, 56524, 63170, 54167, 8760, 26198, 46600, 69965, 38960, 31916, 9570, -30696, -982, -39052, -74672, -53528, 6391, 63427, 53653, 18098, -25050, -33815, -22019, -8078, -17081, -93355, -130160, -81851, -52543, -39106, -23869, -19416, -39940, -76247, -20033, 8028, 69436, 78744, 54260, 51456, -15271, -59860, -89521, -47318, 5267, 327, -35210, -48631, -14415, 10050, 34355, 464, 2020, -14185, -11381, -28981, -41469, -22212, -734, 25695, -21566, -61651, -78815, -124099, -68972, 35839, 57123, -8696, -76505, -83375, -70970, -47630, -64324, -87207, -66989]
24284f6989J5322j4886L7456N772o063n8882Q648O4010O608r409L0114K5622j9356
24271A7967j5842k7957J0769K0696J8598n8349M6240K3422o0735l7768k39K9147
24259c4051K3707L1393J0885J477j8135J3015l1393L7870o756L094L9650J1293
24247H2049R967l971j6997N383j7110q019n6497k0777K5611J1356k5702j1488
24235b6195P323k111j1436j1686o408O4032L3272m1550n405l8173j0262M800K2655
24222b1144L0705q096n706K0154J5979J9775J5903O182j2599Q458l7364J0973
24210D3220J0560k0847L8180k5737j9737O977O0389j5732k3764J7399k1364l6627
24198A2917m1897l9806J5814M2952O8592l3661m0280l3549J6176L5383O86J5757
$$ y = [-66989, -51667, -66553, -29097, -23325, -29388, -88270, -79622, -15612, -9004, -18413, 11701, 37323, 17967, 2125, -25832, -15063, 5633, 24231, -34118, 12122, 35544, -25191, -62959, -63198, -34051, -10344, 21049, 31934, 33411, 15276, 28291, -3102, 34768, 28012, 31106, 70756, 82049, 92016, 88045, 71048, 76431, 59321, 51302, -5195, -25972, -361, 10995, -14707, -26195, -18872, -20983, -32419, -44105, -50513, 13519, 46791, 5241, -164, -38337, -48599, -43799, -21144, 9561, 1465, -4241, 15913, 31892, 51667, 67570, 73752, 61153, 69611, 32247, 43220, 53780, 32933, 71113, 45376, 25639, 32616, 93005, 77273, 53509, 70908, 49544, 12917, -28980, -68786, -52972, -10020, 58572, 24911, -15369, -48918, -32742, 2641, 3327, 19084]
24186A9084j96J288o4436j5100Q495P1481J646j3397O981j5638l6043k5514K2415
24173c8934P3871j0648q814k068M1426q782n737j1447o2755k1399L6874K7610
24161I197K986n0618r722M1264J3621J2254k9436j480j063J4609l5011N144L987
24148b4268Q77J6399K4007n2286o1398q908P2568N2461l1304m5351m7619o565
24136a11387k8363R435M0418O6566L6842o876l7125J1456l2333J8464j874l4576
24124f9353L995K078L371K3710K1574J5232M6943M6289J3787n1082m6108K3399
24112C3835m1788J7182K4776O944l196L7941K5622P538m3163P639o2294q5764
24100g4728k2573R053N7652J8062j9994j5415j3871j085N9597K5674N6513l7515
$$ y = [19084, 18888, 20176, -44260, -59360, -50865, 20616, 22262, 8865, 15846, 208, -35835, -61349, -38934, 34937, 24289, 15475, 13407, 54833, 46051, 40314, 28867, -33888, -55287, -18413, 9197, 12183, -38435, -48157, -6893, 6728, 18982, -10454, -11934, -12997, 1612, -33399, -28255, -24268, -23391, -6992, 17015, -35271, -96669, -105577, -33009, 19452, -11852, -57203, -104822, -111387, -139750, -130315, -89897, -23331, 13511, 6635, -30490, -19034, -51367, -32903, -34777, -69353, -65358, -63280, -59909, -36199, -14625, 607, 47550, 93839, 107626, 56544, 10436, 33835, -7953, 9229, 34005, 40949, 37753, 75694, 101316, 108854, 65691, 73330, 11036, -74728, -97301, -88248, -30596, -12534, -32528, -47943, -61814, -62899, -3302, 22372, 78885, 41370]
24088D1370l3600J7148l067J1026n5337J0846N6088o798m0114L4126J1618m3422
24076a16k6613K7054j0219J1784j4853l8547K6437K0J0892N2182m3027k6462n1310
24063h2778K4401N5107l2062j9331K2856L3856Q758K8022l5887m6237o3410k4308
24051a31013M1626K8879Q165J331Q726J1382j6352L2085N6168j3110l3011k8404
24039c3528k6621k0452L7567K8093L8811R404l4347m5114q892L1232m1096J6650
24027d8293K0736k5665j4138k989J3863L3518L2841k7377J6599O494J6450j3224
24015H815J0770r998m0377K2140R331j4081J6807M8969k0688k3185L9797L1029
24003G9329o8888k5637L0052k3206m1321k4894J6345M6444J20J7307l5371k2757
$$ y = [41370, 7770, 24918, 21851, 32877, -22460, -11614, 44474, 37676, -2438, 31688, 43306, -116, -26729, 325, -9894, 1890, -12963, -51510, -25073, -25053, -14161, 38021, -5006, -31468, -82778, -58377, -3270, -35332, -54663, -31807, 2049, 10807, 38829, 2942, -43295, -106705, -131013, -89387, -60508, -52343, -51012, -42286, -30904, -47256, -15171, 40997, 27887, -5124, -33528, -60149, -80601, -43034, -14941, 23870, 33274, -1073, -46187, -55079, -23847, -64943, -48293, -27557, -53222, -67360, -70349, -56486, -22968, 9873, -17504, -905, 5589, 22039, 8815, 19585, 9587, -30790, -8650, 681, -13400, 3407, 52376, 31688, 8503, 48300, 79329, 10441, -15196, 14856, -8350, -49671, -74565, -58220, -11776, -11656, 5651, -29720, -52477]
23991e2477m5541j3937N6874K8070N5615J2462l5851m7441J1236J1978l8275L7361
23979a9926J8497l1209m89K2737L3117J4695J4136n3965l2343l1083P344n4164
23967a12653n7439R9205P4064R646r991k4608k5915k0550M0359J0468L7726L4655
23955E4967M4641n5666m6399P892K3344j6075K1125m209L0676l3217q2841l46
23943e6108K5326J0791J1183J4936J0471N2167k7433Q405J2325N0171l9056n3358
23931A9820o6266q773k4331k2506L946P8838M3290n6363J4441l8763L343n9108
23919a12432K924Q7925N1980k2589L5884r542k5819k6298k7239j389L2855M4442
23907C0702m550J1679j558k1559m3908j4054j3816j4487j2164J0572K8985m1970
$$ y = [-52477, -98018, -111955, -55081, -27011, 28604, 41066, 5215, -42226, -30990, -19012, -57287, -19926, -1429, -32638, -33127, -10390, 22727, 37422, 51558, -2407, -34750, -65833, -58489, -112653, -170092, -70887, 3177, 12823, 2832, -21776, -47691, -68241, -27882, -17414, 20312, 54967, 99608, 43942, -2457, 5435, 28779, 12704, 33829, 29620, 60296, 27079, -55762, -56108, -30782, -19991, -8808, 6128, 16599, 68766, 41333, 49738, 62063, 112234, 73178, 19820, -46446, -55219, -79550, -102056, -98110, -19272, 24018, -32345, -17904, -56667, -53324, -112432, -109508, -21583, 30397, 7808, 43692, 34150, 8331, -17967, -45206, -46595, -13740, 30702, 26152, 37831, 36273, 14714, -29194, -43248, -57064, -71551, -83715, -73143, -44158, -86128]
23895h6128P618k3483J6078K351P494M6426p421L7035J3006K6346L1435q0435
23883i678m8867J1218J4333O9703J3741k2499K131N679N535J0867M803J679J574
23870F0219Q3l0278J7995k617n3489K71j6661L7724R635k8931m4172r198l1075
23857i0494M5451J5516j4394p797l0545r127N4536O8249M3198j516j9913n4550
23845a386m7487J3358J3169k8724k2223J9732l5802M0101N37m3099J2774M4029
23833c5021J9507j9846o4671J8715N1443J7643L175M0540l5614k9132k8835L084
23821e9012j5390k2404J0745L6553L1454N7596R099m7046k4502L757M91k8215
23809d6874J1820L5568j6488K2045K1257o785l7618k6126m0044m121Q45j6100
$$ y = [-86128, -78510, -101993, -85915, -83564, -76070, -29644, -37065, -30, 12976, 39322, 70757, -9678, -58545, -47327, -32994, 36709, 50450, 27951, 30082, 35761, 41296, 52163, 56966, 58645, 60219, 60302, 30024, 48019, 45402, -8087, -7816, -24477, 13247, 22882, -6049, -50221, -59419, -90494, -45043, -29527, -43921, -51718, -82263, -91390, -36854, 31395, 74593, 73077, 53164, -1386, -48873, -35515, -22346, -51070, -73293, -53561, -89363, -49262, -48725, -91824, -79050, -35021, -15514, -35360, -100031, -81316, -29873, -12230, -9055, 31485, -4129, -33261, -62096, -59012, -74402, -96806, -86061, -49508, -18054, 39542, 48641, 1595, -22907, -19150, -18659, -46874, -35054, 514, -15974, 6071, 27328, 20543, -17075, -43201, -83245, -87366, -86521, -102621]
23797a02621J0774k855r832K1286M0338M1752J5099L3495L7891k5924q5318p6724
23785a02639K334O2099L2132n1739o255M6715R209o2407k4976J2384n633K365
23773h6411L1710L7177P3935k2214m3418j4299n5298j6117M6080L5122O586k535
23761i682K6340j3620K3194j268m650L6035j2503k4379k107M2863K8632J3874
23749A02729n5181o8920O1598o539k3702L5476R92j2496m0313l4468o2731N0748
23737e2807P892J1884N8317N3422J2779n229m7494k6074J8104r409N0315L637
23725G5337j3405k3731J5074l2639k5640K7273J8408k859j5509m3488j1747k925
23713c5851j3027K3498J5725J1292K8708N075N6244M7514m5355q9174n5390l0360
$$ y = [-102621, -91847, -94702, -104534, -83248, -42910, -1158, 13941, 47436, 85327, 59403, -25915, -102639, -100305, -38206, -6074, -57813, -64068, -17353, -8144, -70551, -95527, -83143, -88776, -86411, -54701, -17524, 56411, 34197, -9221, -23520, -78818, -94935, -48855, -13733, -7147, -9682, 16658, 3038, 26232, 24964, 20314, 56349, 43846, 19467, 17360, 60223, 88855, 102729, 47548, -21372, 40226, 33687, 9985, 45461, 46453, 33957, -6356, -40824, -103555, -52807, -44915, -33031, 25286, 78708, 91487, 86258, 38764, 12690, 30794, 21385, 71700, 75337, 61932, 38201, 53275, 20636, -5004, 22269, 40677, 37818, 22309, -21179, -32926, -35851, -48878, -25380, -9655, 1637, 30345, 35420, 91664, 139178, 93823, 4649, -50741, -81101]
23701h1101j2777N9120N3196m9067l7787K7130L9551j2676p785L7237k7369r845
23689b2173K0260q625o1267j1418L9746O8912L4526n1057K3469J1619k405j3343
23677B8244k4274n5703j4680J1989l8975l3231J3044O7534L1275J3787n1301n8213
23665a10504M1416J07455j2592m4535K6144L6433m0989M5138J0054p1570K7598
23654A4048N3150j7826J6042J1394j9560p773j5071N349j6731n205j5203j454
23642A160K4407J7195P064l9167l9678j300K2689r50n331K0358k65L055k6896
23629a7659m9304n2450j8304K4236O4590N1609J3036L3433j0837J5210l7341k2502
23617f283k1983J722J6945K6541q408K909J0168m113k3500L6143J9026L9738O8297
$$ y = [-81101, -93878, -34758, 18438, -30629, -68416, -41286, -1735, -14411, -22196, 15041, -12328, -22173, -1913, -10538, -71805, -83223, -43477, 25435, 59961, 8904, 32373, 43992, 41587, 28244, 3970, -51733, -66413, -54424, -93399, -126630, -113586, -46052, -14777, -990, -52291, -110504, -69088, 38367, 25775, -18760, 7384, 43817, 2828, 47966, 58020, -13550, 14048, 67198, 49372, 65414, 76808, 57248, 49475, 34404, 39753, 23022, 17817, 2614, 1160, 25567, 42762, 49826, 10659, -29019, -30319, -7630, -8580, -13911, 6447, 6182, 9237, -17659, -66963, -119413, -137717, -113481, -48891, 2718, 15754, 49187, 38350, 53560, 16219, -6283, -28266, -26544, -9599, 16942, 8534, 11443, 21611, 17498, -6002, 30141, 49167, 88905, 157202]
23604A57202n8522j2481q645m0243m2997J952L8620j700j7189p198M4304o636
23592D6467j5332l4591p3574J3284J9590K3793J8199m878j5675J1683N7831j9273
23580B7524J988j2539N822r52r148l502l185j4691K2871l790m4576M585j4209
23567d3802K6825l3270O664K3736q943K6934n906N193o0160n0885p17k9775J7031
23554a27075N4959K6896M7545J2468j6434m1754M871l8333M8580K9365J0969j6526
23542d469m2715n2070J4718L7653K7662O1355l1677o832L4146l1521m4704K3752
23530a4702N2586K5001j0909j9559m2361l9254K0210k7955n112Q894P315j5808
23518f1654p1697N292l414O5104M0163j2957j083k89m460q2594N6525R9325P347
$$ y = [157202, 98680, 86199, 77554, 37311, -5686, -3734, 34886, 33186, 15997, 8799, 53103, 46467, 31135, -3456, -77030, -63746, -44156, -20363, -2164, -7042, -22717, -11034, 46797, 27524, 29512, 16973, 22795, 21843, 12695, 9193, 6008, -8683, 14188, 10398, -34178, -29593, -43802, -16977, -50247, -43583, -19847, -28790, -1856, -7762, -2569, -62729, -113614, -114331, -144106, -127075, -72116, -45220, 2325, 14793, -1641, -43395, -38524, -76857, -28277, 1088, 12057, -4469, -47184, -99254, -84536, -46883, -19221, 42134, 10457, 3625, 37771, 6250, -38454, -14702, 37884, 62885, 51976, 32417, -9944, -49198, -28988, -56943, -62055, -53161, -45846, -61654, -133351, -128059, -131473, -66369, -26206, -39163, -40246, -40535, -44995, -127589, -71064, 28261, 35608]
23505C5608j7673K6490K119m0942l4908J8029J6672L025r255n994l2635L2835
23493f629N3468o645J602J1717l2529O93l1431j7116j055j7031M5726P1864L3438
23480A06072k2941l2674m2000R00R264j1272m1027o3913k1738q736O3754k9372
23468i3683k4837M5694J9568k8338j2025O032l861K2929m2392K5050K4875N7L6718
23455b4213j06o0689j612O291j3430J3754p0415k4282L4102M3227K0277Q667j051
23442f9480L1614O2464K4662l5622n818J9606j6823L1403J2968Q661l09K4242
23430H7568j4652O766l2184l3483L2363K3155l0777k4632J7459k8871L5538l555
23418C4695l7184n9592J7199M3048L3790n352M6655N600l8242Q249M1965o5358
$$ y = [35608, 17935, 44425, 46544, 5602, -29306, -11277, 5395, 8420, -835, -6829, -39464, -6629, 46839, 40194, 41796, 53513, 20984, 21677, -9754, -26870, -27925, -44956, 770, 72634, 106072, 83131, 50457, 8457, 9357, 18621, 7349, -33678, -97591, -119329, -128065, -64311, -93683, -118520, -72826, -53258, -81596, -93621, -87589, -91450, -68521, -110913, -85863, -60988, -60931, -24213, -24319, -85008, -86620, -80329, -93759, -80005, -150420, -174702, -140600, -97373, -77096, -68429, -69480, -37866, 24598, 49260, 13638, 7820, 27426, 10603, 42006, 54974, 63635, 63326, 87568, 72916, 79682, 47498, 14015, 46378, 69533, 38756, 14124, 31583, 2712, 38250, 34695, -2489, -62081, -44882, -1834, 31956, 26604, 73259, 78859, 40617, 48866, 90831, 25473]
23406B5473q0295p918J1236K9428j1427k535J2148n492n776n4377k9152Q0644
23394c8043L7524k3390k2052N2839n7p1260J0673L3983r442j5238M2836K0876
23382A9249k0396j7041k7795M1321M4563J835K1667l5168N366n3850k4405J4014
23370c0640R61J3011M5205L3074M5179N507l0945l6855k3762J046k9830n743j9950
23357c3742K0259K9965l2705O939P889p792k0939L3508M6004k7482M1223L6500
23345I9627k944j4298j5575k0938j67J251j9596j8053Q761L8462p935m1249l4734
23332b7388k6912n851n2734j477K2779n0195J3149J0218K2669J3063K8972K4902
23320b8805K9917n6567O092P2961J6143J9588L7275j3266k5808J9960K5196j1627
$$ y = [25473, -54822, -62740, -51504, -22076, -33503, -36038, -23890, -29382, -35158, -89535, -118687, -38043, -519, -23909, -45961, 6878, 6821, -64439, -53766, -19783, -29225, -44463, -1627, 19249, -1147, -18188, -45983, -4662, 39901, 41736, 63403, 28235, 33601, -20249, -44654, -30640, -29679, -16668, 28537, 61611, 106790, 112297, 81352, 44497, 20735, 21781, -8049, -13792, -33742, -13483, 16482, -16223, -9284, -1395, -9187, -30126, 3382, 49386, 21904, 63127, 99627, 96683, 82385, 66810, 45872, 45705, 46956, 27360, 9307, 18068, 56530, 48595, 7346, -27388, -54300, -60151, -112885, -114362, -91583, -141778, -128629, -118411, -95742, -82679, -53707, -28805, 1112, -55455, -49363, 23598, 39741, 59329, 96604, 83338, 57530, 77490, 102686, 91059]
23308I1059k9996K1870m2814r174k175l3864k4434k146K2134m7609o3556M7565
23296g3140O123k4181M1043M5416K2270J2170q946r687j5146k4669j040M3832
23284A4045Q945o748L856m852l2609l4799j7155P9878K3438l8120j3983k8129
23272d6233m0501N2043j3741L3891P018J2603k370P436m012k4916k4079q590r818
23259f1269M9085l220M343O408K3116Q461m538L1722m8547l0449m421j1607J6219
23246b4697l439l0675l2996K9611O0233M1273N1944j0094k9047o467k0826k5574
23234g54L6147k0391J035m543R680J9987J3772k3362o5802m3730j0457M1453m069
23221e1034L429k7587l1581L7436N9850j1992m5778m8570k539K1515q985K5397
$$ y = [91059, 61063, 82933, 40119, 30945, 28770, -5094, -29528, -31674, -9540, -57149, -120705, -73140, -67017, -91198, -50155, -4739, 17531, 29701, 20755, 11068, -4078, -28747, -29787, 14045, 22990, 16242, 20098, 15246, -17363, -52162, -69317, 10561, 33999, -4121, -18104, -46233, -86734, -34691, -48432, -14541, -7523, 5080, 2710, 10146, 6134, -18782, -42861, -51451, -61269, -12184, -15404, -11061, -4653, 18463, 26924, 22386, 54108, 5561, -24888, -29309, -40916, -24697, -28136, -58811, -91807, -62196, -1963, 39310, 91254, 81160, 52113, 45646, 24820, -754, 35393, 15002, 16037, 11494, 21174, 41161, 54933, 31571, -34231, -77961, -88418, -46965, -51034, -47605, -75192, -106773, -69337, -9487, -21479, -67257, -115827, -118366, -96851, -105836, -80439]
23209h0439K0009M6438N2507o9517j7654j0133j8968J2992P1250L2786m7205k5243
23197c3177l0563l3694O4238M2047k8322l3909N480J4594r250o2115L4866L5069
23185c4736J6650K5167p206j1120j6529J8117k0449l5895j0957M9903J3191j1233
23173b5097L7764k401k286L5761J4789N439L0910N5073M824m0474j1265p9304
23161B3733k6528L3301J3291j3877j4307l879j3829m8455n0499K475K262q73N6725
23148d0460M0320l1167l3409j2103l7121l1116J3823K0058J9430M1953K9525j4287
23136c4554K3185K4470P161K4995L86R27j2047m2935m3735Q673j9928j1171l059
23123g7632k1260J5119j6790l917O5837Q9771k7201p7182N198L0364r121L2781
$$ y = [-80439, -60430, -13992, 38515, -31002, -48656, -58789, -77757, -64765, 6485, 39271, -7934, -33177, -63740, -97434, -33196, 8851, -19471, -53380, -47900, -33306, -42556, -104671, -69805, -34736, -18086, 7081, -125, -11245, -27774, -9657, -30106, -66001, -76958, -27055, -13864, -25097, 12667, 10266, 7980, 43741, 58530, 63969, 94879, 149952, 154776, 114302, 103037, 23733, -2795, 30506, 43797, 29920, 15613, 11734, -2095, -50550, -101049, -98574, -96312, -97185, -40460, -140, -31307, -64716, -76819, -113940, -145056, -131233, -111175, -91745, -49792, -20267, -34554, -11369, 13101, 20262, 45257, 45643, 46570, 34523, -8412, -52147, -43474, -63402, -74573, -77632, -98892, -83773, -100563, -104480, -38643, 51128, 23927, -53255, -48057, -17693, -26814, 5967]
23111E967M395l3419n4045j9630L7790R072k3169l356J773J0455K9637k1807l5918
23098i2255M1771N2289O2514j5170L9544j7064m5585p4947n6430K9775K5431J2069
23086c8058L2728o051l3481P669K6482J9989q2521k6044p675M4638L0155Q579
23074b3590K2844l9193p193J436L5314k6374J2522M9421l95K2667n7924l2527
23062d2992K1614J8575l790N4168M6063m5581l0902J9257M9718M4175l8380l0081
23050F1844L2504K5111m5488l0415l3820q544J3061J1587O468l608M697K2204
23038E5601J9303n8994k2127p969m3364L9354j5430J7422j0260j8282m124P157
23026d1713m036j9857M1430J9810k4662j6376M9729L7297M7927N6998Q3690P5910
$$ y = [5967, 10362, -23057, -77102, -96732, -58942, -49870, -73039, -76395, -74622, -64167, -34530, -56337, -92255, -50484, 1805, 64319, 49149, 88693, 71629, 26044, -48903, -105333, -75558, -50127, -38058, -5330, -11381, -44862, -37193, -10711, 9278, -73243, -99287, -106962, -62324, -32169, -23590, -746, -39939, -47132, -45696, -10382, -36756, -24234, 25187, 24792, 47459, -10465, -42992, -21378, -2803, -6593, 47575, 93638, 48057, 17155, 36412, 86130, 130305, 91925, 61844, 94348, 119459, 73971, 43556, 9736, 1192, 14253, 25840, 32308, 28700, 33397, 55601, 74904, 15910, -6217, -14186, -57550, -18196, -33626, -16204, -26464, -44746, -48870, -41713, -45749, -65606, -24176, -4366, -29028, -45404, 4325, 41622, 89549, 146547, 230237, 306147]
23014C06147R2199L7489J2636k7031n5289J335n0777p7054o4925o3568k608L348
23002A11902j2445l0983r340L8436k9950j6885n6597r746J6458M276K5228L2423
22990F2777M2017J1970j6156n978J7213M1702K6293k4067j9672o8247m0891K8
22978B6989P981J313l0741J4644M0638R68j893j6642k5746j6087J4894l4341k4082
22965d2105M7775K5850L7468M5429n0574m7898R613J0656L4558j4874l6732k3894
22953d728J6308l6880K868L3239k7499l2144q425k3512J0704L170j8816M6197
22941c9518P2743r408m4627j5906M7106M9128k059L6732k855l4398k852J5675
22929F9761O3881j5347j3137n1461m0326K2909N3737m148l8172K2497j2696l8701
$$ y = [306147, 398346, 435835, 448471, 421440, 366151, 367486, 316709, 239655, 174730, 111162, 108554, 111902, 99457, 68474, 59134, 97570, 67620, 50735, -5862, -15608, 850, 5126, 30354, 62777, 104794, 116764, 100608, 94630, 111843, 153545, 179838, 155771, 136099, 67852, 26961, 26989, 34970, 36283, 5542, 20186, 60824, 61792, 59899, 43257, 17511, 1424, 16318, -18023, -42105, 5670, 31520, 68988, 114417, 63843, 15945, 25558, 36214, 70772, 55898, 19166, -4728, 11580, -25300, -22432, 10807, -16692, -48836, -57261, -80773, -70069, -66899, -85715, -39518, 33225, 23817, -20810, -36716, 10390, 59518, 57459, 94191, 91336, 56938, 54086, 69761, 133642, 118295, 105158, 53697, 13371, 36280, 90017, 85869, 47697, 70194, 57498, 18797]
22917A8797K5864m8832k517L3567n606j2267K7555P162K5769j4140q239J9568
22905F6681n2883l3684J693J0195m5252k7981J2286K0999j8703k1434L6550n049
22893e6582J0071K7875J6809l1799K348K1452K1096l4963l6472M3008j3988J2306
22881a8839j6500p940n555L693j872n1527j8581K7256J2568k9095m0324K740P5324
22868f8652L4825J2745M0860K8818l1014p5926J7032k9995Q826J8257L3744j0058
22856b0538M3389M4736k2152n5713k6361L902l070J760K1334m900K935M0263N0732
22843G6317K5061p680n5095o4940j5937N1839N5709j5681K2329l3644q3851l1951
22831g7524K4943q994J8345J325J8586J3406n320K4508K7472K337l4793k5774
$$ y = [18797, 44661, -4171, -6688, 26879, 21273, 9006, 36561, 43723, 69492, 55352, 47113, 66681, 13798, -19886, -18193, -7998, -53250, -81231, -68945, -47946, -66649, -88083, -51533, -56582, -46511, -18636, -1827, -33626, -31278, -9826, 11270, -23693, -60165, -17157, -31145, -18839, -35339, -43279, -48834, -45141, -47013, -98540, -117121, -89865, -77297, -106392, -146716, -143976, -68652, -33827, -21082, 19778, 48596, 17582, -58344, -41312, -71307, -62481, -44224, -10480, -20538, 22851, 67587, 45435, -10278, -36639, -32737, -35807, -34047, -12713, -17613, -14678, 25585, 76317, 101378, 93698, 38603, -26337, -42274, 9565, 65274, 49593, 71922, 38278, -45573, -77524, -52581, -61575, -43230, -41905, -23319, -9913, -15233, 9275, 36747, 39084, 4291, -21483]
22819b1483K4529K462n6889O067K5283k6088k6784J7272l3053k1401o037J2208
22807a03914J820K5647N2528K5639L0486M099k6394m6295J9537N369q1906l0460
22795a23844J0288P5847O9347J0553l0723j8160k7360l2019J3492M8791J5401
22784A1613l1172n649N4397K9161k6086j9704j5524k2186N02l66n306j0440j3753
22771e4513J1578k348j1440k1518l43J5583K4056l155j7105k7288m46P432P70
22758g8737j7852j9108M8604k49m1479l1674P3970J2854j2689L9106J8466j1490
22746b0278Q419m5269n8265k5241j311N0444P1080J4037m948J5210j5501j641
22734a3264r317m2720J9926R7870M8943m6813j7011l3090l8464J4623k679K7379
$$ y = [-21483, 3046, 5508, -51381, -45314, -20031, -46119, -72903, -55631, -88684, -110085, -116122, -103914, -102094, -76447, -23919, 1720, 32206, 36305, 9911, -36384, -16847, -11478, -93384, -123844, -113556, -37709, 31638, 42191, 11468, -6692, -34052, -66071, -52579, -3788, 11613, -19559, -25208, 29189, 58350, 32264, 12560, -2964, -25150, -24648, -25014, -30320, -40760, -54513, -42935, -45283, -56723, -78241, -78584, -63001, -38945, -42100, -59205, -86493, -86939, -79507, -78737, -96589, -115697, -67093, -67342, -108821, -140495, -66525, -53671, -66360, -27254, -8788, -20278, -11859, -57128, -115393, -140634, -141945, -91501, -20421, -6384, -11332, 3878, -11623, -13264, -22581, -65301, -45375, 52495, 101438, 54625, 37614, 4524, -33940, -19317, -21996, 5383]
22722E383M8482m7920q6210k4748m93k0469R212L4949N5497J6032K9055j719q2131
22709f5080J0759L6024M1182Q407M117l2305m6935j5822M9088p656k7627L4339
22697a1509o953j943L149j0663J1174P1836M6644j8394m7240l3757Q477J1629
22685B2450K496j2057K1164l7579p6331L0164L7232K3312K4313M7916m2375m4744
22673d039J3006j0863l1575r365J8377N9717K3724m1908m6000n8200J1048j582
22661g7660j1467K6705M9742m644n2989m2876J3971N2913J0344j4131K4834K1830
22649c428J4818K3214N107P0024k4254j17000m6582N2543M2489L622j7433j4853
22637a1733k3660k2593N3991j1770j8271K0069j8673j3806k2205K639O9446P2858
$$ y = [5383, 53865, 5945, -80265, -105013, -105506, -125975, -116763, -81814, -26317, -10285, 18770, 17051, -65080, -54321, -18297, 22885, 31292, 35409, 3104, -43831, -59653, -10565, -18221, -45848, -11509, -18462, -20405, -17256, -27919, -16745, 55091, 101735, 83341, 36101, 2344, 10821, 22450, 24946, 12889, 34053, -3526, -79857, -49693, -12461, 10851, 35164, 83080, 40705, -4039, 8967, -1896, -33471, -42836, -24459, 35258, 58982, 17074, -28926, -87126, -76078, -77660, -89127, -62422, -12680, -17324, -70313, -113189, -99218, -46305, -35961, -50092, -25258, -3428, 11390, 34604, 39711, 109735, 85481, -31519, -78101, -25558, 16931, 20553, 3120, -11733, -35393, -57986, -3995, -15765, -34036, -13967, -32640, -46446, -68651, -66012, 3434, 76292]
22625G6292k3533o6005N108m4834O384L6193J726l8573k8752r66J757L8098j0725
22612d7830J8915k5280k4827r616J0401K0342N7203J6926L9392M2450m393o3280
22600C0403n3365L3187L4K927j8729j2406m1197l4752L4907N27j719l0044M0466
22587d9761K6279N086n1890k3491j1009k3507o81N8571K1269J2742L482l327Q8897
22574E2660L3121l0238p6560k7799L1343J3556J7599J5271n9265n1912k3348K4357
22562h1215M5430L7430j8915m3871l697k9992m1550j1955L2233O1565M7011M6371
22550C8845M7497Q578l2107n3585J2335m478L2680R689k0211k5703k2916n7666
22538f7042J1754L3534J9200j2610k1518j4543L5568L5013j2356N3356J4731j27907
$$ y = [76292, 52759, -13246, -8138, -52972, -46588, -10395, -8669, -47242, -75994, -76960, -75203, -37105, -47830, -28915, -54195, -79022, -88638, -78237, -57895, -692, 16234, 55626, 98076, 93683, 30403, -22962, 10225, 10259, 13186, -5543, -17949, -59146, -93898, -58991, -58464, -60183, -90227, -49761, -23482, -18396, -70286, -93777, -104786, -128293, -128974, -70403, -49134, -36392, -32910, -36237, 52660, 85781, 55543, -21017, -48816, -17473, -3917, 13682, 28953, -30312, -82224, -105572, -81215, -35785, 1645, -17270, -61141, -64838, -94830, -136380, -148335, -116102, -54537, -7526, 38845, 86342, 94920, 62813, 9228, 21563, 17085, 49765, 59454, 39243, 13540, -9376, -67042, -55288, -21754, -2554, -15164, -36682, -51225, -15657, 19356, 7000, 60356, 75087, -52820]
22526e2820o4109M9614M6848n46n2052k7124M3016O6141R601k677m6993j7530
22514d8631j6583M970J0667Q42J6779K9008K4240J2406j0037o5544j3184J5299
22502c9768p630L1890j7702n3943K2977N2279k1758n4272j2747k7162J7696l343
22490a13483J748P8804K1247j8734l8290l0643L1201j8475m5688O536N0581O2168
22478a3028K8454N710k8637k7181k555l4015R827K6148M7102L1834k9049l933
22466A0677m1776k5509o0887k6680L6764J5035K7905P342K5772J0186j1511m6671
22454g9353j6038k6690M324J5441K2432K4167L6096L5260j9331q110n7863o9104
22442a38769k4380K6867k6701O1517R4464o1387l7131P3011L5399j0500K0238
$$ y = [-52820, -116929, -67315, -20467, -21013, -73065, -100189, -57173, 8968, 18569, 15892, -31101, -48631, -65214, -60244, -49577, -48735, -31956, -2948, 21292, 33698, 23661, -41883, -55067, -39768, -47398, -15508, -33210, -87153, -64176, -11897, -33655, -87927, -100674, -127836, -110140, -113483, -111735, -32931, -11684, -30418, -68708, -99351, -68150, -86625, -132313, -125777, -75196, -13028, 15426, 21136, -7501, -34682, -37237, -71252, -61425, -35277, 11825, 43659, 14610, 10677, -31099, -56608, -117495, -144175, -107411, -92376, -64471, -57129, -31357, -21171, -32682, -79353, -95391, -122081, -117757, -102316, -79884, -55717, -19621, 15639, -3692, -11802, -69665, -138769, -163149, -136282, -162983, -101466, -7002, -68389, -105520, -32509, 2890, -7610, 12628]
22431A2628K2265P394M618j4891l4567L81l1947l5093K4034L2881l6632n677M9652
22418d954k4697l5587J7583O0282P270m907l0384k7266r452L1929N3659M8986
22406H2462k3105m1888m8212J0721J9811j4991m840M0795J8733l3383o0875j7887
22394g2659M9416N3847j1567m3973m0332l6824K3764K5779J6273Q726P79r5983
22382a22754K3938J9257K1402J3448q7723o864O5636M1708K4574l9389Q050N0171
22370A1454K2896j0904N717q99p275j3966q2909M269O5734M0731n5404O614L3222
22357A9280k3357K7392K0677j5955J9152q468p2569j7357j5950J5097M3178M4906
22345C6026P9308O141n5874k3621k0280L0622j9585j7560k9815o2112p785l1547
$$ y = [12628, 34893, 42287, 46905, 32014, -2553, -2172, -34119, -69212, -45178, -12297, -48929, -54606, -4954, -29651, -65238, -47655, 12627, 19897, 14990, -15394, -42660, -52112, -20183, 33476, 82462, 59357, 17469, -30743, -20022, -211, -15202, -20042, 20753, 39486, 6103, -54772, -72659, -23243, 30604, 19037, -24936, -65268, -102092, -78328, -52549, -36276, -27550, -26771, -122754, -98816, -79559, -58157, -44709, -132432, -139296, -73660, -31952, -7378, -46767, -38717, 11454, 34350, 23446, 29163, 28264, 20989, 7023, -75886, -71617, -5883, 34848, -20556, -13942, 19280, -4077, 23315, 43992, 28037, 47189, 38721, -33848, -51205, -67155, -52058, -8880, 36026, 115334, 121475, 65601, 41980, 21700, 52322, 32737, 15177, -14638, -76750, -84535, -116082]
22333a16082J5160N7852M2374j7862K7916P735o1065l6873j0092K7541L8728M47
22321b4221P724L8904P051K1403K8253J7107k2268k1980k7166L4033M0104j12020
22309a3076l3530M8886K9704o830J7958K5578l9050p0579O357O0081K3991k1267
22297B8223P99m865J2529n5553n6587K4168Q446n336J8142J3601q161Q154k2548
22284c8988k1983J5345L0613j793j8309m0855n7734k4578P8109L5986N2853r177
22272e11N3087M359k1352n0199k0354k4759L1627M2919J5624k9348k9584M3992
22260A5501N729n9909J3942L2484K7870J8055o0358o2461M2220N2808K052R532
22248C7465o0418n6021Q152L7520J6393L0241N134k5708j9519r387L9367p5211
$$ y = [-116082, -100922, -43070, -696, -18558, 9358, 17093, -43972, -80845, -90937, -63396, -24668, -24221, -16497, 22407, 29458, 50861, 79114, 96221, 73953, 51973, 24807, 58840, 98944, -13076, -46606, 2280, 31984, 25154, 43112, 68690, 29640, -40939, -34582, 25499, 49490, 28223, 29022, 24157, 36686, -18867, -75454, -51286, -42840, -48176, -30034, -16433, -24594, -16440, -38988, -60971, -45626, -15013, -16806, -35115, -75970, -133704, -158282, -80173, -44187, 8666, -511, 52576, 56935, 35583, -14616, -34970, -59729, -28102, 14817, 30441, 1093, -28491, 15501, 21230, -38679, -24737, 7747, 35617, 53672, -6686, -69147, -26927, 25881, 27933, 37465, -22953, -78974, -70822, -33302, -16909, 13332, 18466, -7242, -26761, -36148, 3219, -71992]
22236g1992m9605P3N2355L6231L1796M4927l7795m2061j8694R242M9254N036O306
22223A5073m6944k8874j8073J0548N5620P1803l1140o2689l238M4452K1524k8971
22211i09J187k3531n266J4856j1208j2896K7257K6856j2360L976k8046o433P924
22198a8593m0795r226J5651J7176j8118j1463j4870n5067K4271M3580J7808j1059
22186f0705j8654M0436O8223M0933L4033Q437q0139j7126R683K505l7611k1410
22174c1395L1367M2096l4821n1190J1492N4444M0646Q191k7645k2628l2621n3747
22162f5811O784r501J0589N5371K4601K0038n473Q822m247l1849m0240l067L3997
22149A4n018l8368K2069J488k1510p789M6300J1338O267K8195l1001Q651j3150
$$ y = [-71992, -121597, -121524, -69169, -32938, -1142, 43785, 5990, -36071, -54765, -45523, 3731, 8767, 15073, -31871, -60745, -78818, -68270, -12650, 59153, 28013, -34676, -37914, 6538, 28062, -909, 278, -23253, -28519, -13663, -24871, -37767, -10510, 16346, 3986, 7962, -20084, -26517, -18593, -59388, -68614, -52963, -35787, -53905, -65368, -80238, -135305, -111034, -67454, -49646, -60705, -79359, -38923, 29300, 70233, 104266, 112703, 32564, 15438, 25121, 27626, -9985, -31395, -28, 42068, 7247, -43943, -32451, 21993, 62639, 70830, 43185, 20557, -12064, -65811, -59027, -68528, -57939, -2568, 22033, 42071, 36598, 45420, 41173, 9324, -30916, -33983, 14, -5004, -43372, -21303, -19815, -41325, -49114, -2814, 8524, 14791, 42986, 11985, 20636, 7486]
22136G486k3123j9383k4849J176m6737K0167L5086J2397N095N2263l79L7226J5693
22123G2118n5908m7667r091j9391J1458K1945L7494N456n5911n3662J7294L3925
22111d1940k2419r768n096K0028P5905R989p1588J629L8285j9781m9515k8846
22099a03117L3989L9547L4237K6541n0466o3478o621M1216M3042J2511J7692j6954
22087H139L2352j6234o9594P356K4407K6427J9568K6046k2268k1518J977J3566
22075C0224k3212l5204p21o9904J1496j0312r320j2292l0728K3456L2398K960
22063i1159j0933O475r737k7380M3486O4225O0237k1517r569j276J3440N5809
22051G2101m9673n7393L9825k6346m343J9826j2297J0000J8769j3684l156J0659
$$ y = [7486, -15637, -35020, -59869, -58693, -105430, -85263, -50177, -37780, -32685, 19578, 19199, 56425, 72118, 16210, -31457, -40548, -59939, -48481, -26536, 10958, 16414, -39497, -93159, -75865, -41940, -64359, -74127, -79223, -59195, 16710, 26699, -44889, -43260, -4975, -24756, -74271, -103117, -69128, -29581, 4656, 31197, -19269, -82747, -89368, -48152, -5110, 7401, 25093, 8139, 40491, 24257, -45337, -37981, -13574, 12853, 32421, 58467, 36199, 14681, 16658, 30224, 7012, -28192, -28913, -98817, -87321, -97633, -106953, -119245, -149973, -126517, -94119, -91159, -102092, -95617, -105354, -132734, -89248, -25023, 35214, 13697, 4128, 2852, 16292, 72101, 22428, -34965, 4860, -21486, -25829, -6003, -18300, -8300, 10469, -3215, -6371, 4288]
22039D288M897k3060m3856J6390K9783n134O2149K2220j2664o4389J5127m163
22027A588N1683K0511p0646m6750M2991L3899M356q4251p9833J8075O7311K8007
22015a3059j4727j7305m4398O285M4664k0341K0415M2554N0916l5686r849k339
22003G130J1642l9459J8131L397L027m0297K858k1985l3218o9332O0912M6595
21991e0599O444o470n620K6535m4565p7813O2333J09827L1103k4672l3574m446
21979a1517l1357l5473K3204p590P92J0516q573j3844P878M0561L2255N1945k6758
21966C2039J2072l3328j5285r061l4679l245M4287L1143N712n7521K4227l2182
21954c5821l1573m7674K1104M5555k8402J7821l4K2872P04L9090j09O903J4416
$$ y = [4288, 9185, -13875, -57731, -41341, -11558, -16692, 45457, 67677, 55013, -9376, 5751, 1588, 53271, 73782, 3136, -43614, -623, 33276, 37632, -46619, -126452, -108377, -41066, -13059, -27786, -45091, -89489, -83204, -38540, -58881, -38466, 4088, 55004, 19318, 9469, 7130, 18772, -20687, -2556, 841, 3868, -36429, -33571, -55556, -88774, -158106, -97194, -50599, -44155, -50625, -56245, -29710, -74275, -152088, -89755, 20072, 51175, 26503, -7071, -11517, -42874, -78347, -55143, -62733, -61941, -51425, -59998, -73842, -65964, -25403, 6852, 58797, 32039, 44111, 10783, -4502, -13563, -48242, -51487, -7200, 23943, 29655, -27866, -3639, -35821, -67394, -115068, -93964, -48409, -76811, -58990, -59024, -36152, -35448, 3642, 3533, 10436, 24852]
21941B4852q716J533j8354k8389k1292j3207l8199J9775J0374l837j0653L5633
21929e0480j0389J1434k882Q755M8897O1981J629j6930L0813L6198p5093J0095
21917E4028p211m4541J2824k1773n1532K1948N3090j5058k1934O437K0109J3648
21905B0035M9638q2589p8865m0846K0209M9204M0393K8674L2599k5302j8021L309
21893a562r763n104o3854j0937J6904Q7130N6634K5484j5565m7415k1547K2424
21881C2829J8758K1371m1061J0774K976j9448k9350J9996J2202J9432l8552m106
21869E821J7265L3389m5343n1102j794j426K0345l9405p376L7497k0337K273J3488
21856c6705N4766k88o5898m8719L2750O7678L587J9096J9222K6904O25q9051p146
$$ y = [24852, 16136, 17669, -685, -29074, -50366, -63573, -101772, -81997, -71623, -75460, -86113, -50480, -60869, -49435, -52317, -43562, 5335, 67316, 68945, 52015, 82828, 119026, 43933, 54028, 46817, 2276, 15100, -6673, -58205, -36257, 16833, 1775, -20159, -13722, 6387, 20035, 69673, -12916, -91781, -132627, -112418, -63214, -22821, 5853, 38452, 13150, -4871, -1562, -11325, -16429, -80283, -91220, -74316, 12814, 69448, 94932, 79367, 31952, 10405, 32829, 51587, 72958, 31897, 42671, 45647, 26199, -3151, 16845, 29047, 48479, 9927, 5821, 23086, 56475, 11132, -39970, -41764, -43190, -22845, -62250, -69626, -32129, -52466, -50193, -36705, 18061, 17773, -48125, -96844, -64094, 3584, 7171, 26267, 45489, 72393, 73018, -16033, -23179]
21843b3179r609N2679M9694J7474l3953j0820j2703m5931J1417N4288K9605j5872
21831F3090m0884M0681l2781n6036K5827K2140K1998J8729M0027l1345k2201L249
21819E2494l4216n7365J4331K983m2896q498k7845K870P3804k659K6047l65m0254
21806d1569n2569L2228L552N0740J4712N091j09189R774N9349n922m5694m84L7399
21793d2582M1948N931M481m2794L0127L0187j5687m613R179l814K9588m9409P122
21780c36J8554k0183p799k1310O491j6539L8475j7119j5293m8706L3053N2084
21768A372Q961J1712O0214J1418m7357l7782l3047L0892r485J1047l2729j5436
21756d0220J3807Q0303M0742k3891n5724k4005J7127L6594k2088j704j5362j0059
$$ y = [-23179, -32788, 19891, 69585, 87059, 53106, 42286, 29583, -16348, -4931, 49357, 78962, 63090, 22206, 62887, 30106, -25930, -103, 22037, 44035, 62764, 102791, 71446, 49245, 52494, 18278, -39087, -24756, -21773, -64669, -73167, -101012, -98142, -24338, -26997, -950, -1315, -41569, -94138, -61910, -58358, -7618, 7094, 12185, -97004, -87230, -27881, -33803, -79497, -79981, -42582, -634, 5297, 9778, -33016, -2889, 27298, 11611, 6998, 16177, 12363, 41951, -7458, -336, 18218, -1965, -9764, -31074, -24583, -41122, -2647, -19766, -35059, -83765, -50712, 1372, 10333, 22045, 82259, 93677, 46320, 8538, -24509, 6383, -3102, 7945, -24784, -40220, -26413, 53890, 94632, 70741, 15017, -8988, 8139, 44733, 22645, 20941, 5579, -4480]
21744d480k6674j6454R767K3547n1031J3669K9780l428j453L978N0846o394j346
21731B0327k5275k8463Q186k2622K9093L2722n3772Q6J6787j010P2619O3210o9777
21718D2111k6669J492r883l2278q608N207L1971L25l3294J3872R659j5497K6981
21705E389n558L384J2680k687P40l7183L2940k1704m938j2210l3340m9368q340
21692a20195M4608N9829J9028N1031Q465m1951p2582m1532j6815n469L0446J7630
21680f7507K7377K2303j1803m7174M3844P7153m378q538k7814k1184j7969o897
21668d2587k5109N1928N2063K9649l5180m1626l2136l459M0581J6974k5334j03937
21656a18173j6707M4185J6465J19965M4201k7219j26235r5186J4667M9776p27
$$ y = [-4480, -31154, -47608, -37841, -14294, -65325, -51656, -21876, -25304, -26757, -22779, 28067, 21673, 20327, -4948, -33411, -25225, -47847, -18754, 13968, -39804, -39718, -22931, -23941, 48678, 111888, 42111, 15442, 16934, 7051, -25227, -33835, -28628, 3343, 3668, -29626, -15754, -6095, -21592, 5389, -169, 3215, 15895, 13208, 13948, -23235, 9705, -11999, -16937, -29147, -62487, -111855, -120195, -75587, -15758, 3270, 54301, 62766, 20815, -51767, -93299, -110114, -115583, -85137, -67507, -40130, -17827, -29630, -76804, -32960, 44193, 39815, 31277, 3463, -17721, -35690, -42587, -67696, -15768, 36295, 65944, 30764, -10862, -42998, -46457, -5876, 11098, -14236, -118173, -134880, -90695, -74230, 45735, 89936, 62717, -63518, -158704, -144037, -94261, -94988]
21645i4988j2793L8505J5309P8027j9130J611K726J3319M1613k0768k3259k2730
21633b558n9046j6333J0358K1873P9668J5771o2736n0769j0792J1753L943M1257
21621a7611K4031L6837q0207j91O1327k7362q926o998J5258R396K4638j8685l430
21608H077J8337O8290L7354m751l9077p1222k5962n167k4474m1944L9229K3245
21596a8065R0844K6686R514J3115r2339l2648k3700k7995N3317K7163o7430J794
21584c9744J5986p861m351j7938k405l4440J5737M4723M816M3603l6448q817M0937
21571A3798K777k9664k6524j060l3843O8468L6520l349J4919j4979o3415j6986
21559e3338j3492J9577j7227K3220P0543K7153N6600k0079l8185k9466o5047o9893
$$ y = [-94988, -107781, -69276, -53967, 24060, 4930, 6541, 9267, 22586, 64199, 43431, 20172, -2558, -61604, -77937, -67579, -45706, 33962, 49733, -13003, -63772, -74564, -62811, -58868, -17611, 6420, 43257, -36950, -37141, 24186, -3176, -12102, -19100, -3842, 5554, 30192, 11507, 8077, 26414, 94704, 132058, 127307, 88230, 17008, -8954, -14121, -38595, -80539, -41310, -18065, 72779, 99465, 108979, 122094, 29755, -2893, -26593, -54588, -1271, 25892, -41538, -39744, -23758, -31619, -35970, -53908, -56313, -90753, -75016, -30293, -25477, 18126, -18322, -27139, 13798, 16575, -13089, -39613, -40673, -74516, -6048, 30472, 27123, 42042, 27063, -36352, -53338, -66830, -47253, -64480, -41260, 29283, 56436, 113036, 92957, 54772, 25306, -39741, -109634]
21547a09634M307j3277M8351N0991M0867K5182J2909K1509m5117m463K8841j8908
21535D1558K0855J8861J7512k7399j3743k8301j2888k0808M397j5044J8409j2190
21523h781K570M4340k4345j00499l5795K389L4158M8947N4625N925l566J4092
21511C4060J9799j3631n5507O093K4669m2463m6684l215M6188K2388J446J423
21499e434l654K8407k0943L1331K244l8066k2640n2115L7569L3444O733O546J4150
21486A7572J4004p573N696l248K4111n9014k5542p065M97L3738N8390M0855j8595
21473G3826n2616k6671j7211K3934p281m774K2313J8750m8239p08N825R804o455
21460i503R627l1450N096N1713K1555l6824k0781K6057K7118l0778O3590K8949
$$ y = [-109634, -105327, -118604, -70253, -19262, 21605, 46787, 59696, 81205, 36088, 31625, 60466, 41558, 62413, 81274, 98786, 71387, 57644, 29343, 16455, -4353, 44, -15000, 3409, -8781, -6211, 38129, 13784, -86715, -122510, -120121, -85963, -37016, 17609, 23534, 19968, 34060, 53859, 40228, -15279, -9186, 15483, -26980, -73664, -76879, -30691, -8303, -6857, -5434, -9088, 19319, -1624, 29707, 31951, -6115, -28755, -80870, -43301, -9857, -3124, 3422, 17572, 31576, 24003, 29699, 26451, 50562, -8452, -33994, -41059, -40562, -6824, 51566, 92421, 73826, 21210, -5461, -22672, 1262, -6019, -10793, 11520, 30270, -17969, -18677, -12852, -3048, -9503, 124, -31326, -26230, 25483, 47038, 10214, -10567, 15490, 42608, 11830, 75420, 104369]
21448A04369l0764m0410o7715l0144o0914q692J5450N3680N8244L4961N8324l3139
21436E3250p8950k8814M994n959M4056K6962n7391P606M0992R97J3701P903j1786
21423A7561k858J0056n018J1699j042l4617Q743K5244j3599q557j4007n0458k8930
21410h5783J7820L2183J8117J7969k2212j832j6253o726O6865K2066o6625n928
21398c0339P0664M7053K2191j810k8601l8063o9561o0635L4786N3181j480l9433
21386d2047j8342K6985L06L885j0739O12K3126J1522L4377j3305j0780k8575J8512
21373d463J7682k4044k8016q70J123N0162L3289k462P38R551J8660J05o4798J9663
21359B6320J2107m5110n460N708L302j5849J1394P1188O352k0520l3433J9519
$$ y = [104369, 73605, 33195, -34520, -64664, -125578, -134270, -118820, -65140, -6896, 28065, 86389, 53250, -25700, -54514, -49520, -55479, -11423, 15539, -41852, -34246, 6746, 7743, 21444, 29347, 17561, 14703, 24759, 19741, 31440, 30398, -4219, 4524, 29768, 16169, 7612, -6395, -56853, -85783, -67963, -35780, -17663, 306, -21906, -23738, -39991, -46717, 20148, 42214, -24411, -30339, 40325, 87378, 109569, 107759, 79158, 41095, -28466, -89101, -54315, -1134, -2614, -42047, -60389, -33404, -33098, -29213, -39952, -39340, -16214, -4692, 29685, 16380, 5600, -22975, -4463, 13219, -10825, -38841, -39711, -38588, 11574, 44863, 42401, 43139, 52690, 71350, 71455, 6657, 26320, 38427, -6683, -12143, -6435, -3133, -18982, -7588, 63600, 69952, 49432, 15999, 35518]
21347C5518k6311p5536l9844J6480Q6884K3944l0283K7718K4629n3824k6262J0605
21335b6282M221L972o509k3792k7524l3215O9972N6210K0669l285N926J9135J2306
21322G1804p5344l644P7228O1723l5534m5424k4883l331M4085k148J5020J0138
21310H9690n0094n1528J4970m3694o4529R062J0067P672k3035K3581N4979L6116
21298A3257J7762L062J5967m5319k5261M54K33j270J076K5797O7147k0078k7939
21285B4888j1560l5425K4943k6758l4034J6123p948J3846K0956k6643L4868M824
21273a920j8828l3589q455O702n541q49J4497N0370k4207L6319n541k9244k0004
21260d0290M4316L3870k5184k6726K7851l9442n7804j8989K1802L4131L0590L0117
$$ y = [35518, 9207, -66329, -106173, -89693, -2809, 21135, -9148, 18570, 43199, -10625, -36887, -26282, -22061, -18089, -24598, -48390, -75914, -109129, -39157, 17053, 37722, 34437, 40363, 59498, 71804, -3540, -7184, 70044, 131767, 96233, 50809, 25926, 22595, 66680, 64532, 79552, 89690, 39596, -11932, 3038, -40656, -105185, -96123, -86056, -78384, -101419, -77838, -22859, 13257, 31019, 34081, 50048, 4729, -20532, -20078, -19845, -21115, -20039, 5758, 72905, 52827, 24888, 13328, -22097, 2846, -23912, -57946, -41823, -49771, -35925, -14969, -41612, -6744, -1920, -20748, -54337, -62792, -56090, -61631, -62480, -47983, 2387, -21820, 14499, 8958, -20286, -40290, 4026, 37896, 12712, -14014, 13837, -25605, -83409, -102398, -80596, -46465, -15875, 14242]
21248A4242k5815l0734k6530P2965r547n1040n3473N2240L4327J7876J2280k8842
21236b2051n5354k4538J6880l168Q85J9513K9256O9940O358m9785o2308j6830
21224i1202j305O7250N6962k6629J0448Q335l459L323k8257n536M5617J0655J823
21211D8025J7674R899K3732q519n5195k5505P809m7416l2564n653K8289k8515
21199f7939L2111K7901P033L9501j1456n361L291L5291j4450n9665N874k1011
21187b8880j7476J6027N246l6703l6963R005L4233L6485m221L5492L350k7211
21175a1616j4224M6964J420k7238l9948m175P3441O6902J7457j3685o2468m206
21163B8624k2216J5642k2991j0975O293k6377o999J0015J2747N930O733K9251
$$ y = [14242, -11573, -42307, -68837, 4128, -5419, -56459, -109932, -57692, -23365, -5489, 6791, -22051, -77405, -101943, -85063, -88231, -87346, -67833, -38577, 31363, 37721, -12064, -74372, -91202, -92507, -25257, 31705, 5076, 15524, 23859, 20400, 23723, -4534, -10070, 35547, 46202, 48025, 65699, 75598, 99330, 90811, 35616, 10111, 17920, -29496, -62060, -67713, -39424, -67939, -35828, -7927, -894, 38607, 27151, 21790, 25081, 60372, 45922, -13743, -7869, -28880, -46356, -30329, -25083, -61786, -98749, -89744, -55511, -19026, -23247, 12245, 15595, -11616, -25840, 21124, 22544, -4694, -44642, -48817, 24624, 91526, 108983, 95298, 32830, 28624, 6408, 22050, -941, -11916, -5623, -32000, -38999, -28984, -16237, -10307, -3574, 25677]
21151B5677M1570N4090k721l5303m9963N076r507l0517J0593M7754j1022k2621
21139B3106n102J8980J6480j4599o066L0009k2107K3213k5076o510k9536q5395
21127h2603m183k6653M211K7230O5190k1484k4708K0570P623J0590k5224m4459
21115i3900m32L2644o087Q567j1937k8433J9264K8772L5852m8773N509O3445K3219
21102B7710q0985p83P4487N8760l2356r526P391K2807l0299n3016j00704k1078
21090a37592M9654P6976N3411p4705M756Q2092L262K7748Q52m1064O298j4935
21078C6753P774J0251P336k497k6113l4569l2735M3696J4274Q420j1262p8697
21066e7369p433j0867j8348P808J4360M1828L7275k0985L0450O848j4172K7371
$$ y = [25677, 67247, 121337, 118616, 83313, 33350, 38426, 28919, -1598, 8995, 56749, 45727, 23106, 18004, 36984, 53464, 38865, 32799, 62808, 40701, 63914, 38838, 32328, 2792, -82603, -86786, -113439, -109228, -81998, -16808, -38292, -63000, -42430, -34807, -24217, -49441, -93900, -94332, -61688, -67775, -59208, -71145, -99578, -80314, -51542, -15690, -64463, -58954, 4491, 27710, -53275, -54058, 20429, 79189, 46833, 37307, 44698, 67505, 37206, -15810, -116514, -137592, -87938, -10962, 42449, -32256, -27500, 54592, 57854, 85602, 86454, 45390, 51688, 36753, 44527, 54778, 62114, 59617, 33504, -1065, -33800, 9896, 24170, 32590, 21328, -57369, -64802, -75669, -94017, -86209, -71849, -30021, 7254, -13731, 16719, 23567, 9395, 36766]
21054C6766K9081l7273l8560j6381l2523P230Q080j5021N0062K6680p862K7355
21042C7634k7308l3400L2063J8226R724k142n9336j7296K0627L0171k2590m4948
21030e8575K2245M5897l7986l565N2309l962J0136k1021q739k9726j9844k0106
21018g2937J1914L0492O0990L9458l3931l0833N6971k2682n6619R125O0323j467
21006E0804l6679K56l5531N3381N1778j474k2888m2289o6994K5477O9256o465
20994C8632k0470m1436q300R316O607j8897j1574M799L6551K7665P288J9687m1778
20981H090J5888l7151L8726J31668J453q0008l1505n184K9745k4623j6895J9880
20969E0084J9059K2341k5508K9629j8318J5832j9878l9951m6765m6947k1290R5250
$$ y = [36766, 65847, 28574, -9986, -26367, -58890, -51660, -43580, -58601, -8539, 18141, 10279, 37634, 10326, -23074, 8989, 27215, 36939, 34797, -24539, -41835, -21208, 8963, -13627, -58575, -36330, 9567, -28419, -31984, 20325, 16363, 26499, 5478, -3261, -32987, -52831, -72937, -61023, -30531, 30459, 69917, 35986, 5153, 62124, 39442, -17177, -8052, 52271, 50804, 14125, 14381, -21150, 32231, 84009, 82535, 59647, 17358, -49636, -24159, 45097, 38632, 18162, -23274, -31574, -22258, -15651, -34548, -46122, -41323, -4772, 22893, 30181, 49868, 8090, 23978, -13173, 25553, 157221, 158674, 78666, 47161, 41977, 71722, 47099, 30204, 50084, 69143, 91484, 65976, 95605, 77287, 93119, 73241, 33290, -13475, -60422, -81712, 13538]
20957A3538J15288R453j05790n7543n964K0777O998K2538k4917n0145M871J5313
20945c5583K457N500K5468m192J4943l262l3542J4661K9303K5967l2130l8906
20933b9316J037L5732j9963j3775O3503O0477M5575n0925l8168L3053m1795q068
20921C7367M7708M13l6873k0511n1983J1471K3788P169k0638l7378J1721K5930
20909a816M926K4046J3670j9287M3765j721n1534K3409K6362J4919l9322L0915
20897F8332m2094l9048j598M9081K9409m1577J03m903m8216M492M2596k1824K1296
20884A6049R106J8132m122l8651j6909J6775J1066L8051k5898k9542j6648R384
20872a3207O883o992J5449p995k410l627p0009P902M8995L3216J1256n4310m3976
$$ y = [13538, 128826, 138279, 32489, -25054, -31018, -10241, -3243, 19295, -5622, -55767, -50896, -35583, -33126, -27626, -2158, -6350, 8593, 5331, -28211, -13550, 15753, 41720, 9590, -29316, -28279, 7453, -12510, -26285, 37218, 97695, 143270, 92345, 54177, 87230, 45435, 37367, 85075, 85488, 48615, 28104, -23879, -12408, 11380, 18549, -2089, -39467, -27746, -1816, 3110, 27156, 40826, 21539, 65304, 63583, 12049, 35458, 61820, 76739, 37417, 68332, 26238, -12810, -14408, 34673, 64082, 22505, 22608, 17705, -30511, -26019, 16577, -5247, 16049, 25155, 43287, 39165, 514, -16395, 380, 11446, 49497, 23599, -5943, -22591, -13207, -6324, -13316, 2133, -5862, -8272, -11899, -81908, -74006, -25011, 8205, 19461, -34849, -78825]
20859g8825j2835M977L0917L9245J7344L7934k095l0556K0998K5820P269o5979
20847e786j3532K734l0832k905k6366J1288J9082N1807j1920M0246L4478L3105
20835A01399q59L480j3912o2505m7242k4083l431R575J1107N8864k2286l0651
20823b0544j012J9495k5793K8870l5795k8657L8166j5099k0070K9868M2215K4493
20811C6137Q867k1243K4558J5004R9305R572j7096o0961M0283l7433m2562k2338
20799C2093l89j414J5109j8552k1876m6955R796K4340R08m510j3767L4986O266
20786A6035l838J7722r082l0253k8470O480n0097J5610P2005L0590Q287k0135
20774B4854q0675Q173M0474K6933o536q38L0090J8191l3177J8892j3094j0505
$$ y = [-78825, -91660, -86683, -55766, -16521, 823, 38757, 36662, 6106, 27104, 52924, 60193, -5786, -19318, -16584, -47416, -50321, -76687, -65399, -46317, 5490, -6430, 33816, 68294, 101399, 100540, 104020, 90108, 27603, -19639, -43722, -47153, -37578, -26471, 32393, 10107, -20544, -21556, -2061, -27854, 1016, -34779, -63436, -25270, -40369, -60439, -30571, 11644, 36137, 45004, 23761, 48319, 63323, 162628, 172200, 155104, 94143, 134426, 96993, 54431, 32093, 31704, 30290, 45399, 26847, 4971, -41984, -32188, -7848, -6940, -11450, -25217, 9769, 16035, 12197, 29919, 20837, -9416, -37886, -31406, -81503, -65893, 6112, 36702, 44989, 24854, -55821, -47648, -7174, 19759, 13223, 12385, 42475, 60666, 27489, 46381, 33287, 22782]
20762B2782j6374N797P0950j7579m767k7561j4849J4836k853L494J4288k7566
20750B0598p0045j0376J0983R825j4344K732N2937J5434m3933J6710L0379N1067
20738G1967M8657J0804k541K284J1461n1346j00636l0763L3132j8091L3753K1123
20726B9804L950K8032l900M3898n8253m6546L1150L2395l3501J1427O771p608
20714C7619J9710J3672k2302J9376J9128n8459l5352M3367N1507K202n7263j7907
20702A5298l2940L3659j766j191N349r591m4341j787l489L4662p072m9008k9733
20689i1950M6064M6854O217k3397K386j5261m7577K0392N5794o15l2394o602L7209
20676b880J02994O5887j2429n2766r7196o6848K2687N3177o291o626j4308K6790
$$ y = [22782, 6408, 12205, 83155, 65576, 60809, 33248, 18399, 33235, 30382, 33876, 48164, 20598, -49447, -59823, -48840, -39015, -53359, -50627, 2310, 17744, -26189, -9479, 20900, 71967, 120624, 131428, 128887, 131171, 142632, 91286, -9350, -40113, -6981, -25072, 8681, 29804, 33754, 61786, 57886, 101784, 43531, -3015, 28135, 60530, 27029, 38456, 45227, 37619, 57329, 71001, 48699, 68075, 87203, 28744, -6608, 36759, 88266, 90468, 33205, 15298, -17642, 16017, 14251, 13060, 18409, 8818, -35523, -37310, -40799, -6137, -13209, -62217, -91950, -45886, 968, 7185, -16212, -13826, -29087, -76664, -56272, -478, -1093, -33487, -40089, -2880, 100114, 166001, 153572, 100806, 3610, -63238, -40551, 12626, 6335, -291, -14599, 12191]
20664A2191J1546j0324L1302K3141K3043m4825j4930l2324J7636j3348j8864O899
20652h857N2984j771j0441K653J0188m9553K5820L0061r633m8778l6491L2483
20640a1335Q6142Q176k0863l5121j4139J9823L310j6098p4729L7280N4966P0984
20628A08396L732K800P8781k5407n8337k0330K1568o1726j7741N8225k5745l6070
20616B8146N912j346K1558p004R862J979j5211l9420r09J3262r155M216L6756
20603D8646O4475m1825j9378r2734J4038K8860j7554P1348P181l5742M7807k5741
20591D9381l8847k0475K9777J8381p290r779j9910j3966K347K9973l7223k5005
20579d2636K4216M0632J8350K046k3574J2756K1810L2860k3704j1188j4301n6776
$$ y = [12191, 23737, 13413, 44715, 67856, 90899, 46074, 31144, -1180, 16456, 3108, -15756, -8857, 44127, 42356, 31915, 34568, 44756, -4797, 21023, 51084, 41451, -7327, -43818, -11335, 74807, 82983, 62120, 26999, 12860, 32683, 35993, 19895, -54834, -17554, 37412, 108396, 112128, 114928, 193709, 168302, 109965, 89635, 111203, 49477, 31736, 89961, 64216, 28146, 34058, 32712, 54270, 47266, 57128, 59107, 43896, 4476, 3567, 16829, 7674, 11890, 48646, 113121, 71296, 51918, -40816, -26778, 2082, -15472, 55876, 63057, 27315, 75122, 49381, 10534, -9941, 19836, 38217, 30927, 21148, 1238, -12728, -10381, 19592, -17631, -42636, -18420, 22212, 40562, 42608, 19034, 31790, 53600, 86460, 62756, 51568, 37267, -19509]
20567a9509k427p002M7110L1855M1059M0813j1912l4233j6621l0676L8412n2863
20555B4006p1780M6556O4895k3046o6545L2912K7834Q3654o679l467l6200r2171
20543b0031k4975j3437j5133j4901Q2070Q8898l1188o9452j8807L3686K375l128
20531d023k1682M7451L4349m3329J7334k7772n646M2387K9064r850q559J129J1894
20518F2747k1787m8585j4218J8971R525P4631J5797m7391R958l8536O792j4151
20506A3753q433L6768j7231o860L3625j308k0623k4148q684J1121l515M3414N9895
20493A07774k643J1442P897k3312J6388p0302l0570K9258m3791N3308L1968k2903
20481F4514J0845J5364o4218r6022j4221Q0149J8993R3872k1572n1525m7231M6381
$$ y = [-19509, -21936, -28938, 18172, 50027, 91086, 131899, 119987, 85754, 69133, 38457, 76869, 24006, -47774, -1218, 63677, 40631, -25914, 6998, 34832, 118486, 111807, 108340, 72140, -20031, -45006, -58443, -73576, -88477, -6407, 82491, 51303, -18149, -36956, -3270, -895, -4023, -25705, 21746, 56095, 12766, 30100, 2328, -3318, 39069, 68133, 58283, 49724, 50853, 62747, 40960, -7625, -21843, -2872, 6653, 81284, 97081, 49690, 59648, 21112, 27904, 13753, 5320, 42088, 24857, 17997, 51622, 50314, 29691, 5543, -3141, 7980, 4465, 47879, 107774, 105131, 116573, 124470, 101158, 117546, 47244, 16674, 45932, 2141, 55449, 87417, 64514, 75359, 90723, 26505, -69517, -83738, -3589, 15404, 109276, 87704, 36179, -11052, 35329]
20469C5329j9597k098R92o567L3259J849l8752j4427K6652N6553j52k2908J785
20456E1918M4756n177m5331j7909K431j5975J2757r708m7259L2375n7292j5419
20444f9833R1859J428o2992J3205M8594j4961l0642P2095J0715j3219r1372P082
20432c8041N3780M9096N7353k8037k6975P085l8556j8092J4912K1443L5355J1125
20420A00448r057L1646L904m8577r340l4836l0991L1458M9170q624m7650l2026
20408d475k4841K973K1752M1832l6883r032q855O6500k9417N561K9609K9610k5288
20395E9046K0999L1788m0723N738K4287q311j1637l4819j06025K3405Q18O192
20383b9242P667J8759k6669L819J1111j3142n2592K5330J58545N0773l0740k4288
$$ y = [35329, 15732, 13634, 14626, 8059, 41318, 43167, 4415, -10012, 16640, 73193, 73041, 50133, 51918, 96674, 91497, 46166, 28257, 30688, 14713, 27470, 17762, -29497, 2878, -54414, -69833, 22026, 23454, -39538, -26333, 22261, 7300, -23342, 48753, 59468, 46249, -45123, -38041, 15739, 64835, 122188, 94151, 67176, 74261, 35705, 17613, 32525, 53968, 89323, 100448, 91391, 123037, 126941, 78364, 69024, 34188, 3197, 34655, 83825, 75201, 27551, -4475, -29316, -26343, -4591, 37241, 358, -8674, -17529, 48971, 19554, 25115, 54724, 84334, 59046, 80045, 111833, 71110, 76848, 101135, 92824, 81187, 46368, -59657, -36252, -35434, -29242, -21575, -2816, -29485, -25666, -14555, -27697, -80289, -54959, 103586, 154359, 123619, 99331]
20371I9331n3595p1290o70n821j5514j4056Q0700L9617J6929J3304m0337j9418
20359B9180l758j476m27n182J7622j6757l991o0836k0404k0090K2040L4964j7271
20346d6386L0082M7748R3857j5300k8611q273K8722J9106l5053p8256o077k219
20334f60L1664K8484m5633m6686m0328K7792l2277J9686P2496k247O963r045K6706
20321C6915N0813k8461L8440m0920n8173k9902K2374N6528k0104j8710m8879r350
20309d9429n261K0188L5973q145K0580K6181K9396o3484o1168M4561J2209L8897
20297D0498M2587M3767j3304r108K3869J5758n8540m8709l3648k4044J5125O5289
20285E9540K7114k7229p6463K4682L7274J3804k1461l5809k7923J3091j6608J789
$$ y = [99331, 45736, -25554, -26224, -32045, -47559, -61615, 19085, 58702, 75631, 88935, 48598, 29180, 25422, 23946, 23519, 18337, 35959, 19202, 15211, -45625, -66029, -86119, -64079, -29115, -46386, -16304, 31444, 125301, 110001, 81390, 73117, 101839, 120945, 85892, 7636, 1559, -660, 31004, 59488, 13855, -32831, -73159, -45367, -77644, -57958, 14538, 12291, 19254, 10209, 36915, 87728, 59267, 97707, 56787, -1386, -31288, -8914, 47614, 27510, 8800, -40079, -49429, -54690, -34502, 1471, -6674, 13906, 40087, 69483, 5999, -55169, -10608, 1601, 40498, 83085, 126852, 113548, 104440, 128309, 144067, 85527, 36818, 3170, -20874, -5749, 59540, 86654, 59425, -17038, 7644, 44918, 58722, 37261, 1452, -26471, -13380, -29988, -28199]
20273b8199J9612L8567N9005k234k1220p356N4029P372j8734m8846j4486L135
20261D0645n282L7837k120P708j191m5821k0952o688Q0415L6797q89j309k5308
20248I3842p1786j7754j5674L4030P6042o744K703l5937L7714R421N1998m8318
20236A09537m4608l1028K4327J4906J9716k487k44l3820L298m5127l5973q035
20224b9538N652M251J7373M1336K2625k419J2167j0224k5285l3867O106N4058
20212F2235l5011m2649j3241p158k0090M1678N6537k1561j7916K5528P215K0093
20200E5660L4205K4078J0827j2102j2386O7j7339k7108o633N5744j953j2330k6242
20187F4488l0773R937l4669J9649K7785J3161J6705l8750j6739M3228K2615K2474
$$ y = [-28199, -8587, 29980, 88985, 86751, 65531, 58175, 112204, 119576, 100842, 51996, 37510, 40645, 35363, 73200, 71080, 78788, 77597, 31776, 10824, 4136, 84551, 121348, 120459, 119150, 93842, 22056, 4302, -11372, 22658, 98700, 91956, 94659, 58722, 96436, 105857, 157855, 109537, 64929, 33901, 58228, 73134, 92850, 90363, 90119, 56299, 59597, 14470, -21503, -29538, -23886, -19635, -2262, 39074, 61699, 59280, 71447, 61223, 35938, 2071, 8177, 62235, 27224, -15425, -28666, -35824, -55914, -14236, 42301, 20740, 2824, 28352, 35567, 55660, 89865, 113943, 124770, 112668, 100282, 100349, 83010, 55902, 49269, 105013, 103060, 90730, 64488, 33715, 43652, 8983, 28632, 56417, 69578, 86283, 47533, 30794, 74022, 96637, 119111]
20175A19111M809l7212o9131L828M4625M1908M060j6974p1417m928K3556n684
20163C6551L5260Q795n710L9828N5186K1325J2401j411p9590m0531k0571K0240
20151H1773j7196k2469l7054R278M0072J3300O359K7621M1647M5328m7826l0919
20139A09914q948k0804M76o887K8102L095N1057J6745k7083n8586o2475n6410
20127c1804J9128O3648L5473k4163n4478k2382R261P2163L2981K3280K4694j8989
20115A28812m423O72q0128j3256q433K4721O5460K2714P365o691j7041O7911L257
20102A90940n7897j1933J2027k9012j6136k2389j4955J1794M844L5044L459j9310
20090H6476k1315K4644K9950K1180j5892o2869O442P0474M4905p3838n3007J9484
$$ y = [119111, 123920, 86708, 17577, 21405, 66030, 107938, 111998, 95024, 23607, 18679, 42235, 36551, 71811, 80606, 74896, 114724, 169910, 191235, 203636, 202225, 122635, 82104, 61533, 81773, 64577, 42108, 5054, 14332, 54404, 67704, 74063, 101684, 143331, 188659, 140833, 109914, 100966, 80162, 80638, 73751, 101853, 104948, 156005, 172750, 145667, 87081, 24606, -31804, -12676, 50972, 86445, 62282, 7804, -14578, -5317, 66846, 99827, 123107, 147801, 128812, 124389, 125061, 44933, 31677, 23244, 47965, 113425, 136139, 143504, 136813, 119772, 187683, 190940, 133043, 121110, 133137, 104125, 87989, 65600, 50645, 62439, 67283, 102327, 105786, 86476, 65161, 89805, 119755, 140935, 125043, 62174, 68616, 139090, 183995, 110157, 57150, 76634]
20078G6634N3333m698n3719n626N6298p741j3594l5256j0165j4526j8548K2894
20066D5286N7205o179l0097o4369M9369l438k2161L2137K819n100j0826j1907
20054C2739j2307P2582K176j7754m6142Q277M0424L638L289j8770J5289N3822
20042A37263p0530J781N0596l0016K1116o84k9045j3891M1833N2000J985j6942
20030A45466l4464m2541n221L3233N411j0469K0580K8379J5791J7990m8120j8366
20018A07669j8882m4098j4349j9858O8012J4024m1758j3925N243L0006M0615Q1
20006A12780K2549M5908l5976l1916j3435l7094O7196O8140M0674n1547p939k6239
19994A53101m6738n0278l672K5331k541k3150J0276J8942j8911J2201J8699k5276
$$ y = [76634, 129967, 125269, 71550, 65924, 122222, 114481, 100887, 65631, 55466, 40940, 22392, 45286, 102491, 96312, 66215, 1846, 51215, 47777, 25616, 57753, 60572, 55472, 44646, 32739, 20432, 93014, 95190, 77436, 31294, 39571, 79995, 83633, 86922, 68152, 83441, 137263, 66733, 68514, 119110, 89094, 110210, 109526, 80481, 66590, 108423, 160423, 162408, 145466, 111002, 68461, 63240, 96473, 101884, 91415, 111995, 140374, 156165, 174155, 126035, 107669, 88787, 44689, 30340, 10482, 78494, 92518, 50760, 36835, 42078, 72084, 112699, 112780, 135329, 181237, 145261, 113345, 99910, 62816, 130012, 198152, 238826, 187279, 179340, 153101, 106363, 56085, 52413, 77744, 75203, 52053, 62329, 81271, 62360, 74561, 93260, 67984]
19982F7984k5804J2795j8644j7371M823L2662L2510J1901r682l7191l3972N3887
19970G3898K4346K9408N052L478L9898j6227P659K0009k5828l2837M0591L6639
19958B06086L2838L3001Q8856R5307M2722R4009J05582J19293K18012K80499L38039
19947A654244M26335L03771J67792o1302k17399l13700l04522k72408j87377j41341
19937A054093j26003n2366p1773j8368l3917p882k6557o9352k8903k2942n411
19926E90619P668o1266O330j6586k8538m3893j9467K8991N8552M4700p4982p2982
19914D19146j1845O3822M5991n374q480k7003k5198Q271P908k3177J4634p350
19902D51345l2747n864o0859r5682j5606j4030l5714j9940j0084p048K7640L8651
$$ y = [67984, 42180, 54975, 36331, 18960, 23783, 56445, 88955, 100856, 91174, 53983, 20011, 73898, 98244, 127652, 132704, 136182, 176080, 159853, 167512, 187521, 161693, 128856, 169447, 206086, 238924, 271925, 360781, 456088, 498810, 592819, 698401, 817694, 1035706, 1316205, 1654244, 2080579, 2384350, 2552142, 2490840, 2273441, 1959741, 1655219, 1382811, 1195434, 1054093, 928090, 875724, 803951, 785583, 751666, 743784, 717227, 647875, 618972, 596030, 590619, 598287, 537021, 543351, 526765, 498227, 454334, 434867, 463858, 522410, 567110, 492128, 419146, 407301, 471123, 517114, 511740, 503260, 476257, 451059, 459330, 467238, 444061, 458695, 451345, 418598, 412734, 351875, 256193, 240587, 226557, 190843, 170903, 160819, 153771, 181411, 220062]
19890B20062M065K552L1596k0094k9405j044l1650l4954n076P85N6543o496o6169
19877A20715J6731Q433R044q329M128J0846J6972n5122m0538j2309K9455L2527
19865A32553M6653J0950j1831k9159m5042j3942K4333K5348K4074m0915m0451
19854H2571m6512L5418Q0843J9832K0504l1964j8824l485M416l7602l279k6613
19842G5305k735J0858K721k21J9410L7191K7268L3027P427l6120K9300N3151L3517
19829B90099j6165l5164J2129l7890q406j1862m4639N4592O5587r132l0185j599
19817B27365l9402j451K9984K2979O10j9913j0998m3388L1551L1514M561n3924
19805A79488q823J6787j0474m2844j2914J1972J6943L7793R963K2621M2306p918
$$ y = [220062, 224127, 226679, 258275, 238181, 208776, 207732, 176082, 141128, 136052, 136837, 193380, 186884, 120715, 137446, 145879, 154923, 146594, 150722, 161568, 178540, 123418, 82880, 70571, 100026, 132553, 179206, 190156, 178325, 149166, 104124, 90182, 114515, 139863, 163937, 123022, 82571, 36059, 71477, 152320, 172152, 192656, 160692, 141868, 138383, 142799, 105197, 101918, 75305, 72570, 83428, 86149, 85928, 105338, 142529, 169797, 202824, 210251, 174131, 203431, 256582, 290099, 273934, 238770, 250899, 213009, 204603, 192741, 148102, 202694, 268281, 259149, 228964, 227365, 187963, 186512, 216496, 239475, 240085, 220172, 209174, 165786, 197337, 228851, 233412, 179488, 170665, 187452, 176978, 134134, 121220, 133192, 150135, 187928, 197891, 220512, 262818, 254900]
19793B54900j2260k6251K4194M3405Q0919L6542k3660n708K9869o472M6013K3387
19781D64878J4074R23Q444P813m314P339J852l7142k9816J0330j8679K3179l7395
19768D11486p5918k3906j8092O290M6749L6315n9658n0632m381k0261k8225J403
19756B21170N262P1065K1673J2578J1632l0497k2191k4693J9813Q0301K440p0792
19744B97761n8953L6799R655k3839J6202J5542M079Q7336k803m0188k7886M0030
19732C53735K6553l7126j9116P894j8508m4314K1437j8333P332j6898k4160p549
19720B30947K9694n112L8735J3850k5660n1457k5677P6140M0150K4747m459J8665
19708C60563P237k2062M2553k5382j6385J6827k1074K0442m596p649J6179N3183
$$ y = [254900, 242640, 216389, 240583, 283988, 364907, 401449, 377789, 372081, 401950, 395478, 441491, 464878, 478952, 479875, 488319, 496132, 491818, 499157, 501009, 463867, 434051, 444381, 425702, 448881, 411486, 335568, 311662, 293570, 299860, 346609, 382924, 323266, 272634, 268253, 247992, 219767, 221170, 226432, 297497, 319170, 331748, 343380, 312883, 290692, 265999, 285812, 366113, 368553, 297761, 238808, 275607, 285262, 261423, 277625, 293167, 297246, 384582, 381779, 341591, 313705, 353735, 380288, 343162, 324046, 331940, 313432, 269118, 290555, 272222, 279554, 262656, 238496, 230947, 260641, 255529, 294264, 308114, 282454, 230997, 205320, 281460, 321610, 346357, 341898, 360563, 367800, 345738, 388291, 362909, 346524, 363351, 342277, 362719, 358123, 350474, 366653, 419836]
19696D19836M7395l5603j9726K2942K5557M7460M7046K4546q4853l8189k2462
19685D33949L3860M4567N3600M4867Q771o464l3578M2149Q5056J27305J92378
19674A026460J84229J79266L39221L98783M31539L38374J68664m7269k12838l03637
19664B502792l66363k77112k52030k05496j06328j26366o5452j1009n995p1139
19654A015502o8095m0248k2744j7181J6382l5409m9820q342J9547J9672J612j1842
19642H19034l308j8097k8693k5950M2524K8140o5804o5564J2482K8638K7358j2140
19630G38620J8013m6270q252m5877k8754Q845L0719L821K825k6353j9873J5673
19618F43137L7223J091m6168k8644K63k2100j5248o3696k4127M8185M6050K1567
$$ y = [419836, 467231, 431628, 411902, 434844, 460401, 507861, 554907, 579453, 494600, 456411, 433949, 467809, 512376, 565976, 610843, 619614, 613150, 579572, 621721, 706777, 834082, 1026460, 1210689, 1389955, 1729176, 2127959, 2559498, 2897872, 3066536, 3019267, 2806429, 2502792, 2136429, 1859317, 1607287, 1401791, 1295463, 1169097, 1103645, 1092636, 1086641, 1015502, 947407, 907159, 884415, 867234, 883616, 848207, 798387, 790045, 809592, 829264, 830876, 819034, 815726, 797629, 768936, 742986, 785510, 813650, 747846, 682282, 694764, 723402, 750760, 738620, 756633, 710363, 702111, 656234, 627480, 636325, 667044, 670865, 673690, 647337, 627464, 643137, 680360, 681451, 635283, 606639, 606902, 584802, 569554, 505858, 481731, 529916, 575966, 597533]
19606E97533J7342M5605k2440J7136k8481n3845J6679J5942J9963l5480o1080
19595E28874l5789j1004O1647N7069O0356N4416K8264Q140l688r2984l5796K7527
19583F47032j3350N0760P3409l5490P5728M6886K990M3374K9979L5916l1087m9255
19571H76892n0160n3413n3429l0818L0120L8623l2589m2397o0574m881o3443j6084
19559E37847P01m956K5725n521l7110O4912M8538k3467n1884o742K223K9486k9596
19546E50156N72J4652p74k8213l9233j0477p355M6417k2492Q359l443m415O2059
19533E65813Q061Q639M610N471l4725P862J3325J2346J8601L0916J6867P1324
19521G29110M2068R074M4874J29833J25598J89626L26852N15739P29706O80632
$$ y = [597533, 614875, 660480, 638040, 655176, 626695, 572850, 589529, 605471, 625434, 589954, 528874, 493085, 482081, 543728, 600797, 661153, 715569, 743833, 751973, 748285, 655301, 619505, 647032, 633682, 684442, 757851, 722361, 798089, 844975, 847965, 891339, 921318, 957234, 926147, 876892, 826732, 773319, 719890, 689072, 719192, 757815, 725226, 682829, 622255, 617374, 553931, 537847, 538548, 533592, 559317, 553796, 516686, 581598, 630136, 606669, 554785, 548043, 550266, 579752, 550156, 550728, 565380, 564606, 536393, 497160, 486683, 479328, 525745, 503253, 511612, 508169, 503754, 565813, 573874, 582513, 587123, 592594, 557869, 565731, 579056, 591402, 610003, 640919, 657786, 729110, 771178, 780252, 825126, 954959, 1080557, 1270183, 1597035, 2112774, 2842480, 3523112]
19511C523112J81431l87746o26840m67649l96570l10678j74494j24275q8400m5430
19501A082461o3875q8713m6375p3799l0922L4670J481l6914K373N4745M4448k1599
19489H57981K3465L7413j6575K2971L3382P3793N5483O5564P6472O6781Q4845
19478A381575N2891P5990L7242k3726q0905q8588j59775p0361l9382n1125l5430
19467I98406p9325k9548m9172m6433o2959k7966k811k9214n214J1756K7969o2552
19455F42937r0710K4008o3467l3787K0529N711l125j0621l7039q011M0086K7882
19443E14393k9154p757P027r905l7333K5016K4096j9737j9447j4320J753L3812
19431D68444O583j0134R9227R1430P4849J21956J06112J34794R5922O4033N4882
$$ y = [3523112, 3704543, 3316797, 2689957, 2222308, 1825738, 1515060, 1340566, 1216291, 1127891, 1082461, 1018586, 929873, 883498, 809699, 778777, 813447, 814928, 778014, 780387, 835132, 879580, 857981, 881446, 918859, 902284, 925255, 958637, 1032430, 1087913, 1153477, 1229949, 1296730, 1381575, 1434466, 1510456, 1547698, 1523972, 1443067, 1354479, 1194704, 1124343, 1084961, 1033836, 998406, 919081, 889533, 840361, 793928, 730969, 703003, 700192, 670978, 665764, 677520, 705489, 642937, 552227, 576235, 512768, 478981, 499510, 505221, 502096, 491475, 454436, 446425, 486511, 514393, 485239, 477482, 484509, 474604, 437271, 462287, 486383, 466646, 447199, 432879, 434632, 468444, 475027, 464893, 564120, 655550, 730399, 852355, 958467, 1093261, 1189183, 1253216, 1308098]
19420A308098m6972m8577K534n5940m2927K8725M4615M0099L2783J5450M6580
19409A324468J4718j02637j31607j24416o6385l4319m7473J7383J3634l1345J601
19398H33622l4308J307m2507L8753J7795n0148m9324J1349J816k2393K7831O787
19386G40580L0787K6104O0439N6849K2510n5713n3003K7565J296O6301R3115J38463
19374A155293P4039P1484J40634R2695N1468q1649j00277J8110L800K314Q3033
19363A510944Q5729R6300R6803L6387q1714r8430j6212N53O1871L0696K5106Q3750
19351A831783Q1493k0030p2468j56843k27619j82500j39271j02151o9845o6890
19341H75659m9079P23L3519p410K906j6076O6834P9305p3737m4766N5146l790
$$ y = [1308098, 1261126, 1212549, 1215083, 1159143, 1116216, 1144941, 1189556, 1229655, 1262438, 1277888, 1324468, 1339186, 1236549, 1104942, 980526, 914141, 879822, 832349, 849732, 863366, 832021, 833622, 799314, 800621, 758114, 796867, 814662, 764514, 715190, 726539, 728355, 705962, 733793, 740580, 771367, 797471, 857910, 914759, 937269, 881556, 828553, 856118, 857414, 923715, 1016830, 1155293, 1229332, 1300816, 1441450, 1534145, 1585613, 1503964, 1403687, 1421797, 1425597, 1427911, 1510944, 1596673, 1692973, 1789776, 1826163, 1744449, 1646019, 1629807, 1630360, 1692231, 1722927, 1748033, 1831783, 1913276, 1893246, 1820778, 1663935, 1436316, 1253816, 1114545, 1012394, 942549, 875659, 826580, 827303, 860822, 853412, 856318, 840242, 907076, 986381, 912644, 867878, 923024, 919234]
19329I19234k6385L9528O721P6537J00980J2359L3495N5709J6643N2439L2549
19318A319809P0956P1446O4780J20456J61946K20328J62142J45369J59291K03614
19308B700137J15294Q6936J90517J73857J63408J39343J86385J86600J39255M3787
19298D125519o4081j13649q7963l2666n4878j22784r3821k3279m019m927L2649
19287C556101N3962K6591j3691L0823L0731o09N1428J08652K6308j2210j5483
19276C842603L3540L8715P6872P7052Q6878J09866R6960Q5774Q4580J57369J48319
19265D838528J82104K75476L93200L99958L50151K45833J51490L7561j5631J936
19255F860606J01773J57579K59001M52825N64589O12567O46126N89212M80886
$$ y = [919234, 892849, 932377, 939098, 1015635, 1116615, 1128974, 1162469, 1218178, 1234821, 1287260, 1319809, 1390765, 1462211, 1526991, 1647447, 1809393, 2029721, 2191863, 2337232, 2496523, 2700137, 2815431, 2902367, 3092884, 3266741, 3430149, 3569492, 3755877, 3942477, 4081732, 4125519, 4061438, 3947789, 3859826, 3827160, 3772282, 3649498, 3555677, 3532398, 3528379, 3523452, 3556101, 3610063, 3636654, 3622963, 3653786, 3684517, 3683908, 3735336, 3843988, 3870296, 3858086, 3842603, 3876143, 3914858, 3991730, 4068782, 4155660, 4265526, 4362486, 4448260, 4532840, 4690209, 4838528, 5020632, 5296108, 5689308, 6089266, 6439417, 6685250, 6836740, 6874301, 6858670, 6860606, 6962379, 7119958, 7378959, 7831784, 8396373, 9008940, 9655066, 10244278, 10725164]
19246A0725164L32967J73163J55310L10316N37213O75985R03360J158227J520352
19237A6492057J993639K521137L101131L705286M487866N732056P640526J0259822
19229E5933520J3935194J8893509K5703023L5408690M8861942O3990227P3873886
19222C36599991O8738133M4314096O340099l1520650n6431434o2629953n4727354
19215B50682928m2208194l1001171k2843469j7112379j3090191j0208462q151302
19208A06067760o657862n607647m938608m414766m012883l563644l116539k620298
19200G1135513k201081j795068j440673j031280p50197o69392n65698n22915m34434
19191F1724775m10836n25853p93642j154027j379337j514115j501068j471568
$$ y = [10725164, 11058131, 11231294, 11386604, 11696920, 12234133, 12910118, 13813478, 14971705, 16492057, 18485696, 21006833, 24107964, 27813250, 32301116, 38033172, 45673698, 55933520, 69868714, 88762223, 114465246, 149873936, 198735878, 262726105, 336599991, 405338124, 449652220, 455992319, 424471669, 368040235, 305410282, 250682928, 208474734, 177473563, 154630094, 137517715, 124427524, 114219062, 106067760, 99409898, 93802251, 88863643, 84448877, 80435994, 76872350, 73755811, 71135513, 68934432, 67139364, 65698691, 64667411, 63917214, 63247822, 62682124, 62159209, 61724775, 61313939, 60788086, 59994444, 58840417, 57461080, 55946965, 54445897, 52974329]
19183E2974329j411870j544592j711450j873523j975320k100567k114787k149162
19175C8093058k046790j921254j786904j709454j655214j674909j588156j431186
19167B4279191j389024j274172j100876j005519r29586q05507q36385p37476o85240
19158A5515406o54008o87010o84954o23085m71192m17473n03985m34955m28473
19149A0610271m71327m68041l95676l84857l18054l33513k92345j95659j79233
19140G571566k30843k29129k08199k14362j56115j61072j66337j66887j46633
19131E891989r6996j16152n7807l0755K4961m3553n6053r7562j05160m459p2977
19120E235476j18849q5994n1503K0552N6329N1768J7884K4297K0947m0752L8465
$$ y = [52974329, 51562459, 50017867, 48306417, 46432894, 44457574, 42357007, 40242220, 38093058, 36046268, 34125014, 32338110, 30628656, 28973442, 27298533, 25710377, 24279191, 22890167, 21615995, 20515119, 19509600, 18580014, 17774507, 16938122, 16200646, 15515406, 14861398, 14174388, 13489434, 12866349, 12395157, 11977684, 11473699, 11038744, 10610271, 10138944, 9670903, 9275227, 8890370, 8572316, 8238803, 7946458, 7750799, 7571566, 7340723, 7111594, 6903395, 6689033, 6532918, 6371846, 6205509, 6038622, 5891989, 5794993, 5678841, 5621034, 5590279, 5615240, 5571687, 5515634, 5418072, 5312912, 5308453, 5235476, 5116627, 5030633, 4979130, 4999682, 5056011, 5107779, 5125663, 5149960, 5170907, 5130155, 5168620]
19109E168620M4868M3090J36892J51843J72334K88804L68222M49848M52559N21616
19099G798696N11869M25052J18471k09735m69946n92176n73565m90316l76050
19090F142300k22603j45779q5703J9846O0910J38577J38321K75861L89407M57647
19080G168784N19722M67571K98667J24712o1838m2585n7007r8978p1389m0612
19070H207047J7626J51390K35576K82805M16593N80386O39921O90462P87360J016246
19060A3025412J290335J632836K176323K741526L600346M836822O545750Q746752
19052D4596102J1789961J6067076K2185926L1051620M3927974O0300833P5222290
19045C05141782P9133187O3574663K9072535j3333633m8595199o5979403o4917392
$$ y = [5168620, 5213488, 5256578, 5393470, 5545313, 5717647, 6006451, 6374673, 6824521, 7277080, 7798696, 8310565, 8735617, 8854088, 8644353, 8174407, 7582231, 7008666, 6518350, 6142300, 5919697, 5773918, 5688215, 5708061, 5768971, 5907548, 6045869, 6321730, 6711137, 7168784, 7688506, 8156077, 8454744, 8579456, 8517618, 8475033, 8418026, 8319048, 8247659, 8207047, 8224673, 8376063, 8611639, 8894444, 9311037, 9891423, 10531344, 11221806, 12009166, 13025412, 14315747, 15948583, 18124906, 20866432, 24466778, 29303600, 35849350, 44596102, 56386063, 72453139, 94639065, 125690685, 169618659, 229919492, 305141782, 384274969, 447849632, 476922167, 463588534, 414993335, 349013932, 284096540]
19038B84096540n2971769l9157131k8073502k0486009j5403669j1906339r393241
19031A06704880p581958o265229n220203m498097l912347l343814k989010k732751
19023G0161471k304359j979205j734455j460919j240652q61496o22160l56531
19015E9601694J4579K50069L22265J65271k71666o87382j046751j205800j305792
19006E5836487j570376j871769k168514k411757k539515k479058k398045k263916
18998C8133537k094241j942507j746096j615735j533804j302942j174904j063309
18990B5659999r01623p45666o31855n99032o81474q07145j031623j159809j122975
18981A7978797j037312r14418q21583o97490o09527o16990n85670n03905m72258
$$ y = [284096540, 231124771, 191967640, 163894138, 143408129, 128004460, 116098121, 106704880, 99122922, 92857693, 87637490, 83139393, 79227046, 75883232, 72894222, 70161471, 67857112, 65877907, 64143452, 62682533, 61441881, 60580385, 59958225, 59601694, 59616273, 59866342, 60188607, 60353878, 60082212, 59394830, 58348079, 57142279, 55836487, 54266111, 52394342, 50225828, 47814071, 45274556, 42795498, 40397453, 38133537, 36039296, 34096789, 32350693, 30734958, 29201154, 27898212, 26723308, 25659999, 24758376, 24012710, 23380855, 22781823, 22100349, 21293204, 20261581, 19101772, 17978797, 16941485, 16027067, 15205484, 14507994, 13898467, 13281477, 12695807, 12191902, 11719644]
18972A1719644m91631m17758m31322m07837l64248l88239l15231k81002l14772
18963H307604k64640k20938k49529k05609k36439k12764j65776j90767j99278
18954F361864j65655j07947q9821j45960j34963j18472q7561k7008k5358l6098
18944E423021m9745M8021P8804J19620J07941J55336J25566R2056R5103M3427
18934F239150N7585J3977Q198J38496J53805K14064L67328M12152M04809M14928
18924H424492M82040N42138O14871P10789P07419Q64987J263033J795066K485875
18915A7890710L632115N203310P411328J0887158J5476509J9671975K0597534
18908A00770639J6638089Q412742j436536r541579j2942712j0872092n039729
$$ y = [11719644, 11228013, 10810255, 10378933, 9971096, 9606848, 9218609, 8903378, 8622376, 8307604, 8042964, 7822026, 7572497, 7366888, 7130449, 6917685, 6751909, 6561142, 6361864, 6196209, 6088262, 5998441, 5852481, 5717518, 5599046, 5511485, 5484477, 5459119, 5423021, 5373276, 5421297, 5500101, 5619721, 5727662, 5882998, 6008564, 6100620, 6195723, 6239150, 6296735, 6310712, 6318910, 6457406, 6611211, 6825275, 7192603, 7604755, 8009564, 8424492, 8906532, 9448670, 10063541, 10774330, 11481749, 12346736, 13609769, 15404835, 17890710, 21522825, 26726135, 34137463, 45024621, 60501130, 80173105, 100770639, 117408728, 125821470, 124384934, 114843355, 101900643, 91028551, 85988822]
18901H5988822K186931R567955J5258313J6670569J2440121L501149o953758j5316104
18893A23343998j8710651j7320595j3350896r533237o703667m908163l720478
18886D9096311k799596k177652j648535j346599j034567p56421n56690l95452
18878C8380799k18005j87381k03939k05897j22265l5388J35498L40113N23416
18869C8406951R30630J524743K154383K846959L883333N532550Q150938J2394306
18861G5824793J7904608K2840176K3794080J8933549R128576k451827j2235329
18854A53738626j6451667j3950939o920198J701834J0442732J7150271J8718642
18847A64429301J3681679L342965q752976j8627495k2874654k1229462j6619201
$$ y = [85988822, 88175753, 97743708, 113002021, 129672590, 142112711, 145613860, 138660102, 123343998, 104633347, 87312752, 73961856, 64428619, 57724952, 52816789, 49096311, 46296715, 44119063, 42470528, 41123929, 40089362, 39332941, 38776251, 38380799, 38162794, 37975413, 37771474, 37565577, 37443312, 37407924, 37543422, 37883535, 38406951, 39337581, 40862324, 43016707, 45863666, 49746999, 55279549, 63430487, 75824793, 93729401, 116569577, 140363657, 159297206, 168425782, 165973955, 153738626, 137286959, 123336020, 116415822, 118117656, 128560388, 145710659, 164429301, 178110980, 181453945, 172700969, 154073474, 131198820, 109969358, 93350157]
18840I3350157j2063704q707830o462298m942087l751051k887252k371357j926958
18832E0237620j586206j315814j091664r72036r69001r08172r05563r38667r43000
18823D0607497q83574p90407o14607m26812l68537m08049n41694p01900q86812
18814C4985105r33838r20865q92142r44421q79445q17871q42533p50353p62866
18805B7240771q52776r25588r44813r13022q00274m33746j48136J77581N22752
18796B2922749Q86477J369913K026617K994457M392150O445072R668214J4515421
18788F5221070K0230928K3566558K1036000J3340512L077718n637387r205364
18781A31630035m661748M927607J2688801J2920043O116450m192352j3933279
$$ y = [93350157, 81286453, 72578623, 66116325, 61174238, 57423187, 54535935, 52164578, 50237620, 48651414, 47335600, 46243936, 45271900, 44302899, 43394727, 42489164, 41550497, 40607497, 39723923, 38933516, 38318909, 37892097, 37523560, 37115511, 36573817, 35871917, 34985105, 34051267, 33130402, 32238260, 31293839, 30414394, 29596523, 28753990, 28003637, 27240771, 26387995, 25462407, 24517594, 23604572, 22804298, 22370552, 22222416, 22399997, 22922749, 23809226, 25179139, 27205756, 30200213, 34592363, 41037435, 50705649, 65221070, 85451998, 109018556, 130054556, 143395068, 146472786, 140835399, 131630035, 126968287, 131895894, 144584695, 157504738, 163621188, 159428836, 145495557]
18774A45495557k0502106k1136341j7018570j2221411q597738o123997m478896
18767E5416498l514653k958259k412272j938789j584887j283206j003478q28761
18759C9892193o94917o78480m76397k76516k16432k23943k65655l14099l34981
18750C6410773k48858L6653L29289O35931Q81306J140219J523468K158883L263289
18741D6130953M990632P491555J1342565J7014505K3379138K6566029K2732268
18734A59647645J3219600J314603q025329j0846979m415992O559702J4512826
18727A71966076J3713935N157197o982897j7909524k4369804k3879715j8846874
18720I8848394j3481324r561074o985179n321273m195097l365841k819796k529085
$$ y = [145495557, 124993451, 103857110, 86838540, 74617129, 66019391, 59895394, 55416498, 51901845, 48943586, 46531314, 44592525, 43007638, 41724432, 40720954, 39892193, 39197276, 38518796, 38042399, 37765883, 37549451, 37325508, 37059853, 36745754, 36410773, 36161915, 36198568, 36527857, 37163788, 38045094, 39185313, 40708781, 42867664, 46130953, 51121585, 58613140, 69955705, 86970210, 110349348, 136915377, 159647645, 172867245, 174181848, 166156519, 155309540, 150893548, 157453250, 171966076, 185680011, 190837208, 183854311, 165944787, 141574983, 117695268, 98848394, 85367070, 75805996, 68820817, 63499544, 59304447, 55938606, 53118810, 50589725]
18712E0589725k210439j859081j534122j246109j137759j080035r66303p61675
18704C9794202o04328n85483o34446p16303p42902q02890p72157o23466o06519
18695C3705708o99904q61123j080827j138741j170450j075547j104145j059746
18687B5515225j035471j025830j091508j038271j010005r27633q13609o91937
18679A7880961o23439m64878k81290j26089j24211j78071k94766m66316o58806
18670A4663095o76167o86211n96000m28273j66645K2901J68415J55598J7035j10376
18660A2363372k84586l76288l73985k47554j21574q9376j12835k35576l43163
18651A0178435m52091m16705k70266j07286l0748o3512j37936k78123m87812n33539
$$ y = [50589725, 48379286, 46520205, 44986083, 43739974, 42602215, 41522180, 40555877, 39794202, 39189874, 38604391, 37969945, 37253642, 36510740, 35707850, 34935693, 34312227, 33705708, 33005804, 32144681, 31063854, 29925113, 28754663, 27679116, 26574971, 25515225, 24479754, 23453924, 22362416, 21324145, 20314140, 19386507, 18572898, 17880961, 17257522, 16792644, 16511354, 16385265, 16261054, 16082983, 15788217, 15321901, 14663095, 13986928, 13300717, 12704717, 12276444, 12109799, 12132700, 12301115, 12456713, 12473748, 12363372, 12078786, 11702498, 11328513, 11080959, 10959385, 10870009, 10757174, 10521598, 10178435, 9726344, 9309639, 9039373, 8932087, 8901339, 8837827, 8699891, 8421768, 7933956, 7400417]
18641G400417n82690m68646l95163k69196k18346j65426j21532j12068m8936K2459
18631E040873J49203J87649L33037M03359M42921M98108M75282K84903k2145j85472
18621G607718l00474l49175k37077l0621K94256N53059N88555M82865L78842J37702
18611I125650k0266j98419k09745k26124o4298J32884K88669K57889Q2956j52417
18601I016779k95980k81505r7612J91791M48598M12293L71438M54570K96612M1466
18591A0558450j71582l75328o16711o55154l88468o0476J92475K46771J32858
18582H862835j41954m58004o89682p05443n40118l95630l06621k22916j70534
18573E231933j23275j06194p7194q4609n2407j4208l8194j0756N131O4073J9998
$$ y = [7400417, 6817727, 6349081, 5953918, 5684722, 5466376, 5300950, 5179418, 5067350, 5018414, 5040873, 5190076, 5377725, 5710762, 6114121, 6557042, 7055150, 7530432, 7815335, 7793190, 7607718, 7307244, 6958069, 6720992, 6690371, 6984627, 7537686, 8126241, 8609106, 8987948, 9125650, 9105384, 8906965, 8697220, 8471096, 8406798, 8539682, 8828351, 9086240, 9169196, 9016779, 8720799, 8439294, 8341682, 8533473, 8982071, 9394364, 9765802, 10220372, 10516984, 10558450, 10386868, 10011540, 9394829, 8739675, 8351207, 8290731, 8483206, 8729977, 8862835, 8720881, 8262877, 7573195, 6867752, 6327634, 5932004, 5625383, 5402467, 5231933, 5108658, 5002464, 4925270, 4840661, 4788254, 4774046, 4735852, 4725096, 4730227, 4794300, 4814298]
18562D814298J8534p169q1584m5243o334q0574q8502r459P2179J35299J11639
18551D833084R2019K3790J21323K28506L27315M93483N81077Q02186R91750R33128
18541I427661O49943K66567j22200k97131k22232Q7386M19892N50200M20526K3522
18531A1204134m01045p58697r11058q19630p05684o18749n14961m52546k80409
18522E741355k35960k07549k04107n3802n23K4891p4487j32652j23773o0334k3644
18511D649415q7062p2250l9372m1790m2535m6407j39N8086J3361k2728N3086R1997
18499D513662J59461K31490K71553L36176K94992L96719L70281L76064L49306
18490G299704L69601L82448K78189O2266j30783k62460k70399k69117k02913k69006
$$ y = [4814298, 4832832, 4825663, 4744079, 4698836, 4692502, 4611928, 4523426, 4513967, 4586146, 4721445, 4833084, 4925103, 4948893, 5070216, 5298722, 5626037, 6119520, 6700597, 7502783, 8494533, 9427661, 10077604, 10344171, 10221971, 9924840, 9702608, 9789994, 10209886, 10760086, 11180612, 11204134, 10803089, 10044392, 9133334, 8313704, 7608020, 6989271, 6474310, 6021764, 5741355, 5505395, 5297846, 5093739, 5039937, 5039414, 5064305, 4989818, 4857166, 4733393, 4673059, 4649415, 4562353, 4490103, 4450731, 4408941, 4366406, 4319999, 4319860, 4377946, 4391307, 4368579, 4421665, 4513662, 4673123, 4904613, 5176166, 5512342, 5807334, 6204053, 6574334, 6950398, 7299704, 7669305, 8051753, 8329942, 8392208, 8261425, 7998965, 7728566, 7459449, 7256536, 6987530]
18480F987530l07314l80049m20171m16721l92673l43087l26867k69174k23882
18471C907592j49001q3745p9167m2118j07454n4058n3935q9965m2398J0871o0737
18460C155885n7050M2531l4143n0757l133Q2615L1419j09243j47619j10637q5244
18449B714624o3587n1793K2445M7234j2586n809k2921k1238j3784n6932l5690
18438B499963M47p3239r5216q4049o3202m8886l5067q220o4695m8300n9308m2333
18426A877895j5111k7687P759O6882Q2466M9369J06454O9264P4129J66653K91758
18415B749831L95262M43997M45139L76783J51751k3318k94960l17925l51186k10689
18405C364685j55437j41301o6765R145N5578N3742M9265M4860M1241n24M7458
$$ y = [6987530, 6680216, 6300167, 5879996, 5463275, 5070602, 4727515, 4400648, 4131474, 3907592, 3758591, 3674846, 3595679, 3553561, 3446107, 3392049, 3338114, 3248149, 3205751, 3216622, 3155885, 3098835, 3141366, 3107223, 3056466, 3053333, 3135948, 3167367, 3058124, 2910505, 2799868, 2714624, 2651037, 2599244, 2621689, 2668923, 2656337, 2650528, 2627607, 2606369, 2592585, 2535653, 2499963, 2500410, 2427171, 2331955, 2247906, 2184704, 2135818, 2100751, 2092531, 2027836, 1979536, 1920228, 1877895, 1862784, 1835097, 1842856, 1909738, 1992204, 2041573, 2148027, 2217291, 2291420, 2458073, 2749831, 3145093, 3589090, 4034229, 4411012, 4562763, 4539445, 4244485, 3926560, 3575374, 3364685, 3209248, 3067947, 3001182, 3010327, 3065905, 3119647, 3168912, 3213772, 3255013, 3254489, 3301947]
18394C301947J25095P6433k724L2461O9278J66493K62050K38552K53591J36694
18384D659870N5979k4361M7366J06692J35353J61256J32379Q2107Q4274J52458
18374E593373L12074M26525N81607P59790J093503J529947K120274K842864L803892
18365A9063849N338201P886428J1667506J4989721J3913600O326325l310401q261469
18357F7613760o438712j295130M789423R849629J0485355L958798n995657j2551730
18349G0415736j2625393r523164o498029m587811l437303k640310j933905j354790
18341B7815031q28785o03440n90656m71629l18407j80877j15383n965k1794j18166
18331B4559929j10415k4728O308R7207J74023L26764N52959R59914J682462K500606
$$ y = [3301947, 3427042, 3503475, 3500751, 3533212, 3602490, 3768983, 4031033, 4269585, 4523176, 4659870, 4715849, 4691488, 4738854, 4845546, 4980899, 5142155, 5274534, 5356641, 5440915, 5593373, 5905447, 6331972, 6913579, 7673369, 8766872, 10296819, 12417093, 15259957, 19063849, 24402050, 32288478, 43955984, 58945705, 72859305, 79185630, 75875229, 67613760, 61175048, 59879918, 64669341, 74518970, 85004325, 88963123, 82967466, 70415736, 57790343, 48267179, 41769150, 37181339, 33744036, 31103726, 29169821, 27815031, 26986246, 26382806, 25792150, 25320521, 25002114, 24821237, 24705854, 24699889, 24678095, 24559929, 24449514, 24424786, 24431094, 24528301, 24702324, 25029088, 25582047, 26541961, 28224423, 30725029]
18321C0725029L415290M477963O176654R039306J3563287J9603530K4390207K2706110
18313A34097376J3964176M442299r63731l428505l857038L9590O932550R875190
18305A61101907N163152k641555q104221j2032688j6215002j8100993j5884111
18298I3286489j1987696q747909o577197n054974l950765l039915k200803j630391
18290E0096839j391651j417792j477384j490534j408756j044487o82483n08193
18282D0675559m52900m55241n11856n87091m85861l10461j03402J00472K39912
18273C8109131N49978J039289J684678K514876L688217N874258R450047J4057996
18265G6968470J7050924J3334246K735217p661121j0994233p323510p98065O115482
$$ y = [30725029, 34140319, 38618282, 44794936, 53834242, 67397529, 87001059, 111391266, 134097376, 148061552, 152503851, 151540120, 148111615, 144254577, 144294167, 151226717, 161101907, 166265059, 163623504, 155519283, 143486595, 127271593, 109170600, 93286489, 81298793, 72550884, 65973687, 60918713, 56967948, 53928033, 51727230, 50096839, 48705188, 47287396, 45810012, 44319478, 42910722, 41866235, 41183752, 40675559, 40222659, 39767418, 39255562, 38668471, 38182610, 37872149, 37768747, 37869219, 38109131, 38659109, 39698398, 41383076, 43897952, 47586169, 53460427, 62910474, 76968470, 94019394, 107353640, 110088857, 102427736, 91433503, 84109993, 83311928, 89427410]
18257H9427410J0917673R747324J101046r355241j4646064j3300981r574694o490672
18249E7825801m825913m003609l499884k974081k506575k000545j616335j265334
18241C5133525j228818j281613j337929j326201j193072j134674j023130p76448
18233B5831640n97210n21856n66549o32293o71220o67397n63657m01640l43948
18224B0865870n33689p18797p53043p03954o90550o34970m78922m07435m14844
18215A5529666m27073l73704k54949p1894J57005K43379K96881J83695N2502j28608
18205A5206900j50694j17857k8027M372o6585k03282l67163m91449o71549o84528
18195A2430138o42048o27613o08289n85704n47067n31880n42885m71492l88782
$$ y = [89427410, 100345083, 110092407, 111193453, 101838212, 87192148, 73891167, 64316473, 57825801, 52999888, 48996279, 45496395, 42522314, 40015739, 38015194, 36398859, 35133525, 33904707, 32623094, 31285165, 29958964, 28765892, 27631218, 26608088, 25831640, 25234430, 24712574, 24146025, 23513732, 22842512, 22175115, 21611458, 21209818, 20865870, 20332181, 19613384, 18860341, 18156387, 17465837, 16830867, 16351945, 15944510, 15529666, 15102593, 14728889, 14473940, 14402046, 14559051, 14802430, 15099311, 15283006, 15335508, 15206900, 15056206, 14938349, 14910322, 14914694, 14848109, 14644827, 14277664, 13786215, 13114666, 12430138, 11788090, 11160477, 10552188, 9966484, 9419417, 8887537, 8344652, 7873160, 7484378]
18186G484378l45237l22440k46931k24894k11429j60391j44711j14413j13296
18177E600636q5246j17845j59643j74990k54289j11702n9855n0941n8112j341
18167D526672O3151M8312J23501J52103J90714K79436L01354J51739k3931j24256
18157E688795j91387j82418o9425P2603M7689P2439P0413r4976k20035l01831
18147D891867k52812j25126o5170o0313q2394j04664p587k333M4722m4193q3964
18136D108033j08392j23917j9903J7601P7853Q8611J6143O2375O4655K6134l9093
18125D170100O7296R7159Q5017J38513K57075L79303M79764O51891R15017J266317
18115H507452J682533K336413L346993N061202Q116824J1919560J3122861P249768
$$ y = [7484378, 7139141, 6816701, 6569770, 6344876, 6133447, 5973056, 5828345, 5713932, 5600636, 5515390, 5397545, 5237902, 5062912, 4808623, 4696921, 4637066, 4586125, 4528013, 4526672, 4589823, 4638135, 4761636, 4913739, 5104453, 5383889, 5685243, 5836982, 5813051, 5688795, 5497408, 5314990, 5245565, 5318168, 5365857, 5438296, 5508709, 5413733, 5193698, 4891867, 4639055, 4513929, 4448759, 4388446, 4306052, 4201388, 4193801, 4191468, 4236190, 4191997, 4108033, 3999641, 3875724, 3855821, 3873422, 3951275, 4039886, 4056029, 4118404, 4183059, 4209193, 4170100, 4237396, 4334555, 4419572, 4558085, 4815160, 5194463, 5674227, 6326118, 7241135, 8507452, 10189985, 12526398, 15873391, 20934593, 29051417, 40970977, 54093838, 61343606]
18107F1343606l126386j0840965j1144282q174017n317931l453642k415155j725337
18099A5145891j278725r44869p79479o04606n76968m12366l28976k93708k82144
18090I644050k34030j71053q3604j08502l7102R3580Q2606M8979L6584O2077N8905
18079I392490Q1218J96247L07789K00960J44178K44645K57590K38340J83721O0924
18069A1308102j58970k62282k73736k01059j01681Q5844K20688K56776K96517
18060A1170199M46468N77355O15030R06967J425303K077103K936745M048286N855733
18051C0059189Q632258J2792476J7214129J7843995J0786444j562995j1154769
18044H4610727j2845799r113562m307355J41673M733837J0029451J4988124J5576008
$$ y = [61343606, 58217220, 47376255, 36231973, 28057956, 22740025, 19286383, 16871228, 15145891, 13867166, 12922297, 12142818, 11538212, 10961244, 10548878, 10219902, 9926194, 9644050, 9410020, 9238967, 9155363, 9046861, 9009759, 9103339, 9185945, 9234924, 9271508, 9333585, 9392490, 9473708, 9669955, 9977744, 10178704, 10322882, 10567527, 10825117, 11063457, 11247178, 11308102, 11149132, 10886850, 10613114, 10412055, 10310374, 10396218, 10616906, 10873682, 11170199, 11616667, 12194022, 12809052, 13716019, 15141322, 17218425, 20155170, 24203456, 30059189, 38691447, 51483923, 68698052, 86542047, 97328491, 95765496, 84610727, 71764928, 62651366, 58344011, 58485684, 63219521, 73248972, 88237096, 103813104]
18036A03813104Q126622m574871j4297660j6241592j3169679r255462o342392
18029D8058070m390885k943203k038410j303513p34771m41014l88213o34400q31554
18020C4352107j002038j017748p88226m82574j89093n4643J823K36621M02227
18011C1458456O37035R74237J480089J997210K743193L973625N730049Q463026
18003E7456920J2514618J6646413J7492093J3259465P553822N309621N207067
17996A35440019J536766n532299r807605p135636J95069P422660J0260574P516396
17988A39895944L217578J743224J189101l845785j2349826j7918429j7329308
17981I4602499j3363867r394058o604259m681000l411416k577460k085288j838827
$$ y = [103813104, 111939726, 107364855, 93067195, 76825603, 63655924, 54400462, 48058070, 43667185, 40723982, 38685572, 37382059, 36647288, 36206274, 35818061, 35183661, 34352107, 33350069, 32332321, 31544095, 31061521, 30872428, 30817785, 30819608, 31056229, 31458456, 32095491, 33069728, 34549817, 36547027, 39290220, 43263845, 48993894, 57456920, 69971538, 86617951, 104110044, 117369509, 124923331, 130232952, 135440019, 136976785, 131444486, 121636881, 114501245, 114696314, 122118974, 132379548, 139895944, 143113522, 144856746, 146045847, 142200062, 129850236, 111931807, 94602499, 81238632, 71844574, 65240315, 60559315, 57147899, 54570439, 52485151, 50646324]
17973E0646324j745762j729105j700925j548423j338768j125507r47023p42378
17965C9768433n39323m60639m64580l96838l07865j94684J82490N47133J004781
17956C9138908J615084K409830L630059N636329Q556353J1092204R840990L334314
17948H5254071m937831r520549q962578n913455k651001K84074L447561P001708
17940F4002000R447478P734071J003910p117461j1312955j0623484p974888n575905
17932C9582766l944644k886020k186058j668792j363583j072885j054815j151951
17924B4254018j133573j026367r85050q41810o06790n42559m79478n00022m69941
17915A7668428m53952m45754l35424l97832m15070m43278m49374l87807m50660
$$ y = [50646324, 48900562, 47171457, 45470532, 43922109, 42583341, 41457834, 40510811, 39768433, 39229110, 38768471, 38303891, 37907053, 37599188, 37404504, 37586994, 38134127, 39138908, 40753992, 43163822, 46793881, 52430210, 60986563, 72078767, 81919757, 85254071, 80316240, 70795691, 61833113, 55919658, 53268657, 53552731, 57000292, 64002000, 73449478, 81183549, 82187459, 75069998, 63757043, 53133559, 45158671, 39582766, 35638122, 32752102, 30566044, 28897252, 27533669, 26460784, 25405969, 24254018, 23120445, 22094078, 21109028, 20267218, 19660428, 19117869, 18638391, 18138369, 17668428, 17214476, 16768722, 16433298, 16035466, 15620396, 15177118, 14727744, 14339937, 13889277]
17906A3889277m71668m76143n29555m95761m56721m13929m64051n15926m99957
17897I565566n37115n03815m48866l86372m22975l49984l62653l21903k30035
17888F001848k49390k81296k50689k38285j86654j13025j44230j69833j31602
17879D236844r8533j02422p7529o8120j29899j54915r6926o7382m0833q8451o6337
17868C245497j19126j18329o7110j1445j7371l3503n0829p152m4826k5693o5956
17857B684157r6557r8996o4391n5109j02033j34060r8576j2993r134j6288m3651
17846A952369l9382o8734n8433n3038P167P4422N5497L9961l2667q0327j01346
17835A695489j2874K5531j0694K891J22880L4653L9159l4883m6007o2059m7897
$$ y = [13889277, 13417609, 12941466, 12411911, 11916150, 11459429, 11045500, 10581449, 10065523, 9565566, 9028451, 8524636, 8075770, 7689398, 7266423, 6916439, 6553786, 6231883, 6001848, 5752458, 5471162, 5220473, 4982188, 4795534, 4682509, 4538279, 4368446, 4236844, 4138311, 4035889, 3958360, 3890240, 3760341, 3605426, 3508500, 3441118, 3400285, 3311834, 3245497, 3126371, 3008042, 2940932, 2929487, 2912116, 2878613, 2827784, 2820632, 2775806, 2750113, 2684157, 2587600, 2488604, 2424213, 2369104, 2267071, 2133011, 2034435, 2021442, 2012308, 1996020, 1952369, 1912987, 1844253, 1785820, 1732782, 1739949, 1814371, 1869868, 1909829, 1877162, 1796835, 1695489, 1682615, 1708146, 1697452, 1700343, 1823223, 1857876, 1897035, 1862152, 1816145, 1754086, 1706189]
17824A706189q7395n1447k7977j2886N9282J85j5411N3372N155K2674M4417j9646
17812A676512l508j8700j7205N4931M3969o036K4574n10m3863l3020l0134l8472
17800A608538l9845p2766k4109m4117m5685q876M7694R5857Q6011O4062R3367
17789A760131N2277q7388j08212n4320O14J6819K663L9776K7648n8964j76177
17778A414867j21800o5584j03391m9917J9978J8389q7522o2321l7401l3494m5592
17767H46212l7786m1887j09429k2514M9369O6723n4305m4106l7196R759q950l4337
17755E81553o1538l5326O7835j264m1581o5769N3688M7658j5403Q251P0235P8917
17743F87256M351O2723J7781p5540o7395k6005j010Q651j0186o979N1252q75l1240
$$ y = [1706189, 1618794, 1567347, 1539370, 1526484, 1585766, 1585951, 1570540, 1623912, 1629067, 1651741, 1696158, 1676512, 1673004, 1654304, 1637099, 1692030, 1735999, 1729963, 1754537, 1754027, 1710164, 1677144, 1647010, 1608538, 1568693, 1495927, 1471818, 1427701, 1382016, 1373140, 1420834, 1516691, 1602702, 1666764, 1760131, 1812408, 1725020, 1616808, 1562488, 1563102, 1579921, 1582584, 1622360, 1650008, 1591044, 1414867, 1293067, 1227483, 1124092, 1074175, 1094153, 1112542, 1025020, 962699, 925298, 891804, 846212, 808426, 766539, 657110, 634596, 683965, 750688, 696383, 652277, 615081, 624840, 615890, 581553, 520015, 484689, 552524, 551260, 509679, 443910, 497598, 545256, 529853, 538104, 608339, 687256, 691607, 754330, 772111, 696571, 629176, 603171, 602161, 610812, 600626, 593647, 644899, 644024, 612784]
17730F12784l3195n9789r1018n8013r0677p5496j4914M3187k5978k2045O458R1243
17718B82547J9604l7478m8863M377M3965j251n684o8918m7282j1236l255J9231
17706A45757M4988o012o2595j0165K8906K1459N7112K6650o9816o6774l0593O0401
17694A39318L1845n0626n9852l0193K2531K4310O3561J9569l2147j4584N1650
17683A65382K3230k9276N408K031J1837L3147j0386J6957n3334m2572l9913l8350
17671D4161L69n508j4703J5874K5162K8870J3123j28n2599J951J0346l6459J0908
17658D1367K0667k6794M9118l617j385k1732N897k2517j545L9408J5171l0113
17646F3925l2835K1519K1861k275l6573k7890M5098K4807R839L1229l5340m9718
$$ y = [612784, 579589, 519800, 428782, 370769, 280092, 204596, 189682, 232869, 206891, 184846, 191304, 282547, 302151, 264673, 215810, 220187, 264152, 262901, 257217, 188299, 141017, 129781, 126526, 145757, 190745, 184733, 122138, 111973, 140879, 162338, 219450, 246100, 176284, 109510, 78917, 139318, 171163, 120537, 60685, 30492, 53023, 77333, 140894, 160463, 128316, 113732, 165382, 188612, 159336, 164744, 166775, 178612, 211759, 201373, 218330, 164996, 122424, 82511, 44161, 44530, 39022, 24319, 40193, 65355, 94225, 107348, 107220, 54621, 56572, 66918, 30459, 41367, 62034, 35240, 84358, 80741, 79356, 57624, 63521, 41004, 39459, 78867, 94038, 63925, 31090, 52609, 74470, 72195, 35622, 7732, 52830, 77637, 87476, 118705, 83365, 33647]
17634C3647k4681p386J323J6222J2541K6768l6804j3743M0001R62q094L927N8985
17621A03668J8743K8409n6519n2315m8664k1111l7289l5039K2099M6448l0149
17610f1719m1033M954L0862k932l6181P6575M5373m2321m3080j2177J6057L9589
17598b6033J3188j2517L920P773L6643n7423l0916K728K5831j5139k5478L6430
17586d0993j2792l2592J0752N641J9774P780K444j3279M5431J3098n330K3056
17574B2990k514j6480j0801j4029n8583n924M9669M2971L6308j0359m6993l7341
17562e1086j2243K2559J5802j8011k9085l8928J0589n855n2333k153K6280K5900
17550a08564N9490K3925l8023m3773P554O2224K7692k39J7789K1862M0231j1026
$$ y = [33647, 8966, 1580, 2903, 19125, 31666, 58434, 21630, 7887, 47888, 48850, 40756, 44683, 103668, 122411, 150820, 94301, 41986, -6678, -27789, -65078, -100117, -78018, -31570, -61719, -102752, -97798, -66936, -69868, -106049, -29474, 15899, -26422, -69502, -81679, -65622, -26033, -12845, -25362, -21442, -13669, 22974, -34449, -65365, -62637, -36806, -51945, -77423, -40993, -53785, -86377, -75625, -69984, -50210, -42430, -39986, -53265, -7834, 5264, -66, 22990, 20476, 3996, -6805, -20834, -79417, -85341, -35672, 7299, 43607, 33248, -13745, -51086, -63329, -40770, -24968, -42979, -72064, -110992, -100403, -106258, -158591, -160744, -134464, -108564, -49074, -25149, -63172, -106945, -99391, -37167, -9475, -9714, 8075, 29937, 70168, 59142]
17538E9142j1000n2232m4679P6731M1752L3948j3569P6805J32879R0135J3038
17527D02950p2609o4296k5576m9776l1996M2888K1659N9327J08220M6079k1210
17516D15660m9854q4735l827q360l4524o0828l4609n1715q2803l4101N5302N1560
17504G7166L4162J9328l3490k4312k8509o5582L026N9073O3289L403j0794L399
17492A00159K9403K4802J7791L7954j3454J6794N047M7701Q6283N6595M1217N1863
17480E02155J0595J2798M2889L7727K1364k2722l6263K0397P3726P3290K511r007
17468G29460k1614j6191n9279p4993n6182o6858r7459l4809m9158l6159l1901
17457A84857n61k5390j7171J881k026k2125K7301k7178k1000k0040M4241N1784
$$ y = [59142, 48142, -4090, -48769, 27962, 69714, 103662, 90093, 166898, 299777, 389912, 402950, 330341, 266045, 240469, 190693, 158697, 201585, 223244, 282571, 390791, 436870, 415660, 365806, 281071, 277244, 268884, 234360, 173532, 138923, 87208, 4405, -29696, 25606, 77166, 111328, 130656, 97166, 72854, 44345, -21237, -18211, 40862, 104151, 107554, 96760, 100159, 129562, 154364, 172155, 210109, 196655, 213449, 218496, 266197, 352480, 409075, 450292, 502155, 512750, 525548, 568437, 606164, 627528, 604806, 568543, 588940, 662666, 735956, 738467, 729460, 707846, 691655, 632376, 557383, 501201, 434343, 336884, 302075, 252917, 216758, 184857, 184296, 158906, 141735, 143616, 141590, 119465, 146766, 119588, 98588, 78548, 122789, 174573]
17445A74573M9912O4351Q1305N7408N736k0738m1854l0545l579k8459M1926q670
17433C41366n7507M973J02262N0392o983o4623o3032j7787M6779J1790n045M3567
17421C86152O9531M3559l7771j33987q0228K9652l2754k8366l673n1464p5055
17410H5596Q253O1650k2160m0328J6790l0091j5176o993L5626k4883o438K9837
17398I1683k3499l5188N3178K4917l3419l4968P837O800j1143J4650J113n914
17386E6047L114n310K8392j8470j9149j8756o0655j6236k0321K1738Q360M730
17374c6516K7740q9172l0894M7880P4777m5548n587j6772o0890n503n6576M284
17362a92777J1967N5513J7546n4409k5841M2229K1208O501n536q727N5021Q722
$$ y = [174573, 224485, 288836, 370141, 427549, 433285, 412547, 370693, 340148, 336569, 308110, 350036, 341366, 283859, 288832, 391094, 441486, 434503, 369880, 306848, 289061, 335840, 347630, 342585, 386152, 455683, 499242, 461471, 327484, 247256, 276908, 244154, 215788, 212115, 160651, 85596, 93849, 155499, 133339, 93011, 109801, 79710, 64534, 57541, 93167, 68284, 61846, 91683, 68184, 32996, 86174, 111091, 77672, 42704, 50541, 57341, 46198, 60848, 61961, 56047, 59161, 53851, 82243, 63773, 44624, 25868, -34787, -51023, -71344, -49606, -41246, -36516, -8776, -97948, -128842, -80962, -6185, -51733, -57320, -74092, -134982, -140485, -197061, -192777, -180810, -125297, -107751, -162160, -188001, -145772, -124564, -118063, -123599, -132326, -77305, -68583]
17350f8583m9258n2542N6885K5452k3003J6622N723j0288m571J2566J7691l68
17338g3674J2470M641r2636l0849M5196K1558l0125l8827j0816L2685M9758O2711
17326d7908K9765j5590M0835K4507J8423k7594m1610q906j747o1863q5161K8929
17314a47920M2387p441L6184O8451K3615o2178n3028j436k1372K12L458k3891
17302a42959m3921N4296j2163M2240j3728k7717J5422J9524L28J6310K5609N2921
17290a3838j288j3923k3954l4058k4076j4303m5110n6741O2636O2776k5165p780
17278a34824L6283m256K0092O6986k3635k9035O963l1183l4566L4881L5367K7502
17266b9425L3131j4251j998K5332k9543l2159l053n429K6449O8220n856q0335
$$ y = [-68583, -117841, -170383, -113498, -88046, -111049, -94427, -88704, -98992, -103563, -90997, -73306, -73674, -61204, -56563, -149199, -180048, -134852, -113294, -143419, -182246, -193062, -160377, -110619, -47908, -18143, -33733, 7102, 31609, 50032, 22438, -19172, -28078, -29825, -91688, -176849, -147920, -105533, -112974, -76790, -8339, 15276, -46902, -99930, -101366, -122738, -122526, -119068, -142959, -186880, -132584, -144747, -102507, -116235, -143952, -128530, -109006, -108678, -92368, -66759, -13838, -15126, -29049, -53003, -87061, -111137, -125440, -170550, -227291, -164655, -101879, -127044, -134824, -98541, -102797, -82705, -15719, -39354, -68389, -61426, -92609, -127175, -92294, -56927, -29425, 3706, -10545, -12543, 12789, -16754, -48913, -51966, -57395, -30946, 37274, 31418, -48917]
17254d8917n1843M2965P0459L5320r0649m6917R616j54K5834J8375n8816m2322
17242a37049q915j8570J5225K9831N1591N6126J8050k135o194n1956j0647k7099
17230i1742o5067J7405l36M2505L5919j5675J7075M2198O981M069K5302K9144
17218D7778J5074N669m4661n1866k4374j457j2968J2828r841l554l67k253K6811
17205d3181j6113n595J7298N4562j0929N622p2722m2710O649J2925K0788l7789
17193a11195j3851P0053N4051k0089m2701k1904N809m018j9593m120J6840n2994
17181a43712p534j5982l6475q988j8555Q318J5752N4543l743L8635O2421M1366
17169a3954K692k3748m2152k8099L0638N4716M0144J612R585l1377o9418o7840
$$ y = [-48917, -100760, -57795, 12664, 47984, -42665, -89582, -79966, -80120, -54286, -35911, -94727, -137049, -145964, -164534, -149309, -119478, -67887, -11761, 6289, 4154, -2040, -53996, -64643, -91742, -156809, -139404, -139740, -97235, -61316, -76991, -59916, -17718, -10737, -6668, 18634, 47778, 62852, 68521, 23860, -28006, -52380, -53837, -66805, -53977, -63818, -67372, -67739, -69992, -43181, -59294, -64889, -47591, 6971, -3958, 1664, -71058, -113768, -107119, -94194, -73406, -111195, -125046, -54993, -942, -21031, -63732, -85636, -79827, -83845, -103438, -107558, -90718, -143712, -151246, -167228, -203703, -212691, -231246, -222928, -207176, -152633, -156376, -117741, -55320, -13954, -11262, -35010, -77162, -105261, -74623, -19907, 20237, 21849, 31434, 57, -69361, -137201]
17157a37201k041L8639K8058m915N0383J2685k4709j3579M7487j3586j1974o737
17145c7490P855k3503k0581k0632p272R341n9645Q087J2882K4574K7062L7588
17133d1734j1208k2731L9971L7900J1574k103n4794L9147J9172l1792J0883J6169
17121A0454m8534K7733p729o379l3947l0385J7419O962j3777j1808j7346O84n118
17108a11771j6275q87j0952j6788M0413L5883J9787K1049n992m7000n2369j2542
17096a57444L9449k7483j347K2105m5959m1071J5151P2235K7430k706o364K9996
17084g6008M4206j9390k9311l5444J3645r045J2195M7908Q034k8274R278l973
17072f6179p546j8061P022L3744K3448J823l5302n0615J774j0547m703K5129K0083
$$ y = [-137201, -139242, -100603, -72545, -77460, -27077, -14392, -39101, -52680, -5193, -18779, -30753, -37490, -29635, -53138, -73719, -94351, -101623, -92282, -151927, -143840, -130958, -106384, -79322, -41734, -52942, -75673, -35702, 2198, 13772, 11669, -43125, -3978, 15194, -16598, -5715, 10454, -38080, -10347, -18076, -24455, -58402, -88787, -71368, -64406, -78183, -89991, -107337, -106653, -111771, -128046, -128933, -139885, -156673, -116260, -80377, -60590, -39541, -45533, -92533, -144902, -157444, -117995, -145478, -146825, -124720, -170679, -211750, -196599, -124364, -96934, -99640, -106004, -76008, -31802, -51192, -80503, -115947, -102302, -111347, -99152, -51244, -43210, -71484, -62206, -66179, -73725, -91786, -84764, -51020, -27572, -25749, -61051, -111666, -109892, -120439, -125142, -100013, -79930]
17059g9930r11J4311l2327l4615j0024N350m9335Q258m9933M454J2389N6225R3806
17046f2282M7086l7807n0411n4730J2036L9984K9393j0564J8920j0271m8568J4973
17034a12241L3347J2786J685l972K2984n9570p0056N343j1278r670J2931l496
17022a81207J7214k3865L3416K387j5264p397R013M1798J6938P815J0381r814
17010i8585j1714J4262J43j7775k685l0612K2021L8452L532K7435o938l002m627
16997g0093J7422k0264K0191J8438p329L513l7117k4405q625k9109l2451K3029
16985a46800L3746Q4100j1102m1817j1535J8265L9089K6746k8191m9567m8266
16974a35332m8587J0082N6040L5204J9513M001k0176m3139N2714q493l2327J7469
$$ y = [-79930, -80841, -66530, -98857, -133472, -143496, -138146, -187481, -179223, -229156, -224702, -212313, -156088, -62282, -15196, -53003, -103414, -158144, -146108, -106124, -76731, -87295, -68375, -78646, -127214, -112241, -78894, -66108, -64423, -68395, -45411, -104981, -175037, -169694, -180972, -190642, -177711, -181207, -163993, -187858, -154442, -152055, -167319, -174716, -165703, -123905, -106967, -99152, -88771, -98585, -110299, -96037, -95894, -113669, -116354, -146966, -124945, -86493, -82961, -55526, -62464, -65466, -70093, -52671, -72935, -52744, -34306, -41635, -38122, -75239, -99644, -108269, -137378, -169829, -146800, -113054, -28954, -40056, -81873, -93408, -75143, -36054, -9308, -37499, -87066, -135332, -183919, -173837, -117797, -82593, -63080, -59079, -79255, -122394, -69680, -78173, -110500, -93031]
16962i3031K2908k9348Q691m853r193J441P8478J7730l8760j1385p3277J2738
16950a17861K2594M546O8139k1776r3232r367K8160J1589k6222k4061J5044K5334
16938a17113K4489m3040M473j0745m1542L7080M1077J510M9965k0834l0938J547
16926a04071p404Q701J4201j9051J331J0387r42R81J3129n4262q414L5007M3410
16913f6997k4394K6503q330m7524J1731l538L6253N1156P465J8989J6373l9768
16901b2081K4187k2849R119K7347n0275q642l7277p778P8649M7432k7334j4303
16889c805p403K0032p2614q941q040k404q446k0985n2243K1383Q2160K6480L8585
16876C759m5735q3997L2591n3573J1893M2322J8856J2899M3120Q685Q656j8538
$$ y = [-93031, -70123, -99471, -90780, -95633, -104826, -103385, -24907, -7177, -45937, -57322, -130599, -117861, -95267, -90721, -22582, -44358, -137590, -146957, -118797, -107208, -133430, -157491, -142447, -117113, -92624, -135664, -131191, -141936, -183478, -146398, -105321, -103811, -53846, -74680, -105618, -104071, -111475, -102774, -88573, -107624, -106293, -95906, -96848, -95867, -82738, -137000, -145414, -110407, -66997, -91391, -64888, -73218, -120742, -109011, -112549, -76296, -25140, -17675, 1314, 17687, -22081, 2106, -20743, -11624, 15723, -34552, -43194, -80471, -88249, -9600, 37832, 10498, -3805, -11208, 8824, -63790, -72731, -80771, -83175, -91621, -112606, -164849, -143466, -61306, -34826, 3759, -41976, -125973, -93382, -146955, -135062, -92740, -73884, -60985, -17865, -9180, -524, -19062]
16864a9062l7422O854J1501n0034k3198o1958j9006K0320J3555k2007r007M0555
16852a48909P5348O650q675j2388k2959m8007J573J4338p554J3371K7473m537
16840a14276L9825O8267N457n477n2974n4172J8856O1013J5353J2749k2627n7637
16828h5643n8072J3917M0878k3076o771l5083k9322M0430O6828K2229j9000J7726
16816e4959k4493l4143n0921L8735j4152k8739J3425K1257L2263m98M6781O7316
16804A1872R917k0183m1441j8793M4126k4154k3030K729n124p377N5821r416l2328
16791e7381K8588J3366l7349m381j5870L9832j5545k208O098j8054L1982m910
16779c5832L2318j7636l2589o761J7388P085l5657k6630L3567j986M355K0985
$$ y = [-19062, -56484, -49630, -38129, -88163, -111361, -173319, -192325, -172005, -158450, -180457, -189464, -148909, -73561, -66911, -75586, -87974, -110933, -158940, -157367, -143029, -150583, -137212, -109739, -114276, -74451, -6184, -727, -6204, -59178, -113350, -94494, -33481, -18128, -5379, -28006, -85643, -143715, -129798, -88920, -111996, -118767, -153850, -183172, -142742, -75914, -53685, -72685, -54959, -79452, -113595, -164516, -125781, -139933, -168672, -155247, -133990, -101727, -102225, -55444, 11872, 21789, 1606, -39835, -58628, -14502, -38656, -61686, -58957, -64081, -71458, -15637, -25053, -57381, -28793, -15427, -52776, -57157, -73027, -33195, -48740, -50948, -44850, -62904, -30922, -35832, -3514, -21150, -53739, -60500, -43112, -36027, -71684, -98314, -64747, -66733, -62378, -41393]
16767d1393n5367l3015K3074r383L5084J558M6513J3703J3358j1525Q278k524
16755a1639l3775m3988k7284K576K4718m3414j4219k2825J6760J3740l334P097
16743a35587J2952K9135N9949K0185l2977k858o452j7197j8925j2272N0143j6525
16731g0429K3740L3053o0148j9795L691l7058R2781N3437J1872K0639Q033k0875
16719C8941m2276J1053j7208j7199p0211K6165L8262o9781J6275j7052j1706k7511
16707a42248K7064P2835M7365L714j0525k347k3343J3017l736Q40j5270K0654
16695a1980N395J0446k2843m8231Q474J102j7955L2568k4400q609m266L0968N229
16682d4102L2290l6050j6764p66l9938q25j612M9541R940o0824J8503j777J5325
$$ y = [-41393, -96760, -129775, -106701, -116084, -81000, -79442, -32929, -19226, -5868, -17393, -9115, -11639, -45414, -89402, -116686, -114110, -89392, -132806, -147025, -169850, -153090, -139350, -142684, -135587, -122635, -93500, -33551, -13366, -46343, -49201, -55653, -72850, -91775, -104047, -53904, -70429, -46689, -13636, -73784, -93579, -89888, -126946, -34165, 19272, 31144, 51783, 59816, 38941, -3335, 7718, -9490, -26689, -96900, -70735, -32473, -102254, -85979, -103031, -114737, -142248, -115184, -42349, 5016, 8730, -1795, -4142, -27485, -14468, -18204, -17364, -32634, -11980, -6585, 3861, -18982, -67213, -58739, -57637, -75592, -43024, -67424, -76033, -80299, -49331, -44102, -11812, -47862, -64626, -65392, -105330, -106155, -107767, -58226, -48286, -109110, -90607, -92384, -77059]
16669g7059L1469L0142J1628L5615K3861k1728o2793m9085R512J1443l2529k9262
16657a18786j6844j9893K4279K8635K7492J9058K2593j64O2405K374m5789K0719
16645F079q221m1391m0541o1435L5352R209J214l3691M237M1720J4242R672M7540
16632a6014k1016p1709L4477L0880j2529j4099J7799K939n2274L906j0453p602
16620a15695K8123K8048J5253m4623O196j2353l6951l7834K4223j7205K8215k7413
16608a62016n8627O8700L7035n0491K024K5305k908M2285L4275L6747j9846J375
16596d6142L0068M4275m8936k5536j8708j2425p606j2089m9939k26J8467L1009
16584i7788k78K1486O2632L3113o324m6043j4449r5897l4556O1804O8334n972
$$ y = [-77059, -45590, -15448, -3820, 31795, 55656, 33928, -28865, -77950, -68438, -56995, -89524, -118786, -135630, -155523, -131244, -102609, -75117, -56059, -33466, -33630, 28775, 31149, -14640, 6079, -2142, -43533, -84074, -145509, -110157, -100948, -99734, -133425, -129188, -87468, -73226, -63554, -16014, -37030, -108739, -74262, -43382, -55911, -70010, -52211, -49272, -101546, -97640, -108093, -115695, -87572, -59524, -44271, -88894, -82698, -95051, -132002, -169836, -145613, -162818, -134603, -162016, -220643, -151943, -114908, -165399, -163375, -138070, -140978, -98693, -64418, -27671, -47517, -46142, -16074, 28201, -20735, -46271, -64979, -77404, -85010, -97099, -147038, -147264, -128797, -97788, -98066, -76580, -13948, 19165, 12841, -33202, -47651, -143548, -178104, -116300, -47966, -53938]
16572e3938j2787J9330M482k0523k9742j9261K4928k2689J7533L5377l7724j9161
16560a14175K1284Q606N1038M5133M529J8578k5573k8911p4975l2431k873M7362
16548h2408N5772k5198l1428k0910j7171L878M3821J5217n1152j9224L2831P497
16536h8475J2037j3986K9829m070l689M048P644l272k9314q756m7495O3550L4456
16523d7493L0459L5730l9250o5099m0587n8941l850L0841K1279l871J1422K9000
16511a00360K6542J9244j1822j8781k3545L217K8484J2906k0043J2961j0284m4652
16499a26133O436M2987N7377n3294q455k4063k9292r684j5322Q41K1005K5265
16487a12332M3167L0195n513q2963j3472O8025L5432l2075m8040P229K9977O2366
$$ y = [-53938, -66725, -47395, -42913, -63436, -93178, -112439, -87511, -110200, -92667, -57290, -95014, -114175, -92891, -84285, -33247, 11886, 16415, 34993, 9420, -19491, -94466, -126897, -129770, -82408, -26636, -51834, -83262, -104172, -121343, -117465, -73644, -58427, -109579, -128803, -95972, -88475, -76438, -90424, -60595, -64665, -68354, -64306, -56662, -59934, -89248, -98004, -145499, -81949, -47493, -17034, 18696, -20554, -85653, -126240, -185181, -189031, -158190, -136911, -140782, -129360, -100360, -73818, -54574, -66396, -85177, -108722, -105505, -77021, -64115, -84158, -71197, -81481, -126133, -119697, -76710, -19333, -72627, -81082, -105145, -134437, -144121, -159443, -158602, -137597, -112332, -69165, -38970, -44483, -127446, -140918, -72893, -37461, -69536, -117576, -110347, -80370, -18004]
16475a8004J4873J118m3063m9759M681J6491m2259k8039K8577N853N8833p727
16463e8425m7659j3069k5558P084J4397J1244J7221l0264m2676R25K6430J8948
16451a21402k66k4477j2496K7390J1743K1651J9040J5901k3244k3831L0370J6440
16439f3181M3232J5678P5854R026j07492j7319J6823K5707K2671J3132j003k7225
16427E903l1020k9426L673j2605r9996p2214K9815Q1610L0399P746P602M144k5406
16414i9775N0900L3385k3870l2991n5629J7005J5119M2048L4372K1194j3325l2776
16402d4343K649J8701j4974l5749L981K5666M8368k3963m6018K7307J9752J5135
16390c488k6928k4168m6169l0432L2929j3024j9582J1493n93P314L1010j5813
$$ y = [-18004, -3131, -2013, -45076, -94835, -90154, -73663, -115922, -143961, -115384, -109531, -50698, -58425, -106084, -119153, -144711, -137627, -123230, -111986, -94765, -125029, -167705, -166780, -140350, -121402, -121668, -146145, -158641, -131251, -119508, -97857, -78817, -62916, -86160, -109991, -79621, -63181, -19949, -4271, 71583, 80609, -26883, -44202, -27379, -1672, 20999, 34131, 33128, 5903, -25117, -54543, -50870, -63475, -163471, -235685, -205870, -124260, -93861, -86115, -78513, -74369, -99775, -48875, -15490, -39360, -72351, -127980, -110975, -95856, -53808, -19436, 1758, -11567, -44343, -41694, -22993, -37967, -73716, -69735, -44069, 4299, -19664, -65682, -38375, -18623, -3488, -30416, -54584, -100753, -131185, -98256, -111280, -130862, -119369, -119962, -112648, -81638, -97451]
16378i7451N147K3166k7188k7298k7172Q0542M4964J1684m9378J113k9914K4953
16366f6832J6597K774J5848k2805k8322l0421k6630L1176N5572K2255j7734M671
16354d3851k6970j0035L1395j4857l5251m4058L6802L3755K5991j1590L5707M7141
16342B4179l081l4865q404L6853k4555l9131o6593m8610J8212P8712L1178K4161
16330a1944m9613k3004L4728l17l8528l8049O3557M0291k1077m7155J2286M464
16318g4361P0948N9029J8764n0083o6608k9328m139j9341J1817P952N7635M3966
16306B6251j070k1226j8796l0058m1020L819R955K4995k4389n0211M3546R2934
16294A4730K8905k956o5084k1551M6305K719p2401J0783L0576p2906k3071k0953
$$ y = [-97451, -92304, -69138, -96326, -123624, -150796, -70254, -25290, -13606, -62984, -61871, -91785, -66832, -50235, -47461, -31613, -54418, -82740, -113161, -139791, -108615, -53043, -30788, -48522, -43851, -70821, -80856, -49461, -64318, -99569, -143627, -106825, -73070, -47079, -58669, -22962, 24179, 21098, -13767, -22171, 14682, -9873, -49004, -115597, -164207, -145995, -67283, -36105, -11944, -61557, -84561, -49833, -50150, -88678, -126727, -63170, -22879, -43956, -91111, -78825, -74361, -3413, 55616, 74380, 24297, -42311, -71639, -75778, -95119, -83302, -75350, -17715, 26251, 25181, 3955, -14841, -44899, -85919, -82100, -72145, -47150, -71539, -121750, -78204, 14730, 43635, 40679, -24405, -45956, 349, 3068, -69333, -58550, -27974, -100880, -123951, -144904]
16282a44904j7933N1458P985J7233j008K5967j896J1343J6022k9434k154J017
16270f6304j7951k6956j7436L6465N8237j4627J742N729L2396q968r520k2871
16258e0064j9064j9200N032K5930J4340O3989K7003o766N609Q037m6348j2728
16246d230o2568m1304l857k266J3982M7287j6509R699O727K0784r117J3055j3333
16233d1650j2674Q510n782O0027J9954l5138m1821j5320r2710r404O9196Q6463
16221a0349K8077k3951l6021k4587j5500j6109k4508R021M375K2154M1053p313
16209e3658j3506M4619J2004K9669l1575m681M466j2318l8879o621K2809N5958
16197H287J4436l6677j9157j3617p8397J1368N6327J8575j09j1790r8466K2605
$$ y = [-144904, -162837, -111379, -103394, -86161, -87169, -61202, -63098, -51755, -35733, -65167, -67321, -66304, -84255, -111211, -128647, -92182, -33945, -48572, -46830, -41101, -8705, -17673, -27193, -50064, -69128, -88328, -83296, -57366, -43026, 20963, 47966, 41200, 46809, 54846, 8498, -4230, -66798, -108102, -111959, -114225, -100243, -52956, -69465, -59766, -53039, -32255, -41372, -28317, -41650, -54324, -45814, -51596, 8431, 28385, -6753, -48574, -63894, -156604, -166008, -96812, -10349, 17728, -6223, -42244, -66831, -82331, -98440, -122948, -113927, -109552, -87398, -46345, -53658, -67164, -22545, -10541, 19128, -12447, -17128, -12662, -24980, -63859, -70480, -47671, 8287, 22723, -13954, -33111, -46728, -125125, -113757, -57430, -38855, -38964, -50754, -149220, -126615]
16185a26615J00860q475L229m5406m0133j6999j6768l6867J8419J1161N8865O0073
16173c8656l4837K9749k7515Q116K668j7114K6610K2764j5700j1567J1789N699
16161c7994j7075P215j8245j1749k14M1926M0536n743J9656Q320o3319l2256K1363
16148d7579Q30L4114L670N7138l8317o8354k5944L8003J2478k9672l987k5943
16136i3563P871L2166J9733O2758K1064m5094L2343K0378j8891L2180j6427m7517
16124G001k3963n1421J4556J0778K0391K6924p1025N285K4387l2791k1640q97
16112i2415N3962R2994j7394l0214j8321K022o6106k3680K7131q288n539J6364
16100f9484O621M745k1371j6273m921j6219j9957M0148J0249K1849J6044M02l9977
$$ y = [-126615, -25755, -34230, -31001, -76407, -116540, -133539, -150307, -187174, -168755, -157594, -98729, -38656, -73493, -43744, -71259, -63143, -60475, -77589, -50979, -28215, -43915, -55482, -43693, -37994, -55069, -47854, -66099, -77848, -78062, -36136, 4400, -1343, 18313, 26633, -36686, -68942, -47579, -46749, -12635, -8965, 48173, 9856, -58498, -84442, -46439, -33961, -63633, -67620, -93563, -85692, -53526, -33793, 28965, 50029, 4935, 37278, 57656, 38765, 70945, 54518, 7001, -16962, -68383, -53827, -43049, -22658, 4266, -66759, -61474, -37087, -69878, -91518, -92415, -38453, 54541, 37147, 6933, -11388, -9366, -75472, -99152, -72021, -80309, -85848, -69484, -62863, -58118, -79489, -95762, -100683, -116902, -136859, -96711, -86462, -64613, -48569, -48167, -88144]
16087h8144J8981J1311K6963J1530j7192J498N8946P9286k1303m6074l7334J7665
16075A6133K7145k3214K3506k3443l7300J3263M9648m943M150l74Q561p942j8698
16062B6492K8769p742q0122m1209m9640k1003J3657r732j9804O1014M2442K3958
16050c2920J8888q974k5072O2789K6268n3552k4307K5470m091j0746L415P4681
16038E1849J1425J7825m0870n9566k0260L5818K1076j729m9542m3466l4584J2314
16026i9710K9840N0879J0753j2807k1416j1836j6987K9135n3358K959N3392J9247
16014a9909K4061l7183n359k7526J3547j1143J4555J558L0376M6587L9165k106
16002F6623n2604r2084m5246M9222N4591O6521k2364l2940P040J9154K8068L8630
$$ y = [-88144, -69163, -57852, -30889, -19359, -36551, -35053, 23893, 103179, 81876, 35802, -1532, 16133, 43278, 20064, 43570, 20127, -17173, -3910, 45738, 40795, 44945, 44571, 53132, 45190, 26492, 55261, 47519, -32603, -73812, -123452, -144455, -130798, -140530, -160334, -99320, -56878, -32920, -14032, -23006, -48078, 14711, 40979, -12573, -36880, -11410, -15501, -26247, -22832, 51849, 63274, 81099, 40229, -19337, -39597, -3779, 17297, 15568, -33974, -77440, -112024, -99710, -69870, -18991, -8238, -21045, -42461, -54297, -71284, -42149, -95507, -92548, -39156, -19909, 4152, -33031, -38390, -65916, -52369, -63512, -48957, -47399, -17023, 29564, 68729, 66623, 14019, -78065, -123311, -74089, -19498, 47023, 24659, -8281, -1241, 17913, 45981, 84611]
15990H4611j6302p4722r949K4776j9954j6753k1908K049K5028M4242j6720L542
15978G940n2824K7330n953L114K2165O584J6580R307L4196j5050m7752l0265O96
15965b3932L9832J5462k7413J8795J5978l8070k5656L0599l2230n172L4777J5221
15953A8191j1888O168k1046l4890J8502l0509k9932l3254N7810N5002o94q831
15941a5371j4261j941L2662O1998m866K0513j6670k5927M5801N8864n44m1582
15929I8676n1706l5556m1061N3377M9164j9035l2123K3514O2m9077K7277j7611
15917E901K2638l3510l0223L9222N1633J1831o826k6543l7640l7378M4774l5946
15905c2067l0693L4366R2652O0870o699m3468n889j3420m9686n4013J5757K6791
$$ y = [84611, 68309, -6413, -16362, 8414, -11540, -28293, -50201, -48152, -23124, 21118, 4398, 7940, -44884, -17554, -23507, -20393, 1772, 8356, 24936, 34243, 68439, 53389, 5637, -24628, -23932, 15900, 31362, 3949, 22744, 38722, 652, -25004, 5595, -26635, -31807, 2970, 18191, 6303, 12471, -8575, -43465, -24963, -55472, -85404, -118658, -60848, -5846, -6540, -15371, -29632, -31573, 1089, 63087, 58221, 78734, 62064, 36137, 81938, 140802, 140258, 98676, 46970, 11414, -29647, 23730, 72894, 53859, 21736, 45250, 45312, -3765, 23512, 5901, 28539, -4971, -35194, 4028, 55661, 67492, 60666, 34123, -3517, -40895, 3879, -32067, -62760, -28394, 64258, 125128, 118429, 74961, 69072, 55652, 5966, -48047, -32290, -5499]
15893e499j9513N210p54K1459J3836j2214j9671k1105K0511K8871O677l2288p2385
15880h6865L3095N9115R3599J9689l1587l2523k0209l1231K6422k3334j7585N5542
15868D4128M108l7818J837M8066P4627q2516q931M3290M0665k6984k4851j3681
15856F1940j5803n4600m9378k9459K2539O2248L9575N1792q101l8902j7475O161
15844C0537J7965k7484J3806J9261j1700R924n3208j6219o7541Q487M4322N5719
15832B3869L7826L53J0414o3455K3481K4612k0061J1859j0439M063O2194L5775
15820A40491l9764m1162J8730k3031o0725j0155K5930k0261r990L4328P761M665
15808B6817k8389K174j4872M003L8732p317M3182k0011k5268j5649R812L8011
$$ y = [-5499, -25012, -19802, -20556, 903, 14739, 2525, -17146, -38251, -17740, 11131, 17808, -14480, -86865, -53770, 5345, 98944, 118633, 87046, 54523, 34314, 3083, 29505, 6171, -11414, 44128, 48236, 10418, 12255, 60321, 134948, 52432, 43501, 86791, 127456, 100472, 75621, 61940, 46137, -8463, -57841, -87300, -64761, -2513, 37062, 88854, 80753, 41851, 24376, 30537, 48502, 21018, 34824, 54085, 42385, 52309, -899, -17118, -84659, -76172, -31850, 23869, 61695, 62048, 72462, 9007, 32488, 57100, 37039, 48898, 38459, 42522, 104716, 140491, 100727, 59565, 78295, 55264, -5461, -15616, 10314, -9947, -19937, 14391, 22152, 26817, -1572, 602, -14270, -10267, 28465, 21148, 64330, 44319, 19051, 3402, 13214, 51225]
15796E1225P060K7336K2764p4970J1791j4854N848J3936l064j0696j2401M5348
15784F9323J388k5232k7272j7003L0251m568K2869K2189J9094L1015j8341k5808
15772G7905j8777m6692j8210J5845O2319L822n0541l2577n244K270m832L1977
15760A7265p328L542J46n4968K372J0405M574o005K8706P0819K8502l3976l1815
15747C2239j6762Q138J3556o742j6781l9512n7946j1895O4919M1963n868p100
15735a791P809J8771L7733J0888J9972q396R792m5747l4001K3162L7039L1233
15723A06464K1303N7129l2609o2171j1839l9099j4396l3179L580J8331L152l9256
15711b2590J5666k4315j5805M282k9415m8848M4707N2792N8743K1676l6787k4679
$$ y = [51225, 58285, 85621, 108385, 33415, 45206, 30352, 36200, 50136, 47072, 36376, 23975, 69323, 70711, 45479, 18207, 1204, 31455, 26887, 49756, 71945, 91039, 122054, 103713, 77905, 59128, 12436, -5774, 10071, 72390, 76212, 25671, -6906, -12150, -9880, -14712, 17265, 9937, 13479, 13625, -41343, -38971, -28566, -23992, -29997, -1291, 69528, 98030, 64054, 32239, 15477, 23615, 37171, 30429, 13648, -25864, -83810, -95705, -30786, 11177, 5309, -1791, 6018, 24789, 62522, 73410, 93382, 84986, 94778, 49031, 15030, 38192, 75231, 106464, 127767, 184896, 152287, 90116, 78277, 39178, 24782, -8397, -4817, 13514, 16666, -22590, -6924, -31239, -47044, -42762, -72177, -121025, -76318, -23526, 35217, 56893, 20106, -4573]
15699d573K9525m441k7008j3587J038L604O416K4931Q196q587m809L2315R6086
15686A39106N5836K5021k9052m6138r7020j5831j915J3801K0111N6610j5762m3391
15674F1376K588J6374k7816L1230J9881J3312j9914j5201m9417J9854L4325j6736
15662F9856J7656J172m6556j3950O039L6638N4984P356m6319l8067Q068N897j3068
15649D9706N6288P2198L9096m4265q9580l2349m5822K306K6149n665K8021M4430
15637A00513j3856n1080K2864J7249l7959K7776O5125M510J8227k853l5136o0819
15625E4561k1881L2937q564J9358P4299L1473L412l2636o4673J020R629N632l1652
15612G2915l7080k7286k2407n959M1540N1181L8262M7136n4414Q31k4089M2631
$$ y = [-4573, 24952, 20511, -6497, -20084, -19046, -15442, -9026, 15905, 24101, 15514, 10705, 43020, 139106, 194942, 219963, 190911, 144773, 47753, 31922, 30007, 43808, 63919, 120529, 104767, 61376, 63964, 80338, 52522, 83752, 103633, 116945, 97031, 81830, 32413, 52267, 86592, 69856, 87512, 88684, 42128, 28178, 34217, 70855, 125839, 133195, 86876, 48809, 56877, 62774, 49706, 105994, 178192, 217288, 173023, 83443, 51094, 5272, 7578, 33727, 28062, 56083, 100513, 86657, 35577, 58441, 75690, 37731, 65507, 130632, 135142, 153369, 150516, 115380, 54561, 32680, 65617, 57053, 76411, 150710, 182183, 185595, 152959, 88286, 89306, 98935, 104567, 72915, 35835, 8549, -13858, -19817, 21723, 72904, 111166, 158302, 103888, 104719, 80630, 123261]
15600A23261L2591J1486L4559j4218K110q0513n9400J3743N8216J5016q486j3878
15588A14487o7149J5881J6970r0750r472O6329K9640K7082M489l7361J9781J2437
15576A02364k8869j9981L4989O488k5713m774J1084k6258l4936p503o784L1409
15564C1516K0250M5365J8133p464o408K682K1781J0938J5483J2206k0950k6421
15552A17111l7885L2633j1143k7094J5787M2287M2701l8709j222M026o3160l1678
15540D3654l5542K1447N3652J4893Q489n439N3479l6519j8889K5173P159j8744
15528A12813k3023J0030m0860P511L3249N9957L5301n5553r1550K8689Q1419O175
15516A64158l2816l3742l7292K8766L6419o1879M3588N5247K3310M1704k7056
$$ y = [123261, 155852, 167338, 201897, 187679, 189789, 109276, 49876, 63619, 121835, 136851, 128365, 114487, 47338, 63219, 80189, -10561, -20033, 46296, 75936, 103018, 107507, 70146, 89927, 102364, 73495, 53514, 88503, 94991, 69278, 64504, 75588, 49330, 14394, 6891, 107, 31516, 51766, 97131, 115264, 107800, 101392, 104074, 125855, 136793, 152276, 164482, 143532, 117111, 79226, 111859, 100716, 73622, 89409, 131696, 174397, 135688, 134466, 138492, 75332, 43654, 8112, 29559, 83211, 98104, 106593, 101154, 154633, 118114, 99225, 124398, 131557, 112813, 89790, 99820, 58960, 66471, 99720, 159677, 194978, 139425, 47875, 76564, 157983, 164158, 131342, 97600, 60308, 89074, 125493, 63614, 107202, 162449, 185759, 227463, 200407]
15505B00407n3588o0825J3765K8886K5366q373k9837J9519j9024l0902k1849L4330
15493I7875N8337J5912j1848N523r873N7085K560k297k9018K6222K7170r169K1512
15480B49991J5196o2699j8967N0415L4733m8585k3985O2023m9765n5878K8296
15469A80775J3591j6515j7484P5594N2005m220J324l1472o6833J20L4597q345
15457B13137q9366J8679R449J6472P926J0682M1983K8220k0527n641J4883n6340
15445A89557M040J8065l6270j5288L7908q432J3137K3551O0023L9924J6692J0852
15433C53759K4504K1862M8068O7102L8896L6951M116q900O6515J03288J20731
15422H76892J66307J74022J49375K39773L87505N53224Q17115J080626J429207
$$ y = [200407, 146819, 85994, 99759, 128645, 154011, 145638, 115801, 135320, 116296, 85394, 63545, 97875, 156212, 172124, 160276, 165799, 155926, 213011, 215571, 213274, 184256, 210478, 237648, 228479, 249991, 265187, 202488, 183521, 233936, 268669, 220084, 196099, 258122, 208357, 152479, 180775, 194366, 177851, 160367, 235961, 287966, 283746, 285070, 253598, 186765, 186885, 221482, 213137, 123771, 142450, 151899, 168371, 176297, 186979, 228962, 257182, 236655, 231014, 245897, 189557, 193597, 211662, 175392, 160104, 198012, 189580, 202717, 226268, 286291, 326215, 342907, 353759, 378263, 400125, 448193, 515295, 554191, 591142, 595258, 586358, 652873, 756161, 876892, 1043199, 1217221, 1366596, 1606369, 1993874, 2547098, 3364213, 4444839, 5874046]
15413E874046J766264J950636J897699J554207R57456Q4442p15516j229168j621657
15404A0518409j650879j490692j202523r06882o74451m71665l44635k96845k28408
15395C251429k25946j75436j58522o1311j01044o3894r8598j46136j04946m9116
15385B066480m5309l3202j190M5002P92n1541o0670j9541j7418K3499k0034J2172
15373A899040p941o7528j18747j36005o3040k3255n4049q0112j10543k2103o9859
15362A145858q1446n7964p7023n5578N210o1475l8012l3979p3246l7076q317l8193
15350E88759o7256k3056J066M2037n3236j3888j5740p8219k0630M0218r346j7871
15338C72838j1541k1588m5854k9567j2650q203q23m8750J378N0417J3733k9123
$$ y = [5874046, 7640310, 9590946, 11488645, 13042852, 14000308, 14084750, 13369234, 12140066, 10518409, 8867530, 7376838, 6174315, 5267433, 4592982, 4121317, 3776682, 3479837, 3251429, 3025483, 2850047, 2691525, 2630214, 2529170, 2465276, 2366678, 2220542, 2115596, 2066480, 2021171, 1987969, 1986779, 2031781, 2032573, 1981032, 1920362, 1900821, 1883403, 1906902, 1886868, 1899040, 1891099, 1823571, 1704824, 1568819, 1505779, 1482524, 1428475, 1348363, 1237820, 1215717, 1145858, 1064412, 1006448, 929425, 873847, 879057, 817582, 779570, 745591, 672345, 635269, 626952, 588759, 521503, 498447, 499513, 541550, 488314, 474426, 458686, 380467, 359837, 400055, 390709, 372838, 361297, 339709, 293855, 264288, 251638, 243435, 242612, 193862, 195240, 245657, 259390, 230267]
15326B30267J7831K3677m4703p4100r309O3321P807j8955n9327K764M256M1988
15314A85517N2178j1964L748l4796m2935l9909M6453p757k5925m2734l7684J3857
15302E8049N2121M4288j2678k4317k1997r27P455L1476P768m73K1948L8664k2529
15289A78848j793N882J7191L4070j4576N086k1964n9500k7509m7307K4247K6672
15277A19347q795k3076k4717R184R199L0572J0436j9514j3841l1623k2783K9904
15265F4293K2828j6286K3118J2517m5806j0134Q294r969j141K2588K6874L6683
15253A33859j5803K6557K8458l2571k4552L2540K7487p638k9946j0350k5059L794
15241A06776k5586O99K8553K1756k1561J6389l6807K257P1253p411n5283k9484
$$ y = [230267, 248098, 271775, 227072, 152972, 143663, 206984, 214791, 195836, 136509, 139273, 143529, 185517, 237695, 225731, 229479, 194683, 151748, 111839, 158292, 150535, 124610, 81876, 44192, 58049, 110170, 154458, 141780, 117463, 95466, 94539, 101994, 133470, 141238, 140765, 162713, 201377, 178848, 177055, 182937, 200128, 234198, 219622, 224708, 202744, 143244, 115735, 68428, 92675, 119347, 110552, 87476, 62759, 71943, 81142, 111714, 122150, 102636, 88795, 57172, 34389, 64293, 87121, 70835, 93953, 106470, 60664, 50530, 58824, 48855, 47714, 70302, 97176, 133859, 118056, 144613, 173071, 140500, 115948, 148488, 175975, 168337, 138391, 128041, 102982, 106776, 81190, 81889, 110442, 132198, 110637, 127026, 90219, 92476, 163729, 156318, 101035, 71551]
15229G1551Q803N053n5069m0976J8750M1925N6558J0396m0455K8450J2637p297
15217A10326L498m415m5657K5846O6069p064m6148m0220n5200M1148Q364K6K2616
15204G9189l257O321K50m5115m0870l6612L6276N7888N7091j8221K9868N518n4704
15191G3622k5509k918L6592m8417J592M9868r420j3623K4749N4264J7302r32j2455
15178A44715k936k228q8156m6304k9381J8825O4225K6044l2190K6060O621l1249
15166E4046k3164k1439j9847O1869j8419J1365o347R011k4079l440n498L9660
15154E3718M2134N735n0768j993M5497P1903J9863l9760m0514J9720j2604n836
15142A07095n1748n2805r492O0766M5753j4913n0983m3535Q230J8418L2401L514
$$ y = [71551, 80354, 85407, 30338, -10638, 8112, 50037, 106595, 116991, 76536, 104986, 117623, 110326, 113824, 109409, 63752, 89598, 155667, 148603, 102455, 62235, 7035, 48183, 56547, 56573, 79189, 75932, 82253, 82503, 37388, -3482, -40094, -3818, 54070, 111161, 92940, 122808, 128326, 73622, 48113, 45195, 81787, 33370, 34962, 84830, 75410, 61787, 86536, 140800, 158102, 157170, 144715, 141779, 139551, 51395, 5091, -24290, -5465, 58760, 84804, 52614, 78674, 85295, 54046, 30882, 9443, -10404, 51465, 33046, 44411, 38064, 47075, 22996, 19556, 14058, 53718, 95852, 101587, 50819, 48826, 94323, 166226, 186089, 146329, 105815, 125535, 112931, 107095, 55347, 2542, -6950, 53816, 99569, 84656, 33673, -9862, -1632, 16786, 49187, 52701]
15130E2701M0192j7965k9623L1415q432m2619J3907m1377j8997N8616J7920L6951
15118I2689J1240l1167k2332j3875j1594J2931j8271L2832l432M963l9683j3499
15106H02R527K8526L0681j8626m4657L5308K6798l2551P319N8613L5534k2738
15094A14536p53k0952j3171J887k9443k4707K2714J3110K7769j8050l7126m1667
15082e853k955N1142M6101k7592n9619j3256J8225J8111K3505J7912l1665n9122
15070b5066j691O13o316j0332Q20M5630L755l6711l6099l3352N3057J8433J9110
15057h149L548j7492k4151K5205O0690M1055O8280k6689o5036n9555J1030J4778
15045B3514N180M8042M99m5886m0101l9376j3666o252J2843N5300K2825j0181
$$ y = [52701, 92893, 74928, 45305, 76720, 68288, 25669, 39576, -1801, -20798, 37818, 55738, 92689, 103929, 72762, 50430, 36555, 24961, 37892, 19621, 52453, 49021, 53984, 14301, 802, 10329, 38855, 69536, 50910, 6253, 41561, 68359, 35808, 43127, 101740, 137274, 114536, 113783, 92831, 79660, 81547, 52104, 27397, 50111, 63221, 90990, 72940, 35814, -5853, -8808, 42334, 88435, 60843, 1224, -12032, 6193, 24304, 47809, 65721, 34056, -25066, -26757, -26144, -32460, -42792, -41972, 3658, 7413, -29298, -65397, -98749, -45692, -27259, -8149, -4601, -22093, -46244, -21039, 39651, 80706, 148986, 122297, 57261, -2294, 8736, 23514, 28694, 76736, 77235, 31349, -8752, -48128, -61794, -68046, -55203, 97, 22922, 12741]
15033A2741l8438j0246j2394N060K0164L2021Q669j7072n412n1944N408O1213
15021I770L2119J1349J1813m5033p5864N111L8921N1308l0971K688J3755K8740
15009E3706J7983p5378n8778j0573J2420j5374J2209j676K6591R761J9820n2448
14997f1737L8346P7520K9018j5373j4711k1648J176O856J0576L1793O1486K6724
14985A70026j03351k8416j5179l9679l0941N8687M2379j0169n93j0237n4380K58
14973b1595N1091j0043n1753L2229k765L3516L0248M270R438J8160L9391K7837
14961A60024K421J1155P1739Q8408J83330J70407J23706K0453J9307n228j0313
14950H35409l5784j33032j53227j32780o1632o5242n9085n6015m6299j1384l65
$$ y = [12741, -25697, -35943, -48337, -43277, -23113, 8908, 17577, 505, -4907, -56851, -51443, 9770, 41889, 53238, 65051, 20018, -55846, -50735, -11814, 39494, 8523, 11211, 24966, 53706, 71689, -3689, -62467, -73040, -60620, -75994, -63785, -65461, -38870, -29109, -9289, -61737, -23391, 54129, 83147, 67774, 53063, 31415, 32591, 39447, 50023, 81816, 143302, 170026, 66675, 38259, 23080, -16599, -47540, 11147, 53526, 43357, 42764, 32527, -21853, -21595, 29496, 19453, -32300, -71, -2836, 30680, 60928, 65198, 74636, 92796, 132187, 160024, 162445, 173600, 245339, 333747, 517077, 687484, 811190, 831643, 850950, 845722, 835409, 799625, 666593, 513366, 380586, 318954, 253712, 194627, 138612, 92313, 80929, 80564]
14939H0564k9363k5282l7603L7411O182k7875l20K4330O597j1330n377L1718J9418
14926F9070j3488m2004K0540r8P319o6366L9575P0672K0580J2736j4345j5128
14914H9063Q077l8172j3733R700k6818J2093n396k1217J4991m089J1937n014m241
14901B7181k9314k1123J4467L546M4943J1846J0042M5933M718J7645m7535m3762
14889C8587J705O3155N6816j3253o7430l9548L2118j0893k0205k0892k0831j586
14877b257J3203K6352J6036r919N580k5328K3747M4763K0202M998p4920o5489
14865b3032k6286o7416K128O3109J090R580J6017J8284J8328j1316l5377q676
14853d3567q523k9737n0396N1333P5345K5343K0912q703R362j2552j1218m0256
$$ y = [80564, 51201, 25919, -11684, 25727, 31909, 4034, 3714, 28044, 34641, 23311, 17934, 49652, 69070, 55582, 13578, 34118, 34020, 41339, -25027, 14548, 85220, 105800, 118536, 104191, 89063, 97140, 58968, 45235, 54935, 28117, 40210, 34814, 13597, 28588, 24499, 36436, 31422, 27181, -2133, -23256, -8789, -5243, 39700, 51546, 61588, 107521, 112239, 129884, 82349, 38587, 40292, 103447, 160263, 147010, 79580, 40032, 72150, 61257, 41052, 20160, -671, -2257, 10946, 37298, 53334, 43415, 48995, 23667, 47414, 92177, 112379, 117377, 42457, -23032, -49318, -116734, -114606, -51497, -50407, -40827, -24810, -6526, 11802, 486, -34891, -43567, -52090, -81827, -132223, -80890, -5545, 19798, 40710, 32007, 41369, 28817, 17599, -22657]
14841b2657l0967M495L2612j4871m2091J0037L1639l1505j7780M5016l727O639
14829c3160j5384m875M5926N659l1895J0472Q91o917K3619J7569m7153m5804j3553
14816i4605M0935L6123q524j7609n5021j5971M8645Q4378n3706J9315n4700k2027
14804i2767J9525K1153r135K6714M5354J3416j5884l5903j351q389j2106J2308
14792c7065J1364j7018J2745k667n0774o5950l0169M2106R2807J2373L446k050
14780c0852L9872j9282l6204P572J6773R366j626J7914K8269p794j7953K0775
14768B6830P904l7148m3883j7088K4197P987P518j0755L4507N8772m948p1968
14756a8075l2880l5382J6985K0731L8614J0875k1906j0398l7226R458J8452M7070
$$ y = [-22657, -53624, -49129, -16517, -31388, -73479, -63442, -31803, -63308, -81088, -36072, -39799, -33160, -48544, -53419, -7493, -1834, -33729, -23257, -22366, -29283, -5664, 11905, -35248, -81052, -94605, -53670, -17547, -26071, -43680, -98701, -114672, -66027, 18351, -35355, -16040, -70740, -92767, -73242, -52089, -61224, -34510, 10844, 24260, 8376, -27527, -28878, -37267, -49373, -37065, -25701, -42719, -29974, -32641, -83415, -149365, -179534, -137428, -44621, -32248, -28802, -30852, 9020, -10262, -46466, -38894, -22121, -12755, -14381, 3533, 31802, 24008, 6055, 26830, 34734, -2414, -46297, -63385, -39188, -31201, -23683, -34438, 69, 58841, 53893, -18075, -50955, -86337, -69352, -48621, -10007, 868, -21038, -31436, -68662, -59204, -40752, 6318]
14744F318K4274k295k5880o1837J1886L5040n4232Q966N3458J5757l6810K551
14732b2804o4438m5750L8159J3036m3695J9724P7240J0526J5887l408J2289K178
14720H944q3152K262R160P7393M5437n2117N643p052Q204k1969j7531p414o368
14707c8560j2071L6310K8346j0944j7018N0354J6764n2487m5472q1351k1046M4848
14695a02327L1346K9093N1437j2526k3333l9153j955J6933L1667M525p050R344
14683a1999j0330J5645j1714J4185K4522M6531N4577J672k7880n338r421j5143
14671F5307r5044l6496L5136j3665J2916J6010M912k6709j15N2881P101K0192
14659D2426o6273l9917L9462M786m867M6690j755k6030l557o587j7222K5327K4381
$$ y = [6318, 30592, 28297, 2417, -59420, -47534, -12494, -66726, -57760, -4302, 11455, -25355, -22804, -87242, -132992, -94833, -81797, -125492, -105768, -28528, -18002, -2115, -5523, 6766, 8944, -74208, -71946, -62786, 14607, 60044, 7927, 13570, 6518, 14722, -7247, -24778, -32192, -38560, -50631, -14321, 14025, 3081, -13937, 36417, 53181, 694, -44778, -126129, -147175, -102327, -70981, -41888, 9549, -2977, -26310, -65463, -67418, -50485, -18818, -14293, -21343, -11999, -22329, -6684, -18398, -4213, 20309, 66840, 121417, 123089, 95209, 89871, 80450, 65307, -29737, -66233, -31097, -44762, -31846, -15836, -10924, -37633, -37748, 15133, 22234, 42426, -23847, -63764, -24302, -19516, -24383, 22307, 20552, -5478, -9035, -15622, -32844, -7517, 16864]
14646A6864J9692l1446k8098l3161K3463K3265k3345o433K4270n429l2777L4909
14634a8226l8507p7735j0788K8369R7J3674L1803K4433o389n3583K0204P2063
14622a4585Q027m5018k7692n6994L7017R9040L7496j5989r3211j8857j7766P91
14610a07741M6384j7224J2033M9852l0482J4934J2071j4662N3604l8595q352l3759
14598f1937m1533q564r004J7611L0828K0656m8133K382M3273L6069L3508j8996
14586c840k7019r697o4971m831M40n408J8742J91J835j9590M9043M4881o540r344
14572c6108k5033o704n4346l4407J4325O1931M8649q974O3521L036L6634j5733
14560D6791k240n5283p0246p307J2022K8531R783n313j9079m5922j3221L4719
$$ y = [16864, 36556, 5110, -22988, -56149, -32686, -9421, -32766, -39199, -14929, -20358, -53135, -18226, -56733, -134468, -145256, -116887, -116790, -103116, -71313, -46880, -53269, -106852, -86648, -14585, -6558, -51576, -79268, -136262, -99245, -205, 37291, 21302, -71909, -90766, -108532, -107741, -61357, -78581, -66548, -16696, -47178, -32244, -20173, -34835, 18769, -19826, -28178, -61937, -103470, -112034, -121038, -103427, -72599, -51943, -100076, -97694, -54421, -18352, 15156, -3840, -30859, -40556, -105527, -110358, -109918, -115326, -96584, -96393, -94558, -114148, -65105, -20224, -26764, -36108, -61141, -67845, -122191, -156598, -142273, -80342, -31693, -40667, 22854, 25890, 62524, 46791, 44551, -10732, -80978, -88285, -76263, -47732, -37949, -43262, -62341, -108263, -121484, -86765]
14548h6765j8173N625Q1858N1959l2569k4249j4714n2091m3309K8431o261j4686
14536a24944l4473O8134K0507N341j41K5298l6604m8685l1924p894M2640K7669
14524i5076J3799J5646k7894j4451K7887L7801N0024K1048P76k9721j7068J8074
14512H45K9034L4114l4712j8183o7635J4120O2525l6160K2056k2720o0662l511
14500h0889K8436j0469j4620K6289k9925L4817l291J5570L1925J3217J8110j104
14488B8066n3514o0744p973k5204m162N9381J6409N038j8052O797N471K073J0679
14475c5735r690J6606k6983r199p028J0831K7367K767n490k476M079P26L713l4464
14461f4976M507M7338o3853j8262l5439l9009L7332N682o123K5152M6713M5955
$$ y = [-86765, -104938, -99313, -17455, 34504, 1935, -22314, -37028, -89119, -132428, -103997, -110258, -124944, -159417, -91283, -70776, -65435, -65576, -40278, -76882, -125567, -157491, -165385, -122745, -95076, -81277, -65631, -93525, -107976, -80089, -42288, 7736, 28784, 29560, -161, -17229, 845, 29879, 63993, 29281, 11098, -56537, -42417, 20108, -16052, 6004, -16716, -77378, -80889, -52453, -62922, -77542, -51253, -81178, -46361, -49652, -34082, -2157, 11060, 29170, 28066, -25448, -86192, -94165, -119369, -123531, -64150, -47741, -42703, -60755, -53958, -48487, -46414, -35735, -45425, -28819, -55802, -65001, -72029, -61198, -33831, -31064, -36554, -39030, -34951, -34225, -30512, -64976, -60469, -13131, -76984, -95246, -130685, -169694, -132362, -126680, -132803, -107651, -60938, -14983]
14449a4983J0744l1022m7655j2277N4520k0389m7310l1438j409N9668M9520N7479
14437B5448M2278R706K1109o8477j05323n6940L2984O1133J0667l6248l3852J7804
14425g9711J3394J1457M5070N895j7527k0186L2790L9728P261k3230Q808J4328
14413C8077n0546k4010k8618j7605m7049O528M9680K7763K2747n3026k0278j8906
14401a15243j1312J5350M7024p926m2280O682M6337N5337O346k2586L786P941
14389a0544R411j9976J1497n2977j6446L374k7008K8786N2191K5604j2433k3913
14377c2434n8042J2409N2022K4676o34P283j8027l5482K7690L1611k897K7375
14365C5550o261q6812m1583k8617m6528L110M0031K3238L1187P2036M7759k7664
$$ y = [-14983, -4239, -35261, -82916, -95193, -40673, -61062, -108372, -139810, -141219, -81551, -32031, 25448, 67726, 77432, 98541, 30064, -75259, -132199, -99215, -38082, -27415, -63663, -97515, -79711, -66317, -54860, -9790, -3895, -21422, -41608, -8818, 30910, 38171, 14941, 23749, 38077, -12469, -36479, -65097, -82702, -129751, -123223, -73543, -45780, -23033, -76059, -96337, -115243, -126555, -111205, -64181, -72107, -114387, -107705, -61368, -6031, 315, -22271, -18485, -10544, -1133, -21109, -9612, -62589, -79035, -75661, -102669, -73883, -21692, 3912, -8521, -32434, -90476, -78067, -26045, -1369, -2003, 5280, -12747, -48229, -20539, 11072, 8175, 35550, 29289, -57523, -99106, -127723, -174251, -171141, -131110, -107872, -76685, -4649, 43110, 15446]
14353A5446Q959J6611J122q954m6135k923j8007q788K187K6167l6002p7210J4789
14340a12738N6620K3062j521j4556J7240K9736j0004m8866l1599K5254K8470j4070
14328e2972J7311R504K814j0753l6219o140M2340J4255j3101k1686N375N8184
14316H912P95k1577n7350k1895p451o629K8962j2892k0692K3928J7310N166L6044
14303b7369L343j1474J7969L4425N6039k4327m0931n4307k0931k5475M2101K1260
14291b9677k2977l710J4657J0477J5777k2934q381K5471J7859M0145o4263L899
14279b3657k3830J6672J1931l69m615p149M6760j4454m9924J7621P0439K3528
14267F2953r383l3998J0995M4965j1394l5837j6544l4701k3107k925L4159J3726
$$ y = [15446, 24405, 41016, 42138, 33184, -12951, -15874, -33881, -42669, -40482, -14315, -50317, -127527, -112738, -56118, -33056, -34577, -49133, -31893, -2157, -12161, -61027, -92626, -67372, -38902, -52972, -35661, -26157, -23343, -34096, -70315, -76455, -34115, -19860, -32961, -54647, -49272, 8912, 9707, -11870, -69220, -91115, -98566, -105195, -76233, -89125, -109817, -85889, -68579, -63413, -27369, -24026, -35500, -17531, 16894, 72933, 48606, 7675, -46632, -67563, -93038, -50937, -29677, -52654, -56364, -41707, -31230, -15453, -38387, -46768, -21297, -3438, 36707, -27556, -23657, -47487, -30815, -18884, -19253, -23868, -31017, 15743, 1289, -48635, -31014, 39425, 62953, 53570, 19572, 30567, 75532, 64138, 28301, 11757, -22944, -46051, -48976, -14817, -1091]
14255a091j8603j4294m4593J9258k911L7990j1062K7501j4622n0175R399n5833
14243a19036O176P2839M5087l2746k3181l467M0261J1865j2702q990J7499n4916
14231f1311j5709j7356M8791K3154J4838j5344M794L446l5000m1842q152J9402
14219h0289M5796L2910L7517J9717K3687k6265o3532p2882m0716o987K7547L410
14207a00087k1613P1294M5461r500m4865J1571j598m302l742N0545L512J3257
14195I933l9541n199J4369M844O544J7613m2675K5526k7787j1635l5166L610Q8058
14182H494l9817l1984j1669o245M7401N2387N9702M0769N3059K2611k7456m5177
14170A22075l2151J1994j7920n2452r392q52J8711M7374j2377k7403j5664l8768
$$ y = [-1091, -19694, -33988, -78581, -59323, -62234, -24244, -35306, -7805, -22427, -72602, -63203, -119036, -112860, -40021, 5066, -27680, -50861, -54328, -14067, -2202, -14904, -23894, -6395, -61311, -77020, -94376, -45585, -22431, -7593, -22937, -18143, -14697, -49697, -91539, -99691, -80289, -34493, -1583, 35934, 55651, 79338, 53073, -10459, -83341, -124057, -131044, -103497, -100087, -121700, -50406, -4945, -14445, -59310, -47739, -49337, -53639, -57381, -6836, -3324, 9933, -29608, -34807, -20438, -15594, -9050, 8563, -34112, -8586, -36373, -48008, -83174, -79564, 8494, -31323, -63307, -74976, -81221, -33820, 18567, 78269, 119038, 172097, 194708, 167252, 122075, 89924, 101918, 83998, 31546, 22154, 21302, 40013, 87387, 75010, 47607, 31943, -6825]
14158f825k2223k4684O096O9022n790R318L191K4156l3879n3602j1690L2357K7740
14145A3187R6449K0349k1334j8747M253L7025j5470l7597l6059J3425l8940K1269
14133C7810J9233k6874j6312O763m236L9039n7427o6774L9478L4810J9673K0596
14121D5779j839n1795L3078K762m752n2993K6151O8943O269m1236j3989j141k8646
14108a3409k85K310K9915J3950p3505J3068L6137M6626L4611k5231j057M4238
14096A07368l709j2184L4095n2829k4644M0142K8962o5713p3820l2043L5227N0904
14084C1756O3718N9639L9587M2521J10020N0428M5434P9628K7012k9511l5498
14073D84734p259J02015K215k6675r0258j27664q6175q187j38m8422p6781k0307
$$ y = [-6825, -29048, -53732, -47636, 21386, 15596, 24914, 28105, 52261, 18382, -35220, -46910, -14553, 13187, 109636, 129985, 108651, 89904, 94157, 131182, 115712, 78115, 42056, 55481, 16541, 37810, 57043, 30169, 13857, 20620, 16384, 55423, -2004, -68778, -29300, 5510, 25183, 45779, 43940, -7855, 25223, 27985, 23233, -29760, -3609, 65334, 71603, 30367, 16378, 15237, -13409, -13694, -11384, 18531, 32481, -41024, -27956, 8181, 54807, 89418, 64187, 63130, 107368, 103659, 91475, 125570, 72741, 48097, 88239, 117201, 51488, -22332, -54375, -19148, 31756, 95474, 155113, 194700, 237221, 347241, 397669, 443103, 522731, 549743, 520232, 484734, 477475, 579490, 581705, 555030, 464772, 337108, 250933, 242746, 242608, 194186, 117405, 97098]
14061I7098J4795M4598P0040l2712r6608P188K8971M6883j1082j4966M234L8716
14049A97155O0146J21753J10028J00568k5913l0925J7837P404M6556o0546k6736
14038E17327m2217q7029p6354j18163q0509l8249L8855j5764k0926K3575j6469
14027H4077m2657J1050L6844O8287o831r6182J3776J0496Q0560k2591p6895j4995
14015D4939K6982O1450o3990l3526N9165j6679J6335l388l8477j9482J0463j3143
14003C0649J9383j6410l174L8854l0405k3060L5994Q64O083J4517k2165k3386
13991B7744p770J0465K57J6636J1679j384m4602J2739L3117q100L6399N629R74
13978I3783m8412q3360j892J2766M1358L9483j2570r7443m8528P0525M8633L0066
$$ y = [97098, 111893, 156491, 226531, 193819, 97211, 104399, 133370, 180253, 169171, 154205, 158439, 197155, 257301, 379054, 489082, 589650, 563737, 532812, 550649, 558053, 604609, 544063, 517327, 475110, 388081, 311727, 193564, 113055, 74806, 113661, 97897, 76971, 100546, 84077, 41420, 52470, 89314, 157601, 150770, 54588, 68364, 78860, 159420, 136829, 59934, 44939, 71921, 133371, 69381, 35855, 95020, 78341, 94676, 91288, 52811, 33329, 43792, 30649, 50032, 33622, 30448, 69302, 38897, 15837, 51831, 52695, 58778, 73295, 51130, 27744, 19974, 30439, 30696, 47332, 59011, 57627, 13025, 25764, 58881, 50781, 87180, 92809, 93783, 45371, -37989, -39881, -27115, 14243, 53726, 41156, -56287, -104815, -34290, 14343, 44409]
$$ [...]
##END NTUPLES=NMR SPECTRUM
##END=
