##TITLE=Analysis number 311016
Compound Code cc 35714
Book Reference 397/56/1
Project Code adrs
Chemist Name brucer
##JCAMPDX= 6.0         $$ Bruker NMR JCAMP-DX V2.0
##DATA TYPE= NMR SPECTRUM
##DATA CLASS= NTUPLES
##ORIGIN= Bruker BioSpin GmbH
##OWNER= NMR
$$ XWIN-NMR		Version 3.5
$$ Wed Jun 29 09:56:17 2005 GMT Daylight Time (UT+1h)  MAYBRIDGE\NMR@NMR_250MHZ
##.OBSERVE FREQUENCY= 250.131544655141
##.OBSERVE NUCLEUS= ^1H
##.ACQUISITION MODE= SIMULTANEOUS (DQD)
##.ACQUISITION SCHEME= undefined
##.AVERAGES= 16
##.DIGITISER RES= 18
##SPECTROMETER/DATA SYSTEM= dpx250
##.PULSE SEQUENCE= zg30
##.SOLVENT NAME= CDCl3
##.SHIFT REFERENCE= (INTERNAL, CDCl3, 0, 16.522)
##AUDIT TRAIL= $$ (NUMBER, WHEN, WHO, WHERE, WHAT)
$$ ##TITLE= Audit trail, XWIN-NMR		Version 3.5
$$ ##JCAMPDX= 5.01
$$ ##ORIGIN= Bruker BioSpin GmbH
$$ ##OWNER= NMR
$$ C:\u/data/dgb/nmr/ADRS/4940/pdata/1/auditp.txt
$$ ##AUDIT TRAIL=  $$ (NUMBER, WHEN, WHO, WHERE, WHAT)
(   1,<2005-06-29 09:55:52.08 +100>,<MAYBRIDGE\NMR>,<NMR_250MHZ>,
      <created by zg, POWCHK disabled, PULCHK disabled
       configuration hash MD5:
       62 19 C7 07 E1 42 D1 B7 37 6C 3D D0 77 39 F9 E6
       data hash MD5: 64K
       1A C5 E5 A2 3F 3B A3 82 84 8E 8F BE 08 E8 0E 85>)
(   2,<2005-06-29 09:56:05.89 +100>,<MAYBRIDGE\NMR>,<NMR_250MHZ>,
      <Start of raw data processing
       ef LB = 0.3 FT_mod = 6 PKNL = 1 SI = 32K 
       data hash MD5: 32K
       98 AC 5C 9E 1B BA 51 2C 12 C5 F0 81 93 70 84 83>)
(   3,<2005-06-29 09:56:08.22 +100>,<MAYBRIDGE\NMR>,<NMR_250MHZ>,
      <apk 
       data hash MD5: 32K
       5E F3 F8 89 FE BE 5B E5 37 58 85 A0 E9 68 9C 6E>)
(   4,<2005-06-29 09:56:09.04 +100>,<MAYBRIDGE\NMR>,<NMR_250MHZ>,
      <abs ABSG = 5 
       data hash MD5: 32K
       5C A7 A2 2D DA 7D B5 D7 E6 3B C1 45 B4 D5 7B 06>)
$$ ##END=
$$ 
$$ hash MD5
$$ 1C E1 7A CF 06 80 B0 E4 DF E2 3B 61 E1 49 80 07
##$RELAX= 
##$RELAX= 
##$RELAX= 
##$RELAX= 
##$RELAX= 
##$RELAX= 
##$RELAX= 
$$ Bruker specific parameters
$$ --------------------------
##$DU= <C:\u>
##$EXPNO= 4940
##$NAME= <ADRS>
##$PROCNO= 1
##$TYPE= <nmr>
##$USER= <dgb>
##$AMP= (0..31)
100 100 100 100 100 100 100 100 100 100 100 100 100 100 100 100 100 100 
100 100 100 100 100 100 100 100 100 100 100 100 100 100 
##$AQSEQ= 0
##$AQ_mod= 3
##$AUNM= <au_zg>
##$AUTOPOS= <5 >
##$BF1= 250.13
##$BF2= 250.13
##$BF3= 250.13
##$BF4= 250.13
##$BF5= 500.13
##$BF6= 500.13
##$BF7= 500.13
##$BF8= 500.13
##$BYTORDA= 1
##$CFDGTYP= 0
##$CFRGTYP= 5
##$CHEMSTR= <none>
##$CNST= (0..31)
1 1 145 1 1 1 1 1 1 1 1 1 1 1 1 1 1 1 1 1 1 1 1 1 1 1 1 1 1 1 1 1 
##$CPDPRG= <>
##$CPDPRG1= <>
##$CPDPRG2= <>
##$CPDPRG3= <>
##$CPDPRG4= <mlev>
##$CPDPRG5= <mlev>
##$CPDPRG6= <mlev>
##$CPDPRG7= <mlev>
##$CPDPRG8= <mlev>
##$CPDPRGB= <>
##$CPDPRGT= <>
##$D= (0..31)
0 1 0 0 0 0 0 0 0 0.06 0 0 0 0 0 0 0.0002 0 0 0 0 0 0 0 0 0 0 0 0 0 0 
0 
##$DATE= 1120035351
##$DBL= (0..7)
120 120 120 120 120 120 120 120 
##$DBP= (0..7)
150 150 150 150 150 150 150 150 
##$DBP07= 0
##$DBPNAM0= <>
##$DBPNAM1= <>
$$ [...]
##$SUBNAM7= <"">
##$SUBNAM8= <"">
##$SUBNAM9= <"">
##$SW= 20.6930455092707
##$SWIBOX= (0..15)
0 0 3 0 0 0 0 0 0 0 0 0 0 0 0 0 
##$SW_h= 5175.983436853
##$TD= 65536
##$TD0= 1
##$TE= 295.16
##$TE2= 300
##$TE3= 300
##$TEG= 300
##$TL= (0..7)
0 120 120 120 120 120 120 120 
##$TP= (0..7)
150 150 150 150 150 150 150 150 
##$TP07= 0
##$TPNAME0= <>
##$TPNAME1= <>
##$TPNAME2= <>
##$TPNAME3= <>
##$TPNAME4= <>
##$TPNAME5= <>
##$TPNAME6= <>
##$TPNAME7= <>
##$TPOAL= (0..7)
0.5 0.5 0.5 0.5 0.5 0.5 0.5 0.5 
##$TPOFFS= (0..7)
0 0 0 0 0 0 0 0 
##$TUNHIN= 0
##$TUNHOUT= 0
##$TUNXOUT= 0
##$USERA1= <user>
##$USERA2= <user>
##$USERA3= <user>
##$USERA4= <user>
##$USERA5= <user>
##$V9= 5
##$VALIST= <valist>
##$VCLIST= <CCCCCCCCCCCCCCC>
##$VD= 0
##$VDLIST= <DDDDDDDDDDDDDDD>
##$VPLIST= <PPPPPPPPPPPPPPP>
##$VTLIST= <TTTTTTTTTTTTTTT>
##$WBST= 1024
##$WBSW= 4
##$XGAIN= (0..3)
0 0 0 0 
##$XL= 0
##$YL= 0
##$YMAX_a= 442576
##$YMIN_a= -395586
##$ZGOPTNS= <>
##$ZL1= 120
##$ZL2= 120
##$ZL3= 120
##$ZL4= 120
##$ABSF1= 16.522
##$ABSF2= -4.171173
##$ABSG= 5
##$ABSL= 3
##$ALPHA= 0
##$AQORDER= 0
##$ASSFAC= 0
##$ASSFACI= 0
##$ASSFACX= 0
##$ASSWID= 0
##$AUNMP= <proc_1d>
##$AZFE= 0.1
##$AZFW= 0.1
##$BCFW= 0
##$BC_mod= 0
##$BYTORDP= 0
##$COROFFS= 0
##$CY= 12.5
##$DATMOD= 1
##$DC= 0
##$DFILT= <>
##$DTYPP= 0
##$F1P= 14.0000005364418
##$F2P= -0.99999901652339
##$FCOR= 0.5
##$FTSIZE= 32768
##$FT_mod= 6
##$GAMMA= 0
##$GB= 0
##$INTBC= 1
##$INTSCL= 1
##$ISEN= 128
##$LB= 0.3
##$LEV0= 0
##$LPBIN= 0
##$MAXI= 10000
##$MC2= 0
##$MEAN= 0
##$ME_mod= 0
##$MI= 0
##$NCOEF= 0
##$NC_proc= -5
##$NLEV= 6
##$NOISF1= 0
##$NOISF2= 0
##$NSP= 0
##$NTH_PI= 0
##$NZP= 0
##$OFFSET= 16.522
##$PC= 1
##$PHC0= -77.24928
##$PHC1= 4.240538
##$PH_mod= 1
##$PKNL= yes
##$PPARMOD= 0
##$PSCAL= 4
##$PSIGN= 0
##$REVERSE= no
##$SF= 250.13
##$SI= 32768
##$SIGF1= 0
##$SIGF2= 0
##$SINO= 400
##$SIOLD= 32768
##$SREGLST= <1H.CDCl3>
##$SSB= 0
##$STSI= 32768
##$STSR= 0
##$SW_p= 5175.98343685301
##$SYMM= 0
##$S_DEV= 0
##$TDeff= 65536
##$TDoff= 0
##$TI= <Analysis number 999999
Compound Code 99
Book Reference 9
Project Code 9>
##$TILT= no
##$TM1= 0
##$TM2= 0
##$TOPLEV= 0
##$USERP1= <user>
##$USERP2= <user>
##$USERP3= <user>
##$USERP4= <user>
##$USERP5= <user>
##$WDW= 1
##$XDIM= 32768
##$YMAX_p= 399668446
##$YMIN_p= -462468
$$ End of Bruker specific parameters
$$ ---------------------------------
##NTUPLES= NMR SPECTRUM
##VAR_NAME=  FREQUENCY,     SPECTRUM/REAL,   SPECTRUM/IMAG
##SYMBOL=    X,             R,               I
##VAR_TYPE=  INDEPENDENT,   DEPENDENT,       DEPENDENT
##VAR_FORM=  AFFN,          ASDF,            ASDF
##VAR_DIM=   32768,         32768,           32768
##UNITS=     HZ,            ARBITRARY UNITS, ARBITRARY UNITS
##FACTOR=    0.157963299565203, 1,           1
##FIRST=     4132.6476996994, 0,             0
##LAST=      -1043.33573715361, 0,           0
##MIN=       -1043.33573715361, -462468,     0
##MAX=       4132.6476996994, 399668446,     0
$$ Real data points
##PAGE= N=1
##DATA TABLE= (X++(R..R)), XYDATA
$$ [...]
28706 -65072 -38266 59808 184312 51 -71833 -142508 -92733 -83943 -211648 -199510 -98863
28695 -98863 -100827 -141872 -203075 -179826 -63270 -87571 -141291 -148421 -19480 52436 4574 -103719
28683 -103719 -162469 -173030 -149576 -71312 -20049 -55842 -30167 55317 149579 135210 465
28672 465 -13665 79171 -25077 -167941 -24700 22155 -2085 8390 43995 37755 5138 -89866
28660 -89866 -72332 -51128 -19371 2179 59322 -13643 -76690 -73901 -102230 -21818 86535 114476
28648 114476 138729 64655 -80870 -191529 -141250 -47204 58737 138033 209038 128760 102004
28637 102004 98430 56140 -22645 -109562 -58435 -8388 94033 93099 60252 133382 61425 17191
28625 17191 56110 142561 225946 240635 148232 189442 189204 117791 102055 26272 -32328 -19032
28613 -19032 61864 97720 75472 71006 132728 145261 26531 67174 80474 68294 59788 -12493
28601 -12493 37257 57735 97510 135982 148420 152065 127730 178390 91776 -46718 10437 175453
28589 175453 141964 43043 2371 -16808 58239 125501 23308 -2770 101452 178126 112209
28578 112209 52730 77957 101199 84547 51512 54054 53450 8164 32874 102791 114508 172584
28566 172584 175517 156222 201271 171348 76849 20747 44452 87505 -9921 -149202 -166554
28555 -166554 -65870 -27960 -44815 -109619 -71232 65196 -22959 37257 91267 53087 -157975
28544 -157975 -68042 52452 -27167 -87174 -36310 -45784 -40690 32701 -32529 3992 114257
28533 114257 107528 163979 210339 232037 209620 117696 211351 270557 189194 183317 180444 258743
28521 258743 207007 92292 150846 269964 248097 199767 239693 325795 308170 156823 79339
28510 79339 132096 97340 29749 76801 131554 115445 98971 132684 170726 259569 251568 179169
28498 179169 14944 -7434 -74636 -117666 34450 130405 124351 148318 207635 210788 181802
28487 181802 68878 149364 161350 88402 133993 110983 41639 -44088 -43222 -38908 6675 57942
28475 57942 -57943 -89252 -70589 -113016 -55343 -10796 19815 70649 20489 41096 99097
28464 99097 57985 176702 217265 211837 203519 251057 217992 118875 125019 160051 93031 14191
28452 14191 47931 10864 21554 141255 264934 235029 189005 269960 354907 347848 224059
28441 224059 -5539 -4317 -15392 66201 93778 -18945 58120 104911 130666 131970 138418 131970
28429 131970 22106 93490 39885 -1 11814 -11915 -28629 11418 103642 140244 296466
28418 296466 315107 235031 151903 119285 186702 162796 -52230 -123535 12410 83404 153811
28407 153811 110038 4159 -48707 94834 174594 161813 170394 191337 143082 166164 162560
28396 162560 201169 216389 127408 160231 150379 115785 39675 23792 38242 111410 139471 -40854
28384 -40854 -106220 -120616 -87834 -58657 -188910 -133961 -53497 -92328 -56205 -45804 -109872
28373 -109872 -27857 139393 173538 179259 162284 192969 65612 9368 29157 136216 96667
28362 96667 -17342 -40518 -6052 68479 11246 129089 219306 210567 167451 127008 60728
28351 60728 5557 -84329 -71030 -21989 -104931 -107874 -8096 -84731 -39697 -6258 -18714 25902
28339 25902 -2877 -59069 -51588 -15900 44079 81302 122112 72208 -53875 21028 -29675 -92887
28327 -92887 -117340 -76741 -14535 -49366 40123 13730 -66898 -75860 -54918 84527 18333 -20986
28315 -20986 108783 126162 114222 270438 238884 151230 55043 35237 20880 -125326 -108568
28304 -108568 -58139 -28005 86368 26617 32834 64692 99920 135114 148409 204136 112680
28293 112680 75174 -4037 -14228 96454 124913 125648 101305 29371 -76382 -750 108251
28282 108251 126358 147781 139226 136040 111879 -19967 -48705 74959 207115 210329 46592
28271 46592 23863 71778 60167 38164 30672 3222 148324 105414 8522 -22694 -82751 -133503
28259 -133503 -163591 -144697 -126474 -8906 -71952 -88937 -106588 -76222 -33367 14916 14608 50767
28247 50767 171666 335642 329743 195763 112223 93809 83157 126792 197868 36660 -84517
28236 -84517 -105047 -5627 42882 -10270 775 50801 20001 39109 91912 92533 92137 52116
28224 52116 94392 132999 110144 69338 43840 -57050 -77231 70655 171823 53223 49178
28213 49178 40364 -29349 -100220 -213281 -246055 -286050 -220917 -77721 21480 10838 -20816
28202 -20816 -68300 10733 98149 102488 55851 24963 96724 113636 182480 214529 153070 119876
28190 119876 158377 76742 -23474 -85147 -103576 -57109 -46967 -54027 -24219 -44469 -70644
28179 -70644 -80639 13782 78228 23195 22692 145936 143058 32834 -18940 -6508 24665 50500
28167 50500 50202 -34866 -8270 -90067 -224271 -222410 -215549 -166306 -79789 1007 -95941 -147700
28155 -147700 -72739 -53818 -103673 -130206 -185629 -79459 4732 -27109 -38282 55756 53051
28144 53051 106939 169012 76920 36739 7550 -7797 -32107 -8745 52046 73597 32721 -28151
28132 -28151 -5690 22902 33131 104987 170087 132237 121512 147132 99011 70529 -40358
28121 -40358 -30485 -32816 -61406 -71934 -59013 -111045 -178961 -55740 -45054 78795 192181
28110 192181 1715 -64909 -13971 -58074 -41647 73315 101677 30788 -57238 -47188 -33763
28099 -33763 42200 9147 -42530 -94230 -35482 32204 84716 185802 225629 173460 203875
28088 203875 197656 106221 -24047 -14466 8397 -109169 -47221 -79782 -80892 -2939 52395 47059
28076 47059 76194 89219 109105 35898 -29102 9695 -67539 -74537 -53895 55488 176452
28065 176452 70591 50514 43843 41558 -10372 12896 36649 58290 75965 34457 -28762 73708
28053 73708 96974 118138 106071 92933 143816 218929 198304 123822 59219 -73328 -93536
28042 -93536 -2714 45 -14938 -6103 73770 70561 51891 -37766 32728 13328 43134 67287
28030 67287 70133 105441 149939 109344 199031 80289 45638 27654 18087 -1656 72535 169088
28018 169088 231768 256205 186872 102339 -50439 13962 139634 215982 267212 301649 258697
28007 258697 136039 54099 -50104 -35329 -19040 -48480 34568 73518 38944 -22822 -4283
27996 -4283 18923 88835 128812 124123 162126 93857 -12940 20833 80874 76023 24099 21363
27984 21363 56765 -60432 -26959 -22936 -52569 -86691 -39716 81263 92215 181989 271880
27973 271880 171796 -24044 -84309 -48186 32160 149172 92071 90687 179308 101471 91438
27962 91438 38204 -40110 -21720 63869 74949 9923 49132 3015 -13225 -55372 -142478 -192196
27950 -192196 -124303 -18062 -13250 11859 41246 74162 110495 104146 -39278 -88443 -90698 -35766
27938 -35766 -70230 -146108 -97214 -58761 -71820 -63732 -81535 -61788 67632 23541 16532 -46116
27926 -46116 -18989 68976 28244 -14069 10973 59038 120289 157034 147691 -7663 -92254 -118392
27914 -118392 -16346 73832 132579 206686 307143 216325 138683 122795 37402 -24693 -152844
27903 -152844 -212151 -170494 -146306 -151817 -168820 -75244 -27740 -15191 -22863 16553 77712 -11940
27891 -11940 20379 1467 -60118 -79206 135731 176897 127766 -8520 -120476 -174851 -129986
27880 -129986 42018 41265 41794 82304 15793 -63042 -39773 11679 -99705 -176734 -135010 -93588
27868 -93588 -4302 50137 39632 47056 116124 69517 -18658 -69723 -82873 -17422 -14177 -34144
27856 -34144 -36997 83688 102999 49108 -21435 648 -51510 56285 59349 46027 151117
27845 151117 161181 83701 2402 1928 136155 130325 93963 39841 27550 5733 -58004 19554
27833 19554 39488 -53899 -51070 -8477 22991 61368 49021 131439 98909 42630 -27477 21849
27821 21849 136985 93602 58131 132041 180707 252978 218136 111848 146209 203743 149008
27810 149008 137539 143031 94346 67408 114371 120431 50475 19485 -50266 -54400 -57787 -56957 4582
27797 4582 -18165 -53836 -29171 -65530 -84701 8307 -6529 -62037 51374 103291 19619 6132
27785 6132 41472 73271 76753 -8336 -26611 27061 109192 -34635 -99255 -44453 2518 -30978
27773 -30978 -35389 36806 16689 16885 13796 13057 -64370 -80273 -190934 -77312 68963 196409
27761 196409 175001 146523 101352 64232 82213 107029 93074 56762 -49960 -86449 4318
27750 4318 -9954 -73259 -58906 -5447 22959 10019 18988 73733 96477 59110 121066 166662
27738 166662 139396 137415 64536 -18598 -29943 -58286 -168180 -132828 -119892 -87223 66355
27727 66355 72598 38515 -23450 -8070 576 -97270 -118844 7607 -122088 -161670 -99453 61018
27715 61018 90891 -46100 -119032 -131872 -232179 -306521 -276797 -186389 -128249 -103976 -200672
27704 -200672 -220220 -156117 -78175 -74808 -102561 13426 44343 33880 40318 66039 23529 -2732
27692 -2732 -68912 -116361 -108995 -4700 95857 249689 265407 59066 -19875 -73824 -15827
27681 -15827 -19177 -26757 -28033 18924 -23535 56255 85126 67498 29447 -12282 -92162 -105853
27669 -105853 -30474 -57335 -22359 59012 9749 -12996 -3597 4064 -2661 -108755 -136302 -64213
27657 -64213 54372 72411 48390 88322 58273 131167 120269 73944 -818 53702 200122
27646 200122 317651 222295 86230 20399 -35401 960 90571 72992 -91613 -60309 29444
27635 29444 191167 238733 98421 13265 152563 315190 251927 127812 -1400 -112822
27625 -112822 -82501 -149678 -269939 -197173 -156644 -85481 -77971 31952 141554 134465 8767
27614 8767 1955 3800 -27712 -85022 52310 63457 71598 -51535 47480 163115 124713 106323
27602 106323 -23531 -76658 -17033 -144651 -131606 -91686 45927 120721 164013 188062 134306
27591 134306 -10588 -10654 72936 164166 84260 -65522 -108969 -154676 57896 154870 187142
27580 187142 133623 186429 195423 114545 50379 -21284 -34228 -87102 -117030 6047 -13336
27569 -13336 -30745 39287 225110 266641 143394 -40142 -174587 -71049 28172 45469 113137
27558 113137 147344 108009 98256 46789 -29730 66377 186194 274335 298958 254031 206250
27547 206250 178033 17308 -50081 -128464 -180335 -190126 -35872 78166 18812 12763 119114
27536 119114 4808 -42504 43619 -5069 -62168 51304 75238 128798 215916 302957 131094
27525 131094 51475 91248 73802 13872 -101679 -97401 36179 88716 117276 8797 -24686
27514 -24686 -76829 -79089 -251 12700 -113878 -31527 24199 21294 69274 50257 71684 133832
27502 133832 82796 -39080 -37867 34108 58599 17443 -96539 -190777 -218302 -179834 -117806
27491 -117806 -71759 -12085 47779 146355 147354 127959 164599 63506 125900 108162 -46889
27480 -46889 -73765 -53589 -6322 -115382 -78433 -162309 -199639 -167950 -179136 -166719 -117395
27469 -117395 -132319 -168570 -112641 -128810 -145583 -34231 93745 183267 97756 -41799 -57978
27458 -57978 -54966 -144803 -196183 -116951 -67929 -35754 -63996 -42312 -62921 -125289 -113337 7803
27446 7803 -99082 -10787 142998 141159 33347 -24780 62701 154955 160332 91230 -15449
27435 -15449 56741 84183 115041 166617 252095 110922 -42422 6736 -57951 -23435 54770
27424 54770 151244 192010 131161 44386 106858 187780 212557 267741 258895 260307 279426 365064
27412 365064 286913 148129 220629 292191 250635 222747 133405 75196 -13476 -48719 -84748
27401 -84748 -173843 -152081 -97483 -61996 -130751 -107650 -52411 167 -9565 12714 77665 56989
27389 56989 -42084 58977 80665 123040 154029 207100 186856 255209 220776 149202 92572
27378 92572 79330 -269 11612 128412 96502 8375 65448 -11131 39797 -13215 -177467
27367 -177467 -126905 -76850 -83376 -70140 -25950 -9403 -82296 -160952 -77727 -127351 -71199 -23770
27355 -23770 -74956 -120103 -112856 -160085 -104729 -113208 -132449 -47331 49561 171664 264776 160885
27343 160885 170142 167220 69503 -30169 -75181 -126292 -58037 -67590 -422 125975 152588 105883
27331 105883 146362 -26357 -159727 -145126 -20015 0 111261 137817 146078 82241 82803
27320 82803 44921 101294 83178 98136 83042 311 -36249 -11797 49184 118543 169566 94569
27308 94569 120332 13450 -11781 20497 14656 -37769 -80596 -100048 -207416 -236632 -137612
27297 -137612 -39712 -130413 -49459 52271 9824 -76591 1046 38710 124953 117469 -2678
27286 -2678 79490 168693 126268 -27979 34393 115634 14906 46551 83442 127505 67508
27275 67508 -41396 -33699 41475 78952 62775 -53071 -14104 53025 128189 82109 73300 105769
27263 105769 60326 30266 -2021 43047 58124 108702 -1957 -68905 3375 -8005 102360
27252 102360 -25502 -152254 -19808 137269 90166 13636 15885 18311 61101 -1798 -74585
27241 -74585 -80688 -40596 -72158 -151511 -51544 -2733 42301 13621 -37319 -4147 -23817 -120490
27229 -120490 -173591 -121290 47307 116429 102175 114533 52484 34650 110640 128806 112170
27218 112170 67633 42803 17351 -29325 -37931 -74122 -68983 -16783 -43867 -68999 35465 198370
27206 198370 212582 189453 141295 100783 27802 -18649 -83324 -48421 -37399 -114794 -184675
27195 -184675 -80427 14001 41651 58221 120721 178195 162288 164698 161249 285871 379524
27184 379524 225267 51034 -53646 -80129 -28796 -107640 -188777 -111634 -57809 -63085 -75828
27173 -75828 -161836 -222624 -131272 3762 42874 147628 168170 105012 90838 137303 171496
27162 171496 90969 66336 142592 124578 167828 144630 50541 -6140 -39216 -105519 -74196
27151 -74196 7779 83031 93989 128052 177991 211860 149825 64150 8175 -93299 -3886
27140 -3886 44271 72214 105363 165109 130028 177092 187645 83199 35582 75683 66712 -68944
27128 -68944 -133357 -70020 -5510 -76675 -170064 -220916 -185970 -137672 -66109 -117978 -171118 -107463
27116 -107463 -11357 -21099 -19942 -91889 -10276 40357 60702 49667 83402 15174 -23061 -30086
27104 -30086 39099 7521 68447 67611 63874 50237 81143 102283 99175 89878 127764 128349 43226
27091 43226 -16796 -28011 -63742 -144009 -123550 39079 45785 15562 -50059 -20509 32916 13651
27079 13651 79218 89308 145646 211203 -20425 -147130 -130995 -117165 -109407 -72799 24617
27068 24617 -11393 -86391 -8382 114586 159076 259976 231601 174302 97090 -15810 -22043
27057 -22043 -78535 -75312 -70792 40695 90864 35010 -4060 -47354 -90248 -51540 76487 -25711
27045 -25711 -76007 -66919 -38836 -74731 -104060 -40744 -22654 -1735 -27866 -59498 -99959 -13871
27033 -13871 -9707 -61817 -164731 -188823 -101402 -109841 4592 130271 134251 61284 7369 -3369
27021 -3369 -3573 -26661 -80736 -54401 -3450 -32780 -25057 -21106 44506 57759 -3552 -109460
27009 -109460 -177316 -79682 -73959 -33714 10276 156776 123438 -58956 -9953 22866 -2028
26998 -2028 -26600 -17505 23333 36266 39808 38905 144305 126331 77885 14610 123417 115887
26986 115887 93779 137077 129383 38696 38897 180635 240026 235626 156599 76428 -37690 -25648
26974 -25648 -34734 25698 24267 -43556 9624 48645 136996 171910 137303 125412 63391 22483
26962 22483 -44043 -96593 -68447 -150803 -125099 -166329 -169286 -39395 64359 156416 78995
26951 78995 -51173 -157975 -150887 -15420 146414 136626 104014 102260 80717 53360 37849
26940 37849 42900 61529 85356 114776 23894 24864 34103 122999 230306 170397 42929 -3206
26928 -3206 19307 -45791 -4689 32291 68024 51376 -31689 -24364 95853 129843 66215 96538
26916 96538 158439 76667 57112 -34601 -167185 -108397 -80392 -31567 -33492 -50503 -42161 18250
26904 18250 14025 -36660 -51500 -20407 114132 95127 75951 153198 163741 89618 55995 37454
26892 37454 -21553 -81682 -214863 -233395 -145688 -109500 -20455 -7748 -127990 -97277 -164589
26881 -164589 -68311 -32860 -66416 -61917 -124980 -65868 13420 -42431 39644 -40266 -75483 -8946
26869 -8946 92399 138328 73122 -193844 -222090 -73222 -39194 3306 87019 66103 12677
26858 12677 29403 151362 93376 31120 10983 47530 36799 166975 16531 -54635 63533
26847 63533 -64170 -81708 -28999 59099 134967 -39626 -116929 -100411 -187332 -241244 -236344
26836 -236344 -141135 -110358 -94204 -97747 32169 102326 110806 109768 91422 31450 102786 118629
26824 118629 161155 32150 20460 -39873 -89373 -141115 -208069 -204003 -120077 -163412 -65132
26813 -65132 -9917 -74721 -115546 -48972 -73522 -68463 -105780 -54185 51488 63344 -4624 -23161
26801 -23161 -48746 49808 78313 183930 107826 -22385 29689 130062 130501 120720 -53630
26790 -53630 30239 194505 226962 183203 85810 57966 49676 -47374 -101762 -104913 -125951 -155479
26778 -155479 -52962 98795 19214 -13766 -21404 76626 -7681 -204541 -136873 -8266 14725
26767 14725 -26335 4440 -67113 -84604 -86849 -60046 -48339 -36399 -102256 -115282 -204394 -150014
26755 -150014 -29149 -104103 -81361 9702 168705 150832 213877 117210 -45420 -44144 69237
26744 69237 152277 142477 151126 6559 -21953 105409 119876 161151 120682 43004 -8858 -12060
26732 -12060 -120583 -199207 -106477 111564 259707 212359 231164 149751 83393 101516 56810
26721 56810 58395 156155 154477 -15075 -100304 -79254 24012 193622 280906 219991 173429
26710 173429 67624 32168 129412 186994 52925 -52932 -119695 -86524 -101352 -96398 -21594
26699 -21594 -64992 -106832 -27422 -11791 -48779 -110404 -113956 -124002 -79268 50700 77477 79812
26687 79812 16638 -22049 -28960 40022 -15408 -84688 -120470 -93426 -161 82602 41311 -45392
26675 -45392 -81443 -28175 -30560 -20005 -67269 -137092 -113356 -218774 -162282 -40523 -60346
26664 -60346 8252 -27527 -181727 -141917 -113984 -127362 -192410 -78370 -48029 -39874 -14875
26653 -14875 -24419 -104772 -158660 -144623 -71590 -35411 -134086 -73304 -53086 -94295 42366 57376
26641 57376 50409 122329 103715 148489 121606 45637 6621 22060 47961 -63667 -121021 -251494
26629 -251494 -246117 -96970 -64737 -65910 -13143 -60355 -89120 -64720 -15734 12210 6305 38901
26617 38901 102722 58890 -52405 -72329 -14245 -50535 -168178 -170743 -124489 -139545 -156811
26606 -156811 -185035 -95973 -2361 106212 72754 58286 116363 156971 126297 83815 83325 69368
26594 69368 12954 -55585 25656 180504 269329 185653 91232 10246 -54799 -51642 -12498 40472
26582 40472 18962 -79452 -163422 -167569 -83444 3150 139101 79716 -28903 22781 169120
26571 169120 164406 96848 137816 97559 15322 18848 94978 101648 114598 130797 138213 11668
26559 11668 -59352 -54127 -18424 -34967 -7180 -3714 -79928 -140600 -147237 20262 134198 149102
26547 149102 132010 115793 77480 1997 -72279 746 15657 -41286 7928 -78876 -106035
26536 -106035 -78210 -174575 -227106 -156847 -34318 157644 146434 154558 61796 -45132 -141465
26525 -141465 -140159 82 76543 -29846 -14843 33319 46039 79656 199902 284467 260085
26514 260085 221336 186905 206345 170867 40025 -4927 -64493 -52602 33296 26389 39751
26503 39751 258249 256223 121433 -19243 -123280 21525 152608 180522 89740 26803 76352
26492 76352 87411 112720 168701 146012 121280 103739 66045 -19195 30766 115236 150171 142159
26480 142159 38269 38715 -48747 -133538 -56829 -30851 -28202 65750 155803 66784 141157 133972
26468 133972 70282 71233 50801 175705 389471 365370 239794 155920 67282 160217 227748
26457 227748 166485 60604 -35849 -38564 -54158 -76568 -91866 -66910 9359 59927 -21241
26446 -21241 -2410 -5056 -24243 -66725 -42521 -29527 -6880 56815 148956 136257 84388 -40244
26434 -40244 -103321 -32706 63010 113792 38320 89383 181559 211009 125934 91281 54949 36408
26422 36408 71092 113110 61472 -8758 -58418 -147466 -175840 -263280 -203330 -144348 -13427
26411 -13427 88181 93506 75621 35672 71462 -2602 -40460 -94679 -135911 -113106 20746
26400 20746 86345 115157 176546 117551 47988 56859 9224 103014 87050 42860 47302 1811
26388 1811 -76422 -99477 -27155 36420 -32501 -48115 -26161 56326 157114 160125 163461 174782
26376 174782 109797 143909 118741 164770 294802 254511 163665 94721 90890 178349 188114 168085
26364 168085 165165 203449 229950 157937 141505 185324 51097 41195 -53937 -128940 -140623 -76782
26352 -76782 167332 287226 226734 21032 1514 -12121 -67587 -157784 -259464 -164457 -75540
26341 -75540 4821 -44467 20043 88251 -314 -4430 116422 175040 97618 -43823 -84944
26330 -84944 -100438 -46262 -24350 -127393 -137588 40345 109577 142262 85792 140613 187732
26319 187732 137382 97392 117693 187469 127574 28658 94052 -10588 -179784 -125167 3541
26308 3541 -14227 -32115 34133 -15195 -3493 61405 99756 43999 45941 88275 96397 -4261
26296 -4261 62094 204289 231902 167857 89216 -94165 -134065 -58830 -51694 -112280 -117640 14814
26284 14814 -14832 58039 -9757 -81605 -2887 -70637 -157710 -63243 -52731 -88225 2202 58612
26272 58612 4889 -34013 -14714 -55079 -99888 -101997 -174468 -190627 -80113 -93688 -66490 -20559
26260 -20559 -7063 -21306 -7410 71265 -9839 -24830 23954 103796 200263 140504 307
26249 307 -56322 -3686 8342 -85832 -9161 154120 141518 59796 72838 -42105 -97063 -77027
26237 -77027 11614 -3057 -26471 -108063 -105148 -42555 -32820 -41595 32107 15196 27556 31641
26225 31641 -95347 -162132 -75694 25377 102337 209999 195894 177325 83530 3241 -34119
26214 -34119 -11221 21814 25555 75039 115893 102932 134061 173020 117124 58440 42140 15057
26202 15057 64839 22376 -104348 25049 61492 59470 87720 83848 113335 150929 63009 -27509
26190 -27509 -65824 35472 -16398 26912 19105 -92644 -73882 15583 82748 66381 -3638
26179 -3638 14999 13855 -61258 -68482 -17554 -8093 64912 20392 6018 37633 34152 -35916 -36279
26166 -36279 100490 176443 130900 80608 41156 -8912 -57264 -20110 109239 155309 104129
26155 104129 92324 27763 6213 -16432 55966 63792 75268 -37197 -63782 -28437 -109234
26144 -109234 -194512 -90287 27879 113654 56025 -53265 -44048 -13994 -93352 -93534 -115414
26133 -115414 71597 200158 148213 516 14396 45616 -69696 -125133 -30886 66091 175120
26122 175120 142464 153416 180690 76984 52590 -27631 86050 127499 111021 210735 263425
26111 263425 214284 188293 207857 157167 84454 45047 56820 111558 43755 -39989 -78627
26100 -78627 -114821 -90044 35784 2671 91098 62982 102540 57409 211486 200530 160496
26089 160496 58620 86156 70076 11277 34337 66146 149691 152587 172681 111202 85319
26078 85319 5065 -44074 -18445 3009 -55612 -99124 -127167 -107028 -100630 -93523 -32966 95163
26066 95163 178625 196301 152426 123409 -3236 -25214 -151706 -226321 -172442 -142416 -84130
26055 -84130 14737 -62185 -79889 -88733 -53923 84944 142519 11624 -43048 -21402 -122732
26044 -122732 -113896 -89736 -114237 -114600 -119848 -51551 37180 -22990 -15177 20556 -78251 -166528
26032 -166528 -119157 20444 106428 121993 199021 178693 131109 91780 123364 176235 39527
26021 39527 -63197 41939 63968 64918 268448 226013 63587 79582 70748 167468 208335
26010 208335 1444 -88696 -115069 -98143 -89239 -121246 -52624 -36731 18508 54253 13816
25999 13816 37915 82659 150632 217891 172959 170784 204783 195620 213181 166099 215170 227607
25987 227607 191841 31570 -71582 -130786 -178653 -191886 -217055 -198128 -211683 -101020 20372
25976 20372 -17824 95706 112658 -40941 -165300 -61948 25849 101124 143085 205629 194183
25965 194183 86252 -18336 -124954 -23567 71184 53192 97287 107553 56992 145205 130202
25954 130202 82657 54216 19804 -55441 -46478 -98164 12038 251245 253739 189293 100008
25943 100008 -18745 -69988 -95013 -168128 -101005 -68471 -71699 -95230 -57765 53102 56595
25932 56595 -19340 -74640 -71094 -56529 -76395 -99312 -104573 -54429 78165 194349 232601 249560
25920 249560 224530 33733 -103056 -40224 82576 147794 111435 104189 -11180 -5537 91800
25909 91800 -36936 -176452 -58694 -10618 75487 -45215 -96982 42930 106472 40205 -1401
25898 -1401 -19908 -35788 23252 -19161 -51156 -20754 -87831 -8405 -40810 -150929 -120550 -24986
25886 -24986 -12181 74426 203047 115319 50169 114438 -35439 -79905 -79049 -52463 -57351 2730
25874 2730 -13583 -48391 -48926 -57816 -204852 -211084 -206862 -144503 -119681 -186724 -137773 -112294 -102062
25861 -102062 -36536 68276 206727 242928 141252 140943 191816 199469 113842 12264 -90034
25850 -90034 -38332 49461 -46779 -55766 24696 -2195 -15624 150073 211972 180512 114830 25667
25838 25667 45909 13005 69647 76873 -102860 -54173 -8920 -114395 -145593 -142226 -151243 -64854
25826 -64854 -26893 58144 54577 52534 -82491 -80248 -105149 -128948 -148009 -82466 -6553 17371
25814 17371 -13869 -97525 -50868 158050 159132 131060 157421 119061 72792 -23319 -115289 -174385
25802 -174385 -232767 -118555 -50306 1376 28315 35837 35260 -15034 -31284 53546 61283 24572
25790 24572 -72654 -50880 18191 54546 99641 137029 140807 169290 136604 145239 96318 24832
25778 24832 27487 72930 -57118 -137700 -94042 -41288 31222 101966 164583 208754 142194 87928
25766 87928 17907 -28007 -31930 7269 102467 114543 51747 27051 27290 13363 -70146 -8769
25754 -8769 34639 60319 92275 46575 -20653 -8240 -730 -51697 -54012 -27227 33171 -57053
25742 -57053 -104219 -64343 -42884 83398 80008 59219 129398 210551 153287 77170 84041 110470
25730 110470 6120 -65238 -34316 -37859 -9206 79464 79901 -9082 -17087 36418 34226 18
25718 18 -881 47647 18839 -51197 -54594 95424 62638 81238 135452 81832 77022 98777 62917
25705 62917 38739 9324 79651 148308 90133 65293 37393 -62992 -102648 -101166 61540
25694 61540 138073 154376 280885 355822 303601 227637 182127 171073 43867 23489 252749
25683 252749 316599 178219 172135 159987 193273 180621 157804 34910 -11729 129071 81226
25672 81226 114140 140121 84765 -65862 -58917 58404 84328 245 -9144 14754 24400 12404
25660 12404 -99315 -123102 -113190 -74955 -11265 65847 120752 226935 226710 156110 15640 -136514
25648 -136514 -271765 -176562 889 58442 28816 -68536 -63653 48292 176697 254032 203264
25637 203264 -6837 44319 52090 61826 -34910 -108217 -158940 -98753 -232487 -176376 -25540
25626 -25540 27319 34312 -9718 19742 50413 43243 -72986 -77476 29192 -10556 26532 107872
25614 107872 45130 -11462 -82678 -116760 -144302 -138037 -62801 -89588 35431 83119 102168
25603 102168 90476 -91945 -69778 60998 47135 13604 5398 28199 -71418 -107658 5260
25592 5260 206810 258758 95975 -57641 -187570 -233446 -157934 -78825 -40725 25087 41295
25581 41295 2757 43826 159448 201518 239139 300434 257732 73484 418 -12564 -66968
25570 -66968 -100030 -153761 -149498 -150410 -37653 28149 30386 81888 129830 141708 67932 154779
25558 154779 163915 113873 58693 82138 28103 -43094 10944 165504 264835 257118 118443
25547 118443 -25505 -65390 107273 174970 119252 -16223 -22137 83367 51724 -29126 -42923
25536 -42923 -43760 53265 -12898 -130441 -71659 -19396 -94086 -47830 -27674 -122542 -138841 -103005
25524 -103005 14448 85978 18062 35377 68641 99993 157671 156417 133958 189027 120035
25513 120035 -7613 -13893 83780 45303 9632 -4381 15990 100999 161612 -4539 40130
25502 40130 73728 113365 121340 101120 152880 70443 20706 75859 141914 210606 186946 97015
25490 97015 55848 59868 -16600 -87081 -31863 -28317 381 38657 132584 277958 354308 347523
25478 347523 312707 281154 341551 248458 172940 -39623 -189612 -153117 -66903 -88253 -3906
25467 -3906 81135 32694 -57593 -71001 -8923 -90324 -104017 -63256 76863 154879 -49656
25456 -49656 -89142 13660 -32049 -117893 -182432 -79065 101654 52123 49096 61874 -78472
25445 -78472 -63333 22901 -94044 -57416 64670 39917 -73895 -61971 -16157 -169772 -182212
25434 -182212 -70667 -89866 -131682 -119551 -132627 -64110 -4361 -957 -5186 26155 60469 39590
25422 39590 -57449 -130438 -47324 72220 96184 -83597 -112441 -83310 -90068 -124764 17476
25411 17476 62660 47601 -44592 44466 133454 93446 27744 37390 74859 -20938 9581 126824
25399 126824 56863 29383 -4829 24238 40747 -12160 -86510 20773 72062 32115 -5673
25388 -5673 4909 53183 -57118 -90985 -116193 -54936 -43548 -113529 -78264 -24826 6128 11850
25376 11850 -56325 -69811 -84027 -119035 -129286 -210341 -53234 57448 136317 229346 208288
25365 208288 -38724 -147462 -25688 2694 -21450 -915 65941 175856 190271 189021 184545
25354 184545 160893 93014 65825 126879 39263 -21948 -7289 52882 110800 162555 57598
25343 57598 6035 -174841 -221128 -127895 52143 32582 -35267 -44595 -15952 102704 92394
25332 92394 -37047 -108359 7379 115073 169801 179375 96971 16139 127673 92568 28040
25321 28040 27986 83549 87927 108174 230454 185373 124697 182052 223413 198422 136761 87626
25309 87626 17209 44887 82832 65896 148989 238120 161735 3312 -26036 -42744 -15601
25298 -15601 -1348 2353 36325 79918 -2840 28319 30422 -83577 -55615 21808 103558 121102
25286 121102 125843 46782 4802 -156340 -131167 47014 72692 42216 115014 170398 211683
25275 211683 77205 87157 63577 -29575 26090 15576 -97176 -160406 -179659 -139609 -199194
25264 -199194 -163457 -138536 -167226 -110574 -115913 -80438 -14992 36526 126345 56461 41855 34075
25252 34075 82666 108829 -1949 23205 -45456 -3844 -19381 -123305 -208285 -354065 -398919
25241 -398919 -183048 -55245 -67457 66082 39726 -59522 -105573 -76749 -119039 -83052 -54212
25230 -54212 74997 117873 61710 47901 46985 88872 -18006 -37311 -9010 -13459 4081 -73713
25218 -73713 -181633 -156196 -190793 -151562 -95943 -54845 -138513 -125860 -183521 -167744 -193190
25207 -193190 -39328 -21414 1029 -20640 -121328 -141928 -66076 64034 121164 94208 74109
25196 74109 127475 110853 94668 78225 -157754 -165196 -129049 10711 82597 21537 21404 13670
25184 13670 -15672 -82268 -159586 -191710 -109504 -26260 1463 -41117 -25653 67498 119174 264074
25172 264074 217860 118335 -13496 -39882 -8176 -11104 73166 117556 128532 71435 97319
25161 97319 170647 138018 133566 82393 -27312 -148229 -209214 -138548 -36163 60986 130438
25150 130438 146768 53504 -9412 50295 -10537 -2569 36029 -44638 5913 14949 4317 -101823
25138 -101823 -160062 -147615 8195 45439 -20133 88949 157370 95431 -24337 -58319 -42610
25127 -42610 -22233 -84177 -49455 60102 136094 134782 81669 161810 100287 -45789 -86958
25116 -86958 -205142 -263792 -163507 -34304 -66544 -72261 6229 47615 34193 26949 150424
25105 150424 267278 260543 80653 127313 179034 120669 98717 44009 -30744 33005 38810
25094 38810 45316 77209 16023 76329 39397 42489 107708 41848 -119985 -150873 -83971 -30059
25082 -30059 -52599 -124543 -180762 -144749 -94791 -65211 -99166 -89771 -53958 -76168 -1062 103210
25070 103210 7414 -172446 -286399 -202908 -137987 -68711 -25478 45151 102605 50151 -41605
25059 -41605 -103674 -127659 -156515 11713 65280 22130 150370 204897 90408 -34628 -73720
25048 -73720 -107093 -36387 -12322 33746 92835 5241 79093 111609 75441 110912 31585 83688
25036 83688 101312 8838 -78639 14998 108203 113294 3799 -73229 -139227 -136024 -53200 -37998
25024 -37998 -91917 20112 185213 153760 178943 191839 117063 12442 -22193 83141 81275
25013 81275 27052 -59618 -128109 -54427 16310 -11943 -60928 43547 80372 120574 177676
25002 177676 182765 -51307 -84825 -50585 62551 71803 -26947 32361 65029 89994 74459
24991 74459 10942 -36202 -147241 -223678 -123247 43786 62936 45440 82735 -56574 -74501
24980 -74501 -83927 -47911 -36274 -50118 -16377 45249 49193 -12824 9644 -51065 -140451 -15975
24968 -15975 -22691 -21888 39844 38611 -13833 -58133 -67054 -70646 -63202 25337 128211 103661 -16364
24955 -16364 -175615 -227880 -138012 -77747 -71982 -57175 -117888 -85576 66056 231079 215619
24944 215619 111757 24995 124091 220274 108329 -72698 -225330 -237331 -126502 -38654
24934 -38654 -63725 -31222 -11829 -36057 -7 -52601 -109961 -77455 -100025 -155669 -196585 -214933
24922 -214933 -173240 -157527 -80962 -110944 -140607 -49628 41024 107171 118708 79866 63695
24911 63695 15749 70171 98863 27324 -51971 -168 56746 46776 29940 118454 184811 219732
24899 219732 136381 107520 164862 218246 105130 68045 28859 61949 93459 175303 74258
24888 74258 87612 182785 216321 232554 254818 162884 88208 -30874 -83491 -133772 -138437 -121458
24876 -121458 67975 150348 98509 137681 115417 46860 62428 5654 -134424 -173773 -146428
24865 -146428 -144360 -98630 -32566 -21720 17365 83504 -6837 -71176 -82215 -167755 -220707 -268161
24853 -268161 -174377 -38605 56893 110845 129944 129633 92618 114868 101878 109400 -31896 -163313
24841 -163313 -215582 -141679 -36471 -32307 -137783 -214629 -119157 -27409 50942 60546 21010
24830 21010 35013 -19026 -28172 -39933 -64267 -48675 -63754 -41115 10568 112326 62909 41755
24818 41755 6799 -81473 -22541 48965 -908 -176036 -199601 -149722 -112721 -52402 35885
24807 35885 104573 73062 -50419 24350 78002 170431 138550 -10080 -116549 -86930 -125056
24796 -125056 -52155 68892 -18879 -91127 -182839 -82507 -180580 -217544 -150889 -149607 -264682
24785 -264682 -298609 -248340 -142278 -67090 76815 87028 -65996 -37419 40070 78589 46589
24774 46589 71539 97597 132230 209916 168175 27574 -77262 -37207 56151 28269 22772
24763 22772 62863 100708 146774 184818 139191 -7903 -55782 -101628 -120740 -180027 -91807
24752 -91807 -17328 -70370 34582 58366 56661 124205 182486 203874 185936 173506 224171 219015
24740 219015 64657 -13720 73414 212426 297552 196725 29593 -84585 -12402 82500
24730 82500 86442 85431 34853 92226 59343 -111201 -320861 -287828 -365973 -367332 -252537 -102859
24718 -102859 -33332 -48797 -11742 49258 42423 -39784 -56746 -58720 -10674 24389 35822 100616
24706 100616 162226 231766 202545 184100 122488 47134 -74122 -108863 -52742 -5736 -38419
24695 -38419 -67106 -167608 -187001 -87020 -59182 -122004 -48497 20348 2616 -69295 -38989
24684 -38989 -18354 37584 30851 10239 -28750 -56347 11526 23102 61876 -6 -29449 -109067
24672 -109067 -265759 -297396 -230211 -262042 -236284 -44601 178148 214345 160551 102537 80458
24661 80458 -12284 15178 129573 126566 -3552 -84931 -36547 68356 -41616 -97769 -62924
24650 -62924 -18826 8920 3592 -63846 18308 55504 -6533 50185 23244 14844 -25903 -16751
24638 -16751 -4602 -59944 23003 75985 87928 -51293 -177868 -5939 113088 79852 30007
24627 30007 -59495 -109931 -63599 2669 -59309 -52118 -59852 9412 41382 17446 -72456 -21945
24615 -21945 147995 270845 186214 153213 197450 141583 98663 46637 74816 74516 22810 -82664
24603 -82664 27043 78621 -29772 -162161 -159700 -178088 -97910 62825 56666 -58549 -133155
24592 -133155 -126586 -80013 -20250 -42410 -12190 -13178 47361 105002 194670 216665 109573 79233
24580 79233 -16705 12394 2409 -32117 -180944 -206723 -220702 -239529 -263285 -132164 -35121
24569 -35121 -44102 -92641 -41475 24159 19036 65997 100017 161294 117027 2417 -40759 -90498
24557 -90498 -10340 14710 -6100 68097 94500 75788 -25004 -186622 -208073 -229669 -203808
24546 -203808 -186988 -247260 -211471 -178144 -207316 -179024 -64334 -22569 -145578 -220113 -163847
24535 -163847 -120956 -55626 -14682 -79385 -92317 19998 -3106 93981 144635 81285 20155
24524 20155 -29682 -193027 -122995 -32218 32921 35777 130994 134037 41859 12206 -28254 -3935
24512 -3935 11708 -69288 -36280 -32592 20076 -76986 -70597 -83047 -134484 -11849 -35575 -74647
24500 -74647 -27559 -76189 -30257 -49796 -107754 -149427 -179974 -223007 -185520 -182097 -125908 -20439
24488 -20439 94013 76320 -20132 -86623 -124354 -101791 -68010 -85352 -126328 -105732 -19461
24477 -19461 -10736 -141993 -67609 7556 -39208 -69909 -87800 -122085 -117645 -15233 -119656
24466 -119656 -172973 -175807 -173709 -133372 -105315 -115847 -174896 29281 119441 89452 23265 -7524
24454 -7524 11811 67740 81401 -9512 -68294 5175 11700 -53098 -88383 -65888 -92794 -107702
24442 -107702 -104457 -45056 43739 -96053 -184098 -112461 -79611 4719 62711 31438 72259
24431 72259 141601 142128 19971 -46377 -143330 -202196 -113683 -74568 -133402 -66575 -20773 6263
24419 6263 -98817 -59962 49006 14599 -83459 -207995 -200280 -77895 23994 -43772 -60074
24408 -60074 18664 67258 53585 146438 145612 47666 1474 -3202 7930 -7163 -83669 -75484
24396 -75484 -36248 -217 -21747 5694 436 -63904 -107545 -5228 44098 92066 25208 -49633
24384 -49633 -126701 -207345 -89211 27600 99284 115656 187112 181613 18239 -760 80278
24373 80278 84195 -35090 -173950 -150363 -44133 -17764 -26272 8340 23962 96306 139905
24362 139905 76621 41272 118213 78465 -22290 23439 20036 -803 7546 -133462 -158670
24351 -158670 -135988 -22583 148778 163984 75577 -8585 -106076 -35305 -661 6558 4716
24340 4716 12132 -107241 -153079 -138756 -77558 -79072 -113773 -136389 -107207 -151216 -150516 -252824
24328 -252824 -247767 -272707 -75703 58285 -18814 -160851 -195517 -22239 141396 151286 144639
24317 144639 156103 17385 95983 101039 143408 -27683 -201908 -134994 -104672 -106439 -179705
24306 -179705 -224339 -216970 -214645 -234306 -220601 -150676 -85567 -104520 -193370 -77632 104709
24295 104709 47283 -86190 -94592 -154853 -209918 -239339 -274983 -243465 -170666 -105144 66786
24284 66786 181996 191199 114803 19602 -70586 -106346 -21129 125725 198349 195298 166767 104820
24272 104820 66827 33254 21063 -70726 -49599 -31438 -16259 19304 28975 45565 5476 -73227
24260 -73227 -176337 -260892 -257631 -187074 -40001 -63071 -27931 63773 30901 64734 109422
24249 109422 -12141 -17243 32024 -105675 -130318 -75411 -126185 -176079 -59480 18381 25560
24238 25560 -51802 -56098 -27137 -8666 4673 14269 -59604 -57482 -1257 -64512 -44052 4819
24226 4819 -4114 -154609 -367010 -297743 -188565 -190508 -177980 -93194 -89748 -101461 -190480 -163312
24214 -163312 -139053 -48732 10769 32233 -1952 57209 -39325 -92964 -35682 2537 66975
24203 66975 89136 69484 109084 22363 -51830 59132 14191 -83641 -111324 -8983 54711
24192 54711 -9804 -42813 -115488 -123312 -199052 -181557 -71212 13397 71391 35188 -11808 40494
24180 40494 34847 -6546 -46646 -148795 -259505 -292981 -139518 -91701 -157427 -135152 -54744
24169 -54744 -11237 73829 112141 95576 81073 -18708 -118140 -158152 -94110 -72961 39334
24158 39334 40159 -94540 -148085 -174339 -138645 -109187 -24537 -25591 40414 91666 129015 -6720
24146 -6720 -58918 -78209 -75114 36981 132586 77838 -35123 33541 197666 292732 224312
24135 224312 57542 -15981 23593 172441 243870 179282 3549 -1878 69036 76477 -84802
24124 -84802 -129904 -58164 -38834 -67694 49545 45398 -79056 -70172 -66943 54975 133323 166082
24112 166082 144085 79228 12100 58328 -14156 48485 53816 87835 104787 135151 66022 -38925
24100 -38925 -12908 -44520 -36762 -44755 -32360 53794 173065 227148 124876 -8660 -1981 27460
24088 27460 45074 52593 26971 -17953 -12952 -103460 -133103 -59371 47022 122862 101576 13828
24076 13828 34242 -88832 -109951 -130293 -168807 -22639 86191 -37221 -21037 -6602 -91238
24065 -91238 -158091 -240615 -225878 -205774 -47797 16206 -178912 -179832 -277822 -193206 -83962
24054 -83962 -68118 -234556 -350383 -260107 -225688 -216093 -175954 -214871 -190106 -161159 -124723
24043 -124723 -43853 -123354 -145396 -26109 -53874 -74032 -67036 -62729 -138758 -189614 -104229 -35959
24031 -35959 -52406 -64353 -115410 -79068 -103861 -183176 -110021 -80895 -197515 -155241 -56575
24020 -56575 95543 206206 169398 141967 147360 97252 20383 -16480 -67319 -88310 -97151 -174563
24008 -174563 -83428 951 36006 28314 -74539 -2943 -2178 23162 48910 -1812 -46176 -96825
23996 -96825 -219062 -176691 -99150 -106657 -159598 -157763 -223497 -104767 -63124 -132587 -127564 -100119
23984 -100119 -22398 -54470 -32634 101081 -28839 -31316 -57435 -84098 -158686 -261531 -242993
23973 -242993 -198633 -243834 -152948 -75500 23380 37313 -40824 -46672 -30740 -31643 -80694 -21368
23961 -21368 75121 59609 110267 -216 -166821 -110689 -62324 -105611 -116136 -71971 101002
23950 101002 208970 269264 171376 80195 52831 11929 -49844 1517 33837 1892 127479
23939 127479 121323 15169 8075 -6563 -7231 66746 139207 126066 59891 114598 63692 62506
23927 62506 47629 93872 57345 -88238 -210153 -204507 -69018 -34160 -8931 54445 36904
23916 36904 -55309 -146079 -87718 -18177 -57075 -89427 83303 179252 112129 64562 83955
23905 83955 61028 -67512 -135256 -80971 -109716 -162418 -277793 -364920 -460265 -394637 -240117
23894 -240117 -99113 -238576 -284274 -146087 -132940 -161857 -181478 -85535 -39983 17883 -77210
23883 -77210 -41903 -97072 -13678 -2257 -47965 81699 83382 53307 33029 -55443 -13439 -689
23871 -689 -43201 -78105 -129489 -37944 -7826 4995 -108494 -57787 -15578 -51416 -11004 24262
23859 24262 13714 4279 15151 16793 56958 21691 29491 19130 60172 116249 61382 2692
23847 2692 -57031 27900 -35577 -97912 -130375 -102816 -42714 -20055 33387 -8792 -71136 -81966
23835 -81966 -84374 -122640 -52669 -38717 -102697 -10491 92566 70796 -29803 -162755 -61691
23824 -61691 55497 -29425 21785 48617 47985 68259 -32585 -31453 8239 -30712 -53324 -62087
23812 -62087 2301 80881 86530 -88614 -180258 -111014 -24096 -38324 -73898 -13847 -89005 -81916
23800 -81916 -1795 -35308 -90449 -64167 -90785 -155802 -218841 -215602 -170925 -125181 -121609 -153637
23788 -153637 -98676 8516 -63716 -104106 -202355 -120073 -86066 -110353 -72293 -155165 -193059
23777 -193059 -263510 -302060 -300147 -310491 -344886 -299957 -280300 -273771 -104060 -31008 -6677 23088
23765 23088 -45940 -103082 -115653 15553 -17226 -157513 -42258 141809 143494 113346 81397
23754 81397 69200 119826 135484 108024 81922 182999 167520 74904 14037 61887 125653
23743 125653 227492 122936 54069 53837 122277 27991 -77792 -44902 -100860 -76937 -19687
23732 -19687 -9029 -132721 -141203 -105389 -56284 70940 166856 153599 35081 -93419 -73404
23721 -73404 23501 206338 213133 130516 17498 -101922 -134056 -79282 -46252 106995 178723
23710 178723 233856 229493 233545 186813 45096 -58510 -61082 -8283 -15780 -62485 -33972 85135
23698 85135 40895 2884 114070 58308 -167169 -266416 -115186 5216 7873 -14492 -2684
23687 -2684 -74516 -15346 -23908 -88536 -80893 7999 107088 187904 180692 94065 32109 46423
23675 46423 25778 -63226 11256 115966 136243 -69520 -125215 -103882 -41440 38523 66261
23664 66261 47422 -10046 -16721 -63558 -54823 26447 88053 -40654 -148403 -7345 39310
23653 39310 41737 -18152 -112216 -118698 -137588 -100745 -152136 -195136 -227437 -171933 -70336 37148
23641 37148 34101 -36337 -55381 -84399 -91605 -85973 69933 61591 -13672 66487 101232 33065
23629 33065 86693 74211 17027 -23532 -26610 126516 71838 4510 56502 8828 15190 -11086
23617 -11086 76915 127432 110441 109317 113211 64181 2075 -8789 -12290 1370 1595 66014 11528
23604 11528 -7118 -3136 40607 34073 -116540 -144539 -102312 -86390 -158319 -136816 18574 23594
23592 23594 31791 -40033 -114934 -162969 -80790 -38163 -132826 -120382 -106594 -162139 -205773 -221970
23580 -221970 -108860 -23124 -51701 -77162 -73146 -76743 -175301 -115573 17170 -55407 -17602
23569 -17602 -35852 -11647 -173734 -182402 -171036 -124423 -113755 -123309 -31481 59448 148640 49321
23557 49321 -39372 -84146 -17718 40575 28714 -26563 -44491 -137809 -141716 -196533 -115911 -41601
23545 -41601 -154481 -218787 -224136 -175257 -138777 -83660 -53720 -127744 -138886 6999 65445
23534 65445 87055 51068 120525 36752 -537 27706 44527 67426 55889 -35109 -41882 -10330
23522 -10330 -14617 -18837 -190674 -149782 -75844 -75762 -89572 -36026 17963 -55180 -43837 -133902
23510 -133902 -276328 -254735 -83567 99812 31168 -29745 -55892 -49399 -95308 -185142 -107332
23499 -107332 -13430 -41014 -22563 -40312 40312 147509 133141 105536 107748 81102 10047
23488 10047 -18450 8794 34839 -120856 -170230 -216124 -62770 58486 108704 35006 32390
23477 32390 157106 143661 72569 82250 147753 219147 143731 95254 51684 52948 127583 109823
23465 109823 57824 34032 -5740 -29012 -38166 -74095 -204048 -245700 -92135 38260 123406
23454 123406 143114 67767 -25820 -20266 22903 -23828 42805 167153 184892 122887 50325
23443 50325 2490 42257 38142 148301 148889 143000 140237 266211 275078 220534 137256 160321
23431 160321 94479 72320 -61946 -81012 -88027 862 141856 152678 83634 180819 280499
23420 280499 215071 210427 112702 10465 -2693 -77074 5845 11435 29964 115791 66959 47741
23408 47741 -32647 -135690 -33074 28359 -77885 -48213 -96413 -124944 -106620 -108320 -149946
23397 -149946 -155186 -2245 -461 4712 57715 113950 27284 30692 -37455 -59619 -54932 -71903
23385 -71903 -191082 -234002 -140577 -99358 -132302 -59121 30618 94490 -10885 -108642 -168789
23374 -168789 -233080 -159626 -61849 26593 4106 -71996 -82630 -24712 131645 150529 95249
23363 95249 -60563 -93993 -42394 -27223 -23029 -31683 -62602 13438 50452 -1668 50212 -19701
23351 -19701 -138311 -1819 96044 164319 185181 138799 34939 33816 87626 110084 115056
23340 115056 -21863 -82697 25182 144687 118009 76381 -125187 -120980 -50538 -103891 -126879
23329 -126879 -61351 -59635 86822 113492 177143 177175 29131 -83494 -12178 9626 -31641 -67228
23317 -67228 -73981 -79779 -118224 -145937 -86145 -71425 27352 139305 126294 64769 137201 37852
23305 37852 6773 -26587 -105562 -101101 -6733 55174 34712 68202 34333 -58636 -11898 73296
23293 73296 161169 107221 69176 -9929 1296 1962 43779 192809 111845 161384 156663 1178
23281 1178 -139349 -206524 -89550 -86607 -54327 -24756 -25243 -76445 -168305 -101165 -1435 5722
23269 5722 -98686 -78185 7909 35541 -23109 8860 -51285 -78287 -68272 -4699 -15630 -22888
23257 -22888 -103811 -171258 -68718 50327 48698 -56263 -86986 -146915 -121885 -144848 -71464
23246 -71464 -56159 36159 68889 59118 1823 -13208 57348 2331 -71953 -81725 22400 145181
23234 145181 130804 -1456 -56015 -24842 -20151 -78139 -136947 -185340 -132847 -119663 -79010
23223 -79010 11384 79426 34269 -32 118299 49547 -83652 -114970 -255011 -199669 -230292
23212 -230292 -205096 -142444 -96911 -47402 120861 212675 120791 -27637 -60147 38744 135272
23201 135272 125696 31908 -67510 41174 83070 96235 108471 106432 -7211 -108924 -72804
23190 -72804 -19482 -144987 -135031 -69009 -53372 -41659 -19212 111642 202471 168430 140514
23179 140514 130405 92559 34918 22634 -11565 -43446 -23593 -66281 36106 184040 138085
23168 138085 -24458 -10574 -124291 -224613 -226136 -99393 -172488 -152727 -103746 -119531 -122863
23157 -122863 -60018 19438 -57289 -70487 -109732 -68692 -4023 43589 40623 -18638 -66775 -160267
23145 -160267 -64727 -13636 120011 128142 -28171 -80565 -8851 35179 -21593 -159926 -220694
23134 -220694 -201381 -137644 -57870 -15557 -46189 -56471 -69857 87698 73531 -56323 -75510
23123 -75510 -33948 96665 99590 134030 29097 -121758 23729 64138 311029 291114 153033
23112 153033 147410 187039 144191 132374 78493 16884 12027 15094 106779 63746 97566 125765
23100 125765 92374 92127 38954 -77281 -91721 -59944 16879 7250 -35424 -1752 17321 -54078
23088 -54078 -76705 -149223 -106781 -12557 47181 12493 34026 9307 -86487 -83880 -27849 2333
23076 2333 69280 164353 64786 -83678 -100015 -125578 -32169 49690 -40066 -101932 -1812
23065 -1812 -4189 -79765 -90352 -71804 -21601 -97214 -172554 -37141 48169 -28401 28539 16557
23053 16557 -90556 -96832 -82145 2502 166244 104360 -50957 -57481 -59698 -15039 -58410 -34705
23041 -34705 -29345 -127912 -198925 -45627 -45386 -138955 -162738 -98800 -86981 -87233 47709 32278
23029 32278 -99859 -237243 -185108 -94521 -67849 -129701 -157703 -232954 -165494 -59832 -114515
23018 -114515 -214869 -229124 -151144 -162670 -40638 23940 -67822 -108137 -74857 -138605 -216267
23007 -216267 -161194 -75223 8067 51073 46905 -51111 -14764 -127790 -107793 74760 163933
22996 163933 122255 32131 -12976 -46196 -138234 -143070 -201960 -178830 -182911 -48367 -33778 -185926
22984 -185926 -171753 -113062 -98806 -259195 -278730 -91207 5195 93726 132027 73051 11661
22973 11661 49414 -38836 -90037 -148734 -144796 33388 15953 122869 108623 -23482 -158238
22962 -158238 -87502 -16653 -22230 -45111 -107426 -93247 49495 -35330 -155277 68268 167821
22951 167821 172106 64787 -46586 -45266 -90677 -56820 54361 84904 88540 63253 87340
22940 87340 -21802 -83133 25080 25789 19871 -32522 -70695 -15029 14373 -82583 -125418 10314
22928 10314 2530 -22357 -96199 -41140 60378 92618 83145 110515 79635 -17300 -170542 -151735
22916 -151735 -102959 19185 13562 -9661 -49298 -27144 -47705 -38988 -61665 -117768 -80124 -111012
22904 -111012 -99678 -155193 -148461 -165456 -164815 -18147 82867 71980 -61020 -38383 -103726
22893 -103726 -112047 60164 197320 175371 145303 140097 77319 -49147 -154027 -73399 -71754
22882 -71754 -57759 -36999 14955 71845 32015 -395 16703 138352 54443 -60930 -111145
22871 -111145 38703 159610 150705 110896 12435 73162 93680 63599 98719 21212 -54641
22860 -54641 -96935 -189600 -224804 -78040 -165387 -157966 -119618 -199123 -206055 -164928 -84046 44308
22848 44308 28125 -45530 -32569 82326 60894 -83939 22031 77605 65881 -41325 -148940
22837 -148940 -41948 -18068 -74555 -35424 -15886 -895 -89075 -134426 -231534 -223424 -180207
22826 -180207 -184681 -216730 -280347 -316544 -293764 -233707 -202626 -287002 -353265 -294598 -69330
22815 -69330 -1039 13406 14747 28855 -92407 -85756 -92053 -159233 -262215 -178151 -58974 -52024
22803 -52024 -134430 -73128 -36642 -39442 -67595 -143256 -167749 -187119 -247478 -148325 -155165 -248905
22791 -248905 -366923 -308033 -212776 -217898 -223558 -77180 -90335 -157690 -108672 -61089 -138474
22780 -138474 -181694 -238020 -258565 -236812 -171404 -104269 -59437 -101975 -7881 8898 48615
22769 48615 7934 83924 110028 -38136 -96551 -145726 -238323 -316425 -247692 -166473 -131519
22758 -131519 -126177 -174749 -70564 29233 -48314 -25827 24778 72621 85841 -1766 -7325 -13166
22746 -13166 27548 64907 41250 -45125 -13089 56463 129526 79137 -32631 -77858 -70426 -88142
22734 -88142 -154540 45015 143111 88659 100755 62217 -47491 -98598 -53823 -96610 -204261
22723 -204261 -197035 -148675 -98071 -39418 -66321 -54046 -27582 -94573 -140119 -159685 -85735 -73827
22711 -73827 -63244 -2456 22054 -72435 26663 93871 25448 -35801 -7684 -89529 -94235 41596
22699 41596 47314 -21792 -23485 -65173 -10762 58750 74417 124794 32792 -100027 -83209 -21779
22687 -21779 -70686 -97931 -137177 -150762 -175328 -104637 -9035 -84967 -23750 -31053 -7988 32165
22675 32165 -94117 -146740 -177325 -70582 -108213 -153665 -264373 -263343 -124851 -71566 -66326
22664 -66326 13641 -15916 28061 26043 9114 -38605 -106971 37377 71641 -32392 -142909
22653 -142909 -166427 -130661 -139331 -74817 -136880 -71193 22092 -58339 -153599 -143140 -162839 -253754
22641 -253754 -184483 -88308 15026 1215 -11133 -65887 -150183 -103325 -108799 -208748 -304517
22630 -304517 -388140 -236183 -99252 -59730 -77551 -93705 -80030 1971 20347 -84954 -127958
22619 -127958 60829 135319 188236 166600 33534 -139470 -154201 -58381 -53458 -85329 -62641
22608 -62641 -18464 53604 -31465 -95397 -63268 -27305 10070 116266 154138 51345 30515
22597 30515 158284 167246 9995 -86226 -130451 -129258 -79106 -3955 -20569 -49032 -102596 -66524
22585 -66524 -84243 -95318 -98025 -242299 -267371 -221830 -118102 -100951 -189965 -109364 -61924
22574 -61924 -45381 -97975 -99706 -81627 -154576 -89873 26647 84904 74036 24889 -29676 -24359
22562 -24359 -131457 -157694 -134912 -94944 -185291 -266132 -215641 -130816 -47211 15229 90075
22551 90075 109243 104709 4466 -34805 -18032 102195 168357 89713 132011 132645 8907 1011
22539 1011 94618 14504 -79683 -114005 -129642 -112635 -74850 -11031 82804 74628 115157 159125
22527 159125 -40666 -273251 -357028 -323553 -199306 31389 -9113 -127450 37237 53376
22517 53376 57612 16412 18664 14899 -13091 -133099 -122115 -46751 -2845 9359 5160 102858
22505 102858 105079 177035 170009 99710 4212 -46368 -4135 26796 -84614 -54830 -48110 -103386
22493 -103386 -115970 -95865 49760 -66390 -154426 -94291 -72227 82692 115553 25224 75658
22482 75658 107939 88156 76821 102901 126276 114789 131287 87997 67437 122320 85384 60204
22470 60204 98982 -98335 -266863 -232923 -227399 -151138 -128436 -82591 -10397 -92602 -120337
22459 -120337 -45546 -74062 -195796 -319488 -289800 -276173 -193250 -88521 -61276 -111994 -142192
22448 -142192 -171907 -180180 -193843 -48571 114314 132158 77476 102577 19727 142337 220330
22437 220330 136070 43241 2295 46249 76373 80131 80117 -32458 -87866 -59957 17280 28650
22425 28650 39847 4435 -2953 -18394 -33946 -107421 -143616 -180213 -238162 -248583 -168313 -133342
22413 -133342 -111653 20466 60690 125756 226544 202881 217245 289586 245221 107871 -50212
22402 -50212 -11272 -19530 -49145 -106485 -147485 -29003 138283 135534 61446 -69660 -79175 -91811
22390 -91811 -175173 -258902 -280838 -170991 -132776 -98056 10072 99733 135323 -5865 -89441
22379 -89441 47269 151500 88673 -20932 -22968 -67209 -1162 -14609 -76340 -150525 -179069
22368 -179069 -210928 -131585 -170438 -179391 -202422 -309853 -325503 -89952 -17268 -47605 27699
22357 27699 56299 -123729 -142371 -6195 43152 12204 -66488 -49926 18556 -61739 -156245
22346 -156245 -104326 -66862 17322 70419 61155 -10115 -86859 -154527 -233175 -251113 -291119 -207742
22334 -207742 -263741 -154428 77127 72416 32876 3308 -94110 -116427 -193366 -237722 -179897
22323 -179897 -236458 -304137 -258305 -194639 -42536 821 3499 -107736 -87020 -202902 -185437
22312 -185437 -78705 -67329 -60370 -110139 -171496 -200749 -244865 -138065 -80022 -106498 -54223
22301 -54223 -40747 -113962 -80645 -16604 -8945 -71898 -186255 -276152 -210578 -178100 -216846 -208134
22289 -208134 -145174 -152326 -82527 -52546 -45148 13866 48650 96681 74650 49243 117448 115771
22277 115771 13016 32432 -45876 -130528 -79203 -124120 15877 90004 35874 2233 4014
22266 4014 -3333 11026 14594 82589 76071 32219 -15572 -35306 -142870 -188804 -244398 -285505
22254 -285505 -111619 -136034 -117735 -126742 -50975 -55183 -72784 -74872 -40680 14500 -5550 -95903
22242 -95903 -80465 -44615 68560 42699 21889 -71403 41796 61648 50685 10972 -25200
22231 -25200 -73472 -75624 -44537 38262 23810 -55029 -697 51946 46905 -33593 -105198 -105080
22219 -105080 -165307 -138952 -123288 -102095 -137242 -226291 -248741 -180261 -130999 25933 -42812
22208 -42812 -145148 -186736 -149446 -96459 -157280 -187237 -157840 -133464 -109623 -65960 -33602
22197 -33602 52754 126140 -32751 23520 62439 -71083 -160286 -57420 -32702 11302 32906
22186 32906 29548 -112488 -203548 -255035 -190441 -73382 -142532 -99909 -113465 -69729 -77969 -96057
22174 -96057 -90173 -104834 -91360 -74438 -42842 -60183 22538 101979 202571 171113 68233
22163 68233 13771 76868 57960 26519 584 -128739 -190512 -188319 -204650 -230151 -91785
22152 -91785 -43268 5996 103327 116321 12194 124963 124633 86876 67206 65101 47691 115229
22140 115229 133799 147511 167103 167491 74756 -111148 -209843 -174401 -8346 11848 -8549
22129 -8549 -130242 -147829 -109469 -74323 -51525 26670 25368 -46260 -59180 -100356 -170625 -131911
22117 -131911 -11981 -45578 -12246 -25613 908 -10736 -14327 1164 -67358 -120084 -8581
22106 -8581 185720 312179 239051 183934 45601 -90623 -116448 -218945 -314277 -205448 -35244
22095 -35244 -2674 -60079 -103798 -57006 -149428 -104436 -47635 106422 91606 4241 -11754
22084 -11754 6697 -119045 -133532 -84803 -75131 -53639 -3183 -38587 -123089 -136606 -141279 -54361
22072 -54361 -46542 -107182 -125949 -140466 -157823 -81405 -49244 -56871 -39639 -136241 -189062 -163608
22060 -163608 -208691 -120053 -15787 92081 227896 186990 111836 40972 55675 44330 77307
22049 77307 157428 226551 186401 103848 -61084 -120109 -72550 -24915 -60775 -151994 -133213
22038 -133213 -113193 -110697 -94837 -91989 -56235 -79607 -115199 -129228 37458 126008 84035 -6150
22026 -6150 -19921 65867 100433 90749 -23427 -144011 -126849 -102065 -15675 -132155 -189106
22015 -189106 -66823 -19291 -43094 -42862 -55351 -87388 -92531 -67775 -79312 -51537 -36241 -58115
22003 -58115 -19292 33645 -517 -44433 -91465 -130068 -123506 -68634 -150296 -226106 -181083 -128359
21991 -128359 -104345 -215347 -100963 -7977 83527 105053 52338 -25570 -62765 -59720 -46708
21980 -46708 -67219 -110797 -33088 66533 105081 3241 -44150 -491 32125 -49039 -116452
21969 -116452 -121013 -116945 -101867 -48186 236 -33904 -126733 -214169 -156594 27145 -33521 -62646
21957 -62646 -96201 -91398 -117196 -109575 -113827 -96620 1068 90653 -11332 -18247 -56635 6790
21945 6790 59636 38498 -98855 -128116 -210832 -231354 -183545 -94398 -129874 -89986 60301
21934 60301 -61391 -285846 -193012 -117580 -128932 -116826 -169861 -111631 -53910 109734 234888
21923 234888 90926 -25944 -66387 -79514 69786 23908 -20496 -17927 -45710 -130896 -42075
21912 -42075 -7189 -95481 -105405 -193045 -175532 -70282 -80344 -52766 18496 -59845 -143326 -201287
21900 -201287 -165486 -122703 -57541 6183 -37084 -149278 -139786 -182207 -190590 -169807 -154394 -230381
21888 -230381 -191652 -168688 -77950 -35703 -98893 -146769 -185526 -119468 -100578 -124002 -143475
21877 -143475 -127205 -144907 -189804 -133031 -83376 -156099 -248581 -258408 -266021 -276078 -215083 -196366
21865 -196366 -170858 -88880 -61393 -85897 -90678 -156646 -159529 -114143 -101439 -178904 -193088 -113361
21853 -113361 -8780 -32553 -72064 -45202 -28787 -16843 -10931 96796 169227 62991 -22436
21842 -22436 -66554 15267 56147 -64006 -38851 -33900 -59765 8822 22215 -50073 24744 72147
21830 72147 94840 59106 12656 -129617 -146532 -152056 -139208 -94590 -143889 -106042 -40624 65079
21818 65079 23950 54670 189210 217921 160400 180081 39251 4760 -91502 -105047 -103925
21807 -103925 -34108 -79455 15231 94786 99123 78216 101930 90695 -4866 -6673 -22866 -83134
21795 -83134 -179810 -26952 146710 152980 31427 -70380 24243 85117 141009 27815 -172019
21784 -172019 -179986 -83472 -91287 -178501 -352178 -393549 -258294 -86228 -153114 -221933 -70262
21773 -70262 76638 -6761 -17439 -65507 -147158 -75286 -34923 -66898 -210709 -320402 -269315
21762 -269315 -77264 -68323 27253 135243 81573 45402 -18087 62329 29259 92048 128725
21751 128725 42879 -51470 -188616 -234577 -169264 -107261 -21942 476 -34000 73840 34602
21740 34602 -95701 -195662 -132650 37157 -1921 -26810 -41560 -99034 -68138 -165203 -120245
21729 -120245 82373 179661 64452 -96212 -97600 69292 80208 -52882 -143289 -215335 -146313
21718 -146313 -97120 -149316 -120283 -100996 -59251 46526 64874 4018 -10443 79273 64873
21707 64873 -29979 13710 34484 41522 -53831 20885 45137 52471 58756 8845 -15331 -53712
21695 -53712 -99526 -136142 -93789 -143750 -256245 -174902 41363 125345 -6120 -8435 54355
21684 54355 8154 -66024 -87294 -65979 -12122 34236 -52520 8129 -17202 -81132 64118
21673 64118 -55771 -231979 -182493 -133499 -43030 -47759 -70305 -42011 -6604 -167246 -257635
21662 -257635 -144464 -102853 -100211 -193664 -264172 -175404 -97178 54382 101053 -31691 -114814
21651 -114814 -192982 -308002 -377901 -370762 -284310 -171211 -149978 -77171 -16275 18909 81076
21640 81076 122363 26392 -74776 -134785 -173841 -113300 -109410 -176051 -134700 -44143 54565 -33721
21628 -33721 -19550 87165 97396 93509 -22780 -36454 10977 -37064 -128286 -198906 -254015
21617 -254015 -184721 -148571 -148128 -120549 -80223 -86464 -19663 34533 104412 159818 128408 70446
21605 70446 27678 -54780 7456 37669 176471 90169 -3416 -5085 43976 113697 73251 69976
21593 69976 162794 57068 16527 54951 60925 79670 154584 186708 109803 61120 6664 104068
21581 104068 108731 26864 -47122 -61797 -99658 -33854 -48586 28969 8932 34564 61577 -15851
21569 -15851 -207906 -271216 -291117 -227788 -237609 -242240 -195858 -265722 -142626 -111809 -216108
21558 -216108 -147515 47733 130690 203759 243093 219396 132853 78705 182879 239005 239185
21547 239185 263044 213593 95855 22218 -30172 -12261 82245 131171 89003 -100357 -217320
21536 -217320 -152001 -105824 -35310 33329 -15736 2688 37690 5695 -90150 -120586 -53504
21525 -53504 13115 111215 102496 105157 130187 124655 65527 56797 -20539 -18221 24944 3292 -52925
21512 -52925 -11469 33914 29634 -27753 -24979 -11022 83924 89030 33570 69118 44363 48852
21500 48852 -35800 -86147 -88129 -25876 11344 -184005 -131711 -77670 -191799 -192404 -173528 -145120
21488 -145120 -116563 -119430 -153553 -184001 -215548 -195381 -185606 -267518 -184277 31453 113901 -31053
21476 -31053 -180982 -221389 -208554 -260914 -264657 -120766 -127428 -80601 36044 37534 2701 4593
21464 4593 -188880 -283421 -210587 -85977 -111900 -126834 -67653 5063 73549 88267 82928 26611
21452 26611 -90814 -221840 -176702 -127822 4837 107537 127462 88989 -102120 13672
21442 13672 123486 102929 106292 106689 112711 41995 34423 141646 257533 152473 99041 60893
21430 60893 -5784 119220 153769 16790 -146816 -156913 -25762 15345 11648 34361 14594
21419 14594 107500 90938 46077 94904 198814 276227 254103 314699 339299 361964 262895
21408 262895 209448 96753 178559 281328 266543 181050 63796 51600 100806 127229 157633
21397 157633 40408 -54565 -7194 58251 147029 180117 241510 198210 135393 163119 4044
21386 4044 -65913 -32925 -9422 -40323 53571 -20589 -85965 -81858 -116968 -87110 -30931 -69416
21374 -69416 -84888 -84129 -96089 -89971 -70403 -41065 -31683 -12960 127876 141004 147485 43515
21362 43515 -39051 30227 57579 7348 -52172 -34492 -160491 -202051 -178209 -102372 -48769
21351 -48769 9929 -36923 -124032 -215830 -264061 -243469 -74592 112804 175072 101758 63715
21340 63715 81170 69810 -106833 -114396 28698 86599 88798 1625 34245 169469 137622
21329 137622 61071 -49933 54433 44398 2881 -45311 -84997 -108537 -45282 18802 27450
21318 27450 30390 -59650 -91397 -120477 -108123 -60544 -44040 -45353 14344 -25696 17943 -9589
21306 -9589 4417 48194 31967 62852 -26649 -139083 -104859 -6278 -108 -87186 -74447 -116632
21294 -116632 -151264 -167072 -70380 -27856 12227 88712 83205 34964 49764 107451 153160 142194
21282 142194 61240 -88550 -153214 -78008 -6309 -55834 34369 74839 53052 39953 140553
21271 140553 129357 36080 -63413 -46797 -7574 -91244 -76136 -9849 28063 -38406 -142325
21260 -142325 -123471 -99050 -181287 -236862 -150936 -98498 -116685 -147179 -141351 -153324 -226034 -298899
21248 -298899 -280600 -172186 -41402 -21322 -121756 -123177 22571 77013 68047 -66093 -143546
21237 -143546 -127997 -68566 -48835 -107962 -179541 -117881 -74449 -115460 -107691 -68973 2733 -38464
21225 -38464 12279 -11650 -141435 -223178 -235629 -190548 -140251 -234452 -241520 -74350 60864
21214 60864 94910 169572 139173 95347 67132 109663 237555 206133 105644 66419 99176
21203 99176 82174 64330 190749 175974 145607 199300 155195 68832 2230 -45762 -91525
21192 -91525 -154834 -22257 -9349 54078 124990 85885 55724 107789 68227 -54224 -133699
21181 -133699 -246026 -246213 -122830 -118671 -216879 -185185 -115661 -119964 -102073 29049 39907 -29550
21169 -29550 -15979 -112906 -136018 -153833 -200067 -168806 -136219 -61505 -129499 -229866 -200211
21158 -200211 -1041 -53155 -208317 -383174 -271914 -169246 -220589 -256764 -106080 -72689
21148 -72689 -184231 -214451 -184501 4336 83708 53089 -13271 -89889 13061 68 -46481
21137 -46481 -13153 -12101 -140957 -264325 -279289 -180348 -19630 104294 163052 99697 88663
21126 88663 23995 -57703 -49099 -101428 -30664 -30877 -87712 -79439 -64294 -70185 -41308 -25110 -148678
21113 -148678 -215650 -307468 -325043 -340500 -292706 -247995 -290862 -397799 -330827 -190156 -87135
21102 -87135 347 28662 -19283 -15840 151098 331484 272564 99109 -51445 8058 16162
21091 16162 25285 -30055 -195320 -222318 -212660 -106387 -128275 -82782 384 -100404 -130815
21080 -130815 -17239 -15717 -83313 -73173 -119568 -175213 -142447 -28482 66692 80265 66260
21069 66260 80884 60970 107818 12258 -8563 23843 -60375 -153755 -164895 -61835 -94278
21058 -94278 -67882 -23897 30160 58091 28443 -120922 -187768 -197133 -222670 -94882 -88383 -54949
21046 -54949 62419 115625 -27398 -125255 -116185 -166813 -215503 -248458 -337645 -266766 -215850
21035 -215850 -186610 -219546 -312938 -326624 -277773 -280940 -247620 -131325 -6616 54782 54895 570
21023 570 64322 133357 58679 -21919 -91970 -87723 -103988 -71644 -211477 -352836 -238953 -159451
21011 -159451 -38546 -46574 -73844 -100100 -207896 -240382 -157156 -118214 -80289 -5950 -30605
21000 -30605 -26749 -26690 -164639 -175847 -165611 -170023 -181115 -80838 19791 -46437 -205594 -200751
20988 -200751 -93580 -97787 -173979 -171796 -63157 46718 218908 188488 52380 69676 78374
20977 78374 6944 14141 13264 125073 31876 -108856 -137591 -188668 -68090 49166 23844
20966 23844 81048 28306 -1523 93416 89021 49296 145185 144750 65817 -44378 88006 99909
20954 99909 -19594 -71758 -77749 -76424 -130049 -178383 -218689 -166920 -143172 -89882 -1620 38195
20942 38195 26379 -33166 -47478 -24622 45486 78265 100951 96443 55842 22557 15634 -80637
20930 -80637 -102134 -35764 2285 33733 39886 4014 -52834 -54992 -96675 -80020 -152691 -154054
20918 -154054 -91527 -81059 -142714 -106690 -5744 -103789 -114962 -5825 -20926 -122132 -230259
20907 -230259 -200009 -34446 32933 -18141 -84633 -95346 -138516 -217497 -170961 -16013 -77645
20896 -77645 -143624 -152220 -179537 -222578 -105147 -97303 -79926 -29364 -88309 -180154 -238000 -267996
20884 -267996 -296771 -170668 -81800 -129446 -133080 -46318 -31540 -146457 -144050 -47420 111287
20873 111287 96675 -22469 110278 203679 -50685 -76447 -1566 -171828 -139098 -164876 -235205
20862 -235205 -146013 29909 4903 -35893 -2215 -31510 -43462 -36917 -198538 -196617 -125320
20851 -125320 -86118 -173820 -258981 -149876 95311 40202 -13082 5204 -71555 -88785 -28799
20840 -28799 -13659 74908 112 -165189 -151614 -204541 -170204 -117612 -61941 -149354 -157439 -121863
20828 -121863 -13943 218544 189815 135402 186598 219683 179187 108087 -40530 -63555 -123345
20817 -123345 -116243 -2954 9183 -14075 -3128 28263 -57843 -77217 -123347 -2236 19217
20806 19217 -125074 -196619 -151754 -107667 -24796 -53842 -32682 -65486 -105978 -134683 -177510
20795 -177510 -67528 1704 -7219 91117 39305 -5021 -63978 -18511 44067 26471 20273 -11766
20783 -11766 -27037 -62489 -2047 6328 -66020 -43886 -65878 -84031 -169672 -123781 -57540 -102551
20771 -102551 -97462 -133516 -171636 3668 105996 139075 199949 231711 193598 144960 163438
20760 163438 73600 -31622 -78593 -23478 12956 -11844 -18152 -61944 -130564 -147927 -109046
20749 -109046 -66283 -20615 11477 60494 44821 -63725 -88180 -131247 -218368 -117102 74524
20738 74524 19954 -25268 -89701 -66709 133953 192378 218207 81531 -52223 30157 67130
20727 67130 42454 45935 -33524 -25616 -12825 -18909 -47043 15160 27923 20151 7734 16288 12217
20714 12217 -108010 -98787 -80265 -96989 -152917 -67663 9145 10501 126005 120610 71828 47336
20702 47336 36462 24451 -66342 -53270 -96212 -128212 -79321 -38047 -64310 -86177 -46990 9759
20690 9759 -52231 -70908 -106144 -99614 -80819 -8478 64091 10292 16618 32214 45924 37048
20678 37048 69653 35768 62202 8402 -276605 -298268 -200593 -137952 -55801 -93553 -137072
20667 -137072 -112826 -31270 -103798 -74640 103676 194630 206535 52799 31727 -24044 16246
20656 16246 2145 64907 19642 -104126 -186241 -108189 -28856 -70227 -130641 -30075 31482
20645 31482 19923 -21438 147082 182646 122427 82743 60887 105725 126691 116728 159875 220618
20633 220618 162619 138877 33054 89044 134572 18385 -145164 -135509 -91738 -64693 -20357
20622 -20357 57145 140537 124402 67317 71211 -23934 -57457 6105 -8518 -76632 -41071 -6592
20610 -6592 -66408 -41503 13503 196724 204125 104365 63712 -121362 -76975 44141 102375
20599 102375 85679 80471 98630 91231 31166 67271 125854 143346 85303 -30024 4011 115911
20587 115911 95992 109874 32676 90807 195098 180712 165549 215455 140718 13171 -30768
20576 -30768 68623 174288 141525 113070 52354 -65828 -22666 -29160 -96113 -169161 -72193
20565 -72193 35913 129619 187252 208260 74044 -75226 -36628 31078 -11364 -109131 -136682
20554 -136682 -52408 -12996 -60858 -53576 -204 48087 38014 -3790 -24718 18759 35905 4289
20542 4289 2234 15998 -71875 -97962 -87182 -64345 -67484 -131592 -123045 -63108 -42904 36675
20530 36675 102901 27180 26242 114210 58928 -46338 -114795 -19960 18058 128410 162041 80605
20518 80605 -69854 -35213 10729 16713 27659 -29985 -1310 93696 116372 27242 15961 175942
20506 175942 141650 33275 18233 1475 -85311 -21210 18385 13124 6606 21250 129103
20495 129103 50972 -42274 -84651 -200121 -245730 -82706 45673 89011 11859 -55454 -35066
20484 -35066 -54407 -83068 73317 65176 80290 47577 62234 120982 75971 62014 29176 6608
20472 6608 -70571 -16689 101860 149005 75329 46553 64004 68871 27872 -78424 -80695 72292
20460 72292 136385 104293 144405 177961 121970 125655 164970 164065 61318 101402 89653 25959
20448 25959 85649 155215 -3764 -43379 -24967 -21823 154629 58705 70233 206446 160452
20437 160452 74282 21480 -70943 -92555 -68339 -108219 -2382 93929 38725 128371 204753
20426 204753 199607 195576 199281 89491 29682 -486 22604 -54926 43851 123480 15267 -29490
20414 -29490 13597 98771 38787 15867 -2543 -18818 63281 144219 72206 163460 37715
20403 37715 7166 -66914 -166917 -119751 50041 127045 84708 -54829 -55522 -69976 -14319
20392 -14319 21114 138267 199528 129874 7405 -42202 -102525 -38532 73274 128791 40840
20381 40840 -26770 -28620 21930 16499 -84627 -127730 -91388 -97514 -44523 61540 217035 225121
20369 225121 -5926 47942 138589 82421 -71843 -10596 102592 259318 262585 149229 -59652
20358 -59652 -155498 -131872 -133694 2447 185139 131213 26540 -58042 -16785 -171694 -195101
20347 -195101 -145682 -144660 11816 -18701 -33379 -8430 -142648 -155327 -197934 -208239 -167273
20336 -167273 -127580 -66459 40802 55872 -41428 -9978 -19745 -57043 -31876 24196 90427
20325 90427 81522 102952 -18570 23306 10399 56441 52439 -19975 -44173 -55590 -88344 -174133
20313 -174133 -150510 -84584 -53800 40695 19957 10658 118879 75659 55421 30266 -49270
20302 -49270 -111895 -182957 -109743 88548 198506 244680 184369 195306 162389 68511 127499
20291 127499 163272 155145 137076 191619 212592 171257 59345 -6057 14384 8517 -18766 -83608
20279 -83608 -53526 -83333 -165955 -128539 -126206 -116198 -166251 -201344 -159165 -162453 -242009 -126294
20267 -126294 59449 88746 93427 72034 25187 -18082 19211 65389 101776 136181 138489 78345
20255 78345 -47575 76615 131781 172904 128172 166362 126485 25284 -34424 -16624 -26077
20244 -26077 -1278 -38170 -78275 25841 121055 74677 71626 39222 71372 163996 289980
20233 289980 222664 133725 133684 200233 200767 118079 40734 20296 -45473 -10575 57667 47548
20221 47548 112461 101377 87043 -79154 -111792 -27004 -55691 -183347 -165291 -195269 -238308
20210 -238308 -153404 -3205 81732 35984 -5225 12474 32403 55294 177182 128980 54787
20199 54787 134758 66387 55930 80738 164365 211402 69549 3592 -9644 -3612 -31257 25218
20187 25218 -2916 -1242 -14626 -47788 -51219 -125192 -93127 -117823 -141756 -161417 -125284 -26280
20175 -26280 -120676 -178170 -183458 -55591 21107 107617 204570 232410 185639 152465 232520 310654
20163 310654 227531 43141 -49091 -1394 -36948 -32146 119943 113805 68341 40450 18943
20152 18943 48339 59911 88289 86971 152321 118222 49292 49247 32925 86887 152613 137090
20140 137090 23913 101571 181215 221823 234807 144414 61766 84220 62768 -6095 -252
20129 -252 61962 135518 281388 360658 283422 201045 248863 246867 144990 90526 193480 195328
20117 195328 247366 279673 157271 61915 57537 10168 32057 165058 290423 328812 275406
20106 275406 223318 191508 151323 -1536 -68234 -63970 -89598 -20025 -45328 36908 93248
20095 93248 114174 77326 50687 66465 80706 173188 107476 98500 178128 68684 102580 200618
20083 200618 57714 21297 141259 132159 91280 -42932 -156619 -73625 -5616 53452 105742
20072 105742 115669 -2097 -97607 -39375 18494 65328 153260 294683 302462 317694 302146
20061 302146 289644 113582 61202 35451 116981 250397 191260 147339 256382 224167 252216
20050 252216 322120 247055 126470 51471 111774 244416 318231 190200 111950 167504 191318
20039 191318 189279 160630 176480 214382 189163 270016 247071 236216 233618 223561 274975 183594
20027 183594 141326 77790 84231 171990 119316 87182 145687 217214 152520 37233 48122
20016 48122 19492 68209 146997 195408 140141 44485 -5078 67600 70195 44841 90739 138745
20004 138745 138864 80179 76792 112896 116867 244088 151918 31395 60108 149204 120375 71623
19992 71623 125101 81643 28575 89829 112710 101973 56494 202343 223124 171429 288339
19981 288339 263822 177011 111356 69172 110940 52713 145144 126979 17860 79531 57410
19970 57410 -7795 15701 179519 268968 250507 246463 322995 371894 275776 93197 66892
19959 66892 182674 178772 133831 110223 121851 135003 105659 161480 165701 273314 331923 405508
19947 405508 408778 416758 368867 242781 128677 210695 334703 422874 472676 537413 655811
19936 655811 655149 746074 905159 975308 1045568 1203147 1456698 1717915 1994302 2235506 2219309
19925 2219309 2047118 1793825 1466117 1230831 1090891 1049224 1037966 909257 819214 857530
19915 857530 879536 841439 755925 688892 666665 639029 694084 557059 438851 369632 288619
19904 288619 309924 377411 405319 500579 581751 659966 654526 491981 370649 215002 163104
19893 163104 459152 573303 499448 327856 303716 387908 378042 314695 282896 301512 293109
19882 293109 234098 214431 359045 354267 338626 321531 342162 242994 290353 337300 223350
19871 223350 203919 373656 448420 368382 290096 231076 248984 267916 208264 249147 357121
19860 357121 305103 262180 348142 352780 220473 85786 114617 170119 208891 168076 28561
19849 28561 65794 51919 11755 -678 59926 155164 177662 308533 324608 278728 346254
19838 346254 507538 466743 404886 330493 368870 378680 360707 286774 223790 199823 232738
19827 232738 253555 335381 336007 410481 385592 367662 454084 473132 418221 388588 357564 379796
19815 379796 287604 146483 206418 282694 285978 339791 338059 375235 390042 388872 466055 523951
19803 523951 517957 523656 578743 579987 559136 490906 481536 466629 482946 431483 429496 365837
19791 365837 347053 368764 363731 259414 263789 416365 493246 466744 501530 476457 421959
19780 421959 359127 322458 358025 374418 338780 224007 216182 280682 290543 274102 202456 183364
19768 183364 181158 238254 348389 367783 356203 401808 371872 272062 178315 153377 235825
19757 235825 240131 193300 215243 359929 263899 102120 7361 -4328 76048 192046 224374
19746 224374 287350 339461 416167 428735 403721 308619 213225 245204 242503 184011 286156
19735 286156 364076 418948 539757 584313 483476 246666 -38528 -70983 -66929 99953 195120
19724 195120 169351 269640 286483 232090 176607 317890 366808 330597 387654 372838 301939
19713 301939 371075 379335 357470 347565 323774 336188 364759 309925 298382 309381 285636 348428
19701 348428 260571 152853 152618 149731 302367 370596 403750 332951 302304 220289 284186 310858
19689 310858 211330 186089 272714 350794 320768 348161 474877 338751 321079 484354 500371
19678 500371 394547 432647 564666 652386 595859 463595 438991 397101 461059 527750 554431
19667 554431 663768 658238 549972 481928 421717 383011 427910 485745 567131 560638 530805
19656 530805 481746 501582 593893 577278 544438 553877 489765 495536 477668 409558 396830 373073
19644 373073 367924 355264 368070 398822 477169 426154 379790 305564 365090 360095 341541 281520
19632 281520 349068 374395 283270 100854 74992 141014 146055 201473 353139 366820 315593
19621 315593 379531 488424 497803 395017 415504 404460 381411 395134 432336 406973 356918
19610 356918 332700 265388 322257 280121 173355 222359 303859 340895 310453 290003 278037
19599 278037 345943 340689 287700 231031 263244 432707 513820 523534 518303 467649 391731 450379
19587 450379 442678 313952 251422 407162 401731 361181 381718 469488 616884 554793 484494
19576 484494 412629 280388 246791 184999 138821 118012 96348 212047 265053 348093 371885
19565 371885 407652 318036 289336 168141 186525 200210 123570 166695 252450 265006 284861
19554 284861 219469 146953 212745 280496 207309 175144 107563 93554 143131 181331 201133
19543 201133 99392 42610 24104 122350 151985 223838 236812 229318 291477 287788 229716 199698
19531 199698 53350 37679 112728 196118 247812 220170 193116 220206 387330 433007 375683
19520 375683 273158 260920 230260 235436 215888 195796 237008 312416 169669 121321 177403
19509 177403 181050 127123 63423 55138 126816 288287 377873 356797 303751 237471 192785 292768
19497 292768 289145 188834 180467 197901 259713 330808 367805 302323 447767 448814 368294 341609
19485 341609 295962 362801 355485 398372 501567 489197 438258 375256 349142 408315 444708
19474 444708 404434 359040 409826 575680 662675 662224 725445 626607 533079 613332 777003
19463 777003 893804 931571 946335 892671 854798 852120 925422 921709 924268 995173 1040166 929614
19451 929614 733511 774634 886672 829987 688063 732781 850561 788000 677923 635362
19441 635362 604457 588841 512687 490387 463479 474744 485864 571302 576930 574315 420530 392213
19429 392213 331772 437219 566337 508693 528981 544473 594871 525251 397572 494963 563137
19418 563137 671311 773350 740559 792238 893000 894035 706365 700301 809165 809132 790865
19407 790865 858463 802582 868068 910655 882733 861185 757832 660984 639898 727858 797907
19396 797907 858831 889770 891720 853339 780843 810797 723185 569993 554909 673410 715422
19385 715422 751700 811877 969175 1087117 1011044 945870 980336 1042340 1191955 1311160 1315323
19374 1315323 1100866 1066550 1122748 1207557 1211579 1214557 1290558 1305238 1328698 1363063 1537622
19363 1537622 1678803 1689066 1665459 1697716 1879686 2036267 2117149 2242826 2319842 2375951
19353 2375951 2591151 2928645 3440605 3945220 4362578 4744796 5026891 5218806 5466650
19344 5466650 5752438 6062752 6568758 7356630 8469927 10120135 12507709 15793976 19701689
19335 19701689 22827544 24056046 23614342 21333876 18099142 15259757 13414355 12294002
19327 12294002 11769423 11683156 11803259 11657390 11368374 10986108 10474681 9965784 9780992
19318 9780992 9876216 10248442 10556986 10558085 10365030 10054560 9527303 8725113 7940257 7459299
19308 7459299 7127234 6840803 6673194 6509792 6463742 6480817 6420195 6336438 6249436 6259315 6287694
19297 6287694 6249199 6122787 6134934 6125966 6229719 6226930 6193270 6183172 6285910 6376564 6363490
19286 6363490 6450354 6594428 6871783 7112681 7372296 7694774 8095348 8639564 9318489 10158892
19276 10158892 11095990 12058477 12859398 13618087 14176745 14440616 14325628 14087330 14100291
19267 14100291 13950379 13638519 13304650 12890439 12412292 11734516 10822406 9995076 9456675
19258 9456675 9057420 8601370 8320224 8202564 8116074 8116105 8163635 8139336 8140063 8369370 8541013
19247 8541013 8635614 8759561 8964420 9243019 9573250 9759327 9942754 10091792 10371651 10699860
19237 10699860 11050622 11442421 11876908 12486113 13091009 13798316 14666021 15628103 16705230
19228 16705230 17856642 19028710 20175501 21408590 22962980 24885035 27120033 29873108
19220 29873108 33191756 37234249 41801278 46755743 52225153 57996311 63884763 69994720
19212 69994720 76531069 83791136 92518437 103875237 119175295 140645205 170537240
19205 170537240 211092572 262401734 317691445 361540819 379949219 369154208 332506569
19198 332506569 282125544 233793986 195205481 166477581 145024847 128749855 116304643
19191 116304643 106623355 98890618 92605666 87290494 82544486 78399172 74755945 71354014
19183 71354014 68302024 65865174 63730422 61952356 60487012 59258259 58405353 57686488
19175 57686488 57261480 56916108 56499435 56202452 55887091 55579650 55224452 54542416 53444528
19166 53444528 52031624 50147596 48091069 46034869 43921858 41715663 39653928 37722018
19158 37722018 35755897 33856803 31885448 29954578 28309079 26855117 25522936 24247549
19150 24247549 22963535 21803232 20676297 19713949 18815412 18024811 17234456 16471325 15689411
19141 15689411 14950273 14193107 13509577 13006346 12587928 11931843 11436575 11204126 10748479
19132 10748479 10239132 9852378 9452234 8915718 8375359 7967730 7614326 7299298 7036553
19123 7036553 6743586 6564130 6377358 6216949 5940323 5709457 5526736 5449915 5309943 5110220
19113 5110220 4963492 4832385 4718239 4526337 4376684 4228214 3878103 3773572 3701512 3676182
19103 3676182 3539111 3429317 3331784 3186546 3121090 3108840 3057634 2957607 2813407 2704333
19093 2704333 2622717 2584150 2599417 2560546 2484855 2455491 2463183 2485259 2555157 2565398 2601061
19082 2601061 2660473 2592558 2438602 2332191 2191623 2253918 2305049 2337523 2234714 2127941
19072 2127941 2106831 1984038 1871848 1963251 1975926 1908744 1782391 1713768 1725568 1511554
19062 1511554 1348395 1550141 1693510 1682888 1678085 1615286 1468264 1460352 1351343 1381665 1438610
19051 1438610 1427823 1394827 1426437 1549838 1557519 1561596 1605069 1622970 1625621 1568120 1576063 1619116
19039 1619116 1673436 1705177 1709599 1807666 1852317 1896158 2014767 2043439 2056871 2113944 2132916
19028 2132916 2035441 1997211 2026161 2157167 2179452 2102111 2081080 1954375 1787269 1726892 1684493
19017 1684493 1720850 1865311 1925684 1896774 1882031 1816069 1893546 1901703 1976140 2043429 2085066
19006 2085066 1885659 1707259 1735830 1770209 1846315 1787863 1726530 1734092 1760469 1833111 1770634
18995 1770634 1718163 1768487 1678196 1674459 1670521 1609959 1533290 1549189 1621049 1653007 1758837
18984 1758837 1903817 1995584 1803956 1661093 1861410 1934684 1952059 1881228 1784097 1799785
18974 1799785 1817221 1840475 1933599 1919326 1897332 1989893 2009472 1844643 1762416 1607561 1526069
18963 1526069 1565731 1675456 1720023 1677049 1640374 1605681 1570227 1483909 1467552 1452382 1463778
18952 1463778 1585062 1718249 1591638 1515040 1515312 1454396 1444184 1477334 1422808 1367210 1322653
18941 1322653 1391399 1372362 1392082 1440461 1389384 1435034 1495950 1601571 1672721 1755419 1870085
18930 1870085 1926763 1898556 1874648 1807997 1751117 1553972 1759986 1951112 1974093 1911436 1788585
18919 1788585 1733632 1753810 1741897 1769692 1800160 1608128 1426199 1390802 1400160 1425313 1335320
18908 1335320 1348340 1414641 1439587 1470121 1469728 1389406 1446136 1605846 1684417 1732244 1825852
18897 1825852 1915154 1992871 2082719 2077117 2093571 2200319 2315889 2343986 2366111 2430476 2583327
18886 2583327 2752319 2898102 3086492 3223861 3350721 3724969 4311783 4968242 5664006
18877 5664006 6274814 6710448 6941782 6965286 6702844 6354734 6266612 6665661 7262542 7514898
18867 7514898 7367909 7125793 6895134 6335396 5488206 4813230 4359601 3954618 3695770
18858 3695770 3519796 3411741 3310305 3255492 3245457 3106993 3037705 3033836 3020961 2976754 2973687
18847 2973687 3064797 3176905 3223707 3231339 3293975 3390545 3457407 3531555 3625496 3642201 3687851
18836 3687851 3829636 3922969 3951917 3951886 4055506 4338938 4720226 5299124 6207840 7168273
18826 7168273 7966067 8498984 8662622 8536239 8222434 7964588 7926682 8137478 8617208 9006277
18816 9006277 8962589 8708635 8364940 7554658 6482913 5575145 5075355 4791390 4487473
18807 4487473 4295436 4040850 3916581 3823187 3735272 3621717 3513769 3593138 3617442 3652521
18797 3652521 3779718 4034691 4347441 4645347 4805237 4899314 4800642 4601280 4318747 4038153
18787 4038153 3801924 3571119 3373598 3261146 3048098 2888151 2894159 2867699 2893595 2848934
18777 2848934 2742854 2605730 2505362 2397607 2284563 2190790 2146059 2164583 2112193 2123640
18767 2123640 2327397 2561092 2531828 2362857 2206148 2071137 1983709 1926330 1966720 1947930
18757 1947930 1920070 1833870 1860526 1856607 1834728 1889525 1816588 1845973 1802975 1750045 1757694 1773951
18745 1773951 1795765 1838037 1806927 1739744 1669485 1756109 1803360 1813341 1740975 1808908 1842018
18734 1842018 1862706 1973072 2059837 2008080 1938591 1826679 1883462 1871715 1808440 1695082 1716111
18723 1716111 1899874 1949811 1845145 1779486 1831558 1795204 1820974 1923620 1906065 1936375 1917655
18712 1917655 1938677 1979571 2053011 2203431 2309747 2344477 2539539 2900728 3311502 3803559
18702 3803559 4128158 4133336 3969834 3706107 3488218 3461081 3600455 3957711 4396434 4705660
18692 4705660 4652977 4323409 3819569 3463315 3233478 3021883 2779580 2643388 2658495 2652802
18682 2652802 2590635 2531004 2558141 2460477 2528233 2559870 2615447 2639499 2720635 2729273 2720972 2815316
18670 2815316 2888484 2960017 2930300 2971223 3017195 3094515 3205325 3253806 3551967 3872214 4155950
18659 4155950 4609400 5280693 6158494 7205828 7781578 7616667 7390718 7424775 7303147
18650 7303147 6933699 6945108 7208711 7616065 7676371 7385281 7074182 6869335 6356460 5649070
18640 5649070 5023460 4623984 4359433 4168199 3924247 3627179 3597111 3638095 3481640 3394542
18630 3394542 3416744 3359996 3127437 3119573 3263981 3261433 3248795 3244455 3318724 3255634 3331418
18619 3331418 3461258 3551755 3474539 3513698 3668239 3863211 4010820 4067847 4215834 4388692
18609 4388692 4681469 5166545 5884343 6570896 6706136 6293824 5817642 5462013 5286475
18600 5286475 5350579 5701697 6083233 6258716 6020139 5508605 4921704 4466212 4113266 3961281
18590 3961281 3772181 3648936 3618202 3686850 3802262 3908912 4081611 4191375 4180823 4143869
18580 4143869 3970823 3825220 3851191 3824574 3845373 4094792 4100445 4028297 4090714 4032589 3832887
18569 3832887 3690451 3622862 3536071 3546069 3563884 3498111 3560657 3631604 3658452 3647842 3656746
18558 3656746 3652329 3611234 3668422 3861129 3907656 3975480 4075136 4143140 4219079 4466585 4623832
18547 4623832 4664024 4767982 5071155 5337462 5645224 6045678 6330466 6599927 6927198 7592502
18537 7592502 8312651 9025014 9950328 11263228 13214117 15774690 18876798 22193755 24972434
18528 24972434 26069953 25459564 23273758 20364248 17368717 15097920 13491303 12240580
18520 12240580 11305736 10652905 10237792 9923702 9596519 9382877 9252383 9133423 9261122
18511 9261122 9382777 9392256 9651466 9990450 10311530 10668818 11036181 11468744 11921886 12371845
18501 12371845 12908161 13600771 14557861 15728992 17188066 18660800 20157509 21554913
18493 21554913 22945634 24464776 26115025 27955760 30166734 33080400 36594901 41110369
18485 41110369 47433256 56191707 68270512 83905849 100383803 112578573 118605143
18478 118605143 120420123 117368469 109470787 101929955 99146903 102522705 111745226 123106179
18470 123106179 130597312 132049950 128986727 120006043 105477414 90245212 77749372
18463 77749372 68324806 61302551 56060493 52134760 49270707 47120997 45545674 44457604
18455 44457604 43699135 43131016 42577345 42274129 42129009 42411346 43045461 43987987 45030011
18446 45030011 46055506 47299148 48495677 49580736 50872685 52381477 54222623 56572168
18438 56572168 59636262 63764249 69579158 77630818 88932211 104112921 121554163 135937850
18430 135937850 143514375 146069111 143603898 134546173 123573494 117068587 117679771 125440413
18422 125440413 137588911 147930891 151495363 149136884 140865577 125276131 106907079
18415 106907079 91455851 80156980 71698077 65028122 59527858 55114715 51749090 49067114
18407 49067114 46950262 44969820 43283673 41862470 40546616 39358883 38411989 37720358
18399 37720358 37149041 36589802 35938836 35378381 34652569 33899174 33080035 32343685 31638572
18390 31638572 30793101 29830134 29109444 28436171 27594726 26652210 25703390 24725340 23723195
18381 23723195 22810811 21941562 21127790 20582568 20170235 19480569 18563865 17460038 16516101
18372 16516101 15768522 15043234 14426333 14090424 13873778 13529811 12804424 11986523 11185681
18363 11185681 10501191 9983969 9549614 9029081 8653427 8313955 8020559 7843476 7579795
18354 7579795 7241885 7055955 6796072 6645177 6450104 6256363 6008904 5889119 5611826
18345 5611826 5289113 5267386 5225856 5095631 4810364 4638650 4561791 4339005 4218538 4152603
18335 4152603 3955027 3844574 3784209 3651999 3635992 3499433 3347122 3253825 3166656 3183947
18325 3183947 3151386 3181716 3224032 3204419 3249559 3068953 2967138 2984681 3044697 3153370 3249565
18314 3249565 3163904 3165369 3328240 3400898 3467451 3485395 3521750 3495562 3553608 3635909 3759179
18303 3759179 3967353 4017594 4184814 4503897 4980273 5653530 6358717 6652881 6658630 6531977
18293 6531977 6228051 5657452 5148731 4848469 4631004 4483112 4505720 4542155 4566381 4621383
18283 4621383 4724480 4737465 4595197 4380058 4293449 4266709 4265229 4274729 4148464 4027870 3944349
18272 3944349 4021819 4147029 4205461 4320178 4452097 4507045 4576879 4527826 4628363 4766578
18262 4766578 4839849 4859054 4874217 4915417 4968554 5107067 5194664 5317862 5394234 5377164 5286353
18251 5286353 5424351 5482247 5578706 5696683 5796082 5760514 5787082 5969468 6139360 6304003
18241 6304003 6426882 6562078 6806263 7189234 7606325 7873955 8232174 8531623 8532571 8365612
18231 8365612 8122700 7929670 8034608 8031866 8126385 8270005 8415613 8606476 8749528 8878222
18221 8878222 9167709 9365722 9694191 9948856 10357928 10862501 11509440 12142604 12750287
18212 12750287 13255494 13661077 13914730 14231382 14733410 15227803 15972054 17007626 18237430
18203 18237430 19619198 21228240 23192456 25598726 28448121 31762371 35674751 40006066
18195 40006066 44763183 49969710 55437575 61181179 67128702 73467806 80531096 89124476
18187 89124476 100340646 115448998 136736071 166947222 209153031 264201529 325147672
18180 325147672 375666295 399668446 391339206 353530920 298855032 244746858 201248307
18173 201248307 169362979 146389367 129503978 116491581 106291518 98158095 91440477
18166 91440477 85955141 81414361 77526069 74281421 71399917 68809071 66480270 64350656
18158 64350656 62549916 60991595 59696487 58648408 57929499 57374928 57128585 57218534 57574089
18149 57574089 57955176 58373728 58607269 58507691 57864841 56561266 54733871 52524628 50149139
18140 50149139 47620308 45052406 42598069 40368418 38332312 36577814 34826108 33299194
18132 33299194 32104424 31113131 30271880 29453431 28870239 28653555 28679521 28924775 29373785
18123 29373785 30023675 30890207 31639778 32114298 32526779 33030414 33507607 34435840 35984138
18114 35984138 38722714 43138389 50185834 61700027 80088513 107276724 135626561
18107 135626561 138635021 112288266 83886465 65139392 53665625 45995871 40604600
18100 40604600 36646773 33616640 31268335 29257411 27679011 26374927 25172592 23947270
18092 23947270 22902497 21982288 21198736 20533062 19902366 19404098 18961054 18593812 18177954
18083 18177954 17864754 17593305 17538950 17556619 17514356 17500246 17702699 17896397 17922876 17737793
18073 17737793 17324453 16843486 16267907 15856694 15296048 14744011 14344235 14094710 13861925
18064 13861925 13599219 13481801 13269312 13057707 12932987 12773010 12633747 12446553 12290482
18055 12290482 12301981 12454139 12554604 12728162 12899622 13207474 13625981 14036454 14285121
18046 14285121 14589145 15163208 15840731 16574423 17531088 18725883 20398250 22567736 25531794
18037 25531794 29782220 35982065 44428109 54662894 63054680 63876085 57480935 49862367
18029 49862367 44857551 42618821 42933115 46061371 51920081 59878539 66273143 65110122
18021 65110122 56932626 47616673 40621505 35814601 32458409 30043624 28373772 27185977
18013 27185977 26188762 25572575 25294611 24987393 24854266 24920887 25041209 25448390 26000431
18004 26000431 26491878 27293308 28333019 29483761 30723925 32140540 33779518 35373642
17996 35373642 37082238 38902814 41204901 44201326 48343702 54030127 61889757 72763770
17988 72763770 87052100 101570808 109816478 110239937 109777832 114035613 120364976 121592492
17980 121592492 116826221 112855166 114605202 120037882 122387083 118538476 113974831 113461796
17972 113461796 113867057 107868444 94719923 80796019 70143519 62603586 57206753 53281869
17964 53281869 50337457 48112837 46261307 44708621 43540121 42395385 41364872 40547812
17956 40547812 40128793 40008076 40031451 40134713 40312199 40490768 40850409 41413911 41837654
17947 41837654 42368687 42934710 43744835 44729208 46087415 48194341 51333783 55937930 62474914
17938 62474914 72041401 84814215 97849414 103124987 96449882 84374895 74357677
17931 74357677 68675325 66776656 68424853 73856470 83025084 93035909 95844495 87473693
17923 87473693 73710547 61639473 52941147 46745137 42262974 38764206 35943079 33678872
17915 33678872 31962475 30518217 29222892 27977577 27010745 26431884 26004500 25617430 25031241
17906 25031241 24462726 23926877 23312303 22906836 22574076 22217179 21779362 21292183 20769794
17897 20769794 20166754 19524479 18833445 18227328 17676616 17236708 16532055 15801659 15142506
17888 15142506 14381033 13622923 12948272 12367570 11783890 11250974 10806707 10329713 9878013
17879 9878013 9494969 9100663 8738708 8413093 8154645 7913445 7642180 7500176 7382661
17870 7382661 7232592 7052122 6864141 6721409 6616215 6640799 6610052 6487777 6284091 6082557
17860 6082557 5892159 5727004 5538670 5418076 5333273 5312882 5216966 5093874 4982599 4857890
17850 4857890 4712274 4614369 4558934 4403282 4221915 4067707 3920446 3859490 3739961 3566856
17840 3566856 3429194 3408021 3178242 3055562 3074837 2997336 2911041 2918154 2972998 2995171 2928997
17829 2928997 2893717 2812672 2686107 2650934 2618480 2603200 2650367 2586157 2595466 2688166 2784006
17818 2784006 2731588 2582058 2539103 2434268 2428540 2539656 2553915 2549913 2602404 2530749 2523193
17807 2523193 2461186 2348448 2297239 2263983 2236091 2154024 2063742 2086672 2065530 1990747 1948822
17796 1948822 1994718 1900861 1771951 1849906 1963922 2006551 1848645 1776829 1855525 1942932 2032670
17785 2032670 1991259 1965744 1881052 1894682 1908579 1808663 1830857 1795002 1821440 1863883 1845304
17774 1845304 1762919 1715484 1697380 1776596 1804471 1776161 1826717 1833788 1744848 1704588 1692936
17763 1692936 1746526 1720572 1728467 1664315 1629454 1582216 1449515 1472667 1540218 1509573 1635512
17752 1635512 1769801 1805304 1735886 1688291 1742958 1864034 1832889 1770210 1720031 1625624 1611927
17741 1611927 1542024 1593937 1588928 1625474 1693201 1813801 1854134 1834695 1850728 1896804 1838647
17730 1838647 1809969 1821912 1712452 1679689 1648871 1665724 1755678 1786727 1662275 1700902 1812449
17719 1812449 1839240 1852082 1796334 1553842 1533475 1602952 1547757 1560561 1613211 1607209 1561299
17708 1561299 1504070 1318911 1265585 1146645 1065605 1126274 1168089 1192382 1185987 1084988 1063472
17697 1063472 1031189 1128398 1218670 1317373 1361085 1366394 1317237 1309639 1159637 1161506 1358083
17686 1358083 1435538 1461674 1389928 1297315 1307956 1333029 1366813 1342354 1285740 1283107 1239117
17675 1239117 1248484 1282128 1337541 1270503 1284174 1308751 1257040 1193647 1105874 1033789 1099469
17664 1099469 1110962 1129610 1257184 1331943 1183466 1177196 1170903 1270981 1228664 1109628 1079188
17653 1079188 1172563 1230193 1131661 1117227 1226852 1321332 1458303 1470748 1579639 1707816
17643 1707816 1722659 1702370 1805720 1801803 1785926 1861834 2021334 2085466 1969204 1728247 1688411
17632 1688411 1604914 1517285 1546766 1443139 1354068 1313679 1250446 1233759 1253227 1158900 1135680
17621 1135680 1184550 1190695 1093544 1101666 1193270 1251382 1281559 1368838 1382505 1286711 1227405 1264826
17609 1264826 1229176 1283663 1358026 1475082 1568502 1650372 1691762 1800556 1916667 2090771
17599 2090771 2111043 2175789 2198181 2240362 2231084 2177305 2180876 2194363 2243697 2359970 2395741
17588 2395741 2344007 2252730 2143723 2044687 2012186 1941956 1984891 1937727 2068367 2079884 2007808
17577 2007808 1932534 1928428 1928474 2005421 1977358 2084097 1958923 2016650 2044975 1967617 2071325
17566 2071325 2229449 2380375 2698832 3105778 3387768 3619456 3793055 3807855 3805350 3560188
17556 3560188 3366725 3209227 3080020 2984585 2885117 2866052 2851040 2862042 2842463 2792377 2691339
17545 2691339 2539225 2598844 2644061 2699188 2726353 2667492 2634309 2557469 2456521 2461995 2500050
17534 2500050 2500093 2424073 2441628 2624245 2818956 2852646 2827194 2850449 2995292 3035451 3116069
17523 3116069 3149955 3121196 3220944 3287571 3366322 3434765 3531502 3617535 3758142 3880445 4004619
17512 4004619 4184988 4367188 4537389 4727014 4927058 5281586 5568541 5784935 6172714
17503 6172714 6606769 6934292 7232391 7605587 8255806 8954177 9638602 10665745 11612329
17494 11612329 12660054 13828108 15122512 16475031 17897323 19675026 21726790 24315256
17486 24315256 27836960 32320523 38361325 47016276 58963485 72984748 82214980 80387914
17478 80387914 72934838 68136923 68692717 74914415 85832411 96241923 95590034 82458057
17470 82458057 67076217 55421397 47694971 42365266 38446543 35576629 33465149 31842885
17462 31842885 30598296 29760872 29234175 28704264 28307458 28205535 28255355 28460519 28930014
17453 28930014 29545073 30394883 31406129 32716653 34165197 35624202 36997481 38384095
17445 38384095 39837512 41566725 43490475 46021819 49186284 52950745 57721236 64075745
17437 64075745 73061356 85678990 101999042 118229140 127755929 131947641 134947401 134344322
17429 134344322 131729423 134065939 142433166 149685606 150895772 149421782 142227213 124839405
17421 124839405 104329308 88039391 76583399 68627832 62783115 58401272 54933465
17414 54933465 52059843 49840412 48306438 47148285 46232871 45502549 44918798 44646681 44480437
17405 44480437 44453742 44758059 45404965 46195104 47291809 48625178 49991964 51474164 53183124
17396 53183124 54984998 57132889 59670326 62482246 65814455 69866866 74483237 80232791
17388 80232791 87977735 98726994 113473188 130706337 145116411 155342967 168201767
17381 168201767 186633039 204123771 218041314 231528508 236703818 224246324 205666792
17374 205666792 195079560 190100039 182375277 172275884 160908655 144427620 124837853
17367 124837853 107947468 95651072 86669543 80053468 74892062 70707864 67334170 64665793
17359 64665793 62523562 60743787 58966532 57627806 56727355 56030721 55454623 55104108 54803142
17350 54803142 54595448 54600492 54809009 55249401 55822918 56357465 56826160 57328038 57952068 58598603
17340 58598603 59423392 60140643 61065706 62450745 64297420 67251641 71723447 78513957
17332 78513957 88921550 103849064 121574301 135817506 142826061 146245995 144953468
17325 144953468 137647885 131673103 132709745 136955019 136888346 132388822 125201270 112359994
17317 112359994 95762512 81251931 70603563 62956161 57232552 52831706 49328889
17310 49328889 46412838 43968276 41887877 40247583 38623479 37201583 36075820 35086747
17302 35086747 34127586 33321468 32486783 31965544 31427462 30891546 30524468 30105906 29576363
17293 29576363 29099145 28332091 27561999 26925617 26099392 25367034 24489141 23579126 22552036
17284 22552036 21596565 20539189 19491948 18508776 17564231 16621852 15695365 14776011 13931962
17275 13931962 13144860 12443251 11811971 11296072 10986756 10552536 10105945 9493366 9024868
17266 9024868 8827919 8541858 8292969 8062503 7767870 7386454 7117711 6820216 6475947
17257 6475947 6276192 6093743 5913860 5769714 5563844 5448619 5272676 5129134 4942354
17248 4942354 4777646 4589409 4436563 4167187 3978165 3794795 3780819 3619118 3519464 3471240
17238 3471240 3408986 3332913 3256205 3170551 3060695 2921500 2865547 2878212 2731229 2606857
17228 2606857 2574531 2582850 2671846 2653195 2554458 2501085 2576149 2657033 2561763 2360569 2350348
17217 2350348 2406346 2404589 2354165 2280977 2310295 2311867 2321161 2245977 2245720 2226870 2232409 2216703
17205 2216703 2289364 2344057 2347444 2328704 2311700 2188907 2185753 2193877 2185311 2157205 2151470 2207919
17193 2207919 2185813 2204370 2155911 2080657 2058481 2021735 2029187 2077340 2152844 2327169 2341394
17182 2341394 2247615 2168284 2134512 2169720 2208249 2212403 2088819 2012617 1883544 1884960 1882405
17171 1882405 1896725 1947504 1962329 1968493 1881782 1833621 1752188 1754727 1868377 1871892 1791255 1872486
17159 1872486 1855964 1718793 1724164 1698918 1602817 1519563 1597859 1645415 1570514 1489757 1469267
17148 1469267 1513407 1542768 1539687 1587605 1617170 1610602 1535884 1540408 1518326 1496544 1424710 1417775
17136 1417775 1483570 1486467 1540802 1530294 1436784 1379258 1399341 1322220 1199854 1217605 1289391
17125 1289391 1305143 1314960 1297067 1308145 1200674 1042283 940699 902334 857939 871595 949374
17114 949374 922264 890308 901117 969178 914478 879462 811069 801814 713054 635964 657323 659422
17102 659422 667433 720090 749202 659106 633209 722154 731138 673376 625099 584657 624566 621400
17090 621400 480293 511146 530389 354739 353515 451271 367705 360317 481731 432315 475177
17079 475177 550725 521197 424438 413117 498644 513231 478771 452942 361233 369359 298287 285587
17067 285587 375693 520875 418273 296047 342352 496754 534890 499024 480367 366036
17057 366036 285395 323354 364118 396942 471508 424507 313202 298826 320439 323340 305873
17046 305873 311990 205362 143946 136530 189405 326597 301303 279420 187505 197327 303937
17035 303937 353725 445484 487186 376714 419151 582232 578567 561119 627554 696334 657125
17024 657125 572072 440256 405988 443744 482190 497414 593806 606594 454227 485367 438289
17013 438289 297841 442566 419640 391855 470165 451593 513684 494132 520362 652249 647916
17002 647916 639074 664118 761622 766920 856386 954708 1150785 1259283 1283212 1267480 1285822
16991 1285822 1436765 1598435 1750787 1858532 1906377 2043750 2121663 2135044 2222306 2153915
16981 2153915 2052135 2013256 1942586 1898280 1829595 1707815 1724924 1650645 1591241 1394162 1289979
16970 1289979 1366874 1365222 1332944 1341615 1293472 1234344 1287263 1284310 1223634 1204166 1133982 1105178
16958 1105178 1109754 1227807 1255672 1218914 1147631 1076375 959936 826544 842374 855458 767657
16947 767657 673918 677519 713249 761362 737454 649173 523646 405539 443758 565099 552844
16936 552844 551283 513637 464115 377627 412249 375176 232942 251462 374123 408637 422117
16925 422117 547031 634085 656669 597153 592095 510715 499082 596479 762518 809736 796579
16914 796579 892521 859613 917355 966701 874375 833924 818746 765650 790894 725947 657535
16903 657535 543469 521101 435863 432294 462511 564006 525179 562802 509174 345178 268102
16892 268102 332442 397829 448250 456975 426626 515485 604933 643958 672476 737392 812026 922003
16880 922003 1037187 1023925 992271 1032258 1136240 1146055 1230750 1268718 1207621 1175767 1121122
16869 1121122 982944 966991 826184 751271 667218 704603 718363 658790 614121 705081 763046
16858 763046 690584 645530 514066 447136 314157 325806 366339 393588 410573 431744 321697
16847 321697 293977 273737 251087 374471 459165 440213 494225 538157 534201 516996 581095
16836 581095 600024 658139 741061 741566 729129 792704 714425 834810 921589 796735 818617
16825 818617 868424 935046 891438 893311 909643 874773 688460 578459 463167 335539 317997
16814 317997 186739 186743 210989 231465 236154 227842 292239 258855 136796 126663 158313 307348
16802 307348 404457 359598 343412 282122 213763 220374 227198 253212 212094 136530 238710 261521
16790 261521 238413 208982 79747 131090 172400 162117 144884 234796 365068 180164 243911
16779 243911 287628 180380 114146 47163 89105 179304 198980 29032 -48107 35251 98684
16768 98684 79095 129040 77608 108056 159454 72861 97421 82225 133361 88238 42743 4059
16756 4059 18566 1812 17934 -8272 77125 140059 155343 147489 -1611 -29347 40290 -16367
16744 -16367 -28276 -62350 45311 63919 92919 192537 179246 64192 33663 37869 -73189
16733 -73189 -100432 -116570 -90533 -9577 104319 159060 137772 29814 89188 204774 119866
16722 119866 134168 33244 24329 88157 111480 113748 197667 130030 9333 68627 30096
16711 30096 -18962 66339 14773 -82766 -31047 65779 88902 72751 166961 211703 211155 141536
16699 141536 195801 234106 319643 230256 36877 29813 80497 31677 -8657 -66482 -83077
16688 -83077 -33153 -48154 -93817 -161769 -147730 -117182 -137727 -39242 59727 78043 -11544 -10150
16676 -10150 42365 82168 -74035 31131 31562 -91498 -67305 -72826 -1869 85787 51731 61440
16664 61440 22336 -4746 83800 49300 8189 84523 75682 98469 142555 94973 59260 95596
16652 95596 48188 -10596 41754 -16403 -31218 -97445 -157371 -185386 -89465 42571 -44603
16641 -44603 -216635 -161810 -106732 -118358 -31927 20835 41265 97876 109993 48861 -53481
16630 -53481 -42594 -6789 1435 55449 37579 -6547 -79238 6051 118037 270688 209344
16619 209344 109757 112876 83980 37999 74253 -5915 -48804 -25964 52121 17020 -33216 8825
16607 8825 -21713 43683 133124 194757 173090 90904 111704 138306 167896 83023 -41296 139285
16595 139285 172115 118051 152637 209352 122665 87083 122230 167327 186825 157376 66620
16584 66620 36008 12509 -55499 -83654 71704 180694 149445 105038 20090 -45447 -18077
16573 -18077 -13877 105063 327623 352490 310156 251210 203370 232554 213582 108554 128761
16562 128761 236297 173802 187456 237520 160094 77469 22465 157256 234996 161970 69065
16551 69065 118497 65414 71051 200908 237967 212170 241782 160721 75141 69763 13399 68159
16539 68159 191022 182476 50867 97187 22866 -24394 -111160 -148553 -98522 -56629 15931
16528 15931 -51241 19417 132149 104325 153084 177203 111141 32038 -45444 -62629 -139604
16517 -139604 -101204 74071 239194 229515 250262 304529 130915 32795 -1952 -45359 7287
16506 7287 25902 -7757 -97195 -123679 -84123 3719 70025 154012 195636 41953 -34701 91632
16494 91632 190620 110902 189835 224863 189207 130629 93417 143043 33713 14109 46164
16483 46164 53343 -31268 -5646 40305 -7017 -42670 32058 118301 152351 246171 325837 191605
16471 191605 67507 55406 2837 -1403 36785 41113 -95495 -95268 -14740 69779 16996 -17293
16459 -17293 93251 193296 73691 -23188 -20516 12121 100840 65114 -88752 -154083 -100230
16448 -100230 -102981 -19094 6481 -2424 -69450 -43184 -36268 -76960 -32112 16280 2062 -15111
16436 -15111 -91600 -128947 -144320 -91996 -101210 -232767 -223793 -72318 -72899 -236704 -137696 -115875
16424 -115875 -91478 -43200 -49920 -45187 -73927 -83281 -147602 -92450 -108571 -87668 -61500 -163473
16412 -163473 -185759 -67359 -22667 -13965 71699 158656 147846 96742 -11431 -73394 -59328
16401 -59328 -105227 -127054 -91388 -86893 -87817 -103111 -134805 -168334 -137952 -85425 -78334 -65004
16389 -65004 37881 26194 127111 142003 -54083 -170014 -158930 -202204 -269536 -296702 -216303
16378 -216303 -148352 -152766 -16450 2812 -103321 -191762 -199699 -82086 -103466 -183975 -84775
16367 -84775 168038 103861 93496 -36592 -204870 -268499 -164989 -10132 -2364 -63677 -10097
16356 -10097 24775 97198 -87813 -84646 -32618 -53338 -67993 -53976 -33015 31814 139256
16345 139256 89924 94588 66348 15168 -31656 -72611 -96020 -10105 -12117 19100 73951 180632
16333 180632 332578 422960 513942 375766 187672 156438 204638 147427 92756 179128 218051
16322 218051 139813 216308 163874 132532 48970 82854 84667 73181 130969 -17349 -91151
16311 -91151 -37830 32501 59258 6549 23041 -50205 -180922 -182518 -35777 109662 37085
16300 37085 -38834 -20369 85808 45383 -50878 -20780 -17489 -6699 42381 85269 20275 66732
16288 66732 120570 83194 33297 142311 282989 427697 356950 294715 255543 170008 242938
16277 242938 345114 286738 129201 127271 52991 30915 -32111 7598 128307 191184 145005
16266 145005 128595 146552 24193 -61497 -83848 -68667 -57583 -115418 -77557 -27582 -161520
16255 -161520 -117089 1359 -66120 -101278 -3547 46884 33542 74577 64305 24776 -41914
16244 -41914 -61972 24717 19842 -74262 -68133 -110530 -219599 -212880 -73901 -30522 -39716 -207670
16232 -207670 -184603 -232091 -331690 -361739 -374497 -215925 -205951 -251303 -292596 -213041 -75757
16221 -75757 -58968 -106641 -50916 142595 142064 -42478 -70659 -131237 -194397 -252573 -179562 -249208
16209 -249208 -343445 -179059 -162668 -236452 -212212 -147158 -168558 -50101 39156 -8211 -175653
16198 -175653 -271356 -158792 -83750 -169883 -183502 -80523 -44597 57521 -11902 -195044 -199495
16187 -199495 -178249 -231393 -191939 -100115 -161623 -186160 -59296 60664 5772 -102149 -125859
16176 -125859 -70485 -73015 -163514 -160292 -179114 -239003 -104631 25458 84539 -9933 -84520
16165 -84520 -64117 -159973 -165874 -59246 -4583 -81315 13254 37686 57714 16171 -25188 -3332
16153 -3332 34510 75841 -149634 -131779 -33891 -73088 -32517 -6024 -11262 12924 -40380 -43891
16141 -43891 -51515 -108260 -78400 64433 -6495 -121835 -157864 20113 190671 279089 210628
16130 210628 54496 -75565 -74316 -77279 -83133 -217132 -359580 -328607 -311305 -244178 -115542
16119 -115542 -85062 -318 10374 -62453 -86988 -124653 -134755 -124302 -13601 -71250 -180432
16108 -180432 -123393 -66013 -46394 -126236 -243334 -127209 62017 37863 48424 -18245 -100153
16097 -100153 -30005 -52127 -55558 -30917 -106402 -179283 -181969 -83059 -100214 -151116 -93933 -77009
16085 -77009 8244 -44761 -13435 145714 92247 62041 29777 -12489 -99080 -69406 -31063
16074 -31063 -159395 -186534 -88663 -27491 -27135 -93 -13047 89828 123353 29863 -184879
16063 -184879 -226993 -127834 -104984 20400 136461 57210 -23270 -106286 -102803 -126225 -145983
16052 -145983 -159827 -288682 -330517 -340705 -235000 -134683 -169023 -237680 -233417 -202599 -226701
16041 -226701 -195847 -26898 82348 53834 77691 67330 20233 71003 76990 4936 25634
16030 25634 10990 74246 71587 58846 -59305 -154386 -209701 8337 128767 72487 10016
16019 10016 51736 49425 -12317 -53906 -87448 -47154 -121831 -89270 -117406 -62875 59756 83351
16007 83351 2700 -129137 -83224 -120305 -93609 -25768 -25974 -91882 -84884 -90699 -62774 -21572
15995 -21572 -43766 78147 85757 -48604 17727 67463 46348 92614 146475 115842 106903 155329
15983 155329 165661 177672 146422 48980 29428 -14745 -77409 -144440 -191234 -237383 -180133
15972 -180133 -135836 19039 25101 -48788 -50279 17681 45251 102611 62578 -8435 -74349 -31970
15960 -31970 88848 60941 21921 44651 88491 34276 983 -7028 -125831 -56408 -44191
15949 -44191 -102065 -65853 -58802 -76759 -88206 -154755 -92092 107374 240676 93270 52609
15938 52609 -30669 -2127 -58189 -111637 -31073 8444 -7089 19685 -25503 -8353 -39043 -52450
15926 -52450 -46904 -60653 15770 36606 -33814 -128100 -134268 -26066 15323 101119 110587 114770
15914 114770 -11419 -227978 -265870 -137869 -10796 51242 27842 -163042 -130679 -64354
15904 -64354 54455 95321 -50286 -144456 -156680 -214004 -219949 -281882 -172817 -144628 -82281
15893 -82281 24744 -4977 -36781 -14405 -130887 -86866 -111968 -42606 -47861 -101424 -91863 -91295
15881 -91295 -70604 -59463 -102729 -66987 -2902 46278 66634 -10427 -54476 38704 52607 -122975
15869 -122975 -158189 -101912 -153252 -225701 -272602 -265350 -139085 -209645 -250273 -142759 -15177
15858 -15177 8576 -62641 -51081 -21574 -37884 25732 8740 -107396 -168327 -92511 -121454
15847 -121454 -195366 -167656 -123356 -137763 -136367 -173435 -201171 -215787 -211500 -186837 -58504 51820
15835 51820 -70834 -134463 -175408 -163756 -10089 8934 22712 35436 10246 -130430 -92777
15824 -92777 -50476 -113283 -38586 -57287 -129149 -159693 -142016 -158976 -89107 -59830 -24511 -20806
15812 -20806 -127706 -81910 -50350 -105463 -136711 -150045 -95137 -45112 61683 73777 12481
15801 12481 -101287 -110608 -207912 -262974 -279953 -210965 -182955 -193191 -182895 -74313 -5410
15790 -5410 -49772 -62308 -100297 -108160 -154314 -188423 -181773 -108073 -104007 -69709 -42042 82241
15778 82241 215707 160993 -21551 -101871 -19596 -44633 -122361 -118316 -78243 -1743 74772
15767 74772 7176 -28981 -136862 -61607 80530 54438 -54064 -42126 -46602 -150152 -72383
15756 -72383 56437 55076 84148 94576 52383 44426 -34506 -21864 -85283 -175187 -104782 -23075
15744 -23075 -46063 -68278 -83013 63749 160012 200587 152366 -116638 -140755 -59431 -74846
15733 -74846 -176587 -188654 -75499 48083 63760 6266 49422 251 -5617 34407 22517
15722 22517 -123173 -56303 -66704 15694 -64171 -99918 -117264 -113761 84365 37542 -8158
15711 -8158 63273 33213 -29639 -9774 59149 2507 -106043 -104170 -218494 -189276 -36675
15700 -36675 -23568 -90766 -38132 -34546 -9972 44835 29346 -14452 -24060 -90862 -124526 -130539
15688 -130539 -31111 4230 14543 21048 73080 -4790 -70062 -91736 -393 17476 -62756 -95993
15676 -95993 -13789 47759 90708 26859 -134147 -48077 -58082 -33647 -92900 -313257 -225533
15665 -225533 -133848 -174180 -127239 -33308 -36021 8780 30912 -8971 -34934 91725 115292
15654 115292 91268 47900 36376 89209 153067 150676 84114 96819 63543 -48342 -72795
15643 -72795 -64695 -5005 92536 94517 50958 -4921 -112467 -269203 -212581 -116655 -23933 86025
15631 86025 107465 16757 38766 129080 86035 147039 51525 -34222 -151478 -170803 -153065
15620 -153065 -84331 29940 40528 80373 74321 20574 -132960 -161250 -31893 146445 198048
15609 198048 111054 17738 4473 4727 10978 -66417 -48245 24000 169280 244484 243389 113885
15597 113885 62712 58980 71256 80878 79815 119577 38147 80094 43262 2619 -27865 -71340
15585 -71340 -119251 -97737 -17527 -90090 -72322 -43498 -86846 -79266 -80269 -29401 -90778 -152200
15573 -152200 -274492 -270974 -212188 -185744 -32458 83768 30638 39072 100045 12737 -60073
15562 -60073 17617 36479 -94493 -149264 -153991 -100938 -56338 -95903 -42753 -24635 38289 66509
15550 66509 120042 170731 104082 111098 38288 -68134 -52228 -97786 -75738 -44879 29455 18274
15538 18274 -413 -3012 -120539 -190409 -154348 -50101 104548 111157 18908 2977 53719
15527 53719 46585 -75872 -34962 79245 12585 -69743 -88399 62020 19659 -146146 -141890
15516 -141890 -55449 -22286 34923 144121 160030 173724 124054 52850 17428 72139 -24948
15505 -24948 -15760 -41434 -62826 -86993 -96869 -4827 78544 14714 18818 40953 61543 80672
15493 80672 30880 5843 -66073 -46633 -35868 -38737 -78628 32467 7777 -6789 58573 97550
15481 97550 91144 99936 24151 -57744 -98488 -51015 6296 -67791 -126621 -83017 2271 -15930
15469 -15930 -103118 27158 5030 -36328 -25667 -33307 51092 74158 31829 7057 41386 45946
15457 45946 71030 84047 147613 177953 219127 154038 168818 152079 254521 269004 193858
15446 193858 152657 56049 68033 99694 120745 66345 -91759 -119007 7514 97519 196225
15435 196225 230205 181090 45240 -10961 42903 43366 116076 110647 26963 12951 135923 166129
15423 166129 113507 59561 161182 243413 202285 166001 183771 61922 66550 72189 37321
15412 37321 181168 333799 344539 320801 285013 217067 100711 48798 250326 183483 32473
15401 32473 -2612 -7289 3451 79271 175533 169916 219881 261889 140291 112533 82124 130262
15389 130262 162895 191500 90332 12866 -76356 -102024 46660 144244 112851 70040 75429
15378 75429 51617 54864 39906 60048 107582 169663 126022 139466 72320 -13256 9915 -9145
15366 -9145 -3429 12779 -11677 13484 88356 167418 128187 42831 127663 155446 61466 101501
15354 101501 144417 93148 1359 72188 116673 11187 -79701 -65998 -60588 94577 206657
15343 206657 185001 48596 2595 116909 247143 232661 118634 90951 100689 -29519 -104872
15332 -104872 -56809 -59071 -107360 -28238 -15142 -33576 -145302 -85249 -65938 -92057 -85429 -56795
15320 -56795 -144465 -140840 -80532 -38261 -9938 133522 160023 189750 160552 13407 17305 88691
15308 88691 34279 101349 71048 79681 -8739 -14834 49136 87837 116592 65895 32800 -212
15296 -212 -75321 -159502 -176389 -209264 -213590 -221584 -163535 -70760 -16627 39052 202312 292888
15284 292888 245033 221456 287491 228121 125198 135934 174917 121459 96597 62191 83628
15273 83628 12983 -12374 -89089 -55405 -26008 -77024 -102985 -47064 -5061 101502 131909
15262 131909 188722 100889 61257 18144 4014 42769 113542 202660 225431 151348 99508
15251 99508 76106 75161 78383 -22214 1215 3312 -33609 -100675 -98275 -35838 -32898 16028 108528
15238 108528 231576 215107 173761 271127 315482 190861 76118 68594 30581 38956 75628
15227 75628 93031 87526 -75473 -63376 32362 118127 37318 -53436 -139959 -154670 -81157 -86739
15215 -86739 -49920 -38436 -11206 -104851 -150098 -75092 -69756 -3804 130047 203927 114069 -15849
15203 -15849 -39550 -31138 -2628 -54330 86385 79628 -27320 -86674 -41439 -40974 -35693 -59983
15191 -59983 7319 8714 1196 27970 45780 106807 113389 -94978 -250610 -228928 -82839 -33134
15179 -33134 -83547 -170100 -103231 -87014 -111710 -51825 -72742 -142362 -178696 -57217 35852
15168 35852 54976 57161 15756 120880 194261 195296 143861 161435 70035 67357 82848 21672
15156 21672 -18754 15845 80414 129991 115248 52269 108412 133538 95184 67930 141982 -8096
15144 -8096 -34239 14830 3735 95167 133672 147679 43139 21396 38750 14095 43299 103843
15132 103843 52722 98023 47180 18563 -30663 33896 -39673 114764 199402 149532 62881
15121 62881 52195 41159 46617 117775 78618 -15327 38769 -2467 25764 -56926 -26516 32606
15109 32606 50043 56819 23853 50878 104588 261185 235145 187846 15943 -119604 -138159
15098 -138159 -139570 -112553 -34720 -43361 -71278 -207398 -102975 -60900 -48356 -62863 -41764
15087 -41764 -39397 -44231 -2889 42008 128442 153230 169327 211276 117064 9384 68159 10961
15075 10961 -15643 -1823 67691 84411 18374 -29835 -40649 -88625 -184343 -79925 104309
15064 104309 74258 89909 -22968 -103904 -82878 -183136 -314044 -268272 -189843 -111399 -117142
15053 -117142 -83038 62327 80286 16119 -767 -49198 -154274 -229271 -270972 -132963 -97744
15042 -97744 -174317 -160837 -118187 -66653 -17695 95890 189012 135512 -55323 -131290 -99107
15031 -99107 -85922 -129960 -97891 -66278 -47206 -73548 -28443 28612 -13064 -12298 34054 46554
15019 46554 66295 133764 174216 114720 40269 -36535 -111911 -133857 -126786 -144318 -195737 -254213
15007 -254213 -204761 -68814 15982 15777 25691 -76853 -80895 -94367 -74331 -76292 -41658 -93498
14995 -93498 23491 43377 -46688 570 -19581 32635 57200 -28915 -64957 73467 146256
14984 146256 -8890 -177696 -152265 -84755 -35904 45306 13912 26353 119559 79638 109672
14973 109672 192656 201362 200421 65014 34288 56950 108046 15233 -81003 -59192 -49994 -158415
14961 -158415 -167261 -148906 -63190 -59515 29561 10929 -12273 19255 24030 22462 73846 229340
14949 229340 210085 -21391 -103097 -95530 -91876 -27335 -28578 -4582 68264 144393 112868 184834
14937 184834 163022 125540 60235 14785 75961 112400 113764 38025 -60812 -78575 -59867 -93464
14925 -93464 -86354 -108262 -114801 -103267 -9315 -71419 -45562 13387 69953 84736 112201 76643
14913 76643 169120 300774 314890 222809 91097 33896 -32275 11513 130921 294311 312543
14902 312543 382128 333476 267171 242460 62655 44986 79067 86244 53965 13336 37623
14891 37623 2524 17292 29694 11865 -6708 13460 77904 7590 31183 145522 135481
14880 135481 179535 235591 187696 38905 -76690 -145805 -193769 -93689 -66675 -164229 -87371
14869 -87371 11553 -66552 -97252 -3533 22996 138462 189682 185550 210775 292942 208009 34227
14857 34227 -150251 -168413 -123083 -113211 -60506 -26923 -3636 132515 179221 90465 -12639
14846 -12639 -2737 85514 92212 85990 110375 84635 35173 144641 131910 79313 8010 32487
14834 32487 46666 35262 -2773 161046 246877 189865 96965 74898 44938 -44815 -139534
14823 -139534 -211479 -149916 -49803 28730 -1750 -158831 -148435 -32653 -14072 -164158 -101256
14812 -101256 -13578 15951 -105515 -151024 -82775 33945 -27569 -27224 -51660 44531 180239
14801 180239 157460 53036 9403 -6068 32194 118762 130270 99400 13264 53442 129908
14790 129908 109828 -9776 -114649 16348 54622 6670 -36775 -16849 36220 137535 180362
14779 180362 242688 247545 125130 -3149 34249 82538 38453 59686 93409 36363 112596
14768 112596 138358 223592 299638 310786 300346 163985 68849 -70562 27831 167760 97246
14757 97246 72604 18432 -71847 -55350 -43178 -61490 48685 115935 19258 -45115 -9777
14746 -9777 -4630 -94958 -76265 -103194 -25508 -8868 72905 134701 13545 -87590 49115
14735 49115 133563 84497 100392 140348 75226 80101 84468 93303 39321 -27943 -21123 5172
14723 5172 55063 88812 176523 228519 103024 -48960 -71626 -95674 -131162 -136023 -64438 12873
14711 12873 183127 197103 164936 191608 177100 98077 118236 92393 85066 67396 110295 79749
14699 79749 24556 -573 -38410 -17054 157840 227081 146551 4574 -106230 -70380 -39541
14688 -39541 -125320 -124007 -73360 -16738 -39459 44243 81755 63172 102720 106964 65250 23147
14676 23147 -17253 -60199 -119681 -72703 6663 59771 -7480 -15510 47419 126358 223654 179425
14664 179425 55020 -97423 -63216 56264 91674 71110 142706 185896 120396 125491 165521
14653 165521 72319 57521 116432 187787 120516 21672 -47801 -171958 -164668 -125215 -82255
14642 -82255 11624 51622 -3665 -61267 15606 84635 56429 51625 19468 82614 110819 38828
14630 38828 2598 -13099 -21937 -61562 -17471 5879 49233 -13397 -753 33581 38708 45036
14618 45036 15144 145211 249641 325134 418218 350905 208186 195769 308268 419729 336580
14607 336580 238505 136272 62986 70822 264677 205113 119375 43090 27063 145867 210743
14596 210743 131920 75330 57418 66232 29368 -154 -50591 26580 91184 26057 46454 74088
14584 74088 89869 -12823 77284 286043 152936 70265 28135 82736 162754 205116 270118
14573 270118 381943 306311 194402 216876 191317 174487 120147 18085 98824 152284 192240
14562 192240 166434 103369 -18428 -42630 -128471 -189740 -95305 -60393 -72350 75936 125972
14551 125972 106176 80615 102326 57680 6390 -47998 44103 196297 214559 241314 68276
14540 68276 -31921 134306 99755 136277 102121 107606 124417 174401 196365 160656 111354
14529 111354 134945 269531 181613 230743 229105 64779 77891 95597 34679 30461 147859
14518 147859 116430 -6364 94247 147605 133015 199564 202396 104282 -32153 -36957 -52635
14507 -52635 1496 -2521 -14044 10953 132141 54086 82651 237069 305885 331744 334182 248634
14495 248634 117901 161953 303779 424016 257707 46775 -1441 95595 193931 173164
14485 173164 184859 223902 240748 186596 235774 270348 284223 155564 182110 178449 66280
14474 66280 18533 -41583 52990 169790 191777 140552 80124 4866 1068 56507 56392 -7273
14462 -7273 -11200 -20364 -31304 59510 175199 118549 79045 62717 76267 167203 144816 147712
14450 147712 138309 146316 53253 -54333 -126531 -28541 68308 86207 14864 -100282 -38954
14439 -38954 -30030 -22305 11571 41721 126526 143993 112431 196645 234603 110907 2946 69447
14427 69447 71765 4392 -36896 -80358 -104790 30212 71362 103749 78526 -5558 6169 43288
14415 43288 17164 -39257 28300 115785 93133 -17835 -29689 -48303 -26208 -22434 -26127 -66768
14403 -66768 16806 59514 169211 253823 266907 350628 181061 206721 261722 185646 114208
14392 114208 79896 77664 23019 32226 109430 208637 215341 267425 354190 472802 490202 449381
14380 449381 400340 346362 337337 255814 218086 168968 31024 -59979 -77217 39936 57631
14369 57631 16495 27585 117017 168907 108033 96817 37163 49260 85969 147669 184684 201725
14357 201725 190062 241471 280785 266725 230542 295932 287533 307088 179215 192141 300194
14346 300194 346894 297455 299461 330231 431336 393704 272289 284935 304617 300285 345362
14335 345362 270868 117738 81928 73810 120681 186380 224455 223284 239726 161176 106094 77988
14323 77988 64673 49142 -4021 16032 82435 197936 162579 116786 105051 -50342 -32300
14312 -32300 85452 185072 124371 49502 70656 174989 237500 231010 202622 226780 217877 178502
14300 178502 152890 219907 228945 239175 242049 274293 192999 176156 156983 151100 258330 356878
14288 356878 320533 238288 212727 378948 477607 495514 457139 512922 292996 175190 212898
14277 212898 280112 314249 257982 216712 240278 329356 241018 228058 264450 217668 170774
14266 170774 193513 214266 229482 250873 292364 231315 235733 228340 240133 132366 24469
14255 24469 121268 122423 151755 38717 63344 154325 193860 219623 214705 252638 302862 381531
14243 381531 482996 427377 368541 243861 239518 336246 270054 264253 278722 251498 207207
14232 207207 166674 209316 301659 319390 375138 363629 298118 173058 154765 98602 119239
14221 119239 166589 188817 221887 212469 257137 287590 279486 246169 251913 237720 218544 154305
14209 154305 83371 148730 136623 169428 149649 235517 296753 205388 210464 238701 306681 329103
14197 329103 280832 258133 260241 248904 128190 84386 37508 104193 79290 122121 236036
14186 236036 179246 25608 51257 143989 221927 224670 131742 115831 15812 83584 299273
14175 299273 294201 236986 236400 289528 305105 358119 330320 357694 340383 254878 239314 416202
14163 416202 431293 317468 304471 343224 358495 307974 256939 379125 391929 281976 288181
14152 288181 304923 309149 237370 185200 98844 244726 417226 335010 449355 569702 625309
14141 625309 700981 718392 729641 739262 691882 689972 683449 657226 683236 618226 535176 577878
14129 577878 671019 602892 584140 580051 585930 522927 471865 391491 397237 445963 502885 520061
14117 520061 530984 690255 693060 603084 640505 799326 820835 746355 681657 766974 887253
14106 887253 884839 836670 817941 774674 735887 639805 639445 712527 649914 603738 660256 741320
14094 741320 693477 636936 647441 461182 437977 535352 493578 348419 242358 218149 253266
14083 253266 224710 322903 230864 201332 166856 371564 539472 495927 480092 585749 581461
14072 581461 500618 505048 643378 823772 744001 550770 380823 473265 488711 492653 423930
14061 423930 388802 434407 455509 356923 376171 371627 392296 456220 559900 546501 525942
14050 525942 476423 386928 366402 512555 485562 436577 443615 370823 322214 395792 457471
14039 457471 467081 512968 641329 639743 493944 456752 396893 396008 370078 353851 272930 335039
14027 335039 440347 390807 267493 356089 386429 459344 410604 417122 369949 334739 327140
14016 327140 280629 240605 228102 369630 436812 465668 487487 499056 507330 538355 634988
14005 634988 574638 411534 355490 331539 285356 412687 475416 515621 533301 447961 458326
13994 458326 451839 324571 320833 390588 518637 606223 605772 584013 495668 601137 579093 364931
13982 364931 323787 344267 282050 333582 365829 333363 359020 396120 441772 556484 448447
13971 448447 608652 638446 700188 797153 629085 381186 211330 275566 257262 424842
13961 424842 559425 693991 604892 523174 486509 426491 457908 435492 489267 540794 505012
13950 505012 513411 579064 600704 640919 735219 641740 612318 527446 527541 664672 710111 641849
13938 641849 524421 530546 472675 448078 610026 720145 606163 546826 592839 545442 483947
13927 483947 534832 629688 523571 413822 435612 386716 518956 613692 633700 665366 653223
13916 653223 622913 619539 719461 794859 768401 700804 675996 691184 690853 683541 635480 589368
13904 589368 546866 690272 681622 553288 637377 686308 731604 741867 703625 644717 674353
13893 674353 589997 522059 408870 457667 622738 698045 652380 544414 546253 578735 524232
13882 524232 441391 494430 566678 569862 509989 562516 452283 365548 345178 412030 399712
13871 399712 393808 485666 551225 660831 660876 612678 580192 628083 688824 799735 809728 737587
13859 737587 593867 566668 670838 751501 826287 857557 778278 825651 814201 783457 822464
13848 822464 804750 790795 704975 738763 729924 633668 620148 764235 758673 714580 660481 540946
13836 540946 505453 580712 677651 600790 720972 832399 886791 826965 745544 754430 809761
13825 809761 836809 870200 863042 943036 981206 888968 762098 789365 719508 728664 714374 637776
13813 637776 584947 635020 723534 826440 844816 859330 839458 691569 684984 784477 787706
13802 787706 736095 862924 915450 911272 963583 934639 935108 1024717 1079012 968246 868690 858442
13790 858442 860715 833705 771057 806625 905393 978109 998517 1026838 1001039 906179 878164 931042
13778 931042 965638 941896 952689 911927 876925 904914 895523 870217 836270 932603 1085858
13767 1085858 1134998 1057329 1032959 1098233 1136812 1009056 829776 743909 782501 899565 944626
13756 944626 917275 967285 1056651 1101785 1076723 1176071 1207403 1055415 988322 989797 1032168
13745 1032168 1108290 938005 902127 866748 915647 1083054 1135271 1136668 1155914 1110805 1225351
13734 1225351 1399289 1393093 1269314 1149771 1106090 1156477 1220609 1301314 1315424 1392197 1447262
13723 1447262 1356834 1302727 1200554 1224716 1206570 1218158 1311633 1376439 1325160 1183791 1226723
13712 1226723 1251178 1258575 1233736 1375552 1331962 1315426 1418236 1384253 1316242 1278002 1219205
13701 1219205 1252880 1318266 1317787 1374657 1296794 1288495 1451279 1347258 1286275 1252531 1166143
13690 1166143 1161070 1142267 1165251 1160973 1249753 1261413 1336098 1412455 1414667 1402545 1286877 1276417
13678 1276417 1381328 1509894 1499894 1458472 1377315 1322284 1459806 1499639 1587246 1608354 1666204
13667 1666204 1571924 1293624 1385196 1417497 1416093 1394290 1291533 1248723 1269231 1376580 1586640
13656 1586640 1587185 1617993 1581936 1551630 1527238 1560769 1631464 1561081 1487245 1477295 1487611 1527741
13644 1527741 1487217 1490244 1550192 1602903 1573250 1566559 1600724 1570570 1591210 1668834 1690647 1691247
13632 1691247 1641572 1574073 1503131 1552171 1635978 1760742 1750590 1716526 1851008 1894539 1854743
13621 1854743 1890792 1863237 1925676 2007969 2075549 2062662 1944636 2005856 2045221 2060798 2149376
13610 2149376 2185571 2130729 2164947 2114827 2102634 2088534 2003183 1979856 1980286 2146718 2191261
13599 2191261 2192141 2150163 2174738 2229638 2187513 2186715 2228396 2128198 2140960 2248203 2206121 2175961
13587 2175961 2202305 2151035 2173653 2246965 2298972 2404370 2584365 2659959 2608832 2521174 2491825
13576 2491825 2490539 2501419 2625759 2779197 2667889 2689188 2652223 2491865 2468328 2453549 2578490
13565 2578490 2681327 2644953 2606610 2637246 2616050 2669203 2686784 2801032 2832368 2879921 2917572
13554 2917572 2975704 3048532 3031217 2999027 3068999 3171463 3191394 3019300 2999829 3159868 3211894
13543 3211894 3231621 3264925 3207418 3221147 3245604 3371924 3423815 3252891 3251333 3306150 3410642
13532 3410642 3457142 3483266 3646952 3704533 3629717 3610326 3571732 3526060 3502947 3599714 3719342
13521 3719342 3725233 3714820 3806008 3835739 3866934 3845869 3874787 3910202 3880112 3917581 3973375
13510 3973375 4021151 4141147 4289943 4472892 4458383 4374241 4380569 4518396 4636296 4617186
13500 4617186 4520652 4553675 4499159 4462170 4489424 4647506 4773326 4874160 5025708 5348013
13490 5348013 5501223 5562230 5478775 5253776 5112713 5125317 5253319 5247335 5230427 5238066 5450459
13479 5450459 5459108 5383924 5335433 5295764 5241251 5228589 5163586 5241655 5296926 5281430 5316646
13468 5316646 5416736 5535407 5629372 5716407 5710473 5748217 5895679 6010728 5954779 5962868 5980939
13457 5980939 6023949 6107147 6210274 6272727 6208581 6232644 6352764 6319742 6456559 6727164
13447 6727164 6795098 6700164 6774630 6851481 6802737 6889767 6843624 6861913 6835773 6810485 6927234
13436 6927234 7057125 7196764 7301052 7387991 7556679 7625292 7620519 7690504 7763222 7797494 7771149
13425 7771149 7791501 7979463 8071487 8123250 8136457 8236158 8341760 8483536 8647683 8669082
13415 8669082 8750811 8827373 8777843 8856647 9020889 9233171 9484464 9622354 9689647 9668963
13405 9668963 9689626 9809179 9908780 10088004 10305535 10452940 10569852 10662314 10720194 10794352
13395 10794352 10907313 11098468 11167557 11329102 11481923 11650649 11926455 12068439 12241859
13386 12241859 12402744 12572045 12745098 12924952 13052369 13316531 13535165 13739439 13956178
13377 13956178 14297528 14348554 14454196 14790535 15038175 15208267 15371405 15578344 15763313
13368 15763313 16080812 16446952 16684574 16854196 17050196 17301951 17427657 17547396 17743482
13359 17743482 18096289 18416357 18672841 19162045 19561630 19695372 20016802 20243943 20587526
13350 20587526 21020889 21296512 21563826 21947908 22281236 22627139 22984569 23371242 23865892
13341 23865892 24310027 24733719 25106244 25466911 25991079 26462010 26992692 27500501 27972777
13332 27972777 28523581 29069003 29573624 30132009 30661925 31003552 31432144 31991600 32526687
13323 32526687 33234498 34014891 34706396 35421909 36046652 36714996 37273146 37892005 38578670
13314 38578670 39379238 40133125 40931498 41704493 42468777 43329833 44221281 45157381 46074241
13305 46074241 46932849 47885909 48763404 49644535 50570675 51633618 52825385 53862892 54838830
13296 54838830 55945158 57026072 58101776 59121405 60210236 61472790 62715318 63849505
13288 63849505 65001976 66162373 67387289 68647575 69938052 71119282 72375725 73724241
13280 73724241 74992806 76254504 77535169 78802646 80262066 81556092 82799714 83999186
13272 83999186 85156977 86274644 87414354 88614142 89688270 90693640 91741000 92769449
13264 92769449 93806066 94533256 95244593 96023499 96743852 97431932 98055800 98542201 99078600
13255 99078600 99595468 100025017 100229407 100474262 100685989 100700453 100792940 100797094 100737480 100575376
13245 100575376 100336972 100069166 99744054 99265942 98826016 98279323 97761344 97242988 96634677
13236 96634677 96064274 95354054 94542158 93761749 92863515 91964137 91099665 90089670 89227368
13227 89227368 88398959 87258651 86326604 85381320 84352038 83276426 82224391 81182113
13219 81182113 80062000 78890383 77904983 76885049 75666779 74494497 73439469 72331989
13211 72331989 71222284 70196415 69086639 67968264 66977890 65995632 64959084 63937335
13203 63937335 62843607 61808400 60805668 59756054 58828850 57826337 56739634 55748068
13195 55748068 54824472 53913133 53100142 52181382 51190059 50144175 49248102 48490518 47736290
13186 47736290 46906665 46052712 45217220 44426944 43619961 42799749 41905609 41157589 40467958
13177 40467958 39793088 39048482 38397469 37735803 37078017 36422778 35789366 35178162 34548174
13168 34548174 33839139 33266014 32743101 32257424 31686249 31131947 30512068 30048627 29490377
13159 29490377 29047932 28607752 28056588 27556788 27120541 26580414 26084253 25623076 25344468
13150 25344468 25004114 24554964 24138353 23720358 23211487 22839866 22576790 22181399 21797551
13141 21797551 21413878 21044379 20699160 20316491 20013365 19758371 19548074 19334152 19094287
13132 19094287 18851620 18530720 18198741 17904958 17598836 17345192 17063597 16926320 16608776
13123 16608776 16341168 16187022 15930922 15622677 15359831 15164088 15030621 14747952 14571997
13114 14571997 14454972 14242824 14064945 14048011 13927465 13749815 13562431 13299074 13131887
13105 13131887 12930652 12607389 12385071 12151088 11959275 11916090 11919021 11849849 11706865 11578730
13095 11578730 11322398 11219910 11221002 11111173 10900809 10785657 10728730 10529913 10338644 10389002
13085 10389002 10310069 10154038 9991680 9809104 9733530 9648764 9597330 9516186 9456868 9351456
13075 9351456 9233837 9219751 9249274 9113712 8927302 8792274 8618514 8401305 8405724 8350043
13065 8350043 8316359 8370133 8283526 8180962 8145065 8072216 7839483 7724280 7737007 7652874 7510653
13054 7510653 7436172 7372395 7346786 7303839 7183799 7071497 6932831 6790674 6866353 6932581
13044 6932581 6935977 6795285 6767297 6804279 6660025 6501327 6351318 6299647 6334070 6417609 6410116
13033 6410116 6387507 6345194 6240684 6204535 6077076 6033708 6108895 5954648 5869109 5783630 5742370
13022 5742370 5713112 5581231 5435505 5429562 5381749 5440843 5360130 5290499 5173538 5106109 5123459
13011 5123459 5098667 5082328 5157266 5074474 5016620 5083407 5094871 5055069 5012276 4920059 4950940
13000 4950940 4978041 4919110 4807499 4747125 4640141 4609321 4616628 4516165 4405266 4312611 4322082
12989 4322082 4425993 4421572 4253806 4153821 4153765 4171680 4191735 4125515 4053695 4065082 3936253
12978 3936253 3932149 3949956 3942533 3907090 3826426 3795168 3759797 3704192 3656198 3628002 3586729 3529589
12966 3529589 3521218 3548020 3595954 3520955 3477481 3522453 3572099 3568390 3532480 3362600 3346044
12955 3346044 3339318 3209486 3122223 3160208 3091423 3050915 3078163 3037489 2957332 2936366 2846796
12944 2846796 2853338 2828278 2815504 2800416 2750826 2763812 2830291 2778747 2713048 2676748 2657006
12933 2657006 2656208 2761623 2839960 2800355 2760774 2708018 2741983 2757298 2793405 2880474 2863153
12922 2863153 2705484 2566875 2536144 2627419 2555366 2595220 2630800 2461673 2476629 2531212 2413223
12911 2413223 2372298 2400582 2398808 2409967 2293602 2311964 2407732 2365818 2281741 2428962 2481775
12900 2481775 2540552 2479940 2338479 2193018 2144582 2294662 2261194 2287039 2200547 2135720 2081665
12889 2081665 2162413 2205848 2133002 1880906 1791623 1990138 2014044 1966212 1951823 1966175 2134650
12878 2134650 2183020 2156583 2105040 2053267 1997169 2105317 2187754 2157345 2133126 1996752 2030507
12867 2030507 2063871 2059082 1990293 2149969 2121781 1957913 1927264 1866130 1758929 1693217 1689873
12856 1689873 1720468 1738278 1738954 1678751 1664035 1601260 1593123 1634062 1759711 1773914 1621289
12845 1621289 1440227 1572899 1645051 1457511 1398984 1410898 1300260 1366351 1442346 1503508
12835 1503508 1569806 1590474 1562998 1512477 1477690 1470017 1338520 1307591 1414292 1382766 1362519
12824 1362519 1454916 1402703 1378047 1375379 1420967 1397354 1392625 1451601 1382686 1335418 1347002 1315215
12812 1315215 1372777 1380822 1336067 1367246 1473098 1486886 1414127 1189100 1217327 1303130 1330276
12801 1330276 1348131 1295368 1247762 1220852 1244890 1332230 1338353 1317805 1224244 1267561 1342305
12790 1342305 1208836 1275667 1310264 1251814 1186719 1172716 1241961 1228289 1166764 1093415 1040995
12779 1040995 932568 1026884 1063987 986616 927661 879720 891342 967765 981347 953245 929570
12768 929570 928627 1160923 1261524 1216318 1235129 1332818 1262567 1227218 1080646 1034972 1152353
12757 1152353 1164080 1135737 1155795 1190023 1219785 1305915 1308640 1420735 1463665 1479879 1511164
12746 1511164 1601822 1644026 1564650 1612848 1576032 1503246 1592224 1820031 2234156 2728978 3024279
12735 3024279 2922173 2494821 2100830 1971591 1762928 1603919 1575349 1538230 1529609 1473768
12725 1473768 1284393 1213840 1130397 1077657 1130984 1107914 1059199 1141012 1110378 1038047 1073401
12714 1073401 1115534 1088915 1090453 931130 940926 945291 990962 1015426 959337 880609 819485 881248
12702 881248 914022 1028715 1115739 1004539 953638 846417 829197 812618 814907 869158 959088
12691 959088 947989 853881 715555 616776 690505 767607 823489 738665 710316 715392 830778
12680 830778 958814 959730 958831 937333 883718 882927 717142 737278 880404 972775 920620 911008
12668 911008 829288 848913 711816 697525 734397 849207 940814 787700 566446 485922 546606
12657 546606 632553 753752 620151 454692 490291 706710 842171 796566 719666 588054
12647 588054 549597 579962 570892 493697 593068 578286 506329 479112 484744 419378 396731 504332
12635 504332 565296 422984 349784 418845 439458 450810 428123 424422 477843 496220 442828
12624 442828 560598 568036 547678 489226 397266 502879 527646 460468 430133 455268 495157
12613 495157 584327 606064 507951 477571 571116 464664 362237 289804 340949 341247 442150
12602 442150 430038 515630 625401 670975 650179 727743 570532 426474 413921 352771 355520
12591 355520 327211 346134 316521 446852 595709 566095 509615 438281 477309 502868 382801
12580 382801 434999 550440 487606 510553 424159 315788 440505 536975 451864 327841 385966
12569 385966 511382 610853 676251 676910 690054 545548 465694 522245 640313 677933 616527
12558 616527 473745 310117 335181 410577 466081 461679 517999 617937 538551 504781 512836
12547 512836 507032 494748 500107 399081 309334 248059 274098 181909 274884 413799 418578 377766
12535 377766 316116 319088 332880 326547 348851 452864 496963 568985 663573 618667 479643
12524 479643 533137 613954 586474 488976 497296 507271 578892 601277 522573 523995 506736 490349
12512 490349 378854 436464 494409 406007 498881 596210 417664 311003 357809 343286 343790
12501 343790 360230 417673 477140 461961 499160 441212 455601 375939 263475 337764 402028
12490 402028 244181 293878 492658 580380 491843 411036 451007 657089 565539 432814 239173
12479 239173 205106 292675 363608 323820 410187 488341 521043 508767 419200 415843 279356
12468 279356 212859 171045 92892 63409 183805 354769 361845 335041 359492 365416 413753
12457 413753 408590 412026 441268 417294 442797 517974 566088 469987 377666 234544 235389 203382
12445 203382 196139 267649 301478 240347 193342 270513 241767 220102 290714 358348 353914 414649
12433 414649 367187 304297 234305 262655 381457 303571 185365 112989 132168 247909 314281
12422 314281 330578 311682 345533 383341 248998 200212 264782 289953 218012 160381 232217
12411 232217 285551 210140 149664 83867 119231 214620 339810 287065 269308 213739 259344
12400 259344 245444 213506 200491 283626 365410 306388 191023 199678 292126 271519 219534
12389 219534 188796 167252 91797 146451 186762 304559 404341 276302 194501 166199 248578
12378 248578 377130 302799 308481 325572 351895 390966 357929 339422 350377 252619 281621
12367 281621 268235 258647 309591 329470 308684 344472 387383 379574 365012 365033 365316 351622 265299
12354 265299 208659 299414 441802 429962 266500 290539 367722 393776 453295 407313 351491
12343 351491 340335 286184 230072 261337 357152 414777 305109 284387 314079 264401 192229
12332 192229 205834 203107 174351 83923 101686 156042 257191 350715 424231 356607 138533
12321 138533 93908 72810 55631 128407 92741 106965 160611 159080 161049 290587 312907 187206
12309 187206 200136 275525 360915 389272 486932 463990 312943 102185 201246 174625 12044
12298 12044 -25870 -13369 -79707 70752 100707 62465 118983 134411 126658 54054 45836 15535
12286 15535 -23342 121873 192757 181819 212940 291744 264717 212476 372641 333515 228992
12275 228992 209781 237508 150715 134321 180642 219467 272321 306460 169084 48404 6460
12264 6460 73815 80904 77916 142256 145100 136744 163895 118446 86530 163494 181439 152289 163139
12251 163139 70243 175554 129840 -2004 -17243 -123356 -119484 -15537 48406 185495 250833
12240 250833 156922 113618 81951 -30598 -35750 193878 141601 131372 136376 130829 95214 154238
12228 154238 91522 150971 207977 94012 90709 -21703 -55426 -64596 -2016 -19158 -28881 -92512
12216 -92512 -94859 -128992 -31774 53432 35133 27126 2448 29059 165969 112306 174982 198644
12204 198644 143020 86973 50118 -38275 -53207 -31307 -64019 -19458 83270 -17719 -8047
12193 -8047 41131 47142 62628 138674 136152 188958 179880 101663 113942 19582 -29561 -17959
12181 -17959 29022 121161 188585 129930 -33098 -68908 -649 28715 58939 203108 216539
12170 216539 217293 157829 156474 161469 54666 40568 60069 35357 -3641 15596 140641 133903
12158 133903 83334 106557 77346 106312 128304 161516 88676 -108588 -182862 -71776 18366
12147 18366 19838 68114 105524 52897 -11408 19188 192733 301048 210626 136761 149786
12136 149786 112381 45759 -93695 -59851 -55159 -24303 14897 73553 134189 108196 188866
12125 188866 166955 215198 153957 146991 144813 139350 56417 -13165 55857 56214 170391 262742
12113 262742 216899 104749 55876 126 -41579 39530 74459 28939 -6021 44097 70437
12102 70437 91113 155305 225118 181224 113747 68179 52168 -56132 -166009 -241456 -176083
12091 -176083 -176055 -48625 114549 179391 288291 290237 206791 83179 154839 188866 116022
12080 116022 129361 223457 184211 177089 231121 221972 162868 205365 326124 385999 280382
12069 280382 222786 268732 233202 195562 163657 146201 175307 192464 161223 68556 164725
12058 164725 200905 227510 228489 277730 190612 126194 182187 220699 119461 -19056 4916
12047 4916 15651 108331 140193 143172 179593 256231 229283 142935 67791 707 37578 147739
12035 147739 253711 169212 57165 103228 190196 249264 233597 159493 18099 61262 139846
12024 139846 216598 164959 146445 254585 351840 400348 353571 245573 225575 258654 289699
12013 289699 292304 273054 318812 347444 328156 418601 273055 403952 514942 492736 421720
12002 421720 477391 468987 318176 239088 228360 185691 255514 312626 279299 193697 165588
11991 165588 239037 289660 209553 214622 263524 257194 150680 347575 475487 391841 355200
11980 355200 300450 319980 435754 383060 261977 257764 364726 386080 408480 405716 378845
11969 378845 308840 321109 363465 214686 149223 264784 232228 279257 308750 205444 86678
11958 86678 100023 247708 288679 288673 371207 413893 424111 333368 247096 215808 203294 359641
11946 359641 296976 232920 224825 190938 156291 269435 291802 221091 70839 95826 196653
11935 196653 309089 237708 134188 172873 73575 62259 28872 75287 101899 114587 100571
11924 100571 23344 97795 69381 41397 29760 31377 104706 72087 163678 206457 226889 130722
11912 130722 166968 156373 116312 138226 18299 -32288 70878 144076 178767 284891 230978
11901 230978 335862 189623 116406 111926 108034 157866 230046 121272 104333 94946 167652
11890 167652 125956 67364 65694 150208 303987 396531 271002 183397 121145 77860 68382
11879 68382 101337 142890 85142 -12275 -164620 -191189 -138864 -185557 -106695 -59111 -25545
11868 -25545 -114006 -175552 -95059 -26163 40777 31379 5379 -27647 10294 -49535 -105926 -116953
11856 -116953 -52221 -87459 -103550 -127711 -89302 -78751 -127401 -100029 -43908 -17065 18871
11845 18871 45308 -32513 -97443 -140876 -182257 -120697 -80971 -68956 -77543 15440 41329 69706
11833 69706 22850 -22405 -35998 -78991 -62059 -2414 -53471 -57624 -24907 -39683 -19058 31366
11821 31366 89734 -32667 -120827 -128967 38151 157016 198315 131534 115030 60549 28118
11810 28118 -86394 -96742 -78562 -44845 20469 76404 78959 94264 94973 104287 75754 -95494
11798 -95494 -204635 -164920 -18124 -7330 -73436 -51918 -26579 10003 106470 169829 181793
11787 181793 139870 -82967 1590 192500 131649 142606 164168 159099 137334 155922 199260
11776 199260 139604 94941 154313 104940 64554 71732 49073 -30381 3990 16406 -18213 51064
11764 51064 97445 61805 -7486 8688 54142 111323 137260 186760 97787 -15111 -59199
11753 -59199 -141637 -177566 -165572 -96706 -3801 39723 82223 2593 -60588 -25668 -72040 -33122
11741 -33122 52584 88794 -12276 19433 122745 45835 98567 78551 -36169 33517 171010
11730 171010 214516 106474 2582 -49447 -112612 -138565 -101360 40766 47287 108050 156078
11719 156078 101748 -7669 26314 -75103 -117597 -150988 -197719 -174775 -102163 -47433 32834
11708 32834 -48869 -93467 -27620 -20656 -17265 -35562 -81199 -65104 -91876 -102770 -114780 -85296
11696 -85296 -12888 140234 33899 -73079 -85806 -25807 11528 -8277 -8366 17815 67418 99058
11684 99058 16717 65782 -19174 -49938 20322 3025 -51279 11746 98754 95600 171133 249977
11672 249977 144275 83170 12882 -24026 54024 35559 -54258 -88801 -17741 53028 101735
11661 101735 104654 -91568 -179153 -115014 -114928 -195472 -188764 -182366 -236380 -167954 -144482 -85486
11649 -85486 -148954 -192196 -120686 -108797 -52277 39632 -6085 -55233 -109017 4904 146137
11638 146137 127236 -29581 -68586 -32585 -32060 -27132 -13401 -37952 25734 49787 23423 65625
11626 65625 -3561 -94604 -130248 -175082 -179332 -224794 -147428 -59526 2939 9667 -22527 -60708
11614 -60708 33043 51397 39799 -25151 -53339 -2617 58219 139109 135664 106449 44564 53006
11602 53006 81848 -653 -122110 -223635 -151096 -60354 -14417 98229 105855 62441 -1015
11591 -1015 5844 -9991 -46230 -102608 -56837 -68706 -83909 -16419 927 22108 -25375 113386
11579 113386 89920 42678 -21043 -50801 -89111 -68061 -97613 -42295 -10340 -76854 -57563
11568 -57563 30116 20063 15930 -62699 -97958 -177065 -223098 -287053 -237587 -249524 -121069 -2782
11556 -2782 43189 24021 46937 105035 80949 -11207 -62022 28735 117627 92150 -73432 -118852
11544 -118852 -154828 -181169 -104823 -109355 470 26816 33569 40742 121729 136999 55426 5226
11532 5226 -58028 70648 168301 200904 154717 119614 161967 79167 95474 132283 147964 51832
11520 51832 -15867 -149427 -237199 -203061 -106180 -6739 -31154 35989 238624 306432 173486
11509 173486 153780 81254 66676 62510 -31932 -190854 -167717 407 33867 -89504 -99264
11498 -99264 -43217 -3634 -49265 -78114 -28928 -140747 -65453 -21421 -80738 -79441 -153934 -130118
11486 -130118 -51669 -60973 -99277 -197235 -173799 -97106 -156314 -171138 -189774 -182262 -104764 -115272
11474 -115272 -35477 68941 198250 59085 74408 76365 22327 38678 105490 79990 -32948
11463 -32948 -21461 -17842 -85052 -117476 -175754 -215687 -251429 -144714 -97629 -141175 -212474 -228038
11451 -228038 -204527 -120628 1522 65834 47414 21229 -83478 -211051 -158916 -132253 8074
11440 8074 69064 26942 -145419 -191185 -221704 -133057 -103212 29901 72591 -82703 -51278
11429 -51278 -102791 -120952 -52257 27892 17643 66857 437 -32025 -36561 -96703 -27279 -52946
11417 -52946 -128813 -134244 -77247 -79384 -192038 -153468 -140690 -91073 -102600 -116671 -50694 65706
11405 65706 93986 62465 381 -54386 -113756 -88368 -100654 -281190 -415035 -350000 -238810
11394 -238810 -137355 -126651 -190172 -161032 -137538 24112 -68122 -198101 -112599 -7810 -70266
11383 -70266 -123283 -73983 -110271 -1680 51326 53563 25671 -196135 -320648 -281497 -91938
11372 -91938 39284 -3864 -24916 -29164 -88100 -48938 17080 -8918 -79462 -16572 57509 39950
11360 39950 30745 56206 -42371 -114204 -197141 -149253 -96428 -94622 -4381 96586 166991 198257
11348 198257 196337 145062 21621 -32877 -136671 -35603 -88878 -91742 -34848 -31065 -17619
11337 -17619 -27913 -105817 -75011 -44043 -52094 -67252 -62975 13267 30158 75285 1128 -103593
11325 -103593 -63146 -15517 -6920 -61646 -101517 -138796 -158871 -223009 -334535 -390814 -350397
11314 -350397 -257499 -118343 11724 117800 4020 -36875 -36131 -153337 -168644 -81188 -101861
11303 -101861 -175895 -257717 -202903 -127503 -59679 26363 -22185 -105909 -219460 -182243 -78019
11292 -78019 -127526 -121708 -27277 -45414 -184706 -194315 -84965 -97466 -95848 -95186 -114948 -103932
11280 -103932 -102079 -121241 -11910 26938 62544 34490 -51110 17129 82611 -23861 -43883
11269 -43883 95381 218010 21392 -118938 -73288 -20505 -94525 -85367 -17524 -7970 -36748
11258 -36748 65110 114392 81877 138566 89283 -10211 -128466 -96388 -68956 -2114 -17857
11247 -17857 95861 91298 -23259 -27673 -79236 -214892 -176993 -72053 -77556 -154437 -92737
11236 -92737 -179216 -259490 -230326 -112144 7045 111970 128643 37995 -46476 -92400 -126278
11225 -126278 -122925 -97959 -142268 -151063 -39383 63200 103904 138341 62522 28449 116478
11214 116478 134314 102588 7131 -16706 47230 41916 -58365 -54715 -140820 -95426 -172635 -235408
11202 -235408 -85735 42697 -11183 -82196 -91363 -153726 -306741 -324441 -216619 -175854 -123195
11191 -123195 -35086 -46733 -184304 -101717 -20462 -71114 13134 125283 129376 77877 -117648
11180 -117648 -243371 -152610 -114882 -201046 -120037 -22789 33528 -56665 -109708 -166569 -98216
11169 -98216 -81213 -116311 -64513 27003 83422 58628 -4124 69747 76013 86616 102989 34249
11157 34249 -722 -70452 -42363 12917 26756 -75990 -183803 -209319 -168538 -37380 -21889
11146 -21889 -72559 -116628 -225109 -217802 -140193 -152723 -293981 -234019 -216387 -185448 -122388
11135 -122388 -111342 -61937 -74209 34679 100077 -37944 -87374 -88465 -176817 -153687 28478
11124 28478 50958 5262 -135657 -146073 -117457 -61997 16938 -50093 -122890 -176424 -130307
11113 -130307 -136022 -165093 -168066 -114273 -55632 43848 106294 -24457 49823 61792 -55288
11102 -55288 -60993 8130 64452 150452 31345 -109937 -107149 -31874 -31275 -11980 97099 153143
11090 153143 -600 -6595 114926 20693 -51594 -36356 29509 93258 71497 156250 191201
11079 191201 79891 42246 -36337 -49067 -142462 -144966 42824 91519 92056 70896 13552 -128368
11067 -128368 -95895 -30621 -27011 -9887 82090 98672 18351 -64622 -22733 131952 74151
11056 74151 -30004 -151033 -250861 -191075 -60854 -111473 -131942 -73284 101561 104496 9589
11045 9589 117689 129641 84081 12693 16373 76378 16253 -144131 -185250 -234601 -229077 -137236
11033 -137236 -140415 -150893 -95662 -141392 -203781 -184617 -190507 -213304 -217040 -147187 -253609 -270887
11021 -270887 -250295 -236823 -245142 -228898 -231609 -210184 -144278 -184086 -195610 -237989 -220689 -165846
11009 -165846 -90235 -1662 -60912 -98709 -59852 -13866 -189256 -258950 -147451 -62089 -149828
10998 -149828 -157429 -178275 -223117 -266440 -249050 -178022 -177718 -93257 -25640 -16355 10701 12054
10986 12054 118903 116657 41435 -43148 -171486 -111877 -61943 -10075 136872 126137 -106017
10975 -106017 -143909 -146460 -145708 -163277 -195523 -182788 -167344 2999 94009 48754 58289 -4208
10963 -4208 -64408 -117009 -81225 -136345 -149150 -40211 56521 64605 47825 9144 58648 -1712
10951 -1712 -38867 104705 143308 140421 139106 161851 86205 45025 -26179 -104058 -155874 -128377
10939 -128377 -77151 -20715 -95437 -150718 -202074 -186173 -64375 -35192 -181411 -206156 -190493
10928 -190493 -191452 -124838 -87345 -280223 -303823 -142885 -17987 -54635 -25070 -83144 -144470
10917 -144470 -115699 -55507 7329 -60444 -4273 -31334 -57115 -23327 -36569 -40495 -36357 -15765
10905 -15765 -49694 -129677 -162634 -173911 -169316 -189097 -207745 -70314 -12080 -3999 -1268 -128893
10893 -128893 -181381 -171496 -132468 -185524 -301588 -346256 -196485 -126596 14580 21095 -67235
10882 -67235 -91547 -66542 -47189 -4976 58654 -24434 -139484 -93638 -5800 152283 78107
10871 78107 -88849 -154731 -107173 -134292 -119800 -152346 -192246 -226911 -209396 -219933 -269824
10860 -269824 -274159 -181171 -114757 -74246 -111393 -127282 -154342 -65507 9060 -13610 62958 76008
10848 76008 19111 -65548 -45314 -43726 -89285 -89391 45426 68333 35110 -43603 -137356 -232247
10836 -232247 -225995 -107395 -42058 43980 54273 -5395 -33621 -49454 -84451 -27551 -46595
10825 -46595 -88973 -202438 -254248 -229861 -302861 -263123 -260044 -205968 -182107 -40614 74932
10814 74932 81839 6892 -1838 32109 89992 -30543 -137442 -168621 -155725 -63755 59311
10803 59311 39163 37783 52920 122936 94215 78122 67122 152885 108067 52496 -31949 -49837
10791 -49837 0 54507 100188 41742 -75187 -141868 -196591 -264549 -269307 -158944 -147988
10780 -147988 -81825 71647 108124 -2809 -48558 -69878 -107613 -88403 -115435 4104 37168
10769 37168 -57932 -221135 -228490 -208679 -189539 -155594 -140660 7242 -26945 -89004 -84349 -61353
10757 -61353 -196283 -247707 -198553 -204861 -190244 -186348 -159663 -172214 -152757 -31759 -90344 -117277
10745 -117277 -204541 -203904 -171034 -138904 -127208 -168076 -227149 -130170 -105803 -86421 -164072 -100524
10733 -100524 1600 -21004 -77299 -80273 -111916 -125337 -117801 -870 -54407 -100487 -68003
10722 -68003 -102006 -24728 -6279 -105605 -338360 -345335 -254275 -118175 26194 -94723 -271325
10711 -271325 -303911 -318570 -139154 -25570 19664 74364 50512 -23872 -26860 -16238 -12391
10700 -12391 -55175 -170148 -201428 -149891 -107165 -90712 -125605 -105474 4955 -9227 -33177
10689 -33177 -120632 -214144 -416883 -462468 -234127 -110111 -91648 -77818 -48630 -211419 -241403
10678 -241403 -180958 -164967 -231966 -253095 -226073 -221843 -177215 -164087 -153791 -106489 -119538 -86316
10666 -86316 -53410 -143922 -273755 -175185 -139344 -126315 -75079 3691 -34415 -60008 -36515
10655 -36515 23581 32590 -172436 -267825 -324515 -377418 -173066 -72563 -117516 -15709 77113
10644 77113 161663 125214 105822 94730 141730 68790 -35152 -71386 -9848 3920 18626
10633 18626 -40680 -39757 -33840 -157504 -162074 -95855 -142098 -245886 -235221 -122142 -108142 -129461
10621 -129461 12766 90603 68025 -93136 -46216 -112101 -111969 -4010 89270 77370 -36336
10610 -36336 -13391 33784 -60076 -102934 -160118 -70594 -78555 -126232 -16719 -13598 -76810 -73903
10598 -73903 -74847 -125310 -177722 -200931 -151234 -98450 -17059 -58623 -50827 77085 105280 -12771
10586 -12771 -6838 8663 -160941 -138974 -118493 -128505 -161989 -185113 -178540 -72478 -76186 21369
10574 21369 85440 105281 221936 198398 131305 26090 -15393 -41513 -162478 -139467 -175283
10563 -175283 -181450 -80873 90931 74653 19900 32591 53994 -38348 -42140 28473 99744
10552 99744 88464 -18320 -52221 -166384 -132201 15535 141502 170758 87361 -36496 56247
10541 56247 44825 82127 101235 118309 137347 57660 38913 20788 3352 33212 -10568 83963
10529 83963 58799 23654 82157 67483 170637 248890 104773 67787 187459 240947 219212
10518 219212 236645 89279 35153 29794 95155 67697 75193 201810 202629 267765 242190 237530
10506 237530 223784 142407 34637 -63499 -7626 60457 236806 257351 142371 160892 88193
10495 88193 11082 82702 68598 74945 74328 44756 148251 168891 136602 77679 114008 149905
10483 149905 225610 213348 126492 44696 -9046 112486 233158 269173 73954 11940 9882
10472 9882 55575 123617 93341 24482 51924 40864 54897 69652 -46642 -113754 -154682 -25279
10460 -25279 156582 129449 76240 141162 150533 187987 183834 234667 231907 296668 355815 415887
10448 415887 456093 498048 533725 538672 519294 461701 432181 433202 485178 427308 437709 391411
10436 391411 274030 312817 384130 352208 362191 410625 386439 324951 449954 362561 268502
10425 268502 225621 234420 160266 216626 277737 309500 191346 159918 261815 417422 415888
10414 415888 361721 434097 368066 309959 327299 279082 158321 204522 314807 383078 403301
10403 403301 402086 513665 542869 471930 461114 532577 508396 360806 284630 290024 301902
10392 301902 311985 296278 379433 288058 223491 182775 189192 146336 221831 281254 352058 440341
10380 440341 399722 357276 315586 279812 352967 369790 416702 488910 529997 451666 383251
10369 383251 424188 400528 439967 498838 486495 443191 339273 231927 285946 348835 400241
10358 400241 443422 588428 558899 510861 594076 675567 668753 613566 571503 671820 791608
10347 791608 995649 1179712 1403542 1424872 1298977 1298606 1417850 1482330 1472320 1471642 1447698
10336 1447698 1343644 1334313 1242314 1240133 1259983 1195254 1042737 970339 890998 860761 816842
10325 816842 771623 822678 883338 999184 1144511 1203548 1172269 1204747 1200752 1087358 1022313
10314 1022313 1121906 1237566 1187580 1092345 1047912 1090502 1093063 949142 826882 737437 778610
10303 778610 887506 854903 796088 800020 837129 771873 724398 700626 746798 771934 750699
10292 750699 860351 940947 965156 921073 913152 940153 900927 880107 821705 799265 766138
10281 766138 678427 617639 618869 692623 691909 646331 516203 450643 387107 355361 320913 298020
10269 298020 401030 236521 144851 182334 247403 237220 228439 284242 359508 417740 423091
10258 423091 358424 352691 367403 382036 314836 265186 388878 345987 337852 279487 184663 126335
10246 126335 238243 249196 200641 157060 184033 212422 198509 185342 249206 246511 318155
10235 318155 248349 212270 153828 227977 193655 188714 170918 244149 269518 235105 184565 150784
10223 150784 198847 95663 42247 67601 -22516 -152007 -164507 -45334 6417 -24106 135947
$$ [...]
##END NTUPLES=NMR SPECTRUM
##END=
