##TITLE=Analysis number 312024
Compound Code cc 35916
Book Reference 419/166/2
Project Code adrs
Chemist Name anns
##JCAMPDX= 6.0         $$ Bruker NMR JCAMP-DX V2.0
##DATA TYPE= NMR SPECTRUM
##DATA CLASS= NTUPLES
##ORIGIN= Bruker BioSpin GmbH
##OWNER= NMR
$$ XWIN-NMR		Version 3.5
$$ Thu Jul 21 13:56:03 2005 GMT Daylight Time (UT+1h)  MAYBRIDGE\NMR@NMR_250MHZ
##.OBSERVE FREQUENCY= 250.131544655141
##.OBSERVE NUCLEUS= ^1H
##.ACQUISITION MODE= SIMULTANEOUS (DQD)
##.ACQUISITION SCHEME= undefined
##.AVERAGES= 16
##.DIGITISER RES= 18
##SPECTROMETER/DATA SYSTEM= dpx250
##.PULSE SEQUENCE= zg30
##.SOLVENT NAME= CDCl3
##.SHIFT REFERENCE= (INTERNAL, CDCl3, 0, 16.522)
##AUDIT TRAIL= $$ (NUMBER, WHEN, WHO, WHERE, WHAT)
$$ ##TITLE= Audit trail, XWIN-NMR		Version 3.5
$$ ##JCAMPDX= 5.01
$$ ##ORIGIN= Bruker BioSpin GmbH
$$ ##OWNER= NMR
$$ C:\u/data/dgb/nmr/ADRS/6290/pdata/1/auditp.txt
$$ ##AUDIT TRAIL=  $$ (NUMBER, WHEN, WHO, WHERE, WHAT)
(   1,<2005-07-21 13:55:43.10 +100>,<MAYBRIDGE\NMR>,<NMR_250MHZ>,
      <created by zg, POWCHK disabled, PULCHK disabled
       configuration hash MD5:
       62 19 C7 07 E1 42 D1 B7 37 6C 3D D0 77 39 F9 E6
       data hash MD5: 64K
       05 E2 5A 08 F8 9B 66 57 68 65 77 EA 64 B8 92 F7>)
(   2,<2005-07-21 13:55:54.96 +100>,<MAYBRIDGE\NMR>,<NMR_250MHZ>,
      <Start of raw data processing
       ef LB = 0.3 FT_mod = 6 PKNL = 1 SI = 32K 
       data hash MD5: 32K
       52 6E 26 0C A6 F6 5C E8 04 70 37 1F CD E6 F2 73>)
(   3,<2005-07-21 13:55:56.75 +100>,<MAYBRIDGE\NMR>,<NMR_250MHZ>,
      <apk 
       data hash MD5: 32K
       E8 FB 41 B5 41 6A 4E 6D E8 A5 56 34 8C 26 83 E8>)
(   4,<2005-07-21 13:55:57.43 +100>,<MAYBRIDGE\NMR>,<NMR_250MHZ>,
      <abs ABSG = 5 
       data hash MD5: 32K
       E0 FE 6D C1 48 FF C8 77 05 BD 83 B1 AB BF A4 54>)
$$ ##END=
$$ 
$$ hash MD5
$$ A8 0F 93 6A 08 DD 56 8B 84 DE D5 F8 3A 07 8E 62
##$RELAX= 
##$RELAX= 
##$RELAX= 
##$RELAX= 
##$RELAX= 
##$RELAX= 
##$RELAX= 
$$ Bruker specific parameters
$$ --------------------------
##$DU= <C:\u>
##$EXPNO= 6290
##$NAME= <ADRS>
##$PROCNO= 1
##$TYPE= <nmr>
##$USER= <dgb>
##$AMP= (0..31)
100 100 100 100 100 100 100 100 100 100 100 100 100 100 100 100 100 100 
100 100 100 100 100 100 100 100 100 100 100 100 100 100 
##$AQSEQ= 0
##$AQ_mod= 3
##$AUNM= <au_zg>
##$AUTOPOS= <33 >
##$BF1= 250.13
##$BF2= 250.13
##$BF3= 250.13
##$BF4= 250.13
##$BF5= 500.13
##$BF6= 500.13
##$BF7= 500.13
##$BF8= 500.13
##$BYTORDA= 1
##$CFDGTYP= 0
##$CFRGTYP= 5
##$CHEMSTR= <none>
##$CNST= (0..31)
1 1 145 1 1 1 1 1 1 1 1 1 1 1 1 1 1 1 1 1 1 1 1 1 1 1 1 1 1 1 1 1 
##$CPDPRG= <>
##$CPDPRG1= <>
##$CPDPRG2= <>
##$CPDPRG3= <>
##$CPDPRG4= <mlev>
##$CPDPRG5= <mlev>
##$CPDPRG6= <mlev>
##$CPDPRG7= <mlev>
##$CPDPRG8= <mlev>
##$CPDPRGB= <>
##$CPDPRGT= <>
##$D= (0..31)
0 1 0 0 0 0 0 0 0 0.06 0 0 0 0 0 0 0.0002 0 0 0 0 0 0 0 0 0 0 0 0 0 0 
0 
##$DATE= 1121950542
##$DBL= (0..7)
120 120 120 120 120 120 120 120 
##$DBP= (0..7)
150 150 150 150 150 150 150 150 
##$DBP07= 0
##$DBPNAM0= <>
##$DBPNAM1= <>
$$ [...]
##$SUBNAM7= <"">
##$SUBNAM8= <"">
##$SUBNAM9= <"">
##$SW= 20.6930455092707
##$SWIBOX= (0..15)
0 0 3 0 0 0 0 0 0 0 0 0 0 0 0 0 
##$SW_h= 5175.983436853
##$TD= 65536
##$TD0= 1
##$TE= 295.16
##$TE2= 300
##$TE3= 300
##$TEG= 300
##$TL= (0..7)
0 120 120 120 120 120 120 120 
##$TP= (0..7)
150 150 150 150 150 150 150 150 
##$TP07= 0
##$TPNAME0= <>
##$TPNAME1= <>
##$TPNAME2= <>
##$TPNAME3= <>
##$TPNAME4= <>
##$TPNAME5= <>
##$TPNAME6= <>
##$TPNAME7= <>
##$TPOAL= (0..7)
0.5 0.5 0.5 0.5 0.5 0.5 0.5 0.5 
##$TPOFFS= (0..7)
0 0 0 0 0 0 0 0 
##$TUNHIN= 0
##$TUNHOUT= 0
##$TUNXOUT= 0
##$USERA1= <user>
##$USERA2= <user>
##$USERA3= <user>
##$USERA4= <user>
##$USERA5= <user>
##$V9= 5
##$VALIST= <valist>
##$VCLIST= <CCCCCCCCCCCCCCC>
##$VD= 0
##$VDLIST= <DDDDDDDDDDDDDDD>
##$VPLIST= <PPPPPPPPPPPPPPP>
##$VTLIST= <TTTTTTTTTTTTTTT>
##$WBST= 1024
##$WBSW= 4
##$XGAIN= (0..3)
0 0 0 0 
##$XL= 0
##$YL= 0
##$YMAX_a= 402116
##$YMIN_a= -466803
##$ZGOPTNS= <>
##$ZL1= 120
##$ZL2= 120
##$ZL3= 120
##$ZL4= 120
##$ABSF1= 16.522
##$ABSF2= -4.171173
##$ABSG= 5
##$ABSL= 3
##$ALPHA= 0
##$AQORDER= 0
##$ASSFAC= 0
##$ASSFACI= 0
##$ASSFACX= 0
##$ASSWID= 0
##$AUNMP= <proc_1d>
##$AZFE= 0.1
##$AZFW= 0.1
##$BCFW= 0
##$BC_mod= 0
##$BYTORDP= 0
##$COROFFS= 0
##$CY= 12.5
##$DATMOD= 1
##$DC= 0
##$DFILT= <>
##$DTYPP= 0
##$F1P= 14.0000005364418
##$F2P= -0.99999901652339
##$FCOR= 0.5
##$FTSIZE= 32768
##$FT_mod= 6
##$GAMMA= 0
##$GB= 0
##$INTBC= 1
##$INTSCL= 1
##$ISEN= 128
##$LB= 0.3
##$LEV0= 0
##$LPBIN= 0
##$MAXI= 10000
##$MC2= 0
##$MEAN= 0
##$ME_mod= 0
##$MI= 0
##$NCOEF= 0
##$NC_proc= -3
##$NLEV= 6
##$NOISF1= 0
##$NOISF2= 0
##$NSP= 0
##$NTH_PI= 0
##$NZP= 0
##$OFFSET= 16.522
##$PC= 1
##$PHC0= -82.14886
##$PHC1= 7.975251
##$PH_mod= 1
##$PKNL= yes
##$PPARMOD= 0
##$PSCAL= 4
##$PSIGN= 0
##$REVERSE= no
##$SF= 250.13
##$SI= 32768
##$SIGF1= 0
##$SIGF2= 0
##$SINO= 400
##$SIOLD= 32768
##$SREGLST= <1H.CDCl3>
##$SSB= 0
##$STSI= 32768
##$STSR= 0
##$SW_p= 5175.98343685301
##$SYMM= 0
##$S_DEV= 0
##$TDeff= 65536
##$TDoff= 0
##$TI= <Analysis number 999999
Compound Code 99
Book Reference 9
Project Code 9>
##$TILT= no
##$TM1= 0
##$TM2= 0
##$TOPLEV= 0
##$USERP1= <user>
##$USERP2= <user>
##$USERP3= <user>
##$USERP4= <user>
##$USERP5= <user>
##$WDW= 1
##$XDIM= 32768
##$YMAX_p= 290689300
##$YMIN_p= -59399
$$ End of Bruker specific parameters
$$ ---------------------------------
##NTUPLES= NMR SPECTRUM
##VAR_NAME=  FREQUENCY,     SPECTRUM/REAL,   SPECTRUM/IMAG
##SYMBOL=    X,             R,               I
##VAR_TYPE=  INDEPENDENT,   DEPENDENT,       DEPENDENT
##VAR_FORM=  AFFN,          ASDF,            ASDF
##VAR_DIM=   32768,         32768,           32768
##UNITS=     HZ,            ARBITRARY UNITS, ARBITRARY UNITS
##FACTOR=    0.157963299565203, 1,           1
##FIRST=     4132.6476996994, 0,             0
##LAST=      -1043.33573715361, 0,           0
##MIN=       -1043.33573715361, -59399,      0
##MAX=       4132.6476996994, 290689300,     0
$$ Real data points
##PAGE= N=1
##DATA TABLE= (X++(R..R)), XYDATA
$$ [...]
##PAGE= N=2
##DATA TABLE= (X++(I..I)), XYDATA
$$ plain form
15288 343513 353267 371582 360714 351009 359131 371579 376334 386153 374614 366231 378821 376335 367581
15275 367581 368030 367495 378210 376584 375006 377469 362497 359009 357511 371868 383735 378725 375717 364905
15261 364905 369642 377854 387428 389721 388810 369291 358754 359160 359492 363085 367463 370717 372744 383353
15247 383353 372910 374691 368687 353134 356788 373496 385609 386852 375205 379616 374943 368481 374335
15234 374335 390888 402032 401672 398480 389943 391416 394241 406460 412534 402566 391865 392461 394475 392559
15220 392559 385124 394647 396572 401568 415896 407144 405368 402674 404027 403709 395594 386362 392421 395129
15206 395129 398525 404213 404174 410255 394818 396399 407733 413653 414376 404914 400560 397058 405218 408395
15192 408395 396526 392662 408517 423411 423032 402363 386452 382663 385223 397393 402302 387177 380915
$$ packed form
15288C43513R754J8315j0868r705Q122J2448M755R819j1539q383J2590k486q754
15275C67581M49n35J0715j626j578K463j4972l488j498J4357J1867n010l008j0812
15261C64905M737Q212R574K293r11j9519j0537M06L32L593M378L254K027J0609
15247C83353j0443J781o004j5553L654J6708J2113J243j1647M411m673o462N854
15234C74335J6553J1144l60l192q537J473K825J2219O074r968j0701N96K014j916
15220C92559p435R523J925M996J4328q752j776k694J353l18q115r232O059K708
15206C95129L396N688l9O081j5437J581J1334N920P23r462m354l502Q160L177
15192D08395j1869l864J5855J4894l79k0669j5911l789K560J2170M909j5125o262
$$ plain form
15179 380915 385423 398734 410265 405368 403109 398146 408359 413493 406941 399446 407062 407906 411318 414035
15165 414035 416311 405765 396684 399337 403984 401029 402318 410315 418021 428562 443313 454369 449211
15152 449211 443433 441227 430930 433646 430124 427671 434331 424498 429458 425194 422049 433164 444384
15139 444384 450678 453467 443671 429901 433340 445098 451958 444551 441056 435476 437908 445167 453003 443861
15125 443861 445868 444385 445436 432228 434403 439216 443767 437816 442796 445093 442098 451837 453092 443828
15111 443828 437298 440504 435869 423149 420791 433951 429421 428210 431345 438253 440321 441191 438834 446254
15097 446254 445775 442018 430493 426892 435139 450602 460848 467858 464161 451026 462587 476319 470977
15084 470977 463252 461523 454154 458114 449926 437767 440054 452857 460434 466188 452874 448502 442423
$$ packed form
15179C80915M508J3311J1531m897k259m963J0213N134o552p495P616Q44L412K717
15165D14035K276j0546r081K653M647k955J289P997P706J0541J4751J1056n158
15152D49211n778k206j0297K716l522k453O660r833M960m264l145J1115J1220
15139D44384O294K789r796j3770L439J1758O860p407l495n580K432P259P836r142
15125D43861K007j483J051j3208K175M813M551n951M980K297k995R739J255r264
15111D43828o530L206m635j2720k358J3160m530j211L135O908K068Q70k357P420
15097D46254m79l757j1525l601Q247J5463J0246P010l697j3135J1561J3732n342
15084D70977p725j729p369L960q188j2159K287J2803P577N754j3314m372o079
$$ plain form
15071 442423 437012 435417 436760 451301 453435 450259 448503 455314 450530 457699 466712 475108 482915 475302
15057 475302 459590 450704 458842 471097 464656 468518 467302 458004 457228 452032 448686 454360 460069 465054
15043 465054 464957 460097 467123 475703 477942 484085 485528 472807 466600 473521 481175 486298 487114 480410 471919
15028 471919 469041 467230 481400 481341 472380 464379 469374 469038 476429 487791 494295 488949 475537 471069
15014 471069 484109 489940 488436 486668 492173 485569 482732 495513 501939 504056 502325 503506 502017 498353
15000 498353 500806 483802 480343 481216 486927 493961 484060 492559 493780 495657 499612 503887 501212 491453
14986 491453 499512 501046 497606 497487 509776 508210 498411 498355 494263 500227 517128 520703 531931 526094
14972 526094 517184 522025 507977 486785 475983 478801 492699 491527 490633 504396 518534 521740 509083
$$ packed form
15071D42423n411j595J343J4541K134l176j756O811m784P169R013Q396P807p613
15057D75302j5712q886Q138J2255o441L862j216r298p76n196l346N674N709M985
15043D65054r7m860P026Q580K239O143J443j2721o207O921P654N123Q16o704q491
15028D71919k878j811J4170n9q961q001M995l36P391J1362O504n346j3412m468
15014D71069J3040N831j504j768N505o604k837J2781O426K117j731J181j489l664
15000D98353K453j7004l459Q73N711P034r901Q499J221J877L955M275k675r759
14986D91453Q059J534l440j19J2289j566r799n6m092N964J6901L575J1228n837
14972E26094q910M841j4048k1192j0802K818J3898j172q94J3763J4138L206j2657
$$ plain form
14959 509083 502032 497024 510769 520076 512318 509603 510947 507241 511403 506961 497536 499252 502737 510840
14945 510840 508189 508537 505405 501660 501344 509228 517335 520033 515634 504249 499235 510904 525302 529199
14931 529199 524852 525450 529468 531563 533767 529598 522382 521733 515023 500084 496562 494412 496519 513416
14917 513416 535650 548592 541016 532414 519679 515711 514614 523218 527658 521483 538429 536923 530777
14904 530777 533098 533199 529312 523272 528138 528591 538653 540615 548647 552001 546038 541240 554914 555841
14890 555841 538228 532854 536588 549207 543213 541074 535067 534194 538806 543581 542823 541829 534645 535138 543999
14875 543999 551603 555461 543466 533951 530989 529478 537587 531944 535446 552859 558381 550321 543996 537755
14861 537755 535885 536514 538827 527259 529325 537225 552054 565051 551401 556200 555157 547477 541842
$$ packed form
14959E09083p051n008J3745R307p758k715J344l706M162m442r425J716L485Q103
14945E10840k651L48l132l745l16P884Q107K698m399j1385n014J1669J4398L897
14931E29199m347N98M018K095K204m169p216o49o710j4939l522k150K107J6897
14917E13416K2234J2942p576q602j2735l968j097Q604M440o175J6946j506o146
14904E30777K321J01l887o040M866M53J0062J962Q032L354n963m798J3674R27
14890E55841j7613n374L734J2619n994k139o007q73M612M775p58r94p184M93Q861
14875E43999P604L858j1995r515k962j511Q109n643L502J7413N522q060o325o241
14861E37755j870O29K313j1568K066P900J4829J2997j3650M799j043p680n635
$$ plain form
14848 541842 553292 553596 554151 565356 555438 562203 561378 558829 563289 571531 559050 551620 563050 561615
14834 561615 546092 541256 555443 559652 559738 563551 569718 586901 589317 588655 577652 561052 554842 566905
14820 566905 585162 579837 582627 594795 598360 586553 575183 573767 568482 577907 581172 577308 579104
14807 579104 572568 565143 574679 588805 588605 590318 597051 598036 600562 591780 595615 590465 591852 605251
14793 605251 604283 602475 587326 580215 572487 575138 584537 574606 554854 555999 566860 581566 587385
14780 587385 591447 596985 592118 596654 592637 585651 587126 596112 589468 592217 599117 594828 592446 591803
14766 591803 590318 600623 613262 611774 604736 593428 579629 586332 593561 586452 584760 587955 590746
14753 590746 584248 575536 586986 587850 583744 582987 597240 613279 614611 623552 622111 610376 601277 600217
$$ packed form
14848E41842J1450L04N55J1205r918O765q25k549M460Q242j2481p430J1430j435
14834E61615j5523m836J4187M209Q6L813O167J7183K416o62j1003j6600o210J2063
14820E66905J8257n325K790J2168L565j1807j1370j416n285R425L265l864J796
14807E79104o536p425R536J4126k00J713O733R85K526q782L835n150J387J3399
14793F05251r68j808j5149p111p728K651R399r931j9752J145J0861J4706N819
14780E87385M062N538m867M536m017o986J475Q986o644K749O900m289k382o43
14766E91803j485J0305J2639j488p038j1308j3799O703P229p109j692L195K791
14753E90746o498q712J1450Q64m106p57J4253J6039J332Q941j441j1735r099j060
$$ plain form
14739 600217 610119 621217 619239 623128 628852 631764 626383 627190 631215 622851 616431 614139 620639 623564
14725 623564 619381 623287 622286 608924 613555 625035 626010 623770 623554 631557 626900 629453 624483 613574
14711 613574 611389 610008 607288 623146 618006 626190 634186 631433 634019 639708 645637 640962 635408 627268
14697 627268 628250 643509 643307 626089 618671 621091 630307 637554 645223 652923 655304 649528 634904 624179
14683 624179 630194 628522 628462 634271 638402 654678 639731 627518 629859 630631 628380 638496 645944 649701
14669 649701 643678 639161 621743 612619 632434 645528 635222 629001 631585 626056 633317 636447 643360
14656 643360 647409 641719 635020 633994 642535 654961 667265 664055 658582 655977 655223 651289 663918 664259
14642 664259 656620 650974 654288 664707 682103 676494 658572 659458 659870 661276 672727 683389 691607
$$ packed form
14739F00217R902J1098j978L889N724K912n381Q07M025q364o420k292O500K925
14725F23564m183L906j001j3362M631J1480R75k240k16Q003m657K553m970j0909
14711F13574k185j381k720J5858n140Q184P996k753K586N689N929m675n554q140
14697F27268R82J5259k02j7218p418K420R216P247P669P700K381n776j4624j0725
14683F24179O015j672o0N809M131J6276j4947j2213K341P72k251J0116P448L757
14669F49701o023m517j7418r124J9815J3094j0306o221K584n529P261L130O913
14656F43360M049n690o699j026Q541J2426J2304l210n473k605p54l934J2629L41
14642F64259p639n646L314J0419J7396n609j7922Q86M12J406J1451J0662Q218
$$ plain form
14629 691607 688147 683953 673595 669080 668442 668392 678309 670585 684432 688611 680202 682985 681716 667727
14615 667727 672734 660625 658878 665277 659675 661700 668360 665976 671349 668489 660197 662954 673743 670340
14601 670340 660187 652943 648749 655494 671750 678277 673477 675244 673376 669686 679085 681359 680846 678110
14587 678110 658835 669370 682385 671846 674117 674011 682354 690676 685662 691054 676900 668808 673991
14574 673991 669646 668347 670432 682536 678378 681476 682530 682934 684704 679442 681116 683115 689302 691821
14560 691821 697946 694510 697049 702871 706695 707421 710817 706969 700806 706233 705081 695583 690288 687222
14546 687222 685479 687661 693430 699338 701399 713367 721155 715819 720114 720753 726017 738797 729253 707677
14532 707677 697612 697413 702407 697216 698057 690825 677664 686227 695567 697052 686788 687142 692513 694253
$$ packed form
14629F91607l460m194j0358m515o38n0R917p724J3847M179q409K783j269j3989
14615F67727N007j2109j747O399n602K025O660k384N373k860q292K757J0789l403
14601F70340j0153p244m194O745J6256O527m800J767j868l690R399K274n13k736
14587F78110j9275J0535J3015j0539K271j06Q343Q322n014N392j4154q092N183
14574F73991m345j299K085J2104m158L098J054M04J770n262J674J999O187K519
14560F91821O125l436K539N822L824P26L396l848o163N427j152r498n295l066
14546F87222j743K182N769N908K061J1968P788n336M295O39N264J2780r544k1576
14532G07677j0065j99M994n191Q41p232j3161Q563R340J485j0264L54N371J740
$$ plain form
14518 694253 698642 710335 705691 703101 702483 708173 711821 691613 696850 696435 702899 713567 709594 697178
14504 697178 697738 693856 693106 690136 691112 687240 691438 695510 688089 699198 706490 708200 704179 711274 702304
14489 702304 694884 705292 702873 689142 683389 686105 687079 693314 701464 707939 698359 704188 726960 721486
14475 721486 721002 727825 735002 740591 723450 722321 739263 751533 746504 736864 741405 753660 755675
14462 755675 752499 741195 739845 736503 733248 728997 729112 724853 739903 746674 727956 731336 732918 742071
14448 742071 752059 748495 729141 720406 734667 736840 734399 737556 745869 750945 741922 736342 751911
14435 751911 755793 737161 744030 746458 736011 736211 734069 737339 729739 736395 726452 741780 752076
14422 752076 752419 753399 745066 726153 709880 720174 728624 737229 743414 750835 744466 742398 749869 742641
$$ packed form
14518F94253M389J1693m644k590o18N690L648k0208N237m15O464J0668l973j2416
14504F97178N60l882p50k970R76l872M198M072p421J1109P292J710m021P095q970
14489G02304p420J0408k419j3731n753K716R74O235Q150O475r580N829K2772n474
14475G21486m84O823P177N589j7141j129J6942J2270n029r640M541J2255K015
14462G55675l176j1304j350l342l255m251J15m259J5050O771j8718L380J582R153
14448G42071R988l564j9354q735J4261K173k441L157Q313N076r023n580J5569
14435G51911L882j8632O869K428j0447K00k142L270p600O656r943J5328J0296
14422G52076L43R80q333j8913j6273J0294Q450Q605O185P421o369k068P471p228
$$ plain form
14408 742641 734120 731442 719998 715248 718589 735461 736027 732606 723930 720941 719648 717561 716131 731755
14394 731755 742962 739726 744167 745083 745956 750833 730066 732325 735719 729502 734033 742005 743142 744715
14380 744715 744349 731965 727887 741007 750301 759265 763168 761610 764207 753367 751082 741238 727411
14367 727411 720536 728010 728372 739546 742903 740444 742660 724695 716482 723071 726210 731466 736923 744527
14353 744527 748778 739020 728677 727852 730084 725978 733759 737942 735946 735366 742926 750220 740658 728223
14339 728223 724088 724406 727000 739551 748478 755715 763544 761720 750209 754197 755365 758222 763331 753759
14325 753759 749739 744328 751103 750541 752377 758235 760887 760934 752627 750683 761329 755519 750911 751825 746839
14310 746839 739357 741505 746817 771762 787077 778748 786559 783881 768845 778219 775427 763109 766271
$$ packed form
14408G42641q521k678j1444m750L341J6872N66l421q676k989j293k087j430J5624
14394G31755J1207l236M441R16Q73M877k0767K259L394o217M531P972J137J573
14380G44715l66j2384m078J3120R294Q964L903j558K597j0840k285r844j3827
14367G27411o875P474L62J1174L357k459K216j7965q213O589L139N256N457P604
14353G44527M251r758j0343q25K232m106P781M183j996n80P560P294r562j2435
14339G28223m135L18K594J2551Q927P237P829j824j1511L988J168K857N109r572
14325G53759m020n411O775n62J836N858K652M7q307j944J0646n810m608R14m986
14310G46839p482K148N312K4945J5315q329P811k678j5036R374k792j2318L162
$$ plain form
14297 766271 776696 777984 775075 768401 761105 759832 760394 779143 782651 776255 769542 772299 775865 765938
14283 765938 772756 780946 787261 789194 794172 802424 805034 799132 789066 782113 805161 811847 803103 811951
14269 811951 816652 815844 806039 796840 788862 786319 788404 802082 806650 796223 786123 775038 780156
14256 780156 791083 804990 806236 800170 786169 785443 783484 794449 798919 805962 808834 810860 804166
14243 804166 808230 812945 821426 815536 806573 797746 800717 801231 804092 804871 795781 795716 797425 801757 808440
14228 808440 818588 826979 824147 819195 807989 806547 809752 806141 799511 815727 825618 822842 829429
14215 829429 825233 816498 828686 828624 828037 840050 836223 834516 836109 829385 820436 808944 807275 813130
14201 813130 804039 806826 808631 819506 835210 844931 834370 825776 832249 831787 833114 828272 832716 831961
$$ packed form
14297G66271J0425J288k909o674p296j273N62J8749L508o396o713K757L566r927
14283G65938O818Q190O315J933M978Q252K610n902j0066o953K3048O686q744Q848
14269H11951M701q08r805r199p978k543K085J3678M568j0427j0100j1085N118
14256G80156J0927J3907J246o066j4001p26j959J0965M470P043K872K026o694
14243H04166M064M715Q481n890q963q827K971N14K861P79r090o5J709M332O683
14228H08440J0148Q391k832m952j1206j442L205l611o630J6216R891k776O587
14215H29429m196q735J2188o2n87J2013l827j707J593o724q949j1492j669N855
14201H13130r091K787J805J0875J5704R721j0561q594O473m62J327m842M444p55
$$ plain form
14187 831961 830041 836152 845561 850070 845735 833633 838666 836837 833678 839908 845973 855006 858461 844181
14173 844181 841487 833449 824340 835881 851193 850294 846184 840716 841490 841280 849498 851484 853710 844661
14159 844661 842467 841631 838636 843672 848427 846955 848075 840691 838951 845666 849420 859620 866019 867073
14145 867073 862760 849881 847774 849843 849430 858930 860841 852386 856461 864955 875805 880705 873876 886479
14131 886479 884546 887295 886280 888009 880453 873441 863174 858326 870518 866605 866559 858863 874391 879370
14117 879370 865491 855603 850259 865761 878591 881387 890031 890122 880987 875821 880497 874620 866380 878512
14103 878512 890450 887811 879402 896002 909248 905173 889602 887738 880890 888008 887591 883567 891599
14090 891599 889723 887949 878582 880221 890114 909843 907897 884652 880663 892131 894307 884195 892599
$$ packed form
14187H31961j920O111R409M509m335j2102N033j829l159O230O065R033L455j4280
14173H44181k694q038r109J1541J5312q99m110n468P74k10Q218J986K226r049
14159H44661k194q36k995N036M755j472J120p384j740O715L754J0200O399J054
14145H67073m313j2879k107K069m13R500J911q455M075Q494J0850M900o829J2603
14131H86479j933K749j015J729p556p012j0267m848J2192l913m6p696J5528M979
14117H79370j3879r888n344J5502J2830K796Q644R1r135n166M676n877q240J2132
14103H78512J1938k639q409J6600J3246m075j5571j864o848P118m17m024Q032
14090H91599j876j774r367J639R893J9729j946k3245l989J1468K176j0112Q404
$$ plain form
14077 892599 891362 896681 908501 908392 917653 916323 920491 919662 924934 927867 930306 924183 916676 918214
14063 918214 915570 906646 906032 901168 920615 932255 934319 925499 926934 927487 929409 930264 935566 939209
14049 939209 926849 915780 921935 923650 926284 934124 944766 939258 930562 931570 924990 924820 925720 926887
14035 926887 926116 932907 931343 928426 928232 931271 941010 933317 917207 907963 916057 924847 931732 925886
14021 925886 932102 929748 925953 911304 915268 925097 927164 922537 911374 907969 895916 890601 906229
14008 906229 934305 941372 944582 943903 945996 957102 943640 936026 933118 932301 920792 912194 912442 921617
13994 921617 922484 927218 938195 939891 934525 923579 935515 933178 923167 926608 937518 949248 956723
13981 956723 956787 960514 959904 961113 951403 949358 952922 968475 969719 963102 958344 951376 958959 952191 953315
$$ packed form
14077H92599j237N319J1820j09R261j330M168q29N272K933K439o123p507J538
14063I18214k644q924o14m864J9447J1640K064q820J435N53J922Q55N302L643
14049I39209j2360j1069O155J715K634P840J0642n508q696J008o580j70R00J167
14035I26887p71O791j564k917j94L039R739p693j6110r244Q094Q790O885n846
14021I25886O216k354l795j4649L964R829K067m627j1163l405j2053n315J5628
14008I06229K8076P067L210o79K093J1106j3462p614k908q17j1509q598K48R175
13994I21617Q67M734J0977J696n366j0946J1936k337j0011L441J0910J1730P475
13981I56723O4L727o10J209r710k045L564J5553J244o617m758o968P583o768J124
$$ plain form
13966 953315 976452 985902 969750 965611 978745 984202 991215 995825 990726 982630 974345 972660 971487
13953 971487 978444 985908 996686 993345 982749 970261 968185 970558 959134 958989 979240 993760 997775
13940 997775 996521 998971 986730 971320 973445 987984 982812 984893 987585 993963 1000677 995674 989895
13927 989895 988649 989001 986065 975460 982163 989920 990555 991970 998739 1001520 1003972 999714 996861 980243
13913 980243 975781 981371 988821 991121 994221 998677 994013 991950 986045 984116 984878 1006343 1019974 1007068
13899 1007068 1006174 1004235 1005715 1004510 998053 992004 991915 1002417 1014207 1022805 1030017 1019232 1028444 1021395
13885 1021395 1004300 1002202 1006445 1006482 1000817 1008001 1015684 1008859 1007721 1016860 1015993 1026081 1029967 1020804
13871 1020804 1017108 1025417 1032698 1040381 1037922 1034305 1033278 1020672 1018439 1014303 1025625 1038376 1037153
$$ packed form
13966I53315K3137R450j6152m139J3134N457P013M610n099q096q285j685j173
13953I71487O957P464J0778l341j0596j2488k076K373j1424j45K0251J4520M015
13940I97775j254K450j2241j5410K125J4539n172K081K692O378O714n003n779
13927I89895j246L52k936j0605O703P757O35J415O769K781K452m258k853j6618
13913I80243m462N590P450K300L100M456m664k063n905j929P62K1465J3631j2906
13899A007068q94j939J480j205o457o049q9J0502J1790Q598P212j0785R212p049
13885A021395j7095k098M243L7n665P184P683o825j138R139q67J0088L886r163
13871A020804l696Q309P281P683k459l617j027j2606k233m136J1322J2751j223
$$ plain form
13858 1037153 1010169 1007168 1024403 1033625 1030611 1025536 1026630 1039360 1034066 1042864 1047836 1049230 1049200 1030078
13844 1030078 1028716 1029084 1028534 1030206 1030520 1029787 1032207 1035631 1035572 1032571 1055302 1056774 1050522 1037383 1030904
13829 1030904 1019741 1031558 1049342 1051222 1052340 1052877 1060292 1052980 1059574 1068649 1060961 1054860 1057841
13816 1057841 1061368 1072396 1068968 1065146 1063332 1065836 1063647 1061709 1062042 1049701 1045500 1066157 1079132
13803 1079132 1063050 1057200 1061525 1057268 1054956 1063616 1072761 1074241 1070110 1073245 1074851 1070578 1080175 1084739
13789 1084739 1069476 1074467 1082028 1079660 1077041 1074861 1083744 1074490 1071892 1072219 1067663 1064599 1069400 1089399
13775 1089399 1104309 1106933 1101784 1100487 1093765 1088497 1076571 1074237 1073008 1080556 1093390 1087825 1085065
13762 1085065 1075084 1080606 1090611 1097967 1096017 1093560 1089332 1089573 1091710 1100812 1105792 1099930 1089634 1090083
$$ packed form
13858A037153k6984l001J7235R222l014n075J094J2730n294Q798M972J394l0j9122
13844A030078j362L68n50J672L14p33K420L424n9l001K2731J472o252j3139o479
13829A030904j1163J1817J7784J880J118N37P415p312O594R075p688o101K981
13816A057841L527J1028l428l822j814K504k189j938L33j2341m201K0657J2975
13803A079132j6082n850M325m257k312Q660R145J480m131L135J606m273R597M564
13789A084739j5263M991P561k368k619k180Q883r254k598L27m556l064M801J9999
13775A089399J4910K624n149j297o722n268j1926k334j229P548J2834n565k760
13762A085065r981N522J0005P356j950k457m228K41K137R102M980n862j0296M49
$$ plain form
13748 1090083 1094385 1100807 1108979 1118121 1113019 1117113 1118581 1118092 1113668 1110700 1107937 1110488 1114978 1105209
13734 1105209 1095993 1086792 1089969 1095546 1089273 1094817 1094224 1085714 1092986 1109712 1115950 1119352 1120695 1115547
13720 1115547 1123709 1131875 1127157 1135807 1131921 1130481 1123760 1123806 1140838 1139119 1147230 1159437 1144383 1125607
13706 1125607 1120637 1126465 1130644 1114915 1111361 1121980 1127628 1114607 1110202 1127775 1141468 1138524 1134129
13693 1134129 1113190 1104628 1110662 1126410 1143384 1150484 1153369 1158232 1156831 1149376 1152473 1147639 1147205
13680 1147205 1138081 1130707 1126525 1129445 1140529 1148497 1147281 1152604 1150902 1151198 1162169 1156198 1146319 1139199
13666 1139199 1149679 1161757 1162823 1151141 1151745 1147753 1141848 1139083 1132855 1144890 1156725 1155513 1153820
13653 1153820 1156510 1154407 1156357 1155249 1170192 1165881 1166062 1169477 1181199 1197322 1183083 1177665 1169691
$$ packed form
13748A090083M302O422Q172R142n102M094J468m89m424k968k763K551M490r769
13734A105209r216r201L177N577o273N544n93q510P272J6726O238L402J343n148
13720A115547Q162Q166m718Q650l886j440o721M6J7032j719Q111J2207j5054j8776
13706A125607m970N828M179j5729l554J0619N648j3021m405J7573J3693k944m395
13693A134129k0939q562O034J5748J6974P100K885M863j401p455L097m834m34
13680A147205r124p374m182K920J1084P968j216N323j702K96J0971n971r879p120
13666A139199J0480J2078J066j1682O04l992n905k765o228J2035J1835j212j693
13653A153820K690k103J950j108J4943m311J81L415J1722J6123j4239n418p974
$$ plain form
13640 1169691 1160511 1152406 1158977 1181976 1179463 1174068 1172961 1167875 1172261 1171343 1171563 1189607 1196837 1181089
13626 1181089 1176946 1183757 1185570 1186604 1191297 1182757 1181282 1187840 1185000 1185508 1187555 1183489 1186288 1188146
13612 1188146 1186653 1193599 1201699 1197262 1201462 1203662 1188186 1181028 1203574 1209069 1203149 1204412 1202490
13599 1202490 1206567 1221685 1232166 1223563 1202040 1205194 1212857 1210307 1214434 1215917 1209323 1206241 1199415
13586 1199415 1192282 1189151 1206460 1222447 1218288 1217827 1203813 1197380 1208863 1214056 1223689 1228481 1234319
13573 1234319 1219235 1202856 1205671 1223575 1232430 1236526 1227874 1221836 1215386 1216422 1213940 1217049 1209558
13560 1209558 1216539 1216858 1213528 1220615 1213172 1221241 1224001 1246432 1250377 1241550 1239625 1224827 1229347 1246525
13546 1246525 1244686 1231410 1245408 1253688 1250262 1241857 1236375 1230860 1234722 1244223 1236447 1241021 1237963
$$ packed form
13640A169691r180q105O571K2999k513n395j107n086M386r18K20J8044P230j5748
13626A181089m143O811J813J034M693q540j475O558k840N08K047m066K799J858
13612A188146j493O946Q100m437M200K200j5476p158K2546N495n920J263j922
13599A202490M077J5118J0481q603k1523L154P663k550M127J483o594l082o826
13586A199415p133l131J7309J5987m159m61j4014o433J1483N193R633M792N838
13573A234319j5084j6379K815J7904Q855M096q652o038o450J036k482L109p491
13560A209558O981L19l330P087p443Q069K760K2431L945q827j925j4798M520J7178
13546A246525j839j3276J3998Q280l426q405n482n515L862R501p776M574l058
$$ plain form
13533 1237963 1242658 1260154 1279447 1274741 1258324 1248542 1250324 1255451 1258650 1253200 1251596 1253069 1266088
13520 1266088 1259124 1246613 1249890 1251947 1252117 1243719 1242113 1241785 1255551 1269561 1261768 1256166 1262603 1267380
13506 1267380 1270491 1272577 1278442 1285801 1275693 1265227 1259156 1281613 1296943 1287119 1274650 1280910 1282321
13493 1282321 1265550 1272990 1281724 1273068 1277275 1282011 1281899 1288377 1293834 1269323 1270358 1293130 1298547
13480 1298547 1304489 1308398 1310515 1302305 1297515 1305939 1305751 1299649 1298808 1293875 1305709 1313840 1308190 1300404
13466 1300404 1306983 1314734 1325096 1316833 1305422 1314172 1325596 1327931 1328028 1333877 1325541 1304099 1293963
13453 1293963 1310382 1329163 1339584 1335090 1332781 1331923 1324134 1335332 1341640 1338551 1343112 1338286 1334429
13440 1334429 1336886 1346369 1344760 1339473 1326440 1329108 1331359 1336050 1337451 1334288 1323130 1320743 1313046
$$ packed form
13533A237963M695J7496J9293m706j6417r782J782N127L199n450j604J473J3019
13520A266088o964j2511L277K057J70q398j606l28J3766J4010p793n602O437M777
13506A267380L111K086N865P359j0108j0466o071K2457J5330r824j2469O260J411
13493A282321j6771P440Q734q656M207M736j12O478N457k4511J035K2772N417
13480A298547N942L909K117q210m790Q424j88o102q41m933J1834Q131n650p786
13466A300404O579P751J0362q263j1411Q750J1424K335R7N849q336k1442j0136
13453A293963J6419J8781J0421m494k309q58p789J1198O308l089M561m826l857
13440A334429K457R483j609n287j3033K668K251M691J401l163j1158k387p697
$$ plain form
13427 1313046 1323113 1333484 1343295 1346648 1350173 1350511 1359625 1353994 1367536 1369986 1372306 1361141 1351951
13414 1351951 1362755 1377806 1379100 1359270 1358669 1365468 1360494 1356495 1343624 1335124 1339854 1354730 1357540
13401 1357540 1350899 1358084 1364932 1357132 1359194 1365588 1365456 1352369 1351590 1354585 1354474 1342791 1352828 1368465
13387 1368465 1360334 1351722 1345864 1347922 1360286 1371727 1373317 1363539 1364278 1368213 1366903 1368629 1370603 1372303
13373 1372303 1385044 1395595 1395973 1398347 1393215 1386823 1394022 1401616 1391301 1382727 1374364 1369730 1370911
13360 1370911 1379255 1392760 1398095 1395225 1404793 1402674 1396104 1408498 1412229 1415264 1422167 1415811 1409969
13347 1409969 1406954 1396668 1396753 1411662 1408483 1402658 1404178 1420594 1414623 1407922 1416358 1413133 1412171 1416854
13333 1416854 1421295 1422248 1423688 1404375 1407580 1420366 1423784 1414409 1412839 1425679 1436141 1444805 1429683
$$ packed form
13427A313046J0067J0371R811L353L525L38R114n631J3542K450K320j1165r190
13414A351951J0804J5051J294j9830o01O799m974l999j2871q500M730J4876K810
13401A357540o641P185O848p800K062O394j32j3087p79K995j11j1683J0037J5637
13387A368465q131q612n858K058J2364J1441J590r778P39L935j310J726J974J700
13373A372303J2741J0551L78K374n132o392P199P594j0315q574q363m634J181
13360A370911Q344J3505N335k870R568k119o570J2394L731L035O903o356n842
13347A409969l015j0286Q5J4909l179n825J520J6416n971o701Q436l225r62M683
13333A416854M441R53J440j9313L205J2786L418r375j570J2840J0462Q664j5122
$$ plain form
13320 1429683 1420773 1421338 1421168 1430213 1436343 1427981 1435204 1448117 1448231 1441618 1429315 1420292 1415671 1434058
13306 1434058 1455060 1460731 1455777 1457705 1464425 1474186 1487305 1478754 1468870 1473415 1476787 1481809 1477549
13293 1477549 1470497 1471870 1471333 1466379 1459761 1453119 1456673 1464677 1460506 1446825 1452473 1465888 1481778
13280 1481778 1488268 1486569 1491487 1477595 1476891 1480069 1487278 1491105 1477621 1467604 1487716 1483233 1477955
13267 1477955 1489484 1496355 1478866 1471659 1470844 1477993 1482399 1490103 1499842 1507466 1502206 1483432 1480936
13254 1480936 1489189 1488598 1500156 1508855 1513774 1503929 1496052 1486831 1490081 1496804 1494178 1501418 1497786 1507974
13240 1507974 1523055 1526353 1520152 1514965 1517033 1509958 1509826 1513911 1522880 1512334 1519645 1538448 1540423
13227 1540423 1526030 1513617 1506716 1509041 1518564 1531400 1536496 1548725 1554783 1552385 1559334 1566976 1562712
$$ packed form
13320A429683q910N65j70R045O130q362P223J2913J14o613j2303r023m621J8387
13306A434058K1002N671m954J928O720R761J3119q551r884M545L372N022m260
13293A477549p052J373n37m954o618o642L554Q004m171j3681N648J3415J5890
13280A481778O490j699M918j3892p04L178P209L827j3484j0017K0112m483n278
13267A477955J1529O871j7489p207q15P149M406P704R739P624n260j8774k496
13254A480936Q253n91J1558Q699M919r845p877r221L250O723k626P240l632J0188
13240A507974J5081L298o201n187K068p075j32M085Q969j0546P311J8803J975
13227A540423j4393j2413o901K325R523J2836N096J2229O058k398O949P642m264
$$ plain form
13214 1562712 1560913 1555259 1549409 1556571 1558251 1563812 1560556 1554330 1558550 1564134 1556206 1548480 1555203 1554094
13200 1554094 1551342 1545821 1546752 1558612 1577349 1573005 1557348 1565333 1570666 1570881 1566735 1569836 1571258 1574879
13186 1574879 1575118 1575376 1556518 1550002 1557370 1574048 1568798 1560364 1551161 1562994 1559445 1560271 1563675 1558052
13172 1558052 1558004 1560410 1567413 1572425 1584253 1577380 1582903 1598837 1595009 1591190 1591184 1586043 1588046 1593427 1593500
13157 1593500 1593869 1600127 1601203 1589939 1581776 1594989 1600136 1610095 1617403 1624943 1629258 1629802 1630171 1632691
13143 1632691 1624656 1620533 1607538 1600663 1605218 1608903 1607421 1606510 1589719 1591138 1608850 1615625 1629642
13130 1629642 1625466 1620247 1618654 1616720 1614005 1621121 1633963 1639696 1641170 1635272 1628206 1633976 1640299 1652054
13116 1652054 1652211 1647593 1646039 1652559 1660665 1654426 1661008 1662296 1650334 1648625 1654069 1660804 1675455 1681803
$$ packed form
13214A562712j799n654n850P162J680N561l256o226M220N584p928p726O723j109
13200A554094k752n521R31J1860J8737m344j5657P985N333K15m146L101J422L621
13186A574879K39K58j8858o516P368J6678n250q434r203J1833l549Q26L404n623
13172A558052m8K406P003N012J1828o873N523J5934l828l819on141K003N381P3
13157A593500L69O258J076j1264q163J3213N147R959P308P540M315N44L69K520
13143A632691q035m123j2995o875M555L685j482r11j6791J419J7712O775J4017
13130A629642m176n219j593j934k715P116J2842N733J474n898p066N770O323J1755
13116A652054J57m618j554O520Q106o239O582J288j1962j709N444O735J4651O348
$$ plain form
13102 1681803 1681911 1681904 1670253 1662375 1676421 1691576 1681105 1683088 1683485 1674181 1661295 1662235 1653703 1663383
13088 1663383 1674898 1680920 1684915 1679840 1675118 1683383 1681785 1685185 1686968 1682392 1677571 1680308 1687776 1704473
13074 1704473 1709034 1715720 1707681 1704448 1695837 1687783 1693944 1700219 1694249 1688536 1700186 1714906 1719709
13061 1719709 1719929 1712482 1707839 1692755 1700259 1700579 1696045 1707697 1712988 1723725 1722506 1725582 1733997 1735134
13047 1735134 1738608 1739476 1740442 1742880 1751368 1759956 1760925 1751725 1738886 1740169 1749294 1753929 1751162 1736978
13033 1736978 1734651 1744312 1743393 1746218 1741796 1739591 1753135 1748662 1753077 1760713 1760756 1768061 1770476 1771356 1777433
13018 1777433 1783295 1786722 1779882 1776049 1784650 1776840 1766797 1771411 1772492 1766019 1775126 1793910 1796998
13005 1796998 1795246 1789240 1792365 1790794 1802495 1802117 1796599 1785236 1782039 1794070 1803417 1812871 1818155
$$ packed form
13102A681803J08pj1651p878J4046J5155j0471J983L97r304j2886R40q532R680
13088A663383J1515O022L995n075m722Q265j598L400J783m576m821K737P468J6697
13074A704473M561O686q039l233q611q054O161O275n970n713J1650J4720M803
13061A719709K20p447m643j5084P504L20m534J1652N291J0737j219L076Q415J137
13047A735134L474Q68R66K438Q488Q588R69r200j2839J283R125M635k767j4184
13033A736978k327R661r19K825m422k205J3544m473M415P636M3P305K415Q80O077
13018A777433N862L427o840l833Q601p810j0043M614J081o473R107J8784L088
13005A796998j752o006L125j571J1701l78n518j1363l197J2031R347R454N284
$$ plain form
12992 1818155 1829557 1826896 1830487 1820467 1803006 1790393 1797606 1809223 1815083 1804636 1801211 1807602
12980 1807602 1817940 1822600 1811428 1802386 1801689 1808957 1802396 1807450 1818417 1817049 1821669 1827384 1842849
12967 1842849 1856963 1849295 1841019 1835399 1836552 1839528 1846737 1858950 1867226 1856934 1840336 1852512 1868023
12954 1868023 1867787 1871921 1869654 1860103 1853298 1857803 1862481 1858000 1866676 1860244 1853371 1868035 1875132 1887370
12940 1887370 1881560 1873290 1874158 1882536 1887198 1899214 1895126 1896059 1890654 1896781 1909985 1902859 1902810 1922980
12926 1922980 1932897 1923855 1903217 1905074 1892889 1895714 1897683 1901482 1909060 1913861 1924239 1928575 1918823
12913 1918823 1919013 1916541 1933297 1932482 1924191 1922304 1931799 1946793 1952570 1944343 1934559 1928591 1927624 1917379
12899 1917379 1932240 1949986 1953299 1938506 1936069 1949909 1953452 1952491 1941831 1934307 1940836 1951473 1955969
$$ packed form
12992A818155J1402k661L591j0020j7461j2613P213J1617N860j0447l425O391
12980A807602J0338M660j1172r042o97P268o561N054J0967j368M620N715J5465
12967A842849J4114p668q276n620J153K976P209J2213Q276j0292j6598J2176J5511
12954A868023k36M134k267r551o805M505M678m481Q676o432o873J4664P097J2238
12940A887370n810q270Q68Q378M662J2016m088R33n405O127J3204p126m9K0170
12926A922980R917r042k0638J857j2185K825J969L799P578M801J0378M336r752
12913A918823J90k472J6756q15q291j887R495J4994N777q227r784n968r67j0245
12899A917379J4861J7746L313j4793k437J3840L543r61j0660p524O529J0637M496
$$ plain form
12886 1955969 1955142 1959700 1962738 1960572 1959952 1975837 1992027 1989284 1989762 2002115 1998794 1988648 1996486 1992698
12872 1992698 1967389 1955293 1964158 1970302 1963132 1947607 1949704 1947512 1959132 1971818 1984229 1994516
12860 1994516 1988434 1985600 2007725 2015511 2009024 2012190 2023692 2024796 2012230 2009098 2018712 2031055 2030268
12847 2030268 2024551 2022599 2013242 2027298 2029101 2039520 2037191 2040428 2044721 2040088 2036953 2034585 2032067
12834 2032067 2032227 2034976 2033293 2044390 2050132 2056329 2070314 2056620 2048398 2056090 2069469 2072536 2063921
12821 2063921 2065335 2056514 2055923 2057510 2053399 2058239 2059531 2057410 2060123 2071544 2071988 2085950 2091687 2093246
12807 2093246 2109007 2120508 2125420 2117435 2122105 2125535 2123663 2135591 2127764 2130053 2136557 2141942 2145016
12794 2145016 2154029 2139319 2119745 2115701 2122719 2133111 2139504 2139909 2140250 2136922 2133895 2120940 2132997
$$ packed form
12886A955969q27M558L038k166o20J5885J6190k743M78J2353l321j0146P838l788
12872A992698k5309j2096Q865O144p170j5525K097k192J1620J2686J2411J0287
12860A994516o082k834K2125P786o487L166J1502J104j2566l132R614J2343p87
12847B030268n717j952r357J4056J803J0419k329L237M293m633l135k368k518
12834B032067J60K749j683J1097N742O197J3985j3694q222P692J3379L067q615
12821B063921J414q821n91J587m111M840J292k121K713J1421M44J3962N737J559
12807B093246J5761J1501M912p985M670L430j872J1928p827K289O504N385L074
12794B145016R013j4710j9574m044P018J0392O393M05L41l328l027j2955J2057
$$ plain form
12781 2132997 2141162 2151356 2152062 2144604 2131534 2139956 2146326 2138489 2136899 2148208 2151738 2153750 2156069
12768 2156069 2156198 2151659 2162892 2175229 2182198 2182377 2170416 2180028 2182294 2192225 2196773 2185780 2186752 2196783
12754 2196783 2199491 2205346 2216402 2229068 2232267 2231564 2224186 2218133 2219741 2220364 2219562 2235761 2241742 2236012
12740 2236012 2240683 2250680 2262207 2253277 2260965 2277121 2279164 2264349 2256651 2257691 2269899 2274447 2261505
12727 2261505 2245920 2245551 2244240 2228907 2212439 2210425 2202211 2197424 2201287 2210761 2224287 2231748 2236325
12714 2236325 2251375 2249240 2245729 2252863 2252570 2246588 2238850 2238831 2256342 2276715 2273021 2266117 2278430 2304746
12700 2304746 2305217 2301233 2303743 2297046 2284784 2277257 2293611 2311237 2312078 2319373 2327925 2327300 2327326 2327620 2324445
12685 2324445 2326579 2337001 2343574 2335354 2342895 2348235 2348808 2350320 2346656 2360754 2380154 2395031 2402642
$$ packed form
12781B132997Q165J0194P06p458j3070Q422O370p837j590J1309L530K012K319
12768B156069J29m539J1233J2337O969J79j1961R612K266R931M548j0993R72J0031
12754B196783K708N855J1056J2666L199p03p378o053J608O23q02J6199N981n730
12740B236012M671R997J1527q930P688J6156K043j4815p698J040J2208M548j2942
12727B261505j5585l69j311j5333j6468k014q214m787L863R474J3526P461M577
12714B236325J5050k135l511P134k93n982p738j9J7511K0373l694o904J2313K6316
12700B304746M71l984K510o697j2262p527J6354J7626Q41P295Q552o25K6K94l175
12685B324445K134J0422O573q220P541N340N73J512l664J4098J9400J4877P611
$$ plain form
12672 2402642 2398571 2407273 2419755 2425250 2419358 2389950 2380349 2385284 2392063 2392232 2375623 2373635 2368168
12659 2368168 2367580 2376852 2380615 2374915 2379769 2386688 2380329 2377028 2392518 2394668 2392638 2384168 2378830 2393870
12645 2393870 2412642 2420067 2426644 2429885 2424189 2420336 2422848 2425237 2413355 2422274 2436842 2438376 2437604
12632 2437604 2440304 2437396 2432902 2424822 2435228 2446819 2450565 2445041 2445956 2459241 2462573 2465801 2471950
12619 2471950 2473809 2467442 2459474 2463415 2458883 2455271 2460427 2454671 2443862 2449208 2453738 2440284 2424773
12606 2424773 2443287 2458357 2469377 2478847 2470621 2473687 2476971 2472891 2461553 2456886 2446964 2471261 2477575
12593 2477575 2470242 2467762 2473847 2489234 2493797 2489613 2487199 2477478 2474158 2474878 2472696 2485574 2496236
12580 2496236 2494126 2495020 2489549 2481201 2492059 2510786 2502727 2499423 2502019 2495930 2487408 2494567 2500592 2512480
$$ packed form
12672B402642m071Q702J2482N495n892k9408r601M935O779J69j6609j988n467
12659B368168n88R272L763n700M854O919o359l301J5490K150k030q470n338J5040
12645B393870J8772P425O577L241n696l853K512K389j1882Q919J4568J534p72
12632B437604K700k908m494q080J0406J1591L746n524R15J3285L332L228O149
12619B471950J859o367p968L941m532l612N156n756j0809N346M530j3454j5511
12606B424773J8514J5070J1020R470q226L066L284m080j1338m667r922K4297O314
12593B477575p333k480O085J5387M563m184k414r721l320P20k182J2878J0662
12580B496236k110Q94n471q348J0858J8727q059l304K596o089q522P159O025J1888
$$ plain form
12566 2512480 2508884 2509803 2519553 2519742 2517258 2519730 2520749 2527377 2533916 2536396 2529364 2541695 2551115 2556858
12552 2556858 2556343 2550681 2548803 2550785 2548533 2550431 2551843 2551106 2546749 2552999 2559621 2559406 2556118 2550359 2550097
12537 2550097 2555020 2561120 2569482 2585666 2592904 2601132 2601831 2601145 2604526 2606958 2616767 2612349 2620925 2625864
12523 2625864 2618857 2619692 2619569 2604801 2609865 2629659 2619105 2606325 2621610 2628920 2638760 2648436 2647620
12510 2647620 2641108 2645815 2657333 2658471 2665705 2690549 2684793 2671849 2673390 2681294 2683275 2680257 2684771
12497 2684771 2686167 2685025 2688040 2684435 2663242 2658967 2676909 2690646 2699625 2719177 2730540 2723179 2720014
12484 2720014 2728237 2733711 2733280 2742395 2752854 2749631 2755521 2761824 2766917 2775281 2784649 2798485 2783896
12471 2783896 2778444 2782057 2779469 2775741 2779946 2775833 2771999 2787811 2792146 2791942 2796806 2802040 2810407 2819294
$$ packed form
12566B512480l596R19R750J89k484K472J019O628O539K480p032J2331R420N743
12552B556858n15n662j878J982k252J898J412p37m357O250O622k15l288n759k62
12537B550097M923O100Q362J6184P238Q228O99o86L381K432R809m418Q576M939
12523B625864p007Q35j23j4768N064J9794j0554j2780J5285P310R840R676q16
12510B647620o512M707J1518J138P234K4844n756j2944J541P904J981l018M514
12497B684771J396j142L015l605k1193m275J7942J3737Q979J9552J1363p361l165
12484B720014Q223N474m31R115J0459l223N890O303N093Q364R368J3836j4589
12471B783896n452L613k588l728M205m113l834J5812M335k04M864N234Q367Q887
$$ plain form
12457 2819294 2837044 2839493 2846086 2842906 2827452 2828386 2837739 2841681 2849854 2846560 2852210 2862681 2870311
12444 2870311 2871515 2881955 2889546 2894846 2900741 2895882 2898283 2890799 2896700 2894542 2893259 2916095 2917252
12431 2917252 2903874 2924182 2938170 2928440 2923300 2921577 2920390 2922899 2924458 2933338 2955896 2960257 2957072
12418 2957072 2963070 2959071 2967171 2982160 2982389 2981027 2982052 2979132 2985384 2983223 2989835 3006753 3018773
12405 3018773 3023648 3015783 3023384 3020289 3035532 3037597 3035911 3039531 3053225 3057349 3053594 3046567 3053276
12392 3053276 3058983 3060996 3065529 3062713 3070008 3083060 3098710 3108541 3087454 3087482 3104813 3125126 3112551
12379 3112551 3117994 3124213 3121412 3133922 3134014 3130071 3128289 3121633 3138317 3162083 3173818 3164624 3160764
12366 3160764 3175800 3185342 3191161 3189017 3196735 3193571 3199597 3200927 3206816 3208876 3203400 3202849 3209631 3218858
$$ packed form
12457B819294J7750K449O593l180j5454R34R353L942Q173l294N650J0471P630
12444B870311J204J0440P591N300N895m859K401p484N901k158j283K2836J157
12431B917252j3378K0308J3988r730n140j723j187K509J559Q880K2558M361l185
12418B957072N998l999Q100J4989K29j362J025k920O252k161O612J6918J2020
12405C018773M875p865P601l095J5243K065j686L620J3694M124l755p027O709
12392C053276N707K013M533k816P295J3052J5650R831k1087K8J7331K0313j2575
12379C112551N443O219k801J2510R2l943j782o656J6684K3766J1735r194l860
12366C160764J5036R542N819k144P718l164O026J330N889K060n476n51O782R227
$$ plain form
12352 3218858 3216560 3225703 3243905 3247203 3246237 3260236 3253439 3253772 3261001 3272357 3284065 3303983 3312600
12339 3312600 3305150 3286207 3291189 3290484 3296683 3304113 3305981 3302278 3297888 3310251 3313853 3332158 3346029
12326 3346029 3338182 3340610 3350524 3364397 3377325 3367158 3371346 3369956 3363284 3370366 3380513 3394700 3417264
12313 3417264 3422591 3425659 3424751 3428291 3435145 3442994 3451258 3448559 3449833 3464249 3464656 3479512 3495266 3493708
12299 3493708 3497611 3506242 3505385 3505104 3516783 3525975 3525738 3526017 3537205 3547789 3559705 3553984 3557033 3562791
12285 3562791 3559021 3571056 3584987 3584575 3579522 3585504 3595473 3608788 3616571 3628302 3638366 3646566 3650015
12272 3650015 3659011 3660559 3660719 3662267 3667677 3677644 3699529 3720440 3711356 3715885 3717903 3717433 3725137 3729945
12258 3729945 3726565 3732993 3739513 3749058 3760792 3762360 3758364 3759928 3773576 3775009 3796447 3810356 3815647
$$ packed form
12352C218858k298R143J8202L298r66J3999o797L33P229J1356J1708J9918Q617
12339C312600p450j8943M982p05O199P430J868l703m390J2363L602J8305J3871
12326C346029p847K428R914J3873J2928j0167M188j390o672P082J0147J4187K2564
12313C417264N327L068r08L540O854P849Q264k699J274J4416M07J4856J5754j558
12299C493708L903Q631q57k81J1679R192k37K79J1188J0584J1916n721L049N758
12285C562791l770J2035J3931m12n053N982R969J3315P783J1731J0064Q200L449
12272C650015Q996J548J60J548N410R967K1885K0911r084M529K018m70P704M808
12258C729945l380O428O520R545J1734J568l996J564J3648J433K1438J3909N291
$$ plain form
12245 3815647 3824193 3838694 3853475 3844190 3847503 3862434 3867540 3891982 3891444 3883262 3884926 3893188 3906275
12232 3906275 3921573 3937449 3951430 3956485 3966740 3970189 3986590 4000232 3994247 4001511 3992942 3983757
12220 3983757 3986169 3993718 4000781 4010343 4013163 4010561 4027475 4043122 4048148 4045389 4063997 4085963 4102834
12207 4102834 4120110 4123859 4129518 4140364 4149247 4156675 4161397 4162039 4189867 4218067 4230781 4233842 4246080
12194 4246080 4251117 4263295 4269992 4287582 4313897 4335833 4349672 4364386 4364071 4366805 4377604 4389650
12182 4389650 4405582 4401303 4399938 4402309 4385705 4361516 4339052 4305345 4278277 4259370 4233843 4211350
12170 4211350 4228615 4244311 4263056 4290637 4322377 4353705 4374205 4393334 4406410 4410329 4418586 4437575
12158 4437575 4456275 4464709 4473900 4487231 4487280 4484228 4489465 4494907 4510217 4510919 4509924 4509389 4506786 4477685
$$ packed form
12245C815647Q546J4501J4781r285L313J4931N106K4442n38q182J664Q262J3087
12232C906275J5298J5876J3981N055J0255L449J6401J3642n985P264q569r185
12220C983757K412P549P063R562K820k602J6914J5647N026k759J8608K1966J6871
12207D102834J7276L749N659J0846Q883P428M722O42K7828K8200J2714L061J2238
12194D246080N037J2178O697J7590K6315K1936J3839J4714l15K734J0799J2046
12182D389650J5932m279j365K371j6604k4189k2464l3707k7068j8907k5527k2493
12170D211350J7265J5696J8745K7581L1740L1328K0500J9129J3076L919Q257J8989
12158D437575J8700Q434R191J3331M9l052N237N442J5310P02r95n35k603k9101
$$ plain form
12144 4477685 4447773 4440182 4419576 4405524 4409843 4413435 4412569 4416528 4426021 4452933 4463247 4461279 4466077
12131 4466077 4462592 4445319 4465561 4490679 4500430 4506610 4518445 4545699 4571634 4597206 4630248 4657537
12119 4657537 4687432 4703543 4724434 4724956 4718386 4717445 4688421 4655152 4616515 4582506 4552810 4515263
12107 4515263 4490958 4484703 4493341 4501978 4522369 4551712 4587393 4614039 4646008 4672289 4689331 4715248
12095 4715248 4728609 4738308 4750396 4767879 4779306 4804149 4824019 4840835 4864745 4884446 4891754 4908827
12083 4908827 4914382 4932246 4948796 4967573 4977357 4984651 5006739 5033920 5051217 5068137 5083200 5098549
12071 5098549 5115412 5136116 5155196 5165951 5189880 5213012 5225659 5240011 5264292 5272882 5286052
12060 5286052 5307257 5331497 5343023 5355988 5360374 5390201 5406597 5406309 5408824 5408118 5405849 5398049 5402575
$$ packed form
12144D477685k9912p591k0606j4052M319L592q66L959R493K6912J0314j968M798
12131D466077l485j7273K0242K5118R751O180J1835K7254K5935K5572L3042K7289
12119D657537K9895J6111K0891N22o570r41k9024l3269l8637l4009k9696l7547
12107D515263k4305o255Q638Q637K0391K9343L5681K6646L1969K6281J7042K5917
12095D715248J3361R699J2088J7483J1427K4843J9870J6816K3910J9701P308J7073
12083D908827N555J7864J6550J8777R784P294K2088K7181J7297J6920J5063J5349
12071E098549J6863K0704J9080J0755K3929K3132J2647J4352K4281Q590J3170
12060E286052K1205K4240J1526J2965M386K9827J6396k88K515p06k269p800M526
$$ plain form
12047 5402575 5406904 5400859 5407556 5425784 5452163 5472305 5480672 5498577 5525056 5535133 5557443 5588745
12035 5588745 5609341 5622558 5642966 5670537 5701928 5725967 5745316 5755476 5772395 5797434 5816170
12024 5816170 5819081 5822726 5841665 5858081 5881160 5911587 5931413 5947982 5961241 5986491 6010519 6044474
12012 6044474 6072144 6095118 6118891 6144718 6176458 6194717 6219913 6250333 6274396 6292938 6310115
12001 6310115 6326330 6346829 6363050 6373090 6394207 6411528 6418204 6419011 6419933 6404330 6387640 6374845
11989 6374845 6378066 6382045 6387758 6385086 6384191 6388893 6386464 6398982 6433527 6463320 6501711 6530730 6562401
11976 6562401 6599869 6627166 6644749 6657604 6663591 6678961 6706833 6734087 6750347 6756524 6766421 6770990
11964 6770990 6765488 6765407 6765775 6762549 6764940 6774571 6766507 6776546 6776930 6781259 6788044 6792927 6802887 6819883
$$ packed form
12047E402575M329o045O697J8228K6379K0142Q367J7905K6479J0077K2310L1302
12035E588745K0596J3217K0408K7571L1391K4039J9349J0160J6919K5039J8736
12024E816170K911L645J8939J6416K3079L0427J9826J6569J3259K5250K4028L3955
12012F044474K7670K2974K3773K5827L1740J8259K5196L0420K4063J8542J7177
12001F310115J6215K0499J6221J0040K1117J7321O676Q07R22j5603j6690j2795
11989F374845L221L979N713k672q95M702k429J2518L4545K9793L8391K9019L1671
11976F562401L7468K7297J7583J2855N987J5370K7872K7254J6260O177R897M569
11964F770990n502q1L68l226K391R631q064J0039L84M329O785M883R960J6996
$$ plain form
11950 6819883 6835871 6849828 6876942 6906609 6933980 6956796 6988476 7032864 7074348 7086901 7122195
11939 7122195 7156190 7190073 7228776 7274686 7309722 7329134 7345961 7353546 7359746 7380881 7405384 7409205
11927 7409205 7405938 7408779 7412196 7423299 7434005 7449030 7476892 7521172 7561054 7590336 7624447 7666628
11915 7666628 7712871 7752059 7797350 7849741 7898621 7942024 7996353 8050972 8099264 8153575 8198036
11904 8198036 8229289 8258106 8303629 8359762 8406085 8458918 8503536 8559295 8625769 8682914 8721670
11893 8721670 8755192 8809157 8864305 8914584 8969318 9014287 9064059 9120645 9183954 9234699 9292202
11882 9292202 9357838 9402976 9447378 9502171 9543622 9598423 9661228 9721173 9786917 9854677 9925103
11871 9925103 9982987 10028695 10074118 10125112 10167305 10217990 10271901 10327365 10384840 10439911 10489547
$$ packed form
11950F819883J5988J3957K7114K9667K7371K2816L1680M4388M1484J2553L5294
11939G122195L3995L3883L8703M5910L5036J9412J6827P585O200K1135K4503L821
11927G409205l267K841L417J1103J0706J5025K7862M4280L9882K9282L4111M2181
11915G666628M6243L9188M5291N2391M8880M3403N4329N4619M8292N4311M4461
11904H198036L1253K8817M5523N6133M6323N2833M4618N5759O6474N7145L8756
11893H721670L3522N3965N5148N0279N4734M4969M9772N6586O3309N0745N7503
11882I292202O5636M5138M4402N4793M1451N4801O2805N9945O5744O7760P0426
11871I925103N7884M5708M5423N0994M2193N0685N3911N5464N7475N5071M9636
$$ plain form
11860 10489547 10538503 10597163 10673613 10736443 10802025 10877377 10970761 11059071 11142191 11221189 11305358
11849 11305358 11383203 11461194 11546841 11641356 11702135 11786521 11878514 11965524 12057808 12158779 12258611
11838 12258611 12363000 12471374 12572413 12682022 12789998 12893724 12998035 13104291 13216267
11829 13216267 13331250 13455899 13589472 13728061 13856230 13985710 14129202 14280845 14433781
11820 14433781 14575315 14711154 14860858 14996059 15144127 15307245 15469477 15629794 15755405
11811 15755405 15898010 16079295 16284979 16497174 16695384 16903418 17124297 17334002 17557160
11802 17557160 17789386 18024030 18253805 18494770 18753334 19034041 19310966 19585182 19876927
11793 19876927 20194190 20508024 20817634 21147172 21498704 21852909 22220121 22602967 23000208
$$ packed form
11860A0489547M8956N8660P6450O2830O5582P5352R3384Q8310Q3120P8998Q4169
11849A1305358P7845P7991Q5647R4515O0779Q4386R1993Q7010R2284J00971R9832
11838A2258611J04389J08374J01039J09609J07976J03726J04311J06256J11976
11829A3216267J14983J24649J33573J38589J28169J29480J43492J51643J52936
11820A4433781J41534J35839J49704J35201J48068J63118J62232J60317J25611
11811A5755405J42605J81285K05684K12195J98210K08034K20879K09705K23158
11802A7557160K32226K34644K29775K40965K58564K80707K76925K74216K91745
11793A9876927L17263L13834L09610L29538L51532L54205L67212L82846L97241
$$ plain form
11784 23000208 23416498 23863525 24331819 24832994 25351628 25888973 26461504 27055599 27685603
11775 27685603 28354830 29081185 29837104 30616865 31454721 32350811 33316240 34355130 35466362
11766 35466362 36652293 37948179 39339304 40836373 42454261 44196113 46067185 48106455
11758 48106455 50291765 52585282 54901925 57008250 58534190 58912221 57433953 53447379
11750 53447379 46808024 38100693 28537436 19510548 12136293 7070828 4425125 3880905
11742 3880905 4950135 7100626 9875520 12978433 16216256 19413407 22466051 25258913
11734 25258913 27682413 29618768 30962537 31652988 31708668 31205187 30289278 29163244 28025301
11725 28025301 27046847 26279471 25641447 24894894 23629725 21362682 17712455 12598032 6324991
$$ packed form
11784B3000208M16290M47027M68294N01175N18634N37345N72531N94095O30004
11775B7685603O69227P26355P55919P79761Q37856Q96090R65429J038890J111232
11766C5466362J185931J295886J391125J497069J617888J741852J871072K039270
11758D8106455K185310K293517K316643K106325J525940L78031j478268l986574
11750E3447379o639355q707331r563257r026888p374255n065465k645703n44220
11742C880905J069230K150491K774894L102913L237823L197151L052644K792862
11734B5258913K423500J936355J343769O90451N5680n03481r15909j126034j137943
11725B8025301r78454p67376o38024p46553j265169k267043l650227n114423o273041
$$ plain form
11716 6324991 -428549 -6817351 -12112621 -15898418 -18086358 -18913758 -18799347 -18223855 -17660120
11707 -17660120 -17472597 -17784050 -18546687 -19598141 -20738638 -21693053 -22275306 -22343450 -21793641
11698 -21793641 -20580667 -18767731 -16427698 -13640624 -10503041 -7148958 -3745190 -544029
11690 -544029 2088528 3591585 3281069 473139 -5191986 -13520419 -23617446 -34079721
11682 -34079721 -43510081 -50888594 -55766617 -58225034 -58642311 -57585875 -55652027 -53258808
11674 -53258808 -50730621 -48231456 -45869245 -43694421 -41681918 -39819807 -38100837 -36537035
11666 -36537035 -35086774 -33730151 -32470016 -31292273 -30179483 -29146461 -28199046 -27318629
11658 -27318629 -26490622 -25713136 -24991631 -24305925 -23655545 -23049645 -22499058 -21960388 -21451085
$$ packed form
11716F324991o753540o388802n295270l785797k187940q27400J14411N75492N63735
11707a7660120J87523l11453p62637j051454j140497r54415n82253o8144N49809
11698b1793641J212974J812936K340033K787074L137583L354083L403768L201161
11690e44029K632557J503057l10516k807930n665125q328433j0097027j0462275
11682c4079721r430360p378513m878023k458417m17277J056436J933848K393219
11674e3258808K528187K499165K362211K174824K012503J862111J718970J563802
11666c6537035J450261J356623J260135J177743J112790J033022R47415Q80417
11658b7318629Q28007P77486P21505O85706O50380O05900N50587N38670N09303
$$ plain form
11649 -21451085 -20971214 -20511325 -20051492 -19618018 -19203884 -18805542 -18423464 -18058759 -17699500
11640 -17699500 -17344691 -17021278 -16701375 -16395571 -16102728 -15825302 -15545612 -15269803 -15016243
11631 -15016243 -14770181 -14542063 -14316939 -14088930 -13858332 -13637909 -13444627 -13276371 -13108650
11622 -13108650 -12918805 -12734754 -12581425 -12418182 -12256355 -12112848 -11956260 -11799625 -11640903
11613 -11640903 -11475632 -11331011 -11185945 -11041134 -10883530 -10732624 -10600797 -10461786 -10329831
11604 -10329831 -10209580 -10099714 -9982176 -9869671 -9752196 -9635954 -9530290 -9425336 -9313538
11595 -9313538 -9198365 -9083423 -8970957 -8873597 -8767561 -8670956 -8585467 -8506531 -8455365 -8395126
11585 -8395126 -8329560 -8253490 -8165850 -8083444 -8004267 -7933201 -7833743 -7751481 -7680820 -7611773 -7521254
$$ packed form
11649b1451085M79871M59889M59833M33474M14134L98342L82078L64705L59259
11640a7699500L54809L23413L19903L05804K92843K77426K79690K75809K53560
11631a5016243K46062K28118K25124K28009K30598K20423J93282J68256J67721
11622a3108650J89845J84051J53329J63243J61827J43507J56588J56635J58722
11613a1640903J65271J44621J45066J44811J57604J50906J31827J39011J31955
11604a0329831J20251J09866J17538J12505J17475J16242J05664J04954J11798
11595i313538J15173J14942J12466R7360J06036R6605Q5489P8936N1166O0239
11585h395126O5566P6070Q7640Q2406P9177P1066R9458Q2262P0661O9047R0519
$$ plain form
11574 -7521254 -7436854 -7367616 -7299026 -7239931 -7210964 -7173698 -7124502 -7071935 -7028044 -6974689 -6904629
11563 -6904629 -6841722 -6769022 -6692721 -6634761 -6569856 -6519974 -6467912 -6401500 -6341797 -6298887 -6263417
11552 -6263417 -6213012 -6147339 -6078867 -6023225 -5974746 -5901985 -5835064 -5776559 -5724842 -5676732 -5623123
11541 -5623123 -5566041 -5507991 -5447987 -5398511 -5348258 -5293456 -5250334 -5209304 -5162188 -5100713 -5041915
11530 -5041915 -4985523 -4935702 -4885642 -4846599 -4802937 -4757391 -4718930 -4689357 -4636121 -4584884 -4552406
11519 -4552406 -4519429 -4486823 -4449896 -4402847 -4372123 -4332397 -4293563 -4250886 -4209667 -4186314 -4171296
11508 -4171296 -4139974 -4095190 -4067742 -4039634 -4003376 -3953691 -3913125 -3879497 -3848753 -3818648 -3781400
11497 -3781400 -3733687 -3695448 -3659704 -3632543 -3605067 -3571305 -3528851 -3493410 -3464321 -3436387 -3397677
$$ packed form
11574g521254Q4400O9238O8590N9095K8967L7266M9196N2567M3891N3355P0060
11563f904629O2907P2700P6301N7960O4905M9882N2062O6412N9703M2910L5470
11552f263417N0405O5673O8472N5642M8479P2761O6921N8505N1717M8110N3609
11541e623123N7082N8050O0004M9476N0253N4802M3122M1030M7116O1475N8798
11530e041915N6392M9821N0060L9043M3662M5546L8461K9573N3236N1237L2478
11519d552406L2977L2606L6927M7049L0724L9726L8834M2677M1219K3353J5018
11508d171296L1322M4784K7448K8108L6258M9685M0566L3628L0744L0105L7248
11497c781400M7713L8239L5744K7161K7476L3762M2454L5441K9089K7934L8710
$$ plain form
11486 -3397677 -3372878 -3359300 -3341091 -3306630 -3293891 -3275355 -3236601 -3204672 -3183833 -3158922 -3120826
11475 -3120826 -3094057 -3071425 -3056633 -3031808 -3001082 -2969044 -2944441 -2924169 -2903858 -2882489 -2854696
11464 -2854696 -2822921 -2798303 -2776361 -2748520 -2717254 -2681306 -2652145 -2643474 -2623216 -2591938 -2573223
11453 -2573223 -2556106 -2538124 -2499763 -2488687 -2462107 -2426970 -2386696 -2374355 -2363904 -2358283 -2329368
11442 -2329368 -2296451 -2282185 -2258639 -2226931 -2197202 -2170216 -2141844 -2125866 -2097126 -2060505 -2028310
11431 -2028310 -1995700 -1959321 -1937718 -1930572 -1922403 -1912762 -1905302 -1912959 -1918282 -1918451 -1914216 -1906307 -1897955
11418 -1897955 -1889265 -1882447 -1844751 -1804572 -1771539 -1751924 -1738838 -1717580 -1691145 -1668678 -1657358 -1635318
11406 -1635318 -1614635 -1609695 -1594949 -1577847 -1568372 -1552771 -1519433 -1491920 -1473938 -1459603 -1443434 -1420504
$$ packed form
11486c397677K4799J3578J8209L4461J2739J8536L8754L1929K0839K4911L8096
11475c120826K6769K2632J4792K4825L0726L2038K4603K0272K0311K1369K7793
11464b854696L1775K4618K1942K7841L1266L5948K9161Q671K0258L1278J8715
11453b573223J7117J7982L8361J1076K6580L5137M0274J2341J0451N621K8915
11442b329368L2917J4266K3546L1708K9729K6986K8372J5978K8740L6621L2195
11431b028310L2610L6379K1603P146Q169R641P460p657n323j69M235P909Q352
11418a897955Q690O818L7696M0179L3033J9615J3086K1258K6435K2467J1320K2040
11406a635318K0683M940J4746J7102R475J5601L3338K7513J7982J4335J6169K2930
$$ plain form
11394 -1420504 -1404980 -1383924 -1378788 -1370731 -1353970 -1347587 -1338723 -1346102 -1351035 -1337258 -1322249 -1314761 -1308877
11381 -1308877 -1292453 -1270476 -1258550 -1235749 -1219606 -1207987 -1192917 -1168105 -1132284 -1104636 -1068128
11370 -1068128 -1042600 -1029876 -1008338 -998417 -990558 -979510 -940842 -921050 -927264 -930189 -922583 -910412
11358 -910412 -906702 -909347 -896687 -883277 -858560 -838182 -816826 -808212 -789765 -779618 -761778 -730063
11346 -730063 -700903 -671087 -651327 -639618 -631815 -617581 -591939 -573156 -551992 -530158 -505450 -494796
11334 -494796 -461412 -451514 -441522 -413957 -390391 -377869 -374988 -353711 -319495 -279877 -264168 -241218
11322 -241218 -218178 -188170 -176663 -170600 -159489 -159983 -171726 -187760 -212068 -249464 -286952 -308899
11310 -308899 -333667 -320294 -304308 -291797 -279963 -253665 -215064 -177883 -156673 -122283 -103772
$$ packed form
11394a420504J5524K1056N136Q057J6761O383Q864p379m933J3777J5009P488N884
11381a308877J6424K1977J1926K2801J6143J1619J5070K4812L5821K7648L6508
11370a068128K5528J2724K1538R921P859J1048L8668J9792o214k925P606J2171
11358i10412L710k645J2660J3410K4717K0378K1356Q614J8447J0147J7840L1715
11346g30063K9160K9816J9760J1709P803J4234K5642J8783K1164K1834K4708J0654
11334d94796L3384R898R992K7565K3566J2522K881K1277L4216L9618J5709K2950
11322b41218K3040L0008J1507O063J1111m94j1743j6034k4308l7396l7488k1947
11310c08899k4768J3373J5986J2511J1834K6298L8601L7181K1210L4390J8511
$$ plain form
11299 -103772 -86461 -56850 -16395 7940 17943 22951 17241 26004 25258 33154 34302 20730 11224
11286 11224 9256 9351 -24157 -44356 -46757 -50447 -49272 -61051 -47048 -26016 -15597 -4405 19729
11273 19729 35297 42969 36802 54127 71619 83427 88613 96381 117632 128324 134416 159094 191786
11260 191786 218622 248514 270851 289945 317329 346807 340786 330812 324711 290423 245426 198297
11248 198297 167394 142210 123240 118279 130749 166467 198685 206353 231156 250844 288095 318703
11236 318703 332873 342827 349140 373353 391642 423243 451036 459271 483016 507214 533128 551787
11224 551787 565814 579791 591141 601128 595710 599027 617138 636744 649475 663016 679495 694978
11212 694978 712018 735553 743718 744211 756270 776875 794248 814314 827992 830049 836995 856261
$$ packed form
11299a03772J7311K9611M0455K4335J0003N008n710Q763p46P896J148j3572r506
11286A1224j968R5l3508k0199k401l690J175j1779J4003K1032J0419J1192K4134
11273A9729J5568P672o167J7325J7492J1808N186P768K1251J0692O092K4678L2692
11260A91786K6836K9892K2337J9094K7384K9478o021r974o101l4288m4997m7129
11248A98297l0903k5184j8970m961J2470L5718L2218P668K4803J9688L7251L0608
11236C18703J4170R954O313K4213J8289L1601K7793Q235K3745K4198K5914J8659
11224E51787J4027J3977J1350R987n418L317J8111J9606J2731J3541J6479J5483
11212F94978J7040K3535Q165M93J2059K0605J7373K0066J3678K057O946J9266
$$ plain form
11200 856261 882402 903859 911858 926915 940626 966176 982535 989547 1001846 1010915 1019196 1031988
11188 1031988 1047130 1062462 1077310 1100131 1105881 1110850 1118710 1125397 1145661 1158477 1177534 1196434
11176 1196434 1201149 1218472 1217777 1228218 1240523 1254339 1279932 1295935 1316090 1322513 1316925 1311324
11164 1311324 1339827 1367989 1380376 1385164 1390137 1420334 1441234 1449432 1457568 1462447 1482124 1504697
11152 1504697 1511907 1529240 1546286 1553752 1560916 1575296 1590408 1604617 1629375 1648111 1668932 1685815
11140 1685815 1699480 1720715 1737837 1737527 1745592 1769057 1778623 1788966 1805239 1823088 1849977 1880975
11128 1880975 1898426 1908754 1927151 1949013 1972040 1992448 2006435 2023952 2052517 2074516 2083993
11117 2083993 2100542 2113372 2116044 2113650 2097493 2058093 2017018 1976898 1946530 1943594 1958352 1963367
$$ packed form
11200H56261K6141K1457P999J5057J3711K5550J6359P012J2299R069Q281J2792
11188A031988J5142J5332J4848K2821N750M969P860O687K0264J2816J9057J8900
11176A196434M715J7323o95J0441J2305J3816K5593J6003K0155O423n588n601
11164A311324K8503K8162J2387M788M973L0197K0900Q198Q136M879J9677K2573
11152A504697P210J7333J7046P466P164J4380J5112J4209K4758J8736K0821J6883
11140A685815J3665K1235J7122l10Q065K3465R566J0343J6273J7849K6889L0998
11128A880975J7451J0328J8397K1862K3027K0408J3987J7517K8565K1999R477
11117B083993J6549J2830K672k394j6157l9400m1075m0120l0368k936J4758N015
$$ plain form
11105 1963367 1972979 1986838 1997168 2022422 2067774 2096370 2113017 2140222 2160862 2186380 2207438
11094 2207438 2203789 2197848 2211293 2227244 2233231 2245509 2246211 2252972 2260050 2275388 2288214 2306659 2322545
11081 2322545 2327445 2308112 2280111 2251187 2229567 2223134 2216299 2208608 2213931 2215857 2230399 2261690
11069 2261690 2283076 2292777 2308404 2323188 2335483 2337217 2362869 2378217 2402960 2427260 2445266 2468766
11057 2468766 2506891 2543252 2576955 2590189 2608447 2621678 2626552 2618892 2599251 2592626 2588172 2573714
11045 2573714 2563086 2561895 2557972 2570739 2584859 2602203 2611959 2606614 2631108 2647728 2670186 2696176
11033 2696176 2725255 2751332 2788856 2826471 2859823 2891432 2937205 2976343 3020371 3066187 3112905
11022 3112905 3147686 3122655 3023764 2932087 2861788 2806392 2802520 2815619 2840457 2888444 2942213
$$ packed form
11105A963367R612J3859J0330K5254M5352K8596J6647K7205K0640K5518K1058
11094B207438l649n941J3445J5951N987J2278P02O761P078J5338J2826J8445J5886
11081B322545M900j9333k8001k8924k1620o433o835p691N323J926J4542L1291
11069B261690K1386R701J5627J4784J2295J734K5652J5348K4743K4300J8006K3500
11057B468766L8125L6361L3703J3234J8258J3231M874p660j9641o625m454j4458
11045B573714j0628j191l923J2767J4120J7344R756n345K4494J6620K2458K5990
11033B696176K9079K6077L7524L7615L3352L1609M5773L9138M4028M5816M6718
11022C112905L4781k5031r8891r1677p0299n5396l872J3099K4838M7987N3769
$$ plain form
11011 2942213 2981834 3013243 3047711 3072904 3082886 3114531 3135763 3173879 3203946 3226959 3244525
11000 3244525 3267970 3289086 3292789 3332127 3354813 3373691 3398039 3422581 3436867 3459786 3482611
10989 3482611 3499726 3519966 3544377 3577327 3596016 3599616 3617744 3627294 3642352 3667455 3684285 3692349
10977 3692349 3714922 3754809 3782644 3803991 3820562 3845035 3865742 3880640 3893149 3911822 3932918
10966 3932918 3967245 3986694 3998102 4027642 4055719 4075438 4093943 4115921 4148347 4179907 4208464
10955 4208464 4219647 4245337 4269397 4280602 4306892 4328271 4348846 4368543 4381912 4396534 4415105
10944 4415105 4435989 4453125 4459735 4471926 4496612 4522518 4555124 4577593 4591857 4607873 4632588
10933 4632588 4662205 4688413 4718491 4734289 4752846 4780126 4808153 4842326 4877790 4907346 4916069
$$ packed form
11011B942213L9621L1409L4468K5193R982L1645K1232L8116L0067K3013J7566
11000C244525K3445K1116L703L9338K2686J8878K4348K4542J4286K2919K2825
10989C482611J7115K0240K4411L2950J8689L600J8128R550J5058K5103J6830Q064
10977C692349K2573L9887K7835K1347J6571K4473K0707J4898J2509J8673K1096
10966C932918L4327J9449J1408K9540K8077J9719J8505K1978L2426L1560K8557
10955D208464J1183K5690K4060J1205K6290K1379K0575J9697J3369J4622J8571
10944D415105K0884J7136O610J2191K4686K5906L2606K2469J4264J6016K4715
10933D632588K9617K6208L0078J5798J8557K7280K8027L4173L5464K9556Q723
$$ plain form
10922 4916069 4939929 4979277 5015032 5043172 5081375 5096253 5095497 5114738 5142341 5176120 5205458 5227680
10910 5227680 5253014 5279861 5297348 5303350 5337382 5382152 5418156 5449741 5472010 5500864 5528468
10899 5528468 5548321 5575081 5608378 5622580 5659838 5712462 5744598 5773780 5811533 5848817 5884172
10888 5884172 5924470 5973495 6008517 6043215 6077137 6108576 6142331 6172995 6200607 6217005 6246094
10877 6246094 6293957 6317124 6344696 6384733 6411029 6436099 6471405 6516504 6556658 6604654 6643051
10866 6643051 6667262 6718070 6778838 6810530 6845193 6896964 6950816 6979870 7022348 7062447 7117367
10855 7117367 7160108 7202082 7254012 7302008 7342966 7391164 7426710 7456767 7511004 7565926 7615822
10844 7615822 7654463 7699484 7756695 7803332 7856698 7897132 7935713 7978751 8035232 8101838 8166871
$$ packed form
10922D916069K3860L9348L5755K8140L8203J4878p56J9241K7603L3779K9338K2222
10910E227680K5334K6847J7487O002L4032M4770L6004L1585K2269K8854K7604
10899E528468J9853K6760L3297J4202L7258N2624L2136K9182L7753L7284L5355
10888E884172M0298M9025L5022L4698L3922L1439L3755L0664K7612J6398K9089
10877F246094M7863K3167K7572M0037K6296K5070L5306M5099M0154M7996L8397
10866F643051K4211N0808O0768L1692L4663N1771N3852K9054M2478M0099N4920
10855G117367M2741M1974N1930M7996M0958M8198L5546L0057N4237N4922M9896
10844G615822L8641M5021N7211M6637N3366M0434L8581M3038N6481O6606O5033
$$ plain form
10833 8166871 8216565 8268896 8307827 8354185 8420442 8496467 8559578 8611227 8673029 8742838 8798124
10822 8798124 8843050 8906551 8960564 9015386 9081524 9143525 9207804 9271245 9356117 9428267 9498552
10811 9498552 9562026 9605271 9650944 9692004 9735235 9790633 9830679 9861286 9898383 9960859 10033642
10800 10033642 10107243 10191048 10282843 10375703 10467628 10555902 10643876 10736789 10823511 10894204 10969025
10789 10969025 11052822 11152152 11257448 11351791 11453784 11577305 11692730 11805623 11921717 12014670
10779 12014670 12148145 12289055 12412974 12532674 12661227 12789371 12914198 13037191 13180369
10770 13180369 13322630 13483064 13628259 13782600 13943582 14109989 14273711 14435010 14599751
10761 14599751 14772538 14945788 15131956 15302971 15490479 15670213 15880951 16088317 16305370
$$ packed form
10833H166871M9694N2331L8931M6358O6257P6025O3111N1649O1802O9809N5286
10822H798124M4926O3501N4013N4822O6138O2001O4279O3441Q4872P2150P0285
10811I498552O3474M3245M5673M1060M3231N5398M0046L0607L7097O2476P2783
10800A0033642P3601Q3805R1795R2860R1925Q8274Q7974R2913Q6722P0693P4821
10789A0969025Q3797R9330J05296R4343J01993J23521J15425J12893J16094R2953
10779A2014670J33475J40910J23919J19700J28553J28144J24827J22993J43178
10770A3180369J42261J60434J45195J54341J60982J66407J63722J61299J64741
10761A4599751J72787J73250J86168J71015J87508J79734K10738K07366K17053
$$ plain form
10752 16305370 16569728 16843898 17111301 17392206 17677600 17929896 18124923 18202091 18161334 18100060
10742 18100060 18072211 18130364 18289720 18538995 18848640 19204671 19583032 19978395 20373578 20776484
10732 20776484 21184493 21597929 22041018 22477962 22929953 23412952 23915040 24438855 24993926
10723 24993926 25579923 26186234 26823848 27499125 28211106 28937137 29701927 30534127 31421979
10714 31421979 32334431 33299425 34331968 35435092 36600446 37869194 39248199 40741164
10706 40741164 42397000 44199831 46183798 48379163 50734331 53227035 55804360 58345214
10698 58345214 60617887 62229174 62567427 60845906 56327064 48637779 38412268 27186117
10690 27186117 16610456 7983686 2109423 -883586 -1401708 -87509 2402631 5551235
$$ packed form
10752A6305370K64358K74170K67403K80905K85394K52296J95027P7168m0757o1274
10742A8100060k7849N8153J59356K49275L09645L56031L78361L95363L95183M02906
10732B0776484M08009M13436M43089M36944M51991M82999N02088N23815N55071
10723B4993926N85997O06311O37614O75277P11981P26031P64790Q32200Q87852
10714C1421979R12452R64994J032543J103124J165354J268748J379005J492965
10706D0741164J655836J802831J983967K195365K355168K492704K577325K540854
10698E8345214K272673J611287L38253j721521m518842p689285j0225511j1226151
10690B7186117j0575661q626770n874263k993009n18122J314199K490140L148604
$$ plain form
10682 5551235 8956251 12353826 15599740 18592897 21228541 23414026 24984861 25784852
10674 25784852 25694874 24752612 23292236 21762549 20578073 20001266 20116982 20783898 21759406
10665 21759406 22680055 23111626 22552646 20472750 16588402 10960022 4035307 -3362474
10657 -3362474 -10280906 -15942768 -19945685 -22308371 -23341175 -23535891 -23482985 -23650947 -24334459
10648 -24334459 -25518812 -26910683 -28127474 -28812982 -28781739 -28030462 -26606212 -24644532 -22262953
10639 -22262953 -19563394 -16630353 -13506498 -10279799 -7054539 -4002261 -1393134 293357
10631 293357 398388 -1836527 -6964349 -14886053 -24560625 -34390480 -42939215 -49296517
10623 -49296517 -53134439 -54695150 -54508054 -53180940 -51224939 -48987063 -46665415 -44408720
$$ packed form
10682E551235L405016L397575L245914K993157K635644K185485J570835P99991
10674B5784852q9978r42262j460376j529687j184476n76807J15716O66916R75508
10665B1759406R20649M31571n58980k079896l884348n628380o924715p397781
10657c362474o918432n661862m002917k362686j032804j94716N2906j67962o83512
10648b4334459j184353j391871j216791o85508L1243P51277J424250J961680K381579
10639b2262953K699559K933041L123855L226699L225260L052278K609127J686491
10631B93357J05031k234915n127822p921704r674572r829855q548735o357302
10623d9296517l837922j560711J87096J327114J956001K237876K321648K256695
$$ plain form
10615 -44408720 -42263098 -40243669 -38387183 -36695512 -35136243 -33703991 -32385592 -31167461
10607 -31167461 -30040379 -28988806 -28011129 -27097700 -26231431 -25420616 -24653391 -23921589 -23232125
10598 -23232125 -22592981 -21993366 -21405663 -20849052 -20339561 -19845592 -19372829 -18927169 -18504032
10589 -18504032 -18071472 -17648682 -17253328 -16868975 -16495224 -16134364 -15806923 -15491076 -15203782
10580 -15203782 -14952106 -14713029 -14464935 -14207457 -13950412 -13696265 -13449090 -13210980 -12961754
10571 -12961754 -12735519 -12513202 -12294713 -12089415 -11888263 -11691105 -11496701 -11319213 -11150976
10562 -11150976 -10960050 -10772064 -10591896 -10414549 -10233969 -10060788 -9895756 -9724200 -9553593
10553 -9553593 -9385516 -9231194 -9096167 -8957536 -8806614 -8656348 -8507055 -8382773 -8241292
$$ packed form
10615d4408720K145622K019429J856486J691671J559269J432252J318399J218131
10607c1167461J127082J051573R77677R13429Q66269Q10815P67225P31802O89464
10598b3232125O39144N99615N87703N56611N09491M93969M72763M45660M23137
10589a8504032M32560M22790L95354L84353L73751L60860L27441L15847K87294
10580a5203782K51676K39077K48094K57478K57045K54147K47175K38110K49226
10571a2961754K26235K22317K18489K05298K01152J97158J94404J77488J68237
10562a1150976J90926J87986J80168J77347J80580J73181J65032J71556J70607
10553i553593J68077J54322J35027J38631J50922J50266J49293J24282J41481
$$ plain form
10544 -8241292 -8079454 -7961074 -7854257 -7743835 -7624798 -7500379 -7363024 -7240041 -7129789
10535 -7129789 -6996885 -6877724 -6754788 -6648493 -6541512 -6430015 -6327202 -6214878 -6098888
10526 -6098888 -5984713 -5867923 -5747778 -5623000 -5502970 -5394181 -5312573 -5193426 -5059612 -4937700
10516 -4937700 -4828578 -4726483 -4644683 -4556464 -4486462 -4447987 -4405577 -4350924 -4291857 -4218500 -4142680
10505 -4142680 -4051964 -3936105 -3836944 -3736234 -3647455 -3528789 -3407661 -3315176 -3214068 -3093566
10495 -3093566 -2977144 -2866504 -2769139 -2705809 -2669042 -2630628 -2580605 -2497167 -2388847 -2289597 -2178313
10484 -2178313 -2065376 -1964480 -1885630 -1823264 -1768464 -1751680 -1742964 -1734651 -1727831 -1702915 -1657462
10473 -1657462 -1576463 -1476406 -1379773 -1262066 -1137549 -1029889 -920808 -809266 -693513 -582671
$$ packed form
10544h241292J61838J18380J06817J10422J19037J24419J37355J22983J10252
10535g129789J32904J19161J22936J06295J06981J11497J02813J12324J15990
10526f098888J14175J16790J20145J24778J20030J08789Q1608J19147J33814J21912
10516d937700J09122J02095Q1800Q8219P0002L8475M2410N4653N9067P3357P5820
10505d142680R0716J15859R9161J00710Q8779J18666J21128R2485J01108J20502
10495c093566J16422J10640R7365O3330L6767L8414N0023Q3438J08320R9250J11284
10484b178313J12937J00896P8850O2366N4800J6784Q716Q313O820K4916M5453
10473a657462Q0999J00057R6633J17707J24517J07660J09081J11542J15753J10842
$$ plain form
10463 -582671 -479970 -376091 -281739 -173916 -51576 74542 194233 275208 296462 265020
10453 265020 215964 239773 352660 475256 588439 661223 713728 747894 783330 826351 891455
10442 891455 953335 1028496 1111111 1210959 1320630 1429335 1545794 1662378 1789239 1923334
10432 1923334 2055372 2197432 2327037 2449944 2575254 2698563 2833802 2967207 3099042
10423 3099042 3242004 3392306 3546180 3702099 3837961 3969952 4111854 4246424 4342559 4407789
10413 4407789 4469882 4529914 4613414 4730444 4863203 5009390 5172613 5353964 5548490 5746202
10403 5746202 5953121 6182739 6414198 6624303 6838817 7061330 7280453 7493228 7721433
10394 7721433 7959132 8193815 8445623 8684510 8921164 9156610 9416733 9702430 9991670
$$ packed form
10463e82671J02701J03879R4352J07823J22340J26118J19691Q0975K1254l1442
10453B65020m9056K3809J12887J22596J13183P2784N2505L4166L5436M3021O5104
10442H91455O1880P5161Q2615R9848J09671J08705J16459J16584J26861J34095
10432A923334J32038J42060J29605J22907J25310J23309J35239J33405J31835
10423C099042J42962J50302J53874J55919J35862J31991J41902J34570R6135O5230
10413D407789O2093O0032Q3500J17030J32759J46187J63223J81351J94526J97712
10403E746202K06919K29618K31459K10105K14514K22513K19123K12775K28205
10394G721433K37699K34683K51808K38887K36654K35446K60123K85697K89240
$$ plain form
10385 9991670 10288890 10624292 10964027 11297836 11649668 11999315 12353102 12728367 13124734
10376 13124734 13519319 13927164 14342522 14784948 15253804 15744866 16233324 16732837 17258091
10367 17258091 17812282 18388459 18978022 19587582 20230816 20901536 21624905 22399791 23245905
10358 23245905 24157679 25121477 26164370 27283914 28461617 29684723 30960724 32341669
10350 32341669 33828024 35452850 37211664 39128256 41181783 43319931 45451966 47509329
10342 47509329 49614893 52047532 54969018 58482253 62645265 67502729 73109425 79613508
10334 79613508 87224533 96208383 106934648 119708361 134523234 149837757 159383096
10327 159383096 148126945 100820122 27310474 -44739157 -102473560 -141134410 -157566376
$$ packed form
10385I991670K97220L35402L39735L33809L51832L49647L53787L75265L96367
10376A3124734L94585M07845M15358M42426M68856M91062M88458M99513N25254
10367A7258091N54191N76177N89563O09560O43234O70720P23369P74886Q46114
10358B3245905R11774R63798J042893J119544J177703J223106J276001J380945
10350C2341669J486355J624826J758814J916592K053527K138148K132035K057363
10342D7509329K105564K432639K921486L513235M163012M857464N606696O504083
10334G9613508P611025Q983850J0726265J2773713J4814873J5314523R545339
10327A59383096j1256151m7306823p3509648p2049631n7734403l8660850j6431966
$$ plain form
10320 -157566376 -157016398 -147320197 -134525551 -121975808 -110800033 -101130035 -92782175 -85537581
10312 -85537581 -79222522 -73692667 -68905057 -64920977 -61709944 -59073391 -56721418 -54502972
10304 -54502972 -52360908 -50235757 -48170949 -46191861 -44338471 -42622718 -41028936 -39553881
10296 -39553881 -38194563 -36948558 -35785241 -34691733 -33684236 -32731262 -31825147 -30942685
10288 -30942685 -30080716 -29223891 -28398505 -27585744 -26776727 -25979738 -25191628 -24393737 -23591206
10279 -23591206 -22811681 -22110490 -21708050 -21891036 -22676639 -23673358 -24499340 -25001906 -25100389
10270 -25100389 -24856019 -24435843 -23936933 -23427600 -22960944 -22537389 -22158733 -21803279 -21450679
10261 -21450679 -21107781 -20773862 -20453044 -20143736 -19832305 -19528601 -19245127 -18966546 -18711512
$$ packed form
10320a57566376N49978R696201J2794646J2549743J1175775R669998Q347860P244594
10312h5537581O315059N529855M787610L984080L211033K636553K351973K218446
10304e4502972K142064K125151K064808J979088J853390J715753J593782J475055
10296c9553881J359318J246005J163317J093508J007497R52974R06115Q82462
10288c0942685Q61969Q56825Q25386Q12761Q09017P96989P88110P97891Q02531
10279b3591206P79525P01191M02440j82986p85603r96719q25982n02566r8483
10270b5100389K44370M20176M98910N09333M66656M23555L78656L55454L52600
10261b1450679L42898L33919L20818L09308L11431L03704K83474K78581K55034
$$ plain form
10252 -18711512 -18474405 -18232498 -18001438 -17805326 -17613139 -17432094 -17254953 -17070353 -16883719
10243 -16883719 -16698768 -16519405 -16334391 -16157275 -15981609 -15831577 -15694047 -15532491 -15399937
10234 -15399937 -15280142 -15155915 -15051685 -14943982 -14851534 -14745724 -14632314 -14515184 -14403212
10225 -14403212 -14283915 -14170927 -14056104 -13963762 -13871841 -13784406 -13694533 -13593843 -13488481 -13383572
10215 -13383572 -13274700 -13163978 -13056049 -12945884 -12838779 -12725741 -12626879 -12540322 -12450084 -12345927
10205 -12345927 -12246570 -12160189 -12071679 -11993459 -11932148 -11928127 -11985809 -12054603 -12103703 -12115909 -12087393
10194 -12087393 -12045016 -11980148 -11907040 -11805348 -11711541 -11636288 -11568205 -11499643 -11426709 -11355911 -11286647
10183 -11286647 -11215419 -11149111 -11072186 -10990613 -10913282 -10844556 -10788690 -10721936 -10674378 -10638311 -10587231
$$ packed form
10252a8711512K37107K41907K31060J96112J92187J81045J77141J84600J86634
10243a6883719J84951J79363J85014J77116J75666J50032J37530J61556J32554
10234a5399937J19795J24227J04230J07703R2448J05810J13410J17130J11972
10225a4403212J19297J12988J14823R2342R1921Q7435Q9873J00690J05362J04909
10215a3383572J08872J10722J07929J10165J07105J13038R8862Q6557R0238J04157
10205a2345927R9357Q6381Q8510P8220O1311M021n7682o8794m9100j2206K8516
10194a2087393M2377O4868P3108J01692R3807P5253O8083O8562P2934P0798O9264
10183a1286647P1228O6308P6925Q1573P7331O8726N5866O6754M7558L6067N1080
$$ plain form
10172 -10587231 -10529266 -10490438 -10426955 -10356207 -10278140 -10220028 -10172176 -10117341 -10051212 -9992552 -9933211
10161 -9933211 -9879193 -9833492 -9799305 -9752316 -9703361 -9648170 -9600178 -9555750 -9511548 -9476296 -9466444
10150 -9466444 -9437324 -9403878 -9373211 -9327814 -9295515 -9249918 -9202369 -9134336 -9068881 -9000154 -8938039
10139 -8938039 -8876880 -8814461 -8752300 -8687810 -8627885 -8589075 -8554233 -8535321 -8509787 -8494041 -8473097
10128 -8473097 -8445836 -8430528 -8417953 -8390262 -8366399 -8330797 -8301431 -8290122 -8267855 -8242412 -8220769
10117 -8220769 -8185717 -8148225 -8133733 -8118507 -8093618 -8048816 -8022522 -8000386 -7966127 -7946888 -7924972
10106 -7924972 -7892547 -7863590 -7839775 -7793337 -7751310 -7719249 -7682493 -7646173 -7619743 -7588934 -7558545
10095 -7558545 -7539977 -7525577 -7509355 -7489050 -7461733 -7434866 -7417991 -7403169 -7386711 -7367124 -7342800
$$ packed form
10172a0587231N7965L8828O3483P0748P8067N8112M7852N4835O6129N8660N9341
10161i933211N4018M5701L4187M6989M8955N5191M7992M4428M4202L5252R852
10150i466444K9120L3446L0667M5397L2299M5597M7549O8033O5455O8727O2115
10139h938039O1159O2419O2161O4490N9925L8810L4842J8912K5534J5746K0944
10128h473097K7261J5308J2575K7691K3863L5602K9366J1309K2267K5443K1643
10117h220769L5052L7492J4492J5226K4889M4802K6294K2136L4259J9239K1916
10106g924972L2425K8957K3815M6438M2027L2061L6756L6320K6430L0809L0389
10095g558545J8568J4400J6222K0305K7317K6867J6875J4822J6458J9587K4324
$$ plain form
10084 -7342800 -7304766 -7274074 -7258819 -7234832 -7218169 -7202051 -7168948 -7135293 -7125933 -7116781 -7097041 -7071281
10072 -7071281 -7053358 -7038136 -7017301 -6988758 -6974456 -6948329 -6923915 -6918197 -6905892 -6879532 -6864858
10061 -6864858 -6839735 -6797296 -6773487 -6743468 -6726051 -6716085 -6684487 -6661663 -6633499 -6628490 -6625383 -6600172
10049 -6600172 -6582575 -6570775 -6554190 -6521971 -6504373 -6498284 -6455041 -6432097 -6418451 -6395213 -6365156
10038 -6365156 -6346782 -6321458 -6293772 -6285366 -6296856 -6295968 -6285213 -6276396 -6264077 -6245632 -6220509 -6205325
10026 -6205325 -6175945 -6157902 -6145447 -6128174 -6113341 -6093328 -6075565 -6066539 -6058103 -6052732 -6042169 -6039312
10014 -6039312 -6028783 -6013525 -5991642 -5975466 -5943484 -5933099 -5908301 -5886069 -5861029 -5845918 -5832220
10003 -5832220 -5815303 -5805629 -5792458 -5776310 -5775077 -5768762 -5747484 -5722127 -5703143 -5692502 -5681652 -5683368
$$ packed form
10084g342800L8034L0692J5255K3987J6663J6118L3103L3655R360R152J9740K5760
10072g071281J7923J5222K0835K8543J4302K6127K4414N718J2305K6360J4674
10061f864858K5123M2439K3809L0019J7417R966L1598K2824K8164N009L107K5211
10049f600172J7597J1800J6585L2219J7598O089M3243K2944J3646K3238L0057
10038f365156J8374K5324K7686Q406j1490Q88J0755Q817J2319J8445K5123J5184
10026f205325K9380J8043J2455J7273J4833K0013J7763R026Q436N371J0563K857
10014f039312J0529J5258K1883J6176L1982J0385K4798K2232K5040J5111J3698
10003e832220J6917R674J3171J6148J233O315K1278K5357J8984J0641J0850j716
$$ plain form
9991 -5683368 -5684028 -5683235 -5668567 -5652204 -5627728 -5601533 -5573228 -5541714 -5524165 -5516752 -5497313 -5488345 -5470575
9978 -5470575 -5448579 -5444838 -5438465 -5422898 -5421189 -5411837 -5397546 -5388379 -5370924 -5351414 -5325088 -5303620
9966 -5303620 -5292995 -5281166 -5259885 -5234656 -5219691 -5230635 -5226063 -5206794 -5188662 -5181291 -5174844 -5165050
9954 -5165050 -5164749 -5140328 -5125679 -5127454 -5111877 -5096169 -5077720 -5075779 -5058942 -5031989 -5008115 -4987172
9942 -4987172 -4973162 -4966290 -4955643 -4939696 -4931393 -4911462 -4900243 -4882193 -4849441 -4816312 -4797910 -4796640
9930 -4796640 -4787903 -4780925 -4771375 -4748663 -4720465 -4713761 -4693852 -4664953 -4648267 -4640083 -4620343 -4587240
9918 -4587240 -4562255 -4549318 -4529159 -4499328 -4456005 -4415693 -4385529 -4349686 -4311928 -4270254 -4209178
9907 -4209178 -4148439 -4086892 -4029140 -3962159 -3921970 -3962575 -4138112 -4426936 -4755442 -5030223 -5223105
$$ packed form
9991e683368o60P93J4668J6363K4476K6195K8305L1514J7549P413J9439Q968J7770
9978e470575K1996L741O373J5567J709R352J4291R167J7455J9510K6326K1468
9966e303620J0625J1829K1281K5229J4965j0944M572J9269J8132P371O447R794
9954e165050L01K4421J4649j775J5577J5708J8449J941J6837K6953K3874K0943
9942d987172J4010O872J0647J5947Q303J9931J1219J8050L2752L3129J8402J270
9930d796640Q737O978R550K2712K8198O704J9909K8899J6686Q184J9740L3103
9918d587240K4985J2937K0159K9831M3323M0312L0164L5843L7758M1674O1076
9907d209178O0739O1547N7752O6981M0189m0605j75537k88824l28506k74781j92882
$$ plain form
9896 -5223105 -5325053 -5339849 -5289004 -5223485 -5162271 -5110753 -5047046 -4996779 -4958229 -4924879 -4882501
9885 -4882501 -4827017 -4787184 -4756453 -4726312 -4706218 -4695002 -4673714 -4646502 -4640412 -4631405 -4613838 -4600717
9873 -4600717 -4588652 -4567662 -4538400 -4524406 -4523330 -4508350 -4484924 -4465475 -4460904 -4450319 -4435879 -4423496
9861 -4423496 -4400270 -4387866 -4381459 -4364040 -4348837 -4331501 -4319759 -4306508 -4295036 -4288369 -4285517 -4260447
9849 -4260447 -4244976 -4241215 -4232190 -4237600 -4235649 -4217951 -4190786 -4177051 -4171682 -4160462 -4154992 -4134974 -4110484
9836 -4110484 -4102975 -4084742 -4069969 -4060485 -4071546 -4072806 -4077463 -4080354 -4075077 -4046372 -4019083 -4013302 -4013173
9823 -4013173 -3996078 -3977439 -3967950 -3954410 -3927148 -3920381 -3930328 -3931980 -3925206 -3915310 -3903597 -3874885 -3877015
9810 -3877015 -3872920 -3845633 -3829309 -3817499 -3812251 -3809774 -3801676 -3784309 -3776968 -3751311 -3736277 -3719846
$$ packed form
9896e223105j01948j4796N0845O5519O1214N1518O3707N0267L8550L3350M2378
9885d882501N5484L9833L0731L0141K0094J1216K1288K7212O090R007J7567J3121
9873d600717J2065K0990K9262J3994J076J4980K3426J9449M571J0585J4440J2383
9861d423496K3226J2404O407J7419J5203J7336J1742J3251J1472O667K852K5070
9849d260447J5471L761R025n410J951J7698K7165J3735N369J1220N470K0018K4490
9836d110484P509J8233J4773R484j1061j260m657k891N277K8705K7289N781J29
9823d013173J7095J8639R489J3540K7262O767r947j652O774R896J1713K8712k130
9810c877015M095K7287J6324J1810N248K477Q098J7367P341K5657J5034J6431
$$ plain form
9798 -3719846 -3704467 -3682247 -3677887 -3682071 -3672464 -3649623 -3633992 -3621885 -3622718 -3619531 -3604376 -3588058 -3570900
9785 -3570900 -3567261 -3553592 -3542299 -3527588 -3510781 -3509607 -3495777 -3503324 -3487395 -3475630 -3459627 -3452941
9773 -3452941 -3447055 -3435528 -3432597 -3424514 -3402924 -3384267 -3362985 -3351273 -3332066 -3317000 -3308595 -3297060
9761 -3297060 -3290622 -3284726 -3275927 -3253727 -3230893 -3231792 -3226696 -3220939 -3199014 -3191236 -3190241 -3192368 -3185238 -3168626
9747 -3168626 -3144594 -3118424 -3109202 -3096467 -3069996 -3045620 -3039805 -3036651 -3016610 -2998148 -2970594 -2964473
9735 -2964473 -2953173 -2931122 -2900984 -2896079 -2900795 -2885928 -2866608 -2846483 -2833371 -2812712 -2787654 -2753301
9723 -2753301 -2746262 -2745772 -2728346 -2711285 -2689061 -2656646 -2650040 -2632224 -2594304 -2580732 -2561131 -2542403
9711 -2542403 -2532696 -2529185 -2500749 -2475718 -2454228 -2430905 -2405715 -2378736 -2356889 -2357016 -2335849 -2301138
$$ packed form
9798c719846J5379K2220M360m184R607K2841J5631J2107q33L187J5155J6318J7158
9785c570900L639J3669J1293J4711J6807J174J3830p547J5929J1765J6003O686
9773c452941N886J1527K931Q083K1590J8657K1282J1712J9207J5066Q405J1535
9761c297060O438N896Q799K2200K2834q99N096N757K1925P778R95k127P130J6612
9747c168626K4032K6170R222J2735K6471K4376N815L154K0041J8462K7554O121
9735b964473J1300K2051L0138M905m716J4867J9320K0125J3112K0659K5058L4353
9723b753301P039M90J7426J7061K2224L2415O606J7816L7920J3572J9601J8728
9711b542403R707L511K8436K5031K1490K3323K5190K6979K1847j27K1167L4711
$$ plain form
9699 -2301138 -2272541 -2230718 -2204637 -2187956 -2186565 -2167876 -2130636 -2108574 -2099935 -2086086 -2055311 -2035892
9687 -2035892 -2018663 -2006861 -1989243 -1967954 -1947836 -1928615 -1907241 -1872517 -1840973 -1829508 -1823395 -1800514
9675 -1800514 -1764590 -1737492 -1742635 -1742508 -1735576 -1716393 -1708686 -1713094 -1719558 -1727093 -1729574 -1738495 -1742594 -1753739
9661 -1753739 -1785814 -1826012 -1871409 -1908202 -1953569 -2012321 -2070213 -2123324 -2189024 -2275553 -2351466
9650 -2351466 -2444293 -2545374 -2663774 -2778736 -2906352 -3030361 -3151720 -3273088 -3412860 -3565410
9640 -3565410 -3699707 -3824280 -3959061 -4107721 -4248934 -4381738 -4497221 -4595366 -4710680 -4840811
9630 -4840811 -4950152 -5038325 -5118153 -5182617 -5254986 -5317487 -5374371 -5417092 -5466746 -5523162 -5565487
9619 -5565487 -5573563 -5573008 -5582380 -5593213 -5597329 -5600294 -5618444 -5621417 -5613003 -5602902 -5586301 -5562358 -5538420
$$ packed form
9699b301138K8597M1823K6081J6681J391J8689L7240K2062Q639J3849L0775J9419
9687b035892J7229J1802J7618K1289K0118J9221K1374L4724L1544J1465O113K2881
9675a800514L5924K7098n143J27O932J9183P707m408o464p535k481q921m099j1145
9661a753739l2075m0198m5397l6793m5367n8752n7892n3111o5700q6529p5913
9650b351466r2827j01081j18400j14962j27616j24009j21359j21368j39772j52550
9640c565410j34297j24573j34781j48660j41213j32804j15483r8145j15314j30131
9630d840811j09341q8173p9828o4464p2369o2501n6884m2721m9654n6416m2325
9619e565487q076N55r372j0833m116k965j8150k973Q414J0101J6601K3943K3938
$$ plain form
9606 -5538420 -5508245 -5492171 -5488694 -5470245 -5452906 -5438546 -5431780 -5398997 -5359282 -5340175 -5330545 -5317461
9594 -5317461 -5282973 -5244326 -5207876 -5180843 -5161407 -5148405 -5138180 -5129382 -5109910 -5092859 -5069634 -5039025
9582 -5039025 -5011664 -4987589 -4964171 -4944681 -4926149 -4900816 -4890180 -4881299 -4852678 -4821173 -4803135 -4791088
9570 -4791088 -4779804 -4768236 -4746848 -4734988 -4707757 -4694763 -4672834 -4650051 -4628605 -4614926 -4607705 -4594883
9558 -4594883 -4574192 -4553751 -4546755 -4541325 -4517034 -4493398 -4473490 -4459041 -4444908 -4440125 -4438987 -4418046
9546 -4418046 -4399360 -4384056 -4370705 -4363955 -4367707 -4371448 -4362013 -4345305 -4330749 -4310414 -4290875 -4289374
9534 -4289374 -4265758 -4243585 -4239358 -4225705 -4199167 -4170766 -4162463 -4157619 -4143249 -4130381 -4118503 -4111103
9522 -4111103 -4110175 -4123753 -4126292 -4112807 -4104015 -4102087 -4084406 -4065073 -4057818 -4059489 -4047162 -4032857 -4023332
$$ packed form
9606e538420L0175J6074L477J8449J7339J4360O766L2783L9715J9107R630J3084
9594e317461L4488L8647L6450K7033J9436J3002J0225Q798J9472J7051K3225L0609
9582e039025K7361K4075K3418J9490J8532K5333J0636Q881K8621L1505J8038J2047
9570d791088J1284J1568K1388J1860K7231J2994K1929K2783K1446J3679P221J2822
9558d594883K0691K0441O996N430K4291K3636J9908J4449J4133M783J138K0941
9546d418046J8686J5304J3351O750l752l741R435J6708J4556K0335J9539J501
9534d289374K3616K2173M227J3653K6538K8401Q303M844J4370J2868J1878P400
9522d111103R28j3578k539J3485Q792J928J7681J9333P255j671J2327J4305R525
$$ plain form
9509 -4023332 -4009665 -4009662 -4011946 -4012255 -4004021 -3998038 -3980470 -3968673 -3954783 -3950223 -3937277 -3942343 -3940007 -3929984
9495 -3929984 -3922066 -3917098 -3905106 -3890157 -3875389 -3866982 -3870359 -3862700 -3855929 -3855266 -3857931 -3867346 -3865200 -3857041
9481 -3857041 -3851316 -3832052 -3819051 -3808650 -3807218 -3809468 -3805948 -3788036 -3768495 -3752064 -3743430 -3740405 -3734923
9468 -3734923 -3725076 -3722382 -3722562 -3723901 -3725535 -3723721 -3710845 -3717044 -3713817 -3714219 -3714279 -3703467 -3692081 -3673228
9454 -3673228 -3654304 -3646205 -3644591 -3640641 -3632123 -3621765 -3629745 -3631870 -3628191 -3621624 -3615925 -3611742 -3605244 -3607275
9440 -3607275 -3604284 -3597265 -3597535 -3588896 -3576014 -3555877 -3545769 -3538517 -3543046 -3553880 -3547940 -3534911 -3525600
9427 -3525600 -3500571 -3494283 -3496661 -3496366 -3499389 -3501998 -3498209 -3493821 -3497006 -3495954 -3492947 -3481780 -3471142 -3465317
9413 -3465317 -3469953 -3467372 -3460086 -3454919 -3455717 -3435035 -3424680 -3427339 -3427605 -3428652 -3423479 -3415383 -3426438 -3431558
$$ packed form
9509d023332J3667Lk284l09Q234N983J7568J1797J3890M560J2946n066K336J0023
9495c929984P918M968J1992J4949J4768Q407l377P659O771O63k665r415K146Q159
9481c857041N725J9264J3001J0401J432k250L520J7912J9541J6431Q634L025N482
9468c734923R847K694j80j339j634J814J2876o199L227m02o0J0812J1386J8853
9454c673228J8924Q099J614L950Q518J0358p980k125L679O567N699M183O498k031
9440c607275K991P019k70Q639J2882K0137J0108P252m529j0834N940J3029R311
9427c525600K5029O288k378K95l023k609L789M388l185J052L007J1167J0638N825
9413c465317m636K581P286N167p98K0682J0355k659k66j047N173Q096j1055n120
$$ plain form
9399 -3431558 -3424718 -3429326 -3411062 -3377865 -3377374 -3375518 -3365260 -3358688 -3356476 -3339878 -3341537 -3344640 -3340995
9386 -3340995 -3329970 -3323272 -3329254 -3339555 -3351958 -3346135 -3322110 -3323534 -3318991 -3307107 -3294414 -3289855 -3278449
9373 -3278449 -3268544 -3273018 -3273363 -3290173 -3303051 -3301323 -3288646 -3276588 -3262245 -3257545 -3270757 -3260465 -3259555
9360 -3259555 -3267884 -3265318 -3253422 -3246281 -3242077 -3241588 -3237855 -3243709 -3237525 -3235950 -3229264 -3210269 -3195643 -3197672
9346 -3197672 -3196623 -3193842 -3189431 -3184110 -3179943 -3180271 -3187803 -3189700 -3177088 -3162177 -3141568 -3136360 -3143894 -3158007
9332 -3158007 -3172471 -3172275 -3172234 -3162227 -3148965 -3146310 -3150663 -3147595 -3130668 -3124297 -3134110 -3125613 -3117554 -3128505
9318 -3128505 -3126593 -3106142 -3089453 -3079192 -3077972 -3082618 -3073182 -3063330 -3063496 -3077033 -3063584 -3054373 -3046238
9305 -3046238 -3049272 -3055676 -3058403 -3055553 -3044258 -3027747 -3016781 -3009840 -3008004 -3031442 -3048397 -3042477 -3040152
$$ packed form
9399c431558O840m608J8264L3197M91J856J0258O572K212J6598j659l103L645
9386c340995J1025O698n982j0301j2403N823K4025j424M543J1884J2693M559J1406
9373c278449R905m474l45j6810j2878J728J2677J2058J4343M700j3212J0292R10
9360c259555q329K566J1896P141M204M89L733n854O184J575O686J8995J4626k029
9346c197672J049K781M411N321M167l28p532j897J2612J4911K0609N208p534j4113
9332c158007j4464J96M1J0007J3262K655m353L068J6927O371r813Q497Q059j0951
9318c128505J912K0451J6689J0261J220m646R436R852j66j3537J3449R211Q135
9305c046238l034o404k727K850J1295J6511J0966O941J836k3438j6955N920K325
$$ plain form
9292 -3040152 -3028770 -3018568 -3009476 -3017771 -3014723 -3009805 -3004073 -3001540 -2995027 -3010067 -3016193 -3011403 -3002906
9279 -3002906 -2995924 -2995159 -2991182 -2989423 -2993737 -2993820 -2987368 -2991564 -2982917 -2977344 -2969945 -2970895 -2959879 -2950600 -2947146
9264 -2947146 -2960583 -2958529 -2951809 -2947996 -2951863 -2932202 -2918501 -2918683 -2922914 -2913982 -2914588 -2925382 -2932498 -2931620
9250 -2931620 -2930223 -2922888 -2904150 -2892505 -2884247 -2883792 -2891419 -2900084 -2906202 -2911818 -2916984 -2909393 -2899362 -2900386
9236 -2900386 -2892736 -2885780 -2874210 -2878742 -2877564 -2875684 -2877811 -2871351 -2860655 -2863328 -2864947 -2856153 -2843880
9223 -2843880 -2846551 -2846332 -2839138 -2835362 -2836009 -2833842 -2831042 -2830043 -2824189 -2817390 -2819472 -2812796 -2816482 -2803706 -2795545
9208 -2795545 -2794678 -2792751 -2780862 -2784566 -2779119 -2770600 -2777262 -2776058 -2776224 -2787182 -2801615 -2800383 -2787198 -2793345
9194 -2793345 -2787746 -2778365 -2769459 -2758479 -2755351 -2742008 -2742355 -2750945 -2752606 -2733939 -2734855 -2733482 -2741944 -2745184
$$ packed form
9292c040152J1382J0202R092q295L048M918N732K533O513j5040o126M790Q497
9279c002906O982P65L977J759m314q3O452m196Q647N573P399r50J1016R279L454
9264b947146j3437K054O720L813l867J9661J3701j82m231Q932o06j0794p116Q78
9250b931620J397P335J8738J1645Q258M55p627q665o118n616n166P591J0031j024
9236b900386P650O956J1570m532J178J880k127O460J0696k673j619Q794J2273
9223b843880k671K19P194L776o47K167K800R99N854O799k082O676l686J2776Q161
9208b795545Q67J927J1889l704N447Q519o662J204j66j0958j4433J232J3185o147
9194b793345N599R381Q906J0980L128J3343l47q590j661J8667r16J373q462l240
$$ plain form
9180 -2745184 -2744386 -2732989 -2731083 -2739616 -2731384 -2713765 -2707797 -2702162 -2696020 -2706490 -2712436 -2723302 -2730419
9167 -2730419 -2718222 -2703540 -2698639 -2714429 -2717194 -2707485 -2693319 -2701067 -2710896 -2700770 -2691114 -2683782 -2687144
9154 -2687144 -2697675 -2698526 -2704761 -2697576 -2688005 -2682292 -2694399 -2695127 -2680951 -2657482 -2655196 -2658621 -2670761
9141 -2670761 -2673605 -2677230 -2673378 -2663026 -2648852 -2649522 -2654742 -2661250 -2645768 -2635982 -2640367 -2645074 -2647537 -2638884
9127 -2638884 -2621468 -2612737 -2615842 -2620343 -2617228 -2618480 -2625568 -2618452 -2613887 -2624011 -2620812 -2616032 -2617294 -2625048
9113 -2625048 -2626033 -2611839 -2603078 -2609876 -2607515 -2615823 -2618662 -2606668 -2604989 -2598410 -2583823 -2577330 -2582843 -2581329
9099 -2581329 -2577397 -2583589 -2579877 -2571158 -2577104 -2584600 -2577935 -2578864 -2579641 -2574934 -2573204 -2558359 -2552626 -2551169
9085 -2551169 -2552672 -2554067 -2559910 -2560749 -2563956 -2570785 -2566396 -2561667 -2563637 -2559262 -2544730 -2540488 -2536796 -2528793
$$ packed form
9180b745184P98J1397J906q533Q232J7619N968N635O142j0470n946j0866p117
9167b730419J2197J4682M901j5790k765R709J4166p748r829J0126R656P332l362
9154b687144j0531q51o235P185R571N713j2107p28J4176K3469K286l425j2140
9141b670761k844l625L852J0352J4174o70n220o508J5482R786m385m707k463Q653
9127b638884J7416Q731l105m501L115j252p088P116M565j0124L199M780j262p754
9113b625048r85J4194Q761o798K361q308k839J1994J679O579J4587O493n513J514
9099b581329L932o192L712Q719n946p496O665r29p77M707J730J4845N733J457
9085b551169j503j395n843q39l207o829M389M729j970M375J4532M242L692Q003
$$ plain form
9071 -2528793 -2520407 -2522503 -2536849 -2539363 -2523015 -2508191 -2512732 -2521950 -2519231 -2511539 -2510049 -2499165 -2494017
9058 -2494017 -2489224 -2492675 -2496844 -2504229 -2511177 -2508764 -2503490 -2502966 -2490514 -2481627 -2473787 -2471482 -2469213 -2482044
9044 -2482044 -2496112 -2493756 -2489490 -2490231 -2492308 -2465632 -2459769 -2475834 -2486891 -2487304 -2486942 -2481014 -2468829 -2462399
9030 -2462399 -2449177 -2446257 -2437446 -2441150 -2442220 -2449302 -2452322 -2449862 -2437500 -2429184 -2442232 -2449761 -2448951 -2456297
9016 -2456297 -2458112 -2449169 -2439358 -2433194 -2442852 -2442643 -2432082 -2431372 -2424771 -2421059 -2415075 -2407619 -2416870 -2416850 -2422861
9001 -2422861 -2424099 -2408945 -2400788 -2412837 -2413301 -2405089 -2422607 -2413907 -2403608 -2400136 -2398530 -2387627 -2378603
8988 -2378603 -2389669 -2399323 -2388746 -2383634 -2372743 -2368827 -2376679 -2389195 -2380663 -2371742 -2367521 -2367468 -2360311 -2335481
8974 -2335481 -2332379 -2338535 -2348408 -2352621 -2351069 -2365443 -2379003 -2377095 -2375180 -2377999 -2369529 -2376402 -2380450 -2367058
$$ packed form
9071b528793Q386k096j4346k514J6348J4824m541r218K719P692J490J0884N148
9058b494017M793l451m169p385o948K413N274N24J2452Q887P840K305K269j2831
9044b482044j4068K356M266p41k077K6676N863j6065j1057m13L62N928J2185O430
9030b462399J3222K920Q811l704j070p082l020K460J2362Q316j3048p529Q10p346
9016b456297j815Q943R811O164r658K09J0561P10O601L712N984P456r251K0o011
9001b422861j238J5154Q157j2049m64Q212j7518Q700J0299L472J606J0903R024
8988b378603j1066r654J0577N112J0891L916p852j2516Q532Q921M221N3P157K4830
8974b335481L102o156r873m213J552j4374j3560J908J915k819Q470o873m048J3392
$$ plain form
8960 -2367058 -2369800 -2354464 -2351865 -2347605 -2343036 -2342860 -2335912 -2320730 -2316768 -2318125 -2321037 -2325855 -2332598 -2331958
8946 -2331958 -2326695 -2321020 -2317707 -2324493 -2328357 -2321237 -2324632 -2320965 -2304557 -2291494 -2291857 -2290090 -2295955 -2306417
8932 -2306417 -2307479 -2310356 -2329018 -2324309 -2310095 -2305448 -2311376 -2320931 -2310149 -2302687 -2310092 -2317101 -2311300
8919 -2311300 -2297741 -2287750 -2282041 -2276467 -2262298 -2257288 -2277947 -2291045 -2297400 -2296681 -2292361 -2275911 -2263108
8906 -2263108 -2252771 -2258126 -2259815 -2271261 -2282930 -2276985 -2281731 -2298624 -2305494 -2298333 -2295726 -2303743 -2291135
8893 -2291135 -2266491 -2258732 -2267125 -2278301 -2281958 -2265683 -2254504 -2257247 -2270272 -2271060 -2272127 -2252777 -2243781
8880 -2243781 -2242483 -2236169 -2233837 -2236005 -2244092 -2251552 -2258302 -2257292 -2257208 -2250348 -2244734 -2240177 -2240752 -2227155 -2216917
8865 -2216917 -2217568 -2234225 -2246392 -2244350 -2232730 -2225267 -2238362 -2237185 -2228842 -2227931 -2212208 -2201934 -2195758
$$ packed form
8960b367058k742J5336K599M260M569J76O948J5182L962j357k912m818o743O40
8946b331958N263N675L313o786l864P120l395L667J6408J3063l63J767n865j0462
8932b306417j062k877j8662M709J4214M647n928r555J0782P462p405p009N801
8919b311300J3559R991N709N574J4169N010k0659j3098o355P19M320J6450J2803
8906b263108J0337n355j689j1446j1669N945m746j6893o870P161K607q017J2608
8893b291135K4644P759q393j1176l657J6275J1179k743j3025p88j067J9350Q996
8880b243781J298O314K332k168q087p460o750J010Q4O860N614M557n75J3597J0238
8865b216917o51j6657j2167K042J1620P463j3095J177Q343R11J5723J0274O176
$$ plain form
8852 -2195758 -2193333 -2189687 -2176888 -2165505 -2181444 -2196194 -2200568 -2207233 -2217448 -2195001 -2183516 -2183586 -2191864
8839 -2191864 -2183117 -2173147 -2171741 -2165003 -2162012 -2165129 -2169153 -2171634 -2165304 -2167144 -2162767 -2164941 -2163752 -2156169
8825 -2156169 -2160445 -2174209 -2180973 -2166788 -2154731 -2151397 -2161906 -2152674 -2151985 -2163257 -2159628 -2150382 -2148339
8812 -2148339 -2134470 -2149547 -2165967 -2167599 -2165805 -2150098 -2135391 -2131256 -2135036 -2135959 -2150971 -2151075 -2150953
8799 -2150953 -2147304 -2152425 -2148400 -2150588 -2138015 -2132820 -2133675 -2130005 -2127824 -2136113 -2127903 -2122715 -2122354 -2123785
8785 -2123785 -2116081 -2111158 -2121527 -2130497 -2125429 -2109474 -2110395 -2113870 -2117063 -2124195 -2125528 -2131853 -2125393 -2113366
8771 -2113366 -2109051 -2098549 -2080103 -2063297 -2062709 -2078940 -2093814 -2084632 -2091666 -2100803 -2099214 -2098829 -2099061 -2090542
8757 -2090542 -2085960 -2085628 -2089189 -2083390 -2080344 -2078140 -2086735 -2089874 -2088805 -2074134 -2070829 -2076956 -2071420 -2067792
$$ packed form
8852b195758K425L646J2799J1383j5939j4750m374o665j0215K2447J1485p0q278
8839b191864Q747R970J406O738K991l117m024k481O330j840M377k174J189P583
8825b156169m276j3764o764J4185J2057L334j0509R232O89j1272L629R246K043
8812b148339J3869j5077j6420j632J794J5707J4707M135l780r23j5012j04J22
8799b150953L649n121M025k188J2573N195q55L670K181q289Q210N188L61j431
8785b123785P704M923j0369q970N068J5955r21l475l193p132j333o325O460J2027
8771b113366M315J0502J8446J6806N88j6231j4874R182p034r137J589L85k32Q519
8757b090542M582L32l561N799L046K204q595l139J069J4671L305o127N536L628
$$ plain form
8743 -2067792 -2057263 -2060234 -2071998 -2085123 -2088722 -2078254 -2068347 -2080025 -2088726 -2073670 -2065542 -2057607 -2056273
8730 -2056273 -2059275 -2053615 -2056613 -2055006 -2052207 -2041990 -2038158 -2035874 -2030259 -2031705 -2040373 -2055973 -2043576
8717 -2043576 -2030545 -2030259 -2045845 -2052459 -2048506 -2040071 -2045310 -2048720 -2032852 -2029660 -2034268 -2035076 -2050884 -2062412
8703 -2062412 -2066233 -2065234 -2068607 -2062797 -2057264 -2046375 -2034558 -2030107 -2024642 -2018343 -2017982 -2015465 -2036230 -2030727
8689 -2030727 -2024955 -2016780 -2001096 -1988871 -1990415 -1996826 -1993962 -1995488 -2009165 -2019501 -2016906 -2011149 -1995751
8676 -1995751 -1987112 -1985178 -1999539 -2004490 -1999414 -1992206 -1988495 -1992794 -2004212 -1996787 -1990325 -1990256 -1990609 -1993147
8662 -1993147 -1993160 -1993736 -1992190 -1977252 -1974129 -1985241 -1985760 -1985648 -1979147 -1964226 -1960223 -1970237 -1974771 -1972534
8648 -1972534 -1962671 -1966298 -1965965 -1957958 -1955867 -1966125 -1979187 -1982789 -1979626 -1978348 -1983523 -1984979 -1982753 -1973883
$$ packed form
8743b067792J0529k971j1764j3125l599J0468R907j1678q701J5056Q128P935J334
8730b056273l002N660k998J607K799J0217L832K284N615j446q668j5600J2397
8717b043576J3031K86j5586o614L953Q435n239l410J5868L192m608q08j5808j1528
8703b062412l821R99l373N810N533J0889J1817M451N465O299L61K517k0765N503
8689b030727N772Q175J5684J2225j544o411K864j526j3677j0336K595N757J5398
8676a995751Q639J934j4361m951N076P208L711m299j1418P425O462O9l53k538
8662a993147j3n76J546J4938L123j1112n19J12O501J4921M003j0014m534K237
8648a972534R863l627L33Q007K091j0258j3062l602L163J278n175j456K226Q870
$$ plain form
8634 -1973883 -1967064 -1964066 -1951549 -1953240 -1964667 -1963589 -1962322 -1965773 -1967036 -1964111 -1955276 -1955188 -1964022 -1965778
8620 -1965778 -1955121 -1969076 -1979844 -1966852 -1957113 -1957402 -1948061 -1943604 -1943521 -1949164 -1953725 -1948219 -1945640 -1947189
8606 -1947189 -1953043 -1953118 -1948415 -1938708 -1942051 -1936050 -1937767 -1938667 -1917583 -1921641 -1920474 -1912356 -1909633 -1905036 -1901360
8591 -1901360 -1900512 -1897709 -1902100 -1912025 -1923782 -1920681 -1939165 -1951486 -1956824 -1966997 -1958826 -1946126 -1932621
8578 -1932621 -1934316 -1937071 -1925910 -1922671 -1925822 -1926594 -1927647 -1922745 -1922391 -1921874 -1926127 -1917246 -1909988 -1909417 -1909200
8563 -1909200 -1933295 -1934728 -1909714 -1905946 -1897789 -1909133 -1926370 -1921639 -1913350 -1910757 -1913266 -1919003 -1912359
8550 -1912359 -1917375 -1924042 -1911141 -1912632 -1905769 -1898220 -1895970 -1885112 -1872697 -1875225 -1874290 -1884704 -1890264
8537 -1890264 -1897932 -1906427 -1890784 -1872480 -1869459 -1887342 -1892958 -1899998 -1889968 -1873498 -1872767 -1877343 -1874860
$$ packed form
8634a973883O819K998J2517j691j1427J078J267l451j263K925Q835Q8q834j756
8620a965778J0657j3955j0768J2992R739k89R341M457Q3n643m561N506K579j549
8606a947189n854p5M703R707l343O001j717r00K1084m058J167Q118K723M597L676
8591a901360Q48K803m391r925j1757L101j8484j2321n338j0173Q171J2700J3505
8578a932621j695k755J1161L239l151p72j053M902L54N17m253Q881P258N71K17
8563a909200k4095j433K5014L768Q157j1344j7237M731Q289K593k509n737O644
8550a912359n016o667J2901j491O863P549K250J0858J2415k528R35j0414n560
8537a890264p668q495J5643J8304L021j7883n616p040J0030J6470P31m576K483
$$ plain form
8524 -1874860 -1876226 -1876876 -1879558 -1882663 -1877768 -1880074 -1873921 -1872122 -1873413 -1873687 -1873954 -1875001 -1878034 -1859064 -1858757
8509 -1858757 -1875072 -1872854 -1868737 -1861475 -1851474 -1854017 -1853468 -1845105 -1837177 -1840154 -1850499 -1860861 -1855116
8496 -1855116 -1847692 -1842943 -1843363 -1842647 -1841081 -1828075 -1839655 -1843362 -1848319 -1861819 -1869271 -1865504 -1843153 -1828545
8482 -1828545 -1836017 -1845996 -1851065 -1845888 -1843640 -1844439 -1836274 -1838298 -1840283 -1834812 -1844246 -1839760 -1838495 -1846196
8468 -1846196 -1846497 -1841789 -1842842 -1842340 -1836731 -1835131 -1822722 -1811421 -1807393 -1823939 -1824305 -1820919 -1807334 -1805976
8454 -1805976 -1809286 -1815042 -1811603 -1817666 -1822946 -1831803 -1817472 -1803242 -1813893 -1822470 -1817338 -1816715 -1816878 -1817769
8440 -1817769 -1825044 -1829056 -1825159 -1819312 -1817274 -1814543 -1814659 -1811229 -1817670 -1820195 -1796641 -1792093 -1805129 -1810257
8426 -1810257 -1791726 -1789335 -1797852 -1802477 -1812804 -1801587 -1799075 -1805499 -1795342 -1782672 -1792827 -1801274 -1800629
$$ packed form
8524a874860j366o50k682l105M895k306O153J799j291k74k67j047l033J8970L07
8509a858757j6315K218M117P262J0001k543N49Q363P928k977j0345j0362N745
8496a855116P424M749m20P16J566J3006j1580l707m957j3500p452L767K2351J4608
8482a828545p472r979n069N177K248p99Q165k024j985N471r434M486J265p701
8468a846196l01M708j053N02N609J600J2409J1301M028j6546l66L386J3585J358
8454a805976l310n756L439o063n280q857J4331J4230j0651q577N132O23j63q91
8440a817769p275m012L897N847K038K731j16L430o441k525K3554M548j3036n128
8426a810257J8531K391q517m625j0327J1217K512o424J0157J2670j0155q447O45
$$ plain form
8413 -1800629 -1791557 -1799159 -1793764 -1790440 -1801945 -1806510 -1794701 -1770828 -1752447 -1751598 -1755407 -1760269 -1762380
8400 -1762380 -1764864 -1768416 -1763382 -1766561 -1761402 -1765102 -1787264 -1793658 -1780005 -1763153 -1768791 -1769456 -1768956 -1767968
8386 -1767968 -1771169 -1768441 -1763076 -1764857 -1764627 -1769435 -1764566 -1768580 -1765560 -1761100 -1754307 -1756663 -1753651 -1751892
8372 -1751892 -1758153 -1750373 -1739330 -1748878 -1762038 -1752819 -1746725 -1750349 -1753309 -1757747 -1748593 -1732936 -1728176
8359 -1728176 -1729058 -1734219 -1734469 -1733633 -1738489 -1748422 -1752610 -1744049 -1737949 -1742112 -1750462 -1753745 -1763322 -1760137 -1746359
8344 -1746359 -1735903 -1721831 -1715684 -1723026 -1738831 -1742858 -1743316 -1738026 -1740091 -1726784 -1715990 -1708874 -1726331
8331 -1726331 -1729625 -1735577 -1744657 -1740704 -1723240 -1719581 -1725771 -1733191 -1741821 -1742514 -1742824 -1731681 -1728283 -1718363
8317 -1718363 -1706615 -1704555 -1708849 -1715778 -1727159 -1705260 -1686492 -1692396 -1709623 -1719449 -1721431 -1707825 -1706123
$$ packed form
8413a800629R072p602N395L324j1505m565J1809K3873J8381Q49l809m862k111
8400a762380k484l552N034l179N159l700k2162o394J3653J6852n638o65N00R88
8386a767968l201K728N365j781K30m808M869m014L020M460O793k356L012J759
8372a751892o261P780J1043r548j3160R219O094l624k960m438R154J5657M760
8359a728176q82n161k50Q36m856r933m188Q561O100m163q350l283r577L185J3778
8344a746359J0456J4072O147p342j5805m027m58N290k065J3307J0794P116j7457
8331a726331l294n952r080L953J7464L659o190p420q630o93l10J1143L398R920
8317a718363J1748K060m294o929j1381K1899J8768n904j7227r826j982J3606J702
$$ plain form
8304 -1706123 -1711514 -1701279 -1690952 -1703462 -1710050 -1707419 -1684178 -1677822 -1698649 -1709441 -1704573 -1707461 -1716767
8291 -1716767 -1716207 -1701715 -1693843 -1696219 -1697798 -1686395 -1681012 -1685205 -1684684 -1699744 -1700191 -1690789 -1683998 -1668590
8277 -1668590 -1663331 -1664046 -1668678 -1673568 -1677962 -1692268 -1687750 -1683453 -1687037 -1688950 -1688952 -1697725 -1694451 -1680798 -1687105
8262 -1687105 -1697427 -1686308 -1672828 -1674088 -1670984 -1648929 -1644255 -1653964 -1668475 -1678953 -1675569 -1672663 -1664458
8249 -1664458 -1658080 -1663889 -1658117 -1647971 -1648996 -1647213 -1647718 -1656291 -1645832 -1641651 -1640991 -1641874 -1650475 -1656415
8235 -1656415 -1657140 -1657687 -1649472 -1644139 -1661140 -1661781 -1652770 -1637488 -1642666 -1653750 -1657205 -1667066 -1671755 -1668743
8221 -1668743 -1654708 -1655967 -1662167 -1661660 -1658133 -1651583 -1650299 -1645331 -1641487 -1652702 -1656407 -1647583 -1636214 -1646609
8207 -1646609 -1644783 -1638581 -1634679 -1633231 -1629509 -1636942 -1643612 -1632685 -1615859 -1617203 -1634643 -1642859 -1630106
$$ packed form
8304a706123n391J0235J0327j2510o588K631K3241O356k0827j0792M868k888r306
8291a716767N60J4492P872k376j579J1403N383m193N21j5060m47R402O791J5408
8277a668590N259p15m632m890m394j4306M518M297l584j913kq773L274J3653o307
8262a687105j0322J1119J3480j260L104K2055M674r709j4511j0478L384K906Q205
8249a664458O378n809N772J0146j025J783n05q573J0459M181O60q83q601n940
8235a656415p25n47Q215N333j7001o41R011J5282n178j1084l455r861m689L012
8221a668743J4035j259o200N07L527O550J284M968L844j1215l705Q824J1369j0395
8207a646609J826O202L902J448L722p433o670J0927J6826j344j7440q216J2753
$$ plain form
8194 -1630106 -1617568 -1625604 -1624254 -1610669 -1609352 -1615558 -1640476 -1640020 -1638934 -1634894 -1638274 -1631967 -1621012
8181 -1621012 -1611702 -1612951 -1605772 -1616723 -1619930 -1613436 -1617534 -1631613 -1630273 -1629219 -1633869 -1633057 -1633468 -1621224
8167 -1621224 -1616161 -1618377 -1618772 -1610948 -1607423 -1601197 -1608452 -1617281 -1614906 -1605633 -1600428 -1603778 -1600425 -1592938
8153 -1592938 -1606302 -1610922 -1601754 -1607225 -1614360 -1601159 -1602932 -1602147 -1585311 -1583318 -1584720 -1585550 -1586037 -1581830
8139 -1581830 -1597234 -1606135 -1594303 -1585093 -1571793 -1564489 -1565336 -1580363 -1594064 -1592095 -1584497 -1588376 -1585450
8126 -1585450 -1578027 -1583701 -1584451 -1574118 -1572037 -1573607 -1567670 -1557353 -1565339 -1574764 -1575674 -1588320 -1581616 -1582859
8112 -1582859 -1571898 -1578678 -1590114 -1588137 -1582659 -1564393 -1561928 -1574650 -1582740 -1581126 -1576281 -1576556 -1588672
8099 -1588672 -1596000 -1594742 -1581791 -1560609 -1558558 -1559730 -1578241 -1570157 -1562723 -1570935 -1567973 -1553295 -1550770
$$ packed form
8194a630106J2538q036J350J3585J317o206k4918M56J086M040l380O307J0955
8181a621012R310j249P179j0951l207O494m098j4079J340J054m650Q12m11J2244
8167a621224N063k216l95P824L525O226p255q829K375R273N205l350L353P487
8153a592938j3364m620R168n471p135J3201j773P85J6836J993j402q30m87M207
8139a581830j5404q901J1832R210J3300P304q47j5027j3701J969P598l879K926
8126a585450P423n674p50J0333K081j570N937J0317p986r425r10j2646O704j243
8112a582859J0961o780j1436J977N478J8266K465j2722q090J614M845k75j2116
8099a588672p328J258J2951K1182K051j172j8511Q084P434q212K962J4678K525
$$ plain form
8086 -1550770 -1564201 -1563160 -1546069 -1541053 -1554637 -1571515 -1570865 -1550959 -1550210 -1548054 -1560383 -1563331 -1560658
8073 -1560658 -1566329 -1569122 -1568441 -1565921 -1572758 -1568220 -1555706 -1544689 -1541535 -1542095 -1546779 -1543839 -1541453 -1551941
8059 -1551941 -1554549 -1557538 -1554314 -1539595 -1542859 -1551722 -1560210 -1561678 -1561582 -1538441 -1549528 -1558893 -1551006 -1562061
8045 -1562061 -1563342 -1558955 -1536939 -1534127 -1534925 -1530135 -1517700 -1517473 -1531264 -1539867 -1530161 -1533173 -1542453 -1540136
8031 -1540136 -1533753 -1533501 -1532584 -1539254 -1556510 -1560699 -1562591 -1554605 -1528525 -1508560 -1498877 -1506880 -1518099 -1499209
8017 -1499209 -1505073 -1516709 -1509688 -1507029 -1508239 -1502115 -1503116 -1512190 -1527971 -1529702 -1523610 -1517330 -1503498
8004 -1503498 -1495431 -1495653 -1504498 -1504539 -1516260 -1530235 -1532201 -1524366 -1512096 -1507925 -1513493 -1518434 -1512637 -1517429
7990 -1517429 -1516527 -1506724 -1501184 -1496553 -1495377 -1487331 -1494110 -1493380 -1489663 -1488559 -1478498 -1491487 -1492376 -1494293
$$ packed form
8086a550770j3431J041J7091N016j3584j6878O50J9906P49K156j2329k948K673
8073a560658n671k793O81K520o837M538J2514J1017L154n60m684K940K386j0488
8059a551941k608k989L224J4719l264q863q488j468R6K3141j1087r365P887j1055
8045a562061j281M387K2016K812p98M790J2435K27j3791q603R706l012r280K317
8031a540136O383K52R17o670j7256m189j892P986K6080J9965R683q003j1219J8890
8017a499209n864j1636P021K659j210O124j001r074j5781j731O092O280J3832
8004a503498Q067k22q845m1j1721j3975j966P835J2270M171n568m941N797m792
7990a517429R02R803N540M631J176Q046o779P30L717J104J0061j2989q89j917
$$ plain form
7976 -1494293 -1494496 -1495379 -1493211 -1488557 -1496229 -1513992 -1519175 -1510767 -1516247 -1513433 -1509644 -1501896 -1501780 -1495907 -1499940
7961 -1499940 -1496377 -1486758 -1496995 -1503070 -1502116 -1499112 -1493935 -1474373 -1458992 -1458469 -1464530 -1461717 -1472381 -1484596
7947 -1484596 -1484637 -1495944 -1503781 -1515802 -1514309 -1507744 -1495855 -1488246 -1492922 -1495553 -1505043 -1487822 -1451806
7934 -1451806 -1450284 -1458898 -1477962 -1481862 -1472432 -1485927 -1499180 -1504919 -1513436 -1510188 -1511163 -1508772 -1497318
7921 -1497318 -1498199 -1497994 -1486426 -1485782 -1493305 -1489417 -1476106 -1467260 -1472512 -1466689 -1448928 -1462356 -1473177 -1468463
7907 -1468463 -1470930 -1470574 -1474017 -1470184 -1473181 -1467546 -1458531 -1458463 -1468071 -1460063 -1451561 -1457015 -1464852 -1458434 -1455366
7892 -1455366 -1455380 -1462662 -1470008 -1481408 -1469447 -1468114 -1460225 -1451869 -1451773 -1456729 -1455093 -1448998 -1451640 -1459779 -1464161
7877 -1464161 -1452893 -1450758 -1457145 -1460253 -1455470 -1463655 -1476251 -1482720 -1477027 -1477199 -1463827 -1462249 -1458463 -1468099
$$ packed form
7976a494293k03q83K168M654p672j7763n183Q408n480K814L789P748J16N873m033
7961a499940L563R619j0237o075R54L004N177J9562J5381N23o061K813j0664j2215
7947a484596m1j1307p837j2021J493O565J1889P609m676k631r490J7221L6016
7934a451806J522q614j9064l900R430j3495j3253n739q517L248r75K391J1454
7921a497318q81K05J1568O44p523L888J3311Q846n252N823J7761j3428j0821M714
7907a468463k467L56l443L833k997N635R015O8r608Q008Q502n454p837O418L068
7892a455366j4p282p346j1400J1961J333P889Q356R6m956J636O095k642q139m382
7877a464161J1268K135o387l108M783q185j2596o469N693j72J3372J578L786r636
$$ plain form
7863 -1468099 -1473470 -1479142 -1469534 -1458642 -1459352 -1458548 -1455702 -1455824 -1467147 -1476897 -1478020 -1483826 -1475138 -1464368
7849 -1464368 -1465281 -1460511 -1455589 -1447569 -1438951 -1443599 -1447499 -1443282 -1429612 -1428151 -1434176 -1451608 -1461322 -1447497
7835 -1447497 -1449269 -1447865 -1451220 -1449331 -1436762 -1432537 -1448983 -1459965 -1464214 -1463505 -1456364 -1446064 -1439915
7822 -1439915 -1442703 -1438585 -1423969 -1417685 -1413612 -1406360 -1405912 -1411920 -1411067 -1410147 -1398466 -1393830 -1397026 -1417960
7808 -1417960 -1441258 -1440345 -1424730 -1424014 -1430428 -1431969 -1426304 -1431476 -1439349 -1427508 -1425767 -1431073 -1417993 -1435220
7794 -1435220 -1439488 -1428538 -1425930 -1437916 -1434108 -1425404 -1428684 -1428196 -1413958 -1412809 -1410594 -1406578 -1412135 -1417157
7780 -1417157 -1416438 -1414356 -1417844 -1419290 -1417829 -1425470 -1421191 -1419975 -1427796 -1428980 -1413919 -1402569 -1398698 -1413159
7766 -1413159 -1418949 -1419996 -1435803 -1437721 -1441021 -1437029 -1437920 -1425476 -1420063 -1423115 -1420786 -1419093 -1404257 -1403644
$$ packed form
7863a468099n371n672R608J0892p10Q04K846j22j1323r750j123n806Q688J0770
7849a464368r13M770M922Q020Q618m648l900M217J3670J461o025j7432r714J3825
7835a447497j772J404l355J889J2569M225j6446j0982m249P09P141J0300O149
7822a439915k788M118J4616O284M073P252M48o008Q53R20J1681M636l196k0934
7808a417960k3298R13J5615P16o414j541N665n172p873J1841J741n306J3080j7227
7794a435220m268J0950K608j1986L808Q704l280M88J4238J149K215M016n557n022
7780a417157P19K082l488j446J461p641M279J216p821j184J5061J1350L871j4461
7766a413159n790j047j5807j918l300L992q91J2444N413l052K329J693J4836O13
$$ plain form
7752 -1403644 -1393392 -1393740 -1405736 -1400142 -1395892 -1396908 -1394144 -1392925 -1393130 -1389834 -1385815 -1382941 -1388917 -1390852
7738 -1390852 -1385953 -1397732 -1399830 -1399776 -1411258 -1399116 -1387889 -1399954 -1401895 -1417036 -1417017 -1397789 -1389522
7725 -1389522 -1406958 -1421001 -1413307 -1419583 -1426772 -1420266 -1416814 -1409062 -1413669 -1408419 -1415419 -1416585 -1400585
7712 -1400585 -1385037 -1380300 -1389470 -1385470 -1395800 -1403811 -1401905 -1386734 -1376576 -1371756 -1372396 -1383499 -1383375
7699 -1383375 -1370848 -1377304 -1373194 -1373972 -1389627 -1396807 -1390111 -1383887 -1383086 -1393837 -1404790 -1390799 -1373496
7686 -1373496 -1377114 -1382389 -1372688 -1372318 -1396461 -1386458 -1372495 -1369707 -1366409 -1353680 -1353458 -1362582 -1371848 -1367604
7672 -1367604 -1361766 -1375700 -1399406 -1407270 -1398109 -1401754 -1399230 -1386483 -1378950 -1375635 -1375385 -1360730 -1354025
7659 -1354025 -1365310 -1374497 -1371318 -1366736 -1371302 -1364957 -1355370 -1351942 -1353737 -1368667 -1374850 -1376055 -1365345
$$ packed form
7752a403644J0252l48j1996N594M250j016K764J219k05L296M019K874n976j935
7738a390852M899j1779k098N4j1482J2142J1227j2065j941j5141J9J9228Q267
7725a389522j7436j4043P694o276p189O506L452P752m607N250p000j166J6000
7712a400585J5548M737r170M000j0330q011J906J5171J0158M820o40j1103J24
7699a383375J2527o456M110p78j5655p180O696O224Q01j0751j0953J3991J7303
7686a373496l618n275R701L70k4143J0003J3963K788L298J2729K22r124r266M244
7672a367604N838j3934k3706p864R161l645K524J2747P533L315K50J4655O705
7659a354025j1285r187L179M582m566O345R587L428j795j4930o183j205J0710
$$ plain form
7646 -1365345 -1364165 -1369066 -1359213 -1338753 -1331931 -1338688 -1340060 -1337718 -1350041 -1354133 -1350173 -1343051 -1341386 -1323521
7632 -1323521 -1326955 -1333652 -1342221 -1352508 -1361861 -1365961 -1380437 -1369381 -1337509 -1324729 -1324956 -1330319 -1336204
7619 -1336204 -1336223 -1341194 -1345480 -1364891 -1355364 -1348807 -1342067 -1350802 -1347515 -1335557 -1336291 -1333422 -1340548 -1346539
7605 -1346539 -1343046 -1335629 -1337050 -1342712 -1330642 -1337741 -1330124 -1324621 -1330867 -1338467 -1342401 -1326131 -1324260 -1331092
7591 -1331092 -1349538 -1353528 -1345675 -1341524 -1344537 -1342101 -1329193 -1330333 -1323024 -1319054 -1336459 -1342136 -1322905
7578 -1322905 -1310440 -1314170 -1303223 -1309669 -1302877 -1305623 -1311524 -1330793 -1337390 -1329766 -1325373 -1329466 -1330880
7565 -1330880 -1327625 -1327624 -1328057 -1309525 -1312183 -1317214 -1317362 -1318460 -1317152 -1318540 -1316387 -1308840 -1315604 -1315812 -1313363
7550 -1313363 -1313775 -1321446 -1318568 -1329451 -1341065 -1342337 -1338290 -1328924 -1321327 -1319892 -1315116 -1314169 -1302806 -1309701
$$ packed form
7646a365345J180m901R853K0460O822o757j372K342j2323m092L960P122J665J7865
7632a323521l434o697q569j0287r353m100j4476J1056L1872J2780k27n363n885
7619a336204j9m971m286j9411R527O557O740q735L287J1958p34K869p126n991
7605a346539L493P417j421n662J2070p099P617N503o246p600l934J6270J871o832
7591a331092j8446l990P853M151l013K436J2908j140P309L970j7405n677J9231
7578a322905J2465l730J0947o446O792k746n901j9269o597P624M393m093j414
7565a330880L255Jm33J8532k658n031j48j098J308j388K153P547o764k08K449
7550a313363m12p671K878j0883j1614j272M047R366P597J435M776R47J1363o895
$$ plain form
7536 -1309701 -1311965 -1308251 -1299719 -1302587 -1312646 -1312800 -1306466 -1295422 -1303562 -1315639 -1320038 -1328187 -1321214 -1321159
7522 -1321159 -1318733 -1310618 -1305968 -1305598 -1314924 -1314401 -1300991 -1296237 -1299450 -1302828 -1299769 -1292685 -1298915 -1291030
7508 -1291030 -1284310 -1291134 -1280418 -1282455 -1294601 -1294259 -1293019 -1296707 -1289190 -1294058 -1293392 -1294752 -1299354 -1291650
7494 -1291650 -1281156 -1282221 -1280456 -1279408 -1291303 -1294137 -1296782 -1303520 -1305130 -1317284 -1310757 -1295548 -1298647
7481 -1298647 -1293432 -1277592 -1275940 -1273374 -1293232 -1299353 -1296690 -1282336 -1273921 -1263278 -1270609 -1282973 -1285869
7468 -1285869 -1274388 -1273574 -1278572 -1279001 -1276378 -1275261 -1283473 -1300775 -1306745 -1296210 -1283588 -1271315 -1281767
7455 -1281767 -1277632 -1285029 -1286211 -1278343 -1276579 -1288377 -1283086 -1264824 -1260829 -1279007 -1295577 -1292054 -1293919
7442 -1293919 -1281223 -1265999 -1270751 -1269663 -1274815 -1282629 -1280483 -1274704 -1266864 -1267773 -1264627 -1264323 -1270057 -1283924
$$ packed form
7536a309701k264L714Q532k868j0059j54O334J1044q140j2077m399q149O973N5
7522a321159K426Q115M650L70r326N23J3410M754l213l378L059P084o230P885
7508a291030O720o824J0716k037j2146L42J240l688P517m868O66j360m602P704
7494a291650J0494j065J765J048j1895k834k645o738j610j2154O527J5209l099
7481a298647N215J5840J652K566j9858o121K663J4354Q415J0643p331j2364k896
7468a285869J1481Q14m998m29K623J117q212j7302n970J0535J2622J2273j0452
7455a281767M135p397j182P868J764j1798N291J8262L995j8178j6570L523j865
7442a293919J2696J5224m752J088n152p814K146N779P840r09L146L04n734j3867
$$ plain form
7428 -1283924 -1283980 -1285715 -1274175 -1276556 -1277606 -1273954 -1273992 -1271236 -1275604 -1286644 -1294570 -1284674 -1267936 -1270722
7414 -1270722 -1264618 -1261494 -1266569 -1264237 -1261322 -1259677 -1258311 -1256340 -1265969 -1258278 -1254131 -1262610 -1271728 -1269127
7400 -1269127 -1259894 -1263159 -1265221 -1282914 -1288254 -1271039 -1270698 -1264927 -1262608 -1273887 -1271084 -1257164 -1263856
7387 -1263856 -1264758 -1269930 -1288578 -1288218 -1279730 -1268127 -1275920 -1274274 -1258747 -1258015 -1253440 -1252581 -1238948 -1239254
7373 -1239254 -1244633 -1252383 -1250705 -1244253 -1237936 -1236100 -1234592 -1229724 -1227718 -1232310 -1239453 -1239351 -1244486 -1235987
7359 -1235987 -1235591 -1240191 -1223197 -1227229 -1243413 -1243833 -1245181 -1248143 -1255098 -1259576 -1259297 -1254074 -1255474 -1260039
7345 -1260039 -1253147 -1236465 -1239524 -1236022 -1233428 -1236605 -1244692 -1239911 -1244607 -1247256 -1236748 -1220430 -1227847
7332 -1227847 -1242054 -1243557 -1253114 -1251726 -1244102 -1227134 -1225290 -1222597 -1222149 -1231103 -1226667 -1224959 -1214662 -1217616
$$ packed form
7428a283924n6j735J1540k381j050L652l8K756m368j1040p926R896J6738k786
7414a270722O104L124n075K332K915J645J366J971r629P691M147q479r118K601
7400a269127R233l265k062j7693n340J7215L41N771K319j1279K803J3920o692
7387a263856r02n172j8648L60Q488J1603p793J646J5527P32M575Q59J3633l06
7373a239254n379p750J678O452O317J836J508M868K006m592p143J02n135Q499
7359a235987L96m600J6994m032j6184m20j348k962o955m478K79N223j400m565
7345a260039O892J6682l059L502K594l177q087M781m696k649J0508J6318p417
7332a227847j4207j503r557J388P624J6968J844K693M48q954M436J708J0297k954
$$ plain form
7318 -1217616 -1234374 -1242239 -1237235 -1239944 -1233819 -1216258 -1228082 -1231576 -1226241 -1221681 -1224388 -1216702 -1207235
7305 -1207235 -1213130 -1208796 -1201975 -1203332 -1210162 -1228247 -1234579 -1233940 -1223422 -1214845 -1213238 -1224599 -1222920 -1223188
7291 -1223188 -1231538 -1227126 -1222308 -1228520 -1235686 -1233825 -1223408 -1213148 -1221536 -1217997 -1213827 -1226067 -1226385 -1219665
7277 -1219665 -1223771 -1231366 -1231426 -1231661 -1234559 -1241488 -1237708 -1219223 -1210094 -1212582 -1209955 -1205841 -1202204 -1198668 -1202696
7262 -1202696 -1201538 -1207912 -1216525 -1203476 -1200881 -1202082 -1201972 -1216345 -1220611 -1215683 -1217876 -1223888 -1231686 -1211828
7248 -1211828 -1205848 -1219577 -1216709 -1214625 -1215391 -1215482 -1220216 -1217584 -1212462 -1218101 -1229781 -1231185 -1233816 -1235850
7234 -1235850 -1230247 -1234453 -1223010 -1208654 -1213975 -1224459 -1214687 -1228670 -1234497 -1232516 -1230011 -1212631 -1205266
7221 -1205266 -1214442 -1218286 -1205426 -1201844 -1205434 -1202786 -1196913 -1201880 -1206687 -1207104 -1204065 -1198624 -1194289 -1204570
$$ packed form
7318a217616j6758p865N004k709O125J7561j1824l494N335M560k707P686R467
7305a207235n895M334O821j357o830j8085o332O39J0518Q577J607j1361J679k68
7291a223188q350M412M818o212p166J861J0417J0260q388L539M170j2240l18O720
7277a219665m106p595o0k35k898o929L780J8485R129k488K627M114L637L536m028
7262a202696J158o374q613J3049K595j201J10j4373m266M928k193o012p798J9858
7248a211828N980j3729K868K084p66r1m734K632N122n639j1680j404k631k034
7234a235850N603m206J1443J4356n321j0484R772j3983n827J981K505J7380P365
7221a205266r176l844J2860L582l590K648N873m967m807m17L039N441M335j0281
$$ plain form
7207 -1204570 -1196510 -1189073 -1189698 -1202300 -1216395 -1223744 -1202211 -1188345 -1193549 -1202245 -1190195 -1191157 -1194770
7194 -1194770 -1209193 -1200692 -1191180 -1189946 -1198859 -1203139 -1186218 -1181270 -1187980 -1190968 -1193003 -1185991 -1184384 -1179221
7180 -1179221 -1187185 -1199937 -1211455 -1201999 -1183471 -1186178 -1198526 -1201427 -1197764 -1200790 -1191328 -1180456 -1178627
7167 -1178627 -1185222 -1185084 -1189115 -1196146 -1192796 -1193557 -1197019 -1181796 -1167201 -1174102 -1192987 -1183912 -1164683 -1162365
7153 -1162365 -1152690 -1147168 -1159250 -1167623 -1156217 -1158313 -1171446 -1175398 -1183879 -1183973 -1175727 -1172860 -1176845 -1182291
7139 -1182291 -1197411 -1204519 -1188749 -1180747 -1179692 -1180190 -1163931 -1168968 -1179038 -1178574 -1168917 -1165056 -1165225 -1163628
7125 -1163628 -1165379 -1163054 -1165954 -1167451 -1159071 -1160266 -1183312 -1180347 -1172366 -1165441 -1167711 -1178022 -1188502
7112 -1188502 -1175857 -1177277 -1164329 -1162707 -1176229 -1177835 -1177467 -1171835 -1177397 -1178656 -1171750 -1158341 -1153261
$$ packed form
7207a204570Q060P437o25j2602j4095p349K1533J3866n204q696J2050r62l613
7194a194770j4423Q501R512J234q913m280J6921M948o710k988k035P012J607N163
7180a179221p964j2752j1518R456J8528k707j2348k901L663l026R462J0872J829
7167a178627o595J38m031p031L350p61l462J5223J4595o901j8885R075J9229K318
7153a162365R675N522j2082q373J1406k096j3133l952q481r4Q246K867l985n446
7139a182291j5120p108J5770Q002J055m98J6259n037j0070M64R657L861j69J597
7125a163628j751K325k900j497Q380j195k3046K965P981O925k270j0311j0480
7112a188502J2645j420J2948J622j3522j606L68N632n562j259O906J3409N080
$$ plain form
7099 -1153261 -1154575 -1162183 -1168782 -1166689 -1153170 -1154920 -1156052 -1155670 -1159722 -1170377 -1168686 -1172850 -1187390 -1185510
7085 -1185510 -1189323 -1170586 -1166548 -1172923 -1168725 -1169616 -1170995 -1168363 -1166057 -1165783 -1148398 -1140526 -1144739 -1153950
7071 -1153950 -1153360 -1148236 -1145469 -1137374 -1138099 -1146899 -1150215 -1148607 -1147337 -1155129 -1159938 -1160002 -1163378 -1167798 -1152006
7056 -1152006 -1133990 -1145034 -1160177 -1168590 -1165155 -1159395 -1150972 -1147812 -1149029 -1134593 -1124743 -1143043 -1153824
7043 -1153824 -1159165 -1146246 -1146642 -1157740 -1151767 -1138330 -1136864 -1134936 -1134366 -1123696 -1105196 -1099682 -1113137
7030 -1113137 -1125252 -1142687 -1154148 -1153800 -1152629 -1154122 -1153389 -1148998 -1144688 -1152929 -1152906 -1153341 -1148697 -1137449
7016 -1137449 -1139187 -1146038 -1150257 -1132976 -1127449 -1127500 -1131466 -1134500 -1132131 -1118472 -1113858 -1116493 -1137770 -1143196
7002 -1143196 -1127368 -1121353 -1111075 -1121853 -1135094 -1143813 -1142632 -1134031 -1121522 -1128297 -1121768 -1112001 -1116664
$$ packed form
7099a153261j314p608o599K093J3519j750j132L82m052j0655J691m164j4540J880
7085a185510l813J8737M038o375M198q91j379K632K306K74J7385P872m213r211
7071a153950N90N124K767Q095p25q800l316J608J270p792m809o4l376m420J5792
7056a152006J8016j1044j5143q413L435N760Q423L160j217J4436R850j8300j0781
7043a153824n341J2919l96j1098N973J3437J466J928N70J0670J8500N514j3455
7030a113137j2115j7435j1461L48J171j493P33M391M310q241K3m35M644J1248
7016a137449j738o851m219J7281N527n1l966l034K369J3659M614k635k1277n426
7002a143196J5828O015J0278j0778j3241q719J181Q601J2509o775O529R767m663
$$ plain form
6989 -1116664 -1135575 -1134182 -1135847 -1130342 -1127733 -1135093 -1140365 -1132822 -1140126 -1136992 -1139456 -1148649 -1149015 -1150933
6975 -1150933 -1139833 -1127131 -1130667 -1133007 -1121547 -1123454 -1133837 -1137670 -1143810 -1148055 -1141941 -1130680 -1127928
6962 -1127928 -1140069 -1140083 -1144520 -1136261 -1117355 -1107220 -1128265 -1146058 -1148865 -1142396 -1122699 -1104284 -1113360
6949 -1113360 -1110458 -1108220 -1107563 -1109433 -1110866 -1099948 -1104901 -1109779 -1104349 -1108769 -1117392 -1110114 -1108866 -1097862
6935 -1097862 -1110372 -1130318 -1126130 -1107452 -1105835 -1111521 -1111983 -1115117 -1105371 -1099916 -1101238 -1101245 -1099665 -1125598
6921 -1125598 -1136631 -1120083 -1107531 -1098528 -1097791 -1102303 -1097488 -1099736 -1100614 -1100330 -1099940 -1089510 -1099793 -1117413
6907 -1117413 -1120145 -1105631 -1089104 -1082131 -1088254 -1090992 -1101023 -1109916 -1108986 -1103156 -1103243 -1102998 -1105879 -1104546
6893 -1104546 -1109160 -1100585 -1112443 -1123194 -1121533 -1119112 -1106809 -1106987 -1110951 -1117192 -1109777 -1105461 -1105672 -1116830
$$ packed form
6989a116664j8911J393j665N505K609p360n272P543p304L134k464r193l66j918
6975a150933J1100J2702l536k340J1460j907j0383l833o140m245O114J1261K752
6962a127928j2141j4m437Q259J8906J0135k1045j7793k807O469J9697J8415r076
6949a113360K902K238O57j870j433J0918m953m878N430m420q623P278J248J1004
6935a097862j2510j9946M188J8678J617n686m62l134R746N455j322pJ580k5933
6921a125598j1033J6548J2552R003P37m512M815k248q78K84L90J0430j0283j7620
6907a117413k732J4514J6527O973o123k738j0031q893R30N830q7K45k881J333
6893a104546m614Q575j1858j0751J661K421J2303j78l964o241P415M316k11j1158
$$ plain form
6879 -1116830 -1114345 -1103182 -1107143 -1115027 -1098923 -1083061 -1084200 -1078931 -1073805 -1069420 -1073484 -1092773 -1105821
6866 -1105821 -1104361 -1108932 -1109105 -1114604 -1117551 -1129381 -1131816 -1119540 -1104680 -1100673 -1093376 -1096721 -1093898 -1101138
6852 -1101138 -1111076 -1118523 -1122528 -1129710 -1139578 -1130005 -1105636 -1091555 -1083657 -1077406 -1086992 -1089447 -1085928 -1080789
6838 -1080789 -1081037 -1089951 -1094206 -1089386 -1085804 -1100508 -1104727 -1095280 -1078556 -1086430 -1078809 -1063244 -1064923 -1070122
6824 -1070122 -1069892 -1081230 -1100364 -1101146 -1089290 -1092660 -1085888 -1088409 -1070585 -1056647 -1062515 -1081377 -1071460
6811 -1071460 -1063090 -1067374 -1066110 -1070958 -1077979 -1083852 -1087487 -1078261 -1067864 -1072831 -1073438 -1084593 -1087631 -1077760
6797 -1077760 -1086360 -1089563 -1089604 -1088788 -1091667 -1080733 -1063055 -1062430 -1063388 -1056935 -1062743 -1069269 -1062420 -1069864 -1079818
6782 -1079818 -1080156 -1074304 -1063267 -1057855 -1065866 -1079961 -1097927 -1092560 -1091882 -1078488 -1056478 -1066182 -1078454
$$ packed form
6879a116830K485J1163l961p884J6104J5862j139N269N126M385m064j9289j3048
6866a105821J460m571j73n499k947j1830k435J2276J4860M007P297l345K823p240
6852a101138r938p447m005p182r868R573K4369J4081P898O251r586k455L519N139
6838a080789k48q914m255M820L582j4704m219R447J6724p874P621J5565j679n199
6824a070122K30j1338j9134p82J1856l370O772k521J7824J3938n868j8862R917
6811a071460Q370m284J264m848p021n873l635R226J0397m967o07j1155l038R871
6797a077760q600l203m1Q16k879J0934J7678O25r58O453n808o526O849p444r954
6782a079818l38N852J1037N412q011j4095j7966N367O78J3394K2010r704j2272
$$ plain form
6769 -1078454 -1075156 -1073626 -1077992 -1076914 -1063140 -1071001 -1077407 -1068482 -1065660 -1067745 -1065887 -1058126 -1051940 -1048054
6755 -1048054 -1053817 -1072302 -1064009 -1068229 -1081589 -1092131 -1081806 -1073983 -1064517 -1062934 -1058729 -1056685 -1055890
6742 -1055890 -1063325 -1075714 -1074243 -1070426 -1064442 -1060069 -1045868 -1042847 -1057900 -1044485 -1046407 -1061764 -1068461
6729 -1068461 -1056800 -1053927 -1065586 -1051023 -1052496 -1061984 -1062152 -1060498 -1066815 -1078102 -1071163 -1056339 -1059054
6716 -1059054 -1058657 -1065623 -1068578 -1071468 -1071712 -1077853 -1080513 -1080251 -1077244 -1076862 -1074331 -1075879 -1078412 -1072864 -1066972
6701 -1066972 -1072617 -1072877 -1075414 -1078918 -1073320 -1060691 -1056410 -1066179 -1060654 -1063062 -1058611 -1062222 -1071338 -1082450
6687 -1082450 -1087918 -1074478 -1062359 -1050376 -1053621 -1059148 -1060758 -1044109 -1049384 -1057905 -1061105 -1056322 -1049555
6674 -1049555 -1037898 -1035326 -1040982 -1057036 -1064670 -1050893 -1040422 -1046814 -1067839 -1082155 -1076710 -1054185
$$ packed form
6769a078454L298J530m366J078J3774p861o406Q925K822k085J858P761O186L886
6755a048054n763j8485Q293m220j3360j0542J0325P823R466J583M205K044P95
6742a055890p435j2389J471L817N984M373J4201L021j5053J3415j922j5357o697
6729a068461J1661K873j1659J4563j473r488j68J654o317j1287O939J4824k715
6716a059054L97o966k955k890k44o141k660K62L007L82K531j548k533N548N892
6701a066972n645k60k537l504N598J2629M281r769N525k408M451l611r116j1112
6687a082450n468J3440J2119J1983l245n527j610J6649n275q521l200M783O767
6674a049555J1657K572n656j6054p634J3777J0471o392k1025j4316N445K2525
$$ plain form
6662 -1054185 -1054096 -1065039 -1054168 -1043510 -1038479 -1039648 -1041322 -1055769 -1061131 -1055826 -1039637 -1032933 -1047715
6649 -1047715 -1044826 -1045183 -1041392 -1051685 -1052128 -1057059 -1063018 -1060877 -1059217 -1056535 -1063206 -1067169 -1067733 -1068263 -1058677
6634 -1058677 -1048692 -1050593 -1047035 -1047144 -1049041 -1048744 -1041010 -1020814 -1011201 -1013338 -1012914 -1020780 -1026882 -1018646 -1014940
6619 -1014940 -1019190 -1023685 -1039815 -1047721 -1040713 -1036923 -1046874 -1062190 -1049212 -1034864 -1029296 -1034662 -1045633
6606 -1045633 -1058319 -1058711 -1049950 -1038297 -1041406 -1062826 -1071675 -1056223 -1041515 -1039317 -1035207 -1042306 -1032721
6593 -1032721 -1034155 -1044708 -1037743 -1031973 -1029199 -1034924 -1038676 -1037971 -1045695 -1028746 -1023580 -1033647 -1052651
6580 -1052651 -1042056 -1034328 -1028182 -1023618 -1021234 -1028022 -1037693 -1038381 -1044863 -1048519 -1052620 -1043188 -1047538 -1046782
6566 -1046782 -1034249 -1031451 -1031466 -1028798 -1031520 -1028694 -1029465 -1025208 -1010849 -1014614 -1021896 -1034405 -1029648 -1026123
$$ packed form
6662a054185Q9j0943J0871J0658N031j169j674j4447n362N305J6189O704j4782
6649a047715K889l57L791j0293m43m931n959K141J660K682o671l963n64n30R586
6634a058677R985j901L558j09j897K97P734K0196R613k137M24p866o102Q236L706
6619a014940m250m495j6130p906P008L790r951j5316J2978J4348N568n366j0971
6606a045633j2686l92Q761J1653l109k1420q849J5452J4708K198M110p099R585
6593a032721j434j0553O965N770K774n725l752P05p724J6949N166j0067j9004
6580a052651J0595P728O146M564K384o788r671o88o482l656m101R432m350P56
6566a046782J2533K798j5K668k722K826p71M257J4359l765p282j2509M757L525
$$ plain form
6552 -1026123 -1025129 -1020136 -1016395 -1012817 -1020201 -1027941 -1026330 -1018707 -1003909 -1003136 -1012216 -1018636 -1013194 -1008930
6538 -1008930 -1017685 -1017093 -1015472 -1005357 -1006967 -991947 -989961 -1005422 -1026890 -1029899 -1026026 -1020289 -1012587
6525 -1012587 -1020452 -1020614 -1024774 -1025707 -1015374 -1003620 -1008346 -1024082 -1019252 -1003759 -1010017 -1023542 -1022215
6512 -1022215 -1013624 -1018107 -1013801 -1017218 -1023065 -1029677 -1023682 -1016398 -1020387 -1030937 -1018914 -1005681 -1006759
6499 -1006759 -1016624 -1013151 -1018975 -1019944 -1010557 -998096 -999164 -1010248 -1003734 -1001085 -992483 -981333 -986464 -994297
6485 -994297 -1012758 -1012387 -997175 -1000838 -1007531 -1008013 -1013221 -1037586 -1037582 -1014428 -1002583 -996535 -1003706 -1011573
6471 -1011573 -1023647 -1016678 -1021714 -1025815 -1025214 -1008957 -989599 -991029 -997193 -997917 -1006482 -1011195 -1017093 -1012035
6457 -1012035 -1011651 -1017280 -1016208 -996592 -997173 -996294 -992968 -990558 -990826 -993203 -1003141 -993726 -989537 -995986 -1001017
$$ packed form
6552a026123R94M993L741L578p384p740J611P623J4798P73r080o420N442M264
6538a008930q755N92J621J0115j610J5020J986j5461k1468l009L873N737P702
6525a012587p865j62m160r33J0333J1754m726j5736M830J5493o258j3525J327
6512a022215Q591m483M306l417n847o612N995P284l989j0550J2023J3233j078
6499a006759r865L473n824r69R387J2461j068j1084O514K649Q602J1150n131p833
6485i94297j8461L71J5212l663o693m82n208k4365MK3154J1845O048p171p867
6471a011573j2074O969n036m101O01J6257J9358j430o164p24q565m713n898N058
6457a012035L84n629J072J9616n81Q79L326K410k68k377r938R415M189o449n031
$$ plain form
6442 -1001017 -1011456 -1007144 -994494 -995206 -996048 -981661 -969008 -976830 -971702 -974873 -997507 -990537 -983532
6429 -983532 -983896 -976442 -970564 -986901 -1007449 -998391 -980847 -969845 -972862 -994577 -1002329 -998588 -993271
6416 -993271 -994623 -1000542 -996389 -1000055 -1009533 -1015218 -1023410 -1021035 -1011029 -1004293 -986483 -995850 -1005944 -1001588
6402 -1001588 -990294 -984720 -995614 -1003667 -997530 -990042 -1002613 -1006448 -997040 -985961 -990597 -989228 -976119
6389 -976119 -967217 -963652 -964990 -977665 -984228 -976545 -973649 -971483 -979571 -990363 -1003910 -997246 -989260 -985668
6375 -985668 -978851 -982695 -984287 -977440 -970459 -980194 -983403 -986608 -981000 -982063 -990739 -1000371 -1006886 -984603
6361 -984603 -967262 -971060 -970719 -976606 -971192 -965825 -982256 -984686 -975012 -977698 -984230 -980116 -974770 -978350
6347 -978350 -980773 -975908 -977951 -996862 -1002207 -991753 -981189 -976713 -989264 -986093 -963300 -960068 -961188
$$ packed form
6442a001017j0439M312J2650p12q42J4387J2653p822N128l171k2634O970P005
6429i83532l64P454N878j6337k0548R058J7544J1002l017k1715p752L741N317
6416i93271j352n919M153l666r478n685q192K375J0006O736J7810r367j0094M356
6402a001588J1294N574j0894q053O137P488j2571l835R408J1079m636J369J3109
6389i76119Q902L565j338j2675o563P683K896K166q088j0792j3547O664P986L592
6375i85668O817l844j592O847O981r735l209l205N608j063q676r632o515K2283
6361i84603J7341l798L41n887N414N367j6431k430R674k686o532M114N346l580
6347i78350k423M865k043j8911n345J0454J0564M476j2551L171K2793L232j120
$$ plain form
6334 -961188 -975053 -983759 -980348 -975426 -962509 -962233 -963367 -970466 -973150 -977634 -978079 -974333 -980217 -972570
6320 -972570 -974994 -988854 -977397 -969338 -963400 -961018 -958246 -962010 -956050 -950747 -967315 -979958 -982193
6307 -982193 -987408 -978410 -966471 -962207 -956193 -953208 -960130 -971685 -959196 -955142 -973156 -975288 -972218
6294 -972218 -972365 -973450 -978625 -976418 -970817 -971281 -967165 -970489 -976249 -979982 -972296 -964064 -964904 -960323 -977455
6279 -977455 -980946 -970973 -963150 -958324 -936667 -933674 -954121 -969480 -973800 -972198 -949190 -955571 -962131
6266 -962131 -966203 -977196 -971111 -963909 -953458 -951094 -963464 -969487 -959632 -951719 -949071 -954880 -960931 -972169
6252 -972169 -967459 -967156 -960789 -955977 -949730 -948659 -936627 -943384 -949971 -951357 -944059 -943683 -957813 -964472
6238 -964472 -964004 -951459 -948088 -963367 -961471 -949268 -950231 -945799 -941757 -945872 -939759 -936738 -939399 -949948
$$ packed form
6334i61188j3865q706L411M922J2917K76j134p099k684m484m45L746n884P647
6320i72570k424j3860J1457Q059N938K382K772l764N960N303j6568j2643k235
6307i82193n215Q998J1939M264O014K985o922j1555J2489M054j8014k132L070
6294i72218j47j085n175K207N601m64M116l324n760l733P686Q232q40M581j7132
6279i77455l491R973P823M826K1657K993k0447j5359m320J602K3008o381o560
6266i62131m072j0993O085P202J0451K364j2370o023R855P913K648n809o051j1238
6252i72169M710L03O367M812O247J071J2032o757o587j386P298L76j4130o659
6238i64472M68J2545L371j5279J896J2203r63M432M042m115O113L021k661j0549
$$ plain form
6224 -949948 -953229 -952103 -954451 -945449 -943049 -946972 -953845 -949758 -944752 -964461 -971841 -975051 -970542 -967736
6210 -967736 -963663 -946180 -945565 -950903 -950079 -943970 -958695 -962737 -975292 -969727 -961937 -969297 -971638 -957447
6196 -957447 -943368 -938997 -956382 -975228 -969696 -967058 -961548 -960940 -964912 -968214 -966005 -950503 -940676 -938954
6182 -938954 -927383 -926066 -926821 -931156 -940334 -955502 -952646 -940985 -937422 -935309 -941733 -945333 -952224 -956693
6168 -956693 -951016 -945512 -942154 -942989 -941754 -941143 -937714 -951293 -960211 -966335 -960560 -957044 -950425 -938647
6154 -938647 -948343 -953725 -945415 -933983 -929515 -941135 -945330 -942645 -939556 -931455 -935579 -938398 -946446 -954620
6140 -954620 -953296 -938081 -943119 -935052 -937177 -934356 -927034 -931098 -935481 -952947 -951917 -948950 -946164 -942208
6126 -942208 -945774 -957298 -962607 -956403 -946529 -944199 -948056 -951866 -944646 -920921 -925181 -932779 -944729 -929337
$$ packed form
6224i49948l281J126k348R002K400l923o873M087N006j9709p380l210M509K806
6210i67736M073J7483O15n338Q24O109j4725m042j2555N565P790p360k341J4191
6196i57447J4079M371j7385j8846N532K638N510O08l972l302K209J5502R827J722
6182i38954J1571J317p55m335r178j5168K856J1661L563K113o424l600o891m469
6168i56693N677N504L358q35J235O11L429j3579q918o124N775L516O619J1778
6154i38647r696n382Q310J1432M468j1620m195K685L089Q101m124k819q048q174
6140i54620J324J5215n038Q067k125K821P322m064m383j7466J030K967K786L956
6126i42208l566j1524n309O204R874K330l857l810P220K3725m260p598j1950J5392
$$ plain form
6112 -929337 -921649 -932449 -928586 -930403 -943810 -945893 -942414 -939692 -930131 -924661 -918422 -915745 -924314 -927596
6098 -927596 -927013 -930128 -925667 -926252 -929733 -936582 -929366 -909714 -907075 -912768 -920644 -927261 -942873 -953753
6084 -953753 -950896 -933931 -920655 -916343 -920650 -923742 -916066 -923450 -938979 -937160 -933667 -925619 -925793 -914301
6070 -914301 -911414 -912201 -911507 -929617 -934732 -929084 -917604 -908868 -907369 -918304 -939701 -950341 -940130
6057 -940130 -917102 -907927 -907008 -908053 -898229 -899926 -895831 -899010 -905094 -905833 -918457 -926697 -916522 -922597
6043 -922597 -929999 -928447 -918054 -911733 -911869 -913123 -910364 -902128 -910713 -914653 -922302 -917620 -912871 -917247
6029 -917247 -913087 -902658 -898330 -904596 -914196 -918241 -919775 -914888 -913002 -909105 -911759 -924549 -925347 -917443
6015 -917443 -904453 -899647 -899048 -905992 -919026 -922288 -921889 -914016 -913619 -907142 -895083 -895454 -903513 -905904 -918203
$$ packed form
6112i29337P688j0800L863j817j3407k083L479K722R561N470O239K677q569l282
6098i27596N83l115M461n85l481o849P216J9652K639n693p876o617j5612j0880
6084i53753K857J6965J3276M312m307l092P676p384j5529J819L493Q048j74J1492
6070i14301K887p87O94j8110n115N648J1480Q736J499j0935k1397j0640J0211
6057i40130K3028R175R19j045R824j697M095l179o084p39j2624q240J0175o075
6043i22597p402J552J0393O321j36j254K759Q236q585l940p649M682M749m376
6029i17247M160J0429M328o266r600m045j534M887J886L897k654j2790p98P904
6015i17443J2990M806N99o944j3034l262L99P873L97O477J2059l71q059k391j2299
$$ plain form
6000 -918203 -918221 -912698 -914042 -920518 -916081 -915646 -913011 -917852 -926185 -926915 -918007 -919837 -924200 -919636 -923656
5985 -923656 -918283 -909424 -903497 -912268 -907191 -911303 -918501 -908355 -900347 -912395 -912869 -916848 -917536 -915086
5971 -915086 -912359 -901127 -897563 -906767 -915987 -901200 -894805 -893338 -910282 -919089 -920481 -920486 -922120 -920525
5957 -920525 -916861 -914736 -926887 -918744 -898838 -903209 -917614 -921731 -912000 -905471 -903671 -893660 -904490
5944 -904490 -906192 -891814 -881220 -879479 -887111 -880592 -887081 -887922 -886407 -889687 -889222 -892775 -897399 -903925
5930 -903925 -902352 -883508 -883983 -888126 -873054 -870137 -879726 -880019 -887474 -896367 -886552 -883959 -897604 -907551
5916 -907551 -917325 -918777 -905075 -912914 -906311 -899791 -908245 -905062 -902924 -908492 -910728 -913958 -908334 -899275
5902 -899275 -897656 -905465 -917348 -924905 -918425 -916157 -911356 -908632 -907820 -912573 -908885 -899865 -896259 -896236 -897866
$$ packed form
6000i18203j8N523j344o476M437M35K635m841q333p30Q908j830m363M564m020
5985i23656N373Q859N927q771N077m112p198J0146Q008j2048m74l979o88K450
5971i15086K727J1232L564r204r220J4787O395J467j6944q807j392nj634J595
5957i20525L664K125j2151Q143J9906m371j4405m117R731O529J800J0011j0830
5944i04490j702J4378J0594J741p632O519o489q41J515l280M65l553m624o526
5930i03925J573J8844m75m143J5072K917r589k93p455q893R815K593j3645r947
5916i07551r774j452J3702p839O603O520q454L183K138n568k236l230N624R059
5902h99275J619p809j1883p557O480K268M801K724Q12m753L688R020L606K3j630
$$ plain form
5887 -897866 -890382 -888962 -893549 -879715 -882189 -888482 -886062 -892998 -893862 -900744 -896301 -892727 -893531 -906926
5873 -906926 -907473 -907086 -891299 -871185 -862561 -871243 -878110 -882394 -890086 -883254 -882068 -882603 -877041 -892846
5859 -892846 -909014 -901243 -895783 -904714 -904267 -900917 -894762 -878607 -866986 -872065 -889054 -893831 -879070
5846 -879070 -880939 -873543 -881398 -882451 -873678 -877416 -881063 -887289 -878913 -894562 -899883 -899747 -901737 -888332
5832 -888332 -870760 -870361 -881531 -889130 -881207 -872776 -886829 -897162 -905446 -905812 -904236 -905611 -905714 -889785
5818 -889785 -884076 -881772 -887993 -885435 -889404 -878465 -868360 -882982 -888011 -887492 -877620 -865993 -870590 -876828
5804 -876828 -888024 -891348 -897113 -901392 -881346 -873102 -877654 -875175 -874774 -870659 -862302 -862421 -868038 -867469 -883012
5789 -883012 -892453 -887538 -873955 -871671 -872179 -877046 -866512 -863749 -864477 -871643 -890851 -881544 -885186 -892221
$$ packed form
5887h97866P484J420m587J3834k474o293K420o936q64o882M443L574q04j3395
5873i06926n47L87J5787K0114Q624q682o867m284p692O832J186n35N562j5805
5859h92846j6168P771N460q931M47L350O155J6155J1621n079j6989m777J4761
5846h79070j869P396p855j053Q773l738l647o226Q376j5649n321J36j990J3405
5832h88332J7572L99j1170p599P923Q431j4053j0333q284l66J576j375j03J5929
5818h89785N709K304o221K558l969J0939J0105j4622n029N19R872J1627m597o238
5804h76828j1196l324n765m279K0046Q244m552K479M01M115Q357j19n617N69j5543
5789h83012r441M915J3583K284n08m867J0534K763p28p166j9208R307l642p035
$$ plain form
5775 -892221 -883438 -880065 -877521 -884195 -890385 -891079 -877734 -878188 -882873 -887292 -897062 -910690 -903278 -885660
5761 -885660 -873664 -877390 -868044 -867611 -868391 -868900 -861427 -869538 -874599 -867085 -871136 -877962 -875536 -869566 -857616
5746 -857616 -855551 -861806 -869330 -864217 -861933 -851527 -848305 -852502 -861537 -857079 -850086 -847939 -851288 -860754
5732 -860754 -868503 -870035 -868536 -872272 -861913 -853598 -860672 -869167 -869248 -869162 -858933 -857071 -860695 -877638 -881677
5717 -881677 -880471 -875119 -870213 -866882 -869065 -874600 -864655 -855935 -864975 -877384 -872470 -869808 -860182 -854583
5703 -854583 -853783 -863387 -866587 -859990 -853048 -851316 -862016 -869243 -860176 -865982 -876518 -878026 -858375 -864020
5689 -864020 -882263 -886995 -891748 -897314 -885421 -873086 -861713 -851177 -853719 -875901 -895657 -890529 -870783
5676 -870783 -848526 -845458 -847244 -844024 -840664 -844312 -848298 -848817 -839047 -842523 -834746 -837033 -845163 -838844
$$ packed form
5775h92221Q783L373K544o674o190o94J3345m54m685m419r770j3628P412J7618
5761h85660J1996l726R346M33p80n09P473q111n061P514m051o826K426N970J1950
5746h57616K065o255p524N113K284J0406L222m197r035M458O993K147l349r466
5732h60754p749j532J499l736J0359Q315p074q495q1Q6J0229J862l624j6943m039
5717h81677J206N352M906L331k183n535R945Q720r040j2409M914K662R626N599
5703h54583Q00r604l200O597O942J732j0700p227R067n806j0536j508J9651n645
5689h64020j8243m732m753n566J1893J2335J1373J0536k542k2182j9756N128J9746
5676h70783K2257L068j786L220L360l648l986n19R770l476P777k287q130O319
$$ plain form
5662 -838844 -834025 -847452 -867817 -876977 -868294 -855129 -858508 -856645 -855978 -852689 -851948 -849185 -865103 -872869
5648 -872869 -861394 -847210 -854457 -856464 -848460 -843103 -842996 -844828 -859692 -867736 -880013 -881460 -881990 -867150
5634 -867150 -847518 -841845 -837709 -840845 -841422 -857967 -857492 -852653 -855945 -853585 -856271 -859061 -861551 -848541
5620 -848541 -844171 -838586 -839280 -839724 -848091 -856478 -852781 -837818 -830338 -827861 -835935 -823158 -828386 -843128
5606 -843128 -848698 -854384 -853389 -853290 -843691 -842480 -842806 -838945 -839642 -841774 -843381 -834101 -830644 -824446 -827298 -839104
5590 -839104 -850059 -849740 -848025 -842868 -844964 -849200 -848496 -851819 -872537 -870069 -862846 -871480 -859153 -848069
5576 -848069 -848504 -844386 -849093 -849419 -848753 -846179 -844169 -841311 -838398 -838139 -833344 -845411 -863389 -855854 -841412
5561 -841412 -839164 -843788 -847467 -842996 -839806 -845954 -843991 -836794 -823575 -822644 -847559 -862525 -856646 -851083
$$ packed form
5662h38844M819j3427k0365r160Q683J3165l379J863O67L289P41K763j5918p766
5648h72869J1475J4184p247k007Q004N357J07j832j4864q044j2277j447n30J4840
5634h67150J9632N673M136l136n77j6545M75M839l292K360k686k790k490J3010
5620h48541M370N585o94m44q367q387L697J4963P480K477q074J2777n228j4742
5606h43128n570n686R95R9R599J211l26L861o97k132j607R280L457O198k852j1806
5590h39104j0955L19J715N157k096m236P04l323k0718K468P223q634J2327J1084
5576h48069m35M118m707l26O66K574K010K858K913K59M795j2067j7978P535J4442
5561h41412K248m624l679M471L190o148J963P197J3219R31k4915j4966N879N563
$$ plain form
5547 -851083 -856039 -850508 -849847 -850684 -843239 -847630 -841092 -844943 -840335 -833099 -829080 -832348 -833242 -828758 -838343
5532 -838343 -844925 -843676 -845029 -844542 -841359 -849439 -855848 -853244 -857456 -847860 -836405 -821565 -816859 -832114
5518 -832114 -833188 -829363 -820819 -810026 -812301 -814612 -818807 -823428 -831757 -830410 -837732 -844882 -839034 -837933
5504 -837933 -841375 -845424 -851784 -854571 -859715 -857060 -847425 -846157 -848911 -847435 -843053 -846352 -847891 -839660
5490 -839660 -833791 -841141 -848848 -839277 -826169 -824755 -838964 -850567 -842335 -830290 -822348 -830318 -837904
5477 -837904 -834397 -825611 -820689 -828263 -835093 -830237 -823348 -829339 -840835 -846075 -840070 -830710 -824736 -821962
5463 -821962 -825444 -835368 -840739 -843301 -845910 -842186 -834088 -832534 -828579 -816828 -819854 -821012 -822517 -826430
5449 -826430 -833516 -829647 -816236 -811082 -826462 -841316 -846879 -839948 -842543 -834190 -829502 -822004 -829668 -827620
$$ packed form
5547h51083m956N531O61q37P445m391O538l851M608P236M019l268q94M484r585
5532h38343o582J249j353M87L183q080o409K604m212R596J1455J4840M706j5255
5518h32114j074L825Q544J0793k275k311m195m621q329J347p322p150N848J101
5504h37933l442m049o360k787n144K655R635J268k754J476M382l299j539Q231
5490h39660N869p350p707R571J3108J414j4209j1603Q232J2045P942p970p586
5477h37904L507Q786M922p574o830M856O889n991j1496n240O005R360N974K774
5463h21962l482r924n371k562k609L724Q098J554L955J1751l026j158j505l913
5449h26430p086L869J3411N154j5380j4854n563O931k595Q353M688P498p664K048
$$ plain form
5435 -827620 -818021 -811576 -803424 -810932 -817171 -823027 -823933 -822116 -815047 -811082 -818032 -815607 -819134 -829722
5421 -829722 -826620 -834869 -830339 -819827 -812687 -816146 -824728 -838348 -846473 -846846 -841851 -829896 -824425 -824844
5407 -824844 -825248 -822857 -822476 -838369 -837293 -821387 -819094 -819021 -821493 -834059 -834095 -824596 -810893 -798998 -798231
5392 -798231 -799321 -813002 -821727 -824858 -824276 -819221 -806003 -813931 -824263 -821228 -811131 -816307 -824728 -830726
5378 -830726 -819144 -810528 -808517 -807375 -796969 -802501 -817836 -809956 -807703 -823264 -820621 -810682 -803874
5365 -803874 -805661 -801910 -796894 -811399 -807917 -812446 -818355 -814961 -827624 -821511 -807269 -808016 -810717 -809194
5351 -809194 -810655 -813047 -809337 -804145 -807058 -808824 -813918 -802021 -789990 -784840 -789403 -804354 -804349 -794305
5337 -794305 -800607 -804850 -807426 -807630 -799494 -797221 -798975 -809265 -816768 -819973 -807328 -790421 -788547 -792346
$$ packed form
5435h27620R599O445Q152p508o239n856r06J817P069L965o950K425l527j0588
5421h29722L102q249M530J0512P140l459q582j3620q125l73M995J1955N471m19
5407h24844m04K391L81j5893J076J5906K293P3k472j2566l6R499J3703J1895P67
5392g98231j090j3681q725l131N82N055J3218p928j0332L035J0097n176q421n998
5378h30726J1582Q616K011J142J0406n532j5335P880K253j5561K643R939O808
5365h03874j787L751N016j4505L482m529n909L394j2663O113J4242p47k701J523
5351h09194j461k392L710N192k913j766n094J1897J2031N150m563j4951NJ0044
5337g94305o302m243k576k04Q136K273j754j0290p503l205J2645J6907J874l799
$$ plain form
5323 -792346 -806871 -832305 -835793 -823877 -819947 -814625 -819566 -812818 -802281 -797462 -808110 -807180 -809417
5310 -809417 -812195 -819875 -812654 -810772 -831930 -841814 -837279 -828154 -819294 -814464 -819418 -827309 -827749 -832798
5296 -832798 -830234 -813141 -803720 -797520 -806391 -810120 -797626 -787221 -790272 -799079 -816755 -824421 -819076
5283 -819076 -802126 -806396 -807077 -807983 -799969 -801712 -805856 -813456 -820463 -816923 -819447 -815444 -807400 -796439
5269 -796439 -791968 -793968 -797490 -797792 -809258 -814529 -812165 -810054 -807249 -804816 -804683 -812624 -815628 -812543 -799189
5254 -799189 -797137 -781204 -791811 -797852 -799669 -796530 -798546 -809352 -824485 -820292 -806899 -804881 -816838
5241 -816838 -818554 -814667 -812133 -805852 -800760 -810954 -802989 -801925 -794542 -788738 -792592 -808362 -816325 -800837
5227 -800837 -794174 -775766 -777333 -783559 -777874 -780560 -792655 -800045 -797246 -791940 -784857 -781230 -794017 -795218
$$ packed form
5323g92346j4525k5434l488J1916L930N322m941O748J0537M819j0648R30k237
5310h09417k778p680P221J882k1158r884M535R125Q860M830m954p891m40n049
5296h32798K564J7093R421O200q871l729J2494J0405l051q807j7676p666N345
5283h19076J6950m270o81r06Q014j743m144p600p007L540k524M003Q044J0961
5269g96439M471k000l522l02j1466n271K364K111K805K433J33p941l004L085J3354
5254g99189K052J5933j0607o041j817L139k016j0806j5133M193J3393K018j1957
5241h16838j716L887K534O281N092j0194P965J064P383N804l854j5770p963J5488
5227h00837O663J8408j567o226N685k686j2095p390K799N306P083L627j2787j201
$$ plain form
5213 -795218 -794213 -781054 -787905 -792141 -797651 -800837 -803121 -802308 -803654 -807660 -809216 -806849 -810872 -811330 -805071
5198 -805071 -798264 -794768 -793019 -792124 -789946 -786511 -781123 -784672 -780369 -789678 -802111 -791562 -783257 -772374
5184 -772374 -772301 -778404 -774121 -776066 -789033 -794311 -791572 -789980 -787148 -798604 -794845 -797405 -807117 -799669
5170 -799669 -779878 -787872 -791188 -780406 -788300 -789930 -781887 -788446 -804961 -805777 -806862 -797018 -796185 -793397
5156 -793397 -799269 -798985 -805185 -814522 -803143 -801701 -803841 -789999 -793304 -793354 -792058 -798734 -801153 -799450 -806916
5141 -806916 -798984 -790366 -783899 -788593 -787818 -789642 -786025 -788993 -797461 -783140 -773832 -775971 -789130 -804364
5127 -804364 -804628 -801758 -791207 -776201 -762982 -771050 -783595 -799301 -795398 -786853 -788535 -799490 -797251
5114 -797251 -782607 -768760 -770853 -773947 -764637 -755160 -751075 -762462 -771813 -770005 -784825 -791260 -786413
$$ packed form
5213g95218J005J3159o851m236n510l186k284Q13j346m006j556K367m023m58O259
5198h05071O807L496J749Q95K178L435N388l549M303r309j2433J0549Q305J0883
5184g72374P3o103M283j945j2967n278K739J592K832j1456L759k560r712P448
5170g99669J9791p994l316J0782p894j630Q043o559j6515q16j085R844Q33K788
5156g93397n872K84o200r337J1379J442k140J3842l305n0J296o676k419J703p466
5141h06916P932Q618O467m694P75j824L617k968q468J4321R308k139j3159j5234
5127h04364k64K870J0551J5006J3219q068j2545j5706L903Q545j682j0955K239
5114g97251J4644J3847k093l094R310R477M085j1387r351J808j4820o435M847
$$ plain form
5101 -786413 -788062 -792857 -787684 -785292 -787611 -777671 -763388 -759406 -773271 -777450 -777084 -777191 -774033 -772048
5087 -772048 -781510 -785850 -776515 -761216 -756897 -762880 -780213 -786855 -780547 -769090 -759106 -751621 -749498 -757332
5073 -757332 -769265 -775584 -763574 -762176 -763659 -780541 -787718 -776617 -770694 -767907 -763183 -764456 -760655
5060 -760655 -756760 -760685 -779969 -782112 -766528 -773600 -776055 -774089 -771894 -772999 -771368 -770740 -766148 -779316
5046 -779316 -778588 -774678 -779919 -771233 -755033 -760624 -766968 -771693 -778542 -774693 -771396 -773384 -778677 -785409
5032 -785409 -786189 -782305 -783314 -778675 -782773 -778018 -775860 -782063 -793017 -800093 -796439 -777828 -770316 -778546
5018 -778546 -785877 -774370 -759974 -762356 -768264 -761347 -755306 -762453 -776192 -769980 -758085 -747031 -748418
5005 -748418 -752766 -753226 -760981 -764658 -776198 -765790 -763825 -771572 -772428 -770814 -756469 -753330 -743059 -736590
$$ packed form
5101g86413j649m795N173K392k319R940J4283L982j3865m179L66j07L158J985
5087g72048r462m340R335J5299M319n983j7333o642O308J1457R984P485K123p834
5073g57332j1933o319J2010J398j483j6882p177J1101N923K787M724j273L801
5060g60655L895l925j9284k143J5584p072k455J966K195j105J631O28M592j3168
5046g79316P28L910n241Q686J6200n591o344m725o849L849L297j988n293o732
5032g85409p80L884j009M639m098M755K158o203j0954p076L654J8611P512q230
5018g78546p331J1507J4396k382n908O917O041p147j3739O212J1895J1054j387
5005g48418m348m60p755l677j1540J0408J965p747q56J614J4345L139J0271O469
$$ plain form
4991 -736590 -738230 -748559 -749530 -756509 -754550 -758102 -770731 -775179 -775071 -771204 -774280 -784222 -780806 -776893
4977 -776893 -763609 -749757 -759009 -767272 -761912 -761149 -756049 -752559 -749486 -755339 -755897 -750875 -763242 -766865
4963 -766865 -774117 -788566 -783954 -776609 -774465 -777623 -772903 -766913 -765843 -763239 -760431 -762200 -769468 -777862
4949 -777862 -768980 -761685 -763365 -759884 -758490 -760112 -755630 -758908 -765710 -777289 -781486 -776772 -776588 -770502
4935 -770502 -762746 -749380 -738964 -768560 -788374 -779259 -773738 -766498 -752063 -751316 -764726 -771895 -782276
4922 -782276 -775851 -769639 -758770 -757995 -770662 -777530 -778942 -783925 -790244 -784170 -800478 -796164 -779983 -766948
4908 -766948 -760699 -758487 -762337 -756340 -745384 -730679 -741597 -766313 -771343 -774242 -769670 -774207 -771059
$$ packed form
4991g36590j640j0329r71o979J959l552j2629m448J08L867l076r942L416L913
4977g76893J3284J3852r252q263N360P63N100L490L073n853n58N022j2367l623
4963g66865p252j4449M612P345K144l158M720N990J070K604K808j769p268q394
4949g77862Q882P295j680L481J394j622M482l278o802j1579m197M714J84O086
4935g70502P756J3366J0416k9596j9814R115N521P240J4435P47j3410p169j0381
4922g82276O425O212J0869P75j2667o868j412m983o319O074j6308M314J6181J3035
4908g66948O249K212l850N997J0956J4705j0918k4716n030k899M572m537L148
$$ [...]
##END NTUPLES=NMR SPECTRUM
##END=
