##TITLE=Analysis number 308807
Compound Code cc 36014
Book Reference 419/120
Project Code adrs
Chemist Name anns
##JCAMPDX= 6.0         $$ Bruker NMR JCAMP-DX V2.0
##DATA TYPE= NMR SPECTRUM
##DATA CLASS= NTUPLES
##ORIGIN= Bruker BioSpin GmbH
##OWNER= NMR
$$ XWIN-NMR		Version 3.5
$$ Wed May 25 10:31:50 2005 GMT Daylight Time (UT+1h)  MAYBRIDGE\NMR@NMR_250MHZ
##.OBSERVE FREQUENCY= 250.131544655141
##.OBSERVE NUCLEUS= ^1H
##.ACQUISITION MODE= SIMULTANEOUS (DQD)
##.ACQUISITION SCHEME= undefined
##.AVERAGES= 16
##.DIGITISER RES= 18
##SPECTROMETER/DATA SYSTEM= dpx250
##.PULSE SEQUENCE= zg30
##.SOLVENT NAME= CDCl3
##.SHIFT REFERENCE= (INTERNAL, CDCl3, 0, 16.522)
##AUDIT TRAIL= $$ (NUMBER, WHEN, WHO, WHERE, WHAT)
$$ ##TITLE= Audit trail, XWIN-NMR		Version 3.5
$$ ##JCAMPDX= 5.01
$$ ##ORIGIN= Bruker BioSpin GmbH
$$ ##OWNER= NMR
$$ C:\u/data/dgb/nmr/ADRS/3510/pdata/1/auditp.txt
$$ ##AUDIT TRAIL=  $$ (NUMBER, WHEN, WHO, WHERE, WHAT)
(   1,<2005-05-25 10:31:31.17 +100>,<MAYBRIDGE\NMR>,<NMR_250MHZ>,
      <created by zg, POWCHK disabled, PULCHK disabled
       configuration hash MD5:
       62 19 C7 07 E1 42 D1 B7 37 6C 3D D0 77 39 F9 E6
       data hash MD5: 64K
       CD D9 CB 46 63 29 65 90 A1 CB F7 FB 5A A6 37 9A>)
(   2,<2005-05-25 10:31:41.48 +100>,<MAYBRIDGE\NMR>,<NMR_250MHZ>,
      <Start of raw data processing
       ef LB = 0.3 FT_mod = 6 PKNL = 1 SI = 32K 
       data hash MD5: 32K
       21 09 9D 51 3B 32 56 45 A3 63 83 5B 14 E8 28 55>)
(   3,<2005-05-25 10:31:43.45 +100>,<MAYBRIDGE\NMR>,<NMR_250MHZ>,
      <apk 
       data hash MD5: 32K
       4B E2 55 09 8A 47 00 10 57 BD 37 8F 33 0B DF 9F>)
(   4,<2005-05-25 10:31:44.15 +100>,<MAYBRIDGE\NMR>,<NMR_250MHZ>,
      <abs ABSG = 5 
       data hash MD5: 32K
       1B 6A 96 38 11 12 E9 88 28 3A 46 2B F3 4E 8A A1>)
$$ ##END=
$$ 
$$ hash MD5
$$ 91 89 8A 1C 82 39 81 BD F3 5A A9 DD EE 11 5E FB
##$RELAX= 
##$RELAX= 
##$RELAX= 
##$RELAX= 
##$RELAX= 
##$RELAX= 
##$RELAX= 
$$ Bruker specific parameters
$$ --------------------------
##$DU= <C:\u>
##$EXPNO= 3510
##$NAME= <ADRS>
##$PROCNO= 1
##$TYPE= <nmr>
##$USER= <dgb>
##$AMP= (0..31)
100 100 100 100 100 100 100 100 100 100 100 100 100 100 100 100 100 100 
100 100 100 100 100 100 100 100 100 100 100 100 100 100 
##$AQSEQ= 0
##$AQ_mod= 3
##$AUNM= <au_zg>
##$AUTOPOS= <12 >
##$BF1= 250.13
##$BF2= 250.13
##$BF3= 250.13
##$BF4= 250.13
##$BF5= 500.13
##$BF6= 500.13
##$BF7= 500.13
##$BF8= 500.13
##$BYTORDA= 1
##$CFDGTYP= 0
##$CFRGTYP= 5
##$CHEMSTR= <none>
##$CNST= (0..31)
1 1 145 1 1 1 1 1 1 1 1 1 1 1 1 1 1 1 1 1 1 1 1 1 1 1 1 1 1 1 1 1 
##$CPDPRG= <>
##$CPDPRG1= <>
##$CPDPRG2= <>
##$CPDPRG3= <>
##$CPDPRG4= <mlev>
##$CPDPRG5= <mlev>
##$CPDPRG6= <mlev>
##$CPDPRG7= <mlev>
##$CPDPRG8= <mlev>
##$CPDPRGB= <>
##$CPDPRGT= <>
##$D= (0..31)
0 1 0 0 0 0 0 0 0 0.06 0 0 0 0 0 0 0.0002 0 0 0 0 0 0 0 0 0 0 0 0 0 0 
0 
##$DATE= 1117013489
##$DBL= (0..7)
120 120 120 120 120 120 120 120 
##$DBP= (0..7)
150 150 150 150 150 150 150 150 
##$DBP07= 0
##$DBPNAM0= <>
##$DBPNAM1= <>
$$ [...]
##$SUBNAM7= <"">
##$SUBNAM8= <"">
##$SUBNAM9= <"">
##$SW= 20.6930455092707
##$SWIBOX= (0..15)
0 0 3 0 0 0 0 0 0 0 0 0 0 0 0 0 
##$SW_h= 5175.983436853
##$TD= 65536
##$TD0= 1
##$TE= 295.16
##$TE2= 300
##$TE3= 300
##$TEG= 300
##$TL= (0..7)
0 120 120 120 120 120 120 120 
##$TP= (0..7)
150 150 150 150 150 150 150 150 
##$TP07= 0
##$TPNAME0= <>
##$TPNAME1= <>
##$TPNAME2= <>
##$TPNAME3= <>
##$TPNAME4= <>
##$TPNAME5= <>
##$TPNAME6= <>
##$TPNAME7= <>
##$TPOAL= (0..7)
0.5 0.5 0.5 0.5 0.5 0.5 0.5 0.5 
##$TPOFFS= (0..7)
0 0 0 0 0 0 0 0 
##$TUNHIN= 0
##$TUNHOUT= 0
##$TUNXOUT= 0
##$USERA1= <user>
##$USERA2= <user>
##$USERA3= <user>
##$USERA4= <user>
##$USERA5= <user>
##$V9= 5
##$VALIST= <valist>
##$VCLIST= <CCCCCCCCCCCCCCC>
##$VD= 0
##$VDLIST= <DDDDDDDDDDDDDDD>
##$VPLIST= <PPPPPPPPPPPPPPP>
##$VTLIST= <TTTTTTTTTTTTTTT>
##$WBST= 1024
##$WBSW= 4
##$XGAIN= (0..3)
0 0 0 0 
##$XL= 0
##$YL= 0
##$YMAX_a= 381732
##$YMIN_a= -507209
##$ZGOPTNS= <>
##$ZL1= 120
##$ZL2= 120
##$ZL3= 120
##$ZL4= 120
##$ABSF1= 16.522
##$ABSF2= -4.171173
##$ABSG= 5
##$ABSL= 3
##$ALPHA= 0
##$AQORDER= 0
##$ASSFAC= 0
##$ASSFACI= 0
##$ASSFACX= 0
##$ASSWID= 0
##$AUNMP= <proc_1d>
##$AZFE= 0.1
##$AZFW= 0.1
##$BCFW= 0
##$BC_mod= 0
##$BYTORDP= 0
##$COROFFS= 0
##$CY= 12.5
##$DATMOD= 1
##$DC= 0
##$DFILT= <>
##$DTYPP= 0
##$F1P= 14.0000005364418
##$F2P= -0.99999901652339
##$FCOR= 0.5
##$FTSIZE= 32768
##$FT_mod= 6
##$GAMMA= 0
##$GB= 0
##$INTBC= 1
##$INTSCL= 1
##$ISEN= 128
##$LB= 0.3
##$LEV0= 0
##$LPBIN= 0
##$MAXI= 10000
##$MC2= 0
##$MEAN= 0
##$ME_mod= 0
##$MI= 0
##$NCOEF= 0
##$NC_proc= -3
##$NLEV= 6
##$NOISF1= 0
##$NOISF2= 0
##$NSP= 0
##$NTH_PI= 0
##$NZP= 0
##$OFFSET= 16.522
##$PC= 1
##$PHC0= -75.03102
##$PHC1= 9.053154
##$PH_mod= 1
##$PKNL= yes
##$PPARMOD= 0
##$PSCAL= 4
##$PSIGN= 0
##$REVERSE= no
##$SF= 250.13
##$SI= 32768
##$SIGF1= 0
##$SIGF2= 0
##$SINO= 400
##$SIOLD= 32768
##$SREGLST= <1H.CDCl3>
##$SSB= 0
##$STSI= 32768
##$STSR= 0
##$SW_p= 5175.98343685301
##$SYMM= 0
##$S_DEV= 0
##$TDeff= 65536
##$TDoff= 0
##$TI= <Analysis number 999999
Compound Code 99
Book Reference 9
Project Code 9>
##$TILT= no
##$TM1= 0
##$TM2= 0
##$TOPLEV= 0
##$USERP1= <user>
##$USERP2= <user>
##$USERP3= <user>
##$USERP4= <user>
##$USERP5= <user>
##$WDW= 1
##$XDIM= 32768
##$YMAX_p= 323402325
##$YMIN_p= -99164
$$ End of Bruker specific parameters
$$ ---------------------------------
##NTUPLES= NMR SPECTRUM
##VAR_NAME=  FREQUENCY,     SPECTRUM/REAL,   SPECTRUM/IMAG
##SYMBOL=    X,             R,               I
##VAR_TYPE=  INDEPENDENT,   DEPENDENT,       DEPENDENT
##VAR_FORM=  AFFN,          ASDF,            ASDF
##VAR_DIM=   32768,         32768,           32768
##UNITS=     HZ,            ARBITRARY UNITS, ARBITRARY UNITS
##FACTOR=    0.157963299565203, 1,           1
##FIRST=     4132.6476996994, 0,             0
##LAST=      -1043.33573715361, 0,           0
##MIN=       -1043.33573715361, -99164,      0
##MAX=       4132.6476996994, 323402325,     0
$$ Real data points
##PAGE= N=1
##DATA TABLE= (X++(R..R)), XYDATA
$$ [...]
16115b0956j7538K3512k23J9951N483k8371Q384K7611N390j6513j8383M53J7096
16102E896L056o343J6308J2912q982k3683k3241k5157N119J8646L3642j2860j5458
16089b0145J6039O044k8118J8722J7400J0234q865k7858J2131J3634j877Q979
16077A6320k845J1997K1316r41M994k0376j9004l1358l119O595Q080P342J0350
16064I351N169k0285l5189O973J2368P994J7643J6973k4188j0795J0740l040J2507
16051F221l3256j0558j4948k9886L0924L8040L751j8722O79o694N4J7301J4217
16038b877m208k798K2902N661J9234R999j0207m2521j6827M7160J9204J2275P536
16025F4533k2319j043m454P445J1292p148j3386p044J812j00O071j5164j336j070
$$ y = [-20956, -38494, -14982, -15205, 4746, 10229, -18142, -9758, 17853, 23243, 6730, -11653, -11200, 5896, 8952, 2609, 18917, 31829, 22847, -836, -24077, -49234, -44115, -25469, 8173, -4687, -20145, -4106, 1938, -26180, -7458, 9942, 20176, 11311, -16547, -4416, 9218, 7341, 16320, 13475, 25472, 46788, 45847, 50841, 30465, 11461, -19897, -23016, -16421, -8341, -999, 9351, 14520, -5765, -40954, -33981, -21613, -13619, 4024, 20997, -3191, -13986, -3246, -6286, 6221, -27035, -37593, -52541, -82427, -51503, -13463, -9712, -28434, -27755, -34449, -34395, -17094, -2877, -7085, -9883, 13019, 18680, 37914, 47913, 37706, -4815, -21642, 25518, 44722, 56997, 64533, 42214, 41171, 36717, 44162, 55454, 48306, 34920, 27876, 29688, 29588, 35659, 20495, 19159, 18089]
16011A8089J5755j492n1l8279p51r81l0638J5739L3803J5428J4290J1762k1878
15998C0796j6276P643k0744l379l79j3142l995L041J9622J9460n339k7846j8699
15985b9237j4276M221J8356J554K3630O278j3106J0741J2495J0103k9388j6223
15973a4852P728J3005m194o677L998K4802j6296o173J4436j6959N625n089Q981
15960H335J4558k1745P186O175j7251N525j0287k1755j5656J2263K9738j5093
15948a8007Q8j0391j5418K7042J1986J317P466j8329q841N139K5970J8065k2651
15935C436k2044M794j4636r575j733j2988p867r583L169K053K0053K177m518J878
15921d5384J6328p219l46j4879j645J5401Q24J378L508J190J6645R387J8622O022
$$ y = [18089, 33844, 32352, 32301, -5978, -6729, -7710, -38348, -22609, 11194, 26622, 40912, 52674, 30796, 14520, 22163, 1419, -1960, -2339, -15481, -19476, -16435, 3187, 22647, 17308, -10538, -29237, -43513, -39292, -20936, -19382, 4248, 10526, -2580, 8161, 20656, 30759, 1371, -14852, -7124, 5881, 1687, -4990, -992, 23810, 7514, 1341, 15777, -1182, 4443, -646, 8335, 22893, 1148, 8334, 14509, -2742, 2783, -7504, -29259, -44915, -32652, -2914, -18007, -17919, -28310, -43728, -16686, -4700, -3383, 4083, -14246, -23087, -17948, 8022, 26087, 3436, -18608, -13814, -28450, -38025, -39758, -52746, -60613, -70196, -67027, -64974, -44921, -42744, -47262, -45384, -29056, -36275, -36621, -51500, -53145, -37744, -36920, -35542, -32034, -30844, -14199, -4812, 13810, 19832]
15907A9832q339j4478k4375P413J5232j8952R375j945o732j9914R065R307m456
15894b8967Q165j3805L134j626K3055Q174J9164k890N633k604j875j875k4124
15881a0441l599J4200R659j9679m2311p167J5635j2738N333J7868l60J4652N982
15868a2966o012m113O282J5190Q916n312o096q295j4171k1751K9419j900k843
15855b3652K4815K7497l3172k4101J2056n889R787K4047m3340L222K115p893p144
15842d1652J5115J4757J110J0328j3782R891L65n189R185k1009p975j538l912
15829c4306j7648q580j1768O353J5931L3905p694k5863N44J7498J3811q231k4595
15816e0643J3753K0594m097k827j4920l1627L2702K4619K115j7713J7817K245
$$ y = [19832, 11493, -2985, -27360, -19947, -4715, -23667, -14292, -16237, -22969, -42883, -33818, -24511, -28967, -20802, -34607, -31473, -33099, -10044, -1870, 17294, 14404, 20037, 17433, 15558, 13683, -10441, -14040, 160, 9819, -9860, -52171, -59338, -43703, -56441, -51108, -33240, -33600, -18948, -12966, -18978, -23091, -16809, -1619, 7297, 1985, -4111, -12406, -26577, -48328, -18909, -20809, -23652, 1163, 28660, -4512, -28613, -16557, -22446, -12659, 11388, -31952, -28730, -26615, -34508, -41652, -26537, -11780, -10670, -342, -14124, -4233, -3868, -9057, 128, -20881, -28856, -30394, -34306, -51954, -60534, -72302, -65949, -50018, -16113, -23807, -49670, -49126, -31628, -17817, -26048, -50643, -36890, -16296, -20393, -23220, -38140, -69767, -37065, -12446, -10331, -28044, -10227, -7982]
15804g982L118J0947J0382O842l747k5946j1759K7412m842j3285J4896j9196q090
15791b1250j3110k913J0096K0934M0429k2037k0945m3222j0430P356M307J8498
15779c2287J5142Q236j2696n728M179O089m633q501J2839J8327J792n802j6770
15766a9813j482K3072m131q554j1224J2634m6520p928j582J2324J7134j150J1705
15753b5515n485j2603J1229J608j3364r28J0028J3573L9703K7208K773k9667k6304
15740g744j4009m268K5116K8657j1385k0508k687j0997j184J0931L0076j750l4151
15727a3903j0446L4404K5638O99J1877L622j8485k9799O923j762j854M258k5886
15714a4714k462J9027M259j6332J4763J3887r481K92J3289j3696k5801p294L1123
$$ y = [-7982, -4864, 6083, 16465, 23307, 19560, -6386, -18145, 9267, 4425, -8860, 6036, -13160, -21250, -34360, -37273, -27177, -6243, 34186, 12149, -8796, -52018, -62448, -55092, -50785, -32287, -17145, -8909, -21605, -27333, -23154, -17065, -21698, -30199, -17360, 967, 2759, -3043, -19813, -21295, 1777, -2354, -10908, -22132, -9498, -56018, -63946, -65528, -53204, -36070, -37220, -25515, -31000, -43603, -32374, -30766, -44130, -45058, -35030, -21457, 18246, 45454, 48227, 18560, -7744, -21753, -26021, -905, 27752, 16367, -4141, -6828, -17825, -19009, -8078, 21998, 20248, -13903, -24349, 10055, 35693, 36392, 48269, 51891, 33406, 3607, 10530, 8768, 6914, 11172, -14714, -17176, 1851, 6110, -10222, 4541, 18428, 8947, 9239, 22528, 8832, -16969, -24263, 6860]
15701F860J1140p733j5923j8136o779J3357p703M163j404K2500O140L430J2231
15688B2143J9517j9540n616Q525P003j0688j6485J617l6345j4967K7015N734n820
15675a7907R050K0171r912o661o194r307J8932K2404K0168j6494J3188K217o178
15662C3477k9714l9247r251O768J3512J1864K8945M027k0630o19J955j1383o330
15649a6626o874J1099K9478o598J393K1799O249l0277j2779J7600J4352k8655
15637A61j5860o323J5001K7716K1659l501q434j4882l1542j4814K265j3827n660
15624d8041K7583o583k0812K642K4007K1507P418K3863J1982o283q362l79j3493
15611A5049k444l121k2148l156j1742k641K3508J7772o710J1352J2920j9521m055
$$ y = [6860, 18000, 10267, -5656, -23792, -30571, -17214, -24917, -20754, -22158, 342, 6482, 9912, 22143, 41660, 22120, 16504, 25029, 32032, 21344, 4859, 6476, -29869, -44836, -17821, -12087, -17907, -8857, 11314, 1402, -5259, -11453, -20760, -1828, 20576, 40744, 24250, 37438, 39655, 33477, 3763, -35484, -44735, -37967, -24455, -12591, 16354, 20381, -249, -868, 1087, -10296, -16626, -23500, -12401, 17077, 10479, 11872, 33671, 39920, 9643, -3136, 14464, 28816, 161, -15699, -22022, -7021, 20695, 42354, 38853, 30419, 15537, -16005, -30819, -28554, -42381, -48041, -20458, -27041, -47853, -45211, -21204, 303, 7721, 31584, 43566, 37283, 28921, 28542, 15049, 12605, 9484, -12664, -15820, -27562, -30203, -6695, 11077, 4367, 15719, 28639, 9118, 5063]
15598E063J5638n444j9823R898M768k8738K94o031P539L5346N164l3325M042j3461
15584a9070k0484P573R469O016r112J5895J044j6654q537J0312k243K5566o781
15571g006r678k2112l5843P781j3796n873J5417M9608K8102K4983j7569j2841
15559A173K401J2488J0971K4989n103j7254k0230J5645K3851k5703l9421j3449
15547b9642r160j8218M4284L1067J3376p920P22R008j6589j5923N150P275j5538
15534b108q174P540J2312j2435j9174k3641J0281K0848K0989j818o847p883j2156
15521b2266r350j1399O877J4889L327q975N82p346O209L8976K1158n814k1374
15508E494j162P158k8738j6241P244k140J0306J6408L647n583J3407k5916l871
$$ y = [5063, 20701, 15257, -4566, 5332, 10100, -18638, -18344, -24375, -16836, 18510, 23674, -9651, -5609, -19070, -39554, -31981, -22512, -16496, -25608, -9713, -8669, -25323, -33860, -23548, -25791, -225, -7006, -16684, -38796, -74639, -66858, -80654, -86527, -71110, -21502, 6600, 31583, 14014, 1173, 3574, 16062, 27033, 52022, 46919, 29665, 9435, 25080, 48931, 23228, -16193, -29642, -38802, -57020, -12736, 18331, 31707, 23787, 24509, 33517, 16928, 1005, 6155, 13430, -2108, -10282, -2742, 9570, -2865, -22039, -45680, -35399, -14551, 6438, 4620, -2227, -10110, -22266, -31616, -43015, -36138, -21249, -17922, -26897, -26315, -33661, -27452, 11524, 32682, 26868, 5494, 4332, 11490, -17248, -33489, -26245, -28385, -18079, -1671, 1976, -3607, 9800, -16116, -19987]
15495a9987J5289l742o71K7371J4917k356L626o070q603j283j9267K604M677j0929
15481d424r37N161N828L0229j87j1937L783k5760n0408j6851K820k267Q419O516
15467e0015Q553J2220K4105L6945M198j5992l0584k0716j5044L2669M0439p086
15455A9692k1818J131J4499J854k232Q399j9640k6624J3657k722j2445R06N557
15442a9786M536J3434P723j3015r152o340N281l1543J412n267K6597K0315N367
15429d38j0119j6720j1188J7824K7551j734J0419K2100m587j8681j0933o785M660
15416A369q22o528K8015J607q539j1115K1279r290k9074N816j1276j8310K1343
15403a5525J8629K514k3963j0938J038J5846R141K2067J0439L001j2771k6907
$$ y = [-19987, -4698, -8440, -9111, 18260, 33177, 30821, 34447, 28377, 19774, 18491, -776, 1828, 6505, -4424, -5361, -200, 5628, 35857, 35670, 23733, 27516, 1756, -48652, -65503, -62683, -64950, -56531, -50015, -41462, -29242, -5137, 31808, 36006, 20014, -10570, -31286, -46330, -13661, 26778, 19692, -2126, -995, 13504, 15358, 13126, 21525, 1885, -24739, -11082, -13804, -26249, -25343, -19786, -15250, -1816, 5907, -7108, -16260, -22600, -17319, -48862, -47450, -52717, -26120, -5805, -438, -10557, -27277, -38465, -20641, 6910, 5176, 15595, 37695, 33108, 14427, 3494, -3291, 1369, 547, -5981, 22034, 23641, 15102, 3987, 25266, 15976, -13098, -7282, -18558, -36868, -15525, 3104, 5618, -18345, -29283, -28245, -12399, -3258, 18809, 29248, 32249, 19478, -7429]
15391g429K0590j879n8045k4615R089J4765J3029J3820J4794P115r75o939l354
15378a0034k632j3398j0000R653K583j4471J2723K1063R440J1893K3959l264r823
15365B7692k7487j2515j5399L734l038R727J3177J0395j6996K266K5776p366l8799
15352b8833K0914K4231Q78q796p518k800J1415L647K5127J2432l1915n1058j5168
15339d7444q388J3504K8895k0111l608J7531J9945n736o511J219J764j3904L1107
15326H263P890j6321R074K1508J4196o387J0769j5939l0548j7642L356J0930N351
15313D500n223l1496k6947R340K9598L9318M50k1420m0992M25o055j4370J2111
15300e0761J5772j6544q562L2598K1560j5834k191K702L446N12J8401M76j0387
$$ y = [-7429, 13161, 11282, -46763, -71378, -62289, -47524, -34495, -20675, -5881, 1234, 259, -6680, -10034, -12666, -26064, -36064, -26411, -23828, -38299, -25576, -4513, 4927, 16820, 40779, 37515, 27692, 205, -12310, -27709, -23975, -27013, -17286, -4109, 6286, -10710, -8444, 17332, 9966, -28833, -7919, 16312, 17190, 8394, 876, -1924, 9491, 13138, 38265, 50697, 18782, -32276, -47444, -55832, -42328, -13433, -33544, -37152, -19621, 324, -5412, -11923, -10704, -8940, -22844, 8263, 16153, -168, 8906, 30414, 44610, 38223, 48992, 33053, 2505, -15137, -11781, -851, 4500, -723, -32219, -59166, -49826, -20228, 19090, 19540, -1880, -42872, -42447, -48502, -62872, -50761, -34989, -51533, -60095, -27497, -5937, -21771, -23962, -21260, -17814, -17302, 1099, 1575, -8812]
15287h812K954Q359k2023o879K5298J5853K201L443o78K3689J448k7539p337j2495
15273b518p56J2924n448K4399K2434m1910q911M6417j7160m1218k6431r31n470
15260d4579l1955N706K6071J0792K4245J6317Q583J1146l266j3583j7132K872
15248d783K984m693J148J3619J5143M538k5075k5087L54M006O918J0332r387q779
15234a8762j117o132J3745J2937J0372O119j054k3430j6395k3409J0004J1370
15222b5752R117O212P186N311j8487k546O726J3531l807k644k577o628J4588L874
15208D104M636j2715M470J5103P438l0856m754N077p500J6172L180n10n641K103
15194C07l834k3225p773l578j4046k0263J2213P760j0419K386J4565L3556k3184
$$ y = [-8812, -5858, 2501, -19522, -26401, -1103, 14750, 16951, 20394, 19716, 43405, 44853, 17314, 9977, -2518, -3274, 9650, 4202, 28601, 51035, 9125, 214, 46631, 29471, -11747, -38178, -39109, -44579, -76534, -70828, -44757, -33965, -9720, 6597, 15180, 26326, 23060, 9477, -7655, -4783, -1799, -6492, -5344, 8275, 23418, 27956, 2881, -22206, -21852, -17846, -10928, -596, -9983, -18762, -19879, -26011, -12266, 671, 11043, 17162, 16108, -7322, -23717, -47126, -37122, -25752, -16635, -10423, -3237, 2074, -16413, -18959, -12233, 1298, -2509, -5153, -7730, -14358, 230, 4104, 8740, -3975, 495, 15598, 23036, -7820, -12574, -7497, -14997, 1175, 4355, 3845, -1796, 307, -3527, -26752, -34525, -38103, -52149, -72412, -60199, -52439, -62858, -60472, -45907, -12351, -35535]
15181c5535p053J30N174o952k790N048K2750L892K0716J0418q724j6073j0992
15168a9991m005j6550L7685j1532K078J0116p52j7527J6993J9017J3255j4192
15156A4595l135M768j4388r312P52p372m520l955J4674J4452r386j2565J6206
15143H14R281J0139l546M444j9990j5635M557m738K8559p465l6098l748J3178
15130b0248R594M493j0765j116J880q709J6369r28O111j2752k1205K1800K580
15117a2896q635l454j4911L982K4331K583p500K6481o007l0812j3269J6333k2785
15104d6559j6724N019K3718k879l661r823j146K2087N1733r258N402P753j7174
15091H488l520l1882j1929J1730K3879r66l1043r332K462K9200K1558J6674K528
$$ y = [-35535, -42588, -42458, -37284, -44236, -47026, -41978, -19228, -15336, 5380, 15798, 7074, -8999, -19991, -23996, -40546, -2861, -14393, -12315, -2199, -2951, -20478, -3485, 15532, 28787, 14595, 11460, 16228, 1840, -7472, -6720, -14092, -18612, -22567, -7893, 6559, -2827, -15392, 814, 10095, 20234, 16688, 21132, 1142, -14493, -9936, -14674, 13885, 6420, -29678, -33426, -20248, -10654, -6161, -16926, -18042, -16162, -24871, -8502, -9430, -3319, -16071, -37276, -15476, -12896, -21531, -24985, -39896, -35914, -11583, -9000, -16500, 9981, 3974, -26838, -40107, -23774, -46559, -63283, -58264, -34546, -37425, -41086, -50909, -52055, -29968, 21765, 12507, 17909, 25662, 8488, 4968, -26914, -38843, -27113, -3234, -4200, -35243, -44575, -42113, -12913, 8645, 25319, 27847]
15078B7847j3764l1566J6651K2107j7910k128k3661m01O361L356o571m349M804
15065a9224O346k4755j4034J0463J3217K492J6421J0249M151o163K0905K2744
15053D2812j3630o864M886J242L078j0921j510j5037P929J3770K4133Q331l5802
15040B2417j4048l692j364N42j0377r86J045J5137J9758J8714l225k1863k1295
15027G63J7698N0j3079Q110K0661l632j6158o510N705K2689q081K4163K4112N713
15013H2204k108J5438r02K406L8007N1364N0937P9259J21483J56585L41214P24925
15001A660812J274114J371503O87183k56524j208814j366111q61334m51199k61784
14992E87846j68806j15509p9912o7529k3828Q806r30k2576j7500n902M434k4822
$$ y = [27847, 14083, -17483, -832, 21275, 3365, 1237, -22424, -22825, -16464, -13108, -19679, -24028, -19224, -12878, -37633, -51667, -41204, -27987, -25495, -9074, 1175, 5326, -837, 20068, 42812, 29182, 22318, 27204, 28446, 31524, 20603, 19093, 4056, 11985, 25755, 49888, 58219, 22417, 8369, 4677, 3313, 3855, -6522, -7508, -6463, 8674, 28432, 47146, 43921, 22058, 763, 18461, 18511, 5432, 13542, 34203, 30571, 14413, 7903, 13608, 36297, 28216, 52379, 76491, 82204, 80096, 95534, 94632, 97038, 135045, 186409, 237346, 316605, 438088, 594673, 935887, 1660812, 2934926, 4306429, 4993612, 4737088, 3528274, 2162163, 1300829, 849630, 587846, 419040, 303531, 223619, 156090, 132262, 141068, 140138, 117562, 100062, 94160, 98594, 73772]
14980G3772l4000o413O914m644J7272k0307o166r31K0195k5100l410j0247k0692
14967a3757K978J4937L0728l346p032q998M144p837P217P563j1892k8069O52p076
14953a9788k5949n308M6234J7865k0328k4708J9960N8573J3546k0425m7655k3542
14941c1525J0311P364J1270k7314j0374j004j097O000J0412o503j8189n419L68
14928e5700J3067Q444J7067J7390J4463k6824l19K2094n333j2552k2570m6783
14916g7556J3284J4149J6666q332O034Q363R546r866j31K6047J0394j3230J0199
14903E567M32L973l064j37R029k016j5073j4284K3446n283L83P221Q135L052o994
14888A4387p481p654N312m340j4792j9122Q782L7368K4607J3628k3391l8427j2802
$$ y = [73772, 39772, 33359, 40273, 35629, 52901, 32594, 26428, 25497, 45692, 20592, 17182, 6935, -13757, -10779, 4158, 34886, 31540, 24508, 15510, 19654, 11817, 19034, 26597, 14705, -13364, -12712, -19788, -45737, -51045, -4811, 13054, -7274, -31982, -12022, 46551, 60097, 39672, -7983, -31525, -21214, -13850, -2580, -29894, -40268, -41272, -42369, -36369, -25957, -32460, -50649, -56068, -55700, -42633, -34189, -17122, 268, 14731, -12093, -12412, 9682, 4349, -8203, -30773, -77556, -64272, -50123, -33457, -41789, -35755, -27392, -17846, -27712, -27843, -1796, 8598, -4632, 5567, 5999, 9972, 6908, 6771, 15800, 13784, -1289, -15573, 7873, 2590, 2973, 10194, 18329, 21381, 14387, 6906, -748, 4564, 224, -14568, -33690, -24908, 12460, 37067, 50695, 27304, -11123, -23925]
14875b3925K7339n596k2236k773L391j0849Q976J0940M872k914j3499q71K7239
14862I4l453k7525j1719P617L642p214J3868N00o503j6095j6595L1050K6733K965
14848b635M481j3699k2603L303J2033l334r703J5808J5137j501n27J159j7166
14835a9247k811K1231M5760k23J5758l8933j9051K3632J8681j7128k6916O850
14823G603M750j0808l2978q379K0735J8055K584q857l148q943l4287l967K2269
14810c5371J5184R093K6156j5289M558J6896j5375J2692K0969k4177k0974J2909
14798G271r243M8k5217k4665K5602K2024k037j3835j204K0840K619l4974J881
14785c0890K6477J4522j1779k5496j0143j9502K4482j2968j5192R660M12j5761
$$ y = [-23925, 3414, -2182, -24418, -27191, -23800, -34649, -25673, -14733, -9861, -12775, -26274, -27145, 94, -3359, -30884, -42603, -34986, -31344, -38558, -24690, -24190, -30693, -46788, -63383, -32333, -5600, -2635, 1846, -11853, -34456, -31153, -19120, -22454, -32157, -16349, -1212, -2713, -3240, -2081, -19247, -22058, -827, 44933, 44710, 60468, 21535, 2484, 26116, 44797, 27669, 753, 7603, 12353, 1545, -31433, -39812, -19077, -1022, 1562, -7295, -10443, -19386, -53673, -57640, -35371, -20187, -11094, 15062, -227, 4331, 21227, 5852, 18544, 39513, 15336, -5638, 7271, -1972, -1924, -27141, -51806, -26204, -4180, -6217, -20052, -21256, -416, 2203, -32771, -30890, -4413, 10109, -1670, -27166, -37309, -56811, -32329, -45297, -60489, -50829, -50417, -66178]
14773f6178J6206p692o302M6523N477n497J8747p76o284p321j781M375J6550K4811
14759C0858Q360j1638j2108m0353j2624K7091j325j1876k7717J4953j0273l656
14747e0308L661L244J3715J7939R435K563j660j7992J6933J7395k795k5473l787
14734a7130R122j3126j4745p75R286K154k2834O198K4601J94K390L782K829J6329
14720H275J225N034P060o0325k1533J4777K8147j0337p090p155K3892R478j6226
14707b4778K520O847O660L133q363p070j7091J1J2502J0762J3940o938k4301j4585
14693d6751L273J4116J6368J9769L127l325K10j0490K0594M226l3821j9419l071
14680c5194r310L598r805j798J9438L5852J4839k6668K8500J0620j7791j949j0690
$$ y = [-66178, -49972, -57664, -63966, -17443, -11966, -17463, 1284, 508, -5776, -13097, -14878, -10503, 6047, 30858, 39218, 27580, 15472, -24881, -37505, -10414, -11739, -23615, -51332, -36379, -46652, -50308, -46647, -43403, -29688, -11749, -2314, 249, -1411, -19403, -2470, 14925, 12130, -13343, -17130, -8008, -21134, -35879, -36654, -27368, -25214, -48048, -41850, -17249, -17055, -14665, -10883, -8054, 8275, 9500, 14534, 21594, -38731, -60264, -45487, -17340, -27677, -34767, -41922, -18030, -8552, -24778, -22258, -15411, -8751, -5618, -13981, -21051, -38142, -38131, -25629, -14867, -927, -7865, -32166, -46751, -43478, -29362, -12994, 6775, 9902, 6577, 6787, -3703, 16891, 21117, -12704, -32123, -35194, -44504, -40906, -50711, -52509, -33071, 2781, 17620, -9048, 19452, 30072, 12281, 10332, -358]
14667c58l796j3314K692J4585J157k2632k7504k631K7583O091J7029j2512Q159
14654e451K5283J5312J023j737j0270j7723K883O721o066N857k761R961r289k8966
14640a5223J7138K3842N226K467j8717k1183R912l244j5455j3002J0788K4924
14628G473k821J1939o999r952p585o46Q316J2003L474j2938j8513j8958M862j492
14614c1837K4023k0798j5809O374J9307J6760o961j156o134j0250l643j6508p345
14601e3977J4730K3505K4940j4652q137r222K8244J9999k1247n0815k1159J3164
14589e4627J3176M852m499J7073j0476J3980L3589L4157j3806q506m427K809j1737
14576A1558J8340N11m302j24j9667j167K773J4237j0550k0517J122R242j734q337
$$ y = [-358, -4154, -17468, -14776, -191, 966, -21666, -49170, -51801, -24218, -18127, -1098, -13610, -5451, 19832, 35144, 36167, 34430, 24160, 6437, 9320, 16041, 9975, 15832, 13071, 23032, 13743, -15223, 1915, 25757, 30983, 33450, 14733, -6450, 3462, 218, -15237, -28239, -17451, 7473, 4652, 16591, 9592, -360, -7945, -8591, -275, 11728, 15202, 2264, -16249, -35207, -30345, -31837, -7814, -28612, -44421, -38047, -18740, -1980, -8941, -10097, -16231, -26481, -30124, -46632, -53977, -39247, -15742, 9198, -5454, -13591, -22813, 5431, 25430, 4183, -46632, -67791, -54627, -41451, -36599, -41098, -24025, -34501, -20521, 13068, 47225, 33419, 24913, 20486, 23295, 11558, 29898, 30409, 26107, 25983, 6316, 5149, 7922, 22159, 11609, -8908, -7786, 1456, -278, -8615]
14562h615j2508K496j1703k359m3P841J751k1338J1543M3508k525Q572n098K255
14548A3777J4581K132R067j7714l5810j6186J7970L3498K6896j3620K307o787
14536C0111j1624j7216j8508j6697J4150K2153k953J0309L312m808j6081q271
14524a6123O65Kl3865r853J9508R825J5546J7422n593J5649R427j6021k4226n250
14510b2887q878L0121J5842j3102O043n56q686j3128J1022l2522j1278P070L3191
14497g748L4199n071k44j5743J1124J6979r571l7462k70q89j6877l780m9j473
14483c6875L534L790P489K235k421K6042K2002Q761M977r350j7343k3767P960
14470b966m984k8690J9813L9492P406l0232j7296J8431r806q736J5300k910J5002
$$ y = [-8615, -21123, -18627, -30330, -32689, -32732, -24891, -23140, -44478, -32935, 10573, 8048, 16620, 11522, 13777, 28358, 30490, 39557, 21843, -13967, -30153, -12183, 21315, 48211, 34591, 36898, 30111, 18487, 1271, -17237, -33934, -19784, 2369, -584, 9725, 13037, 8229, -7852, -16123, -15458, -15456, -49321, -59174, -39666, -29841, -14295, 3127, -2466, 13183, 22610, 6589, -17637, -22887, -31765, -1644, 14198, 1096, 7139, 6583, -2103, -15231, -4209, -36731, -48009, -40939, -7748, 26451, 21380, 21136, 5393, 16517, 33496, 23925, -13537, -13807, -14696, -31573, -35353, -35402, -36875, -33341, -29551, -22062, -19827, -22248, 3794, 25796, 34557, 39534, 30184, 12841, -10926, -2966, -7950, -36640, -16827, 22665, 30071, -161, -17457, 974, -8832, -17568, -2268, -5178, 9824]
14457I824r855k6084k5242n77K1243J3129L554J7553R80r535j2926l017j8951
14444c9904j2256J6099L361k099N65r093n385N465J0393p358L6633L8071r89j9607
14430A3896n760k2319J4812j541Q597J7532m413l655r861o130j8883J853R364
14417f508J594j495J6325Q758K1632N577l9131J2136J2852l896k01l412j4075
14404A0156k3105L010m619p183K0050L9609P090j8263k2256J6754P159j8034j37
14391A0231R439J325j4362j7668r393J3211K6869p838j5025M515J5037R316p887
14378A7770k6957j2095k965r40K2927J8297j7415p20J0453J1556m2188O875K4711
14365I309k464j3683j207K9987m339L728k0667j0892K1692M8518k989j3730K19
$$ y = [9824, -31, -26115, -51357, -51934, -30691, -17562, -14008, 3545, 4525, -5010, -17936, -20953, -39904, -52160, -36061, -32700, -34799, -34234, -43327, -48712, -43247, -32854, -40212, -3579, 34492, 33503, 13896, 8136, -14183, 629, -912, 7685, 25217, 20804, 17149, 7288, 1158, -17725, -15872, -6508, -4914, -6409, 9916, 18674, 40306, 45883, 6752, 18888, 31740, 27844, 27643, 24231, 10156, -12949, -9939, -14558, -21741, -1691, 37918, 45008, 26745, 4489, 21243, 28402, 10368, 10231, 19670, 20995, 6633, -11035, -20428, -7217, 19652, 11814, -3211, 1304, 16341, 25657, 17770, -9187, -21282, -24247, -25187, -2260, 16037, -1378, -2098, 8355, 19911, -22277, -15402, 9309, 6845, -6838, -8045, 21942, 17603, 21331, 664, -10228, 11464, 59982, 56993, 43263, 43482]
14352D3482j688m242j1561l0932l117q763J8420J9967M08j5063K2080J817j8876
14339A1932j8387J7132j8647r305l642K428J25K0910p612j6107P113K1941J8305
14326B6186l429j5480l1202k2637K8935K6445j6356J3788O597j9571l1246j3685
14314e1655k212J2031m98J4553l047J5053J1545q975L1921J6459P722N61o018
14301C7440j4981j3309k3037n512P760n05m681m519J4891K3355L2246k114k4187
14288B2847K152j2868J1765qk6769j0676j3134r229j246K0124J0692R488j4839
14275a1701o508l873J1085K4093L509k994J0776j272j1577j2827j8103J0477K9425
14262B0510M639j79o664j4152j8154J2108N363m754j8830o633K5760K6336l75
$$ y = [43482, 41794, 37552, 25991, -4941, -8058, -16821, 1599, 21566, 21974, 6911, 28991, 30808, 11932, -6455, 10677, -7970, -17275, -20917, -18489, -18364, 2546, -5066, -21173, -14060, 7881, 26186, 22757, 7277, -23925, -46562, -17627, 8818, -7538, 6250, 12847, -6724, -37970, -51655, -53867, -41836, -42334, -27781, -30828, -15775, -4230, -13205, 18716, 35175, 42897, 43458, 37440, 22459, 9150, -13887, -19399, -11639, -12144, -16825, -21344, -6453, 16902, 49148, 47034, 22847, 24999, 12131, 23896, 23888, -2881, -13557, -26691, -35920, -37166, -17042, -6350, 3138, -11701, -18209, -22082, -10997, 13096, 16605, 13611, 24387, 23115, 11538, -1289, -19392, -8915, 20510, 25149, 24970, 18306, 4154, -14000, -1892, 3471, -1283, -20113, -26746, -986, 25350, 24975]
14249B4975k3590j5034R095N639m623l201o034q442j0205J0541J1085K5690k9680
14236a3784l785J2466j4374j1559N993L986m23m209P518l37N947Q80R759Q447
14222F525K851n201l136J5041j9176J0081K910K64k7226J4145k984m851N969J5699
14208A0911J9766k3491J522L186j4782k5551J4081J1493K3406K3586Q007k5938
14196B6196k1421p93J2586M597N415k500k1367j7006p419L2024K5738J6147N639
14183E7836k2218k7959k1505J7091N714Q69r18M166m318k1349K354L031J456j4918
14169b0668J3414p948J4441L5865J0105m449q835o607J877n242K892j0439r038
14156E368j0337N036J2134q00j2435q559J4881O33o373J9005Q89N925p03j5924
$$ y = [24975, 1385, -13649, -4554, 1085, -3538, -6739, -12773, -21215, -31420, -20879, -9794, 15896, -13784, -17569, -5103, -19477, -31036, -25043, -21057, -21480, -25689, -18171, -18508, -12561, -11681, -1922, 6525, 9376, 4175, 1039, 16080, -3096, 6985, 9895, 10159, -17067, -2922, -5906, -10757, -4788, 10911, 30677, 7186, 8708, 11894, -2888, -28439, -14358, -2865, 20541, 44127, 52134, 26196, 4775, 3982, 16568, 21165, 26580, 24080, 2713, -14293, -21712, 10312, 36050, 52197, 57836, 35618, 7659, -13846, 3245, 8959, 9828, 8910, 13076, 8758, -12591, -10237, -7206, -5750, -20668, -7254, -15202, -761, 35104, 45209, 40760, 31925, 25318, 27195, 21953, 24845, 14406, 5368, -4969, 67, 12201, 11401, -1034, -9593, 5288, 5921, -452, 18553, 19442, 25367, 24664, 8740]
14142H740j425K0371N824M751j2829k1138j5600O1j830j0345j0593n508J1796
14129b7725r556Q130O125N144k0929j3572J7977L585N477p356j2895o107J9123
14116c2579J5702M766M4456J0346r766r025j2873j0024Q526p801l2727k0715J565
14103e0149P840J1513K1584L2021O150j5018j2605p410j2686j0466K3832K364
14091c030j893O106L429l1K2937J9410j6434k9530O774J9235J4555J1028o012
14078D6544k3092l0110j5946J0912J3381J1565J4027j2870k9475K913j0762j6547
14066c9460L161J2859j9018K130J0980K1628J5228j5580l2044K0641J7828J3045
14054A1398k538j0679l0192q030K7949l963N197K6050J703J5674K815k0096l5043
$$ y = [8740, 7315, 27686, 33510, 38261, 25432, 4294, -11306, -11245, -13075, -23420, -34013, -39521, -27725, -37281, -29151, -23026, -17882, -38811, -52383, -34406, -30821, -25344, -32700, -45595, -51702, -32579, -16877, -12111, 32345, 42691, 32925, 23900, 11027, 1003, 9529, 1728, -30999, -51714, -50149, -42309, -30796, -9212, 22809, 28959, 13941, 1336, -6074, -18760, -29226, -5394, -3030, -4923, 1183, 4612, 4581, 27518, 46928, 30494, 964, 7738, 26973, 41528, 52556, 46544, 23452, -6658, -22604, -11692, 1689, 13254, 27281, 14411, -15064, -12151, -22913, -39460, -36299, -23440, -42458, -40328, -29348, -7720, 7508, -8072, -40116, -19475, -1647, 11398, 8860, -1819, -32011, -40041, -12092, -16055, -10858, 15192, 16895, 32569, 35384, 15288, -19755]
14041a9755K8955j0525O795K0228J9616r945k5034J2673O468j605n848k475j1396
14028H152j7137J0115J596J9716j0486o931J2123Q206J7870J1647R952o204j9929
14015C8690k1210j5619j708K3402K1776p9k2186M011P327j8713P153p821J0278
14002B5301j4901j2071K923q034J3662J3844j0125j815l733L310Q957m849j899
13989A0570q400j436j9677J989J3982J0230j3189p930k06k919J6817j344r556
13976a1069j1863K6980J0949o447R717q71K0431j6430k1606J100k0711m614n589
13963c0023j876k860N627K4257l897j187j6892J4065L2531J0278N077M079k0329
13950A8850j7264R093J4574j8374j5509J17k9424r008J7392K6339j1938J3102
$$ y = [-19755, 9200, -1325, 5470, 25698, 45314, 35369, 10335, 23008, 29476, 27871, 22023, 19548, 8152, -8985, 1130, 2726, 22442, 11956, 5025, 17148, 25354, 43224, 54871, 64823, 58619, 38690, 17480, 1861, 153, 23555, 45331, 45252, 23066, 27077, 34404, 15691, 22844, 15023, 25301, 10400, -1671, 1252, -6782, 6880, 20724, 10599, 8784, 5051, 8361, 17318, 12469, 10570, 2170, 734, -18943, -16954, -2972, 7258, -5931, -13861, -14067, -16986, -169, -1513, -11069, -22932, 4048, 14997, 8550, 18267, 17396, 37827, 21397, -209, 891, -19820, -24434, -30023, -31899, -34759, -29132, -4875, -8772, -9959, -26851, -12786, 19745, 30023, 35100, 39179, 18850, 1586, 10679, 25253, 6879, -8630, -8513, -37937, -46945, -29553, -3214, -15152, -2050]
13938b050J8356L077j3786J717k4721k8958J3850J4938M204p550n359Q262o864
13925b4884l406K3295J3786n674j6618J9045J4802p838k3584L186j6250q562R945
13912b2757j3589j3468k0446K7080M1326J398J1545P233j9926R913p619k5329
13900b4639k5141J2656M7049K9920l341q139O612P85j8433M137M899l685q131
13887A4549J2614J5128J663J3421N772r636n953o694k5666j6719L1069M182j1505
13874B2225q962m3837j3866J045J4790K2339J2246j0303J092K4242J5603p389
13862B9225j221j9037k9461K0807O320K3538J7689L131j4347q83j9570j547l354
13849A1290J5489Q541j3902n434Q102j3162P443q795jJ6863j171j0608R58N177
$$ y = [-2050, 16306, 19383, 5597, 7314, -17407, -46365, -32515, -17577, -13373, -20923, -26282, -18020, -24884, -28290, -4995, 8791, 3117, -13501, 5544, 20346, 12508, -11076, -7890, -24140, -32702, -22757, -36346, -49814, -70260, -43180, -1854, -456, 11089, 18322, -1604, 8309, 690, -24639, -49780, -37124, 9925, 39845, 36504, 28365, 34977, 35762, 17329, 21466, 26365, 22680, 14549, 27163, 42291, 43954, 57375, 63147, 53511, 47558, 40864, 15198, -1521, 29548, 33730, 22225, 13263, -30574, -44440, -43395, -28605, -6266, 5980, -4323, -3231, 21011, 36614, 29225, 28004, 8967, -20494, 313, 6633, 30171, 47860, 50991, 36644, 35761, 16191, 14644, 11290, 26779, 35320, 21418, 15984, 24086, 10924, 18367, 9572, 9571, 26434, 25263, 14655, 15613, 20790]
13835B0790K0911Q068j0214K3285j1923k2513m968r666O508J3662J4402k882N895
13822E1355K6784O638N251r747k4738m10j2155k3323O533j3419l4283J3698J5722
13809G906J2534L767J225k36L953k899l46N367o373J1679J4569l2184k6914J0183
13795B231L2066L1733R691j2959k9752J0430j3197k0165j2672J4452l041L640
13783A2457P603M606j4292j6304k041J559K7486K2366N587R030J7782l2026r93
13770D2820Q387Q898j8167r492m011j0362k2432k6624L057L2033K2518o213r425
13757A0987P307o560L196K8241R762r801r265k0426J2429J6116P399k0063l3598
13744d276J459L917K3959l043j6543L263N28K1927o637j5885k8419j0687P455
$$ y = [20790, 41701, 49769, 39555, 62840, 50917, 28404, 23436, 13770, 20278, 33940, 48342, 45460, 51355, 78139, 84777, 90028, 80281, 55543, 55133, 42978, 19655, 26188, 12769, -21514, -7816, 7906, 20440, 24207, 25432, 25196, 29149, 26250, 25904, 31271, 24898, 36577, 51146, 18962, -7952, 2231, 34297, 66030, 75721, 62762, 33010, 43440, 30243, 10078, -2594, 11858, 8817, 12457, 20060, 24666, 10374, -5930, -7971, -6412, 21074, 43440, 49027, 58057, 75839, 43813, 42820, 51207, 60105, 41938, 32446, 28435, 18073, -4359, -30983, -27926, 4107, 26625, 20412, 10987, 18294, 11734, 14930, 43171, 52933, 43132, 33867, 13441, 25870, 41986, 49385, 29322, -4276, -2817, 1100, 25059, 22016, 5473, 8736, 9264, 31191, 24554, 8669, -19750, -30437, -22982]
13731b2982n173K7264k583k2635J8642Q251k3482j8095M34L1198L0784N824l3365
13718e918l661L8540J0447q244o590k1836j8730J5271K3343K241P782k5935M65
13705G175K4640J7918j9436m42q650j7468R102r272K540O461J6194J9578l39j5070
13691C2931o673P787K908O884o291j2122k302j3260Q697l765K0107j7131k5852
13678h082L141J2408j206q670K162K0774J2177r641j4651o546K9908M2549k653
13665G1670l3607j2612k7341q255J7900k782j2933P673K9125K8310j497l6375
13653A9276j5348r557L6924P149O633k1067j1218L3592M743k5542P611P692J1389
13640E2277k026k1967J7225%j3503j8684k8920k0669J8806j9165p917j3290j5764
$$ y = [-22982, -28155, -891, -3474, -26109, -7467, 784, -22698, -40793, -40359, -9161, 21623, 27447, -5918, -9579, 28961, 39408, 31164, 24574, 2738, -15992, -721, 22622, 24863, 32645, 6710, 7175, 31815, 49733, 30297, 29855, 21205, 3737, 12839, 3567, 6107, 12568, 28762, 48340, 48001, 32931, 26258, 34045, 36953, 43837, 37546, 25424, 23122, 9862, 18559, 14794, 34901, 17770, -8082, -4941, 7467, 6261, -2409, -247, 20527, 32704, 23063, 8412, 1866, 31774, 74323, 71670, 38063, 25451, -1890, -10145, 7755, 4973, -7960, -287, 28838, 57148, 55651, 19276, 3928, -5629, 31295, 38444, 45077, 24010, 12792, 46384, 51127, 25585, 33196, 40888, 52277, 50251, 28284, 45509, 45509, 32006, 13322, -15598, -36267, -17461, -36626, -44543, -57833, -73597]
13627g3597K6475M3086K6917J1872n18k1597r427j8001R923N193L8127K1791j0519
13614D9725j4331j1994O894l60P181Q977K403R455j7339p997J7123M840k7292
13601B7285p553k2660j9848N24J1439L5093J5248r141k1085j6072J5187J824j7667
13588g426o747K286J2205L8853J4444n026j9705j0238l1751M243L9806K5197n693
13575E0448J1653R564k4472Q552p870R530R970P71o331j3776k5849l851K6296
13562D4635O627j7452J002k098J3805J3184k6039l5592L65j0576Q963M7454K2999
13549F7277j6492n91j7554l0721k4088N88J1100K4052K3000J895n682K6927J5555
13536G5266j0653p090j8063o356O845L5226J5224l7420j2561k327K071P636j8664
$$ y = [-73597, -47122, -4036, 22881, 34753, 34235, 12638, 3211, -14790, -4867, 326, 38453, 60244, 49725, 35394, 23400, 30294, 29934, 37115, 46092, 48495, 57950, 40611, 32614, 49737, 54577, 27285, 19732, -2928, -22776, -22252, -10813, 24280, 39528, 30387, 9302, -6770, 8417, 10241, -7426, -14173, -11887, 318, 39171, 53615, 48589, 28884, 18646, -13105, -8862, 30944, 56141, 50448, 62101, 71665, 47193, 55745, 47875, 57405, 67375, 68146, 61815, 48039, 22190, 18339, 44635, 51262, 33810, 34812, 32714, 46519, 59703, 33664, -1928, -1563, -12139, -3176, 44278, 67277, 50785, 50194, 32640, 1919, -22169, -21581, -10481, 13571, 36571, 38466, 32784, 59711, 75266, 64613, 57523, 39460, 33104, 39949, 75175, 90399, 52979, 40418, 38091, 40162, 47798, 29134]
13523B9134j0780m622N229j2413L74L8695m140j1672m608R054L0082K2332l5384
13510E1281k3710j2290l807J422j1329p612P352K4971j0365R31J8772J9057j9420
13497C5253J220M564O742l32l8598l579K4130K6185j594N046J50n577L134R193
13483F5937L228k16P225l0073N631K7712j3335j9958k0347j7868J0082J2475j6697
13470A3796L0394O718K1077j4099j8288J617r877J0152j182M328N570M17K2275
13457G2898J736Q000M807j0897J5011k0141m1020j4940J1855J5758j9817m226
13445A9024R569K8034J0318l2700j3362K789M186J4186j687k1594N273K8307n746
13432D6597Q645K7086j1207j8103j6246J143N94J8774j5213n418R279R72j9844
$$ y = [29134, 18354, 13732, 18961, 6548, 6922, 45617, 41477, 29805, 25197, 34251, 64333, 86665, 51281, 27571, 15281, 11474, 12896, 1567, -6045, 1307, 26278, 15913, 16844, 35616, 54673, 35253, 36473, 41037, 47779, 47447, 8849, 5270, 29400, 55585, 53991, 59037, 59187, 53610, 56744, 65937, 69165, 68949, 76174, 46101, 51732, 79444, 66109, 46151, 25804, 7936, 18018, 30493, 13796, 44190, 50908, 71985, 57886, 39598, 41215, 31338, 41490, 40308, 44636, 50206, 50623, 72898, 74634, 82634, 87441, 76544, 91555, 71414, 30394, 15454, 27309, 43067, 23250, 19024, 28593, 56627, 66945, 34245, 20883, 23672, 27858, 42044, 40357, 18763, 24036, 52343, 46597, 55242, 82328, 71121, 53018, 36772, 37915, 38509, 57283, 42070, 36652, 45931, 46903, 27059]
13419B7059j0212J225K3776K222j3389L456j2143J7627L4513K1727j4603l76j641
13406G9241J207j7351k0137r013N201J3393k598j0788K4148J8883n424k521n614
13393F8627k785J3511J5406k5677j9590J5489j8398K306J8342P286n498j3086
13381E5933J252n042o752J3445m2417j64L4609O286j1730l018n769J9108K0790
13368G6531p429j2714M557k716j917J1695K3288J6299k2793k9149j6582O916J334
13355D7320J2699O431l989o631J1543j3274k3681Q729J2596J3000O62J1384j9738
13342E7051j5776K0591K4505J9836O783K936j1706j7418r1j7035p314L6162n379
13329I3145n5319j3502K3342J7645J8568K0971j6220l181J2152J1402l0523j2224
$$ y = [27059, 16847, 18072, 41848, 44070, 30681, 34137, 21994, 39621, 74134, 95861, 81258, 80882, 79241, 80448, 63097, 42960, 33947, 39148, 52541, 49943, 39155, 63303, 82186, 76762, 74241, 68627, 65842, 79353, 94759, 69082, 49492, 64981, 46583, 48889, 67231, 74517, 69019, 55933, 57185, 52143, 45391, 58836, 16419, 16255, 50864, 57150, 45420, 42402, 36633, 55741, 76531, 69102, 56388, 60945, 58229, 56312, 68007, 91295, 107594, 84801, 55652, 39070, 45986, 47320, 60019, 66450, 62461, 55830, 67373, 54099, 30418, 39147, 51743, 64743, 65405, 76789, 57051, 41275, 61866, 86371, 106207, 112990, 115926, 104220, 86802, 86711, 69676, 62362, 98524, 93145, 37826, 24324, 47666, 65311, 83879, 104850, 88630, 85449, 97601, 109003, 78480, 66256]
13317F6256Q940o100L862J565m618J3875o569L078j1111q875J111Q332K1667M959
13303I6372j4513R317j380n620J146r74K108j28l759j7517K809j1899J7983J6342
13289I0287k428k0573l141J8985m018J7906N552q470j1812r550L3828n05K1456
13276A27517j8301k4914J4775K049j4849j5120k242P02p804j0662J4893k358J4587
13263G8273L3392j981k1225L037J4858J2355j1365j3953L011L3085M13O928N452
13250A42280j718N296Q44l3064J4095R973N715m751k3968K0350K5083J679J2560
13237A74374J8574N32j7785k8202M845k8327j2605J1905J9577K655O054k8590
13225A23007J1742r617j0634J6944J2288r508l2848p419P922Q32n058Q8j5568
$$ y = [66256, 75196, 69096, 72958, 74523, 69905, 83780, 77211, 80289, 69178, 60303, 61414, 69746, 91413, 96372, 81859, 91176, 89796, 84176, 85322, 84348, 86456, 86328, 82569, 65052, 67861, 55962, 73945, 90287, 87859, 67286, 64145, 83130, 79112, 97018, 102570, 94100, 82288, 72738, 106566, 106061, 127517, 109216, 84302, 99077, 101126, 86277, 71157, 68915, 69617, 61813, 51151, 66044, 63686, 78273, 111665, 109684, 88459, 91496, 106354, 118709, 107344, 93391, 96402, 129487, 129900, 136828, 142280, 140562, 145858, 146702, 113638, 127733, 137706, 143421, 138670, 114702, 135052, 160135, 161814, 174374, 192948, 193480, 175695, 147493, 152338, 124011, 111406, 123311, 142888, 145543, 151597, 123007, 134749, 125132, 114498, 131442, 143730, 134222, 101374, 93955, 101877, 102709, 97651, 97739, 82171]
13212H2171J0090K3631q073P043L1293J6914l797m018p970J2241r48m074J1431
13199A65934Q28k1478j2057J5157J8815J5283J3002J114j6585N693q414k283P662
13186A82671o341L0258J5074j1879k936p833k738k0436j012L310J1616P023J3681
13173B10458k2908k2546J5827R828J7926k6356J6698N500j8961K2813n653l898
13161A98728K196K8344J3839l182J2318j8694j6389l0420j397J9011K2957Q012
13149B35323L727P705J1214m436k492L179J949K0641N394J2993J2223L4061L9412
13136C80893K1281J5974L2880N1737J6090J3268J1392J541m4691n2230m8697j6687
13124C82751M112j6525k7205j8795J2232M099j8197k206k193o154L153L2704J7041
$$ y = [82171, 92261, 115892, 107819, 114862, 146155, 163069, 159272, 155254, 147284, 159525, 158577, 154503, 165934, 166762, 145284, 133227, 148384, 167199, 182482, 195484, 196598, 180013, 185706, 177292, 175009, 182671, 176330, 206588, 221662, 209783, 206847, 199014, 196276, 175840, 174828, 178138, 189754, 196777, 210458, 187550, 165004, 180831, 190659, 208585, 182229, 198927, 204427, 185466, 208279, 202626, 198728, 200924, 229268, 243107, 239925, 252243, 233549, 217160, 186740, 185343, 204354, 227311, 235323, 239050, 246755, 257969, 253533, 251041, 254220, 256169, 276810, 282204, 295197, 307420, 341481, 380893, 402174, 418148, 451028, 502765, 518855, 532123, 543515, 545056, 500365, 448135, 399438, 382751, 386863, 370338, 343133, 324338, 336570, 340669, 322472, 320266, 318073, 311919, 315072, 347776, 364817]
13111C64817M4977L7126N5296O4927P303K8924k5779r6064m3508q989j5062k0842
13099C93126o929J0834O345l927j6188R642J6300M4681J6241m388N187r729j0845
13086D50350k9415p492p037K0280k278K671j9086J2687N5640L5306q589k2471
13074D80566K1078K3775J0236K5386K8461L3166L9741P8434J17094J65220J53039
13063A176196P9089K7769o9466j14593j37952j30325n7631l3417l9267j4668r185
13052F76550n770q66j4597j3896J7195M424J5995J6221M948n821m170J6239J1643
13039G18095n81j168Q471q670P635p37K0771J8213N163M936J5799K1665L1277
13026H40869L3135M5611L4771J06338J28419J83036J97635J36284J9049p9404
$$ y = [364817, 409794, 446920, 502216, 567143, 574446, 603370, 577591, 481527, 438019, 429030, 413968, 393126, 386197, 397031, 403376, 399449, 383261, 392903, 409203, 453884, 470125, 465737, 470924, 461195, 450350, 420935, 413443, 406406, 426686, 424408, 427079, 407993, 420680, 476320, 511626, 503037, 480566, 501644, 525419, 535655, 561041, 589502, 622668, 662409, 740843, 857937, 1023157, 1176196, 1255285, 1283054, 1213588, 1098995, 961043, 830718, 773087, 739670, 700403, 685735, 676550, 670780, 669914, 655317, 641421, 658616, 663040, 679035, 695256, 700204, 694383, 690213, 706452, 718095, 717514, 716346, 724817, 716147, 723782, 723045, 743816, 762029, 767192, 772128, 787927, 809592, 840869, 874004, 919615, 954386, 1060724, 1189143, 1372179, 1569814, 1706098, 1725147, 1645743]
13016A645743j29652j75655j47096r0730k4582j9479M121L3229O380k0014P099
13005A089364J4333N326L8524J3891j659K4012M7474J8920M8716Q338J0238Q55
12993A318332Q861P918M8122M7700K9921q140k588L2595J9519K2271J0815L8306
12981A573632M0366M3291Q2438P6305R2628R9617P5127M3423N651o498l3729q51
12969B091400K9642N7968M3105J5740N0124P2994M9678M7146N9038L5847L4685
12958B587367M2760P1251N6793N3772Q6156Q7876J04686Q9553Q1699J00075Q9133
12947C451121J00930Q5202R2439J05780J22907J30317J38036J20243J33710J36101
12937D616786J42200J60404J61452J94554J96004J70493J44448J86787K16176
$$ y = [1645743, 1516091, 1340436, 1193340, 1102610, 1078028, 1058549, 1062670, 1095899, 1102279, 1082265, 1089364, 1103697, 1109023, 1147547, 1161438, 1159779, 1183791, 1231265, 1250185, 1298901, 1307239, 1317477, 1318332, 1327193, 1335111, 1383233, 1430933, 1460854, 1452714, 1450126, 1482721, 1502240, 1524511, 1535326, 1573632, 1613998, 1657289, 1739727, 1816032, 1908660, 2008277, 2083404, 2126827, 2132478, 2125980, 2092251, 2091400, 2121042, 2179010, 2222115, 2237855, 2287979, 2360973, 2410651, 2457797, 2516835, 2552682, 2587367, 2630127, 2701378, 2758171, 2811943, 2898099, 2985975, 3090661, 3180214, 3261913, 3361988, 3451121, 3552051, 3637253, 3729692, 3835472, 3958379, 4088696, 4226732, 4346975, 4480685, 4616786, 4758986, 4919390, 5080842, 5275396, 5471400, 5641893, 5786341, 5973128, 6189304]
12928F189304K30559K39139K21713K33443K68505K83135K54694K96304L48110
12919H564906L33399L33036L48126L46240L93177M04560M21733M52104M60833
12910A2058114M49615M71624N22982N13232N24225N58637N60630N89461O08305
12901A6856825N83945N85875N44328N35404N88530N69412N24898M67807M52170
12892B1709194M40149L87664L51093K72728J87740J58054Q9889J7529m3774j24488
12882B3445778j81557k18964k75203l25512l99508m56592m68468n10694n41483
12873B0067797n44371n52750n74451n80102n52079n59349n72104n77018n27599
12864A5027974n38841n24040m83268n06272m73956m53490m44885m34006m25918
$$ y = [6189304, 6419863, 6659002, 6880715, 7114158, 7382663, 7665798, 7920492, 8216796, 8564906, 8898305, 9231341, 9579467, 9925707, 10318884, 10723444, 11145177, 11597281, 12058114, 12507729, 12979353, 13502335, 14015567, 14539792, 15098429, 15659059, 16248520, 16856825, 17440770, 18026645, 18570973, 19106377, 19694907, 20264319, 20789217, 21257024, 21709194, 22149343, 22537007, 22888100, 23160828, 23348568, 23506622, 23596511, 23614040, 23570266, 23445778, 23264221, 23045257, 22770054, 22444542, 22045034, 21588442, 21119974, 20609280, 20067797, 19523426, 18970676, 18396225, 17816123, 17264044, 16704695, 16132591, 15555573, 15027974, 14489133, 13965093, 13481825, 12975553, 12501597, 12048107, 11603222, 11169216, 10743298]
12855A0743298m06659l80237l50765l58041l29720l20428k97447k99323k57737
12846G742941k61234k44255k51052k13010k12186k29104k24410k23406j86895
12837E697389k02497j55647j99296j70353j41855j41382j54447j18301j03606
12828D310005j17644j36752j25562j02071q9194p9545j10088j02912j01991p8375
12818C265871o8152q4728p9729o9054m7411n6530q3207q5106o1333m7944n2795
12807B529882o3536m9275n1418l1515q0131p8562k9121m6430n6972n3482n0390
12796A939050k9648l1052n1135m6330k1281k4513j6502k4733j5891j343m3967
12785A632655m9138l5402k2952k5035k6858J538q525l5504k2298n3426o2043l3823
$$ y = [10743298, 10336639, 9956402, 9605637, 9247596, 8917876, 8597448, 8300001, 8000678, 7742941, 7481707, 7237452, 6986400, 6773390, 6561204, 6332100, 6107690, 5884284, 5697389, 5494892, 5339245, 5139949, 4969596, 4827741, 4686359, 4531912, 4413611, 4310005, 4192361, 4055609, 3930047, 3827976, 3738782, 3659237, 3549149, 3446237, 3344246, 3265871, 3197719, 3112991, 3033262, 2964208, 2916797, 2860267, 2777060, 2691954, 2630621, 2582677, 2529882, 2466346, 2417071, 2365653, 2334138, 2254007, 2175445, 2146324, 2099894, 2042922, 1989440, 1939050, 1909402, 1878350, 1827215, 1780885, 1759604, 1735091, 1718589, 1693856, 1677965, 1676622, 1632655, 1583517, 1548115, 1525163, 1500128, 1473270, 1474808, 1466283, 1430779, 1408481, 1355055, 1293012, 1259189]
12773A259189j3970j393k7570j0018m381N147j215j1726l4964m7905m1966O5k0340
12760A048953k0263m650j3513k1133m531Q193r439K1101j8762k6199m3858n1056
12748H64843K306O589j9535j1278P090K0372o554k0158k996k3209k9202k4499
12736G63769M603M240j7033M668M466j5248o295l670l6411j9157J2237j4690k6382
12723F55097j5493n146N586J16J128j4144k432j7483J2108P384k4899q775R169
12710F02216K687k393K598m4883N7K1989K372P97J6716l026k159p163l507Q701
12696E95002l824m2201j7725J4995J4320J5767J986N258j4162j4113N429L5693
12684E96425J3086r164j2077j4339q273j1826L5080N975m431K1806N535R999J8342
$$ y = [1259189, 1245219, 1243826, 1216256, 1206238, 1201857, 1207004, 1205789, 1194063, 1159099, 1111194, 1069228, 1069293, 1048953, 1028690, 1024040, 1010527, 989394, 984863, 993056, 983617, 1004718, 985956, 959757, 915899, 864843, 867149, 873738, 854203, 842925, 850015, 870387, 863833, 843675, 840679, 817470, 788268, 763769, 768372, 772612, 755579, 760247, 764713, 749465, 743170, 739500, 703089, 683932, 696169, 681479, 655097, 639604, 634458, 640044, 640160, 641288, 627144, 624712, 607229, 619337, 626721, 601822, 593047, 602216, 604903, 602510, 605108, 560225, 560282, 582271, 584643, 585440, 602156, 599130, 596971, 589808, 586301, 595002, 591178, 548977, 531252, 546247, 560567, 576334, 578320, 583578, 569416, 555303, 560732, 596425, 609511, 600347, 588270, 573931, 565658, 553832, 588912, 594887, 590456, 612262, 617797, 627796, 646138]
12671F46138l1236q896K3821O085J9165L7907J0447k0192J2426R487r941J7163
12659G12374N6412L8939Q977j9448l3012k1873P420L984J1295M0457J5520m455
12647H16590m050o815l9411K2952K8334P004K613K3030K4088q799K683k2993l9221
12634H06005j2699k9834k8916l4282o475k249l4841l1985j9898k4059J7359l531
12622E94595k0236k309P461o029k1278j1993j7215l6798k1613J1207K23J9312
12610D95327L8651j0815l2004l3964n0612J4196O930Q597P225J1300k4935j1106
12598D18790j060j0411K0797J4232r173q556j2279j4911k3058j484m493K7519
12586C95913o059k8824N763L636k1760l6605j5635J3294J2298K870l0320r859
$$ y = [646138, 614902, 606006, 629827, 635912, 655077, 692984, 703431, 683239, 695665, 705152, 695211, 712374, 768786, 807725, 816702, 797254, 764242, 742369, 749789, 753773, 765068, 805525, 821045, 816590, 812540, 805725, 766314, 789266, 817600, 824604, 827217, 850247, 874335, 865536, 868219, 845226, 806005, 793306, 763472, 734556, 700274, 693799, 691550, 656709, 624724, 604826, 580767, 598126, 594595, 574359, 572050, 579511, 573482, 552204, 540211, 522996, 486198, 464585, 475792, 476015, 495327, 533978, 523163, 491159, 457195, 406583, 420779, 427709, 436306, 443531, 454831, 429896, 418790, 417730, 407319, 428116, 442348, 433175, 424619, 412340, 397429, 374371, 372887, 368394, 395913, 389854, 361030, 366793, 370429, 348669, 312064, 296429, 309723, 322021, 324891, 294571, 284712]
12574B84712K0675J8847R858r905j9k8189p87K0783K4062o573k619j5821j1978
12561C03046j6627j0220M517o617L188J018N706j5666j0607J622k025K928j976
12548B58287J9908O51k6859J5319j7778k6854n637k272k0L440M677K9567O212
12535B58641k1799j9177J668r33l564K5395Q650J2092L1596K6640p406j8162J3974
12522C07615N9840K2468k203l3056m1083n2634m1771j3409k2298R37R874j9863
12510A74417P723O849j664J5259J769j3022o802O394J0576j0202k3156J5476K2661
12497B06278j8800l2602j8763r66K2190K4470R228K898r510J6787L1138L549j3581
12484B22316J6826L426J2175N545K2098K1968J6311L0337j0559o807K8428m938
$$ y = [284712, 305387, 324234, 334092, 324187, 324168, 295979, 295192, 315975, 340037, 333464, 330845, 315024, 303046, 286419, 276199, 280716, 274099, 277287, 278305, 284011, 268345, 257738, 259360, 257335, 260263, 258287, 278195, 278846, 251987, 267306, 249528, 222674, 217037, 214765, 214745, 218185, 222862, 252429, 258641, 236842, 217665, 219333, 218400, 214836, 240231, 248881, 260973, 292569, 319209, 311803, 293641, 307615, 367455, 389923, 387720, 354664, 313581, 260947, 219176, 205767, 183469, 184406, 194280, 174417, 182140, 188989, 187325, 202584, 204353, 191331, 184529, 190923, 201499, 191297, 168141, 183617, 206278, 187478, 154876, 136113, 135147, 157337, 181807, 191035, 193933, 184423, 201210, 232348, 235897, 222316, 239142, 242568, 254743, 260288, 282386, 304354, 320665, 351002, 340443, 333636, 362064, 357126]
12472C57126n5279m3695j1696k447j8522l1814j578L239j740N408L259q627j0525
12459A83109j0014k2134j0533k616J5369J7462m90r842j2874O634k3607k5530
12447A04934p630N726J6404J3141K7189j0823k219O558M260j0088O221j4371M947
12434A44249K8921P849k1830J1091J9887K3340M006m638m2510k9604J5740j114
12422A55387J6917l4462k7374J0492P632Q427Q527N753q197M780K1684k202k8999
12409A38365l2104J3471K7675p010l038J0039j334m7131l6827J5804l537L964
12397G8337J5193M0499K2855j8471k095m0k9250L188J0383J7529k371j7326l7785
12384H0646q798K9780p402k0130r429K7614J259j5908K903N634O972j7844k8J9861
$$ y = [357126, 301847, 258152, 246456, 244009, 225487, 193673, 192095, 195334, 193594, 199002, 202261, 193634, 183109, 173095, 150961, 140428, 137812, 153181, 170643, 170153, 160311, 147437, 154071, 130464, 104934, 97304, 103030, 119434, 132575, 159764, 148941, 146722, 153280, 157540, 147452, 153673, 139302, 144249, 173170, 181019, 159189, 170280, 190167, 213507, 217513, 212875, 170365, 140761, 156501, 155387, 172304, 137842, 110468, 120960, 128592, 137019, 145546, 151299, 143102, 147882, 169566, 167364, 138365, 106261, 119732, 147407, 140397, 137359, 147398, 146064, 98933, 62106, 77910, 74373, 78337, 93530, 134029, 156884, 138413, 136318, 136278, 107028, 110216, 120599, 138128, 135757, 118431, 80646, 71848, 101628, 94226, 74096, 64667, 92281, 93540, 77632, 80535, 86169, 93141, 75297, 75269, 95130]
12370I5130R078j4229J7009o285J3590r766k7427L258J2515k7469R499N273Q299
12357H8475l131r377J9529m260j3473k744J032l3J0319k3869k3265J6788M411
12344F0402j97J6752Q12J167N340j3433K815K3777K2493k5119m1631j2027p438
12331C3713r195p4J3989J2438o264o35L633J0295K3004M479j662J5355M199j2900
12317I0375o321O47q003K0064J1817K0649o84l1089J2538j6170k1976o824k2690
12304D2333p92L422N908L5886j2451j4199j0038K679L958j1367J4416l218L422
12291E9959j1676N891J0450l59j887j6559j1342J6115J2348J2001K572j1140k936
12278F3437K9062J4131R337k700j9321k3470p775K553J5805r895J1588k4438k6252
$$ y = [95130, 104208, 89979, 106988, 100703, 114293, 104527, 77100, 80358, 92873, 65404, 74903, 80176, 88475, 85344, 75967, 95496, 91236, 77763, 75019, 76051, 76018, 86337, 62468, 39203, 55991, 60402, 60205, 76957, 77769, 78936, 84276, 70843, 73658, 97435, 119928, 94809, 53178, 41151, 33713, 24518, 24444, 38433, 50871, 44607, 43972, 47605, 57900, 80904, 85383, 83721, 99076, 103275, 90375, 84054, 84701, 76698, 96762, 108579, 129228, 128544, 97455, 109993, 93823, 71847, 65023, 42333, 41541, 44963, 50871, 86757, 74306, 60107, 50069, 52748, 56706, 45339, 59755, 56537, 59959, 48283, 54174, 64624, 64265, 62378, 45819, 34477, 50592, 62940, 74941, 77513, 66373, 63437, 92499, 106630, 115967, 113267, 93946, 70476, 62701, 65254, 81059, 71164, 82752, 58314, 32062]
12265C2062J9585P154j1869Q408P185m969r714Q771K7251Q027l653r270N371j6844
12251F7495n476K4752m89J0851Q199j0976m961j2060q985m957O383N498P060k923
12237G9411J2151K1383P32j7689r399N470q431K610J3209r959R778o182N078k0229
12223G7933j1255r953k361M895l626L033q401K0094K1286o58k3376j5545q293
12210D3773K993k3281k1855J3300P981J4560J1900M111p569N990P759K852J1275
12197G3789K197M890J4399K8342l046l0163j0624j6277r531n577k9939J1643N848
12184C5951j146Q69J3798K830k168m995l266p607m327Q689k260o266j3863J930
12170A8169J4953r624J163Q493O94o785j0112J8479M447M428J0905q349R220M882
$$ y = [32062, 51647, 58801, 46932, 55340, 62525, 57556, 47842, 56613, 83864, 91891, 88238, 78968, 84339, 67495, 62019, 86771, 86282, 97133, 105332, 94356, 89395, 77335, 68350, 63393, 69776, 75274, 82334, 79411, 91562, 112945, 113677, 95988, 86589, 92059, 83628, 86238, 99447, 89488, 99266, 93084, 98162, 77933, 66678, 56725, 54364, 59259, 55633, 58666, 50265, 70359, 91645, 90987, 67611, 52066, 43773, 46766, 23485, 1630, 14930, 22911, 37471, 49371, 53482, 45913, 51903, 59662, 62514, 73789, 75986, 80876, 95275, 123617, 120571, 90408, 79784, 63507, 53976, 48399, 18460, 30103, 35951, 34805, 35674, 49472, 52302, 50134, 45139, 41873, 34266, 29939, 38628, 36368, 30102, 16239, 18169, 33122, 23498, 24661, 33154, 33848, 27063, 16951, 35430, 39877, 44305, 55210, 46861, 56081, 60963]
12156F0963j2104m628Q050j9387j6449J3484P043J0874M381M162k5621k440J8378
12143D6706K0066m237j8823J0024K3253k040R103k2702o288L676j6387j3974J7410
12130D5787q387j2367M426K5187R719L912K2877K242m142l249p076q867O148L79
12116G6589j0672l147k0401N754J689M887q489N334l749J7339R368P569q783n906
12102F7382P414M763K7998j3354j8998k2304q626n480k957j6122j8014J1175K3425
12089C6302J2768j37N781P279m226Q234j6518j4217j3649j2721j4351P106K4488
12076B6139o280l465j120Q576L2543n00q070N026p640l7791q862R590K6860P007
12062D2013L3236Q43j6074k1438j2930j0418J6029J4878J9503M994r568n816r46
$$ y = [60963, 48859, 44231, 52281, 32894, 16445, 29929, 36972, 47846, 52227, 56389, 30768, 28328, 46706, 66772, 62535, 43712, 53736, 76989, 74949, 84052, 61350, 55062, 58738, 42351, 28377, 45787, 37400, 25033, 29459, 54646, 64365, 68277, 91154, 93396, 89254, 86005, 78929, 70062, 76210, 76589, 65917, 62770, 42369, 48123, 49812, 54699, 46210, 51544, 47795, 65134, 74502, 82071, 73288, 67382, 74796, 79559, 107557, 94203, 75205, 52901, 44275, 38795, 35838, 19716, 1702, 12877, 36302, 49070, 48933, 54714, 61993, 57767, 66001, 49483, 35266, 21617, 8896, -5455, 1651, 26139, 19859, 16394, 15274, 23850, 56393, 55893, 47823, 52849, 45209, 7418, -1444, 8146, 35006, 42013, 75249, 76092, 60018, 38580, 25650, 15232, 31261, 46139, 65642, 70636, 61068, 55252, 54306]
12049E4306J350K889J499J8003J3797n749o608J3250j6072k6013k2476n286M0920
12036F3810Q760j6833m701p076k3025J5994J3880K8066Q328J1192O297j4211l3510
12023E6971j2805l625J309R070K1594r107j3334j4817J0689K1239L5087j5562
12011H6709j5545j6453l1486j906N559K7941J4018O227m919L415L082l0273j9129
11998B7240K0409K3671l6376k7881o736K1686K4739n587J1227P450Q41R543M308
11985G4534j4704r762J4466Q910j1571o065O932q458O384J8730j183r275J2027
11972H0965j0356j6731k5177m365K8417R019l8170r620P057L7100J9029L284k3777
11959E6675j0067J369N5L3386L0528J7650j3244j3686j7665J2552j3506k6538
$$ y = [54306, 55656, 58545, 60044, 78047, 91844, 86095, 79487, 92737, 76665, 50652, 28176, 22890, 63810, 72570, 55737, 51036, 43960, 20935, 36929, 50809, 78875, 87203, 98395, 104692, 90481, 56971, 44166, 40541, 41850, 50920, 72514, 63407, 50073, 35256, 45945, 67184, 102271, 86709, 71164, 54711, 23225, 21319, 26878, 54819, 68837, 75064, 70145, 73560, 76642, 46369, 27240, 47649, 71320, 34944, 7063, 327, 22013, 46752, 41165, 52392, 59842, 60683, 70226, 74534, 59830, 50068, 64534, 73444, 61873, 55808, 62740, 54282, 60666, 79396, 78213, 68938, 80965, 70609, 53878, 28701, 24336, 52753, 61772, 23602, 13982, 21039, 58139, 77168, 80452, 56675, 46608, 47977, 48032, 81418, 111946, 129596, 116352, 102666, 85001, 97553, 84047, 57509]
11947E7509R226R260K6412p350l4373q576k1484P45j587J6157j6842J660K2606
11934E3363R419R088J8991q587j5519j408n148J2615o474J385p986m389j5205
11921D0145L213K4968K5803J0079p466J6006O895r175l041k0141j4439J7653J411
11908I1911R265J7329k3430l1889j872K976N734K928j7187l766k0909J0433K567
11895D4090R433L3776Q370r272j9570R313j911j0841k7122L352K4066Q822j2917
11882E9589K3162J670j4098p480P996J7892J2624O901n055j4017j2563p742r976
11869E8903K2629N698j613K240k2612m399K08J8808J0084M278R174p474k1665
11856G4259J8963K2021J1405j5239l550L1332j3071q964m034m018K6071L323k3768
$$ y = [57509, 66735, 75995, 102407, 95057, 60684, 52108, 30624, 31369, 29782, 45939, 29097, 30757, 53363, 62782, 71870, 90861, 82274, 66755, 65347, 60199, 72814, 66340, 67725, 59739, 55350, 40145, 43358, 68326, 94129, 104208, 96742, 112748, 119643, 110468, 107427, 87286, 72847, 90500, 91911, 101176, 118505, 95075, 63186, 61314, 64290, 70024, 72952, 55765, 51999, 31090, 41523, 44090, 53523, 87299, 95669, 86397, 66827, 76140, 74229, 63388, 36266, 39618, 63684, 72506, 59589, 82751, 84421, 70323, 62843, 70839, 88731, 101355, 108256, 103201, 89184, 76621, 68879, 58903, 81532, 87230, 85617, 87857, 65245, 60846, 61054, 79862, 89946, 94224, 103398, 95924, 74259, 93222, 115243, 126648, 111409, 107859, 139191, 126120, 117156, 113122, 109104, 135175, 138498, 114730]
11843A14730k0530R772O930o565O769j6091j6150j7251O783j0242J0081J4153
11831H2389o115N881j4884k4263R369N544o584P614K0972J4866j0751K1797r978
11818I5857k1872J6125N268p681j0373O716P430p163l48m958l0188K9295L4698
11805A12806l0370k4054j0385j7331J5533J0185J0261r887j2792J5869j7751L338
11793D5422J3954M337l401m282m518J9057K7517P407P664M600q034j2849l1979
11780F4895k8626n76K8309L3857K1835k3524k6419L950O754K1412j429p323j1147
11767H1968M25j8900n023J6534M6354P148m409J5491L851m637N557p428j8706
11754A18225K9756Q809R983L6001N1P567K2848N134J4180r353L758J6020Q921
$$ y = [114730, 94200, 103972, 110902, 104337, 111106, 95015, 78865, 61614, 68397, 58155, 68236, 82389, 76274, 82155, 67271, 43008, 52377, 57921, 51337, 58951, 79923, 94789, 84038, 105835, 95857, 73985, 90110, 95378, 87697, 77324, 84040, 91470, 84307, 83959, 79001, 48813, 78108, 112806, 82436, 58382, 47997, 30666, 46199, 56384, 66645, 56758, 43966, 59835, 42084, 45422, 59376, 63713, 60312, 56030, 51512, 70569, 98086, 105493, 113157, 117757, 109723, 96874, 64895, 36269, 35693, 64002, 97859, 119694, 96170, 69751, 73701, 80455, 101867, 100438, 93115, 81968, 82393, 63493, 58470, 75004, 121358, 128506, 124097, 139588, 143439, 138802, 144359, 136931, 118225, 147981, 156790, 166773, 202774, 202825, 210392, 233240, 238374, 252554, 243201, 246959, 262979, 271900]
11741B71900Q028K1448J7481l3060j1934j1212K0261q672p977k637k2782j3027
11729B27817j6637J5127J6766j5644p124O25J7079L8147J121J2603L4546K554
11717C26980L1876M9900M691P514J737K535L849L9634J6719L056j1165O309n4979
11704D28656j9464R66j3223j0852q896J8373m3470k7194m3793m6962J0526K8716
11692B73383M391l373k8463k0358Q953J9010J6293L832K5484L4170j2017r035
11680C12270O267J6783j9509j9363J9894p258k8983j0726R885q864l711k2836
11668B43849j7455k9296L91l706O593J0106k3824r986J4676L6k9372q698n825
11655A47489O366K1413l520o034l167j6634o181J1739N243J0637O389k198M871
$$ y = [271900, 279928, 301376, 318857, 285797, 273863, 262651, 282912, 274240, 266263, 263626, 240844, 227817, 211180, 226307, 243073, 227429, 220305, 220930, 238009, 276156, 277277, 289880, 324426, 326980, 358856, 408756, 413447, 420961, 422698, 425233, 429082, 468716, 485435, 488491, 477326, 483635, 428656, 409192, 410158, 396935, 386083, 377187, 395560, 352090, 324896, 281103, 234141, 244667, 273383, 277774, 274401, 245938, 225580, 234533, 253543, 269836, 273668, 299152, 333322, 321305, 312270, 318537, 335320, 315811, 296448, 316342, 309084, 280101, 269375, 279260, 270396, 266685, 243849, 226394, 197098, 197489, 193783, 200376, 210482, 186658, 176672, 191348, 191384, 162012, 153314, 147489, 153855, 175268, 171748, 165714, 162547, 145913, 139732, 151471, 156714, 167351, 173740, 171542, 176413]
11642A76413J1282j4289o209k5758j082J127q545l273J9113L985r047r821J4021
11629A47917K5373J9248J6528l084m0099j0636O043j7960k0781J2044K3114q013
11617A49694J1852O317j7800j5020m147J9448p807J2005Q557k4159j3889M732
11605A29783o340q797k1002j7665K8904L354j0376K0068J6944k45r526k2088J7856
11592A20870j9551R154J5507J7561K9801M816n0334k9219K044K1348K3486P068
11580A52551J371K082j7384J5449M2510K1268J968j0936N376j0269j6690m7510
11568A39786j1641M8610K2394M264j7982q696N747K3527j0726j5507M377Q962
11556A93115l014R822P861o905p583j3321N851J145J112j723j2246r519Q521J2202
$$ y = [176413, 187695, 173406, 167197, 141439, 140357, 141484, 132939, 129666, 148779, 152764, 143717, 133896, 147917, 173290, 192538, 209066, 205982, 165883, 155247, 161290, 143330, 122549, 134593, 157707, 149694, 161546, 167863, 150063, 135043, 130896, 150344, 142537, 154542, 163099, 138940, 125051, 129783, 123443, 114646, 93644, 75979, 104883, 108237, 97861, 117929, 134873, 134628, 125102, 103014, 120870, 101319, 110473, 125980, 143541, 173342, 178158, 127824, 98605, 100649, 121997, 145483, 152551, 153922, 156004, 138620, 154069, 196579, 217847, 219815, 208879, 214255, 203986, 187296, 139786, 128145, 176755, 199149, 203413, 185431, 176735, 182482, 206009, 195283, 179776, 184153, 193115, 190101, 199923, 207784, 200879, 193296, 179975, 185826, 186971, 188083, 186360, 174114, 164595, 173116, 185318]
11542A85318K7284K11k1438J3139J2926K917Q907j6496r752J4336P203O374N950
11529B36879q882l7036p260R452K172o582m601P601L3943Q376k3234k7429K756
11516A86155J5762R796L8694K6899J3875j2009k5728k8410k3593K7076J4838L685
11504B47040P711K533k4011J5857J8127J1032K095j1832l337j297j9686l0235
11492B13997J7204J3168K4443J0940K798q806p30k5459m306O738J8992N3772K0352
11479C43103l540L86K169j9485j0447J0815J2049j342r263K4330K4401J3242j8559
11466C67859q060P635O142j9110J2146n583m150K9865K4349j365J5259l322k3489
11453C98176M262q556q626O05j3479J7011l86L1370L5793J5924j2418l9364j0894
$$ y = [185318, 212602, 212813, 191375, 204514, 217440, 220357, 229264, 212768, 203016, 217352, 224555, 230929, 236879, 227997, 190961, 183701, 193153, 195325, 188743, 184142, 191743, 225686, 234062, 210828, 183399, 186155, 201917, 211713, 250407, 277306, 291181, 279172, 253444, 225034, 201441, 228517, 243355, 247040, 254751, 257284, 233273, 249130, 267257, 278289, 280384, 268552, 265215, 263918, 244232, 213997, 231201, 244369, 268812, 279752, 282550, 273744, 273014, 247555, 243249, 249987, 268979, 322751, 343103, 339563, 339949, 342118, 322633, 312186, 323001, 335050, 333708, 324445, 348775, 373176, 386418, 367859, 359799, 367434, 373576, 354466, 366612, 361029, 356879, 386744, 411093, 409728, 424987, 421665, 398176, 402438, 393882, 385256, 385861, 372382, 389393, 389007, 420377, 456170, 472094, 459676, 420312, 409418]
11440D09418K722K1740O383K0539P256K7950J6658m313p873j0166J289K1920J8869
11427E32392M129J587L987J1119J4838J3740K4362j9108r353J4450j911J3042
11415F03274M401K1756J5685J9496J5200K7232P445p895M742K200O405r116K5098
11402G35923J642Q255O4182L2848R003k489O050J8307K1219L4083N593J8517Q116
11389I61249J3557M0578M3833K5922K6237J643K6307N1786M7800M6714M9561K1735
11377A356922M4513N5262N9527O6607P7221O2825L7931L9608P4347J07638Q8719
11366B071120Q7945R1529Q4841P3549O4166O6978N6980N6180M2863M9101M9713
11355B794965N3049Q9005P1170Q4662J08756J24411J09438J31467J41813J67063
$$ y = [409418, 412140, 433880, 440263, 460802, 468058, 496008, 512666, 508353, 500480, 490314, 491603, 513523, 532392, 536521, 538108, 542095, 553214, 568052, 581792, 606154, 587046, 577693, 592143, 590232, 603274, 607675, 629431, 645116, 664612, 679812, 707044, 714489, 706594, 711336, 713536, 719941, 710825, 735923, 737565, 745820, 810002, 842850, 851853, 849364, 855414, 873721, 894940, 929023, 934616, 953133, 961249, 974806, 1015384, 1059217, 1085139, 1111376, 1113019, 1139326, 1191112, 1238912, 1285626, 1335187, 1356922, 1401435, 1456697, 1516224, 1582831, 1660052, 1722877, 1760808, 1800416, 1874763, 1982401, 2071120, 2159065, 2250594, 2335435, 2408984, 2473150, 2540128, 2597108, 2653288, 2696151, 2745252, 2794965, 2848014, 2937019, 3008189, 3092851, 3201607, 3326018, 3435456, 3566923, 3708736, 3875799]
11345C875799J84337K02963K25537K18641K56887L11242L40844L66474M15504
11336F398228M50227M99640N32693N75415O75789P48892Q60762R80364J122500
11327A2844510J301400J560734J848770K137224K530582K884869L223389L496816
11319C1828294L580602L420083K954951K164492J170696L4044j033591j844614
11311D2274957k334149k580378k546773k315157j967615j598032j163690p54784
11303B7014379l45559N4772L96624P46739J158937J552653J975905K418018K873164
11294C7845632L385892L840243M236800M510386M607729M476505M093403L363584
11286G0360174K403780J193697j34524j402994k488309l358451l951154m263730
$$ y = [3875799, 4060136, 4263099, 4488636, 4707277, 4964164, 5275406, 5616250, 5982724, 6398228, 6848455, 7348095, 7880788, 8456203, 9131992, 9880884, 10741646, 11722010, 12844510, 14145910, 15706644, 17555414, 19692638, 22223220, 25108089, 28331478, 31828294, 35408896, 38828979, 41783930, 43948422, 45119118, 45153162, 44119571, 42274957, 39940808, 37360430, 34813657, 32498500, 30530885, 28932853, 27769163, 27014379, 26668820, 26723592, 27120216, 27866955, 29025892, 30578545, 32554450, 34972468, 37845632, 41231524, 45071767, 49308567, 53818953, 58426682, 62903187, 66996590, 70360174, 72763954, 73957651, 73823127, 72420133, 69931824, 66573373, 62622219, 58358489]
11278E8358489m331835m164170l898374l551280l153066k697174k254176j803607
11270C2504807j420518j031234o78556l26541P4520M74747Q22962J181809J536460
11261C3138456J816014K048684K172770K130595J900771J443871Q40718J14665
11253D5606544o68270j481281k149828k609019k907284l004635k992011k825533
11245B6968683k647940k424961k180536j911827j674323j462195j272879j108803
11237A2285219r61966q44909p30907o34131n14267m64933m40364m08474l81765
11228F903503m05978l85799l44189k98306k81938k68647k40945k14650j58656
11219D304395j82502j66510j53426j30872j23333j11978r3604r2113n6380q4381
$$ y = [58358489, 54026654, 49862484, 45964110, 42412830, 39259764, 36562590, 34308414, 32504807, 31084289, 30053055, 29374499, 29047958, 29122478, 29597225, 30420187, 31601996, 33138456, 34954470, 37003154, 39175924, 41306519, 43207290, 44651161, 45491879, 45606544, 44938274, 43456993, 41307165, 38698146, 35790862, 32786227, 29794216, 26968683, 24320743, 21895782, 19715246, 17803419, 16129096, 14666901, 13394022, 12285219, 11323253, 10478344, 9747437, 9113306, 8599039, 8134106, 7693742, 7285268, 6903503, 6497525, 6111726, 5767537, 5469231, 5187293, 4918646, 4677701, 4463051, 4304395, 4121893, 3955383, 3801957, 3671085, 3547752, 3435774, 3342170, 3250057, 3193677, 3109296]
11209C109296o6882n3951j5876j0980k794M5375L1082J7299J3085P067j0680j00293
11197B961748j27516p7739r7081j42540j20040r9688r2352q6305o1046q0819m1038
11186A935584l0981n1778m0657n8212m1188l3313n3264k0368j948J4010N340r85
11174A622240K1060L1130L2024J114L1143J9030K5132n106m2700r3852q6079o7034
11162A488102o3909m8261n7291m8913m1894j0280j1201m5198k0199N429k855k6844
11150A116686l8796k0081q619n922j0510k7753k4297l5666O882M940n092n566
11138I46206k8125m1650j649O285l0527J9157K6689P467j3343n100j9135j3724
11126H52551P571O197j5256n788J8073J3900k0952j18J1430j9622p106m826m042
$$ y = [3109296, 3042414, 2988463, 2972587, 2961607, 2958813, 3004188, 3035270, 3052569, 3065654, 3072721, 3062041, 2961748, 2834232, 2756493, 2659412, 2516872, 2396832, 2297144, 2204792, 2118487, 2057441, 1976622, 1935584, 1904603, 1852825, 1812168, 1753956, 1712768, 1679455, 1626191, 1605823, 1603875, 1617885, 1623225, 1622240, 1643300, 1674430, 1706454, 1707568, 1738711, 1757741, 1782873, 1777767, 1735067, 1641215, 1555136, 1488102, 1424193, 1375932, 1318641, 1269728, 1227834, 1217554, 1206353, 1161155, 1140956, 1146385, 1143530, 1116686, 1077890, 1057809, 1049190, 1043268, 1032758, 1005005, 980708, 945042, 951924, 956864, 951772, 946206, 918081, 876431, 874782, 881067, 850540, 869697, 896386, 903853, 890510, 885410, 866275, 852551, 860122, 866319, 851063, 845275, 863348, 877248, 856296, 856178, 867608, 847986, 840880, 836054, 832012]
11113H32012j385j4815p83J9870j763l3736k4265J8981J0275j0134r235k696J6690
11100G99016J0378j6776n677j1109k960j0493m754P984J0977J4432R223k2002
11088G78239k8546j3393j3443p943k2515r429K151J9723K8872j6665N720J5529
11076G38300K8012J2146J1724n372r616K354K533j2724L258k9574k9493j6926
11064F94622J6422J8998O921n964K906L6857M0994k2738m3652l0448K6984L841
11052G45743j6636k1233q752R682L772j1396l355K1271J525J1689K6290l036J926
11039G57490k685j8431M100R414p416k7777p278R767K609K162j025j877J039j359
11025G18733r901J9488M79j0457j2935J7199K5116k0376j5260O939Q404K676P514
$$ y = [832012, 830627, 815812, 815029, 834899, 833136, 799400, 775135, 794116, 804391, 794257, 785022, 782326, 799016, 809394, 792618, 786941, 775832, 772872, 762379, 757625, 765609, 776586, 791018, 800241, 778239, 749693, 736300, 722857, 714914, 692399, 682970, 685121, 704844, 733716, 717051, 722771, 738300, 766312, 778458, 790182, 784810, 775194, 777548, 780081, 767357, 770615, 741041, 711548, 694622, 711044, 730042, 736963, 730999, 733905, 770762, 811756, 789018, 745366, 714918, 741902, 745743, 729107, 707874, 699122, 708804, 712576, 701180, 697825, 719096, 720621, 732310, 758600, 755564, 757490, 754805, 736374, 740474, 749888, 742472, 714695, 707417, 717184, 719793, 721955, 720930, 719053, 720092, 718733, 708832, 728320, 728799, 718342, 705407, 722606, 747722, 727346, 712086, 719025, 727429, 730105, 737619]
11012G37619J1707O973J2744j2705J3252J693p578q378k8K3021K3805J4989K0726
10999H37840K7104l281k8358k3229j434J6571J7887o207n1314J114N1343K3115
10987H61151k2932j3754j3994L8040K9418j9982j6982r291J6344J3992L1598K6974
10975I20582o866k6875k829o34l534k4436j992L1147M4490K9081k162o086J4552
10962I64438l646j3318J3429N095J2645K4147R693k4097J2870O193p700N333M428
10949A009510J1099K3065J4874n684P073j5124r950J5449J5076m710k1739J2063
10937A051002K7414L0784K3322o553n177p979J2246K2977J465k441o990J4578
10925A154648J1805J8399L7316P184j6396k4241K7625M2665J3640l191J4091J7171
$$ y = [737619, 749326, 756299, 769043, 756338, 769590, 771283, 763705, 755327, 755299, 778320, 802125, 817114, 837840, 864944, 861663, 833305, 810076, 808642, 825213, 843100, 836893, 785579, 786693, 838036, 861151, 838219, 824465, 810471, 848511, 877929, 857947, 840965, 831674, 848018, 862010, 893608, 920582, 913716, 886841, 884012, 883378, 879844, 855408, 853416, 884563, 929053, 958134, 955972, 949886, 964438, 960792, 947474, 960903, 965998, 978643, 1002790, 1012483, 988386, 1001256, 1007449, 999749, 1005082, 1009510, 1020609, 1043674, 1058548, 1052864, 1059937, 1044813, 1034863, 1050312, 1065388, 1060678, 1038939, 1051002, 1078416, 1109200, 1132522, 1125969, 1120792, 1112813, 1125059, 1148036, 1149501, 1147060, 1140070, 1154648, 1166453, 1184852, 1222168, 1229352, 1212956, 1188715, 1216340, 1259005, 1272645, 1269454, 1283545, 1300716]
10913A300716M1098Q891O024P035j0389K3520L0815J8663J140J8934j811q898
10901A435738J3225K1825J9536Q021J3992Q659K8547J4331n87L9724L5982K1513
10889A660506L5338L4069J3798K3078K5645N047O665P809K6883L9109K5331K0318
10877A923596J2857J8461j352L9104M1194K3125J6529K7276K1972L7027J2770
10866B172559M162L2575L1191M9556M9544O8163M6902J3452J9917N5543K0379
10855B563943L6018K5876J576J0254L8360K4161J898M206N594J8123M0591O4281
10843B834881K2230M966L6388L7662L3770K6887K0266M4227L1192M5555N7334
10832C195358O0907M2873M1502M4879K9765K3552L3888J5370K6110N1815L9808
$$ y = [1300716, 1341814, 1350705, 1356729, 1363764, 1353375, 1376895, 1407710, 1426373, 1427513, 1446447, 1444636, 1435738, 1448963, 1470788, 1490324, 1498345, 1512337, 1520996, 1549543, 1563874, 1563287, 1603011, 1638993, 1660506, 1695844, 1729913, 1743711, 1766789, 1792434, 1797481, 1804146, 1811955, 1838838, 1877947, 1903278, 1923596, 1936453, 1954914, 1953562, 1992666, 2033860, 2056985, 2073514, 2100790, 2122762, 2159789, 2172559, 2176721, 2209296, 2240487, 2290043, 2339587, 2407750, 2454652, 2468104, 2488021, 2543564, 2563943, 2599961, 2625837, 2627413, 2637667, 2676027, 2700188, 2702086, 2706292, 2711886, 2730009, 2770600, 2834881, 2857111, 2862077, 2898465, 2936127, 2969897, 2996784, 3017050, 3061277, 3092469, 3138024, 3195358, 3256265, 3299138, 3340640, 3385519, 3415284, 3438836, 3472724, 3488094, 3514204, 3566019, 3605827]
10821C605827K9511M4181K7515M0461N5237L5212K3979L6810P1029O2235M8546
10810D080543M0267O0911N7797J11667P4870M6283P3616O1743M6628N8402N6998
10799D769725Q2471P6174P2776Q3739Q0391O9345P8188Q1576Q1853R7441R7471
10788E671150Q9774J07623J53077J18634R6092J12620J20320J08510J59119J40611
10778F877530J08300J43881J74949J67728J86980K11905K69749L33307M63944
10769H938273M98340L98724J90063j889r6393j19528o4771K0135Q5041J28246
10759I976241J34048J66278J56027J70250J95108K42919K39327K57176K55147
10750A1792521K88567K69860K33699J99548K12253K07868K36850K45854K42180
$$ y = [3605827, 3635338, 3679519, 3707034, 3747495, 3802732, 3837944, 3861923, 3898733, 3969762, 4031997, 4080543, 4120810, 4181721, 4239518, 4351185, 4426055, 4472338, 4545954, 4607697, 4654325, 4712727, 4769725, 4852196, 4928370, 5001146, 5084885, 5165276, 5234621, 5312809, 5394385, 5476238, 5573679, 5671150, 5760924, 5868547, 6021624, 6140258, 6236350, 6348970, 6469290, 6577800, 6736919, 6877530, 6985830, 7129711, 7304660, 7472388, 7659368, 7871273, 8141022, 8474329, 8938273, 9436613, 9835337, 10025400, 10023511, 9927118, 9807590, 9742819, 9762954, 9847995, 9976241, 10110289, 10276567, 10432594, 10602844, 10797952, 11040871, 11280198, 11537374, 11792521, 12081088, 12350948, 12584647, 12784195, 12996448, 13204316, 13441166, 13687020, 13929200]
10741A3929200K45532K53774K68582K69812K90103K57397K54374K54879L02936
10732A6326589K65611K70536K70070K78423K76623K48667K52959K45964K32110
10723A8667552K24857K33819K55678K32511K21083K22105K05152J67023J68120
10714B0597900J46760J51734J92058J83383J61926J41671J47328J38454J00848
10705B1962062P7697R2319J04361P3185P5229N9357N1840K3122M9950M0835k610
10694B2607347k0078m926o235l1217l813l7756l9398q0058n1301m3761o8101q3826
10682B2136877j00752j14759j02752j07431j32952j62302j67593j89486j66038
10673B0892812j57001j53349j51385j48465j54662j44946k24929k11394k05165
$$ y = [13929200, 14174732, 14428506, 14697088, 14966900, 15257003, 15514400, 15768774, 16023653, 16326589, 16592200, 16862736, 17132806, 17411229, 17687852, 17936519, 18189478, 18435442, 18667552, 18892409, 19126228, 19381906, 19614417, 19835500, 20057605, 20262757, 20429780, 20597900, 20744660, 20896394, 21088452, 21271835, 21433761, 21575432, 21722760, 21861214, 21962062, 22039759, 22132078, 22236439, 22309624, 22384853, 22444210, 22496050, 22519172, 22569122, 22609957, 22607347, 22587269, 22582343, 22576108, 22544891, 22541078, 22503322, 22463924, 22383866, 22332565, 22288804, 22220703, 22136877, 22036125, 21921366, 21818614, 21711183, 21578231, 21415929, 21248336, 21058850, 20892812, 20735811, 20582462, 20431077, 20282612, 20127950, 19983004, 19758075, 19546681, 19341516]
10664A9341516k04409k01852k45025k28605k10958j98043k17989k32909k46281
10655A7355445k15601k45580k74316k41591k30322k13270k09398k20185k34204
10646A5270978k19524k20670k52999k48629k88986k58717k36523k13306k14440
10637A3117184k36735k23029k01001k17303k17892k02806k13050k16540j95013
10628A1193815j99156k23782k56149j73403j75990j82487j80261j65380j43850
10619I493357j55931j78220j58704j90307j73335j14313j56564j67408j23020
10610H075555j25507j38319j19622j25172j03392j06219j22675j27199j08502
10601F998948j32638j26343j02765j12027j08247j12935j33693j40614j31228
$$ y = [19341516, 19137107, 18935255, 18690230, 18461625, 18250667, 18052624, 17834635, 17601726, 17355445, 17139844, 16894264, 16619948, 16378357, 16148035, 15934765, 15725367, 15505182, 15270978, 15051454, 14830784, 14577785, 14329156, 14040170, 13781453, 13544930, 13331624, 13117184, 12880449, 12657420, 12456419, 12239116, 12021224, 11818418, 11605368, 11388828, 11193815, 10994659, 10770877, 10514728, 10341325, 10165335, 9982848, 9802587, 9637207, 9493357, 9337426, 9159206, 9000502, 8810195, 8636860, 8522547, 8365983, 8198575, 8075555, 7950048, 7811729, 7692107, 7566935, 7463543, 7357324, 7234649, 7107450, 6998948, 6866310, 6739967, 6637202, 6525175, 6416928, 6303993, 6170300, 6029686, 5898458]
10592E898458j06524q0605r1697j02479r8927r4662p2555q9830r0722m5892q1995
10581D942570j10789q0687o0015m2332p5129p3739o2166m8290r5663r2805p0991
10570D129964o8800m9268o1373o9264o9455m9586n4504m5518l2933l3440j3565
10559C582258j5467n9107q4239m8015j4963k8209l1375m8246m7948o8344k9929
10548C106416l9597n6880j0628k7306o6243l8912j749l0844n8815n9694j8077
10537B697671k762k1714k4702L942j0712o1492o3127l2733j5261j3057l3430m4710
10525B377913j5878j6343k9285l2732N32k5912l7108j2515j0161j0373m5439k4677
10513B118022j7417k3273l5471l9825n189m46N493j8920k1632l7535k6668k8970
$$ y = [5898458, 5791934, 5711329, 5619632, 5517153, 5418226, 5323564, 5251009, 5161179, 5070457, 5024565, 4942570, 4831781, 4751094, 4691079, 4648747, 4573618, 4499879, 4437713, 4389423, 4293760, 4200955, 4129964, 4061164, 4011896, 3950523, 3881259, 3811804, 3762218, 3707714, 3662196, 3629263, 3595823, 3582258, 3566791, 3507684, 3423445, 3375430, 3360467, 3332258, 3300883, 3252637, 3204689, 3136345, 3106416, 3066819, 3009939, 2999311, 2972005, 2905762, 2866850, 2865101, 2834257, 2775442, 2715748, 2697671, 2694909, 2673195, 2648493, 2652435, 2641723, 2580231, 2517104, 2484371, 2469110, 2456053, 2422623, 2377913, 2362035, 2345692, 2316407, 2283675, 2284207, 2258295, 2221187, 2208672, 2198511, 2188138, 2142699, 2118022, 2100605, 2077332, 2041861, 2002036, 1996847, 1996401, 2001894, 1982974, 1961342, 1923807, 1897139, 1868169]
10501A868169k3567l4732o846J2400P109k1730l7234j0211j2317j4201j3633r442
10489A703765k7188j6671k430j0648R789K1511n792l2763R852J7907J0155J33
10477A677620k9972m9368l3081k9624r761Q080J0194n441k5958J3558M6575L29
10465A573151j3163k7501k1820k5355l0685m0922l0731l6589j5951J492K1767
10454A353693J6592p132j0573K4859k139l7014O185j3210j2219m278m6n053O778
10441A316443O01J52l22L688n570K2683L644m3774m338L775j426M541K7926K5052
10427A353075N547K0531K4078L7907L9287M9964O4255K8699m479j8340l7811l7533
10415A525180j9846n035o369n930k1349l2905l596j5180o279L1180N4310O8149
$$ y = [1868169, 1844602, 1809870, 1803024, 1815424, 1822533, 1800803, 1763569, 1753358, 1741041, 1726840, 1713207, 1703765, 1676577, 1659906, 1657476, 1646828, 1656617, 1678128, 1672336, 1639573, 1649425, 1667332, 1677487, 1677620, 1647648, 1598280, 1565199, 1535575, 1525814, 1533894, 1544088, 1538647, 1512689, 1526247, 1572822, 1573151, 1559988, 1532487, 1510667, 1485312, 1454627, 1413705, 1382974, 1346385, 1330434, 1331926, 1353693, 1370285, 1363153, 1352580, 1377439, 1375300, 1338286, 1344471, 1331261, 1319042, 1314764, 1314718, 1309665, 1316443, 1317044, 1317196, 1316874, 1320562, 1314992, 1337675, 1341319, 1297545, 1293207, 1296982, 1295556, 1300097, 1328023, 1353075, 1358622, 1379153, 1403231, 1441138, 1480425, 1530389, 1594644, 1623343, 1618864, 1600524, 1562713, 1525180, 1505334, 1500299, 1493930, 1488000, 1466651, 1433746, 1430150, 1414970, 1408691, 1439871, 1494181, 1562330]
10403A562330N7193M0746N8055L3242K0071N638L7172L6666L8683K9660L5317
10392A954773N3079O1908O6820Q0883P8532R0668J17321J03226P9906Q5993N4728
10381B827837P5209Q8799J12576J30848J60034K29072L21872L89932M53323N82301
10371E371803P00876Q42983J068402J240181J206237R91821Q01289Q28480J115545
10362A4167617J603574K277633L130226M209494N702210P995289J1894700J8764987
10354F9745730L0671418M9178060O8340332O8061847L7404938r572974n2661653
10347B61167698o8745051n7466843l9721627k6027352j7080668j1552838q108449
10340C2464870n940115m478495l387550k492710j685484j018785o06705n43111
$$ y = [1562330, 1619523, 1660269, 1718324, 1751566, 1771637, 1777275, 1814447, 1851113, 1889796, 1919456, 1954773, 2007852, 2069760, 2136580, 2217463, 2295995, 2386663, 2503984, 2607210, 2687116, 2773109, 2827837, 2903046, 2991845, 3104421, 3235269, 3395303, 3624375, 3946247, 4336179, 4789502, 5371803, 6072679, 6915662, 7984064, 9224245, 10430482, 11422303, 12223592, 13052072, 14167617, 15771191, 18048824, 21179050, 25388544, 31090754, 39086043, 50980743, 69745730, 100417148, 149595208, 217935540, 285997387, 323402325, 313829351, 261167698, 192422647, 134955804, 95234177, 69206825, 52126157, 40573319, 32464870, 26524755, 22046260, 18658710, 16166000, 14480516, 13461731, 12855026, 12311915]
10332A2311915p59854j082263j277270j206687r82860p09543n23904m07486l57055
10323E004993l45734l41440l28655l07585k71462k19062k02501k05548j39103
10314B643903p5667m9348o6355n4915n5941o4633o2056p9864r1864p4659r1257
10303A877344r6090l7917j6750n5297n3050j7660j3762p597M307L4504j7810l7078
10291A563144k3359l5722n7479n6611m9040j5952j4190k1424m5270m4106j3871
10280A186120j5835Q496j255l2906M060j0846k3340k6434k5276K4474J1589k1119
10268A077728n275q583j3476j5252O733k3909l039Q509k656l581o880K57k402
10255A008174l0470m6073l0269k258r644r960N806L3579M7041L4566M3706O0393
$$ y = [12311915, 11552061, 10469798, 9192528, 7985841, 7002981, 6293438, 5769534, 5362048, 5004993, 4659259, 4317819, 3989164, 3681579, 3410117, 3191055, 2988554, 2783006, 2643903, 2568236, 2518888, 2452533, 2397618, 2341677, 2277044, 2214988, 2135124, 2043260, 1968601, 1877344, 1781254, 1743337, 1726587, 1671290, 1618240, 1600580, 1586818, 1579221, 1583528, 1618032, 1600222, 1563144, 1539785, 1504063, 1446584, 1389973, 1340933, 1324981, 1310791, 1289367, 1244097, 1199991, 1186120, 1170285, 1178781, 1177526, 1144620, 1148680, 1137834, 1114494, 1088060, 1062784, 1087258, 1098847, 1077728, 1072453, 1063870, 1050394, 1035142, 1041875, 1017966, 1014927, 1023436, 1020780, 1017199, 1010319, 1010576, 1008174, 977704, 931631, 901362, 899104, 889460, 879500, 885306, 918885, 965926, 1000492, 1044198, 1104591]
10243A104591K8868m8606l4905o9337n4890k8624k8836j6309l9704m2133l200
10232G66915J8783M6310K6537J9840L2747L2048m4888o1311j8957m3606n2389
10221G22029P75K3446L9113K1528M9905P3986J06771J83311L35310N66774O94832
10210B817780M69157J4350m75860o95845n51477l49519k10025j50097j06934m9767
10200G11763m3060l1385j0629J051l5361k8259p318k1405L2016M5794j424k7060
10188E84723m840r369k0457J8901j022l338r745k9735P930J3980K3954p135k0072
10175E43775r084j840j9426l4903l382l2663l7269j4539j7174K095J2877K738
10163C91205J8864J5224j8009k1833P751K0383K2053O005L7553O44j108K8067
$$ y = [1104591, 1133459, 1084853, 1049948, 980611, 925721, 897097, 868261, 851952, 812248, 770115, 766915, 785698, 832008, 858545, 878385, 911132, 943180, 898292, 836981, 818024, 774418, 722029, 722804, 746250, 785363, 806891, 856796, 930782, 1037553, 1220864, 1556174, 2122948, 2817780, 3286937, 3301287, 2825427, 2129582, 1578105, 1228586, 1018561, 868464, 761530, 711763, 668703, 637318, 626689, 627740, 592379, 564120, 556802, 535397, 567413, 613207, 611783, 584723, 579883, 570514, 550057, 568958, 567936, 564598, 554853, 525118, 533048, 547028, 570982, 563847, 543775, 534691, 532851, 513425, 478522, 475140, 442477, 405208, 390669, 373495, 375590, 388467, 391205, 410069, 425293, 407284, 385451, 393202, 413585, 435638, 441643, 479196, 479840, 478732, 506799]
10151E06799J6319l3336m5644k2759m277J7759M148j2428j0463j1272j1416l6044
10139C57386O947J0390K2866K5853L1619m45k965P770k4889k3477j5352j2383
10127C83320J8414k0169j9489K8120K2899J6352K2630J5757J4463K6856j2757
10116D96396k5696P74j6538m0316l5895J9154L390l1191p602R353J2757J7621
10104D02207J0373k7674k0374J0611M567k481j1736m944k1630k4779m119Q362
10092C18383K2735R433p255j2717j4564k262l986o165J4912j026k1601K913N382
10079C04182R901j1511j4188k099K9847j4370j5205L2739M2871K9889l770k3099
10067C65187L744q555L164K3192M165k2000j548J3504K1708K5357N8565J29287
$$ y = [506799, 523118, 489782, 444138, 421379, 417102, 434861, 439009, 426581, 416118, 404846, 393430, 357386, 364333, 374723, 397589, 423442, 455061, 454616, 451651, 459421, 434532, 411055, 395703, 383320, 401734, 381565, 362076, 390196, 413095, 429447, 452077, 467834, 482297, 509153, 496396, 470700, 471474, 454936, 414620, 378725, 397879, 401269, 370078, 362476, 371829, 384586, 402207, 412580, 384906, 364532, 375143, 379710, 377229, 365493, 360549, 338919, 314140, 310021, 318383, 341118, 350551, 343296, 330579, 316015, 313753, 309767, 303602, 318514, 317488, 295887, 298800, 304182, 314083, 302572, 288384, 286285, 316132, 301762, 286557, 319296, 362167, 392056, 388286, 365187, 368931, 360376, 363540, 386732, 390897, 368897, 367349, 380853, 402561, 427918, 486483, 615770]
10055F15770K06253L98327P29587J138907R46154K66140n49678j135308r31084
10046A685068n10171k79664j90251j31945o0912m6677J2786j1509j9482j3710
10036D33533m2808m4784m122P58J0175l117j0975j6991l2377q509J3151J7483
10024C11417k3799l8209m5605k6180l8435j3332M5971K4687j2985j0745L9010
10013B11795K7853K4276K4962J9573m8686k8300L387r565k0085N215J0791j2354
10001B08862m0652J5815J5913j3689J2448L0305N772p573Q562j0113P32p455k7155
9988A91772K3302J6270j2617k3419k3283K867N4082K9212j6892r706j0868p372
9976B13348j0440k7414r600J3463J9243P259k8879k7592l393J7417J8593n11O057
$$ y = [615770, 822023, 1220350, 1949937, 3088844, 4034998, 4301138, 3751460, 2616152, 1685068, 1174897, 895233, 704982, 573037, 512125, 465448, 478234, 466725, 447243, 433533, 390725, 345941, 341819, 342577, 352752, 349635, 338660, 321669, 289292, 280783, 293934, 311417, 287618, 249409, 203804, 177624, 139189, 125857, 171828, 196515, 183530, 172785, 211795, 239648, 263924, 288886, 308459, 259773, 231473, 234860, 225295, 205210, 210425, 221216, 208862, 168210, 184025, 199938, 186249, 198697, 229002, 234774, 227201, 235763, 225650, 226382, 218927, 191772, 215074, 231344, 218727, 195308, 172025, 174892, 228974, 258186, 241294, 231588, 220720, 213348, 202908, 175494, 165894, 179357, 198600, 205859, 176980, 149388, 145995, 163412, 182005, 181494, 187551]
9963A87551r240k685J3635j6698k4698j8801Q289K8563L6318L4723k6067J0649
9951B21539K0046p914j1224M211L0401L916j5886r703J5138K7061L887L565j8376
9938B66661O350L9534j8292J650L8007N6556P7758J00159J46075K12053K80773
9927A207284K83719J72871n774k02944k89909k51148j80202j43402r0638o6248
9917D33609p5098l6495j8982j8662N122p387l5085o6356p233J4164J1737J7384
9905B16718Q478l8808O564M196j1952j0979J6147R144J6706L2044m155J822k6510
9892B19415j7005r078j3437j64J460p746j6279n86q422L054L693J4954r122j387
9878A59350M3277J5321j533j8638k6105J7446j924K389k3577l550J8729J487L801
$$ y = [187551, 178311, 175626, 189261, 172563, 147865, 129064, 137353, 165916, 202234, 236957, 210890, 221539, 241585, 233671, 222447, 226658, 257059, 260975, 245089, 235386, 250524, 277585, 281472, 285037, 266661, 273011, 312545, 294253, 295903, 333910, 390466, 468224, 568383, 714458, 926511, 1207284, 1491003, 1663874, 1658100, 1455156, 1165247, 914099, 733897, 590495, 499857, 433609, 358511, 322016, 303034, 284372, 289494, 282107, 247022, 180666, 173433, 187597, 199334, 216718, 225196, 186388, 192952, 197148, 185196, 174217, 190364, 199508, 216214, 248258, 244103, 245925, 219415, 202410, 193332, 179895, 179731, 181191, 173445, 157166, 156580, 148158, 151212, 154905, 169859, 160737, 159350, 202627, 217948, 216415, 197777, 171672, 189118, 187194, 189583, 166006, 162456, 181185, 182672, 186473]
9865A86473K3706l1849Q416K2253o409N191K6625N955k1299k1049l5268J6489
9853A79234L905k2823M8k296N12o899j8178J3742j923M223Q391k0128k3710n504
9839A08594j0715J5637r320R926J7199j2173p181J902j4724j1001n568J3882J7565
9826A14023J0339J6462L7026r531l8112K071R694l738n146K1450m423j4611p262
9813A28242O148j9400m197J1910J7765L225J9158J9707n666r069n030l88K9033
9800A91438q265j8755p403J1572j495K4978L815k007l2829j8108q455Q444j0897
9787A32033j2160K1311L2898K2307l430j6177l6659K6837P979m3636J8266J5181
9775A64750l3257J2815j4979J2292J1459J4119R922p229j6683q626r360k0012
$$ y = [186473, 210179, 178330, 186746, 208999, 202590, 207781, 234406, 240361, 219062, 198013, 162745, 179234, 183139, 160316, 160364, 158068, 158580, 151681, 133503, 147245, 145322, 149545, 157936, 137808, 114098, 108594, 97879, 113516, 104196, 114122, 131321, 119148, 111967, 113869, 99145, 88144, 82576, 96458, 114023, 124362, 140824, 177850, 168319, 130207, 132278, 141972, 138234, 133088, 154538, 150115, 135504, 128242, 134390, 114990, 110793, 122703, 140468, 143693, 162851, 182558, 176892, 167823, 162793, 162405, 191438, 183173, 164418, 157015, 168587, 167092, 192070, 195885, 193878, 161049, 142941, 134486, 142930, 132033, 119873, 141184, 174082, 196389, 192959, 176782, 140123, 166960, 174939, 131303, 149569, 164750, 131493, 144308, 129329, 141621, 153080, 167199, 177121, 169892, 153209, 144583, 135223, 115211]
9763A15211J8078L0314j3753j3225j323N88O794j0821j626k923m693L4K8862j643
9749A49874j9696q742K9323r183O198K5273j1970k0329o461j5457Q541R811k202
9736A34980j892j0655K2449K5572J1029o600j9435l8127m69J9263K4472J6127
9724A76714J4649k2196j482m311j3824q735m047j0497p320p864P69r862J7168
9711A19162R288k2872r809m475j2999J5597O932L3055K6853P662k54l1955q972
9698A27213P679j5294j1092j2485m611j3612K0845J8170K2242j5670j6548j5149
9686I1688K4966R928l262K377K8051j30k4951M344J3759J7294J1531j9805l082
9673A52708M480J3615n438j9072O38n34l6988o952J2085L766o589j1676J3223
$$ y = [115211, 133289, 163603, 149850, 136625, 135302, 135890, 142684, 131863, 130237, 127314, 122621, 122655, 151517, 149874, 130178, 121436, 150759, 141576, 147774, 173047, 161077, 140748, 134287, 118830, 127371, 137182, 134980, 133088, 122433, 144882, 170454, 181483, 174883, 155448, 117321, 116852, 136115, 160587, 176714, 191363, 169167, 167685, 163374, 149550, 140815, 136768, 126271, 118951, 111087, 111856, 101994, 119162, 128450, 105578, 95769, 91294, 78295, 93892, 100824, 133879, 160732, 168394, 168140, 136185, 127213, 134892, 119598, 108506, 96021, 91410, 77798, 98643, 116813, 139055, 123385, 106837, 91688, 116654, 126582, 123320, 125697, 153748, 153618, 128667, 133011, 146770, 164064, 175595, 155790, 152708, 157188, 170803, 165365, 146293, 146931, 146397, 109409, 102457, 114542, 118308, 111719, 100043, 113266]
9660A13266K4103k4863J8861K862J2456J0564J2419j0746K477j0106l0098n545
9648A15650j9528Q507Q124R383J7087J5944K581m608K5780j0589k8454K1016j130
9635A59763k046q441p504k672p304J5964K5672j363j857o00r134K0641j359j4409
9621A65351k846K9474k1531l8181J7436K6292J097m226K517j6956j0992k1491
9609A25944J4858k267j0397n499L5226J0527j2678k3906J7170r57K3792K60j6484
9596A55589p768k5200L44J654J434L3301K4568q920k9702L95L7607l223n071j0182
9582A64826j1963p132M441L6408J8659R646J5768j7571j3449M387P36K791M63
9569B08010j7252R205Q357O134K4334R224l77m98j0432p339J1452J9308k71k9114
$$ y = [113266, 137369, 112506, 131367, 134229, 146685, 157249, 169668, 158922, 161399, 151293, 121195, 115650, 96122, 104629, 112753, 122136, 139223, 155167, 157748, 153140, 178920, 168331, 139877, 160893, 159763, 157717, 149276, 141772, 139100, 131796, 147760, 173432, 172069, 170212, 169612, 160478, 181119, 179760, 165351, 162505, 191979, 170448, 132267, 149703, 175995, 177092, 172866, 175383, 158427, 147435, 125944, 140802, 138535, 128138, 122639, 157865, 168392, 155714, 131808, 148978, 148021, 171813, 172073, 155589, 147821, 122621, 122965, 124619, 126053, 159354, 183922, 175002, 145300, 145695, 183302, 180079, 175008, 164826, 152863, 145731, 150172, 186580, 205239, 214885, 230653, 213082, 199633, 204020, 204756, 207547, 208010, 190758, 199963, 208320, 214454, 238788, 248012, 247635, 247137, 236705, 229366, 240818, 260126, 259855, 230741]
9555B30741m6825r790K9867K1066J8779k6052j5338K5089K3797L263J4151j362
9543B67386k648q412j2233j134N793P101J7218J3146n977j3874J2208J536k6846
9530B53264r150K7882R380o109j925K3702K4054J8963K78j7867k4686K2392J6155
9517C36333j8077j0668j2516K6213K0853K0477J1328m813K664R895L784J2209
9505C97682j1704j6244J0347P355Q521Q160J0907L700J5644L930m9436p863J8248
9492C99247L2183J7844K7166J5444L5006L567m833k1136P079K2559K5640L354
9480E63120k610L788L4354J9181k5043J9018K3587K443L2137R817J5100j466m183
9467F89243o180K4720K8988N006J5634j391P04M3931K2378l75J1954J1265K2476
$$ y = [230741, 183916, 174126, 203993, 225059, 243838, 217786, 202448, 227537, 251334, 254597, 268748, 267386, 264738, 256326, 244093, 242959, 248752, 255853, 273071, 286217, 280240, 266366, 278574, 280110, 253264, 244114, 271996, 281376, 275267, 273342, 297044, 321098, 340061, 340339, 322472, 297786, 320178, 336333, 318256, 307588, 295072, 321285, 342138, 362615, 373943, 369130, 371794, 381689, 385473, 397682, 385978, 369734, 380081, 387436, 395957, 404117, 415024, 418724, 434368, 438298, 388862, 380999, 399247, 431430, 449274, 476440, 491884, 526890, 530457, 525624, 504488, 511567, 534126, 559766, 563120, 560510, 564298, 598652, 617833, 592790, 611808, 635395, 637838, 669975, 679792, 694892, 693426, 689243, 683063, 707783, 736771, 741777, 757411, 756020, 756724, 800655, 823033, 822658, 834612, 845877, 868353]
9454H68353j0586k723K0554J5307K415O239J5229K4091K8838k638L066K3688P112
9441I98945J2171O552P570L407P527K6585R88m979o246J2884J4648J790j0128
9428A071714k8052r837j9223M287Q262K4963K6557r887m997n245l744o891j9319
9415A028588j5713n061j0060k3624l557k507q231j6525k7404k7834m115p959k7284
9402H48714k0414l733N445k7500j7986m721P050j645k9229j7560k007k4617k2508
9389F89289k789j3905K4201j9407j1296r529j3133l8296J4075k7149l7201Q55
9377E55715P726k8020l2141m576J0038j2038J026k7214Q144J1047l1073j0235
9365D48399K4643r79k1439k7239j8291q474L077R417J6529J908p122n4655o853
$$ y = [868353, 857767, 855044, 875598, 890905, 893320, 899559, 914788, 938879, 967717, 965079, 968145, 991833, 998945, 1011116, 1017668, 1025238, 1028645, 1036172, 1062757, 1063745, 1058766, 1052520, 1065404, 1080052, 1081842, 1071714, 1043662, 1033825, 1014602, 1018889, 1027151, 1052114, 1078671, 1068784, 1063787, 1058542, 1054798, 1047907, 1028588, 1012875, 1007814, 997754, 974130, 970573, 968066, 959835, 943310, 915906, 888072, 883957, 875998, 848714, 828300, 824567, 830012, 802512, 784526, 779805, 786855, 785210, 755981, 738421, 736414, 711797, 689289, 686500, 672595, 696796, 677389, 666093, 656564, 643431, 605135, 619210, 592061, 554860, 555715, 563441, 535421, 503280, 498704, 508742, 496704, 497730, 470516, 478660, 489707, 458634, 448399, 473042, 472063, 450624, 423385, 405094, 396620, 399697, 409114, 425643, 427551, 420429, 365774, 358921]
9352C58921L0151M310k9878p887j048R038q270J3754o314j2686l0638j554J014
9339C18913k7730j1674o33J2304R337L694j2346J6440k2801K764J3977K4028J766
9326C28039k5113k5827k2358l759j8494o180O084K2642L1569J6666k0007l0674
9314B52588k2565O177o357k2152j451K01N38K5623J392p02n460j0267j2930j1699
9300A92936j0057n61J9918Q332j3106j9431j2352J102J3030l027J0011j2820k1781
9287A52194J0501Q261Q848O180q016m845l909L9962K0588n915k5928k1166J8641
9274A95396j9963k5789J0619J2380j6420J220R046R250J0726N741k2100k1693
9262A48413K2650j029P658r632j3153L825k289j2474j4208k1803r886K5650K4330
$$ y = [358921, 389072, 393382, 363504, 355617, 354569, 363607, 355337, 369091, 362777, 350091, 319453, 317899, 318913, 291183, 279509, 278876, 291180, 300517, 304211, 291865, 308305, 285504, 288268, 302245, 326273, 328039, 302926, 277099, 254741, 250982, 232488, 226308, 232392, 255034, 286603, 303269, 283262, 252588, 230023, 236200, 229843, 207691, 206240, 206441, 206979, 232602, 233994, 233292, 227832, 217565, 204635, 192936, 182879, 182318, 202236, 210568, 197462, 178031, 165679, 166781, 179811, 176784, 186795, 173975, 152194, 162695, 170956, 179804, 185984, 177968, 173123, 169214, 209176, 229764, 223849, 197921, 176755, 195396, 175433, 149644, 160263, 172643, 156223, 157443, 166489, 175739, 186465, 192206, 170106, 148413, 171063, 170034, 177692, 168060, 154907, 158732, 156443, 143969, 129761, 107958, 98072, 123722, 148052]
9249A48052J4298l3407m2175J3368L7668j3481p687L494j4809K6567K1994k3756
9237A30126o452M363l5657m693O388k1898k1275J5552M4827L1196j2081l9041
9225I1355k453r48J2172J4116j0883J4305J5970O491p412k7200l4940j2037J8585
9212G7121K657p274L8408J5251j4265j4742L806N127J1257k3721n1465J9083j9268
9199D1975J0840N503M977P854n172j9351K6129J4109K7526l966K1110n449L071
9186A29156j8836j9168J4487K3084R876N162k611J9244j0532j7466j7320P048
9174A22124j8817j0133p643M1159L4869r437j0195k3105m181o520j6923k4142
9162F7056J1436J6331J0619Q199Q584k276L90j0834R13j2097J5005o134n937P081
$$ y = [148052, 162350, 128943, 86768, 100136, 137804, 124323, 116636, 120130, 105321, 131888, 153882, 130126, 123674, 128037, 92380, 87687, 94075, 72177, 50902, 66454, 111281, 142477, 130396, 91355, 88902, 87954, 100126, 114242, 103359, 117664, 133634, 140125, 132713, 105513, 70573, 58536, 77121, 79778, 72504, 110912, 126163, 111898, 97156, 100962, 106089, 117346, 93625, 42160, 61243, 41975, 52815, 58318, 63295, 71149, 65977, 46626, 72755, 86864, 114390, 110424, 131534, 126085, 129156, 110320, 91152, 105639, 128723, 138599, 143761, 141150, 160394, 149862, 132396, 115076, 122124, 103307, 93174, 85531, 126690, 161559, 152122, 141927, 118822, 114641, 108121, 91198, 67056, 78492, 94823, 105442, 113641, 122225, 119949, 120339, 109505, 110418, 98321, 113326, 107192, 101255, 108336]
9148A08336P782L965l599K25j4550m843K3429k088l0271l7994j0296N8848J0948
9135A09892Q1n51l0563p710j5994J5619K8823K4953J0757j3423k0376j2008r323
9122H0177R847K3199k7520k7612N67O187L103L2392j2925j7185j3881M64q720
9109D8093J6336Q234P11J2282j5336K1400K0198J4863J3167j2304m0669k9501
9097E7474O746K1838L126j2152j0700m699J2653j3087k8527N686N5093L3768J876
9084A29095j7574k2455l0998R40o169j2778k731Q081L1405N849j8821J0630Q054
9071H2528r296j2151J158j255k0043k0121J8046J604o937j2906j0493j239K2321
9058C1216J9817J7551J2869J5507p518j0892j7487o132o522R820j5434k0484R459
$$ y = [108336, 116118, 120083, 116484, 116709, 102159, 97316, 120745, 118657, 88386, 50392, 40096, 98944, 109892, 109973, 109422, 78859, 71149, 55155, 70774, 99597, 124550, 135307, 121884, 101508, 89500, 80177, 90024, 113223, 85703, 58091, 58658, 64845, 67948, 100340, 87415, 70230, 56349, 56813, 48093, 64429, 72663, 73374, 85656, 70320, 91720, 111918, 126781, 139948, 127644, 86975, 57474, 64220, 86058, 89184, 77032, 66332, 61633, 74286, 61199, 32672, 38358, 93451, 127219, 129095, 111521, 89066, 58068, 59008, 52839, 40061, 37330, 45411, 76816, 82665, 63844, 74474, 82528, 73232, 61081, 62239, 60984, 40941, 20820, 38866, 40470, 33533, 20627, 10134, 8895, 31216, 51033, 68584, 81453, 96960, 89442, 78550, 61063, 54931, 48409, 58229, 42795, 22311, 31770]
9045C1770K4435J438k1855q211J8118P359P609j521Q048j6745m045L0734Q626
9032H5760L851l6363j7475J9227j1112L524R09j4050K629K4490O681K0608J1411
9019A00090l394k711l19O583r377m4423J0793P008M068l9518P630L1828k929o116
9005E9213k2456j0148L6720L5407O292l5399k0540r477J5233J5769n485j7088
8993D8041N056K773r22j7965O378K0626P448j1097o630L1993J646m739k1225q31
8979F0552m575j5166J4267R861O483R283J7820K119K0326k3562l548m649K383
8966I1594R526O918j5621q982K0334n172j9982o964j5144k3274L454L9268J2402
8953H8357q253O419P206j2529K6913n604k2198j9382J0688J8333j7669J7884Q825
$$ y = [31770, 56205, 57643, 35788, 27577, 45695, 53054, 60663, 59142, 67190, 50445, 46400, 77134, 85760, 89611, 53248, 35773, 55000, 43888, 47412, 48321, 34271, 36900, 61390, 68071, 88679, 100090, 96696, 93985, 93666, 100249, 90872, 46449, 57242, 64250, 68318, 28800, 36430, 68258, 65329, 59213, 36757, 26609, 63329, 98736, 105028, 69629, 49089, 39612, 54845, 70614, 65129, 48041, 53097, 55870, 54948, 36983, 43361, 63987, 71435, 60338, 53708, 85701, 87347, 82608, 61383, 60552, 55977, 40811, 55078, 64939, 71422, 80705, 98525, 100644, 120970, 97408, 93860, 89211, 91594, 101120, 108038, 92417, 83435, 103769, 98597, 78615, 71651, 56507, 33233, 36687, 75955, 88357, 80104, 86523, 93729, 81200, 108113, 102509, 80311, 60929, 71617, 89950, 72281, 90165, 98990]
8940I8990p264k6464J7271K1730L4381J2676J0844K8117M9035L9219K1757M0483
8928C40775P6762J27281J89429J89099J02357n9046j81493k07101j62096j02337
8918C13630n9374j7715j0039l7746k4425k681L89j145j7945k9630j5836k4472
8906G3011r021J3013O317o518M634J507k2350l012J8842o220O516M541K4057J9492
8892A24809K67L462J9317K7813K6875N8395O9206Q4197J57812K46504L82272M52235
8880A653164K60185m7601l23087m38738l42073k43151j22005p2850q2636n6664
8870A84544L06n201r030L330m005l5067r880O041J2212l974k3937J224J894l7633
8856H0824k0891J5314j2651k62J9713J2254k708O476J7230r237L566J1461J8200
$$ y = [98990, 91726, 65262, 82533, 104263, 138644, 151320, 162164, 190281, 239316, 278535, 300292, 340775, 417537, 544818, 734247, 923346, 1025703, 966657, 785164, 578063, 415967, 313630, 254256, 236541, 226502, 188756, 164331, 161650, 162039, 160894, 142949, 113319, 97483, 73011, 63990, 77003, 83320, 76802, 81436, 82943, 60593, 57581, 76423, 70203, 76719, 81260, 105317, 124809, 125076, 128538, 147855, 175668, 202543, 260938, 330144, 414341, 572153, 818657, 1200929, 1653164, 1913349, 1865748, 1542661, 1103923, 761850, 518699, 396694, 323844, 241208, 184544, 184850, 179649, 170619, 173949, 169944, 134877, 124997, 131038, 143250, 139276, 115339, 116563, 118457, 80824, 59933, 75247, 62596, 62334, 82047, 94301, 91593, 98069, 115299, 106062, 109628, 121089, 139289]
8843A39289K5692L1424N3456N3006P9404J77677K41067J79479K8038j25007k29130
8832F54395k10595j09333n7259q8989p7065l3110O870k020O089N082j8941j6166
8820E8958p847K2272K3597q419J0582j7335k4615J906R004M048J5095j2120j6132
8807E8994J2911j2463j6224p630J0228o485L79Q011J8474J2811J3749p608j6570
8794F8577J8908L6142K7991N989J553j4653k8648j1750L509j1178P844P321j0050
8781A01555k6523k2520P153N675J1664R056l555q201n365o260K099K5017j8346
8768G1449j3454m946j9581m388O160J2003m294k7420n13o132N280K8178J6060
8755E8402j4383J1804J3759O195l4759j6868J7784L8821K8659Q992m1343o998
$$ y = [139289, 164981, 196405, 249861, 302867, 382271, 559948, 801015, 980494, 1008532, 883525, 654395, 443800, 334467, 277208, 188219, 111154, 78044, 84914, 82894, 88983, 94065, 75124, 58958, 51111, 73383, 96980, 88561, 99143, 81808, 57193, 59099, 68103, 72151, 87246, 75126, 58994, 71905, 59442, 43218, 35588, 45816, 39331, 39710, 47721, 66195, 79006, 92755, 85147, 68577, 87485, 123627, 151618, 157607, 159160, 144507, 115859, 104109, 107618, 96440, 104284, 111605, 101555, 75032, 52512, 59665, 65340, 77004, 86060, 82505, 74304, 68939, 62679, 64778, 89795, 71449, 57995, 53049, 33468, 29080, 35240, 47243, 42949, 15529, 15016, 8884, 14164, 42342, 58402, 44019, 55823, 69582, 75777, 41018, 24150, 41934, 80755, 109414, 118406, 77063, 70065]
8743G0065J5070l454j5996J1254j5391j7084q193m693J0568K7745K287k5386j7540
8730B9252O65M913K2540j9154l1031P358K5896R239J4997J6784n297k8773k5141
8717B2248J3820J9216P367j6105k2459L2j2256Q708K7563J1113j3859j0068M321
8704C9641J923N952L571l3172K182J2955P134L932J7765L337N696L4388L714m1454
8690F7564m2678q670R288Q762r138N118K0262q689l368j130J2298j1137M591J828
8676D4901k1911m78K772J240n019J6297K4076J1173j7320j133k1475j246j2574
8663A9303P786N348o790j2548J4166J1068m473m74J3427J1836n664j3765N201
8650D4421K6039K6103J4804L548q318k8510j8026q785l8327O28K8629K5923j7121
$$ y = [70065, 85135, 81681, 65685, 76939, 61548, 44464, 36271, 31578, 42146, 69891, 72178, 46792, 29252, 29917, 34830, 57370, 38216, 7185, 14543, 40439, 49678, 64675, 81459, 76162, 47389, 22248, 36068, 55284, 62651, 46546, 24087, 24119, 11863, 20571, 48134, 59247, 45388, 35320, 39641, 41564, 47516, 51087, 17915, 20097, 33052, 40186, 44118, 61883, 65220, 70916, 105304, 109018, 67564, 24886, 16216, 25504, 34266, 25128, 30246, 50508, 41819, 38451, 37321, 49619, 38482, 43073, 44901, 22990, 22512, 25284, 26524, 21505, 37802, 61878, 73051, 55731, 54598, 33123, 31877, 19303, 27089, 32437, 25647, 13099, 27265, 38333, 33860, 33386, 46813, 58649, 52985, 39220, 44421, 70460, 96563, 111367, 114915, 106597, 78087, 60061, 51276, 12949, 13577, 42206, 68129, 51008]
8637E1008m759n844m673o490K6194J7939j4156j8510K0338J1060r792k936M9768
8624A09147O6523P6595N6170J1946m7686n7824n0249l4522j4901j0328r548O902
8612A02225r851k1044K2040L3318J4465j4913k8450r225K2903O634K3278K222
8600A43602k0042l1675o096J1013p17J0839L179N50n7297j5371K2069L044K788
8587F5886J3520J4271j2581J9096J6376R175M3606P9001J14773J07221O3658R250
8575E43252r6055j38753j06353n2815r474l54p23k9032k2018r059j1027P567k4404
8562E0752k4045q349J4413M4645J1879l3210j0414Q115K755k0649j1839j373j6873
8549E807N77J9018J6449P250J166N477J2254p682j9313J3716l201K1164P1513
$$ y = [51008, 46249, 40405, 35732, 29242, 55436, 73375, 59219, 40709, 61047, 72107, 62315, 59379, 109147, 175670, 252265, 308435, 320381, 272695, 214871, 164622, 130100, 115199, 104871, 95323, 102225, 92374, 71330, 93370, 126688, 141153, 126240, 97790, 88565, 111468, 118102, 141380, 143602, 123560, 91885, 85789, 96802, 96085, 106924, 110103, 110653, 53356, 37985, 60054, 63098, 65886, 79406, 93677, 81096, 100192, 116568, 125743, 169349, 248350, 363123, 470344, 534002, 543252, 447197, 308444, 202091, 149276, 139802, 139448, 138725, 109693, 87675, 78616, 67589, 75156, 50752, 26707, 18358, 32771, 77416, 89295, 56085, 45671, 53786, 56541, 35892, 24053, 22680, 5807, 6384, 25402, 41851, 49101, 50267, 55744, 67998, 60316, 41003, 54719, 51518, 72682, 144195]
8536A44195L4641M4088N6696M7022P910l8268j05182p2084r156j9926j4802k0119
8524E5015j9327j7242q414J4942J7779l0638K5228J3532j1456m436j877r60k7291
8511D855K0963K4665j5432k4346l150L436K2714M2839j517r009J2518J1842p71
8498H9607k7851k118j260k9747j1710n40R296k259k6973P816J9283J1729k785
8485C2488O351N144k6353r780J6266J8523r441j437O395j955k503j2124J5753
8472C7327J0432k7294J2192l274j7110q242Q940J5649M987j768j1779M6993j074
8459F5979k7256k1296P368K7941j385R98P444k2744k5437K1718J5255J2305J7602
8446G8492j3412k0349j1488J1046L121j6346j6229O694j2200J805j7547O149J1422
$$ y = [144195, 178836, 222924, 279620, 326642, 334552, 296284, 191102, 119018, 109862, 89936, 75134, 55015, 35688, 18446, 10032, 24974, 42753, 12115, 37343, 50875, 39419, 34983, 33106, 32146, 4855, 25818, 50483, 35051, 10705, 7555, 10991, 33705, 76544, 75027, 66018, 78536, 90378, 89607, 61756, 59638, 58378, 28631, 16921, 16381, 25677, 23418, -3555, 4261, 23544, 35273, 32488, 38839, 43983, 17630, 7850, 24116, 42639, 33198, 31761, 38156, 36201, 33698, 21574, 37327, 47759, 20465, 32657, 29383, 12273, 4031, 12971, 28620, 33607, 31839, 20060, 67053, 65979, 38723, 17427, 24795, 52736, 51351, 52349, 59793, 37049, 11612, 33330, 48585, 60890, 78492, 65080, 44731, 33243, 44289, 47410, 31064, 14835, 21529, 9329, 11134, -6413, -264, 11158]
8433A1158L317l318P988m051k707K1710j5935j0798J7610J1428j1953k7788k887
8420f226n726k0447R281J9922J9284J0074M778J3428M744J086o399J5371J6549
8407G5719j6335k2081O523j0204k6214N628j3807O760M08K837J938r198q059j2552
8393a8637J3972K6991P782J2444j3315k9672j531p061J7327j46k0367L0808K0057
8380C8652J8008P189J3725K291q073n649N45l430o773l778l9541m711m108J684
8366F031J1451M476N397L181j1646j4623M2063k3230l0955J9336K7289K0718j2498
8353D6990l0446k1783j6626L1736K0791K4191O663m484j4449k877k5597k2237
8341h128K2374M918K7184R179k4366j1307M4436M3511J8907J7335j3988m1898
$$ y = [11158, 14475, 11157, 19145, 15094, 12387, 34097, 18162, 7364, 24974, 36402, 24449, -3339, -6226, -11952, -32399, -23118, -3196, 16088, 26162, 30940, 44368, 49112, 50198, 43799, 59170, 75719, 59384, 37303, 43826, 33622, 7408, 13036, -771, 5989, 6397, 9234, 11172, 1974, -6085, -18637, -4665, 22326, 30108, 42552, 29237, -435, -1966, -9027, 8300, 8154, -12213, 18595, 38652, 56660, 63849, 77574, 79865, 71792, 66143, 66688, 63258, 56485, 52707, 13166, 8455, 4347, 6031, 17482, 21958, 27355, 30536, 18890, 4267, 46330, 23100, -7855, 11481, 38770, 59488, 46990, 16544, -5239, -21865, 9871, 30662, 54853, 61516, 57032, 42583, 39706, 14109, -8128, 14246, 19164, 46348, 55527, 31161, 19854, 64290, 107801, 126708, 144043, 130055, 88157]
8329H8157l9016l1153n618n198K798k92n925o831n442j7644J1570P46J8482m79
8315D155j6277K6602J0784j8872M231k4577J4068J628j2859Q563J6497J3842k245
8302B5540R704L8104Q067M216k0878m2317L42l918R50n015k856r717L9742M9784
8288I1748L0096j118q954k3030l1232k6894j2640J2864M43J856N510M303k0102
8275B2850N830m970J943R013l621o355p64k715K4806L932K4694o035o551K50j3012
8260D9295k4566k0625N52R237J419R547k1465R428J4269l2461j1673j0817J6702
8247a1158R446n269j988P944o690K4442%o833J9421J5828k442q031j1438l2285
8233i053J8217K9420M412K3700L209q332j5991j6117j6207l329j1366N603O102
$$ y = [88157, 49141, 17988, 12370, 7172, 9970, 9678, 3753, -3078, -8520, -26164, -14594, -13848, 4634, 4155, -12122, 14480, 25264, 6392, 10623, -13954, 114, 1742, -11117, -2554, 13943, 27785, 25540, 35244, 73348, 81415, 85631, 64753, 22436, 22778, 18860, 19810, 14795, 11939, 2222, 41964, 91748, 121844, 120726, 111772, 88742, 57510, 30616, 17976, 30840, 31283, 33139, 38649, 42952, 22850, 28680, 23710, 25653, 34666, 31045, 24690, 23926, 21211, 46017, 49949, 74643, 68608, 62057, 62307, 49295, 24729, 4104, 4656, 13893, 15312, 24859, 3394, 12822, 27091, -5370, -17043, -27860, -11158, -1712, -6981, -8969, -1025, -7715, 16727, 16727, 9894, 29315, 45143, 42701, 34670, 23232, -9053, 9164, 38584, 42996, 66696, 69905, 61573, 45582, 29465, 13258, 9929, -1437, 4166, 10268]
8220A0268J7082r679p984k5805L514p702r263j800L9996K0934l274j2434k6565
8207a2712J6674j8123k0196R946K8571J010J3848R925N092o706J0314k1261j8354
8194a972j573q237L055Q770q680m1362o985K8853K5519P829J2544M686L137k6137
8180e53q938J3606Q579q396J829P934M65J1003K2048K1421j159j8978k2865n687
8166B0309O763J108J2675j7566j9078j5886k363J2762J6198M198P163P681J1154
8153D5118j4965l5406q163L519q85J3906J1372K7613P760j3634m1921j2513K1199
8140C000O460M430J8548r159j3390r735j9910Q330M477j4043J8507j944j3804
8127a8233q725K245j188J1404Q937J5247K5283j7709l0252P093K4104K6438j4467
$$ y = [10268, 27350, 17671, 9687, -16118, -12604, -20306, -29569, -31369, 8627, 29561, 26287, 13853, -12712, 3962, -14161, -34357, -24411, 4160, 5170, 19018, 28943, 34035, 27329, 37643, 16382, -1972, -3545, -11782, -8727, 43, -8637, -49999, -56984, -28131, -2612, 5217, 17761, 22447, 25584, -553, -9491, 4115, 12694, 4298, 6127, 14061, 14526, 25529, 47577, 68998, 67839, 48861, 25996, 20309, 27072, 28180, 40855, 23289, 4211, -11675, -14038, -1276, 14922, 19120, 26283, 33964, 45118, 30153, -5253, -13416, -9897, -10782, 3124, 14496, 42109, 49869, 36235, -5686, -18199, 3000, 9460, 13890, 32438, 23279, 9889, 154, -19756, -11426, -6949, -20992, -2485, -4429, -18233, -26958, -24713, -25901, -14497, -5560, 9687, 34970, 17261, -12991, -5898, 18206, 44644, 30177]
8114C0177j1388j7707R704P218j8029q577K1249J0075q810P463l5119K0401J5902
8101B2559J6728J3122P498k108j5572l0225J5317o168j7595M634o967P049J3050
8088B1322J4466j9737P200p932j7635j902R448j3380m4885K5075L0216k5470j6120
8075c9334L4268K9047r275J4172O721N926J8909j0855r201K929j7128j9984j9941
8062a3746j5987Q961R927J4456J5821M868l6082L552K5882j2235k148j097J9198
8049B1370o195O498J470j744n331p223J8970k7806r5L811J5092j4320k0634J0510
8035e627j5841l563N102m739K3873M3389Q658j0310J8934J3028k5762l3671k309
8022A1162p685k8578L0200M0306J8857k013j1715N399j3566j2553j5978n555l1
$$ y = [30177, 18789, 1082, 10786, 18004, -25, -8602, 12647, 22722, 13912, 21375, -13744, 6657, 22559, 39287, 52409, 59907, 57799, 42227, 12002, 27319, 21151, 3556, 8190, 1223, 8272, 21322, 35788, 16051, 23251, 15319, -2316, -4218, 5230, -8150, -53035, -27960, 2256, -23214, -39334, -5066, 23981, 14706, 28878, 35599, 41525, 60434, 49579, 40378, 43307, 26179, 6195, -13746, -29733, -20772, -10845, 3611, 19432, 24300, -11782, -8230, 17652, 5417, 3269, 2172, 21370, 15175, 21673, 23143, 21399, 16068, 8845, 27815, 9, -86, 3725, 18817, 4497, -16137, -5627, -21468, -25031, -19929, -24668, -795, 42594, 51252, 40942, 59876, 72904, 47142, 13471, 11162, 3477, -25101, 5099, 45405, 64262, 62249, 50534, 55933, 42367, 29814, 13836, 8281, 8250]
8009H250K4413J8917K655j4101j2935p187L1403P219k293m50m622k3190j8951
7996I128N549R090k635j682j845j6538k3493O462O657j486j5605K9015J9876j6870
7982E623j7160j501L4101m730l0689k612J9889K2230O770M9851Q933k4000j9588
7969D7117L481m4450K3874L1821j8158n182L0455j9634l5737n661l142J3340k492
7956A5632J7776l025k6777K1812J7312r624J2019q992L1693j9613j9533q525O111
7943B6266K1054j493O609n048j3254k3354m541K1874J3920j9508J0830P865q924
7930C2296m024J9139j0312M727j320J3726j4831r453j4318J2382L3940j4495l1888
7917A5569j7558N375J3835j2341L388K1200L4600O624j317R47L212m367P490k0799
$$ y = [8250, 32663, 51580, 54235, 40134, 27199, 20012, 51415, 58634, 56341, 55891, 51269, 28079, 9128, 14677, 23767, 21132, 19450, 17605, 1067, -22426, -15964, -9307, -10793, -26398, 2617, 22493, 5623, -11537, -13038, 21063, 16333, -14356, -16968, 2921, 25151, 31921, 81772, 90705, 66705, 47117, 50598, 6148, 30022, 61843, 43685, 38503, 68958, 49324, 13587, 7926, 4784, 18124, 15632, 33408, 30383, 3606, 25418, 42730, 33106, 45125, 36133, 67826, 48213, 28680, 20155, 26266, 47320, 45827, 52436, 47388, 34134, 10780, 6239, 28113, 42033, 22525, 33355, 41220, 32296, 28272, 47411, 37099, 41826, 40506, 54232, 39401, 29948, 15630, 28012, 61952, 47457, 15569, -1989, 3386, 17221, 4880, 8268, 29468, 64068, 70692, 69375, 70322, 73534, 69167, 76657, 55858]
7903E5858m0091j1113J3439M525J366P208J4691K7242l2197j9584R945j2300m183
7890A4806j2984J1624j3651M445o97j021l350K073J4552L87J953J089O028j6784
7876H470m206J5312P007j2718j3294k1917J3497J8493R640l3033k9299j9686R955
7863e1779K6337R175R17j6989j6260J6626J3487L793J8719o969p063J8874L2754
7850D1622p460p76l152p048k848J8077N118K802J939K9541j2724j7076k3982M757
7836B8790q819J3482J2465j295j4227j6077m803o52o546q135L4907r249j5876
7823C965P312J7211j8505N706p25j4518n095N18m070j7477o224K885q959O998
7809c0978J8688K6097J2792N677J365j7915q468Q208K3463j8401l4995j5372L7616
$$ y = [55858, 15767, 4654, 18093, 22618, 23984, 31192, 45883, 73125, 40928, 21344, 31289, 18989, 14806, 1822, 13446, -205, 4240, 3543, 2522, -828, 1245, 15797, 16184, 18137, 19226, 25254, 8470, 4264, 19576, 26583, 13865, 571, -21346, -7849, 10644, 20284, -12749, -42048, -61734, -51779, -25442, -16267, -15350, -32339, -48599, -31973, -18486, -14693, 4026, -2943, -10006, 8868, 41622, 34162, 33386, 30234, 23186, 20338, 38415, 43533, 46335, 48274, 77815, 65091, 48015, 24033, 28790, 19971, 33453, 45918, 44623, 30396, 14319, 9516, 8864, 2318, -5817, 29090, 19841, 3965, 11277, 28488, 9983, 15689, 14964, 446, -4649, -4131, -8201, -25678, -31902, -29017, -37976, -30978, -12290, 13807, 26599, 32276, 33641, 15726, 7258, 15466, 38929, 20528, -14467, -29839, 7777]
7796G777K6761r579P911N65r898j2410q484L141J4114k949q635J3818P246j3021
7782A6357P076J9600J3770j1363k4099j4675n707m0911J8593L6562M364N16q827
7769A1256K7811K6849j6981l2865j9274j6007J2577K6327J8400l576r950k6063
7757a496J5592P891K854l691O59N232k2776l300L383k0160l316J6098P633k2637
7743a8034L377p7j232M0233J6830j3415J6114n166K290k6015j0900j1235j6643
7730b3873j0881j3524Q832M809K2732J0795j4041K8431m519j0020j4956j8528
7718c4743j18L6244K3586J5335J1521j6185j6566k2319K082K075m601j547J5091
7705I855p763m2427n680K3299M2616J9030m373k4203j2948r2L063j1558p897P272
$$ y = [7777, 34538, 24959, 32870, 33435, 23537, 11127, 2643, 5784, 19898, 16949, 8314, 22132, 29378, 16357, 23433, 43033, 56803, 45440, 21341, 6666, 959, -39952, -21359, 15203, 19567, 20083, 11256, 39067, 65916, 48935, 16070, -3204, -19211, -6634, 19693, 38093, 34517, 24567, -1496, 14096, 21987, 24841, 21150, 21809, 27041, 4265, 965, 4348, -15812, -19128, -3030, 4603, -18034, -14657, -14734, -15966, 24267, 41097, 27682, 43796, 38630, 40920, 14905, 4005, -7230, -23873, -34754, -48278, -39446, -34637, -11905, -1110, -15151, 13280, 8761, -1259, -16215, -34743, -34861, 1383, 24969, 40304, 51825, 35640, 19074, -3245, -1163, 912, -3689, -5236, 9855, 2092, -40335, -46015, -22716, 19900, 38930, 34557, 10354, -2594, -2686, 377, -11181, -19078, -11806]
7691a1806J6303J2197K821K3803K7090p992k6370O411J9542l6440l6596n705j9855
7678c6597q6L633K4428K8731r559k5412j942K2083R188j867j2888p279P114P564
7664G111K4738P714j9337k4767j266J8433k605j5170j183q810j676K8261K3044
7651C4487j6208j6607Q731J8756M944j219k6324k8769l4m5J7016L0914o910O758
7637B5490n40O434K980O04j4376j8404j1658J3468N644j7091N09K2987Q932J3542
7623C8521j8207j5502j2489O094J4985J9347k0934l173J150K318R897q172o525
7610G310J9469P191l0354m512Q944k7207j9147J4897J4149J5351K878Q716K2555
7597D0240j6415P460L7015O2l9733k3317j804l0790J1826L0167J5248P611O280
$$ y = [-11806, 4497, 16694, 19515, 43318, 70408, 62416, 36046, 42457, 61999, 25559, -11037, -16742, -36597, -36683, -33050, -8622, 20109, 10550, -14862, -16804, 5279, 14467, 12600, -288, -7567, -453, 7111, 31849, 39563, 20226, -4541, -5807, 12626, 10021, -5149, -6332, -15142, -16818, 11443, 34487, 18279, 1672, 10403, 29159, 34103, 32884, 6560, -22209, -22243, -22288, -5272, 25642, 18732, 25490, 24950, 31384, 34364, 34968, 20592, 2188, -9470, 3998, 9642, -7449, -6940, 16047, 24979, 38521, 20314, 4812, -7677, -1583, 13402, 32749, 11815, 8642, 9792, 12110, 22007, 13835, 7310, 26779, 33970, 3616, -896, 8048, -19159, -38306, -23409, -9260, 6091, 8969, 17685, 40240, 23825, 31285, 68300, 68362, 28629, 5312, 3508, -27282, -15456, 14711, 29959, 37570, 43850]
7584D3850j3361n137n786l632L0701L1061k6190j5130j5550o812k2342J2556m432
7571b04j2034P917j4982M747J4068k7144J4498m581J2428K0772k2395l0629k4564
7558f2103k21J0750K005J9222K7375k3466p644Q352J1856K0564K6141O139k5186
7545A3784k149K0187j6202j2469j129P071j2240k8998K060O427J9601M6j0688
7532a4699k3243J194R842K629l94O110k936j693k2201P354j3053J0716N176J3648
7518b1550k0267j4918J4839P904k806J6921j350K0429o176J3761l6045k0044K8876
7505b0426K0365p08J8392m896o942R87K464p401O327j1200J722K0842j3206P766
7491A4086O244J5883j9998L898j0828j5725r771p924N250k547J5590J3688R880
$$ y = [43850, 30489, 25352, 19566, 15934, 46635, 77696, 51506, 36376, 20826, 14014, -8328, 4228, -204, -12238, -4321, -19303, -14556, -488, -27632, -13134, -17715, -5287, 15485, -6910, -37539, -62103, -62324, -51574, -49569, -30347, -2972, -26438, -34082, -25730, -13874, 6690, 32831, 38970, 13784, 11635, 31822, 15620, 3151, 2022, 9093, -3147, -32145, -30085, -23658, -4057, -4011, -14699, -37942, -36748, -26906, -24277, -24671, -18561, -21497, -23190, -45391, -38037, -51090, -40374, -35198, -21550, -41817, -56735, -41896, -33992, -36798, -19877, -21227, -798, -6974, 6787, -29258, -49302, -20426, -61, -769, 17623, 12727, 5785, 6772, 9236, 1835, 8162, -3038, -1316, 19526, 6320, 14086, 20330, 36213, 16215, 20113, 9285, -6440, -16211, -24135, -18885, -21432, -5842, 7846, 17726]
7478A7726K0160M756k6353q944M933l763J4700N00P86m851J0853j6738k1314k3332
7464c0881K0000J4782j8275j5712L6036K5562l682q31K209q983j5983J9044R001
7451C2287J959l7576j5719K7180M411J420K138J9954K180r250K304o12L619M07
7437C4702k2466p888Q294j967j5382j842l7420q797K7447J6978J5139K475J6296
7424B5569J0530l7019j5347J0734k638q17n045n528j5022k2198J3285J5895P162
7411b0439J5954K9534P334m2390l779J0771P970r727j635K920K4995m869J0929
7398B7568j4465k440Q328J2591m90k7635j7411J2109j5213J4265J8223K448o485
7385A1393j4069j4744K1989J2794o182n181N642L858J4282L580j0554J7369J1736
$$ y = [17726, 37886, 42642, 16289, 7345, 12278, 8515, 23215, 23715, 24501, 19650, 30503, 13765, -7549, -30881, -10881, 3901, -14374, -30086, 5950, 31512, 27830, 26999, 29208, 20225, 4242, 23286, 32287, 34246, -3330, -19049, 8131, 12542, 13962, 16100, 36054, 38234, 28984, 31288, 30676, 34295, 34702, 12236, 4348, 12642, 10675, -4707, -6549, -43969, -52766, -25319, -8341, 6798, 9273, 25569, 36099, -920, -16267, -5533, -8171, -8988, -14033, -19561, -34583, -56781, -43496, -27601, -20439, -4485, 25049, 32383, -10007, -13786, -3015, 4955, -4772, -6407, -3487, 21508, 16639, 27568, 13103, 10663, 18991, 31582, 31092, 3457, -13954, -1845, -17058, -2793, 15430, 17878, 11393, -2676, -17420, 4569, 17363, 11181, 6000, 11642, 15500, 29782, 33362, 22808, 40177, 51913]
7372E1913k3169p852q548l2975o099J3663Q521J4053j2734k2337k138O70P51j1521
7358c7802O6k372K0718J784K0214P75K1045O852j3623r619O9l952k957M72J9618
7343B1288o637K388O861j3849j7390o929n808J0551K0670O378o603J1562j211
7330B1271O274l3527K949m541K6394J3801Q392j035m1698j7171r595J2429K8861
7317A2804k784k2677r049r611K4038K9532M464J2538J757o648P947n2274l4074
7304d4037R121L2932J1493j4865L892L2319N453l1991Q768p597j4263j9710O462
7291b2023j0138N309J6209j4334R019k3J0358K1174M5611K5091r041n286k8323
7278D3603k7920j3751m920J3266j6501j9058o654K58L542P105J1466n843j0789
$$ y = [51913, 28744, 20892, 12344, -20631, -26730, -13067, -4546, 9507, -3227, -25564, -27702, -27032, -26281, -37802, -37736, -40108, -19390, -17606, 2608, 3383, 24428, 31280, 17657, 8038, 8107, 4155, 1198, 1670, 21288, 14651, 17039, 23900, 10051, -7339, -14268, -20076, -9525, 11145, 17523, 10920, 22482, 21271, 27545, -5982, -3033, -7574, 18820, 32621, 41013, 39978, -1720, -18891, -28486, -16057, 12804, 10020, -12657, -21706, -31317, -7279, 22253, 26717, 39255, 41012, 34364, 42311, -9963, -44037, -34916, -1984, 9509, -5356, -1464, 30855, 36308, 4317, 13085, 5488, -8775, -28485, -22023, -32161, -26852, -10643, -24977, -15958, -15981, -5623, 15551, 61162, 86253, 77212, 71926, 43603, 15683, 1932, -2988, 10278, -6223, -25281, -31935, -31677, -28135, -21030, -9564, -15407, -26196]
7265b6196l233q838M583l992k8997p537K7631J8898J8644n180K1155J0567J4736
7252C2241N595k0184j8679j002n206K3820L929P83K290j9335k6302K069j0101
7239c0082P009J9452K1824N141k0125n683l251l322r176o956J5585l650k3441
7226c6675L163P619J7664K002l777K0432O691l6106o98q039J5570r677j2189J3130
7212b0890J4779J977R249J1270N559J0046j6460j7380j5950m625J5708K3754j9572
7199b535l3159o05K0485N165P614J2463K7581O722K1049J85k6570l2011m9043
7186d2659K912K2827O83k3342M930J9373P280N027p276M451q236Q458K0401J0456
7172B5285N407P474j6213M705J4966p16m1399k8249L1816J445j4145J641Q196
$$ y = [-26196, -29429, -38267, -33684, -37676, -66673, -74210, -46579, -27681, -9037, -14217, 6938, 17505, 32241, 37836, 17652, -1027, -2029, -7235, 16585, 20514, 21297, 23587, 4252, -22050, -19981, -30082, -23073, -3621, 18203, 23344, 3219, -2464, -5715, -9037, -18213, -25169, -9584, -13234, -36675, -33512, -25893, -8229, -6227, -10004, 10428, 17119, -18987, -19685, -27724, -12154, -21831, -34020, -20890, -6111, -4134, 5115, 16385, 21944, 31990, 15530, -1850, -17800, -22425, -6717, 17037, -2535, -35694, -36299, -15814, -10649, -3035, 9428, 37009, 43731, 64780, 64965, 38395, 6384, -42659, -39747, -16920, -16237, -39579, -34649, -15276, -7996, -2969, -10245, -5794, -14030, -5572, 14829, 25285, 30692, 38166, 21953, 26658, 41624, 40908, -491, -28740, 3076, 4521, -9624, -7983, 213]
7159B13M422j6089O818L86M252J7981m060k8811l219M688k624K041L2998J2473
7145C1469j1205k3782j6751j090l182J3600P170M233J3699M646k0172K3491m748
7132A7378k1893j265k7090k0198J5128L6456L617n623r560k0896Q263L4186J6723
7119B5226K7405j1882J081J2294k9804l0274j0250p229K81Q675Q515P07o371K712
7105h914K351n381j2751p864N984J7770J7317K1100J6856L0174j2621q427J4233
7092F9827J0778k6835k6548j1489Q387j4091n295n301l895J7283K1078m977k4294
7079D628j2340J8046K0229k13j2978l2883m2818j0451L1005K9425J75K864L1548
7066B6237M759j1849K693K1227O081k0552r858j6m9928J1427K3679M265J4798
$$ y = [213, 4635, -11454, -4636, -4250, 2, 17983, 13923, -14888, -18107, -13419, -16043, -14002, 18996, 31469, 20264, -3518, -20269, -21359, -24541, -10941, -3771, 462, 14161, 18807, -1365, 22126, 17378, -4515, -5780, -32870, -53068, -37940, -1484, 2133, -3490, -13050, -33946, -25683, 8503, 25226, 52631, 40749, 41830, 54124, 24320, -5954, -16204, -23433, -23152, -14477, -5962, -5255, -11626, -8914, -6563, -11944, -24695, -32559, -26575, -8805, 8512, 29612, 46468, 76642, 64021, 55594, 69827, 80605, 53770, 27222, 15733, 24120, 10029, 4734, -567, -4462, 12821, 33899, 28922, 4628, -7712, 10334, 30563, 30350, 17372, -15511, -58329, -68780, -37775, -8350, -8175, -5311, 26237, 30996, 19147, 21840, 43067, 49148, 28596, 18738, 18722, -31206, -19779, 3900, 8165, 22963]
7053B2963O375n302n0591k5265p821J2329K1708j461J0509j1075q301M335k769
7040c4366J7919K7972l746k1220Q326p376j1105N073J5298Q164p202Q692j9209
7027a2780j9924J4513K487K550k254J1381P153k5266j1162J8597l206j0763j9485
7014d8159o962K920M4691O400l1708l765J2785K1181n54n278M946j5440p712J4516
7000a2139L2024K3838j6989k2902l24J8576n761p02K0517j2305k1428J2865j5014
6987B56K797R605p718l2534j9433J9062J6306J4872K1372k426L208j2972N087
6974A7482L168k2101J2332K2741l530k8710j3298N800o990M966J0312J7365R596
6961B9133o185j6243P348J1777j4204j4411m3493k3824r27K8996M3021M621L695
$$ y = [22963, 29338, 24036, -26555, -51820, -59641, -47312, -25604, -27065, -16556, -27631, -35932, -31597, -34366, -16447, 11525, 7779, -13441, -5115, -12491, -23596, -18523, -3225, 4939, -2263, 6429, -12780, -32704, -18191, -15704, -13154, -15408, -4027, 3126, -22140, -33302, -14705, -17911, -28674, -48159, -55121, -52201, -7510, -1110, -32818, -36583, -23798, -2617, -3171, -8449, -3503, -18943, -26655, -12139, 19885, 43723, 26734, 3832, 3508, 22084, 16323, 15621, 36138, 23833, 2405, 15270, 256, 3053, 12658, 4940, -27594, -47027, -27965, -11659, 3213, 24585, 22159, 25367, 12395, 17482, 20650, -1451, 10881, 33622, 30092, 1382, -11916, -6116, -13106, -8140, 2172, 19537, 29133, 22948, 6705, 14053, 25830, 11626, -2785, -46278, -70102, -71029, -42033, 988, 5609, 9304]
6948I304j8861l7073Q015N8234K9629P089p462r362j5288k4794m0843l11J7163
6935b4560j6281j7151J0094p178J9342J0812J08K4545K1181j6933o00M420k1520
6922a3721j4275L686K5673P839L705j8861j3833J8540J645n189p1L524J3458J625
6908A3745p636n011O418M650K088J368k4654q102J434R192L361Q499j1656l25
6894f629q065J53j1009R17j710L1301K5406j4446k7194j0102O959J9204j9062
6881a4277j0865J4066j838M68J0804M521R684J6514R652k5489j5621L135n534
6868d780J8903n878j2605n239m00K1269R556k2569J6927J2658k747q863m156p350
6854D726o127l5515J5916J3457R349K307k4781j4952j601N434J6996J0922R995
$$ y = [9304, -9557, -46630, -38615, 19619, 49248, 56337, 48875, 39513, 24225, -569, -41412, -41723, -24560, -40841, -57992, -47898, -55076, -35734, -24922, -24814, -269, 20912, 3979, 3379, 7799, -13721, -27996, -24310, 1363, 9202, 12907, -5954, -19787, -1247, 398, -4791, -4862, -1338, 12120, 13745, 6109, 1098, 7516, 12166, 14254, 15622, -9032, -17134, -15700, -6508, -3147, 5352, -6304, -6629, -14694, -14541, -25550, -24633, -26343, 4958, 30364, 15918, -11276, -21378, -14419, 4785, -14277, -25142, -11076, -12914, -12446, -1642, 2879, 12563, 29077, 38729, 13240, -2381, 754, -4780, 14123, 8245, -4360, -9599, -9999, 11270, 20826, -1743, 15184, 27842, 25095, 16232, 12076, 4726, -1401, -36916, -21000, -7543, 1806, 4113, -20668, -35620, -37221, -31787, -14791, -3869, 6126]
6841F126J3482M274Q33j3704Q485K1892J2397k2718j1193j5792M894m423j4634
6828a0081K5676J4713M350j862j5586k4954l305m295P635L2881M3352P23j6838
6815E2409k4853k480K469k5298J5970o511J2722o687l2275j6029K1310K8135p31
6802A8151m805J418r298J6474k02J0112j033m932j6320j583J5241J8399O461q999
6788C9084j5184K423j2406j5744l144J1181p94j4972J4941Q126M464r73l160p371
6774F471q012J336K649j8818j4666M995J1274J9828m49r353Q760l2707p308O307
6760b9693O868J5652k8613M217J3270n362j3499J042K7559K1296M777J2033k0309
6747I238j9710K85J2996k3277Q754P580j4577L074k4876q600J0088K6127M0694
$$ y = [6126, 19608, 23882, 24715, 11011, 19496, 41388, 53785, 31067, 19874, 4082, 8976, 4553, -10081, 15595, 30308, 34658, 32796, 17210, -7744, -11049, -15344, -7709, 25172, 68524, 69247, 52409, 27556, 25076, 27545, 2247, 18217, 11706, 24428, 17741, -14534, -30563, -9253, 18882, 18151, 13346, 14764, 5466, 21940, 21738, 31850, 30817, 25885, 9565, 7982, 23223, 41622, 48083, 39084, 23900, 26323, 13917, -1827, -4971, 6210, 5416, -9556, 5385, 13511, 17975, 17002, 13842, 6471, -1541, -205, 2444, -16374, -31040, -26045, -14771, 5057, 4608, -4745, 4015, -28692, -36000, -29693, -22825, -7173, -35786, -31569, -18299, -23661, -37160, -36118, -8559, 12737, 17514, 29547, 9238, -10472, -10187, 2809, -20468, -11714, -4134, -18711, -15637, -40513, -49113, -39025, -12898, 27796]
6734B7796m203K570k0433n448j04J7444J9723m284N310K945n725m626o716M83
6720B4732J5700J2492j7491l0108k5469Q455j5005j5490K1881J5662P707L230
6708F296L7386k0632k4221M215P257N67J0227K439m1465l9968K237K4372K1008
6695a0282q926j9617J1594k2045J4778N23J1086N93L006J351n431L3795J058n346
6681F137Q416p038O987J3958L595k5998r539O455M694J6381O72k0579j6884j5641
6667b8384j4829n210O117M5677K1939o708j0896j9151j4100J1619L6827p393K804
6654A8312J7446Q556j9696k0943m996L5974j3405j2665j1006l0874R385K8654
6642D742J2612j058j4144K821L973p508J4212L811j3520j2348m2824P604J6084
$$ y = [27796, 23593, 26163, 5730, 282, 178, 17622, 37345, 33061, 38371, 41316, 35591, 30965, 24249, 24732, 40432, 52924, 35433, 5325, -20144, -11689, -26694, -42184, -20303, -4641, 3066, 6296, 43682, 23050, -1171, 3044, 10301, 10868, 21095, 23534, -17931, -57899, -55662, -31290, -10282, -19208, -38825, -27231, -49276, -34498, -33975, -22889, -22296, -19290, -17939, -23370, 10425, 11483, 6137, 14553, 7515, 14502, 28460, 32055, 6057, -3482, 2973, 7667, 24048, 24720, 4141, -12743, -28384, -43213, -48423, -42306, 3371, 25310, 18602, 7706, -11445, -25545, -13926, 22901, 15508, 18312, 35758, 44314, 24618, 3675, -1321, 34653, 21248, 8583, -2423, -33297, -23912, 4742, 17354, 16296, 2152, 4973, 8946, 1438, 15650, 19461, 5941, -6407, -49231, -41627, -25543]
6629b5543L250J5904j2883q927r165J4423J3232M526m659j9892O144M0077K8849
6616D5336j6792n258K1215R775l2087k035L9776m18m1343j222k4855K505k66j6145
6602b1814j1556Q715k443J1641L2318j0165l864L551J4388L3283L017n756j4491
6589C6824j6662j594l184q10O068p557P413q154j3777r829k587k4073p141J7371
6575b7692K9841J5966m351M022N024j403k9179q328j6052J8532J1145J9177o714
6562I988j346K5508j7028n0398j4725L9041M5722P457l1366M120R294o037k0468
6549b38k155j4052k4738J0172K3615J3739L440N206J041O865l798O445n373r026
6535A1143J3492O188R899k3699l6482j0248L922J95MK3581m781j5258M425K3851
$$ y = [-25543, -22293, -6389, -19272, -28199, -37364, -22941, -9709, -5183, -9842, -29734, -23590, 16487, 45336, 28544, 23286, 44501, 54276, 22189, 20154, 59930, 59512, 18169, 16947, -7908, -5403, -5669, -21814, -33370, -24655, -27098, -15457, 16861, 6696, 2832, 6383, 20771, 54054, 57071, 51315, 36824, 20162, 18568, 15384, 14574, 20642, 13085, 20498, 12344, -1433, -11262, -13849, -37922, -45063, -27692, 2149, 18115, 13764, 17786, 22810, 21407, -7772, -16100, -32152, -13620, -2475, 16702, 9988, 8642, 34150, 17122, -33276, -48001, -8960, 36762, 44219, 12853, 16973, 26267, 20230, -238, -2393, -16445, -41183, -31011, -7396, 6343, 9783, 14989, 16030, 22895, 19097, 25542, 20169, 11143, 24635, 30823, 40722, 17023, -19459, -29707, -25785, -25590, -25586, -2005, -6786, -22044, -17619, 6232]
6521F232K0180J3131J3258j8172l3834r586J0662K449q633R025J0365Q207j6063
6508G221k1308j2717j4801K5646J2154j0531L6811L091m2349j5084J7613J5788
6496A534j044J6385j2618j5151j081R458J428J0201O233J5456P923q948j9164
6483A0612j68n551j4579J0472N194k633k2960m640q594l225n298m450J6771K0373
6469h676j645O884J7247K4251M329r707l0363Q567M961M254j097r885J9297K1055
6455D9472k7570j5580k5000j4405O340J2617K151j1296j4555n679K7855j5033
6443c0683K9698K5529k0115q467Q85m400L822J1963k421j1354j7221k0490K9004
6430a4250L8967K229j4762j4939m668q872L678J0869o988k6838M752L9683L299
$$ y = [6232, 26412, 39543, 52801, 34629, 795, -8791, 1871, 4320, -4313, 4712, 15077, 23284, 7221, -14087, -26804, -41605, -15959, -3805, -14336, 22475, 25566, -16783, -31867, -14254, 1534, 490, 16875, 4257, -10894, -11975, -2517, -1089, 9112, 15345, 30801, 38724, 29776, 10612, 10444, 4893, -9686, 786, 5980, 3347, -19613, -24253, -32847, -36072, -41370, -45820, -29049, -8676, -10321, -3437, 13810, 38061, 42390, 32683, 2320, 10887, 15848, 20102, 19005, 9120, 28417, 49472, 21902, 6322, -18678, -33083, -26743, -14126, -11975, -23271, -37826, -43505, -15650, -30683, -985, 24544, 4429, -4038, -3153, -7553, -3731, 8232, 5811, -5543, -22764, -43254, -14250, 24717, 26946, 12184, -2755, -7423, -16295, -12617, -1748, -8736, -35574, -30822, 8861, 12160]
6417A2160j237K1459J4092k8767j7354K983J5397k5828j5996j0012j3848k1036
6405f7987Q762J6056K3036J3774q051J8928p846K216L463n678r301L956r45O975
6391b642J4678O126k4657j8292o863K0684l696J6061P390j9904J1996j6133j6510
6378c1762l4655j1792l01K7823J1492K6673K6377j2601j4471K1668n704l883p01
6365a837J2498m920J8355J1784r933L322J2514q516j3435K2447p344k3885J249
6352A2299K4201j3674j016J3777k356k4839Q232k9459j774J3352k20r95j3672
6339a6144M894j2293K068K8428j0939j0700K0800J2043M066p185m2267M814J4929
6326g486L6660J0885r972m3059j4268j2988j3464L394J8555J9443p357K1002r568
$$ y = [12160, 10923, 32382, 46474, 17707, 353, 3336, 18733, -7095, -23091, -33103, -46951, -67987, -59225, -43169, -20133, -6359, -14410, 4518, -3328, -1112, 2351, -3327, -12628, -8672, -9617, -2642, 12036, 18162, -6495, -24787, -31650, -10966, -14662, 1399, 8789, -11115, 881, -15252, -31762, -66417, -78209, -78510, -50687, -39195, -12522, 13855, 1254, -13217, 8451, 2747, -1136, -1837, 10661, 5741, 24096, 35880, 25947, 29269, 41783, 33267, 19832, 42279, 34935, 11050, 12299, 36500, 22826, 21810, 35587, 33231, 8392, 16624, -12835, -14609, -1257, -1477, -2472, -16144, -11250, -23543, -21475, 6953, -3986, -14686, 6114, 18157, 22223, 15038, -27229, -22415, -7486, 29174, 40059, 30087, -12972, -27240, -40228, -53692, -50298, -31743, -12300, -19657, 1345, -8223]
6313h223k251J6293k3162j5674K9477j4540J043J6804K287j6078j3566J1073K688
6300a3829j6641N405K3113o937J0180j3638j1786M647Q426J195K4583K4337j5764
6287B3291j1822k7359j395j3088L6503J0213n987j8978j129l63K5864Q290Q512
6274C2552P674j6505m41j2030J27k713j5382r395l412k0892J6818J9235m825k0774
6260b9963p482m06r3K6240K2440r134k5423m236L2859L1276l4469p031J7393k136
6246I835k6157J3750q20k152j604r485K761Q882k1462J3109K2900J3207j0316
6233A2448o771J023J2587k0339P542P089l0517J4087m242k9679M665J0137J9619
6220b351L765n278J5072P560j2094Q000M185K5272k854j3259J204L19j8564r262
$$ y = [-8223, -10474, 5819, -17343, -33017, -3540, -18080, -17037, -233, 2054, -14024, -27590, -16517, -13829, -30470, -25065, -1952, -8889, 1291, -12347, -24133, -19486, -11060, -9865, 14718, 39055, 23291, 11469, -15890, -17285, -30373, 6130, 16343, 10356, -8622, -9751, -10114, 15750, 24040, 32552, 40226, 23721, 23280, 11250, 11377, 8664, -6718, -16113, -19525, -40417, -23599, -4364, -9189, -29963, -37445, -37851, -37944, -11704, 10736, 1602, -23821, -28057, 4802, 36078, 1609, -5422, 11971, 9835, -16322, -2572, -3392, -5544, -7148, -16633, -13872, -4990, -26452, -13343, 9557, 22764, 12448, 5677, 6700, 19287, -1052, 6490, 13579, -16938, -2851, -7093, -36772, -32107, -21970, -2351, 1414, -3864, 11208, 18768, 6674, 14674, 18859, 44131, 41277, 28018, 29222, 29541, 10977, 1715]
6206A715K5661L579k5306j6746O657J4122L008p633k4713n607j1134K08J2863
6193b3326l122j459J2443j3508n881K6336J9126q897J2628p699O917L083l7353
6180b0712k1484J9302P404O640k396k9487n450J8780L216j7886j4592J8436L2046
6167f183m90J3985O972k2834j7218p240L4045N328j8870J1895j367O548k6473
6154b1902L797k6627q531M4695l090M766M948q986Q858K909k39l0130k521M3031
6140A0978N952J2685j3025j7258J5230J136j8858K1210M2324j967j0865N894l6087
6127A7349k4964k7241l336N386j10M4878J2857n672j7199m3908q535L0953K7661
6114H119L9145J06k6952k743K946R536l698n308n443r730O137j6729k250k816
$$ y = [1715, 27376, 30955, 5649, -11097, -4440, 9682, 12690, 5057, -19656, -25263, -36397, -36189, -23326, -26448, -27907, -15464, -28972, -34853, -8517, 10609, 1712, 14340, 6641, 13558, 16641, -20712, -42196, -22894, -15490, -8850, -11246, -40733, -46183, -27403, -24187, -42073, -56665, -38229, -6183, -6673, 7312, 14284, -8550, -25768, -33008, 1037, 6365, -12505, -610, -1977, 4571, -21902, -18105, -44732, -53263, -8568, -11658, -6892, -1944, -10930, -2072, 837, 598, -29532, -32053, 10978, 16930, 29615, 16590, -668, 14562, 15698, -3160, 18050, 60374, 58407, 47542, 53436, 17349, -7615, -34856, -38192, -32806, -32916, 11962, 24819, 19147, 1948, -41960, -50495, -19542, 8119, 47264, 47370, 20418, 17675, 20621, 30157, 26459, 21151, 15708, 5978, 12115, -4614, -6864, -9680]
6100i680j9695M120K3190j616K998K7256q506j998k8148j2862r952k843K1305
6087a6431j2956J911K6642K4450j4863j9029p751L784J5890o605J551l338J4842
6074H097M4242o040j9111m189j448r499k1838k1928J1418J5653k560l365j602
6061a2170k049L4621J7655N663N764k5160k9255k5094K8303J6294N829j2761J0393
6048A8033m1301k2019K2027K8877J6621q421j7829J1083j2794k1292j9846K4899
6036b1962Q036j2625j3834J6053J9205l0360J3211L7836N771Q983L283l0973k9600
6023b6976j2640J7026l183O888R291J4949J2957j0554k3313l1127K4009R433N973
6010g267k9041l1366J1963K3399K2127J9327l303J1098J4004j4940j6777m0601
$$ y = [-9680, -29375, -25255, -2065, -3681, -683, 26573, 18067, 16069, -12079, -24941, -34893, -37736, -16431, -29387, -27476, -834, 23616, 8753, -10276, -18027, -14243, 1647, -4958, -3407, -6745, 8097, 52339, 46299, 27188, 22999, 21551, 12052, -9786, -31714, -20296, -4643, -7203, -10568, -12170, -14219, 20402, 38057, 43720, 49484, 24324, -4931, -30025, -1722, 14572, 20401, 7640, 18033, -23268, -45287, -23260, 5617, 22238, 13817, -4012, 7071, -5723, -27015, -46861, -21962, -13926, -26551, -40385, -24332, -5127, -35487, -22276, 15560, 21331, 30314, 33597, 2624, -26976, -39616, -22590, -25773, -18885, -9594, 5355, 18312, 7758, -15555, -46682, -22673, -13240, -7267, -36308, -67674, -55711, -32312, -10185, 9142, 5839, 16937, 30941, 16001, -776, -41377]
5998d1377J3682J8883L3578k153m1601R930K4326P810Q452o569k6316j9062M733
5985a5684j2154j0561M807M185j6245M37L1727O991J7775j4836l9141j5025L4829
5972b2895J1411K8417J621r486l0604j052J0851J557M422J5556k0426J4599J8112
5959B2083r178o13k0008M236K4109M9604l0878k9477k8703J9054j61J948N632
5946G648r718J5178K6618k0410K5914J5665k572n813k5811k6337j791j3418R54
5933a3893J853J5184O845r718K1730p002k1389m12J4710Q40j7609q991J0404P665
5919B17K221j6006J5984R988j6335n451j0266l454O995J8933j2726k1665o506
5906c8071o881P338Q415J8889q60p876J7106Q076j83o506N379j7241Q2l625K9062
$$ y = [-41377, -27695, -8812, 24766, 22613, -18988, -9058, 15268, 23078, 31530, 24961, -1355, -20417, -15684, -27838, -38399, -33592, -29407, -45652, -45215, -13488, -6497, 11278, -3558, -42699, -57724, -22895, -11484, 16933, 18554, 9068, -21536, -22588, -11737, -10180, -5758, 9798, -10628, 3971, 22083, 12905, 12292, -7716, -3480, 20629, 70233, 39355, 9878, -18825, 229, 68, 2016, 7648, -2070, 13108, 39726, 19316, 45230, 60895, 58323, 52510, 26699, 362, -1429, -14847, -13893, -12040, 3144, 9989, 271, 22001, 14999, -6390, -6802, 7908, 8748, -8861, -17852, -7448, 217, 2438, -13568, 2416, 12404, -3931, -9382, -19648, -23102, -16107, 2826, -9900, -31565, -38071, -44952, -37614, -29199, -10310, -11170, -19046, -1940, 6136, 5953, -553, 4826, -12415, -12333, -15958, 13104]
5891A3104j1632K438J5806j7427N091k069n094k6445m310P671P905p305r494K155
5877b9606J5598O828K89n373K003J1625P094j2819k6821J297Q259J3219j2246
5864b0653J350K3986k180K1132j9636l0798j1519J1008J4704Q096P098P506j150
5851H944n521L158k8888l549L098R027L6818m689j4507j2278J3165n031j8011
5838a8264m586m564J4504N473j7011J0513r457L52J0992J2594k928L443J594J3134
5824A5789J2995l8696k5516j7318R617R742J4727j9299l7695L4567R900J2458
5812a8729J2002q619J3155o935J2711j2988j1560P230J0974l939n455q129k7767
5799d8049o093k101k441M7479K3738N785O705o005j5383q055j207M822N213k199
$$ y = [13104, 1472, 3910, 19716, 2289, 7380, 5311, 217, -26228, -30538, -22867, -14962, -22267, -31761, -29606, -14008, -7180, -6891, -12264, -10261, 1364, 8458, -4361, -31182, -29885, -21626, -8407, -20653, -19303, 4683, 2503, 23635, 3999, -26799, -38318, -27310, -12606, -4510, 2588, 10094, 8944, 3423, 6581, -22307, -25856, -22758, -13731, 23087, 18398, 3891, -8387, 4778, -253, -18264, -22850, -27414, -12910, -7437, -24448, -13935, -23392, -23040, -12048, 546, -2382, 1061, 2655, 15789, 28784, -9912, -35428, -52746, -43129, -33387, -18660, -37959, -75654, -41087, -31187, -18729, -6727, -15346, -2191, -9126, 3585, -9403, -20963, -13733, -2759, -6698, -12153, -20282, -48049, -54142, -56243, -58684, -11205, 12533, 18318, 25023, 19018, 3635, -4420, -5627, -805, 4408, 2209]
5785B209O141K4912j0248l6390k5981N606Q045o423J7332L3131p927n095J619
5772F931k1290k1140R418N362j650j1365j1357q344Q495O736n222K3140L4868
5759A4582L567K947j7659j8621j1761j1453k6230O585K4601J6j0439r808K6299
5746b7374L4296j3901K3162k2621j4326Q530J715p272J6580P516j5866k262J6807
5733D984n604n284q619j3620q704o564K769L4313j0910k2058J4014J9108P64j6882
5719b2293J4837o335J3443n334J654J9108J5966l0274k3769l957K0512K1225m270
5706A0513o24l267k5096K9494M373O742k2418j4340Q099L170M68O376j8038k8088
5692d2636q263K3285j3501q094L1041K8800L350k1218O806j242q86k2905o309
$$ y = [2209, 8350, 33262, 23014, -13376, -39357, -33751, -25706, -32129, -14797, 18334, 10407, 5312, 6931, -14359, -35499, -26081, -20719, -22369, -33734, -45091, -53435, -44940, -38204, -43426, -20286, 14582, 18149, 21096, 3437, -15184, -26945, -38398, -64628, -58043, -33442, -33426, -43865, -53673, -27374, 6922, -6979, 16183, -6438, -20764, -12234, -10519, -17791, -1211, 6305, -9561, -11823, 4984, -620, -5904, -14523, -28143, -36847, -43411, -40642, -6329, -17239, -39297, -25283, -6175, -5411, -22293, -7456, -13791, -348, -5682, -4028, 15080, 31046, 772, -22997, -26954, -6442, 14783, 10513, 9889, 6622, -18474, 11020, 15393, 22135, -283, -14623, -6524, -3354, -2886, 3490, -14548, -42636, -50899, -27614, -41115, -49209, -18168, 10632, 13982, -7236, -430, -1672, -2558, -25463, -31772]
5679c1772J0252J8038P984j0777J5580l281p109j3002j2405j0431J0308K4845
5667a770Q99j7522r798J0956J71J981J3638N884Q438j3099P464Q166m220K1125
5653C2313K099k0494r451j1738k7010o124K328j536K0966n107J452J883j7440
5640c7859K594L1777P877J2245l672k0829j3477r800J7472K935J5477M114j8023
5627i169J5349K2678k5933k528k4691m953m08J7675J9398K2871O377j0831r362
5614A6473J893q660q011j4436P156K0359r79k4411j7192q441K628M466K3141J1708
5600E694l655J5610J2514j1269j0621J1586N36l597P435O821J8688N817k4943
5587C0616m0406l0474j706N820Q209M3784K3184p744k0892j2047k1478p572K9133
$$ y = [-31772, -21520, -3482, 4502, -6275, 9305, 6024, -1085, -14087, -26492, -36923, -26615, -1770, -871, -18393, -28191, -17235, -17064, -15083, -1445, 4439, 12877, -222, 7242, 15408, 11188, 32313, 34412, 13918, 4467, -7271, -34281, -40405, -38077, -39613, -18647, -23754, -22302, -20419, -37859, -35265, -3488, 4389, 16634, 12962, -7867, -21344, -31144, -13672, -10737, 4740, 8854, -9169, 6180, 28858, 2925, 397, -24294, -29247, -29655, -11980, 7418, 30289, 36666, 25835, 16473, 18366, 9706, 1695, -12741, -5585, 14774, 13795, -10616, -27808, -36249, -33621, -29155, -6014, 5694, 2039, 17649, 30163, 18894, 8273, 19859, 20395, 16798, 24233, 31054, 49742, 55559, 30616, -9790, -40264, -41970, -36150, -27941, 15843, 39027, 31283, 10391, -1656, -23134, -30706, -1573]
5574a573K2062L0389k11k1741p928j2104j1956j6580J6809O15m1639J0320N234
5561b8303k989J5831p882L062J9109J7404J3271Q433J0500J380l4915j1236j4715
5548a1050j1902r286J768J2255j5435o303J1956J8012k402Q195n974J3772J0577
5535A4183J7836j2659o804j2750k2932k3975j3603K7002J4640k553j6042K0821
5523a6836J6840J5959O799j3074o401k8217j8386j0589P071J8692r022J7209J6880
5510c075K1961P96m1552k4076K4005L0325O087q993P245O830k31J3432j120k5908
5496E726R539n756k909K912L4617J7575j8813j9321L804J3694m147k3726r407
5483C788J1520j2230L713Q250J6419j1630p985j318Q628l434q902p884k8670k440
$$ y = [-1573, 20489, 50878, 50667, 28926, 20998, 8894, -3062, -19642, -2833, -2218, -43857, -33537, -28303, -31292, -15461, -23343, -20281, -1172, 16232, 29503, 37936, 48436, 49816, 14901, 3665, -11050, -22952, -32238, -30470, -18215, -33650, -39953, -27997, -9985, -12387, -4192, -10166, 3606, 14183, 32019, 19360, 12556, -194, -23126, -47101, -60704, -33702, -19062, -21615, -37657, -16836, 4, 15963, 22762, 9688, 3287, -24930, -43316, -53905, -46834, -28142, -37164, -19955, -3075, 18886, 19682, -21870, -45946, -21941, 8384, 14471, 5478, 12723, 19553, 19322, 32754, 31634, 5726, 15265, 9509, 6600, 9512, 44129, 61704, 42891, 23570, 27374, 41068, 36921, 13195, 3788, 15308, 3078, 6791, 15041, 31460, 19830, 11845, 10527, 19155, 15721, 6819, -1065, -29735, -32175]
5469c2175M0964J0412r660k3081r478L778k1891K5634L5066n584k9148M527K9414
5456A8778K794P819j4494L959k5895k5441J5051K0431J9676K68N416Q733j3423
5443B3672l4197R675N46M808J9562K043j8188j3586j2038J1766K789p619J9444
5430H677J6729o114K246j911J176J0671J375j4897j0988K684K0050j3562j6644
5417e08j8680j6080j0750J4592L175n528Q144K5042N557j0813n720p988j4938
5404c4495l385J7349K0319L59j6449K9141m149j2386K0606M592P627l0821l5058
5391c6750L024P331K1558J4415o867j4091J2082J5195j5509j764J6740L786r651
5378I499p89k1267q980J2481k89j0745k1896l0772L3777j60m166K2402L131J4557
$$ y = [-32175, 8789, 19201, 9541, -13540, -23018, -19240, -41131, -15497, 19569, 13985, -15163, -10636, 18778, 21572, 29391, 14897, 18856, -7039, -32480, -17429, 3002, 22678, 22946, 28362, 37095, 23672, -10525, -850, -304, 4504, 24066, 26109, 7921, -5665, -17703, -5937, -3148, -10767, 8677, 25406, 19292, 21538, 19627, 20803, 31474, 32849, 17952, 6964, 9648, 29698, 16136, -508, -19188, -35268, -46018, -31426, -28251, -33779, -25635, -593, 4964, -5849, -11569, -19557, -34495, -37880, -20531, -212, 147, -16302, 12839, 8690, -3696, 16910, 21502, 29129, -1692, -36750, -33726, -26395, -4837, 9578, 2711, -11380, 702, 15897, 388, -1376, 15364, 19150, 9499, 8710, -12557, -21537, -9056, -9345, -20090, -41986, -72758, -38981, -39141, -43307, -20905, -17774, -3217]
5364c217n749k4198K679J9786K3737j0996R167j2240o852K1387K9210k6532j8562
5351b380o077m835K3199j2316J0190o024J2843M114n567J4455m553l1395l8298
5338d6644K635J3807K2535R942J22L793J0402j3295j1296j6941L568J4017J1159
5325C804J1884J6032k3331k3257l422P433J4062J6459j1805l4992J759l0749j6656
5312g2779K0798M2132J2780k3549j7533P084K1585K2347j1006j8536M518j364
5300a3523K219J8855M373j7572l5064j97j81O772j0385O399L7487J6737j4513
5287A407j0939q584q733K6653O025N678N6k4381r637O163Q897r53L154J4213J969
5272A0988K761j6988j6560J385L2073K5342p249j4680K453n464p371l5715k9726
$$ y = [-3217, -8966, -33164, -30485, -10699, 13038, 2042, 11209, -1031, -7883, 13504, 42714, 16182, -2380, -8457, -13292, 9907, -2409, 7781, 1757, 14600, 18714, 13147, 27602, 23049, -8346, -46644, -44009, -30202, -7667, 2275, 2397, 6190, 16592, 3297, -7999, -24940, -21372, -7355, 3804, 15688, 31720, 8389, -14868, -18290, -10857, 3205, 19664, 7859, -27133, -25374, -56123, -72779, -51981, -9849, 2931, -20618, -38151, -31067, -9482, 12865, 1859, -16677, -12159, -13523, -11304, 7551, 11924, -5648, -40712, -40909, -41090, -34318, -44703, -38304, -817, 15920, 1407, -9532, -18116, -26849, -196, 5829, 11507, 11563, -12818, -22455, -16292, -7395, -8348, -5194, 9019, 10988, 13749, -3239, -19799, -18414, 13659, 39001, 31752, 17072, 19525, 14061, 6690, -29025, -58751]
5259e8751N790K6114L74k6617M378P660J2973j6559J1097J119K6392p918N970
5246g978m790J0759P827r943k249J3637j592j7371Q900N556n160M06j9316r03
5232b2217K2003k3495k037K2602O929l4591r290J8223K2128j2725p405O54J1188
5219h033j2402J361j4033j5535P93J4896L6593m414M53K0187l921k1386M388K544
5205A491j1809k1140q267J0877N624J252O033L333M262Q032J2700j3159L0779
5192C0008r76l6428j1567P202R653k856r653m422m545K973K7097J5073j3844k5974
5178a8259k304k3294P794J0714J5566k478l4002j1950N6769K2000K2734P280J1675
5165F2245q147q435q674l1388j3976j3454k0032K750J1169o231o471k17J9940
$$ y = [-58751, -52961, -26847, -26473, -53090, -48712, -41052, -28079, -44638, -33541, -32422, -6030, -13948, -7978, -12768, -2009, 5818, -4125, -6374, 7263, 5671, -11700, -2800, 2756, -2404, -1998, -21314, -22217, -214, -23709, -25746, -3144, 3785, -30806, -40096, -21873, 255, -12470, -19875, -19221, -8033, -20435, -19074, -33107, -48642, -47849, -32953, 3640, -774, -321, 19866, 15945, -5441, -1053, 1491, -10318, -31458, -39725, -28848, -23224, -21972, -15939, -12606, -8344, -312, 12388, -771, 30008, 29032, -7396, -18963, -11761, -2108, -4964, -14617, -19039, -23584, -20611, 6486, 21559, 7715, -18259, -20563, -43857, -36063, -25349, -9783, -12261, -46263, -58213, -1444, 20556, 43290, 50570, 62245, 54098, 45663, 36989, 5601, -8375, -21829, -41861, -39111, -27942, -34173, -40644, -40861, -20921]
5152b0921K2090n540k3962p659P690J1628M013l927J6233K053K244R2Q798j1782
5138A050j7612J5666R772j1199j4712r854P471K1142J3203K7698k3259o495J1394
5125B4265J0433J854j7647p715K3740P38k7135p591j4874j7786l831J6610K1564
5112B625l2104j4887o010j6596n422J7864j3410J0033J5682J120R012M944M887
5099b2262j9476k1547P641m900N31j1704J561K5481K6579m118K7127o068j1287
5086a2442j1142o843K0207J6475k6351Q686K3399k6796J679R531J4461j2708j8367
5073b0211J4029K0176o363k935k7739n852Q422j6959k9425K0100p29K8557P679
5060a1250L167M567k4853j6610K43J7425J6347K0647K438j9194j5275K0092L8009
$$ y = [-20921, 1169, -4371, -28333, -35992, -28302, -16674, -12661, -16588, -355, 1698, 3942, 4034, 12832, 1050, -16562, -896, 8876, -2323, -17035, -26889, -19418, 1724, 14927, 42625, 19366, 12871, 24265, 34698, 36552, 18905, 11190, 34930, 35668, 8533, 942, -13932, -31718, -35549, -18939, 2625, -29479, -44366, -50376, -66972, -72394, -54530, -67940, -57907, -42225, -41105, -32093, -27149, -22262, -41738, -63285, -55644, -60544, -60013, -71717, -70156, -44675, -18096, -22214, 4913, -1155, -12442, -23584, -30427, -10220, 6255, -20096, -11410, 11989, -14807, -13128, -3597, 10864, -1844, -20211, -6182, 13994, 7631, 4696, -23043, -28895, -20473, -37432, -66857, -46757, -47486, -18929, -11250, -8083, -3516, -28369, -44979, -44736, -27311, -10964, 9683, 12121, -7073, -22348, -2256, 35753]
5047C5753J2497j789Q704j0376q740l2477n630j3902j7135M688M30K1717L702
5034b558m229n106M6091N8j6659k4849l305J7621L67k0846k6283M796q692L843
5020c9751K4619L2962K9583p19m553k9574j2443q251K2790L0469m061o493n422
5007B9156J2197l0515k6877J0448k3572k7006j1837j0652J7555J5962Q394p902
4995d4649K7760M4734j5653k0332N879q620K2922J760j1981j740k065k8580j4182
4982d4747J6138P901Q137K0899M003J1964Q247l1759m743j2207j7449k094K2881
4969a2829K939l4191k3615K6387L7345N949l5887j8705R502q902J0734K2508j7569
4956c6334J4965m653k669K6810J0619j7361O210j1576j5273j4253q929P841K6490
$$ y = [35753, 48250, 46461, 55165, 44789, 36049, 3572, -2058, -15960, -33095, -28407, -27977, -6260, -2558, -6787, -11893, 34198, 34256, 17597, -7252, -10557, 7064, 7431, -13415, -39698, -34902, -43594, -39751, -15132, 17830, 47413, 46694, 42141, 12567, 124, -8127, 14663, 45132, 41071, 34578, 29156, 41353, 10838, -16039, -5591, -29163, -56169, -68006, -78658, -61103, -45141, -36747, -44649, -16889, 27845, 12192, -8140, -2261, -10881, 12041, 13801, 1820, 80, -1985, -30565, -44747, -28609, -20708, -12571, 8328, 12331, 24295, 32542, 783, -3960, -16167, -33616, -35710, -12829, -9890, -44081, -67696, -41309, -3964, 1985, -33902, -52607, -43105, -52007, -41273, -18765, -36334, -21369, -26022, -28691, -1881, 8738, -8623, -2413, -13989, -29262, -43515, -52444, -44603, -18113]
4943a8113O931p978J2394J7492P430q295k4710J74J7287j1753j8714l788R992
4930b1651J744J5338J2359j7325l943K2207K2700M428k8347j0052q352j5748j9162
4917d5804K7996J0014r149J4433O076j8133j4128K949J5260K714K167k3219J1363
4904a7461J6099j2209l113J660K9566o147q600Q857K006k3716p766J0829K2307
4891A2312J6547j8514l22j5763j949K4604N94k7393k6284J2709J1331K5611n597
4878G886l083k7j8253P719K5675q435k6758L815K5741L314L295j4677o176n452
4864e416L6097m742k6243J385J6654j2412o115p466J4670J3523n414l619k5241
4851a4339L463k295p067l548o41M1807J0215k1165j5549k73J0868k5321j635O677
$$ y = [-18113, -11182, -19160, -6766, 10726, 18156, 9861, -14849, -14675, 2612, -9141, -27855, -31643, -21651, -19907, -4569, 7790, -9535, -13478, 8729, 31429, 35857, 7510, -2542, -10894, -26642, -45804, -17808, -7794, -16943, -2510, 3566, -14567, -28695, -25746, -10486, -7772, -5605, -28824, -17461, -1362, -13571, -16684, -15024, 14542, 8395, -205, 8652, 10658, -13058, -20824, -9995, 12312, 28859, 10345, 10023, -5740, -7689, 16915, 17509, -9884, -36168, -23459, -12128, 13483, 7886, 4803, 4776, -13477, -5758, 19917, 11482, -15276, -11461, 14280, 17594, 20889, 6212, 36, -5416, 30681, 25939, -304, 1081, 17735, 5323, -792, -8258, 6412, 19935, 14521, 10902, -14339, -10876, -13171, -20238, -23786, -24427, 17380, 27595, 6430, -9119, -9392, 1476, -23845, -25480, -18803]
4837a8803j1333Q151L365L4362K1594O550j1083J2353l5092k4864K606j1455l0150
4824e3799j9845K0421p33P769J1443J0940P192k4330R178J425l839o910O502J6840
4810a7746J4629m383k3530J071J4834J7792P482p402m712J3476m262o092q477
4797g320k3627J0019J6734J4765J8162j6111k6761K1875K7909q028k1401o90m033
4784A493M328K5253L6444j1369k7862l0667j0129l929k4489J4320l059J6067K101
4771a1498o603K869J3886j1552P521P34k4746J5449k413J4827R385j7148R689
4758D00J0987l342o726J5415Q82k1030j2435L029Q740j0385o869k7R688J5425
4744C752J5913Q953k203l5485j9115J4815n880L8093R141j9658l008K4719m494
$$ y = [-18803, -30136, -21985, -18620, 15742, 37336, 43886, 32803, 45156, 10064, -14800, -12194, -23649, -53799, -73644, -53223, -53956, -46187, -34744, -23804, -16612, -40942, -31764, -30339, -34178, -41088, -34586, -17746, -3117, -7500, -31030, -29959, -15125, 2667, 10149, 2747, -1965, 11511, 7249, 1157, -7320, -30947, -20928, -4194, 10571, 28733, 12622, -14139, 7736, 35645, 27617, 6216, 5526, 1493, 5821, 31074, 67518, 56149, 28287, -2380, -12509, -16438, -40927, -26607, -29666, -13599, -11498, -18101, -15232, -1346, -12898, -5377, -4643, -29389, -13940, -16353, -1526, 7859, -9289, 400, 11387, 8045, 1319, 16734, 17616, -3414, -15849, -12820, -4080, -14465, -21334, -21361, -11673, 3752, 19665, 28618, 26415, -9070, -28185, -13370, -19250, 18843, 27984, 8326, 5318, 30037, 25543]
4731B5543l5069r354O898k784K87J6306K2252M217j3851m578p736l830r636q899
4717b0234P668O895R939n044M687K8076l795L449m122J6598m367m4948p81Q165
4703B186m1902J0588m418k585Q526m4J4189p01l0285J4452K140j0463m418J5488
4689b7247L9542J4151o417N7r520J4385J026k5170o768K0642M017k433j7665n862
4675g262Q143k4511o574n757K992J0259q87J4462m706r965q731k028m352J1017
4661b7900O195M998J2904J2095j6829k752P543P691J1917j1389j2382J740j8569
4648b4738K473K474J0721j6559j6023p616j4734L6903K3669k3311k3484J4460
4636c5765N932K2696m562O116m398k5441Q343J1690J3o193J4882J0050n396j3289
$$ y = [25543, -9526, -18880, -11982, -14766, -14479, 1827, 24079, 28296, 14445, 9867, 2131, -1699, -11335, -20234, -12566, -5671, 4268, -776, 3911, 31987, 28192, 31641, 27519, 44117, 39750, -5198, -5979, 2186, -39716, -29128, -33546, -36131, -27605, -27649, -13460, -14161, -44446, -29994, -27854, -38317, -42735, -27247, 12295, 26446, 20029, 20086, 10566, 24951, 25977, 807, -5961, 14681, 18698, 16265, -1400, -7262, 881, -23630, -30204, -35961, -32969, -22710, -23597, -9135, -13841, -23806, -32537, -34565, -38917, -27900, -21705, -16707, -3803, 8292, -8537, -11289, -3746, 3945, 15862, 4473, -7909, -6169, -24738, -22265, -19791, -9070, -25629, -41652, -49268, -64002, -27099, -3430, -26741, -50225, -35765, -29833, -7137, -11699, -5583, -9981, -35422, -27079, -15389, -15376, -21569, -6687, 3363, -2033, -15322]
4622a5322P613J8032O556j1716Q67m572k1699J0318q58j7507J5667J0175P464
4609E018K565J8780o369l5976L0531k2149m6013m1974L3097J2716J486K3045L8941
4596A3698p984j8207j6093Q146K1910J0462J1803r62j2575o171l172l379Q280
4583E756J7734K0139j5500j8651J1949j5264j1897J8596q588j0697R428k1669
4571a8664j4047J7328J2870N607q761p172j907N161M156r186o431l0760q258O1247
4557A183J0916j9059N179k3883k6771K0547K2801J427l155k3757J5809J2716K3441
4544A7394r755j2961o307K6535K6699j1583q573q290j2944M0203J2075j0539q068
4531C3886J1911k5069N120N382j7276k457j8995j7403j2390o628m480M620K2219
$$ y = [-15322, -7709, 10323, 16879, 5163, 6030, 1458, -20241, -9923, -10781, -28288, -12621, -2446, 5018, 7583, 26363, 19994, -15982, 14549, -7600, -53613, -95587, -62490, -49774, -48288, -25243, 13698, 5714, -12493, -28586, -20440, 1470, 11932, 23735, 22773, 10198, 4027, 855, -2524, 5756, 23490, 43629, 28129, 9478, 21427, 6163, -5734, 12862, 4274, -6423, 3005, -18664, -32711, -15383, -2513, 3094, -5667, -12839, -14746, -9585, -5429, -14615, -21046, -51806, -60064, 1183, 12099, -6960, -1781, -25664, -52435, -31888, -9087, -7660, -10815, -34572, -18763, -6047, 17394, 7639, -5322, -11629, 14906, 41605, 30022, 21449, 13159, 215, 40418, 52493, 41954, 33886, 45797, 20728, 25848, 31230, 13954, 11497, -7498, -24901, -37291, -43919, -48399, -43779, -21560]
4518b1560o080J3976N619j0537K2240K039k0701o301J1525j7195m481k346n927
4505c9729n338K1780J6220j0136p489J1207M3434K1292q880j1660j1901L8o967
4492A1871o425p744k983j8335j9049J8618J2883j2974K6348K0559k4862K3172
4480B1079K4458k4760k3305k5771J7615N375l710O687M220r861o445J3440Q574
4467G596L72j3299K1544L4112l3340j5027J3092o725j6094L321R179L452l189
4454D994K32K0776k8434j6222J3769L5794l853k6303N961J2380j0659n2670j0755
4441e4990J3477J6943L7712O822k8151r915M091O152k6638q947K0768O18J1265
4428a0793J6887p193j1703J6512M112j5615j6553R556M5537J9396n012j9335k7990
$$ y = [-21560, -27640, -13664, -8045, -18582, 3658, 5697, -15004, -21305, -9780, -26975, -31456, -33802, -39729, -45067, -23287, -7067, -17203, -24692, -13485, 29949, 51241, 42361, 30701, 18800, 18838, 11871, 5446, -2298, -5281, -23616, -42665, -24047, -11164, -24138, 2210, 22769, -2093, 21079, 45537, 20777, -2528, -28299, -10684, -5309, -9019, -2332, 1888, -7973, -14418, -978, 7596, 7968, -5331, 16213, 50325, 16985, 1958, 15050, 8325, -7769, -4448, 4731, 8183, 4994, 5226, 26002, -2432, -18654, -4885, 30909, 27056, 753, 6714, 19094, 8435, -44235, -54990, -41513, -24570, 13142, 19964, -8187, -18102, -14011, -7859, -34497, -43444, -22676, -22058, -10793, 6094, -1099, -12802, 3710, 7822, -7793, -24346, -14790, 30747, 50143, 45131, 25796, -2194]
4415b194J5463J2787l3626k1435J2135q915k0096K266J0128P760j2650J4371K5254
4402A248r832j2608O981J6673j7888q926K5840J082L987j3171j0835P66r358j1701
4388c7742P162L7000n735p177J9381k125J4783j1974M560K8551k5712R61r796
4375A2137n780O274j5001K3247J8020j3160j0101j7624p37Q260j8703l086L4281
4362A8027L2740j53p227k8715j3155L9970K265k5416o307J817j0571q56j33Q458
4348A0744P569j3662P301M249k7798l621j0425K3535Q692j926M5452L8558k250
4335H6418k3017l2239Q508j0954O290Q243K186J814o130k5973j4054k2922J1093
4322a0737o420q218O513J22m612k652J3670p414J3157L2239L66k2197j0888J1310
$$ y = [-2194, 13269, 26056, -7570, -29005, -16870, -25785, -45881, -43615, -33487, -25727, -38377, -24006, 1248, -8584, -21192, -14211, 2462, -15426, -24352, 1488, 2570, 6557, -6614, -17449, -16683, -26041, -37742, -30580, 6420, 685, -6492, 12889, 10764, 25547, 13573, 18133, 46684, 20972, 21933, 12137, 6357, 12631, -2370, 20877, 38897, 25737, 15636, -1988, -2725, 5535, -13168, -16254, 18027, 50767, 50614, 43387, 14672, 1517, 41487, 43752, 18336, 12029, 13846, 3275, 2419, 2286, 10744, 18313, 4651, 11952, 16201, -11597, -15218, -25643, -2108, 6584, 4658, 50110, 88668, 86418, 63401, 31162, 39670, 28716, 35006, 43249, 45435, 47249, 41119, 15146, 1092, -21830, -10737, -17157, -25375, -18862, -18740, -23352, -26004, -12334, -19748, -6591, 25648, 26014, 3817, -7071, 4239]
4308D239J1141Q111J2859k7812K322o922j0703j3591k6752J7798J3555K033j0172
4295b3894j1322k696L2022K3624j9287j3377J5717j3605j3333J0651K2020J1j9009
4282a2478m021M5354k342p463K5969j0558j9516j3427J1165n36j2726J5289k34
4269A4476n2551J463p201J9034L6494j0618l9769J0069L6404M921l861P265l820
4256A2306M250j9887k1293M338J1479r549q726k0103L063L6836Q496o454J5235
4243I991P579L061J3109l797j1788k6244K510r152n297P703J7236J1131J722j6967
$$ y = [4239, 15380, 23491, 36350, 8538, 10860, 3938, -6765, -20356, -47108, -29310, -15755, -13722, -23894, -35216, -37912, -5890, 17734, -1553, -14930, 787, -12818, -26151, -15500, 6520, 6531, -12478, -16499, 28855, 26513, 19050, 45019, 34461, 14945, 1518, 12683, 12147, -579, 14710, 14476, -38075, -36612, -43813, -24779, 11715, 1097, -38672, -28603, 7801, 12722, 8861, 16126, 12306, 16556, -3331, -24624, -20286, -8807, -18356, -27082, -47185, -44122, -7286, 1210, -5244, 9991, 17570, 20631, 33740, 29943, 18155, -8089, -5579, -14731, -20028, -12325, 4911, 16042, 17764, 797]
$$ [...]
##END NTUPLES=NMR SPECTRUM
##END=
