##TITLE=Analysis number 311489
Compound Code cc 44346
Book Reference 433/111/4
Project Code adrs
Chemist Name victoriam
##JCAMPDX= 6.0         $$ Bruker NMR JCAMP-DX V2.0
##DATA TYPE= NMR SPECTRUM
##DATA CLASS= NTUPLES
##ORIGIN= Bruker BioSpin GmbH
##OWNER= NMR
$$ XWIN-NMR		Version 3.5
$$ Fri Jul  8 11:53:42 2005 GMT Daylight Time (UT+1h)  MAYBRIDGE\NMR@NMR_250MHZ
##.OBSERVE FREQUENCY= 250.131544655141
##.OBSERVE NUCLEUS= ^1H
##.ACQUISITION MODE= SIMULTANEOUS (DQD)
##.ACQUISITION SCHEME= undefined
##.AVERAGES= 16
##.DIGITISER RES= 18
##SPECTROMETER/DATA SYSTEM= dpx250
##.PULSE SEQUENCE= zg30
##.SOLVENT NAME= CDCl3
##.SHIFT REFERENCE= (INTERNAL, CDCl3, 0, 16.522)
##AUDIT TRAIL= $$ (NUMBER, WHEN, WHO, WHERE, WHAT)
$$ ##TITLE= Audit trail, XWIN-NMR		Version 3.5
$$ ##JCAMPDX= 5.01
$$ ##ORIGIN= Bruker BioSpin GmbH
$$ ##OWNER= NMR
$$ C:\u/data/dgb/nmr/ADRS/5520/pdata/1/auditp.txt
$$ ##AUDIT TRAIL=  $$ (NUMBER, WHEN, WHO, WHERE, WHAT)
(   1,<2005-07-08 11:52:58.66 +100>,<MAYBRIDGE\NMR>,<NMR_250MHZ>,
      <created by zg, POWCHK disabled, PULCHK disabled
       configuration hash MD5:
       62 19 C7 07 E1 42 D1 B7 37 6C 3D D0 77 39 F9 E6
       data hash MD5: 64K
       F0 1C 27 A5 9F 92 EB CD ED B8 65 7A 2B 39 EC 4A>)
(   2,<2005-07-08 11:53:16.41 +100>,<MAYBRIDGE\NMR>,<NMR_250MHZ>,
      <Start of raw data processing
       ef LB = 0.3 FT_mod = 6 PKNL = 1 SI = 32K 
       data hash MD5: 32K
       D3 E8 1D 78 C1 1A 5A D7 F9 C2 6E 39 62 F4 CF 6C>)
(   3,<2005-07-08 11:53:19.79 +100>,<MAYBRIDGE\NMR>,<NMR_250MHZ>,
      <apk 
       data hash MD5: 32K
       03 FD 57 3D 62 97 56 3C 08 26 02 8D FB 5E 15 45>)
(   4,<2005-07-08 11:53:21.04 +100>,<MAYBRIDGE\NMR>,<NMR_250MHZ>,
      <abs ABSG = 5 
       data hash MD5: 32K
       2B 78 D9 D0 4A E5 A5 47 77 82 DF FB EE 29 92 DC>)
$$ ##END=
$$ 
$$ hash MD5
$$ CE E5 EB C6 0B 63 9C AD D8 40 B2 7B 60 84 F1 BE
##$RELAX= 
##$RELAX= 
##$RELAX= 
##$RELAX= 
##$RELAX= 
##$RELAX= 
##$RELAX= 
$$ Bruker specific parameters
$$ --------------------------
##$DU= <C:\u>
##$EXPNO= 5520
##$NAME= <ADRS>
##$PROCNO= 1
##$TYPE= <nmr>
##$USER= <dgb>
##$AMP= (0..31)
100 100 100 100 100 100 100 100 100 100 100 100 100 100 100 100 100 100 
100 100 100 100 100 100 100 100 100 100 100 100 100 100 
##$AQSEQ= 0
##$AQ_mod= 3
##$AUNM= <au_zg>
##$AUTOPOS= <22 >
##$BF1= 250.13
##$BF2= 250.13
##$BF3= 250.13
##$BF4= 250.13
##$BF5= 500.13
##$BF6= 500.13
##$BF7= 500.13
##$BF8= 500.13
##$BYTORDA= 1
##$CFDGTYP= 0
##$CFRGTYP= 5
##$CHEMSTR= <none>
##$CNST= (0..31)
1 1 145 1 1 1 1 1 1 1 1 1 1 1 1 1 1 1 1 1 1 1 1 1 1 1 1 1 1 1 1 1 
##$CPDPRG= <>
##$CPDPRG1= <>
##$CPDPRG2= <>
##$CPDPRG3= <>
##$CPDPRG4= <mlev>
##$CPDPRG5= <mlev>
##$CPDPRG6= <mlev>
##$CPDPRG7= <mlev>
##$CPDPRG8= <mlev>
##$CPDPRGB= <>
##$CPDPRGT= <>
##$D= (0..31)
0 1 0 0 0 0 0 0 0 0.06 0 0 0 0 0 0 0.0002 0 0 0 0 0 0 0 0 0 0 0 0 0 0 
0 
##$DATE= 1120819976
##$DBL= (0..7)
120 120 120 120 120 120 120 120 
##$DBP= (0..7)
150 150 150 150 150 150 150 150 
##$DBP07= 0
##$DBPNAM0= <>
##$DBPNAM1= <>
$$ [...]
##$SUBNAM6= <"">
##$SUBNAM7= <"">
##$SUBNAM8= <"">
##$SUBNAM9= <"">
##$SW= 20.6930455092707
##$SWIBOX= (0..15)
0 0 3 0 0 0 0 0 0 0 0 0 0 0 0 0 
##$SW_h= 5175.983436853
##$TD= 65536
##$TD0= 1
##$TE= 295.16
##$TE2= 300
##$TE3= 300
##$TEG= 300
##$TL= (0..7)
0 120 120 120 120 120 120 120 
##$TP= (0..7)
150 150 150 150 150 150 150 150 
##$TP07= 0
##$TPNAME0= <>
##$TPNAME1= <>
##$TPNAME2= <>
##$TPNAME3= <>
##$TPNAME4= <>
##$TPNAME5= <>
##$TPNAME6= <>
##$TPNAME7= <>
##$TPOAL= (0..7)
0.5 0.5 0.5 0.5 0.5 0.5 0.5 0.5 
##$TPOFFS= (0..7)
0 0 0 0 0 0 0 0 
##$TUNHIN= 0
##$TUNHOUT= 0
##$TUNXOUT= 0
##$USERA1= <user>
##$USERA2= <user>
##$USERA3= <user>
##$USERA4= <user>
##$USERA5= <user>
##$V9= 5
##$VALIST= <valist>
##$VCLIST= <CCCCCCCCCCCCCCC>
##$VD= 0
##$VDLIST= <DDDDDDDDDDDDDDD>
##$VPLIST= <PPPPPPPPPPPPPPP>
##$VTLIST= <TTTTTTTTTTTTTTT>
##$WBST= 1024
##$WBSW= 4
##$XGAIN= (0..3)
0 0 0 0 
##$XL= 0
##$YL= 0
##$YMAX_a= 418246
##$YMIN_a= -497901
##$ZGOPTNS= <>
##$ZL1= 120
##$ZL2= 120
##$ZL3= 120
##$ZL4= 120
##$ABSF1= 16.522
##$ABSF2= -4.171173
##$ABSG= 5
##$ABSL= 3
##$ALPHA= 0
##$AQORDER= 0
##$ASSFAC= 0
##$ASSFACI= 0
##$ASSFACX= 0
##$ASSWID= 0
##$AUNMP= <proc_1d>
##$AZFE= 0.1
##$AZFW= 0.1
##$BCFW= 0
##$BC_mod= 0
##$BYTORDP= 0
##$COROFFS= 0
##$CY= 12.5
##$DATMOD= 1
##$DC= 0
##$DFILT= <>
##$DTYPP= 0
##$F1P= 14.0000005364418
##$F2P= -0.99999901652339
##$FCOR= 0.5
##$FTSIZE= 32768
##$FT_mod= 6
##$GAMMA= 0
##$GB= 0
##$INTBC= 1
##$INTSCL= 1
##$ISEN= 128
##$LB= 0.3
##$LEV0= 0
##$LPBIN= 0
##$MAXI= 10000
##$MC2= 0
##$MEAN= 0
##$ME_mod= 0
##$MI= 0
##$NCOEF= 0
##$NC_proc= -4
##$NLEV= 6
##$NOISF1= 0
##$NOISF2= 0
##$NSP= 0
##$NTH_PI= 0
##$NZP= 0
##$OFFSET= 16.522
##$PC= 1
##$PHC0= 129.675
##$PHC1= 6.636521
##$PH_mod= 1
##$PKNL= yes
##$PPARMOD= 0
##$PSCAL= 4
##$PSIGN= 0
##$REVERSE= no
##$SF= 250.13
##$SI= 32768
##$SIGF1= 0
##$SIGF2= 0
##$SINO= 400
##$SIOLD= 32768
##$SREGLST= <1H.CDCl3>
##$SSB= 0
##$STSI= 32768
##$STSR= 0
##$SW_p= 5175.98343685301
##$SYMM= 0
##$S_DEV= 0
##$TDeff= 65536
##$TDoff= 0
##$TI= <Analysis number 999999
Compound Code 99
Book Reference 9
Project Code 9>
##$TILT= no
##$TM1= 0
##$TM2= 0
##$TOPLEV= 0
##$USERP1= <user>
##$USERP2= <user>
##$USERP3= <user>
##$USERP4= <user>
##$USERP5= <user>
##$WDW= 1
##$XDIM= 32768
##$YMAX_p= 581020304
##$YMIN_p= -66732
$$ End of Bruker specific parameters
$$ ---------------------------------
##NTUPLES= NMR SPECTRUM
##VAR_NAME=  FREQUENCY,     SPECTRUM/REAL,   SPECTRUM/IMAG
##SYMBOL=    X,             R,               I
##VAR_TYPE=  INDEPENDENT,   DEPENDENT,       DEPENDENT
##VAR_FORM=  AFFN,          ASDF,            ASDF
##VAR_DIM=   32768,         32768,           32768
##UNITS=     HZ,            ARBITRARY UNITS, ARBITRARY UNITS
##FACTOR=    0.157963299565203, 1,           1
##FIRST=     4132.6476996994, 0,             0
##LAST=      -1043.33573715361, 0,           0
##MIN=       -1043.33573715361, -66732,      0
##MAX=       4132.6476996994, 581020304,     0
$$ Real data points
##PAGE= N=1
##DATA TABLE= (X++(R..R)), XYDATA
$$ [...]
16353a9409J6737L604M620k719m505m899m006P832J073J735J6752l658M04j0880
$$ -19409 -2672 932 5552 2833 -1672 -6571 -10577 -2745 -1672 63 16815 13157 13561 2681
16339B681j1500k233J707J0925k697j340j4701j4436R47j949q98k357p488O014
$$ 2681 -8819 -11052 -9345 1580 -1117 -2457 -17158 -31594 -30647 -32596 -33494 -35851 -43339 -37325
16325c7325P441Q376J815k193m285J0763R410n269L452l189Q213J1543m068k1736
$$ -37325 -29884 -21508 -19693 -21886 -26171 -15408 -5998 -11267 -7815 -11004 -2791 8752 4684 -17052
16311a7052o311k228k405K315J383O059L146j601L669m775J4234J0876o152j424
$$ -17052 -23363 -25591 -27996 -25681 -24298 -18239 -15093 -16694 -13025 -17800 -3566 7310 1158 -266
16297b66p769m883n216j2059r205J3708q46R983O293j0575m940M165J1783O287
$$ -266 -8035 -12918 -18134 -30193 -39398 -25690 -26536 -16553 -10260 -20835 -25775 -21610 -9827 -3540
16283c540j433k075l978K0448P391o05j846J444J822K392M2l077r619m915M272
$$ -3540 -4973 -7048 -11026 9422 16813 16208 14362 15806 17628 20020 20062 16985 7366 2451 6723
16268F723l184r255p220r517J173j259L794L983l23P961L322m50O011k335j214
$$ 6723 3539 -5716 -12936 -22453 -21280 -22539 -18745 -14762 -15085 -7124 -3802 -4252 1759 -576 -1790
16253a790j4893j336J042j687l490k728O495J2539j1004m16N159M756r443j001
$$ -1790 -16683 -18019 -16977 -18664 -22154 -24882 -18387 -5848 -16852 -17268 -12109 -7353 -16796 -17797
16239a7797L775M695P82o427k682j1800p31K497K0711Q199j1450l116J2078r115
$$ -17797 -14022 -9327 -8545 -14972 -17654 -29454 -30185 -27688 -6977 1222 -10228 -13344 -1266 -10381
16225a0381j2782P171J2798q73j0500M741J440M364J3825J636m341N830L133n083
$$ -10381 -23163 -15992 -3194 -4067 -14567 -9826 -8386 -4022 9803 11439 7098 12928 16061 10978
16211A0978l596o626j5244q987N601J6298Q449J2759j1860p145K145Q484j1380
$$ 10978 7382 756 -14488 -23475 -17874 -1576 6873 19632 7772 627 2772 11256 -124
16198a24o64p587l942j4601m273N069R587O689j023j0330j0823n999L943M696
$$ -124 -788 -8375 -12317 -26918 -31191 -26122 -16535 -9846 -10869 -21199 -32022 -38021 -34078 -29382
16184b9382J1778J2799O052j976O587J457j068M773j557n018J90P824k842J523
$$ -29382 -17604 -4805 1247 -729 5858 7315 6247 11020 9463 4445 4635 12459 9617 11140
16170A1140M46j9497j3269K408o701j0473p747J4871O641P84o396J2264k478k844
$$ 11140 11586 -7911 -21180 -18772 -25473 -35946 -43693 -28822 -22181 -21397 -27793 -15529 -18007 -20851
16156b0851M563N487j1824l972J1959J4005j1431j1956N821R831J2198k976j084
$$ -20851 -16288 -10801 -22625 -26597 -14638 -633 -12064 -24020 -18199 -8368 3830 854 -230
16143b30Q482m698p360O694L005l999O920M654o435n982p259J604K503p15l49
$$ -230 8252 3554 -3806 2888 5893 1894 8814 13468 7033 1051 -6208 -4604 -2101 -2816 -3165
16128c165j233N370R75P692r830j3757N207k964J531N050J2506k505o176j727
$$ -3165 -4398 972 1947 9639 -191 -13948 -8741 -11705 -10174 -5124 7382 4877 -1299 -3026
16114c026l11R414J414m488l913L809K820J881O36j590j1694Q595q215r310K123
$$ -3026 -3337 6077 7491 3003 -910 2899 5719 7600 8236 6646 -5048 3547 -4668 -13978 -11855
16099a1855K843o04j7244n730N399J9012R435n498p46P447p700o657j089J0064
$$ -11855 -9012 -9616 -26860 -32590 -27191 -8179 1256 -4242 -4988 2459 -5241 -11898 -12987 -2923
16085b923o039k579J4824Q407l644p229n596J915L927p944j988N594L505J1172
$$ -2923 -8962 -11541 3283 11690 8046 817 -4779 -2864 1063 -6881 -8869 -3275 230 11402
16071A1402O641l463p021k0952k734q053q203J2421J1390J5153q194q284j2324
$$ 11402 18043 14580 7559 -13393 -16127 -24180 -32383 -19962 -8572 6581 -1613 -9897 -22221
16058b2221j925J460P077J0066n603j688R027P344j5268L261O009j4580n436J3373
$$ -22221 -24146 -22686 -15609 -5543 -11146 -12834 -3807 3537 -11731 -8470 -2461 -17041 -22477 -9104
16044i104J2500J1877K65o765j0641r87N942m281m235p872o492j464O016L016
$$ -9104 3396 15273 15538 8773 -1868 -2855 3087 -1194 -5429 -13301 -19793 -21257 -15241 -12225
16030a2225J7782J2162j1201j0821m327p417k025j03M002J645l828p11j042j2959
$$ -12225 5557 17719 6518 -4303 -8630 -16047 -18072 -18175 -14173 -12528 -16356 -17067 -18109 -31068
16016c1068M623K612M330P007j0303p004l593J3758J0213N778j0578j1511j727
$$ -31068 -26445 -23833 -19503 -12496 -22799 -29803 -33396 -19638 -9425 -3647 -14225 -25736 -27463
16003b7463J9284K238m653p631O943J6351Q29p741j1720r640p985N622j72m400
$$ -27463 -8179 -5941 -10594 -18225 -11282 5069 5898 -1843 -13563 -23203 -31188 -25566 -25738 -30138
15989c0138L244J3017P581K801p463j4303R367J2979j7289j1931K180J2716o11
$$ -30138 -26894 -13877 -6296 -3495 -10958 -25261 -15894 -2915 -20204 -32135 -29955 -17239 -17850
15976a7850l612L005k877J736P38J3510N094j3386L063J1761n098j0169j6429
$$ -17850 -21462 -18457 -21334 -19598 -18860 -5350 -256 -13642 -10579 1182 -3916 -14085 -30514
15963c0514J703K010Q766j44J5071R931j7487j2594k857N787j060l441L487j65
$$ -30514 -28811 -26801 -18035 -18179 -3108 6823 -10664 -23258 -26115 -20328 -21388 -24829 -21342 -21507
15949b1507J0592K456K652o012Q92O308r36R67J2395O818L554m754r733J167J965
$$ -21507 -10915 -8459 -5807 -11819 -10927 -4619 -5555 -4588 7807 14625 18179 13425 3692 4859 6824
15934F824m885n837Q774N40j0485Q188o571p673N47q6O099m270m653J268m15O809
$$ 6824 1939 -3898 4876 5416 -5069 3119 -3452 -11125 -10578 -10664 -4565 -8835 -13488 -12220 -12635 -5826
15918e826q289l675K2401j479j1901m745o721N21j064m507J5615L128j1389o303
$$ -5826 -14115 -17790 4611 3132 -8769 -13514 -20235 -19714 -20778 -25285 -9670 -6542 -17931 -24234
15904b4234R235j736R947M629j876m570j272l657j742m908o344J2704J3246J797
$$ -24234 -14999 -16735 -6788 -2159 -4035 -8605 -9877 -13534 -15276 -20184 -26528 -13824 -578 1219
15890A219P82M611j548j0454j5898m455J0007J088K457n565P872Q194l078j0598
$$ 1219 2001 6612 5064 -5390 -21288 -25743 -15736 -14648 -12191 -17756 -9884 -1690 -4768 -15366
15876a5366J175J1493j1775p09J448M304J5903R099j072j1619n882j6332j3589
$$ -15366 -14191 -2698 -14473 -15182 -13734 -9430 6473 15572 14500 2881 -3001 -19333 -32922
15863c2922Q865Q98j1347j654M50R220R523J0240K838k440N081L298r822o986
$$ -32922 -24057 -23159 -34506 -36160 -35710 -26490 -16967 -6727 -3889 -6329 -1248 2050 -7772 -14758
15849a4758k664O469K87R30K146j4711j889Q905R021q95m991p319J0995K861r106
$$ -14758 -17422 -10953 -10666 -9736 -7590 -22301 -24190 -15285 -6264 -7159 -12150 -19469 -8474 -5613 -14719
15834a4719j1470k044l186K40J6262l217k312m247M290J0270R923n357m726R920
$$ -14719 -26189 -28233 -31419 -31179 -14917 -18134 -20446 -24693 -20403 -10133 -210 -5567 -10293 -373
15820c73j706j1200l213J4342M942k2115q646P402o251K503o335m530M074m950
$$ -373 -2079 -13279 -16492 -2150 2792 -19323 -27969 -20567 -26818 -24315 -30650 -35180 -31106 -36056
15806c6056l65J0384J0188K264J213k908n629L759O256o737j2148m718J0694j13
$$ -36056 -36421 -26037 -15849 -13585 -12372 -15280 -20909 -17150 -10894 -17631 -29779 -34497 -23803 -23916
15792b3916P36j016J085M21j961m505L960k483L446J4002N380k722j0149p215
$$ -23916 -23180 -24196 -23111 -22690 -24651 -29156 -25196 -27679 -24233 -10231 -4851 -7573 -17722 -24937
15778b4937R22m745o294j1704K518J674k119J1420J4849j3697j5106J303L339
$$ -24937 -24015 -28760 -35054 -46758 -44240 -42566 -44685 -33265 -18416 -32113 -47219 -45916 -42577
15765d2577K2163J167j0157K998N318Q014J4560L070j9587r668J4970J862l992
$$ -42577 -20414 -19247 -29404 -26406 -21088 -13074 1486 4556 -15031 -24699 -9729 -7867 -11859
15752a1859n878j749J400k761o727n150l017Q562M944n205j0110m323J1650Q944
$$ -11859 -17737 -19486 -18086 -20847 -27574 -32724 -35741 -27179 -22235 -27440 -37550 -41873 -30223 -21279
15738b1279m71j119k590Q726m844j278R699k338j889K132K08J4641p094j2156
$$ -21279 -21750 -22869 -25459 -16733 -21577 -22855 -13156 -15494 -17383 -15251 -15043 -402 -7496 -19652
15724a9652j616j804o27J1360J6886l223R67k0373j1615K064M36q93p8q82l825
$$ -19652 -21268 -23072 -23699 -12339 4547 1324 2291 -18082 -29697 -27633 -27197 -28090 -28168 -29050 -32875
15709c2875N958N753k592L500j1290m461J300O107M003P428o19J0618J845j3285
$$ -32875 -26917 -21164 -23756 -20256 -31546 -36007 -34707 -28600 -24597 -17169 -17788 -7170 -5325 -18610
15695a8610L048j9352K343K879p825k678M511K164O761R773O578N875M669k604
$$ -18610 -15562 -34914 -32571 -29692 -37517 -40195 -35684 -33520 -26759 -16986 -10408 -4533 136 -2468
15681b468j1093j1637j1754j490k257P10R521K512N05M895k082m134r63O070j364
$$ -2468 -13561 -25198 -36952 -38442 -40699 -39989 -30468 -27956 -27451 -22556 -24638 -28772 -29735 -23665 -25029
15666b5029j7717L91K5318R371q180k114j6006l875O944O573M964K319L384R792
$$ -25029 -42746 -42355 -17037 -7666 -15846 -17960 -33966 -37841 -30897 -24324 -19360 -17041 -13657 -3865
15652c865p948k1719l200J491m234R465R744M764n620J963o069j1675p444o31
$$ -3865 -11813 -33532 -36732 -35241 -39475 -30010 -20266 -15502 -21122 -19159 -25228 -36903 -44347 -44978
15638d4978l267M611L493O891J2367J34O14O007O896o821j1156R47k773p511o390
$$ -44978 -48245 -43634 -40141 -33250 -20883 -20749 -20135 -14128 -7232 -14053 -25209 -24262 -27035 -34546 -40936
15623d0936J232m446J1161J2508r88M671m748r846n351p139M212K078O842m246
$$ -40936 -39704 -44150 -32989 -20481 -21469 -16798 -21546 -31392 -36743 -43882 -39670 -37592 -30750 -34996
15609c4996J1112M029j4309o915Q971J2622K004j0042M61q100P006o632L043O691
$$ -34996 -23884 -19855 -34164 -41079 -32108 -19486 -17482 -27524 -27063 -35163 -28157 -34789 -31746 -25055
15595b5055q472m502J2781J244J454L799O307r155J1535j5016j0941R752R276
$$ -25055 -33527 -38029 -25248 -24004 -22550 -18751 -12444 -21599 -10064 -25080 -36021 -26269 -16993
15582a6993L754L479J856r976n832N892J2634j527p223n190q969j10l822J746
$$ -16993 -13239 -9760 -7904 -17880 -23712 -17820 -5186 -6713 -13936 -19126 -28095 -28205 -32027 -30281
15568c0281L495j710L636L962k563k810q470k469J5294R323J4827L399j5723k351
$$ -30281 -26786 -28496 -24860 -20898 -23461 -26271 -34741 -37210 -21916 -12593 2234 5633 -10090 -12441
15554a2441j728m245J2603p353L056R107N374q883k108l009r900o176J0235J8881
$$ -12441 -14169 -18414 -5811 -13164 -10108 -1001 4373 -4510 -6618 -9627 -19527 -25703 -15468 3413
15540C413m268n014m82j6316J517J5189K447n461m221j0984n524j166P944m551
$$ 3413 -855 -5869 -6351 -22667 -21150 -5961 -3514 -8975 -13196 -24180 -29704 -30870 -22926 -27477
15526b7477j5862p887J2783J1455Q916M488j6674j2165o268J2696k346p41N511
$$ -27477 -43339 -51226 -38443 -26988 -18072 -13584 -30258 -42423 -48691 -35995 -38341 -39082 -33571
15513c3571P432Q874k465R101n89o354j0454M590M648L143N113L518o711o478
$$ -33571 -26139 -17265 -19730 -10629 -11218 -17572 -28026 -23436 -18788 -15645 -10532 -7014 -13725 -20203
15499b0203N282m777R510P138M152R595p407l660q025j1468n69Q907J128p847
$$ -20203 -14921 -19698 -10188 -3050 1102 10697 3290 -370 -8395 -19863 -20432 -11525 -10397 -18244
15485a8244L633O705Q643j112r323l908p246q280r333J0565J3470N908o02M808
$$ -18244 -14611 -7906 737 -375 -9698 -13606 -20852 -29132 -38465 -27900 -14430 -8522 -9124 -4316
15471d316J0330K490j7550n296o359j957L680j0879P955N357J4930J5043k063
$$ -4316 6014 8504 -9046 -14342 -20701 -22658 -18978 -29857 -21902 -16545 -1615 13428 11365
15458A1365N224r982j0869j1066O25J3795O961l473l002j4832j3841o860O34J8106
$$ 11365 16589 6607 -4262 -15328 -14703 -908 6053 2580 -422 -15254 -29095 -35955 -35321 -17215
15444a7215J0065p425J57l08j4282L863j4034k701N57J2946K3961J0698r497o997
$$ -17215 -7150 -14575 -14418 -14726 -29008 -25145 -39179 -41880 -41323 -28377 -4416 6282 -3215 -10212
15430a0212j1989n527m362J2532J213n623P541M564j9687Q11K503L39J8329N886
$$ -10212 -22201 -27728 -32090 -19558 -18345 -23968 -16427 -11863 -31550 -30739 -28236 -27897 -9568 -3682
15416c682j8001j993L124r185j012M911k91L112o825j1238N044R287N23m071o373
$$ -3682 -21683 -23676 -20552 -29737 -30749 -25838 -26129 -23017 -29842 -41080 -36036 -26749 -26226 -30297 -36670
15401c6670J1870J1621M714L457j013l825q332L240j176k963R579J3447N610q299
$$ -36670 -24800 -13179 -8465 -5008 -6021 -9846 -18178 -14938 -16114 -19077 -9498 3949 9559 1260
15387A260j5436j661q22q409j751l955r384n441J1485K3375J9339j5311j1571
$$ 1260 -14176 -15837 -16659 -25068 -26819 -30774 -40158 -45599 -34114 -10739 8600 -6711 -18282
15374a8282O282m58K441j2900o260J798M343N66j8647k374J0131Q20m711l538
$$ -18282 -12000 -12458 -10017 -22917 -29177 -27379 -23036 -22470 -41117 -43491 -33360 -32540 -37251 -40789
15360d0789K5404L517J3653J79j312j0613j1226l421O955Q273O29n903R159k708
$$ -40789 -15385 -11868 1785 1964 652 -9961 -21187 -24608 -17653 -9380 -8751 -14654 -5495 -8203
15346h203q701j0508l836L651p428k788O878O605N565Q006N271N348r431l419
$$ -8203 -16904 -27412 -31248 -27597 -35025 -37813 -30935 -24330 -18765 -10759 -5488 -140 -9571 -12990
15332a2990N15n510o689m744L5J1174K289j400j103j387k990N631M938l804J0193
$$ -12990 -12475 -17985 -24674 -29418 -29383 -18209 -15920 -17320 -18423 -19810 -22800 -17169 -12231 -16035 -5842
15317e842Q530k080j2090j2427K45L635L938M593J998j64pn42m218p350K12K065
$$ -5842 2688 608 -11482 -23909 -23664 -20029 -16091 -11498 -9500 -9664 -9671 -10213 -14431 -21781 -21569 -19504
15301a9504J471O681K1392j0281j4820q742o720o403j264N819J4775O020r178
$$ -19504 -18033 -11352 10040 -241 -15061 -23803 -30523 -36926 -38190 -32371 -17596 -11576 -20754
15288b0754j033N501n727j026q33j4241N74K0150P748o308N90J674j699N390r98
$$ -20754 -21787 -16286 -22013 -23039 -23872 -38113 -37539 -17389 -9641 -15949 -15359 -13685 -15384 -9994 -10992
15273a0992j681K499k947n167j614j27p364k419J1803P289J473P666k101j511
$$ -10992 -12673 -10174 -13121 -18288 -19902 -20029 -27393 -29812 -18009 -10720 -9247 -1581 -3682 -5193
15259e193m212j1331J248O13j1227M238k269J7245R831l633M29r670n481m617
$$ -5193 -9405 -20736 -19488 -18875 -30102 -25864 -28133 -10888 -1057 -4690 -4261 -13931 -19412 -24029
15245b4029o150j0396K581K2986N652m486J289J983j2929J0603J5291m116q836
$$ -24029 -30179 -40575 -37994 -15008 -9356 -13842 -12553 -10570 -23499 -12896 2395 -1721 -10557
15232a0557q046q965q284O675N982o910M352P812M876l195p187q731m772N643
$$ -10557 -18603 -27568 -35852 -29177 -23195 -30105 -25753 -17941 -13065 -16260 -23447 -32178 -36950 -31307
15218c1307n168m558j37J2197J4789J5653j789j2501J117L137L098p290q022N2
$$ -31307 -36475 -41033 -41170 -28973 -14184 1469 -320 -12821 -11704 -8567 -5469 -12759 -20781 -20729
15204b0729L885j597m483J865Q223q806O920J3492n987m921n52L049n358l57o608
$$ -20729 -16844 -18441 -22924 -21059 -12836 -21642 -14722 -1230 -7217 -12138 -12690 -9641 -14999 -15356 -21964
15189b1964m082K118P481O218J5857m96k0472j1383P198p34o331L251Q456P032
$$ -21964 -26046 -23928 -16447 -10229 5628 5132 -15340 -26723 -19525 -20259 -26590 -23339 -14883 -7851
15175g851k068J344M576Q395J516J655p161j2342J4524L380q357M689l505K718
$$ -7851 -9919 -8575 -3999 4396 5912 7567 406 -11936 2588 5968 -2389 2300 -1205 1513
15161A513L633o964l226K390n950k237P268j811n241q182n298q632J363J3291
$$ 1513 5146 -1818 -5044 -2654 -8604 -10841 -3573 -5384 -10625 -18807 -24105 -32737 -31374 -18083
15147a8083m158J688J0100O293l829J1026p863o611O748m08M252K413j8483k616
$$ -18083 -22241 -20553 -10453 -4160 -7989 3037 -4826 -11437 -4689 -5097 -845 1568 -16915 -19531
15133a9531j0755j0653J739J528l566J1637r295m56k086j495L792P113M491l952
$$ -19531 -30286 -40939 -39200 -37672 -41238 -29601 -38896 -39352 -41438 -42933 -39141 -32028 -27537 -31489
15119c1489J980n49K675j1226O503R505K454L651M242J1909m569r221j497J0060
$$ -31489 -29509 -30058 -27383 -38609 -32106 -22601 -20147 -16496 -12254 -345 -4914 -14135 -15632 -5572
15105e572o131j6488j425o285N997O65Q790J3625m968J094L595j624R42J0910
$$ -5572 -11703 -28191 -29616 -35901 -29904 -29239 -20449 -6824 -11792 -10698 -7103 -8727 -7785 3125
15091C125k181j3387m738j0289j434K239O604j406k527k413R1Q244J1575o133
$$ 3125 944 -12443 -17181 -27470 -28904 -26665 -20061 -21467 -23994 -26407 -26316 -18072 -6497 -12630
15077a2630m543l266r676J0620J4959l145o925J0242J2413r727j5991j416K0533
$$ -12630 -17173 -20439 -30115 -19495 -4536 -7681 -14606 -4364 8049 -1678 -17669 -19085 1448
15064A448J3000k471o010r612o586n435m521J2362j0600k577m74q45J3524J370
$$ 1448 14448 11977 5967 -3645 -10231 -15666 -20187 -7825 -18425 -21002 -21476 -22321 -8797 -7427
15050g427j932K501r036j3174p983J2967N707j4050l186K0295O915m607m386n307
$$ -7427 -9359 -6858 -15894 -29068 -37051 -24084 -18377 -32427 -35613 -15318 -8403 -13010 -17396 -22703
15036b2703L436j770P592k526j2347N879J2879N341j1217J767p44L457O921N469
$$ -22703 -19267 -21037 -13445 -15971 -28318 -22439 -9560 -4219 -15436 -13669 -14413 -10956 -4035 1434
15022A434M32j0770L528P036J2945P82r848J520l64J5440n463j6923J3579L155
$$ 1434 1866 -8904 -5376 1660 14605 15387 5539 7059 6695 22135 16672 -251 13328 16483
15008A6483N504k479j2528l027m500Q370K855q716r621q870q941r394R741J5690
$$ 16483 21987 19508 6980 3953 -547 7823 10678 1962 -7659 -16529 -25470 -34864 -25123 -9433
14994i433j3944k046L749N283m842q753o536J365J1738N873M405Q874j2036m129
$$ -9433 -23377 -25423 -21674 -16391 -21233 -29986 -36522 -35157 -23419 -17546 -13141 -4267 -16303 -20432
14980b0432O389k351M77o205M179M184j790l438k2nO833P696r49M362k426K36
$$ -20432 -14043 -16394 -15917 -22122 -17943 -13759 -15549 -18987 -19009 -19014 -12181 -4485 -5434 -1072 -3498 -3262
14964c262m476P287J73m229j9124k1111p391r1Q283J5305P051J1002K563l893
$$ -3262 -7738 -451 -278 -4507 -23631 -44742 -52133 -52224 -43941 -28636 -21585 -10583 -8020 -11913
14950a1913k230J618k131n000k419l467O286Q965m221q037m379l071j5223M353
$$ -11913 -14143 -12525 -14656 -19656 -22075 -25542 -19256 -10291 -14512 -22549 -26928 -29999 -45222 -40869
14936d0869J9325J1610K008r816k3013M230R631L570Q82l026R95k99P087n518
$$ -40869 -21544 -9934 -7926 -17742 -40755 -36525 -26894 -23324 -22442 -25468 -24473 -24772 -17685 -23203
14922b3203M534m057N618q202k453r525j6585P698M760J0314k56L730k194O214
$$ -23203 -18669 -22726 -17108 -25310 -27763 -37288 -53873 -46175 -41415 -31101 -31357 -27627 -29821 -23607
14908b3607O238J1596N956l175R346p078j3524q583j3243k612j48k013J4843Q064
$$ -23607 -17369 -5773 183 -2992 6354 -724 -14248 -22831 -36074 -38686 -38834 -40847 -26004 -17940
14894a7940j344j2570L046K3705J5078q297j1839j906l297j4319j1909N452N213
$$ -17940 -19284 -31854 -28808 -5103 9975 1678 -10161 -12067 -15364 -29683 -41592 -36140 -30927
14881c0927j984m338N711Q494J0499P190j8233q010M722M749J771Q762P435K805
$$ -30927 -32911 -37249 -31538 -23044 -12545 -5355 -23588 -31598 -26876 -22127 -20356 -11594 -4159 -1354
14867a354L257o020n26q004o335J94J507J7233O384j6335j1047j90N22N28k931
$$ -1354 1903 -4117 -4643 -12647 -18982 -18788 -17281 -48 6336 -9999 -21046 -21236 -20714 -20186 -23117
14852b3117r300J0791J0900j553J994M997p227K464P932r500n459k329l426j1136
$$ -23117 -32417 -21626 -10726 -12279 -10285 -5288 -12515 -10051 -2119 -11619 -17078 -19407 -22833 -33969
14838c3969m047j3680k899K730O103J2466N576J1557K384l633j2081N435J712
$$ -33969 -38016 -51696 -54595 -51865 -45762 -33296 -27720 -16163 -13779 -17412 -29493 -24058 -22346
14825b2346o09N604n439q822Q66O769J0171n517J947N095p155q116m51K89J1626
$$ -22346 -22955 -17351 -22790 -31612 -30746 -23977 -13806 -19323 -17376 -12281 -19436 -27552 -28003 -27714 -16088
14810a6088K722O936j0211J958n635Q898J6590l042j2262k1067J841M749j547
$$ -16088 -13366 -6430 -16641 -14683 -20318 -11420 5170 2128 -10134 -31201 -29360 -24611 -26158
14797b6158M258J0990j0662l290K852o031J84l285m399n228Q256l3O38K385j2332
$$ -26158 -21900 -10910 -21572 -24862 -22010 -28041 -27857 -31142 -35541 -40769 -32513 -32546 -31908 -29523 -41855
14782d1855j5799O212P694L834J6487R829j3685q800K017q633N88J4853K223k381
$$ -41855 -57654 -51442 -43748 -39914 -23427 -13598 -27283 -36083 -34066 -42699 -42111 -27258 -25035 -27416
14768b7416m37n928J0013K696J3525J5706q741p855j538Q443K525j2036j7334
$$ -27416 -27853 -33781 -23768 -21072 -7547 8159 -582 -8437 -9975 -1532 993 -11043 -28377
14755b8377k859J5547J0497n734j5014k869j829Q348l430J076J4841m729q458
$$ -28377 -31236 -15689 -5192 -10926 -25940 -28809 -30638 -22290 -25720 -24644 -9803 -14532 -22990
14742b2990m972M520j193m413J577R20j703K630L104j671L981J0773N521J575
$$ -22990 -27962 -23442 -24635 -29048 -27471 -26551 -28254 -25624 -22520 -24191 -20210 -9437 -3916 -2341
14728b341k256P080p585K73Q967J3218M8j5532k500O09J549o219m448o666m108
$$ -2341 -4597 2483 -5102 -4829 4138 17356 17404 1872 -628 -19 1530 -4689 -9137 -15803 -19911
14713a9911N469n227J3344O164j5347k03m43n619J4428P663J2399m536p356q888
$$ -19911 -14442 -19669 -6325 -161 -15508 -15711 -16154 -21773 -7345 318 12717 8181 825 -8063
14699h063j2106j0177J662o035n12l306N542M88j2021j7240N114J3938J1975R862
$$ -8063 -20169 -30346 -28684 -34719 -35231 -38537 -32995 -32507 -44528 -61768 -56654 -42716 -30741 -20879
14685b0879K612q796k956K794k21l502j924O95J053j545J2196L735k693j848r361
$$ -20879 -18267 -27063 -30019 -27225 -27446 -30948 -32872 -32177 -31124 -32669 -20473 -16738 -19431 -21279 -30640
14670c0640j956K744k97k142J963K2710J3851o821o342O500l755r319p262n067
$$ -30640 -32596 -29852 -30149 -32291 -30328 -7618 6233 -588 -6930 -430 -4185 -13504 -20766 -25833
14656b5833n433j7382j148L206P924N827n125n785m912J7348J7379L448j4726
$$ -25833 -31266 -48648 -49796 -46590 -38666 -32839 -37964 -43749 -48661 -31313 -13934 -10486 -25212
14643b5212j746q895J3097M114M101P40O092j4427r637m752j2721m960N615O347
$$ -25212 -26958 -35853 -22756 -18642 -14541 -13801 -7709 -22136 -31773 -36525 -49246 -54206 -48591 -42244
14629d2244K157j037k902R40J225J07J6900J0654j1880J282K964N100R361j728
$$ -42244 -40087 -41124 -44026 -43086 -41861 -41754 -24854 -14200 -26080 -24798 -21834 -16734 -7373 -9101
14615i101r497j6659j8J0457R429R628l468N784L939p489p103Q60n956n501P656
$$ -9101 -18598 -35257 -35275 -24818 -15389 -5761 -9229 -3445 494 -6995 -14098 -13238 -19194 -24695 -17039
14600a7039o74K664J4343L306n95l827k264k1405j4328R462o23N625m974J950
$$ -17039 -17713 -15049 -706 2600 2005 -1822 -4086 -25491 -39819 -30357 -30980 -25355 -30329 -28379
14586b8379J23L703Q330m287p585M846J4724J0175m359j2239p447o413J0412Q403
$$ -28379 -28256 -24553 -16223 -20510 -28095 -23249 -8525 1650 -2709 -14948 -22395 -28808 -18396 -9993
14572i993l265J452M828K684l076p740l731L618M997p07Q40j994o637J067n542
$$ -9993 -13258 -11806 -6978 -4294 -7370 -15110 -18841 -15223 -10226 -10933 -10093 -12087 -18724 -17657 -23199
14557b3199L781K148N747O829j919j0415k138o896l702P224J969O847K453n214
$$ -23199 -19418 -17270 -11523 -4694 -6613 -17028 -19166 -26062 -29764 -22540 -20571 -13724 -11271 -16485
14543a6485J0695J3117r245M14l609M563m156J03M579L926J4112J7028n577J807
$$ -16485 -5790 7327 -1918 -1504 -5113 -550 -4706 -4603 -24 3902 18014 35042 29465 31272
14529C1272m944N301k03M916L261J1339P01k848q189j4660q921j2916N494m483
$$ 31272 26328 31629 31426 36342 39603 50942 51643 48795 40606 25946 17025 4109 9603 5120
14515E120j7851j7837j829K3098J7290K971J382J1110l863k1976j0058J322M322
$$ 5120 -12731 -30568 -32397 -9299 7991 10962 12344 23454 19591 -2385 -12443 -11121 -6799
14502f799l413R342L671J518j1746j0723J904J1112k628j028J994p465r70R727
$$ -6799 -10212 -870 2801 4319 -7427 -18150 -16246 -5134 -7762 -8790 -6796 -14261 -15231 -5504
14488e504m201j6041l811r87J0675J5469l89J683o267k1562l741M093Q562k871
$$ -5504 -9705 -25746 -29557 -30544 -19869 -4400 -4789 -3106 -9373 -30935 -34676 -30583 -22021 -24892
14474b4892o215R017N143q019k785M912o027J0823N047m433o780K303J0625K383
$$ -24892 -31107 -22090 -16947 -24966 -27751 -22839 -28866 -18043 -12996 -17429 -24209 -21906 -11281 -8898
14460h898n000O501M723l503K923P440k783k0438p348J0006LR73P224M882j0196
$$ -8898 -13898 -7397 -2674 -6177 -3254 4186 1403 -19035 -26383 -16377 -16374 -15401 -8177 -3295 -13491
14445a3491r856j7963k689K685l16J0069J3423q325p078L846o919P903J3182m735
$$ -13491 -23347 -41310 -43999 -41314 -41630 -31561 -18138 -26463 -33541 -29695 -36614 -28711 -15529 -20264
14431b0264l47j655N180J959j7292P987Q373k626p140J1073J185p834N926J2811
$$ -20264 -20611 -22266 -17086 -15127 -32419 -24432 -16059 -18685 -25825 -14752 -13567 -21401 -15475 -2664
14417b664o549o857o206M2r845k441k950J1216J1211p283k683J000q90J2068j760
$$ -2664 -9213 -16070 -22276 -22234 -32079 -34520 -37470 -26254 -15043 -22326 -25009 -24009 -24899 -12831 -14591
14402a4591j5984P464M667M1o427l821R119O831n858q386o499J0705K441J964
$$ -14591 -30575 -23111 -18444 -18403 -24830 -28651 -19532 -12701 -18559 -26945 -33444 -22739 -20298 -18334
14388a8334P605M631o483L854p950o748M574J4388j0518J631P241q69k114q75
$$ -18334 -10729 -6098 -12581 -8727 -16677 -23425 -18851 -4463 -14981 -13350 -6109 -6978 -9092 -9967
14374i967j1193j6831M114K182l652K2757N561j5007j7976n219J3318J3030J2586
$$ -9967 -21160 -37991 -33877 -31695 -35347 -12590 -7029 -22036 -40012 -45231 -31913 -18883 -6297
14361f297N322j186q682P923j1149k0868r63M804L877K764J1042r49L632k18p79
$$ -6297 -975 -2161 -10843 -2920 -14069 -34937 -35900 -31096 -27219 -24455 -13413 -14362 -10730 -10948 -11727
14346a1727L617J733k344j456q093m456o209J1J0933R506L496q371O67R757O785
$$ -11727 -8110 -6377 -8721 -10177 -18270 -22726 -28935 -28924 -17991 -8485 -4989 -13360 -12693 -2936 3849
14331C849p406M441j0771j2520M952J0590R114j9169j1807p571m890J0252k740
$$ 3849 -3557 884 -9887 -22407 -17455 -6865 2249 -16920 -28727 -36298 -41188 -30936 -33676
14318c3676j165N608L188N625Q917n270k55O845j2160j5572k806k008J0324J1939
$$ -33676 -34841 -29233 -26045 -20420 -11503 -16773 -17028 -10183 -22343 -37915 -40721 -42729 -32405 -20466
14304b0466R670K776r889J0668k653p908J2119j983k287k681m586J2042Q498j2142
$$ -20466 -10796 -8020 -17909 -7241 -9894 -17802 -5683 -7666 -9953 -12634 -17220 -5178 3320 -8822
14290h822o699j0570J5004K568P189j3181q074o81o843k098J0563J2289R294k629
$$ -8822 -15521 -26091 -11087 -8519 -1330 -14511 -22585 -23266 -30109 -32207 -21644 -9355 -61 -2690
14276b690r987l694M227R543N63k30J140p899J640N588q763j1076j4380n704O393
$$ -2690 -12677 -16371 -12144 -2601 -2038 -2268 -1128 -9027 -7387 -1799 -10562 -21638 -36018 -41722 -35329
14261c5329o000n61J981J6457L260Q768j247k0216l719k434J0970J0674R194m68
$$ -35329 -41329 -41890 -39909 -23452 -20192 -11424 -12671 -32887 -36606 -39040 -28070 -17396 -8202 -8670
14247h670j0355n87k630L296J0082J3176K078l477O916n237n428k506q459k0079
$$ -8670 -19025 -19612 -22242 -18946 -8864 4312 6390 2913 9829 4592 -836 -3342 -11801 -31880
14233c1880n032R686J0887j721p96K754M788J1540j5039j3105M998J2840J77k669
$$ -31880 -36912 -27226 -16339 -18060 -18856 -16102 -11314 226 -14813 -27918 -22920 -10080 -9903 -12572
14219a2572J0483p375j5066K72P726J694j787o444J2976Q593o580n077r45K806
$$ -12572 -2089 -9464 -24530 -24258 -16532 -14838 -16625 -23069 -10093 -1500 -8080 -13157 -14102 -11296
14205a1296p37P767R891o432j1061n161j1680K348n841L299J7837L972k199N849
$$ -11296 -12033 -4266 5625 -807 -11868 -17029 -28709 -26361 -32202 -28903 -11066 -7094 -9293 -3444
14191c444p763o840K393J1562p435K59o570k810k524J7518R357j2054o496R209
$$ -3444 -11207 -18047 -15654 -4092 -11527 -11268 -17838 -20648 -23172 -5654 3703 -8351 -14847 -5638
14177e638O025j711L299J1305N041n150p700Q204J1980N570J3732j886p444n596
$$ -5638 387 -1324 1975 13280 18321 13171 5471 13675 25655 31225 44957 43071 35627 30031
14163C0031o604k437L503k873P418N298J932J1445L322o903p203o043p877Q531
$$ 30031 23427 20990 24493 21620 29038 34336 36268 47713 51035 44132 36929 30886 23009 31540
14149C1540R304M616q379K8M902Q614J0929m422o1M091N341L798L083K424m887
$$ 31540 40844 45460 37081 37109 42011 50625 61554 57132 57071 61162 66503 70301 73384 75808 70921
14134G0921K658J085m659j565o321J3107J5793J1429Q041j278O457J5457J3678
$$ 70921 73579 74664 70005 68440 62119 75226 91019 102448 110489 109211 115668 131125 144803
14121A44803N987Q752O833M987O26N090m438K1241K9134K6557J4938K2250K4912
$$ 144803 150790 159542 166375 171362 171988 177078 172640 193881 223015 249572 264510 286760 311672
14108C11672K8859K7734K5683L7124M5427L5083N2946N4263O8351Q9785J05515
$$ 311672 340531 368265 393948 431072 476499 511582 564528 618791 687142 776927 882442
14097H82442Q5868J11330J39900J56262J97407K31112K84976L47293M54729N79773
$$ 882442 968310 1079640 1219540 1375802 1573209 1804321 2089297 2436590 2891319 3471092
14087C471092P10158Q87104J057446J173564J248713J198278R73586N95228J41005
$$ 3471092 4181250 5068354 6125800 7299364 8548077 9746355 10719941 11315169 11456174
14078A1456174l27251p78795j134547j307899j356958j299065j099114q26240
$$ 11456174 11128923 10350128 9215581 7907682 6550724 5251659 4152545 3326305
14070C326305n90560m00370k65722j92643j65876j21563j04828j01520r6550o1671
$$ 3326305 2735745 2335375 2069653 1877010 1711134 1589571 1484743 1383223 1286673 1225002
14060A225002o4476o0673n1918m0695l0213j7475j3480j0405j1759k3466r211
$$ 1225002 1160526 1099853 1047935 1007240 977027 959552 946072 935667 923908 900442 891231
14049H91231j3496k7517k6435l9955n4046l5654l5630l7895m2004k8683l2461
$$ 891231 877735 850218 823783 783828 729782 694128 658498 620603 578599 549916 517455
14038E17455k9984l2952l1197r454j3180k3075k6606k8402j4045k049j4417j5476
$$ 517455 487471 454519 423322 413868 400688 377613 351007 322605 308560 306511 292094 276618
14026B76618j2303k0559p742r859m956p004n758o878m41j584J068R503l274j6375
$$ 276618 264315 243756 236014 226155 221199 214195 208437 201559 201118 199534 200602 210105 206831 190456
14012A90456o612j3936j2396M295j8903j4773j6947j333p140j6426j719n279k794
$$ 190456 183844 169908 157512 161807 142904 128131 111184 109851 102711 86285 84566 79287 76493
13999G6493M980J295p111r433j4662m356l520o690k118J5976O721j4032j6006
$$ 76493 81473 82768 75657 66224 51562 47206 43686 36996 34878 50854 57575 43543 27537
13986B7537j0791K07R650N415o220j6672r204L345J797o227J994Q39P984M623
$$ 27537 16746 16953 26603 32018 25798 9126 -78 3267 5064 -1163 831 1670 9654 14277
13972A4277K843N131P845n656j939l581J1589R620j9064k003J6907o944l292r440
$$ 14277 17120 22251 30096 24440 22501 18920 30509 40129 21065 19062 35969 29025 25733 16293
13958A6293j3089J5548J0423p969l141J4461r237o622N815K334q365p864L157
$$ 16293 3204 18752 29175 21206 18065 32526 23289 16667 22482 24816 16451 8587 11744
13945A1744L758P420L041J2543r173r310N168J9346N415l929R1P624J3426j1137
$$ 11744 15502 22922 25963 38506 29333 20023 25191 44537 49952 46023 46114 53738 67164 56027
13931E6027J2259J6264N569P663J9137J3918N816k66J513m720O392L708j2610
$$ 56027 68286 84550 90119 97782 116919 130837 136653 136387 137900 133180 139572 143280 130670
13918A30670k252j1544j839j8582j0954N100n760l183l38j584R459N423L539O399
$$ 130670 128418 116874 115035 96453 85499 90599 84839 81656 81318 79734 89193 94616 98155 104554
13904A04554J1712N530j0746o902O926q894j7188J501P8j577J005j903q478r772
$$ 104554 116266 121796 111050 104148 111074 102180 84992 86493 86571 84994 85999 84096 75618 65846
13890F5846j9955q300Q416j785l296k154Q299N882K473O83o451J109J2495P39
$$ 65846 45891 37591 46007 44222 40926 38772 47071 52953 55426 56109 49658 50767 63262 64001
13876F4001j8099j836R040o90n629K860K704J389k5472r873J8068K1254M157j0565
$$ 64001 45902 44066 53106 52416 46787 49647 52351 53740 28268 18395 36463 57717 61874 51309
13862E1309K216N388P421K298Q452J2012R44N343N225Q186l460L627j626j981
$$ 51309 53525 58913 66334 68632 77084 89096 90040 95383 100608 108794 105334 108961 107335 105354
13848A05354M323l836L226k98J459J1081j54M702J6261J4440o508r923M881J6012
$$ 105354 109677 105841 109067 108769 110228 121309 121155 125857 142118 156558 150050 140127 145008 161020
13834A61020K5468K2627J6947J1335J1281N308J250J5257K9261K2129L7576N3515
$$ 161020 186488 209115 226062 237397 248678 253986 255236 270493 299754 321883 359459 412974
13822D12974L4350L9219M7309O6678R3370J13161J32253J62524K01577K31247
$$ 412974 447324 486543 533852 600530 693900 807061 939314 1101838 1303415 1534662
13812A534662K48188K81693K90784K82422K20204J59352P4471q566j07618j90109
$$ 1534662 1782850 2064543 2355327 2637749 2857953 3017305 3091776 3083210 2975592 2785483
13802B785483k52079l04170l22644k96892k51176k19655j78205j39959j01922
$$ 2785483 2533404 2229234 1906590 1609698 1358522 1138867 960662 820703 718781
13793G18781q9878n2576m1568m3881l2434l7597k4297j2381j4894k3507j8754
$$ 718781 628903 576327 534759 490878 458444 420847 396550 384169 369275 345768 327014
13782C27014n65q679j5213j7079O788N223j5898j2987j3947l689p034j1658j3049
$$ 327014 326449 317770 302557 285478 292266 297489 281591 268604 254657 250968 243934 232276 219227
13769B19227q820j9282j4751m258j3319j1479J378N67j508k306j9203k3942j2871
$$ 219227 210407 191125 176374 172116 158797 147318 148696 149263 147755 145449 126246 102304 89433
13756H9433k831j1353o71J3324j2200p382l606q46J4149R68j1540j0774p143n335
$$ 89433 86602 75249 74578 87902 75702 68320 64714 63868 78017 78985 67445 56671 49528 44193
13742D4193l422O314K169o315k97M326K121K245j455k340o856q222J812k840n428
$$ 44193 40771 47085 49254 42939 42642 46968 49089 51334 49879 47539 40683 32461 34273 31433 26005
13727B6005q297k905k040J50Q114R754k383n066m242O93L193N929N12q368K043
$$ 26005 17708 14803 12763 12913 21027 30781 28398 23332 19090 19783 22976 28905 29417 21049 23092
13712B3092K630m848n643K100J6105J5850l20K76L484j1298O887J748N321J841
$$ 23092 25722 20874 15231 17331 33436 49286 48966 49242 52726 41428 48315 50063 55384 57225
13698E7225r310j1897LJ4598Q596j2430m450J1095J4979Q963J753K462O259K563
$$ 57225 47915 36018 36021 50619 59215 46785 42335 53430 68409 77372 79125 81587 87846 90409
13684I0409l64O941K787l958l644j5276J0369n102j056N182j7840j3392J459k058
$$ 90409 90045 96986 99773 95815 92171 76895 87264 82162 81106 86288 68448 55056 56515 54457
13670E4457J2127o034j1751M61o914M608J1258J8829m61J2672J8059m101J0025
$$ 54457 66584 60550 48799 49260 42346 46954 58212 77041 76580 89252 107311 103210 113235
13657A13235P636k680J5550R415K614J3471L421J2898K6732K8918M266N876K2186
$$ 113235 120871 118191 133741 143156 145770 159241 162662 175560 202292 231210 235476 241352 263538
13644B63538L4730K8973J4379L1540M9131N1400M9953O6383Q8142J14008J25994
$$ 263538 298268 327241 341620 373160 422291 473691 523644 590027 678169 792177 918171
13633I18171J55357K00285K23317K45072K60074K61654K50460K13603J61744P4333
$$ 918171 1073528 1273813 1497130 1742202 2002276 2263930 2514390 2727993 2889737 2964070
13623B964070J1943o3946j45276k14454k51048k63093k58693k56374k33931k08482
$$ 2964070 2976013 2912067 2766791 2552337 2301289 2038196 1779503 1523129 1289198 1080716
13613A080716j66690j23045j04679n8884l0839k0589k6178l5129m1751k8565j9674
$$ 1080716 914026 790981 686302 627418 596579 575990 549812 514683 472932 444367 424693
13602D24693k8741j9145j5672l379q676o382r809j1427j6975O67N57j5031j9701
$$ 424693 395952 376807 361135 357756 349080 342698 332889 321462 304487 305154 305711 290680 270979
13589B70979j6944j5259j766j6902k9681j3327o859M104j3622o319n173m299j7529
$$ 270979 254035 238776 237010 220108 190427 177100 170241 174345 160723 154404 149231 144932 127403
13576A27403o214p613O469M639j2793m385n271o049p659o48n728l925R520O226
$$ 127403 121189 113576 120045 124684 111891 107506 102235 96186 88527 87879 82151 78226 87746 93972
13562I3972j0983M8J61p126n498l361M575N514J6179O997L648j3438l393M783
$$ 93972 82989 83037 83198 76072 70574 67213 71788 77302 93481 100478 104126 90688 87295 92078
13548I2078j820R612P257P528J1363j628j2998o668J1950Q968L191J3825J7931
$$ 92078 90258 99870 107127 114655 126018 124390 111392 104724 116674 125642 128833 142658 160589
13535A60589J6463J9906R48p707j1499M776p251j0454n286l091k329o312p681
$$ 160589 177052 196958 197906 190199 178700 183476 176225 165771 160485 157394 155065 148753 141072
13522A41072j2528j2033j4483n728J0901Q37j8536j5916l393q756j0217O09J591
$$ 141072 128544 116511 102028 96300 107201 108038 89502 73586 70193 61437 51220 51829 53420
13509E3420k680Q782o261q1j3481n982Q452K243J2668j55j2529n537K254O437
$$ 53420 50740 59522 53261 53180 39699 33717 42169 44412 57080 56925 44396 38859 41113 47550
13495D7550j2082r031J272L727J747k570r478M740J0993j299p793j1291m471P755
$$ 47550 35468 26437 27709 31436 33183 30613 21135 25875 36868 35569 27776 16485 12014 19769
13481A9769J525l148p303J0715M342n921j279p462n899J049J0361L329J3834J7488
$$ 19769 21294 18146 10843 21558 25900 19979 18700 11238 5339 6388 16749 20078 33912 51400
13467E1400j3539j9915p06J3597P911L386K975J5104J1301n447m513O487P249
$$ 51400 37861 17946 17240 30837 38748 42134 45109 60213 71514 66067 61554 68041 75290
13454G5290o003l309j2443m179j781j2004j808L597m591r645Q45m814l871M491
$$ 75290 69287 65978 53535 49356 47575 35571 33763 37360 32769 23124 23969 19155 15284 19775
13440A9775r399p017K914O409M742q12L994N515o726q546J384J726K99j0604N835
$$ 19775 10376 3359 6273 12682 17424 16612 20606 26121 19395 10849 12233 13959 14258 3654 9489
13425I489M739j4039J403R414l281Q478J3441m021r369K554M42R675p144k7115
$$ 9489 14228 189 1592 11006 7725 16203 29644 25623 16254 18808 19250 28925 21781 -5334
13411e334p404J4296q20j94M026o77m548N619j1110j607M383P756J6659r063k75
$$ -5334 -12738 1558 738 544 4570 3893 -655 4964 -6146 -7753 -3370 4386 21045 11982 11707
13396A1707J7367l458M908J1738k431j7573j449j4785q549J1479k50Q80R408R868
$$ 11707 29074 25616 30524 42262 39831 22258 20809 6024 -2525 8954 8704 9584 18992 28860
13382B8860r053n724j08P420R712m069m59j0423J1784L201m55p10k55K14O212
$$ 28860 19807 14083 13975 21395 31107 27038 26579 16156 27940 31141 30686 29976 29721 29935 36147
13367C6147j4966j2859L007Q443M796M129q189j3111n606j1723M337O752N255
$$ 36147 21181 8322 11329 19772 24568 28697 20508 7397 1791 -9932 -5595 1157 6412
13354F412J767J0131P456J4454j0453q813Q251L887m9j3187j6714j3286J0133
$$ 6412 8179 18310 25766 40220 29767 20954 29205 33092 33043 19856 3142 -10144 -11
13341a1P552P985j1388p227P221M580j269n593R85p573l768j8681M831R606O065
$$ -11 7541 15526 4138 -3089 4132 8712 7443 1850 2835 -4738 -8506 -27187 -22356 -12750 -6685
13326f685l047r140j942J1136N235J0200m86O861M89o492j1209q413L354P057
$$ -6685 -9732 -18872 -20814 -9678 -4443 5757 5271 12132 12621 6129 -5080 -13493 -10139 -3082
13312c082p306k691Q22K276M061N356M709J7689J217j1765p982j2127L845P83
$$ -3082 -10388 -13079 -12257 -9981 -5920 -564 4145 21834 23051 11286 3304 -8823 -4978 -4195
13298d195K123Q643j695j3020O908n651m590p027m850j853O733J51J5947K5922
$$ -4195 -2072 6571 4876 -8144 -1236 -6887 -11477 -18504 -23354 -25207 -18474 -18323 -2376 23546
13284B3546O296o904j637n213M38l360j2280J23P82o65L306M650L899O85R94j3535
$$ 23546 29842 22938 21301 16088 16526 13166 886 1009 1791 1126 4432 9082 12981 13666 14660 1125
13268A125j0426j793N806J6006n928j4935l912J3332R051O211j399k07Q12J462
$$ 1125 -9301 -11094 -5288 10718 4790 -10145 -14057 -725 8326 14537 13138 12931 13743 15205
13254A5205k944j956M782j5668k325O838N66j3370j611Q21o008J28J3498K0576
$$ 15205 12261 10305 15087 -581 -2906 3932 4498 -8872 -10483 -9662 -15670 -15542 -2044 18532
13240A8532q260k96Q057m445n036m751q659N87L203p997L010o39j7435J3784J7392
$$ 18532 10272 9976 18033 13588 8552 3801 -4858 -4271 -1068 -9065 -6055 -6694 -24129 -10345 7047
13225G047r343j2115j701l541L836O591R078Q677o98N996M297j0320j9069j2511
$$ 7047 -2296 -14411 -16112 -19653 -15817 -9226 -148 8529 7831 13827 18124 7804 -11265 -23776
13211b3776j315J3847K752N169l732p053j635p73J220J1550J1461J3595J3773
$$ -23776 -25091 -11244 -8492 -3323 -7055 -14108 -15743 -16516 -15296 -3746 7715 21310 35083
13198C5083j3756k0055j4051M486J2130m020m075J0011j226l353r875M425J1051
$$ 35083 21327 1272 -12779 -8293 3837 -183 -4258 5753 4527 1174 -8701 -4276 6775
13185F775J2637M350J831r901M709q222j0147j034Q659o414q665J497K547M143
$$ 6775 19412 23762 25593 15692 20401 12179 2032 998 9657 3243 -5422 -3925 -1378 2765
13171B765P959m856m621J900L603o270m28q639p170k892j755P931N72m091o577
$$ 2765 10724 5868 1247 3147 6750 480 52 -8587 -15757 -18649 -20404 -12473 -11901 -15992 -22569
13156b2569O551J2314N949J948L050n130L132q957o716m607o67K776O306N532
$$ -22569 -16018 -3704 2245 4193 7243 2113 5245 -3712 -10428 -15035 -15702 -12926 -6620 -1088
13142a088O477J0298l067j4370p824k303K070J8506J0428j1508k1849L877J0345
$$ -1088 5389 15687 12620 -1750 -9574 -11877 -9807 8699 19127 7619 -14230 -10353 -8
13129hJ1209o914k792j672n919J689j0918j0103j64J3606L465J797k9r73p495
$$ -8 11201 4287 1495 -177 -6096 -4407 -15325 -25428 -25592 -11986 -8521 -6724 -6753 -7726 -15221
13114a5221o662R946l657j842L320R026J658j1302J028J6920J0328O742k462j2559
$$ -15221 -21883 -11937 -15594 -17436 -14116 -5090 -3432 -14734 -13706 3214 13542 20284 17822 5263
13100E263n850O489N040Q113R739Q045q117m757O378m561L417K8588j416p264
$$ 5263 -587 5902 10942 19055 28794 36839 28722 23965 30343 25782 29199 57787 56371 49107
13086D9107J7006O544j8216k7004L536Q40n209J6583o697p709J714k3013j8199
$$ 49107 66113 72657 54441 27437 30973 31813 26604 43187 36490 28781 30495 7482 -10717
13073a0717J6467J9918L869M69j19r292J901J4111P666O789K381j3771q556j0843
$$ -10717 5750 25668 29537 30006 29887 20595 22496 36607 44273 51062 53443 39672 31116 20273
13059B0273q248k271L037M752m254P642p495o521L312J5875P231l004j5195k294
$$ 20273 12025 9754 12791 17543 13289 20931 13436 6915 10227 26102 33333 30329 15134 12840
13045A2840K0501J5498M348m420m815Q103N311m632l029k221l372J3016O834K045
$$ 12840 33341 48839 53187 48767 43952 52055 57366 52734 49705 47484 44112 57128 63962 66007
13031F6007M875J3050P726N346Q680N76P678J6294J3579J2525K0837K1293J4687
$$ 66007 70882 83932 91658 97004 105684 106260 113938 130232 143811 156336 177173 198466 213153
13018B13153P212K4519L4928M7591M5374N6001P5856P9368J09994J33493J24443
$$ 213153 220365 244884 279812 327403 372777 428778 504634 584002 693996 827489 951932
13007I51932J44855J56012J29288P5744L7361J748m6929j06614j47064j38787
$$ 951932 1096787 1252799 1382087 1457831 1495192 1496940 1450011 1343397 1196333 1057546
12997A057546j49628j40948j30361j12188q1697o5508m7408m0942k5242j4039
$$ 1057546 907918 766970 636609 524421 442724 377216 329808 288866 263624 249585
12987B49585j6440j7076J129j2422q356o279j042m850k231l7k905k668L543L903
$$ 249585 233145 216069 217198 204776 196420 190141 189099 184249 182018 181981 179076 176408 179951 183854
12973A83854j1785Q300K175j2521j3293j1187j0519q709j9507Q451m302r69k55
$$ 183854 172069 180369 182544 170023 156730 145543 135024 126315 106808 115259 110957 109988 109733
12960A09733j3792k844J9858l686j4223k305L693j1492j1532n453j2140j817P001
$$ 109733 95941 93097 112955 109269 95046 92741 96434 84942 73410 67957 55817 54000 61001
12947F1001J0048j2422k0316j669l191M91o708Q532O873j5241o406o215p173j3858
$$ 61001 71049 58627 38311 36642 33451 33942 27234 35766 42639 27398 20992 14777 7604 -6254
12933f254Q347N76N415J609N474l407K492O411N816L997j3352j4157N106J3501
$$ -6254 2093 2669 8084 9693 15167 11760 14252 20663 26479 30476 17124 2967 8073 21574
12919B1574o552L944p900K734j329p15l63j3739j6141k371R507K079j1981L890
$$ 21574 15022 18966 11066 13800 12471 11756 11393 -2346 -18487 -20858 -11351 -9272 -21253 -17363
12905a7363k101m43J5494J3448Q710J2750K874R93j1041k152K465q626K4J1821
$$ -17363 -19464 -19907 -4413 9035 17745 30495 33369 34362 23321 21169 23634 15008 15032 26853
12891B6853n26J697j560j0355o238j2352o64J1930n560N026K126P696Q24p391
$$ 26853 26327 28024 26464 16109 9871 -2481 -3145 8785 3225 8251 10377 18073 18897 11506
12877A1506p701o278Q187J3602J1295K033p906O333m489J271l037q281p668Q129
$$ 11506 3805 -2473 5714 19316 30611 32644 24738 31071 26582 27853 24816 16535 8867 16996
12863A6996J6512k77k312K761L18J1159J4808J48j1972K0956J873q810J6995J9685
$$ 16996 33508 33231 30919 33680 33998 45157 59965 60113 48141 69097 70970 62160 79155 98840
12849I8840J7312J1277K8219L6817K8167J3880K6446L2704K4583L6083J6847k230
$$ 98840 116152 127429 155648 192465 220632 234512 260958 293662 318245 354328 371175 368945
12837C68945q016o110l141k3903k2370l2598k9831k3329j7169k9528k4645k6542
$$ 368945 360929 354819 351678 327775 305405 272807 242976 219647 202478 172950 148305 121763
12825A21763k4502p020j6471J890Q802J508p650j1911n851j926P93m207k078J3035
$$ 121763 97261 90241 73770 75660 84462 85970 78320 66409 60558 58632 59425 55218 53140 66175
12811F6175O874j8373j431l817J84J934M430O448j1168r823J1934m86n356O70
$$ 66175 73049 54676 53245 49428 49612 51546 55976 62424 51256 41433 53367 52881 47525 48195
12797D8195m718p944q109j2692l506q410j3101J0365M26k0661k6972p810J819
$$ 48195 43477 35533 27424 14732 11226 2816 -10285 80 506 -20155 -47127 -54937 -53118
12784e3118m423J0068L1901J8377L048K6629L3262K2302K1082J1754J1552J7287
$$ -53118 -57541 -47473 -15572 2805 5853 32482 65744 88046 109128 120882 132434 149721
12772A49721j646q528q298p95J3263J7809K3848J0716J791p855K727L243j7809
$$ 149721 148075 139547 131249 130454 143717 161526 185374 196090 197881 190026 192753 195996 178187
12759A78187k4795j2550o886M825Q23m055o754J5611O224R325N340L064j444o844
$$ 178187 153392 140842 133956 138781 139604 135549 128795 144406 150630 159955 165295 168359 166915 160071
12745A60071K2697J7579L019K732j5917J354J5817K0722n97j2485J779R085J5249
$$ 160071 182768 200347 203366 206098 190181 191535 207352 228074 227477 214992 216771 225856 241105
12732B41105J6070J7355K0009J8457K588J1436L2088J9474J8505K1243Q712K9212
$$ 241105 257175 274530 294539 312996 315584 327020 359108 378582 397087 418330 427042 456254
12720D56254L5376J0618R327J3575L0431L1903K974p809j27r736j1523k1313k7182
$$ 456254 491630 502248 511575 525150 555581 587484 590458 582649 582522 572786 561263 539950 512768
12707E12768j2695j6192j5929K210J015q819j786M53j7808p743l335M208J0688
$$ 512768 500073 483881 467952 470162 471177 462358 460572 461025 443217 435474 432139 436347 447035
12694D47035K5127K8702R577M46R496Q175Q623O802J0052N259K0525L0016K5904
$$ 447035 472162 500864 510441 510887 520383 528558 537181 543983 554035 559294 579819 609835 635739
12681F35739M0681M8688L8902M3233K9085K1682K1793L0713L4733K4516L2389
$$ 635739 676420 725108 764010 807243 836328 858010 879803 910516 945249 969765 1002154
12670A002154K6562L1708L6910K1130L0222L8196L5608L7143L4344M6463N0897
$$ 1002154 1028716 1060424 1097334 1118464 1148686 1186882 1222490 1259633 1293977 1340440 1391337
12659A391337L6645K2712L5822M0271N3739N1242N3558N1614M0125N0127O5098
$$ 1391337 1427982 1450694 1486516 1526787 1580526 1631768 1685326 1736940 1777065 1827192 1892290
12648A892290M0582M7462O8173N9646N4712N7918O6243O8779P1114O2403O0194
$$ 1892290 1932872 1980334 2048507 2108153 2162865 2220783 2287026 2355805 2426919 2489322 2549516
12637B549516O4255O3531P0126R9009J04549J13779J23524J46144J74535J76025
$$ 2549516 2613771 2677302 2747428 2846437 2950986 3064765 3188289 3334433 3508968 3684993
12627C684993J74826J98800K15169K06505K35766K65868K80862L13784L57087
$$ 3684993 3859819 4058619 4273788 4480293 4716059 4981927 5262789 5576573 5933660
12618E933660L84681M07793M65379N26469N78888O37234P03926P74381Q79620
$$ 5933660 6318341 6726134 7191513 7717982 8296870 8934104 9638030 10412411 11292031
12609A1292031R97416J106351J251821J442114J642491J874266K142607K442453
$$ 11292031 12289447 13395798 14647619 16089733 17732224 19606490 21749097 24191550
12601B4191550K755652L081310L487415L962337M576025N443783O623768Q243564
$$ 24191550 26947202 30028512 33515927 37478264 42054289 47498072 54121840 62365404
12593F2365404J0419435J3178640J6468300K0080402K3733737K6893701K8610210
$$ 62365404 72784839 85963479 102431779 122512181 146245918 173139619 201749829
12586B01749829K7890828K4281760J8151287J0188182R89978q904701j8356317
$$ 201749829 229640657 253922417 272073704 282261886 283251864 274347163 255990846
12579B55990846k5690010k9737538l0627240k9201281k5984113k1327524j6119131
$$ 255990846 230300836 200563298 169936058 140734777 114750664 93423140 77304009
12572G7304009j1426137p934420n624763m214850l352802k811548k485863k278220
$$ 77304009 65877872 57943452 52318689 48103839 44751037 41939489 39453626 37175406
12564C7175406k101808j898203j683744j472508j226859r91110p71697o14111
$$ 37175406 35073598 33175395 31491651 30019143 28792284 27801174 27029477 26415366
12556B6415366n17364m90120n20661n84938o91276p90062q75218r56189j016838
$$ 26415366 25898002 25407882 24887221 24302283 23611007 22820945 21945727 20989538 19972700
12547A9972700j032381j033715r90509r35337q88185q35610p66334o99945o61592
$$ 19972700 18940319 17906604 16916095 15980758 15092573 14256963 13490629 12790684 12129092
12538A2129092o09673n80198n34811n00299m64030m38476m01323l64474l38056
$$ 12129092 11519419 10939221 10404410 9904111 9440081 9001605 8600282 8235808 7897752
12529G897752l13104k83035k43339k22917j76853j33014q3009o2015p7082p5622
$$ 7897752 7584648 7301613 7058274 6835357 6658504 6525490 6442481 6380466 6303384 6227762
12519F227762j06217j47614j90474k39581k95950l22803l32057l29774l04017
$$ 6227762 6121545 5973931 5783457 5543876 5247926 4925123 4593066 4263292 3959275
12510C959275k65180k52982k00386j72150j54918j46582j20754j20310j07198
$$ 3959275 3694095 3441113 3240727 3068577 2913659 2767077 2646323 2526013 2418815
12501B418815j02422r8673q6570r1367p9672q5219q1700o5921o1690n5305o8907
$$ 2418815 2316393 2217720 2131150 2039783 1960111 1874892 1793192 1727271 1665581 1610276 1541369
12490A541369o8205l7863k8439l3890l3665m7200n4460n1463m7001k4551l0804
$$ 1541369 1473164 1435301 1406862 1372972 1339307 1292107 1237647 1186184 1139183 1114632 1083828
12479A083828l1347k9285p178k2164k2828l2143k1878j0448k0694l987J5025J9414
$$ 1083828 1052481 1023196 1016018 993854 971026 938883 917005 906557 885863 881876 896901 916315
12467I16315K309J7649L2350L0192K8542K2735K3880P509j8687l4821k3362l8816
$$ 916315 918624 936273 968623 998815 1027357 1050092 1073972 1081481 1062794 1027973 1004611 965795
12455I65795n2585m0942m1032l0266k3002k6511l4769J394J0521J3246J4196O133
$$ 965795 913210 872268 831236 800970 777968 751457 716688 718082 728603 741849 756045 762178
12443G62178J0739J5888M3666M0367N3185O1067O6796Q6283R1475J00819J31982
$$ 762178 772917 788805 832471 872838 926023 987090 1053886 1140169 1231644 1332463 1464445
12432A464445J44979J71643K00276K39893K65113K73358K87988K41795J74097
$$ 1464445 1609424 1781067 1981343 2221236 2486349 2759707 3047695 3289490 3463587
12423C463587R1595n572p3491j60899k20185k63770k74324k58539k24544j71554
$$ 3463587 3555182 3549610 3476119 3315220 3095035 2831265 2556941 2298402 2073858 1902304
12413A902304j21295q7316p1033m1050J966o024K618J2623k528r492j2604m2132
$$ 1902304 1781009 1693693 1622660 1581610 1583576 1577552 1580170 1592793 1590265 1580773 1568169 1526037
12401A526037m4522n1983o0656p7201o1825o0052o4353m7905m9795l3585k2127
$$ 1526037 1481515 1429532 1368876 1291675 1229850 1169798 1105445 1057540 1007745 974160 952033
12390I52033k4601k5352o053k599L481j83r518r534l649O685j4635l5261l4426
$$ 952033 927432 902080 896027 893428 896909 896726 887208 877674 874025 880710 866075 830814 796388
12377G96388l9918j9636r904k9468k3120m761j0075k1882j1066m498j7624j5705
$$ 796388 756470 736834 726930 697462 674342 669581 659506 637624 626558 622060 604436 588731
12365E88731k649j4368j8133k4872k3894j0149r744k0187j2950l314j5275k57
$$ 588731 586082 571714 553581 528709 504815 494666 484922 464735 451785 448471 433196 432939
12353D32939j613j3816r144j1694r178m769j9833j6982n578j103L525P786N902
$$ 432939 431326 417510 408366 396672 387494 382725 362892 345910 340332 339229 342754 350540 356442
12340C56442O643j2724j4736R724P669J228o179q303j8847j0379r716j634j1241
$$ 356442 363085 350361 335625 345349 353018 354246 348067 339764 320917 310538 300822 299188 287947
12327B87947j1334j8518p507j4165R30K659q719j2526n241o700k791O548l946
$$ 287947 276613 258095 250588 236423 237353 240012 231293 218767 213526 206826 204035 210583 206637
12314B06637K263o307k563l94J4167O547J4992M808j6483k1961L13J1687P966
$$ 206637 208900 202593 200030 199636 213803 220350 235342 240150 223667 201706 202019 213706 221672
12301B21672m809q220K631L659l344k5985j5779Q698J2446J0167P887O184M823
$$ 221672 216863 208643 211274 214933 211589 185604 169825 178523 190969 201136 209023 215207 220030
12288B20030l286r883p033Q81M762j1867k654P605l274j231p01k736j221Q545
$$ 220030 216744 206861 199828 200709 205471 193604 190950 198555 195281 194050 193349 190613 189392 197937
12274A97937Q6o208M972K1419Q853j393J484o801p682L792O867Q922R076R418
$$ 197937 198023 191815 196787 218206 227059 225666 227150 220349 212667 216459 223326 232248 241324 250742
12260B50742J1789J356j620P912p520j4554q382r145O530Q499r66J288k77n284
$$ 250742 262531 263887 262267 270179 262659 248105 239723 230578 237108 245607 244641 245929 245652 240368
12246B40368N832L064K68j5365j9015n097O99L536K234k319m109J228j435m729
$$ 240368 246200 249264 249532 234167 215152 210055 210754 214290 216524 214205 210096 211324 209889 205160
12232B05160l103p094N157J051o002l815N287R16p776l527n538o003J7396N176
$$ 205160 202057 194963 200120 201171 195169 191354 196641 197557 189781 186254 180716 174713 192109 197285
12218A97285p552k694P199j656o22j896k821n936L847K6530J7404J0957P531N441
$$ 197285 189733 187039 194238 192582 191960 190064 187243 181307 185154 211684 229088 240045 247576 253017
12204B53017L205N82Q80R048j0310j7900p450P259J4046K1388J4459n426O222
$$ 253017 256222 256804 257684 266732 256422 238522 231072 238331 252377 273765 288224 282798 289020
12191B89020R378J2313K9525K7168J7212j8703q210N925K1220M823J0886K7361
$$ 289020 298398 310711 340236 367404 384616 365913 357703 363628 384848 389671 400557 427918
12179D27918J4715J3233j306J7318K2652K3448L0908J9496R791J3062K1725K5825
$$ 427918 442633 455866 454560 471878 494530 517978 548886 568382 578173 591235 612960 638785
12167F38785M0052O7495R1782J08616J14795J30447J46473J53896J28977Q6085
$$ 638785 678837 746332 838114 946730 1061525 1191972 1338445 1492341 1621318 1707403
12157A707403M6741K1877m0242j00175j15094j47836j78847j49860j48249j29752
$$ 1707403 1754144 1776021 1735779 1635604 1520510 1372674 1193827 1043967 895718 765966
12147G65966j03770o4478n6935m5193k1653k6109k4251k2910j5132j0970j5380
$$ 765966 662196 597718 540783 495590 473937 447828 423577 400667 385535 374565 359185
12136C59185j5451j0030l439p20Q827K497k536j6051r21L263k695J5068Q655p23
$$ 359185 343734 333704 330265 329545 338372 340869 338333 322282 321361 324624 321929 336997 345652 344929
12122C44929M704M164Q559L907J4941L966L249r92J6076K3814K1244j4170K952
$$ 344929 349633 353797 362356 366263 381204 385170 388419 387427 403503 427317 448561 434391 437343
12109D37343J7146l74j6231p901m974O757M767j2379n435p241m588P956K2963
$$ 437343 454489 454115 437884 429983 425009 431766 436533 424154 418719 411478 406890 414846 437809
12096D37809J4993J3941K0061Q842J0654J0414J5641J2751Q871R306J1901j552
$$ 437809 452802 466743 486804 495646 506300 516714 532355 545106 553977 563283 575184 573632
12084E73632n200j7682j2432j5539j9273j6724N917n865J0102K0967l598N12P090
$$ 573632 568432 550750 538318 522779 503506 486782 492699 486834 496936 517903 514305 514817 521907
12071E21907J197L0202K9816L6382L8079K1464K1567M2099M7856L6294M6901Q1391
$$ 521907 523104 553306 583122 619504 657583 679047 700614 742713 790569 826863 873764 955155
12059I55155P8229Q5241R4243J26713J80173K26115K73903L18225L72169L94571
$$ 955155 1033384 1118625 1212868 1339581 1519754 1745869 2019772 2337997 2710166 3104737
12049C104737L79814L69816K88421J79697O5873p9754k19018l28352m07484m21196
$$ 3104737 3484551 3854367 4142788 4322485 4388358 4308604 4089586 3761234 3353750 2932554
12039B932554m40040m09062l37546k71561k19273j49820j06475p3987o8250o4891
$$ 2932554 2492514 2083452 1745906 1474345 1255072 1105252 998777 924790 856540 791649
12029G91649l7581k8672m1375l0078k5023k0073l2718k4952k2110n417q7r091
$$ 791649 754068 725396 684021 653943 628920 608847 576129 551177 529067 523650 523563 514472
12017E14472j0227k3168j3280m743j0504j6425n700j0336o805p572j3913j6318
$$ 514472 504245 481077 467797 463054 452550 436125 430425 420089 413284 405712 391799 375481
12005C75481q875l93L13N159l774M269L742Q015K371Q794P679J1097n92P734q090
$$ 375481 366606 366213 366526 371685 367911 372180 375922 383937 386308 395102 402781 413878 413286 421020 412930
11990D12930j1644k8244l8999k6247j7150j3559k1413j0673j7054m995q955j4456
$$ 412930 401286 373042 334043 307796 290646 277087 255674 245001 227947 222952 213997 199541
11978A99541l110j1192o352m09j6905o21r991j2628l72q13n648q868r979l590
$$ 199541 196431 185239 178887 178478 161573 160952 150961 138333 137961 137148 131500 122632 112653 109063
11964A09063o35P869Q914j629k164j1910j843k1153j4222J2571K337k936l415
$$ 109063 108428 116297 125211 123582 121418 109508 107665 86512 72290 84861 87198 84262 80847
11951H0847n482l580j227n608M939N701q910o410l893M761J3112R69j355j693
$$ 80847 75365 71785 70558 64950 69889 75590 66680 60270 56377 61138 74250 75219 73864 72171
11937G2171K024L790m542p35P23O909J3155q322r235j2850m672O814J1741m621
$$ 72171 74195 77985 73443 72708 73431 80340 93495 85173 75938 63088 58416 65230 76971 72350
11923G2350J2762K0580R23o24j5288j699m312P254N52j4709J0502N732M900J2392
$$ 72350 85112 105692 106615 105991 90703 89004 84692 91946 92498 77789 88291 94023 98923 111315
11909A11315J1917M717J1007m421J2654J6316J2371K3416K1654K9143K8037L2031
$$ 111315 123232 127949 138956 134535 147189 163505 175876 199292 220946 250089 278126 310157
11897C10157K0980K8320K7603m797k3464j0392k3060k3792j2448k0449m3421m4218
$$ 310157 331137 359457 387060 382263 358799 348407 325347 301555 289107 268658 225237 181019
11885A81019j6949J240p335N765j1865l262k111J0613q10k191l027j7452o028
$$ 181019 164070 165310 157975 163740 151875 148613 146502 157115 156305 154114 151087 133635 127607
11872A27607Q57L274m699j6386k803m83m135K725Q26l868l059q140m712O184m583
$$ 127607 128464 131738 127039 110653 107850 107367 103232 105957 106783 102915 99856 91716 87004 93188 88605
11857H8605r130j0679m552p69J337J0139N984l989N077P144j2886M952J9013n155
$$ 88605 79475 68796 64244 63475 64812 74951 80935 76946 82023 89167 76281 81233 100246 95091
11843I5091n950K779l384N147r80j0828l404p520m32n725J764K808J2530J659
$$ 95091 89141 91920 88536 93683 92703 81875 78471 70951 70519 64794 66558 69366 81896 83555
11829H3555m029M491P521J068M993l166j0086J0032J0673j650R526L097j339P143
$$ 83555 79526 84017 91538 92606 97599 94433 84347 94379 105052 103402 112928 116025 114686 121829
11815A21829n02L127J0472M856q4M999J3600J7788L0788K2704J8459J0051J9466
$$ 121829 121327 124454 134926 139782 139698 144697 158297 176085 206873 229577 248036 258087 277553
11802B77553J9354K0720J7059J2689J4472q93o388J675K997m935r63j1040r308
$$ 277553 296907 317627 334686 347375 361847 360954 354566 356241 359238 354303 353340 342300 332992
11789C32992k061K332j7419j5212J492J3644o620l904n032l397J1913O0j4511
$$ 332992 330931 333263 315844 300632 302124 315768 309148 305244 300212 296815 308728 308788 294277
11776B94277j9111k7588k6158k2930k0261j1673j4677K807j0837j3536L314p321
$$ 294277 275166 247578 221420 198490 178229 166556 151879 154686 143849 130313 133627 126306
11764A26306k291R730Q872P304p152r240p737o512J489L21o981j481J0724J2512
$$ 126306 124015 133745 142617 149921 142769 133529 125792 119280 120769 121090 114109 112628 123352 135864
11750A35864N807P045J9335K1368J0327K107J0468J6037K7869L0913K6698L7179
$$ 135864 141671 148716 168051 189419 199746 201853 212321 228358 256227 287140 313838 351017
11738C51017L9112L8247L2237N5201O6143M7671N6336N6720M7633K8371K6474
$$ 351017 390129 428376 460613 515814 581957 629628 685964 742684 790317 818688 845162
11727H45162K8666J3602l439n975l1019m2960n4214o3214n7649m0661l9114k2522
$$ 845162 873828 887430 883991 878016 846997 804037 749823 686609 628960 588299 549185 526663
11715E26663j796j9464j9712k081j0049j2309m284j5759k7572k8773k4952o441
$$ 526663 524867 505403 485691 483610 473561 461252 456968 441209 413637 384864 359912 353471
11703C53471j042q21j5926r447k955o626q275l94k341j2422n361k0533K69l267
$$ 353471 352429 351608 335682 326235 323280 316654 308379 307985 305644 293222 287861 267328 267597 264330
11689B64330M218Q444o607k258n853o508M706k656j5769J0438N32k4996Q821O76
$$ 264330 268548 276992 270385 268127 262274 255766 260472 257816 242047 252485 253017 228021 236842 237518
11675B37518l802j5433j1767m30K1955K2563N958J7717K3706K8665M2861L4900
$$ 237518 233716 218283 206516 206086 228041 250604 256562 274279 297985 326650 369511 404411
11663D04411L1276N3113M6129L9846K8846K3533K6449R147j3848l2384l7929n1785
$$ 404411 435687 488800 534929 574775 603621 627154 653603 662750 648902 616518 578589 526804
11651E26804o0189n7998m2340k8341k9243j3013j1302j0653n396J271R835O596
$$ 526804 466615 408617 366277 337936 308693 295680 284378 273725 268329 269600 279435 286031
11639B86031O626l052j415L857M866J0246K1387J7721J2383J0646p886j2297J587
$$ 286031 292657 289605 288190 292047 296913 307159 328546 346267 358650 369296 361410 349113 350700
11626C50700P72K5043K0052O782k766j404o335J4595M783L822O978K0138P37L062
$$ 350700 351472 376515 396567 403349 400583 399179 392844 407439 412222 416044 423022 443160 443897 446959
11612D46959Q573M814p288o754j1055R1L329l899j8318k3176m3143k8582j0977
$$ 446959 455532 460346 453058 446304 435249 435340 438669 434770 416452 393276 350133 321551 310574
11599C10574o391j236J1780Q742M356N839L0315L3859K8253J3370m647j8765j7044
$$ 310574 304183 302947 314727 323469 327825 333664 363979 397838 426091 439461 434814 416049 399005
11586C99005j477p927j6275k09J2738K4794K8435J8152k767R599Q553R849k889
$$ 399005 397528 389601 373326 373117 385855 410649 439084 457236 454469 464068 472621 482470 479581
11573D79581j7537k2528k0713j7639j8274j4190k1374j0359J82K2565J6507J8951
$$ 479581 462044 439516 418803 401164 382890 368700 347326 336967 337149 359714 376221 395172
11561C95172L969m539M78l753j0185n020j4953k6798l2158j7112j5235j2560j4163
$$ 395172 399141 394602 395080 391327 381142 376122 361169 334371 302213 285101 269866 257306 243143
11548B43143j0152l818k964J031J877k030N498J5856K9505L3440J5997L6393N2905
$$ 243143 232991 229173 226209 227240 229117 227087 232585 248441 277946 311386 327383 363776 416681
11535D16681L4637J7060J7399j537p592j8707O206j6367l5121k5515k9233m4381
$$ 416681 451318 468378 485777 484240 476648 457941 464147 447780 412659 387144 357911 313530
11523C13530l9119l0728o487N212n22j0445N496P589P596N497j9596p137p83j0093
$$ 313530 274411 243683 237196 242408 241886 231441 236937 244526 252122 257619 238023 230886 230103 220010
11509B20010m722q301N825J3968O630N494q376N496K993j4082j2794p950k010
$$ 220010 215288 206987 212812 226780 233410 238904 230528 236024 239017 224935 212141 204191 202181
11496B02181j3214m492p165M372q83J257O341K915J0732K851J6520l142j7571
$$ 202181 188967 184475 177310 181682 180799 182056 188397 191312 202044 204895 221415 218273 200702
11483B00702l202l896k791j1481j4789n524j1908O211l563j7056k3282j4165l656
$$ 200702 197500 193604 190813 179332 164543 159019 147111 153322 149759 132703 109421 95256 91600
11470I1600J3447k730j2873j025J556O498M097k222J5837J5214K583j72p744K355
$$ 91600 105047 102317 89444 88419 89975 96473 100570 98348 114185 129399 131982 131810 124066 126421
11456A26421J5501L465K069L997q275N82l623j423j0467o251Q304N203o20r779
$$ 126421 141922 145387 147456 151453 143178 143760 140137 138714 128247 121996 130300 135503 134883 125104
11442A25104j1936k072j065j1699j1291J0333J250K588l513k0426k2378L215J3493
$$ 125104 113168 111096 110031 98332 87041 97374 98624 101212 97699 77273 54895 58110 71603
11429G1603P089j832o010P796J1258q908m702Q12j752K817j1622q742k706K087
$$ 71603 78692 76860 70850 78646 89904 80996 76294 77106 75354 78171 66549 57807 55101 57188
11415E7188N630J4558o182J864q396p768J161j6253k0476N390Q382J7138N769
$$ 57188 62818 77376 71194 73058 64662 56894 58055 41802 21326 26716 35098 52236 58005
11402E8005O077k0468j2261K648K2770R243j077L229j223J1129J0619Q924n939
$$ 58005 64082 43614 31353 34001 56771 66014 64937 68166 66943 78072 88691 97615 91676
11389I1676j2833o949K924N653j2838p420K2601K2625L141j5807j415K1854J5290
$$ 91676 78843 71894 74818 80471 67633 60213 82814 105439 108580 92773 91358 113212 128502
11376A28502n080J9031k082j3235j058R816J0011n470k473L355K3287J4922K6866
$$ 128502 123422 142453 140371 127136 126078 135894 145905 140435 137962 141317 164604 179526 206392
11363B06392J6088L320M27l588j951p499k606p451l081j4923j4176K140M026j03
$$ 206392 222480 225800 226227 222639 220688 213189 210583 203132 200051 185128 170952 173092 177118 177015
11349A77015j499j2477q322l865L151k07Q079K3716J4397J0099P504N820R626
$$ 177015 175516 163039 154717 150852 154003 153796 161875 185591 199988 210087 217591 223411 233037
11336B33037R383J5541K8985J9615K3486J4760K112l39j3122j7317k6386l4032
$$ 233037 242420 257961 286946 306561 330047 344807 346919 346580 333458 316141 289755 255723
11324B55723R65p394j0450o955j4929l657j59l438n492j4424n164n671p91j0715
$$ 255723 256688 249294 238844 231889 216960 213303 213144 209706 204214 189790 184626 178955 178164 167449
11310A67449M100R592J4179J2423Q846J4400L1184K1786j061K4541O351j145J226
$$ 167449 171549 181141 195320 207743 216589 230989 262173 283959 282898 307439 313790 312645 313871
11297C13871J3485J6605j365P384O794j690r521j7082k770R60k111k9117l0368
$$ 313871 327356 343961 342596 349980 356774 355084 345563 328481 325711 326671 324560 295443 265075
11284B65075j3606n45q457P007L373J604J1219n522M426M196J1589K0409J8254
$$ 265075 251469 250924 242467 249474 252847 254451 265670 260148 264574 268770 280359 300768 319022
11271C19022J8638J9690K2302K4115L1438M4456M1102K7853K6965K7151N753j9862
$$ 319022 337660 357350 379652 403767 435205 479661 520763 548616 575581 602732 608485 588623
11259E88623m1116k7777m5861m4201m0641j3344j8602j2062l1293l6852j0050
$$ 588623 547507 519730 473869 429668 389027 375683 357081 345019 313726 276874 266824
11248B66824m381j0289l27Q664L016P96k061J2859J1832J3962R550R242K20J2337
$$ 266824 262443 252154 251827 260491 263507 264303 262242 275101 286933 300895 310445 319687 319907 332244
11234C32244J0373j321J2611J6131K197j6852m562K60m92j215q874j0544J691
$$ 332244 342617 341296 353907 370038 372235 355383 350821 351081 350589 349374 340500 329956 331647
11221C31647r708O696R59j4090j156o441q770K20n440Q171M981J0306J3911P744
$$ 331647 321939 328635 329594 315504 314348 307907 299137 299357 293917 302088 307069 317375 331286 339030
11207C39030J8556L3082K2751K7294J3968K7329M4449L4563K0984J1252J7802
$$ 339030 357586 390668 413419 440713 454681 482010 526459 561022 582006 593258 611060
11196F11060J8135J9249L1344K9382L8755M8886N1405O4242P4702R8420J36020
$$ 611060 629195 648444 679788 709170 747925 796811 848216 912458 987160 1085580 1221600
11185A221600J61501K09718K75849L32210M42453N43295O19684O74438O64986
$$ 1221600 1383101 1592819 1868668 2200878 2643331 3186626 3806310 4480748 5145734
11176E145734N73893L36374j2110m16939p55514q74199p79890n90861l76631k30333
$$ 5145734 5719627 6056001 6043891 5626952 4871438 3997239 3217349 2626488 2249857 2019524
11166B019524j65522j13020r5512q5469q8346q7917n6485l7141k6457P238J1727
$$ 2019524 1854002 1740982 1645470 1560001 1471655 1383738 1327253 1290112 1263655 1270893 1282620
11155A282620L4622N9441P8197R5794J48410K12587K64457L19633M28236N39586
$$ 1282620 1317242 1376683 1454880 1550674 1699084 1911671 2176128 2495761 2923997 3463583
11145C463583O26426O82330P10932O48422M39292Q5406l21412o48414q90294r59109
$$ 3463583 4090009 4772339 5483271 6131693 6570985 6656391 6334979 5686565 4796271 3837162
11135C837162q69443o44150m34668k96324j79346j39775j16342r2275p0700o5414
$$ 3837162 2967719 2323569 1888901 1592577 1413231 1273456 1157114 1064839 994139 928725
11125I28725n3395m1958l5705l1097l4955k3534j1439k8767l3300m794m382o246
$$ 928725 875330 833372 797667 766570 731615 708081 696642 667875 634575 629781 625399 619153
11113F19153J3912j4502m837k1580l2839k0069j3109k934j7892l1487k2211j8906
$$ 619153 633065 618563 613726 592146 559307 539238 526129 523195 505303 473816 451605 432699
11101D32699j4730r291p982j6288j7440k3023j3605j7816l74j0329j4210j7708
$$ 432699 417969 408678 400696 384408 366968 343945 330340 312524 312150 301821 287611 269903
11089B69903j751M17n257j2776n940r711m389R81N390M428j5675j3764n368j1288
$$ 269903 268152 268569 263312 250536 244596 234885 230496 231477 236867 241295 225620 211856 206488 195200
11075A95200p162j0824r860J0034J3381n61j0942P906n306N819P317J72O81K749
$$ 195200 188038 177214 167354 177388 190769 190208 179266 187172 181866 187685 195002 195174 195855 198604
11061A98604N440R911J2397J6165J8104K0083R754Q375N677O57l965j7755k6812
$$ 198604 204044 213955 226352 242517 260621 280704 290458 298833 304510 305167 301202 283447 256635
11048B56635j1286L048L923l720M310O216R887J3738M553k854J9609J8827K469
$$ 256635 245349 248397 252320 248600 252910 259126 269013 282751 287304 284450 304059 322886 325355
11035C25355q285j046K4636J0465O251K9937K4010L5501M7119M3277L2237M0827
$$ 325355 317070 316024 340660 351125 357376 387313 411323 446824 493943 537220 569457 610284
11023F10284O7026Q3230Q7576J23531J64965K19036K60778L53576M49743N14872
$$ 610284 677310 760540 848116 971647 1136612 1355648 1616426 1970002 2419745 2934617
11013B934617O11118O85638P39923O86272M09910R205k93319m45503o09914q27453
$$ 2934617 3545735 4231373 4971296 5657568 6067478 6076683 5783364 5337861 4727947 3900494
11003C900494q82275p23458m92047l04250j80138j13500q9315n4686n2594l6368
$$ 3900494 3018219 2294761 1802714 1498464 1318326 1204826 1115511 1060825 1008231 971863
10993I71863l7542m1014m4424l4338k0338j4206p876p033p195o999J4407J9654
$$ 971863 934321 893307 848883 814545 794207 780001 772125 765092 757897 750898 765305 784959
10981G84959l995p23k146k1117k0666n229Q70J160Q408J2186K095k545j0666k2997
$$ 784959 780964 780241 778095 756978 736312 731083 731953 733113 741521 753707 755802 753257 742591 719594
10967G19594n5786p5804o0214m4308l4204k1762j6946k2705j5790q822k563l115
$$ 719594 663808 588004 527790 483482 449278 427516 410570 387865 372075 363253 360690 357575
10955C57575L987n499j9666j6356P75L329j0388j1071r706j3101j6591P481P780
$$ 357575 361562 356063 336397 320041 320816 324145 313757 302686 292980 279879 263288 270769 278549
10942B78549R393r76J5471J3417N61p239P826J0344j2433r351M33M806k94j3322
$$ 278549 287942 286966 302437 315854 316415 309176 317002 327346 314913 305562 305995 310801 310507 297185
10928B97185j4303M313J0782J8863l102j5845k62k0848k5612j0432Q430m454k0212
$$ 297185 282882 287195 297977 316840 313738 297893 297631 276783 251171 240739 249169 244715 224503
10915B24503p955J920R647L427K2882L556j981M187r679j4735K0903J6393J656
$$ 224503 216548 218468 228115 231542 254424 257980 255999 260186 250507 235772 256675 273068 274724
10902B74724j152J6226K0217J7479L1078L8965K3660L3687M1335N8113Q2369J03430
$$ 274724 273572 289798 310015 327494 358572 397537 421197 454884 496219 554332 636701 740131
10890G40131J37708J68672K19833K72083L15088L43128L60722L63857K74864L9348
$$ 740131 877839 1046511 1266344 1538427 1853515 2196643 2557365 2921222 3196086 3235434
10880C235434k89063n33125n61549m38083k96982j76350j38888j21621p7670n1454
$$ 3235434 2946371 2413246 1851697 1413614 1116632 940282 801394 679773 602103 550649
10870E50649l4523k1139k8628l1905q560r820k2313j8683j9063p064M041l854
$$ 550649 516126 494987 466359 434454 425894 416074 393761 375078 356015 348951 352992 349138
10858C49138M186J1532R688Q795j6036r713J6087L900q292q757q415j4487j7128
$$ 349138 353324 364856 374544 383339 367303 357590 373677 377577 369285 360528 352113 337626 320498
10845C20498k8004j6140j3155j7072j8593l592J0683j479k2080p438K055m920
$$ 320498 292494 276354 263199 246127 227534 223942 234625 233146 211066 203628 205683 200763
10833B00763n644n574n757k100j8047m070J43j0485m83m48j5061R256K2031k892
$$ 200763 195119 189545 183788 181688 163641 159571 159714 149229 148746 148298 133237 142493 164524 161632
10819A61632j3866O78j8226j3361M52K045j8935K31K6012P216O823o797O86o879
$$ 161632 147766 148444 130218 116857 117309 119354 100419 100650 126662 133878 140701 133904 134590 127711
10805A27711j536m368j4102j2154p918n771J311O955M641K313j2765j7090j8452
$$ 127711 126175 121807 107705 95551 87633 81862 83173 90128 94769 97082 84317 67227 48775
10792D8775o9j0210p371r694j2252R854J4623P682j0432J2225J5841J6837J5017
$$ 48775 48706 38496 31125 21431 9179 19033 33656 41338 30906 43131 58972 75809 90826
10779I0826J5442P489N063K511j850m386j2533k81j168j968k866L168L290O793
$$ 90826 106268 113757 118820 121331 119481 115095 102562 102281 101113 99145 96279 99447 102737 109530
10765A09530k937r73o348n163N902k138m310j072l089O785Q084K010l603J0636
$$ 109530 106593 105620 99272 94109 100011 97873 93563 92491 89402 96187 104271 106281 102678 113314
10751A13314L174j6921O164k904j5780r88J3306J2923L226M98m430m429R366M079
$$ 113314 116488 99567 105731 102827 87047 86059 99365 112288 115514 116012 111582 107153 116519 120598
10737A20598r549P674J6633J2057M803N368J1423J8703J5824M0805M5082M9276
$$ 120598 111049 118723 135356 147413 152216 157584 169007 187710 203534 244339 289421 338697
10725C38697O1394O1411N6109O3532L4061l19J5110L1857k7809n3928k4656j6209
$$ 338697 400091 461502 517611 581143 615204 614885 629995 661852 634043 580115 555459 539250
10713E39250k5969n9453n2007n1066n5094n2660n2229j9567l16r983r748J4240
$$ 539250 513281 453828 401821 350755 295661 243001 190772 171205 170889 160906 151158 165398
10701A65398L25j997m377m307j208j5734j9064j2553r108N188J7700J3127K7792
$$ 165398 165723 163726 159349 155042 153834 138100 119036 106483 97375 102563 120263 133390 161182
10688A61182n096k1403j6002j1174l687j8000r043k077j6175q576n155J4556J3043
$$ 161182 156086 134683 118681 107507 103820 85820 76777 74700 58525 49949 44794 59350 72393
10675G2393O237J4212n161j5511j9586k4570l1611k9231j8780o346l164m735M328
$$ 72393 78630 92842 87681 72170 52584 28014 -3597 -32828 -51608 -57954 -61118 -65853 -61525
10662f1525K7334N3272P2744P6609N5171J5773r97K084r12J638R797L634P759
$$ -61525 -34191 19081 91825 168434 223605 239378 238381 240465 239553 241191 250988 254622 262381
10649B62381R023J0912K1109J1201j2359j9415j6207k0309l301j3991k0857n134
$$ 262381 271404 282316 303425 314626 302267 282852 266645 246336 243035 229044 208187 203053
10637B03053q499K108N641K4849J4993K3785K3054K3404Q133J713J0595J1572
$$ 203053 194554 196662 202303 227152 242145 265930 288984 312388 320521 322234 332829 344401
10625C44401L267J0127J2670J3687Q424L815O018n752j3516o902o685P010J365
$$ 344401 347668 357795 370465 384152 392576 396391 402409 396657 383141 376239 369554 376564 377929
10612C77929J5438K1321K2796K7413M1013M1915L0663K6531K2740K9764K4387
$$ 377929 393367 414688 437484 464897 505910 547825 578488 605019 627759 657523 681910
10601F81910L0696K7361N9053P0488O0156J7548j7583m1506k4129J7514M6084
$$ 681910 712606 739967 799020 869508 929664 947212 929629 888123 863994 881508 927592
10590I27592l766j72636j95357j689J58610O8887n3965n9314m0760k6977k0749
$$ 927592 923826 751190 555833 554144 712754 781641 727676 668362 627602 600625 579876
10579E79876Q099K6618J4451J4690R893k647O57J0846J1342L1454M7313N1893
$$ 579876 587975 614593 629044 643734 653627 650980 651637 662483 673825 705279 752592 804485
10567H04485M2222M5760M1246M1391M5770L9538M7331M8170M0294N2099M9579
$$ 804485 846707 892467 933713 975104 1020874 1060412 1107743 1155913 1196207 1248306 1297885
10556A297885M7143L9666L2963L8250M9728N9431O1282N2302N6933O5762N2799
$$ 1297885 1345028 1384694 1417657 1455907 1505635 1565066 1626348 1678650 1735583 1801345 1854144
10545A854144M4633N8429N8440M2546M4390M5610N8698N1143O4379O6624O4945
$$ 1854144 1898777 1957206 2015646 2058192 2102582 2148192 2206890 2258033 2322412 2389036 2453981
10534B453981O3772O2294P7259P7275O8762O9291Q4191P5826J05971J07406J03032
$$ 2453981 2517753 2580047 2657306 2734581 2803343 2872634 2956825 3032651 3138622 3246028 3349060
10523C349060R1775R2596Q1983P1737M9640M9822Q7534J21162J43083J49359J65061
$$ 3349060 3440835 3533431 3615414 3687151 3736791 3786613 3874147 3995309 4138392 4287751 4452812
10512D452812J71312J95437K16591K63997K88323K82497L08267L44442L76733
$$ 4452812 4624124 4819561 5036152 5300149 5588472 5870969 6179236 6523678 6900411
10503F900411L81843L78934L64348L98911M50265N47136O46258P12760P97893
$$ 6900411 7282254 7661188 8025536 8424447 8874712 9421848 10068106 10780866 11578759
10494A1578759Q82817R76193J066614J161911J280801J428716J597815J819105
$$ 11578759 12461576 13437769 14504383 15666294 16947095 18375811 19973626 21792731
10486B1792731K085697K382468K664261K930812L202873L469026L731809M060483
$$ 21792731 23878428 26260896 28925157 31855969 35058842 38527868 42259677 46320160
10478D6320160M551357N433163O925153R026580J1826844J5553404K0412515K6670784
$$ 46320160 50871517 56304680 63229833 72256413 84083257 99636661 120049176 146719960
10470A46719960L4779132M4829854N4627060O1736359O5727413O6602220O2563627
$$ 146719960 181499092 226328946 280956006 342692365 408419778 475021998 537585625
10463E37585625M3434679n139729p1663379j13847804j07497724p5636805m7786986
$$ 537585625 581020304 575880575 504217196 390369392 282871668 207234863 159447877
10456A59447877l0566546k0381748j4085147j0197513p918912o532398n502002
$$ 159447877 128881331 108499583 94414436 84216923 76298011 69765613 64263611
10449F4263611m475901l578886k853630k337972j994638j865203j915304j869225
$$ 64263611 59787710 56208824 53355194 51017222 49022584 47157381 45242077 43372852
10441D3372852j618780j254539q60623n01514j93815P9763J13830l24682j020438
$$ 43372852 41754072 40499533 39638910 39137396 38943581 39023344 39137174 38812492 37792054
10432C7792054j549361j785321j847619j824856j751485j655964j554990j460677
$$ 37792054 36242693 34457372 32609753 30784897 29033412 27377448 25822458 24361781
10424B4361781j379348j271750j161322j062134r47744q58908p81793p11699o40737
$$ 24361781 22982433 21710683 20549361 19487227 18539483 17680575 16898782 16187083 15546346
10415A5546346n57415m92701m12786l05008j81205n9397N3239J45983K39226K92402
$$ 15546346 14988931 14496230 14083444 13778436 13597231 13537834 13591073 13737056 13976282 14268684
10405A4268684K35578l7266o56276j249744j391629j111858p54307n15496l95823
$$ 14268684 14504262 14466996 13810720 12560976 11169347 10057489 9303182 8787686 8391863
10396H391863l84179m60072n23402m92027m21056l53510l11562k78896k44674
$$ 8391863 8007684 7547612 7024210 6532183 6111127 5757617 5446055 5167159 4922485
10387D922485k18703j82473j76958j74968j38722j24684j28449j33335j34177
$$ 4922485 4703782 4521309 4344351 4169383 4030661 3905977 3777528 3644193 3510016
10378C510016j26250j13072j14921j18167j13392j16608j12034j18735j27397
$$ 3510016 3383766 3270694 3155773 3037606 2924214 2807606 2695572 2576837 2449440
10369B449440j00577o0007p4820p1198n3458l3973m2975n1074m7141n2575l8509
$$ 2449440 2348863 2288856 2214036 2142838 2089380 2055407 2012432 1961358 1914217 1861642 1823133
10358A823133l6591n4364m0059n5674n4348m1099o3080n0708m7329l1906L32L2642
$$ 1823133 1786542 1732178 1692119 1636445 1582097 1540998 1477918 1427210 1379881 1347975 1348307 1380949
10346A380949L3501K1777M4305P3540O5559L3916l026l1976m2485j22503j77560
$$ 1380949 1414450 1436227 1480532 1554072 1619631 1653547 1650521 1618545 1576060 1453557 1275997
10335A275997j48416q8759j03807r4904p8840m6858l1709k0121o782J3559k878
$$ 1275997 1127581 1038822 935015 840111 761271 714413 682704 662583 655801 669360 666482
10324F66482k0005J1231K2379J5756K1163J9022Q872K1743L5980K6913Q21j7178
$$ 666482 646477 657708 680087 695843 717006 736028 744900 766643 802623 829536 830357 813179
10312H13179j4737j366J8454Q321J1613K2974J2916P663Q828R507R827R308J6504
$$ 813179 798442 797076 815530 823851 835464 858438 871354 879017 887845 897352 907179 916487 932991
10299I32991M377K768j955J0418J5928J8218K5964K1658k926j6094k2684k1636
$$ 932991 937368 940136 938181 948599 964527 982745 1008709 1030367 1027441 1011347 988663 967027
10287I67027j3081k0312k5301k3758j8667q949j9349j4249Q451j0308J261j926
$$ 967027 953946 933634 908333 884575 865908 856959 837610 823361 831812 821504 822765 820839
10275H20839j0498r676j9991N539m40n321K75K6629M2781N0849O6932N4782J5047
$$ 820839 810341 800665 780674 786213 785773 780452 780727 807356 850137 900986 967918 1022700 1037747
10262A037747k546k2520l1533m7953m4247l0557l1536k3472l1445j7833k0027
$$ 1037747 1035201 1012681 981148 933195 888948 858391 826855 803383 771938 754105 734078
10251G34078j3380M608P57q543o53j8836k4415j8433o045j4556j7223M689m035
$$ 734078 720698 725306 726063 717520 716867 698031 673616 655183 649138 634582 617359 622048 618013
10238F18013K05R05L725J680J7016K9013R076m402m095r736j1065k6952j1279
$$ 618013 618218 619123 622848 624528 641544 670557 679633 675231 671136 661400 650335 623383 612104
10225F12104Q28J1808K7883J2474K1001K6638K6901J8491K5993J8397L1543N5886
$$ 612104 612932 624740 652623 665097 686098 712736 739637 758128 784121 802518 834061 889947
10213H89947P2238P8999O8305M4913J9808J9036o2710j16716j35775j05877q3403
$$ 889947 962185 1041184 1109489 1154402 1174210 1193246 1130536 1013820 878045 772168 688765
10202F88765n5416k9315j9817k6005j0638o100k5353j8350J230K08P87k040j6366
$$ 688765 633349 604034 584217 558212 547574 541474 516121 497771 499001 499209 499996 497956 481590
10189D81590p651J658J0786q70l68r038L792N553J5452K3298o645o02P08n684
$$ 481590 473939 475597 486383 485513 485145 476107 479899 485452 500904 524202 517557 516955 517663 511979
10175E11979J4873J2083Q352J0074J5839O866J2153J5931R692k578J619J298J1263
$$ 511979 526852 538935 547287 557361 573200 580066 592219 608150 617842 615264 616883 618181 629444
10162F29444K2893L6736L5598L4272M5454K0747L7790O4766O0000N8818O4823
$$ 629444 652337 689073 724671 758943 804397 825144 862934 927700 987700 1046518 1111341
10151A111341N2730N5613N4353N9893O6796O1111P5202J05425J08868J16648J40567
$$ 1111341 1164071 1219684 1274037 1333930 1400726 1461837 1537039 1642464 1751332 1867980 2008547
10140B008547J71577J72031K04650K46285L10051M25245N66481P31794R62518
$$ 2008547 2180124 2352155 2556805 2803090 3113141 3538386 4104867 4836661 5799179
10131E799179J210122J475418J714999J879591J919473J755543J232125J89884
$$ 5799179 7009301 8484719 10199718 12079309 13998782 15754325 16986450 17176334
10123A7176334j269536k483849k829529k422902j768400j180842p62870n00241
$$ 17176334 15906798 13422949 10593420 8170518 6402118 5221276 4458406 3958165
10115C958165l37216k22468j44094j07236p7023p2649j04787j34260j80618j93585
$$ 3958165 3620949 3398481 3254387 3147151 3070128 2997479 2892692 2758432 2577814 2384229
10105B384229j75593j38601j08004r1877p7053n8674m2662l6292k6985j5761l8458
$$ 2384229 2208636 2070035 1962031 1870154 1793101 1734427 1691765 1655473 1628488 1612727 1574269
10094A574269n3690n2380n4838p4951p3664n4903n4830n0993l5606l0514l2396
$$ 1574269 1520579 1468199 1413361 1338410 1264746 1209843 1155013 1104020 1068414 1037900 1005504
10083A005504k0780k6450j9698j0458r779r392j3171r669q192k5300k7279k1525
$$ 1005504 984724 958274 938576 928118 918339 908947 895776 886107 877915 852615 825336 803811
10071H03811n102J9965J4356N867J1470M5453N7850O9479Q4439R1574R8196J37365
$$ 803811 798709 818674 833030 838897 850367 895820 953670 1023149 1107588 1199162 1297358 1434723
10059A434723J51623J42957J35825J05460P2623N9880J0814n0387j26257j38082
$$ 1434723 1586346 1729303 1865128 1970588 2043211 2103091 2113905 2063518 1937261 1799179
10049A799179j04815o2266K0022P1327J29701K02068K59180K92596L02644L27662
$$ 1799179 1694364 1632098 1652120 1723447 1853148 2055216 2314396 2606992 2909636 3237298
10039C237298L07285J94428m1354l71371n97392n96176m21078k70971j73231j34392
$$ 3237298 3544583 3739011 3697657 3326286 2728894 2132718 1711640 1440669 1267438 1133046
10029A133046q9175p1684o9593l3935l5677m4438k4818k3500k4459j601r492k3106
$$ 1133046 1043871 972187 902594 868659 832982 788544 763726 740226 715767 714166 704674 681568
10017F81568j1413j6947o211j0443o205j0982J530q654j6807L336j2150k2960
$$ 681568 670155 653208 646997 636554 630349 619367 620897 612243 595436 598772 586622 563662
10005E63662k0003q450N08o44J2183O119m394k4223k7170j1776L033j4735p979
$$ 563662 543659 535209 535717 535073 547256 553375 548981 524758 497588 485812 488845 474110 466131
9992D66131N530p360n849j4387l480n735k6397k6878p100L073j0277p152m835
$$ 466131 471661 464301 458452 444065 440585 434850 408453 381575 374475 377548 367271 360119 355284
9979C55284j2866q768j0161m277j1145j901p815q598J870o743j3224k867r144
$$ 355284 342418 333650 323489 319212 308067 306166 298351 289753 291623 284880 271656 268789 259645
9966B59645O943P978P516k061n508r104l080K468J3808Q752j1348j5061R04j9874
$$ 259645 266588 274566 282082 280021 274513 265409 262329 264797 278605 287357 276009 260948 261852 241978
9952B41978j6695k565J2702J7489M645j6364p790R500J2694P402l021K345j004
$$ 241978 225283 222718 235420 252909 257554 241190 233400 242900 255594 262996 259975 262320 261316
9939B61316P87j3994j9735o794J0104K168M745J1217K729k5933j3009J54P444
$$ 261316 262103 248109 228374 221580 231684 233852 238597 249814 252543 226610 213601 213755 221199
9926B21199J2807K804J308J0261O046j1585J696P58n898K090Q105J6412J0120
$$ 221199 234006 236810 238118 248379 254425 242840 244536 245294 239396 241486 249591 266003 276123
9913B76123J0470N139o431M086J4068o560m280m030j8952k3719r773p956j0785
$$ 276123 286593 291732 285301 289387 303455 296895 292615 288585 269633 245914 236141 228185 217400
9900B17400j0742r803L425k222J0878o198L926l817j108j9406k015R383L788l620
$$ 217400 206658 196855 200280 198058 208936 202738 206664 202847 201739 182333 180318 189701 193489 189869
9886A89869j5o833q82J1148K362k707L520O616L647M985M736L459r833j2109P301
$$ 189869 189854 183021 182139 193287 195649 192942 196462 203078 206725 211710 216446 219905 210072 197963 205264
9871B05264Q585m641N152J958n856j222j065j659L01m874J240J0505p835j3936
$$ 205264 213849 209208 214360 216318 210462 209240 208175 206516 206817 201943 203183 213688 205853 191917
9857A91917q632J3089L610K448r357q565K353K2311M252j9871j4740n30J1693
$$ 191917 183285 196374 199984 202432 193075 184510 186863 209174 213426 193555 178815 178285 189978
9844A89978l185R226N134k886r105j9735M31Q616k519P08l157k143r137p431P295
$$ 189978 186793 196019 201153 198267 189162 169427 169858 178474 175955 176663 173506 171363 162226 154795 162090
9829A62090j643R684n423j0431j456j233K4857J8926J228K487l963j830l718j5115
$$ 162090 160447 170131 164708 154277 152821 151588 176445 195371 196599 199086 195123 193293 189575 174460
9815A74460l521o955O45J0858j653O10n950n496l452J1566J3452k0301j2416j311
$$ 174460 170939 163984 164629 175487 173834 174444 168494 162998 159546 171112 184564 164263 151847 150536
9801A50536O354J1765j0119n519k288J4814J5932m055P149K892j751k3317M945
$$ 150536 156890 168655 158536 153017 150729 165543 181475 177420 184569 187461 185710 162393 167338
9788A67338P622J0405J125o779j63j322j4561n467K078J96p485k764o806P733
$$ 167338 174960 185365 186490 179711 179548 178226 163665 158198 160276 160472 152987 150223 143417 151150
9774A51150O962J0840m705o746L082J3791M326l141O12l532Q09L878P023J383
$$ 151150 158112 168952 164247 157501 160583 174374 178700 175559 176171 172639 173448 177326 184349 185732
9760A85732m41J1463R098J1450o08j0672j143j730n469p797m07Q273K732Q499
$$ 185732 185291 196754 205852 217302 216694 206022 204879 203149 197680 189883 189476 197749 200481 208980
9746B08980K3575N883p181J656m895L616R682o17J4917N803J4964J3581J3898
$$ 208980 232555 238438 231257 232913 228018 231634 241316 240699 255616 261419 276383 289964 303862
9733C03862J3555J9247L1401L6660P1071Q1819P8347R0255Q4835Q8061N0595l357
$$ 303862 317417 336664 368065 404725 475796 557615 635962 726217 811052 899113 949708 946351
9721I46351j07979j44913j30568q6293m5141k9235k0513k0294j3894k4438k6145
$$ 946351 838372 693459 562891 476598 431457 402222 381709 361415 347521 323083 296938
9710B96938j122M962m399o830J1932J1584J0297J435O833l089o264j8404l711
$$ 296938 295816 300778 296379 289549 301481 313065 323362 324797 331630 328541 322277 303873 300162
9697C00162K419r701k801q805k2531j8920m528M310O698q036R045J0509k786j4000
$$ 300162 302581 292880 290079 281274 258743 239823 235295 239605 246303 238267 247312 257821 255035 241035
9683B41035m241j2738L027J3954k276m339R262J837J374l989l444j3958j9559
$$ 241035 236794 224056 227083 241037 238761 234422 243684 245521 246895 242906 239462 225504 205945
9670B05945M905p062L86O487O81j548j5983m073R290Q407q879n003N775K861o679
$$ 205945 210850 203788 204174 210661 211342 209794 193811 189738 199028 207435 198556 193553 199328 202189 195510
9655A95510m194M778Q760n13J928J438r924j637j967R894R257l896j1743Q908
$$ 195510 191316 196094 204854 204341 206269 207707 197783 196146 194179 204073 213330 209434 197691 206599
9641B06599J1182J1149J0417L881L327n283j7304j736j0019o714L100m909j1839
$$ 206599 217781 228930 239347 243228 246555 241272 223968 222232 212213 205499 208599 203690 191851
9628A91851j850M942P157J3347l181O832J215p627k700J742P641n292j7415K447
$$ 191851 190001 194943 202100 215447 212266 219098 220313 212686 209986 211728 219369 214077 196662 199109
9614A99109J1678j631p403p37M384L427J2170M731J1796N48m103q55m736O385
$$ 199109 210787 209156 201753 201016 205400 208827 220997 225728 237524 238072 233969 233114 228378 234763
9600B34763n994q120j331n492j010R751P035j344q003j1307M764O24K0720J2747
$$ 234763 228769 220649 219318 213826 212816 222567 229602 228258 220255 208948 213712 214336 235056 247803
9586B47803r778p722M264J0764J039j002K511l978O949O406r15o850m52m923P047
$$ 247803 238025 230303 234567 245331 246370 245368 247879 243901 250850 257256 256341 249491 249039 244116 251163
9571B51163k153J716j0223p17m975J9286K707k227n833J0648J1008o429q331P356
$$ 251163 249010 250726 240503 239786 234811 254097 256804 254577 248744 259392 270400 263971 255640 262996
9557B62996Q164j3464j5958j5246J171R185m367P721J8627R695O138p004n387
$$ 262996 271160 257696 241738 226492 227663 236848 232481 240202 258829 268524 274662 267658 262271
9544B62271k788M886m067o785J181J5820q096l570M755q699L241K368q296O742
$$ 262271 259483 264369 260302 253517 254698 270518 262422 258852 263607 254908 258149 260517 252221 258963
9530B58963Q693J5710R577M17k998O44k907L978J4145p348K098n308k074J1048
$$ 258963 267656 283366 292943 293360 290362 291006 288099 292077 306222 298874 300972 295664 293590 304638
9516C04638J543R846N168q673j7982q078N884j271P359K571L462l313J672N68
$$ 304638 306181 316027 321195 312522 294540 286462 292346 291075 298434 301005 304467 301154 302826 303394
9502C03394j339j170J236J770l486k950P01o95l694P660P200r607r927K912J2291
$$ 303394 302055 300885 302121 303891 300405 297455 298156 297461 293767 301427 308627 299020 289093 292005 304296
9487C04296J3160l069n023N060N595K172M391Q802J0303j1789j0157M102l45j0180
$$ 304296 317456 314387 309364 314424 320019 322191 326582 335384 345687 333898 323741 327843 327498 317318
9473C17318n322J5126J1149J6716l789K809P242k967k879j15k15l498q008J994
$$ 317318 311996 327122 338271 354987 351198 354007 361249 358282 355403 355288 355073 351575 343567 345561
9459C45561J2345j346j4682k25J1795K536L960O399l082o606j9207j131J7402
$$ 345561 357906 356560 341878 341653 353448 355984 359944 366343 363261 356655 337448 336317 353719
9446C53719Q449r185N72m444r16J9209J8790j182o387J247N44n332k695m879R944
$$ 353719 362168 352983 353555 349111 348195 367404 386194 385012 378625 379872 380416 375084 372389 367510 377454
9431C77454k187O37R298O534J9898J2349j6455j4277j966M595N430l067M405M877
$$ 377454 375267 375904 385202 391736 411634 423983 407528 393251 391285 395880 401310 398243 402648 407525
9417D07525L043J3800J2053j4556K914M171j095n47n338N511J861r191J3053J6895
$$ 407525 410568 424368 436421 421865 424779 428950 427855 427308 421970 427481 429342 420151 433204 450099
9403D50099o354k855l566n993l309J007O424J8727J5071j0745j6934j801M80K225
$$ 450099 443745 440890 437324 431331 428022 429029 435453 454180 469251 458506 441572 439771 440251 442476
9389D42476J2169o605n762R034P024J1752r938j1243j529O724Q663N978J699R573
$$ 442476 454645 448040 442278 451312 458336 470088 460150 448907 447378 454102 462765 468743 470442 480015
9375D80015o00Q03J4579J2186l652J832J2599m271q721M261P134J456L631M930
$$ 480015 479415 480218 494797 506983 503331 505163 517762 513491 504770 509031 516165 517621 521252 526182
9361E26182j592O850M94Q28K965j1041J287J2915J34j5747K172J3571J2969J5841
$$ 526182 524590 531440 531934 532762 535727 524686 525973 538888 539022 523275 525447 539018 551987 567828
9347E67828k65j2009r61J129J6394J5073m268o023M677j826j422N84P879L36O519
$$ 567828 567563 555554 554593 555722 572116 587189 582921 576898 581575 579749 578327 578911 586790 587126 593645
9332E93645R649n108q979J3754m619k618J1536J451J3145P132N570n001N095R754
$$ 593645 603294 598186 589207 602961 598342 595724 607260 608711 621856 628988 634558 629557 634652 644406
9318F44406L797Q818l517p390M665M980K2916J6320n13j3480j8491L976K0856
$$ 644406 648203 657021 653504 646114 650779 655759 678675 694995 694482 681002 662511 666487 687343
9305F87343Q447m30j3113J702Q052N031m26M398J9931M001J6704J7871k840J8032
$$ 687343 695790 695360 682247 683949 692001 697032 696606 701004 720935 724936 741640 759511 756671 774703
9291G74703m437o457o719r843r276O767L625q00J9946J7258L00p367j565j182
$$ 774703 770266 763809 757090 747247 737971 744738 748363 747563 767509 784767 785067 777700 776135 774953
9277G74953J2703O336O183J5568N937j146R391O645R658Q715P572r249n022L440
$$ 774953 787656 793992 800175 815743 821680 820534 829925 836570 846228 854943 862515 853266 848244 851684
9263H51684K1823P754M475J2995O297N195P703K178P265k254j3094L359J7920
$$ 851684 873507 881261 885736 898731 905028 910223 917926 920104 927369 925115 912021 915380 933300
9250I33300J6383j811J600J313J1823J3396K1865r902j592M562J9938R899M987
$$ 933300 949683 947872 949472 950785 962608 976004 997869 987967 986375 990937 1010875 1020774 1025761
9237A025761R030m769N384P521K320Q393Q889J3853P475R658k236K1677O857j313
$$ 1025761 1034791 1030022 1035406 1042927 1045247 1053640 1062529 1076382 1083857 1093515 1091279 1112956 1119813 1118500
9223A118500N738j1128J602L7581K3091q23j871N851P34o63k584O919J8308J4881
$$ 1118500 1124238 1113110 1114712 1152293 1175384 1174561 1172690 1178541 1179275 1178612 1176028 1182947 1201255 1216136
9209A216136M00K5442J1642N055J687M884O037P067K1792R895L694N942J7697
$$ 1216136 1216536 1241978 1253620 1258675 1260362 1265246 1271283 1278350 1300142 1310037 1313731 1319673 1337370
9196A337370J4279J545J5433K2923Q244P431o132j1051K1188J0506Q018K9645
$$ 1337370 1351649 1353194 1368627 1391550 1399794 1407225 1401093 1390042 1411230 1421736 1429754 1459399
9184A459399L1854J9700J0133K379O13J3238K6106J0155N461J2658q562L491O432
$$ 1459399 1491253 1510953 1521086 1523465 1524078 1537316 1563422 1573577 1579038 1591696 1583134 1586625 1593057
9171A593057K2398J4295J5017Q937k686K1833K7422J7730K4182K0021P138m83
$$ 1593057 1615455 1629750 1644767 1653704 1651018 1672851 1700273 1718003 1742185 1762206 1769344 1768861
9159A768861J0427K2271M648O619K7080L2657J5797p46J1878J6958K9633K5525
$$ 1768861 1779288 1801559 1806207 1812826 1839906 1872563 1888360 1887614 1899492 1916450 1946083 1971608
9147A971608J0322Q708J9897K1975K1559K3342J6468J8714J2080J2668J5325J6820
$$ 1971608 1981930 1990638 2010535 2032510 2054069 2077411 2093879 2112593 2124673 2137341 2152666 2169486
9135B169486L5883J8594J0882K7571K5555Q219J6111L2987K0497K0275J7789Q366
$$ 2169486 2205369 2223963 2234845 2262416 2287971 2296190 2312301 2345288 2365785 2386060 2403849 2412215
9123B412215K6642K7841K3746K1691K9299K9470K9568K5522J2655K8913L2762
$$ 2412215 2438857 2466698 2490444 2512135 2541434 2570904 2600472 2625994 2638649 2667562 2700324
9112B700324K0184J8853L6316K4463J7678K1675J2972K9494K9464K4974K1842
$$ 2700324 2720508 2739361 2775677 2800140 2817818 2839493 2852465 2881959 2911423 2936397 2958239
9101B958239L8724K1115L6712M5069M3954K9625K5525K7272L2740M1610L5211
$$ 2958239 2996963 3018078 3054790 3099859 3143813 3173438 3198963 3226235 3258975 3300585 3335796
9090C335796M0743L4006M1423M6253K8042K5095K8612L0292M5182M7128M4988
$$ 3335796 3376539 3410545 3451968 3498221 3526263 3551358 3579970 3610262 3655444 3702572 3747560
9079C747560M5167K9614K7260K9806M7882N2702N4841L3013M0493N5419N6170
$$ 3747560 3792727 3822341 3849601 3879407 3927289 3979991 4034832 4067845 4108338 4163757 4219927
9068D219927L7454N0342N4602L8293L2334M9431M5406L6576N9068O4778N3822
$$ 4219927 4257381 4307723 4362325 4400618 4432952 4482383 4527789 4564365 4623433 4688211 4742033
9057D742033N4301O4437O0785N7450N9157M2793N0560M7406O3982O7785N7973
$$ 4742033 4796334 4860771 4921556 4979006 5038163 5080956 5131516 5178922 5242904 5310689 5368662
9046E368662N9780M6411O5620P5249O6448P0072O3636N8228N9381P6814O7255
$$ 5368662 5428442 5474853 5540473 5615722 5682170 5752242 5815878 5874106 5933487 6010301 6077556
9035F077556O0202P6383P7875O6929P3426Q4104P6375P6813O4861N9840P9520
$$ 6077556 6137758 6214141 6292016 6358945 6432371 6516475 6592850 6669663 6734524 6794364 6873884
9024F873884R3397Q3131O9012P8367R0178Q5377P6575Q6834Q2067Q1254R2612
$$ 6873884 6967281 7050412 7119424 7197791 7287969 7373346 7449921 7536755 7618822 7700076 7792688
9013G792688R7980O7739O9733Q7647Q7683P6586Q0722Q6665Q0569Q0605Q7096
$$ 7792688 7890668 7958407 8028140 8115787 8203470 8280056 8360778 8447443 8528012 8608617 8695713
9002H695713R4950J04442P7445Q8193R2758Q7227Q9381R3683P9594Q1595Q3234
$$ 8695713 8790663 8895105 8972550 9060743 9153501 9240728 9330109 9423792 9503386 9584981 9668215
8991I668215Q8003Q1947P6745Q0296Q8666P7121P2141R7057Q2653P1866P0212
$$ 9668215 9756218 9838165 9914910 9995206 10083872 10160993 10233134 10330191 10412844 10484710 10554922
8980A0554922P9589O6038P3051O5224O9904O1310P4184P7987O5695O1520N6454
$$ 10554922 10634511 10700549 10773600 10838824 10908728 10970038 11044222 11122209 11187904 11249424 11305878
8969A1305878N2490O3519L4518M8701N7246L3114M6897L6791L6514L3943L3560
$$ 11305878 11358368 11421887 11456405 11505106 11562352 11595466 11642363 11679154 11715668 11749611 11783171
8958A1783171K7777J4973L780J5280K5070J9846K6904R058O550k770j8796j35
$$ 11783171 11810948 11825921 11829701 11844981 11870051 11889897 11916801 11925859 11932409 11929639 11910843 11910708
8946A1910708l836j8984j9835j6172j3052k8116k1127l0009j4944j0440k3483
$$ 11910708 11906872 11887888 11868053 11851881 11838829 11810713 11789586 11759577 11744633 11734193 11710710
8935A1710710m3552n6816m2801m6178m7454m6504m2864m2386n1254o3310o5160
$$ 11710710 11667158 11610342 11567541 11521363 11473909 11427405 11384541 11342155 11290901 11227591 11162431
8924A1162431q4456p0189o0403o7601p2414o0538o0338o9350o8183q5288q8614
$$ 11162431 11077975 11007786 10947383 10879782 10807368 10746830 10686492 10617142 10548959 10463671 10375057
8913A0375057p6707o8048p0819o7626q5757q6998p9502j01400q2202p2266p4874
$$ 10375057 10298350 10230302 10159483 10091857 10006100 9919102 9839600 9738200 9655998 9583732 9508858
8902I508858p3117q7574q9062r0301r5788q1995q2218q1547q8104p7916r3638
$$ 9508858 9435741 9348167 9259105 9168804 9073016 8991021 8908803 8827256 8739152 8661236 8567598
8891H567598j03987q6553p3130q8207q2073r4119q5882p1305p2170q4235p1107
$$ 8567598 8463611 8377058 8303928 8215721 8133648 8039529 7953647 7882342 7810172 7725937 7654830
8880G654830p4434q4739q9040q7888p4802q5275p6272o2946o6484q4031p5849
$$ 7654830 7580396 7495657 7406617 7318729 7243927 7158652 7082380 7019434 6952950 6868919 6793070
8869F793070p5296p3588o9201o2665q3329p2126n4033o9344p1563n9325n9290
$$ 6793070 6717774 6644186 6574985 6512320 6428991 6356865 6302832 6233488 6161925 6102600 6043310
8858F043310n9770q1631p1907o5959n0991o2827p4156p1981o5295m7836n3299
$$ 6043310 5983540 5901909 5830002 5764043 5713052 5650225 5576069 5504088 5438793 5390957 5337658
8847E337658p0445n6176n1274n3582m8577m7423m6825o8983o4577n8114m4284
$$ 5337658 5267213 5211037 5159763 5106181 5057604 5010181 4963356 4894373 4829796 4771682 4727398
8836D727398l6400n3758n4783n9035n7727l8031n1111n5657m3712l5515m1945
$$ 4727398 4690998 4637240 4582457 4523422 4465695 4427664 4376553 4320896 4277184 4241669 4199724
8825D199724n3344n5825m3495k0630m0520n1626m3857l2331l0819l2304m7076
$$ 4199724 4146380 4090555 4047060 4026430 3985910 3934284 3890427 3858096 3827277 3794973 3747897
8814C747897m4566k8624l7119m3883l6949l2018j7194l7193k9668k4179l6094
$$ 3747897 3703331 3674707 3637588 3593705 3556756 3524738 3507544 3470351 3440683 3416504 3380410
8803C380410l5800k6824m1437m2541k5721k4319l9734m5422l1818l6241k1391
$$ 3380410 3344610 3317786 3276349 3233808 3208087 3183768 3144034 3098612 3066794 3030553 3009162
8792C009162k9310j6122k8431k8643k6394k3847k1712k3274k6700l2666k7049
$$ 3009162 2979852 2963730 2935299 2906656 2880262 2856415 2834703 2811429 2784729 2752063 2725014
8781B725014k4208k8359l2239l0023k9503j6848j4921j7646k6042k9943j3431
$$ 2725014 2700806 2672447 2640208 2610185 2580682 2563834 2548913 2531267 2505225 2475282 2461851
8770B461851j3616l6568l1172l2950j6694J157n574r102l4012l8336k5351k0192
$$ 2461851 2448235 2411667 2380495 2347545 2330851 2332008 2326434 2317332 2283320 2244984 2219633 2199441
8758B199441k0125j3314j2751j6716j2541r740j2592r295j4308j1722j8284j0927
$$ 2199441 2179316 2166002 2153251 2136535 2123994 2114254 2101662 2092367 2078059 2066337 2048053 2037126
8746B037126j6434k3030j1447j6888k6139k9081o150n11r163k7271l6141k5378
$$ 2037126 2020692 1997662 1986215 1969327 1943188 1914107 1907957 1907446 1898283 1871012 1834871 1809493
8734A809493p742j9469k0747l904j4732k3955j2772o280L254m602k1532j7746
$$ 1809493 1801751 1782282 1761535 1757631 1742899 1718944 1706172 1699892 1703146 1698544 1677012 1659266
8722A659266r741j905j1988j9424j0077j4185j0792k0500k232L735j9417l233
$$ 1659266 1649525 1647620 1635632 1616208 1606131 1591946 1581154 1560654 1558422 1562157 1542740 1539507
8710A539507j2732k2101j1002l283J796j1032j0511j1665j4072j0433j5881j3942
$$ 1539507 1526775 1504674 1493672 1490389 1492185 1481153 1470642 1458977 1444905 1434472 1418591 1404649
8698A404649o416j1440k0483j9898j0383r158L481Q830j5383k2975j8474r160
$$ 1404649 1398233 1386793 1366310 1346412 1336029 1326871 1330352 1339182 1323799 1300824 1282350 1273190
8686A273190m88j2023n062j8202k755o374j0377o163M129q250p821j6765j0909
$$ 1273190 1272702 1260679 1255617 1237415 1234660 1228286 1217909 1211746 1215875 1207625 1199804 1183039 1172130
8673A172130k216r593p468j4794j8885j6391k143k509j5625j0733l75M194L115
$$ 1172130 1169914 1160321 1152853 1138059 1119174 1102783 1100640 1098131 1082506 1071773 1071398 1075592 1078707
8660A078707o195m828K805j2319j5830o457j3741j1048j1374N826J2403O59m743
$$ 1078707 1072512 1067684 1070489 1058170 1042340 1035883 1022142 1011094 999720 1005546 1017949 1018608 1013865
8647A013865o173j7143k2337j9445L786J0292n230k915p680j0837n595p256o348
$$ 1013865 1007692 990549 968212 948767 952553 962845 957615 954700 947020 936183 930588 923332 916984
8634I16984j0822m077j0481j1138m404N278K542k207k215p178k5349r745K238
$$ 916984 906162 902085 891604 880466 876062 881340 883882 881675 879460 872282 846933 837188 839426
8621H39426P311j870j4481O045N484o982j0831m379J688k0388k2702K427J1171
$$ 839426 846737 844867 830386 836431 841915 834933 824102 819723 821411 801023 778321 780748 791919
8608G91919k303j0573j4215r769o724J1628N297M138j628p015j1634m173j3870
$$ 791919 789616 779043 764828 755059 748335 759963 765260 769398 767770 760755 749121 744948 731078
8595G31078k764J344o020n205L381K062J58r63p655j1511R03j0805k795O02q339
$$ 731078 728314 729658 723638 718433 721814 723876 724034 723071 715416 703905 704808 694003 691208 691810 683471
8580F83471R24P489j539j6059q989j0507l73N542q023O40q492Q438J6731L621
$$ 683471 684395 691884 690345 674286 665297 654790 654417 659959 651936 652576 644084 652522 669253 672874
8566F72874J315o083j5449j2963l299Q225p014k1299j0337j4691N146K369r508
$$ 672874 674189 668106 652657 639694 636395 644620 637606 616307 605970 591279 596425 598794 589286
8553E89286O112Q290Q571p940j4272p506n132n76j0692q37p436L323J1905j1164
$$ 589286 595398 603688 612259 604319 590047 582541 577409 576833 566141 565304 557868 561191 573096 561932
8539E61932j1326J3367k372o801m143J145L230J806m27n541j0299j3403K116J071
$$ 561932 550606 563973 561601 554800 550657 551802 555032 556838 556411 550870 540571 527168 529284 530355
8525E30355P799J1835J641Q2p200j184J804j824q166j5923k5610Q08P378J3685
$$ 530355 538154 549989 551630 551712 544512 543328 545132 543308 535142 519219 493609 494417 501795 515480
8511E15480J0823n500j601o64j5859j4673J1156J4949N854j6917j1474n134k85
$$ 515480 526303 520803 519202 518538 502679 488006 499162 514111 519965 503048 491574 486440 486155
8498D86155j3851l196k496o568L05J453M140j872m818n393m360q286J384J644
$$ 486155 472304 469108 466612 460044 460349 461802 465942 464070 459252 453859 449499 441213 442597 444241
8484D44241j950J486l387l777Q673O279K666J17q700j4165p303n392j0552K89
$$ 444241 442291 443777 440390 436613 445286 451565 454231 454348 445648 431483 424180 418788 408236 408525
8470D08525M618k996l276j482p043J975l665L090r616O821n480p913Q309j38o46
$$ 408525 413143 410147 406871 405389 398346 400321 396656 399746 390130 396951 391471 383558 391867 391729 391083
8455C91083N99L786m417O311r970j5936p434P818o081j5458M320J7176l804j3992
$$ 391083 391682 395468 391051 397362 387392 371456 364022 371840 365759 350301 354621 371797 367993 354001
8441C54001j5034R64O946J5784P55j7318M39j81o362n095j055j847q792j7532
$$ 354001 338967 339931 346877 362661 363416 346098 346537 346356 339994 334899 333844 331997 323205 305673
8427C05673q987R407L568K0545P025o249L985l235l557P845j873O315k659p562
$$ 305673 296686 306093 309661 330206 337231 330982 334967 331732 328175 336020 334147 340462 337803 330241
8413C30241j0048J0693L823j3063J751j816l906L69ql21q479j3209K927J0884
$$ 330241 320193 330886 334709 321646 323397 321581 317675 318044 318036 317715 309236 296027 298954 309838
8399C09838P978M219Q719p625j5546j1824q197J84M77J1100p765m302J2700l370
$$ 309838 317816 322035 330754 323129 307583 295759 287562 287746 288223 299323 291558 287256 299956 296586
8385B96586n846P12j1250N788j495j1272r84L482m47Q669k322k523M359J651j9501
$$ 296586 290740 291452 280202 285990 284495 273223 272239 275721 275274 283943 281621 279098 283457 285108 265607
8370B65607m444Q150R2j5937l748J0610L906O409J2535k956o828K011q87j1802
$$ 265607 261163 269313 269405 253468 249720 260330 264236 270645 283180 280224 273396 275407 274520 262718
8356B62718p500O10o754Q142k523l083J8013J0540J4973N140k716L554j1567j917
$$ 262718 255218 255828 249074 257216 254693 251610 269623 280163 295136 300276 297560 301114 289547 287630
8342B87630n917j1637j168p327k0748m218M064p393j34J739m794p140M791P539
$$ 287630 281713 270076 268908 261581 240833 236615 240679 233286 233152 234891 230097 222957 227748 235287
8328B35287J1113j158j805R930j999j1768j027N760L867q589m011o822j6353l594
$$ 235287 246400 245242 243437 253367 251368 239600 238573 244333 248200 239611 235600 228778 212425 208831
8314B08831N954j688l298q578M697p15o860k753J704J1189J2549p302l439P609
$$ 208831 214785 213097 209799 201221 205918 205203 198343 195590 197294 208483 221032 213730 210291 217900
8300B17900l761J26J4975J1716p366L48p511r719l05J530O637J085j847J1894
$$ 217900 214139 214265 229240 240956 233590 233938 226427 216708 216403 217933 224570 225655 223808 235702
8286B35702j1825k3716m084o720M676J3446K1705K770j0027P852m608j3267n023
$$ 235702 223877 200161 196077 189357 194033 207479 229184 231954 221927 229779 225171 211904 206881
8273B06881p160j603r901n157J627p74J0391Q631J309j615l379q057o848M474
$$ 206881 199721 198118 188217 183060 184687 183913 194304 202935 204244 202629 199250 191193 184345 188819
8259A88819J2746R883O49j5392k4125J1194J0175l811K069P490L913m150m842
$$ 188819 201565 211448 212097 196705 172580 183774 193949 190138 192207 199697 203610 199460 194618
8246A94618r685j9700r71k144k811J4182K2863j134J0846M407J3743M994k96q791
$$ 194618 184933 165233 164262 162118 159307 173489 196352 195218 206064 210471 224214 229208 228912 220121
8232B20121j1164l2359r466J7664J3138N348q441j7027P202J2544P657j0676k2597
$$ 220121 208957 176598 167132 184796 197934 203282 194841 177814 185016 197560 205217 194541 171944
8219A71944j5014L623J251Q157n383J867m694J1805J1790p363n801r264j478K274
$$ 171944 156930 160553 161804 169961 164578 166445 161751 173556 185346 177983 172182 162918 161440 163714
8205A63714p719m465J1211K31m494k399j0628K144K442r026Q875J563J397J956
$$ 163714 155995 151530 162741 162972 158478 156079 145451 147595 150037 141011 149886 151449 152846 154802
8191A54802r019K510O324N508j1102j899K803k587n951j477J805j743o811M833
$$ 154802 145783 148293 154617 160125 149023 147124 149927 147340 141389 139912 141717 139974 133163 137996
8177A37996J14j0596J2216l068J727N51O674J5594J7388l718m003N423n341j1676
$$ 137996 138110 127514 139730 136662 138389 138940 145614 161208 178596 174878 170875 176298 170957 159281
8163A59281k0230L56l644j200q587J134J5167M462L178o2L71l577J142J897m771
$$ 159281 139051 139407 135763 134563 125976 127110 142277 146739 149917 149855 150226 146649 147791 149688 144917
8148A44917m681k298q433j2371m009j613Q884K123J4317P419N792n325p268n68
$$ 144917 140236 137938 129505 117134 113125 111512 120396 122519 136836 144255 150047 144722 137454 136886
8134A36886Q784q891j0241P316Q738N698j339P860R495j622l366j1580q768l436
$$ 136886 145670 136779 126538 133854 142592 148290 146951 154811 164306 162684 159318 147738 138970 135534
8120A35534k328Q888k069k76K278J1898n439k1952K857q182L03L881l552m881
$$ 135534 133206 142094 140025 139749 142027 153925 148486 126534 129391 121209 121512 125393 121841 116960
8106A16960m737j309O298L358m384P126k020p82j392n561R34P852q1o494q516
$$ 116960 112223 110914 117212 120570 116186 123312 121292 120510 119118 113557 114491 122343 122262 115768 107252
8091A07252P41R504R517m857P1p207K964n763o84J161J9736p252j1787P440J6447
$$ 107252 107993 117497 127014 122157 122228 115021 117985 112222 111538 112699 132435 125183 113396 120836 137283
8076A37283J4081j297j7284j4129k362M44q173L62q439K305K62j3044J663J1288
$$ 137283 151364 150067 132783 118654 116292 116736 108563 108925 100486 102791 103053 90009 91672 102960
8062A02960J6759J1805L877r143k2562j1930q502k550j04K723O507M283l785m073
$$ 102960 119719 131524 135401 126258 103696 91766 83264 80714 80610 83333 89840 94123 90338 86265
8048H6265O350J6368L274q929j145j2685J525j861p941O389J3312j0846J6192
$$ 86265 92615 108983 112257 103328 102183 89498 91023 89162 81221 87610 100922 90076 106268
8035A06268J2460m249m328J408r588n760J5955L048k0807j3164P022j13o236R202
$$ 106268 118728 114479 110151 111559 101971 96211 112166 115214 94407 81243 88265 88152 81916 91118
8021I1118J859q818q587J607K70O492J338J2182m205r52M866J2033K775j6467
$$ 91118 92977 84159 75572 77179 77449 83941 85279 97461 93256 92304 97170 109203 111978 95511
8007I5511r260m13K194k473p469L057J0813N12J4063m236k916L485l418j2692
$$ 95511 86251 85838 88032 85559 78090 81147 91960 92472 106535 102299 99383 102868 99450 86758
7993H6758N011J1810J757m057R327k418J2935R348j333r513K953m379j6583r837
$$ 86758 91769 103579 105336 101279 110606 108188 121123 130471 129138 119625 122578 118199 101616 91779
7979I1779O743j219o804k003L29K510J651k436j245j1388N395r64q69K778q105
$$ 91779 98522 97303 90499 88496 88825 91335 92986 90550 89305 77917 83312 82348 81479 84257 76152
7964G6152j908k378J1069J0994o088j6352m788l827K0419P021m660J608O066j901
$$ 76152 74244 71866 82935 93929 87841 71489 66701 62874 83293 90314 85654 87262 93328 91427
7950I1427L82J922j7667M150J5351j271k720r692j1667L336j435j401Q156j1724
$$ 91427 91809 93731 76064 80214 95565 94294 91574 81882 70215 73551 72116 70715 78871 67147
7936F7147q93l385P827O871J4206Q78j2470q345J366J228j546k29Q532p78J55
$$ 67147 66254 62869 70696 77567 91773 92651 80181 71836 73202 74430 72884 72655 81187 80409 80564
7921H0564J6070p3Q262N435k002M84j2276Q181J2762J9042r759j8572j1604n969
$$ 80564 96634 96561 104823 110258 108256 108740 96464 104645 117407 136449 126690 108118 96514 90545
7907I0545Q921o598j0617L2n106m531j955R862K3716M477j5876q75k39m544m830
$$ 90545 99466 92868 82251 82283 77177 72646 70691 80553 104269 108746 92870 91995 91756 87212 82382
7892H2382m614O217l444k112J2406j0901k738q845K208J4364R002R160n553J4611
$$ 82382 77768 83985 80541 78429 90835 79934 77196 68351 70559 84923 93925 103085 97532 112143
7878A12143J2624k0229j6079K3940n828l065O491j936p115p233m435J2039K916
$$ 112143 124767 104538 88459 112399 106571 103506 109997 108061 100946 93713 89278 101317 104233
7865A04233L449Q873J852O392M714j1297j9755l662J125M753L53j0656k878K934
$$ 104233 107682 116555 118407 124799 129513 118216 98461 94799 95924 100677 101030 90374 87496 90430
7851I0430O896O677o219o323n392L434m652q581O497j7161m54J1739Q447J0663
$$ 90430 97326 104003 97784 91461 86069 89503 84851 76270 82767 65606 65152 76891 85338 96001
7837I6001Q116m26L696j4475j8927j2883j416M156R517P552l240Q012R493O961
$$ 96001 104117 103691 107387 92912 73985 61102 59686 63842 73359 80911 77671 85683 95176 102137
7823A02137m978j1288o222j5790q422p364K085K2561J5256l979n755J721l612
$$ 102137 97159 85871 79649 63859 55437 48073 50158 72719 87975 83996 78241 79962 76350
7810G6350Q55j7843L72J1134J322j653N032q832l991J1847M780K665m48q091o753
$$ 76350 77205 59362 59734 70868 72190 70537 75569 66737 62746 74593 79373 82038 81590 73499 66746
7795F6746l046N774o54m866L126l679j1733o092M040O087L502l978m60J5875k299
$$ 66746 63700 69474 68820 63954 67080 63401 51668 45576 49616 55703 59205 55227 54767 70642 68343
7780F8343l212j2528O635J130J386l858J2976P987r132j0348p613r024o444M223
$$ 68343 65131 52603 59238 60368 61754 57896 70872 78859 69727 59379 51766 42742 36298 40521
7766D0521k036N651P725n168o822N50j360o935J396N755R902r201j7716m524K368
$$ 40521 38485 44136 51861 46693 39871 40421 39061 32126 33522 39277 49179 39978 22262 17738 20106
7751B0106J1555R3k90j2257N130k580R834k16P017P07o714o18R910N979m80j687
$$ 20106 31661 31754 31464 19207 24337 21757 31591 31375 38392 39099 32385 31767 41677 47656 47176 45489
7735D5489p288L336r86k0505N069K528j0423K573J0858k603p526PP514N653J0249
$$ 45489 38201 41537 40551 20046 25115 27643 17220 19793 30651 28048 20522 20529 28043 33696 43945
7720D3945N717k505m470n442L255r46M896N753l660J85J771L465q149o204J4617
$$ 43945 49662 47157 42687 37245 40500 39554 44450 50203 46543 46728 48499 51964 43815 37611 52228
7705E2228j2898l391N920r413L603J0108j1031P176N68q276j319k355Q630K095
$$ 52228 39330 35939 41859 32446 36049 46157 35126 42302 42870 34594 33275 30920 39550 41645
7691D1645k2405n815M585P754j68M948J4229K76j0735k7K582J3266Q920o040o358
$$ 41645 19240 13425 18010 25764 25596 30544 44773 45049 34314 34287 36869 50135 59055 53015 46657
7676D6657N199p404J461o33J2962j1037k827L23O264L448j1809j97J841Q374J499
$$ 46657 51856 44452 45913 45280 58242 47205 44378 44701 50965 54413 42604 42407 44248 52622 54121
7661E4121m054L83L216j202j15M909M124j267j6634q278K071M532j4894j105O270
$$ 54121 50067 50450 53666 52464 52349 57258 61382 60115 43481 35203 37274 41806 26912 25807 32077
7646C2077r399M28R63K465J667P099M545M085l531R716O24n112o389j244m738
$$ 32077 22678 23106 24069 26534 28201 35300 39845 43930 40399 50115 50739 45627 39238 37994 33256
7631C3256R16Q832l288j2050l08J5202P509m351j4696q318O730J912P459K0108
$$ 33256 34172 43004 39716 27666 27358 42560 50069 45718 31022 22704 29434 31346 38805 58913
7617E8913o151k249J808r123n881J829j492L561O162n63m222q385Q47N728k077
$$ 58913 52762 50513 52321 43198 37317 39146 37654 41215 47377 46814 42592 34207 35054 40782 38705
7602C8705L301N168m821j0922K253K922o775j369j024n177R75j194N477O990J4407
$$ 38705 42006 47174 42353 31431 33684 36606 29831 28462 27438 22261 23236 22042 27519 34509 48916
7587D8916q077K593J5920k968j8665j0825M636j4823O073k203Q36L987Q368L921
$$ 48916 40839 43432 59352 56384 37719 26894 31530 16707 22780 20577 21413 25400 33768 37689
7573C7689R944r829K094j1347q133J8836J0019j1556r985k506J2159J0711k731
$$ 37689 47633 37804 39898 28551 20418 39254 49273 37717 27732 25226 37385 48096 45365
7560D5365k0590m089P755R023j528j1830o71J3526m406R765P651k400q263j693
$$ 45365 24775 20686 28441 37464 35936 24106 23435 36961 32555 42320 49971 47571 39308 37615
7546C7615N094n551q403K551R271L136Q423o275p752n834o975L201k991N149N005
$$ 37615 42709 37158 28755 31306 40577 43713 52136 45861 38109 32275 25300 28501 25510 30659 35664
7531C5664m99r919J1390J0110q095p89K478k391r052j3907N601J8184o700p436
$$ 35664 35165 25246 36636 46746 38651 37862 40340 37949 28897 14990 20591 38775 32075 24639
7517B4639J8457M853n119n242n553J4979n622j5260j2436j409p818j7556J7396
$$ 24639 43096 47949 42830 37588 32035 47014 41392 26132 13696 12287 4469 -13087 4309
7504D309K240M419J9630P269o218j401k255k560L566J0326k17p478o943m827n603
$$ 4309 6549 10968 30598 37867 31649 30248 27993 25433 28999 39325 39108 31630 24687 19860 14257
7489A4257j2458P171J2562L938l599o577r106N085K681K461R941P205J1998n946
$$ 14257 1799 8970 21532 25470 21871 15294 6188 11273 13954 16415 26356 33561 45559 39613
7475C9613j6342j612P309r19j1571J919O739O988Q46r887j784j6320p893J2903
$$ 39613 23271 21659 28968 28049 16478 18397 25136 32124 32970 23083 21299 4979 -2914 9989
7461I989R261K725n584P080O587M605p922q409p908J017Q617P35J7651K602n650
$$ 9989 19250 21975 16391 23471 30058 34663 26741 18332 10424 11441 20058 20793 38444 41046 35396
7446C5396j2787N322q124j3753K921K5380N973j4123j804N474M319k202J1025
$$ 35396 22609 27931 19807 6054 8975 34355 40328 26205 24401 29875 34194 31992 43017
7433D3017P127o640p515l771P100p578K578l528L294j132l779j6356n610P52J8964
$$ 43017 50144 43504 35989 32218 39318 31740 34318 30790 34084 32952 29173 12817 7207 7959 26923
7418B6923K0330l466l574P9k89o217j5133J1677J188J0397q053L534L46j6886
$$ 26923 47253 43787 40213 40292 40003 33786 18653 30330 31518 41915 33862 37396 37742 20856
7404B0856q40J5015N412M234n718p156M743m925n407J4705j0791k169k754m295
$$ 20856 20016 35031 40443 44677 38959 31803 36546 31621 26214 40919 30128 27959 25205 20910
7390B0910q159n005J3136Q99l159M284P874M119j2952n393k689r085K813Q437
$$ 20910 12751 7746 20882 21781 18622 22906 30780 34899 21947 16554 13865 4780 7593 16030
7376A6030k025K919M221L733l927K147r47L232l67j1240m458K964m690r181N327
$$ 16030 14005 16924 21145 24878 20951 23098 22151 25383 25016 13776 9318 12282 7592 -1589 3738
7361C738J2977P053Q258o957j2337J508Q61L061p97P157M416J465n495j021l90
$$ 3738 16715 23768 32026 25069 12732 14240 15101 18162 17365 24522 28938 30403 24908 23887 23497
7346B3497J1628J0117k0027J555N085K933j0564l379l475k856Q627r37n248Q58
$$ 23497 35125 45242 25215 26770 31855 34788 24224 20845 17370 14514 23141 22204 16956 17814
7332A7814j2100J79J4871k029j1185L598R99J3485R094P788j3952p776l75j1544
$$ 17814 5714 5893 20764 18735 7550 11148 12147 25632 34726 42514 28562 20786 20411 8867
7318H867j4125j475R549J1837M854k120L920o615k945l737m077P65l006k529M221
$$ 8867 -5258 -6733 2816 14653 19507 17387 21307 14692 11747 8010 3933 4698 1692 -837 3384
7303C384J3606J6279j2035p212k108o653l138J1026P927M011P298r434j7458l448
$$ 3384 16990 33269 21234 14022 11914 5261 2123 13149 21076 25087 32385 22951 5493 2045
7289B045P697J2075K928q102j3365o419Q730Q637R11o840j053l077Q136R70k974
$$ 2045 9742 21817 24745 16643 3278 -3141 5589 14226 15137 8297 7244 4167 12303 13273 10299
7274A0299P081j3756M286j0334l851J1255L585k796N979Q742R4R48K592L026O300
$$ 10299 17380 3624 7910 -2424 -6275 4980 8565 5769 11748 20490 20584 21532 24124 27150 33450
7259C3450r821M126P3m225K910N867p870j4134o285R837K299Q33k226R578M840
$$ 33450 23629 27755 27828 23603 26513 32380 24510 10376 4091 13928 16227 17060 14834 24412 29252
7244B9252j1671o041J0063N904n683l533k2162m024J1799O816J305L614J0498
$$ 29252 17581 11540 21603 27507 21824 18291 -3871 -7895 3904 10720 12025 15639 26137
7231B6137L56j5608l82q468O897n629J09J7912r329j5639o475J724P917Q496J5712
$$ 26137 26493 10885 10503 2035 8932 3303 3412 21324 11995 -3644 -10119 -8395 -478 8018 23730
7216B3730r068m377M046J0830p038l867m11O084l960j0328o571j5342J1334K3795
$$ 23730 14662 10285 14331 25161 18123 14256 13845 19929 15969 5641 -930 -16272 -4938 18857
7202A8857O401L485l060N8r548J273n513j5990l179K830Q015R955P783R930P947
$$ 18857 25258 28743 25683 25741 16193 17466 11953 -4037 -7216 -4386 3629 13584 21367 31297 39244
7187C9244n051r557Q170O726M365J712q680j0868j1422J2848K08j072l664M098
$$ 39244 34193 24636 32806 39532 43897 45609 36929 26061 14639 27487 27695 26623 22959 27057
7173B7057m110K286O835k593l694q805j2365n768j1444J395Q008J3400l373r667
$$ 27057 22947 25233 32068 29475 25781 16976 4611 -1157 -12601 -11206 -3198 10202 6829 -2838
7159b838K155J4119O173l96J4187L822J008l160j1931R714m26q562p36J626j127
$$ -2838 -683 13436 19609 19213 33400 37222 38230 35070 23139 32853 32427 23865 23129 24755 23628
7144B3628j216K975n425K846L503o834k174K317k468L991K453j1891k059m228
$$ 23628 22412 25387 19962 22808 26311 19477 17303 19620 17152 21143 23596 11705 9646 5418
7130E418o887n419R3Q134J0894J654l514L471K961j3686j6070j0429J3915P664
$$ 5418 -1469 -6888 -6795 1339 12233 13887 10373 13844 16805 3119 -12951 -23380 -9465 -1801
7116a801P834L293k1885k357J2363M785L740N427l349m545K525M919J054K074
$$ -1801 6033 9326 -12559 -14916 -2553 2232 5972 11399 8050 3505 6030 10949 12003 14077
7102A4077N117O8k912o009Q52K5267j779j5199k3565o83R425L442O659K139k556
$$ 14077 19194 19262 16350 10341 11193 36460 34681 19482 -4083 -4766 4659 8101 14760 16899 14343
7087A4343m374q76P533q350j4298J330L266Q09M827J3383L949j2530j0106o223
$$ 14343 9969 9093 16626 8276 -6022 -4692 -1426 -617 4210 17593 21542 9012 -1094 -7317
7073g317J378J1578M991K733m67J2120m170o31p967r051L585j981q055k881N036
$$ -7317 -5939 5639 10630 13363 12896 25016 20846 20215 12248 3197 6782 4801 -3254 -6135 -1099
7058a099L327M661J1347M668Q299L317m956K280j3525J2030Q625k6001j2656J7945
$$ -1099 2228 6889 18236 22904 31203 34520 29564 31844 18319 30349 38974 12973 317 18262
7044A8262J1309n016j417j112j1006m25p56r704J360R178j509q668l521N396K997
$$ 18262 29571 24555 23138 22026 11020 10595 9839 135 1495 10673 9164 496 -3025 2371 5368
7029E368M626M955Q524P59j2066N354q159n558q511p08m93O753J2654j599j0464
$$ 5368 9994 14949 23473 24232 12166 17520 9361 3803 -4708 -5416 -5909 844 13498 11899 1435
7014A435R635M319j5898q930l515L052L677N126M550N294p59m838k99L90M177
$$ 1435 11070 15389 -509 -9439 -12954 -9902 -6225 -1099 3451 8745 7986 3148 2849 3239 7416
6999G416o223q613J812R559J8848L21k7364K723P641q860R30L531J2079r543o56
$$ 7416 1193 -7420 -5608 3951 22799 23120 -4244 -1521 6120 -2740 -1810 1721 13800 4257 3601
6984C601Q182r67M426N101L099o056k082j1973O41o604J3208R292j101j9525k2910
$$ 3601 11783 10816 15242 20343 23442 17386 15304 3331 3972 -2632 10576 19868 18767 -758 -23668
6969b3668J3579O688J0010L06l985K762J2359m309k524m231L436m618k327J1646
$$ -23668 -10089 -3401 6609 6915 2930 5692 18051 13742 11218 6987 10423 5805 3478 15124
6955A5124Q889l441J2554k522r761k488m695j74l198p3l906K279P836Q954l58
$$ 15124 24013 20572 33126 30604 20843 18355 13660 13486 10288 10215 6309 8588 16424 25378 25020
6940B5020j2576q407l66R396K737j5458o323O599O521n428N483M721L94K0119
$$ 25020 12444 4037 3671 13067 15804 346 -5977 622 7143 1715 7198 11919 12313 32432
6926C2432R448j6836k2302j3650K563J7573J5205L068m711j4147r646j0634j0982
$$ 32432 41880 25044 2742 -10908 -8345 9228 24433 27501 22790 8643 -1003 -11637 -22619
6913b2619l240P733J1820k658M673M678N375N63J4063M935K441j4820j6835P994
$$ -22619 -25859 -18126 -6306 -8964 -4291 387 5762 6325 20388 25323 27764 12944 -3891 4103
6899D103P924j3522J470J0238o500o793J347L232j867O999l30j6045O881J549
$$ 4103 12027 -1495 -25 10213 3713 -3080 -1733 1499 -368 6631 6301 -9744 -2863 -1314
6885a314j0043j701J4697O074m891j416K1050O742K504k594m130l455k3517l11
$$ -1314 -11357 -13058 1639 7713 2822 1406 22456 29198 31702 29108 24978 21523 -1994 -2305
6871b305L841R42K335L727J423k502r873k482M244m980L856n495j505M152J1796
$$ -2305 1536 2478 4813 8540 9963 7461 -2412 -4894 -650 -5630 -1774 -7269 -8774 -4622 7174
6856G174O675m756M009J7293K216j1685q254o571J19p722L900J1114N994r886
$$ 7174 13849 9093 13102 30395 32611 20926 12672 6101 6220 -1502 2398 13512 19506 9620
6842I620j2044k249O810J1503R405M240k391j3662L846l42J634J010L884r493
$$ 9620 -2424 -4673 2137 13640 23045 27285 24894 11232 15078 14736 16370 17380 21264 11771
6828A1771R411O842m487n211n005L019K447R1N498K490j0420K246J495J990L392
$$ 11771 21182 28024 23537 18326 13321 16340 18787 18878 24376 26866 16446 18692 20187 22177 25569
6813B5569o440j26M793P311Q24j2496j1550N028j2770p202l513O080P528R712
$$ 25569 19129 19003 23796 31107 31931 19435 7885 12913 143 -7059 -10572 -4492 3036 12748
6799A2748k715j4894j65Q047K4444k066j0907O055p756l449m210m321J1695N56
$$ 12748 10033 -4861 -5026 3021 27465 25399 14492 20547 12791 9342 5132 811 12506 13062
6785A3062o511n447j4377N412J1977q917j7532K853j828M878O015Q058M307L896
$$ 13062 6551 1104 -13273 -7861 4116 -4801 -22333 -19480 -21308 -16430 -10415 -2357 1950 5846
6771E846O5M799Q405r012p903j9908M04J0892J6036m998k740j3802l693L165J1992
$$ 5846 5911 10710 19115 10103 2200 -17708 -17304 -6412 9624 4626 1886 -11916 -15609 -12444 -452
6756d52R792J2520J187Q422l465j0950j012m218J898n620j0196J300J2570K721
$$ -452 9340 21860 23047 31469 28004 17054 16042 11824 13722 8102 -2094 -794 11776 14497
6742A4497K828j137L593N236R42q403j658r251J194O766j0391j0450k46M839Q677
$$ 14497 17325 16188 19781 25017 25959 17556 15898 6647 7841 14607 4216 -6234 -6480 -1641 7036
6727G036K2080N604j3433J252r22m840N305K705l143k49j5725q051M382J1374
$$ 7036 29116 34720 21287 22539 21617 16777 22082 24787 21644 21395 5670 -2381 2001 13375
6713A3375O699j1528j6813J5745J4167L981N2k0328N620K1233o91r606r962Q712
$$ 13375 20074 8546 -8267 7478 21645 25626 25678 5350 10970 32203 31512 21906 11944 20656
6699B0656Q626l833L733L286l650j111j422N54j8277l667p600R249L918N876N724
$$ 20656 29282 25449 29182 32468 28818 27707 26285 26839 8562 4895 -2705 6544 10462 16338 22062
6684B2062R977j33n573k618n686o180k488p597K067K508Q077N417J933J4431K1730
$$ 22062 32039 31906 26333 23715 18029 11849 9361 1764 3831 6339 14416 19833 21766 36197 57927
6669E7927O835J8018K8000J2797J2458O75j3779q272l1847k8318j7687p054K390
$$ 57927 64762 82780 110780 123577 136035 136710 122931 114659 82812 54494 36807 29753 32143
6656C2143o160q490p020R117O650j464m083m147N321j936m933J3895r867j0751
$$ 32143 25983 17493 10473 19590 26240 24776 20693 16546 21867 19931 14998 28893 19026 8275
6642H275o411l659J1766p157J1571P201k0398j7921O474J6628K775n329j2205
$$ 8275 1864 -1795 9971 2814 14385 21586 1188 -16733 -10259 6369 9144 3815 -8390
6629h390k4681J1238K5050M643L767n174n599J412P27m008Q028J2860J417O727
$$ -8390 -33071 -21833 3217 7860 11627 6453 854 2266 2993 -1015 7013 19873 21290 28017
6615B8017q969q775p983o49o960r616M631J0435Q518l7j1571m564L059O055N103
$$ 28017 19048 10273 2290 1641 -5319 -14935 -10304 131 8649 8612 -2959 -7523 -4464 1591 6694
6600F694J5429k966j7214q925k942j2427k164L54J4488J3546R622n705j3461n172
$$ 6694 22123 19157 1943 -6982 -9924 -22351 -24515 -24161 -9673 3873 13495 7790 -5671 -10843
6586a0843N308j0057m489J766O533L746R444p254k752l536J0005Q757j0732o213
$$ -10843 -5535 -15592 -20081 -18315 -11782 -8036 1408 -5846 -8598 -12134 -2129 6628 -4104 -10317
6572a0317J8862J1679j626l337p771n77j7939j6287J4238r823r814J6570J6062
$$ -10317 8545 20224 18598 15261 7490 6913 -11026 -27313 -13075 -22898 -32712 -16142 -80
6559h0O239N902l120M570k777o537q770K314J0646O175q773r047r651J0081P429
$$ -80 6159 12061 8941 13511 10734 4197 -4573 -2259 8387 14562 5789 -3258 -12909 -2828 4601
6544D601r339J289R552P94j906K259j2763J428J1313m312m724J8388j586q562
$$ 4601 -4738 -3449 6103 6897 4991 7250 -5513 -4085 7228 2916 -1808 16580 14994 6432
6530F432j110P408q047j0866J1537k271m132O584Q177k689k741J384p764o147
$$ 6432 5322 12730 4683 -6183 5354 3083 -1049 5535 13712 11023 8282 9666 1902 -4245
6516d245K227R871p920l59P696l512K516P389k686n282r609L133J958O75Q938
$$ -4245 -2018 7853 -67 -426 7270 3758 6274 13663 10977 5695 -3914 -781 1177 1852 10790
6501A0790q86l437j223n303n849J741j501p64k493J893Q567N619P434j0931p878
$$ 10790 9904 6467 5244 -59 -5908 -4167 -5668 -6432 -8925 -7032 1535 7154 14588 3657 -4221
6486d221O540p891k390p187R080J5790R175N278r396q845L105p578M900M791n346
$$ -4221 2319 -5572 -7962 -15149 -6069 9721 18896 24174 14778 5933 9038 1460 6360 11151 5805
6471E805m494o599j5119n654m249J2764j3316j1289M995K1705L284n066P447J1781
$$ 5805 1311 -5288 -20407 -26061 -30310 -17546 -30862 -42151 -37156 -15451 -12167 -17233 -9786 1995
6457A995p466K252N421l922j4637l527N469J6147O53O150M60k61J137J863j0893
$$ 1995 -5471 -3219 2202 -1720 -16357 -19884 -14415 1732 2385 8535 8995 8734 9871 11734 841
6442H41N72r92m062L827J19K974O420K8Q92P03N105K867j3923j4796K506J166
$$ 841 1413 421 -3641 186 305 3279 9699 9727 10619 11322 16427 19294 5371 -9425 -6919 -5753
6426e753M099L778m954q389K217J764j1527O720K967R590O133Q301l779M83k749
$$ -5753 -1654 2124 -2830 -11219 -9002 -7238 -18765 -12045 -9078 512 6645 14946 11167 11650 8901
6411H901j0799p314J120j474J5407J5270n359j955j126K116q386n218j6521J8128
$$ 8901 -1898 -9212 -8092 -9566 5841 21111 15752 13797 12671 14787 6401 1183 -15338 2790
6397B790J0495M63m905m604q18J1613p552q151R124p867L092l662L203J0402j7005
$$ 2790 13285 13748 8843 4239 3421 15034 7482 -669 8455 588 3680 18 3221 13623 -3382
6382c382r385N161J4986Q423L807p163j1140j1765M28m992l560M064P627R796
$$ -3382 -12767 -7606 7380 15803 19610 12447 1307 -10458 -10030 -15022 -18582 -14518 -6891 2905
6368B905P376j133r751k367m071N300r023K54M779o24l69j708K12O321L679l60
$$ 2905 10281 9148 -603 -2970 -7041 -1741 -10764 -10510 -5731 -6355 -6724 -8432 -8220 -1899 1780 1420
6352A420m354j266k281O966M3j681K871p16N525J447O507j3694j7592Q541N108
$$ 1420 -2934 -4200 -6481 485 528 -1153 1718 1002 6527 7974 14481 787 -16805 -8264 -3156
6337c156R316O628m901r362j4650K736J0742O060j476O638N157j0865j055l95
$$ -3156 6160 12788 7887 -1475 -16125 -13389 -2647 3413 1937 8575 13732 2867 1812 1417
6323A417k982L305j0378j5280J0663Q010o642J1423M257m830j0107R96L654K524
$$ 1417 -1565 1740 -8638 -23918 -13255 -5245 -11887 -464 3793 -1037 -11144 -10148 -6494 -3970
6309c970O372k908p798j0457l950J6673R978J0584k379m057l083k645k794O93
$$ -3970 2402 -506 -8304 -18761 -22711 -6038 3940 14524 12145 8088 5005 2360 -434 259
6295B59K469k94j0334j3820p615P393L807m74J9645J1340j398q11o523j2062j0688
$$ 259 2728 2434 -7900 -21720 -29335 -21942 -18135 -18609 1036 12376 10978 10167 3644 -8418 -19106
6280a9106M775l170K21K3319J374j2881j919O390O225k061r823j699L894p842
$$ -19106 -14331 -17501 -17280 6039 7413 -5468 -7387 -997 5228 3167 -6656 -8355 -4461 -12303
6266a2303J3001P128j6093k628K109k415Q891P077n197j72p495j11n088N84J4350
$$ -12303 698 7826 -8267 -10895 -8786 -11201 -2310 4767 -430 -602 -8097 -8208 -13296 -12712 1638
6251A638R049O219K009n834k210o003q183j2548J2994J9135K573p965k1749J7012
$$ 1638 10687 16906 18915 13081 10871 4868 -3315 -15863 -2869 16266 18839 10874 -10875 6137
6237F137K512q444J4100L815j1871q371L744R172j3391J131r871R789P606j9240
$$ 6137 8649 205 14305 18120 6249 -2122 1622 10794 -2597 -1466 -11337 -1548 6058 -13182
6223a3182J249R12P41k186N855O476M668j246l400r890l153O908l46j481o73l528
$$ -13182 -11933 -11021 -10280 -12466 -6611 -135 4533 3287 -113 -10003 -13156 -6248 -6594 -8075 -8748 -12276
6207a2276n781J6140M410n406K313k31l376L10l57l948j190K037m324J1744J0747
$$ -12276 -18057 -1917 2493 -2913 -600 -831 -4207 -3897 -4254 -8202 -9392 -7355 -11679 65 10812
6192A0812q203n003p059q334J950J1042J0420j0645L295R807j3049j2148Q894
$$ 10812 2609 -2394 -9453 -17787 -15837 -4795 5625 -5020 -1725 8082 -4967 -17115 -8221
6179h221J2899J4572J0184j2237k2326p768j334o001J864m022n306J0263K4897
$$ -8221 4678 19250 29434 17197 -5129 -12897 -14231 -20232 -18368 -22390 -27696 -17433 7464
6166G464J3235j0007j3428o418q599n113J5504O719r406j3416K151o732J1598
$$ 7464 20699 10692 -2736 -9154 -17753 -22866 -7362 -643 -10049 -23465 -21314 -28046 -16448
6153a6448J523j964L016J953J1504J0083J328p079m088r780j467l023o916j499
$$ -16448 -14925 -16889 -13873 -11920 -416 9667 10995 3916 -172 -9952 -11419 -14442 -21358 -22857
6139b2857P623P956m526K3N300J0085J2225m726j0612o417O874P70n412p566o10
$$ -22857 -15234 -7278 -11804 -11781 -6481 3604 15829 11103 491 -5926 948 1718 -3694 -11260 -11870
6124a1870J70n863N925j2488k733m981P860Q790q12M028L792j513J4368J4071
$$ -11870 -11700 -17563 -11638 -24126 -26859 -31840 -23980 -15190 -16002 -11974 -8182 -9695 4673 18744
6110A8744K595r426j2048k715R213J4281j4552j3165o495p296Q286J7840P192
$$ 18744 21339 11913 -135 -2850 6363 20644 6092 -7073 -13568 -20864 -12578 5262 12454
6097A2454n402M145o676r384k791J0810J6445M707p449j8116p797R267N40L014
$$ 12454 7052 11197 4521 -4863 -7654 3156 19601 24308 16859 -1257 -9054 213 753 3767
6083C767j928j3737L9J2943K753L169J755l429J1268R753J891m866k699p999j3425
$$ 3767 1839 -11898 -11859 1084 3837 7006 8761 5332 16600 26353 28244 23378 20679 12680 -745
6068g45j7547p199p220O766K948J095j554P924R558N158k655q545q171O862J479
$$ -745 -18292 -25491 -32711 -25945 -22997 -21902 -23456 -15532 -5974 -816 -3471 -12016 -20187 -13325 -11846
6053a1846l446r436l2126L446K4250n13K225J9143p835n381N705J1163Q478M331
$$ -11846 -15292 -24728 -56854 -53408 -29158 -29671 -27446 -8303 -16138 -21519 -15814 -4651 3827 8158
6039H158R323J916j2620j3559K130r508R649j865O38j4215p102P667m338j968
$$ 8158 17481 19397 6777 -6782 -4652 -14160 -4511 -6376 -5738 -19953 -27055 -19388 -23726 -25694
6025b5694L329m68P38M05P316P601j165o833J872J631Q599O251J244j0775q36
$$ -25694 -22365 -22833 -22095 -21690 -14374 -6773 -7938 -14771 -12899 -11268 -2669 3582 4826 -5949 -6785
6010f785J392J654j2744j2603N035Q359M732Q546j516n784r36j1753j9440k345
$$ -6785 -5393 -3739 -16483 -29086 -24051 -15692 -10960 -2414 -3930 -9714 -10650 -22403 -41843 -44188
5996d4188J5335J8629K74N774J208j2654l948K858J7466M046o642r185J046J1793
$$ -44188 -28853 -10224 -9950 -4176 -2968 -15622 -19570 -16712 754 4800 -1842 -11027 -9981 1812
5982A812N384k2460p347K997P651l770k354K164J891m439K387N281Q791n323O868
$$ 1812 7196 -15264 -22611 -19614 -11963 -15733 -18087 -15923 -14032 -18471 -16084 -10803 -2012 -7335 -467
5967d67P614J1716j426n808K792K099r946p007J3987l807j8212o164K392k49j582
$$ -467 7147 18863 17437 11629 14421 16520 6574 -433 13554 9747 -8465 -14629 -12237 -12486 -14068
5952a4068K435r559n26l023R955J1656J0915o699K02j5501k4920P848K3890Q666
$$ -14068 -11633 -21192 -21718 -24741 -14786 -3130 7785 1086 1288 -14213 -39133 -31285 -7395 1271
5938A271r94j8307lM179J1431P242Q340K71n013r985l647Q149n050p465n735R937
$$ 1271 277 -18030 -18033 -13854 -2423 4819 13159 13430 8417 -1568 -5215 2934 -2116 -9581 -15316 -5379
5922e379J818K085K967j3482m910L305M391R36m402j8576k771L631J1533J0418
$$ -5379 -3561 -1476 1491 -11991 -16901 -13596 -9205 -8269 -12671 -31247 -34018 -30387 -18854 -8436
5908h436Q88o503L010J615j1539k497R219K3468r02o703J5954J191q209l394p325
$$ -8436 -7548 -14051 -11041 -9426 -20965 -23462 -14243 9225 8323 1620 17574 18765 10556 7162 -163
5893a63j929N761k310m739J0099k312K811J017r785m109P622J3671O398m658n150
$$ -163 -2092 3669 1359 -3380 6719 4407 7218 8235 -1550 -5659 1963 15634 22032 17374 12224
5878A2224p305j4941j6545J2507R707K024P325J970p588j0656K472J0692N318
$$ 12224 4919 -10022 -26567 -14060 -4353 -2329 4996 6966 -622 -11278 -8806 1886 7204
5865G204p184M800L108o60l461P82m989M906P950K813k761J251q085n853o155
$$ 7204 20 4820 7928 7268 3807 4589 -400 4506 12456 15269 12508 13759 5674 -179 -6334
5850f334R82L577J5161J1431o88M540K458j3654j1921j0563j2408M21J2655J2205
$$ -6334 -5352 -1775 13386 24817 24129 28669 31127 17473 5552 -5011 -17419 -16998 -4343 7862
5836G862Q798p663j6456p785n809K478K884l714J4761j0937k334R504O295Q45
$$ 7862 16660 8997 -7459 -15244 -21053 -18575 -15691 -19405 -4644 -15581 -17915 -8411 -2116 -1271
5822a271K379j1844L07J9492M726l564q874N545K706m623o504j0816J566R585
$$ -1271 1108 -10736 -10429 9063 13789 10225 1351 6896 9602 4979 -1525 -12341 -10775 -1190
5808a190P187m406j0951j6857o970P447K324r668Q879J3451J6206p860p919K283
$$ -1190 5997 1591 -9360 -26217 -33187 -25740 -23416 -33084 -24205 -10754 5452 -2408 -10327 -8044
5794h044m572Q866J3531j996j0180P812L408l360N341J25l264m624L620N237p397
$$ -8044 -12616 -3750 9781 7785 -2395 5417 8825 5465 10806 10931 7667 3043 6663 11900 4503
5779D503k938j7099o015J0235o411l433m831J0917P010Q062m667q502P386j631
$$ 4503 1565 -15534 -21549 -11314 -17725 -21158 -25989 -15072 -8062 0 -4667 -13169 -5783 -7414
5765g414O85N701Q274R584n713j2758N420L037r61k410n974l641j1607m537N297
$$ -7414 -6729 -1028 7246 16830 11117 -1641 3779 6816 5855 3445 -2529 -6170 -17777 -22314 -17017
5750a7017M645K067J0020K291k529K668k31K654R706q279r018p401n450R177N455
$$ -17017 -12372 -10305 -285 2006 -523 2145 1914 4568 14274 5995 -3023 -10424 -15874 -6697 -1242
5735a242N028k740K895m823q011l766k471J5256L149q122j0420P08P219M913Q281
$$ -1242 3786 1046 3941 -882 -8893 -12659 -15130 126 3275 -4847 -15267 -14559 -7340 -2427 5854
5720E854J3686J132j587n367j0730P56j6040L160R339o692K803J242P37l736j407
$$ 5854 19540 20672 19085 13718 2988 3744 -12296 -9136 203 -6489 -3686 -2444 -1707 -5443 -6850
5705f850R407J2081r38m015r165n486n052K990j972K986o866n180J2921j263l670
$$ -6850 2557 14638 13700 9685 520 -4966 -10018 -7028 -9000 -6014 -12880 -18060 -5139 -6402 -10072
5690a0072k269m273j643j547J406P919Q064j159N669K574K187q83O111q879q656
$$ -10072 -12341 -16614 -18257 -19804 -18398 -10479 -2415 -3574 2095 4669 6856 5973 12084 3205 -5451
5675e451L079P988J746N945k330j9093k2416M712J0098J696J389l892R833J336
$$ -5451 -2372 5616 7362 13307 10977 -8116 -30532 -25820 -15722 -14026 -12637 -16529 -6696 -5360
5661e360K837n371O97l799j3299N196M880m628R754J3665M898J662n259l573j833
$$ -5360 -2523 -7894 -7197 -10996 -24295 -19099 -14219 -18847 -9093 4572 9470 11132 5873 2300 467
5646D67J157r935k95M549M518J246l031p429K359l924P721n960j6977O62J4425
$$ 467 1624 -8311 -8606 -4057 461 1707 -1324 -8753 -6394 -10318 -2597 -8557 -25534 -24872 -10447
5631a0447L187O384K3343M389n607O032J2064M801r705j8854o118j773L817j5080
$$ -10447 -7260 -876 22467 26856 21249 27281 39345 44146 34441 15587 9469 7696 11513 -3567
5617c567j8751K44L783Q99o014J1514j54j865J2943q764N828J0454J304j1079
$$ -3567 -22318 -22074 -18291 -17392 -23406 -11892 -12046 -13911 -968 -9732 -3904 6550 7854 -3225
5603c225R130K1229J42p441k5052P76k290Q42l584K119J6423k250j221J6809K618
$$ -3225 5905 27134 27276 19835 -5217 -4441 -6731 -5889 -9473 -7354 9069 6819 5598 22407 25025
5588B5025j4439q96l442j526K933m88j097n959J62q561J2200M272P129j211P290
$$ 25025 10586 9690 6248 4722 7655 7167 6070 111 273 -8288 3912 8184 15313 14102 21392
5573B1392o756q279P94m930j0993N169j121l265k043L774M018N056K950k846J520
$$ 21392 14636 6357 7151 2221 -8772 -3603 -4724 -7989 -10032 -6258 -2240 2816 5766 2920 4440
5558D440j419j6559m393m354l613J8347J999p978l723P303J1503O125R445j6880
$$ 4440 3021 -13538 -17931 -22285 -25898 -7551 -5552 -13530 -17253 -9950 1553 7678 17123 243
5544B43j760L704L526P838j3158l803L758r236J480R128j854j0029J946J0567
$$ 243 -1517 2187 5713 13551 393 -3410 348 -8888 -7408 1720 -134 -10163 -8217 2350
5530B350P749n715j8522k0841m967K0713J4493j746q024M690k344J3941J8717
$$ 2350 10099 4384 -14138 -34979 -39946 -19233 -4740 -6486 -14510 -9820 -12164 1777 20494
5517B0494p460j0643L314k914j4624p830N010L681Q59n654l036N802M428L033
$$ 20494 13034 2391 5705 2791 -11833 -19663 -14653 -10972 -10113 -15767 -18803 -13001 -8573 -5540
5503e540o106j368J6185O114j1331K178L336j532o024M648P513l472m686j005
$$ -5540 -11646 -13014 3171 9285 -2046 132 3468 1936 -4088 560 8073 4601 -85 -1090
5489a090j4718M330K896q169q9J1073m170j0122q634J583P772N743l863M558k709
$$ -1090 -15808 -11478 -8582 -16751 -16840 -5767 -9937 -20059 -28693 -27110 -19338 -13595 -17458 -12900 -15609
5474a5609m383n482n439l71O003J2316R277j407l064o995o597n385m357O758J119
$$ -15609 -19992 -25474 -30913 -31284 -25281 -12965 -3688 -5095 -8159 -15154 -21751 -27136 -31493 -24735 -23616
5459b3616K361M340J1588J5698l626J520N023j6937m77O831j0952o854l4N077
$$ -23616 -21255 -16915 -5327 10371 6745 8265 13288 -3649 -4126 2705 -8247 -15101 -15135 -10058
5445a0058Q62O758q75p48j0440o937M501K3463J5728q501j7738N684j1360o311
$$ -10058 -9196 -2438 -3313 -4061 -14501 -21438 -16937 6526 22254 13753 -3985 1699 -9661 -15972
5431a5972q785J6628Q286p792l455K770L805l656o634M01Q437l204j604J5641
$$ -15972 -24757 -8129 157 -7635 -11090 -8320 -4515 -8171 -14805 -14404 -5967 -9171 -10775 4866
5417D866L411q326k680M605r581j1067J771o95R724j353J662l503r378L004J0309
$$ 4866 8277 -49 -2729 1876 -7705 -18772 -17001 -17696 -7972 -9325 -7663 -11166 -20544 -17540 -7231
5402g231n55J31J17m084J616o471R01Q142L108j662j336J204j2528n433J760m203
$$ -7231 -7786 -7655 -7538 -11622 -10006 -16477 -15576 -7434 -4326 -5988 -7324 -6120 -18648 -24081 -22321 -26524
5386b6524M609J3425K462R05k213j1607q94M123l644j1933n24J3013K686M029
$$ -26524 -21915 -8490 -6028 -5123 -7336 -18943 -19837 -15714 -19358 -31291 -31815 -18802 -16116 -12087
5372a2087J1165m596J674j2512k57L922j684n813n93r339N775J9293K591n991
$$ -12087 -922 -5518 -3844 -16356 -16613 -12691 -14375 -20188 -20781 -30120 -24345 -5052 -2461 -8452
5358h452n481M281k569n168R0J2062o245o89J771k642N932R25L054J4506p459
$$ -8452 -13933 -9652 -12221 -17389 -17299 -5237 -11482 -12171 -10400 -13042 -7110 -6185 -3131 11375 3916
5343C916m024K924o105J0618P293O523l430j4039p493l095j833J097k1694l652
$$ 3916 -108 2816 -3289 7329 14622 21145 17715 3676 -3817 -6912 -8745 -7648 -29342 -32994
5329c2994J8668J7863K237j3916n971J544L011Q750P813j419n371n660l410M056
$$ -32994 -14326 3537 5774 -8142 -14113 -12569 -9558 -808 7005 5586 215 -5445 -8855 -4799
5315d799J0467j6166j3139J337o60R346m686K347K2910q16o695J820q564n297
$$ -4799 5668 -10498 -23637 -22300 -22960 -13614 -18300 -15953 6957 6141 -554 1266 -7298 -12595
5301a2595m105l269M630J1239J808O482j2793j6123M982M964N794O448k178j2354
$$ -12595 -16700 -19969 -15339 -4100 -2292 4190 -8603 -24726 -19744 -14780 -8986 -2538 -4716 -17070
5287a7070m591L220J4556p843j1786J4027Q125o73j83p619o724j0890K072P363
$$ -17070 -21661 -18441 -3885 -11728 -23514 -9487 -1362 -2035 -2218 -9837 -16561 -27451 -25379 -18016
5273a8016P22J2011P959j0395K722j327j6588N696N873j3712n456L653O076J3815
$$ -18016 -17294 -5283 2676 -7719 -4997 -6324 -22912 -17216 -11343 -25055 -30511 -26858 -20782 -6967
5259f967l809k510l732J0117J0567N231N867o200j6708n454P376P436J749q008
$$ -6967 -10776 -13286 -17018 -6901 3666 8897 14764 8564 -8144 -13598 -6222 1214 2963 -5045
5245e045Q91j4701R73J1461O31j2634r544K150K990L311Q862O524p82N808j0084
$$ -5045 -4154 -18855 -17882 -6421 -5790 -18424 -27968 -25818 -22828 -19517 -10655 -4131 -4913 895 -9189
5230i189k700K511p141n753j967L899K338K944K474J564J2483l92k526J18m71
$$ -9189 -11889 -9378 -16519 -22272 -24239 -20340 -18002 -15058 -12584 -11020 1463 1071 -1455 -1337 -1808
5215a808n797k635O746R42l833p932j059R663J5883P292j9420o861R136j6506
$$ -1808 -7605 -10240 -3494 -2552 -6385 -14317 -15376 -5713 10170 17462 -1958 -8819 317 -16189
5201a6189j3712o133P264J7958R559J192j4138Q831M917M464N511J966j287p903
$$ -16189 -29901 -36034 -28770 -10812 -1253 -61 -14199 -5368 -451 4013 9524 11490 10203 2300
5187B300j604j5242j7718Q391M757L698J1935N091N303N913K88n152n588n82j0052
$$ 2300 696 -14546 -32264 -23873 -19116 -15418 -3483 1608 6911 12824 13112 7960 2372 1790 -8262
5172h262o248Q145P611M979n916O98j007l727l781J1662J1740q119k8609q586
$$ -8262 -14510 -6365 1246 6225 309 1007 0 -3727 -7508 4154 15894 7775 -20834 -29420
5158b9420J3772J186P368q340q522J4201J4270k448j8350o189Q104n341j77K231
$$ -29420 -15648 -14462 -7094 -15434 -23956 -9755 4515 2067 -16283 -22472 -14368 -19709 -19886 -17655
5144a7655p6N072o293p062J1391K661K446K444n211J41K482J5943P924k891j7803
$$ -17655 -17731 -12659 -18952 -26014 -14623 -11962 -9516 -7072 -12283 -12142 -9660 6283 14207 11316 -6487
5129f487j1339J184J1121M272k325J454N123J568K388j1265N492m417j0224O105
$$ -6487 -17826 -16642 -5521 -1249 -3574 -2120 3003 4571 6959 -4306 1186 -3231 -13455 -7350
5115g350J6037O231j5304k626K795m601J0806q515p601Q143Q566L550O291o80
$$ -7350 8687 14918 -386 -3012 -217 -4818 5988 -2527 -10128 -1985 6581 10131 16422 15742
5101A5742j7324M46N713n053p833n489N407J6269L084j4199o214M804J3812J17
$$ 15742 -1582 -1136 4577 -476 -8309 -13798 -8391 7878 10962 -3237 -9451 -4647 9165 9282
5087I282j8244K371l57J235p943o01o389O840J6842r993j1495M616O10k021k216
$$ 9282 -8962 -6591 -6948 -5713 -13656 -14257 -20646 -13806 3036 -6957 -18452 -13836 -13226 -15247 -17463
5072a7463o405M545l367p669L365J6099J4972j0390k0203J6151l774j1751M008
$$ -17463 -23868 -19323 -22690 -30359 -26994 -10895 4077 -6313 -26516 -10365 -14139 -25890 -21882
5059b1882J311P08J0708J1761j99k3333j2240N285k2p453N802K419j82J0817R936
$$ -21882 -20571 -19863 -9155 2606 2407 -20926 -33166 -27881 -27903 -35356 -29554 -27135 -27317 -16500 -6564
5044f564m022o90J1006P968q946m700M76J305K901K739l614j598q447J526j515
$$ -6564 -10586 -11276 -270 7698 -1248 -5948 -5472 -4167 -1266 1473 -2141 -3739 -12186 -10660 -12175
5029a2175K732K038J1962M354j1640r862l861j2107j2225J306K0386J326j0269
$$ -12175 -9443 -7405 4557 8911 -2729 -12591 -16452 -28559 -40784 -39478 -19092 -17766 -28035
5016b8035n087O658Q533J644q301K898Q741N675O813Q332l808l242q374N40k444
$$ -28035 -33122 -26464 -17931 -16287 -24588 -21690 -12949 -7274 -461 7871 4063 821 -7553 -7013 -9457
5001i457P069j4240j0776l37K2561N802j778L536k420q13q893q84L760N10j381
$$ -9457 -2388 -16628 -27404 -27741 -5180 622 -1156 2380 -40 -853 -9746 -10630 -6870 -6360 -7741
4986g741Q523J2243j3963m23P684L924q608j1711j507L115J0512m213J7538j187
$$ -7741 782 13025 -938 -1361 6323 10247 1639 -10072 -11579 -8464 2048 -2165 15373 14186
4972A4186q63l36j8610o733o490L937J6182J070l770M52K844N528m83j0256M299
$$ 14186 13323 12987 -5623 -12356 -18846 -14909 1273 2343 -1427 -975 1869 7397 6914 -3342 957
4957I57k725j5023J1493N657o341P29j3890P231m40k008J781L596m687q95M8Q220
$$ 957 -1768 -16791 -5298 359 -5982 -5253 -19143 -11912 -12352 -14360 -12579 -8983 -13670 -14565 -14517 -6297
4941f297J3148k227P176q353q547r370p250R304L515n228n078O30J2814R837j790
$$ -6297 6851 4624 11800 3447 -5100 -14470 -21720 -12416 -8901 -14129 -19207 -18577 -5763 4074 2284
4926B284l926N15j2839j1000k970l080J913l462j043J1603J7693L877k494j529
$$ 2284 -1642 -1127 -13966 -24966 -27936 -31016 -29103 -32565 -33608 -22005 -4312 -435 -2929 -4458
4912d458J180J523o361m578n330l634o14Q315o98r964Q522J7932P479l149j4642
$$ -4458 -3278 -1755 -8116 -12694 -18024 -21658 -22272 -13957 -14655 -24619 -16097 1835 9314 6165 -8477
4897h477j4196k412J2242R858n144j869r120r062J2934J6693J1698m880j7778
$$ -8477 -22673 -25085 -12843 -2985 -8129 -9998 -19118 -28180 -15246 1447 13145 8265 -9513
4884i513j3194M257L989K739R807J0448J828p509q707o741N249K2274J3872n149
$$ -9513 -22707 -18450 -14461 -11722 -1915 8533 10361 2852 -5855 -12596 -7347 14927 28799 23650
4870B3650j8188k4250K993P384k439M498j3605K854M475o115M619J2820J0497
$$ 23650 5462 -18788 -15795 -8411 -10850 -6352 -19957 -17103 -12628 -18743 -14124 -1304 9193
4857I193R225m815j0145l488j0478j4049l330R062N813J144P693k711J159P388
$$ 9193 18418 13603 3458 -30 -10508 -24557 -27887 -18825 -13012 -11868 -4175 -6886 -5727 1661
4843A661j1523j4167O722J8043P739m792o781n603O378N349j2748j1671J4089
$$ 1661 -9862 -24029 -17307 736 8475 3683 -3098 -8701 -2323 3026 -9722 -21393 -7304
4830g304N07k136k665n143p065P200O441n19n401M885J1882k633j1140j344m12
$$ -7304 -6797 -8933 -11598 -16741 -23806 -16606 -10165 -10684 -16085 -11200 682 -1951 -13091 -14435 -14847
4815a4847j6144k759J5826L230M672j8306p536J2015O408Q023j1202m921J1344
$$ -14847 -30991 -33750 -17924 -14694 -10022 -28328 -35864 -23849 -17441 -9418 -20620 -25541 -14197
4802a4197j121l180J2066P548j9307j0001n170J030N588r40J590N871k259j3065
$$ -14197 -15318 -18498 -6432 1116 -18191 -28192 -33362 -32332 -26744 -27684 -26094 -20223 -22482 -35547
4788c5547K034K1123J0212J0962o135j3881K882n493p011n017n644p841J305O215
$$ -35547 -33513 -12390 -2178 8784 2649 -11232 -8350 -13843 -20854 -25871 -31515 -39356 -38051 -31836
4774c1836J592J4759O547K393n204q716J288j2299j0858q372J6428P797M691J0111
$$ -31836 -30244 -15485 -8938 -6545 -11749 -20465 -19177 -31476 -42334 -50706 -34278 -26481 -21790 -11679
4760a1679Q117l985j0057M86J4258K1579o914p235L827j0463j871k517k95l830
$$ -11679 -3562 -7547 -17604 -17118 -2860 18719 11805 4570 8397 -2066 -3937 -6454 -6749 -10579
4746a0579k1917o229J4240K5523K452j7729j6277N460l547L555M119J5572J8612
$$ -10579 -32496 -38725 -24485 1038 3490 -14239 -30516 -25056 -28603 -25048 -20929 -5357 13255
4733A3255J1353o510j1737k098j5800P184o93P62L735N321J003k3688K047L0872
$$ 13255 24608 18098 6361 4263 -11537 -4353 -5046 -4284 -549 4772 5775 -17913 -15866 15006
4719A5006N730r866q984k1350l038O964J104K878J4395M241m01q331L115N545
$$ 15006 20736 10870 1886 -19464 -22502 -15538 -14434 -11556 2839 7080 6679 -1652 1463 7008
4705G008p112r422K427k54J4259L195R540p035j0862k169j0298m237l394n898
$$ 7008 -104 -9526 -7099 -7353 6906 10101 19641 12606 1744 -425 -10723 -14960 -18354 -24252
4691b4252R160J3457k483M466R326O350l943j6918O026l237r327n56n764N430
$$ -24252 -15092 -1635 -4118 348 9674 16024 12081 -4837 1189 -2048 -11375 -11931 -17695 -12265
4677a2265L236j490j2587j4811o454J0951P126P468K1490m586j4322J0393L758
$$ -12265 -9029 -10519 -23106 -37917 -44371 -33420 -26294 -18826 2664 -1922 -16244 -5851 -2093
4664b093r660r463j2932m678P020K6806j674J630R476J4467J6341o977j8715o239
$$ -2093 -11753 -21216 -34148 -38826 -31806 -5000 -6674 -5044 4432 18899 35240 28263 9548 3309
4650C309k329M318N213p434J10L191o11o742k541k762j1347m658J0348P966l273
$$ 3309 980 5298 10511 3077 3187 6378 5767 -975 -3516 -6278 -17625 -22283 -11935 -3969 -7242
4635g242p081N066r043q859Q657k48J958p092p037O962J6407Q522n107o144n639
$$ -7242 -14323 -9257 -18300 -27159 -18502 -18750 -16792 -23884 -30921 -23959 -7552 970 -4137 -10281 -15920
4620a5920L264q406m439n350n59J3496J1404q489M790J2250N738k444N79k312
$$ -15920 -12656 -21062 -25501 -30851 -31410 -17914 -6510 -14999 -10209 2041 7779 5335 5914 3602
4606C602n145m65q05l043n705l941M446J0507l566R81J1077k68n34n663L515q68
$$ 3602 -1543 -2008 -2813 -5856 -11561 -15502 -11056 -549 -4115 -3134 7943 7675 7141 1478 4993 4125
4590D125p502N604M187k94r940K599j81o75Q006K695K595o260n920k2178j5326
$$ 4125 -3377 2227 6414 6120 -3820 -1221 -1402 -2077 5929 8624 11219 4959 -961 -23139 -38465
4575c8465R521J2186J0386J1510k565L578l687j3481p869N576q341J3089O041
$$ -38465 -28944 -16758 -6372 5138 2573 6151 2464 -11017 -18886 -13310 -21651 -8562 -2521
4562b521q419o229J305K796k765j2889N725O832k029q33K252R857k361O920O224
$$ -2521 -10940 -17169 -15864 -13068 -15833 -28722 -22997 -16165 -18194 -19027 -16775 -6918 -9279 -2359 3865
4547C865n017j1154K845L055J911m467J3232M044r402J384m378l551r86J0099
$$ 3865 -1152 -12306 -9461 -6406 -4495 -8962 4270 8314 -1088 296 -4082 -7633 -8619 1480
4533A480K124N506l271K308K409l123r589q007O552o893o723P601J9740l136j6690
$$ 1480 3604 9110 5839 8147 10556 7433 -2156 -10163 -3611 -10504 -17227 -9626 10114 6978 -9712
4518i712P822q987L343J4119n91j1062J429J0124m625m723N267M318j2242j5362
$$ -9712 -1890 -10877 -7534 6585 5994 -5068 -3639 6485 1860 -2863 2404 6722 -5520 -20882
4504b0882m79P533k605M865r032j002K534J441p046N424Q716J214O397k982o45
$$ -20882 -21361 -13828 -16433 -11568 -20600 -21602 -19068 -17627 -24673 -19249 -10533 -9319 -2922 -5904 -6549
4489f549j53P487Q386k764j419L769P249k71j6540l300l538p714j2550O369J0570
$$ -6549 -6702 785 9171 6407 4988 8757 16006 15735 -805 -4105 -7643 -15357 -27907 -21538 -10968
4474a0968L996O912q62o726j0357k524j918R012J3906J0735k612J219j6826J960
$$ -10968 -6972 -60 -922 -7648 -18005 -20529 -22447 -13435 471 11206 8594 9813 -7013 -5053
4460e053n855o238O04P718J1002l285J0394R431j4653j3272o109R16N850L730
$$ -5053 -10908 -17146 -16542 -8824 2178 -1107 9287 18718 4065 -9207 -15316 -14400 -8550 -4820
4446d820q405K215J0664L407J366n245j159q945j0869K426l012J4607J3592P597
$$ -4820 -13225 -11010 -346 3061 4427 -818 -1977 -10922 -21791 -19365 -22377 -7770 5822 13419
4432A3419j1230k956O407J407j2673j1911m563K2402J4956n719J162j2189k890
$$ 13419 2189 -767 5640 7047 -5626 -17537 -22100 302 15258 9539 10701 -1488 -4378
4419d378K04j0374L716L959M623N092j1474m213o492r547O471J1035K940k77J8602
$$ -4378 -4174 -14548 -10832 -6873 -2250 2842 -8632 -12845 -19337 -28884 -22413 -11378 -8438 -8715 9887
4404I887J527k567q213l397k61L966M432n423n076k854J3065N577j0521q351o464
$$ 9887 11414 8847 634 -2763 -3024 942 5374 -49 -5125 -7979 5086 10663 142 -8209 -14673
4389a4673j964J7120l884j5826J566M996L253M417k665J0760L821K206o994j748
$$ -14673 -16637 483 -3401 -19227 -17661 -12665 -9412 -4995 -7660 3100 6921 9127 2133 385
4375C85q242q075J6735Q133j936O331q581m441K474J307K78r386j8771j58J1387
$$ 385 -7857 -15932 803 8936 7000 13331 4750 309 2783 4090 4368 -5018 -23789 -23947 -12560
4360a2560q135l420L473J9996J201l490L16p385K231K459k317r255k535l050J423
$$ -12560 -20695 -24115 -20642 -646 555 -2935 -2619 -10004 -7773 -5314 -7631 -16886 -19421 -22471 -21048
4345b1048R753P036r918n066m750k416R215M546J249J0700L490k006N686Q174
$$ -21048 -11295 -4259 -14177 -19243 -23993 -26409 -17194 -12648 -11399 -699 2791 785 6471 14645
4331A4645q082l620j1939p337n0J3114Q761r05L835j4292j7648j511N265K0165
$$ 14645 6563 2943 -8996 -16333 -16383 -3269 5492 4587 8422 -5870 -23518 -25029 -19764 401
4317D01l877J441j0790q464N14J332O141Q150P696J743O340k085j0169N571j0581
$$ 401 -3476 -2035 -12825 -21289 -20775 -19443 -13302 -5152 2544 4287 10627 8542 -1627 3944 -6637
4302f637l420n5J999n147M14m347L6J0973j391r540k96O902L53P01k95o285p05
$$ -6637 -10057 -10112 -8113 -13260 -12846 -17193 -17157 -6184 -7575 -17115 -17411 -10509 -10156 -9455 -9750 -16035 -16740
4285a6740K929n788J986J6943K071r829j559M795n197q106j561O05R026K262M715
$$ -16740 -13811 -19599 -17613 -670 1401 -8428 -9987 -5192 -10389 -18495 -20056 -19451 -10425 -8163 -3448
$$ [...]
##END NTUPLES=NMR SPECTRUM
##END=
