##TITLE=Analysis number 308220
Compound Code cc 44401
Book Reference 440/14
Project Code adrs
Chemist Name craigr
##JCAMPDX= 6.0         $$ Bruker NMR JCAMP-DX V2.0
##DATA TYPE= NMR SPECTRUM
##DATA CLASS= NTUPLES
##ORIGIN= Bruker BioSpin GmbH
##OWNER= NMR
$$ XWIN-NMR		Version 3.5
$$ Mon May 23 08:51:27 2005 GMT Daylight Time (UT+1h)  MAYBRIDGE\NMR@NMR_250MHZ
##.OBSERVE FREQUENCY= 250.131544655141
##.OBSERVE NUCLEUS= ^1H
##.ACQUISITION MODE= SIMULTANEOUS (DQD)
##.ACQUISITION SCHEME= undefined
##.AVERAGES= 16
##.DIGITISER RES= 18
##SPECTROMETER/DATA SYSTEM= dpx250
##.PULSE SEQUENCE= zg30
##.SOLVENT NAME= DMSO
##.SHIFT REFERENCE= (INTERNAL, DMSO, 0, 16.522)
##AUDIT TRAIL= $$ (NUMBER, WHEN, WHO, WHERE, WHAT)
$$ ##TITLE= Audit trail, XWIN-NMR		Version 3.5
$$ ##JCAMPDX= 5.01
$$ ##ORIGIN= Bruker BioSpin GmbH
$$ ##OWNER= NMR
$$ C:\u/data/dgb/nmr/ADRS/3270/pdata/1/auditp.txt
$$ ##AUDIT TRAIL=  $$ (NUMBER, WHEN, WHO, WHERE, WHAT)
(   1,<2005-05-23 08:51:07.45 +100>,<MAYBRIDGE\NMR>,<NMR_250MHZ>,
      <created by zg, POWCHK disabled, PULCHK disabled
       configuration hash MD5:
       62 19 C7 07 E1 42 D1 B7 37 6C 3D D0 77 39 F9 E6
       data hash MD5: 64K
       C8 5E CE 9F 6E B5 E5 E7 AB 8F C2 62 3D 13 23 72>)
(   2,<2005-05-23 08:51:19.02 +100>,<MAYBRIDGE\NMR>,<NMR_250MHZ>,
      <Start of raw data processing
       ef LB = 0.3 FT_mod = 6 PKNL = 1 SI = 32K 
       data hash MD5: 32K
       80 F6 E0 EB 8A BF 2A 6D EF C7 6D A3 8C CA 5B 20>)
(   3,<2005-05-23 08:51:20.81 +100>,<MAYBRIDGE\NMR>,<NMR_250MHZ>,
      <apk 
       data hash MD5: 32K
       C8 6E FF D4 D6 25 E8 20 2F 63 6D 0D 74 16 F5 5C>)
(   4,<2005-05-23 08:51:21.49 +100>,<MAYBRIDGE\NMR>,<NMR_250MHZ>,
      <abs ABSG = 5 
       data hash MD5: 32K
       E5 AC 30 E0 29 1B 30 DB 40 94 A7 C4 1C 20 37 1D>)
$$ ##END=
$$ 
$$ hash MD5
$$ 5E 56 B4 B8 26 65 7C EA 4D 0D 1E 00 FC E0 60 83
##$RELAX= 
##$RELAX= 
##$RELAX= 
##$RELAX= 
##$RELAX= 
##$RELAX= 
##$RELAX= 
$$ Bruker specific parameters
$$ --------------------------
##$DU= <C:\u>
##$EXPNO= 3270
##$NAME= <ADRS>
##$PROCNO= 1
##$TYPE= <nmr>
##$USER= <dgb>
##$AMP= (0..31)
100 100 100 100 100 100 100 100 100 100 100 100 100 100 100 100 100 100 
100 100 100 100 100 100 100 100 100 100 100 100 100 100 
##$AQSEQ= 0
##$AQ_mod= 3
##$AUNM= <au_zg>
##$AUTOPOS= <3 >
##$BF1= 250.13
##$BF2= 250.13
##$BF3= 250.13
##$BF4= 250.13
##$BF5= 500.13
##$BF6= 500.13
##$BF7= 500.13
##$BF8= 500.13
##$BYTORDA= 1
##$CFDGTYP= 0
##$CFRGTYP= 5
##$CHEMSTR= <none>
##$CNST= (0..31)
1 1 145 1 1 1 1 1 1 1 1 1 1 1 1 1 1 1 1 1 1 1 1 1 1 1 1 1 1 1 1 1 
##$CPDPRG= <>
##$CPDPRG1= <>
##$CPDPRG2= <>
##$CPDPRG3= <>
##$CPDPRG4= <mlev>
##$CPDPRG5= <mlev>
##$CPDPRG6= <mlev>
##$CPDPRG7= <mlev>
##$CPDPRG8= <mlev>
##$CPDPRGB= <>
##$CPDPRGT= <>
##$D= (0..31)
0 1 0 0 0 0 0 0 0 0.06 0 0 0 0 0 0 0.0002 0 0 0 0 0 0 0 0 0 0 0 0 0 0 
0 
##$DATE= 1116834666
##$DBL= (0..7)
120 120 120 120 120 120 120 120 
##$DBP= (0..7)
150 150 150 150 150 150 150 150 
##$DBP07= 0
##$DBPNAM0= <>
##$DBPNAM1= <>
$$ [...]
##$SUBNAM7= <"">
##$SUBNAM8= <"">
##$SUBNAM9= <"">
##$SW= 20.6930455092707
##$SWIBOX= (0..15)
0 0 3 0 0 0 0 0 0 0 0 0 0 0 0 0 
##$SW_h= 5175.983436853
##$TD= 65536
##$TD0= 1
##$TE= 294.16
##$TE2= 300
##$TE3= 300
##$TEG= 300
##$TL= (0..7)
0 120 120 120 120 120 120 120 
##$TP= (0..7)
150 150 150 150 150 150 150 150 
##$TP07= 0
##$TPNAME0= <>
##$TPNAME1= <>
##$TPNAME2= <>
##$TPNAME3= <>
##$TPNAME4= <>
##$TPNAME5= <>
##$TPNAME6= <>
##$TPNAME7= <>
##$TPOAL= (0..7)
0.5 0.5 0.5 0.5 0.5 0.5 0.5 0.5 
##$TPOFFS= (0..7)
0 0 0 0 0 0 0 0 
##$TUNHIN= 0
##$TUNHOUT= 0
##$TUNXOUT= 0
##$USERA1= <user>
##$USERA2= <user>
##$USERA3= <user>
##$USERA4= <user>
##$USERA5= <user>
##$V9= 5
##$VALIST= <valist>
##$VCLIST= <CCCCCCCCCCCCCCC>
##$VD= 0
##$VDLIST= <DDDDDDDDDDDDDDD>
##$VPLIST= <PPPPPPPPPPPPPPP>
##$VTLIST= <TTTTTTTTTTTTTTT>
##$WBST= 1024
##$WBSW= 4
##$XGAIN= (0..3)
0 0 0 0 
##$XL= 0
##$YL= 0
##$YMAX_a= 315904
##$YMIN_a= -308975
##$ZGOPTNS= <>
##$ZL1= 120
##$ZL2= 120
##$ZL3= 120
##$ZL4= 120
##$ABSF1= 16.522
##$ABSF2= -4.171173
##$ABSG= 5
##$ABSL= 3
##$ALPHA= 0
##$AQORDER= 0
##$ASSFAC= 0
##$ASSFACI= 0
##$ASSFACX= 0
##$ASSWID= 0
##$AUNMP= <proc_1d>
##$AZFE= 0.1
##$AZFW= 0.1
##$BCFW= 0
##$BC_mod= 0
##$BYTORDP= 0
##$COROFFS= 0
##$CY= 12.5
##$DATMOD= 1
##$DC= 0
##$DFILT= <>
##$DTYPP= 0
##$F1P= 14.0000005364418
##$F2P= -0.99999901652339
##$FCOR= 0.5
##$FTSIZE= 32768
##$FT_mod= 6
##$GAMMA= 0
##$GB= 0
##$INTBC= 1
##$INTSCL= 1
##$ISEN= 128
##$LB= 0.3
##$LEV0= 0
##$LPBIN= 0
##$MAXI= 10000
##$MC2= 0
##$MEAN= 0
##$ME_mod= 0
##$MI= 0
##$NCOEF= 0
##$NC_proc= -3
##$NLEV= 6
##$NOISF1= 0
##$NOISF2= 0
##$NSP= 0
##$NTH_PI= 0
##$NZP= 0
##$OFFSET= 16.522
##$PC= 1
##$PHC0= -84.15248
##$PHC1= 6.904758
##$PH_mod= 1
##$PKNL= yes
##$PPARMOD= 0
##$PSCAL= 4
##$PSIGN= 0
##$REVERSE= no
##$SF= 250.13
##$SI= 32768
##$SIGF1= 0
##$SIGF2= 0
##$SINO= 400
##$SIOLD= 32768
##$SREGLST= <1H.DMSO>
##$SSB= 0
##$STSI= 32768
##$STSR= 0
##$SW_p= 5175.98343685301
##$SYMM= 0
##$S_DEV= 0
##$TDeff= 65536
##$TDoff= 0
##$TI= <Analysis number 999999
Compound Code 99
Book Reference 9
Project Code 9>
##$TILT= no
##$TM1= 0
##$TM2= 0
##$TOPLEV= 0
##$USERP1= <user>
##$USERP2= <user>
##$USERP3= <user>
##$USERP4= <user>
##$USERP5= <user>
##$WDW= 1
##$XDIM= 32768
##$YMAX_p= 534846238
##$YMIN_p= -245435
$$ End of Bruker specific parameters
$$ ---------------------------------
##NTUPLES= NMR SPECTRUM
##VAR_NAME=  FREQUENCY,     SPECTRUM/REAL,   SPECTRUM/IMAG
##SYMBOL=    X,             R,               I
##VAR_TYPE=  INDEPENDENT,   DEPENDENT,       DEPENDENT
##VAR_FORM=  AFFN,          ASDF,            ASDF
##VAR_DIM=   32768,         32768,           32768
##UNITS=     HZ,            ARBITRARY UNITS, ARBITRARY UNITS
##FACTOR=    0.157963299565203, 1,           1
##FIRST=     4132.6476996994, 0,             0
##LAST=      -1043.33573715361, 0,           0
##MIN=       -1043.33573715361, -245435,     0
##MAX=       4132.6476996994, 534846238,     0
$$ Real data points
##PAGE= N=1
##DATA TABLE= (X++(R..R)), XYDATA
$$ [...]
19434B05944K1640r279j1391M3803J9523l702J2241n320J1288L494J810m635n293
$$ 205944 227584 218305 206914 250717 270240 266538 278779 273459 284747 288241 290051 285416 280123
19421B80123k4946n0448j7278j1343j3822l7603j6785k6215N856P317K7414p99
$$ 280123 255177 204729 187451 176108 162286 124683 107898 81683 87539 94856 122270 121471
19409A21471q168o859J0569K1683n159O534r063k090J8626j3549N067P241j498
$$ 121471 113303 106444 117013 138696 133537 140071 131008 128918 147544 133995 139062 146303 144805
19396A44805K1359K777j9195q199K0876j913J7483K4054J4261k348J3723L0875
$$ 144805 166164 168941 149746 141547 162423 160510 177993 202047 216308 213960 227683 258558
19384B58558j1061p662K120J4072L7175M1024L3118K6678J0266L812l0249k3063
$$ 258558 247497 239835 241955 256027 293202 334226 367344 394022 404288 408100 377851 354788
19372C54788L5615K8446R390L0206K2840M2245o150m5429m9936n3269m3183j0796
$$ 354788 390403 418849 428239 458445 481285 523530 517380 471951 422015 368746 325563 314767
19360C14767q20K886j6007l4230O693J6534O768k973j4875k2625k9763K5386K7785
$$ 314767 313947 316833 300826 266596 273289 289823 296591 293618 278743 256118 226355 251741 279526
19347B79526j6885m294J3640K8115m541M9691M1128J4165j3781j0181K8791N1977
$$ 279526 262641 258347 271987 300102 295561 345252 386380 400545 386764 376583 405374 457351
19335D57351R410J8534K2852L6246O3467M2069L1874M4102K9923M3734L3041N9774
$$ 457351 466761 485295 508147 544393 607860 649929 681803 725905 755828 799562 832603 892377
19323H92377J26333J17930Q2507P1768O7447R5865J11985J71837K02202K00688
$$ 892377 1018710 1136640 1219147 1290915 1358362 1454227 1566212 1738049 1940251 2140939
19313B140939K11628K43433L71478M91792P31550J023484J467808K211296L415611
$$ 2140939 2352567 2596000 2967478 3459270 4190820 5214304 6682112 8893408 12309019
19304A2309019M957372N519702L835275Q44476j287114l65497K699440N774118
$$ 12309019 17266391 22786093 26621368 27465844 26178730 25813233 28512673 34286791
19296C4286791O958001N310580L17299m798188p800017p208854m113606p78674
$$ 34286791 41244792 46555372 46872671 42074483 34274466 27065612 22952006 22173332
19288B2173332K247589L366631J162508k805392n900505n607486l965644k685891
$$ 22173332 24420921 27787552 28950060 26144668 20244163 14636677 10671033 7985142
19280G985142j780571j178183p93955n48075l47138k43193j93975j55589j16682
$$ 7985142 6204571 5026388 4232433 3684358 3337220 3094027 2900052 2744463 2627781
19271B627781p1902m455K5435M690k8841o166L4695J09861J56176J35140J28439
$$ 2627781 2555879 2551424 2576859 2581549 2552708 2546542 2581237 2691098 2847274 2982414 3110853
19260C110853J81017K71826L81703O00968Q79801J286068J852722K871677M533487
$$ 3110853 3291870 3563696 3945399 4546367 5426168 6712236 8564958 11436635 15970122
19251A5970122O385048O476380M001352Q72409K9331K639030M736069L995670
$$ 15970122 22355170 28831550 32832902 33705311 33734642 36373672 41109741 45105411
19243D5105411J728723p31149k486299m555562n836780l990136n40536J938675
$$ 45105411 46834134 46102985 43616686 39061124 33224344 29234208 28693672 30632347
19235C0632347J371897j837825n389296o357615m989317l469108k387843j699442
$$ 30632347 32004244 30166419 24777123 18419508 13430191 9961083 7573240 5873798
19227E873798j242496q64526n87503m35810l11602k17225k05919j96574j58196
$$ 5873798 4631302 3766776 3179273 2743463 2431861 2214636 2008717 1812143 1653947
19218A653947j13514r6902p5871n6945q3312j01769j07176r1558m5809m2748m1859
$$ 1653947 1540433 1443531 1367660 1310715 1227403 1125634 1018458 926900 881091 838343 796484
19207G96484o4899q2052o4667k3157k2139l1316p2387m3239j5475K571l735k8473
$$ 796484 731585 649533 584866 561709 539570 508254 435867 392628 377153 379724 375989 347516
19195C47516p886j445l6583j0088Q825j0332j1267l3694o181J0368O140l2158
$$ 347516 339630 338185 301602 291514 300339 290007 278740 245046 238865 249233 255373 223215
19183B23215m1123q364L7590J4286O075n034k6396j5889J8921l669n502k2972
$$ 223215 182092 173728 211318 225604 231679 226645 200249 184360 203281 199612 194110 171138
19171A71138k2344M217N555N7723Q1402N8374N8644J6567j3216l8092r0041r1558
$$ 171138 148794 153011 158566 216289 297691 356065 414709 431276 418060 379968 289927 198369
19159A98369l7407J6042p859j7700l6175k3834j2022r97o9J5839R154o497K2233
$$ 198369 160962 177004 169145 151445 115270 91436 79414 78417 78348 94187 103341 96844 119077
19146A19077o723K785j0085j1419P291j1065j7481K7238J1525j4404p845j863
$$ 119077 112354 115139 105054 93635 100926 89861 72380 99618 111143 96739 88894 87031
19134H7031l395Q198j4361j0210K2571K7722N300j52J1196O569K3008m0661l5286
$$ 87031 83636 91834 77473 67263 89834 117556 122856 122704 133900 140469 163477 122816 87530
19121H7530K4488J716j996J3349q189j8938K6884J5197j9950l2979l2345k7071
$$ 87530 112018 113734 111738 125087 116898 97960 124844 140041 120091 87112 54767 27696
19109B7696j9071N957K452R244o160K9208J2318J545k130p263J027m823J9065
$$ 27696 8625 14582 17034 26278 20118 49326 61644 63189 61059 53796 54823 50000 69065
19096F9065j0377J4766P123p42j7273L806O304l920J3372j14k460j3564j8017
$$ 69065 58688 73454 80577 79835 62562 66368 72672 68752 82124 82010 79550 65986 47969
19083D7969p547j3891O610Q562j8402J6907J5876n621r345P926m862M388K528
$$ 47969 40422 26531 33141 41703 23301 40208 56084 50463 41118 49044 44182 48570 51098
19070E1098J8647K0299k834m0938K0612J8862K282j1701l963k743j9387K6580
$$ 51098 69745 90044 87210 46272 66884 85746 88028 76327 72364 69621 50234 76814
19058G6814J3784p816N906j234J0722L810K6984o823j4439k3982q76N355K0555
$$ 76814 90598 82782 88688 87454 98176 101986 128970 122147 107708 83726 82850 88205 108760
19045A08760K6906j7475j7786J4333j3447M503J8608J0885J6251k1946l605r926
$$ 108760 135666 118191 100405 114738 101291 105794 124402 135287 151538 129592 125987 116061
19033A16061j2504J248L7107K4757m1808l2487j6410L2780N303n443j3724o050
$$ 116061 103557 104805 141912 166669 124861 92374 75964 108744 114047 108604 94880 88830
19021H8830J936l262K3484L980m0619j1517K1319m891K444L7635K9116o940n3972
$$ 88830 90766 87504 110988 114968 74349 62832 84151 79260 81704 119339 148455 141515 87543
19008H7543K104K5911P709j8024J6786J8831l323J2445K1308K9535J4977K2268
$$ 87543 89647 115558 123267 105243 122029 140860 137537 149982 171290 200825 215802 238070
18996B38070M0639O9530M613j6330j4690j6781P544q119k6533n633Q454P829o881
$$ 238070 278709 348239 352852 336522 321832 305051 312595 304476 277943 272310 280764 288593 281712
18983B81712o260j7227j9092K1467J0445j6008k6272O623j3419n252l0141J1983
$$ 281712 275452 258225 239133 260600 271045 255037 228765 235388 221969 216717 186576 198559
18971A98559L7792J1601l0837K012q01j1686L563L5453K6899M2882P761q078J1952
$$ 198559 236351 247952 217115 219127 218326 206640 210203 245656 272555 315437 323198 315120 327072
18958C27072J5564q911Q109L2606J4673L4838L1578M3630M4018O5030N0875K3673
$$ 327072 342636 333725 341834 374440 389113 423951 455529 499159 543177 608207 659082 682755
18946F82755L3267P9851P1820O7888J03598Q8581P4514R1205J11400J02058J28936
$$ 682755 716022 795873 867693 935581 1039179 1127760 1202274 1293479 1404879 1506937 1635873
18935A635873J81611J92909J94843K58722L96573N55318P49688J042350J607814
$$ 1635873 1817484 2010393 2205236 2463958 2860531 3415849 4165537 5207887 6815701
18926F815701K500266L968738N418983N281666L107531J68753j232889N59233
$$ 6815701 9315967 13284705 18703688 23985354 27092885 27261638 26028749 26587982
18918B6587982M041511O809154P032788L827928j594953n200195n685979k870572
$$ 26587982 30629493 37438647 44471435 48299363 46704410 41504215 35818236 32947664
18910C2947664o55373j392252l995541o245476n773316m098993k732762j812654
$$ 32947664 32292291 30900039 26904498 20659022 14885706 10786713 8053951 6241297
18902F241297j210618q00314n56780m27328l40228k30118j40033j41384q1085
$$ 6241297 5030679 4230365 3673585 3246257 2906029 2675911 2535878 2394494 2313409
18893B313409m7462k5454l8499l8457J7498K6868L3698J5111o325L3262Q5840
$$ 2313409 2265947 2240493 2201994 2163537 2181035 2207903 2241601 2256712 2250387 2283649 2369489
18882B369489J63544K40988L14033L72843M82094O13558Q59822J366188K152088
$$ 2369489 2533033 2774021 3088054 3460897 3942991 4556549 5416371 6782559 8934647
18873H934647L544369N665385P117421N597543J674307k623535l252133k10782
$$ 8934647 12479016 18144401 25261822 30859365 32533672 29910137 26658004 26447222
18865B6447222M197223R319948J1837309P876185o84418r063686r987025n514932
$$ 26447222 30644445 39964393 51801702 59677887 58993469 49929783 39942758 34427826
18857C4427826j088697O49119q95234m214412o718516o180346m464111l001845
$$ 34427826 33339129 33988248 33093014 28878602 22160086 15979740 11515629 8513784
18849H513784k012430j347314r03495o35361n04117m16206l38865k49255j94509
$$ 8513784 6501354 5154040 4250545 3615184 3111067 2694861 2355996 2106741 1912232
18840A912232j52766j18791r9455r2622j05237j37650j02226j03107j03845p2068
$$ 1912232 1759466 1640675 1541220 1448598 1343361 1205711 1103485 1000378 896533 824465
18830H24465j6190n3120p4766q5646k9916p0116l8854N842J0070M542N096Q176
$$ 824465 808275 755155 680389 594743 564827 494711 455857 461699 471769 476311 481407 489583
18818D89583K0166Q266j3326k5765k6815l1267P829L6340l8516l6495j9014j1772
$$ 489583 509749 518015 504689 478924 452109 420842 428671 465011 426495 390000 370986 359214
18806C59214j5979l5322p292m3747j1897q251r083j0835O350J1742r612J0733
$$ 359214 343235 307913 300621 256874 244977 236726 227643 216808 223158 234900 225288 236021
18794B36021J9586L4699M6732P4925P4203P590p8618q9184m9334l1185l802j0126
$$ 236021 255607 290306 337038 411963 486166 493756 415138 325954 276620 245435 241633 231507
18782B31507M80L41L8497M9230L4314K6393P11o664K377L741N050J2978J8660
$$ 231507 231987 232328 270825 320055 354369 380762 381473 374809 377186 380927 385977 398955 417615
18769D17615K4784l3420m231N382k3980m4400l8409j2784j285o310m1549l6366
$$ 417615 442399 408979 404748 410130 386150 341750 303341 290557 289272 282962 241413 205047
18757B05047j094L7058j0686l5304k2572j5615l984k0053O709L523j6258O980
$$ 205047 203953 241011 230325 195021 172449 156834 152850 132797 139506 143029 126771 133751
18745A33751n625j0108p200P955K5023J6558j0751o056k8316K888J4569L171j7101
$$ 133751 128126 118018 110818 118773 143796 160354 149603 143547 115231 118119 132688 135859 118758
18732A18758J1451j812q206K2348K1553j2721m913M6281N0870L6151J6M6375J9053
$$ 118758 130209 128397 120191 142539 164092 151371 146458 192739 243609 279760 279776 326151 345204
18719C45204k9342k4115J3369n352J6573L8169R203k8743l9497N870r525P583
$$ 345204 315862 291747 305116 299764 316337 354506 363709 334966 295469 301339 291814 299397
18707B99397K8294j4161k6276l937k0077l5223k8003j7266j4144j298m281j8708
$$ 299397 327691 313530 287254 283317 263240 228017 200014 182748 168604 167306 163025 144317
18695A44317j9614l4564M638o70o861j8659k2843J4547K2791L4566R847q867k724
$$ 144317 124703 90139 94777 94107 87246 68587 45744 60291 83082 117648 127495 118628 115904
18682A15904j1911k2118K0756Q866K1101j7579n0626l4644j156J1695K195j3602
$$ 115904 103993 81875 102631 111497 132598 115019 64393 29749 28593 40288 42483 28881
18670B8881K1828M0324N3158J1630q829M0544N2524j1578k0913l4957k5129j234
$$ 28881 50709 91033 144191 155821 146992 187536 240060 228482 207569 172612 147483 146249
18658A46249J0049L0115K4908l5413J2809m187N905m773L248l043j7332J7136
$$ 146249 156298 186413 211321 175908 188717 184530 190435 185662 188910 185867 168535 185671
18646A85671j1911l3467K824l486k9572k1811j3419K5259j91m435P237N669l5369
$$ 185671 173760 140293 143117 139631 110059 88248 74829 100088 99897 95462 102699 108368 72999
18633G2999n2270k6644J3080J3866Q547j1328j6162Q019K1511J9178n564k6863
$$ 72999 20729 -5915 7165 21031 29578 18250 2088 10107 31618 50796 45232 18369
18621A8369M094J1143R577K1533P106k1789r67J6925M4514L7790j1458K518K9644
$$ 18369 22463 33606 43183 64716 71822 50033 49066 65991 110505 148295 136837 139355 168999
18608A68999K1809k1515j3928K8656J8213j7100l3915k0581k9937m7083j9719
$$ 168999 190808 169293 155365 184021 202234 185134 151219 130638 100701 53618 33899
18597C3899j538L5497K397m1895p153J0130j6297r159j2513J6691J4711O091p625
$$ 33899 32361 67858 70255 28360 21207 31337 15040 5881 -6632 10059 24770 30861 23236
18584B3236j4986n171Q756J9110k068k5819K6620K065J9227K9482j7469l7393
$$ 23236 8250 3079 11835 30945 28877 3058 29678 31743 50970 80452 62983 25590
18572B5590p223K340n316r949J9097J7883J9963l0032p814O944O394P579k892
$$ 25590 18367 20707 15391 5442 24539 42422 62385 32353 24539 31483 37877 45456 42564
18559D2564J0527j3214J3291J3821L0146N879l4606k5558n933n140j4467L5514
$$ 42564 53091 39877 53168 66989 97135 103014 68408 42850 36917 31777 17310 52824
18547E2824J1912k1916J1879o75k3695l1999N446L4828M317j2422K0180J7670
$$ 52824 64736 42820 54699 54024 30329 -1670 3776 38604 42921 30499 50679 68349
18535F8349m495j0267l64N562p925j3375P114Q401o055l280K1147N244J7792l2460
$$ 68349 63854 53587 53223 58785 50860 37485 44599 53000 46945 43665 64812 70056 87848 55388
18521E5388m90J7100J4577k2753k3438j3503K4859J457k1667j1869N729k812j1723
$$ 55388 54898 71998 86575 63822 40384 26881 51740 53197 31530 19661 25390 22578 10855
18508A0855J2348M6556J5409R800k0914j5974j3295k5233r705n2p69j4166K3977
$$ 10855 23203 69759 85168 94968 74054 58080 44785 19552 9847 9795 9026 -5140 18837
18495A8837M3304K983J5428k069j6552L840m481r953K133J8745M648K2338M966
$$ 18837 62141 65124 80552 78483 61931 65771 61290 51337 53470 72215 76863 99201 104167
18482A04167k3867j1972k082R183N730q010l452l67J2692j3418l0591K2918o737
$$ 104167 80300 68328 66246 75429 81159 73149 69697 69330 82022 68604 38013 60931 54194
18469E4194j3782J8139j394q258j039J7525R987r88k1152k6513r407k1939k305
$$ 54194 40412 58551 57157 48899 47860 65385 75372 74384 53232 26719 17312 -4627 -6932
18456f932M175J0419O522k2731K3295L0566P505J686K4784J2535j4785K004J2771
$$ -6932 -2757 7662 14184 -8547 14748 45314 52819 54505 79289 91824 77039 79043 91814
18443I1814K0784m040j246O519r930l4893o903L7285O091k8860k8180j5228J7375
$$ 91814 112598 108558 107312 113831 103901 69008 62105 99390 105481 76621 48441 33213 50588
18430E0588L1379K1747p78j4785j2283P992K0611J6945j5156L517J2127O873K0191
$$ 50588 81967 103714 102936 88151 75868 83860 104471 121416 106260 109777 121904 128777 148968
18417A48968p328j4736m505J4738K9071k3824L3102K7052O055J7680K3801r399
$$ 148968 141640 126904 122399 137137 166208 142384 175486 202538 208593 226273 250074 240675
18405B40675J1819K4495o9R2J2709K222O31r405p558k9594k9292J5322J4233j0083
$$ 240675 252494 276989 276920 277012 289721 291943 292574 283169 275611 246017 216725 232047 246280 236197
18391B36197R590K3833J507j1245k840K609j6838l4751m107K727J0797n603Q867
$$ 236197 245787 269620 271127 259882 257042 259651 242813 208062 203955 206682 217479 211876 220743
18378B20743J4152L250k371k8985k2368o956J8713J9309l762N217J284L9696J5750
$$ 220743 234895 238145 235774 206789 184421 177465 196178 215487 211725 216942 218226 257922 273672
18365B73672K0971m374R98j6970l773N4907O0472M6690M2627O9045O8461N4600
$$ 273672 294643 290269 291267 274297 270524 325431 385903 432593 475220 544265 612726 667326
18353F67326K2834K3796N1961K4654N5717N7705O1908N5765K8198k1697m8461
$$ 667326 690160 713956 765917 790571 846288 903993 965901 1021666 1049864 1028167 979706
18342I79706k1287J5149M4926O8693L4113J7358J6123P4208J23000J72606K34694
$$ 979706 958419 973568 1018494 1087187 1121300 1138658 1154781 1228989 1351989 1524595 1759289
18331A759289L06518M70275O60893J000527J570231K543164L729952M076663K649698
$$ 1759289 2065807 2536082 3196975 4197502 5767733 8310897 12040849 16117512 18767210
18322A8767210P8822k362787k729532j384554M88744K501798L816807K907306
$$ 18767210 18846032 16483245 13753713 12369159 12857903 15359701 19176508 22083814
18314B2083814J02199l312103m841705l954466k692757j761334j159249p51383
$$ 22083814 22186013 18873910 14032205 10077739 7384982 5623648 4464399 3713016
18306C713016m73100l03419k23949j71803r3551p7864q3844j6318K5891L4745
$$ 3713016 3239916 2936497 2712548 2540745 2447194 2369330 2285486 2269168 2295059 2329804
18296B329804P5943J20687J41952J81368K27683K78999L85163N59098P69817J136654
$$ 2329804 2405747 2526434 2668386 2849754 3077437 3356436 3741599 4300697 5070514 6207168
18286F207168J706835K669928M322328O560130Q196368O863799K346014l285474
$$ 6207168 7914003 10583931 14906259 21466389 29662757 36526556 38872570 35587096
18278C5587096o003675m348305j054976K350959N209156N888414L508596j127158
$$ 35587096 29583421 25235116 24180140 26531099 31740255 37628669 41137265 40010107
18270D0010107n477909p041514o490844m802762k948586j320391J84957J694632
$$ 40010107 34532198 27490684 20999840 16197078 13248492 11928101 12113058 13807690
18262A3807690K471857J675279l95577k770699l581056k827997j946465j290091
$$ 13807690 16279547 17954826 17559249 14788550 11207494 8379497 6433032 5142941
18254E142941q53008n26119l15324k07920j49373j71985j53252j63303j07490
$$ 5142941 4289933 3763814 3448490 3240570 3091197 2919212 2765960 2602657 2495167
18245B495167k5105L5103Q8035Q5027O7114J07998J99771K57338L53150N74609
$$ 2495167 2470062 2505165 2593200 2678227 2745341 2853339 3053110 3310448 3663598 4238207
18235D238207Q47370J285401J905409L055783M922989P204760P998509N259257
$$ 4238207 5085577 6370978 8276387 11332170 16255159 23459919 31458428 36717685
18227C6717685j20741n468159o753765m666969k024155N24151L117213N193153
$$ 36717685 36596944 31128785 24375020 19708051 17683896 18208047 21325260 26518413
18219B6518413M752961J407526l332315o481185o070694m331139k821894j785336
$$ 26518413 31271374 32678900 29346585 22865400 16794706 12463567 9641673 7856337
18211G856337j098542o35798k90842qK69744N21620Q89476J480456K391950L845347
$$ 7856337 6757795 6121997 5831155 5831147 6100891 6622511 7511987 8992443 11384393 15229740
18201A5229740N749470P179367O136369K371851k341946m880846l762743q18521
$$ 15229740 20979210 28158577 34294946 36666797 34324851 29444005 25681262 24862741
18193B4862741K509168N220771N186646J670688l662494p491621p530629n668945
$$ 24862741 27371909 32592680 37779326 39450014 35787520 28295899 20765270 15096325
18185A5096325l880832k601383j771115j241492q72603o14866m49170l17975k14086
$$ 15096325 11215493 8614110 6842995 5601503 4728900 4114034 3664864 3346889 3132803
18176C132803j48247r5413j12484q0294l5268N044J24217J28080J02415Q1358
$$ 3132803 2984556 2889143 2776659 2696365 2661097 2666141 2790358 2918438 3020853 3102211
18166C102211O3794J65344L59403M99449O95473J004363J609155K577048L679641
$$ 3102211 3166005 3331349 3690752 4190201 4885674 5890037 7499192 10076240 13755881
18157A3755881L934920K509740l5735k148722k156821n95073J403387L640821
$$ 13755881 17690801 20200541 20164806 18016084 15859263 15264190 16667577 20308398
18149B0308398N653343O712735N769048K435606j614914m645161m679506j844735
$$ 20308398 25961741 32674476 38443524 40879130 39264216 34619055 29939549 28094814
18141B8094814J705930L678294K274012j716665o006937p253969n756827l980486
$$ 28094814 29800744 33479038 35753050 34036385 28029448 20775479 15018652 11038166
18133A1038166k732361j869616j247589q75916n98903m20869l12356k50369k17094
$$ 11038166 8305805 6436189 5188600 4312684 3713781 3292912 2980556 2730187 2513093
18124B513093j60257j50825j17850o4261j8993l554j5110J5457M0291L9770Q6062
$$ 2513093 2352836 2202011 2084161 2019900 2000907 1997353 1982243 1997700 2037991 2077761 2163823
18113B163823J67140K33016L38886M87207P50254J166367J878856K947139L930640
$$ 2163823 2330963 2563979 2902865 3390072 4140326 5306693 7185549 10132688 14063328
18104A4063328L539098J568205j080203k538022j725118Q6883J562208J612029
$$ 14063328 17602426 19170631 18090428 15552406 13827288 13914171 15476379 17088408
18096A7088408N3995k217474l548966l209056k300567j562327j041913o94839
$$ 17088408 17142403 14924929 11375963 8166907 5866340 4304013 3262100 2567261
18088B567261m80062l76785k85228k19145j23505j23208q3711l5739n6658o2662
$$ 2567261 2087199 1710414 1425186 1206041 1082536 959328 875617 839878 783220 720558
18078G20558n6913l7617k0961J7642Q479l3159j6898n1987m6746j4193m6509k356
$$ 720558 663645 626028 605067 622709 631188 598029 581131 529144 482398 468205 421696 419340
18066D19340k0595m6972l9140k8112l9986o0629j4454M952K1329j453N813j148
$$ 419340 398745 351773 312633 284521 244535 183906 169452 174404 195733 194280 200093 198945
18054A98945j4216q333j5353j384j0744J0541P424L3526M679j4390j6114k2004
$$ 198945 184729 176396 161043 159659 148915 159456 166880 200406 205085 190695 174581 152577
18042A52577j2652o786j0681k3766k2011k152J7483Q321J2160k247l2968k3588
$$ 152577 139925 133139 122458 98692 76681 74529 92012 100333 112493 110246 77278 53690
18030E3690P039j1450j4464J9622O080J3499L2629K5013k4166K225j0514p897
$$ 53690 60729 49279 34815 54437 60517 74016 106645 131658 107492 109717 99203 91306
18018I1306r711p367k2887J0173L7610J9206M646j7261k5725j4498j6053K731
$$ 91306 81595 74228 51341 61514 99124 118330 122976 105715 79990 65492 49439 52170
18006E2170J0727L6309j544j6564j4877L965M048j0787k9338k7831o429J3323
$$ 52170 62897 99206 97662 81098 66221 70186 74234 63447 34109 6278 -151 13172
17994A3172J4829j4108O393J1470l30L6993K2561M552R432J216m2844j1873K938
$$ 13172 28001 13893 20286 31756 31426 68419 90980 95532 104964 106180 63336 51463 54401
17981E4401P121k517j8875j8593j0445K4821L4059K5398k8084k1436k9825k0239
$$ 54401 61522 59005 40130 21537 11092 35913 69972 95370 67286 45850 16025 -4214
17969d214N2975K9489k963j3082k5747K1761J0233K357K494N226q720k1949l8004
$$ -4214 48761 78250 75287 62205 36458 58219 68452 70809 73303 78529 69809 47860 9856
17956I856K8815K8298L001J8690r805j7877m938J5273L350j4783k9409q776j1430
$$ 9856 38671 66969 69970 88660 78855 60978 56040 71313 74663 59880 30471 21695 10265
17943A0265Q168j4773P622J615j4019J7619J202j8367m515K0897K5626K2003o666
$$ 10265 18433 3660 11282 12897 -1122 16497 17699 -668 -5183 15714 41340 63343 56677
17930E6677q161j3534k7048J3033k367n939M2870j122r38R443j8958k7362j2866
$$ 56677 48516 34982 7934 20967 18600 12661 55531 54409 53471 62914 43956 16594 3728
17917C728J5154K1442L356j2824k9979L13K2236K8633J5931m923O052j91J129
$$ 3728 18882 40324 43680 30856 877 1190 23426 52059 67990 63067 69119 68928 70057
17904G0057n939k9816J5636N395o927K4478p850k5786k0692j3399K5750K0604
$$ 70057 64118 34302 49938 55333 48406 72884 65034 39248 18556 5157 30907 51511
17892E1511j0379k2156j9506J6655J9725r137k6599K0021j7775O840K8973n315
$$ 51511 41132 18976 -530 16125 35850 26713 114 20135 2360 9200 38173 32858
17880C2858j4723K1250n892L999j6175m4089L14J9712l697J0991L1908L55j0227
$$ 32858 18135 39385 33493 37492 21317 -22772 -22458 -2746 -6443 4548 36456 36811 26584
17867B6584p291K404J3335O95k4312L189J0118j2457k2749j3025j2218K525Q687
$$ 26584 19293 21697 35032 35727 11415 14604 24722 12265 -10484 -23509 -35727 -33202 -24515
17854b4515j0825J432J7800J5426j9336j0289J8715K5934R6p69L456K168J712
$$ -24515 -35340 -33908 -16108 -682 -20018 -30307 -11592 14342 14438 13669 17125 19293 21005
17841B1005O00J1963n657K5736J7676j9877j1561O141j6519k1300J0620J2839
$$ 21005 21605 33568 27911 53647 71323 51446 39885 46026 29507 8207 18827 31666
17829C1666j6635p517M1144K8507j9962l3909l802J6179M902J5165M073j8777
$$ 31666 15031 7514 48658 77165 57203 23294 19492 35671 40573 55738 59811 41034
17817D1034l448k8271k9291J6147L1259k973M9116L9968J345j0385j7389k529
$$ 41034 37586 9315 -19976 -3829 27430 24457 73573 113541 114886 104501 87112 84583
17805H4583K0879k8915k5149J9278K6643j5424n9081J3246J7690O981k2903q805
$$ 84583 105462 76547 51398 70676 97319 81895 22814 36060 53750 60731 37828 29023
17793B9023L7315M592l0300l4032J0187K0269J139M335l3451j8353r564J3992
$$ 29023 66338 70930 40630 6598 16785 37054 38193 42528 9077 -9276 -18840 -4848
17781d848r122L36j3691p32j797k9959K0935K4175N356L7608J7474J4768p395
$$ -4848 -13970 -13634 -27325 -28057 -29854 -59813 -38878 -14703 -9347 28261 45735 60503 53108
17768E3108k851L5803N600R273k3277L2850K8334j2827K9036k855j4097L476K7795
$$ 53108 50257 86060 91660 100933 77656 110506 138840 126013 155049 152194 138097 141573 169368
17755A69368m022j5972j5628K4496O190j6933K2562K3774j6286j9562r654m1036
$$ 169368 165346 149374 133746 158242 164432 147499 170061 193835 177549 157987 148333 107297
17743A07297l9991Q659J7290p020p216j8464j9005m303j2835k4q752R17K687m601
$$ 107297 67306 75965 93255 86235 79019 60555 41550 37247 24412 24388 15636 16553 19240 14639
17729A4639O42J6150j6043k1422J5936L0196j2716j9515R645n835m497L0466L0487
$$ 14639 15281 31431 15388 -6034 9902 40098 27382 7867 17512 11677 7180 37646 68133
17716F8133Q832o110N417J5811K4203J8620k2334j3775n172L6112J7380N321k315
$$ 68133 76965 70855 76272 92083 116286 134906 112572 98797 93625 129737 147117 152438 150123
17703A50123l9911l7687o101J1722m713P251j6583j6075J2628J8632J3398L5073
$$ 150123 110212 72525 66424 78146 73433 80684 64101 48026 60654 79286 92684 127757
17691A27757N990l849O932j262k2768j1414M932k0666l6608p227o940J232l6758
$$ 127757 133747 129898 136830 135568 112800 101386 106318 85652 49044 41817 34877 36109 -649
17678f49k5853Q570j4619j393J0686k0067j3617o715K3432J3047K7898J7740j210
$$ -649 -26502 -17932 -32551 -33944 -23258 -43325 -56942 -63657 -40225 -27178 720 18460 17250
17665A7250j914k6536j056j8423K3746J5895l799J4902M674j7331J8997L3178
$$ 17250 15336 -11200 -12256 -30679 -6933 8962 5163 20065 24739 7408 26405 59583
17653E9583L7980k582J9402K7015J581N614p322K5943J6394J016j1622l7863q425
$$ 59583 97563 94981 114383 141398 142979 148593 141271 167214 183608 184624 173002 135139 126714
17640A26714J9582J662j3255J0968K700m048l439j8281j9841m1287m8712j0589
$$ 126714 146296 147958 134703 145671 148371 144323 140884 122603 102762 61475 12763 2174
17628B174J3085O984P589J2939k925j1782k3945p151M987M1413k0777m3213k4620
$$ 2174 15259 22243 29832 42771 39846 28064 4119 -3032 1955 43368 22591 -20622 -45242
17615d5242K6155R707p9J427K0124j4145o443O302j3993J8920L1599J5092R283
$$ -45242 -19087 -9380 -9459 -8032 12092 -2053 -8496 -2194 -16187 2733 34332 49424 58707
17602E8707Q64m53J8291L5471M3615K3706k0294n4204k2377O787J8211Q389N175
$$ 58707 59571 59118 77409 112880 156495 180201 159907 105703 83326 90113 108324 116713 121888
17589A21888j1935k8687p653k9094k8918k0284P392o598m868L170J2844l2224
$$ 121888 109953 81266 73613 44519 15601 -4683 2709 -3889 -8757 -5587 7257 -24967
17577b4967j9331J3490K3199j0400r694L7740K2154j2829j4007k3180j976O337
$$ -24967 -44298 -30808 -7609 -18009 -27703 10037 32191 19362 5355 -17825 -19801 -13464
17565a3464R533k972J2620m297l2088l2807L632k0689J7991J6353K1228K7362
$$ -13464 -3931 -6903 5717 1420 -30668 -63475 -59843 -80532 -62541 -46188 -24960 2402
17553B402l264P293k789R418M989j9989k9372J6355J8448L2900J2552j6992l1724
$$ 2402 -862 6431 3642 13060 18049 -1940 -31312 -14957 3491 36391 48943 31951 227
17540B27K6050K610O27q656R600k4202k2646k887q889L217J406j5729R823j0713
$$ 227 26277 28887 29514 20858 30458 6256 -16390 -19277 -28166 -24949 -23543 -39272 -29449 -40162
17526d0162r505J5326R643J0791l5472l1458K4740J3378K0481J414k748j3893
$$ -40162 -49667 -34341 -24698 -13907 -49379 -80837 -56097 -42719 -22238 -20824 -23572 -37465
17514c7465K3693J1563N252r359k5499j595K8564K8625K467L137j6717o042K6041
$$ -37465 -13772 -2209 3043 -6316 -31815 -33410 -4846 23779 26246 29383 12666 6624 32665
17501C2665J8973j8126j3083K334l822j7981J8556j0026j3939K2072k263o468
$$ 32665 51638 33512 20429 22763 18941 960 19516 9490 -4449 17623 15360 8892
17489H892O529j4076m4399N25J263m260M175q784J6600J2869r695L0406K6967
$$ 8892 15421 1345 -43054 -42529 -41266 -45526 -41351 -50135 -33535 -20666 -30361 45 27012
17476B7012j3644j1918J4031j8137J2216l554k3796j4098j0498J5216J8424J2750
$$ 27012 13368 1450 15481 -2656 9560 6006 -17790 -31888 -42386 -27170 -8746 4004
17464D004L304j0800k234k758J8732M4073k2809j5567j6173o656K1664j1723j8269
$$ 4004 7308 -3492 -5726 -8484 10248 54321 31512 15945 -228 -6884 14780 3057 -15212
17451a5212p425j1346R719l1603N517K846J0999L6166M3596q600k6927j7865j887
$$ -15212 -22637 -33983 -24264 -55867 -50350 -47504 -36505 -339 43257 34657 7730 -10135 -12022
17438a2022j7324M626J9695l91k965j8334o034J6378k995j969J9939M564K7316
$$ -12022 -29346 -24720 -5025 -5416 -8381 -26715 -32749 -16371 -19366 -21335 -1396 3168 30484
17425C0484J733q86j378k854j384j2376j8172J736N967j9308j7240k624k1543
$$ 30484 32217 31331 29953 27099 25715 13339 -4833 -3097 2870 -16438 -33678 -36302 -57845
17412e7845j1676J835K0556L3874J2205J7613N221j9051J1750l0228k3108K8262
$$ -57845 -69521 -67686 -47130 -13256 -1051 16562 21783 2732 14482 -15746 -38854 -10592
17400a0592K1743l317j0975j1394J4386R555J4095j2871K339j3342J5513O828
$$ -10592 11151 7834 -3141 -14535 -149 9406 23501 10630 12969 -373 15140 21968
17388B1968j1276p142K0070L8276j9194Q449j7742j9574k1758J9760J0749l794
$$ 21968 10692 3550 23620 61896 42702 51151 33409 13835 -7923 11837 22586 18792
17376A8792j6256m434j3552K1558k1708j7995J9785J4021j6651Q72j1835p257
$$ 18792 2536 -1898 -15450 6108 -15600 -33595 -13810 211 -16440 -15568 -27403 -34660
17364c4660K7452j4472k3351J8604N7J546N895j1724k1186K707L3271N897r399
$$ -34660 -7208 -21680 -45031 -26427 -26370 -24824 -18929 -30653 -51839 -49132 -15861 -9964 -19363
17351a9363j4938R464j723j5757J9991J1069J1559k602J8157J5821l5435j4072
$$ -19363 -34301 -24837 -26560 -42317 -22326 -11257 302 -2300 15857 31678 -3757 -17829
17339a7829R87m461K192J9413J5029p495r365k8343L18Q493m071j8306M8138J4880
$$ -17829 -16842 -21303 -19111 302 15331 7836 -1529 -29872 -29554 -21061 -25132 -43438 4700 19580
17325A9580l5484k8585N697M240J3867K5754K045j0876N859N3855j89l2445j1162
$$ 19580 -15904 -44489 -38792 -34552 -20685 5069 7114 -3762 2097 55952 55763 23318 12156
17312A2156j9707k1535n051J1505K0009R172k1757j4703M957r853m75P441J0452
$$ 12156 -7551 -29086 -34137 -22632 -2623 6549 -15208 -29911 -24954 -34807 -35282 -27841 -17389
17299a7389m562J8887k2396j961j147M6q028J9409J287k3260J5299K1885j215
$$ -17389 -21951 -3064 -25460 -27421 -28568 -28522 -36550 -17141 -15854 -39114 -23815 -1930 -3145
17286c145Q188L2419N004j0328k8590k3038K2372J5548j0112l0225j2659K5575
$$ -3145 5043 37462 42466 32138 3548 -19490 2882 18430 8318 -21907 -34566 -8991
17274h991L1356J5228k5051j0316j6750R855M184l597N95l014j0642Q044n037
$$ -8991 22365 37593 12542 2226 -14524 -4669 -485 -4082 -3487 -6501 -17143 -9099 -14136
17261a4136j5827n755L874M348J8098L01l1178j8158j3359M111M918J2894N705
$$ -14136 -29963 -35718 -31844 -27496 -9398 -9097 -40275 -58433 -71792 -67681 -62763 -49869 -44164
17248d4164K9509J7492n751l876r990O655o83j4194N994N766j9643M0636l789
$$ -44164 -14655 2837 -2914 -6790 -16780 -10125 -10808 -25002 -19008 -13242 -32885 7751 3962
17235C962j2720K0170k2597k3877j1026J8636L444j3838J0121P224J387J4656
$$ 3962 -8758 11412 -11185 -35062 -46088 -27452 -24008 -37846 -27725 -20501 -19114 -4458
17223d458Q111N604J7117o293j8141n799j8206r942L390j638j3328l5404K9829
$$ -4458 3653 9257 26374 20081 1940 -3859 -22065 -32007 -28617 -30255 -43583 -78987 -49158
17210d9158J9731l512r710J2675r307Q338r6n311J1361L0828M51k7849j3222j6954
$$ -49158 -29427 -32939 -42649 -29974 -39281 -30943 -31039 -36350 -24989 5839 6290 -21559 -34781 -51735
17196e1735k419k19j0930L0694J8312J0265m115O398P516J169j6094n233k0286
$$ -51735 -54154 -54373 -65303 -34609 -16297 -6032 -10147 -3749 3767 4936 -11158 -16391 -36677
17183c6677P456J3458R2j0021L623K1344K0300j602m4544j074K2572l676j2453
$$ -36677 -29221 -15763 -15671 -25692 -22069 -725 19575 17973 -26571 -27645 -5073 -8749 -21202
17170b1202n131l584k149K8157K8177J299j0898r538l0902j7520K3424J662m586
$$ -21202 -26333 -29917 -32066 -3909 24268 25567 14669 5131 -25771 -43291 -19867 -18205 -22791
17157b2791N247K0216r896l7336j169L5171p693Q35K3083m612k4978j8793n05
$$ -22791 -17544 2672 -7224 -44560 -45729 -10558 -18251 -17416 5667 1055 -23923 -42716 -43221
17144d3221J395J8952L4874P788l83k058M594j6727L559m073m556n034O748M473
$$ -43221 -41826 -22874 12000 19788 19405 17347 21941 5214 8773 4700 144 -4890 1858 6331
17130F331J0950q64o087J3448J8083L615k7015n0741j4599K8306k3225l6293Q376
$$ 6331 17281 16417 10330 23778 41861 45476 18461 -32280 -46879 -18573 -41798 -78091 -69715
17117f9715K6052J2409K5306J2331j3057o452P518k1445j0656N779n860K24K403
$$ -69715 -43663 -31254 -5948 6383 -6674 -13126 -5608 -27053 -37709 -31930 -37790 -37566 -35163
17104c5163J1338L652m233j6303K383L4468J2111q256r79k9849k8239L7347K7462
$$ -35163 -23825 -20173 -24406 -40709 -38326 -3858 8253 -3 -982 -30831 -59070 -21723 5739
17091E739J3312J0562j1006m912K837K7933N040l5234J874k8715k2386O169J5347
$$ 5739 19051 29613 18607 13695 16532 44465 49505 14271 16145 -12570 -34956 -28787 -13440
17078a3440L6827K296l9395P966J2779N919L1400J3031k0392l6762r293P645k4819
$$ -13440 23387 25683 -13712 -5746 7033 12952 44352 57383 36991 229 -9064 -1419 -26238
17065b6238p427K8985K310K013j6952m670N989K4220K1731o998k8603q800J0769
$$ -26238 -33665 -4680 -2370 -357 -17309 -21979 -15990 8230 29961 22963 -5640 -14440 -3671
17052c671J0950j3607k7151J6517K1083j3385J2043J9322J3666k3077j2780R43
$$ -3671 7279 -6328 -33479 -16962 4121 -9264 2779 22101 35767 12690 -90 853
17040H53L0697p21K6370k9292j4972j5741r324O3679J1235k5305J5977K594l5676
$$ 853 31550 30829 57199 27907 12935 -2806 -12130 51549 62784 37479 53456 56050 20374
17027B0374o444K5656J376k731m5055m7435K428Q090l243J3513N25R509k30j4733
$$ 20374 13930 39586 40962 38231 -6824 -54259 -51831 -43741 -46984 -33471 -32946 -23437 -23667 -38400
17013c8400K1259J0370K292q482j5525J5907J3665k8058j6792k1182j205L4862
$$ -38400 -17141 -6771 -4479 -12961 -28486 -12579 1086 -26972 -43764 -64946 -66151 -31289
17001c1289N326J3472R857l5566j0502J2855m816K334J7720k0257P663L2053M215
$$ -31289 -25963 -12491 -2634 -38200 -48702 -35847 -40663 -38329 -20609 -40866 -33203 -1150 3065
16988C065k3328J2005R406p027l9279j3997o931L1449K3032M468K5165K7803J2855
$$ 3065 -20263 -8258 1148 -5879 -45158 -59155 -66086 -34637 -11605 -7137 18028 45831 58686
16975E8686m4249k2071N042m050M263j4578k5880k181O873M890j3190K0608m217
$$ 58686 14437 -7634 -2592 -6642 -2379 -16957 -42837 -45018 -38145 -33255 -46445 -25837 -30054
16962c0054j7027l829K2682Q61m490M95J5709K0331n237m401k0135l1073j6663
$$ -30054 -47081 -50910 -28228 -27367 -31857 -31362 -15653 4678 -559 -4960 -25095 -56168 -72831
16949g2831J9116M0175K1138k686K4055l1228n2154J1902L1439J5059j843l9136
$$ -72831 -53715 -13540 7598 4912 28967 -2261 -54415 -42513 -11074 3985 2142 -36994
16937c6994R846J0491n773j2917L082R32J9205j660j7071j3882k2879R241k0826
$$ -36994 -27148 -16657 -22430 -35347 -32265 -31333 -12128 -13788 -30859 -44741 -67620 -58379 -79205
16924g9205O866L5416K0169L351r870R7K55l0014k0115J5395K6714P977j1856
$$ -79205 -72339 -36923 -16754 -13403 -23273 -23176 -22921 -52935 -73050 -57655 -30941 -22964 -34820
16911c4820P751K0582j1316k3517O391K4780K1312k0140l3606L476m621K1383
$$ -34820 -27069 -6487 -17803 -41320 -34929 -10149 11163 -8977 -42583 -39107 -43728 -22345
16899b2345K4810J0606o14j5150k6383m822Q233R555L3810j752l0296j0820k8517
$$ -22345 2465 13071 12457 -2693 -29076 -33898 -25665 -16110 17700 15948 -14348 -25168 -53685
16886e3685J335P229L298J2501j4144j0794K3926J4417j2174q2K0467J5047j5553
$$ -53685 -52350 -45121 -41823 -29322 -43466 -54260 -30334 -15917 -28091 -28173 -7706 7341 -8212
16873h212l4803l080l071K970M6320k791k9504j6592K4528L4043M2705O159k1047
$$ -8212 -43015 -46095 -49166 -46196 124 -2667 -32171 -48763 -24235 9808 52513 58672 37625
16860C7625m0563j3574Q237j127Q361J3551P866k121r199l6035m931K2382J8891
$$ 37625 -2938 -16512 -8275 -9402 -1041 12510 20376 18255 9056 -26979 -31910 -9528 9363
16847I363o141M964p83k0845l8026o386l504J9135K2375L7004K0253Q395l2588
$$ 9363 3222 8186 7403 -13442 -51468 -57854 -61358 -42223 -19848 17156 37409 45804 13216
16834A3216J0256J4960O807O078k1441p8j5335R026j7387l4129N36M023Q158J4080
$$ 13216 23472 38432 45239 51317 29876 29798 14463 23489 6102 -28027 -27491 -23468 -15310 -1230
16820a230p683k9862l853R648J2217J792Q820q288m340Q189L072l195l879K1147
$$ -1230 -8913 -38775 -42628 -32980 -20763 -18971 -10151 -18439 -22779 -14590 -11518 -14713 -18592 2555
16806B555j5838o439R886k143j0891j6283m1742j5371N721K6637M0636J6471N902
$$ 2555 -13283 -19722 -9836 -11979 -22870 -39153 -80895 -96266 -90545 -63908 -23272 -6801 -899
16793h99k536O82q087L164L813J2485L542J5514K653j7997j6363j6189q156J3785
$$ -899 -3435 -2753 -10840 -7676 -3863 8622 12164 27678 30331 12334 -4029 -20218 -28374 -14589
16779a4589q33N027N08q034K305k5607l0272k763o507P071M170j031R141O1014
$$ -14589 -15422 -10395 -9887 -17921 -15616 -41223 -71495 -74258 -80765 -73694 -69524 -70555 -61414 -400
16765d00J7907P066K5460j5550k9602N09Q915j7618K067q048j5277k1442j6438
$$ -400 17507 24573 50033 34483 4881 5390 14305 -3313 -1246 -9294 -24571 -46013 -62451
16752f2451J7369n746j1854j2240n454R64J9569J4662J1228K9021P765O688j3173
$$ -62451 -45082 -50828 -62682 -74922 -80376 -79412 -59843 -45181 -33953 -4932 2833 9521 -3652
16739c652k848J6555k802J3988k319M643k2427M725l613j3776r267j1451O187
$$ -3652 -6500 10055 7253 21241 18922 23565 1138 5863 2250 -11526 -20793 -32244 -26057
16726b6057M0267J5478R993K54k4825j6042o98J8936N021l0732j7146p898J0912
$$ -26057 14210 29688 39681 39935 15110 -932 -1630 17306 22327 -8405 -25551 -33449 -22537
16713b2537J1941m120J0856L2158J8686o740k336J0770J0266k0805l76K8511p424
$$ -22537 -10596 -14716 -3860 28298 46984 40244 37908 48678 58944 38139 37763 66274 58850
16700E8850k6166r139j1313m259j6111Q345J9727K710o63j0461j0291J194K620
$$ 58850 32684 23545 12232 7973 -8138 207 19934 22644 21981 11520 1229 2423 5043
16687E043k0353j7950J8768K1566Q172j3968p33R7K73K418J3911K0609J951j0875
$$ 5043 -15310 -33260 -14492 7074 15246 1278 545 642 915 3333 17244 37853 39804 28929
16673B8929l694j4937l6717p742K0359l043m781K1631J4770L107J486l8756j4917
$$ 28929 25235 10298 -26419 -34161 -13802 -16845 -21626 5 14775 17882 19368 -19388 -34305
16660c4305J9410J3766j2331K907J8195o756N564j0217m1985j2285K2449j2954
$$ -34305 -14895 -1129 -13460 -10553 7642 886 6450 -3767 -45752 -58037 -35588 -48542
16648d8542j117K7503J9475k6647j3808L0090K8596j2201k9010N378j330J7178
$$ -48542 -49659 -22156 -2681 -29328 -43136 -13046 15550 3349 -25661 -20283 -21613 -4435
16636d435J3369j1389Q114m964L195k951j5207n766m36q533L408J5953l0625m1478
$$ -4435 8934 -2455 5659 695 3890 939 -14268 -20034 -20470 -29003 -25595 -9642 -40267 -81745
16622h1745k076M2523N292L182J8644Q816k0362P590j3724l9355j0449L1304R363
$$ -81745 -83821 -41298 -36006 -32824 -14180 -5364 -25726 -18136 -31860 -71215 -81664 -50360 -40997
16609d0997J9718L044J1515Q171l8451l6971J2255N1642J4712j7532p967J5176
$$ -40997 -21279 -18235 -6720 1451 -37000 -73971 -61716 -10074 4638 -12894 -20861 -5685
16597e685J8760k9251j192K921m2907j2577K2094J9709q583l3607k6081R92L7281
$$ -5685 13075 -16176 -17368 -14447 -57354 -69931 -47837 -28128 -36711 -70318 -96399 -95407 -58126
16584e8126L3711K6204o173k5294k2734j5456M3922k27j9370o909K2483K6293
$$ -58126 -24415 1789 -4384 -29678 -52412 -67868 -23946 -24173 -43543 -50452 -27969 -1676
16572a676J3164j3760j6962O366J0483o494K3383j3009j5496k3994N379K8768
$$ -1676 11488 -2272 -19234 -12868 -2385 -8879 14504 1495 -14001 -37995 -32616 -3848
16560c848R547k1230J4570q683k5418J1851r358m62K637J754m370j5471K6998
$$ -3848 5699 -15531 -961 -9644 -35062 -23211 -32569 -33031 -30394 -28640 -33010 -48481 -21483
16547b1483K1350r28p646k2909m102J1564k536Q219J6780p968k4216j4734J6637
$$ -21483 -133 -1061 -8707 -31616 -35718 -24154 -26690 -18471 -1691 -9659 -33875 -48609 -31972
16534c1972K7941p626J3758J1141n344k0382K915L6461K7352l1078k210K4544
$$ -31972 -4031 -11657 2101 13242 7898 -12484 -9569 26892 54244 23166 20956 45500
16522D5500j2j774l0941k1332j1427l9176l663K1131J3732j0502K110J1839J5487
$$ 45500 45488 43714 12773 -8559 -19986 -59162 -62825 -41694 -27962 -38464 -36354 -24515 -9028
16509i028K4703O048l4443k6950n4045m979M4977J4420j3013J0878K2807k342
$$ -9028 15675 21723 -12720 -39670 -93715 -98694 -53717 -39297 -52310 -41432 -18625 -20967
16497b0967J42m16R098P423R525L501p304K4490L4649r165k9409l4282j603k513
$$ -20967 -20825 -21241 -12143 -4720 4805 8306 1002 25492 60141 50976 21567 -12715 -14318 -16831
16483a6831K869Q103J3757J1591j0730j9675k9098R309K5735q536k8499J4597
$$ -16831 -13962 -5859 7898 19489 8759 -10916 -40014 -30705 -4970 -13506 -42005 -27408
16471b7408J7940Q194r777k2574k8639j3125J0320K5137K8199J3454J4265j763
$$ -27408 -9468 -1274 -11051 -33625 -62264 -75389 -65069 -39932 -11733 1721 15986 14223
16459A4223j5837j2387j5452l725j266r021J5270K5055k1366l4947N489q622l555
$$ 14223 -1614 -14001 -29453 -33178 -34444 -43465 -28195 -3140 -24506 -59453 -53964 -62586 -66141
16446f6141K4161Q235R404K6571J6637K30k2508j3153j267J5028L3438r04j7208
$$ -66141 -41980 -33745 -24341 2230 18867 19097 -3411 -16564 -17831 -2803 30635 29731 12523
16433A2523j4700J4370o863k0468n381k4332K4386J4668P702oj0239P366k557
$$ 12523 -2177 12193 5330 -15138 -20519 -44851 -20465 -5797 1905 1899 -8340 -974 -3531
16420c531k4090n841j2523m2346J6306L7861J5275J568K5489k561k4129q029M298
$$ -3531 -27621 -33462 -45985 -88331 -72025 -34164 -18889 -17321 8168 5607 -18522 -26551 -22253
16407b2253J5121Q372k3310l1958M109L4044J3916Q944J3638M4986R666l3137
$$ -22253 -7132 1240 -22070 -54028 -49919 -15875 -1959 6985 20623 65609 75275 42138
16395D2138m0794n8676l0228J0275L7130L0037J1882K6509J92k4735j3198j2269
$$ 42138 1344 -57332 -87560 -77285 -40155 -10118 1764 28273 28465 3730 -9468 -21737
16383b1737o596n943k220J1464j1786k954K9572L5010j9294k1905M163j5923m108
$$ -21737 -28333 -34276 -36496 -25032 -36818 -39772 -10200 24810 5516 -16389 -12226 -28149 -32257
16370c2257K1065J2698J2836R075k7496j3442n798k512J6631J725j1647J6022
$$ -32257 -11192 1506 14342 23417 -4079 -17521 -23319 -25831 -9200 -7475 -19122 -3100
16358c100P740k555m293J2336j0328P705J453n957j3295j3530J653k531K9417
$$ -3100 4640 2085 -2208 10128 -200 7505 8958 3001 -10294 -23824 -22171 -24702 4715
16345D715j7228k280R186K7682K3276k8621j9182J4615r551j5517Q851l101J4703
$$ 4715 -12513 -14793 -5607 22075 45351 16730 -2452 12163 2612 -12905 -4054 -7155 7548
16332G548l218K761J0784L9464l5526k4767K4629J195P465N733l704k7598l3314
$$ 7548 4330 7091 17875 57339 21813 -2954 21675 22870 30335 36068 32364 4766 -28548
16319b8548K362j538J0993J6656J8150r066n939j5119k3640R428L7716q764j629
$$ -28548 -26186 -27724 -16731 -75 18075 9009 3070 -12049 -35689 -26261 11455 2691 1062
16306A062J5990r482L045O319l6023m3005k3236J8937J6412O343P489O69J8350
$$ 1062 17052 7570 10615 16934 -19089 -62094 -85330 -66393 -49981 -43638 -36149 -35480 -17130
16293a7130K50K2393J8822K5093o289k2470j6827k3314Q269Q59k076J0307K7723
$$ -17130 -16880 5513 24335 49428 43139 20669 3842 -19472 -11203 -10344 -12420 -2113 25610
16280B5610n04k2561j2808J2307L136j8653k9641Q946L0879N997j9243r617j003
$$ 25610 25106 2545 -10263 2044 5180 -13473 -43114 -34168 -3289 2708 -16535 -26152 -27155
16267b7155p234K419N571J9144K4822Q778l0374k0542q705N173j9551m899J0960
$$ -27155 -34389 -31970 -26399 -7255 17567 26345 -4029 -24571 -33276 -28103 -47654 -52553 -41593
16254d1593j2431O03J9509M84m2806q855m589L719J0248K6081K8789L264O024
$$ -41593 -54024 -53421 -33912 -33428 -76234 -85089 -89678 -85959 -75711 -49630 -20841 -17577 -11553
16241a1553P547r720J0262j1353o720k5312p081K1396j552j8855R297R417O398
$$ -11553 -4006 -13726 -3464 -14817 -21537 -46849 -53930 -32534 -34086 -52941 -43644 -34227 -27829
16228b7829K9882k8130l0487K605K3289K6289K5609N846P050j8340q135L48j148
$$ -27829 2053 -26077 -56564 -53959 -30670 -4381 21228 27074 34124 15784 7649 7997 6849
16215F849k3011l471N178k733j3507j5311R829K7158J0032J7827k1443j6719K2469
$$ 6849 -16162 -19633 -14455 -17188 -30695 -46006 -36177 -9019 1013 18840 -2603 -19322 3147
16202C147q115j5136m356K6709l856k1771J1090K2058k846j1315K2110J424L7727
$$ 3147 -4968 -20104 -24460 2249 -1607 -23378 -12288 9770 6924 -4391 17719 19143 56870
16189E6870o936k1417M2J850l301l7739j6950K611L0086r373L497P721Q662k284
$$ 56870 49934 28517 28559 30409 27108 -10631 -27581 -24970 5116 -4257 -760 6961 15623 13339
16175A3339N408J9789J3981J4356k0124j4074q30j6006k8818l2610K797J4722
$$ 13339 18747 38536 52517 66873 46749 32675 31845 15839 -12979 -45589 -42792 -28070
16163b8070K8362R650k3444j9388L696J4763K202J0701k4339P836P998j8968J5204
$$ -28070 292 9942 -13502 -32890 -29194 -14431 -12229 -1528 -25867 -18031 -10033 -29001 -13797
16150a3797K2400j4943r57k871j7853J0325Q004l523j3496o394J8777J6639p248
$$ -13797 8603 -6340 -7297 -10168 -28021 -17696 -9692 -13215 -26711 -33105 -14328 2311 -4937
16137d937j4595o020L7383J9652k4336k2019m571M086r803K8339O99j3147k7562
$$ -4937 -19532 -25552 11831 31483 7147 -14872 -19443 -15357 -25160 3179 3878 -9269 -36831
16124c6831k594K6754K9950n445k7236J0354K8377P766o765P01L139j831j8644
$$ -36831 -39425 -12671 17279 11834 -15402 -5048 23329 31095 24330 25031 28170 26339 7695
16111G695j7115K3188J7480j3712j2302l346n401j334R076L8381r80j3555j6020
$$ 7695 -9420 13768 31248 17536 5234 1888 -3513 -4847 4229 42610 41630 28075 12055
16098A2055n329k5004k3788K1503L4185l802j1910j6432Q3J369K63k4816j4882
$$ 12055 6726 -18278 -42066 -20563 13622 9820 -2090 -18522 -18439 -17070 -16807 -41623 -56505
16085e6505j7603K27M0042L0160J6784Q161p871J191r776M985K9510K411k5965
$$ -56505 -74108 -73881 -33839 -3679 13105 21266 13395 14586 4810 9795 39305 41716 15751
16072A5751P294j5300k4640o065K0299J0771L1978O566r111K2737m0549o0822
$$ 15751 23045 7745 -16895 -22960 -2661 8110 40088 46654 37543 60280 19731 -41091
16060d1091k0898K1394j0403K4925N438j602J3560K0419j532l2543r726q233j6555
$$ -41091 -61989 -40595 -50998 -26073 -20635 -22237 -8677 11742 10210 -22333 -32059 -40292 -56847
16047e6847J4900R115K0386q165k376j960o634k9112L4789L540R94p993j0519
$$ -56847 -41947 -32832 -12446 -20611 -22987 -24947 -31581 -60693 -25904 -22364 -21370 -29363 -39882
16034c9882l444L619N949J4855K9080q761k3211m87q506J0147L053j061P167J8258
$$ -39882 -43326 -39707 -33758 -18903 10177 1416 -21795 -22282 -30788 -20641 -17588 -18649 -11482 6776
16020F776K5951j8459m0106k3439Q191M843K4936L7318j2803K869p284j5487r568
$$ 6776 32727 14268 -25838 -49277 -41086 -36243 -11307 26011 13208 16077 8793 -6694 -16262
16007a6262k1811O07K4997J1735L0845p620k1965j2406J2522L0021l402k2992
$$ -16262 -38073 -37466 -12469 -734 30111 22491 526 -11880 642 30663 27261 4269
15995D269l1750j129j0848L7041K7939j8600k8770J0077K7606l069R735J9688
$$ 4269 -27481 -28610 -39458 -2417 25522 6922 -21848 -11771 15835 12766 22501 42189
15983D2189k5134j9852o361P177P364J4672j936j3367J8158N93K017q051K0233
$$ 42189 17055 -2797 -9158 -1981 5383 20055 18119 4752 22910 23503 25520 17469 37702
15970C7702k0058J0406r122l0299j1690K0681J3987k3133j3658J6345j2034J5174
$$ 37702 17644 28050 18928 -11371 -23061 -2380 11607 -11526 -25184 -8839 -20873 -5699
15958e699K1864M661j2961O362O069J4452j8798n002k7064k0482N119j0157Q535
$$ -5699 16165 20826 7865 14227 20296 34748 15950 10948 -16116 -36598 -31479 -41636 -33101
15945c3101J4010J5524R011K5626J2225k6124l2013Q646p657N80K726k4605k4662
$$ -33101 -19091 -3567 5444 31070 43295 17171 -14842 -6196 -13853 -13273 -10547 -35152 -59814
15932e9814J6011K8858p421j5062J4786n628J8437K4237K5425J4643l0253k3223
$$ -59814 -43803 -14945 -22366 -37428 -22642 -28270 -9833 14404 39829 54472 24219 996
15920I96K2850l34n810j3771k0827k7843j2033K4934L8943J9045q147j4208k5971
$$ 996 23846 23512 17702 3931 -16896 -44739 -56772 -31838 7105 26150 18003 3795 -22176
15907b2176L0457J1604N862q144j3985p14l81M4572o084k4111j3361O268j1190
$$ -22176 8281 19885 25747 17603 3618 2904 2523 47095 41011 16900 3539 9807 -1383
15894a383K762j5246j2754J8862r201j0732k796K7464K828p917N663m118k9091
$$ -1383 1379 -13867 -26621 -7759 -16960 -27692 -30488 -3024 -196 -8113 -2450 -6568 -35659
15881c5659J4006J4745J4757J407j1629M354L644k830J924p46J2776K2927l3556
$$ -35659 -21653 -6908 7849 9256 -2373 1981 5625 2795 4719 3973 16749 39676 6120
15868F120m1227j6362J4240j2683K7713K5384L8244j00l0092j6876j4251n092
$$ 6120 -35107 -51469 -37229 -49912 -22199 3185 41429 41329 11237 -5639 -19890 -24982
15856b4982n262j3255j1067K3682P430j8539j0788m833K2883R636L548J1628J5379
$$ -24982 -30244 -43499 -54566 -30884 -23454 -41993 -52781 -57614 -34731 -25095 -21547 -9919 5460
15843E460k3435j1701l379m639j0681j1591N7354N110J2374J5873k8756k4430
$$ 5460 -17975 -29676 -33055 -37694 -48375 -59966 -2612 2498 14872 30745 1989 -22441
15831b2441q549M0396K5074m130j1084J5763r31j4693q391k6745K541Q5q928k662
$$ -22441 -30990 9406 34480 30350 19266 35029 34098 19405 11014 -15731 -13190 -13105 -22033 -24695
15817b4695q908K2560J2473j7697J3686o079j6748J3848J9975k397j4917j18j39
$$ -24695 -33603 -11043 1430 -16267 -2581 -8660 -25408 -11560 8415 6018 -8899 -9017 -9156
15804i156L347j6307l4428l0034J4143J5134O981j0812O831J6650J7845l3362
$$ -9156 -5809 -22116 -56544 -86578 -72435 -57301 -50320 -61132 -54301 -37651 -19806 -53168
15792e3168j9009K6045J8500o389L2472J27j3396J975r895Q539M0707M4415j8869
$$ -53168 -72177 -46132 -27632 -34021 -1549 -1422 -14818 -12843 -22738 -14199 26508 70923 52054
15779E2054j4963p417r409j9450J3044L2532p85J106j8337J3357O822l2837l2175
$$ 52054 37091 29674 20265 815 13859 46391 45606 46712 28375 41732 48554 15717 -16458
15766a6458j7872J899j1046L0695Q895k6191j2402N718L2983J4571r490n610k4834
$$ -16458 -34330 -32431 -43477 -12782 -3887 -30078 -42480 -36762 -3779 10792 1302 -4308 -29142
15753b9142o602M3892J9714k0114l610j1130k3897p702P184j2869m203L8610J1304
$$ -29142 -35744 8148 27862 7748 4138 -6992 -30889 -38591 -31407 -44276 -48479 -9869 1435
15740A435J3668O128q624n0657j1032l315K430J6588K1634J6838n158k4975j6307
$$ 1435 15103 21231 12607 -38050 -49082 -52397 -49967 -33379 -11745 5093 -65 -25040 -41347
15727d1347J2460m547K209j0316L662l175J5261J1514k4515J7391K0563j2798
$$ -41347 -28887 -33434 -31225 -41541 -37879 -41054 -25793 -14279 -38794 -21403 -840 -13638
15715a3638r802m746Q64k0253J2456O017m284K2058L1375j149R753O810k0831
$$ -13638 -23440 -28186 -27322 -47575 -35119 -29102 -33386 -11328 20047 18898 28651 35461 14630
15702A4630j1334k4356k6390L086L9649J0737K1320r947m6247j7809m0517R837
$$ 14630 3296 -21060 -47450 -44364 -4715 6022 27342 17395 -28852 -46661 -87178 -77341
15690g7341O2520J0678k2721k4525P526L1325J6574k4497k5960o891J0936M0528
$$ -77341 -14821 -4143 -26864 -51389 -43863 -12538 4036 -20461 -46421 -53312 -42376 -1848
15678a848J633M503O762k030n223K147r568K579K3973N484j6235j2947k8679P776
$$ -1848 -215 4288 11050 9020 3797 5944 -3624 -1045 22928 28412 12177 -770 -29449 -21673
15664b1673M2382j5603k8541k9355o407J5348J9133J8751J1705Q192j882r909
$$ -21673 20709 5106 -23435 -52790 -59197 -43849 -24716 -5965 5740 13932 12050 2141
15652B141L537P781K0957q15m3800n4759k715L4771L731O249j0432n4052l038
$$ 2141 5678 13459 34416 33601 -10199 -64958 -67673 -32902 -29171 -22922 -33354 -87406 -90444
15639i0444K4128J6761L2929K2306J4344j4102j7825l094R859Q533N38M674l2355
$$ -90444 -66316 -49555 -16626 5680 20024 5922 -11903 -14997 -5138 3395 3933 8607 -23748
15626b3748j4995J118o495j9280k8649L0531K7289n468j7987j151K9186J0239
$$ -23748 -38743 -37625 -44120 -63400 -92049 -61518 -34229 -39697 -57684 -58835 -29649 -19410
15614a9410j6426R151L629J1231R669j5153K5323L3675l287k428n29j7211k4698
$$ -19410 -35836 -26685 -23056 -11825 -2156 -17309 8014 41689 38402 35974 35445 18234 -6464
15601f464L334m716K2130J4503p38j7234r982Q656j5074j7584m601K3041j0298
$$ -6464 -3130 -7846 14284 28787 28049 10815 833 9489 -5585 -23169 -27770 -4729 -15027
15588a5027M846j1843K3739m37p126j809q267K2494m425l5148n95K061L1476M806
$$ -15027 -10181 -22024 1715 1278 -5848 -7657 -15924 6570 2145 -33003 -33598 -31537 -61 4745
15574D745q823k762J3909L328l717l345K7759j0325l1158J0773j566k5234j4427
$$ 4745 -4078 -6840 7069 10397 6680 3335 31094 20769 -10389 384 -1182 -26416 -40843
15561d0843K2308J941k2631L187K5010p804K442j9803j423J1931K234j4381O453
$$ -40843 -18535 -16594 -39225 -36038 -11028 -18832 -16390 -36193 -37616 -25685 -23451 -37832 -31379
15548c1379K7175L4289R532l9749k8737p696n830k7957K2885Q483j2014L4217
$$ -31379 -4204 30085 39617 -132 -28869 -36565 -42395 -70352 -47467 -38984 -50998 -16781
15536a6781J6100j2098p892Q975M252j922j1509j7208K1538K0335j3818P67J9946
$$ -16781 -681 -12779 -20671 -11696 -7444 -9366 -20875 -38083 -16545 3790 -10028 -9261 10685
15523A0685J1174j0204j7536J141K526K018o216K478j4205l2246R794J4372k206
$$ 10685 21859 11655 -5881 -4740 -2214 -196 -6412 -3934 -18139 -50385 -40591 -26219 -28425
15510b8425J096L0831K4368m813N62k4508Q138j8299j0750j1539j959K053J0883
$$ -28425 -27329 3502 27870 23057 23619 -889 7249 -11050 -21800 -33339 -35298 -33245 -22362
15497b2362m620m552j7778K2049N245j3797j4615J0333J7181R049m569N243J1315
$$ -22362 -26982 -31534 -49312 -27263 -22018 -35815 -50430 -40097 -22916 -13867 -18436 -13193 -1878
15484a878N91r151J1467j4296o428J0435N780J5970j3090j2894Q255J3755J1312
$$ -1878 -1287 -10438 1029 -13267 -19695 -9260 -3480 12490 -600 -13494 -5239 8516 19828
15471A9828o20r343k4306k9766l21O830n264k670P129J0249L49P33J9285k6557
$$ 19828 19208 9865 -14441 -44207 -44528 -37698 -42962 -45632 -38503 -28254 -27905 -27172 -7887 -34444
15457c4444n5080j0583K5658P8L4013K9734N284r764J6974J7577J2111m500P855
$$ -34444 -89524 -100107 -74449 -74371 -40358 -10624 -5340 -15104 1870 19447 31558 27058 34913
15444C4913j5577J5211k023k1580j4534l0023k2825K1474j747j6507n612L2018
$$ 34913 19336 34547 32524 10944 -3590 -33613 -56438 -34964 -36711 -53218 -58830 -26812
15432b6812K8633K1284j102k9184k2820R742J8326m0421l8864l334K916J8051
$$ -26812 1821 23105 22003 -7181 -30001 -20259 -1933 -42354 -81218 -84552 -81636 -63585
15420f3585J7942J2130J9341M617o682N507K392n886J3149j5288l674n39O686
$$ -63585 -45643 -33513 -14172 -9555 -16237 -10730 -8338 -14224 -1075 -16363 -20037 -20576 -13890
15407a3890J9839j4666l719R159j5857j316J1525L5817J3430K3286K0222l5731
$$ -13890 5949 -8717 -12436 -3277 -19134 -20450 -8925 26892 40322 63608 83830 48099
15395D8099m5311m5201P608M9677r924j5306K8080R894l839k1662L2152j0593
$$ 48099 2788 -42413 -34805 14872 4948 -10358 17722 27616 23777 2115 34267 23674
15383B3674k1616R179r779k389k927J6480l429l4426M067K689r738K4021L4269
$$ 23674 2058 11237 1458 -931 -3858 12622 9193 -25233 -21166 -18477 -28215 -4194 30075
15370C0075K0786k2178q657J9085J4923l1491j1634J9844o238L029o124N221r279
$$ 30075 50861 28683 20026 39111 54034 22543 10909 30753 24515 27544 21420 26641 17362
15357A7362j3940j3522r431k5970M166K1499j1848p393J2158M399q807j9948J3157
$$ 17362 3422 -10100 -19531 -45501 -41335 -19836 -31684 -39077 -26919 -22520 -31327 -51275 -38118
15344c8118J2458m202l614j914R527J6496j5182n072J6510p97q650P312q485k4520
$$ -38118 -25660 -29862 -33476 -35390 -25863 -9367 -24549 -29621 -13111 -13908 -22558 -15246 -23731 -48251
15330d8251j2518L175J4681K8102J2635J2644K8929K165m4109k5885J0388j042
$$ -48251 -60769 -57594 -42913 -14811 -2176 10468 39397 41562 -2547 -28432 -18044 -19086
15318a9086K1395J4262p793j1654n654J9015M903r572j9726Q314j7566r122k9478
$$ -19086 2309 16571 8778 -2876 -8530 10485 15388 5816 -13910 -5596 -23162 -32284 -61762
15305f1762j3865J8502N335j540K825M715K4829J076p213J105K4870J3596m4756
$$ -61762 -75627 -57125 -51790 -53330 -50505 -45790 -20961 -19885 -27098 -25993 -1123 12473 -32283
15292c2283l8822j751K2926M168L0113J5244k481J1794K911l673L201K0151J6606
$$ -32283 -71105 -72856 -49930 -45762 -15649 -405 -2886 8908 11819 8146 11347 31498 48104
15279D8104k0324j0942l122m276R959j3817k3747p022j866n124j27K0182k527
$$ 48104 27780 16838 13716 9440 19399 5582 -18165 -25187 -27053 -32177 -32304 -12122 -14649
15266a4649j1695L4009J3206m000K766J5856j5878l842j2348k2336P171K3889
$$ -14649 -26344 7665 20871 16871 19637 35493 19615 15773 3425 -18911 -11740 12149
15254A2149m950j7081n082J4376j0864l138M0729j3278k0621K6772J822j1788
$$ 12149 7199 -9882 -14964 -588 -11452 -14590 26139 12861 -7760 19012 20834 9046
15242I046j2485O404j6736o204M039q695K3878j0052J5387r023N737R444k4639
$$ 9046 -3439 2965 -13771 -19975 -15936 -24631 -753 -10805 4582 -4441 1296 10740 -13899
15229a3899J0936J4459N036J4303k544L680l0118k1889L0834J2378k278J7003
$$ -13899 -2963 11496 16532 30835 28291 31971 1853 -20036 10798 23176 20898 37901
15217C7901M439j0807j2612k1752m1926K7084L5558J8049k8869J4574J3247j2262
$$ 37901 42340 31533 18921 -2831 -44757 -17673 17885 35934 7065 21639 34886 22624
15205B2624l2748J940K3034n844n994L134J7033l2846r205J7866O265K6883J5443
$$ 22624 -10124 -8184 14850 9006 3012 6146 23179 -9667 -18872 -1006 5259 32142 47585
15192D7585Q842J6035l0879j8910k8810M79L426r028j1071J7724K9541k3002J6844
$$ 47585 56427 72462 41583 22673 -6137 -5658 -2232 -11260 -22331 -4607 24934 1932 18776
15179A8776r250j6303k6549j9455K834J6265P532K2188K0887l644j1021k4016
$$ 18776 9526 -6777 -33326 -52781 -49947 -33682 -26150 -3962 16925 13281 2260 -21756
15167b1756K6006K7120j0754l0086l7731J7049J0824K3200j2145k9672K6914K2062
$$ -21756 4250 31370 20616 -9470 -47201 -30152 -19328 3872 -8273 -37945 -11031 11031
15155A1031k0146k2968R460L274J4561l234j87J4653J940k1688j3700J1392l0668
$$ 11031 -9115 -32083 -22623 -19349 -4788 -8022 -8209 6444 8384 -13304 -27004 -15612 -46280
15142d6280P412L2501J5021N836j5744l280Q242k952j7834j706Q786r318k210
$$ -46280 -38868 -6367 8654 14490 -1254 -4534 3708 756 -17078 -18784 -9998 -19316 -21526
15129b1526K8137L3148j6876k4395l5653j2259K6020J941p367P87K0096L1124
$$ -21526 6611 39759 22883 -1512 -37165 -49424 -23404 -21463 -28830 -28043 -7947 23177
15117B3177k6056n312P682L1232N669n757k5609k4603j282m77P142K3049K2533
$$ 23177 -2879 -8191 -509 30723 36392 30635 5026 -19577 -20859 -21336 -14194 8855 31388
15104C1388k2942k6399J279Q788K0333J2419J0007q961j9150k1389j6016L2559
$$ 31388 8446 -17953 -16674 -7886 12447 24866 34873 25912 6762 -14627 -30643 1916
15092A916L9671J1843l1438l7811K4832L0366j0120l0287j3258j1117j7568J613
$$ 1916 41587 53430 21992 -15819 9013 39379 29259 -1028 -14286 -25403 -42971 -41358
15080d1358L5934R484j2438q92J4895K673K2401J8525k152l5828O488m45k1050
$$ -41358 -5424 4060 -8378 -9270 5625 8298 30699 49224 47072 11244 17732 17287 -3763
15067c763K942q657J9404j8065k5280J4606Q890k8747n052K9924L3147P935l0907
$$ -3763 -821 -9478 9926 -8139 -33419 -18813 -9923 -38670 -43722 -13798 19349 27284 -3623
15054c623j7394L8937P244j1874k6148o682N914n019L3097K548J2488j1964j8522
$$ -3623 -21017 17920 25164 13290 -12858 -19540 -13626 -18645 14452 17000 29488 17524 -998
15041i98J3540k0125m740k066J1733o422j2422r671K7034L5916j8593j9546j5479
$$ -998 12542 -7583 -12323 -14389 -2656 -9078 -21500 -31171 -4137 31779 13186 -6360 -21839
15028b1839J70K7517k591M296o776M170K8919j3490j8326j1152l3487j7979J4749
$$ -21839 -21669 5848 3257 7553 777 4947 33866 20376 2050 -9102 -42589 -60568 -45819
15015d5819L3378l097l636L483j958r489M326L1716j0213j9689j3820O495L5679
$$ -45819 -12441 -15538 -19174 -15691 -17649 -27138 -22812 8904 -1309 -20998 -34818 -28323 7356
15002G356M1428k5264j0090J9962p148n481j2316j2911k8682q186J7030Q982Q238
$$ 7356 48784 23520 13430 33392 26244 20763 8447 -4464 -33146 -41332 -24302 -15320 -7082
14989g082j1535K8093r234k6687K6626Q520J460J5656K5260r876l3172k1590J5153
$$ -7082 -18617 9476 242 -26445 181 8701 10161 25817 51077 41201 8029 -13561 1592
14976A592j220J532K311r90O330k8894l3817K2931L6327j1275J460M994j5242
$$ 1592 372 1904 4215 3225 9555 -19339 -53156 -30225 6102 -5173 -3713 1281 -13961
14963a3961m966n767J1047j0299J9622K1792k1617j9799j9370J8432M3641K1543
$$ -13961 -18927 -24694 -13647 -23946 -4324 17468 -4149 -23948 -43318 -24886 18755 40298
14951D0298k9161j9376K1054j4198j5329j4800j3591k54N686K7271J7584K489
$$ 40298 11137 -8239 12815 -1383 -16712 -31512 -45103 -45357 -39671 -12400 5184 7673
14939G673k5112j5456K568K0215O356J9938K3994l3492K890j451N630K511J4834
$$ 7673 -17439 -32895 -30327 -10112 -3756 16182 40176 6684 9574 8123 13753 16264 31098
14926C1098j2201j2985j3715K3466J7516j6705l6062j8894J2908k099o63j448
$$ 31098 18897 5912 -7803 15663 33179 16474 -19588 -38482 -25574 -27673 -28336 -29784
14914b9784J9505J4425j7640j495K0850J4847j5306j6987K197l694q460p430O697
$$ -29784 -10279 4146 -13494 -14989 5861 20708 5402 -11585 -9388 -13082 -21542 -28972 -22275
14901b2275K7816P217q728K1329l5098k3077J5268m729k1308m21J962k131j2163
$$ -22275 5541 12758 4030 25359 -9739 -32816 -17548 -22277 -43585 -44006 -42044 -44175 -56338
14888e6338P090J0690Q872m2093J4142Q674L1257J7657o592J2302j6681k0016
$$ -56338 -49248 -38558 -29686 -71779 -57637 -48963 -17706 -49 -6641 5661 -11020 -31036
14876c1036n144L1932J579j1582j4048j1890J9548J2347j1353j2050k520M4909
$$ -31036 -36180 -4248 -2669 -14251 -28299 -40189 -20641 -8294 -19647 -31697 -34217 10692
14864A0692K2892j871k4922p519L630j1055j1521R089J8075k659O581R903L0507
$$ 10692 33584 31713 6791 -728 2902 -8153 -19674 -10585 7490 4831 11412 21315 51822
14851E1822l5406n2336M408J6929k821n675j3211M375L944L4195j508K723J1445
$$ 51822 16416 -35920 -31512 -14583 -17404 -23079 -36290 -31915 -27971 6224 4716 7439 18884
14838A8884k0410j4273J65j9167K3511J2599q552j0741k2000k2692O330J2110
$$ 18884 -1526 -15799 -15634 -34801 -11290 1309 -7243 -17984 -39984 -62676 -56346 -44236
14826d4236p802R556j832J7234L4746K050k023J2252n290j5713j3559P267L2231
$$ -44236 -52038 -42482 -44314 -27080 7666 9716 7693 19945 14655 -1058 -14617 -7350 24881
14813B4881L3029q721k0799j2620r631K645J7955j8742k4040K1625l5928j0255
$$ 24881 57910 49189 28390 15770 6139 8784 26739 7997 -16043 5582 -30346 -40601
14801d0601K951J1593k9306r844M6044K9988l736r023j5462j2697k817l196r466
$$ -40601 -37650 -26057 -55363 -65207 -19163 10825 7089 -1934 -17396 -30093 -32910 -36106 -45572
14788d5572J7442J2485o358R288K397J9148J179K240l206J8084m870j9088J8j4753
$$ -45572 -28130 -15645 -22003 -12715 -10318 8830 10009 12249 9043 27127 22257 3169 3187 -11566
14774a1566R392O938P380p242j4592r180J4723k632k0272J296K964J1238M798
$$ -11566 -2174 4764 12144 4902 -9690 -18870 -4147 -6779 -27051 -25755 -22791 -11553 -6755
14761f755O287p347l7614J563J9678J7038L5178J5300K702J776k9866j9816r710
$$ -6755 -468 -7815 -45429 -43866 -24188 -7150 28028 43328 46030 47806 17940 -1876 -11586
14748a1586k8438P869O446K2805K193k1691k0956R766K0693K0553K7712J7082
$$ -11586 -40024 -32155 -25709 -2904 -711 -22402 -43358 -33592 -12899 7654 35366 52448
14736E2448k5318j6673M4878K1452l0476Q440j7181l825p69K1265o952n56n447
$$ 52448 27130 10457 55335 76787 46311 54751 37570 33745 32976 54241 47289 46733 41286
14723D1286l2975l7237j878J7045J3824l51J5397L522k1893j95j1892m861K0732
$$ 41286 8311 -28926 -30804 -13759 65 -286 15111 18633 -3260 -3455 -15347 -20208 524
14710E24m8k747j7351j6943K8336J1633J72P1R499j063O383K5595j8281l3174
$$ 524 476 -2271 -19622 -36565 -8229 3404 3576 3647 13146 12083 18466 44061 25780 -7394
14696g394j5597n577j1790k707K687J7713N36m606r101n832K8184J5309M306n267
$$ -7394 -22991 -28568 -40358 -43065 -40378 -22665 -22129 -26735 -35836 -41668 -13484 1825 6131 864
14682H64k4123J2489K0309J7525J4178k9581k4581M064K2544j8067j4358l825
$$ 864 -23259 -10770 9539 27064 41242 11661 -12920 -8856 13688 -4379 -18737 -22562
14670b2562N708p217j4035J1576L415r864J1458J2558J0799J0390J3804J706r636
$$ -22562 -16854 -24071 -38106 -26530 -23115 -32979 -21521 -8963 1836 12226 26030 27736 18100
14657A8100j6774k870p730O25k6941O476J7438j2161j2404j5946J4725K0273J7701
$$ 18100 1326 -1544 -9274 -8649 -35590 -29114 -11676 -23837 -36241 -52187 -37462 -17189 512
14644E12j1993J970K5656M245R731j2724k9099k523k4028k487N844J4068R260
$$ 512 -11481 -9511 16145 20390 30121 17397 -11702 -14225 -38253 -40740 -34896 -20828 -11568
14631a1568j9611P173k1455J9716M5344K0467k5313n508j1089j374L2924p56j2280
$$ -11568 -31179 -24006 -45461 -25745 19599 40066 14753 9245 -1844 -3218 29706 28950 16670
14618A6670o001k3742j1140L202J2944k700Q95N161r349n609j4197r511J4993
$$ 16670 10669 -13073 -24213 -21011 -8067 -10767 -9872 -4711 -14060 -19669 -33866 -43377 -28384
14605b8384K713p983K9007L7102k142j2503j5162O401J3508L5118L510k349l8811
$$ -28384 -25671 -33654 -4647 32455 30313 17810 2648 9049 22557 57675 61185 58836 20025
14592B0025M830L160j7815m4559O40J7541j5509Q119J7706J0067q919l913k002
$$ 20025 24855 28015 10200 -34359 -33719 -16178 -31687 -23568 -5862 4205 -4714 -8627 -10629
14579a0629N501m335l3447l328K6421K5715p061k2926J3833L5268j1848J117O093
$$ -10629 -5128 -9463 -42910 -46238 -19817 5898 -1163 -24089 -10256 25012 13164 14281 20374
14566B0374j1020j1491p293j4234R015J3419M109J9996L054m8806j7933J8326
$$ 20374 9354 -2137 -9430 -23664 -14649 -1230 2879 22875 25929 -22877 -40810 -22484
14554b2484K7588L3152L686l1635l3049K746R26j7543J7582j6672M094J3782J3546
$$ -22484 5104 38256 41942 10307 -22742 -19996 -19070 -36613 -19031 -35703 -31609 -17827 -4281
14541d281J0502K5197j9034m4689m445K0834N6650J3041j4268k0295j7846k392
$$ -4281 6221 31418 12384 -32305 -36750 -15916 40734 53775 39507 19212 1366 -1026
14529a026J4736J2408K2015J5541p8l8533k0712n10l031j8693l5280j4121J5317
$$ -1026 13710 26118 48133 63674 63596 25063 4351 3841 810 -17883 -53163 -67284 -51967
14516e1967J8244K6790m891k4859K9183K3726k6200o202j3141J8129J1517q708
$$ -51967 -33723 -6933 -11824 -36683 -7500 16226 -9974 -16176 -29317 -11188 329 -8379
14504h379j526J434K7810m968j90L9j1709r543l3971j0615m823M406K1558K6202
$$ -8379 -9905 -8471 19339 14371 14181 14220 2511 -7032 -41003 -51618 -56441 -52035 -30477 -4275
14490d275N734J635K5279M612l1222j3037M678L1542Q440k1426k3593l5689J2616
$$ -4275 1459 3094 28373 32985 1763 -11274 -6596 24946 33386 11960 -11633 -47322 -34706
14477c4706N5573M9013j9097j0218j5266L531N377j4846J334J0047q767k3176
$$ -34706 20867 69880 50783 40565 25299 28830 34207 19361 20695 30742 21975 -1201
14465a201N678o324l462J7871K7489P72m957k0780k0881j2883M9760J1878k1132
$$ -1201 4477 -1847 -5309 12562 40051 40823 35866 15086 -5795 -18678 31082 42960 21828
14452B1828m045j677k6864J0669j7324j3115K7555j4614j3549K378J2573q705
$$ 21828 17783 16106 -10758 -89 -17413 -30528 -2973 -17587 -31136 -28758 -16185 -24890
14440b4890j2438J4565K4515q153k903L65K291K5103O978o972K1559K695j3438
$$ -24890 -37328 -22763 1752 -6401 -9304 -8939 -6648 18455 25433 18461 40020 42715 29277
14427B9277J1245k4758p581M914j2827R384L073J874J7280j9579J6477L993l7921
$$ 29277 40522 15764 8183 13097 270 9654 12727 14601 31881 12302 28779 32772 -5149
14414e149j476K0902J5499P510o694j9320J5L863K975J4240l071K3333K7j7845
$$ -5149 -6625 14277 29776 37286 30592 11272 11287 15150 18125 32365 29294 52627 52654 34809
14400C4809j0828K481P311j6551m280n176M811M587P668j5165k665j5106k8763
$$ 34809 23981 26462 33773 17222 12942 7766 12577 17164 24832 9667 7002 -8104 -36867
14387c6867J3683n485j5431N83N469M1024R995n09J0480R519J9638j6188k2493
$$ -36867 -23184 -28669 -44100 -43517 -38048 2976 12971 12462 22942 32461 52099 35911 13418
14374A3418j2209J7199J3678Q132p879n800j2293n462K4908L0043j8265j9216
$$ 13418 1209 18408 32086 40218 32339 26539 14246 8784 33692 63735 45470 26254
14362B6254Q47j0125m186L8398j7834l3767n848k0623L2466M1951J3335l2899
$$ 26254 27101 16976 12790 51188 33354 -413 -6261 -26884 5582 47533 60868 27969
14350B7969k3677N577Q191J3422l401J4937K5144j846j5539n8944k3460L072j6147
$$ 27969 4292 9869 18060 31482 28081 43018 68162 66316 50777 -8167 -31627 -28555 -44702
14337d4702j2128P894J9255J0561N585j1062K1601q77M702q59j3568K165L9504
$$ -44702 -56830 -48936 -29681 -19120 -13535 -24597 -2996 -3873 829 -30 -13598 -11433 28071
14324B8071K2106J2235l0037k4301r764l293l2048j4992K3046J6645J5491M296
$$ 28071 50177 62412 32375 8074 -1690 -4983 -37031 -52023 -28977 -12332 3159 7455
14312G455Q161K311J3227L1757j0012l2598K7112j9446k1518K0245j1918k573
$$ 7455 15616 17927 31154 62911 52899 20301 47413 27967 6449 26694 14776 12203
14300A2203o890j2927K1545J7855L1684p581l0046p447J0228M676k6715m776p574
$$ 12203 5313 -7614 13931 31786 63470 55889 25843 18396 28624 33300 6585 1809 -5765
14287e765J7663l91J5761L0287j794j2242j707j6262l807J0888j0124k158L3371
$$ -5765 11898 11507 27268 57555 55761 43519 41812 25550 21743 32631 22507 20349 53720
14274E3720l099j7741K737N173j2099k0268J4995J93k4179l340J3231r073k4230
$$ 53720 50621 32880 35617 40790 28691 8423 23418 23611 -568 -3908 9323 250 -23980
14261b3980O351p496N647R296N134O215r879k8005n726O423K0634J1323j7737
$$ -23980 -17629 -25125 -19478 -10182 -5048 1167 -8712 -36717 -42443 -36020 -15386 -4063 -21800
14248b1800j698N612j1647N563M2711K3131K816j882R290o01k3423k4332m22n913
$$ -21800 -23498 -17886 -29533 -23970 18741 41872 44688 42806 52096 51495 28072 3740 3318 -2595
14234b595O843K230p012k3496o220j6610J6107J3364J8759J5583K298J074M0678
$$ -2595 4248 6478 -534 -24030 -30250 -46860 -30753 -17389 1370 16953 19251 20325 61003
14221F1003o261j8430R539m0668j6296k5712k3477J5067K2022P339L1511K4778
$$ 61003 54742 36312 45851 5183 -11113 -36825 -60302 -45235 -23213 -15874 15637 40415
14209D0415k9888l063N746r747J8414J2674k7093l4928K1913n783J1821p141j8187
$$ 40415 10527 7464 13210 3463 21877 34551 7458 -27470 -5557 -11340 481 -6660 -24847
14196b4847P481J9388l7017r238R204M0049R7n092P464K3906l264K2585j9076
$$ -24847 -17366 2022 -34995 -44233 -35029 5020 5117 25 7489 31395 28131 50716 31640
14183C1640o953r103J6911K1737P321K541n629m7235n477K2j4370O985k683K2617
$$ 31640 24687 15584 32495 54232 61553 64094 58465 11230 5753 5775 -8595 -1610 -4293 18324
14169A8324K5182K5299L2040k2406r787k8591j9499j8618p792M072J4188K077
$$ 18324 43506 68805 100845 78439 68652 40061 20562 1944 -5848 -1776 12412 14489
14157A4489m932J1134K6347K7261j3192l0821P467J0508j905j2819O110J4535
$$ 14489 9557 20691 47038 74299 61107 30286 37753 48261 46356 33537 39647 54182
14145E4182j029p662j8244j0298J1210J1847J3527J5218j4343R641N362j7239
$$ 54182 53153 45491 27247 16949 28159 40006 53533 68751 54408 64049 69411 52172
14133E2172J823o218p157O054J9165j3901k7238j0941J3043j1109j5248Q90R139
$$ 52172 53995 47777 40620 46674 65839 51938 24700 13759 26802 15693 445 1335 10474
14120A0474J8323P257L043l162R414J0515J2586P312p283m645n363j6037k5619
$$ 10474 28797 36054 39097 35935 45349 55864 68450 75762 68479 63834 58471 42434 16815
14107A6815j86K6315M4521J2619p62M5041J3186L919K4919r583p34J5861O2018
$$ 16815 16629 42944 87465 100084 99322 144363 157549 161468 186387 176804 176070 191931 253949
14094B53949P2103N2231Q4577J36375J89596L30716M22828M89324M25861J10767
$$ 253949 326052 378283 462860 599235 788831 1119547 1542375 2031699 2457560 2568327
14084B568327k71589m95497m70321l51262k48823j66122j22039q5218n9967m4283
$$ 2568327 2296738 1801241 1330920 979658 730835 564713 442674 357456 297489 253206
14074B53206l9962M524l1109L815j8449l3619n9309j9736J6893P289l0197j6091
$$ 253206 213244 217768 186659 190474 172025 138406 79097 59361 76254 83543 53346 37255
14062C7255J1241j3637j5365M2929L2462R795l8408m584j3968J883Q87l0426J4851
$$ 37255 48496 34859 19494 62423 94885 104680 66272 61688 47720 49603 50490 20064 34915
14049C4915r989M9J6368J8833J7119O162j0624J410j4795k6487J9240j94k8687
$$ 34915 24926 24975 41343 60176 77295 83457 72833 74243 59448 32961 52201 52007 23320
14036B3320R72k3374K3433J6853K621k2151j2447k2526K355J1986p500J6941J631
$$ 23320 24292 918 24351 41204 43825 21674 9227 -13299 -10944 1042 -6458 10483 12114
14023A2114P472K8622P455k5645K887K1641K339M960k4517l6366k4970k360J0232
$$ 12114 19586 48208 55663 30018 32905 54546 56885 61845 37328 962 -24008 -26368 -16136
14010a6136o92O786J4230m377k8499M183K0878J8456j4391j3370o569J3732K0356
$$ -16136 -16828 -10042 4188 -189 -28688 -24505 -3627 14829 438 -12932 -19501 -5769 14587
13997A4587j3597j5028J1385N485K1701k8103o494J3790j389m9849n494K5802
$$ 14587 990 -14038 -2653 2832 24533 -3570 -10064 3726 2337 -47512 -53006 -27204
13985b7204K3165J0292K1731K3340M9879K3815k6430j4201N834m69k6883M151
$$ -27204 -4039 6253 27984 51324 101203 125018 98588 84387 90221 89752 62869 67020
13973F7020J5221M035j9444j1479j2804j1951J1628L4928q059j4735k9493q648
$$ 67020 82241 86276 66832 55353 42549 30598 42226 77154 69095 54360 24867 16219
13961A6219K126K7652P635k4377k6487L8377P434l0668m0367n6959n9108o9331
$$ 16219 18345 45997 53632 29255 2768 41145 48579 17911 -22456 -79415 -138523 -207854
13949b07854k4211j3370K4000N9628P5670L7387J6286J1346p594O295L1123l010
$$ -207854 -232065 -245435 -221435 -161807 -86137 -48750 -32464 -21118 -28712 -22417 8706 5696
13937E696K3735Q202o047m615j6529M868J6277j4899J7184J0908j384K0236J378
$$ 5696 29431 37633 31586 26971 10442 15310 31587 16688 33872 44780 43396 63632 65010
13924F5010n72J7922J8768j753j5479l7267m0439J2929L5122J1012k12l163J6609
$$ 65010 64438 82360 101128 99375 83896 46629 6190 19119 54241 65253 65041 61878 78487
13911G8487K327J2836m05o978k2586K055K8390K47n125P776k459L7903N6245R882
$$ 78487 80814 93650 93245 86267 63681 65736 94126 94373 89248 97024 94565 132468 188713 198595
13897A98595K3963L8146L8774O2189K8165m2370k7711l0124j3320m2007l5060
$$ 198595 222558 260704 299478 361667 389832 347462 319751 289627 276307 234300 199240
13886A99240l7572k4794J1539J2129l1663l4475J5257K1754l1038J45J0991j4994
$$ 199240 161668 136874 148413 160542 128879 94404 109661 131415 100377 100522 111513 96519
13874I6519Q791k2646l9109M783o678M282L7302M270l581K50J8416j7110k9458
$$ 96519 105310 82664 43555 48338 41660 45942 83244 87514 83933 84183 102599 85489 56031
13861E6031K8484K0827q343j1408K2980j4446R974n430j1140m10N108J1734J2116
$$ 56031 84515 105342 96999 85591 108571 94125 104099 98669 87529 87119 92227 103961 116077
13848A16077n505K2651NM176j6015l9346J1552K3635J0738K5006R065j890J0107
$$ 116077 110572 133223 133228 137404 121389 82043 93595 117230 127968 152974 162039 160149 170256
13835A70256R700j281n015l1369k4590m3182j8767o730J1033Q897L280r725j2296
$$ 170256 179956 178675 173660 142291 117701 74519 55752 49022 60055 68952 72232 62507 50211
13822E0211j7183k986L2357L0078l470k2640J76J3422K9941K6587J5144J3342
$$ 50211 33028 30042 62399 92477 89007 66367 66543 79965 109906 136493 151637 164979
13810A64979l0734k0514k6188J6903K0274L609m284J0486K7177K395j9542n061
$$ 164979 134245 113731 87543 104446 124720 128329 124045 134531 161708 164103 144561 139500
13798A39500j0033J1647j7690k7966M1646O5451N5236N0194J7282r187n5062k8072
$$ 139500 129467 141114 123424 95458 137104 202555 257791 307985 325267 316080 261018 232946
13786B32946m316j1807j3488N616l4251m0140j634P892K4017K2861Q405r561n062
$$ 232946 228630 216823 203335 208951 174700 134560 132926 140818 164835 187696 196101 186540 181478
13773A81478L2491L3538p966N387L0688P9098J59023J82283Q8219K4281q1512
$$ 181478 213969 247507 239541 244928 275616 354714 513737 696020 784239 808520 727008
13762G27008p3602p1676p2004o3618n6222j5451o036K639J7705l858n799K0729
$$ 727008 653406 581730 509726 446108 389886 374435 368399 371038 388743 384885 379086 399815
13750C99815j3616J1431M7989R69k8771Q946M3743K4839J007k7117l055J3864
$$ 399815 386199 397630 445619 446588 417817 426763 470506 495345 496352 469235 466180 480044
13738D80044K5278j7889m3325p909j0478J195J127J3888J1985K1577J7710K7203
$$ 480044 505322 487433 444108 436199 425721 426916 428043 441931 453916 475493 493203 520406
13726E20406L870L4410K6473j7361m658k0251L545K8582M7633N7502M6623J3511
$$ 520406 524276 558686 585159 567798 563140 542889 546434 575016 622649 680151 726774 740285
13714G40285p453L839L7965J5473P490J2352J5115M0118M0223M0463L6753M0518
$$ 740285 732832 736671 774636 790109 797599 809951 825066 865184 905407 945870 982623 1023141
13702A023141M9077L0011P629M368K3876K0603R440J3035l038K9079L2588J9557
$$ 1023141 1072218 1102229 1109858 1114226 1138102 1158705 1168145 1181180 1178142 1207221 1239809 1259366
13690A259366N8216M5566O4372K5322N2787Q6743J03699R2353R0732P4749J02108
$$ 1259366 1317582 1363148 1427520 1452842 1505629 1592372 1696071 1788424 1879156 1953905 2056013
13679B056013J10894J26475J30897J16028J06674J21165J59308J32660J57597
$$ 2056013 2166907 2293382 2424279 2540307 2646981 2768146 2927454 3060114 3217711
13670C217711K19793L19451L17603L01791L02107L30764L89930M08146M56620
$$ 3217711 3437504 3756955 4074558 4376349 4678456 5009220 5399150 5807296 6263916
13661F263916M84442N49072N82641P44361R46899J145873J375814J656724J998973
$$ 6263916 6748358 7297430 7880071 8624432 9571331 10717204 12093018 13749742 15748715
13652A5748715K398794K927072L540141M520765O043513Q164859J0988248J4916340
$$ 15748715 18147509 21074581 24614722 29135487 35179000 43343859 54332107 69248447
13644F9248447K0865490L0932275M8245529P5810861J08332281J15285248O6126107
$$ 69248447 90113937 121046212 169291741 245102602 353434883 468720131 534846238
13637E34846238j8325192r5080587j12222728q8297801o1514435m1702372k8551900
$$ 534846238 516521046 421440459 309217731 220919930 159405495 117703123 89151223
13630H9151223k0191803j4689073j0834603q103114o100047m686106l594266k752476
$$ 89151223 68959420 54270347 43435744 35332630 29232583 24546477 20952211 18199735
13622A8199735k188358j772958j474505j264367j141749j039981r29567p81700
$$ 18199735 16011377 14238419 12763914 11499547 10357798 9317817 8388250 7606550
13614G606550o51347n81832m99975m39338m25273l38848k65928k38770j92107
$$ 7606550 6955203 6373371 5873396 5434058 5008785 4669937 4404009 4165239 3973132
13605C973132k03924k09088j99196j90517j74656j64577j38315j17520j05644
$$ 3973132 3769208 3560120 3360924 3170407 2995751 2831174 2692859 2575339 2469695
13596B469695j38512p7685p1824q9961r8346p0664p8436n6393o3261p3485n6037
$$ 2469695 2331183 2253498 2181674 2091713 1993367 1922703 1844267 1787874 1724613 1651128 1595091
13585A595091p6744o4488q4273p5684o6187n5856p0149n2889j9223l4231l7905
$$ 1595091 1518347 1453859 1369586 1293902 1227715 1171859 1101710 1048821 1029598 995367 957462
13574I57462m3950l8024m7644j2877j1784l271O105J053l0573m5535k5083Q32
$$ 957462 913512 875488 827844 814967 803183 799912 806017 807070 776497 730962 705879 706711
13562G06711p093l3976m6553j8506o542K8945l722j5553k9925j1760k865o938
$$ 706711 699618 665642 619089 600583 594041 622986 619264 603711 573786 562026 559161 552223
13550E52223j3639o39q925k4778M507J9355L1686j3652k0357k2490n3194k4910
$$ 552223 538584 537945 529020 504242 508749 528104 559790 546138 525781 503291 450097 425187
13538D25187o1731o2280j8928Q180k1154l1959M972M0439K8801j4020J4493K912
$$ 425187 363456 301176 282248 290428 269274 237315 242287 282726 311527 297507 312000 314912
13526C14912L247J854K980R271l9J131l5567P508J2565j3187k6865l1635k2959
$$ 314912 318159 320013 322993 332264 332225 333356 297789 305297 317862 304675 277810 246175 223216
13513B23216n1077l0774l4572j0183K33M5088N7288L5792P931j9314J1779j0352
$$ 223216 172139 141365 106793 96610 96843 141931 199219 235011 242942 223628 235407 225055
13501B25055k8438N519J4527j856P532j7784J9816k6105j0392N54m5060k9477
$$ 225055 196617 202136 216663 214807 222339 204555 224371 198266 187874 188428 143368 113891
13489A13891n232L439n3849o3320M381O125M3321Q9857N9338J4807j5345j7493
$$ 113891 108659 112098 58249 -5071 -690 5435 48756 138613 197951 212758 197413 179920
13477A79920J7467L9026R502j0603l9277l0035R724N246r684k3638r192J811M3110
$$ 179920 197387 236413 245915 235312 196035 166000 175724 180970 171286 147648 138456 140267 183377
13464A83377K3993J994Q842n428j1858p279n474j9911k7738R843J7985J7512Q535
$$ 183377 207370 209364 218206 212778 200920 193641 188167 168256 140518 150361 168346 185858 194393
13451A94393j9074p712l605j1868N134J0229k7042k825k8491l0240j9348j5765
$$ 194393 175319 167607 164002 152134 157268 167497 140455 137630 109139 78899 59551 43786
13439D3786P746K2911K3976K873l0545j0680L671p745r031k6991N162K6752K0923
$$ 43786 51532 74443 98419 101292 70747 60067 63738 55993 46962 19971 25133 51885 72808
13426G2808K4505J8750o549j7216j9024J9274j5897j8007J3137L2617L7955L2842
$$ 72808 97313 116063 109514 92298 73274 92548 76651 58644 71781 104398 142353 175195
13414A75195j389j8654j7138k6118o007K4494L1756o554P861j789o797j6990k2394
$$ 175195 173806 155152 138014 111896 105889 130383 162139 155585 163446 161657 154860 137870 115476
13401A15476n643K139j5980k2341j5057p366M0001Q63j053M027p768K0114K470
$$ 115476 109833 111972 95992 73651 58594 51228 91229 92092 91039 95066 87298 107412 109882
13388A09882O104N775l445M3636J7637j4344l8368k266k2933j8787k8163r172
$$ 109882 115986 121761 118316 161952 179589 165245 126877 124611 101678 82891 54728 45556
13376D5556k93Q035l438j8076r401K6298J293m385M286m331J5177J5370j420M575
$$ 45556 45263 53298 49860 31784 22383 48681 49974 45589 49875 45544 60721 76091 74671 79246
13362G9246K7436j2016q652J1525n902k2632j1834J1166J0491j6605P475j543
$$ 79246 106682 94666 86014 97539 91637 69005 57171 68337 78828 62223 69698 68155
13350F8155k7187q943Q840J8323J857J516j3274P168k3487j4729J896j0653K2152
$$ 68155 40968 32025 40865 59188 61045 62561 49287 56455 32968 18239 20135 9482 31634
13337C1634K092j0787M1848J9173P764J6601J6853L4989R3906O7454L6821l0853
$$ 31634 33726 22939 64787 83960 91724 108325 125178 160167 254073 321527 358348 327495
13325C27495p4101n5397m0804n1507j2210k8594k5161M276l1133M577K1568l1445
$$ 327495 253394 197997 157193 105686 93476 64882 39721 43997 12864 17441 39009 7564
13313G564m467K5100k9324r061J5259L0076L2199k9378O779K2144k7017j9315
$$ 7564 3097 28197 -1127 -10188 5071 35147 67346 37968 44747 66891 39874 20559
13301B0559r025p392R782l8274J571Q984j5467j4074n331J4032N5985L5678J8530
$$ 20559 11534 4142 13924 -24350 -22779 -13795 -29262 -43336 -48667 -34635 21350 57028 75558
13288G5558L1184j4855k9029l942K4884R179N638k4230k3699k5141J5811N406
$$ 75558 106742 91887 62858 58916 83800 92979 98617 74387 50688 25547 41358 46764
13276D6764l1592m902J6058P19j6113j2934J85J4506j4319J4152l61j5595j933
$$ 46764 15172 10270 26328 27047 10934 -2000 -1815 12691 -1628 12524 12163 -3432 -5365
13263e365M7275J2309j3722J8485R942k0473L249m022N163k0765j3184J8610l045
$$ -5365 41910 54219 40497 58982 68924 48451 51700 47678 52841 32076 18892 37502 34457
13250C4457o615p367J615K4339P285p947K4466K1490L2304J4382j8251k9114m1733
$$ 34457 27842 20475 22090 46429 53714 45767 70233 91723 124027 138409 120158 91044 49311
13237D9311J071J7823K3458n377j6056L840J2196K729j6496k0667K4354J6964
$$ 49311 50382 68205 91663 86286 70230 74070 86266 88995 72499 51832 76186 93150
13225I3150j9736l4888j5089J1646J311J730j5839J0286N533m061l945L7233r950
$$ 93150 73414 38526 23437 35083 36394 38124 22285 32571 38104 34043 30098 67331 57381
13212E7381n539J0370l570n555K5950j0075k0263M995j5047L0509M8742Q323k2778
$$ 57381 51842 62212 58642 53087 79037 68962 48699 53694 38647 69156 117898 126221 103443
13199A03443j7884L079K9110L0972J7767M4148M1903N5795O1393N5824J25095
$$ 103443 85559 88638 117748 148720 166487 210635 252538 308333 369726 425550 550645
13188E50645K13413K62224L89463M81950M56528J95006j74668m27834m80740l56870
$$ 550645 764058 1026282 1415745 1897695 2354223 2549229 2374561 1946727 1465987 1109117
13178A109117k63652k08086j54673j08560r4615q3270j4249k0586l7266K515r558
$$ 1109117 845465 637379 482706 374146 279531 196261 182012 161426 124160 126675 117117
13167A17117k1301p653j7526l685p453r477K9666J885j6957j1925J5332M468k4988
$$ 117117 95816 88163 70637 66952 59499 50022 79688 81573 64616 52691 68023 72491 47503
13154D7503p761M565O204J0200J905l800k302J24J2775j1540K8656k7727k4889
$$ 47503 39742 44307 50511 60711 62616 58816 56514 56638 69413 57873 86529 58802 33913
13141C3913P626J2744M471Q501n437j6121K172J4705n7420l243M5319K9227j9612
$$ 33913 41539 54283 58754 67255 61818 45697 47869 62574 5154 1911 47230 76457 56845
13128E6845k9940l7591j4559J6011m025J521R208J0085J7752J4854j148l720j3785
$$ 56845 26905 -10686 -25245 -9234 -13259 -11738 -2530 7555 25307 40161 39013 35293 21508
13115B1508l745k747j2636l490N90l008J6756J6906j389l839l3107l42n634P416
$$ 21508 17763 15016 2380 -1110 -520 -3528 13228 30134 28745 24906 -8201 -8543 -14177 -6761
13101f761J4945K3566M994j6722j5852J796J3436J4693L1966N832j1200j4670
$$ -6761 8184 31750 36744 20022 4170 5966 19402 34095 66061 71893 60693 46023
13089D6023j2051j6199J7343q945N263p258l9092P423M0238Q751j9743j6389k1783
$$ 46023 33972 17773 35116 26171 31434 24176 -14916 -7493 32745 41496 21753 5364 -16419
13076a6419r937p346J9133P18l84L669L3706J7385M122K602k247P35k2356K4287
$$ -16419 -26356 -33702 -14569 -13851 -14235 -10566 23140 40525 44647 47249 45002 45737 23381 47668
13062D7668Q579N56o484j7535j286k147k4767n12J3048p277Q529M1315N461k6740
$$ 47668 56247 56803 50319 32784 31498 29351 4584 4072 17120 9843 18372 59687 65148 38408
13048C8408r802l590l015m328R892L086k3511k0792q933M322J1520P633M2145
$$ 38408 28606 25016 22001 17673 27565 30651 7140 -13652 -22585 -18263 -6743 890 43035
13035D3035O815j0049K2899q332k1883J0496k991k1660n048q584o284r135K8084
$$ 43035 49850 39801 62700 54368 32485 42981 39990 18330 13282 4698 -1586 -10721 17363
13022A7363J4090l3973j9474R450q167J645Q266q708N601J0087N327Q732J555
$$ 17363 31453 -2520 -21994 -12544 -20711 -19066 -10800 -19508 -13907 -3820 1507 10239 11794
13009A1794m768n308n968J117J5690L026j6336m0638k0773K4726J6784j7298j834
$$ 11794 7026 1718 -4250 -3133 12557 15583 -753 -41391 -62164 -37438 -20654 -37952 -39786
12996c9786m005K196K1449J0500J8993J6205J267j5791n011k3024j97j0173L4444
$$ -39786 -43791 -41595 -20146 -9646 9347 25552 26819 11028 6017 -17007 -17204 -27377 7067
12983G067j9369Q966M0504M908j3183r204k899J8886J3518M782j967J0725j0954
$$ 7067 -12302 -3336 37168 42076 28893 19689 16790 35676 49194 53976 52009 62734 51780
12970E1780K0820N651K550j3761k1485k2522n1296m682L5916o007K0348K5456
$$ 51780 72600 78251 80801 67040 45555 23033 -28263 -32945 2971 -3036 17312 42768
12958D2768Q022m971k4304k2961K309J4314n321P241L2381M631l4547m863j808
$$ 42768 50790 45819 21515 -1446 863 15177 9856 17097 49478 54109 19562 14699 12891
12945A2891j6577j6568R16O444N5482K7214j0213k4985j1911k15j3182q293n20
$$ 12891 -3686 -20254 -19338 -12894 42588 69802 59589 34604 22693 22478 9296 1003 483
12932D83J973P002q910R266J8494K2486j3270k9913r41J6810L200M734l0303p097
$$ 483 2456 9458 548 9814 28308 50794 37524 7611 6670 23480 26680 31414 1111 -5986
12918e986j3582L765K7893Q036j0933P874O174J2647P75l851J395J1213j3398
$$ -5986 -19568 -15803 12090 20126 9193 17067 23241 35888 36663 32812 34207 45420 32022
12905C2022L5959n2064p2708M1393M5846M579o01L647N799P329j2317o002J9410
$$ 32022 67981 15917 -56791 -15398 30448 35027 34426 38073 43872 51201 38884 32882 52292
12892E2292K3733k3653J0059j5090j3599R981j6457j6186k4870J7632K6150J810
$$ 52292 76025 52372 62431 47341 33742 43723 27266 11080 -13790 3842 29992 31802
12880C1802j0554j7628n985L040L498j0884K860J8019R212j6150k722j975J3857
$$ 31802 21248 3620 -2365 675 4173 -6711 -3851 14168 23380 7230 4508 2533 16390
12867A6390J5240j3343k6935m322k629j314J4343j0268L653L693M2506J6879J5502
$$ 16390 31630 18287 -8648 -12970 -15599 -16913 -2570 -12838 -9185 -5492 37014 53893 69395
12854F9395j2028l0444K038N029r975j7421M768k6863m753j1183J56J9100j3692
$$ 69395 57367 26923 28961 33990 24015 6594 11362 -15501 -20254 -31437 -31281 -12181 -25873
12841b5873R163J830k3438K4460L6377j0674J7643j975o948O71J2811k980k2587
$$ -25873 -16710 -14880 -38318 -13858 22519 11845 29488 27513 20565 21236 34047 31067 8480
12828H480l694K797M849m361P153J7525k9465k6089J9067M0994J0226p560k749
$$ 8480 4786 7583 12432 8071 15224 32749 3284 -22805 -3738 37256 47482 39922 37173
12815C7173o900m803n994L0417j3184n752K419K1310o196l8767k4150J6595J4922
$$ 37173 30273 25470 19476 49893 36709 30957 33376 54686 48490 9723 -14427 2168 17090
12802A7090r127M300J7979l547J390j623M050J2433j5306q475j5621j4432P737
$$ 17090 7963 12263 30242 26695 28085 26462 30512 42945 27639 19164 3543 -10889 -3152
12789c152L3879j5928m4921R655J9034k1229Q050L2007N976j769N685k36p426
$$ -3152 30727 14799 -30122 -20467 -1433 -22662 -14612 17395 23371 21602 27287 27051 19625
12776A9625l241J8441M584o675L3407R383k1241m56k115j4772o009k6950n601
$$ 19625 16384 34825 39409 32734 66141 75524 54283 53827 51712 36940 30931 3981 -1620
12763a620K1320n447o877M157J2217K769n857P899K2061j8955k68p23L0006M579
$$ -1620 19700 14253 7376 11533 23750 26519 20662 28561 50622 31667 31399 30676 60682 65261
12749F5261l2609k1972N947J7418l129K6124j6061j6398k8453l1897J5327J7342
$$ 65261 32652 10680 16627 34045 30916 57040 40979 24581 -3872 -35769 -20442 -3100
12737c100M09m354J6917l768l605k802l176K0198j0312J177m722j1019p575L928
$$ -3100 -2691 -7045 9872 6104 2499 -303 -3479 16719 6407 7584 2862 -8157 -15732 -11804
12723a1804K0385J8088P323k108K937L740K2014p143k8029j2763J7694K015K4814
$$ -11804 8581 26669 33992 31884 34821 38561 60575 53432 25403 12640 30334 32349 57163
12710E7163p381m8027K3823P044J475j6579m282K8363l702k1548r602J0866J6105
$$ 57163 49782 1755 25578 32622 34097 17518 13236 41599 37897 16349 6747 17613 33718
12697C3718o346j3345k371j2563O463J3421m514o015j1327J099Q622Q180j8860
$$ 33718 27372 14027 11656 -907 5556 18977 14463 8448 -2879 -1780 6842 15022 -3838
12684c838K364K3529r484j0674K1284K3775m8589j3579J0924J2645N157j1935
$$ -3838 -1474 22055 12571 1897 23181 46956 -1633 -15212 -4288 8357 13514 1579
12672A579o792P031k1699L5517M6008J1258k52j189j4113R846L3362J7110k001
$$ 1579 -5213 1818 -19881 15636 61644 72902 72650 71461 57348 67194 100556 117666 115665
12659A15665k1117L709l2486n4018k8012k3829m657J388R008J5732M3398J1362
$$ 115665 94548 98257 65771 11753 -16259 -40088 -44745 -43357 -34349 -18617 24781 36143
12647C6143j3033j200j1395J2550J0762L910J3638j1662k3706N989j3635q635
$$ 36143 23110 21910 10515 23065 33827 37737 51375 39713 16007 21996 8361 -274
12635b74q918j654M0563p99k942J4407Q944k3778j1940j4532j725K3308J56K741
$$ -274 -9192 -10846 29717 28918 25976 40383 49327 25549 13609 -923 -2648 20660 20816 23557
12621B3557L225l6723k9652L2263K5195K3194N667j6703l0179k9581P16K3726
$$ 23557 26782 -9941 -39593 -7330 17865 41059 46726 30023 -156 -29737 -29021 -5295
12609e295K7978j222N245N411l0574J9241j8586K9676J5883J1811j8167l1198
$$ -5295 22683 21461 26706 32117 1543 20784 2198 31874 47757 59568 41401 10203
12597A0203J2800n889l09l6921j0814R456K9596K552J4318L3201J2190j6204j8885
$$ 10203 23003 17114 16805 -20116 -30930 -21474 8122 10674 24992 58193 70383 54179 35294
12584C5294q974o911K2481j7100l2600m765K1613J0602m063M323N558J4618K1889
$$ 35294 26320 19409 41890 24790 -7810 -12575 9038 19640 15577 19900 25458 40076 61965
12571F1965j7120N905q658J5234n040j5560n079r983k8457M61J2993R369K6576
$$ 61965 44845 50750 42092 57326 52286 36726 31647 21664 -6793 -6332 6661 16030 42606
12558D2606j50O070l069O356J1535J4828q773Q79K938p718K2804j2874j8292j8765
$$ 42606 42456 48526 45457 51813 63348 78176 69403 70282 73220 65502 88306 75432 57140 38375
12544C8375J5084o952m502J3195J1085k4267l7472m284K5391o140j3702J5327
$$ 38375 53459 46507 42005 55200 66285 42018 4546 262 25653 19513 5811 21138
12532B1138N326L5923K806j080k7148n326k567p555l527m551j1707K2439K2308
$$ 21138 26464 62387 65193 64113 36965 31639 29072 21517 17990 13439 1732 24171 46479
12519D6479k3313j2826Q916M058O295K258O333j4008L256Q687l568j6780Q290
$$ 46479 23166 10340 19256 23314 29609 31867 38200 24192 27448 36135 32567 15787 24077
12506B4077m72J5903L2466K519l1009R215J7605j6038m5036q316K1018Q470J4923
$$ 24077 23605 39508 71974 74493 43484 52699 70304 54266 9230 914 21932 30402 45325
12493D5325l9252j2443J9115K0737J7443q44O267k988j1991k3837k3260j6604
$$ 45325 6073 -6370 12745 33482 50925 50081 56348 53360 41369 17532 -5728 -22332
12481b2332K049n359J3669J812J9676O97K91L3668J6341R25j1312p58j1634l8667
$$ -22332 -20283 -25642 -11973 -10161 9515 10212 10503 44171 60512 61437 50125 49367 37733 -934
12467i34j5624j8013L5284J7350L0246J285p698j5156r294J1145K7098k5862k9957
$$ -934 -16558 -34571 713 18063 48309 49594 41896 26740 17446 28591 55689 29827 -130
12454a30J2069K079J9475K1167r04J8217J5125l9747k1288J3244j9722k0335J770
$$ -130 11939 14018 33493 54660 53756 71973 87098 47351 26063 39307 19585 -750 1020
12441A020M815P653K1479P256K7286Q325J0212m6334j5615L0551J8064l158k0440
$$ 1020 5835 13488 34967 42223 69509 77834 88046 41712 26097 56648 74712 71554 51114
12428E1114l1776m4902n127L2289o303J3184J5975j0978k383O909J9682k509M473
$$ 51114 19338 -25564 -30691 1598 -4705 8479 24454 13476 11093 18002 37684 35175 39648
12415C9648K1223o607k6830j113L4560J02j9913J9022Q24k715J82p227J1023J3670
$$ 39648 60871 54264 27434 26321 60881 60983 41070 60092 60916 58201 58383 51156 62179 75849
12401G5849K6414j5085k7196j7483j1233K1380N649q673k1454k997J0144J9231
$$ 75849 102263 87178 59982 42499 31266 52646 58295 49622 28168 25171 35315 54546
12389E4546K2192J3335K2947j9472j5543j2589P685r255m2412J2109J484Q596
$$ 54546 76738 90073 113020 93548 78005 65416 73101 63846 21434 33543 35027 43623
12377D3623K0523k0155r282K1659J0825j7948j8300o842Q029j1383J2822O129
$$ 43623 64146 43991 34709 56368 67193 49245 30945 24103 32132 20749 33571 39700
12365C9700Q307J0593O355j3440K9528k2258r925N536K6031J562n048J777R754
$$ 39700 48007 58600 64955 51515 81043 58785 48860 54396 80427 81989 76941 78718 88472
12352H8472k9748J343J5737k7554j7843M737P866L452m5754o695J4707L7478J6352
$$ 88472 58724 60067 75804 48250 30407 35144 43010 46462 708 -5987 8720 46198 62550
12339F2550J4939L904m469R128j7818q123O607K430j4793J6573O1709n099j1765
$$ 62550 77489 81393 76924 86052 68234 60111 66718 69148 54355 70928 132637 127538 115773
12326A15773O956j1776k6013n865K0802j1918k8092q154K2993l037k1165k982
$$ 115773 122729 110953 84940 79075 99877 87959 59867 51713 74706 71669 50504 47522
12314D7522j70n573L4480J0846N863j9320j4851N802K4840p968l1618k1675j3674
$$ 47522 47352 41779 76259 87105 92968 73648 58797 64599 89439 81471 49853 28178 14504
12301A4504n628M808M1038L2686K9759J7273k8319q461K774j3455j983r937l08
$$ 14504 8876 13684 54722 87408 117167 134440 106121 97660 100434 86979 84996 75059 74751
12288G4751m245J5667j1648n5769k0459j0802N5406J2842j9902k235K1226L123
$$ 74751 70506 86173 74525 18756 -1703 -12505 42901 55743 35841 33606 54832 57955
12276E7955j6319K8250K5803J9841j1607k1965P139N445l0319K034P313L645P184
$$ 57955 41636 69886 95689 115530 103923 81958 89097 94542 64223 66257 73570 77215 84399
12263H4399J8329j7902J2526P519J1365J6647k8686m2931j5269K4983K9621l797
$$ 84399 102728 84826 97352 104871 116236 132883 104197 61266 45997 70980 100601 96804
12251I6804j5928o752j1387n743K0936K0081j6618k144o213O474K2426q431J2615
$$ 96804 80876 74124 62737 56994 77930 98011 81393 79249 73036 79510 101936 93505 106120
12238A06120P230j0608R677j9725o142J9229k588l3335J6187J6955Q851j4692
$$ 106120 113350 102742 112419 92694 86552 105781 103193 69858 86045 103000 111851 97159
12226I7159J0023L860K7761j1757l2891L283m1394j3653J507n813J903R681Q713
$$ 97159 107182 111042 138803 127046 94155 97438 56044 42391 43898 38085 39988 49669 58382
12213E8382J8672K0337L001n469j2974J2751J5511k6174k6583J7823J6771J6317
$$ 58382 77054 97391 100392 94923 81949 94700 110211 84037 57454 75277 92048 108365
12201A08365J9169p401J1908j6779k460K7512m588o225j6801l6629K0051J8094
$$ 108365 127534 120133 132041 115262 112802 140314 135726 129501 112700 76071 96122 114216
12189A14216j7959k415M6048L8046J2934j2949r089q411j9157O379J5033Q458
$$ 114216 96257 93842 139890 177936 190870 177921 168832 160421 141264 147643 162676 171134
12177A71134k6077j4233J037k0942j5531L9138M3120l906k377K4866j4956m602
$$ 171134 145057 130824 131861 110919 95388 134526 177646 173740 171363 196229 181273 176671
12165A76671K1821L2651J0807j4962j6501j1002j6604J1038R539j4284j1731K0818
$$ 176671 198492 231143 241950 226988 210487 199485 182881 193919 203458 189174 177443 198261
12153A98261K4823l556q050r920j4149j3230J5941K4736K2744j9098j130N067
$$ 198261 223084 219528 211478 201558 187409 174179 190120 214856 237600 218502 217372 222439
12141B22439j7408q824J3419K0026l5231m949J3771J4170m601l495P973q124n518
$$ 222439 205031 196207 209626 229652 194421 189472 203243 217413 212812 209317 217290 209166 203648
12128B03648K0986J8811k0139j1403m869k068Q419p705K596K2032k125k0906J8136
$$ 203648 224634 243445 223306 211903 207034 204966 213385 205680 208276 230308 228183 207277 225413
12115B25413J5034J7113L9535M3137K2507j1063o0925m3332J6212J434P982K244
$$ 225413 240447 257560 297095 340232 362739 351676 290751 247419 263631 265065 273047 275291
12103B75291K3077J769j282k1787K3227L9087j4865J8314k0957q954J5649J3728
$$ 275291 298368 300137 298855 277068 300295 339382 324517 342831 321874 312920 328569 342297
12091C42297L601K480q746j8524J9766J4892Q140J1500J1035m450l99K3578J4079
$$ 342297 345898 348378 339632 321108 340874 355766 363906 375406 386441 381991 381592 405170 419249
12078D19249J4796l5493k5357J0680J4864L2787K240p325k2648k71L2078L0937
$$ 419249 434045 398552 373195 383875 398739 431526 433766 426441 403793 403522 435600 466537
12066D66537J0064J799M112l988L093J0854K344J9924J144k732J3428j7029J111
$$ 466537 476601 478400 482512 478524 481617 492471 494815 514739 515883 513151 526579 509550 510661
12053E10661J450n719Q929K9946Q013K0928J2681J9934j4221j4466N7327K8302
$$ 510661 512111 506392 515321 545267 553280 574208 586889 606823 592602 578136 635463 663765
12041F63765l8282J3584J99j1419R721l399P033L675J901K9819J9418M5210J0986
$$ 663765 625483 639067 639266 627847 637568 634169 641202 644877 646778 676597 696015 741225 752211
12028G52211p037j2155R35J8703k135J4779J1714J5251J3431J7642K2781J1497
$$ 752211 745174 733019 733954 752657 750522 765301 777015 792266 805697 823339 846120 857617
12016H57617j6394J8704L4436K7061K2081J2756O866M1133L1867m239k957m520
$$ 857617 841223 859927 894363 921424 943505 956261 963127 1004260 1036127 1031888 1028931 1024411
12004A024411M514N261L0888K7660M0268M1431L4265J9947j246o879k370K1008
$$ 1024411 1028925 1034186 1065074 1092734 1133002 1174433 1208698 1228645 1227399 1220520 1218150 1239158
11992A239158L1672M2489M0485L8628K5791J7480R219M0118K8201L5800P825M0040
$$ 1239158 1270830 1313319 1353804 1392432 1418223 1435703 1444922 1485040 1513241 1549041 1556866 1596906
11980A596906o859L3933L172K7336p301L3405M3974O099P70K3143M0472J3606
$$ 1596906 1590047 1623980 1627152 1654488 1647187 1680592 1724566 1730665 1731435 1754578 1795050 1808656
11968A808656k2079J5273L407k636N008M6579N6326L3255M0211J1871K8124J4356
$$ 1808656 1786577 1801850 1805257 1802621 1807629 1854208 1910534 1943789 1984000 1995871 2023995 2038351
11956B038351l1125K210J123O915M1449M2748Q435N286J5508J9389Q465J1535
$$ 2038351 2007226 2009436 2010559 2017474 2058923 2101671 2110106 2115392 2130900 2150289 2158754 2170289
11944B170289P095j7198r865p152l6039n093J6955j7161l6281l1852l7234o040
$$ 2170289 2177384 2160186 2150321 2143169 2107130 2102037 2118992 2101831 2065550 2033698 1996464 1990424
11932A990424K5080j2091K8702L925l5697j1987m503j5455k7920k6059k6471j7960
$$ 1990424 2015504 2003413 2032115 2036040 2000343 1988356 1983853 1968398 1940478 1914419 1887948 1869988
11920A869988k6599m071j2708k1734k3983l9514m2562r068l3631k7525J7608M996
$$ 1869988 1843389 1839318 1826610 1804876 1780893 1741379 1698817 1689749 1656118 1628593 1646201 1651197
11908A651197m4611j2849j3328k5847l3842k5669j9827j3186k050N909l1423n3143
$$ 1651197 1606586 1593737 1580409 1554562 1520720 1495051 1475224 1462038 1459988 1465897 1434474 1381331
11896A381331j4725l7002l4270k9882j4388k3774m0514L449j7743k4441l08k8910
$$ 1381331 1366606 1329604 1295334 1265452 1251064 1227290 1186776 1190225 1172482 1148041 1147733 1118823
11884A118823o9262Q8p84m9699K245J3103r01k5925k2007p072j7508m1903j7370
$$ 1118823 1049561 1049649 1048865 999166 1001411 1014514 1013613 987688 965681 958609 941101 899198 881828
11871H81828P509J0193k5340N817j8219p889j4285m1175k6544k40j1810J442j8299
$$ 881828 889337 899530 874190 880007 861788 853899 839614 798439 771895 771655 759845 761287 742988
11858G42988O929l3315m5809l3139k1051k12o801K3944j791J1274q376j3472m3669
$$ 742988 749917 716602 670793 637654 616603 616391 609590 633534 631743 643017 634641 621169 577500
11845E77500j4833Q282J8537k493m9733j6964j507l0257j8369j541K5367Q269
$$ 577500 562667 570949 589486 586993 537260 520296 518789 488532 470163 468622 493989 502258
11833E02258L238j398R908m5421j1633L817j6923M017k2339j237J2127j7207q539
$$ 502258 505496 504098 514006 468585 456952 460769 443846 447863 425524 424287 436414 419207 410668
11820D10668r672j3733l1034R113r468R950Q355k0799k1209j9298J4020K7582
$$ 410668 400996 387263 356229 365342 355874 365824 374179 353380 332171 312873 326893 354475
11808C54475K0018J2630l0130k0690q264j8538k2255M7486j1196m2546L0903P849
$$ 354475 374493 387123 356993 336303 328039 309501 287246 334732 323536 280990 311893 319742
11796C19742o067L2723J4377k6534k8776k6171M507M72j6052n01L1637M714K493
$$ 319742 313675 346398 360775 334241 305465 279294 283801 284273 268221 267720 299357 304071 306564
11783C06564j5785j0090N486n142j1376p533j0396j5002k5644J4388j339L5007
$$ 306564 290779 280689 286175 281033 269657 262124 251728 236726 211082 225470 224131 259138
11771B59138j8697r279j6435k1083j8346o227J5963J3521M3477Q389o4944O379
$$ 259138 240441 231162 214727 193644 175298 169071 185034 198555 242032 250421 185477 191856
11759A91856M1184J0786j4794k1302j8605m792J3944J3193p840Q153l3338j7531
$$ 191856 233040 243826 229032 207730 189125 184333 198277 211470 203630 211783 178445 160914
11747A60914K4772K2859n560j9496j0515k7225K5811K6342n279j5048j6527o693
$$ 160914 185686 208545 202985 183489 172974 145749 171560 197902 192623 177575 161048 154355
11735A54355J4236j6218p694j2118k5726K9687L9779L5073j3293j7554k9058J411
$$ 154355 168591 152373 144679 132561 106835 136522 176301 211374 198081 180527 151469 152880
11723A52880L5250l8319l3835J607P30k7647j7968k0801R484N5935O36j2314O462
$$ 152880 188130 149811 115976 117583 118313 90666 72698 51897 61381 117316 117952 105638 112100
11710A12100q01L6771J020j1834J0224L946k914Q718P406P910k7758j7039J2986
$$ 112100 111299 148070 149090 137256 147480 151426 148512 157230 164636 172546 144788 127749 140735
11697A40735L5832k1628l3882j1349j5863j5252j6892N911O387o904P51j2893
$$ 140735 176567 154939 121057 109708 93845 78593 61701 67612 73999 67095 67846 54953
11685E4953J8040J3363m21J1081K9846m0773Q905K0717L029L5462N24n527M091
$$ 54953 72993 86356 85935 97016 126862 86089 94994 115711 118740 154202 154726 149199 153290
11672A53290l0351j7989K055o172k4260R052j9444k0860M788J7920j3797K926
$$ 153290 122939 104950 107005 100833 76573 85625 66181 45321 50109 68029 54232 57158
11660E7158K0907J7344P566j384K953j8n979m0958R671p274J0680N486o42k2087
$$ 57158 78065 95409 102975 101591 104544 104526 98547 57589 67260 59986 70666 76152 75510 53423
11646E3423L0067J5913p564l2542o382L7127j3100J3025N829N001k9012j798K2853
$$ 53423 83490 99403 91839 59297 52915 90042 76942 89967 95796 100797 71785 69987 92840
11633I2840R385m128l0598m5316O577J4241J5915L6999O081j559K859K969K919
$$ 92840 102225 98097 67499 22183 28760 43001 58916 95915 101996 100437 103296 106265 109184
11620A09184l7585j6873n960K2836L979l325Q911k4666l3628K3432L954m814O361
$$ 109184 71599 54726 48766 71602 75581 72256 81167 56501 22873 46305 50259 45445 51806
11607E1806J4972k498r754l0526K3644M110K3159o282j6238P063J4842J4790J5780
$$ 51806 66778 64280 54526 24000 47644 51754 74913 68631 52393 59456 74298 89088 104868
11594A04868R891j7342j2016K1374J3568K6224q511n1637j3927L8664j5743j0971
$$ 104868 114759 97417 85401 106775 120343 146567 138056 86419 72492 111156 95413 84442
11582H4442j6417n313K4676k8431j2220R745J2260L954J5260k9101k9990j7917
$$ 84442 68025 62712 87388 58957 46737 56482 68742 72696 87956 58855 28865 10948
11570A0948r754J5086J2554P214K709L2913J6012j7183j7260n776J1760M2004
$$ 10948 1194 16280 28834 36048 38757 71670 87682 70499 53239 47463 59223 101227
11558A01227l0261m0544O074O903p241j8004n981J6890J7436j6558j6329k499
$$ 101227 70966 30422 36496 43399 36158 18154 12173 29063 46499 29941 13612 11113
11546A1113J2401K5370p275l5832O929l116K0681Q391q482j6393M0007K5765O924
$$ 11113 23514 48884 41609 5777 12706 9590 30271 38662 30180 13787 53794 79559 86483
11533H6483J0933j1979q955j0409j9871k259l1612k2799J1563K4967l656r280
$$ 86483 97416 85437 76482 66073 46202 43943 12331 -10468 1095 26062 22406 13126
11521A3126J5773k132L0887L6345j716k1279l1527o007M831q016k1685j6295J4673
$$ 13126 28899 26767 57654 93999 92283 71004 39477 33470 38301 30285 8600 -7695 6978
11508F978p430J7319J5616J7604k939K2435L2386j9738k4310k315j8957j314K2701
$$ 6978 -452 16867 32483 50087 47148 69583 101969 82231 57921 55606 36649 35335 58036
11495E8036J6415l1032j5658O912o035k0503l331J8659K2210j5897L574K5340
$$ 58036 74451 43419 27761 34673 28638 8135 4804 23463 45673 29776 33350 58690
11483E8690J5182k9983q423N880m912o870q439j2151Q969K0738L8349r788j7805
$$ 58690 73872 43889 35466 41346 36434 29564 21125 8974 17943 38681 77030 67242 49437
11470D9437l769J516j845P338M011k5653K3959k1674O403O445J2767m161K9530
$$ 49437 45668 47184 45339 52677 56688 31035 54994 33320 39723 46168 58935 54774 84304
11457H4304o08k6422n5097l983l526K927n865n645J4527J0020o538J6915L0990
$$ 84304 83696 57274 2177 -1806 -5332 -2405 -8270 -13915 612 10632 4094 21009 51999
11444E1999J4031K159j6187q602j8297j6206L5763J9011j191j1570k3981j3877
$$ 51999 66030 68189 52002 43400 25103 8897 44660 63671 62480 50910 26929 13052
11432A3052n280O365K390N29k1162J2660R966k631L174K778m4053K0743O156J5830
$$ 13052 7772 14137 16527 17056 -4106 8554 18520 15889 19063 21841 -22212 -1469 4687 20517
11418B0517K522r457k653L1271Q126m5842k4769J1566M8849J6970j0421j6949
$$ 20517 23039 13582 10929 42200 50326 4484 -20285 -8719 40130 57100 46679 29730
11406B9730l0346Q02j672l938P390n274L6547L2179k1260j8319J5250K8206P68
$$ 29730 -616 186 -1486 -5424 1966 -3308 33239 65418 44158 25839 41089 69295 70063
11393G0063m0348K3813J6299j0254k3403K9264M876j6134k3894r397J4173Q837
$$ 70063 29715 53528 69827 59573 36170 65434 70310 54176 30282 20885 35058 43895
11381D3895k1213p968J1428k5890O074L0130M698l019J2626j9727l1626j9695
$$ 43895 22682 14714 26142 252 6326 36456 41154 38135 50761 31034 -592 -20287
11369b0287j9179j104P462o252J9772M0528m503n098m950m633l966q921J8645
$$ -20287 -39466 -40570 -33108 -39360 -19588 20940 16437 11339 6389 1756 -2210 -11131 7514
11356G514J7952j0384Q937j012K0923j1850l1201l1662k716R051J9495O040l391
$$ 7514 25466 15082 24019 23007 43930 32080 879 -30783 -33499 -24448 -4953 1087 -2304
11343b304N235k5684p323Q291K3257l354J7295K7428m584L689j1420j6611j0549
$$ -2304 2931 -22753 -30076 -21785 1472 -1882 15413 42841 38257 41946 30526 13915 3366
11330C366k0953j459K5230J1529K86M31J8841P409k3337J1289K853k1944o306
$$ 3366 -17587 -19046 6184 17713 17999 18430 37271 44680 21343 32632 35485 13541 7235
11317G235O772Q251N124k4417k6415k824J9960L417K3488O167l6556K2030N2281
$$ 7235 14007 22258 27382 2965 -23450 -26274 -6314 -2897 20591 26758 -9798 12232 64513
11304F4513j8048j4519k5150k271k059K757L494j4622Q854J1259L426K745k0734
$$ 64513 46465 31946 6796 4525 2466 5223 8717 -5905 2949 14208 17634 20379 -355
11291c55j7689J0250r832r573K5061M1419Q033J5086k5383J2545k7477k3789M050
$$ -355 -18044 -7794 -17626 -27199 -2138 39281 47314 62400 37017 49562 22085 -1704 2346
11278B346K5238K2101j8104k090r2n60j0415j9320k806M477L9136k4564j4114
$$ 2346 27584 49685 31581 29491 29399 28839 18424 -896 -3702 775 39911 15347 1233
11265A233n004j1395p821o582O199J7698n825j6236J9103l971J2295P988n088
$$ 1233 -3771 -15166 -22987 -29569 -23370 -5672 -11497 -27733 -8630 -12601 -306 7682 2594
11252B594o267j252Q897k2958k66J2185k4221j746K3558K7059J0400M625n1069
$$ 2594 -3673 -4925 3972 -18986 -19252 -7067 -31288 -33034 -9476 17583 27983 32608 -18461
11239a8461O242J6864Q269M0825j0277j9404j7748k7232K21L4400L0599L966j2881
$$ -18461 -12219 4645 12914 53739 43462 24058 6310 -20922 -20701 13699 44298 48264 35383
11226C5383l2635q975m80R644P663J5949L5349j4013k8376j1873N080K482j1367
$$ 35383 2748 -6227 -6707 2937 10600 26549 61898 47885 19509 7636 12716 15198 3831
11213C831q721K1725R658j3300J8941J0916J4819k5556r421P709J9878l9781k7392
$$ 3831 -4890 16835 26493 13193 32134 43050 57869 32313 22892 30601 50479 10698 -16694
11200a6694J7173O325K2016J7060j7309q777M471J3091j3032j7792J5845j8028
$$ -16694 479 6804 28820 45880 28571 19794 24265 37356 24324 6532 22377 4349
11188D349j5546J4060K8146p648j359o352J9280J2026J0197p285n601j7878k8119
$$ 4349 -11197 2863 31009 23361 22002 15650 34930 46956 57153 49868 44267 26389 -1730
11175a730l1862J6716Q634K716K5140J551j2748l000K2796j210p046m5445m7286
$$ -1730 -33592 -16876 -8242 -5526 19614 21165 8417 5417 28213 27003 19957 -25488 -72774
11162g2774M0183N7484R865j6488J6335J8436M033l5179o241k4996j6032J8727
$$ -72774 -32591 24893 34758 18270 34605 53041 57074 21895 15654 -9342 -25374 -6647
11150f647M4522m490k0039l963j0561K9375l731l6759k1989J4402K2530J2774
$$ -6647 37875 33385 13346 9383 -1178 28197 24466 -12293 -34282 -19880 2650 15424
11138A5424o004l1370j8596J9549J3357o522K201J1849l617R679J1604k6166J4403
$$ 15424 9420 -21950 -40546 -20997 -7640 -14162 -11961 -112 -3729 5950 17554 -8612 5791
11125E791j5311Q138N7318L6542k0526l1285N045Q294k0155k9313p326J6693O774
$$ 5791 -9520 -1382 55936 92478 71952 40667 45712 54006 33851 4538 -2788 13905 20679
11112B0679l491m623m691J0570O936k689J9641L104j5505j891l3161j0574O503
$$ 20679 17188 12565 7874 18444 25380 22691 42332 45436 29931 28040 -5121 -15695 -9192
11099i192J4574L0824p168K293j632k3532k4776J9503J4625J1173j4635j8976
$$ -9192 5382 36206 29038 31331 29699 6167 -18609 894 15519 26692 12057 -6919
11087f919J598J6706o211K251k0984O74K5771k206J5386Q824q342k455o890j6520
$$ -6919 -5321 11385 5174 7425 -13559 -12885 12886 10680 26066 34890 26548 24093 17203 683
11073F83n059R401J4246K0991n605k7262M801O62j6614k3708K2621L6212J293
$$ 683 -4376 5025 19271 40262 34657 7395 12196 12858 -3756 -27464 -4843 31369 32662
11060C2662K085J1703k0451J887j3847o126K6318p536n702J8639j066l599k1379
$$ 32662 34747 46450 25999 27886 14039 7913 34231 26695 20993 39632 38566 34967 13588
11047A3588j1261o228L1384L0787K5460J2841q283l3663P812m397O529K9752K4308
$$ 13588 2327 -3901 27483 58270 83730 96571 88288 54625 62437 58040 64569 94321 118629
11034A18629K2343K5081L1373J3903m928m8220j1429L8417L8689j7417l3263J3264
$$ 118629 140972 166053 197426 211329 206401 158181 146752 185169 223858 206441 173178 186442
11022A86442L0920O3810L1131L2917L003k7642l1167l5075m8124K064p558n040
$$ 186442 217362 281172 312303 345220 348223 320581 289414 254339 206215 208279 200721 195681
11010A95681J623j3097K1583M2549J0434n0681m9638n5247k0964K5982n594K257
$$ 195681 197304 184207 205790 248339 258773 208092 158454 103207 82243 108225 102631 104888
10998A04888L2020P095j4137q069j1030k8060j1909J4105j2206j5217R830j3173
$$ 104888 136908 144003 129866 121797 110767 82707 70798 84903 72697 57480 67310 54137
10986E4137j9820l9112j9055L0376L3968K2673O265m456k3374n163l9769k5903
$$ 54137 34317 -4795 -23850 6526 40494 63167 69432 64976 41602 36439 -3330 -29233
10974b9233k800J6402k999o330O113K4705K7276q488n934l546l7028n230K2468
$$ -29233 -32033 -15631 -18630 -24960 -18847 5858 33134 24646 18712 15166 -21862 -27092 -4624
10961d624J1933m559N60j5315k1776o129J4929r118J2149L2942M465j6465K0490
$$ -4624 7309 2750 3310 -12005 -33781 -39910 -24981 -34099 -21950 10992 15457 -1008 19482
10948A9482j9578j2073j3083q584K3140R931J9839M014J1735J1137p348j8454
$$ 19482 -96 -12169 -25252 -33836 -10696 -765 19074 23088 34823 45960 38612 20158
10936B0158K231J1655j2665r671J7447P799j5925o128j1649O704J1031Q282n590
$$ 20158 22389 34044 21379 11708 29155 36954 21029 14901 3252 9956 20987 29269 23679
10923B3679K8630J2221m1941j8434j050P50j7420k059o068K0342k5865l1433J4618
$$ 23679 52309 64530 22589 4155 3105 3855 -13565 -15624 -21692 -1350 -27215 -58648 -44030
10910d4030R711q218R009L0300J8509n849k231j348j0412k7309n361J5290j9063
$$ -44030 -34319 -42537 -33528 -3228 15281 9432 7201 5853 -4559 -31868 -37229 -21939 -41002
10897d1002M906N46q772K3158N732J7273R033j7425j3979j2329m558q373K1995
$$ -41002 -36096 -35550 -44322 -21164 -15432 1841 10874 -6551 -20530 -32859 -37417 -45790 -23795
10884b3795J7557L945p587J4404K4057k3986K8655J8568j8026k1357p016M459
$$ -23795 -6238 -2293 -9880 4524 28581 4595 33250 51818 33792 12435 5419 9878
10872I878L439k837K2751p867L594p070L010L4127p870m2554j0681J2808K5329
$$ 9878 13317 10480 33231 25364 28958 21888 24898 59025 51155 8601 -2080 10728 36057
10859C6057o478k1652j1312J3728K2362R48l800K7792M0086l447m3243l2280m964
$$ 36057 29579 7927 -3385 10343 32705 33653 29853 57645 97731 94284 51041 18761 13797
10846A3797P2q463J2936n072l633J3533N267r695p182K4204M3638J0773q079k7502
$$ 13797 13869 5406 18342 13270 9637 23170 28437 18742 11560 35764 79402 90175 82096 54594
10832E4594N31j173j5569o0379n355o561r200j8475m850J7916K6356K4850K5424
$$ 54594 55125 53952 38383 -21996 -27351 -33912 -43112 -61587 -66437 -48521 -22165 2685 28109
10819B8109J023M641j4568k8582J1341J710R569P171k8476k1827K8585P672o714
$$ 28109 29132 33773 19205 -9377 1964 3674 13243 20414 -8062 -29889 -1304 6368 -346
10806c46J5067M115n098O903J4862n947j0550q641L725L199j2614k4791J0394
$$ -346 14721 18836 13738 20641 35503 29556 19006 10365 14090 17289 4675 -20116 -9722
10793i722L1424j6918n248l773o216Q220J8330j4720j6430K1883P032J0204k359
$$ -9722 21702 4784 -464 -4237 -10453 -2233 16097 1377 -15053 6830 13862 24066 21707
10780B1707j9230k1124J2748j355L1357K0884M314j4960P6k354k246k9465p051
$$ 21707 2477 -18647 -5899 -7254 24103 44987 49301 34341 34417 32063 29817 352 -6699
10767f699Q941j4275q543J8435O014j6726j8277J9057L4145l983Q820K2718K6194
$$ -6699 2242 -12033 -20576 -2141 3873 -12853 -31130 -12073 22072 18089 26909 49627 75821
10754G5821J9793j8489l2706j6230m508K9120J8118J6155L02j8180k3340j0367
$$ 75821 95614 77125 44419 28189 23681 52801 70919 87074 87376 69196 45856 35489
10742C5489l8124J047L3405K6871r089j2744k5849K164K8468m669K546N639Q498
$$ 35489 -2635 -1588 31817 58688 49599 36855 11006 13170 41638 36969 39515 45154 53652
10729E3652K6394Q53q106n778n608J0152J0785m2249o619P329J5869M6178L4867
$$ 53652 80046 80899 72793 67015 61407 71559 82344 40095 33476 40805 56674 102852 137719
10716A37719O419l1119k1337j5310r067P023L1893M669j3576m858M556j1363J1328
$$ 137719 144138 113019 91682 76372 67305 74328 106221 110890 97314 92456 97012 85649 96977
10703I6977k4697j5055L3469J2331n602j6341j882p240N572J5155K4108K6259
$$ 96977 72280 57225 90694 103025 97423 81082 79200 71960 77532 92687 116795 143054
10691A43054J1458j4968q508j5630q297k1348m9675l745L8966K1533K3178O368
$$ 143054 154512 139544 131036 115406 107109 85761 36086 32341 71307 92840 116018 122386
10679A22386j8408J0374L2926r074p138K6245q050k5718L973L95m539P333J9318
$$ 122386 103978 114352 147278 138204 131066 157311 149261 123543 127516 127911 123372 130705 150023
10666A50023J82K2997R986l852j3375m83J0351M7866N321J3277j2359j2593K1812
$$ 150023 150205 173202 183188 179336 165961 165478 175829 223695 229016 242293 229934 217341 239153
10653B39153J718O673J4588k084l915J3231K0929R700l859o535K0250K3437J3376
$$ 239153 240871 247544 262132 260048 256133 269364 290293 299993 296134 289599 309849 333286 346662
10640C46662J9806L1741M8253M1164J8346M0841N8548L8237O0391J02669J10700
$$ 346662 366468 398209 446462 487626 505972 546813 605361 643598 703989 806658 917358
10629I17358R9043J12193R5572Q3324J44602J44855J89522K83810L97490N55111
$$ 917358 1016401 1128594 1224166 1307490 1452092 1596947 1786469 2070279 2467769 3022880
10619C022880P58199J028599J328011J779432K208875K412508K046846J202722
$$ 3022880 3781079 4809678 6137689 7917121 10125996 12538504 14585350 15788072
10611A5788072K35374n00523p05377m25131K03536J035023K056396L228517M385612
$$ 15788072 16023446 15522923 14817546 14392415 14595951 15630974 17687370 20915887 25301499
10602B5301499M777561L767056J457570j115318k723803k868974k033139p55639
$$ 25301499 30079060 33846116 35303686 34188368 31464565 28595591 26562452 25806813
10594B5806813P11877K409557M169878N591767N813063L899329K93625l410079
$$ 25806813 26518690 28928247 33098125 38689892 44502955 48402284 48695909 45285830
10586D5285830n486087n510012m351212k777779j148675M26399J879833K847515
$$ 45285830 39799743 34289731 29938519 27160740 26012065 26438464 28318297 31165812
10578C1165812K827490J395137j095932l438752m576283m346133l349076k242335
$$ 31165812 33993302 35388439 34292507 30853755 26277472 21931339 18582263 16339928
10570A6339928j253926m14657K71178O44789N49320r3572j083427j929790k328287
$$ 16339928 15086002 14671345 14942523 15587312 16136632 16043060 14959633 13029843 10701556
10561A0701556k197993j802755j421862j097342p86243n85645m46382l39124k45815
$$ 10701556 8503563 6700808 5278946 4181604 3395361 2809716 2363334 2024210 1778395
10552A778395k04953j76702j62731j54133j05121p7353k9634o7367q2461l4911
$$ 1778395 1573442 1396740 1234009 1079876 974755 897402 867768 800401 717940 683029
10542F83029k9508o3454n7589k8428j7356k1808m3855k4919n6485m5179k0995
$$ 683029 653521 590067 532478 504050 486694 464886 421031 396112 339627 294448 273453
10531B73453j3800j5173J3642R029K588k5507J6794J1891j9306n6590l1020P531
$$ 273453 259653 244480 258122 267151 269739 244232 261026 272917 253611 197021 166001 173532
10519A73532K4730J2710J6791k8056j878j7803j7589j3204j0794o62K177k4707
$$ 173532 198262 210972 227763 199707 197829 180026 162437 149233 138439 137777 139954 115247
10507A15247k0795J466P875J5934l667J4001O270k7958l3837J113k30o089N583
$$ 115247 94452 95918 103793 119727 116060 130061 136331 108373 74536 75649 75419 69330 74913
10494G4913j3454K111K7958p137p857J6383J1995M789J3871N890l838k3324M75
$$ 74913 61459 63570 91528 84391 76534 92917 104912 109701 123572 129462 125624 102300 102775
10481A02775j0874j4427j2599j1571J5823p40J1996m898k8686q834m027k928Q992
$$ 102775 91901 77474 64875 53304 69127 68387 80383 75485 46799 37965 33938 31010 40002
10468D0002K3499j1586J0790r84j565J0007k4096k3160J6877j473j857K4048J3354
$$ 40002 63501 51915 62705 61721 60156 70163 46067 22907 39784 38311 36454 60502 73856
10455G3856j7225M991j0994j8204o392L8498J0621q676N523j3281m2565k7322
$$ 73856 56631 61622 50628 32424 26032 64530 75151 66475 71998 58717 16152 -11170
10443a1170K706J5849m637j7L3766j348j5364n632k333J1814j1434Q829R660J1457
$$ -11170 -8464 7385 2748 2731 36497 35149 19785 14153 11820 23634 12200 21029 30689 42146
10429D2146K9133n453l6987j6632M5281K8020m4082k7422J4388J8713K0166N628
$$ 42146 71279 65826 28839 12207 57488 85508 41426 14004 28392 47105 67271 72899
10417G2899L5502N58m7531j8501J202n582q237R882K4766j848N904o943k9931
$$ 72899 108401 108959 61428 42927 44129 38547 30310 40192 64958 63110 69014 62071 32140
10404C2140J1134P235j2775n198J6809J0676R068N280j613j9295j4713j0257q043
$$ 32140 43274 50509 37734 32536 49345 60021 69089 74369 72756 53461 38748 28491 20448
10391B0448j2870N36R866m503j2653j549l205M596j124L080J4569j6594L159j1068
$$ 20448 7578 8114 17980 13477 824 -725 -3930 666 -458 2622 17191 597 3756 -7312
10377g312p493J92K1632K2336k7972j5508K1307n947o653J1491j5158K3829P088
$$ -7312 -14805 -14613 7019 29355 1383 -14125 7182 1235 -5418 6073 -9085 14744 21832
10364B1832j1847M395m534o671r812K3262J9074n482j500L078r962Q514l4081
$$ 21832 9985 14380 9846 3175 -6637 16625 35699 30217 28717 31795 21833 30347 -3734
10351c734k69L4296K1437J9719k3329k5901k739m564m880J29p700J00J7153N722
$$ -3734 -4003 30293 51730 71449 48120 22219 19480 14916 10036 10165 2465 2565 19718 25440
10337B5440r559k65L1298J2165k6501Q231L481k7119j7141j2263Q115K059L641
$$ 25440 15881 15616 46914 59079 32578 40809 44290 17171 30 -12233 -4118 -2059 1582
10324A582j3325O840N747L0654J4513m226j8340j6587j9357R746j522k8624R290
$$ 1582 -11743 -4903 844 31498 46011 41785 23445 6858 -12499 -2753 -4275 -32899 -23609
10311b3609J9508j50j3995K5830J4400j1633j2460m185k0222j1171J613K3674
$$ -23609 -4101 -4251 -18246 7584 21984 10351 -2109 -6294 -26516 -37687 -36074 -12400
10299a2400n333j6444J5885K9684K2014M688n869J5715J5729j5269j5740K5728
$$ -12400 -17733 -34177 -18292 11392 33406 38094 32225 47940 63669 48400 32660 58388
10287E8388l800l205j649m4139k2796j1510K8924O536k2909J5914J1040L072R915
$$ 58388 54588 51383 49734 5595 -17201 -28711 213 6749 -16160 -246 10794 13866 23781
10274B3781j3961j9786j195P953J6492J5410M682n061j7459j190o454K5275k1311
$$ 23781 9820 -9966 -11161 -3208 13284 28694 33376 28315 10856 9666 3212 28487 7176
10261G176q436n868j5919j517P883j5823m304K1818J4140J0667j4928k4206J6309
$$ 7176 -1260 -7128 -23047 -24564 -16681 -32504 -36808 -14990 -850 9817 -5111 -29317 -13008
10248a3008K340K0368K543p715q45J92q795L575J0455P953j224M919R040j4445
$$ -13008 -10668 9700 12243 4528 3683 3875 -4920 -1345 9110 17063 15839 20758 29798 15353
10234A5353j715M955k5118m085j956L594L378m845K3815J6805Q97Q805j3577L0973
$$ 15353 13638 18593 -6525 -10610 -12566 -8972 -5594 -10439 13376 30181 31078 39883 26306 57279
10220E7279L818l8048K0915R521m2780k8723r35l2500K0128K0959J5585P651Q419
$$ 57279 61097 23049 43964 53485 10705 -18018 -18953 -51453 -31325 -10366 5219 12870 21289
10207B1289q331O387K6549j2554j9438j8867k9817j913K0927O262J2618K067o21
$$ 21289 12958 19345 45894 33340 13902 -4965 -34782 -36695 -15768 -9506 3112 5179 4558
10194D558J557J7464N456k0213j1900l72J8694O274n678N515L889J826j3566O774
$$ 4558 6115 23579 29035 8822 -3078 -3450 15244 21518 15840 21355 25244 27070 13504 20278
10180B0278L5741K3769K0284L1740q951K3609J105j7701j4604j8757L2627j2406
$$ 20278 56019 79788 100072 131812 122861 146470 147575 129874 115270 96513 129140 116734
10168A16734j4864K6388M197L5470J372N464J4054m478j586J081k9331r972M0607
$$ 116734 101870 128258 132455 167925 169297 174761 188815 184337 182751 183832 154501 144529 185136
10155A85136K1879J8167N1560J9709j1890m4546l6632m5233j3492n373L673k5908
$$ 185136 207015 225182 276742 296451 284561 240015 203383 158150 144658 139285 142958 117050
10143A17050K1038J8124K2131K147k948j4709l0630k3243j7266L084J0877r981
$$ 117050 138088 156212 178343 180490 177542 162833 132203 108960 91694 94778 105655 95674
10131I5674j3220k4999M120J1377J4712l5066r374K2993k0073N70K279j0551k6956
$$ 95674 82454 57455 61575 72952 87664 52598 43224 66217 46144 46714 48993 38442 11486
10118A1486n515j1563j0129j9466l006K05J8001J2713J046l954P621o421j6955
$$ 11486 5971 -5592 -15721 -35187 -38193 -37988 -19987 -7274 -6228 -10182 -2561 -8982 -25937
10105b5937J7803J7700r892r235k958j9163J0402K1062J2610n126K842o40j1450
$$ -25937 -8134 9566 -326 -9561 -12519 -31682 -21280 -218 12392 7266 10108 9468 -1982
10092a982J0620K9003Q115q799J1103k0740n351P597q529j0872m750q311r73k5656
$$ -1982 8638 37641 45756 36957 48060 27320 21969 29566 21037 10165 5415 -2896 -3869 -29525
10078b9525p971M448O712K0045k4994J7240K601k8248l0521M35O307L2534J6384
$$ -29525 -37496 -33048 -26336 -6291 -31285 -14045 -11444 -39692 -70213 -69778 -63471 -30937 -14553
10065a4553N947J4064Q80J906m732k4479o085j1097l558J4977M840m645J9706
$$ -14553 -8606 5458 6338 8244 3512 -20967 -27052 -38149 -41707 -26730 -21890 -26535 -6829
10052f829P014J7387R703k1846R109J5437k371J2068K8787j3053l3437j7580r698
$$ -6829 185 17572 27275 5429 14538 29975 27604 39672 68459 55406 21969 4389 -5309
10039e309r147m730l931K1217N933j5173R912p830N65K0941J2365K1113M378m9924
$$ -5309 -14456 -19186 -23117 -1900 4033 -11140 -1228 -9058 -8493 12448 24813 45926 50304 380
10025C80n0662k0627K642n215J4112J1088J4401N812r527M422M1674L4743m3354
$$ 380 -50282 -70909 -68267 -73482 -59370 -48282 -33881 -28069 -37596 -33174 8500 43243 -111
10012a11l7593j9651R678p706J4368Q943L675J6582j1275j9786N426L46K9141
$$ -111 -37704 -57355 -47677 -55383 -41015 -32072 -28397 -11815 -23090 -42876 -37450 -37104 -7963
9999g963L2469q717j8984j4656P859p213K206J5113M387r924l1107p069P245k1308
$$ -7963 24506 15789 -3195 -17851 -9992 -17205 -14999 114 4501 -5423 -36530 -43599 -36354 -57662
9985e7662l804K0126L6370J19k1031k091M037K5158R854J1231k3894j0279m595
$$ -57662 -61466 -41340 -4970 -4851 -25882 -27973 -23936 1222 11076 22307 -1587 -11866 -16461
9972a6461j7640J2863L6088m089l616j6554j802J2738M776O936J5718K523q475
$$ -16461 -34101 -21238 14850 10761 7145 -9409 -11211 1527 6303 13239 28957 31480 23005
9959B3005r250j3055j3074n050K6207J06k2433j9338K6744K5391J1019k6091k6780
$$ 23005 13755 700 -12374 -17424 8783 8889 -13544 -32882 -6138 19253 30272 4181 -22599
9946b2599j9457L339q519J1848M1771j3450k0224m751L5520R738k1017k2473m223
$$ -22599 -42056 -38717 -47236 -35388 6383 -7067 -27291 -32042 3478 13216 -7801 -30274 -34497
9933c4497Q505m811J3052j4498O920p599J35n30L6680k2449j1646j877J0030K2276
$$ -34497 -25992 -30803 -17751 -32249 -25329 -32928 -32793 -33323 3357 -19092 -30738 -32615 -22585 -309
9919c09Q110j2236l1677k276L6284r107J9354J6829k9150q522J580j0474l540
$$ -309 7801 -4435 -36112 -38388 -2104 -11211 8143 24972 -4178 -12700 -11120 -21594 -25134
9906b5134J6461K546J5219p312j0725k1258K286R808K029M985j952K085J7280
$$ -25134 -8673 -6127 9092 1780 -8945 -30203 -27917 -18109 -16080 -11095 -13047 -10962 6318
9893F318K0605J1918k4936l109j3641k5729J907r558m1151K1166L9023n588Q79
$$ 6318 26923 38841 13905 10796 -2845 -28574 -26667 -36225 -77376 -56210 -17187 -22775 -21896
9880b1896R971N598o216n001Q759j3636k7551J0026J3255j3699J1991L5073L3608
$$ -21896 -11925 -6327 -12543 -17544 -8785 -22421 -49972 -39946 -26691 -40390 -28399 6674 40282
9867D0282j875P213P844k0825o503J776k7487n1179j7992J7167J9589l1623k669
$$ 40282 38407 45620 53464 32639 26136 27912 425 -50754 -68746 -51579 -31990 -63613 -66282
9854f6282J6291k167K6553K0908k0145j5191L2799J9724L4301J124l6342R813
$$ -66282 -49991 -52158 -25605 -4697 -24842 -40033 -7234 12490 46791 47915 11573 21386
9842B1386n394r237k6310j6804K9273J1194j2742j7975j3916q269j7061j803K4123
$$ 21386 15992 6755 -19555 -36359 -7086 4108 -8634 -26609 -40525 -48794 -65855 -67658 -43535
9829d3535j2956O663O452O132L4495L8195j0492P81L607k7457j3121O280J4612
$$ -43535 -56491 -49828 -43376 -37244 -2749 35446 24954 25735 29342 1885 -11236 -4956 9656
9816I656J4985j4374k1530J7162L861k1974o139m117o270k117J7734K6918J0358
$$ 9656 24641 10267 -11263 5899 9760 -12214 -18353 -22470 -28740 -30857 -13123 13795 24153
9803B4153n533O642J0910j8726m1595k6591l401j6458O063J1328L2987O0849n622
$$ 24153 18620 25262 36172 17446 -24149 -50740 -54141 -70599 -64536 -53208 -20221 40628 35006
9790C5006l9199k3585J3069O085p853k4557L2648J3218q050j3531o307k4894k5013
$$ 35006 -4193 -27778 -14709 -8624 -16477 -41034 -8386 4832 -3218 -16749 -23056 -47950 -72963
9777g2963L5043J8262Q369J3306P266k8682k2295R176M486J8862K5105O666l573
$$ -72963 -37920 -19658 -11289 2017 9283 -19399 -41694 -32518 -28032 -9170 15935 22601 19028
9764A9028O447J5802l7527j0753l849L0701O864j3995J1268m82j5120N509J6407
$$ 19028 25475 41277 3750 -7003 -10852 19849 26713 12718 23986 23504 8384 13893 30300
9751C0300P029j5080j8495k461j3745Q349J8407n192L15L3895k086m6553n891
$$ 30300 37329 22249 3754 1293 -12452 -4103 14304 9112 9427 43322 41236 -5317 -11208
9738a1208O116J2640J4244J124k7880j4981n712n541k3318p532k852M9338Q629
$$ -11208 -5092 7548 21792 22916 -4964 -19945 -25657 -31198 -54516 -62048 -64900 -15562 -6933
9725f933J05o579m835l174J3926n374K0364K7937j1196m8738l3027K0426n018
$$ -6933 -6828 -13407 -18242 -21416 -7490 -12864 7500 35437 24241 -24497 -57524 -37098 -42116
9712d2116n303j9160J1770K5757Q874J0745K1646k1505j2127j5844J8657J2362
$$ -42116 -47419 -66579 -54809 -29052 -20178 -9433 12213 -9292 -21419 -37263 -18606 -6244
9700f244M641j2749N685l924n532J4173n4N156K219K538J67Q448j801j6291l3403
$$ -6244 -1603 -14352 -8667 -12591 -18123 -3950 -4004 1152 3371 5909 6076 14524 12723 -3568 -36971
9685c6971Q664K5361K8044J0471k7916k8708q520J9019O307n973l0663k539J9029
$$ -36971 -28307 -2946 25098 35569 7653 -21055 -29575 -10556 -4249 -10222 -40885 -43424 -24395
9672b4395L0374j4340k0715J4940k329P041K3515N178J7468J125q053j4373r131
$$ -24395 5979 -8361 -29076 -14136 -16465 -9424 14091 19269 36737 37862 29809 15436 6305
9659F305k1137j5615L186J5259n414J5795J7885N1493L7064l5312k9992k9551
$$ 6305 -14832 -30447 -27261 -12002 -17416 -1621 16264 67757 104821 69509 39517 9966
9647I966j1027k0036L46l97L4124J1414J4325K553k3067k086O121K3175j2758
$$ 9966 -1061 -21097 -20751 -21148 12976 24390 38715 41268 18201 16115 22236 45411 32653
9634C2653k6279k9631n522j8701J3882J6963J0742K756K2157l001j0105j5599
$$ 32653 6374 -23257 -28779 -47480 -33598 -16635 -5893 -3137 19020 16019 5914 -9685
9622i685J4422J2441l2805q938J7819O62k0428K2625p420j0293o420j1323j3411
$$ -9685 4737 17178 -15627 -24565 -6746 -6084 -26512 -3887 -11307 -21600 -28020 -39343 -52754
9609e2754K348O88L8271J6858k5688j7609K696J4659L698k404j4483r33L0006
$$ -52754 -50406 -49718 -11447 5411 -20277 -37886 -35190 -20531 -16833 -19237 -33720 -34653 -4647
9596d647L3672m175k2122r158m410J855J0220K5109K605k1688k6443j0583n023
$$ -4647 29025 24850 2728 -6430 -10840 -8985 1235 26344 28949 7261 -19182 -29765 -34788
9583c4788L073P853n425J1915J3429j1979J8307O953J4697K2674K278r333l0365
$$ -34788 -31715 -23862 -29287 -17372 -3943 -15922 2385 9338 24035 46709 48987 39654 9289
9570I289j9216j00L2125L844k5232j8269J4550J249r462k0485J1884q458r74K2431
$$ 9289 -9927 -10027 22098 25942 710 -17559 -3009 -1760 -11222 -31707 -19823 -28281 -29255 -6824
9556f824J1284j2123q396L729p562J3243k7995J783J2740J1865L4036Q726k8608
$$ -6824 4460 -7663 -16059 -12330 -19892 -6649 -34644 -32861 -20121 -8256 25780 34506 5898
9543E898K703M056j364K366J1232m90K274k8148j621q653j6571j9425K5485K5940
$$ 5898 8601 12657 11293 13659 24891 24401 26675 -1473 -3094 -11747 -28318 -47743 -22258 3682
9529C682l4900J1554L745J4440q408k8401k5866m062J0507J0561K8467J8532j6634
$$ 3682 -31218 -19664 -15919 -1479 -9887 -38288 -64154 -68216 -57709 -47148 -18681 -149 -16783
9516a6783k22j2463j2372j7678p999K1709J3324j666K7766k152J3765Q915j9114
$$ -16783 -17005 -29468 -41840 -59518 -67517 -45808 -32484 -34150 -6384 -8536 5229 14144 -4970
9503d970q591N218K4431K1816k0057l9469j582Q937m173k047n520j851l951J2644
$$ -4970 -13561 -8343 16088 37904 17847 -21622 -23204 -14267 -18440 -20487 -26007 -27858 -31809 -19165
9489a9165j6706J1344R699Q062K520J2309M0730j6603l1948q278j4882l121K7892
$$ -19165 -35871 -24527 -14828 -6766 -4246 8063 48793 32190 242 -8036 -22918 -26039 1853
9476A853q757j377J3255m395k7520J5588j2424r665q076M440j0432r542J9256
$$ 1853 -6904 -8281 4974 579 -26941 -11353 -23777 -33442 -41518 -37078 -47510 -57052 -37796
9463c7796L929K9468K9159j0824j5670r674k4363k0138J2138J6297j2135J9325
$$ -37796 -33867 -4399 24760 13936 -1734 -11408 -35771 -55909 -43771 -27474 -39609 -20284
9451b0284p907k3037K0102J3245j4190K42J6573k1930l224L884M1934P502l6244
$$ -20284 -28191 -51228 -31126 -17881 -32071 -31829 -15256 -37186 -40410 -36526 5408 12910 -23334
9438b3334o21K1241q08j888J0497n183j9194j8209J8172J7270J3809J2633r728
$$ -23334 -23955 -2714 -3522 -5410 5087 -96 -19290 -37499 -19327 -2057 11752 24385 14657
9425A4657j1630J8245m090j1962k5208p525O867K4885K1769p47l1297l328n502
$$ 14657 3027 21272 17182 5220 -19988 -27513 -20646 4239 26008 25261 -6036 -9364 -14866
9412a4866j2407J2776q886p874R948J0285L0739J0381r656j5853O551k6104j1709
$$ -14866 -27273 -14497 -23383 -31257 -21309 -11024 19715 30096 20440 4587 11138 -14966 -26675
9399b6675J0629K758j890K9428K9178P220k8388K9282J0015m0149k5275J5338
$$ -26675 -16046 -13288 -15178 14250 43428 50648 22260 51542 61557 21408 -3867 11471
9387A1471L115o326n281k4899n462r789k3328J1261K9375J5551L123l205J1148
$$ 11471 14586 8260 2979 -21920 -27382 -37171 -60499 -49238 -19863 -4312 -1189 -4394 6754
9374F754j0450m0812k7947M339K2706J6784J9450k103j4236r72J1270R331J4078
$$ 6754 -3696 -44508 -72455 -68116 -45410 -28626 -9176 -11279 -25515 -26487 -15217 -5886 8192
9361H192r279L17K051j020m399O012J1774k8135o963n583J7033J4101J7314k0045
$$ 8192 -1087 -770 1281 261 -4138 1874 13648 -14487 -21450 -27033 -10000 4101 21415 1370
9347A370l1975L2828R602m2689l561o723J0880m842p534J5316J6847p626l8021
$$ 1370 -30605 2223 11825 -30864 -34425 -41148 -30268 -35110 -42644 -27328 -10481 -18107 -56128
9334e6128J1510L1053J850J6860J5812j6025j3242M10j6179J7475j3260k805N449
$$ -56128 -44618 -13565 -11715 5145 20957 4932 -8310 -7900 -24079 -6604 -19864 -22669 -17220
9321a7220j0129K1543M4343J4881j803l7058j9928J7065J7882p521j070p417j0615
$$ -17220 -27349 -5806 38537 53418 51615 14557 -5371 11694 29576 22055 20985 13568 2953
9308B953n798m87k7647j4049K416L6173n489J634O302m245K025J9387K9303J1091
$$ 2953 -2845 -3332 -30979 -45028 -42612 -6439 -11928 -10294 -3992 -8237 -6212 13175 42478 53569
9294E3569j7352j1093k9172k1497l470K376J4948k6264k0305L4488j0113N80j478
$$ 53569 36217 25124 -4048 -25545 -29015 -26639 -11691 -37955 -58260 -23772 -33885 -33305 -34783
9281c4783K8269J1970j5941M754O615q540Q702K265k8201k9764Q059K1827j3365
$$ -34783 -6514 5456 -10485 -5731 884 -7656 1046 3311 -24890 -54654 -46595 -24768 -38133
9268c8133n874j6324M910K7629O21l872J8121K4209K1731O782j2098k4538k838
$$ -38133 -44007 -60331 -55421 -27792 -27171 -31043 -12922 11287 33018 39800 27702 3164 326
9255C26K2133K1532q46J120l3295j8419J2497j4303j9889J3394j8527N870L763
$$ 326 22459 43991 43145 44265 10970 -7449 5048 -9255 -29144 -15750 -34277 -28407 -24644
9242b4644P542K4036L027l9507j8357J5671L5k4879J0123K6613p836J5137J9880
$$ -24644 -17102 6934 9961 -29546 -47903 -32232 -32197 -57076 -46953 -20340 -28176 -13039 6841
9229F841J8982M717j9538P57j4984k202p546N135J7238k1710j1141J1145m647
$$ 6841 25823 30540 11002 11759 -3225 -5427 -12973 -7838 9400 -12310 -23451 -12306 -16953
9216a6953k344L2370K3663L7602j9344l0200j3558j4871n275n037n589M599r498
$$ -16953 -19297 13073 36736 74338 54994 24794 11236 -3635 -8910 -13947 -19536 -14937 -24435
9203b4435n247R985l5072k2886J752j1433J8453K6857P110j4437r656o56K937
$$ -24435 -29682 -19697 -54769 -77655 -75903 -87336 -68883 -42026 -34916 -49353 -59009 -59665 -56728
9190e6728k0519P669K2386K9628K305j6431L371l872J4068J473K5468K7044k5706
$$ -56728 -77247 -69578 -47192 -17564 -15259 -31690 -28319 -32191 -18123 -16650 8818 35862 10156
9177A0156l8680R7n901l651J0558j1656J1130J516J7756j4426J427J3955j4207
$$ 10156 -28524 -28427 -34328 -37979 -27421 -39077 -27947 -26431 -8675 -23101 -21674 -7719 -21926
9164b1926J3997r456J509k1449K445N983j6908p697J7574L9778k396j5200j8498
$$ -21926 -7929 -17385 -15876 -37325 -34880 -28897 -45805 -53502 -35928 3850 1454 -13746 -32244
9151c2244J2299k865P201O328j1905n816n261k0778p968J8052K3265K3588K7895
$$ -32244 -19945 -22810 -15609 -9281 -21186 -27002 -32263 -53041 -61009 -42957 -19692 3896 31791
9138C1791j7212j4772k1820j4087j405J4869j5558J1042J7659l897k8836l0393
$$ 31791 14579 -193 -22013 -36100 -37505 -22636 -38194 -27152 -9493 -13390 -42226 -72619
9126g2619N2039L7214j753J4845q76k597K4069p14j5072j5602m0952j3495J4745
$$ -72619 -20580 16634 14881 29726 28850 26253 50322 49608 34536 18934 -22018 -35513 -20768
9113b0768J4962K9914p796O365P196j6016J5858l1082j4516L1274j120j6283M5581
$$ -20768 -5806 24108 16312 22677 29873 13857 29715 -1367 -15883 15391 14271 -2012 43569
9100D3569l408p979j7980k1898l3711Q137K7045Q478n078K675K7154J733l6667
$$ 43569 40161 32182 14202 -7696 -41407 -33270 -6225 2253 -2825 -150 27004 28737 -7930
9087g930M286L2660J4397L5639k1408p333k2796l0798J7402K900p700k6436j2327
$$ -7930 -3644 29016 43413 79052 57644 50311 27515 -3283 14119 17019 9319 -17117 -29444
9074b9444r714n668J1555o551p056K7089J4554k1619j1114o319n704L573J9783
$$ -29444 -39158 -44826 -33271 -39822 -46878 -19789 -5235 -26854 -37968 -44287 -49991 -46418 -26635
9061b6635K2920R3J6859J9822j5008k6156j4376Q790M710K2644j0167o782J7816
$$ -26635 -3715 -3622 13237 33059 18051 -8105 -22481 -13691 -8981 13663 3496 -3286 14530
9048A4530J5689j631l7280n014L0472k1198J436J2471M436P64P237K3108Q370
$$ 14530 30219 28588 -8692 -13706 16766 -4432 -2996 9475 13911 14675 21912 45020 53390
9035E3390k4418q957j0704l2686J1378K4176N053J974L367j2540k6988l378M338
$$ 53390 28972 20015 9311 -23375 -11997 12179 17232 19206 22573 10033 -16955 -20333 -15995
9022a5995J0992k4820o101J2610L1512J2912n803k9053l6849j645l509j9519J2125
$$ -15995 -5003 -29823 -35924 -23314 8198 21110 15307 -13746 -50595 -52240 -55749 -75268 -63143
9009f3143L0089K2700M363n560J8741N091J0584j4740j0642J1401P638j2505n6738
$$ -63143 -33054 -10354 -5991 -11551 7190 12281 22865 8125 -2517 8884 16522 4017 -52721
8996e2721n635p140L2839L0975Q542K0757q253j5551p068j0724k542L9382J9433
$$ -52721 -58356 -65496 -32657 -1682 6860 27617 19364 3813 -3255 -13979 -16521 22861 42294
8983D2294n316j2605k0015m0232j2921J2213K661J5325M0901L0275k1973M770
$$ 42294 36978 24373 4358 -35874 -48795 -36582 -33921 -18596 22305 52580 30607 35377
8971C5377p289k0669J8600n157k0395j5038N874J8526j3022J5334k8398j0500
$$ 35377 28088 7419 26019 20862 467 -14571 -8697 9829 -3193 12141 -16257 -26757
8959b6757L1021N650l3305J8700K1583n198o562M004j9122J6968j5502J513K1068
$$ -26757 4264 9914 -23391 -4691 16892 11694 5132 9136 -9986 6982 -8520 -7007 14061
8946A4061O269L830j0595K7333P128k6081J18j330J2432j0541l4318l924o916
$$ 14061 20330 24160 13565 40898 48026 21945 22063 20733 33165 22624 -11694 -15618 -22534
8933b2534j1501m897j044k7059J6171L2653M441j7495K942L1536K7656m922k0885
$$ -22534 -34035 -38932 -39976 -67035 -50864 -18211 -13770 -31265 -28323 3213 30869 25947 5062
8920E062J3540R409O046j8569k1700J1123Q666l5671k1653j7646l790K7406J6878
$$ 5062 18602 28011 34057 15488 -6212 4911 13577 -22094 -43747 -61393 -65183 -37777 -20899
8907b0899J8475J7966o7620R090R923N805J8339K2148K3057k7892P234K7207J8871
$$ -20899 -2424 15542 -52078 -42988 -33065 -27260 -8921 13227 36284 8392 15626 42833 61704
8894F1704l9249j8977L5876j999J118l1050J934j925P205k8846Q519O307l4071
$$ 61704 22455 3478 39354 37355 38473 7423 9357 7432 14637 -14209 -5690 617 -33454
8881c3454l9674n233J3088M2571k542j035m110J3206J9610l4385j0781kj0687
$$ -33454 -73128 -78361 -65273 -22702 -25244 -26279 -30389 -17183 2427 -31958 -42739 -42741 -53428
8868e3428J9218L1147L3832O061j0721j493L1646O537k9278l5251l0924p378j1662
$$ -53428 -34210 -3063 30769 36830 26109 24616 56262 62799 33521 -1730 -32654 -40032 -51694
8855e1694P628j952O731J2596N349M4267K2124k8934k6069k2398j3978o252J6212
$$ -51694 -44066 -46018 -39287 -26691 -21342 22925 45049 16115 -9954 -32352 -46330 -52582 -36370
8842c6370M1101J9608K470j6378r495k7601l041l871J0575L3471L8362k3711k3204
$$ -36370 4731 24339 26809 10431 936 -26665 -29706 -33577 -23002 10469 48831 25120 1916
8829A916j8760j9216k405J548q788j8108o799M3913r086p648L0482L4976j8409
$$ 1916 -16844 -36060 -38465 -36917 -45705 -63813 -70612 -26699 -35785 -43433 -12951 22025 3616
8816C616q681J0101q632O375k0366J6152L905j8971L537R654k0731K2649J5219
$$ 3616 -5065 5036 -3596 2779 -17587 -1435 2470 -16501 -12964 -3310 -24041 -1392 13827
8803A3827m1371m4686Q155K8179L0657j5601j9199J8162P081l2906P022L5869
$$ 13827 -27544 -72230 -64075 -35896 -5239 -20840 -40039 -21877 -14796 -47702 -40680 -4811
8791d811j5775j9414j1187J9898J6862J2259n607m0571r685j6673p360N0814P658
$$ -4811 -20586 -40000 -51187 -31289 -14427 -2168 -7775 -48346 -58031 -74704 -82064 -31250 -23592
8778b3592l926J5042k337J4248M843p229J8689k4001m3409M2714J9589O503K1214
$$ -23592 -27518 -12476 -14813 -565 4278 -2951 15738 -8263 -51672 -8958 10631 17134 38348
8765C8348j3266j8605j1641L17K5202r605j8015j0855j764j5971K4232M6003K0833
$$ 38348 25082 6477 -5164 -4847 20355 10750 -7265 -18120 -19884 -35855 -11623 34380 55213
8752E5213k8705m8342J5217r113k9066o148K1711K007k559M874K3295K9329k0083
$$ 55213 26508 -21834 -6617 -15730 -44796 -50944 -29233 -27226 -29785 -24911 -1616 27713 7630
8739G630N112N135n447k580q795j0707N897k2624j5174R145o095K3342K8358J5063
$$ 7630 12742 17877 12430 9850 1055 -9652 -3755 -26379 -41553 -32408 -38503 -15161 13197 28260
8725B8260j0411j8097r645k0150p607j473r213O756j1417J55p451K3863L6163
$$ 28260 17849 -248 -9893 -30043 -37650 -39123 -48336 -41580 -52997 -52842 -60293 -36430 -267
8712b67O38j940N1j134N091j7669m2664K2573J8064m813j0296j7004p148J1950
$$ -267 371 -1569 -1518 -2652 2439 -15230 -57894 -35321 -17257 -22070 -32366 -49370 -56518 -44568
8698d4568K4223J8642j9216Q292o584Q489O642k0779R6P028K2632K9395p984j8748
$$ -44568 -20345 -1703 -20919 -12627 -19211 -10722 -4080 -24859 -24763 -17735 4897 34292 26308 7560
8684G560K0095n31j6185Q433k0134r538l884j2455K0167K5441j4863j3529p339
$$ 7560 27655 27124 10939 19372 -762 -10300 -14184 -26639 -6472 18969 4106 -9423 -16762
8671a6762J6953j330j6141k3390p896J2212n056j8045J8252K1023J1286j303N244
$$ -16762 191 -1139 -17280 -40670 -48566 -36354 -41410 -59455 -41203 -20180 -8894 -10197 -4953
8658d953J0019r896K676j6912N256R731l920k2286M674J081o178j715L5762K3512
$$ -4953 5066 -4830 -2154 -19066 -13810 -4079 -7999 -30285 -25611 -24530 -30708 -32423 3339 26851
8644B6851J7215J3099l417j022j7150j7121j1500j3499k6455P643J6289j0751
$$ 26851 44066 57165 53748 52726 35576 18455 6955 -6544 -32999 -25356 -9067 -19818
8632a9818k1432J2296J0791j6606L793K9702j0476j6090j0255O820M79J0197K1841
$$ -19818 -41250 -28954 -18163 -34769 -30976 -1274 -11750 -27840 -38095 -31275 -30796 -20599 1242
8619A242J3883m825k2016m3909P100K4548K2602K0519l0233M857k1844j9159K395
$$ 1242 15125 10300 -11716 -55625 -48525 -23977 -1375 19144 -11089 -6232 -28076 -47235 -44840
8606d4840k3412K1658K8382j2165J3878K5j5084J9946k431K5866J8901J4085j9084
$$ -44840 -68252 -46594 -18212 -30377 -16499 -16474 -31558 -11612 -14043 11823 30724 44809 25725
8593B5725l320P61L956j0940k1872K0403k4522M991r252J0679J677k7817j600
$$ 25725 22405 23166 27122 16182 -5690 14713 -9809 -4818 -14070 -3391 -1714 -29531 -31131
8580c1131m781L622M8L3566j3983L253P069N370j2826J9534J7734j0633j3321
$$ -31131 -35912 -32290 -32242 1324 -12659 -9406 -2337 3033 -9793 9741 27475 16842 3521
8567C521k0760J9081L595k376r337M602J1314K0039J6253k4413M655J6967j5706
$$ 3521 -17239 1842 5437 3061 -6276 -1674 9640 29679 45932 21519 26174 43141 27435
8554B7435j4446K6670R911p312j494l3288k8615J1356r01J1874K9120J7522R45
$$ 27435 12989 39659 49570 42258 40764 7476 -21139 -9783 -10684 1190 30310 47832 48777
8541D8777K377o317r052j2948l707J3919K9733m3467q0157m693K8711J6902J5281
$$ 48777 51154 44837 35785 22837 19130 33049 62782 19315 -60842 -65535 -36824 -19922 -4641
8528d641P322J532k5581K154J5906J426L288J5338j0440J971K6184j2378J2722
$$ -4641 2681 4213 -21368 -19214 -3308 -1882 1406 16744 6304 8275 34459 22081 34803
8515C4803j8378j83k1036K2778N120J5036j5629j1004K3697J6668j043k6687k6316
$$ 34803 16425 16242 -4794 17984 23104 38140 22511 11507 35204 51872 50829 24142 -2174
8502b174K8036O821r560R089J8384o764j1085m0403J3912O357r754k2562K0304
$$ -2174 25862 32683 23123 32212 50596 43832 32747 -7656 6256 12613 2859 -19703 601
8489F01j7984k1822K2827o375l0363j4716L3062J4990k566k0424K6942L5865o935
$$ 601 -17383 -39205 -16378 -22753 -53116 -67832 -34770 -19780 -22346 -42770 -15828 20037 13102
8476A3102r609o634J1309J077N213j3493j6293j8371J9049J8817j8000o523Q772
$$ 13102 3493 -3141 8168 9245 14458 965 -15328 -33699 -14650 4167 -13833 -20356 -11584
8463a1584K0260j2755R884K8411J3103l340l4399l8698j4734J5955J5699J8900
$$ -11584 8676 -4079 5805 34216 47319 43979 9580 -29118 -43852 -27897 -12198 6702
8451F702q938n277j1213J4573L005R806k5057k10J4860k343j518k893J3011M9207
$$ 6702 -2236 -7513 -18726 -4153 -1148 8658 -16399 -16609 -1749 -4092 -5610 -8503 4508 53715
8437E3715J3590k5798p495N668k5075P838M255o998K1996K5799m2208m1905j13
$$ 53715 67305 41507 34012 39680 14605 22443 26698 19700 41696 67495 25287 -16618 -16731
8424a6731j189m40O144P488J0490j6057k0101p742J4213J8022M868J9291q469
$$ -16731 -17920 -18360 -12216 -4728 5762 -10295 -30396 -38138 -23925 -5903 -1035 18256 9787
8411I787k3861j678K5209Q35j4459m886p672K0420K1231k2951J0020K7258l1290
$$ 9787 -14074 -15752 9457 10292 -4167 -9053 -16725 3695 24926 1975 11995 39253 7963
8398G963j2268M484k074j8069J4679J8948k900J2114R085j21M67J0971J8134k0369
$$ 7963 -4305 179 -1895 -19964 -5285 13663 10763 22877 31962 31841 32308 43279 61413 41044
8384D1044q303j0887l1283K392j5614N358K7233k8553l6435k5693K9539K4706
$$ 41044 32741 21854 -9429 -7037 -22651 -17293 9940 -18613 -55048 -80741 -51202 -26496
8372b6496j1159k1710N805L2146q562J0986R555M380Q94O379L7076K7361M893
$$ -26496 -37655 -59365 -53560 -21414 -29976 -18990 -9435 -5055 -4161 2218 39294 66655 71548
8359G1548j2091j8119n370J7271L899M507N8l2730p95j7988Q505J8910L17j480
$$ 71548 59457 41338 35968 53239 57138 61645 61703 28973 28178 10190 18695 37605 37922 36442
8345C6442R592P40J240J2126J4598l0520l3985q23L2421p018k7186M227K8033
$$ 36442 46034 46774 48014 60140 74738 44218 10233 9410 41831 34813 7627 11854 39887
8332C9887R745o124P269J5315J3502m997l4248l2317J2647l8132m948K847K4380
$$ 39887 49632 43508 50777 66092 79594 74597 40349 8032 20679 -17453 -22401 -19554 4826
8319D826J0391P987j1998J0134j426m4832o7P818P46O377k8531r736M1471j1911
$$ 4826 15217 23204 11206 21340 19914 -24918 -24985 -17167 -16421 -10044 -38575 -48311 -6840 -18751
8305a8751L993R249K1274n18j3761j233K4679K5947J3667K7463Q412k6835k1135
$$ -18751 -14758 -5509 15765 15247 1486 253 24932 50879 64546 92009 100421 73586 52451
8292E2451l4421l1062K0398N168j4110p23j9722P364J3888K1263n801k7929K4138
$$ 52451 18030 -13032 7366 12534 -1576 -2299 -22021 -14657 -769 20494 14693 -13236 10902
8279A0902N999j7860m740N306j5274J0475m347J7331K0037p861j7755N549Q969
$$ 10902 16901 -959 -5699 -393 -15667 -5192 -9539 7792 27829 19968 2213 7762 16731
8266A6731k704q842J0593J0485Q498k304o570l6375l167l548J8569R770J4941
$$ 16731 14027 5185 15778 26263 34761 32457 25887 -10488 -13655 -17203 1366 11136 26077
8253B6077R607R250L5813j9964k1631k60j8829k4907o028l643l299j1299j5439
$$ 26077 35684 44934 80747 60783 39152 38892 20063 -4844 -10872 -14515 -17814 -29113 -44552
8240d4552k43K3636J6725j6442j6700J4270J8499k313R121mj1426M428J4060j4537
$$ -44552 -44795 -21159 -4434 -20876 -37576 -23306 -4807 -7120 2001 1997 -9429 -5001 9059 -5478
8226e478m984P461j2684J4774R608M468K285k8473j7208P526Q362p328L0823K615
$$ -5478 -10462 -3001 -15685 -911 8697 13165 15450 -13023 -30231 -22705 -14343 -21671 9152 11767
8212A1767l3889K9300k487j8828j0139j3128J4151J5602j7406j0096J2942L5035
$$ 11767 -22122 7178 4691 -14137 -24276 -37404 -23253 -7651 -25057 -35153 -22211 12824
8200A2824P492l702k4279J8209r363j4243o161j2709l892J8949R25k703L554k4944
$$ 12824 20316 16614 -7665 10544 1181 -13062 -19223 -31932 -35824 -16875 -15950 -18653 -15099 -40043
8186d0043R936K8438j5242K921Q359L70J9500K130l0402j8499L9733l241j4233
$$ -40043 -30107 -1669 -16911 -13990 -5631 -5261 14239 16369 -14033 -32532 7201 3960 -10273
8173a0273J4641k7797k2401o585j8363K7358M1530K7982L949j5720l210K9822
$$ -10273 4368 -23429 -45830 -52415 -70778 -43420 -1890 26092 30041 14321 11111 40933
8161D0933k8539l3635K42j2558L3019J5938P665l780N17k2360k4567J4031K854
$$ 40933 12394 -21241 -20999 -33557 -538 15400 23065 19285 19802 -2558 -27125 -13094 -10240
8148a0240M179J2799j5170J1707J4089J6322j5896l4512J8594P949r941m057R971
$$ -10240 -6061 6738 -8432 3275 17364 33686 17790 -16722 1872 9821 -120 -4177 5794
8135E794k9022P286J6970J7852j8363Q184o244Q88k6043r96J5581J9649K4177
$$ 5794 -23228 -15942 1028 18880 517 8701 2457 3345 -22698 -23694 -8113 11536 35713
8122C5713o506l1661r409k2578j0286k880q239Q988L3797J3169Q480r846j395
$$ 35713 29207 -2454 -11863 -34441 -44727 -47607 -55846 -46858 -13061 108 8588 -1258 -2653
8109b653L4145P533l3165k5580j0626r22R273J9017J730P072J6914j6816q152
$$ -2653 31492 39025 5860 -19720 -30346 -31268 -21995 -2978 -1248 5824 22738 5922 -2230
8096b230j2152j2238P513J377K015k834l7611O684K2970K1538J0873j0535k4195
$$ -2230 -14382 -26620 -19107 -17730 -15715 -18549 -56160 -49476 -26506 -4968 5905 -4630 -28825
8083b8825j7570J9984R685m9780q407K3336N6461Q048K299k7717k5496M53L858
$$ -28825 -46395 -26411 -16726 -66506 -74913 -51577 4884 12932 15231 -12486 -37982 -37529 -33671
8070c3671j480r45p430P772K5819k4754l4026M359M5950J3468k411L0915K0499
$$ -33671 -35151 -36096 -43526 -35754 -9935 -34689 -68715 -64356 -18406 -4938 -7349 23566 44065
8057D4065j1559j3039j9683p894J1370J0071q643N812J596r022k2489O477K8556
$$ 44065 32506 19467 -216 -8110 3260 13331 4688 10500 12096 3074 -19415 -12938 15618
8044A5618K1236l5973j1378R680Q183J6746n869R272j6432k6179n696k829J0494
$$ 15618 36854 881 -10497 -817 7366 24112 18243 27515 11083 -15096 -20792 -23621 -13127
8031a3127j4242o156K0246K1963J730L343o110k4008N221J3451j0379k2614J4617
$$ -13127 -27369 -33525 -13279 8684 10414 13757 7647 -16361 -11140 2311 -8068 -30682 -16065
8018a6065J2073O55K739J09J6768k932k7551l611N690l958m8886j7393J0994J4470
$$ -16065 -3992 -3337 -598 -489 16279 13347 -14204 -17815 -12125 -16083 -64969 -82362 -71368 -56898
8004e6898J3027J8371P104j5080r534L3745K0361p282j3216O827r880k5524L218
$$ -56898 -43871 -25500 -18396 -33476 -43010 -9265 11096 3814 -9402 -2575 -12455 -37979 -34761
7991c4761o204J422J7010k461j5408N079M4602J4019o498K778m409j3165O602
$$ -34761 -40965 -39543 -22533 -24994 -40402 -35323 9279 23298 16800 19578 15169 2004 8606
7978H606j6539j5773o047L1796K0098j9361j0K5346l070J2307k4422k0272J9289
$$ 8606 -7933 -23706 -29753 2043 22141 2780 2770 28116 25046 37353 12931 -7341 11948
7965A1948k839R771O176Q371k707k4722j8657j1770p225J8078l0976J741L6662
$$ 11948 9109 18880 25056 33427 30720 5998 -12659 -24429 -31654 -13576 -44552 -42811 -6149
7952f149K200q287J8521j2959l2507k0931o589l14M901K9587L1902J1943n147
$$ -6149 -3949 -12236 6285 -6674 -39181 -60112 -66701 -67015 -62114 -32527 -625 11318 6171
7939F171k3515J9108K3643P992k3163K233j3375j7090M842L876K7356k06o06J3728
$$ 6171 -17344 1764 25407 33399 10236 12469 -906 -17996 -13154 -9278 18078 17872 17266 30994
7925C0994j3187m2864j645j2401p890q304J0862K5078n272p077J3615L0516K190
$$ 30994 17807 -25057 -26702 -39103 -46993 -55297 -44435 -19357 -24629 -31706 -18091 12425 14615
7912A4615k2085p178N558L631N926j1543j6711p34o356L4141L1694k4539l8744
$$ 14615 -7470 -14648 -9090 -5459 467 -11076 -27787 -28521 -34877 -736 30958 6419 -32325
7899c2325k1100P093k254J7380K7138Q271l9665l9479J4425L4562j7078J2471
$$ -32325 -53425 -46332 -48586 -31206 -4068 4203 -35462 -74941 -60516 -25954 -43032 -30561
7887c0561J0382O3056K5305k1793j1105j827k1080Q862k095j3028j049j6495p924
$$ -30561 -20179 42877 68182 46389 35284 33457 12377 21239 19144 6116 5067 -11428 -19352
7874a9352l251l166J4693J8890r18j874J732M52J7829n436j9412k191K2074j6152
$$ -19352 -22603 -25769 -11076 7814 6896 5022 6754 7206 25035 19599 187 -2004 20070 3918
7860C918o963j218k0621k6800L044L9500K8236N513j9267o780J8125J1712o203
$$ 3918 -3045 -4263 -24884 -51684 -48640 -9140 19096 24609 5342 -1438 16687 28399 22196
7847B2196k4669j4081j4987K551J2039r313K0698j057q537J7417j1636j0220k6732
$$ 22196 -2473 -16554 -31541 -28990 -16951 -26264 -5566 -6623 -15160 2257 -9379 -19599 -46331
7834d6331K4696K8640K195M560j662j226J8831J9100k3370l5687p044k2768K20
$$ -46331 -21635 7005 9200 13760 12098 10872 29703 48803 25433 -10254 -17298 -40066 -39846
7821c9846L7909k3025j1223J7862l3672J9803J0463J1898J0875O75k4774j0090
$$ -39846 -1937 -24962 -36185 -18323 -51995 -32192 -21729 -9831 1044 1719 -23055 -33145
7809c3145L0538K5936j6092r801L2821L396m920N863k3752r106m261k7331k476
$$ -33145 -2607 23329 7237 -2564 30257 33653 28733 34596 10844 1738 -2523 -29854 -32330
7796c2330L0121K1653p281k6785r171m561N236k189J0948j280j9924j1211p823
$$ -32330 -2209 19444 12163 -14622 -23793 -28354 -23118 -25307 -14359 -15639 -35563 -46774 -54597
7783e4597J8777J1385J6297q062m0908j3595J6914N7234K6557j4259k8680j2462
$$ -54597 -35820 -24435 -8138 -16200 -57108 -70703 -53789 3445 30002 15743 -12937 -25399
7771b5399l744L8425J154n335r660j1078J7480j99j1500M810K0640K2017L032
$$ -25399 -29143 9282 10436 5101 -4559 -15637 1843 1644 -9856 -5046 15594 37611 40643
7758D0643j574p460j6926M293o68L372l5261k688L531K531J5699J2462K3060n598
$$ 40643 39069 31609 14683 18976 18308 21680 -13581 -16269 -12738 -10207 5492 17954 41014 35416
7744C5416k6960M671J7609j3788j0551q860J6499L4087j967k7054l3410j5495
$$ 35416 8456 13127 30736 16948 6397 -2463 14036 48123 46156 19102 -14308 -29803
7732b9803M328N136J7452j1080J0226r368j9382P050J5986K6119K5405R752j0833
$$ -29803 -25475 -20339 -2887 -13967 -3741 -13109 -32491 -25441 -9455 16664 42069 51821 40988
7719D0988l3528p019r620o599n600J5082J6030J2946K2005J3522j2394l5245j5737
$$ 40988 7460 441 -9179 -15778 -21378 -6296 9734 22680 44685 58207 45813 10568 -5169
7706e169J0802J0183j5311R461N44j1072O082K617r117P729j4546K9324J7146
$$ -5169 5633 15816 505 9966 10510 -562 5520 8137 -980 6749 -7797 21527 38673
7693C8673j9736k9591J5176M5916j1419j0569p853o179j2864k5712O466K28l523
$$ 38673 18937 -10654 4522 50438 39019 28450 20597 14418 1554 -24158 -17692 -17464 -20987
7680b0987J7262M561k5761J1301J3973K3665l314R051M37j4033o85K002j1024
$$ -20987 -3725 836 -24925 -13624 349 24014 20700 29751 30188 16155 15470 17472 6448
7667F448J2434P990k1718j316J342k272q850q899J2895N055j7288J748J0241j4011
$$ 6448 18882 26872 5154 3838 5180 2908 -5942 -14841 -1946 3109 -14179 -12431 -2190 -16201
7653a6201J561J5500l3576J8121N3457M831K0662k3953n3336j9341K1858M832
$$ -16201 -14640 860 -32716 -14595 38862 43693 64355 40402 -12934 -32275 -10417 -5585
7641e585m9997J9536M0933R646P46o087j6595l0080j5846l1R93j0875K0922K5179
$$ -5585 -55582 -36046 4887 14533 15279 9192 -7403 -37483 -53329 -53360 -52367 -63242 -42320 -17141
7627a7141O140O016L0214J9157j6926j8164j9459O637j447j4979O669J486j7790
$$ -17141 -11001 -4985 25229 44386 27460 9296 -10163 -3526 -4973 -19952 -13283 -11797 -29587
7614b9587J0770k455n583O120R360J2418J3089K8630J5620j2337l3549j0535k5106
$$ -29587 -18817 -21272 -26855 -20735 -11375 1043 14132 42762 58382 46045 12496 1961 -23145
7601b3145p458P235j0698j4135m564l792M8425O440J3201J4794j9079j9630Q948
$$ -23145 -30603 -23368 -34066 -48201 -52765 -56557 -8132 -1692 11509 26303 7224 -12406 -3458
7588c458J7629l23j0510N00J2724K877k2952j8819r105J3092P371K427j6426k0085
$$ -3458 14171 13848 3338 3838 16562 19439 -3513 -22332 -31437 -18345 -10974 -8547 -24973 -45058
$$ [...]
##END NTUPLES=NMR SPECTRUM
##END=
