##TITLE=Analysis number 307858
Compound Code cc 44423
Book Reference 440/8
Project Code adrs
Chemist Name craigr
##JCAMPDX= 6.0         $$ Bruker NMR JCAMP-DX V2.0
##DATA TYPE= NMR SPECTRUM
##DATA CLASS= NTUPLES
##ORIGIN= Bruker BioSpin GmbH
##OWNER= NMR
$$ XWIN-NMR		Version 3.5
$$ Mon May 16 13:22:04 2005 GMT Daylight Time (UT+1h)  MAYBRIDGE\NMR@NMR_250MHZ
##.OBSERVE FREQUENCY= 250.131544655141
##.OBSERVE NUCLEUS= ^1H
##.ACQUISITION MODE= SIMULTANEOUS (DQD)
##.ACQUISITION SCHEME= undefined
##.AVERAGES= 16
##.DIGITISER RES= 18
##SPECTROMETER/DATA SYSTEM= dpx250
##.PULSE SEQUENCE= zg30
##.SOLVENT NAME= CDCl3
##.SHIFT REFERENCE= (INTERNAL, CDCl3, 0, 16.4467)
##AUDIT TRAIL= $$ (NUMBER, WHEN, WHO, WHERE, WHAT)
$$ ##TITLE= Audit trail, XWIN-NMR		Version 3.5
$$ ##JCAMPDX= 5.01
$$ ##ORIGIN= Bruker BioSpin GmbH
$$ ##OWNER= NMR
$$ C:\u/data/dgb/nmr/ADRS/3000/pdata/1/auditp.txt
$$ ##AUDIT TRAIL=  $$ (NUMBER, WHEN, WHO, WHERE, WHAT)
(   1,<2005-05-16 13:21:46.10 +100>,<MAYBRIDGE\NMR>,<NMR_250MHZ>,
      <created by zg, POWCHK disabled, PULCHK disabled
       configuration hash MD5:
       62 19 C7 07 E1 42 D1 B7 37 6C 3D D0 77 39 F9 E6
       data hash MD5: 64K
       5B E7 5B 63 C9 2D 0B 4B 68 E2 6D 69 2C 71 BE 3C>)
(   2,<2005-05-16 13:21:56.77 +100>,<MAYBRIDGE\NMR>,<NMR_250MHZ>,
      <Start of raw data processing
       ef LB = 0.3 FT_mod = 6 PKNL = 1 SI = 32K 
       data hash MD5: 32K
       85 5A 32 FE 4E ED 47 48 70 AF 9D BD 60 61 DF 14>)
(   3,<2005-05-16 13:21:58.48 +100>,<MAYBRIDGE\NMR>,<NMR_250MHZ>,
      <apk 
       data hash MD5: 32K
       7C 6F F8 72 E3 01 1B C2 FE 78 A7 74 38 03 9A 14>)
(   4,<2005-05-16 13:21:59.12 +100>,<MAYBRIDGE\NMR>,<NMR_250MHZ>,
      <abs ABSG = 5 
       data hash MD5: 32K
       72 6B 6C C6 7D 90 F0 59 B6 8E EE EF 06 29 3B 43>)
$$ ##END=
$$ 
$$ hash MD5
$$ 31 52 37 15 C0 F6 3B C7 25 13 10 F6 FA 0F 8C B9
##$RELAX= 
##$RELAX= 
##$RELAX= 
##$RELAX= 
##$RELAX= 
##$RELAX= 
##$RELAX= 
$$ Bruker specific parameters
$$ --------------------------
##$DU= <C:\u>
##$EXPNO= 3000
##$NAME= <ADRS>
##$PROCNO= 1
##$TYPE= <nmr>
##$USER= <dgb>
##$AMP= (0..31)
100 100 100 100 100 100 100 100 100 100 100 100 100 100 100 100 100 100 
100 100 100 100 100 100 100 100 100 100 100 100 100 100 
##$AQSEQ= 0
##$AQ_mod= 3
##$AUNM= <au_zg>
##$AUTOPOS= <45 >
##$BF1= 250.13
##$BF2= 250.13
##$BF3= 250.13
##$BF4= 250.13
##$BF5= 500.13
##$BF6= 500.13
##$BF7= 500.13
##$BF8= 500.13
##$BYTORDA= 1
##$CFDGTYP= 0
##$CFRGTYP= 5
##$CHEMSTR= <none>
##$CNST= (0..31)
1 1 145 1 1 1 1 1 1 1 1 1 1 1 1 1 1 1 1 1 1 1 1 1 1 1 1 1 1 1 1 1 
##$CPDPRG= <>
##$CPDPRG1= <>
##$CPDPRG2= <>
##$CPDPRG3= <>
##$CPDPRG4= <mlev>
##$CPDPRG5= <mlev>
##$CPDPRG6= <mlev>
##$CPDPRG7= <mlev>
##$CPDPRG8= <mlev>
##$CPDPRGB= <>
##$CPDPRGT= <>
##$D= (0..31)
0 1 0 0 0 0 0 0 0 0.06 0 0 0 0 0 0 0.0002 0 0 0 0 0 0 0 0 0 0 0 0 0 0 
0 
##$DATE= 1116246105
##$DBL= (0..7)
120 120 120 120 120 120 120 120 
##$DBP= (0..7)
150 150 150 150 150 150 150 150 
##$DBP07= 0
##$DBPNAM0= <>
##$DBPNAM1= <>
$$ [...]
##$SUBNAM7= <"">
##$SUBNAM8= <"">
##$SUBNAM9= <"">
##$SW= 20.6930455092707
##$SWIBOX= (0..15)
0 0 3 0 0 0 0 0 0 0 0 0 0 0 0 0 
##$SW_h= 5175.983436853
##$TD= 65536
##$TD0= 1
##$TE= 296.16
##$TE2= 300
##$TE3= 300
##$TEG= 300
##$TL= (0..7)
0 120 120 120 120 120 120 120 
##$TP= (0..7)
150 150 150 150 150 150 150 150 
##$TP07= 0
##$TPNAME0= <>
##$TPNAME1= <>
##$TPNAME2= <>
##$TPNAME3= <>
##$TPNAME4= <>
##$TPNAME5= <>
##$TPNAME6= <>
##$TPNAME7= <>
##$TPOAL= (0..7)
0.5 0.5 0.5 0.5 0.5 0.5 0.5 0.5 
##$TPOFFS= (0..7)
0 0 0 0 0 0 0 0 
##$TUNHIN= 0
##$TUNHOUT= 0
##$TUNXOUT= 0
##$USERA1= <user>
##$USERA2= <user>
##$USERA3= <user>
##$USERA4= <user>
##$USERA5= <user>
##$V9= 5
##$VALIST= <valist>
##$VCLIST= <CCCCCCCCCCCCCCC>
##$VD= 0
##$VDLIST= <DDDDDDDDDDDDDDD>
##$VPLIST= <PPPPPPPPPPPPPPP>
##$VTLIST= <TTTTTTTTTTTTTTT>
##$WBST= 1024
##$WBSW= 4
##$XGAIN= (0..3)
0 0 0 0 
##$XL= 0
##$YL= 0
##$YMAX_a= 473150
##$YMIN_a= -488477
##$ZGOPTNS= <>
##$ZL1= 120
##$ZL2= 120
##$ZL3= 120
##$ZL4= 120
##$ABSF1= 16.44674
##$ABSF2= -4.246433
##$ABSG= 5
##$ABSL= 3
##$ALPHA= 0
##$AQORDER= 0
##$ASSFAC= 0
##$ASSFACI= 0
##$ASSFACX= 0
##$ASSWID= 0
##$AUNMP= <proc_1d>
##$AZFE= 0.1
##$AZFW= 0.1
##$BCFW= 0
##$BC_mod= 0
##$BYTORDP= 0
##$COROFFS= 0
##$CY= 12.5
##$DATMOD= 1
##$DC= 0
##$DFILT= <>
##$DTYPP= 0
##$F1P= 14.0000005364418
##$F2P= -0.99999901652339
##$FCOR= 0.5
##$FTSIZE= 32768
##$FT_mod= 6
##$GAMMA= 0
##$GB= 0
##$INTBC= 1
##$INTSCL= 1
##$ISEN= 128
##$LB= 0.3
##$LEV0= 0
##$LPBIN= 0
##$MAXI= 10000
##$MC2= 0
##$MEAN= 0
##$ME_mod= 0
##$MI= 0
##$NCOEF= 0
##$NC_proc= -2
##$NLEV= 6
##$NOISF1= 0
##$NOISF2= 0
##$NSP= 0
##$NTH_PI= 0
##$NZP= 0
##$OFFSET= 16.44674
##$PC= 1
##$PHC0= -74.18686
##$PHC1= 6.426105
##$PH_mod= 1
##$PKNL= yes
##$PPARMOD= 0
##$PSCAL= 4
##$PSIGN= 0
##$REVERSE= no
##$SF= 250.130018823323
##$SI= 32768
##$SIGF1= 0
##$SIGF2= 0
##$SINO= 400
##$SIOLD= 32768
##$SREGLST= <1H.CDCl3>
##$SSB= 0
##$STSI= 32768
##$STSR= 0
##$SW_p= 5175.98343685301
##$SYMM= 0
##$S_DEV= 0
##$TDeff= 65536
##$TDoff= 0
##$TI= <Analysis number 999999
Compound Code 99
Book Reference 9
Project Code 9>
##$TILT= no
##$TM1= 0
##$TM2= 0
##$TOPLEV= 0
##$USERP1= <user>
##$USERP2= <user>
##$USERP3= <user>
##$USERP4= <user>
##$USERP5= <user>
##$WDW= 1
##$XDIM= 32768
##$YMAX_p= 322467184
##$YMIN_p= -389599
$$ End of Bruker specific parameters
$$ ---------------------------------
##NTUPLES= NMR SPECTRUM
##VAR_NAME=  FREQUENCY,     SPECTRUM/REAL,   SPECTRUM/IMAG
##SYMBOL=    X,             R,               I
##VAR_TYPE=  INDEPENDENT,   DEPENDENT,       DEPENDENT
##VAR_FORM=  AFFN,          ASDF,            ASDF
##VAR_DIM=   32768,         32768,           32768
##UNITS=     HZ,            ARBITRARY UNITS, ARBITRARY UNITS
##FACTOR=    0.157963299565203, 1,           1
##FIRST=     4113.8231848722, 0,             0
##LAST=      -1062.16025198081, 0,           0
##MIN=       -1062.16025198081, -389599,     0
##MAX=       4113.8231848722, 322467184,     0
$$ Real data points
##PAGE= N=1
##DATA TABLE= (X++(R..R)), XYDATA
$$ [...]
20048A08748J831O306K4220L2415J8146K904j9169l2977j8820k653q292o337k0990
20035H5332k5397r903j0691q572j7020M459j014Q52k98k490j0255N505N361K050
20021A7919k391K152J1525m942j4241O083J6708K945n00q713j777j1650m540J654
20007A0232o932J1785L578r235J0441J0743n371k57J5065K0515J1795K6108P144
19994A05611j639K5607L7188M1059J3167k7095l6797l1501o702K041m327j7840
19982I8772k1779j6628j4313k1738j0361O351n64Q037j1500J224j934j646j6100
19969b179j5400K920R619J6885J578P6j468J0899k1655k14J0364k541j576k100
19955E208M063o539K007J143N035j2168K204L954M360J2193O742k225p710p521
$$ plain form
20048 108748 110579 116885 141105 173520 191666 194570 175401 142424 123604 120951 112659 106322 85332
20035 85332 59935 50032 39341 30769 13749 18208 17194 18046 17748 15258 5003 10508 15869 17919
20021 17919 15528 17680 29205 24263 10022 16105 32813 35758 35258 26545 24768 13118 8578 10232
20007 10232 3300 15085 18663 9428 19869 30612 25241 24984 40049 60564 72359 98467 105611
19994 105611 103972 129579 166767 207826 220993 193898 157101 125600 118898 120939 116612 98772
19982 98772 76993 60365 46052 24314 13953 20304 19740 27777 16277 17501 15567 13921 -2179
19969 -2179 -17579 -14659 -5040 11845 13423 13499 12031 22930 1275 1061 11425 8884 7308 5208
19955 5208 9271 2732 4739 5882 10917 -1251 953 4907 9267 21460 28202 25977 18267 10746
19941A0746L767R430J2841p63n681j4096N21L087m274Q455L822L799k168r783
19927A9703p903L53O575m437L781o524k488M413r563L590J460j28j709r996k770
19912e643n806K940J1560K137q917p640J250J0088J3372m566m811K67l737L629
19898D123N1j5320Q398J3113K685q807L882P516o852j9817K602O722n953k415
19884a0072K839j039K897R451R569k622j677k774m164M347m739l349r07l234K732
19869b742l339J5058J3545J2188J1282K1023K1190K693r489m973R490O661K0458
19856A13045Q777J2660n975k2121j9263j6743j763O007J8784N082j3946j7064
19844F7480j6387o825n391l569L011r305l159m640l608j394n943l339J0703j229
$$ plain form
19941 10746 14513 23943 36784 36021 30340 16244 16765 19852 15578 24033 27855 31654 29486 19703
19927 19703 11800 12153 18728 14291 18072 11548 9060 13473 3910 7500 8960 8832 7123 -2873 -5643
19912 -5643 -11449 -8509 3051 5188 -3729 -11369 -10119 -31 13341 8775 3964 4231 494 4123
19898 4123 4174 -11146 -2748 10365 13050 4243 8125 15641 8789 -11028 -8426 -1704 -7657 -10072
19884 -10072 -7233 -8272 -5375 4076 13645 11023 9346 6572 2408 6755 2016 -1333 -2240 -5474 -2742
19869 -2742 -6081 8977 22522 34710 45992 67015 88205 90898 81409 76436 85926 92587 113045
19856 113045 121822 134482 128507 106386 87123 70380 68617 74624 93408 98490 84544 67480
19844 67480 51093 44268 38877 35308 38319 29014 25855 21215 17607 16213 10270 6931 17634 16405
19830A6405j5216M95n61P432L962j8610o40M789J1455J908M472R729Q384J239
19816C5243O520j398O462l465N413K5934L2451J7354n947j3248q5J3216j020r365
19802A08065p644j3055j8630M369L134J6796J7432q593k4069k2979k1072j2786
19790B0968n774M988J225q013J56K433m922p421J1463J2626J4877l902k1012k018
19776A5674J1718N508p617k0858p540p766K862R530q46O804P157N640p111k371
19762A0784n356M278O890Q775q357n889o928M227K023j0847m668P802M460K710
19748I904k723O339n943m579M74l709L586K62k766r715r549J0332Q195J572O918
19733H598N817N330J957K648K117r802p276o614q75Q244j981q255O195J5384k566
$$ plain form
19830 16405 1189 1684 1123 8555 12517 -6093 -6733 -1944 9511 11419 15891 25620 34004 35243
19816 35243 41763 40365 46827 43362 48775 74709 107160 124514 118567 105319 105234 118450 117430 108065
19802 108065 100421 87366 68736 73105 76239 93035 110467 101874 77805 54826 33754 20968
19790 20968 15194 20182 21407 13394 13550 15983 11061 3640 15103 27729 42606 38704 17692 15674
19776 15674 27392 32900 25283 4425 -3115 -10881 -8019 1511 665 7469 14626 20266 13155 10784
19762 10784 5428 9706 16596 25371 17014 11125 4197 8424 10447 -400 -5068 2734 7194 9904
19748 9904 7181 13520 7577 2998 3472 -237 3349 3611 845 -8870 -18419 -8087 108 1680 8598
19733 8598 14415 19745 21702 24350 26467 16665 9389 2775 1900 10144 8163 -92 6103 21487 18921
19718A8921n04p158j2806J1808L015j1260L027Q873K285O270n793l522O745P257
19704B7158l928N708j0009j0653k437M241N987o93m869M799O554o928j5678j024
19690a772O593K793k206L343K486J1803o247k826K890o477J835J0184M700j205
19676B5894j6997p093L041J4949O047O120p458j6120M652J2848M629O565l536
19663C3541O822N996P870q12m659J5516n001M423J716j450M532J2613Q325K175
19649I1607J8458J8115R514N87j3470k899J0641J2227K4597P954j5067k7963k2885
19636A11416o184R201N872l269j7176k5375j5572n04l935r293j5282r146J280
19623B2033l264R022M159j1975M03q948N861L098K946K407K966n64M783J0795
$$ plain form
19718 18921 18417 11259 -1547 10261 13276 2016 5043 13916 16201 22471 16678 13156 19901 27158
19704 27158 23230 28938 18929 8276 5839 10080 16067 15374 10505 15304 21858 14930 -748 -1772
19690 -1772 4821 7614 5408 8751 11237 23040 16793 13967 16857 10380 12215 22399 27099 25894
19676 25894 8897 1804 4845 19794 25841 31961 24503 8383 13035 25883 30512 37077 33541
19663 33541 40363 46359 54229 53417 48758 64274 59273 63696 65412 63962 68494 81107 89432 91607
19649 91607 110065 128180 137694 138281 124811 121912 132553 144780 169377 177331 162264 134301 111416
19636 111416 105232 114433 120305 117036 99860 74485 58913 58409 54474 45181 29899 20753 22033
19623 22033 18769 27791 31950 19975 20378 11430 17291 20389 23335 25742 28708 28144 32927 43722
19609D3722k092R223r89n529r150J2870J2421K148J2789K137J8393L8009K4444
19596A58396K2263R180j7489j1300P374J7815J1995J011j0136k4758j6943j603
19584A45805J679M495j3261k1692j9358j6161j2480r490M467K637p84r658k4408
19571C1791p231O122L79n911q392J1115J4091r580o815M290J0366q402j0649Q185
19557B9359L100J203n799j186l897m566o875p362J8845M432p338J1347P3J0023
19543D1359J1111Q996J2283J0448R953M726j4799o325L908K190j752P41k509m259
19529G6071j2325K165n482p756L011j979O89M515m140j0369j0094q078j3513M662
19515A7377P195J314k208q980n422P026L90O598J3431k115N28R17L577n937q11
$$ plain form
19609 43722 41630 50853 49864 44335 35185 48055 60476 62624 75413 77550 95943 133952 158396
19596 158396 180659 189839 172350 161050 168424 186239 198234 199245 189109 164351 147408 145805
19584 145805 147484 151979 138718 117026 97668 81507 69027 59537 64004 66641 65857 56199 31791
19571 31791 24560 30682 31061 25150 16758 27873 41964 32384 25569 29859 40225 31823 21174 29359
19557 29359 32459 33662 27863 26677 22780 18214 11339 3977 22822 27254 19916 31263 31336 41359
19543 41359 52470 61466 73749 84197 94150 98876 84077 77752 81660 83850 82098 82839 80330 76071
19529 76071 63746 65911 60429 52673 55684 53705 54394 58909 54769 44400 34306 26228 12715 17377
19515 17377 24572 25886 23678 14698 9276 16302 16692 23290 36721 34606 35134 36051 39628 33691 32880
19500C2880J227L213R48N531k0o181J289Q486J3829J6580Q31n390n752n993O034
19485F7512J1077Q838J2645N340p677j4582j2904j1157r227n967N237K5o257M803
19471D7706p93M836J0151N243n978J2176m58o75n946j61P002J7382P487O578K6824
19456A31374J3062n788n974k916N30O007m174K695J3705J7527J6471J1667o874
19443A87312j8216k8611j8428j1106n414r814j4864j3152r111j2615n821O509
19431D6669O299k76N264R66o26K746R036j778j5376k273M146k641M866J634P982
19416F6638J0982M141L42O982m213o022J5177J6006J9835J3023o795J2874O837
19403A55807l22K645R317J3668L9466M0667L5368N749J4884K9570L1583j0121
$$ plain form
19500 32880 34107 37320 38268 43799 43779 37598 38887 47373 61202 77782 78613 73223 67471 61478 67512
19485 67512 78589 87427 100072 105412 97735 83153 70249 59092 49865 43898 49135 49160 42903 47706
19471 47706 46913 51749 61900 67143 61165 73341 72883 72208 66262 66101 73103 90485 97972 104550 131374
19456 131374 144436 138648 132674 129758 130288 136295 132121 134816 148521 166048 182519 194186 187312
19443 187312 169096 140485 122057 110951 105537 95723 80859 67707 58596 45981 40160 46669
19431 46669 52968 52692 57956 58922 58296 61042 70078 68300 52924 50651 54797 52156 57022 58656 66638
19416 66638 77620 81761 82103 89085 84872 78850 94027 110033 129868 142891 136096 148970 155807
19403 155807 155485 158130 167447 181115 220581 261248 296616 302365 317249 346819 378402 368281
19391C68281l5383l9493m5205n0862k4625j8884j3713p173k0617p478J3983J8720
19379A37551Q376J853J3094K2354M079n908J725K079J0880K257K3577K8323J9705
19366B69945L0625K6241Q444J4808L3270M4731N6157O3108M5973J0993j133K0282
19354F23444L6342O2779Q4117R3017Q9687O9858J07659J83769K83666M15066N87470
19343B636874Q66961J357592K235624L340735L172630J033611j052617j291076
19335A2300334K85137K504987M061871L547962J476434j692744m021597m483001
19327A3979383l200137j461238J49232J825119K719298J029972j885078l488174
19319I668377l014130j904621j139787p21073m83012l47937k60484k17773j55615
$$ plain form
19391 368281 332898 293405 248200 197338 172713 153829 140116 132943 112326 104848 118831 137551
19379 137551 145927 147780 160874 183228 187307 181399 183124 185203 196083 198340 221917 250240 269945
19366 269945 300570 326811 335255 350063 383333 428064 484221 547329 593302 604295 603162 623444
19354 623444 659786 722565 806682 899699 989386 1059244 1166903 1350672 1634338 2049404 2636874
19343 2636874 3503835 4861427 7097051 10437786 13610416 14644027 13591410 12300334
19335 12300334 12585471 15090458 19152329 22700291 24176725 22483981 18462384 13979383
19327 13979383 10779246 9318008 9467240 11292359 14011657 15041629 13156551 9668377
19319 9668377 6654247 4749626 3609839 2888766 2405754 2057817 1797333 1579560 1423945
19310A423945q9640n5146k7890K9188L8369l12o4753p2802m0651O155N6267J01540
19298A304270Q8747O3649N9648R7798K16552L65397N43556P53177J128922J842004
19288F463720L023803M055374L191397Q71698l79096P28202K190026J399194j55475
19279B1388843k51460J44959j218122k940039k928591j144049J034604K141234
19271A6227379N29592k307973l795824l253187k094652j319064r05071o45895
19263B435305m37102l18767k58437j97103j17020o2251l6621o1875q9524q6819
19253G69786n3910l3831m5852p6209p7923p0014m7209k4386j9404l2901k2655
19242B65492j4012j7956j6632k6146j1951j1296o150j9305j7865j073K229q44
$$ plain form
19310 1423945 1334305 1279159 1251269 1280457 1318826 1318514 1253761 1180959 1140308 1146463 1202730 1304270
19298 1304270 1393017 1456666 1516314 1614112 1830664 2196061 2739617 3492794 4621716 6463720
19288 6463720 9487523 13542897 16734294 17605992 17226896 17955098 20145124 21544318 21388843
19279 21388843 21137383 21282342 20064220 17124181 14195590 13051541 14086145 16227379
19271 16227379 16756971 14448998 10653174 7399987 5305335 3986271 3081200 2435305
19263 2435305 1998203 1679436 1420999 1223896 1106876 1044625 1008004 946129 856605 769786
19253 769786 715876 682045 636193 559984 482061 412047 364838 340452 321048 288147 265492
19242 265492 251480 233524 216892 190746 178795 167499 161349 142044 124179 123106 125335 124491
19230A24491k602K112n156q431o724l860J056K478n315q445j897O117J055Q956
19216A03835P102P292L1232M2511N9622O0478J2558m3814m9945l5565l1909k9277
19204A34120j3064j0611j1206j466J2985o850j3766N696o396m240L063j3996j3593
19191F0676j304J0155Q422m751q344K064n712j564m230J4893J1521m972k580q191
19177F6083M294M254o84N273J3595R673j5511l2824k0885r478m311m863p009M990
19163A2597J1174o99R60o539N433M842K139J0186J5737M12j812R85L478J743m468
19148E6168p40q067l442j0027jJ0414O734m444l907O882O85o045n318J0695J6696
19133F6283J1564q702k1360p431L832O934p589m918q366k698P741M271j904l522
$$ plain form
19230 124491 121889 124001 118845 110414 103690 99830 100886 103364 98049 89604 87707 93824 94879 103835
19216 103835 110937 118229 149461 191972 251594 312072 324630 280816 230871 195306 163397 134120
19204 134120 121056 110445 99239 97773 110758 103908 90142 95838 89442 85202 88265 74269 60676
19191 60676 59372 69527 77949 73198 64854 66918 61206 59642 55412 70305 81826 76854 74274 66083
19177 66083 70377 74631 73947 79220 92815 102488 86977 54153 33268 23790 19479 14616 7607 12597
19163 12597 23771 23072 24032 17493 22926 27768 29907 40093 55830 56242 54430 55415 58893 60636 56168
19148 56168 55428 47361 43919 33892 33891 44305 51039 46595 42688 49570 50255 44210 38892 49587 66283
19133 66283 77847 69145 47785 40354 44186 51120 43531 38613 30247 27549 35290 39561 37657 34135
19119C4135R145J6703j873j3009q499r104k473K278p346j559p828J0908R075k108
19105B8445p166N82o662J579N346L430o557j272L231P883l510o087J3832P722
19091D0796o719n703r8q085P227J2219l096j657m261J0995n708n731q574N336
19077B6941P537n361l343k605O035K56j1871K876P125J2836m993N99N002K884
19063D3918M373N150m666q639K829P587j278j262l025M294K82k416L614n806q362
19048C6593n530R150P582q963J428J1779K1306K0485k355q021o998o448n826q543
19034E5639n467j282P576m590q491k640R09Q311J88j735K472O081J902k158l18
19019E6397k164m009O746J345J0704r172j5073Q94K0082J9958N138K2653L8895
$$ plain form
19119 34135 43280 59983 58110 45101 36602 27498 25025 27303 19957 18398 10570 21478 30553 28445
19105 28445 21279 21861 15199 16778 22124 25554 18997 17725 20956 28839 25329 19242 33074 40796
19091 40796 34077 28374 28276 20191 27418 39637 36541 34884 30623 41618 35910 30179 21605 26941
19077 26941 34478 29117 25774 23169 29204 29460 17589 20465 27590 40426 35433 36032 41034 43918
19063 43918 48291 53441 48775 40136 42965 50552 49274 48012 44987 49281 49563 47147 50761 44955 36593
19048 36593 31063 40213 47795 38832 40260 52039 73345 93830 91475 83454 76456 70008 64182 55639
19034 55639 50172 48890 56466 51876 43385 40745 41654 49965 50153 48418 50890 56971 58873 56715 56397
19019 56397 54233 50224 56970 58315 69019 59847 44774 45668 65750 85708 90846 113499 152394
19006A52394L5954K2255r19k1739k8679k0156l397k7636j9337j1792M936J0890
18994I2774J3042O562l729l503K663R24k034n500Q209J5824M986L722M858M821
18980A43619P315Q448R009P871K782O956P291J167J1661J2803K8997K8411K4934
18967C01264J9465J5893R248L2475N4098M0736L6041K6785K3646K9546O3398Q1387
18955G33982O6422O8485J09371J38166J93389K85518M22244O31220R42079J435044
18945E025920K314361L372797L057592Q72402j112902j263296K74365K366260
18937A4907499L708627L056844J553003l88612k149118k683328j375316R8852
18929A6728451o74436k617144l609720l054354k039126j271457q07576n28861
$$ plain form
19006 152394 188348 210603 209684 187945 159266 139110 135713 108077 88740 76948 81884 92774
18994 92774 105816 112378 108649 105146 107809 108733 106699 101199 109408 125232 130218 133940 138798 143619
18980 143619 150934 159382 168391 176262 179044 186000 193291 194458 206119 218922 247919 276330 301264
18967 301264 320729 336622 345870 378345 432443 473179 509220 536005 559651 589197 652595 733982
18955 733982 800404 868889 978260 1116426 1309815 1595333 2017577 2648797 3590876 5025920
18945 5025920 7340281 10713078 13770670 14643072 13530170 12266874 12541239 14907499
18937 14907499 18616126 21672970 23225973 22837361 20688243 18004915 16629599 16728451
18929 16728451 16054015 13436871 9827151 6772797 4733671 3462214 2654638 2125777
18921B125777l38536k27609j68003j42980j07689p7132m4095j2993n188R881l488
18910A007945j6514j1842M871J5086Q208j641K4375N8278J01038J36073J57874
18899A483751K01132L05134M15734N90630R10155J493396K508616L849028L722844
18890A5480420J029011j766776k435579j105282P49966K938923N698101O963216
18882B7552000L525420k385233n850120n047325k256770M31867J432598l88714
18874A7013723k958502l991862l219473k113699j330724q46569n44464l48346
18866A660084k49281k08870j68021j01866p6474q9767o8025n6291l1978l1105
18856E78406n5512o1760m2263m5106l5493k0691k4887k6192k3019j6330k6836
$$ plain form
18921 2125777 1787241 1559632 1391629 1248649 1140960 1063828 1019733 1006740 1001552 1011433 1007945
18910 1007945 991431 979589 984460 999546 1007754 1006113 1030488 1088766 1189804 1325877 1483751
18899 1483751 1684883 1990017 2405751 2996381 3906536 5399932 7908548 11757576 15480420
18890 15480420 16509431 14742655 12307076 11201794 11951760 14890683 20588784 27552000
18882 27552000 31077420 28692187 22842067 17794742 15537972 15969839 17402437 17013723
18874 17013723 14055221 10063359 6843886 4730187 3399463 2552894 2008430 1660084
18866 1660084 1410803 1201933 1033912 932046 855572 765805 697780 641489 609511 578406
18856 578406 522894 461134 418871 373765 338272 317581 292694 266502 243483 227153 200317
18845B00317j3271j5137m556J943j0864j2259r382j070p268o388l245j0920r381
18832I8519R522M04L849P091m260l774k151r19K3182M0503N8123P5184N4138r425
18818C49986n8666o4975o3259k8596j2319o234O27K650J142K541P296q131k224
18805A19838P971J9672K1456J1546L830k378k427j4485m271J2364l527r799J264
18792A61054N794J2329J3775o422j6249j7972k6790k7230k9068j0543j032j0052
18780D7594J442R540k085k893j2398k140J1436J2136P413J6791N201M864K4785
18767A21686L4001L0430L718j7997k4170j0960o729k384J0522K1766K3970K6827
18755B10680K7691J2019l20k2278j9077O112J4641R393r220l9893l2643l858M211
$$ plain form
18845 200317 187046 171909 167353 169296 158432 146173 136791 135721 128453 122065 118820 107900 98519
18832 98519 108041 108445 112294 119385 115125 111351 109200 108281 131463 171966 230089 305273 359411 349986
18818 349986 291320 226345 163086 134490 122171 115937 116564 119214 120356 122897 130193 122062 119838
18805 119838 127809 147481 168937 180483 184313 181935 179508 165023 160752 173116 169589 159790 161054
18792 161054 166848 179177 192952 186530 170281 152309 125519 98289 69221 58678 57646 47594
18780 47594 49036 58576 56491 53598 41200 39060 50496 62632 70045 86836 92037 96901 121686
18767 121686 155687 186117 189835 171838 147668 136708 129979 127595 138117 159883 183853 210680
18755 210680 238371 250390 250070 227792 208715 214827 229468 238861 229641 189748 157105 153247 157458
18742A57458k845l542j0495k8628k3267p999m248j964k820j1701q071q766o145
18729C6967o35J0563p017R36o785J697L991K0989K736k0922l566R641j2541j2977
18715B3077p612J0480L785N779M49o093M242O410p779N964K530M627P736J3141
18701F6736K0653J8840J2251K5800M4243K1802L523j1010j4453o257M184j0754
18689A75558M807k928k5886l7834k3136j9046k0918j5601q763r588p897j284R200
18676A6684k140R74o448Q46L69J2412j0011j0225N977O752N295J1358N769L812
18662D1424K906j180n304J2274J7469Q217R265J4817M6694N0995M1455N328k4077
18649B20283k8145q906P667K0571K3571K7189L045k2007m2061l2813l0388r947
$$ plain form
18742 157458 154613 151071 140576 111948 88681 80682 76434 74470 71650 59949 51878 43112 36967
18729 36967 36332 46895 39878 40814 34029 35726 39717 60706 63442 42520 38954 48595 36054 23077
18715 23077 15465 25945 29730 35509 35958 29865 34107 40517 32738 38702 41232 45859 53595 66736
18701 66736 87389 106229 118480 144280 188523 210325 213848 202838 188385 182128 186312 175558
18689 175558 180365 177437 151551 113717 90581 71535 50617 35016 26253 16665 8768 7484 16684
18676 16684 14544 15518 9070 9916 10285 22697 12686 2461 8438 15190 20485 31843 37612 41424
18662 41424 44330 43150 37846 50120 67589 75806 85071 99888 146582 197577 239032 244360 220283
18649 220283 192138 183232 190899 211470 235041 262230 265275 243268 201207 168394 138006 128059
18637A28059J202J7407N145p091k6778l6799k1663j821N644n182r194M05q959
18624D0375o212M253l530p538n806j310M860j2981j3271J1523K005K566o228k859
18610E847N628J2624j3159l824N385J2181J4682J2990K4352K3715L8012L9610
18598A78043K4296j459k6722j0164n900m860J5032J2745l625j8043j7346k1731
18586A20266k0621j8736p333r571j5802o802p076m249N946j422J754J911L421
18573D1686J548p636n689j2730r94m646O202k174p766p136m99n35o426J541N39
18558d715L880o46P394P825M711j5P1q074J0356R526M255n51K802n063m118P369
18542C5007J2083K448R533r133j2773j7506M280N503K743m859m749K444J1189
$$ plain form
18637 128059 129261 146668 151813 144722 117944 81145 59482 57661 63305 58123 48929 49334 40375
18624 40375 34163 38416 34886 27348 21542 20232 25092 12111 -1160 10363 12368 14934 8706 5847
18610 5847 11475 24099 10940 7116 12501 24682 39364 52354 76706 100421 138433 178043
18598 178043 202339 200880 174158 163994 158094 153234 168266 181011 177386 159343 141997 120266
18586 120266 99645 80909 73576 64005 48203 41401 34325 30076 36022 34600 36354 38265 41686
18573 41686 43234 35598 29909 17179 16185 11539 17741 15567 7801 665 166 -369 -6795 -5254 -4715
18558 -4715 -835 -1481 5913 13738 18449 18434 18505 10431 20787 30313 34568 34017 36819 31756 27638 35007
18542 35007 47090 49538 59071 49938 37165 19659 23939 29442 32185 27326 22577 25021 36210
18529C6210l548O170J6148m599m422m36P195J2131J4083K877j5890j1775j691
18516E2453K204n817k398J2266O203q191q419L067K255R56J1609J1621N145o30
18502H2324q960j920L460L75n936m160n307M18M053k375l679o592p260o863K419
18487C9997k596k917j4675Q21M570K867L466o116m891j2265K0103K4501m703l607
18473D4555j473O343L388L044O267J3733J9899L1409K2997J1245o378q745O070
18460A52354K774J6275Q419o203m1663l3455q342l134j626J169K006J300J6l774
18446H6116j3355j5373j393Q741O319o367q489L422r225O491R363M191J0657O968
18432H8066K1198N647l108k877R940J1001l954M234m347J8211K4365K4908L5601
$$ plain form
18529 36210 32662 38832 54980 50381 45959 45523 52718 64849 78932 81809 65919 54144 52453
18516 52453 54657 48840 46442 58708 64911 56720 48301 51368 53623 54579 66188 77809 82954 82324
18502 82324 73364 71444 74904 75279 69343 65183 59876 60294 64347 61972 58293 51701 44441 37578 39997
18487 39997 37401 34484 19809 20630 25200 28067 31533 25417 20526 8261 28364 52865 48162 44555
18473 44555 43082 49425 52813 55857 62124 75857 95756 127165 150162 161407 155029 146284 152354
18460 152354 155128 171403 179822 173619 131956 98501 90159 87025 85399 86568 88574 89874 89890 86116
18446 86116 72761 57388 55995 64736 71055 64688 56199 59621 50396 56887 66250 70441 81098 88066
18432 88066 109264 114911 111803 108926 118866 129867 125913 130147 125800 144011 168376 193284 228885
18419B28885J8832P08n908o757L0951K9986Q131j0976k1835l5653k2410j2024
18407B01930j2647n406k2442k4128j3222j8273m52p06j3981j3223l032n008n325
18394F4085Q231m720m866J316o20L898K32J5371M941K975N663k048Q80o203o810
18379H2325J1462K0815J8812M113R679L2372K4345O243Q663K2221K3377J8700
18367B83127J4976K5460J4555o725j0540o330l728l175n565k9248l3746k6480
18355B12581l3011k0619k1637j3981n096o980p966Q194K2465O187m292l837O263
18342A38271N29K299Q806P031r59o207o339J499K0829L8298J5867j0945l705J1217
18328B16491K1944K7810L8553K1632O430m151L503R066O907K2507L1778L1599
$$ plain form
18419 228885 247717 248425 242517 235760 266711 296697 304828 293852 272017 236364 213954 201930
18407 201930 189283 183877 161435 137307 124085 105812 105360 104654 90673 77450 74418 69410 64085
18394 64085 72316 67596 62730 64046 63426 67324 67556 82927 87868 90843 96506 94458 95338 89135 82325
18379 82325 93787 114602 133414 137527 147206 179578 203923 210166 218829 241050 264427 283127
18367 283127 298103 323563 338118 331393 320853 314523 310795 307620 302055 272807 239061 212581
18355 212581 179570 158951 137314 123333 118237 111257 103291 111485 133950 140137 135845 132008 138271
18342 138271 138800 141099 149905 156936 155977 149770 143431 144930 165759 204057 219924 208979 205274 216491
18328 216491 238435 266245 304798 326430 332860 328709 332212 341278 348185 370692 402470 434069
18316D34069L0488J9333L1833N6525P9016J00246J42520J97209K74146M01687
18306A767072O55756J062220J702054K370788J960225K32043j385729j737714
18298F626715j023381n8287R68492K044687K325807P59752j494435k665704k342726
18289E140920j568370r72232n81874l39438j97469j32187j07493q6922o7618n1912
18279A035405m0441j1871j3297Q135L7259L8133O0133R5003R1607J12685J45160
18268A557911K07443L11688M76765P38945J151850J835976K889132M345095M973143
18259A8487948K604291j381554l739730l284250j455980N40261K577414M263001
18251A8611401L717078L42457l406036m927774m190092k773550j571070o84164
$$ plain form
18316 434069 464557 483890 515723 572248 651264 751510 894030 1091239 1365385 1767072
18306 1767072 2422828 3485048 5187102 7557890 9518115 9750158 8364429 6626715
18298 6626715 5603334 5545047 6513539 8558226 10884033 11643785 10149350 7483646 5140920
18289 5140920 3572550 2600318 2018444 1679006 1481537 1349350 1241857 1154935 1087317 1035405
18279 1035405 994964 983093 969796 977931 1015190 1053323 1113456 1208459 1300066 1412751 1557911
18268 1557911 1765354 2077042 2553807 3292752 4444602 6280578 9169710 13514805 18487948
18259 18487948 21092239 19710685 15970955 12686705 11230725 11770986 14348400 18611401
18251 18611401 22328479 22670936 19264900 14337126 10147034 7373484 5802414 5118250
18243E118250K2678P10453J434992J424384J46976j354313j930747j558765j044073
18234B969835o66384m20834k36298j09354n4233m1588o3909p6534q7202p0700
18224A142799l0647J2146M1968Q4108R9994R1802J10113J46841K07804K88196
18214B195124M43125O99055J100548J717939K691026M142174M986605K972847
18206B0948443j086801l940237m006486k578349j116382J66026J458376K910346
18198A2754936L843786K412558q92272l304159l345490j965337n05395R54570
18190I953197K609191M079289L632324O21911k556471l581671k574609r33869
18182A1249292Q21151K772902M189312K996614p85056m141731m904901l788584
$$ plain form
18243 5118250 5140928 5851381 7286373 8710757 8857733 7503420 5572673 4013908 2969835
18234 2969835 2303451 1882617 1646319 1536965 1482732 1441144 1377235 1300701 1213499 1142799
18224 1142799 1112152 1124298 1166266 1250374 1350368 1442170 1552283 1699124 1906928 2195124
18214 2195124 2638249 3337304 4437852 6155791 8846817 12988991 17975596 20948443
18206 20948443 19861642 15921405 11914919 9336570 8220188 8386214 9844590 12754936
18198 12754936 16598722 19011280 18119008 14814849 11469359 9504022 8998627 9953197
18190 9953197 12562388 16641677 20274001 20895912 18339441 14757770 12183161 11249292
18182 11249292 12070443 14843345 19032657 22029271 21244215 17102484 12197583 8408999
18174H408999k472907j544779r86394o47782m43925l04650k15346j61041j24018
18165A508157r5142r1879q4860o1011k2870K1809O4363Q8465O9457N0507M1153
18154A488149N7711J26648K35746L72155N03098P31035J168265J847981K219574
18145H750362J357323k83692j358975j222359m28837N08069J594382K987921M339872
18136A6244066M367016K025042j454769l496059l115448j227359J069877K725458
18128A7137824K003040r97420l639490m140517l136255k014753j262921p88313
18120C161195n02150l18765j92830o3666O3842J76066L15839N54324R09844J572705
18110E676404K872150N363146Q049341N331414j863314o938934o704686m161509
$$ plain form
18174 8408999 5936092 4391313 3404919 2757137 2313212 2008562 1793216 1632175 1508157
18165 1508157 1413015 1321136 1236276 1175265 1152395 1174204 1238567 1327032 1396489 1446996 1488149
18154 1488149 1545860 1672508 1908254 2280409 2783507 3514542 4682807 6530788 8750362
18145 8750362 10107685 9823993 8465018 7242659 6813822 7321891 8916273 11904194 16244066
18136 16244066 20611082 22636124 21181355 17685296 14569848 13342489 14412366 17137824
18128 17137824 19140864 18143444 14503954 10363437 7227182 5212429 3949508 3161195
18120 3161195 2659045 2340280 2147450 2083784 2147626 2323692 2639531 3193855 4103699 5676404
18110 5676404 8548554 13911700 21961041 27292455 25429141 18490207 11785521 7624012
18102G624012k334974j272433o49875k58648L0203K81624O67054J291281K038608
18093G416852K097321P60340r48167j670871j164886j18781R01136J246048L15944
18084H834936j168751j953458j777454j230039p81077m95972l17678k12917j51548
18075G46042j20581q5424n6299n1566m3197k5917l0335k1209k1851k6960j8701
18064B44002j02J6879L563r729k5832k8990j6714M956N524j5071j1367k3229j8841
18051A25049r768m690K302m442j0340j827o083j2467m671Oj419o220j2379m747
18037D8304K64m579m679Q020l347j3653J592n08N974o485j943R30N262K909O169
18022D4230k313l184j755p961n367Q007N948Q61P01K521p021m596j5714P954J595
$$ plain form
18102 7624012 5289038 4016605 3366730 3108082 3138285 3419909 4086963 5378244 7416852
18093 7416852 9514173 10274513 9326346 7655475 6490589 6371808 7272944 8518992 8834936
18084 8834936 7666185 5712727 3935273 2705234 1924157 1428185 1110507 897590 746042
18075 746042 625461 540037 483738 432172 388975 363058 332723 311514 289663 262703 244002
18064 244002 243900 260779 264342 254613 228781 199791 183077 188033 193557 178486 167119 143890 125049
18051 125049 115281 110591 112893 108451 98111 96284 90201 77734 73063 73069 71650 65430 53051 48304
18037 48304 48568 43989 39310 47330 43983 30330 31922 31414 37388 30903 28960 29890 35152 38061 44230
18022 44230 41917 38733 36978 29017 23650 31657 37605 38466 39167 41688 34667 30071 14357 22311 23906
18007B3906L879N88o447J550J0901j0051j3423r495q12j925n248p698N789J5114
17993F628l75j717L626J904m82l432O313j3586q589P717L795O018J449l771j1536
17978f038n910n739P321J5740J955J42j4392j4497M96J4331J3580O584j85o674
17964F714l952m603N599M935M64n586j264p026j105J305j808J4833R859R620p710
17949B0275J595p248J918j850j3759p305l36r196k250k614O918k820j0134j4672
17935d1478n44J0172Q193J8459L34o579j722m531K669m125n573J9876N568n45
17921A74r32j4674M323J0293k308l227O624o143m840L97j291l718N794j535N624
17906e439k51l050J089K124J058k218j2508M33J2148m608j1137J068J304k071
$$ plain form
18007 23906 27785 28373 21926 23476 34377 24326 10903 1408 596 -1329 -6577 -14275 -8486 6628
17993 6628 6253 4536 8162 10066 9584 6152 12465 -1121 -9710 -1993 1802 7820 9269 5498 -6038
17978 -6038 -11948 -17687 -10366 5374 7329 7471 -6921 -21418 -20922 -6591 6989 13573 13388 6714
17964 6714 2762 -1841 3758 8693 9157 3571 2307 -4719 -5824 -4519 -6327 8506 18365 27985 20275
17949 20275 21870 14622 16540 14690 931 -6374 -6710 -15906 -18156 -20770 -13852 -16672 -26806 -41478
17935 -41478 -42022 -31850 -23657 -5198 -4864 -11443 -13165 -17696 -15027 -19152 -24725 -4849 719 174
17921 174 -758 -15432 -11109 -816 -3124 -6351 273 -5870 -10710 -10313 -11604 -15322 -9528 -11063 -5439
17906 -5439 -5690 -8740 -7651 -5527 -4469 -6687 -19195 -18762 -6614 -11222 -22359 -21291 -19987 -22058
17892b2058N140n00J276m872j2696j195N463o163l590q34K226J2354R261Q331
17878g857J872p533l303j915p181l100l471o11J1744K144l141J1403j0725j3976
17864c5650j0383M482J4524j123N832P401k07p67r015j3685J2329Q703P386J6944
17850F771j686O54p348j0972Q898J2466Q737P90j2881o728N035O651j661j2606
17836c880n359K423J0357R16j3031Q66K376J392m230p029N359L65M917L098p41
17821b201L217j5843j4195l838J9152L913k430j0314o890p522L904k487M548J1079
17807a9907O888J2362k841j0315N12r00J4551J3902K392n781m665k942L419J045
17793G720L512L594J1887K2405Q549O886j2819p253j6188q285m63K5766K3500
$$ plain form
17892 -22058 -16918 -17418 -16142 -21014 -33710 -34905 -29442 -35605 -39195 -40029 -37803 -25449 -16188 -7857
17878 -7857 -5985 -13518 -16821 -18736 -25917 -29017 -32488 -33099 -21355 -19211 -22352 -10949 -21674 -35650
17864 -35650 -46033 -41551 -27027 -28150 -22318 -14917 -15124 -15891 -24906 -38591 -26262 -17559 -10173 6771
17850 6771 5085 5739 -1609 -12581 -3683 8783 17520 18310 5429 -1299 3736 10387 8726 -3880
17836 -3880 -9239 -6816 3541 4457 -8574 -7708 -5332 -3940 -8170 -15199 -9840 -9475 -4558 -1460 -2201
17821 -2201 1016 -14827 -29022 -32860 -13708 -9795 -12225 -22539 -29429 -36951 -33047 -35534 -30986 -19907
17807 -19907 -13019 -657 -3498 -13813 -13301 -14201 350 14252 16644 10863 6198 3256 6675 7720
17793 7720 11232 14826 26713 49118 57667 64553 51734 44481 28293 20008 19545 45311 68811
17780F8811P741r174j8233k7336p497M023J1128j2022l052o534o852o581N038
17767e40j720m392j978M906q514P205M748L518K081Q711N121k108l678j2340J8
17752A038K277K380J3038O744Q330K7561J5354k977n958p281j5415j548J8723
17739F2266J1777J1661q740n544K0679J3841J946j0030k2085m315P136J0626o865
17726H2353n642j4357j8422j3601l624j472q336m507R5q183j0527K1J588J592
17712c022Q483L800K173J492j4249j486J2400l426J270J0747J2368j0614r193
17699A0743l925J5637R570O677L781j0135J5191K3682J7257n328j1265l351N355
17686G3889K1947J8049K2631R989j9585k2639p731k1372O928J0902j9333j4211
$$ plain form
17780 68811 76552 67378 49145 21809 14312 18335 29463 17441 14389 7855 1003 -5578 -540
17767 -540 -2260 -6652 -8630 -3724 -12238 -5033 -285 3233 5314 14025 19146 17038 13360 1020 1038
17752 1038 3315 5695 18733 25477 33807 61368 76722 73745 67787 60506 45091 43543 62266
17739 62266 74043 85704 76964 71420 92099 105940 107886 97856 75771 71456 78592 89218 82353
17726 82353 76711 62354 43932 30331 26707 25235 16899 12392 12487 4304 -6223 -6202 -4614 -3022
17712 -3022 5461 9261 11434 12926 -1323 -2809 9591 6165 7435 18182 30550 19936 10743
17699 10743 6818 22455 32025 38702 42483 32348 47539 71221 88478 83150 71885 68534 73889
17686 73889 95836 113885 136516 146505 126920 104281 96550 75178 82106 93008 73675 59464
17674E9464j2442j0320j6476j8596o371Q739j718m660j499P834j350k056k515
17661a966J916j5412k056J1293J3836O509M535l124J15R443R932l220k1009q2
17647A0710J417p563Q847L829N371J9758J8493J6113n680o815J3868J2251P040
17634I7639m864o036j1079m688J2970J8478K11j0488N563l937j2028q444j5799
17621E7498j6247q801j7013o928j804p587P038J4463J1357n308j9993j5220m638
17608a3183N615R382k9L398l779P533J6713k008r835j5327q96Q527j1305N218
17594B4J0243R619J059k17P485m53J2851J3133O360j6585j4476J0244J2510P029
17580E8826j366n375k0429j2578n446n611J2218J2976o874j1821j5496n050M659
$$ plain form
17674 59464 47022 36702 20226 1630 -4741 3998 2280 -2380 -3879 3955 2605 549 -1966
17661 -1966 -50 -15462 -17518 -6225 7611 14120 18655 15531 15646 25089 35021 31801 10792 10710
17647 10710 12127 4564 13411 17240 22611 42369 60862 76975 71295 64480 78348 90599 97639
17634 97639 92775 86739 75660 70972 83942 102420 102631 92143 97706 93769 81741 73297 57498
17621 57498 41251 32450 15437 8509 6705 -882 6156 20619 31976 26668 6675 -8545 -13183
17608 -13183 -7568 1814 1785 5183 1404 8937 25650 23642 13807 -1520 -2416 6111 -5194 24
17594 24 10267 19886 20945 20728 28213 27760 40611 53744 60104 43519 29043 39287 51797 58826
17580 58826 57460 52085 31656 19078 13632 8021 20239 33215 26341 14520 -976 -6026 -1367
17567a367K0796J0848P40l130k607n098k105p360p412m045j22J621j618P120J0584
17552A6845p417j5411n615P097k365J326K179o176p401J0475M875m776J20R92
17538e252j0743q01k762p023J00Q766K3004R873J0865r192j3151L360j737P830
17524A3137j024o353q45o389n387J0711j997q549n236o378p354J2710J2252n747
17510f449q13J301p975Q639M362O886L363p817k511N669o697O505O011o17j4647
17495d790L31L076k524Q877j342K759m082k858p058J617K180l293r04l79M24l934
17479a1900R415M833n902L569m968q322m153R133K573L664Q1m273j2328K039p044
17464b3583J319J3159M515L114J2734R949P868o241j6019M524K342r961r33j50
$$ plain form
17567 -1367 19429 30277 31017 27887 25280 20182 18077 10717 3305 -740 -862 759 -859 6261 16845
17552 16845 9428 -5983 -11598 -4501 -6866 -5540 -3361 -9537 -16938 -6463 -1588 -6364 -6244 -5252
17538 -5252 -15995 -16796 -19558 -26581 -26481 -17715 5289 15162 26027 16835 3684 7044 5307 13137
17524 13137 12113 5760 4915 -1474 -6861 3850 1853 -6696 -11932 -18310 -25664 -12954 -702 -6449
17510 -6449 -7262 -5961 -13936 -5297 -935 5951 9314 1497 -1014 4655 -2042 4463 10474 9857 -4790
17495 -4790 -4459 -1383 -3907 4970 3628 6387 2305 -553 -7611 -5994 -3814 -7107 -8011 -8390 -7966 -11900
17479 -11900 -2485 2348 -3554 15 -4953 -13275 -17428 -8295 -5722 -2058 -1977 -6250 -18578 -16539 -23583
17464 -23583 -22264 -9105 -4590 -1476 11258 21207 29075 22834 6815 11339 13681 3720 2787 2637
17450B637m83j077p397k864J4158Q393R243J4436M1585L4405N04k2818l1031k1717
17436C7974l625p485j0702o635l281j1972p311j722J5134K763r283O147J545l861
17422b314K550q865j239m00l196j433J151l147K25J761m679N567J4111M187j5083
17407a0804q747l620P760L694J1082o824q113J46k519k035J0614N431m749k809
17393a1493p498o922r411Q836Q783J31J4000J1262l105L728m943P516P883r802
17379H965j2390j205J3141j268O757r54N40j803j5759j7765l103j082Q608N817
17365a1501J0449j0128k950J719l165n197P568M123N046j0228j3917o829L893
17352c1117P962J2833P409R140k732l236q90J135n657J866P549O876J049l926
$$ plain form
17450 2637 2154 1077 -6320 -9184 4974 13367 22610 37046 78631 113036 113540 90722 59691 37974
17436 37974 34349 26864 16162 9527 6246 -5726 -13037 -14759 375 3138 -6145 2 1547 -2314
17422 -2314 236 -8629 -9868 -10268 -13464 -14897 -13746 -16893 -16668 -14907 -19586 -14019 92 4279 -10804
17407 -10804 -19551 -23171 -15411 -11717 -635 -7459 -15572 -15426 -17945 -19980 -9366 -3935 -8684 -11493
17393 -11493 -18991 -25913 -35324 -26488 -17705 -17574 -3574 7688 4583 8311 3368 10884 18767 8965
17379 8965 -3425 -4630 8511 7243 14000 13046 13586 11783 -3976 -21741 -24844 -25926 -17318 -11501
17365 -11501 -1052 -11180 -14130 -12411 -15576 -20773 -13205 -9082 -4036 -14264 -28181 -35010 -31117
17352 -31117 -23155 -10322 -2913 6227 3495 259 -631 504 -5153 -3287 4262 11138 12187 8261
17338H261j2854k186R440P064k250k646l87p915N93K752m648N931O119J1326j3102
17323E498j5466n049l159L560n297k914j62q7J4671R348p496K552O507l534q00
17308a828J3618n514n044r924o904P306M793k850l719n723M157k107k082O166
17294i655J3320J308R35q407j946N953J2297k606j0124K115k220m667K39O462
17280C004K698k788K976Q95j5473J693K887O573J973n910k611J0668J747j5706
17266g374j1355J2108L859J808p804j3875J961L783r193p037J3034J2169n79N889
17252b606O060p92J7926l609j8147j333j1576j431j859J521P834J1166K519j1
17238E662O014M728o737j2761k918J542J3037j1253j3392j3372K340Q340J6860
$$ plain form
17338 8261 -4593 -6779 2661 9725 7475 4829 4442 -3473 -2880 -128 -4776 1155 7274 18600 5498
17323 5498 -9968 -15017 -18176 -14616 -19913 -22827 -22989 -23076 -8405 943 -6553 -4001 2506 -1028 -1828
17308 -1828 11790 6276 1232 -8692 -15596 -8290 -3497 -6347 -10066 -15789 -11632 -13739 -15821 -9655
17294 -9655 3665 4973 5908 -2499 -4445 1508 13805 11199 1075 3190 970 -3697 -3458 3004
17280 3004 5702 2914 5890 6785 -8688 -6995 -4108 2465 4438 -1472 -4083 6585 8332 -7374
17266 -7374 -18729 -6621 -2762 -954 -8758 -22633 -20672 -16889 -26082 -33119 -20085 -7916 -8495 -2606
17252 -2606 3454 2662 20588 16979 -1168 -2501 -14077 -15508 -17367 -15846 -8012 3154 5673 5662
17238 5662 11676 16404 9667 -3094 -6012 -4470 8567 -2686 -16078 -29450 -27110 -18770 -1910
17225a910J3541J6n566k639j0634r607M721P048N977R027M92k316n055r384J1129
17210D840M392j195j9428p685O364m001M355m178m819L435J910j109n484P668
17196a4935J3574j457O679N39R806k152r986Jq813q735N352M18Q084Q057K03j3360
17180f725m771j916M040L786M226o349j5358l864J6478n261j368J2248N811J1
17166I88L835K919m242j979m606o894p559N970j323M03M300j64o809m647L992
17151a5816N894m621J584M994K053K107l064J2108n76k763j481L247m86k362k084
17136a266l434O087l223K041N153m239j165j2223l393J152N840O324p748m613
17122a4707j260j161J331P201l231J1998N305o565j3585j499P630Q06N742l838
$$ plain form
17225 -1910 11631 11647 6081 3442 -7192 -16799 -12078 -5030 947 9974 10466 8150 3095 -6289 4840
17210 4840 9232 8037 -11391 -19076 -12712 -16713 -12358 -16536 -21355 -17920 -16010 -17119 -22603 -14935
17196 -14935 -1361 -2818 3861 4400 14206 12054 2068 2069 -6744 -15479 -10127 -9709 -1625 6432 6635 -6725
17180 -6725 -11496 -13412 -9372 -5586 -1360 -7709 -23067 -26931 -10453 -15714 -17082 -4834 977 988
17166 988 4823 7742 3500 1521 -3085 -9979 -17538 -11568 -12891 -12488 -8188 -8352 -15161 -19808 -15816
17151 -15816 -9922 -14543 -12959 -7965 -5912 -3805 -6869 5239 4663 1900 419 3666 3180 818 -1266
17136 -1266 -4700 1387 -1836 205 5358 1119 -46 -12269 -15662 -14510 -8670 -2346 -10094 -14707
17122 -14707 -15967 -17128 -15797 -8596 -11827 171 5476 -1089 -14674 -16173 -8543 -7737 -1995 -5833
17108e833n346J526r280J596q344j976M031L225L56J147n149q91M887N786k720
17093a6985j445J694m554L657J5730N480O440K249p809k317o145j1018NP316J753
17078e949N175j357j890J198p404J883K047K341j0914m560P551Q30K393M682l231
17063g205n844N419J398N860M52j332l573j858m428M657P178K400J1336l027j733
17048I700m883n629j7506r900N693K884j199L659k102r72r522P747J2645L135
17034f250k064O863O941o220o563j0774j7Q27j289j950j871O488Q988j1868l831
17019b2590L942J857P394N186O236R82k381P32J784L723K799m438l937N423q006
17004a294j1202k879R110J7814k686j0698n624k071N678P617N701q094m484P472
$$ plain form
17108 -5833 -11179 -9653 -18933 -17337 -25681 -27657 -23626 -20401 -20045 -18898 -24047 -24938 -20051 -14265 -16985
17093 -16985 -18430 -16736 -21290 -17633 -1903 3577 10017 12266 4457 2140 -4005 -15023 -15018 -7702 -5949
17078 -5949 -774 -2131 -4021 -2823 -10227 -8344 -6297 -3956 -14870 -19430 -11879 -11049 -8656 -3974 -7205
17063 -7205 -13049 -7630 -6232 -372 80 -1252 -4825 -6683 -11111 -6454 724 3124 14460 11433 9700
17048 9700 4817 -812 -18318 -28218 -22525 -19641 -20840 -17181 -19283 -20255 -29777 -22030 -9385 -6250
17034 -6250 -8314 -1451 5490 -730 -7293 -18067 -18084 -17257 -18546 -20496 -22367 -15879 -6891 -18759 -22590
17019 -22590 -18648 -16791 -9397 -4211 2025 3007 626 1358 3142 6865 9664 5226 1289 6712 -1294
17004 -1294 -12496 -15375 -6265 11549 8863 -1835 -7459 -9530 -3852 3765 9466 1372 -3112 4360
16990D360J0743l722p951j6452r004R668M859L288P27j42n529k260Q111R084O53
16975F433j3824J1036j066q760p23o031l411J0260J630Q749L975j1948j4775P06
16961a7749N448M645K01k291P091P9j435P665K028p832p342l364M478L322j1264
16946a6320N778Q226J262M591p66m662J3841M782j8168j3037J17l222J2004N955
16932C81j2126o458O872M696l603l858K934k543m787j98O968j0201N909R509Q321
16917A816O936q164l540o024j568m01J2610J2515k47m286k096j1756J207N046
16903B048j708q363q329j291q780J6862J4673O399o839j4028q89n878n441K871
16889a8693L791O163O06j3604o190J3007R55l439O687P80r227m453J082Q563Q356
$$ plain form
16990 4360 15103 11381 3430 -13022 -22026 -12358 -7499 -4211 -3484 -3626 -9155 -11415 -3304 5780 6433
16975 6433 -7391 3645 2579 -6181 -6904 -12935 -16346 -6086 -4456 4293 8268 -3680 -18455 -17749
16961 -17749 -12301 -7656 -7455 -9746 -2655 -2576 -4011 3654 5682 -2150 -9492 -12856 -8378 -5056 -16320
16946 -16320 -10542 -2316 -1054 3537 2771 -1891 11950 16732 -1436 -14473 -14356 -17578 -5574 381
16932 381 -11745 -18203 -11331 -6635 -10238 -14096 -11162 -13705 -18492 -18690 -11722 -21923 -16014 -6505 1816
16917 1816 8752 588 -2952 -8976 -10544 -10945 1665 14180 13933 9647 7551 -4205 -2998 2048
16903 2048 340 -8023 -16352 -17643 -26423 -9561 5112 11511 4672 -9356 -10245 -16123 -21564 -18693
16889 -18693 -14902 -8739 -8133 -21737 -27927 -14920 -13965 -17404 -10717 -9937 -19164 -23617 -22535 -13972 -5616
16874e616K895L261n007n614N24P147K097r000o21M639O415r845m034j2313m635
16859b9707q69J7684l632m076N381N62p977K039o384O206l408k486L3r93L993
16844b3634J1474J6117O40j0182j69Q596n462j0007p757N739O840M480l754n581
16830a2660L477k256k077j229M662J0193J254J383j078j0130k287M843R432M945
16816H472j080r781r697j446N662R96k790l7M107J0148m839k378o18l79N401L957
16800E698L331j689l996k505O156M976r422j002j2986n714J2977Q575o872K329
16786a44j253K759L555N659m088n546k898L069p141l823N54J0186J119O336o797
16771A547O024J1234k956q530L514J13j6947r908j993O70J221J0895Q950R19q935
$$ plain form
16874 -5616 -2721 540 -4467 -10081 -9557 -2410 -313 -9313 -9934 -5295 1120 -8725 -12759 -25072 -29707
16859 -29707 -30576 -12892 -16524 -20600 -15219 -14657 -22634 -20595 -26979 -20773 -24181 -26667 -26634 -27627 -23634
16844 -23634 -12160 3957 4597 -5585 -5754 2842 -2620 -12627 -20384 -14645 -7805 -3325 -7079 -12660
16830 -12660 -9183 -11439 -13516 -14745 -10083 110 1364 2747 1669 -8461 -10748 -5905 3527 8472
16816 8472 7392 -2389 -12086 -13532 -7870 -6874 -9664 -9701 -5594 4554 -285 -2663 -3281 -3660 1741 5698
16800 5698 9029 7340 3344 839 6995 11971 2549 1547 -11439 -17153 -4176 4399 -2473 -144
16786 -144 -1397 1362 4917 10576 6488 942 -1956 1113 -6028 -9851 -9297 889 2008 8344 1547
16771 1547 7571 18805 15849 7319 10833 10946 -6001 -15909 -17902 -17232 -16011 -5116 3834 4753 -4182
16756d182J610J7912J0145n914j4643j5937K025q254M516P667r131m386j473J2485
16742g560m352p584J6900J4731j3393r128n493M10n506M663J815N653J924k249
16728i169L639j654O998J5211l924k3275j238J6043N933m050J119p307L621k03
16714A744q190n157l051N203M490M911J747j286k511o55M773M887M780j375J61
16699A0471k319j3295j33M007k561p100N656N261r76l138p721J0910j616n712
16685h266j0856N387R468k150j1548L367L499m296j5214p005L409K783J6149l936
16671a9209P722J3317l887M509N851k27m877N108K286q676k826o331k10J5462
16657H012J315p120j4369m655M603L380l16m684M287Q074j311l139M836J1210
$$ plain form
16756 -4182 -2572 15340 25485 19571 4928 -11009 -8984 -17238 -12722 -5055 -14186 -18572 -20045 -7560
16742 -7560 -11912 -19496 -2596 12135 -1258 -10386 -15879 -15469 -20975 -16312 -14497 -8844 -6920 -9169
16728 -9169 -5530 -7184 -186 15025 11101 -12174 -13412 2631 8564 4514 5633 -1674 1947 1744
16714 1744 -6446 -11603 -14654 -9451 -4961 -50 1697 411 -2100 -2755 2018 6905 11685 10310 10471
16699 10471 8152 -5143 -5276 -1269 -3830 -10930 -5274 -13 -989 -4127 -11848 -938 -2554 -8266
16685 -8266 -19122 -13735 -4267 -6417 -17965 -14598 -11099 -15395 -30609 -37614 -34205 -31422 -15273 -19209
16671 -19209 -11487 1830 -2057 2452 8303 8076 3199 8307 10593 1917 -909 -7240 -7450 8012
16657 8012 9327 2207 -12162 -16817 -12214 -8834 -9150 -13834 -9547 -1473 -2784 -5923 -1087 10123
16643A0123l199r051P108k909n626p509n416m333L307N228J7787j017l343l991
16629b841J669k478k18M314J4003r595j6251n874p315O459J605o416M527R827
16615h584J3l63O585R809n410j8632N46k008m448J682J178J0785P427p203K948
16600e675o15J615J896M054K011J152K140r717j2365k526m702M180N817M08j583
16585a3910L892J5081k053j023K486M398l0j2464M75N805r968Q942Q401j06j732
16570H194m241k935K202O42P52r426k369Q651o989j440K0661L074m068n526n399
16555A783L791L411J487j3911j0642p5J041O932l530N461K981K139n40J178o14
16540H92Q384j0142q348l73J002j904M077L732J045J4872l383n395m899n460O991
$$ plain form
16643 10123 6924 -2127 4981 2072 -3554 -11063 -16479 -20812 -17505 -12277 5510 4493 1150 -2841
16629 -2841 -1172 -3650 -3868 446 14449 4854 -11397 -17271 -24586 -18127 -16522 -22938 -18411 -8584
16615 -8584 -8571 -8934 -2349 7460 2050 -16582 -16036 -18044 -22492 -20810 -19632 -8847 -1420 -8623 -5675
16600 -5675 -6290 -4675 -2779 1275 3286 4438 6578 -3139 -15504 -18030 -22732 -18552 -12735 -12327 -13910
16585 -13910 -10018 5063 3010 1987 4473 8871 8841 -3623 -3148 2657 -7311 1631 10032 9926 8194
16570 8194 3953 1018 3220 3862 4614 -4812 -7181 1470 -5519 -6959 13702 16776 12708 7182 1783
16555 1783 5574 8985 10472 -3439 -14081 -14156 -13115 -6183 -9713 -4252 -1271 868 328 1506 892
16540 892 9276 -866 -9214 -9587 -8585 -10489 -6412 -2680 -1635 13237 9854 4459 -440 -5900 1091
16525A091R502n336r495n947k051q561M74Q885J421m835Q747J5235r46j090K247
16510I341q826j0222j969l592M526O321q161L179N941L548k885r333j810J1146
16496b796Q881p378o254R219J0099L441j0566j7221L085J2842n003M700L235M700
16482A0984n233r708P280j0646p858R625J4487O700J267k832n79M072j358j2730
16468C471J434j789q224o509n230J2132Q261K399M896o735p728l440R111j607
16454D42p070O704O743n637n915K294k090o968N305N647o631q279M759p562N045
16439a3213J4361n357o327m926l331M819l436N989Q83j0939K498Q322N828J4599
16425I770J2186p627j0189j6112J934J782J1724N554R181j984j1600j5797l064
$$ plain form
16525 1091 10593 5257 -4238 -10185 -12236 -20797 -20323 -11438 -10017 -14852 -6105 9130 8184 7094 9341
16510 9341 515 -9707 -11676 -15268 -10742 -4421 -12582 -9403 -3462 86 -2799 -12132 -13942 -2796
16496 -2796 6085 -1293 -7547 1672 11771 15212 4646 -12575 -9490 3352 -1651 3049 6284 10984
16482 10984 5751 -3957 3323 -7323 -15181 -5556 8931 15631 16898 14066 13487 17559 16201 3471
16468 3471 4905 3116 -5108 -11617 -16847 -4715 3546 5945 10841 4106 -3622 -7062 2049 442
16454 442 -6628 76 6819 1182 -4733 -2439 -4529 -11497 -6192 -545 -7176 -15455 -10696 -18258 -13213
16439 -13213 1148 -4209 -10536 -15462 -18793 -13974 -17410 -11421 -10538 -21477 -18979 -10657 -4829 9770
16425 9770 21956 14329 4140 -11972 -10038 -8256 3468 9022 18203 16219 4619 -11178 -14242
16412a4242P422O03j918Q446J6300J0470N801j3517j1333N80j2203j1006j272
16399a5869O785Q200Q0M559J855J3924K319j4066j7546l952R92J005k67O414R731
16384D164K32j1073o168p378N035J401n755P793J7079P868P065q865q994L594
16370E998n143J09n106j586m553j865J8538q52q008j4664K866M488R984P513M581
16355A2300l742J3426K799r748Q99q362m145K285j0197l11J77J065N326M040J780
16340G592p053k624j1789n519N734M649p682n431J0749L571J0170M66q77l640
16326a684J3155P28l304j105M86N645K210P370j591o240m152j3518L111Q543l438
16311F216K71p459j0748O800L943R581P322k10j0729n119m646J229J792N30J0431
$$ plain form
16412 -14242 -6820 -6217 -8135 311 16611 27081 32882 19365 8032 8612 -3591 -14597 -15869
16399 -15869 -9084 -884 -804 3755 5610 19534 21853 7787 -9759 -13711 -12719 -11714 -11981 -5567 4164
16384 4164 4396 -6677 -12845 -20223 -15188 -13787 -19542 -11749 5330 13198 20263 11398 2404 5998
16370 5998 855 964 -4142 -5728 -10281 -12146 6392 5540 -2468 -17132 -14266 -9778 206 7719 12300
16355 12300 8558 21984 24783 15035 15934 7572 3427 5712 -4485 -4796 -4619 -3554 1772 5812 7592
16340 7592 539 -2085 -13874 -19393 -13659 -9010 -16692 -22123 -11374 -7803 2367 2833 1956 -1684
16326 -1684 11471 12199 8895 7790 8276 13921 16131 23501 21910 15670 11518 -2000 1111 9654 6216
16311 6216 6487 -972 -11720 -4920 -977 8604 15926 15716 4987 -132 -4778 -3549 -1757 -1227 9204
16296I204o031k223j73P502m175j1697l066l819k546Q807k011r337n37L764J1627
16281d711N268O33L830m018l963L887L833n060p503O895Q154l569L716k403n296
16266c07J760M521Q581q921j2934n534k462l725k439O55O241J3789N984L049k035
16251F223j184m984o167j3295J622K470J4729J4594J678j858o189k1307K865J7067
16237F264k730L58O404j334j2716j2109M400R704k70K956J0580j634j2412p054
16223i593P623K613k643j1129n490O679J2189K397M561l48Q598M200k567r221
16209G869k290j3339p6O342n341q58K772q49m978q42K153N290M923p406q189k10
16193a5029R360p681j129O774K089k84R83J914J943J962n203P214M9m198J424
$$ plain form
16296 9204 3173 950 777 8279 4104 -7593 -10659 -14478 -17024 -8217 -10228 -19565 -20102 -16338 -4711
16281 -4711 557 1190 5020 1002 -2961 926 4759 -301 -7804 -909 7245 3676 7392 4989 -307
16266 -307 1453 5974 14555 5634 -7300 -12834 -15296 -19021 -21460 -20805 -14564 -775 5209 8258 6223
16251 6223 5039 55 -6112 -19407 -17785 -15315 -586 14008 15686 13828 7639 -13668 -10803 6264
16237 6264 3534 3892 10296 8962 -3754 -15863 -11463 -1759 -2029 927 11507 9873 -2539 -9593
16223 -9593 -1970 643 -2000 -13129 -18619 -11940 249 2646 7207 6859 15457 19657 17090 7869
16209 7869 5579 -7760 -7836 -1494 -6835 -7693 -4921 -5770 -10748 -11590 -9437 -4147 776 -6630 -14819 -15029
16193 -15029 -5669 -13350 -14479 -7705 -5616 -5900 -4917 -3003 -1060 902 -4301 2913 2962 -1236 188
16178A88J3489n00k731L641O537o175j732M13m303m09j8634K960P398K570n958
16163c246o317j4218o168q231J084J0769J5203R870m386n326K951L041K021O468
16149C515n163L982p31k46L531k073n857R82R614R191m270m567l50j734J659j0873
16133c390L637P825M773n043j057m180k127j117O243K151o26j038M797k784p414
16118F50J552J4569p611j2625P385r15l343J1346J2072r434j5336k008J389N289
16104B980J2937o163p171p679Q61Q653j1244K557k868K992J425q771p216j457
16090b0164R120L958P176l251K911J570l281k678l69J0696N398l61j6381J380
16076d276k310N474k702m338J249j886L761k055L641N370j042k392l397N816O200
$$ plain form
16178 188 13677 13177 10446 14087 20624 14449 12717 13130 8827 8418 -10216 -7256 142 2712 -3246
16163 -3246 -9563 -23781 -29949 -38180 -37096 -26327 -11124 -1254 -5640 -10966 -8015 -4974 -2953 3515
16149 3515 -1648 2334 1603 1357 4888 2815 -3042 -2060 7554 16745 12475 7908 7558 5824 7483 -3390
16133 -3390 247 8072 12845 7802 6745 2565 438 -679 5564 7715 7089 6051 10848 8064 650
16118 650 2202 16771 9160 -3465 3920 3005 -338 11008 23080 13646 -1690 -3698 -2309 2980
16104 2980 15917 9754 2583 -5096 -4235 4418 -6826 -4269 -7137 -4145 -2720 -11491 -18707 -20164
16090 -20164 -11044 -7086 90 -3161 -250 1320 -1961 -4639 -5008 5688 11086 10725 -5656 -4276
16076 -4276 -6586 -1112 -3814 -8152 -6903 -8789 -5028 -7083 -3442 1928 886 -1506 -4903 913 7113
16061G113k060l868n153l015R048L921j0466J1296J668m679R247j1082l920J433
16047e17R735J2106r731j145J652j887J508J135r675m236J2423M938m318J450
16033A3438j3586r710J137P962J0680L950N482J994j5482j9204n551O789j432
16020a3533O285O93l69M110p218j1360m303M545M014O822J3624K710p452p113
16006h545N361Q989l161J538J0982J169q555j5876Q107L36j2033P78p431n363
15992b3704l037J0861J5880J012p431N473N130j5447j249Q975P037p784j4247
15979a8531l30O824K197N68K288N883l837q083J078L920J2449k033n704n022p611
15964a5944j148Q041J1809m01r57J3385q900k782j1620O183J1453l051j1981R18
$$ plain form
16061 7113 5053 1185 -3968 -6983 2065 5986 -4480 6816 8484 3805 13052 1970 -1950 -517
16047 -517 9218 21324 11593 10448 12100 10213 11721 12856 3181 -1055 11368 16306 11988 13438
16033 13438 -148 -9858 -8721 -759 9921 13871 19353 21347 5865 -13339 -18890 -12101 -13533
16020 -13533 -7248 -6555 -6924 -2814 -10032 -21392 -25695 -21150 -17136 -10314 3310 6020 -1432 -8545
16006 -8545 -3184 5805 2644 4182 15164 16333 7778 -8098 9 345 -11688 -10910 -18341 -23704
15992 -23704 -26741 -15880 0 1012 -6419 -946 4184 -11263 -12512 -3537 3500 -4284 -18531
15979 -18531 -18861 -12037 -9840 -9272 -6984 -1101 -4938 -13021 -11943 -8023 4426 2393 -3311 -8333 -15944
15964 -15944 -17092 -9051 2758 2357 1400 14785 5885 3103 -8517 -2334 9119 6068 -5913 -4995
15950d995N968J2464k827p180L998o537P40p658k556l284P258K302p97r155L361
15935h898J420N662L87p702P387N715p444O635M577K77j881K07k905n879k830
15920e272m634Q354k177k1841L783J3102L762P40J1702o039L956j102p744p73
15906d183K11J3057N842j421q014j9948o979J0360J823j810J192K53J5469J0073
15892A5925q47l815o449r092m38O001l194j773J133M66p592L831K133R499P642
15877A3430J355o910j2246p752p099K71J386J829q835Q822q06o60j823q497l289
15862c0824K3844N357J395P765j1142J986J1034j0579r199L008j273N709Q322
15849E403j0010O47j2m808o484j047o317n753n02M78O146N729J1022R755M390
$$ plain form
15950 -4995 973 13437 10610 3430 7428 891 1631 -6027 -8583 -11867 -4609 -2307 -3104 -12259 -8898
15935 -8898 -7478 -1816 -1429 -9131 -1744 3971 -3473 3162 7739 8016 6135 6342 3437 -2442 -5272
15920 -5272 -9906 -1552 -3729 -25570 -21787 -8685 -4923 -4183 7519 1480 5436 4334 -3410 -4183
15906 -4183 -3972 9085 14927 13506 5492 -14456 -21435 -11075 -9252 -11062 -9870 -9617 5852 15925
15892 15925 15078 11263 4814 -4278 -4716 1285 -1909 -3682 -2549 -2083 -9675 -5844 -3711 5788 13430
15877 13430 14785 7875 -4371 -12123 -19222 -18951 -17565 -15736 -24571 -15749 -16555 -17215 -19038 -27535 -30824
15862 -30824 -6980 -1623 -228 7537 -3605 -1619 9415 -1164 -10363 -7355 -8628 -2919 5403
15849 5403 -4607 -3960 -3972 -8780 -15264 -16311 -22628 -28381 -28883 -28405 -22259 -16530 -5508 4247 8637
15834H637Q41o250p016L918q87L25K402J630q015n074r83N571O97k652o618P37
15818a2737j560L016J620m902K323Q400j435q580O329Q006n713p034k388J2358
15804b297M105k837r690L47k29O837P483k148J256r522j0922Q060J1866M635K774
15789I718p546p073j198k261k293P497K304m840o427Q40L210J3668J7304O868
15775B9771k751r458j1827j0805L309J0103N439p190r497j04n822l408J1892J0453
15761A0105p165n257K661j0751q42J371O12M060k448O367P334K68q339p133Q144
15746a013J0930N944n807l513j5540k541L110l24J2453K1957J0902j3579j4593
15733H386n447R27M656j2312j0369N078J4419J276l937p204m582o3k236P231k588
$$ plain form
15834 8637 9478 3228 -3788 130 -757 -432 1970 3600 -4415 -9489 -10472 -4901 -4204 -6856 -13474 -12737
15818 -12737 -14297 -11281 -9661 -14563 -12240 -3840 -5275 -13855 -7526 480 -5233 -12267 -14655 -2297
15804 -2297 1808 -1029 -10719 -10372 -10601 -3764 3719 1571 2827 -6695 -17617 -9557 2309 6944 9718
15789 9718 2172 -4901 -6099 -8360 -10653 -3156 -852 -5692 -12119 -11279 -8069 5599 22903 29771
15775 29771 27020 17562 5735 -5070 -1761 8342 13781 6591 -2906 -3010 -8832 -12240 -348 10105
15761 10105 2940 -2317 344 -10407 -11249 -9878 -9266 -5206 -7654 -1287 6047 6315 -2024 -9157 -1013
15746 -1013 9917 15861 10054 6541 -8999 -11540 -8430 -8754 3699 25656 36558 22979 8386
15733 8386 2939 3866 8522 -3790 -14159 -9081 5338 6614 2677 -4527 -9109 -9172 -11408 -4177 -6765
15718f765r573o620p215Q023M947R495J2560n026o212O614j419l922N623n359
15704d849L271m851j2194j70j172M961R182O937N979l336O481N200K833l636j2277
15689B359m289L108j0402j934J0644K460P24j937l863j2418n253k188Q573J518
15675a2898n313k625L260O059O658L770M112j170m562M957m586k904k096k767
15661a0105P199M406Q073N083K64p727k1370j1496J7224N995r910L167J0785K617
15647D205j459l302k323M283j2749P29L537k4p869k544J1186J0948L366j1988
15633d004N50N260r3N492j604Q970l719p096r375j3016o021P418O534J313O181
15618c210J869j664O71O777m903j953k546M537J3566l559j7208j0199l099J3308
$$ plain form
15718 -6765 -16338 -22958 -30173 -22150 -17203 -7708 4852 -174 -6386 228 -1191 -5113 510 -4849
15704 -4849 -1578 -6429 -18623 -18793 -19965 -15004 -5822 1115 7094 3758 10239 15439 18272 14636 2359
15689 2359 -1930 1178 -9224 -11158 -514 1946 2670 733 -3130 -15548 -20801 -22989 -14416 -12898
15675 -12898 -18211 -20836 -17576 -11517 -4859 -1089 3023 1853 -2709 2248 -2338 -5242 -7338 -10105
15661 -10105 -2906 1500 9573 14656 14920 7193 -14177 -25673 -8449 -2454 -12364 -9197 1588 4205
15647 4205 2746 -556 -2879 1404 -11345 -10616 -7079 -7103 -14972 -17516 -6330 4618 7984 -4004
15633 -4004 -3454 1806 1713 7205 5601 14571 10852 3756 -5619 -18635 -24656 -17238 -10704 -9391 -3210
15618 -3210 -1341 -3005 -2334 4443 -460 -2413 -4959 -422 13144 9585 -7623 -17822 -20921 -7613
15604g613O050q404K520o12j0880K275J2261P585Q33m860k651m33j1272N270O676
15589c255R51M879O059P645j500n640k285L907P039k763j8027n571M079k945M31
15574f996N56L470j2401j0437p937n20Q939J1538J5852J0240j0298j5558k340
15561a5892k004K060Q927R88q154J834O903O729p834N210l025o742Q54L294N679
15546a173Q019o976j170J6313K983k535J1111l853L719r494j0829K160m98o739
15532A038p551M668J3392k065m186m134m000K255N264M042j1237j3951J16J3734
15518b615R613N784j5150j1868j123Q860p27L226l591r978l731Q084J444M465
15504g307l032J8758J0319j3181o046j365l821K95p163M036J3537J8733r343j0377
$$ plain form
15604 -7613 -1563 -9967 -7447 -8059 -18939 -16664 -4403 3182 4015 -845 -3496 -3929 -15201 -9931 -3255
15589 -3255 -2304 2575 8634 16279 14779 9139 6854 10761 17800 15037 -2990 -8561 -4482 -7427 -6996
15574 -6996 -6440 -2970 -15371 -25808 -33745 -34265 -25326 -13788 2064 12304 2006 -13552 -15892
15561 -15892 -17896 -15836 -6909 -5921 -14075 -12241 -5338 1391 -6443 -1233 -4258 -11000 -10146 -6852 -1173
15546 -1173 6846 -130 -1300 15013 17996 15461 26572 22719 26438 16944 6115 8275 7777 1038
15532 1038 -6513 -1845 11547 9482 5296 1162 -2838 -583 4681 8723 -2514 -16465 -16349 -2615
15518 -2615 6998 12782 -2368 -14236 -15359 -6499 -7226 -4000 -7591 -17569 -21300 -13216 -11772 -7307
15504 -7307 -10339 8419 18738 5557 -489 -1854 -5675 -5380 -12543 -8507 5030 23763 14420 4043
15490D043j969J225Q294K0454l724j0840j4621l680J247q931m317P481Q368M630
15476G660M217N547J1719o590m675l035n509l631m029n437j0485j888P534J1423
15462B821M248K990L329m514j1135o136O890j094k386p939j451n036M247n95J0372
15447e389J1056K261N239k965J0432L708o154o960J601n583j461k588P54j0569
15433f618j779K651k725K059j507j0365J0809J3136L830j032k738l931q19o188
15419e217l080K067J2791J5245K330j3845q542n72K508M605L405M040q740j3427
15405f432R946M045j1916J794L636n033q430J0056k104m080M304n795J1514o640
15391e135j373P30J1894n457p73Q466K710n148N298O480n872j0465N872K484M004
$$ plain form
15490 4043 2074 3299 11593 32047 28323 17483 2862 -818 429 -8502 -12819 -5338 3030 7660
15476 7660 11877 17424 29143 22553 17878 14843 9334 5703 1674 -3763 -14248 -16136 -8602 2821
15462 2821 7069 10059 13388 8874 -2261 -8397 -1507 -2601 -4987 -12926 -14377 -19413 -15166 -15761 -5389
15447 -5389 5667 7928 13167 10202 20634 24342 18188 11228 12829 7246 5785 3197 3951 -6618
15433 -6618 -8397 -5746 -8471 -6412 -7919 -18284 -7475 5661 9491 8459 5721 1790 971 -5217
15419 -5217 -8297 -6230 6561 21806 24136 10291 1749 1177 3685 8290 11695 15735 6995 -6432
15405 -6432 3514 7559 -4357 -2563 1073 -3960 -12390 -2334 -4438 -8518 -4214 -10009 1505 -5135
15391 -5135 -6508 -5778 6116 659 -114 8352 11062 5914 11212 17692 11820 1355 7227 9711 13715
15376A3715K428j6344o834J503Q497M62j9441l063J0988J5947P765m824m874K81
15362F206j547m163M783K58j2262j2307l9N031m167j561N539L914J1685K748R63
15347E081n624K280j022K759L6J330N38Q413Q393P321j094q244q391P49j1367
15332A158j1875M248K636P530O776O539r714j096L430R487K443r489j1887J411
15318A597O415P839K564n625p302o494j370k280j815R100J3950p700J257j0385
15304b49M664n068j3188O57O131R536j938N118R874R98j445o045j0799n572M791
15289b535R444R803j7945j4333L25L135R156M323K49O075N690m025o595K456L198
15274H421M244q687j512J841o510r418p852O295J7414l001M53q68r444j718o608
$$ plain form
15376 13715 16143 -201 -7035 -5532 2965 3427 -16014 -19077 -8089 7858 15623 10799 5925 6206
15362 6206 4659 496 5279 5537 -6725 -19032 -19071 -14040 -18207 -19768 -14229 -10315 1370 4118 5081
15347 5081 -543 1737 715 3474 3510 4840 5378 13791 22184 29505 28411 20167 11776 12525 1158
15332 1158 -10717 -6469 -3833 3697 10473 17012 7298 6202 9632 19119 21562 12073 186 1597
15318 1597 8012 15851 18415 12790 5488 -1006 -2376 -4656 -6471 2629 16579 8879 10136 -249
15304 -249 4415 -653 -13841 -13184 -7053 2483 545 5663 15537 16535 15090 9045 -1754 -7326 -2535
15289 -2535 6909 16712 -1233 -15566 -15241 -12106 -2950 1373 1622 7697 13387 9362 2767 5223 8421
15274 8421 12665 3978 2466 4307 -2203 -11621 -19473 -13178 4236 1235 1688 820 -8624 -10342 -16950
15259a6950M121L050l316J2286O777Q015l967j357k534j1570R105j790m472p848
15245a0450p473O456P332Q053m436m77O440N078k431l697J711N184M719l115o814
15230F080o782Q068N067n733P269J507m481m479o841M690J499j938J363l712j669
15215i2K902M873j912K221p888j745J1793L127o668j2567P821n900K867N208j072
15200B968J991j3238o383J4504J3107Q515Q59j444p447j89L416n642j2054M87
15186e50N827P088K340K10O123q632j0012N596M705N859P445o268p551q246p829
15171c895l729j535l657J3029J3085j2701j0971J904j36o353J70p009q284k878
15157c2960O260J8604M948j221L826N934j030j2531l465J3289R908K491p402P172
$$ plain form
15259 -16950 -12829 -9779 -13095 -809 5968 13983 10016 8659 6125 -5445 3660 1870 -2602 -10450
15245 -10450 -17923 -11467 -4135 3918 -518 -995 5445 10523 8092 4395 6106 11290 16009 12894 6080
15230 6080 -702 7366 12433 6700 13969 15476 10995 6516 -325 4365 5864 3926 5289 1577 -92
15215 -92 2810 7683 5771 7992 104 -1641 10152 13279 6611 -5956 1865 -4035 -1168 4040 2968
15200 2968 4959 -8279 -14662 -158 12949 21464 22323 20879 13432 13243 16659 11017 -1037 -550
15186 -550 5277 12365 14705 14915 21038 12406 2394 7990 12695 18554 25999 19731 12180 3934 -3895
15171 -3895 -7624 -9159 -12816 213 13298 597 -10374 -8470 -8606 -14959 -14789 -21798 -30082 -32960
15157 -32960 -26700 -8096 -3148 -4369 -543 5391 4361 -8170 -11635 1654 11562 14053 6651 13823
15143A3823K390p260m187r006P974J1414m318j0331j3072P086O69l574O976P010
15129E594m812r102R359J663J949k849j770M824N18L476L859n693M588M245r38
15114A4911K87j1554m544M674j6294r00J5106r136m816J0834O124Q54O367O253
15100A8166l043N788Q607j0934j7074n56Q928j689j729j578p546l344r35K0364
15086A3425P239p475j4122j801N400q979k011O207J2489J1169L065l964p793k867
15072I982Q543L01o882j405l115j880m165R55P88M452J835p914k793n4l259L053
15056a558J5602q669n877k487m940j576k840J1441M202o743n40m258P51n575J3113
15041D6L608R414K459R636l175j3135m051J928O427K479j0073J244j23n960p213
$$ plain form
15143 13823 16213 8953 4766 -4240 3734 15148 10830 499 -12573 -5487 -4818 -8392 -1416 5594
15129 5594 782 -8320 1039 2702 4651 1802 32 4856 5374 8850 12709 7016 11604 15849 14911
15114 14911 15198 3644 -900 3774 -12520 -13420 1686 -7450 -12266 -1432 4692 5546 11913 18166
15100 18166 15123 20911 29518 18584 1510 954 9882 8193 6464 4886 -2660 -6004 -6939 13425
15086 13425 20664 13189 -933 -2734 2666 -6313 -8324 -2117 10372 21541 24606 20642 12849 9982
15072 9982 18525 18826 11944 10539 7424 5544 1379 2334 3122 7574 9409 1495 -1298 -1352 -4611 -1558
15056 -1558 14044 5375 -502 -2989 -7929 -9505 -12345 -904 3298 -3445 -3985 -8243 -7492 -13067 46
15041 46 3654 13068 15527 25163 21988 8853 4802 6730 13157 15636 5563 6807 6684 724 -6489
15026f489l062Q479J1942l500j7981j095J3554n722n043K704J0325M638O550q141
15012G159r189O60J1890o9p109m894M310J1649n625k520O307O517l930l106j2628
14997e78o850L357Q560J1004P211R47K725J0630J6241K519o968o403j9304k977
14983B0114N037N44n081j908j1059n918m301p880j1299k109J4126N402J632n81
14969c281K419R963k280J57o930m638M091p174R778J991Q492j15N62M893J078
14954A9006o280J585N901m207j1240J486o367O246J961M106L915j2904j0902j373
14940i067M624L907P48M288N021j2369q862J810J0276J806k217M902m606j5501
14926a5240l796J546J304J0652O451J5687J390j390p80P863J702r507q51j520
$$ plain form
15026 -6489 -9551 -1072 10870 7370 -10611 -11706 1848 -3874 -8917 -6213 4112 8750 15300 7159
15012 7159 -2030 -1370 10520 10451 3342 -1552 2758 14407 8782 6262 12569 19086 15156 12050 -578
14997 -578 -7428 -4071 4489 15493 22704 23651 26376 37006 53247 55766 48798 42395 23091 20114
14983 20114 25151 25695 20614 18706 7647 1729 -2572 -10452 -21751 -23860 -9734 -4332 -2700 -3281
14969 -3281 -862 9101 6821 6978 48 -4590 -499 -7673 2105 4096 12588 12473 13035 17928 19006
14954 19006 12726 14311 20212 16005 4765 6251 -116 6130 8091 12197 16112 3208 -7694 -9067
14940 -9067 -4443 -536 212 4500 9521 -2848 -11710 -9900 376 2182 -35 4867 261 -15240
14926 -15240 -19036 -17490 -16186 -5534 917 16604 17994 16604 15824 23687 25389 15882 15031 13511
14912A3511j1632k84R811l493J921j0638K470M614o393k554j016M61K918N914
14898E610j1461n823j257O907K895k235L019k347L527r432n153n90J5116Q040
14884F816r85j369o956M656P694j2669l065k014O454Q778J5120L131j7236q280
14870G5J479J5600L127j2358j1815M501M34j505K346M568O22j5605l678m773J0852
14855f130J371k244k80l646O254M408J433J296j5754q163N929J2620J4679L479
14841A5252j0525r658k48J1607o043J634K35n08K915m713Q206K391r7O98j708
14826I438J2752q538l493k67N322J1400M192n155k44j0056m877p494o3r07N34
14811B544R869m74j826J1180l662l413j503J328m394o741l63k898n659L746K2382
$$ plain form
14912 13511 1879 1595 11406 7913 9834 -804 1666 6280 -113 -2667 -3683 -3222 -304 5610
14898 5610 -5851 -11674 -12931 -6024 -3129 -5364 -2345 -4692 -1165 -10597 -15750 -16340 -1224 6816
14884 6816 5831 4462 -2494 2162 9856 -2813 -5878 -7892 -1438 7340 22460 25591 8355 75
14870 75 1554 17154 20281 7923 -3892 609 1043 -462 1884 6452 7074 -8531 -12209 -16982 -6130
14855 -6130 -4759 -7003 -7283 -10929 -4675 -267 1166 2462 -13292 -21455 -15526 -2906 11773 15252
14841 15252 4727 -4931 -5179 6428 385 2019 2254 1746 4661 -52 8154 10545 10448 11146 9438
14826 9438 22190 13652 10159 9892 15214 26614 30806 25651 25407 15351 10474 2980 2917 2010 2544
14811 2544 12413 11939 10113 21293 17631 14218 12715 14043 9649 2908 2545 -353 -6012 -2266 20116
14796B0116K940l551j4661l427L772k643O249q68J645P15m012j373o520N458j429
14781B411j336N897j526N482o647o538q043J957l644l695Q338M078l376J0474
14767C832M080n546J09N664J495n857l180n609j936M940J686q206R67R164O53
14752B256Q258l927o083k567J608R37l592j138O245r92p66j273o32K096O023n076
14736A377l138j921Q538o106r649l489J7088O630o542j2723k332L335P698Q838
14722G604m152k889P713L046r633M756L968J36j6120J688M922Q89O36L746M601
14707A0911l14m614J889O996J648M108p419p310r742O333R858j0671K971J4374
14693A9018O912M913o045j1656j1848j247nN488R131J993j4873p507J140J7040
$$ plain form
14796 20116 23056 19505 4844 1417 5189 2546 8795 7927 9572 10287 6275 4902 -1618 3840 2411
14781 2411 1075 6972 5446 10928 4281 -2257 -10300 -8343 -11987 -15682 -7344 -3266 -6642 3832
14767 3832 7912 2366 2475 8139 9634 3777 597 -5012 -6948 -2008 -322 -8528 -7561 1603 2256
14752 2256 10514 6587 504 -2063 -455 482 -3110 -4248 1997 1005 239 -1034 -1666 430 6453 1377
14736 1377 -1761 -3682 4856 -1250 -10899 -14388 2700 9330 2788 -9935 -12267 -8932 -1234 7604
14722 7604 3452 563 8276 11322 1689 6445 10413 10549 -5571 -3883 1039 1928 2564 6310 10911
14707 10911 10597 5983 7872 14868 16516 20624 13205 5895 -3847 2486 12344 1673 4644 19018
14693 19018 25930 30843 24798 13142 1294 47 42 5530 14661 16654 1781 -5726 -4586 12454
14679A2454M088m059k588n574L52M820n668J906K378M843j08Q482M96J3304L178
14664C8304j964L135J120p655k1104m298n436O013o21q566M00J9023O843O043
14650C1237k622j6852J14l926q983n283Q324J4933n228J242K626N746k217p826
14636A1285O42m659n015m069J674M429n281l168M281P98L004R286Q016R386L299
14621C3908j5248j1025j3915o077J3800N230N92k535O71L179P43k677k264N670
14607A0052p763O191o17N71Q553j245j8713M886M96j0293J3222J836m44P858K285
14592A6875j1105l301k053J6774Q357M752J285q67l541n765k213j359m025j0650
14578C164j602O090J0400L728o936K592N287K937k816Q08L420j1717r777j3875
$$ plain form
14679 12454 16542 12483 9895 4321 4673 9493 3825 5731 8109 12952 12844 21326 21822 35126 38304
14664 38304 36340 39475 40595 32940 11836 7538 2102 8115 7494 -1072 -672 18351 25194 31237
14650 31237 28615 11763 11877 7951 -1032 -6315 2009 16942 11714 12956 15582 21328 19111 11285
14636 11285 11927 7268 2253 -1816 -142 4287 -994 -4162 119 917 3921 13207 21223 30609 33908
14621 33908 18660 7635 -6280 -12357 1443 6673 7265 4730 5401 8580 9323 6646 4382 10052
14607 10052 2289 8480 7863 8434 16987 15742 -2971 1915 2411 -7882 5340 7176 6732 14590 16875
14592 16875 5770 2469 416 17190 25547 30299 31584 30717 27176 21411 19198 17839 13814 3164
14578 3164 1562 7652 18052 21780 14844 17436 22723 25660 22844 23652 27072 15355 5578 -8297
14564h297j2351k012R840J779K779K897l679N688M819P47J7552Q211q922l411
14550A5640k919K736N921k043J0768o956l131o850j048J646P19j3597J63Q970
14536A0019Q106m112J608m186j12m938O874J5568J266r552j3177j857L099R935
14522A8541l51j0309k757O777P908P13K555n261J566j561q66Q931n219M66P652
14507B8785l746o199J351j03R776n598j1092k664R344l104p018M276l812o35l248
14492F313o04j012J3783J4815l399o948p571o929j963o51r06N034k763o874K471
14477B796J3698J2170n613j0708o452L567r561L691J7235R307J172J0490l808
14464C7984r302n989J536k251L488M486O06L35K254K952j0389o016J1492J1622
$$ plain form
14564 -8297 -20648 -22660 -12820 -11041 -8262 -5365 -9044 -3356 1463 2210 19762 27973 19051 15640
14550 15640 12721 15457 21378 19335 30103 23147 20016 13166 12118 13764 14483 886 1049 10019
14536 10019 18125 14013 15621 11435 11323 6385 13259 28827 30093 20541 7364 5507 8606 18541
14522 18541 18190 7881 5124 11901 19809 20522 23077 17816 19382 17821 16955 25886 20667 21133 28785
14507 28785 25039 18840 20191 20088 29864 24266 13174 10510 19854 16750 9732 14008 10196 9561 6313
14492 6313 5709 4697 18480 33295 29896 22948 15377 8448 6485 5834 4928 9962 7199 325 2796
14477 2796 16494 28664 23051 12343 5891 9458 -103 3588 20823 30130 31302 41792 37984
14464 37984 28682 22693 24229 21978 25466 29952 30558 30893 33147 36099 25710 19694 31186 42808
14450D2808k897l997j1981j1753J3707J0378L209r823p185J0617J2870N216j1784
14437C9385o010n885l022l614j0748k380R707j1870j3943P915J7803k857K365
14424A6846r412j1627q651N522J3951J093M179L536J678p902j2582O305P391P339
14410A7666N083j0604N653N371O274l38l493k733l363p775q518j694K465N848
14396I842M239L303J0100K718q635j3696N905n14q580J520m304j3094J0914J3170
14382A2888L236j568l656L12K023j51k888P16m201q280J083N035J713O021r916
14367B367o279l457M411P091j624l609N686J1394P565n415j7552o943r496J9614
14353C753Q405m65K068p888j7186o758J6650J4200J571k933o944o01k60m557O654
$$ plain form
14450 42808 39911 35914 23933 12180 25887 36265 39474 29651 22466 33083 45953 51169 39385
14437 39385 33375 27490 24468 20854 10106 7726 17433 5563 -8380 -465 17338 14481 16846
14424 16846 7434 -4193 -12844 -7322 6629 7722 11901 15437 17115 9213 -3369 2936 10327 17666
14410 17666 22749 12145 17798 23169 29443 29105 25612 22879 19516 11741 3223 1529 3994 9842
14396 9842 14081 17384 27484 30202 21567 7871 13776 13262 4682 6202 1898 -11196 -282 12888
14382 12888 16124 14556 10900 11212 13235 13084 10196 10912 6711 -1569 -486 4549 6262 12283 2367
14367 2367 -3912 -7369 -2958 4133 2509 -1100 4586 15980 23545 18130 578 -6365 -15861 3753
14353 3753 12158 11693 13761 5873 -11313 -18071 -1421 12779 14350 11417 4473 3872 3612 -945 5709
14338E709M973R14k529n168Q61m146j419M396N951J264K878M090k775j940k788
14323A0271o606O377L677n031l918O96J3463O475m073j0610j275Q746J758m655
14309A5295j156j082o211L635R831O451J5088J0467k659o075q786N146J739p514
14295C4169M584o501j2511M748M988l565j92K658j2350n616O317J5913M695q28
14281C6509j1289M366J824L224P681r074j0521L552J465k640O559L96j0277j0125
14267A1650R536J5453P063J2019K173j1424j0941J235M678P668J4597P823n394
14254F6136J3682K5050J6777K305j5476j9443k1671j8607j4222p455P03j670N68
14241B6677M35J1542J0720O915k075k023J635p188l287o807J638L083J6814J9899
$$ plain form
14338 5709 10682 11596 9067 3899 4760 614 -805 3591 9542 10806 13684 17774 14999 13059 10271
14323 10271 3665 10042 13719 8688 4770 5466 18929 25404 21331 10721 9446 18192 19950 15295
14309 15295 14139 13057 6846 10481 20312 26763 41851 52318 49659 43584 34798 39944 41683 34169
14295 34169 38753 32252 19741 24489 29477 25912 25720 28378 16028 10412 16729 32642 37337 36509
14281 36509 25220 29586 31410 34634 42315 33241 22720 26272 27737 25097 31656 32052 21775 11650
14267 11650 21186 36639 43702 55721 57894 46470 35529 36764 41442 49110 63707 71530 66136
14254 66136 79818 104868 121645 123950 108474 89031 67360 48753 34531 27076 27779 26109 26677
14241 26677 27112 38654 49374 56289 54214 52191 53826 46638 43351 36544 38182 41265 58079 77978
14227G7978N048M819O25M330J3780j600k863P103J4550L9768K8886L2596O1805
14214B86825J01474J57815K57314M02188M22249J93457j16738l01739l15850k82296
14204H04699k22510j70930j14075o3075m5554k8996j4932k1126j7585j3520j6070
14193G6326J566N58l969j514n868l725l608m275p733k585m26m582k365j224K986
14178C9562J2409l851L515J6982j3176m6P646l554M93Q416J2389K3035K8466M4456
14164A76742O5731Q5718Q5284K1163n3176r5182q2551n6605k7493k7350k4703
14153F7578J892L656P986p786j5695j1544q670q370j0283m667O435N465j649j3478
14139A0870r03O664m392o896l010J3003J6461k016Q944P169o651o822M44J10j3691
$$ plain form
14227 77978 83026 87845 88470 92800 106580 104980 102117 109220 123770 163538 192424 225020 286825
14214 286825 388299 546114 803428 1205616 1627865 1821322 1704584 1402845 1086995 804699
14204 804699 582189 411259 297184 234109 188555 159559 144627 123501 105916 92396 76326
14193 76326 77892 78450 74481 72967 67099 63374 59766 55491 47758 45173 44747 40165 37800 36576 39562
14178 39562 51971 48120 51635 68617 55441 55395 63041 59487 59980 68396 80785 103820 132286 176742
14164 176742 242473 328191 413475 434638 381462 286280 203729 147124 119631 92281 67578
14153 67578 69470 73126 81112 73326 57631 46087 37417 29047 18764 14097 20532 25997 24348 10870
14139 10870 9967 16631 12239 5343 2333 15336 31797 29781 38725 45894 39243 32421 32865 32975 19284
14124A9284k330J0193Q020O520R385J5377K6289L6408J5197K369k2665k0616j1896
14111I1535r225K377o992j6046j8748n327k803m461j1247j1847O98j0242o83P491
14097D480P827J041K11P67N899K627R641K2638N9050J17360J31500O6618k6850
14084D02809o1204m3377l4995k7070k7784j5795q322j9066p692j5584m4118n3916
14072D3886k0070J4744K6194J7937K2094K4503J9353m047j9128j7864j6062L286
14060I4826J57q161L436j2756j3574j7317r348j0298n857N204K1400J2155j369
14047E8498j1088K865K3809Q798J891j433l931M368M656l159j4249m308L336P74
14033G0827m848m350n221J119J2105J442n490M27J1985K6470L6508L2977L4899
$$ plain form
14124 19284 16954 27147 35167 41687 51072 66449 92738 129146 144343 146712 124047 103431 91535
14111 91535 82310 84687 77695 61649 42901 37574 34771 30310 19063 7216 7914 -2328 -3011 4480
14097 4480 12307 13348 13559 14326 20225 22852 32493 55131 114181 231541 363041 429659 402809
14084 402809 341605 298228 263233 236163 208379 192584 184262 165196 157504 141920 97802 43886
14072 43886 23816 38560 64754 82691 104785 129288 148641 144594 125466 107602 91540 94826
14060 94826 94983 86822 90258 77502 63928 46611 37263 26965 21108 26312 47712 59867 58498
14047 58498 47410 50275 74084 82882 84773 83340 79409 83777 88433 85274 71025 66717 70053 70827
14033 70827 65979 61629 56408 57527 69632 71074 65584 66011 77996 104466 140974 173951 208850
14020B08850M0354K3769j6385j2683l2j546m210p378j2273k9671k5969k1884j3518
14007A27424M17J0918P34j0455r268j185j2968k052l749Q011J5592p8k598k2618
13993I8125q670N178P3k169p170l15L533o461N86J7494O727m129j0227O45K490
13978I5710J7837J4892P940J416j2631j4431P163O160j3231O3J1699j195N424
13965A26816J6007N578l848j0951j5566l546K713l100j2239J736J0122K2551J7312
13952A53585K722P009N310j4271k2133j7490k740O499n964P155N189N910m856
13939A25925n917l906L003O181N859O636o241j5821k919J2761O134J9006M893
13926A55594o63P318J266J446p405l6p41j623j9836l7964k1359L798J6024K1498
$$ plain form
14020 208850 249204 272973 256588 243905 243873 242327 238117 230739 218466 188795 162826 140942 127424
14007 127424 127841 138759 139493 129038 119770 118585 105617 103565 99816 107827 123419 123341 120743 98125
13993 98125 89455 94633 94706 92537 85367 85052 88585 82124 82710 100204 106931 102802 92575 93220 95710
13978 95710 113547 128439 136379 137795 125164 110733 117896 124056 110825 110888 122587 121392 126816
13965 126816 142823 148401 144553 133602 118036 114490 117203 114103 101864 103600 113722 136273 153585
13952 153585 156307 163316 168626 154355 132222 114732 111992 118491 112527 119682 124871 130781 125925
13939 125925 120008 116102 119105 125286 131145 137781 131540 115719 112800 125561 131695 150701 155594
13926 155594 154931 162249 163515 164961 157556 157520 156779 155156 135320 97356 75997 79795 95819 117317
13912A17317K2194J6468J1193L13o405Q042J3151Q822o677m652J1949j951P985
13899A97749L1325K2110K4754M1576L5805j3395k9935k4129k953J4354K1314M998
13887C23573J3584M139m455N652M603M577r485j2384k1293k3690j5927k111R692
13874B76475N123J0032N492K422n851l418l034o462l253J9352J4218J0331O883
13861C28310N98J0325J7318K8117L0832J1140L7213L1619N5473R9826J00469N1446
13849H02686n1842j06989j03460o0528k4715l2262j8426N138N333N466K0445L0537
13837D71383L0412M5907M7791L5855k60l6632j9191l702J3541k006m772j2025
13825E66301k994K0603L4034K9999L1620N0421M6645L6274K1345K5877K8781K2970
$$ plain form
13912 117317 139511 155979 167172 167485 161080 169122 182273 191095 184418 179766 191715 189764 197749
13899 197749 229074 251184 275938 317514 353319 339924 309989 285860 282907 297261 318575 323573
13887 323573 337157 341296 336841 342493 347096 351673 342188 329804 308511 284821 268894 266783 276475
13874 276475 281598 291630 297122 299544 293693 290275 287241 280779 277526 296878 311096 321427 328310
13861 328310 328908 339233 356551 384668 415500 426640 463853 495472 550945 650771 751240 802686
13849 802686 750844 643855 540395 479867 455152 422890 404464 409602 414935 420401 440846 471383
13837 471383 501795 547702 595493 631348 631088 594456 575265 571563 585104 583098 578326 566301
13825 566301 563307 583910 617944 647943 679563 729984 776629 812903 834248 860125 888906 911876
13813I11876K4483K7065N6244R3200J18347J42965J75143J77236J28582O7645
13803A922786K0364J4396P2418J45912K02214K56417K90436L79984N10760P05850
13793D521537J049908J627884K599047M034849N428062M972060J494510k740285
13785B2987572m831378m353790k974000j788176r51134l88235j8929K06366M03618
13776H291914O57989R52401J338745J821057K482858L526324N136868P413437
13768C1621593J0623470J5962355K5858161M3339200O8863304Q2066278M4132823
13761C22467184k5193614p2392476p3604825n1154510l1374431j8925121j1772480
13754C8049727p844470n525095l868552k467600j203611n7161J217470K991708
$$ plain form
13813 911876 936359 963424 1019668 1112868 1231215 1374180 1549323 1726559 1855141 1922786
13803 1922786 1943150 1957546 2029964 2175876 2378090 2634507 2924943 3304927 3815687 4521537
13793 4521537 5571445 7199329 9798376 13833225 19261287 24233347 25727857 22987572
13785 22987572 18156194 13802404 10828404 9040228 8089094 7700859 7681930 7888296 8291914
13776 8291914 8949903 9902304 11241049 13062106 15544964 19071288 24208156 31621593
13768 31621593 42245063 58207418 84065579 127404779 196268083 278334361 322467184
13761 322467184 297273570 224881094 151276269 100121759 68747328 49822207 38049727
13754 38049727 30205257 24680162 20811610 18344010 17140399 17083238 18300708 21292416
13746B1292416N725030R967659J5322111J6991451P764928p247762j6601565j6146595
13738C7067673j1383012p304752m581077k872551j840499j273727j034028r42604
13730E835423q32713o46044m81685l99944l22300k29421j46162j17465j02250
13721B557439q7729n5267k2506r655N131K4459N9857J08843J70119K11487K44243
13710C206421L04920M05978N50510P05705Q98458J169732J662917K487033L868141
13701A5259815O203349R982712J5241702J8152450J0626942m800848j6041889
13694E4624233j7059345j2299871p818798m843309l003620j905942j280702j005138
13686E407508q89287p66836n76346m40706l49140k71271k09619j48266j28939
$$ plain form
13746 21292416 27017446 36985105 52307216 69298667 77063595 69815833 53214268 37067673
13738 37067673 25684661 18379909 13798832 10926281 9085782 7812055 6778027 5835423
13730 5835423 5002710 4356666 3874981 3475037 3152737 2923316 2777154 2659689 2557439
13721 2557439 2469710 2414443 2391937 2382282 2387413 2411872 2471729 2580572 2750691 2962178 3206421
13710 3206421 3511341 3917319 4467829 5173534 6071992 7241724 8904641 11391674 15259815
13701 15259815 21463164 31445876 46687578 64840028 75466970 70666122 54624233
13694 54624233 37564888 25265017 17446219 12602910 9599290 7693348 6412646 5407508
13686 5407508 4518221 3751385 3175039 2734333 2385193 2113922 1904303 1756037 1627098
13677A627098j14431j03468p5512o1358m6762m5659k5028L881L4399M7925O5015
13666A306100Q2122J03236J38210J83164K28783K96368L86819N44466P96935J219879
13656E286082J956491L130817M746497N707231L729977q70208m664689n470718
13648A3551480m250215k815513j797633j143390p38770n02986l85187l24091k71223
13639A322472k07495j73132j31836p3221m0024m1269m4440o9208o9003m5325k9877
13628C97642k2412k0848k3466p020j9135j3050j5089j5694j0588q584r31n120
13616B35705N76o398j8251j3880L536P485L543K171r388k5467j8463j0267j4121
13603A36781j8226q311M39P939o298l387k788q114j1094J0545J2700j285k690
$$ plain form
13677 1627098 1512667 1409199 1333687 1272329 1225567 1179908 1154880 1158761 1193160 1241085 1306100
13666 1306100 1388222 1491458 1629668 1812832 2041615 2337983 2724802 3269268 4066203 5286082
13656 5286082 7242573 10373390 15119887 20827118 24557095 23686887 19022198 13551480
13648 13551480 9301265 6485752 4688119 3544729 2805959 2302973 1917786 1593695 1322472
13639 1322472 1114977 941845 810009 736788 696764 655495 611055 541847 472844 427519 397642
13628 397642 375230 354382 330916 323896 304761 291711 276622 260928 250340 241756 240825 235705
13616 235705 236281 229883 211632 197752 201288 208773 212316 214487 205099 179632 161169 150902 136781
13603 136781 118555 110244 110683 118622 112324 108937 106149 98035 86941 97486 110186 108901 106211
13590A06211J060j4836m148j692n672j905j3681m738N418M47j0504J585P847n416
13576E9976r538j1542l319O400j783O723Q199O784l553j3143j4807L299k91P174
13562D0579J425k949m64M967j656k276j3019k323K197j301R025R856R126O266
13548E9453J989o08K924l857j1749j0821N765o246q469N082J995m459j5526m314
13534A1159j1736L713R676N351k007j199L52q628L18L820l673j154j3383q598
13520a5989Q349K4198J8065R320L387n570J568n061k767p717n40J0367q582j0411
13506A8617m980j407N363k955O491J1241R085q118j2179K796K192j1797p419j596
13492E334N741J1364o302j5022q403k516Q368L645J4885J7316Q893R594J0111
$$ plain form
13590 106211 107271 92435 88287 86595 80923 79018 65337 60599 66017 66464 55960 57545 65392 59976
13576 59976 50438 38896 35577 41977 40194 46917 55116 61900 58347 45204 30397 33696 33405 40579
13562 40579 42004 39055 38591 43558 41902 39626 26607 24284 26481 25180 34205 44061 53187 59453
13548 59453 61442 60834 63758 59901 48152 37331 43096 36850 28381 33463 35458 30999 15473 11159
13534 11159 -577 3136 12812 18163 16156 14957 15309 6681 6999 10819 7146 5992 -7391 -15989
13520 -15989 -7640 16558 34623 43943 47330 41760 43328 38267 35500 27783 27243 37610 29028 18617
13506 18617 13637 12230 17593 14638 21129 32370 41455 33337 21158 23954 26146 14349 6930 5334
13492 5334 11075 22439 16137 1115 -7288 -9804 -1436 2209 17094 34410 43303 52897 63008
13479F3008K6810M0009O4453Q8571J31235J30740N0821p8578j52452j15716q3514
13468A65387o1299k8873k0565k2186j5935r372L289K636O696R485j2113l880o89
13455A2581j3853m272J2096R965k8637l4715k3035l2125k1073p175m972l44j6868
13442a52427k5514n1860n6350o3868l9580N7175J37807J23475P1995K9049j498
13431B8404k219Q91n861M278m824j669j432N88j3291j1813j7195k0399j3847r939
13417f8328J3353J8481J8246K3217J3860m796r832Q768L005Qm175R104L011M340
13403B8262m92P889L428R09k618p236r203j437o972n143J1638J041j643L951L403
13388B5777k528j971o569j2198j4167r724j3322k343Q805L22J2357J236j4211
$$ plain form
13479 63008 89818 129827 194280 282851 414086 544826 595647 517069 364617 248901 165387
13468 165387 104088 75215 54650 32464 16529 7157 10446 13082 19778 29263 17150 13270 12581
13455 12581 -1272 -5544 6552 16517 -12120 -46835 -69870 -101995 -123068 -130243 -135215 -135559 -152427
13442 -152427 -177941 -229801 -286151 -350019 -389599 -332424 -194617 -71142 853 29902 28404
13431 28404 26185 27076 21215 25493 20669 19000 17568 18156 4865 -6948 -24143 -44542 -58389 -68328
13417 -68328 -54975 -36494 -18248 4969 18829 14033 4201 12969 15974 15982 11807 20911 23922 28262
13403 28262 27770 35659 39087 39996 37378 30142 20939 19502 12530 7387 19025 20066 18423 22374 25777
13388 25777 23249 21278 14709 2511 -11656 -21380 -34702 -37045 -28240 -27918 -15561 -14325 -28536
13375b8536k8342r903l85l167R546K7863L0004J7508J7336M429M236r35L42r665
13361C0331j6633m46J174j956P79q777j3420n081K203M583M171J1797L799K372
13347A4896l152j853j364o388P054K246J6033J961j5765j6409j003J1123R756
13334A7135l174q104q995j107J2450O441m252n065J5895J3497J2309J0043J0895
13321F7968J5824J0406L1607K9013K1579M5290N1410M9777N0776Q5603J64947
13310F24200K85581L92782K79360l7397l14687l74632k88968j78794j05015o9459
13300B12971n7334l5988j5923r479j3786r386p696j6189j5111m25M202m148o246
13287B5462j761M727Q226O598l965k736N044p810O902J6428j932J102N383J8685
$$ plain form
13375 -28536 -56878 -66781 -67166 -70333 -60787 -32924 -2920 14588 31924 36353 40589 39654 39996 30331
13361 30331 13698 13252 14426 12470 13249 4472 -8948 -14029 -11826 -7243 -3072 8725 12524 14896
13347 14896 11744 9891 8527 2139 9193 11439 27472 29433 13668 -2741 -3744 7379 17135
13334 17135 13961 5857 -3138 -4245 8205 14646 10394 5329 21224 34721 47030 57073 67968
13321 67968 83792 94198 125805 154818 176397 221687 273097 322874 373650 459253 624200
13310 624200 909781 1302563 1581923 1544526 1229839 855207 566239 387445 282430 212971
13300 212971 155637 119649 103726 94247 80461 71075 63379 47190 32079 31654 35856 31708 25462
13287 25462 23701 28428 36654 43252 39287 36551 41595 33785 40687 57115 55183 56285 61668 80353
13273H0353L3946P0930Q5774R1143L5739m8862p9651q0061o3790l7946j5566q175
13261F3834k674k283j0384j3252m545r844L305J5732l704q323j1029N366L665
13248B5864j1005p041M030J600N964O3L385Q63o510O624m260n203M662J5714q569
13233B6181M423O275J0837K6361K5811J8984N1792Q6136J00047M2669m4698p7310
13221B77508q0466n6962l3707k9958j4853j2818p781j5028m094k04Q785j3439
13209A6983j0117L520O966j450M521q34j002o337M331K712J3869P387j5173r634
13195A5742j253P746O198r25m58j0143j0651K744P287J4960M684k665L851J7132
13181E4249J5153K8545J3232q22j1719k3361j6677j2420j3234j0404n452m237
$$ plain form
13273 80353 114299 185229 271003 362146 397885 349023 269372 189311 125521 87575 72009 63834
13261 63834 61160 58877 48493 35241 30696 20852 24157 39889 36185 27862 16833 22199 25864
13248 25864 14859 7818 11848 13448 19412 19475 22860 23723 17213 23837 19577 14374 19036 34750 26181
13233 26181 30604 36879 47716 74077 99888 118872 170664 256800 356847 399516 354818 277508
13221 277508 197042 140080 106373 76415 61562 48744 40963 25935 21841 21637 30422 16983
13209 16983 6866 10386 17352 15902 20423 19589 18587 12250 16581 19293 33162 40549 25376 15742
13195 15742 14489 22235 28433 27508 27050 16907 6256 9000 16287 31247 35931 33266 37117 54249
13181 54249 69402 97947 111179 110357 98638 75277 58600 46180 32946 22542 17090 12853
13169A2853k338o385r577p550N056R104n206K774j568J747k091J199j961M139
13155A96M299q079Q081R512J345O397j88j4678O20r263k514k88O982l489J0030
13140H963L775j7742o391J161j70j2526L309J7096J0229J960j224n519N588J617
13126A0126L154m509m109r523O629k501O213l147j963n302J396Q890N036N307
13112A5697J4422j684j1663r844P630L619O163j582o86l111k398K90n33O592k332
13097B0580r247N819M94l319o820j3360q061J965O765N813p155p054J1621J8278
13083A6319r02M236j0184o244L866J2O693J6725J4136J3320l543p133j5767j5132
13069A6402q405q927P904J9709L200J749N15L213l086R89k462j4476q159p266
$$ plain form
13169 12853 10515 4130 -5447 -12997 -7941 1163 -4043 -1269 -2837 -1090 -3181 -1982 -3943 196
13155 196 4495 -3584 4497 14009 15354 21751 21563 6885 7505 -1758 -4272 -4560 2422 -1067 8963
13140 8963 12738 -5004 -11395 -10234 -10404 -22930 -19621 -2525 7704 9664 8440 2921 8509 10126
13126 10126 13280 8771 4662 -4861 1768 -733 5480 2333 370 -4932 -3536 5354 10390 15697
13112 15697 30119 28435 16772 6928 14558 18177 24340 22758 22072 18961 16563 16853 16320 22912 20580
13097 20580 11333 17152 17646 14327 7507 -5853 -13914 -11949 -5184 629 -6526 -13580 -1959 16319
13083 16319 15417 19653 9469 3225 7091 7103 13796 30521 44657 57977 54434 47301 31534 16402
13069 16402 7997 -930 6974 26683 29883 31632 32147 35360 32274 33263 30801 16325 8166 900
13055I00j393k871k217p651p64O302R507p291k961M560Q381J944J1275J898q788
13040A0831n909M595P24j5663j3562Q571J5667N964N673K943K147n766L51J4933
13026C1499j724j1232N609R421M882m909q861J2866O5k600M1J7676N793K958R073
13011G0557J4045K4610L7927J6817J1975J4330J9778L6312O2275J16983J80906
13000F06515K56207M42124P75504J286987J474646N28055p62625j407363j173676
12991B026374p16893m16216k52543j66486j04345p4805o7010l6972j7450j8271
12981A55383j8208k8302j6578j3817r660j3055j1072K538n752o272k169M317m071
12968C3282o669O692k575k335k457m625O87n340k0131l176N369Q640Q896k619
$$ plain form
13055 900 -493 -3364 -5581 -13232 -13996 -7694 1813 -5478 -8439 -3879 4502 6446 17721 19619 10831
13040 10831 4922 9517 10241 -5422 -18984 -10413 5254 11218 16891 19834 21981 16215 16566 31499
13026 31499 29775 18543 24152 33573 38455 33546 24685 37551 37616 35016 35057 52733 58526 61484 70557
13011 70557 84602 109212 147139 163956 175931 190261 210039 246351 308626 425609 606515
13000 606515 862722 1304846 2080350 3367337 4841983 5370038 4607413 3200050 2026374
12991 2026374 1309481 893265 640722 474236 369891 295086 228076 191104 173654 155383
12981 155383 137175 108873 92295 78478 68818 55763 44691 47229 41477 35205 33036 37353 33282
12968 33282 26613 33305 30730 28395 25938 21313 22000 16660 -3471 -6647 -1278 7362 16258 13639
12954A3639j5654M785J406p288K680J0804n236j3247J572R075j568J0835K639
12941A4442j570o529O920k299l815M56o198j243J174L306J113J3730K718l359
12927A8846j344N717l542p693N761Q227n365o345p681n194m744J2151J1957j446
12913A9305O178Q883N860K809o544o518N17Q72o628j34M229j5172k3153m945L286
12898a1155P269J599r979m212P027K033n001J5754P397p04j5901r662m649O580
12884a3604j3069L587J552N517J1577k697N761J0377J955L963M895k2206K55J4718
12870A2581K3122J6711l339k1558j1315j607R039k983j6275l898j470R860R767
12857A8635m369k5553M145R837M722K647l880j886o431j5184M030N682L81R612
$$ plain form
12954 13639 -2015 2770 4176 -3112 -432 10372 5136 -8111 -6539 2536 968 11803 14442
12941 14442 12872 6343 13263 10964 7149 7605 1407 164 1338 4644 5757 19487 22205 18846
12927 18846 17502 23219 19677 11984 17745 25972 20607 14262 6581 1387 -3357 8794 20751 19305
12913 19305 25483 34366 40226 43035 36491 29973 30490 31362 24734 24600 28829 13657 -9496 -14441 -11155
12898 -11155 -3886 -2287 -12266 -16478 -9451 -7418 -12419 3335 10732 10028 -5873 -15535 -20184 -13604
12884 -13604 -26673 -23086 -21534 -16017 -4440 -7137 -1376 9001 10956 14919 19814 -2392 -2137 12581
12870 12581 35703 52414 49075 27517 16202 14595 23634 20651 4376 478 -992 8868 18635
12857 18635 14266 -11287 -7142 2695 7417 10064 6184 4298 -2133 -17317 -13287 -7605 -7224 2388
12843B388K102L938P875K606n229j4962m342k315o232o547p411J612N446J3388
12829g683P337k496p478l857M809P346R180M539n522K893l480Q25O558p32J487
12814A3726l062n45J08N124n542n499q837J3o070N849J9267R479j5055L158n995
12799F119q069M992Q777L527r51o275k072r35j696J629n935N939k246J266q347
12784d277K984Q216J024M972O849l970q86j5541j2761j63J1383J7334J3383j655
12770B6892j2061j0594q464p219O094J0920R136J0829N633N383J0305L905L086
12757E3845O480K860j4525j6369j1235j4307j166L948n208j7333m118J704J9319
12744C895j377j1406j490L965r579m80J234R438J3210R177j2511j9667j1319r34
$$ plain form
12843 2388 4490 8428 16303 18909 13680 -1282 -5624 -7939 -14171 -20718 -28129 -26517 -21071 -7683
12829 -7683 -346 -2842 -10320 -14177 -9368 -2022 7158 11697 6175 9068 5588 6413 12971 12239 13726
12814 13726 10664 10119 10227 15351 9809 4310 -4527 -4514 -10584 -4735 14532 24011 8956 12114 6119
12799 6119 -1950 3042 11819 15346 14395 8120 6048 5113 3417 5046 -889 5050 2804 4070 -4277
12784 -4277 -1293 6923 7947 12919 19768 15798 14912 -629 -13390 -13553 -2170 15164 28547 26892
12770 26892 14831 4237 -4227 -11446 -5352 5568 14704 25533 31166 36549 46854 50759 53845
12757 53845 60325 63185 48660 32291 21056 6749 5583 9531 4323 -13010 -17128 -15424 3895
12744 3895 2518 -8888 -10378 -6413 -15992 -16472 -15238 -5800 7410 16587 4076 -15591 -26910 -27844
12730b7844J5244Q713Q308J0460m917j2946N169K969p951j887j665n18j436K83
12716h018J3844M718q698n234K38L728n222p875L708J1570J719q059j3959O3p841
12701b5318L233O897l341J2069r495j0451J0933L022l692l98N689N634O599L075
12687D456L448P276r165m396p597J499q53j075j1421Q14J0893O946l566r89q004
12672a1734O436l441q929o652Q045J0853j593j732N757n660L654J0730K622n832
12658B524j2242K712j379p61K477M866M392o560j2472J3932O193j0899o991Q517
12644e691M510o125q265J427n58O410J6736l221k526N957M118n327o519Q234Q03
12629I963n972q002q694K596l403J677k752O046P122j130p802M782O905P77j5545
$$ plain form
12730 -27844 -12600 -3887 4421 14881 9964 -2982 2187 5156 -2795 -4682 -6347 -6865 -8301 -8018
12716 -8018 5826 10544 1846 -3388 -3150 578 -4644 -12519 -8811 2759 4478 -3581 -17540 -17477 -25318
12701 -25318 -22085 -15188 -18529 -6460 -15955 -26406 -15473 -12451 -16143 -16541 -10852 -5218 1381 4456
12687 4456 7904 15180 6015 1619 -5978 -4479 -5332 -6407 -17828 -17014 -6121 825 -2741 -3730 -11734
12672 -11734 -5298 -8739 -17668 -24320 -16275 -5422 -7015 -8747 -2990 -8650 -4996 5734 8356 2524
12658 2524 -9718 -7006 -8385 -9146 -6669 -1803 2589 -3971 -16443 -2511 3682 -7217 -14208 -5691
12644 -5691 -1181 -7306 -15571 -14144 -14702 -8292 8444 5223 2697 8654 12772 7445 926 9160 9963
12629 9963 3991 -4011 -12705 -10109 -13512 -11835 -14587 -8541 -1419 -2549 -10351 -5569 1336 2113 -13432
12614a3432O794L914O129j1292P400n993k39R112P848l594p746q063r257K690
12600a5729J0420M606L284l391L643m630j1983p278j0861Q031J7516J3088o607
12587A09j0835J0014N300J315m537j345m415J383J562K071K341p243j874N058
12573a096O45j491r031j0283j1504J8372M19j1002n935M046J7779P188k136O152
12559B123J5805j994q802n225N13J900R98l461K642j4904N177M243l305k227J438
12544e079q469J499l274l210l708M325J3826O864J738p124m453M55j52n112J1505
12529c69J2741M948j3399j778j25L202O780K252j5480j2141M143R600p491j4646
12515b1763r818J2090p719N239J7750J3562O769p826L555k707j019j056j6214
$$ plain form
12614 -13432 -6638 -2724 3405 -7887 -487 -6480 -6719 2393 10241 6647 -1099 -9162 -18419 -15729
12600 -15729 -5309 -703 2581 -810 2833 -1797 -13780 -21058 -31919 -23888 -6372 6716 109
12587 109 -10726 -712 4588 5903 1366 21 -4394 -3011 -1449 622 2963 -4280 -6154 -1096
12573 -1096 -451 -1942 -10973 -21256 -32760 -14388 -13969 -24971 -30906 -26860 -9081 -1893 -4029 2123
12559 2123 17928 15934 7132 1907 2420 4320 5318 1857 4499 -10405 -5228 -985 -4290 -6517 -5079
12544 -5079 -13548 -12049 -15323 -18533 -22241 -17916 -4090 2774 4512 -2612 -7065 -6610 -6762 -11874 -369
12529 -369 12372 17320 3921 2143 2018 5220 12000 14252 -1228 -13369 -9226 374 -7117 -21763
12515 -21763 -31581 -19491 -27210 -21971 -4221 9341 16110 8284 11839 9132 8113 7057 -9157
12502i157j4587j172J2396J976p85r741N642L169P841Q730K635J0775j864q508
12488G350l757j0964k842n992l011j404K154O458N345J78N525m021K370L413M592
12473E394m842N876P17m001j0182k616L971P429p29q255r703k144Q893j0013q73
12458b1078P150R094M597j706n956N408m900r37k13N950K126p223O602J3975K787
12443A5676m638K382p454j3204k978k228J2076P443o144r115J720l740K796N445
12429a963j941p692P51P07k191j353N223R029J5887N772P39j1967j0309r373L151
12414e530J1688q463j4789N319J0717J533q302N328Q770N23j1622J617n263q73
12400i347o481M089R184l274M051O225L170n365j2084j6913M747K2691J2518k109
$$ plain form
12502 -9157 -23744 -24916 -12520 -10544 -11329 -21070 -15428 -12259 -4418 4312 6947 17722 15858 7350
12488 7350 3593 -7371 -10213 -16205 -19216 -20620 -18466 -12008 -6663 -6485 -960 -4981 -2611 802 5394
12473 5394 552 6428 7145 3144 -7038 -9654 -5683 1746 1017 -7238 -16941 -19085 -10192 -20205 -21078
12458 -21078 -13928 -4834 -237 -1943 -7899 -2491 -7391 -8328 -8541 -2591 -465 -7688 -1086 12889 15676
12443 15676 11038 13420 5966 -7238 -10216 -12444 -368 7075 931 -8184 -6464 -10204 -7408 -1963
12429 -1963 -3904 -11596 -10845 -10138 -12329 -13682 -8459 570 16457 22229 22968 11001 692 -8681 -5530
12414 -5530 6158 -2305 -17094 -11775 -1058 475 -7827 -2499 6271 6794 -4828 -3211 -8474 -9347
12400 -9347 -15828 -11739 -2555 -5829 -1778 4447 7617 2252 -9832 -26745 -21998 693 13211 11102
12386A1102p611n768j2290k597L817O603Q005l469p484k247Q921m040j6146K426
12372b0778J5226J1879q7p969m106P76L730r420J543J7226j044o325n208K126
12358b431l344Jr00Q091J632m696J651L06L538J076N222O658q622j3382j2097
12343a7297j08P282J1065J1771J896n226l481l11k090K61l814K003P420L473m326
12328H518r389K649J0727q238o502J948m36J474L294k578j511m476P184k039K265
12313B890Q552J535o057j920j11j1176j1202L156J237J1244O480L543r681j2032
12299a3542R682j953m691l141K083P272N731J1335J0720l362r777k459l494j1392
12285f988r014j814K728m489p19n242J2881K1138M495r559q766M68Q403K264o42
$$ plain form
12386 11102 3491 -2277 -14567 -17164 -13347 -6744 1261 -2208 -9692 -11939 -3018 -7058 -23204 -20778
12372 -20778 -5552 6327 6240 -1729 -5835 -5059 -1329 -10749 -9206 8020 6976 651 -4557 -2431
12358 -2431 -5775 -5774 -6674 1417 3049 -1647 4 310 3848 4924 10146 16804 8182 -5200 -17297
12343 -17297 -17405 -10123 942 12713 14609 9383 5902 5591 3501 3762 -52 1951 9371 12844 8518
12328 8518 -871 1778 12505 4267 -2235 -287 -723 751 4045 1467 -44 -4520 2664 625 2890
12313 2890 11442 12977 6920 5000 4889 -6287 -17489 -14333 -13096 -1852 4628 8171 -1510 -13542
12299 -13542 -3860 -5813 -10504 -13645 -11562 -4290 1441 12776 23496 20134 10357 7898 4404 -6988
12285 -6988 -16002 -17816 -15088 -19577 -20296 -25538 -12657 8481 12976 3417 -5349 -4881 3522 5786 5144
12270E144o768r383P895k16M04l178k503m662P976j683Q437o677p096L684m05
12255i031o889J7734P256j087p231o782O398J255o955L051k567q29q118n190L741
12240a5244N998P176O539L977k473r698q231J2686J23j1752k545J3474J3145j776
12226A1399l119l888k902j3472k954L843O398R183l780p33M033J0102J1257j0093
12212A5274j4730j0862K099L812n303n689L365Q466P003j1462n154J8111R27L4
12198E891M397M362j1762m132J84O598j4290j412J1610M023Q54m617q942l588
12184a0824j938j1148l931L990J1577O260j2071K470O220k820L139J3395p835
12171c516q327r828K045O962J148j0086o561m696L409R986Q924j623n912m289
$$ plain form
12270 5144 -1624 -11007 -3112 -3328 -2924 -6102 -8605 -13267 -5291 -6974 1463 -5214 -12310 -8626 -9031
12255 -9031 -15920 1814 9070 7983 752 -6030 368 1623 -5332 -2281 -4848 -5677 -13795 -18985 -15244
12240 -15244 -9246 -2070 4469 8446 5973 -3725 -11956 730 853 -10899 -13444 30 13175 11399
12226 11399 8280 4392 1490 -11982 -14936 -11093 -4695 4488 708 -25 4008 14110 25367 15274
12212 15274 544 -10318 -8219 -4407 -9710 -15399 -12034 -3568 3435 -8027 -13181 4930 5857 5891
12198 5891 10288 14650 2888 -1244 -1060 5538 -8752 -10164 1446 5469 6323 1706 -7236 -10824
12184 -10824 -12762 -23910 -27841 -23851 -12274 -6014 -18085 -15615 -9395 -12215 -9076 4319 -3516
12171 -3516 -11843 -21671 -19626 -12664 -11516 -21602 -28163 -32859 -29450 -19464 -10540 -12163 -18075 -22364
12157b2364L124J8897j235j2305J1679n048o036j844j691l5J569O411K234M834
12143a810k695r073J037N06J066j583m723p9L455l859K149L793j1792K232M001
12128a7375R944J1411N658r09l380j15l806m592k563k652N727P38k711M334N091
12113D800L754o517p103j6814k859J2429K0348K438m831p942p10m120M893J978
12099b56L180M535p709K110L553P899N796p524j9913j1646j1713o245J2956Q932
12085a6045L495J3k027K0926J4092j1794o174K121N142o744j267J4867m8r165
12071G392r630M842j3956k611r71J439L911M345J1887q319j1542p027L70R494
12057a0376K715n891j0016K774R691J2722P303j815o042k709O865j0697R82J0075
$$ plain form
12157 -22364 -19240 -343 -1578 -13883 -2204 -7252 -13288 -15132 -16823 -16858 -15289 -8878 -6644 -1810
12143 -1810 -4505 -13578 -12541 -12035 -10969 -12552 -17275 -17354 -13899 -17758 -15609 -11816 -23608 -21376 -17375
12128 -17375 -7431 3980 9638 8729 5349 5234 1428 -3164 -5727 -8379 -2652 -1914 -4625 -291 4800
12113 4800 8554 2037 -5066 -21880 -24739 -12310 8038 10476 5645 -2297 -3007 -7127 -2234 -256
12099 -256 2924 7459 -250 1860 5413 13312 19108 11584 -8329 -19975 -31688 -37933 -24977 -16045
12085 -16045 -12550 -12537 -14564 6362 20454 8660 2486 4607 9749 3005 1738 16605 16557 7392
12071 7392 -2238 2604 -11352 -13963 -14934 -13495 -9584 -5239 6648 -1671 -13213 -20240 -19870 -10376
12057 -10376 -7661 -13552 -23568 -20794 -11103 1619 8922 7107 1065 -1644 5221 -5476 -4494 5581
12043E581N265j3278q148O74K493J929P807k283M638j240o186L450J060J2412
12029A4174J2295o869m669J375r126j2649l341J25O298N925j1299j2489l00Q957
12015a1593O328j200M86O264j66q625o718M396N487L69J854k19O495k375O45J3443
11999A4871M877o808k736k16K864o519l551J946r457R49J540j1071p633J2548
11985h396O733l360m635o343p790R660M709L190L882j1251K581p680k459j469
11971b2628P029Q318J3041L049m154o259K682Q674l772j5396p779N53O199P213
11957c230N57j659Q382P325m543o7K972m632k0216K184j318r995l025K2092K1101
11942A5928M114o959r579j6006M952K299P379J5419p364o121j160k164j76k166
$$ plain form
12043 5581 10846 -2432 -10580 -9906 -7413 -5484 2323 40 4678 3438 -2748 702 1762 14174
12029 14174 26469 19600 14931 16306 7180 -5469 -8810 -8685 -2387 3538 -7761 -20250 -20550 -11593
12015 -11593 -5265 -6465 -5979 285 119 -8506 -15224 -10828 -5341 -4972 -3118 -3337 3158 783 1428 14871
11999 14871 19748 12940 10204 9988 12852 6333 2782 4728 -4729 -3780 -2240 -13311 -20944 -8396
11985 -8396 -1663 -5023 -9658 -16001 -23791 -14131 -9422 -6232 -2350 -13601 -11020 -18700 -21159 -22628
11971 -22628 -15599 -7281 5760 8809 4655 -1604 1078 9752 5980 -9416 -17195 -16642 -10443 -3230
11957 -3230 -2673 -4332 4050 11375 6832 6765 9737 5105 -15111 -12927 -14245 -24240 -27265 -5173 15928
11942 15928 20042 13083 3504 -12502 -7550 -5251 2128 17547 10183 4062 2902 738 562 -1604
11928a604p362QJ696M324N871J0127J541j4117l593p487J1035J2181J667n288
11914H999j2043m302R25J0370l917p414J487O813N67M080p829n931M791p13j280
11899e397L208J1804j099j6308r264J072J3752J0277o276m989L780l404k494J329
11885d009p459Q445Q582j2874o69m516j473l653p200J0431J9065k414q534k739
11871i017q33K993k971P380J7543q633o099p593j1844J596J1907J6243M039o301
11857H410p199j0040k292P688q917j598R678J2648R130p952n470L614P333J311
11843A6344j791m578l415n054j5870l608J8481R049q029k2364q826N650l319m769
11829c2099r49J0368O316K389K926P444J4982K10q417q485O095J1791K188K08
$$ plain form
11928 -1604 -8966 -8958 -7262 -2938 2933 13060 14601 484 -3109 -10596 439 12620 14287 8999
11914 8999 -3044 -7346 -6421 3949 32 -7382 -5895 918 1485 5565 -2264 -8195 -3404 -4117 -5397
11899 -5397 -2189 9615 8516 -7792 -17056 -15984 -2232 8045 1769 -3220 560 -2844 -5338 -4009
11885 -4009 -11468 -3023 5559 -7315 -7984 -12500 -13973 -17626 -24826 -14395 4670 2256 -6278 -9017
11871 -9017 -9850 -6857 -9828 -2448 15095 6462 363 -7230 -19074 -17478 -5571 10672 14711 8410
11857 8410 1211 -8829 -11121 -3433 -12350 -13948 -4270 8378 17508 9556 4086 7700 15033 16344
11843 16344 14553 9975 6560 1506 -14364 -17972 509 9558 1529 -20835 -29661 -24011 -27330 -32099
11829 -32099 -33048 -22680 -16364 -13975 -11049 -3605 11377 11587 3170 -5315 780 12571 14759 14967
11815A4967n489M77o300p118n003k15K883P734R187N159M565q421l130L944L587
11800A6827O268n687p825q599k527l297o979O26J7447K349l027OQ061p55j6553
11785c665r225K670n403l789R092P667j697r938P392L396J326R567J1626L758
11771B2777j147j4252r151l747R165q59m613P990k972n62m944j2319J673k761
11757a5722N596J4102m899j0877J0024M250p82P15O553K852j51j0738l716l236
11743f029M529jp872O395j397k327J278K103Q019M889n830j7356J0627R16j127
11728c183l266q278j4312K079J1217Q050R676k634j0983o087P734M040R15N053
11714B1l309j0173p94M238J7816r277n629L767m447j0865J0537J5838q51J1924
$$ plain form
11815 14967 9478 9955 3655 -3463 -8466 -8681 -5798 1936 11123 16282 20847 12426 9296 13240 16827
11800 16827 23095 17408 9583 984 -1543 -4840 -11819 -11193 6254 8603 5576 5582 13643 12888 -3665
11785 -3665 -12890 -10220 -15623 -19412 -10320 -2653 -4350 -14288 -6896 -3500 -2174 7393 19019 22777
11771 22777 21630 7378 -1773 -5520 3645 2786 -1827 6163 3191 2629 -2315 -14634 -12961 -15722
11757 -15722 -10126 3976 -923 -11800 -1776 2474 1692 2407 8960 11812 11661 923 -2793 -6029
11743 -6029 -1500 -1501 -9373 -2978 -4375 -6702 -5424 -3321 4698 9587 3757 -13599 -2972 -2056 -3183
11728 -3183 -6449 -14727 -29039 -26960 -15743 -7693 1983 -651 -11634 -17721 -9987 -5947 -5032 21
11714 21 -3288 -13461 -14255 -10017 7799 -1478 -7107 -3340 -7787 -18652 -8115 7723 6872 18796
11700A8796J183j6955P247J0623L389q431j4826m518P735M771k774q748O804K287
11686F583J025l760n578j1699R87J1051Q340p28k528L017J6863j893m690k25O001
11671B2766o214j7002n041P949K819O784q328o659K449P019M695k664l157r997
11657d581k401K78j798p541L694R748J9408J020j5478j3998r352J5346N957M203
11643D505k6j3542J0602j061J24m448l942J3486K402n856P57m742r030m933N280
11628a0424O963l325L265J2783J1969j13O30o856q624P058o420M150q845j2122
11614i911l843L206L420K331j115J1089J7165R575l991j1341o397j8114p84M476
11600d234O939J0572N152j127j1765p490k263n69J605r085r613L221j0388q093
$$ plain form
11700 18796 19979 3024 10271 20894 24283 15852 1026 -3492 4243 9014 6240 -2508 4296 6583
11686 6583 7608 3848 -1730 -13429 -12442 -1391 6949 6221 3693 6710 23573 21680 16990 16765 22766
11671 22766 16552 -450 -5491 2458 5277 12061 3733 -2926 -477 6542 11237 8573 5416 -4581
11657 -4581 -6982 -6704 -8502 -16043 -12349 -2601 16807 17827 2349 -11649 -21001 -5655 302 4505
11643 4505 4479 -9063 1539 478 602 -3846 -7788 5698 8100 2244 3001 -1741 -10771 -15704 -10424
11628 -10424 -3461 -6786 -3521 9262 21231 21118 21748 14892 6268 13326 6906 11056 2211 -9911
11614 -9911 -13754 -10548 -7128 -4797 -5912 5177 22342 31917 27926 16585 10188 -7926 -8710 -4234
11600 -4234 2705 13277 18429 17302 5537 -1953 -4216 -4785 -3180 -12265 -21878 -18657 -29045 -37138
11586c7138J1340K23J341L14J4636k378j0352n016J3096J1456L793j6936J1240
11573d381L572m289p686J265k612L095P850J348r588k210J807o526O351J7129
11559E125J2209r265j7271N678J0332J140j792L718j445n789l066l561q849p939
11545b0775l70R27r85M379Q801J3130N654O233l50n838p966l392j0319l397P186
11530g082P081O461m75j2659k658P777J1193Q552k441j4029r411k413O252M503
11516F51K326n044q150K455O585n439J005Q522N595j07J646r073k324j572O265
11501C341p650q497l552L25M757J936j900K478o157l392J3551J577K258k056j206
11486d187j3051M587J5939o246o286n316l851M482p89J432O680J4781p07L805
$$ plain form
11586 -37138 -25798 -25575 -24234 -23920 -9284 -11662 -22014 -27030 -13934 -2478 1315 -15621 -4381
11573 -4381 -809 -5098 -12784 -11519 -14131 -11036 -3186 -1838 -11426 -13636 -11829 -18355 -12004 5125
11559 5125 17334 8069 -9202 -3524 6808 7948 6156 9874 8429 2640 -426 -3987 -12836 -20775
11545 -20775 -21145 -20218 -21203 -16824 -8023 5107 10761 16994 16644 10806 2840 -552 -10871 -14268 -7082
11530 -7082 -1 6460 5985 -6674 -9332 -1555 9638 18190 15749 1720 -7691 -10104 -3852 651
11516 651 2977 -2067 -10217 -7762 -1177 -6616 -5611 2911 8506 8399 10045 972 -1352 -2924 3341
11501 3341 -4309 -12806 -16358 -16033 -11276 -9340 -11240 -8762 -14919 -18311 -4760 -3183 -925 -2981 -4187
11486 -4187 -17238 -12651 3288 -2958 -9244 -14560 -18411 -13929 -14718 -13286 -6606 8175 7468 11273
11472A1273O858o943J1495p428n858m506J321K370l068K776p8M459r091o841p257
11457a0518L239L658j119L325l245J969L262M376m130j4300n766J146J2213l169
11443i059p596J075J6052J0880q076j550P148L604p378n423q818j627M58O086
11429d224O375N568p581j0p553j2356n611J712J1128M629l995m527j3276m365
11415c4086R077m519N025J2826n305R475K061L203J0898J617j0767l682m221j2936
11401b1334p456R702O738N134J972M566L294l324K621J922o36O876j131p289J0131
11386A1786Q763j0286j1770j1342K731Q24q218L056J1252L406N258J0977J813
11373A8250j8725J16Q870P764Q61M291M622o971Q660J523j5900j4651m411P510
$$ plain form
11472 11273 18131 11188 22683 15255 9397 4891 6212 8582 5514 8290 8212 12671 3580 -3261 -10518
11457 -10518 -7279 -3621 -4740 -1415 -4660 -2691 571 4947 817 -13483 -19249 -18103 -5890 -9059
11443 -9059 -16655 -15580 472 11352 3276 1726 8874 12478 5100 -323 -9141 -10768 -10310 -4224
11429 -4224 2151 7719 138 128 -7425 -19781 -25392 -23680 -12552 -7923 -11918 -16445 -29721 -34086
11415 -34086 -25009 -29528 -24503 -11677 -16982 -7507 -5446 -2243 8655 10272 -495 -4177 -8398 -21334
11401 -21334 -28790 -19088 -12350 -7216 -5244 -678 2616 -708 1913 3835 3199 10075 8944 1655 11786
11386 11786 20549 10263 -1507 -12849 -10118 -9294 -17512 -14456 -3204 202 5460 16437 18250
11373 18250 -475 -359 8511 16275 17136 21427 26049 19078 27738 29261 13361 -1290 -5701 1809
11359A809L868N889O688K505l297n208o994K531R121k99O080l956j515r19P559
11344B3862n707n41M068m199l805p506p326p521N43j1635p882J587L444K336M949
11329a5333L548n703j561J0620K354R126n290m962M690L994n008k504K333J0591
11315F895Q010K953J1731J3388J094l424K342K688j3061p086l141j1597k344N754
11301A4202L144J048j635J330J0350p173j2004m686j0462L305P295L238o219K088
11287C821M625k386l877O984o92r527L021M486J77K51J968L047r447j2153l44
11272a0046mP179Q996j8m935K275n738j0822J574K8258L477j2676n981O408O253
11257A4200j7650j2117l004J1692J3004P334m478L315n40j0182o247Q819K081
$$ plain form
11359 1809 5677 11566 18254 20759 17462 12254 5260 7791 16912 16613 22693 18737 17222 16303 23862
11344 23862 18155 17614 21682 17483 13678 6172 -1154 -8675 -8132 -19767 -27649 -26062 -22618 -20282 -15333
11329 -15333 -11785 -17488 -19049 -8429 -6075 3051 -2239 -7201 -2511 1483 -3525 -6029 -3696 6895
11315 6895 14905 17858 29589 42977 44071 40647 42989 45677 32616 25530 22389 10792 8448 14202
11301 14202 17346 18394 16759 18089 28439 21266 9262 4576 -5886 -2581 4714 7952 1733 3821
11287 3821 8446 6060 2183 9167 8475 -1052 1969 6455 6632 6883 8851 11898 2451 -9702 -10046
11272 -10046 -10050 -2871 6125 6107 1172 3447 -2291 -13113 -11539 16719 20196 7520 1539 7947 14200
11257 14200 -3450 -15567 -18571 -6879 6125 13459 8981 12296 11756 1574 -4673 4146 6227
11244F227m795p549l954j3462J0818J2494P038N163k457k709q934Q63O771J0994
11230A6508q831j0709n644J5177L724o988k96o907M197K0273J359j7935j1064
11217g136J3871O354j7735n244M767N867J333J1505P872J938m630q134J43J347
11203A2118o6j5688J79J2252O252O933P482L212k540j0932j444L295p508l157
11189A0388P957O445N47J3422M271q733n069r976n98J5554l488J250P371R679
11175D9020L76K1977K3201K2898J7340L1644O6071R1159J52185K45252M22326
11164A143449N84946M03570r1268m74415n11579l66366k20035j38370j05950n9776
11154A64206k9318l8755l2141j7856J132q583m861m410m948l425q967j3092J4261
$$ plain form
11244 6227 1432 -6117 -10071 -23533 -12715 -221 6817 11980 9523 6814 -2120 -1257 5514 16508
11230 16508 7677 -3032 -8676 6501 10225 3237 2941 -3966 231 20504 21863 3928 -7136
11217 -7136 6735 13089 -4646 -9890 -5123 744 2077 13582 21454 23392 18762 10628 10771 12118
11203 12118 12052 -3636 -3457 8795 15047 21980 29462 32674 30134 19202 17758 21053 13545 10388
11189 10388 18345 24790 25337 38759 43030 34297 29228 19252 18654 34208 30720 31970 39341 49020
11175 49020 49396 71373 94574 117472 134812 166456 232527 323686 475871 721123 1143449
11164 1143449 1728395 2131965 2040697 1566282 1054703 688337 468302 329932 223982 164206
11154 164206 134888 96133 63992 46136 47268 38685 33824 29414 24466 21041 12074 -1018 13243
11141A3243J5749n596k200n792n155J0464M226Q739M140q657p63m663r026j523
11127A3186O865N358m018r234J073O170o176j7376k926K439N592k85m974P191
11113B885l24Q091O228O133l535j3209q198n926j2351L679J1757J21K444Mk834
11098e035j3365k860R833Q205Q945L662j6830j2723J0774J5418L592k904k468
11085D244k286k330L114R874o573q374m308p4p861k57O085L082j710P84m641J0940
11069b91k911r933n02O541R652O695o462j270q205M87R390m308q106q268k283
11054a9774N048J3172j785r36o370M626M265P133J246O584N116q445n93J0464
11040A9751R212j522N296j2166j0245P044J3749K6904M4235K0753J163l6817k8430
$$ plain form
11141 13243 28992 23396 21196 15404 10249 20713 24939 33678 37818 29161 28398 23735 14709 13186
11127 13186 20051 25409 21391 12157 13230 19400 13224 -4152 -7078 -4639 953 668 -4306 2885
11113 2885 2561 10652 16880 23013 19478 6269 -1929 -7855 -20206 -16527 -4770 -4649 -2205 -2201 -5035
11098 -5035 -18400 -21260 -11427 -3222 5723 9385 -7445 -20168 -9394 6024 9616 6712 4244
11085 4244 1958 -372 2742 12616 6043 -2331 -6639 -6713 -14574 -14831 -8746 -5664 -7374 -6590 -11231 -291
11069 -291 -3202 -13135 -13637 -7096 2556 9251 2789 1519 -6686 -6199 3191 -1117 -9223 -17491 -19774
11054 -19774 -14726 -1554 -3339 -4275 -10645 -6019 -1754 5379 6625 13209 18325 9880 9287 19751
11040 19751 28963 27441 32737 20571 10326 17370 31119 58023 102258 123011 124174 87357 58927
11027E8927j8744k3720r383o13j998j552o41J0475R555n642j2346o976q627j38
11013a1423K906j498N962l798j562K29l275L345M440R027k634j1125n455k120
10999a6981q992r664J2960J1820q127l59O599q97J6321J556P027k62l372j0771
10985c142j458j380O340N021l066j1300O789q2j2345J694N707j694N139J2131
10971H354m11j6392n786k330K519P371N260n402r3J7200L97j6114l579M648k771
10956g129M909J1947k717j0836N515Q785l114k667J0254K976n580o139j0998R305
10942D511J862M277kk581r760o696m404O066L708N72K503J907p656j0906j762
10927a8361J5367O918p31N581m250o562r404N489N606k615j152Q842r450o781
$$ plain form
11027 58927 40183 16463 7080 6467 4469 2917 2276 12751 22306 16664 4318 -2658 -11285 -11423
11013 -11423 -8517 -10015 -4053 -7851 -9413 -9184 -12459 -9114 -4674 4353 1719 -9406 -14861 -16981
10999 -16981 -25973 -35637 -22677 -10857 -18984 -19343 -12744 -13641 2680 4236 11263 11001 7629 -3142
10985 -3142 -4600 -5980 360 5381 2315 -8985 -2196 -2278 -14623 -12929 -7222 -8916 -3777 8354
10971 8354 7943 -8449 -14235 -16565 -14046 -6675 -1415 -6817 -6910 10290 10687 -5427 -9006 -4358 -7129
10956 -7129 -2220 9727 7010 -3826 1689 10474 7360 4693 14947 17923 12343 6204 -4794 4511
10942 4511 6373 10650 10648 8067 -1693 -8389 -12793 -6727 -3019 -2447 56 1963 -5693 -16599 -18361
10927 -18361 -2994 3924 3193 8774 4524 -2038 -11442 -5953 -347 -2962 -4114 4728 -4722 -11503
10913a1503L266J547k971J11m231L998J1103r173P492M928k013K414n972Q12L009
10898B817q559j1940j535l488q31O57Q54K18j724N098J2066J3205R936Q583k746
10883B2611k0743p234j784l89j2916n623N657J1107M96N97o917l223n124K006
10869b1479M775J1211q51k404O089n084P172n247m618J991J3284J434O41R364
10855A6278l337k4709q955N167K064R80j173n828N805J3773R760j0485J428j473
10841g05k996j0345k172J1721R023j588m052j0398j3100P099P317M185j7567r165
10827c2743J4830M533j2990l66O797M943q334M436J4187j155J385n447J715m433
10813a2642R183K641J09j0983n316j275K117Q993K443l3J3828J994o562J521k885
$$ plain form
10913 -11503 -8237 -6690 -9661 -9550 -13781 -9783 1320 -7853 -361 4567 2554 4968 -1004 -192 2817
10898 2817 -5742 -17682 -19217 -22705 -23536 -22879 -22025 -21807 -23531 -18433 -6367 6838 16774 25357 22611
10883 22611 1868 -5366 -7150 -7539 -20455 -26078 -20421 -9314 -8818 -8221 -15138 -18361 -23485 -21479
10869 -21479 -16704 -5493 -6344 -8748 -2659 -7743 -571 -5818 -10436 -8445 4839 6273 6914 16278
10855 16278 12941 -11768 -20723 -15556 -13492 -12512 -13685 -19513 -13708 65 9825 -660 768 -705
10841 -705 -3701 -14046 -16218 -4497 4526 2938 -1114 -11512 -24612 -17513 -10196 -6011 -23578 -32743
10827 -32743 -17913 -13380 -26370 -26736 -19939 -14996 -23330 -18894 -4707 -5862 -4477 -9924 -8209 -12642
10813 -12642 -3459 -818 -709 -11692 -17008 -18283 -16166 -7173 -4730 -4763 9065 11059 4497 6018 3133
10798C133q754j286K96Q613N348k304L284P06j4399M083K87k777p589m666K090
10783a3935J0022k048L759o783j944K444R428J4824o370j0455n3N766j438m913
10769a696o953r65o41k600N991J1857R41l022r507K461J535Q070m0q527K680M549
10753D133L145M200J9320M090L908n161r596j5826M642N437m320l540k709j0276
10739b553r398m060N502O77O633N880N544j137K0147o28r014o444l848J14J647
10724I062o124j368J009L541R883Q072j3206j4947O162N425q826n918L085P738
10710C588l016P937j391j0248m921n02L316K050K917Q360l777j3705Q220J3135
10696A1963J275m452O705l803l006n585k163k93P560J05m179K668Q198k576j0278
$$ plain form
10798 3133 -5621 -6907 -6611 2002 7350 5046 8330 9036 -5363 -1280 -993 -3770 -11359 -16025 -13935
10783 -13935 -3913 -5961 -2202 -8985 -10929 -8485 943 15767 9397 -1058 -1111 4655 3217 -1696
10769 -1696 -8649 -9614 -10255 -12855 -6864 4993 5934 2912 -6595 -4134 -2599 5471 5431 -3096 -416 4133
10753 4133 7278 11478 30798 34888 38796 33635 24039 8213 12855 18292 13972 10432 7723 -2553
10739 -2553 -11951 -16011 -10509 -9832 -3199 2681 8225 7088 27235 26607 17593 11149 7301 7415 9062
10724 9062 2938 1570 2579 6120 16003 24075 10869 -4078 2084 7509 -1317 -7235 -4150 3588
10710 3588 572 8509 7118 -3130 -8051 -8553 -5237 -3187 -270 8090 4313 -9392 -1172 11963
10696 11963 13238 8786 15491 11688 8682 3097 934 641 8201 8306 4127 6795 14993 12417 2139
10681B139m466l413p003j252J0881l594j280l375L710o748L421Q764k16J4066
10667A1634O133j2189N330M448p773L076M551n611O85J020m944L221k047k858
10653D676J542M838L987p711n867j2907l732J2438L056K435J2083K083n58q880
10639G483k2400K45J1571J554K915M542K086p800j31m189l934J2168J2180l491
10625A2799m338L325P121M660j4503l898P449n78n92o394j0799L264Q64N56L24
10610g40l18M416J166R553P965o403k3206r879o68R202M117j3235J19N219N691
10595g001p363J0669m457m504N208P526M147l480j452o213q008m749R957J4755
10581E035J3077N65r615K340l292P090j247m31j5811p012O735N984M013j467j736
$$ plain form
10681 2139 -2327 -5740 -12743 -13995 -3114 -6708 -7988 -11363 -7653 -14401 -10980 -2216 -2432 11634
10667 11634 17767 5578 10908 15356 7583 10659 15210 9599 10284 11304 6360 9581 7534 4676
10653 4676 6218 11056 15043 7332 1465 -11442 -15174 -2736 320 2755 14838 16921 16363 7483
10639 7483 -14917 -14672 -3101 -1547 1368 5910 7996 196 65 -4124 -8058 4110 16290 12799
10625 12799 8461 11786 18907 23567 9064 5166 12615 12037 11445 5051 -5748 -2484 -1620 -1064 -740
10610 -740 -1058 3358 4524 14077 22042 15639 -7567 -17446 -18114 -8912 -4795 -18030 -17911 -12692 -7001
10595 -7001 -14364 -3695 -8152 -12656 -7448 78 4225 745 -707 -6920 -14928 -19677 -9720 5035
10581 5035 18112 18677 9062 11402 8110 15200 13953 13522 -2289 -9301 -2566 3418 7431 5964 4228
10566D228O264R742N399o729p980p216J714M40P120K88j0766L734L392n429L017
10551G218p26j1880P951P983o025j3339J25K69n35K936M416j834r976o168R578
10536a0007R634k573p358l763J1639O337q9M604k684p874j1376n024l67M538J7512
10521C149J052N850o17q034J0840J5556r754j1215k235n449M767J0875L279m68
10507A7596m677l00J894L413k64j891L201j2203m26N728k583J3814L014j4611
10493A1705j0568k014r93K495P951j3286J197m050l998J668P719l325j6724r935
10479c2158O76J4583J2329L72k116q445j048l112L166m685j3925N31J6829L711
10465a3292L9L537r047R693J0340l554l530M293R792K361p326p586q464J487R371
$$ plain form
10566 4228 10492 20234 25633 18904 10924 3708 5422 5862 12982 13270 2504 6238 9630 4201 7218
10551 7218 6492 -5388 2563 10546 4521 -8818 -8693 -8424 -8959 -6023 -1607 -3441 -13417 -19585 -10007
10536 -10007 -373 -2946 -10304 -14067 -2428 3909 3820 8424 5740 -2134 -13510 -18534 -18901 -14363 3149
10521 3149 4201 10051 9434 1400 12240 27796 18042 6827 4592 -857 3910 14785 18064 17596
10507 17596 12919 12619 14513 17926 17662 15771 18972 6769 6343 12071 9488 23302 26316 11705
10493 11705 1137 -877 -1870 625 8576 -4710 -3513 -7563 -11561 -9893 -2174 -5499 -22223 -32158
10479 -32158 -31482 -16899 -4570 -4198 -6314 -14759 -15807 -18919 -15753 -20438 -34363 -33832 -17003 -13292
10465 -13292 -13253 -9716 -18763 -9070 1270 -2284 -5814 -1521 8271 10632 3306 -4280 -12744 -11257 -1886
10450a886r353p181N074J1144P935j3063l718K604p01p103k071P411R8L750N922
10435a138p917J919K495p894P866q427p85N690Q14Q957J2865r860j0357O837n738
10420d673j4128N261j316K319k50J5302L856M107K036l146m690K671r49O170O64
10405A3234k0002n248k132k33J4123N669l223k1496j7769R027J4292J0734J2226
10392I202m809r809k959P61L12j866K299J808Q254m955o002j817k246l238K721
10377a2344N560J6491N315o640r314j4654p446M216M157L196Q688M402L502j932
10363C197K405j0012n719P596R098o734O59J175o841n265N561n031J2654N973
10349H716m834q269j569K4J351P871J0146R028q861p334L129n872P840M165P564
$$ plain form
10450 -1886 -11239 -18420 -13346 -2202 5733 -7330 -11048 -8444 -9145 -16248 -18319 -10908 -10810 -7060 -1138
10435 -1138 -9055 -7136 -4641 -12535 -4669 -13096 -13881 -8191 -7377 1580 14445 4585 -5772 1065 -4673
10420 -4673 -18801 -13540 -14856 -12537 -12787 2515 6371 10478 12514 9368 4678 7349 6400 12570 13234
10405 13234 -6768 -12016 -14148 -14381 -258 5411 2188 -19308 -37077 -28050 -13758 -3024 9202
10392 9202 4393 -5416 -8375 -7614 -7302 -9168 -6869 -5061 3193 -1762 -7764 -9581 -11827 -15065 -12344
10377 -12344 -6784 9707 15022 8382 -932 -15586 -23032 -18816 -14659 -11463 -2775 1627 5129 3197
10363 3197 5602 -4410 -10129 -2533 6565 -169 490 1665 -5176 -10441 -4880 -9911 2743 8716
10349 8716 3882 -4387 -5956 -5932 -4581 3290 13436 22464 13603 6269 9398 3526 11366 15531 23095
10334B3095r807q320j561n942J549k602P63M896k805o65j056j525K716Q059K86
10319G081k250n990p131O791P365K688r21j2799j0088j203K596M734n687K101
10305a2713L622j202N360Q912q649j313J738n52k41Q5K011R798Q418m598j1323
10290f47n99N286P033J945q205j0095j188o36L493N031j473j208K056K076P061
10275I930M180K104J056p833j3080p431j798L681P127l347K516j429P783P725
10261A1184N699O131j506p986K865m577m375K957j0299O347n677p48L812K494
10247F321j6450m100J4868M609p892P97P782n068K395J1670l158j531r582n150
10233d489o84l372K030J3350Q617r739O012m389R82j439l801k74N433J1823R993
$$ plain form
10334 23095 13288 4968 3407 -2535 -986 -3588 -2825 2071 -734 -1399 -2455 -3980 -1264 6795 7081
10319 7081 4831 -1159 -8290 -1499 5866 8554 7633 -5166 -15254 -16457 -13861 -9127 -14814 -12713
10305 -12713 -9091 -10293 -4933 3979 -4670 -5983 -4245 -4797 -5038 -4953 -2942 6856 15274 10676 -647
10290 -647 -1246 4040 11073 13018 4813 -5282 -6470 -7106 -3613 1418 -55 -1263 793 2869 9930
10275 9930 14110 16214 17270 9437 -3643 -11074 -12872 -9191 -2064 -5411 -2895 -4324 3459 11184
10261 11184 16883 23014 21508 13522 16387 11810 7435 10392 93 6440 763 15 3827 6321
10247 6321 -10129 -14229 639 5248 -2644 -1847 5935 867 3262 14932 11774 10243 661 -4489
10233 -4489 -5173 -8545 -6515 6835 15452 5713 11725 7336 8318 6879 3078 2804 8237 20060 30053
10218C0053O660k001j0687k653j0821j5622j4193Q734J4469l342k091p562M663
10205d393l818n858o493N527M824J6432O010j1168k59L690K617M523P046j404
10191A7276K25l056n123n706k76k529k279L253p20J5808N563p98j0454j3988l043
10176e847J3991k82P59o784l80J1135L442M796o43k98O008J655q554o922j1536
10161E40q181q68R000r570o872P287P667k018L045K007j563o906K583J502n697
10146h044m570J990K537J3908K336q342n86M576K151N246m739M577j1046k394
10132b400J4235n116r410K26j419N686q012r285M762O04K388j296n515o782R141
10117a2193J6281m912N094J500N373r698K188R216j199n184P249K907o079m827
$$ plain form
10218 30053 36713 34712 24025 21372 10551 -5071 -19264 -10530 3939 597 -1494 -9056 -4393
10205 -4393 -8211 -14069 -20562 -15035 -10211 6221 12231 1063 804 4494 7111 11634 18680 17276
10191 17276 17501 14445 9322 3616 3340 811 -1468 1785 1065 16873 22436 21638 11184 -2804 -5847
10176 -5847 8144 7862 8621 1837 1457 12592 16034 20830 20187 19889 25897 27552 18998 12076 540
10161 540 -7641 -8509 491 -9079 -15951 -8664 -997 -3015 30 2037 474 -6432 -3849 -2347 -8044
10146 -8044 -12614 -10624 -8087 5821 8157 -185 -771 3805 5956 11202 6463 11040 -6 -2400
10132 -2400 11835 6719 -2691 -2465 -3884 1802 -6210 -15495 -10733 -10129 -7741 -9037 -14552 -21334 -12193
10117 -12193 4088 -824 4270 5770 11143 1445 3633 12849 11650 6466 13715 16622 10543 5716
10103E716j899l706l028j464L288j122J683O023M835j3869j824k598M629J951
10089a385P11m231K523K127K820m612L635J1134O63j4364j23J1901j547K450J724
10074A3426p629n193L32j8677n527Q754L738J083K598n782L32kO633J864q731
10059a2781p20Q685k798p669J1111R829m490J222l739J980o435J600K195j838
10045c848m85O019j276k014l827p087M729K1772L826p762K398n874M413R633M703
10030B5320n33n310L848r186r493k983n191J098Q87J178j3557J683j878P34J1196
10015b187J5369O300N889k029j767J593r479l66L262r805p102o812J4158P583
10001A4607r030j4547J322k606Q741J0840l249o590L66K604K256O183L991n961
$$ plain form
10103 5716 3817 111 -2917 -4381 -1093 -2215 -532 5491 10326 -3543 -5367 -7965 -3336 -1385
10089 -1385 -674 -4905 -2382 -255 2565 -2047 1588 12722 13385 -979 -1102 10799 9252 11702 13426
10074 13426 5797 604 936 -17741 -23268 -14514 -10776 -9693 -7095 -12877 -12545 -12547 -5914 -4050 -12781
10059 -12781 -13501 -4816 -7614 -15283 -4172 5657 1167 2389 -1350 630 -5805 -4205 -2010 -3848
10045 -3848 -4333 1686 410 -1604 -5431 -12518 -7789 13983 17809 10047 12445 6571 10984 20617 25320
10030 25320 24787 19477 23325 14139 4646 1663 -3528 -2430 -1543 -365 -13922 -12239 -14117 -13383 -2187
10015 -2187 13182 19482 25371 23342 21575 23168 13689 13323 16585 6780 -322 -7134 7024 14607
10001 14607 5577 -8970 -7648 -10254 -1513 9327 6078 -512 -146 2458 4714 10897 14888 8927
9987H927L052N753j1336k211r080j0275O229J0050k599p13j360K217o500M732
9973c114J579o009k878p047j933J538J1880J0430J1694J1074j4844K570K798q271
9959I467j6932M035q84l520j310r323L4J4107J9531Q773o695k314K764M583k133
9944B0183K417l901l048n474o924r57k512M521Q10l586N017Q893q259q875m972
9929f667l679M029k184K628M199P071j0112l859L90O176Q346m062M911O879P134
9914B1200j0712o765N339l40P586m993l923n214l93K080R75L469p077L605k82
9899D555j4646L36J2463K713L339k872m125M037N998k100J5288M585n470k134
9885B1967J722P453L39M473J774o844p714n735j2717l983Q273l4L43Q833L020
$$ plain form
9987 8927 11979 17732 6396 4185 -4895 -15170 -8941 1109 -1490 -2203 -3563 -1346 -7846 -3114
9973 -3114 -1535 -7544 -10422 -17469 -19402 -17864 -5984 4446 16140 27214 12370 14940 17738 9467
9959 9467 -7465 -3430 -4314 -7834 -9144 -18467 -18433 -4326 15205 23978 17283 14969 17733 22316 20183
9944 20183 22600 18699 15651 10177 3253 2296 -216 4305 5115 1529 6546 15439 7180 -1695 -6667
9929 -6667 -10346 -6317 -8501 -5873 -1674 5397 -4715 -8574 -8184 -2008 6338 2276 7187 14066 21200
9914 21200 10488 3723 9062 8722 16308 11315 7392 2178 1785 3865 4840 8309 1232 4837 4555
9899 4555 -10091 -9755 2708 5421 8760 5888 1763 5800 11798 9698 24986 29571 24101 21967
9885 21967 23689 31142 31481 35954 37728 30884 23170 17435 4718 735 9008 8974 9317 18150 21170
9870B1170o196o368q517k724O912O420J6217N876p169l440j2019J576j028r782
9856I28j5434J016J1322J9710L321m726q64l381O721J1158K1730L1985L2765K2716
9842A38967R03k6102k7015k6990j9575j9939J974L000q862j1795n484L969L80
9829C431M231J1480N514p627j1464j2271K681J2561R877L665J911m371j0495L622
9815A2745J5172j169k095p261j0005J766m798m442q65P053m598r360J0603P540
9801A0286m374l987m655k382m046k12O055J3076m056L39L736l589Q927N838j3704
9786G252p344k24n623j958O743l301N317Q716M91m919j1079l460J3283Q773L317
9771A5984K529L937p464p61m053k932O146q478o050O367O528R77m60J207K853
$$ plain form
9870 21170 14974 8606 89 -2635 4277 10697 26914 32790 25621 22181 10162 11738 10710 928
9856 928 -14506 -13490 -2168 17542 20863 16137 15273 11892 18613 29771 51501 83486 116251 138967
9842 138967 139870 113768 86753 59763 40188 20249 22223 25223 16361 4566 -918 3051 3431
9829 3431 7662 19142 24656 17029 5565 -6706 -4025 8536 18413 22078 23989 19618 9123 12745
9815 12745 27917 26748 24653 17392 7387 9153 4355 -87 -952 6101 1503 -7857 2746 10286
9801 10286 5912 1925 -2730 -5112 -9158 -9370 -3315 9761 5705 6044 9780 6191 15118 20956 7252
9786 7252 -92 -316 -5939 -7897 -1154 -4455 862 9578 10069 5150 -5929 -9389 3894 12667 15984
9771 15984 18513 22450 14986 14225 10172 7240 13386 4908 -1142 5225 11753 12730 12270 13477 16330
9756A6330J5096N633J351o690O329k704j2035j4524j5471K236J5057R733K71j1958
9742H654o177l473J808M968l287n726l282o309Q933R480N681P597q618R94Q613
9727A9856K096q637p161K179l118N111J839p940n906M053m199n748L050Q183P13
9712D371j3821J319N711K832Q218M89o016K520N413j156L720k624m346k233L520
9697G917P563p090p507p927j207J5130L923p928o938p826M543L135R869O549q306
9682C900k701o073N098L901J0891O924M555r12N140N292p277j6829Q4l785Q763
9667A6971k520K78Q691K023Q591k373j0892l026n796L010m840j4295m639O160
9653b657K552n278J626J4576k416N854L77l257R43J2668j4476m621L573R229j032
$$ plain form
9756 16330 31426 37059 38410 31720 38049 35345 23310 8786 -6685 -4449 10608 20341 20612 8654
9742 8654 2477 -996 812 5780 2493 -3233 -6515 -12824 -3891 5589 11270 18867 10249 11243 19856
9727 19856 21952 13315 6154 8333 5215 10326 12165 4225 -1681 2372 -1827 -7575 -4525 3658 4371
9712 4371 -9450 -8131 -2420 412 8630 9119 3103 5623 11036 9880 13600 10976 6630 4397 7917
9697 7917 15480 8390 883 -7044 -8251 6879 10802 2874 -4064 -11890 -7347 -4212 5657 12206 3900
9682 3900 1199 -4874 224 4125 15016 21940 26495 25583 30723 36015 28738 11909 11993 8208 16971
9667 16971 14451 14729 23420 25443 34034 31661 20769 17743 11947 14957 10117 -4178 -8817 -2657
9653 -2657 -105 -5383 -3757 10819 8403 14257 14634 11377 12320 24988 10512 5891 9464 18693 17661
9638A7661j7113K956M325N457r230M847Q626j924j0197l832O144k587M239L38
9624I710l091n624k947J1265P239j0342K149M520l866N077k904K790q59n943n141
9609B033J530j636J3305O258N162j0502j0748K805K527M302k084o030M163P424
9595A8509J823p062n601J474J203m770M243q87l987j216m012k867k245l825P798
9580a422J971m301L415O132J732P823J5354j793j1597O74p747J781p31m515k275
9565D501m233J0307J5190m417p274m370j70O76J0885k802K866M053l125k060j239
9550A8788Q497m069J626O96J256N617l70q660L6R325J144p665j560k93r831n070
9534I467r270K106q243K146J0670K962m730L753K443r298n911J1420L323k852
$$ plain form
9638 17661 548 3504 7829 13286 4056 8903 17529 15605 5408 1576 7720 5133 9372 9710
9624 9710 6619 995 -1952 9313 16552 6210 8359 12879 9013 14090 11186 13976 13117 7174 2033
9609 2033 3563 1927 15232 21490 26652 16150 5402 8207 10734 15036 12952 6922 11085 18509
9595 18509 20332 13270 7669 9143 10346 5576 9819 8932 4945 3729 -283 -3150 -5395 -9220 -1422
9580 -1422 549 -3752 -337 5795 7527 15350 30704 28911 17314 17988 10241 12022 11291 6776 4501
9565 4501 268 10575 25765 21348 14074 9704 9534 10210 21095 18293 21159 25212 22087 20027 18788
9550 18788 27285 23216 24842 25538 26794 32411 32041 23381 23417 32742 33886 26221 24661 24368 14537 9467
9534 9467 197 2303 -5940 -3794 6876 9838 5108 8861 11304 2006 -3905 7515 10838 7986
9520G986j3845j241J9955K0989k916q519M117j833J761R61L47L21J554r398l438
9505A6801K906q845j2930M070J202R611J0928q85L26O563J925k461N748q784j6299
9490I876q725O413P72l42J2378L08N635J069m985O91j0583j387R132J957l27J3148
9474C5030j40n290N023K110J84k893n561J340N10r974k905r862l615R443R167
9459B2567J2427L229k868k294k635K73k745K5j817l7k821M385m259j3863n432
9444D135l183M871J0966J1955P955M589L841R753l382M250K4830K5462M9949P5954
9430B31945Q5406O4762Q739m8359o8832o4306o8577l1076r477j8244j1674o279
9418F4028l071q287j766k955k727n037r870j070P979N216k368l444m894j73O658
$$ plain form
9520 7986 -5859 -7100 12855 33844 30928 22409 26526 24693 26454 27415 27762 28083 29637 20239 16801
9505 16801 19707 10862 -2068 2002 3204 12815 23743 22858 23184 29747 31672 29211 34959 26175 9876
9490 9876 1151 7564 8336 7994 20372 20680 26315 27384 22399 23090 12507 11120 20252 22209 21882 35030
9474 35030 34890 29600 34623 36733 36917 34024 28463 29803 30313 20339 17434 7572 3957 13400 22567
9459 22567 34994 38223 35355 33061 30426 30699 27954 27979 26162 26125 23304 27689 23430 9567 4135
9444 4135 952 5823 16789 28744 36699 41288 45129 54882 51500 55750 80580 106042 155991 231945
9430 231945 317351 382113 390852 342493 273661 209355 140778 109702 100225 81981 70307 64028
9418 64028 60957 52670 50904 47949 45222 40185 30315 29245 37224 42440 40072 36628 31734 31561 38219
9403C8219J20o263r037p522J7172J2458O557J4043R682j0106p39Q681N594K4913
9389A03772N0620M8213P4975J10413J79917J93838O2050r3103j84124j58155j17312
9378B71104q2245m8793k4690j4982j6712n163j6014j0497m578q743Q1o129M78
9365C3117M758j151o256n921R853l53j6987p114N821J9630K3187L1672L1817L832
9351A25905n377j0228p412o481O378K398Q8K2148K3500K7472N1494P0964P2571
9338C73420K9700l5483p7267q2339n4556l9515l2046j5928o676q356l794R965
9326E7125j986j9480j618L4p29j5334o879n207M023K880l605O646K986J642J4730
9311C5228K8240M6582P3431N2337P284j6151k6203l1389l1471q957j2877o719
$$ plain form
9403 38219 38339 32076 23039 15517 32689 45147 51704 65747 75429 65323 64584 73265 78859 103772
9389 103772 154392 202605 277580 387993 567910 761748 823798 730695 546571 388416 271104
9378 271104 188859 140066 115376 100394 83682 78519 62505 52008 47430 38687 38768 32639 33117
9365 33117 37875 36724 30468 24547 34400 34047 17060 9946 15767 35397 58584 90256 122073 125905
9351 125905 120528 110300 102888 96407 102785 105183 105271 127419 150919 178391 229885 300849 373420
9338 373420 403120 367637 290370 208031 153475 113960 81914 65986 59310 50954 47160 57125
9326 57125 55139 35659 34041 34075 33346 18012 11133 5926 9949 12829 9224 15870 18856 20498 35228
9311 35228 63468 110050 183481 235818 243102 226951 200748 169359 137888 128931 116054 109335
9299A09335q23R741n316j0409k2862j8014N653M624j536M600M117L834P448K3525
9285A13917J0718L541o654J3713M839J0480p248j4410j0301o121Q061K8552K4242
9272A73329J6683K2996K6903J7964K3777N2180O6790Q2938J18751J76503K35852
9261A014666L49610N54628R58894J771022K920569K728957K30733k208537k825397
9252E495145k011500j209108p20220m37125k73120j82167j29919r6700o5029l1613
9242C38644k5407k7402k8059j9834j0857k95q781j5011k2236k0366j8851j9582
9230A21963j1900J5727L208o837Q610J0663j2143j8344j2902q437q665j0030o828
9217F4085j0989J298J1733Q782k069K49R159q294m474j379L760K573p002Q945
$$ plain form
9299 109335 108512 118253 112937 102528 79666 61652 67305 71929 70393 74993 79110 82944 90392 113917
9285 113917 124635 128176 121522 135235 140074 150554 143306 128896 118595 112474 120535 149087 173329
9272 173329 190012 213008 239911 257875 281652 333832 400622 483560 602311 778814 1014666
9261 1014666 1364276 1918904 2877798 4648820 7569389 10298346 10529079 8320542 5495145
9252 5495145 3483645 2274537 1554317 1117192 844072 661905 531986 435286 370257 338644
9242 338644 313237 285835 257776 237942 227085 226790 218009 202998 180762 160396 141545 121963
9230 121963 110063 125790 128998 122161 130771 141434 129291 110947 98045 89608 80943 70913 64085
9217 64085 53096 54394 66127 74909 72840 73089 82248 73954 69480 68101 71861 74434 67432 76377
9203G6377M536q490j0057P695O138K353k109J5887J1950P358J1738N474j0721
9190A18129j3293j0320k104K624N951q499j753p400O22j869J395q368k676N715
9176G8154J370N41l822J1891j434k327l406m708o511K28J4084R719q327l090M353
9161H6715q724o666K455J0094R807P579O689R698J0926o402m026L801M522J3548
9147A40016K755m179j0902r957J097N709L45m444j5933p894r830q209M315r57
9133H1932P695P567k567j163n848P46J0531J3224J6426Q943P376Q588k649m426
9119A46375n450L615K89m856j5211K89M501J1822K0768J6538J2853J0394r916
9106A92011o026J2627K713K173q755j93L04P27o650J6322J1746n119q441k256
$$ plain form
9203 76377 80913 72423 62366 70061 76199 78552 76443 92330 104280 111638 123376 128850 118129
9190 118129 104836 94516 92412 95036 100987 92488 90735 83335 83957 82088 83483 75115 72439 78154
9176 78154 79524 80065 76243 88134 86700 84373 80967 76259 69748 69976 84060 93779 85452 82362 86715
9161 86715 77991 71325 73780 83874 93681 101260 107949 117647 128573 122171 118145 121946 126468 140016
9147 140016 142771 138592 127690 117733 118830 124539 124884 120440 104507 96613 86783 78574 82889 81932
9133 81932 89627 97194 94627 93464 87616 88362 98893 112117 128543 137486 144862 153450 150801 146375
9119 146375 140925 144540 144829 139973 124762 125051 129552 141374 162142 178680 191533 201927 192011
9106 192011 185985 198612 201325 203498 194743 194550 194854 195581 188931 205253 216999 211880 203439 201183
9092B01183o065J633J0134O319M434J0995Q567J2453J0001o465o585L516O004
9079B56124N237L209J8017J5783J3891O681P618K5889K1268R950J2481J7269Q253
9066D21670J4031J7268J5956J6302K3523J1786K1890K5215L9792O1234N8588N5179
9054G82434N2575M5677M7767N4119J07654J07243J05103J44935J96643K57986
9044A902136L47533M45376M62220L64588K76823L32589N51228R12074J433956
9035G028523K189519L378267N342882Q688908J3919817J8896646J5505671J267166
9027G6217399j3013832j7887029j4473121r630266o107707l880077k527166j727800
9019F970401j251425r11985o31115m21650k75734k06997j94818j81228j35588
$$ plain form
9092 201183 195118 196751 206885 213204 217638 228633 237200 249653 259654 253189 246604 250120 256124
9079 256124 261361 264570 282587 298370 312261 318942 326560 352449 373717 383667 396148 413417 421670
9066 421670 435701 452969 468925 485227 508750 520536 542426 567641 607433 668667 727255 782434
9054 782434 835009 880686 928453 982572 1090226 1197469 1302572 1447507 1644150 1902136
9044 1902136 2249669 2695045 3157265 3521853 3798676 4131265 4682493 5594567 7028523
9035 7028523 9218042 12596309 17939191 26628099 40547916 59444562 74950233 76217399
9027 76217399 63203567 45316538 30843417 21213151 15105444 11225367 8698201 6970401
9019 6970401 5718976 4806991 4175876 3754226 3478492 3271495 3076677 2895449 2759861
9010B759861j03677q1155n5553k7604K5960P6269J07346J47890K24672L38315
9000C412324M55079O12769Q13955Q75086O90950N03104N53585R20119J565850
8991A0402821K526464L889177N978872R475113J5583286K5976074L8539858L5642938
8983A48014603P093078k4520659l7179610l0715568k0371136j2804933q063885
8976B1451890n226671l561874k557725j876527j332268r01568n99221m20252l98879
8967D576905m57721m45014l73097k80118k21581j82687j32513p3980m8232k9247
8957B332715L1287J16300J97736K65411L41905L80361L35075K63692K73030M26930
8947D964442P16119J159751J805042K774796M321997O961438J1300309J6761666
$$ plain form
9010 2759861 2656184 2575029 2519476 2491872 2517832 2594101 2701447 2849337 3074009 3412324
9000 3412324 3867403 4480172 5294127 6169213 6860163 7363267 7916852 8836971 10402821
8991 10402821 12929285 16818462 22797334 32272447 47855733 73831807 112371665 148014603
8983 148014603 155107681 130587022 93407412 62691844 42320708 29515775 21451890
8976 21451890 16225219 12663345 10105620 8229093 6896825 5995257 5396036 4975784 4576905
8967 4576905 4119184 3674170 3301073 3020955 2799374 2616687 2484174 2410194 2361962 2332715
8957 2332715 2364002 2480302 2678038 2943449 3285354 3665715 4000790 4264482 4537512 4964442
8947 4964442 5680561 6840312 8645354 11420150 15742147 22703585 34003894 50765560
8939E0765560J7424449O662168q572789j7030700j5786996j0917121o933658m372601
8931A1238312k833668j913233j350862r93617p09112m95159l27502k25282k11118
8922B178759k46688k58289k26663j81610j54723j29221j08107q5017o9311n2222
8912F66908n0742m5309j7471j5620o612k3402k1688k1717k4949j6180j9973k9259
8900C73986j2486k0807j6169o342o77k640o021k0728k8371j2063j0334O387j0051
8887B33684r128J84j9288j0431L375k806r893j1618K862J1378l224j667j7322
8874A66106j6383j0267j2034j241j0409p234p769k319J0668j065o140Q251O118
8861A16282O522M746n928N81K7577J376k0354p331j7879k2709l108J2488J6880
$$ plain form
8939 50765560 68190009 74852177 66279388 49248688 33461692 22544571 15610913 11238312
8931 11238312 8404644 6491411 5140549 4146932 3437820 2942661 2615159 2389877 2178759
8922 2178759 1932071 1673782 1447119 1265509 1110786 981565 873458 788441 719130 666908
8912 666908 616166 570857 553386 537766 531154 507752 486064 464347 439398 423218 403245 373986
8900 373986 361500 340693 324524 318182 317505 314865 308844 288116 259745 247682 237348 243735 233684
8887 233684 224556 224740 205452 195021 198396 195590 185697 174079 176941 188319 185095 183428 166106
8874 166106 149723 139456 127422 126181 115772 108538 100769 98450 109118 108053 101913 110164 116282
8861 116282 122804 127550 121622 122203 149780 151156 130802 123471 105592 82883 79775 92263 109143
8848A09143l480r044P020O481j1535j3395j2524q384M680Q32n927N398J0470K617
8834H2352m153J937J1195K114j4840j3432k840n024r021j1057N502Q827o442j5500
8820B9618K726J848J079n539l683O370k245N823J9186P098J820N305j1664j0610
8806D7132R285O670q264j1350K837K325r645N305k099o834j3504r019J164R233
8792B3236P916p005J0776N619q259q456N140k761j79j0483j3987j689K127M96
8778B491M282O097M677p386N99L405R17J0862j5554n724R993O565R542q176L863
8763B6453j369k059j659q322r071J429R730M800L448L237J870m557L461J4688
8749D2079j0081l98K207p363p016n159j831M449K01o807O359j050P130k018l884
$$ plain form
8848 109143 105663 96619 103639 110120 98585 85190 72666 64282 68962 69794 63867 69265 79735 82352
8834 82352 78199 80136 91331 93445 78605 65173 62333 57309 48288 37231 42733 51560 45118 29618
8820 29618 32344 34192 35271 29732 26049 32419 30174 35997 55183 62281 64101 69406 57742 47132
8806 47132 56417 63087 54823 43473 46310 48635 38990 44295 42196 35362 21858 12839 14003 23236
8792 23236 31152 24147 34923 40542 32283 23827 28967 26206 26027 15544 1557 -132 1995 2491
8778 2491 6773 12870 17547 10161 10760 14165 15082 25944 10390 4666 14659 21224 30766 22590 26453
8763 26453 25084 23025 21366 13044 3973 5402 15132 19932 23380 26617 28487 23930 27391 42079
8749 42079 31998 31600 33807 26444 19428 14269 12438 16887 17088 10281 16640 15590 22720 20702 16818
8734A6818O913N249m005J127k459k297K341K04K005j5433K059L719O096Q472J3515
8719D4324M79q453j5790p162j6233r927K777k301O33m43p585j6650l236k5865
8705f5432k1336P534K7700L1968J7308J4431K4410l716j3492j801L433j4399L985
8692A0593J0359p914M002M198R301l529M189K78r256K089N544J855O40m622K361
8677C0088J1211p331K680J8462J0424j880k7314k7843j1000q996q420l174p617
8664c0710j8838k0163j9977l1813k5465J6967M8628M9247L8931L0728J5077N841
8652E8453P150m963o434L306J1434R529j1880m722J2041J4077L637r729J910J3999
8638I7808n220r304j3666j3256j63l006P581O593J6598J9563J9240L6715N2109
$$ plain form
8734 16818 23731 28980 24975 26102 23643 21346 23687 23891 25896 10463 12522 16241 22337 30809 44324
8719 44324 44803 36350 20560 13398 -2835 -12762 -9985 -12286 -11653 -12096 -19681 -36331 -39567 -65432
8705 -65432 -86768 -79234 -51534 -19566 -2258 12173 36583 32867 19375 17574 21007 6608 10593
8692 10593 20952 13038 17040 21238 30539 27010 31199 31477 22221 24310 29854 31709 32349 27727 30088
8677 30088 41299 33968 36648 55110 65534 63654 36340 8497 -2503 -11499 -19919 -23093 -30710
8664 -30710 -49548 -69711 -89688 -121501 -146966 -129999 -81371 -32124 6807 37535 52612 58453
8652 58453 65603 60640 54206 57512 68946 78475 66595 61873 73914 87991 91628 81899 83809 97808
8638 97808 92588 83284 69618 56362 56199 53193 60774 67367 83965 103528 122768 159483 211592
8625B11592P7272Q2811M4153l9373q3795q8860p3934n3351l5604j9619k3301j946
8613c955J4869K3201K6716K4251J0815L225n497M559J0553J0101J7484K2494K1038
8600A79854J7867L0486L7340J3788j135k020j7783j8106j2725m978K26j0944j9396
8587A92474p691K96Q671L252K4833M4089J19126J68900J96209J03498n6151j61631
8575F35875j79394j32207q9195n3316k9432k0495j6149k3189n949l941j772O43
8563H1479j5849j6817r83J3930J1097J0371j1141o751Q90p993P924J3599N268
8550H5024J135j6191k3879j2663K451N578J0613M855J1300R587J718O074J0126
8537I5728L3502N2208O9086Q3188O3308o864o7489q5836p1941n3885l5166k0575
$$ plain form
8625 211592 288864 371675 415828 376455 292660 203800 129866 76515 40911 21292 -2009 -3955
8613 -3955 10914 34115 60831 85082 95897 99122 93625 98184 108737 118838 136322 158816 179854
8600 179854 197721 228207 265547 279335 278200 276180 258397 240291 227566 222588 222814 211870 192474
8587 192474 184783 185079 193750 197002 221835 265924 385050 553950 750159 853657 797506 635875
8575 635875 456481 324274 235079 181763 152331 131836 115687 92498 86549 82608 80836 81479
8563 81479 65630 48813 47830 61760 72857 83228 72087 65336 66226 58233 66157 79756 85024
8550 85024 86159 69968 46089 33426 35877 41455 52068 56923 68223 77810 79528 85602 95728
8537 95728 129230 181438 250524 333712 397020 390156 322667 236831 164890 111005 75839 55264
8525E5264j1041q278O811Q824o939j1299r426n316m851n165l818R99J6019O810
8511B8594m792j0349L750M747M865M06q42j0793M24M278M684J598j3995l127N08
8496I956M600L434Q571M511n056k792n386n568O809L91n545m704q204P254l669
8481D602o49K069M662j348K841L114j411p552L52p35n899o660J603M176M716M213
8465H094P106L639O743O149l852k0023m597l079N367j4091k259J0551l653J568
8451b337m632K267J8346M444j80j0947m365M77K982l919Q154N991L194o669k984
8436I822M861O958k837m687j7915j044J129K687J3564k28L442O613q933q434P416
8421A2414N062o865L759j709M306L619p087m909P59k622m581j0291J532J1943
$$ plain form
8525 55264 44223 35945 42756 51580 44641 33342 23916 18600 13749 8584 4766 5765 21784 28594
8511 28594 23802 13453 17203 21950 26815 27221 26379 15586 16010 20288 24972 26570 12575 9448 9956
8496 9956 14556 17990 26561 31072 26016 23224 17838 12270 19079 19470 13925 9221 1017 8271 4602
8481 4602 3953 6022 10684 9336 12177 15291 13880 6328 6680 5945 46 -6614 -5011 -835 3881 8094
8465 8094 15200 18839 25582 31731 27879 7856 3259 180 5547 -8544 -10803 -252 -3905 -2337
8451 -2337 -6969 -4702 13644 18088 17908 6961 2596 3073 6055 2136 10290 16281 19475 12806 9822
8436 9822 14683 21641 18804 14117 -3798 -4842 -3713 -1026 12538 12310 15752 22365 13432 4998 12414
8421 12414 17476 10611 14370 12661 16967 20586 13499 8590 9349 6727 2146 -8145 -6613 5330
8407E330K805j027R458l536m203n972M227P459m223L840Q993o779j0365k3440
8393a7433j4188M636L131J8713J0347p81J426n66n745k866N822Q879l152j3013
8379d790k504Q53j849K276p03J6566J2796j701k834M760P468r963o372Q075J435
8364B3513k3319L94J4278M133j1211j6441q868l06J1986Q497M891j73j285J45
8350F234J625J0467k002n956n860Q134J324M565j871j1580r900l889l629k239
8336a4577p84J1768J3623j1916l011J0067L455n894M688J802o801k864p502l925
8322a1871N120R778N131Q462Q285k995L519k393m763m861m872j5347k190O952
8308b045P996J897k119l7p156p884J3133J799o175k39P357N287L703j376K297
$$ plain form
8407 5330 8135 7108 16566 13030 8827 2855 7082 14541 10318 14158 23151 16372 6007 -17433
8393 -17433 -31621 -26985 -23854 -5141 5206 4425 5851 5285 -460 -3326 2496 11375 8223 -4790
8379 -4790 -7294 -6441 -8290 -6014 -6717 9849 22645 20944 18110 22870 30338 20375 14003 22078 23513
8364 23513 194 588 14866 18999 7788 -8653 -17521 -17827 -5841 2656 7547 7374 6089 6234
8350 6234 7859 18326 16324 10368 4508 12642 13966 18531 16660 5080 -4820 -8709 -12338 -14577
8336 -14577 -15361 -3593 10030 -1886 -4897 5170 8625 2731 7419 9221 2420 -444 -7946 -11871
8322 -11871 -6751 3027 8158 16620 24905 21910 25429 23036 18273 13412 8540 -6807 -8997 -2045
8308 -2045 5951 7848 5729 5692 -1464 -9348 3785 5584 -591 -830 6527 11814 15517 14141 16438
8293A6438K615p051j3771o593Q734r52L230q456j0005J553R302k862M137P397
8279C716n051j17K488L042K120o918J208Q892r510n626K674R951Q964q115j204
8264F514l472J1508P057K98M983r057o555k046o295j178J0234j52l115l273j4286
8249h835m707R045Q080M123j0156j572J1723J696q71P74r717p211R509j339M956
8234E498J0697l296j0005j1774J5385M223O750J0963j2721j2416j577J1257J5612
8221B8596k719j2456j2520q953M730l543p647N233n823j556k628P745P397J774
8207b370p475j3754J393J4969P810L725M511J967n051p06j0229r770J9876J5865
8193B0761r066r601j2261N735o361j230J2436Q512J4030R821L349j5837j6065
$$ plain form
8293 16438 19053 12002 -1769 -8362 372 -580 2650 -5806 -15811 -14258 -4956 -7818 -3681 3716
8279 3716 -1335 -1452 1036 4078 6198 -720 488 9380 -130 -5756 -3082 6869 15833 7718 6514
8264 6514 3042 14550 21607 21905 26888 17831 11276 9230 2935 1757 11991 11839 8724 5451 -8835
8249 -8835 -13542 -4497 3583 7706 -2450 -4022 7701 9397 8526 9300 -417 -7628 1881 542 5498
8234 5498 16195 12899 2894 -8880 6505 10728 17478 28441 15720 3304 1727 12984 28596
8221 28596 25877 13421 901 -8052 -3322 -6865 -14512 -9279 -15102 -16658 -19286 -11541 -4144 -2370
8207 -2370 -9845 -23599 -22206 -7237 573 4298 8809 10776 5725 5019 -5210 -14980 4896 20761
8193 20761 11695 2094 -10167 -4432 -10793 -12023 413 8925 22955 32776 36125 20288 4223
8180D223q553j1638P54j169J0816J7700R38n280M781o719K74P48l133r767p45
8165f770J0954O231q272J496p676q168l466J0793M433J640R40m081K320n281L153
8150a754N637r948J643k993Q427J5661Q818l877j1597o705O074k134K252n412
8136D092l035K402r428J812J1689j2192L917N719L740R121n025j843Q809k312
8122A7466j2488m544j964L421k69J502Q21r495J120K745p685l982L344N812J3171
8107H975l915j1220o28k413j149N577J4176J140J971q703r75J6184L78J144M414
8092B4956r855j1882o696L366Q116L76n599j584J3842R778j4968N346J6183j6515
8078A4864j2890l707K994J3247J277j2099n026l259Q85N84J1398J5050O903r443
$$ plain form
8180 4223 -4330 -15968 -15214 -16383 -5567 12133 13071 7791 12572 5853 6127 6875 3742 -6025 -6770
8165 -6770 4184 10415 2143 3639 -4037 -12205 -15671 -4878 -445 1195 2135 -1946 374 -4907 -1754
8150 -1754 3883 -6065 -4422 -7415 1012 16673 25491 21614 10017 3312 9386 7252 9504 4092
8136 4092 1057 3459 -5969 -4157 7532 -4660 -743 4976 8716 17837 12812 10969 19778 17466
8122 17466 4978 434 -1530 1891 1622 3124 3945 -5550 -4430 -1685 -9370 -13352 -10008 -4196 8975
8107 8975 5060 -6160 -6788 -9201 -10350 -4773 9403 10543 12514 3811 2836 19020 19398 20542 24956
8092 24956 15101 3219 -3477 -111 8005 8381 2782 1198 15040 24818 9850 15196 31379 14864
8078 14864 1974 -1733 1261 14508 15785 3686 -1340 -4599 -3714 -3130 8268 23318 30221 20778
8064B0778j6336J2200O742j2777l764j307j0193k0216J678R223O449Q636J2675
8051A3788O869J2851J0505j0104j5610o820M555J759n508O832K10K541k115n948
8037A3805J106L016J653L54j385L47n102r273N376K0505N521M355o615p712P103
8022C3054k128j031j0386l704J0248P266r183m149o296M220O587k145N867j986
8008B6234P084M036J0026o354J769n621J0110J1811l21Q783N846k94J107j2558
7994F1658j4645n7M957l134O196n009j3895m163j768q894k0229j540J6228J7837
7980C3542n315p145N674K383r693j0126L527J1197L887R719M822L202o872q273
7966C0529J046L722K614K13K00J0969k176J181j856j205N870L425m41J2280P390
$$ plain form
8064 20778 4442 16642 23384 10607 6843 5536 -4657 -24873 -23195 -13972 -7523 1113 13788
8051 13788 20657 33508 44013 33909 18299 11479 16034 17793 12285 19117 19327 21868 19753 13805
8037 13805 14911 17927 19580 19934 18549 18896 13794 4521 9897 30402 35923 40278 33663 25951 33054
8022 33054 30926 29895 19509 15805 26053 33319 24136 19987 13691 17911 24498 22353 28220 26234
8008 26234 33318 37354 47380 41026 42795 37174 47284 59095 58774 67557 73403 73109 74216 61658
7994 61658 47013 46956 51913 48779 54975 49966 36071 31908 30140 21246 1017 -523 15705 33542
7980 33542 28227 21082 26756 29139 19446 9320 12847 24044 27931 37650 42472 45674 38802 30529
7966 30529 31575 35297 37911 38124 38324 49293 47117 48298 46442 45237 51107 54532 54091 66371 73761
7951G3761j1055l871o506r933m417m251m359J1172m673j4354j3428M991j53j734
7937A1190j70J574m12r877l693K8194J0795j3250k1214q304N494Q485J499J4776
7923B5087O302p485r553J3713R946J414q16j119j038j581m649l42L375o97N984
7908C8541r646j8678j2466L967M43Q750n74O535n181j365N520m081P53k217M469
7893A4770l370J08j2238p723J3052j599M546L479j2624r937O813J748K039J5167
7879A4231J5286j6224j3603j384j267Q407L036l49R979m792o489l51q741j5724
7865a7985m808K750Q369P746J343m893J2390L965p807J316N560n71M721J0276
7851B2372J16j63k2563j3585p012O884j472o074O077J9672Q046M647N133l375
$$ plain form
7951 73761 62706 58835 52329 42396 37979 33728 29369 40541 35868 21514 8086 13077 12924 11190
7937 11190 11020 12594 12182 2305 -1388 26806 37601 24351 3137 -5167 327 8812 10311 25087
7923 25087 31389 23904 14351 28064 38010 39424 38608 37489 36451 34870 30221 29879 33254 32557 38541
7908 38541 28895 10217 -2249 1718 2161 10911 10337 16872 11691 10326 15846 11765 12518 10301 14770
7893 14770 11400 11508 -730 -8453 4599 3000 7546 11025 -1599 -11536 -4723 -2975 -936 14231
7879 14231 29517 13293 -310 -1694 -2961 5446 8482 8133 18112 13320 6831 6480 -2261 -17985
7865 -17985 -22793 -20043 -11674 -3928 -2585 -7478 4912 8877 1070 2386 7946 7375 12096 22372
7851 22372 22488 22325 -238 -13823 -20835 -13951 -15423 -21497 -15420 4252 12298 16945 22078 18703
7837A8703j7055j934P27j760M412R22M143O070m236j4447j1128J0389Q356n2l469
7822c59m046K716Q686k190l932j907o543n309k225J323L577O498r38Q128Q182
7807A1661N492O88j6254k986r16p243P435Q609m443j528J930N556M84r460o581
7792g556L869M922Q575M435o944P140q8o880n287J638m6k310l352O906o587r867
7776a1432O070P79j731R99P148m531j90o831N65N40Q390L369O323O902J933J477
7760A9780O433j0543K035L367j0808q126m171l604q020n473m785N523J7902J2774
7746A2284P03j0949o06m082K200n72k15m400k613J0059j183j0192O83M184O88
7731d011j47k233K21J3181P965L095j5583p649l175l65p54J704N554L334l024
$$ plain form
7837 18703 1648 -286 441 -1319 3093 4015 8158 14228 9992 -4455 -15583 -5194 3162 3110 -359
7822 -359 -4405 -1689 6997 4807 875 -1032 -7575 -12884 -15109 -13786 -10209 -3711 -4649 3479 11661
7807 11661 17153 17841 1587 -1399 -2315 -9558 -2123 6486 2043 515 2445 8001 8485 -975 -7556
7792 -7556 -3687 1235 9810 14245 7301 14441 14353 7473 2186 3824 3778 1468 -1884 5022 -1565 -11432
7776 -11432 -5362 -4583 -6314 -5315 1833 -2698 -2888 -9719 -9154 -8614 -224 3145 9468 16370 18303 19780
7760 19780 26213 15670 17705 21072 10264 2138 -2033 -5637 -13657 -19130 -23915 -18392 -490 12284
7746 12284 12987 2038 1432 -2650 -450 -1022 -1237 -5637 -8250 1809 626 -9566 -8883 -4699 -4011
7731 -4011 -4158 -6391 -6170 7011 14976 18071 2488 -5161 -8336 -8701 -9455 -7751 -2197 1137 -1887
7716a887p108L41P442R359P528n040j1484J2775K185q934N80m572j7034N366M273
7701f210k554O154J224N956M782l717k391m605M535J3268M615r254K048n3m97
7686A3301n639M608L521J379j268K981r685k5937r042J7079L107o097O967N082
7672C57j6255P244M630P52K590K362M687j2477l744P702o185M428m454q959K569
7657a4753J0481J0087M7n929o810K623j150Q648k050o959l895J2108M264r6p694
7642a078r537N156m488P945J0966k66j3770l739k841K630j464J045J0547r397
7628h291p059O714K567R210l343j0563j0650L645o42M539J1270j588j1020j99
7614a5410m154O680N269N014l467k493J20o23k083q950L058J8074m831l683k839
$$ plain form
7716 -1887 -8995 -8654 -1212 8147 15675 10635 -849 11926 14111 5177 5757 1185 -15849 -10483 -6210
7701 -6210 -8764 -2610 -1386 4570 9352 5635 3244 -1361 3174 16442 21057 11803 13851 13798 13301
7686 13301 7662 12270 15791 17170 15902 18883 9198 -16739 -25781 -8702 -5595 -11692 -4725 357
7672 357 -15898 -8654 -4024 -3272 -682 1680 6367 -6110 -9854 -2152 -8337 -3909 -8363 -17322 -14753
7657 -14753 -4272 5815 5862 -67 -6877 -4254 -5404 3244 1194 -5765 -9660 2448 6712 6616 -1078
7642 -1078 -10615 -5459 -9947 -2002 8964 8698 -5072 -8811 -11652 -9022 -10486 -9441 1106 -8291
7628 -8291 -15350 -8636 -6069 3141 -202 -10765 -21415 -17770 -18412 -13873 -2603 -4191 -15211 -15410
7614 -15410 -19564 -12884 -7615 -2601 -6068 -8561 -8441 -9064 -11147 -20097 -17039 1035 -3796 -7479 -10318
7599a0318M04K289P395J2754l307j1766k900M656k201o416M522L54O835J1799
7585A4100p012j1466J404R429R42j3445m642K744J053k802M50P441R057N300k0850
7570h297j2664M873J1744O042N921p45p184j2296O751J1356j304r218O241O339
7556G559q77p044J661m392j456J374m960o889N887K156k383N369J0893N692p321
7541E269o656J1401N432M998j0993m867j5773O321J1489J850k242n988p731J253
7527f237k466L26k974M38j552L398p17l386P092M665j160L290j793p863j0159
7512a9098N489L15J786N474l016j2499J255M758L886J4729J3215q444m189p858
7498d197l432K656K837j0073m712J2786Q978p572n939J1552O530N8j310p718j1272
$$ plain form
7599 -10318 -9914 -7625 -230 12524 9217 -2549 -5449 -793 -2994 -9410 -4888 -4534 2301 14100
7585 14100 7088 -4378 -2974 6455 7397 -6048 -10690 -7946 -6893 -9695 -9245 -1804 7253 12553 -8297
7570 -8297 -20961 -16088 -4344 1698 7619 6874 -310 -12606 -5855 5501 4197 -5021 1220 7559
7556 7559 6682 -362 1299 -3093 -4549 -3175 -8135 -15024 -9137 -6981 -9364 -3995 6898 12590 5269
7541 5269 -1387 10014 15446 20444 9451 4584 -11189 -4868 6621 8471 6229 241 -7490 -6237
7527 -6237 -8703 -8377 -11351 -10913 -12465 -9067 -9784 -13170 -6078 -1413 -2573 717 -1076 -8939 -19098
7512 -19098 -13609 -13294 -11508 -6034 -9050 -21549 -20294 -15536 -11650 3079 16294 7850 3661 -4197
7498 -4197 -7629 -4973 -2136 -12209 -16921 -4135 4843 -2729 -8668 2884 9414 9472 8162 444 -10828
7483a0828o438L442J7161Q11J828o07q614R16O83L52j0731l668P609N870q35N759
7467B710q866j0544Q273N056K177L270l494m65p114r61Q694R461j201q266j309
7452b579l356l56j00N22J1711l840k518P389K819n245l741n848J048j404J0837
7437E339Q771l021j1520n50J156O15O249j2078r96J1925J0735p732m887k713j2426
7422a1133N170m592J541J385l656M481j82o438k876J0186O816j0004KP040J698
7407e62o900o400o636Q331J6043P713m2j646r521j3439M813p861k27Q170K433
7392e731K496M609K218l991M639J768N004P777p759j1360j868j17j982k361J471
7377e187J86J1641N503K671p849r605M200J3245q403l954k032o42J679l930j807
$$ plain form
7483 -10828 -17266 -13824 3337 4148 5976 5369 -3245 -2329 -1646 -1294 -12025 -15693 -8084 -2214 -3049 2710
7467 2710 -6156 -16700 -8427 -3371 -1194 2076 -1418 -1883 -8997 -9958 -1264 8197 6996 -1270 -2579
7452 -2579 -5935 -6291 -6391 -5869 5842 2002 -516 6873 9692 4447 706 -5142 -4094 -5498 5339
7437 5339 14110 11089 -431 -981 175 790 7039 -5039 -6035 5890 16625 8893 4006 1293 -11133
7422 -11133 -5963 -10555 -9014 -7629 -11285 -6804 -6986 -13424 -16300 -6114 702 -9302 -9300 -2260 -562
7407 -562 -7462 -13862 -20498 -12167 3876 11589 11547 9901 380 -13059 -8246 -16107 -16334 -8164 -5731
7392 -5731 -3235 1374 3592 -399 4240 6008 11012 18789 11030 -330 -2198 -2315 -4297 -6658 -5187
7377 -5187 -5001 6640 12143 14814 6965 -2640 1560 14805 6402 2448 416 -226 1453 -2477 -4284
7362d284J1544R15j0198n409O582J773K00j512m102r657o852N821J2758j5709
7348a8130K292K670l136K280N439m279P5j672k034J1037J4087n156p653q796M212
7333h764J2258L555p447K521k17m163M031P675O513p494o021N818N327R533k041
7318B1084p211l457J442m027j929J538r512j0665l454J2003L316J078n756k008
7304g558M169K898q759L563J2960k690j2877k804O511j261J959L708j127Q804
$$ plain form
7362 -4284 7260 8175 -2023 -7432 -850 923 1123 -389 -4491 -14148 -21000 -15179 -2421 -18130
7348 -18130 -15838 -13168 -16304 -14024 -8585 -12864 -12789 -14461 -16495 -5458 8629 3473 -4180 -12976 -8764
7333 -8764 3494 7049 -398 2123 1906 -2257 1774 9449 15962 8468 2447 8265 13592 23125 21084
7318 21084 13873 10416 11858 7831 5902 7440 -2072 -12737 -16191 -4188 -872 206 -5550 -7558
7304 -7558 -3389 -491 -9250 -5687 7273 4583 -8294 -11098 -4587 -5848 -3889 -181 -1308 7496
$$ [...]
##END NTUPLES=NMR SPECTRUM
##END=
