##TITLE=Analysis number 312215
Compound Code cc 45209
Book Reference 440/54
Project Code adrs
Chemist Name craigr
##JCAMPDX= 6.0         $$ Bruker NMR JCAMP-DX V2.0
##DATA TYPE= NMR SPECTRUM
##DATA CLASS= NTUPLES
##ORIGIN= Bruker BioSpin GmbH
##OWNER= NMR
$$ XWIN-NMR		Version 3.5
$$ Thu Jul 28 13:55:12 2005 GMT Daylight Time (UT+1h)  MAYBRIDGE\NMR@NMR_250MHZ
##.OBSERVE FREQUENCY= 250.131544655141
##.OBSERVE NUCLEUS= ^1H
##.ACQUISITION MODE= SIMULTANEOUS (DQD)
##.ACQUISITION SCHEME= undefined
##.AVERAGES= 16
##.DIGITISER RES= 18
##SPECTROMETER/DATA SYSTEM= dpx250
##.PULSE SEQUENCE= zg30
##.SOLVENT NAME= CDCl3
##.SHIFT REFERENCE= (INTERNAL, CDCl3, 0, 16.522)
##AUDIT TRAIL= $$ (NUMBER, WHEN, WHO, WHERE, WHAT)
$$ ##TITLE= Audit trail, XWIN-NMR		Version 3.5
$$ ##JCAMPDX= 5.01
$$ ##ORIGIN= Bruker BioSpin GmbH
$$ ##OWNER= NMR
$$ C:\u/data/dgb/nmr/ADRS/6780/pdata/1/auditp.txt
$$ ##AUDIT TRAIL=  $$ (NUMBER, WHEN, WHO, WHERE, WHAT)
(   1,<2005-07-28 13:54:53.00 +100>,<MAYBRIDGE\NMR>,<NMR_250MHZ>,
      <created by zg, POWCHK disabled, PULCHK disabled
       configuration hash MD5:
       62 19 C7 07 E1 42 D1 B7 37 6C 3D D0 77 39 F9 E6
       data hash MD5: 64K
       BE 42 D7 8C 40 C8 B3 8A BF A2 B2 74 25 0F 61 4C>)
(   2,<2005-07-28 13:55:03.56 +100>,<MAYBRIDGE\NMR>,<NMR_250MHZ>,
      <Start of raw data processing
       ef LB = 0.3 FT_mod = 6 PKNL = 1 SI = 32K 
       data hash MD5: 32K
       B2 B1 10 43 E2 79 03 81 72 A8 86 24 0F BF 5A D9>)
(   3,<2005-07-28 13:55:05.62 +100>,<MAYBRIDGE\NMR>,<NMR_250MHZ>,
      <apk 
       data hash MD5: 32K
       17 14 E1 10 8C EC 41 50 B4 8F 2E 31 F2 63 8D 0C>)
(   4,<2005-07-28 13:55:06.31 +100>,<MAYBRIDGE\NMR>,<NMR_250MHZ>,
      <abs ABSG = 5 
       data hash MD5: 32K
       6A FF 0D 26 24 76 50 92 E6 46 4E 33 73 2A 7C 7D>)
$$ ##END=
$$ 
$$ hash MD5
$$ 5A 68 A0 6F 4F 2D 0B D3 A4 CA 78 82 52 8A 2D EB
##$RELAX= 
##$RELAX= 
##$RELAX= 
##$RELAX= 
##$RELAX= 
##$RELAX= 
##$RELAX= 
$$ Bruker specific parameters
$$ --------------------------
##$DU= <C:\u>
##$EXPNO= 6780
##$NAME= <ADRS>
##$PROCNO= 1
##$TYPE= <nmr>
##$USER= <dgb>
##$AMP= (0..31)
100 100 100 100 100 100 100 100 100 100 100 100 100 100 100 100 100 100 
100 100 100 100 100 100 100 100 100 100 100 100 100 100 
##$AQSEQ= 0
##$AQ_mod= 3
##$AUNM= <au_zg>
##$AUTOPOS= <1 >
##$BF1= 250.13
##$BF2= 250.13
##$BF3= 250.13
##$BF4= 250.13
##$BF5= 500.13
##$BF6= 500.13
##$BF7= 500.13
##$BF8= 500.13
##$BYTORDA= 1
##$CFDGTYP= 0
##$CFRGTYP= 5
##$CHEMSTR= <none>
##$CNST= (0..31)
1 1 145 1 1 1 1 1 1 1 1 1 1 1 1 1 1 1 1 1 1 1 1 1 1 1 1 1 1 1 1 1 
##$CPDPRG= <>
##$CPDPRG1= <>
##$CPDPRG2= <>
##$CPDPRG3= <>
##$CPDPRG4= <mlev>
##$CPDPRG5= <mlev>
##$CPDPRG6= <mlev>
##$CPDPRG7= <mlev>
##$CPDPRG8= <mlev>
##$CPDPRGB= <>
##$CPDPRGT= <>
##$D= (0..31)
0 1 0 0 0 0 0 0 0 0.06 0 0 0 0 0 0 0.0002 0 0 0 0 0 0 0 0 0 0 0 0 0 0 
0 
##$DATE= 1122555291
##$DBL= (0..7)
120 120 120 120 120 120 120 120 
##$DBP= (0..7)
150 150 150 150 150 150 150 150 
##$DBP07= 0
##$DBPNAM0= <>
##$DBPNAM1= <>
$$ [...]
##$SUBNAM7= <"">
##$SUBNAM8= <"">
##$SUBNAM9= <"">
##$SW= 20.6930455092707
##$SWIBOX= (0..15)
0 0 3 0 0 0 0 0 0 0 0 0 0 0 0 0 
##$SW_h= 5175.983436853
##$TD= 65536
##$TD0= 1
##$TE= 295.16
##$TE2= 300
##$TE3= 300
##$TEG= 300
##$TL= (0..7)
0 120 120 120 120 120 120 120 
##$TP= (0..7)
150 150 150 150 150 150 150 150 
##$TP07= 0
##$TPNAME0= <>
##$TPNAME1= <>
##$TPNAME2= <>
##$TPNAME3= <>
##$TPNAME4= <>
##$TPNAME5= <>
##$TPNAME6= <>
##$TPNAME7= <>
##$TPOAL= (0..7)
0.5 0.5 0.5 0.5 0.5 0.5 0.5 0.5 
##$TPOFFS= (0..7)
0 0 0 0 0 0 0 0 
##$TUNHIN= 0
##$TUNHOUT= 0
##$TUNXOUT= 0
##$USERA1= <user>
##$USERA2= <user>
##$USERA3= <user>
##$USERA4= <user>
##$USERA5= <user>
##$V9= 5
##$VALIST= <valist>
##$VCLIST= <CCCCCCCCCCCCCCC>
##$VD= 0
##$VDLIST= <DDDDDDDDDDDDDDD>
##$VPLIST= <PPPPPPPPPPPPPPP>
##$VTLIST= <TTTTTTTTTTTTTTT>
##$WBST= 1024
##$WBSW= 4
##$XGAIN= (0..3)
0 0 0 0 
##$XL= 0
##$YL= 0
##$YMAX_a= 492253
##$YMIN_a= -757551
##$ZGOPTNS= <>
##$ZL1= 120
##$ZL2= 120
##$ZL3= 120
##$ZL4= 120
##$ABSF1= 16.522
##$ABSF2= -4.171173
##$ABSG= 5
##$ABSL= 3
##$ALPHA= 0
##$AQORDER= 0
##$ASSFAC= 0
##$ASSFACI= 0
##$ASSFACX= 0
##$ASSWID= 0
##$AUNMP= <proc_1d>
##$AZFE= 0.1
##$AZFW= 0.1
##$BCFW= 0
##$BC_mod= 0
##$BYTORDP= 0
##$COROFFS= 0
##$CY= 12.5
##$DATMOD= 1
##$DC= 0
##$DFILT= <>
##$DTYPP= 0
##$F1P= 14.0000005364418
##$F2P= -0.99999901652339
##$FCOR= 0.5
##$FTSIZE= 32768
##$FT_mod= 6
##$GAMMA= 0
##$GB= 0
##$INTBC= 1
##$INTSCL= 1
##$ISEN= 128
##$LB= 0.3
##$LEV0= 0
##$LPBIN= 0
##$MAXI= 10000
##$MC2= 0
##$MEAN= 0
##$ME_mod= 0
##$MI= 0
##$NCOEF= 0
##$NC_proc= -4
##$NLEV= 6
##$NOISF1= 0
##$NOISF2= 0
##$NSP= 0
##$NTH_PI= 0
##$NZP= 0
##$OFFSET= 16.522
##$PC= 1
##$PHC0= -81.28825
##$PHC1= 5.359483
##$PH_mod= 1
##$PKNL= yes
##$PPARMOD= 0
##$PSCAL= 4
##$PSIGN= 0
##$REVERSE= no
##$SF= 250.13
##$SI= 32768
##$SIGF1= 0
##$SIGF2= 0
##$SINO= 400
##$SIOLD= 32768
##$SREGLST= <1H.CDCl3>
##$SSB= 0
##$STSI= 32768
##$STSR= 0
##$SW_p= 5175.98343685301
##$SYMM= 0
##$S_DEV= 0
##$TDeff= 65536
##$TDoff= 0
##$TI= <Analysis number 999999
Compound Code 99
Book Reference 9
Project Code 9>
##$TILT= no
##$TM1= 0
##$TM2= 0
##$TOPLEV= 0
##$USERP1= <user>
##$USERP2= <user>
##$USERP3= <user>
##$USERP4= <user>
##$USERP5= <user>
##$WDW= 1
##$XDIM= 32768
##$YMAX_p= 401065559
##$YMIN_p= -101413
$$ End of Bruker specific parameters
$$ ---------------------------------
##NTUPLES= NMR SPECTRUM
##VAR_NAME=  FREQUENCY,     SPECTRUM/REAL,   SPECTRUM/IMAG
##SYMBOL=    X,             R,               I
##VAR_TYPE=  INDEPENDENT,   DEPENDENT,       DEPENDENT
##VAR_FORM=  AFFN,          ASDF,            ASDF
##VAR_DIM=   32768,         32768,           32768
##UNITS=     HZ,            ARBITRARY UNITS, ARBITRARY UNITS
##FACTOR=    0.157963299565203, 1,           1
##FIRST=     4132.6476996994, 0,             0
##LAST=      -1043.33573715361, 0,           0
##MIN=       -1043.33573715361, -101413,     0
##MAX=       4132.6476996994, 401065559,     0
$$ Real data points
##PAGE= N=1
##DATA TABLE= (X++(R..R)), XYDATA
$$ [...]
19667C7212j6713j8632j5283j8274o692J8012K4557n681j3129K717K0101J9442
$$ 37212 20499 1867 -13416 -31690 -38382 -20370 4187 -1494 -14623 -11906 8195 27637
19655B7637j7173l358o525j1877L5020L327q568j3213r937J8041j7585m1498R864
$$ 27637 10464 7106 581 -11296 23724 27051 18483 5270 -4667 13374 -4211 -45709 -35845
19642c5845J8004L943P920O298O842l562j0385o581J3806J0817j398l5217N567
$$ -35845 -17841 -13898 -5978 320 7162 3600 -6785 -13366 440 11257 9859 -25358 -19791
19629a9791K5068j2770O460k5401J878L671Q902n418k1468O72L8111j5k0628Q336
$$ -19791 5277 -7493 -1033 -26434 -24556 -20885 -11983 -17401 -38869 -38197 -86 -101 -20729 -12393
19615a2393j455l4579j0113l991n135J2609Q75p606r101M306J9364L648o202j693
$$ -12393 -13848 -48427 -58540 -62531 -67666 -55057 -54182 -61788 -70889 -66583 -47219 -43571 -49773 -51466
19601e1466J5111J6545r642o576k011k6556j6782K7457j024K1470L2037q198j3726
$$ -51466 -36355 -19810 -29452 -36028 -38039 -64595 -81377 -53920 -54944 -33474 -1437 -9635 -23361
19588b3361J0032l6912J1444K1451j3618j3552j5910o377L8022K1352j4856K0231
$$ -23361 -13329 -50241 -38797 -17346 -30964 -44516 -60426 -66803 -28781 -7429 -22285 -2054
19576b054J5731J7413K0407j2453q734j0324j5202J7768K4611j1426j3988j5260
$$ -2054 13677 31090 51497 39044 30310 19986 4784 22552 47163 35737 21749 6489
19564F489M804O203L01l1188k1064K1749P354j0985J5487K5349L695m5344p618
$$ 6489 11293 17496 17797 -13391 -34455 -12706 -5352 -16337 -850 24499 28194 -17150 -24768
19551b4768j7643Q056q90N964j8600r087K443J4772R827K6884N892P731o110k7540
$$ -24768 -42411 -34355 -35245 -29281 -47881 -56968 -54525 -39753 -29926 -3042 2850 10581 4471 -23069
19537b3069k0441K2814P085M751J0513n156j7287J8671q02k7763j1923M923K2494
$$ -23069 -43510 -20696 -13611 -8860 1653 -3503 -20790 -2119 -2921 -30684 -42607 -37684 -15190
19524a5190K6037N118O201m269n751j7162k9159O219q330J1285K0096Q794j0491
$$ -15190 10847 15965 22166 17897 12146 -5016 -34175 -27956 -36286 -25001 -4905 3889 -6602
19511f602J8012r582k4516q361m974J8430M344q421j2023j1435j4188P099J0805
$$ -6602 11410 1828 -22688 -31049 -36023 -17593 -13249 -21670 -33693 -45128 -59316 -52217 -41412
19498d1412j3951L186J7614N091j3099Q191j4920p489K7900j2497j2854K085r582
$$ -41412 -55363 -52177 -34563 -29472 -42571 -34380 -49300 -56789 -28889 -41386 -54240 -52155 -61737
19485f1737R121K4103j6242J0985P205P61K826J6920M024O194o208j4203q454
$$ -61737 -52616 -28513 -44755 -33770 -26565 -25804 -22978 -6058 -2034 4160 -2048 -16251 -24705
19472b4705N128j419J9962J8263r526L754j45k6369n935K9110m285l9765r587
$$ -24705 -19577 -20996 -1034 17229 7703 11457 11312 -15057 -20992 8118 3833 -35932 -45519
19459d5519J9735L0031k0701L133M864j8509K143o90J0138J5400j3501k316r174
$$ -45519 -25784 4247 -16454 -13321 -8457 -26966 -24823 -25513 -15375 25 -13476 -15792 -24966
19446b4966K2313J1679Q16j8135j4543m5952J0049K5518q647m489n000O824L2591
$$ -24966 -2653 9026 9842 -8293 -22836 -68788 -58739 -33221 -41868 -46357 -51357 -44533 -11942
19433a1942J4839P156j7264k6988m153q173O869K6458K075k128J4349R555p446
$$ -11942 2897 10053 -7211 -34199 -38352 -46525 -39656 -13198 -11123 -13251 1098 10653 3207
19420C207n08l1580J8332K2411j1536j7114L758j113Q032J509J423K657Q168l0640
$$ 3207 2699 -28881 -10549 11862 326 -16788 -13030 -14143 -6111 -4602 -3179 -522 7646 -22994
19406b2994k846Q413K9665n98k7202q9J7106J1418j3711j7353Q285J4128%k4600
$$ -22994 -25840 -17427 12238 11640 -15562 -15651 1455 12873 -838 -18191 -9906 4222 4222 -20378
19392b0378L474L0445n010m505p861l9460p762K9857K308j1968q022P137J6952
$$ -20378 -16904 13541 8531 4026 -3835 -43295 -51057 -21200 -18892 -30860 -38882 -31745 -14793
19379a4793P503p704K589O058j3324m768M2044K4043j8639k4564m201j4945l5234
$$ -14793 -7290 -14994 -12405 -6347 -19671 -24439 17605 41648 23009 -1555 -5756 -20701 -55935
19366e5935j1770n722k145J7236K0628j239J2145L965j1700K8955K2851N963j5817
$$ -55935 -67705 -73427 -75572 -58336 -37708 -38947 -26802 -22837 -34537 -5582 17269 23232 7415
19353G415k8266l380L1456J9394j4588k3089J711k2593j6075O329p240j091J786
$$ 7415 -20851 -24231 7225 26619 12031 -11058 -9347 -31940 -48015 -41686 -48926 -50017 -48231
19340d8231L765m937O178J1934J9401j8450r736K9901j321N345J3876r479j5402
$$ -48231 -44466 -49403 -43225 -31291 -11890 -30340 -40076 -10175 -11496 -6151 7725 -1754 -17156
19327a7156N600N786J0780k0373K037j0185N502l710j7134Q198R258k2678p328
$$ -17156 -11556 -5770 5010 -15363 -13326 -23511 -18009 -21719 -38853 -30655 -21397 -44075 -51403
19314e1403r083K7030j5k1505j690l890J2787L3213J0426J6621q06j3146q073
$$ -51403 -60486 -33456 -33471 -54976 -56666 -60556 -47769 -14556 -4130 12491 11685 -1461 -9534
19301i534K5307O35l2860j6060O204q530k4491o935L2811J3170k5732K027k580
$$ -9534 15773 16408 -16452 -32512 -26308 -34838 -59329 -66264 -33453 -20283 -46015 -43988 -46568
19288d6568M352J7346L494n997k0774r523J8230L0030J3347N200j5814j938K443
$$ -46568 -42216 -24870 -21376 -27373 -48147 -57670 -39440 -9410 3937 9137 -6677 -8615 -6172
19275f172K4840M709N593R338m554J5820j5706k6662j2145K353J854J8718j8058
$$ -6172 18668 23377 28970 38308 33754 49574 33868 7206 -4939 -2586 -732 17986 -72
19262g2j6713R582j1403k1281L509J7846K002j0944j7392J4447j1920l891J5650
$$ -72 -16785 -7203 -18606 -39887 -36378 -18532 -16530 -27474 -44866 -30419 -42339 -46230 -30580
19249c0580L4457L931j8624j5518j6612k3357N862L1799J0622j731J3678j2001
$$ -30580 3877 7808 -10816 -26334 -42946 -66303 -60441 -28642 -18020 -19751 -6073 -18074
19237a8074J0584o846j7476j0487l901K1333L744J4096Q549j2165J362k1745J4885
$$ -18074 -7490 -14336 -31812 -42299 -46200 -24867 -21123 -7027 1522 -10643 -9281 -31026 -16141
19224a6141M721J5644J4255l1763k2088p35m452K2928J1974p36k075q280K6034
$$ -16141 -11420 4224 18479 -13284 -35372 -36107 -40559 -17631 -5657 -6393 -8468 -16748 9286
19211I286L803j1600j9112q587j059J9650J2338m649o376k7347p139K4620J4156
$$ 9286 13089 1489 -17623 -26210 -27269 -7619 4719 70 -6306 -33653 -40792 -16172 -2016
19198b016p151n192k6646n800k677R912K288J4461L151k5816j4427K2574N799
$$ -2016 -9167 -14359 -41005 -46805 -49482 -39570 -37282 -22821 -19670 -45486 -59913 -37339 -31540
19185c1540K1919K2135J1953J4863k6690m0442R280m562k0764q321j7147L4191
$$ -31540 -9621 12514 24467 39330 12640 -27802 -18522 -23084 -43848 -52169 -69316 -35125
19173c5125K7068L145J1310j2183m324k410P818J2261L789r099j1281j767j0118
$$ -35125 -8057 -4912 6398 -5785 -10109 -12519 -4701 7560 11349 2250 -9031 -10798 -20916
19160b0916m09Q886J4272K2322p316r754K736k0283J0258L991r975J264O745J1965
$$ -20916 -21325 -12439 1833 24155 16839 7085 9821 -10462 -204 3787 -6188 -4924 1821 13786
19146A3786k0351M213j483J9012K9985m4331j5183M227n200k4860J8084J7805
$$ 13786 -6565 -2352 -3835 15177 45162 831 -14352 -10125 -15325 -40185 -22101 -4296
19134d296q613q84J1457R49o842k5719l086R637Q85j6110J3700m491j6513m867
$$ -4296 -12909 -13793 -2336 -1387 -8229 -33948 -37034 -27397 -26512 -42622 -28922 -33413 -49926 -54793
19120e4793J1693J7564K995o312l9448q950L3585J2462J8020L0961j9041l6282
$$ -54793 -43100 -25536 -22541 -28853 -68301 -77251 -43666 -31204 -13184 17777 -1264 -37546
19108c7546k3463k851q324M2272J7338j5339j145K825j0521J7822J3645J6184
$$ -37546 -61009 -63860 -72184 -29912 -12574 -27913 -29058 -26233 -36754 -18932 -5287 10897
19096A0897O556K553l630K1137K0987m116j0919R487J796j7870J9594l394M001
$$ 10897 17453 20006 16376 37513 58500 54384 43465 52952 54748 36878 56472 53078 57079
19083E7079K5637M887j6887J3657N0620L6431Q6316N7752P0583P7973Q7439J02420
$$ 57079 82716 87603 70716 84373 134993 171424 257740 315492 386075 464048 551487 653907
19071F53907J33507J53842J38796J15009R5977Q7986J41988J28313J12006R3227
$$ 653907 787414 941256 1080052 1195061 1291038 1379024 1521012 1649325 1761331 1854558
19061A854558J24281J81290K09724J91468J14293L7820J3285L1403k7389q7946
$$ 1854558 1978839 2160129 2369853 2561321 2675614 2713434 2726719 2758122 2730733 2642787
19051B642787j51589j42542r5802p3276p0457j35791j31937j05323p5917r2423
$$ 2642787 2491198 2348656 2252854 2179578 2109121 1973330 1841393 1736070 1660153 1567730
19041A567730j65087k19812j88337j70576j43932j06393j55000q5728k5536o0333
$$ 1567730 1402643 1182831 994494 823918 679986 573593 418593 332865 307329 246996
19031B46996o0699j8350p834p0876m2241J4560P146k5522o812n462N172K997J3070
$$ 246996 186297 167947 160113 89237 46996 61556 68702 43180 36368 30906 36078 39075 52145
19018E2145k283j5325k2090L38K1615K2386j5151k3108K5699j3142j0636K7019
$$ 52145 49862 34537 12447 12785 34400 56786 41635 18527 44226 31084 20448 47467
19006D7467r195l7803n276K5695K2037n13Q843J5747j0588j6739j4852j4191K9921
$$ 47467 38272 469 -4807 20888 42925 42412 51255 67002 56414 39675 24823 10632 40553
18993D0553J0766j1852Q568K7189J4232j8593l0051Q787L6022K1513J1199M5823
$$ 40553 51319 39467 48035 75224 89456 70863 40812 49599 85621 107134 118333 164156
18981A64156J03642R4273R0087J10946J06516J27371J20721N0257N76k498L1190
$$ 164156 267798 362071 452158 563104 669620 796991 917712 967969 968545 966047 997237
18970I97237N6251Q1360J32159J06486P8067L4914l0300o5990q8364r4426r4542
$$ 997237 1053488 1134848 1267007 1373493 1451560 1486474 1456174 1390184 1301820 1207394 1112852
18959A112852r8675n4420l4092o0107l7723k8363r1185j17447j28510o5343o5162
$$ 1112852 1014177 959757 925665 865558 827835 799472 708287 590840 462330 396987 331825
18948C31825n6662o3837k4787p766j5140k3366M283o563j2288J9942J0012K2409
$$ 331825 275163 211326 186539 178773 163633 140267 144550 137987 125699 145641 155653 178062
18936A78062L5630N2570M8660Q7500R1855J36267J43146J60510J29671Q8456M3921
$$ 178062 213692 266262 314922 402422 494277 630544 773690 934200 1063871 1152327 1196248
18925A196248J4632J9267O2779P9493R5153J37246J26069P7477O2123n5529j42622
$$ 1196248 1210880 1230147 1292926 1372419 1467572 1604818 1730887 1808364 1870487 1814958 1672336
18914A672336j76460j29263r7421o9173l2872l005m0164r7921j27677j12582j32587
$$ 1672336 1495876 1366613 1269192 1200019 1167147 1164142 1123978 1026057 898380 785798 653211
18903F53211j32070j01177r1323l9410m4143n9352l2444n0472k1346J0880j431
$$ 653211 521141 419964 328641 289231 245088 185736 153292 102820 81474 92354 90923
18892I0923j7768o498j7229K936j9773J1334M7169j0983k5041J049m055n569k4642
$$ 90923 73155 66657 49428 52364 32591 43925 91094 80111 55070 56119 52064 46495 21853
18879B1853l2369M28M852k0990J2468J685k0778k7865j2235J7556K6158M990q713
$$ 21853 -10516 -10088 -5236 -26226 -13758 -12073 -32851 -60716 -72951 -55395 -29237 -24247 -32960
18866c2960J2488J4971P816l696J8597R436M428j7873j6123n905o301L3765N34
$$ -32960 -20472 -5501 2315 -1381 17216 26652 31080 13207 -2916 -8821 -15122 18643 19177
18853A9177J2257q29j5863r11J0220m484R490j0514j430q683j1005j5193q730
$$ 19177 31434 30605 14742 13831 24051 19567 29057 18543 17113 8430 -2575 -17768 -26498
18840b6498R873K2728N854P46o500q091k8055j4306J2749n610J0530P654l742
$$ -26498 -16625 6103 11957 12703 6203 -1888 -29943 -44249 -31500 -37110 -26580 -18926 -22668
18827b2668j2509l363L1957K717j2849k482j4400R848J896Q56J8174J8962J5856
$$ -22668 -35177 -38540 -6583 -3866 -16715 -19197 -33597 -23749 -21853 -20997 -2823 16139 31995
18814C1995j7819j1504j3443k0559o365Q589L98J8095l865k905K177O47k3112
$$ 31995 14176 2672 -10771 -31330 -37695 -29106 -28708 -10613 -14478 -17383 -15206 -14559 -37671
18801c7671K551L7978J8304l832r732P116o484L275J3562j5483J2506m462l1736
$$ -37671 -35120 2858 21162 17330 7598 14714 8230 11505 25067 9584 22090 17628 -14108
18788a4108j1560R220J9423K717j6327J4693p650r608J7584K244J6729K0165j6824
$$ -14108 -25668 -16448 2975 5692 -10635 4058 -3592 -13200 4384 6628 23357 43522 26698
18775B6698P430j588q458L1765J2839K2421K8865K9030L5336N4147M0472J9342
$$ 26698 34128 32540 24082 55847 68686 91107 119972 149002 184338 238485 278957 298299
18763B98299k6804o8528q5254l0951l0901j1632K530L919m061o688n15J2469R25
$$ 298299 271495 202967 117713 86762 55861 44229 46759 50678 46617 39929 39414 51883 52808
18750E2808Q378K712Q076J9342L6225L650j8334K7910K0277J8777O2483O3425
$$ 52808 61186 63898 71974 91316 127541 131191 112857 140767 161044 179821 242304 305729
18738C05729M134n353K5241J1223K6380K8585K8640L3074N8238R9248Q3422P7779
$$ 305729 309863 304510 329751 340974 367354 395939 424579 457653 515891 615139 698561 776340
18726G76340R1266O1033P4871P6965Q6711L7207j2273k4707J0189N9941N7549
$$ 776340 867606 928639 1003510 1080475 1167186 1204393 1192120 1167413 1177602 1237543 1295092
18715A295092M4785L0343J6019j5567l5927n2849l1817p7107o0660m4780o4693
$$ 1295092 1339877 1370220 1386239 1370672 1334745 1281896 1250079 1172972 1112312 1067532 1002839
18704A002839o3995o2442k3455m1427o0155r3672p6472n2273n8035m1466n4383
$$ 1002839 938844 876402 852947 811520 751365 657693 581221 528948 470913 429447 375064
18693C75064j0047j3369j907J961J9914L0181l454N731K0388o405k1308J7169
$$ 375064 365017 351648 349741 351702 371616 401797 398343 404074 424462 418057 396749 413918
18681D13918M2335M8090P6040O8379J08682J09096J18873J44299J09167N1151
$$ 413918 456253 504343 580383 648762 757444 866540 985413 1129712 1238879 1290030
18671A290030M9470P9167N4638P7898R3712R9394P4504L1745O4840L9724p4165
$$ 1290030 1339500 1418667 1473305 1551203 1644915 1744309 1818813 1850558 1915398 1955122 1880957
18660A880957j10587p9357r0217j57292j09553l0787m4164r2929j07380j18115
$$ 1880957 1770370 1691013 1600796 1443504 1333951 1303164 1259000 1166071 1058691 940576
18650I40576r6749q4360p2609n6973p0513m9616P796j0451J9365L8618L0021K7910
$$ 940576 843827 759467 686858 629885 559372 509756 517552 507101 526466 565084 595105 623015
18638F23015j402n3004p1394n2521m5609r4210q6276l2616k2558k5561n084n179
$$ 623015 621613 568609 497215 444694 399085 304875 218599 185983 163425 137864 132780 127601
18626A27601k5727j4602j6823l742K8269O706j8430J770j0542r488J6841K4375
$$ 127601 101874 87272 70449 66707 94976 101682 83252 85022 74480 64992 81833 106208
18614A06208J9238j9264J8435J4925m6028m6295K9374M7975j798J5915K6372L2456
$$ 106208 125446 106182 124617 139542 93514 47219 76593 124568 122770 138685 165057 197513
18602A97513q073L745J9064J2431N0285L3495J5246N0735O7912O1262N1874Q936
$$ 197513 189440 193185 212249 224680 274965 308460 323706 374441 442353 503615 555489 564425
18590E64425j7753J9016n082m2200m5168m7744l0472l2212m8875l3633m639J4208
$$ 564425 546672 565688 560606 518406 473238 425494 395022 362810 313935 280302 275663 289871
18578B89871J0521P050j9095m7447j0403K8151J4131q740j0769o296j1672L1L890
$$ 289871 300392 307442 288347 240900 230497 258648 272779 264039 253270 246974 235302 235333 239223
18565B39223M6648J5701J8667K2895M39K7915L8999O3262P1008Q2902J20519J73447
$$ 239223 285871 301572 320239 343134 343573 371488 410487 473749 544757 627659 748178 921625
18553I21625K24486K68736L21063L29880K56453J73972O9441n1023j18326j88755
$$ 921625 1146111 1414847 1735910 2065790 2322243 2496215 2565656 2514633 2396307 2207552
18543B207552k44552k92763k52559k20022j74163j48010p6122p7826p3740k4620
$$ 2207552 1963000 1670237 1417678 1197656 1023493 875483 799361 721535 647795 623175
18533F23175j7102l7222m9053k8651k2389k6752m9560m0344o449k6327k5483k7711
$$ 623175 606073 568851 519798 491147 468758 442006 392446 352102 345653 319326 293843 266132
18521B66132K414J3455L3432J4382k6992r955j693J2755J2021M4878P1650P4808
$$ 266132 268546 282001 315433 329815 302823 292868 291175 303930 315951 360829 432479 507287
18509E07287J10836J20574J54981K56814L28672L70383M07406L82059K95744J74689
$$ 507287 618123 738697 893678 1150492 1479164 1849547 2256953 2639012 2934756 3109445
18499C109445R119j22774k30066l68241m05962l54690l25949k83795j92081j36229
$$ 3109445 3118564 2995790 2765724 2397483 1991521 1636831 1310882 1027087 835006 698777
18489F98777j23720p7555o1041o7235m7856m4386k7862j9819r076k5328j7043
$$ 698777 575057 497502 436461 369226 321370 276984 249122 229303 220227 194899 177856
18478A77856j1524k3824Q264Q804k3991q91j1281j4323n17j1755L159J691K1035
$$ 177856 166332 142508 150772 159576 135585 134694 123413 109090 108573 96818 99977 101668 122703
18465A22703J5877J8758K5456N850O982N2914Q2702R2964R4638J49492J43710
$$ 122703 138580 157338 182794 188644 195626 248540 331242 424206 518844 668336 812046
18454H12046J38434Q9377N4273K1335n5266j24634j33085j71915j31799j02473
$$ 812046 950480 1039857 1094130 1115465 1060199 935565 802480 630565 498766 396293
18444C96293j07371n5316n1005m9976l7566j4687j8834l2457J9968K5243J554
$$ 396293 288922 233606 182601 132625 95059 80372 61538 29081 49049 74292 75846
18433G5846k0790J9931J9589l6041j416n858j8119O481j8171n118K1795N480J7983
$$ 75846 55056 74987 94576 58535 57119 51261 33142 39623 21452 16334 38129 43609 61592
18420F1592K9214P660j3789j6877j1750J7133J5688J3045K55K4372J8396J729
$$ 61592 90806 98466 84677 67800 56050 73183 88871 101916 102171 126543 144939 146668
18408A46668l44J6343J8108N618N075J3862j512k9525j7538j5575k1588k3318
$$ 146668 146324 162667 180775 186393 191468 205330 203818 174293 156755 141180 119592 96274
18396I6274J1567M0028j6442M069J2117J1966j592j8816O147L00j2302M2066L6716
$$ 96274 107841 147869 131427 135496 147613 159579 157987 139171 145318 145618 133316 175382 212098
18383B12098n081l770k687j5205J1422j47o518L3260K0603K4515r39n08J3313
$$ 212098 207017 203247 200560 185355 196777 196630 190112 223372 243975 268490 267551 267043 280356
18370B80356J1905J8662k5609k4515J6327J5231Q827k5968m6892J4605K7963j146
$$ 280356 292261 310923 285314 260799 277126 292357 301184 275216 228324 242929 270892 269746
18358B69746k1324K6148K870m373k4951j0169j0386j6098Q62j622M346J6107J0321
$$ 269746 248422 274570 277440 273067 248116 237947 227561 211463 212325 210703 215049 231156 241477
18345B41477Q395q743k5602J5422J1208n620j2374K2874q118Q014p496j8534P73
$$ 241477 249872 241129 215527 230949 242157 236537 224163 247037 238919 246933 239437 220903 221676
18332B21676K9287J987j9633J0271k111o936j9349Q424q171k9768J2143K9220
$$ 221676 250963 252950 233317 243588 241477 234541 215192 223616 215445 185677 197820 227040
18320B27040K4895j6037j7848K6626O0373L1510J8894L5006K5799K0589K2253
$$ 227040 251935 235898 218050 244676 305049 336559 355453 390459 416258 436847 459100
18309D59100M795K1869M6270P3350L3819r464Q973J5307J4997K3522K1947K2947
$$ 459100 463895 485764 532034 605384 639203 629739 638712 654019 669016 692538 714485 737432
18297G37432L0510M2534N4815R9145J30458J80336J93569J70843K08647K35702
$$ 737432 767942 810476 865291 964436 1094894 1275230 1468799 1639642 1848289 2083991
18287B083991K39695K25948K25622K35262K57700K54327K33374K45579K32735
$$ 2083991 2323686 2549634 2775256 3010518 3268218 3522545 3755919 4001498 4234233
18278D234233K41124L07051L40005K73669J96759K18218K52344J74670J20504
$$ 4234233 4475357 4782408 5122413 5396082 5592841 5811059 6063403 6238073 6358577
18269F358577Q1990R0946J40839J50504J77718K28278K57388L31230M37719N46621
$$ 6358577 6440567 6531513 6672352 6822856 7000574 7228852 7486240 7817470 8255189 8801810
18259H801810P47482J015036J348284J692528K086234K622941L190204L590778
$$ 8801810 9549292 10564328 11912612 13605140 15691374 18314315 21504519 25095297
18251B5095297L848297M217877M625146M551659M159697M053560M125830L929282
$$ 25095297 28943594 33161471 37786617 42338276 46497973 50551533 54677363 58606645
18243E8606645L755629L982674M230283M309050M596180M984769M598124L424501
$$ 58606645 62362274 66344948 70575231 74884281 79480461 84465230 89063354 92487855
18235I2487855K457122J811307O49457j148158k651005l472451l911872m166305
$$ 92487855 94944977 96756284 97405741 96257583 93606578 90134127 86222255 82055950
18227H2055950m346444m528776m560339m320425m156849m420399m897180n115520
$$ 82055950 77709506 73180730 68620391 64299966 60143117 55722718 50825538 45710018
18219D5710018n111806n078489m906436m572045m099976l545761k989490k354810
$$ 45710018 40598212 35519723 30613287 26041242 21941266 18395505 15406015 13051205
18211A3051205j780793j286970q45274n85101l01765j01600J10813L27216O00031
$$ 13051205 11270412 9983442 9138168 8553067 8251302 8149702 8260515 8587731 9187762
18202I187762R94485J481327K052148K481022K490656K043620J292163N60940
$$ 9187762 10182247 11663574 13715722 16196744 18687400 20731020 22023183 22584123
18194B2584123j62099j065109j991872k557496k672810k386856j981319j511502
$$ 22584123 22422024 21356915 19365043 16807547 14134737 11747881 9766562 8255060
18186H255060j172846r52878q03285o62078m66620l53035k40087r5061j4813M4890
$$ 8255060 7082214 6129336 5326051 4663973 4197353 3844318 3604231 3509170 3494357 3539247
18176C539247Q5443J36462J60440J75709K04245K43634L16288M27451N54884P57292
$$ 3539247 3624690 3761152 3921592 4097301 4301546 4545180 4861468 5288919 5843803 6601095
18166F601095Q76259Q90817P69890O60287P14537R07776J147538J598321K343166
$$ 6601095 7477354 8368171 9138061 9798348 10512885 11420661 12568199 14166520 16509686
18157A6509686L359328M265189M616543M663132N253695O468874P298293O281283
$$ 16509686 19869014 24134203 28750746 33413878 38667573 45136447 52434740 58716023
18149E8716023L240700p0998k451303m108440n656392o963286p508138p179758
$$ 58716023 61956723 61885725 59434422 55325982 49669590 42706304 35198166 28018408
18141B8018408o103018m699538l380243k374351j651127j203904q75091o33514
$$ 28018408 21915390 17215852 13835609 11461258 9810131 8606227 7731136 7097622
18133G097622m06977k13916l5009J29818K30615K59049L22553L68444M17197M88163
$$ 7097622 6690645 6476729 6441720 6571538 6802153 7061202 7383755 7752199 8169396 8657559
18123H657559O14895P64074R82156J215734J550664J888520K354157L042166L977174
$$ 8657559 9272454 10036528 11018684 12234418 13785082 15673602 18027759 21069925 25047099
18114B5047099N314436P257908J0278852J4964262K1296551K8801880L1059013
$$ 25047099 30361535 37619443 47898295 62862557 84159108 112960988 144020001
18107A44020001J8778571J590173p516693j0725944r289453q775392j1094963
$$ 144020001 162798572 164388745 156872052 146146108 136856655 128081263 116986300
18100A16986300j3545029j4089182j2527490r776713p174547n221724l792591
$$ 116986300 103441271 89352089 76824599 67047886 59873339 54651615 50859024
18093E0859024k638293j515292j09633J618280L607849N647675P485826Q645732
$$ 50859024 48220731 46705439 46595806 48214086 51821935 57469610 64955436 73601168
18085G3601168Q583138P191014M476230Q50966k566694m882304n801891n320897
$$ 73601168 82184306 89375320 93851550 94702516 92135822 87253518 81451627 76130730
18077G6130730l784748j867344l24622M76121K24416j236147l317389n123764
$$ 76130730 72345982 70478638 70154016 70630137 70854553 69618406 66301017 61177253
18069F1177253o443083p010833o816425o014818m803774l440897k141586j014947
$$ 61177253 54734170 47723337 40906912 34892094 30088320 26647423 24505837 23490890
18061B3490890J62428J297459K521145L771347N012510O201678O883272P015224
$$ 23490890 23653318 24950777 27471922 31243269 36255779 42457457 49340729 56355953
18053E6355953O600667N383428L622425K040024P45481k39915n49134j4459R97102
$$ 56355953 62956620 68340048 71962473 74002497 74747978 74508063 73958929 73944470 74941572
18044G4941572K006934K905619L366466K862825J565238j35075k181012m110429
$$ 74941572 76948506 79854125 83220591 86083416 87648654 87513579 85332567 81222138
18036H1222138n560719o263022o199353n497601m512024l619104k966293k674729
$$ 81222138 75661419 69398397 63199044 57701443 53189419 49570315 46604022 43929293
18028D3929293k785781l081018l371349l523583l494095l336329l001518k590882
$$ 43929293 41143512 38062494 34691145 31167562 27673467 24337138 21335620 18744738
18020A8744738k163701j642602j090548n18927J1404N59555J068182J328022J359507
$$ 18744738 16581037 14938435 13847887 13328960 13340364 13899919 14968101 16296123 17655630
18011A7655630J342160J182034P54438L00613q106k25808k03948P1967O28937
$$ 17655630 18997790 20179824 20934262 21234875 21226769 21000961 20797013 20868980 21497917
18002B1497917J237554J780716K162536K330009K003891J253179L19113p60142
$$ 21497917 22735471 24516187 26678723 29008732 31012623 32265802 32584915 31824773
17994C1824773j656939k253738k397380k162688j654470j042411n35582k52049
$$ 31824773 30167834 27914096 25516716 23354028 21699558 20657147 20121565 19869516
17986A9869516k01812n28688r94830j422672j818136k028489j999582j826714
$$ 19869516 19667704 19139016 18144186 16721514 14903378 12874889 10875307 9048593
17978I048593j560892j274036r57102p43234n66711m03936l41567k82725k25826
$$ 9048593 7487701 6213665 5256563 4513329 3946618 3542682 3201115 2918390 2692564
17969B692564j97480j58226j21357j32724j09149j07901j03370o5625o0528o2952
$$ 2692564 2495084 2336858 2215501 2082777 1973628 1865727 1762357 1696732 1636204 1573252
17959A573252j7145p4264p7465l9347o5812o2842p4464o0170l0461r848j3581
$$ 1573252 1556107 1481843 1404378 1365031 1299219 1236377 1161913 1101743 1071282 1061434 1047853
17948A047853j837j3761j0504O290M837q342k2092r050r139k0600k1587k1946
$$ 1047853 1046016 1032255 1021751 1028041 1032878 1024536 1002444 993394 984255 963655 942068 920122
17936I20122m6348j7607j7901j5727j3484j0916l7694p081j031j7575k6950j7507
$$ 920122 873774 856167 838266 822539 809055 798139 760445 753364 752333 734758 707808 690301
17924F90301o512K2470R331j0k3143k1255k514n316k9684j7642p974n108j846
$$ 690301 683789 706259 715590 715580 692437 671182 668668 663352 633668 616026 608052 602944 601098
17911F01098L0769K1010J7210O339j3408k3108j5032j5439l4245j1262R084k2454
$$ 601098 631867 652877 670087 676426 663018 639910 624878 609439 575194 563932 573016 550562
17899E50562r144j8138l5846l7280k0563J5924l476k2262j0988l0811j4717K9080
$$ 550562 541418 523280 487434 450154 429591 445515 442039 419777 408789 377978 363261 392341
17887C92341k5520l7030O9J6708K6709L0249J0811M021K925m777R077K7047J4294
$$ 392341 366821 329791 329860 346568 373277 403526 414337 418358 421283 416506 425583 452630 466924
17874D66924j4420m447K7892J6416j6870j9859N542L368J1692j0857l313j6947
$$ 466924 452504 448057 475949 492365 475495 455636 461178 464546 476238 465381 462068 445121
17862D45121l784K751k9229k6759k7619k5767m238j4725k4164R198j1063k590
$$ 445121 441337 444088 414859 388100 360481 334714 330476 315751 291587 300785 289722 287132
17850B87132p161k7506p425K197M130K1588K0592k4609n239K9735K43J70K5240
$$ 287132 279971 252465 245040 247237 251367 272955 293547 268938 263699 293434 293677 293847 319087
17837C19087J9226k5598k4249J4754L5526K5422n176r473n4003j2580L3186J1956
$$ 319087 338313 312715 288466 303220 338746 364168 358992 349519 295516 282936 316122 328078
17825C28078P832N55K5857O245k7086k5389m128m042J003k5453k1725M414m38
$$ 328078 335910 336465 362322 368567 341481 316092 311964 307922 308925 283472 261747 266161 265723
17812B65723O239j5747j5377j5870m824j2739j8116k2602J0846j8010k6627q52
$$ 265723 271962 256215 240838 224968 220144 207405 189289 166687 177533 159523 132896 132044
17800A32044Q151L165R301j5048j770J3918K1022k245L2965J5051k1312k2325
$$ 132044 140195 143360 152661 137613 135843 149761 170783 168538 201503 216554 195242 172917
17788A72917j861J768k3017k1329j0920p353J5149J0987M411r463k587K8444J3752
$$ 172917 171056 172824 149807 128478 117558 110205 125354 136341 140752 131289 128702 157146 170898
17775A70898q475k5475N475K162j7313r145p089r239O159O544J2363J4456J427
$$ 170898 162423 136948 142423 144585 127272 118127 111038 101799 107958 114502 126865 141321 142748
17762A42748L5170J0841J9909L1781J4518J1374K768K7813L1027R328K8329L3002
$$ 142748 177918 188759 208668 240449 254967 266341 269109 296922 327949 337277 365606 398608
17750C98608j084l844L8653L8637j4659J2287J2240J8787M0747L7565J9372j902
$$ 398608 397524 393680 432333 470970 456311 468598 480838 499625 540372 577937 597309 595407
17738E95407q551L522J6746j1902l6596k1773k0180k8851l1460m8637k3278J27
$$ 595407 586856 590378 607124 595222 558626 536853 516673 487822 456362 407725 384447 384574
17726C84574l114l1692n132j6213k0077m4843m3792k6147Q30j869k1096l2365
$$ 384574 381460 349768 344636 328423 308346 263503 219711 193564 194394 192525 171429 139064
17714A39064j529j4954Q983P314J5787J6304J6821j9043k6703Q939J3902R242
$$ 139064 137535 122581 131564 138878 154665 170969 187790 168747 142044 150983 164885 174127
17702A74127l2565m1113o543Q985J3858J6303P373Q769N568r305J247P6J857J4700
$$ 174127 141562 100449 93906 102891 116749 133052 140425 149194 154762 145457 146704 146780 148637 163337
17688A63337j7510l496J2736J8541K0501J1051L6506K5263M1805L2536K4750J9511
$$ 163337 145827 142331 155067 173608 194109 205160 241666 266929 308734 341270 366020 385531
17676C85531l497k1859M902l5390m8222l2521l5198q414j6801j543J199L624o684
$$ 385531 382034 360175 365077 329687 281465 248944 213746 205332 188531 186988 188187 191811 185127
17663A85127m7860q987P643p517j5309J1686k637p089r343p7m440J0977K2736
$$ 185127 137267 128280 135923 128406 113097 124783 122146 115057 105714 105637 101197 112174 134910
17650A34910n311j1141P983o892k9025L402P875P801j1900o616p9J477K0628L3342
$$ 134910 129599 118458 126441 119549 90524 93926 101801 109602 97702 91086 91007 92484 113112 146454
17636A46454M6059N5525O3725P2639O7875M4901M1447M2890M1776p183o7630j18532
$$ 146454 192513 248038 311763 384402 452277 497178 538625 581515 623291 616108 548478 429946
17624D29946q3941o4801o4830j1007q609j6655j3922j1122j464k81j559k737M841
$$ 429946 346005 281204 216374 205367 196758 180103 166181 155059 153595 153314 151755 149018 153859
17611A53859k7310J3643K998k27q672j9140m151K714K7729K7165O684Q536L4961
$$ 153859 126549 140192 143190 142963 134291 115151 111000 113714 141443 168608 175292 183828 218789
17598B18789J6213Q486K8415K0188O579J5814p164J3170L5357L2986M1645L5890
$$ 218789 235002 243488 271903 292091 298670 314484 307320 320490 355847 388833 430478 466368
17586D66368K4025J8793J3826j4360j0476J5285N73r282l8689p0057l1453k9941
$$ 466368 490393 509186 523012 508652 498176 513461 514034 504752 466063 396006 364553 334612
17574C34612l4265p750k9694O49k8458j7118j6990k0306m1280j2748J1382Q794
$$ 334612 300347 292597 262903 263552 235094 217976 200986 180680 139400 126652 138034 146828
17562A46828J4965K7681J7694K0353L6214K1205M2872J8637K1225N0875J0983
$$ 146828 161793 189474 207168 227521 263735 284940 327812 346449 367674 418549 429532
17551D29532L535J197K1492J9366J3087L0970R819J1682J4243K7453q925j9843
$$ 429532 433067 434264 455756 475122 488209 519179 528998 540680 554923 582376 573451 553608
17539E53608l6368k7819Q807j4215l5504l3385J9491j1780k6252k1839j995l2070
$$ 553608 517240 489421 498228 484013 448509 415124 434615 422835 396583 374744 372749 340679
17527C40679k1696o843o0337m7967k7843N911Q379k2661m539M07k5212J6085O893
$$ 340679 318983 312140 251803 203836 175993 181904 190283 167622 163083 163490 138278 154363 161256
17514A61256l584k394J2902K6297J086R556K2961J5562j1973K995J0993J4283
$$ 161256 157672 155278 168180 194477 195563 205119 228080 243642 231669 234664 245657 259940
17502B59940K9876J1901Q097J1307J9790q214l4264q633O518L531j3820m1545
$$ 259940 289816 301717 309814 321121 340911 332697 298433 289800 296318 299849 286029 244484
17490B44484p422L674r400j6022j3936O084K0566k2105j3135j0570p423l1781
$$ 244484 237062 240736 231336 215314 201378 207462 228028 205923 192788 182218 174795 143014
17478A43014k9908K0171J2530k0519k9728p96j6337J2554J1619k7554l3761n187
$$ 143014 113106 133277 145807 125288 95560 94764 78427 90981 102600 75046 41285 36098
17466C6098Q199n128j8892j3815q948N20J3386K7298K8870J062k4440p131J2754
$$ 36098 44297 39169 20277 6462 -2486 -1966 11420 38718 67588 68650 44210 37079 49833
17453D9833j194K1004J1026J6468o481j4740j2475J5767J6713N7507O6391O2661
$$ 49833 48639 69643 80669 97137 90656 75916 63441 79208 95921 153428 219819 282480
17441B82480M3064j6538l7838o5543m9267l1721m805l3075p756n881p709J8275
$$ 282480 325544 309006 271168 205625 156358 124637 119832 86757 79001 73120 65411 83686
17429H3686m640j9842k5585l413L59r35k9233K4786L0137J2784K7496j787n403
$$ 83686 79046 59204 33619 30206 30565 29630 397 25183 55320 68104 95600 93813 88410
17416H8410j7512K0806P880l3845k8920j982J7521k536k1510M986L450J8039j2692
$$ 88410 70898 91704 99584 65739 36819 34837 52358 49822 28312 33298 36748 54787 42095
17403D2095k2434J4507L8268M231l4234o718J9681N647j5231o919k6965j8488
$$ 42095 19661 34168 72436 76667 42433 35715 55396 61043 45812 38893 11928 -6560
17391f560K709j0258L4065O781j3059M77k1414r906Q317K5634J8422k298O0K313
$$ -6560 -3851 -14109 19956 26737 13678 14155 -7259 -17165 -8848 16786 35208 32910 32970 35283
17377C5283j4684l1797J392J1670j355L6817o093j9707J4610J9657L594j7487
$$ 35283 20599 -11198 -9806 1864 509 37326 31233 11526 26136 45793 49387 31900
17365C1900K0317J9552J9355m297j691j0798l5432k1478K0652J099j8410k3134
$$ 31900 52217 71769 91124 86827 85136 74338 38906 17428 38080 39179 20769 -2365
17353b365K5740L1385O58Q180j5396k0412J2820J5610j8583n211K303K2395J8645
$$ -2365 23375 54760 55418 63598 48202 27790 40610 56220 37637 32426 34729 57124 75769
17340G5769m0214k9448k202Q37k6621j9173L9162K5567l5392J0530K6108R02j6792
$$ 75769 35555 6107 3905 4742 -21879 -41052 -1890 23677 -11715 -1185 24923 25825 9033
17327I033J661J0596P492j0788J3357k281N682j5868p947j876J8687K6519K8354
$$ 9033 10694 21290 28782 17994 31351 29070 34752 18884 10937 9061 27748 54267 82621
17314H2621r458k2561q504k483n993p232Q308r617Q7K6950j9886N798J1010m812
$$ 82621 73163 50602 42098 39615 33622 26390 34698 25081 25168 52118 32232 38030 49040 44228
17300D4228P170k313k534k631K2745J788j7344j3296p809n219K814J6800J1481
$$ 44228 51398 49085 46551 43920 66665 68453 51109 37813 30004 24785 27599 44399 55880
17287E5880j1834J201k771k6716k0894J4436J0128q841J2886K3138N281j5960
$$ 55880 44046 45247 42476 15760 -5134 9302 19430 10589 23475 46613 51894 35934
17275C5934k0898j699l265L226K7272j0346n911Q718j7011k3242K0261R210J0791
$$ 35934 15036 13337 10072 13298 40570 30224 24313 33031 16020 -7222 13039 22249 33040
17262C3040p112n63J7894L397P291j2207j2010N220K760R16R288K966j0924j0319
$$ 33040 25928 25365 43259 46656 53947 41740 29730 34950 37710 38626 47914 50880 39956 29637
17248B9637j963L2917L445k4086l217j9980k0599J2017q18P81J2527Q475P474
$$ 29637 27674 60591 64036 39950 36733 16753 -3846 8171 7353 8134 20661 29136 36610
17235C6610K5514p823K842p342j5964k926M520k1439j0305p176J3021M0609m193
$$ 36610 62124 54301 57143 49801 33837 30911 35431 13992 3687 -3489 9532 50141 45948
17222D5948j6646j1165r377J4020j9740k311J3936J3843m877m2533J7987J8569
$$ 45948 29302 18137 8760 22780 3040 729 14665 28508 23631 -18902 -915 17654
17210A7654J7120j0693j2635N120j4203N730J1369O529q833J3335J9466l455K960
$$ 17654 34774 24081 11446 16566 2363 8093 19462 25991 17158 30493 49959 46504 49464
17197D9464j8742J8438K78p752Q586J3780k924O527k5392k2132o786J0207O415
$$ 49464 30722 49160 49438 41686 50272 64052 61128 67655 42263 20131 13345 23552 29967
17184B9967K4190J0097l8208k4537R960p997M975L0528J1351j5906j5192k195
$$ 29967 54157 64254 26046 1509 11469 3472 8447 38975 50326 34420 19228 17033
17172A7033n73m386l418J274K0543J1218J167q173j3844j6389j1689k7612K2663
$$ 17033 16460 12074 8656 9930 30473 41691 42858 34685 20841 4452 -7237 -34849 -12186
17159a2186K6184q61p67K0973L5639j0773j2897j3722j7034K933K825p741m436
$$ -12186 13998 13137 12370 33343 68982 58209 45312 31590 14556 17489 20314 12573 8137
17146H137M209L178j1826J6131J4721J5604P697j8688k8213j7155j5153P092K5596
$$ 8137 12346 15524 3698 19829 34550 50154 57851 39163 10950 -6205 -21358 -14266 11330
17133A1330o644j5143J750J1594j2107r602J054J1719P585j260j137L6549K395
$$ 11330 4686 -10457 -8707 2887 -9220 -18822 -17768 -6049 1536 276 -861 35688 38083
17120C8083O367r716J3307r238p972j176l2370N119J566j3453P397O639k9613
$$ 38083 44450 34734 48041 38803 30831 29655 -2715 2404 3970 -9483 -2086 4553 -25060
17107b5060j903L7815Q717k1478j413L2220J1544k0307P506m944k2454K8421j5016
$$ -25060 -26963 10852 19569 -1909 -3322 28898 40442 20135 27641 22697 243 28664 13648
17094A3648k5951J361N969J9940O310n864K226J3212J0501k7736q681k4393k174
$$ 13648 -12303 -10942 -4973 14967 21277 15413 17639 30851 41352 13616 4935 -19458 -21632
17081b1632K1024J0749J884k441j3305q134L4893K5231j4948j7644j8939M155
$$ -21632 -608 10141 12025 9584 -3721 -11855 23038 48269 33321 15677 -3262 893
17069H93K4924q025N003L0423J206m0527k7760l21P415N368K0589M010k6367k115
$$ 893 25817 17792 22795 53218 54424 13897 -13863 -14184 -6769 -1401 19188 23198 -3169 -5284
17055e284j4745O727K1156l551j3652K0785J4108l4697j2758K7227m679k5119
$$ -5284 -20029 -13302 7854 4303 -9349 11436 25544 -9153 -21911 5316 637 -24482
17043b4482J5756J862m758k494J4106J2663K2059m477j5981L6243j3424j5913
$$ -24482 -8726 -6864 -11622 -14116 -10 12653 34712 30235 14254 50497 37073 21160
17031B1160m276P960r801j7944j39J9070l896j4230n214j7514Q106J9000L822
$$ 21160 16884 24844 15043 -2901 -3040 16030 12134 -2096 -7310 -24824 -16718 2282 6104
17018F104O031p5J0428j2272N375L370m171L950j776Q171j2091j2042l0856R53
$$ 6104 12135 12060 22488 10216 15591 18961 14790 18740 16964 25135 13044 1002 -29854 -28901
17004b8901M536Q292J2550J0957l031L388m559m576M988q64K6671J8551M778l3920
$$ -28901 -24365 -16073 -3523 7434 4403 7791 3232 -1344 3644 2780 29451 48002 52780 18860
16990A8860m232j0385j6557K763M0510N404J1791l3104l2852j6556n243M2703
$$ 18860 14628 4243 -12314 -9551 30959 36363 48154 15050 -17802 -34358 -39601 3102
16978C102J3747J3166k4247k1419j0178o831J9824J0744K5675q226P218K937m6431
$$ 3102 16849 30015 5768 -15651 -25829 -32660 -12836 -2092 23583 15357 22575 25512 -20919
16965b0919l0982J7462J7835J8314J9252K9100K651j3532m0433j1018J5983K3572
$$ -20919 -51901 -34439 -16604 1710 20962 50062 52713 39181 -1252 -12270 3713 27285
16953B7285J1026o538j0703l315L6530o228j977m5032j5896J2158L2555P64J730
$$ 27285 38311 31773 21070 17755 54285 48057 46080 1048 -14848 -2690 29865 30629 32359
16940C2359j2309m110J728p794j1910o925J251J1352N182j6965m250Q936r770
$$ 32359 20050 15940 17668 9874 -2036 -8961 -7710 3642 8824 -8141 -12391 -3455 -13225
16927a3225j5348L465L15P781L3197Q79M302j9730j3392j7004l978l857K0884
$$ -13225 -28573 -25108 -24793 -17012 16185 17064 21366 1636 -11756 -28760 -32738 -36595 -15711
16914a5711M590j4893N720O055J195L943J7214o498j9312K820L3565K240k1085
$$ -15711 -11121 -26014 -20294 -14239 -13044 -9101 8113 1615 -17697 -14877 18688 20928 -157
16901a57q300L699j8528K145K0073N2947p217Q194m863l0819j9854J495K3558
$$ -157 -8457 -4758 -23286 -21141 -1068 51879 44662 52856 47993 17174 -2680 -1185 22373
16888B2373j0810l3541j5247r00r815K0536L1247K2974K0707m524l1143j7051
$$ 22373 11563 -21978 -37225 -38125 -47940 -27404 3843 26817 47524 43000 11857 -5194
16876e194m079K0182q864L644m117K4329J5681O195o634m1134k9968j7880J1974
$$ -5194 -9273 10909 2045 5689 1572 25901 41582 47777 41143 9 -29959 -47839 -35865
16863c5865K3258R704L864k8015O83J2072K9561K048j3664R88J1510J8613k526
$$ -35865 -12607 -2903 961 -27054 -26371 -14299 15262 17310 3646 4634 16144 34757 32231
16850C2231m138j8741O941k6137P332j229j1843j0088q036L6023j348k623K6268
$$ 32231 28093 9352 16293 -9844 -2512 -3741 -15584 -25672 -33708 2315 967 -1656 24612
16837B4612K7383K8k8462j5809Q808N887j9465l73p37n317j404p424J5704O099
$$ 24612 51995 52023 23561 7752 16560 22447 2982 2609 1872 -3445 -4849 -12273 3431 9530
16823I530o209J437j9467J8603J3374L128K948J1945K741M83r845O142k957j2666
$$ 9530 3321 4758 -14709 3894 17268 20396 23344 35289 38030 38513 28668 34810 31853 19187
16809A9187L2716j288J1417p814j6514p75N567r391l2581j6587L6012L863o199
$$ 19187 51903 50615 62032 54218 37704 36929 42496 33105 524 -16063 19949 23812 17613
16796A7613J3247m51j1574j5586K1579K5822j2537L604M417l3967k6035j0295
$$ 17613 30860 30409 18835 3249 24828 50650 38113 41717 46134 12167 -13868 -24163
16784b4163J6994j883k8702p440O465P30K5693N60j7681j56o960Q839R481P342
$$ -24163 -7169 -9052 -37754 -45194 -38729 -37999 -12306 -11746 -29427 -29583 -36543 -27704 -18223 -10881
16770a0881j1598J4000J1474J5650K2170J1861J7814l704k4772j1779k169j8345
$$ -10881 -22479 -8479 2995 18645 40815 52676 70490 66786 42014 30235 28066 9721
16758I721l920m1343l2916J8042M4378J7471j6757l7320n256m475j6669K1157
$$ 9721 5801 -35542 -68458 -50416 -6038 11433 -5324 -42644 -47900 -52375 -69044 -47887
16746d7887M4453K7641p559r180k0154M451n682M4139N808L10R16k768O439j2883
$$ -47887 -3434 24207 16648 7468 -12686 -8235 -13917 30222 36030 36340 37256 34488 40927 28044
16732B8044l744j3756l661L5102J7155j9808k2410j9407j1806j5862J077l743
$$ 28044 24300 10544 6883 41985 59140 39332 16922 -2485 -14291 -30153 -29076 -32819
16720c2819K3129J7129o562j9951J798l993j706K9842K1693k1276l1576O936K4877
$$ -32819 -9690 7439 877 -19074 -17276 -21269 -22975 6867 28560 7284 -24292 -17356 7521
16707G521l614j3894J6119j0961k119L619N984J2924J3683p048k4404n263K732
$$ 7521 3907 -9987 6132 -4829 -6948 -3329 2655 15579 29262 22214 -2190 -7453 -4721
16694d721L1993j2487j9829j0579j1891O281J7683o049J6335J3166j5378q703
$$ -4721 27272 14785 -5044 -15623 -27514 -21233 -3550 -9599 6736 19902 4524 -4179
16682d179q814J0560L266k5343J0136K7679O547N36j8614j0010m09K0334L6530
$$ -4179 -12993 -2433 833 -24510 -14374 13305 19852 20388 1774 -8236 -8645 11689 48219
16669D8219o202o017J7265r130P172J3016k0389j8140J1363j0399P087j8875n110
$$ 48219 42017 36000 53265 44135 51307 64323 43934 25794 37157 26758 33845 14970 9860
16656I860J151j4548K69J6144L4292J4496l52K260k5522j0592l803J1092j5290
$$ 9860 11011 -3537 -3268 12876 47168 61664 61312 63572 38050 27458 23655 34747 19457
16643A9457k7025p846o398L2010o617l3142p36J7490n657k3662j2227M6232J1141
$$ 19457 -7568 -15414 -21812 10198 3581 -29561 -30297 -12807 -18464 -42126 -54353 -8121 3020
16630C020J6246j8981j541J9497M051k636N590N18j2419j5662k7909j064K200
$$ 3020 19266 285 -1256 18241 22292 19656 25246 25764 13345 -2317 -30226 -31290 -29090
16617b9090l873J8533Q557o14p14k238j1652O266n078r678N19J5331J9204J1126
$$ -29090 -32963 -14430 -5873 -6487 -7201 -9439 -21091 -14825 -19903 -29581 -29062 -13731 5473 16599
16603A6599J7910j6560k766j8397k7187m380r948J2957O172J9508J9691J8452
$$ 16599 34509 17949 15183 -3214 -30401 -34781 -44729 -31772 -25600 -6092 13599 32051
16591C2051N938K1339P180M579j0418j1764K1229K339m0351k4113k0380J4106
$$ 32051 37989 59328 66508 71087 60669 48905 70134 72473 32122 8009 -12371 1735
16579A735Q160l343n782O175M172l608K369J4419M438O991j9811j1269j8758j5658
$$ 1735 9895 6552 770 6945 11117 7509 9878 24297 28735 35726 15915 4646 -14112 -29770
16565b9770m327m081J8006J2877Q101K3643N951k3826j4041j0781n994N575J5131
$$ -29770 -34097 -38178 -20172 -7295 806 24449 30400 6574 -7467 -18248 -24242 -18667 -3536
16552c536K253o463Q271R220O410j3669j151J4118j1181p118l59J7937K343k908
$$ -3536 -1283 -7746 525 9745 16155 2486 1335 15453 4272 -2846 -3205 14732 17075 14167
16538A4167j8349M99k372J2286R086M735j094q688j0849j6932l651j2561K8008
$$ 14167 -4182 -3683 -6055 6231 15317 20052 18958 10270 -579 -17511 -21162 -33723 -5715
16525e715J9675k0763m3913O444K5769j7293O394K7911L9256j9420m250R521k0365
$$ -5715 13960 -6803 -50716 -44272 -18503 -35796 -29402 -1491 37765 18345 14095 23616 3251
16512C251j0923L082p059R652j1629j640r655o222O019P253J3362J8732r2j222
$$ 3251 -7672 -4590 -11649 -1997 -13626 -15266 -24921 -31143 -25124 -17871 -4509 14223 14131 12909
16498A2909M199q60K929P867k0525K8830p638l6376J4688J1400J1242j3895J4937
$$ 12909 17108 16248 19177 27044 6519 35349 27711 -8665 6023 17423 28665 14770 29707
16485B9707K487j1258J2878P577M793r384p480J062J1461l728j1251k1170k420
$$ 29707 32194 20936 33814 41391 46184 36800 29320 30382 41843 38115 26864 5694 3274
16472C274k0962j0290J9150K3952J0141J1335P427N926l2352j5372K1571M2636
$$ 3274 -17688 -27978 -8828 15124 25265 36600 44027 49953 17601 2229 23800 66436
16460F6436j589j6447k2752o732N245j0753k9986O743K631k2364L5490K1493j3206
$$ 66436 64847 48400 25648 18916 24161 13408 -16578 -9835 -7204 -29568 5922 27415 14209
16447A4209o339L799J2450j2406j0029m2024l4325K3121J5784N107O595o939J538
$$ 14209 7870 11669 24119 11713 1684 -40340 -74665 -51544 -35760 -30653 -24058 -30997 -29459
16434b9459K4039k09j507K774M668J364Q878k1403n51k1481J797p15K5119J6809
$$ -29459 -5420 -5629 -7136 -4362 306 1670 10548 -10855 -11406 -32887 -31090 -31805 -6686 10123
16420A0123M247Q70r294j7822M144p025o219N925K7567k256J8584J4089K423n4069
$$ 10123 14370 15240 5946 -11876 -7732 -14757 -20976 -15051 12516 10260 28844 42933 45356 -8713
16406h713j6791k917q7j0377j4260P125M4331n587k071R664q53j0219J5739R58
$$ -8713 -25504 -28421 -28508 -38885 -53145 -46020 -1689 -7276 -9347 317 -536 -10755 4984 5942
16392E942j2898J8227r195J400j5329j1342J8786o241p476j2013Q46n416J3575
$$ 5942 -6956 11271 2076 3476 -11853 -23195 -4409 -10650 -18126 -30139 -29293 -34709 -21134
16379b1134L8727j771r177k6374j8350K026P924K460O59m270j4190J7729J6854
$$ -21134 17593 15822 6645 -19729 -38079 -36053 -28129 -25669 -25010 -29280 -43470 -25741 -8887
16366h887K9201K0459O575j1846j1762l84P502k0786r723J770J3901o652k5532
$$ -8887 20314 40773 47348 35502 23740 23356 30858 10072 349 2119 16020 9368 -16164
16353a6164m007m361J9124K362n399n93J5229L539Q00k447J17O194M991r89K0042
$$ -16164 -20171 -24532 -5408 -3046 -8445 -9038 6191 9730 10530 8083 8200 14394 19385 18396 38438
16338C8438M90k2197n543k326o161J0021j3375j4734J568K2837p079j0121j0508
$$ 38438 38928 16731 11188 8862 2701 12722 -653 -15387 -13819 9018 1939 -8182 -18690
16325a8690J1340J5818J0155k2278N654j4693k1810j143L6735K0562j2818k1607
$$ -18690 -7350 8468 18623 -3655 1999 -12694 -34504 -35647 1088 21650 8832 -12775
16313a2775p824m506n012j113M4071J0398p13j6660l0125k888j6917L25J5527
$$ -12775 -20599 -25105 -30117 -31230 12841 23239 22526 5866 -24259 -27147 -44064 -43739 -28212
16300b8212L990K0813R144l450J5638j0412Q390j9148K0871J5670K8798n158k2754
$$ -28212 -24222 -3409 5735 2285 17923 7511 15901 -3247 17624 33294 62092 56934 34180
16287C4180J2945q938r217N712J1481l5758q145N130N99j6219j8660n923L7236
$$ 34180 47125 38187 28970 34682 46163 10405 2260 7390 7989 -8230 -26890 -32813 4423
16274D423J9575j3643O699J3740J248l1971l6182K972R768j3167P612K5184L1608
$$ 4423 23998 10355 17054 30794 32042 71 -36111 -33139 -23371 -36538 -28926 -3742 27866
16261B7866K755K754J9190Q747P623k0919j8067q968k1293j7471K2741j5195l4534
$$ 27866 30621 33375 52565 61312 68935 48016 29949 20981 -312 -17783 4958 -10237 -44771
16248d4771K813L679J8923Q561J6584j014q972j3849J2467q474j847n937k0561
$$ -44771 -41958 -38279 -19356 -10795 5789 4775 -4197 -18046 -5579 -14053 -15900 -21837 -42398
16235d2398j8948J1142L0840M6853K9927o9l7841j9017r784J3361L628K3096j01
$$ -42398 -61346 -50204 -19364 27489 57416 57347 19506 489 -9295 4066 7694 30790 30689
16222C0689k7363j3698M6r397j669o590O925J3817J913Q810P317J349L62O76j8001
$$ 30689 3326 -10372 -10326 -19723 -21392 -27982 -21057 -7240 -5327 3483 10800 12149 12511 13187 -4814
16207d814J8103J6192Q039j249m422J0097J1407k5641j946j4967l725P591r322
$$ -4814 13289 29481 37520 36271 31849 41946 53353 27712 25766 10799 7074 14665 5343
16194E343l017p543Q615P350O238M210r258j3501N685O255P765k3151J8031j6363
$$ 5343 2326 -5217 3398 10748 16986 21196 11938 -1563 4122 10377 18142 -5009 13022 -3341
16180c341k969K2323j6731M519J9417j9698K343K997J6995l838J0854N133l2565
$$ -3341 -6310 16013 -718 3801 23218 3520 5863 8860 25855 22017 32871 38004 5439
16167E439n38J2493O720k5048l5977j2502R632J3632Q578K6867J8852j1451J2093
$$ 5439 4901 17394 24114 -934 -36911 -49413 -39781 -26149 -17571 9296 28148 16697 28790
16154B8790j7100k689K1285j0905j0668p084l035n766l302j621J7402K3179k560
$$ 28790 11690 9001 30286 19381 8713 1629 -1406 -7172 -10474 -12095 5307 28486 25926
16141B5926M125l2627o04j958k5632J3668P227r019n074j8436J8239l322k4491
$$ 25926 30051 -2576 -3180 -5138 -30770 -17102 -9875 -18894 -23968 -42404 -24165 -27487 -51978
16128e1978R928J3742K1846K8782j1451p998K735J2955K7499j1198j4214j0217
$$ -51978 -42050 -28308 -6462 22320 10869 2871 5606 18561 46060 34862 20648 10431
16116A0431L535m609J5381j174j4287k1743q064j0642R352R906J8512J835l031
$$ 10431 13966 9357 24738 23564 9277 -12466 -20530 -31172 -21820 -11914 6598 8433 5402
16103E402m4375j5486J4978J9183R666K101P602J4774J889j7109P073K183k4395
$$ 5402 -38973 -54459 -39481 -20298 -10632 -8531 -929 13845 15734 -1375 5698 7881 -16514
16090a6514p436j5626J2712L3903K9428l496j9765p467J7334k626l6910L354L1929
$$ -16514 -23950 -39576 -26864 7039 36467 32971 13206 5739 23073 20447 -16463 -13109 18820
16077A8820j9385J0435j348k7718j2846j1020R040N771j4161l594L1804J7514
$$ 18820 -565 9870 8522 -19196 -32042 -43062 -34022 -28251 -42412 -46006 -14202 3312
16065C312n279j8056j9649m41J0747r21J914O261r830k6960P244N4929K1635j0646
$$ 3312 -1967 -20023 -39672 -40113 -29366 -30287 -28373 -22112 -31942 -58902 -51658 3271 24906 14260
16051A4260j2014N070k2885k1490L2282K1758k3085m841k5421o183R093K2595
$$ 14260 2246 7316 -15569 -37059 -4777 16981 -6104 -10945 -36366 -42549 -33456 -10861
16039a0861M8889j0480j4079j164J2459J529j0436j9476Q405K8791J2629p765
$$ -10861 38028 27548 13469 12305 24764 26293 15857 -3619 4786 33577 46206 38441
16027C8441k8106J4286J3285k641m415r447K263j0607j0948J1097j0011k9228
$$ 38441 10335 24621 37906 35265 30850 21403 23666 13059 2111 13208 3197 -26031
16015b6031o023M4384n523M287J5141K886k8971r922j5976M022O643r25L0605
$$ -26031 -32054 12330 6807 11094 26235 29121 150 -9772 -25748 -21726 -15083 -16008 14597
16002A4597Q723k93j9088k5283l2181J3765J3259Q822J3178K5987j9337k0590
$$ 14597 23320 23027 3939 -21344 -53525 -39760 -26501 -17679 -4501 21486 2149 -18441
15990a8441j4198L462J8404k830J2432q051L0568J756o377N866j4032m273j28
$$ -18441 -32639 -29177 -10773 -13603 -1171 -9222 21346 23102 16725 22591 8559 4286 4158
15977D158N710j063N026j8698L865K249l0679j3260K4630Q120J837J1441q370
$$ 4158 9868 8805 13831 -4867 -1002 1247 -29432 -42692 -18062 -9942 -8105 3336 -5034
15964e034Q945J1254r213R358K3233l5369j3676j167k1604J3732L9498l955j4880
$$ -5034 3911 15165 5952 15310 38543 3174 -10502 -11669 -33273 -19541 19957 16002 1122
15951A122r864o197j6312J923R746J9619J548k0338j9788J4282K8391J4634j3728
$$ 1122 -8742 -14939 -31251 -29328 -19582 37 1585 -18753 -38541 -24259 4132 18766 5038
15938E038m385m1535j9284J2286J3588k700Q421J6647P386j0202j2182j3486q63
$$ 5038 653 -40882 -60166 -47880 -34292 -36992 -28571 -11924 -4538 -14740 -26922 -40408 -41271
15925d1271K5638K2939j0314n669q233J549k234l70L685p99j3310l091l049J5802
$$ -41271 -15633 7306 -3008 -8677 -16910 -15361 -17595 -17965 -14280 -15079 -28389 -31480 -34529 -18727
15911a8727J3390K8103J3723r779k9188l0832k2264J7360J5367N284k3845K5807
$$ -18727 -5337 22766 36489 26710 -2478 -33310 -55574 -38214 -22847 -17563 -41408 -15601
15899a5601J7375q100j3924r081j9905l463N084J7024J0193j7000j7672q745Q312
$$ -15601 1774 -6326 -20250 -29331 -49236 -52699 -47615 -30591 -20398 -37398 -55070 -63815 -55503
15886e5503L5683O629j0384K2316J9474p533J1577m313J882N598P293j5328o120
$$ -55503 -19820 -13191 -23575 -1259 18215 10682 22259 17946 19828 25426 32719 17391 11271
15873A1271n248l8288k924K4872O686j3904l038K3742K1976K4993M1177Q86m2316
$$ 11271 6023 -32265 -35189 -10317 -3631 -17535 -20573 3169 25145 50138 91315 92201 49885
15860D9885k6006k1883k6062k4706N414K814O106J5042k1944M695P024p723j7363
$$ 49885 23879 1996 -24066 -48772 -43358 -40544 -34438 -19396 -41340 -36645 -29621 -37344 -54707
15847e4707p321j0219J9369K6812O335J6218O776J5130m807k8446j3039P990R206
$$ -54707 -62028 -72247 -52878 -26066 -19731 -3513 3263 18393 13586 -14860 -27899 -19909 -10703
15834a0703p251K0202J6547j5750o431l5454O535O69N009J4544j3387k198o840
$$ -10703 -17954 2248 18795 3045 -3386 -38840 -32305 -31636 -26627 -12083 -25470 -27668 -34508
15821c4508k306J4490Q432K0271j2200k7152l7647L6678K4597R01J156j5038k3679
$$ -34508 -36814 -22324 -13892 6379 -5821 -32973 -70620 -33942 -9345 -8444 -7288 -22326 -46005
15808d6005O86J7713K430P030j3548J0792J8476N562j0599k8859J1348L827J2280
$$ -46005 -45319 -27606 -25176 -18146 -31694 -20902 -2426 3136 -7463 -36322 -24974 -21147 -8867
15795h867M74n958j6647j942L0366M2793j7848l2789j8578j3424L291j3957k0170
$$ -8867 -8393 -14351 -30998 -32940 -2574 40219 22371 -10418 -28996 -42420 -39129 -53086 -73256
15782g3256P006K0070J3548K1521K7569M143k1768p489k3328J9394J3036m240
$$ -73256 -66250 -46180 -32632 -11111 16458 20601 -1167 -8656 -31984 -12590 446 -3794
15770c794k2661l5709j2425M3065K0128k685j7036j5811p429J7959m550j845p788
$$ -3794 -26455 -62164 -74589 -31524 -11396 -14081 -31117 -46928 -54357 -36398 -40948 -42793 -50581
15757e0581J9152L0112M839j4965k551j8853j496K4344N131j106K363p501k5241
$$ -50581 -31429 -1317 3522 -11443 -13994 -32847 -34343 -9999 -4868 -5974 -3611 -11112 -36353
15744c6353l2858k323L6005Q241J0124J9903m125l0798j747L4449j5396l7226
$$ -36353 -69211 -71534 -35529 -27288 -17164 2739 -1386 -32184 -33931 518 -14878 -52104
15732e2104j4795K8529O3613J1970j8469l0111j2047K1126J8484J1664J5931j6816
$$ -52104 -66899 -38370 25243 37213 18744 -11367 -23414 -2288 16196 27860 43791 26975
15720B6975j0774O662m958j1293q698j6459K056l0769o97j866m837O607K4726
$$ 26975 16201 22863 17905 6612 -2086 -18545 -16489 -47258 -47955 -49821 -54658 -48051 -23325
15707b3325O223q52o494j978j0506K1704J7755P781j5554o213N557l400r407k6441
$$ -23325 -17102 -17954 -24448 -26426 -36932 -15228 2527 10308 -5246 -11459 -5902 -9302 -18709 -45150
15693d5150j9233r092K3757J8431k0946P89K9763j5890K692p262j4089p44O116
$$ -45150 -64383 -73475 -49718 -31287 -52233 -51444 -21681 -37571 -34879 -42141 -56230 -56974 -50858
15680e0858J2071P855P174K3879j4525m939k0453k0610j3963K7223N0697L1682
$$ -50858 -38787 -30932 -23758 121 -14404 -19343 -39796 -60406 -74369 -47146 3551 35233
15668C5233q582j3093k6681k3718K6046K9760p426k0757j1891J5751j1486J3983
$$ 35233 26651 13558 -13123 -36841 -10795 18965 11539 -9218 -21109 -5358 -16844 -2861
15656b861M8606m1068n4743k5714P208J9579J7027J2968J1932J1908N425j8177
$$ -2861 45745 4677 -50066 -75780 -68572 -48993 -31966 -18998 -7066 4842 10267 -7910
15644g910j0830J2617l396j3682k2707m120J4705J0346j9484K12J4852N932q943
$$ -7910 -18740 -6123 -9519 -23201 -45908 -50028 -35323 -24977 -44461 -44249 -29397 -23465 -32408
15631c2408o738K4112Q27k0186L1610L5913j2072k8209j0023j3134k3925j2110
$$ -32408 -39146 -15034 -14207 -34393 -2783 33130 21058 -7151 -17174 -30308 -54233 -66343
15619f6343l688Q074N268J2211l42q64J4209J201J7232j5701j0480K0951L917
$$ -66343 -70031 -61957 -56689 -44478 -44820 -45684 -31475 -30274 -13042 -28743 -39223 -18272 -14355
15606a4355k394K561J7290k889p299k624O808J7716m951l0913j2181M479j4434
$$ -14355 -16749 -14188 3102 213 -7086 -9710 -2902 14814 9863 -21050 -33231 -28752 -43186
15593d3186R361O109o023O856J8771j8001J239k6922J3262K7396j6279j1357j4856
$$ -43186 -33825 -27716 -33739 -26883 -8112 -26113 -24874 -51796 -38534 -11138 -27417 -38774 -53630
15580e3630J7435K4593l17m060j467q67M00k866J0543M838R455k070J0556L0555
$$ -53630 -36195 -11602 -11919 -15979 -17446 -18313 -17913 -20779 -10236 -5398 4057 1987 12543 43098
15566D3098j7333m4868Q761M139P734m015k872k606l101N410J3965K5383J175
$$ 43098 25765 -19103 -10342 -6203 1531 -2484 -5356 -7962 -11063 -5653 8312 33695 34870
15553C4870n186j3002k3225k747K6249o069R22j794j51k7347j0598q58K4075N990
$$ 34870 29684 16682 -6543 -9290 16959 10890 11812 10018 9867 -17480 -28078 -28936 -4861 1129
15539A129j9075l60j6407k4490J1392L5479o647k889K5470J4386j484K591q625
$$ 1129 -17946 -18306 -34713 -59203 -47811 -12332 -18979 -21868 3602 17988 16504 19095 10470
15526A0470j0845J9180J176k1329l5264q938Q371K3480K333m667p755r201K2390
$$ 10470 -375 18805 19981 -1348 -36612 -45550 -37179 -13699 -11366 -16033 -23788 -32989 -10599
15513a0599O856K929R306J4694j5849j8814Q05j5760k316j672k065k951j7243
$$ -10599 -3743 -814 8492 23186 7337 -11477 -10672 -26432 -28748 -30420 -32485 -35436 -52679
15500e2679K1956R233j7593p260j6852O023J6871J9716L345J1596j2092p095J5811
$$ -52679 -30723 -21490 -39083 -46343 -63195 -57172 -40301 -20585 -17240 -5644 -17736 -24831 -9020
15487i020l296L0871L908k2968j3644P638j1394K872Q797J229J3699M246L777
$$ -9020 -12316 18555 22463 -505 -14149 -6511 -17905 -15033 -6236 -5007 8692 12938 16715
15474A6715j55k9074j8959j3567K22J2748J534R21L111j4283j3252O014K3728
$$ 16715 16560 -12514 -31473 -45040 -44818 -32070 -30536 -29615 -26504 -40787 -54039 -48025 -24297
15461b4297J0501N306J5718J3021k3663Q406K2775J323j0271j5938j9500j5857
$$ -24297 -13796 -8490 7228 20249 -3414 4992 27767 29090 18819 2881 -16619 -32476
15449c2476R338J1620k2454j1692K304M1895K405p574o20l603n69j5364k4291
$$ -32476 -23138 -11518 -33972 -45664 -43360 -1465 940 -6634 -7254 -10857 -11426 -26790 -51081
15436e1081j4976J9164J2382P471J1083L260K7330l2597m5939J2769M2312K0861
$$ -51081 -66057 -46893 -34511 -27040 -15957 -12697 14633 -17964 -63903 -51134 -8822 12039
15424A2039k5173j3013L613J0580j9670P609J2647j7173k1304J413R274K529K626
$$ 12039 -13134 -26147 -22534 -11954 -31624 -24015 -11368 -28541 -49845 -48432 -39158 -36629 -34003
15411c4003k381J3883K7579j0269j5913j5870K481m24J0652L350n775J6458J8972
$$ -34003 -36384 -22501 5078 -5191 -21104 -36974 -34493 -34917 -24265 -20915 -26690 -10232 8740
15398H740j6737r223N359O126j673j6576j4227p027j9692j0301J3213J146K4134
$$ 8740 -7997 -17220 -11861 -5735 -7408 -23984 -38211 -45238 -64930 -75231 -62018 -60872 -36738
15385c6738L1690j950j8636p888q798Q81n659K5001K2510n212j7155j6364o957
$$ -36738 -5048 -6998 -25634 -33522 -42320 -41439 -47098 -22097 413 -4799 -21954 -38318 -45275
15372d5275p252J8665K2076o774P109P065j5149l0300J3423O018J143J6326j7816
$$ -45275 -52527 -33862 -11786 -18560 -11451 -4386 -19535 -49835 -36412 -30394 -29251 -12925 -30741
15359c0741k0604J4782J3623o157J882K1437M619k0172k181M33j7029j1263K179
$$ -30741 -51345 -36563 -22940 -29097 -27215 -5778 -1159 -21331 -23512 -23079 -40108 -51371 -49192
15346d9192J2851j7252j7721j4317m239L4814K2077j4181J2071M3465o54N171
$$ -49192 -36341 -53593 -71314 -85631 -89870 -55056 -32979 -47160 -35089 8376 7722 12893
15334A2893k4332j2246N982m664K8919m689k6808J7777j4305k9889J1374l146
$$ 12893 -11439 -23685 -17703 -22367 6552 1863 -24945 -7168 -21473 -51362 -39988 -43134
15322d3134R760R877j7141l0950J6466K5040M732j2552j98n782J0845J2164p274
$$ -43134 -33374 -23497 -40638 -71588 -55122 -30082 -25350 -37902 -38100 -43882 -33037 -20873 -28147
15309b8147N43j7102p197J293J8489O083R032J8259j368J752m381r425l65M468
$$ -28147 -27604 -44706 -51903 -50610 -32121 -26038 -17006 1253 -115 1637 -2744 -12169 -12534 -8066
15295h066k4706J0583M33J6616P112N308J8301M000m15l0442p956l660P558l364
$$ -8066 -32772 -22189 -21756 -5140 1972 7280 25581 29581 29166 -1276 -9232 -12892 -5334 -8698
15281h698R587p104j2711j5780m373J1538Q78L379K658k2767o357L1296J0120
$$ -8698 889 -6215 -18926 -34706 -39079 -27541 -26663 -23284 -20626 -43393 -49750 -18454 -8334
15268h334J7615k803l9511j2723J0833O050M280j2630R945K1018K3994J2794p093
$$ -8334 9281 6478 -33033 -45756 -34923 -28873 -24593 -37223 -27278 -6260 17734 30528 23435
15255B3435l1745l0996k2695p182K6915L6003J2704k6581R239n420j0789K2292
$$ 23435 -8310 -39306 -62001 -69183 -42268 -6265 6439 -20142 -10903 -16323 -27112 -4820
15243d820p186j8426J0827j1283K990K3601P102q190k9807L195J4672j571r106
$$ -4820 -12006 -30432 -19605 -30888 -27898 -4297 2805 -5385 -35192 -31997 -17325 -18896 -28002
15230b8002M850p455J5700J2583j5706m7969q424K0123Q716n395j0447J2068J1353
$$ -28002 -23152 -30607 -14907 -2324 -18030 -65999 -74423 -54300 -45584 -50979 -61426 -49358 -38005
15217c8005R030M731j966K069m299N979k6994o618j7498K6622K3387J2813k3762
$$ -38005 -28975 -24244 -26210 -24141 -28440 -22461 -49455 -56073 -73571 -46949 -23562 -10749 -34511
15204c4511M048K5265J4376j715l487k4442j8945M518J0345M160J633l463j1068
$$ -34511 -30463 -5198 9178 7463 3976 -20466 -39411 -34893 -24548 -20388 -18755 -22218 -33286
15191c3286P999l2324k8683K3140M08j3575K3459J6693j0439j8796r775l68M875
$$ -33286 -25287 -57611 -86294 -63154 -62746 -76321 -52862 -36169 -46608 -65404 -75179 -75547 -70672
15178g0672L3103J6865K7274r58q431k0708j7928J9942J4649Lj7249n2766q746
$$ -70672 -37569 -20704 6570 5612 -2819 -23527 -41455 -21513 -6864 -6861 -24110 -76876 -85622
15165h5622K3091J8813J6252q910k3487P443K8121J7278j4324k981k5282j5999
$$ -85622 -62531 -43718 -27466 -36376 -59863 -52420 -24299 -7021 -21345 -24326 -49608 -65607
15153f5607J1294Q495J4778K0951Q676j8918k5775K5745J5449k1066m974o364
$$ -65607 -54313 -45818 -31040 -10089 -1413 -20331 -46106 -20361 -4912 -25978 -30952 -37316
15141c7316n993j2982M095j6083m631L4824K3560j8444j0297K4219m307k5873
$$ -37316 -43309 -56291 -52196 -68279 -72910 -38086 -14526 -32970 -43267 -19048 -23355 -49228
15129d9228j4491J1361K4049L2428j7339k5762J1293p055K165J4989m506m263
$$ -49228 -63719 -52358 -28309 4119 -13220 -38982 -27689 -34744 -32579 -17590 -22096 -26359
15117b6359j3146j3356K6067R936k7669K9867J6592k2970j2481K952K8691p447
$$ -26359 -39505 -52861 -26794 -16858 -44527 -14660 1932 -21038 -33519 -30567 -1876 -9323
15105i323k3263K0712J4746o200J5078j1568k6732m95L953Q775R287J6617L218
$$ -9323 -32586 -11874 2872 -3328 11750 182 -26550 -27045 -23092 -14317 -5030 11587 14805
15092A4805m2039q36j2565j62j3457l5203J8285N2793O967j2494J5759N347j8474
$$ 14805 -27234 -28070 -40635 -40797 -54254 -89457 -71172 -18379 -11412 -23906 -8147 -2800 -21274
15079b1274P244Q259L002j3671K0071O748j8578O897K2660k7822J98J4736m316
$$ -21274 -14030 -5771 -2769 -16440 3631 10379 -8199 -1302 21358 -6464 -6266 8470 4154
15066D154l780p205J3536J9333j0699j2800K139r345l461J3J4253P931n154N662
$$ 4154 374 -6831 6705 26038 15339 2539 4678 -4667 -8128 -8115 6138 14069 8915 14577
15052A4577P364j030N508j4922M19j3510Q754j7302K7914K7891l3234k51j5160
$$ 14577 21941 20911 26419 11497 11916 -1594 7160 -10142 17772 45663 12429 12178 -2982
15039b982k3510q919m867N57m469O841p944j6587R638K1881M456J494q574j47
$$ -2982 -26492 -35411 -40278 -39721 -44190 -37349 -45293 -61880 -52242 -30361 -25905 -24411 -32985 -33132
15025c3132J034j8008J6730m560J2767K4452n867j7100j540l555K0307n954lK0233
$$ -33132 -32098 -50106 -33376 -37936 -25169 -717 -6584 -23684 -25224 -28779 -8472 -14426 -14429 5804
15011E804m998L061m957m273p54j4289L88R473j1482k2796J873L478Q731R655
$$ 5804 806 3867 -1090 -5363 -6117 -20406 -20018 -10545 -22027 -44823 -42950 -39472 -30741 -21086
14997b1086p080Q225L1701J0834k6197J3653j8812k2036j2201J8102J6821R066
$$ -21086 -28166 -19941 11760 22594 -3603 10050 -8762 -30798 -42999 -24897 -8076 990
14985I90j875M885R528m431l2837k0429K1705K983R534n312J3702N231K530J870
$$ 990 -885 4000 13528 9097 -23740 -44169 -22464 -19481 -9947 -15259 -1557 3674 6204 8074
14971H074j6455K3792l944l9781R137l272k1323O881K4220r789j1987O057J483
$$ 8074 -8381 15411 11467 -28314 -19177 -22449 -43772 -36891 -12671 -22460 -34447 -28390 -26907
14958b6907j0302k6351q156L288j568J5711K7736N798p143J5081k1853k9628J749
$$ -26907 -37209 -63560 -71716 -68428 -69996 -54285 -26549 -20751 -27894 -12813 -34666 -64294 -62545
14945f2545j1496O085K2775J6733j7307Q257M817J020J0416K5181N639l1491p417
$$ -62545 -74041 -67956 -45181 -28448 -45755 -37498 -32681 -31661 -21245 3936 9575 -21916 -29333
14932b9333p532n899j3621j6954M0482K8506j8092j4564p796m323N084N692j741
$$ -29333 -36865 -42764 -56385 -73339 -32857 -4351 -22443 -37007 -44803 -49126 -44042 -38350 -40091
14919d0091K9892M6746k5811k4162K979m259m227l036p245n298K022j8831J3319
$$ -40091 -10199 36547 10736 -13426 -10447 -14706 -18933 -21969 -29214 -34512 -32490 -51321 -38002
14906c8002N824K376j366j1761L7384L6499j1732k0856k0845q285m566j2386J3350
$$ -38002 -32178 -29802 -31168 -42929 -5545 30954 19222 -1634 -22479 -30764 -35330 -47716 -34366
14893c4366J4759J0762M113L924O559j0729l051j1114j625J477K7186k53L440
$$ -34366 -19607 -8845 -4732 -808 5751 -4978 -8029 -19143 -20768 -19291 7895 7642 11082
14880A1082k825j6798L592j1208L7694L4608k6692l1832j6515N997q977J363J5618
$$ 11082 8257 -8541 -4949 -16157 21537 56145 29453 -2379 -18894 -12897 -21874 -20511 -4893
14867d893P936L480j0945n864M314K029k0065p654J9079k2754k4769n599K300
$$ -4893 3043 6523 -4422 -10286 -5972 -3943 -24008 -31662 -12583 -35337 -60106 -65705 -63405
14854f3405k1616K1549J5826J2313J7153p687Q971n721q812O482J9684K2219R218
$$ -63405 -85021 -63472 -47646 -35333 -18180 -25867 -16896 -22617 -31429 -24947 -5263 16956 26174
14841B6174l3846J1222O456k3292l452j3925j9726m05j1591r34L8793J2934j0674
$$ 26174 -7672 3550 10006 -13286 -16738 -30663 -50389 -50794 -62385 -63319 -24526 -11592 -22266
14828b2266k930J2128N38O148q296j7956k8384O078M552p87J5102M3613O79l1258
$$ -22266 -25196 -13068 -12530 -6382 -14678 -32634 -61018 -54940 -50388 -51175 -36073 7540 8219 -23039
14814b3039k220j6656m690J7000J4351j834j3219L6659K1l0540j6690j2045K1189
$$ -23039 -25259 -41915 -46605 -29605 -15254 -17088 -30307 6352 6373 -24167 -40857 -52902 -31713
14801c1713N443Q581R133j2316K781R834J3444j3432k2373j0527j3825j4456J9413
$$ -31713 -26270 -17689 -8556 -20872 -18091 -8257 5187 -8245 -30618 -41145 -54970 -69426 -50013
14788e0013J2261J3457m731k874j8258J0111K417J6112J4635J3511K0348k3545
$$ -50013 -37752 -24295 -29026 -31900 -50158 -40047 -37630 -21518 -6883 6628 26976 3431
14776C431k5527j8462o902J6162J7448J5223l2458j1070J1635k3994j7587k8247
$$ 3431 -22096 -40558 -47460 -31298 -13850 1373 -31085 -42155 -30520 -54514 -72101 -100348
14764a00348M0742L8692L8179J61j2117M03J4415j3759m635j0004J5417O574o556
$$ -100348 -59606 -20914 17265 17426 5309 5712 20127 6368 1733 -8271 7146 13720 7164
14751G164j6125K1502J1965j3422j2712k390j0127k2388l008p755n591k244J1705
$$ 7164 -8961 12541 24506 11084 -1628 -4018 -14145 -36533 -39541 -47296 -52887 -55131 -43426
14738d3426J5902J2756P425l030j341J4005o882j0677p160n298k320n633p143
$$ -43426 -27524 -14768 -7343 -10373 -11714 2291 -4591 -15268 -22428 -27726 -30046 -35679 -42822
14725d2822J8427J680l2073j2802J2363K4306N119p428j6316L268m912j0158p217
$$ -42822 -24395 -22715 -54788 -67590 -55227 -30921 -25802 -33230 -49546 -46278 -51190 -61348 -68565
14712f8565O737J7586K8888K952n771K787J1966k7288l1047P713K279K2825k70
$$ -68565 -61828 -44242 -15354 -12402 -18173 -15386 -3420 -30708 -61755 -54042 -51763 -28938 -29208
14699b9208N865Q330J1358k1227j8550J487L0094J7424L84j698L961j7763L8M014
$$ -29208 -23343 -15013 -3655 -24882 -43432 -41945 -11851 5573 5957 4259 8220 -9543 -9505 -5491
14685e491K180J3085K246K651J7019J8148J5382M6587L6455L2491M7350P4138
$$ -5491 -3311 9774 12020 14671 31690 49838 65220 111807 148262 180753 228103 302241
14673C02241L4468L797P264j2701n318j217n346k9522l7569l8323m5209k1665
$$ 302241 336709 340506 347770 335069 329751 328534 323188 293666 256097 217774 172565 150900
14661A50900l6088n5409k7724j5613r350k441K1046j0050k4672J263J7603j7394
$$ 150900 114812 59403 31679 16066 6716 4275 25321 15271 -9401 -8138 9465 -7929
14649g929k1880l078J0935J1197M45j9167k6097K3275M71k5k038K0143K668J3660
$$ -7929 -29809 -32887 -21952 -10755 -10310 -29477 -55574 -32299 -31828 -31853 -33891 -13748 -11080 2580
14635B580j4087r889l589M2934J3259k2384p531K457p438p370r710J7542Q821
$$ 2580 -11507 -21396 -24985 17949 31208 8824 1293 3750 -3688 -11058 -20768 -3226 5595
14622E595j1523j3753j4430k122J7585J413k9588k2322J2530K4474q277M854J6738
$$ 5595 -5928 -19681 -34111 -36233 -18648 -17235 -46823 -69145 -56615 -32141 -40418 -35564 -18826
14609a8826j2498j295P23O524P352j3744R784P410N061j1934j0487J4880k5022
$$ -18826 -31324 -32619 -31896 -25372 -18020 -31764 -21980 -14570 -9509 -21443 -31930 -17050 -42072
14596d2072l225K3075N065p104J335r29O608o517q052j6867j4552L0958K6116
$$ -42072 -45297 -22222 -17157 -24261 -22926 -23855 -17247 -23764 -31816 -48683 -63235 -32277 -6161
14583f161l10k1334k6288r952m972K5135J0954o971J8173J4727K893O386J8023
$$ -6161 -6471 -27805 -54093 -64045 -69017 -43882 -32928 -39899 -21726 -6999 -4106 2280 20303
14570B0303J6415r725l5612p947J3715m065k819Q048J1747J2522N470Q734m1043
$$ 20303 36718 26993 -8619 -16566 -2851 -6916 -9735 -1687 10060 22582 28052 36786 -4257
14557d257M619N2442J0299l667l5652k1355k819k628r639o04J0317K3477J2454
$$ -4257 362 52804 63103 59436 23784 2429 -390 -3018 -12657 -13261 -2944 20533 32987
14544C2987p038k1143r216K1747J5055L0760m773j6839j2317J2857j0287k3394
$$ 32987 25949 4806 -4410 17337 32392 63152 58379 41540 29223 42080 31793 8399
14532H399k0183j4976k546Q676M277o560n778J9839N364K0282l5j3040J0514l607
$$ 8399 -11784 -26760 -29306 -20630 -16353 -22913 -28691 -8852 -3488 16794 16759 3719 14233 10626
14518A0626j0167p014m151L136K8614o89n641K42P478J2646j0613l689J0070J2675
$$ 10626 459 -6555 -10706 -7570 21044 20355 14714 14956 22434 35080 24467 20778 30848 43523
14504D3523J6768k8484p995O255J30m563j6374j8417k454k709k4274O492K4519
$$ 43523 60291 31807 23812 30067 30197 25634 9260 -9157 -11611 -14320 -38594 -32102 -7583
14491g583J0795O444N40j0026j5354J1347O035j0300j1751j4082N236K7477J716
$$ -7583 3212 9656 10196 170 -15184 -3837 2198 -8102 -19853 -33935 -28699 -1222 494
14478D94k795J0682m3J2786j1554j2342p999l738j0134R443J2811J578q76q895
$$ 494 -2301 8381 8338 21124 9570 -2772 -10771 -14509 -24643 -15200 -2389 -811 -1687 -10582
14464a0582K871K0025j9163J0837J1576n850j1992o428j3921N791l04j552J5928
$$ -10582 -7711 12314 -6849 3988 15564 9714 -2278 -8706 -22627 -16836 -17140 -18692 -2764
14451b764J7068k997q983R734P118m020J3445j5364o266M700k7331k2522m746
$$ -2764 14304 11307 2324 12058 19176 15156 28601 13237 6971 11671 -15660 -38182 -42928
14438d2928J3722L4684J8228p76L117L6482N791l3797O963L6405K2538J5757M736
$$ -42928 -29206 5478 23706 22930 26047 62529 68320 34523 41486 77891 100429 116186 120922
14425A20922K530J5581J2214R09J1098N5607N5831O6596P6102J10159J67144K12450
$$ 120922 123452 139033 151247 152156 163254 218861 274692 341288 417390 527549 694693 907143
14413I07143K57593K45477K35332K08125J51246L2307n413r8640j96090k23418
$$ 907143 1164736 1410213 1645545 1853670 2004916 2037223 2031810 1933170 1737080 1513662
14403A513662k16056k12443k31172j65109j35039j39479r6826n5429o4421l6822
$$ 1513662 1297606 1085163 853991 688882 553843 414364 317538 262109 197688 160866
14393A60866j2497j0610L418j5031m7800k4371R348J791n978O239j2936K085J3895
$$ 160866 148369 137759 141177 126146 78346 53975 63323 65114 59136 65375 52439 54524 68419
14380F8419J291j4653j3781k1526L235l5611j5239J8124J8940j4045r726K4665
$$ 68419 69710 55057 41276 19750 22985 -12626 -27865 -9741 9199 -4846 -14572 10093
14368A0093Q047k1205j0022J6263l743K732J0471l1729j8224J9324J9782j5371
$$ 10093 18140 -3065 -13087 3176 -567 2165 12636 -19093 -37317 -17993 1789 -13582
14356a3582k955J6001J810J2776J4920k4156q965L520M321j3435Q300J0610j9144
$$ -13582 -16537 -536 1274 14050 28970 4814 -4151 -631 3690 -9745 -1445 9165 -9979
14343i979o459J8099m88j374p059r006k3774j7366K5348L1419L581Q34N407j766
$$ -9979 -16438 1661 1173 -201 -7260 -16266 -40040 -57406 -32058 -639 2942 3776 9183 7417
14329G417m418J721J8291j3820P482j6523l1035q849L7699J5215j1974K70q586
$$ 7417 2999 4720 23011 9191 16673 150 -30885 -39734 -2035 13180 1206 1476 -7110
14316g110P217k7252k2115K4369K0717k9608k8698r329J5618J7592j0384n014
$$ -7110 107 -27145 -49260 -24891 -4174 -33782 -62480 -71809 -56191 -38599 -48983 -53997
14304e3997J5117j8751p182O396M548j8568l988J1601K6427K0896K2125J5827
$$ -53997 -38880 -57631 -64813 -58417 -53869 -72437 -76425 -64824 -38397 -17501 4624 20451
14292B0451K257k1439k828J0467J9764j000j1934J755J6535O548J1215N547k9823
$$ 20451 22708 1269 -1559 8908 28672 27672 15738 17493 34028 40576 51791 57338 27515
14279B7515k596K8293K8795J8290M94q198O935K9142K0211N258J5188J9442K9921
$$ 27515 24919 53212 82007 100297 100791 92593 99528 128670 148881 154139 169327 188769 218690
14266B18690J3048L5894M2860L8049o461p346k3494n4733m6007o7367m4137j8241
$$ 218690 231738 267632 310492 348541 342080 334734 311240 256507 210500 143133 98996 80755
14254H0755l5419j2189r925k8144j2833k2448K799J3384L807l4736j8659K029
$$ 80755 45336 33147 23222 -4922 -17755 -40203 -37404 -24020 -20213 -54949 -73608 -71579
14242g1579m75Q477J3817K8091q302L089Q271J4126K1020O836L8205K1018N392
$$ -71579 -72054 -63577 -49760 -21669 -29971 -26882 -18611 -4485 16535 23371 61576 82594 87986
14229H7986O0K4770J9990J4431L0579K0773K3615M454k4004p400k032j3138k4769
$$ 87986 88046 112816 132806 147237 177816 198589 222204 226658 202654 195254 193222 180084 155315
14216A55315k9101j0613j6115j0030O885J3766n181j8272l4272J621j2666k2957
$$ 155315 126214 115601 99486 89456 96341 110107 104926 86654 52382 54003 41337 18380
14204A8380m295j6744k2083M085O107R473m927N267l169j4360n741P061M293J8488
$$ 18380 14085 -2659 -24742 -20657 -14550 -5077 -10004 -4737 -7906 -22266 -28007 -20946 -16653 1835
14190A835j514M787K0021J2945Q13J569L4371K8993m3295k2992Q276m657p646
$$ 1835 321 5108 25129 38074 38887 40456 74827 103820 60525 37533 45809 41152 33506
14177C3506R707k4003M412K957P511m94k2492j8425n731j7299K4108k528j6117
$$ 33506 43213 19210 23622 26579 34090 33596 11104 -7321 -13052 -30351 -6243 -8771 -24888
14164b4888j4665m679k0471J3117K8473K9425J4288j1900Q044J8208L6062J3176
$$ -24888 -39553 -44232 -64703 -51586 -23113 6312 20600 8700 16744 34952 71014 84190
14152H4190J375O529J5435J9191N806j7702n919K5197K4952j0654j0752k0376
$$ 84190 85565 92094 107529 126720 132526 114824 108905 134102 159054 148400 137648 117272
14140A17272Q859K4403J7950J2968N2328P522q293N694M7376L3916N3450Q4375
$$ 117272 126131 150534 168484 181452 233780 241302 233009 238703 286079 319995 373445 457820
14128D57820R4780J01239J02755J52987J99485K49642L41563M42759O13673Q12025
$$ 457820 552600 653839 756594 909581 1109066 1358708 1700271 2143030 2756703 3568728
14118C568728Q93829R94713J102232J119763R97271P54149N15902K23328j02787
$$ 3568728 4462557 5457270 6559502 7679265 8676536 9430685 9946587 10169915 10067128
14109A0067128m53640p85924r76490j048196j061235j032734r68597p94436o11290
$$ 10067128 9613488 8827564 7851074 6802878 5741643 4708909 3740312 2945876 2334586
14100B334586m49369k79541j76607j11585j06008m8695j6119q535p5223r7723
$$ 2334586 1885217 1605676 1429069 1317484 1211476 1162781 1146662 1138127 1062904 965181
14090I65181n5482o0279p2675r8923r5583o9354p9487m8088l6405l6334j841M390
$$ 965181 909699 849420 776745 677822 582239 512885 433398 385310 348905 312571 310730 315120
14078C15120Q748L5831J0394p286K4718M1287K4735J9946L8227M2255O4519Q7057
$$ 315120 323868 359699 370093 362807 387525 428812 453547 473493 511720 553975 618494 705551
14066G05551J07459J84298K36230L93093N92287P23649O76633K77853k13224n30428
$$ 705551 813010 997308 1233538 1626631 2218918 2942567 3619200 3897053 3683829 3153401
14056C153401o48270n78043m34053k96362j98213j26759j17315q2656m4615p363
$$ 3153401 2505131 1927088 1493035 1196673 998460 871701 754386 671730 627115 619752
14046F19752j4338k8569l2079k405J8485J0939p546l138K729Q442Q322O448q862
$$ 619752 605414 576845 544766 542361 560846 571785 564239 561101 563830 572272 580594 587042 578180
14033E78180n419L2271m195K0713L2830J3804J2545J694K0823N4875O6193L0077
$$ 578180 572761 605032 600837 621550 654380 668184 680729 682423 703246 758121 824314 854391
14021H54391M4302L5934N2506N8292O3937Q2724O2278K7865N4601O8110M5454
$$ 854391 898693 934627 987133 1045425 1109362 1192086 1254364 1282229 1336830 1404940 1450394
14010A450394N1155J11401J04475J06509J28959J45899J49498J60441J68004J77269
$$ 1450394 1501549 1612950 1717425 1823934 1952893 2098792 2248290 2408731 2576735 2754004
14000B754004J59902J71272J88530J67890J83572K28902K40763K08995K17510
$$ 2754004 2913906 3085178 3273708 3441598 3625170 3854072 4094835 4303830 4521340
13991D521340K47316K83676L75781M54096N52703P04742Q75677J059754J308025
$$ 4521340 4768656 5052332 5428113 5882209 6434912 7139654 8015331 9075085 10383110
13982A0383110J598665J910627K316467K727945L129361L557685M099231M843785
$$ 10383110 11981775 13892402 16208869 18936814 22066175 25623860 29723091 34566876
13974C4566876O004187P882207J0974227J5862858K2983819L1946723M0681134
$$ 34566876 40571063 48453270 59427497 75290355 98274174 130220897 170902031
13967A70902031M6565401M9002062M7964732M1678643K9840099J5112591j087775
$$ 170902031 217467432 266469494 314434226 356112869 385952968 401065559 399977784
13960C99977784j8656017l4156441m3346728m6777331m6423624m2968107l6939926
$$ 399977784 381321767 347165326 303818598 257041267 210617643 167649536 130709610
13953A30709610k9735232k2605258j6448575j1806988q605574o474241n069947
$$ 130709610 100974378 78369120 61920545 50113557 41507983 35033742 29963795
13946B9963795m125362l436103k929578k551860k152491j778181j503204j275381
$$ 29963795 25838433 22402330 19472752 16920892 14768401 12990220 11487016 10211635
13938A0211635j058259q68285p46574o75445o26287n57140m85785m44859l93861
$$ 10211635 9153376 8285091 7538517 6863072 6236785 5679645 5193860 4749001 4355140
13929D355140l47575k49104k08828j78368j23999j37793j03079r8853r4395r3708
$$ 4355140 4007565 3758461 3549633 3371265 3247266 3109473 3006394 2907541 2813146 2719438
13919B719438p8881q5769j05715q7284o5646m2376l8583k8667o6993q1302n7502
$$ 2719438 2640557 2554788 2449073 2361789 2296143 2253767 2215184 2186517 2119524 2038222 1980720
13908A980720m6867m6120n3955m3585l8087q8864q2588m4142q5928n5787l3973
$$ 1980720 1933853 1887733 1833778 1790193 1752106 1663242 1580654 1536512 1450584 1394797 1360824
13897A360824r136j4035n5484k5994k3357n6479n9285k0533k1137l9378m7716
$$ 1360824 1351688 1337653 1282169 1256175 1232818 1176339 1117054 1096521 1075384 1036006 988290
13886I88290m1657m4537l3100k8476j8813k1343k5585j9319j1005o072j3993p888
$$ 988290 946633 902096 868996 840520 821707 800364 774779 755460 744455 738383 724390 716502
13874G16502j2105j9884N948j141J2136k6147L896l890j6135n553N859j8662m761
$$ 716502 704397 684513 690461 689320 701456 675309 679205 675315 659180 653627 659486 640824 636063
13861F36063j3890j648j1041k6266k2067K3771Q962r175J4767m478j3613R648
$$ 636063 622173 620525 609484 583218 561151 584922 593884 584709 599476 594998 581385 591033
13849E91033J2590J430j5737r810k2796O219L0473K1789J4373J7639J1825R281
$$ 591033 603623 605053 589316 579506 556710 562929 593402 615191 629564 647203 659028 668309
13837F68309K1659M203j4483j1193j6083J5953q282j1600l7053l2424l3360l5346
$$ 668309 689968 694171 679688 668495 652412 668365 660083 648483 611430 579006 545646 510300
13825E10300l5069j4160j4830l8896k8315r373N157k5929k2645k7162k0165j1313
$$ 510300 475231 461071 446241 407345 379030 369657 374814 348885 326240 299078 278913 267600
13813B67600k6388o5958n9032l6207l6355l4903n9627l5078j2172l293M5677N4948
$$ 267600 241212 175254 116222 80015 43660 8757 -50870 -85948 -98120 -101413 -55736 -788
13801g88M8455L2526L1767M2050L7705R252K9604Q674o281J260J0384m758Q259
$$ -788 47667 80193 111960 154010 191715 200967 230571 239245 232964 234224 244608 239850 248109
13788B48109m560q4J6886Q079j7399j6207m467j7589m005j0673p507r265J703
$$ 248109 243549 243465 260351 268430 251031 234824 230357 212768 208763 198090 190583 181318 183021
13775A83021M769P744J6371m489K929K3267O428K5076J7002j5566J6n799j4875
$$ 183021 187790 195534 211905 207416 210345 233612 240040 265116 282118 266552 266568 260769 245894
13762B45894k0814j0647K9195o625r32J0622m4630n3496r833J5198j0874m6886
$$ 245894 225080 214433 243628 237003 236071 246693 202063 148567 138734 153932 143058 96172
13750I6172l710J0967M3899K3210j1867M440l4073j7420J3878J5624L189J1925
$$ 96172 92462 103429 147328 170538 158671 163111 129038 111618 125496 141120 144309 156234
13738A56234K4703K2000j7150m4102l71P853N261q123J5553L2472q692q68L5150
$$ 156234 180937 202937 185787 141685 141314 149167 154428 146305 161858 194330 185638 184770 219920
13725B19920N328q408j9451J6050o781j2019j7319o024j2010j5396j101j878K0729
$$ 219920 225248 216840 197389 213439 206658 194639 177320 171296 159286 143890 142789 140911 161640
13712A61640Q274m017j0973l2189J3327J1101j1927k3392P126K3652j2959k3365
$$ 161640 169914 165897 154924 122735 136062 147163 135236 111844 118970 142622 129663 106298
13700A06298K0870J9338j4895O949o734k7543r396J9331K4869N391j2495m1214
$$ 106298 127168 146506 131611 138560 131826 104283 94887 114218 139087 144478 131983 90769
13688I0769r279Q704K8145K9875P434K6602j1796n495k7506K0059j759p836K3616
$$ 90769 81490 90194 118339 148214 155648 182250 170454 164959 137453 157512 155753 147917 171533
13675A71533J1137l8802j3213j2135Q61k3554k8418m1850j3425R414l3780l1344
$$ 171533 182670 143868 130655 118520 119381 95827 67409 25559 12134 21548 -12232 -43576
13663d3576l0305M441J8412r68r29K7674J6094Q474J4807J2507j5576o70P65j3851
$$ -43576 -73881 -69440 -51028 -51996 -52925 -25251 -9157 -683 14124 26631 11055 10385 11150 -2701
13649b701p189L6141J6346J5411J3039J0952m332J802K0139k1390l440m666k3994
$$ -2701 -9890 26251 42597 58008 71047 81999 77667 79469 99608 78218 74778 70112 46118
13636D6118o739J8924k2223j0375R746J9902K8708Q649O952r596j5457l652Q905
$$ 46118 39379 58303 36080 25705 35451 55353 84061 92710 99662 90066 74609 70957 79862
13623G9862R249l3009j0653R166K2792J0939m889j1036n427r02p203J4546N370
$$ 79862 89111 56102 45449 54615 77407 88346 83457 72421 66994 66092 58889 73435 78805
13610G8805J835Q326N816k1393J109K3652Q192O334j1015k2686p687J757j6944
$$ 78805 80640 88966 94782 73389 74498 98150 106342 112676 101661 78975 71288 73045 56101
13597E6101m2544J1153m340p958K3220j0766K8132Q3J1906j3892p314q878Q61
$$ 56101 13557 24710 20370 12412 35632 24866 52998 53081 64987 51095 43781 34903 35764
13584C5764K3725N855j0848j1342M848J7212J443p611k0411M872M997R896k2597
$$ 35764 59489 65344 54496 43154 48002 65214 66657 59046 38635 43507 48504 58400 35803
13571C5803o229j7501N851k496J0221J8367K818k55j150J1559l749m788L6153
$$ 35803 29574 12073 17924 15428 25649 44016 46834 46579 45429 56988 53239 48451 84604
13558H4604J2677k0575k8635L723N1034K5820Q801k550l5527k1180j7027j8792
$$ 84604 97281 76706 48071 51794 102828 128648 137449 134899 99372 78192 61165 42373
13546D2373k2695j2231Q552M6458O452k3025J9148J3794k0173k1631j9161p311
$$ 42373 19678 7447 15999 62457 68909 45884 65032 78826 58653 37022 17861 10550
13534A0550P654J6673K6266L0794J610k845J6252K0610j6079K1565M3188L6830
$$ 10550 18204 34877 61143 91937 93547 90702 106954 127564 111485 133050 176238 213068
13522B13068K8798P358K6202O1317J19459J37138J41628K04414K41509K60271
$$ 213068 241866 249224 275426 336743 456202 593340 734968 939382 1180891 1441162
13512A441162K55469J96424J18333O3524l18r7463j84974k13347k23495k56065
$$ 1441162 1696631 1893055 2011388 2074912 2074594 1977131 1792157 1578810 1355315 1099250
13502A099250k38276j75128j41705j17817j04613l8838j5954l9230o3463j1608
$$ 1099250 860974 685846 544141 426324 321711 282873 266919 227689 164226 152618
13492A52618j0901l1506j2585j0454r013Q1J751j8177p944N875j5476j2202r763
$$ 152618 141717 110211 97626 87172 78159 78240 79991 61814 53870 59745 44269 32067 22304
13479B2304J0464O819k0260l4583q060J5568m605k3345j1483J9966L1980M208
$$ 22304 32768 39587 19327 -15256 -23316 -7748 -12353 -35698 -47181 -27215 4765 8973
13467H973j6637O875j5836j0613J1629O741M732N659j7677J9299J8633J3333l253
$$ 8973 -7664 -789 -16625 -27238 -15609 -8868 -4136 1523 -16154 3145 21778 35111 31858
13454C1858K2503J172J6786J0728j9986n9119l5976m05P901L2322K4934O031N309
$$ 31858 54361 55533 72319 83047 63061 3942 -32034 -32439 -24538 7784 32718 38749 44058
13441D4058L777k6683l0535j6030K2093J0076j6608j0959K1562K4734o131j4660
$$ 44058 47835 21152 -9383 -25413 -3320 6756 -9852 -20811 751 25485 19354 4694
13429D694P471n603P114K541m695j6583j6977k589J5069M4626J1645m0025Q346
$$ 4694 12165 6562 13676 16217 11522 -5061 -22038 -24627 -9558 35068 46713 6688 15034
13416A5034J9387k3450m304O788n261J0966p157k1063J3247j163j395j8839J0729
$$ 15034 34421 10971 6667 13455 8194 19160 12003 -9060 4187 3024 1629 -17210 -6481
13403f481K6347K350j291o671j4307l137K3471j9471J986K7912k9363q743K7462
$$ -6481 19866 22216 20925 14254 -53 -3190 20281 810 2796 30708 1345 -7398 20064
13390B0064L776O713k9907L7023M2209L403k5620j3671n402j8873k3235J8038
$$ 20064 23840 30553 646 37669 79878 83281 57661 43990 38588 19715 -3520 14518
13378A4518J6323K3014k6013n7243K0327K6307J8198k0367j8393k427M639j8205
$$ 14518 30841 53855 27842 -29401 -9074 17233 35431 15064 -3329 -5756 -1117 -19322
13366a9322l241k9606N42K5828K3235M182K445o974J7926J5041K538k8871m850
$$ -19322 -22563 -52169 -51627 -25799 -2564 1618 4063 -2911 15015 30056 32594 3723 -1127
13353a127J0109P363q119J4062p892m875P091M557R251J989R957p379K3468J719
$$ -1127 8982 16345 8226 22288 14396 9521 16612 21169 30420 32409 42366 34987 58455 60174
13339F0174k8345l0789j1912r125j46j5891L859L4983j2105l0145K1915L730j5302
$$ 60174 31829 1040 -10872 -19997 -20143 -36034 -32175 2808 -9297 -39442 -17527 -13797 -29099
13326b9099o234O143N2489N976j9299J3285J2779j7381j9882J89O322P34j0612
$$ -29099 -35333 -29190 23299 29275 9976 23261 36040 18659 -1223 -1034 5288 6022 -4590
13313d590P419p366K981L5591J8262l4468l9859k917K3114R260O856J0798j8889
$$ -4590 2829 -4537 -1556 34035 52297 17829 -22030 -24947 -1833 7427 14283 25081 6192
13300F192o89j6369R78K8858K4585K1992j8937k2892N15l3522k640n002j9260
$$ 6192 5503 -10866 -9888 18970 43555 65547 46610 23718 24233 -9289 -11929 -16931 -36191
13287c6191l3744M603o391K81J4858J9321J0046m150Q571P054K267O739L4990
$$ -36191 -69935 -65332 -71723 -71442 -56584 -37263 -27217 -31367 -22796 -15742 -13475 -6736 28254
13274B8254K5228k2470j0093J4867J6083j7669l2215L728n34m108q259Q690k0428
$$ 28254 53482 31012 20919 35786 51869 34200 1985 5713 5179 1071 -7188 1502 -18926
13261a8926l902L5916q503k9332j9222Q578J0758P293N099O858j5921k2301p145
$$ -18926 -22828 13088 4585 -24747 -43969 -35391 -24633 -17340 -12241 -5383 -21304 -43605 -50750
13248e0750J7775J8859K310J5371j5566k3294j0166K9899L9567K6251k5817m5327
$$ -50750 -32975 -14116 -11806 3565 -12001 -35295 -45461 -15562 24005 50256 24439 -20888
13236b0888k3953J6512K1904Q687j246Q82J9219M69k5655q083J9574o795J7963
$$ -20888 -44841 -28329 -6425 2262 1016 1898 21117 21586 -4069 -12152 7422 627 18590
13223A8590M8426j791j3351l1851k6305J057M611J7595J6852O483j5030k153M774
$$ 18590 67016 65225 51874 20023 -6282 -5225 -614 16981 33833 40316 25286 23133 27907
13210B7907k7060p125l184j1243R45q155O465J4103j8714l699K2271J0240K3943
$$ 27907 847 -6278 -9462 -20705 -19760 -27915 -21450 -7347 -26061 -29760 -7489 2751 26694
13197B6694P018L751K448j9317j720o81M921p514K648j7170k355K3387L087R674
$$ 26694 33712 37463 39911 20594 18874 18193 23114 15600 18248 1078 -1277 22110 25197 34871
13183C4871j8552k7331L10L866r009k233K310J1346m843j3580p856J4006P907
$$ 34871 16319 -11012 -10702 -6836 -15845 -18078 -15768 -4422 -9265 -22845 -30701 -16695 -8788
13170h788N919j1170p910k813J1962M334M987R23o507L1897j65l0660Q112n737
$$ -8788 -2869 -14039 -21949 -24762 -12800 -8466 -3479 -2556 -9063 22834 22669 -7991 121 -5616
13156e616j5420j010J3166J534j5137k32N012m956Q099J4j0501N66O320J6096
$$ -5616 -21036 -22046 -8880 -7346 -22483 -22715 -17703 -22659 -14560 -14546 -25047 -24481 -18161 -2065
13142b065M0207j0416k8902j7883J5347K4914K5766r437m395l0126L864J3827
$$ -2065 38142 27726 -1176 -19059 -3712 21202 46968 37531 33136 3010 6874 20701
13130B0701n651p0P510J1423m905k6835j922K5851m125Q850j7472k7529j7277
$$ 20701 15050 14980 22490 33913 29008 2173 251 26102 21977 30827 13355 -14174 -31451
13117c1451o597J2826j3116J2819K7235q185J624P629n405q092m691j8488j6695
$$ -31451 -38048 -25222 -38338 -25519 1716 -6469 -4845 2784 -2621 -10713 -15404 -33892 -50587
13104e0587j2305k9R001L580M1787n508r373J1990J0312K526j6102j1600L150
$$ -50587 -62892 -62921 -53920 -50340 -8553 -14061 -23434 -11444 -1132 1394 -14708 -26308 -23158
13091b3158K5076K3413q870J1648J5020j6170k6237p265J7529M1071N499j5277
$$ -23158 1918 25331 16461 28109 43129 26959 722 -6543 10986 52057 57556 42279
13079D2279j8248m0930m192J3156p933J0094j578j4727k8839P615K3521n99p138
$$ 42279 24031 -16899 -21091 -7935 -15868 -5774 -7352 -22079 -50918 -43303 -19782 -20381 -27519
13066b7519P697q574L9324K016N63r862l1135j7430J4318J2859M6887L644l3939
$$ -27519 -19822 -28396 10928 12944 13507 3645 -27490 -44920 -30602 -17743 29144 32788 -1151
13053a151N549K1959j4252R056l4067j9202K3518J6544J9809j9686k2790L302
$$ -1151 4398 26357 12105 21161 -12906 -32108 -8590 7954 27763 8077 -14713 -11411
13041a1411k828N524J3700J5779j7655r223o120k959K2298L2359J3452K3603l720
$$ -11411 -14239 -8715 4985 20764 3109 -6114 -12234 -15193 7105 39464 52916 76519 72799
13028G2799j5941k440j4664p165L184j3878k8502J7571R818p165P800Q225M564
$$ 72799 56858 54418 39754 32589 35773 21895 -6607 10964 20782 13617 21417 29642 34206
13015C4206k1918L347O19K0901M666k3590k1833k5953j0958Q121J2257k026k4186
$$ 34206 12288 15635 16254 37155 41821 18231 -3602 -29555 -40513 -32392 -20135 -22161 -46347
13002d6347j646K3619J8427R888O088j0045k7108p815J1021O665R198l694r594
$$ -46347 -47993 -24374 -5947 3941 10029 -16 -27124 -34939 -23918 -17253 -8055 -11749 -21343
12989b1343J608K0193O701o494j346j959k0343J0213J7844L1563p286m813Q068
$$ -21343 -19735 458 7159 665 -681 -2640 -22983 -12770 5074 36637 29351 24538 32606
12976C2606q497K2154j8851p566J5038j919J2016K95k0654J7994K85k6452j358
$$ 32606 24109 46263 27412 19846 34884 32965 44981 45276 24622 42616 42901 16449 15091
12963A5091J316j342j7612M387K1654j7064m155Q034R11P652m8921n606R318R59
$$ 15091 16407 15065 -2547 1840 23494 6430 2275 10309 11220 18872 -30049 -35655 -26337 -25378
12949b5378M865K9698R399L170k2858J0193L466k0378o12r77k3515l2660j2119
$$ -25378 -20513 9185 18584 21754 -1104 9089 12555 -7823 -8435 -9412 -32927 -65587 -77706
12936g7706J0716J7951K6968L2613M281j8785j2822l147O695R404Q58r910k897
$$ -77706 -66990 -49039 -22071 10542 14823 -3962 -16784 -19931 -13236 -3832 -2974 -12884 -15781
12923a5781k4667k7031P575J8223J7603j1590j0103J036P755j5691k527J758M4538
$$ -15781 -40448 -67479 -59904 -41681 -24078 -35668 -45771 -44735 -36980 -52671 -55198 -53440 -8902
12910h902J0312k2403j5461m821M774N461J3097J2313k2589p384j2232r646R445
$$ -8902 1410 -20993 -36454 -41275 -36501 -31040 -17943 -5630 -28219 -35603 -47835 -57481 -48036
12897d8036J8011Q620J6095J7749k3249j1465J1484J2866j2462n322k9530j1475
$$ -48036 -30025 -21405 -5310 12439 -10810 -22275 -10791 2075 -10387 -15709 -45239 -56714
12885e6714j304p344J9486l811p274K8777N1762J0725j0911m6316k5478m841K4549
$$ -56714 -58018 -65362 -45876 -49687 -56961 -28184 23578 34303 23392 -22924 -48402 -53243 -28694
12872b8694K5398N950p530o994r504p002J2988J7637M137J5503J3765J4201j1516
$$ -28694 -3296 2654 -4876 -11870 -21374 -28376 -15388 2249 6386 21889 35654 49855 38339
12859C8339l6623n219P638j2006J2225j0702q326l847n758k4268Q525K4264j1918
$$ 38339 1716 -3503 4135 -7871 4354 -6348 -14674 -18521 -24279 -48547 -40022 -15758 -27676
12846b7676J0397N865L747j1490n385l1172R917J8969O663K4180r241m813K640
$$ -27676 -17279 -11414 -7667 -19157 -24542 -55714 -45797 -26828 -20165 4015 -5226 -10039 -7399
12833g399j6083l127Q003J5096q226O179M741j2186j0235K615Q640n36K99J0009
$$ -7399 -23482 -26609 -18606 -3510 -11736 -5557 -816 -13002 -23237 -20622 -11982 -12518 -12219 -2210
12819b210J1136k2727j5266Q086L597o875J2258J1580j2389P969r009J4750J3838
$$ -2210 8926 -13801 -29067 -20981 -17384 -24259 -12001 -421 -12810 -4841 -13850 900 14738
12806A4738j1900j6682k8452o911K1124J934J7778Q100j157l365O278P718M33
$$ 14738 2838 -13844 -42296 -49207 -28083 -26149 -8371 -271 -1428 -4793 1485 9203 9636
12793I636n855k4683J2348K3514r997k2460J588K3142K2987O249j7124k5708k7574
$$ 9636 3781 -20902 -8554 14960 4963 -17497 -15909 7233 30220 36469 19345 -6363 -33937
12780c3937J452J2798O188o774M842q565j3227K0687L4897N278P85j1914P878
$$ -33937 -32485 -19687 -13499 -20273 -15431 -23996 -37223 -16536 18361 23639 24424 12510 20388
12767B0388m69M780J2117o615r145J590Q237Q114J503m833K888O210n922l3980
$$ 20388 19919 24699 36816 30201 21056 22646 30883 38997 40500 35667 38555 44765 38843 4863
12753D863j8569L806J5901l586K209k4695m538K6833J5237k2857Q70l660O52P151
$$ 4863 -13706 -9900 6001 2415 4624 -20071 -24609 2224 17461 -5396 -4526 -8186 -7534 -383
12739c83Q011k0110k2276j1052J4142O773j6584N39l785n026Q597J0617k0027
$$ -383 7628 -12482 -34758 -45810 -31668 -24895 -41479 -40940 -44725 -49751 -41154 -30537 -50564
12726e0564n371K9676J5859J0672r261k8003J759K2445K2512j2784j0779O005
$$ -50564 -55935 -26259 -10400 272 -8989 -36992 -35233 -12788 9724 -3060 -13839 -7834
12714g834O531k044L620p5R557k9136k5497J1328K3435J2249l461o440l291L121
$$ -7834 -1303 -3347 273 198 9755 -19381 -44878 -33550 -10115 2134 -1327 -7767 -11058 -7937
12700g937K6441J4570l955J9080q363K484j9596j1405K188m654j0082O209j7709
$$ -7937 18504 33074 29119 48199 39836 42320 22724 11319 13507 8853 -1229 4980 -12729
12687a2729j861k2745p907K4391j0026L251J3844K4490L021r745o907o229K1590
$$ -12729 -14590 -37335 -45242 -20851 -30877 -27626 -13782 10708 13729 3984 -2923 -9152 12438
12674A2438K4827J018M68j6512J3777J9469K4330J4990L3344L5495N128l828p233
$$ 12438 37265 38283 38751 22239 36016 55485 79815 94805 128149 163644 168772 164944 157711
12661A57711j9720J6607j1644l7279l4111r117K921q579k2168J4475k926k0075
$$ 157711 137991 154598 142954 105675 71564 62447 65368 56789 34621 49096 46170 26095
12649B6095k2382N577K6208j5002k6675j7128K8050M640j0222J1167K4550J1939
$$ 26095 3713 9290 35498 20496 -6179 -23307 4743 9383 -839 10328 34878 46817
12637D6817j0092J211R510R646L9245N0202M8905J9939J0601r083O811l4110l7549
$$ 46817 36725 37936 47446 57092 96337 146539 195444 215383 225984 216901 223712 189602 152053
12624A52053L504j5241l2201j8355l091k7939l1678j7216P429P765n378j1779
$$ 152053 155557 140316 108115 89760 86669 58730 27052 9836 17265 25030 19652 7873
12612G873J436j407J0903K2806O074r928l3353J1934L2166L3673J2570k1197l0149
$$ 7873 9309 7902 18805 41611 47685 37757 4404 16338 48504 82177 94747 73550 43401
12599D3401Q770J6139J140J1120l009L7331K8678j1803j4670n201j2834m1171
$$ 43401 52171 68310 69450 80570 77561 114892 143570 131767 117097 111896 99062 57891
12587E7891R126k2706p654j8407O903q846k6587r290R492K4624L091j5617l090
$$ 57891 67017 44311 36657 18250 25153 16307 -10280 -19570 -10078 14546 17637 2020 -1070
12574a070o714Q01Q09K8847J7561l827j9450j3716j5942J0032r784K0396K2037
$$ -1070 -7784 -6983 -6174 22673 40234 36407 16957 3241 -12701 -2669 -12453 7943 29980
12561B9980j2687k4735N243J3531J7896j9983p691R682J8303J1743j5318j7693
$$ 29980 17293 -7442 -2199 11332 29228 9245 1554 11236 29539 41282 25964 8271
12549H271J9633K8263j8992l0624J1645J1965l8824j0062J0434k986l690J5965
$$ 8271 27904 56167 37175 6551 18196 30161 -8663 -18725 -8291 -11277 -14967 998
12537I98L721J4866j0354L876J3595Q502L066O733R402O223K1812j2215q791m256
$$ 998 4719 19585 9231 13107 26702 35204 38270 45003 54405 60628 82440 70225 61434 57178
12523E7178J0881K50M243j8920J2578K701n579L320j5766M875Q248o65N875J796
$$ 57178 68059 68309 72552 53632 66210 68911 63332 66652 50886 55761 64009 63344 69219 71015
12509G1015k7547j8301P216o223K2045q059K883K2747J5040j7290R856J656K0491
$$ 71015 43468 25167 32383 26160 48205 40146 43029 65776 80816 63526 73382 75038 95529
12496I5529J7900N772J4976K2509L6547N2232L9879m846J4119M8613L8087P9765
$$ 95529 113429 119201 134177 156686 193233 245465 285344 280498 294617 343230 381317 461082
12484D61082J51601J65734K18514K26761K06323J97277J65728Q3873L1498p7540
$$ 461082 612683 778417 996931 1223692 1430015 1627292 1793020 1876893 1908391 1830851
12474A830851j44585j68594j97737k13337k05777j68320j44318j05523q1935p0424
$$ 1830851 1686266 1517672 1319935 1106598 900821 732501 588183 482660 400725 330301
12464C30301n2835k9629k6380j9938Q761q901l9055k0851J0819k0086m630k2213
$$ 330301 277466 247837 221457 201519 210280 201379 162324 141473 152292 132206 127576 105363
12452A05363l3156K5504L60j5563j7618K0303J6304j8747l2576J5614j7605j2343
$$ 105363 72207 97711 98071 82508 64890 85193 101497 82750 50174 65788 48183 35840
12440C5840K1772J4582k0845j0779J9607J3124M420o307j5388J4384K8611J2950
$$ 35840 57612 72194 51349 40570 60177 73301 77721 71414 56026 70410 99021 111971
12428A11971o966l63n457M647J0460k691j6974r208J9515J9467k8978k5551J2588
$$ 111971 105005 104642 99185 103832 114292 111601 94627 85419 104934 124401 95423 69872 82460
12415H2460J0437q564K7872J8703J6671K3098K5534K7648R937j5114l4937j8793
$$ 82460 92897 84333 112205 130908 147579 170677 196211 223859 233796 218682 183745 164952
12403A64952j6603K5231k0843L1254K6067Q516p065R703J3939L1999L4870K8532
$$ 164952 148349 173580 152737 183991 210058 218574 211509 221212 235151 267150 302020 330552
12391C30552M8114R3903J26069J54775J20035N7480K4610j9508q9595r1212q7846
$$ 330552 378666 472569 598638 753413 873448 930928 955538 936030 846435 755223 667377
12380F67377k8929l2287k1228K0282J8213L1763Q852J8765M1627K7458M2570K2484
$$ 667377 638448 606161 584933 605215 623428 655191 664043 682808 724435 751893 794463 816947
12368H16947K2730N5566M3963O013O47P735j818j0752O121K6754M0834R1342J04917
$$ 816947 839677 895243 939206 945219 945866 953601 951783 941031 947152 973906 1014740 1106082 1210999
12355A210999J13507J08717Q9286Q6821O5957J1755n3664j00156j22682j42705
$$ 1210999 1324506 1433223 1522509 1609330 1675287 1687042 1633378 1533222 1410540 1267835
12345A267835j55557p8676m3297r3717p7784l1559j4299R358M2855J6935l6081
$$ 1267835 1112278 1033602 990305 896588 818804 787245 772946 782304 825159 842094 806013
12334H06013n3654q481m825n55m3603j7068j4203j630J1450K0134m246K523L5672
$$ 806013 752359 743878 739053 738498 694895 677827 663624 661994 673444 693578 689332 691855 727527
12321G27527L3425M6179N4218L7572L5053M3905j1998n6552j07519r3571j13038
$$ 727527 760952 807131 861349 898921 933974 977879 965881 909329 801810 708239 595201
12310E95201r5808o5599o4448l3479m7146n6997l2440k3193k6656P623K9806j5323
$$ 595201 499393 433794 369346 335867 288721 231724 199284 176091 149435 157058 186864 171541
12298A71541J5098q643m3543j6852r94m869k409M814j4319j279n742J024j90n825
$$ 171541 186639 177996 134453 117601 116607 111738 109329 114143 99824 98545 92803 93827 93637 87812
12284H7812j2397Q150q168J0838N816L627m868q48J214L2391J6958k5309l7076
$$ 87812 75415 83565 75397 86235 92051 95678 90810 89962 91176 123567 140525 115216 78140
12271G8140j5332K5113m443k6032l2374j0993M2770K2832m893l5652o147L0713
$$ 78140 62808 87921 83478 57446 25072 14079 56849 79681 74788 39136 32989 63702
12259F3702m654K041O220J0300J6956k169Q294P310J7699m692j0105J7272P348
$$ 63702 59048 61089 67309 77609 94565 92396 100690 108000 125699 121007 110902 128174 135522
12246A35522k1466n934m003J3719j7266j0362j159j2004m607j5303j5993J05M769
$$ 135522 114056 108122 104119 117838 100572 90210 89051 77047 72440 57137 41144 41249 46018
12233D6018K7123J3327K0262K019j008J0893J0800K1273K7181J3140L5317O1210
$$ 46018 73141 86468 106730 108749 107741 118634 129434 150707 177888 191028 226345 287555
12221B87555N5389M7299P833Q484L2739J5073n831k2590k5958o0791n8068o0793
$$ 287555 342944 390243 398076 406560 439299 454372 448541 425951 399993 339202 281134 220341
12209B20341m2175J5607J4550p852K59m089Q156L4871N093J5324L9944M2605O8950
$$ 220341 178166 193773 208323 200471 200730 196641 204797 239668 244761 260085 300029 342634 411584
12196D11584N9468N5960M6403J6882J8293J2059j0610m1369l7659p4251n6211
$$ 411584 471052 527012 573415 590297 608590 620649 610039 568670 531011 456760 400549
12185D00549l2422l3679m2805l7681k3137r487J1440M071j8341k8418k5311K4328
$$ 400549 368127 334448 291643 253962 230825 221338 232778 236849 218508 190090 164779 189107
12173A89107N39J4884J282L3438J4481K2421O631L988j0001k0592l527p177K0486
$$ 189107 189646 204530 205812 239250 253731 276152 282783 286771 276770 256178 252651 245474 265960
12160B65960J3554K874j4456J9491J0984K3900L4212L150o768K2227L4552j4227
$$ 265960 279514 282388 267932 287423 298407 322307 356519 359669 352901 375128 409680 395453
12148C95453K207K5022j3497q220J3443J6950M9291L9074m876J7594K8559J3599
$$ 395453 397660 422682 409185 400965 414408 431358 480649 519723 514847 532441 561000 574599
12136E74599N611N373R058K1364J160J2910J0632J8079M1805J5467L2345m644
$$ 574599 580210 585583 594641 616005 617165 630075 640707 658786 700591 716058 748403 743759
12124G43759j4279P430K7616L3457L3473L0136K3179N4507N3347L7989N2308R2728
$$ 743759 729480 736910 764526 797983 831456 861592 884771 939278 992625 1030614 1082922 1175650
12112A175650O5449N0573O3032J02581Q1644P0594J11732J47730J38068J27715
$$ 1175650 1241099 1291672 1354704 1457285 1538929 1609523 1721255 1868985 2007053 2134768
12102B134768J52721J75735J95256J87900K09341K31059K54187K84866L08279
$$ 2134768 2287489 2463224 2658480 2846380 3055721 3286780 3540967 3825833 4134112
12093D134112L19710L10564L11924L72829M05166M42571N29941O67461Q14443
$$ 4134112 4453822 4764386 5076310 5449139 5854305 6296876 6826817 7494278 8308721
12084H308721J033384J306650J654049K072820K435225K728765L024209L223405
$$ 8308721 9342105 10648755 12302804 14375624 16810849 19539614 22563823 25787228
12076B5787228L383506L587069L981815M728317O103360Q400218J2008293J7426160
$$ 25787228 29170734 32757803 36739618 41467935 47571295 55971513 67979806 85405966
12068H5405966K4645390L2895194M0165702M4419536M4718178M0066622K9986895
$$ 85405966 110051356 142946550 183112252 227531788 272249966 312316588 342303483
12061C42303483J5800243o64684j7183338l0760592l9329623m2847500m2057122
$$ 342303483 358103726 357439042 340255704 309495112 270165489 227317989 185260867
12054A85260867l7746384l1258330k4224099j8148537j3487481r882569p368867
$$ 185260867 147514483 116256153 92032054 73883517 60396036 50513467 43144600
12047D3144600n573114m405133l672924l221594k945405k737204k513767k258443
$$ 43144600 37571486 33166353 29493429 26271835 23326430 20589226 18075459 15817016
12039A5817016j988013j707141j426575j185486r76499q19687p23232o31636n46806
$$ 15817016 13829003 12121862 10695287 9509801 8533302 7713615 6990383 6358747 5811941
12030E811941n07838m39021l70047k92563k76851k27805j79200j41710j36485
$$ 5811941 5304103 4865082 4495035 4202472 3925621 3697816 3518616 3376906 3240421
12021C240421j26392j22021r2791j01450q0438q5753r5537m8916l6246o4200p6820
$$ 3240421 3114029 2992008 2899217 2797767 2717329 2631576 2536039 2487123 2450877 2386677 2309857
12010B309857q0254o3101p6007n6147p2261q0535n1209o4884o8823m1931o5913
$$ 2309857 2229603 2166502 2090495 2034348 1962087 1881552 1830343 1765459 1696636 1654705 1588792
11999A588792o8934m6514m6932k3110k2840j5717l8788k3858k8876m6166n5536
$$ 1588792 1519858 1473344 1426412 1403302 1380462 1364745 1325957 1302099 1273223 1227057 1171521
11988A171521l0343l1844l9312l9285m0045n8151l5446n360j7632j4640j8179
$$ 1171521 1141178 1109334 1070022 1030737 990692 932541 897095 891735 874103 859463 841284
11977H41284l5148k7041j8819r819k1181j3209R150j0924k0808J9123K3749k4034
$$ 841284 806136 779095 760276 750457 729276 716067 725217 714293 693485 712608 736357 712323
11965G12323l2747R944J7472l025j8433j6578l7708k0440p697l7050j8110n832
$$ 712323 679576 689520 706992 703967 685534 668956 631248 610808 603111 566061 547951 542119
11953E42119J9294L0144M4081K4491k2407J1270J5277o156k157j829K502j68J157
$$ 542119 561413 591557 635638 660129 637722 648992 664269 658113 655956 654127 656629 656461 657618
11940F57618J2842L830l342q06L1523J3550o970J0374J3013k4181l2142m2822
$$ 657618 670460 674290 670948 670142 701665 715215 708245 718619 731632 707451 675309 632487
11928F32487m7846l0985l4107m4956j1938j5611k4639k2049L862K1267L789l3137
$$ 632487 584641 553656 519549 474593 462655 447044 422405 400356 404218 425485 429274 396137
11916C96137l7529l8343j6027r283m0633l9927l7323k3958k1534n1960n1623k0641
$$ 396137 358608 320265 304238 294955 254322 214395 177072 153114 131580 79620 27997 7356
11904G356J4420L1357J5812L4229N7762O9827K7866J4781K2366J4482N561k6940
$$ 7356 21776 53133 68945 103174 160936 230763 258629 273410 295776 310258 315819 288879
11892B88879J803j1015j589L945j0188k459J2938Q335L4081Q871l1703o3627n3700
$$ 288879 290682 279667 278078 282023 271835 269376 282314 290649 324730 333601 301898 238271 184571
11879A84571Q170Q484P475J0429J5861N909m4288r446L7944K5071j5025n561J0020
$$ 184571 192741 201225 208700 219129 234990 240899 196611 187165 225109 250180 235155 229594 239614
11866B39614K4011L5776k3861k0449J8930R502p950p911m2932m6579j4957L0498
$$ 239614 263625 299401 275540 255091 274021 283523 275573 267662 224730 178151 163194 193692
11854A93692j5753k8310K7775J9054K1516J6956l057j2422j5657n5J0048J0992
$$ 193692 177939 149629 177404 196458 217974 234930 231873 219451 203794 203739 213787 224779
11842B24779J0001j7613j9762K4457N964k2937L71l159K3691L5775j2588j3465
$$ 224779 234780 217167 197405 221862 227826 204889 205260 202101 225792 261567 248979 235514
11830B35514J1613L0886j9913m4765r024J96j571J6717R44J9993J7602M585k7113
$$ 235514 247127 278013 258100 213335 204311 204507 202936 219653 220597 240590 258192 262777 235664
11817B35664k4776n691l8079q407J6644M520J3661R304M487n237j9595j4919N229
$$ 235664 210888 205197 167118 158711 175355 179875 193536 202840 207327 202090 182495 167576 172805
11804A72805n033P30O834k3807o542J6421q604J3579Q640M218N785o448K891p625
$$ 172805 167772 168502 175336 151529 144987 161408 152804 166383 175023 179241 185026 178578 181469 173844
11790A73844l4893m844J8810J2185l254k0599J944N6041J8649J0415k0308k1763
$$ 173844 138951 134107 152917 165102 161848 141249 143193 199234 217883 228298 207990 186227
11778A86227j9412l1198Q121J3760k0107j1755Q201K1183m996l647j54k4073l3735
$$ 186227 166815 135617 143738 157498 137391 125636 133837 155020 150024 146377 146223 122150 88415
11765H8415l7096l4194k7541k4736j6738M249j9965J1147L4921J1050L4505M439
$$ 88415 51319 17125 -10416 -35152 -51890 -47641 -67606 -56459 -21538 -10488 24017 28456
11753B8456J6117J2350J467o226l492j8294J5501L5150L1853N448j3105j1915
$$ 28456 44573 56923 58390 52164 48672 30378 45879 81029 112882 118330 105225 93310
11741I3310J2867P999k917k4887J7655l515K1008J5452j8254k836J0434j2558
$$ 93310 106177 114176 111259 86372 104027 100512 121520 136972 118718 115882 126316 113758
11729A13758O279J8996J2222m0669k4926j14O819L2154Q307m076J1737j0480k5619
$$ 113758 120037 139033 151255 110586 85660 85546 92365 124519 132826 128750 140487 130007 104388
11716A04388j1976J667K654p152r370J149J1175M1287N617q664k1874j8689L0529
$$ 104388 92412 94079 96733 89581 80211 81360 92535 133822 139439 130775 108901 90212 120741
11703A20741K9248K416j5358j2644L2414Q854j0335n044J5374M319j9467k8985
$$ 120741 149989 152405 137047 124403 156817 165671 155336 150292 165666 169985 150518 121533
11691A21533n561j6402j3237K2638R369L9296L4059k1419k1334O02k1879j1673
$$ 121533 115972 99570 86333 108971 118340 157636 191695 170276 148942 149544 127665 115992
11679A15992j5385R288K2491K5473q760O301O411K504R233J9820j1744k345k4663
$$ 115992 100607 109895 132386 157859 149099 155400 161811 164315 173548 193368 181624 179279 154616
11666A54616J0810j6450j2849J7411J1097L5836K1528m01O879N755Q397L1566
$$ 154616 165426 148976 136127 153538 164635 200471 221999 221598 228477 234232 242629 274195
11654B74195L4026L3607N285M1161N1495M3730N9466P7701J25365J86618K01116
$$ 274195 308221 341828 347113 388274 439769 483499 542965 620666 746031 932649 1133765
11643A133765J95777K10520J86113J45277O4928J5533n6961j35000j88503k00383
$$ 1133765 1329542 1540062 1726175 1871452 1936380 1951913 1894952 1759952 1571449 1371066
11633A371066j86858j90687j61847j43427q9675r4931p8058m5310m0382n991K0295
$$ 1371066 1184208 993521 831674 688247 598572 503641 425583 380273 339891 333900 354195
11622C54195k5635n096k5512m4602j696J7572j9767j881j2542m0033l5781p7J7704
$$ 354195 328560 323464 297952 253350 251654 269226 249459 247578 235036 195003 159222 159145 176849
11609A76849K3191P495M353j3831K0830k821l6025k0894J3199j64J0133O910O940
$$ 176849 200040 207535 211888 198057 218887 216066 180041 159147 172346 172182 182315 189225 196165
11596A96165n815n206p000j5834L081n784K03J1028Q969P267j7690n29M412J7689
$$ 196165 190350 185144 178144 162310 165391 159607 159810 170838 179807 187074 169384 168855 173267 190956
11582A90956J8321k0152J3937L390n687p106n19k3196l337l321Q667J7472N166
$$ 190956 209277 189125 203062 206452 200765 193659 193140 169944 166607 163286 171953 189425 194591
11569A94591j5038K700J2732K0900L153J4071J3017q799k9708k2374R784K5037
$$ 194591 179553 182253 194985 215885 219038 233109 246126 237327 207619 185245 195029 220066
11557B20066O727l620J604k7533j0725Q440K4917N707K471J2201L9329J9751N590
$$ 220066 226793 223173 224777 197244 186519 194959 219876 225583 228054 240255 279584 299335 304925
11544C04925j9557j1964k0305O661j5880p090o035N064K8864L4556p419q982J4676
$$ 304925 285368 273404 253099 259760 243880 236790 230755 235819 264683 299239 291820 282838 297514
11531B97514K3932K3788r712n295l2418j904j326k9401o921L2276n922M63J0239
$$ 297514 321446 345234 335522 330227 297809 295905 294579 265178 258257 290533 284611 285074 295313
11518B95313K4862K4289K928j5442k1862p353j1476O313j9124J5985O296l670
$$ 295313 320175 344464 347392 331950 310088 302735 291259 297572 278448 294433 300729 297059
11506B97059q043k276J5851n371j8728J5867J3368R503J842n319J5407K6532j6766
$$ 297059 289016 286740 302591 297220 278492 294359 307727 317230 319072 313753 329160 355692 338926
11493C38926j5066J6360M9770j8446k421k4298j0625M2754k37n662o641J2304
$$ 338926 323860 340220 389990 371544 369123 344825 334200 376954 376717 371055 364414 376718
11481C76718J032M165k6754L947L5021o720n420n831j0334L251L3443K745q234
$$ 376718 377750 381915 355161 359108 394129 387409 381989 376158 365824 369075 402518 405263 397029
11468C97029o356J3409m313j1291J7939J7798p798M036o696j030J1889j5786k7976
$$ 397029 390673 404082 399769 388478 406417 424215 416417 420453 413757 412727 424616 408830 380854
11455C80854j0172J2568J9167K4531r827o943L817q496J6772K8777M597o884J6016
$$ 380854 370682 383250 402417 426948 417121 410178 413995 405499 422271 451048 455645 448761 464777
11442D64777Q042k4855q916K1405L2878l347q667J0549N009P213J4378N110J464
$$ 464777 472819 447964 439048 460453 493331 489984 481317 491866 496875 504088 518466 523576 525040
11429E25040m258R523O126J4724q566J0054l2773K9085k355k139K9048L3137P307
$$ 525040 520782 530305 536431 551155 542589 552643 519870 548955 546600 544461 573509 606646 613953
11416F13953k7529j2654J2672o178O504J3937L0534j263j281J9972N97k1377j0821
$$ 613953 586424 573770 586442 580264 586768 600705 631239 629976 628695 648667 649264 627887 617066
11403F17066J3583J807j932J6753N4618L6472p190k0205R250K0488J0562p720
$$ 617066 630649 632456 630524 647277 701895 738367 731177 710972 720222 740710 751272 743552
11391G43552n343J9494K7456K2989k664j9066j4446M9768L1782P517J1764R458
$$ 743552 738209 757703 785159 808148 805484 786418 771972 821740 853522 861039 872803 882261
11379H82261O454J2560J5258J2543K8242P308J1311k269K5068L1238N9835J0308
$$ 882261 888715 901275 916533 929076 957318 964626 975937 973668 998736 1029974 1089809 1100117
11367A100117P9J6834K2542K6106p541K068K436m376J6643J9453K1494J3554J362
$$ 1100117 1100196 1117030 1139572 1165678 1158137 1160205 1162641 1158265 1174908 1194361 1215855 1229409 1230771
11354A230771K4053M2361M0878J0827M607n06L3887L441K948K0133L5692L5063
$$ 1230771 1254824 1297185 1338063 1348890 1353497 1352991 1386878 1390319 1393267 1413400 1449092 1484155
11342A484155L9410J9272o563J9619L7494M0297K2375L3622J0290k872M350J2152
$$ 1484155 1523565 1542837 1536274 1555893 1593387 1633684 1656059 1689681 1699971 1697099 1701449 1713601
11330A713601J066K3731L4576O3510P9011L7116M5074K8186M3090L0534L0858
$$ 1713601 1714667 1738398 1772974 1836484 1915495 1952611 1997685 2025871 2068961 2099495 2130353
11319B130353J8293M450M0896L3477M3260M4838O2550M7857O3294N0235L5997
$$ 2130353 2148646 2153096 2193992 2227469 2270729 2315567 2378117 2425974 2489268 2539503 2575500
11308B575500O3784P5686Q0302P5699N2688K4218L3312P3725Q3267M4567P5371
$$ 2575500 2639284 2714970 2795272 2870971 2923659 2947877 2981189 3054914 3138181 3182748 3258119
11297C258119J06350Q1608O9097O5711Q9416J15507J04155J14798J19927R2545
$$ 3258119 3364469 3446077 3515174 3580885 3670301 3785808 3889963 4004761 4124688 4217233
11287D217233J25712J12890J02400J25993J29912J65990J54857J43896J43862
$$ 4217233 4342945 4455835 4558235 4684228 4814140 4980130 5134987 5278883 5422745
11278E422745J69057J97726J96624J61844K14650K19759K04917K10538K50205
$$ 5422745 5591802 5789528 5986152 6147996 6362646 6582405 6787322 6997860 7248065
11269G248065K74745K57581K59338K81748L12573L22829L20538L29205L66688
$$ 7248065 7522810 7780391 8039729 8321477 8634050 8956879 9277417 9606622 9973310
11260I973310M04882M39210M33103M92355N21050N38806N43368N96546O48922
$$ 9973310 10378192 10817402 11250505 11742860 12263910 12802716 13346084 13942630 14591552
11251A4591552O58492O82981P32328Q00014Q62779Q71530R27938R93902J064203
$$ 14591552 15250044 15933025 16665353 17465367 18328146 19199676 20127614 21121516 22185719
11242B2185719J126204J164717J235984J339427J398725J489072J522326J604572
$$ 22185719 23311923 24476640 25712624 27052051 28450776 29939848 31462174 33066746
11234C3066746J683582J735638J801972J848844J853593J876112J871591J865662
$$ 33066746 34750328 36485966 38287938 40136782 41990375 43866487 45738078 47603740
11226D7603740J798354J716387J592535J427202J246600J056022Q34567N68784
$$ 47603740 49402094 51118481 52711016 54138218 55384818 56440840 57275407 57844191
11218E7844191K74623p548k71327n59284q40034j079933j252574j447347j588251
$$ 57844191 58118814 58111266 57839939 57280655 56440621 55360688 54108114 52660767 51072516
11209E1072516j701770j796277j833095j870635j886792j859791j822681j783403
$$ 51072516 49370746 47574469 45741374 43870739 41983947 40124156 38301475 36518072
11201C6518072j733014j665955j603680j543122j449206j378616j320297j258953
$$ 36518072 34785058 33119103 31515423 29972301 28523095 27144479 25824182 24565229
11193B4565229j184542j111437j077623j002390r29951q66536q09935p66965o99494
$$ 24565229 23380687 22269250 21191627 20189237 19259286 18392750 17582815 16815850 16116356
11184A6116356p11791o88309o35325n85201n62317n12369m65278m31558m52600
$$ 16116356 15404565 14716256 14080931 13495730 12933413 12421044 11955766 11524208 11071608
11175A1071608m38925m24167l80590l62540l19360k91652k84926k72298k70022
$$ 11071608 10632683 10208516 9827926 9465386 9146026 8854374 8569448 8297150 8027128
11166H027128k52036k47531k33045k30668k16443k42740j91141j85129j78243
$$ 8027128 7775092 7527561 7294516 7063848 6847405 6604665 6413524 6228395 6050152
11157F050152j51948j54431j66073j54290j65940j57124j35050j34497j12281
$$ 6050152 5898204 5743773 5577700 5423410 5257470 5100346 4965296 4830799 4718518
11148D718518j21094j35285j14384r7827j08322j22638j00440j05454j01220p9449
$$ 4718518 4597424 4462139 4347755 4249928 4141606 4018968 3918528 3813074 3711854 3632405
11138C632405n8270n8855p3184q6275q1166p7430p0099n1715n3930p1107q1169
$$ 3632405 3574135 3515280 3442096 3355821 3274655 3197225 3127126 3075411 3021481 2950374 2869205
11127B869205n3883l9534n2400q2274q7460l0198m2360m5333n9970m5136m7314
$$ 2869205 2815322 2775788 2723388 2641114 2553654 2523456 2481096 2435763 2375793 2330657 2283343
11116B283343p0479k9714n06m6404o5379k2659J1979k4840l8439m1187o1829k539
$$ 2283343 2212864 2183150 2182644 2136240 2070861 2048202 2060181 2035341 1996902 1955715 1893886 1891347
11104A891347R642j1824k1769p667o375K830j016q984k923k3031l1788j4540k0624
$$ 1891347 1900989 1889165 1867396 1859729 1853354 1856184 1855168 1846184 1843261 1820230 1788442 1773902 1753278
11091A753278j456j7318k5118j9772o4518l1771j7642k0179m0610n8170m7318
$$ 1753278 1751822 1734504 1709386 1689614 1625096 1593325 1575683 1555504 1514894 1456724 1409406
11080A409406m3650l6300l7328l1244k7275k0006k3027k2770l004r515p324k4653
$$ 1409406 1365756 1329456 1292128 1260884 1233609 1213603 1190576 1167806 1164802 1155287 1147963 1123310
11068A123310q468l2779k1599K685J7747n7l8674j6554o187m0651j59r731k1187
$$ 1123310 1114842 1082063 1060464 1063149 1080896 1080839 1042165 1025611 1019424 978773 978614 968883 947696
11055I47696R921q286j5798j1440r133N766l0915j3258J068k5850r779R666k1791
$$ 947696 957617 949331 933533 922093 912960 918726 887811 874553 875621 849771 839992 849658 827867
11042H27867k7629K9505K4341j1868m395k3236j309j518j0818L682p26k0820j2969
$$ 827867 800238 829743 854084 842216 837821 814585 813276 811758 800940 804622 803896 783076 770107
11029G70107j7128o252l1690r797Q440L065J651j5080k0663k5006j0180j287r727
$$ 770107 752979 746727 715037 705240 713680 716745 718396 703316 682653 657647 647467 646180 636453
11016F36453R098K2218J2448j0850m634l125O237M662J1872r799n135q625k5916
$$ 636453 645551 667769 680217 669367 664733 661608 667845 672507 684379 674580 669445 660820 634904
11003F34904l5973r905K5609j2431j2523J0126j0227j7730j6970Q471j7907K6514
$$ 634904 598931 589026 614635 602204 589681 599807 589580 571850 554880 563351 545444 571958
10991E71958O77k2980j3170p387m566N33j4098l542J3314q540L735j823k3041
$$ 571958 572635 549655 536485 529098 524532 525065 510967 507425 520739 512199 515934 514111 491070
10978D91070j1208N094j0425M738J641K6076j545k5375J228l3461j479J4976J2497
$$ 491070 479862 484956 474531 479269 480910 506986 505441 480066 481294 447833 446354 461330 473827
10965D73827K1541p002k488J9090j8229j1341l193L100k147m389p123n473k7703
$$ 473827 495368 488366 485878 504968 486739 475398 472205 475305 473158 468769 461646 456173 428470
10952D28470l157K5262K1456J4381k170j0990k7876J8613O502o542k2710M426
$$ 428470 425313 450575 472031 486412 484242 473252 445376 463989 470491 463949 441239 445665
10940D45665R722m0191k9486k200J6196J7013k1801l4658j1944J3642K6677K1967
$$ 445665 455387 415196 385710 383510 399706 416719 394918 360260 348316 361958 388635 410602
10928D10602j1244l5369l1022P09J1299q989K9004J4639J6367m3575l8158j98
$$ 410602 399358 363989 332967 333676 344975 335986 364990 379629 395996 352421 314263 314065
10916C14065R451J6945K3708R991k512k9279M038J1680P054J1913N486o96j0654
$$ 314065 323516 340461 364169 374160 371648 342369 346407 358087 365141 377054 382540 381844 371190
10903C71190j6071J3605j7102j5750k5279K0032L1756K5739l2007j5955q060J7796
$$ 371190 355119 368724 351622 335872 310593 330625 362381 388120 356113 340158 332098 349894
10891C49894k05M216L9607J7030j3859l7642j1236J9498R804K2009O244m183l3328
$$ 349894 349689 353905 393512 410542 396683 359041 347805 367303 377107 399116 405360 401177 367849
10878C67849o367r890q489Q612M634o263R206j1505J0509J0498j99R504J9189
$$ 367849 361482 351592 343103 351715 356349 350086 359292 347787 358296 368794 368595 378099 397288
10865C97288O051j8921j7596Q686L341p492j8219J3996J7108K2828j497j3664
$$ 397288 403339 384418 366822 375508 378849 371357 353138 367134 384242 407070 405573 391909
10853C91909j6139L785R476J3214m914k5081l5012k175K7421K0035N298J3056
$$ 391909 375770 379555 389031 402245 397331 372250 337238 335063 362484 382519 387817 400873
10841D00873K1190n296P758J0760p050k0092J1720J4601n599k3010L910k511L159
$$ 400873 422063 416767 424525 435285 428235 408143 419863 434464 428865 405855 409765 407254 410413
10828D10413K3897J9838l69Q814j1808l007J8084m14K2732K9498p922K579m887
$$ 410413 434310 454148 453779 462593 450785 447778 465862 465448 488180 517678 509756 512335 507448
10815E07448K7326R430M3493J9064j333Q768L1567L6468l515j0641p028L1884
$$ 507448 534774 544204 587697 606761 605428 614196 645763 682231 678716 668075 661047 692931
10803F92931L5695n150R3L2494K1577q194j5413N443R952p031o157r778j2220
$$ 692931 728626 723476 723569 756063 777640 769446 754033 759476 769428 762397 756240 746462 734242
10790G34242K439K9188L5499Q318J1731O599O426K4533M524n922k2806L758K4526
$$ 734242 736681 765869 801368 809686 821417 828016 834442 858975 863499 857577 834771 838529 863055
10777H63055P604R552J2650J2303J981j5791K2800J6748N1055j0597Q349j1013
$$ 863055 870659 880211 892861 905164 907145 891354 914154 930902 981957 971360 979709 968696
10765I68696N177j5325j8722J6383J2457l934l1799m2389j5739k349N725n777
$$ 968696 973873 958548 939826 956209 968666 964732 932933 890544 874805 872456 878181 872404
10753H72404k0510o635L848l937K7412O569m6398m9864n527P371J49j1125J6644
$$ 872404 851894 845259 849107 845170 872582 879151 832753 782889 777362 784733 784882 773757 790401
10740G90401L1120r180j7104J2910L86j5738j0346J0741l287k1457o737j3672
$$ 790401 821521 812341 795237 808147 808533 792795 782449 793190 789903 768446 761709 748037
10728G48037k074l344k7015j5224l2011n102L774n540n528Q10N584l0967m1365
$$ 748037 745963 742619 715604 700380 668369 663267 667041 661501 655973 656783 662367 631400 590035
10715E90035m56J3583P046k4999j3499k405P543J0753J4121j2989N044k721k8234
$$ 590035 589579 603162 610208 585209 571710 569305 576848 587601 601722 588733 593777 591056 562822
10702E62822j7330R407K1112q904K7k9685q579Q958j3188k1361j2374J1975K0455
$$ 562822 545492 554899 576011 567107 567134 537449 528870 537828 524640 503279 490905 502880 523335
10689E23335M779o932j4616m154J5488K3560K8853q353p884j0801j670j5381J1241
$$ 523335 528114 521182 506566 502412 517900 541460 570313 561960 554076 543275 541605 526224 537465
10676E37465l872p328p547q225L4654L3773K3603J0060L249r988k2205j812k8051
$$ 537465 533593 526265 518718 510493 545147 578920 602523 612583 615832 605844 583639 581827 553776
10663E53776J4958J0856K5735O57R236J3057K5879j0735J973P764J0880l4144
$$ 553776 568734 579590 605325 605982 615218 628275 654154 643419 645392 653156 664036 629892
10651F29892j1424J7071J5495K0428j060o65J5571q158j0897J0557k4053l0828
$$ 629892 618468 635539 651034 671462 670402 669737 685308 677150 666253 676810 652757 621929
10639F21929M333J4122j5185K203J6052K1311J7178M440K224n899M957L704j016
$$ 621929 626262 640384 625199 627402 643454 664765 681943 686383 688607 682708 687665 691369 690353
10626F90353R042Q534j3067p534K320K739j0189o864j3458P280K6182Q363J4824
$$ 690353 699395 707929 694862 687328 689648 692387 682198 675334 661876 669156 695338 703701 718525
10613G18525J0464R03Q200J2485J0908J9540J4425J9576J7289q763l1063q700
$$ 718525 728989 729892 738092 750577 761485 781025 795450 815026 832315 823552 792489 783789
10601G83789K172o192O411L138R825k9052k1049J8444o18J5427L6551J391l1562
$$ 783789 785961 779769 786180 789318 799143 770091 749042 767486 766868 782295 818846 820237 788675
10588G88675j802K0550K0559R53K6339J6584j0332p572j6437j5882p971J0071
$$ 788675 786873 807423 827982 828935 855274 871858 861526 853954 837517 821635 813664 823735
10576H23735K7418K1911J6666J0762K0317L6028j2174M0J2971J3547J9752j1769
$$ 823735 851153 873064 889730 900492 920809 956837 944663 944703 957674 971221 990973 979204
10564I79204k4401j2200Q366M5434J3511J9902L4877j3757l06L1312L2305p113
$$ 979204 954803 942603 950969 996403 1009914 1029816 1064693 1050936 1050630 1081942 1114247 1107134
10552A107134j0646J2857K1494R396K13L8546L5473m926j0L0837K1580R528K5508
$$ 1107134 1096488 1109345 1130839 1140235 1140448 1178994 1214467 1209541 1209531 1240368 1261948 1271476 1296984
10539A296984L2695M2018J0502r019l799K4982J0246L8214M5980r343J0104K4673
$$ 1296984 1329679 1371697 1382199 1373180 1369381 1394363 1404609 1442823 1488803 1479460 1489564 1514237
10527A514237J3202K6814N3313J0298L2183K0181P967L6711M6598K8553K3303
$$ 1514237 1527439 1554253 1607566 1617864 1650047 1670228 1678195 1714906 1761504 1790057 1813360
10516A813360K7424L7594O362k1088M1354P4627K1050J9671L2867J3028K5131
$$ 1813360 1840784 1878378 1884740 1863652 1905006 1979633 2000683 2020354 2053221 2066249 2091380
10505B091380Q174o01M7821N9890M1770J3985R005N3133N9338K0311J3092K1900
$$ 2091380 2099554 2098953 2146774 2206664 2248434 2262419 2271424 2324557 2383895 2404206 2417298 2439198
10493B439198K3154j172J1284L2193K5491O8311O3095K4828K1230M6182M7951
$$ 2439198 2462352 2461180 2472464 2504657 2530148 2598459 2661554 2686382 2707612 2753794 2801745
10482B801745M2539M0893N6920K4665N7802N4695N5486P0289L9838N0884P9616
$$ 2801745 2844284 2885177 2942097 2966762 3024564 3079259 3134745 3205034 3244872 3295756 3375372
10471C375372N4261K0516L6390N2073M5355N4576Q6017N2519O8452J09637N8135
$$ 3375372 3429633 3450149 3486539 3538612 3583967 3638543 3724560 3777079 3845531 3955168 4013303
10460D013303O8753Q9049R1331J00798Q6635J11822J01457J02045J32674Q7662
$$ 4013303 4082056 4171105 4262436 4363234 4449869 4561691 4663148 4765193 4897867 4985529
10450D985529R5399J21899J28782J26543J46484J23495J52288J43394J49270J97771
$$ 4985529 5080928 5202827 5331609 5458152 5604636 5728131 5880419 6023813 6173083 6370854
10440F370854J79925J92152K00951J73269K02429K33180K30622K38473K77562
$$ 6370854 6550779 6742931 6943882 7117151 7319580 7552760 7783382 8021855 8299417
10431H299417L17760L30484K96252L41079L58047L84142L79944M16569M60791
$$ 8299417 8617177 8947661 9243913 9584992 9943039 10327181 10707125 11123694 11584485
10422A1584485M54990M98278N31782N87888O25149O41886P16295P49845Q13529
$$ 11584485 12039475 12537753 13069535 13657423 14282572 14924458 15640753 16390598 17204127
10413A7204127Q81492R33462J011771J098967J175375J257103J339609J452804
$$ 17204127 18085619 19019081 20030852 21129819 22305194 23562297 24901906 26354710
10405B6354710J584632J716784J798533J907621K095741K271918K366960K474469
$$ 26354710 27939342 29656126 31454659 33362280 35458021 37729939 40096899 42571368
10397D2571368K621124K771577K891832K953221K994087L017813K975303K919754
$$ 42571368 45192492 47964069 50855901 53809122 56803209 59821022 62796325 65716079
10389F5716079K798692K614179K354062K130263J841979J497733J219365R54890
$$ 65716079 68514771 71128950 73483012 75613275 77455254 78952987 80172352 81127242
10381H1127242P08369N22785L61431K45757J93304K22473K77133M17115N25536
$$ 81127242 81835611 82358396 82719827 82965584 83158888 83381361 83658494 84075609 84601145
10372H4601145P06539R01439J104635J332813J543164J744742J911567K057447
$$ 84601145 85307684 86209123 87313758 88646571 90189735 91934477 93846044 95903491
10364I5903491K203845K288498K314206K292781K195804J991845J834550J592199
$$ 95903491 98107336 100395834 102710040 105002821 107198625 109190470 111025020 112617219
10356A12617219J293759J006925P00097L12136k4340l54641o78213r74480j223302
$$ 112617219 113910978 114917903 115618000 115930136 115905796 115551155 114872942 113898462 112675160
10347A12675160j489755j665458j812906j939415k036791k073887k040083k016024
$$ 112675160 111185405 109519947 107707041 105767626 103730835 101656948 99616865 97600841
10339I7600841j904894j783102j661946j500901j299802j127060r12336o94721
$$ 97600841 95695947 93912845 92250899 90749998 89450196 88323136 87410800 86716079
10331H6716079n10110l45931j74271k494J53761K37094L29740L69712K93054K19909
$$ 86716079 86205969 85860038 85685767 85683273 85837034 86074128 86403868 86773580 87066634 87286543
10321H7286543N4520k07147n01197q30555j242673j645152j985600k362819k692117
$$ 87286543 87341063 87133916 86632719 85802164 84559491 82914339 80928739 78565920 75873803
10312G5873803k926332l111910l224638l275385l267979l211814l133794l039275
$$ 75873803 72947471 69835561 66610923 63335538 60067559 56855745 53721951 50682676
10304E0682676k894197k755240k609478k432971k254702k138485k014553j866485
$$ 50682676 47788479 45033239 42423761 39990790 37736088 35597603 33583050 31716565
10296C1716565j739982j647777j517730j377614j275097j211092j138514j058013
$$ 31716565 29976583 28328806 26811076 25433462 24158365 22947273 21808759 20750746
10288B0750746r97735r22015q47614q01905p67492o93654o26492o05283n94553
$$ 20750746 19753011 18830996 17983382 17181477 16413985 15720331 15093839 14488556 13894003
10279A3894003n38558m82807m72396m50130m19801l91536l92244l53586l39773
$$ 13894003 13355445 12872638 12400242 11950112 11530311 11138775 10746531 10392945 10053172
10270A0053172k97549l16638l04595k79656k75853k70579k06077k01433k14199
$$ 10053172 9755623 9438985 9134390 8854734 8578881 8308302 8102225 7900792 7686593
10261G686593k19415k00705j72012j75390k13320j72308j35124j52823j40877
$$ 7686593 7467178 7266473 7094461 6919071 6705751 6533443 6398319 6245496 6104619
10252F104619j47492j42030j21511j41557j34473j03820j02458r9473r9308j03456
$$ 6104619 5957127 5815097 5693586 5552029 5417556 5313736 5211278 5111805 5012497 4909041
10242D909041j06406q9335n8905j05068r9738r7553r0806q9411q8453p2951o8124
$$ 4909041 4802635 4713300 4654395 4549327 4449589 4352036 4261230 4171819 4083366 4010415 3942291
10231C942291o8099n8624n8461o1782m6419l4050o8284q2542l9958l7379n6057
$$ 3942291 3874192 3815568 3757107 3695325 3648906 3614856 3546572 3464030 3424072 3386693 3330636
10220C330636p2012m5698j0245m1639p3195m9234m7788l5149m905j223l4503m5414
$$ 3330636 3258624 3212926 3202681 3161042 3087847 3038613 2990825 2955676 2950771 2949548 2915045 2869631
10208B869631m6631l0020o2463o2428p243l5971n8670j8731r905k3113k0745r896
$$ 2869631 2823000 2792980 2730517 2668089 2660846 2624875 2566205 2547474 2537569 2514456 2493711 2483815
10196B483815l5593m3976o1433l2515k9856k6024l7354Rk2831j1561q645m0394
$$ 2483815 2448222 2404246 2342813 2310298 2280442 2254418 2217064 2217073 2194242 2182681 2174036 2133642
10184B133642l3901l2114p031j3538k2015k1725j6422j3118m6193m3249l1751
$$ 2133642 2099741 2067627 2060596 2047058 2025043 2003318 1986896 1973778 1927585 1884336 1852585
10173A852585l1108m8548l9520n4159n2078l7416j5286J0991k291m4963j7638
$$ 1852585 1821477 1772929 1733409 1679250 1627172 1589756 1574470 1585461 1583170 1538207 1520569
10162A520569J7944N9435O05l8984n8956n6896k5908j4055l7985m4533k9448R608
$$ 1520569 1538513 1597948 1598553 1559569 1500613 1443717 1417809 1403754 1365769 1321236 1291788 1301396
10150A301396J3648R262M628l3457k598J805j4536j4898l4523l568Q298n877k8311
$$ 1301396 1315044 1324306 1328934 1295477 1292879 1294684 1280148 1265250 1230727 1227159 1235457 1229580 1201269
10137A201269m7360j6200j7733p812R713O859j2426j3428k826k1854o590N777
$$ 1201269 1153909 1137709 1119976 1112164 1121877 1128736 1116310 1102882 1100056 1078202 1071612 1077389
10125A077389l1015j8675n536J0183j7535j0893m978p7m161K2525N936m0189k9556
$$ 1077389 1046374 1027699 1022163 1032346 1014811 1003918 998940 998863 994702 1017227 1023163 982974 953418
10112I53418J2993Q784N62j3110j5682j6607j8083j0971j8485k2501j0173K7769
$$ 953418 966411 975195 975757 962647 946965 930358 912275 901304 882819 860318 850145 877914
10100H77914r838j7843k7006M65J8002j4571J338k6842l2374j9099K9363J079
$$ 877914 868076 850233 823227 823692 841694 827123 828461 801619 769245 750146 779509 780588
10088G80588Q699Q980j4679j9060j9491J974k453m055L299j6706k1915j2750L0072
$$ 780588 789287 798267 783588 764528 745037 747011 744558 740503 743802 727096 705181 692431 722503
10075G22503P246j0191J770j6892l7075j7038J9376J3598n6170j5983J603N26
$$ 722503 729749 719558 721328 704436 667361 650323 669699 683297 627127 611144 612747 613273
10063F13273O488j1925l2174k913K1717l44j3737o281k7001J4840K7147k0046
$$ 613273 619761 607836 575662 572749 594466 594122 580385 574104 547103 561943 589090 569044
10051E69044k1111J4608J8302p853P269L7453K1431K1797O2629J19452J79154
$$ 569044 547933 562541 580843 572990 580259 617712 639143 660940 723569 843021 1022175
10040A022175J70375L7147r4612j58587j54586j32719o4318k2437k6513n8720
$$ 1022175 1192550 1229697 1135085 976498 821912 689193 624875 602438 575925 517205
10030E17205j2571j2358j63j0105k4589O281R477j7486P734j4723j3586K1527
$$ 517205 504634 492276 492113 482008 457419 463700 473177 455691 463425 448702 435116 456643
10018D56643N732L356l1388l179O662k2205j4346p758O948M8044r007l1533o886
$$ 456643 462375 465731 434343 431164 437826 415621 401275 393517 400465 448509 439502 407969 401083
10005D01083K6428K1237j2479k4243K9442J3736J761J3089P504k7415n817l969
$$ 401083 427511 448748 436269 412026 441468 455204 456965 470054 477558 450143 444326 440357
9993D40357o704k8477J4531L4777J7469j390j694L0311r656L617N2693N285j712
$$ 440357 433653 405176 419707 454484 471953 470563 468869 499180 489524 493141 545834 551119 549407
9980E49407N421q924K6442N985p917p100J7798L3372L4947O024K3878L5654m160
$$ 549407 554828 545904 572346 578331 570414 563314 581112 614484 649431 655455 679333 714987 710827
9967G10827Q619K3599m80K2829j9586j4448Q443J1523P758K674J1049M754P174
$$ 710827 719446 743045 742565 765394 745808 731360 739803 751326 759084 761758 772807 777561 784735
9954G84735J2412m17k3536j4177p485J7975J3436K5058L2380M617r699J2773J2630
$$ 784735 797147 796730 773194 759017 751532 769507 782943 808001 840381 844998 835299 848072 860702
9941H60702J2751N6316K6523K5384M5928O0739Q1325R0131O8670k248o6555m3507
$$ 860702 873453 929769 956292 981676 1027604 1088343 1169668 1259799 1328469 1326221 1259666 1216159
9929A216159r388K0811R5312J56821J50918N4933o6899j41347j71073j61134j06845
$$ 1216159 1206771 1227582 1322894 1479715 1630633 1685566 1618667 1477320 1306247 1145113 1038268
9918A038268p3421o3500m0565k0057j3890l8430J328J8504k2325j968K2330J3032
$$ 1038268 964847 901347 860782 840725 826835 788405 789733 808237 785912 783944 806274 819306
9906H19306J6135J8492m0391j6551P156j6045j6613J84O138l2041Q698k400k2873
$$ 819306 835441 853933 813542 796991 804147 788102 771489 771673 777811 745770 754468 752068 729195
9893G29195k7767l9187k0473j91j5290O15n3251k9596j2061k601K250R118K265
$$ 729195 701428 662241 641768 641577 626287 626902 573651 544055 531994 529393 531643 540761 543026
9880E43026k2589l0798K370p094k4781j7381k0991l6119N305l790k9773j4419
$$ 543026 520437 489639 492009 484915 460134 442753 421762 385643 390948 387158 357385 342966
9868C42966J672K691k2774P252K3488k3254k1884k5736K128J1117K6446K5651
$$ 342966 344638 347329 324555 331807 355295 332041 310157 284421 286549 297666 324112 349763
9856C49763P301j3746j0662k7506P54K4893L2080k8156j7340j7121K9154L9987
$$ 349763 357064 343318 332656 305150 305904 330797 362877 334721 317381 300260 329414 369401
9844C69401R328Q492l6080M21j6034r451n240j4983r409j201n452J207Q731Q158
$$ 369401 378729 387221 351141 351562 335528 326077 320837 305854 296445 295244 289792 290999 299730 307888
9830C07888l1482l3733n28K344l607K0025n562k523m951j87p650j8819Q692K3034
$$ 307888 276406 242673 242145 244489 240882 260907 255345 252822 247871 247684 240034 221215 229907 252941
9816B52941j0619K147M906k6944k1661j2775J2155K3975N570J6677K912K6696
$$ 252941 242322 244469 249375 222431 200770 187995 200150 224125 229695 246372 249284 275980
9804B75980p244k2251j3850j2070M803j3094J711J1360K0806r10j26K0017J5305
$$ 275980 268736 246485 232635 220565 225368 212274 213985 225345 246151 245241 245115 265132 280437
9791B80437M785l011L4716Q729j2294k5438M6579O5532K4053K0049O1095Q7922
$$ 280437 285222 282211 316927 325656 313362 287924 334503 400035 424088 444137 505232 593154
9779E93154J40371J75146K68226M18016M52338K65655n9854k92212m27529l74653
$$ 593154 733525 908671 1176897 1594913 2047251 2312906 2253052 1960840 1533311 1158658
9769A158658k73370k13711j31304r3514l8935l7907n6839n6574l7904p216j48
$$ 1158658 885288 671577 540273 446759 407824 369917 313078 256504 218600 211384 211236
9758B11236P660L4222K0626J0713J0691j284j8197j6047M561J79j8279k4660k4916
$$ 211236 218896 253118 273744 284457 295148 293864 275667 259620 264181 264360 246081 221421 196505
9745A96505L4056p795q926m365k2832J329o375K070J6507J7928q698j7526O698
$$ 196505 230561 222766 213840 209475 186643 187972 181597 183667 200174 218102 209404 191878 198576
9732A98576m213j5912K721Q271P41Q715n714j9269j2673N634j3144M205J1968
$$ 198576 194363 178451 181172 189443 190184 198899 193185 173916 161243 166877 153733 157938 169906
9719A69906q471j4349O344Q629m542K1751M769r293J248K374J915J0773J957k1100
$$ 169906 161435 147086 153430 162059 157517 179268 184037 174744 175992 178366 180281 191054 193011 171911
9705A71911o930n004p730m3597J0325L2126J0754J9882J7973l911k1445j184K0396
$$ 171911 164981 159977 152247 108650 118975 151101 161855 181737 199710 195799 174354 173170 193566
9692A93566L549O637j5276J2169K430j4521k0649J1112J7960K1014J4702j2629
$$ 193566 197115 203752 188476 200645 203075 188554 167905 179017 196977 217991 232693 220064
9680B20064k7080m1580j1127J6800R059M279r629j5339P159j5928j8048J9380
$$ 220064 192984 151404 140277 157077 166136 170415 160786 145447 152606 136678 118630 138010
9668A38010L223n193J0190o26k2378j7245J1345r102O412J4972q586j9938q111
$$ 138010 141233 136040 146230 145604 123226 105981 117326 108224 114636 129608 121022 101084 92973
9655I2973K6538J7554l236j0652J8660J4506O204J214l5811r450K0923J9823O431
$$ 92973 119511 137065 133829 123177 141837 156343 162547 163761 127950 118500 139423 159246 165677
9642A65677o400k3351r708J1493J7212m240r186m534k8585j155l454J6378n469
$$ 165677 159277 135926 126218 137711 154923 150683 141497 136963 108378 107223 103769 120147 114678
9629A14678j4300J4581q591L1746L3545l941m875j0171p632M271R935j0816j5771
$$ 114678 100378 114959 106368 138114 171659 167718 162843 152672 145040 149311 159246 148430 132659
9616A32659j1599M930j0854J6527R464L871q015k0411j1093r571K0429m6091m686
$$ 132659 121060 125990 115136 131663 141127 144998 136983 116572 105479 95908 116337 70246 65560
9603F5560M5100K8149L46N401R747P190J7915j8548j502K789J8485J2823j0592
$$ 65560 110660 138809 139155 144556 154303 161493 179408 160860 159358 162147 180632 193455 182863
9590A82863j5497j1588N320j8166l6040K7093M0512K0269K769n604j3134J6955
$$ 182863 167366 155778 161098 142932 106892 133985 174497 194766 197535 191931 178797 195752
9578A95752J810j5110r849p837n761j1218K0643J9311j0825P405q33J7438K0818
$$ 195752 197562 182452 172603 164766 159005 147787 168430 187741 176916 184321 183488 200926 221744
9565B21744n488j7781q349J170p744P052p628j7672q945J7471K4670M717K0058
$$ 221744 216256 198475 190126 191296 183552 190604 182976 165304 156359 173830 198500 203217 223275
9552B23275J4973k1349N333M2113L1651L1166r847K967K6589L78N833J3913q6
$$ 223275 238248 216899 222232 264345 295996 327162 317315 320282 346871 347249 353082 366995 366909
9539C66909k6513m250j5230j1887k732l339m777j2774k066j847q182k7108L514
$$ 366909 340396 336146 320916 309029 306297 302958 298181 285407 283341 281494 273312 246204 249718
9526B49718Q027J4405M4926J8878l137K0030M1821K2859J4734L769K5491K1103
$$ 249718 257745 272150 317076 335954 332817 352847 394668 417527 432261 436030 461521 482624
9514D82624J0864M6900M2771M7145O937L429j5243j0495j6091J3260M7215Q521
$$ 482624 493488 540388 583159 630304 637241 640670 625427 614932 598841 612101 659316 667837
9502F67837k1214n1492n8190l6485l676J3895l4986j5789j9128M330j2820J2624
$$ 667837 646623 595131 536941 500456 496780 510675 475689 459900 440772 445102 432282 444906
9490D44906J7362J6612J8397J1442J401L2133J1329k517K7131L7274L7564J6948
$$ 444906 462268 478880 497277 508719 510120 542253 553582 551065 578196 615470 653034 669982
9478F69982J3535O0045Q5028M2733n37j153j6707P817j1108Q686j662m6750l9451
$$ 669982 683517 743562 828590 871323 870786 869633 852926 860743 849635 858321 856659 809909 770458
9465G70458k3581l1461m8965k3169j3663l2428k7307q16k0958k9332j1983R09
$$ 770458 746877 715416 666451 643282 629619 597191 569884 569068 548110 518778 506795 507704
9453E07704j3869J3832K3783M9400L1390j5064n73j7126r894J9209p095K4878
$$ 507704 493835 507667 531450 580850 612240 597176 596603 579477 569583 588792 581697 606575
9441F06575J7629L5808M5865M400k150j9340m376j0853M950j1534j7708n8365
$$ 606575 624204 660012 705877 710277 708127 688787 684411 673558 678508 666974 649266 590901
9429E90901m4628o000r427l7937l2672k9028l1687K422L2640j455n148j3572j3081
$$ 590901 546273 540273 530846 492909 460237 431209 399522 401944 434584 433129 427981 414409 401328
9416D01328R218J2687J2103n435k180m541k5670J3359m4j5687j9245K0904K1337
$$ 401328 410546 423233 435336 429901 427721 423180 397510 410869 410825 395138 375893 396797 418134
9403D18134L480q800j1164P764m983j5019k237o432j1727O773l5106m4351j9883
$$ 418134 421614 412814 401650 409414 404431 389412 387175 380743 369016 375789 340683 296332 276449
9390B76449k0334k7853J0946L1906J5307o371P691J095J3517n348q955J1577J5024
$$ 276449 256115 228262 239208 271114 286421 280050 287741 288836 302353 297005 288050 299627 314651
9377C14651l02j5762k3427R945K2324j1921k448o711N260j561q272J4206K0292
$$ 314651 314349 298587 275160 285105 307429 295508 293060 286349 291609 290048 281776 295982 316274
9364C16274m5855k1293L0405J6777j1356J1121J1562m993k4384n832k2848j4314
$$ 316274 270419 249126 279531 296308 284952 296073 307635 302642 278258 272426 249578 235264
9352B35264p912j4347K2902L3975Q8J2908M0343K1002o26k635q160M271K9388
$$ 235264 227352 213005 235907 269882 269970 282878 323221 344223 343597 340962 332802 337073 366461
9339C66461K1244P670r145n379j9765m5023q98K9793J6886j3740q371L8059K564
$$ 366461 387705 395375 386230 380851 361086 316063 315165 344958 361844 348104 339733 377792 380356
9326C80356l2796L789K2759j6613j2453j557O683K8450P024j5803J0973J261k784
$$ 380356 347560 351349 374108 357495 345042 343485 350168 378618 385642 369839 380812 382073 379289
9313C79289J4898L8598O097k1409N810N601J3805J3847n567N371J3088k143P787
$$ 379289 394187 432785 438882 417473 423283 428884 442689 456536 450969 456340 469428 467285 475072
9300D75072L99j8330J66J5094J0084K4100o404J2204K11o039J5168J0483J2432
$$ 475072 475471 457141 457307 472401 482485 506585 500181 512385 512596 506557 521725 532208 544640
9287E44640J394K915L9231M7560N1056L1142M8629R5352J06985Q3436R0066R5194
$$ 544640 546034 548949 588180 635740 686796 717938 766567 861919 968904 1052340 1142406 1237600
9275A237600O7506L8331j1618m7079o8468n2267n3175k1330o371K1376K7639M9325
$$ 1237600 1305106 1343437 1331819 1284740 1216272 1164005 1110830 1089500 1083129 1104505 1132144 1181469
9263A181469R2713J00212R0179P0793L9748k77k5275j6301j843k6180m4486n8859
$$ 1181469 1274182 1374394 1464573 1535366 1575114 1574837 1549562 1533261 1531418 1505238 1460752 1401893
9251A401893k6946J4852K8957O9833P3609O6012J16609J63149J81256K12204K15989
$$ 1401893 1374947 1389799 1418756 1488589 1562198 1628210 1744819 1907968 2089224 2301428 2517417
9240B517417J48995Q2026j4700j33776j79665j71452j72249j43183p5928p4622
$$ 2517417 2666412 2748438 2733738 2599962 2420297 2248845 2076596 1933413 1857485 1782863
9230A782863o6544l7384q261N072Q779k2733J9470N0745N1674K0064J5658K1691
$$ 1782863 1716319 1678935 1670674 1675746 1684525 1661792 1681262 1732007 1783681 1803745 1819403 1841094
9218A841094p326j6775n5732r0820r0734o8610j3901K9759K8624M2231M7861R9658
$$ 1841094 1833768 1816993 1761261 1670441 1579707 1511097 1497196 1526955 1555579 1597810 1645671 1745329
9206A745329R6034P3110J7859j6752j3477n7332j07257o4139l2684j0593m4209
$$ 1745329 1841363 1914473 1932332 1915580 1902103 1844771 1737514 1673375 1640691 1630098 1585889
9195A585889k5366o251j8411j6988L713J4367K0624K0867K6166M2459M0083k382
$$ 1585889 1560523 1554272 1535861 1518873 1522586 1536953 1557577 1578444 1604610 1647069 1687152 1684770
9183A684770L2718N8491N3975M6941O2449P5270J08053P8175P1168R8999J32178
$$ 1684770 1717488 1775979 1829954 1876895 1939344 2014614 2122667 2200842 2272010 2371009 2503187
9172B503187J38559J51075J74210K29243K44250K61884L20625L75450M46968N37700
$$ 2503187 2641746 2792821 2967031 3196274 3440524 3702408 4023033 4398483 4845451 5383151
9162E383151O29160P16222Q84740J081528J219321J350190J510856J693557J858729
$$ 5383151 6012311 6728533 7613273 8694801 9914122 11264312 12775168 14468725 16327454
9153A6327454K004105K115680K160970K063540J834218J488222R37167K85143
$$ 16327454 18331559 20447239 22608209 24671749 26505967 27994189 28931356 29216499
9145B9216499m25829r83780j409472j561695j561911j468071j244327r19319o52466
$$ 29216499 28790670 27806890 26397418 24835723 23273812 21805741 20561414 19642095 18989629
9136A8989629l58973k1186L21372O32317R65556J301459J608690J887298K169752
$$ 18989629 18630656 18609470 18930842 19563159 20528715 21830174 23438864 25326162 27495914
9127B7495914K459436K718836L046030L371698L736509M047538M262811M327158
$$ 27495914 29955350 32674186 35720216 39091914 42828423 46875961 51138772 55465930
9119E5465930M223615L986662L569836L115882K640982K167821J767047J437292
$$ 55465930 59689545 63676207 67246043 70361925 73002907 75170728 76937775 78375067
9111G8375067J122347P50408K77566k97226r22815j506394j986547k308848k452128
$$ 78375067 79497414 80247822 80525388 80228162 79305347 77798953 75812406 73503558 71051430
9102G1051430k449208k305830k034906j701065j243796p08826j51891M28155J014443
$$ 71051430 68602222 66296392 64261486 62560421 61316625 60607799 60455908 60884063 61898506
9093F1898506J581529K072747K527768K967890L408526L818732M154307M498847
$$ 61898506 63480035 65552782 68080550 71048440 74456966 78275698 82430005 86928852
9085H6928852M804049N033731N151199N212439N121709M934428M631881M166116
$$ 86928852 91732901 96766632 101917831 107130270 112251979 117186407 121818288 125984404
9077A25984404L523462K537022J210614l80632k007712l494667m678426n507442
$$ 125984404 129507866 132044888 133255502 132874870 130867158 127372491 122694065 117186623
9069A17186623n962869o109575n977934n564773n047543m440247l804344l160519
$$ 117186623 111223754 105114179 99136245 93571472 88523929 84083682 80279338 77118819
9061G7118819k504885j888655j266545o93410r8762M31539R91052J516658K054786
$$ 77118819 74613934 72725279 71458734 70765324 70666562 71098101 72089153 73605811 75660597
9052G5660597K563674L039734L432847L738383L913277L924637L754398L345281
$$ 75660597 78224271 81264005 84696852 88435235 92348512 96273149 100027547 103372828
9044A03372828K788150K020131J034036r4949j324245k546374l589188m467744
$$ 103372828 106160978 108181109 109215145 109120196 107795951 105249577 101660389 97192645
9036I7192645n113183n448496n527317n414718n162757m755333m319816l895953
$$ 97192645 92079462 86630966 81103649 75688931 70526174 65770841 61451025 57555072
9028E7555072l498121l083096k658052k308535j981043j614514j317819j060515
$$ 57555072 54056951 50973855 48315803 46007268 44026225 42411711 41093892 40033377
9020D0033377p01343l66446J2845L43311O28420Q93931J101789J158184J114591
$$ 40033377 39332034 38965588 38978433 39321744 39950164 40844095 41945884 43104068 44218659
9011D4218659R71827P11991L59419j08140o71804j265836j834042k251066k503941
$$ 44218659 45190486 45902477 46261896 46153756 45481952 44216116 42382074 40131008 37627067
9002C7627067k600086k532818k323712k091608j889057j682254j548065j481577
$$ 37627067 35026981 32494163 30170451 28078843 26189786 24507532 22959467 21477890
8994B1477890j443841j427267j397051j332930j274821j190810j047227q94371
$$ 21477890 20034049 18606782 17209731 15876801 14601980 13411170 12363943 11469572
8986A1469572q25124p11951n92282n20161m26897m13396l69102l29847k81093
$$ 11469572 10644448 9932497 9340215 8820054 8393157 7979761 7610659 7280812 6999719
8977F999719k45943k37523k20139k01896j77577j86113j82414j13429p2300l5895
$$ 6999719 6753776 6516253 6296114 6094218 5916641 5730528 5548114 5434685 5362385 5326490
8967E326490r659j5341j1739K2500M0119M8380O6241P4790P5710J10158J07106
$$ 5326490 5316831 5301490 5289751 5312251 5352370 5400750 5466991 5541781 5617491 5727649 5834755
8956E834755J06360J14640J07322J17805J49249J47711J61522J80289K40846K86088
$$ 5834755 5941115 6055755 6163077 6280882 6430131 6577842 6739364 6919653 7160499 7446587
8946G446587L13932L41075L61466M11914M90756N09107N15917N69426O25696P09461
$$ 7446587 7760519 8101594 8463060 8874974 9365730 9874837 10390754 10960180 11585876 12295337
8936A2295337P27211P02341P22774P31120P01510O67635P26708P54388O74916
$$ 12295337 13022548 13724889 14447663 15178783 15880293 16547928 17274636 18029024 18703940
8927A8703940P09632P56897Q15027Q60896R04903R63676J032548J058008J018136
$$ 18703940 19413572 20170469 20985496 21846392 22751295 23714971 24747519 25805527 26823663
8918B6823663Q81672O90737L98140J27926q1121k44463l05411k52032r3870N7732
$$ 26823663 27705335 28396072 28794212 28922138 28841017 28596554 28291143 28039111 27945241 28002973
8908B8002973K05357L55671M95939N79044O27190O25156N48455M88935M49448
$$ 28002973 28208330 28564001 29059940 29638984 30266174 30891330 31439785 31928720 32378168
8899C2378168L62151L55330L86767M71752N62265O87152Q48937J001751J135247
$$ 32378168 32740319 33095649 33482416 33954168 34516433 35203585 36052522 37054273 38189520
8890C8189520J334626J471575J560085J580751J546717J426813J218456R97640
$$ 38189520 39524146 40995721 42555806 44136557 45683274 47110087 48328543 49326183
8882D9326183P24467M71169K19598j8162k30249l77239n83585p22948q09514q69629
$$ 49326183 50050650 50521819 50741417 50723255 50493006 50115767 49532182 48809234 47999720 47130091
8872D7130091r81411j073387j159360j169077j163135j113942j049609q96273
$$ 47130091 46148680 45075293 43915933 42746856 41583721 40469779 39420170 38523897
8864C8523897o91014m65015j91288J25411M34581O90045R82285J214523J431673
$$ 38523897 37832883 37367868 37176580 37301991 37736572 38426617 39408902 40623425 42055098
8855D2055098J563311J610404J570242J396958J127611P81127M26954K3916l59641
$$ 42055098 43618409 45228813 46799055 48196013 49323624 50104751 50531705 50555621 50195980
8846E0195980o39896q75944j064444j204214j262032j298619j313136j312722
$$ 50195980 49556084 48680140 47615696 46411482 45149450 43850831 42537695 41224973
8838D1224973j298937j263070j190560j123245j039060r55664q33241p15118o40107
$$ 41224973 39926036 38662966 37472406 36349161 35310101 34354437 33521196 32806078 32165971
8829C2165971o02666o17377o33876o82765p03025o77820o25729n35047m36036
$$ 32165971 31563305 30945928 30312052 29629287 28926262 28248442 27622713 27087666 26651630
8820B6651630l47962k70214j79382j18899j44443j52135j42206j79443k19212
$$ 26651630 26303668 26033454 25854072 25735173 25590730 25438595 25296389 25116946 24897734
8811B4897734k75895k57268k51374k65101k59272k54111k96122l77418m82234
$$ 24897734 24621839 24364571 24113197 23848096 23588824 23334713 23038591 22661173 22178939
8802B2178939n95320p24116q60580r82945j069576j099750j106289j061977r93609
$$ 22178939 21583619 20859503 19998923 19015978 17946402 16846652 15740363 14678386 13684777
8793A3684777r16192p83403o89469n88882m87007l70809k17050j78312j16289
$$ 13684777 12768585 11985182 11295713 10706831 10219824 9849015 9631965 9453653 9337364
8784I337364m5074n1589r1770j11022j15030j53935k24965k21913k39549k10847
$$ 9337364 9292290 9240701 9148931 9037909 8922879 8768944 8543979 8322066 8082517 7871670
8774G871670j60706j34636j25030j42803j72774k04459k48670l28769l71284m10452
$$ 7871670 7710964 7576328 7451298 7308495 7135721 6931262 6682592 6353823 5982539 5572087
8764E572087m04978l83226l73390l35634k69884k08869k12957k04053k00165j48459
$$ 5572087 5167109 4783883 4410493 4074859 3804975 3596106 3383149 3179096 2978931 2830472
8754B830472j30888j38586j27510p7127r4894p6888o2273q3291q3568o9072n8366
$$ 2830472 2699584 2560998 2433488 2356361 2261467 2184579 2122306 2039015 1955447 1886375 1828009
8743A828009m4040m9543m0082l5141k4949j4031j6571r538j6864l2295l9016j9822
$$ 1828009 1783969 1734426 1694344 1659203 1634254 1620223 1603652 1594114 1577250 1544955 1505939 1486117
8731A486117J9737j3066m6057m1765l1065j4537r479k4271o797l4895k4018l1504
$$ 1486117 1505854 1492788 1446731 1404966 1373901 1359364 1349885 1325614 1318817 1283922 1259904 1228400
8719A228400p124J2813K2701q502j9383l814N685J2869j061o757m479J7581L3390
$$ 1228400 1221276 1234089 1256790 1248288 1228905 1225091 1230776 1243645 1242584 1235827 1231348 1248929 1282319
8706A282319L3536J3475L8859K2398j3492O103l012Q354L709k5432k8805k5043
$$ 1282319 1315855 1329330 1368189 1390587 1377095 1383198 1380186 1388540 1392249 1366817 1338012 1312969
8694A312969m7638m4624q971k1167j4707j7720j5528j5131j4050j4761Q560N5441
$$ 1312969 1265331 1220707 1211736 1190569 1175862 1158142 1142614 1127483 1113433 1098672 1107232 1162673
8682A162673K0615l1450j1917P309J0015n679R056J0745M888J7364L5874J1081
$$ 1162673 1183288 1151838 1139921 1147230 1157245 1151566 1160622 1171367 1176255 1193619 1229493 1240574
8670A240574m563J1647K1900K0898L1109O238o8183m1826n596j866K888k5076
$$ 1240574 1236011 1247658 1269558 1290456 1321565 1327803 1259620 1217794 1212198 1210332 1213220 1188144
8658A188144k519k1225k5942l8493j8835j4505j1466j6294k1670k5271k1002K6080
$$ 1188144 1185625 1164400 1138458 1099965 1081130 1066625 1055159 1038865 1017195 991924 970922 997002
8646I97002L2055j3085n0631l2527J1689L695j6527L879K7659J8888N9627L149
$$ 997002 1029057 1015972 965341 932814 944503 948198 931671 935550 963209 982097 1041724 1044873
8634A044873n258j1013J359J8377K2470J8885J218L1169L5996J7933j7341l2149
$$ 1044873 1039615 1028602 1029961 1048338 1070808 1089693 1090911 1122080 1158076 1176009 1158668 1126519
8622A126519l0557N710J0727k5009l625P53L237k4137j0647l0344l1159m1723
$$ 1126519 1095962 1101672 1112399 1087390 1083765 1084518 1087755 1063618 1052971 1022627 991468 949745
8610I49745n1203k2089l2324j5943j1178K1682J9236l9568m0867l0K5229K8087
$$ 949745 898542 876453 844129 828186 817008 838690 857926 818358 777491 777461 802690 830777
8598H30777K4352j6064l4930n710j9584l4208k8914l2291l3620j6850k2800l6124
$$ 830777 855129 839065 804135 798425 778841 744633 715719 683428 649808 632958 610158 574034
8586E74034n7904j7549J6115j4616m3534K125o381k8537l4964n687k3763k8715
$$ 574034 516130 498581 514696 500080 456546 458671 452290 423753 388789 383102 359339 330624
8574C30624J338k0455j0641Q990K5138j311N229J2331j9899m976j8958j2789J3716
$$ 330624 331962 311507 300866 309856 334994 333683 338912 351243 331344 326368 307410 294621 308337
8561C08337Q695l7173m19J6280O756j9734n531J2448j3723k9911n682K3272n251
$$ 308337 317032 279859 279440 295720 302476 282742 277211 289659 275936 246025 240343 263615 258364
8548B58364K9146M5759L4708O016k7725l1559k5836j2682p300L65j8174k2805
$$ 258364 287510 333269 367977 373993 346268 314709 288873 276191 268891 269256 251082 228277
8536B28277k8928K095j5912J5380K8947K0394K4071K5968J9462n211k520k1070
$$ 228277 199349 201444 185532 200912 229859 250253 274324 300292 319754 314543 312023 290953
$$ [...]
##END NTUPLES=NMR SPECTRUM
##END=
