##TITLE=Analysis number 310761
Compound Code cc 45222
Book Reference 440/36
Project Code adrs
Chemist Name craigr
##JCAMPDX= 6.0         $$ Bruker NMR JCAMP-DX V2.0
##DATA TYPE= NMR SPECTRUM
##DATA CLASS= NTUPLES
##ORIGIN= Bruker BioSpin GmbH
##OWNER= NMR
$$ XWIN-NMR		Version 3.5
$$ Thu Jun 23 11:12:53 2005 GMT Daylight Time (UT+1h)  MAYBRIDGE\NMR@NMR_250MHZ
##.OBSERVE FREQUENCY= 250.131544655141
##.OBSERVE NUCLEUS= ^1H
##.ACQUISITION MODE= SIMULTANEOUS (DQD)
##.ACQUISITION SCHEME= undefined
##.AVERAGES= 16
##.DIGITISER RES= 18
##SPECTROMETER/DATA SYSTEM= dpx250
##.PULSE SEQUENCE= zg30
##.SOLVENT NAME= CDCl3
##.SHIFT REFERENCE= (INTERNAL, CDCl3, 0, 16.522)
##AUDIT TRAIL= $$ (NUMBER, WHEN, WHO, WHERE, WHAT)
$$ ##TITLE= Audit trail, XWIN-NMR		Version 3.5
$$ ##JCAMPDX= 5.01
$$ ##ORIGIN= Bruker BioSpin GmbH
$$ ##OWNER= NMR
$$ C:\u/data/dgb/nmr/ADRS/4600/pdata/1/auditp.txt
$$ ##AUDIT TRAIL=  $$ (NUMBER, WHEN, WHO, WHERE, WHAT)
(   1,<2005-06-23 11:12:33.88 +100>,<MAYBRIDGE\NMR>,<NMR_250MHZ>,
      <created by zg, POWCHK disabled, PULCHK disabled
       configuration hash MD5:
       62 19 C7 07 E1 42 D1 B7 37 6C 3D D0 77 39 F9 E6
       data hash MD5: 64K
       0E 10 5E 8D 1D 35 5B 9F E4 F1 31 FE B9 AE 16 28>)
(   2,<2005-06-23 11:12:44.96 +100>,<MAYBRIDGE\NMR>,<NMR_250MHZ>,
      <Start of raw data processing
       ef LB = 0.3 FT_mod = 6 PKNL = 1 SI = 32K 
       data hash MD5: 32K
       FC AD 62 81 BB 92 A9 87 A3 C8 C2 52 77 52 40 F5>)
(   3,<2005-06-23 11:12:46.69 +100>,<MAYBRIDGE\NMR>,<NMR_250MHZ>,
      <apk 
       data hash MD5: 32K
       E0 D7 6C BD 9E F2 93 73 30 E0 C5 A8 53 F4 61 81>)
(   4,<2005-06-23 11:12:47.38 +100>,<MAYBRIDGE\NMR>,<NMR_250MHZ>,
      <abs ABSG = 5 
       data hash MD5: 32K
       EB 29 EC 98 13 68 E6 56 06 5A 2A B1 F3 7A 58 49>)
$$ ##END=
$$ 
$$ hash MD5
$$ 32 5A C1 87 7B 83 6D 92 15 E4 A4 13 06 C1 19 E2
##$RELAX= 
##$RELAX= 
##$RELAX= 
##$RELAX= 
##$RELAX= 
##$RELAX= 
##$RELAX= 
$$ Bruker specific parameters
$$ --------------------------
##$DU= <C:\u>
##$EXPNO= 4600
##$NAME= <ADRS>
##$PROCNO= 1
##$TYPE= <nmr>
##$USER= <dgb>
##$AMP= (0..31)
100 100 100 100 100 100 100 100 100 100 100 100 100 100 100 100 100 100 
100 100 100 100 100 100 100 100 100 100 100 100 100 100 
##$AQSEQ= 0
##$AQ_mod= 3
##$AUNM= <au_zg>
##$AUTOPOS= <6 >
##$BF1= 250.13
##$BF2= 250.13
##$BF3= 250.13
##$BF4= 250.13
##$BF5= 500.13
##$BF6= 500.13
##$BF7= 500.13
##$BF8= 500.13
##$BYTORDA= 1
##$CFDGTYP= 0
##$CFRGTYP= 5
##$CHEMSTR= <none>
##$CNST= (0..31)
1 1 145 1 1 1 1 1 1 1 1 1 1 1 1 1 1 1 1 1 1 1 1 1 1 1 1 1 1 1 1 1 
##$CPDPRG= <>
##$CPDPRG1= <>
##$CPDPRG2= <>
##$CPDPRG3= <>
##$CPDPRG4= <mlev>
##$CPDPRG5= <mlev>
##$CPDPRG6= <mlev>
##$CPDPRG7= <mlev>
##$CPDPRG8= <mlev>
##$CPDPRGB= <>
##$CPDPRGT= <>
##$D= (0..31)
0 1 0 0 0 0 0 0 0 0.06 0 0 0 0 0 0 0.0002 0 0 0 0 0 0 0 0 0 0 0 0 0 0 
0 
##$DATE= 1119521552
##$DBL= (0..7)
120 120 120 120 120 120 120 120 
##$DBP= (0..7)
150 150 150 150 150 150 150 150 
##$DBP07= 0
##$DBPNAM0= <>
##$DBPNAM1= <>
$$ [...]
##$SUBNAM7= <"">
##$SUBNAM8= <"">
##$SUBNAM9= <"">
##$SW= 20.6930455092707
##$SWIBOX= (0..15)
0 0 3 0 0 0 0 0 0 0 0 0 0 0 0 0 
##$SW_h= 5175.983436853
##$TD= 65536
##$TD0= 1
##$TE= 295.16
##$TE2= 300
##$TE3= 300
##$TEG= 300
##$TL= (0..7)
0 120 120 120 120 120 120 120 
##$TP= (0..7)
150 150 150 150 150 150 150 150 
##$TP07= 0
##$TPNAME0= <>
##$TPNAME1= <>
##$TPNAME2= <>
##$TPNAME3= <>
##$TPNAME4= <>
##$TPNAME5= <>
##$TPNAME6= <>
##$TPNAME7= <>
##$TPOAL= (0..7)
0.5 0.5 0.5 0.5 0.5 0.5 0.5 0.5 
##$TPOFFS= (0..7)
0 0 0 0 0 0 0 0 
##$TUNHIN= 0
##$TUNHOUT= 0
##$TUNXOUT= 0
##$USERA1= <user>
##$USERA2= <user>
##$USERA3= <user>
##$USERA4= <user>
##$USERA5= <user>
##$V9= 5
##$VALIST= <valist>
##$VCLIST= <CCCCCCCCCCCCCCC>
##$VD= 0
##$VDLIST= <DDDDDDDDDDDDDDD>
##$VPLIST= <PPPPPPPPPPPPPPP>
##$VTLIST= <TTTTTTTTTTTTTTT>
##$WBST= 1024
##$WBSW= 4
##$XGAIN= (0..3)
0 0 0 0 
##$XL= 0
##$YL= 0
##$YMAX_a= 369944
##$YMIN_a= -299173
##$ZGOPTNS= <>
##$ZL1= 120
##$ZL2= 120
##$ZL3= 120
##$ZL4= 120
##$ABSF1= 16.522
##$ABSF2= -4.171173
##$ABSG= 5
##$ABSL= 3
##$ALPHA= 0
##$AQORDER= 0
##$ASSFAC= 0
##$ASSFACI= 0
##$ASSFACX= 0
##$ASSWID= 0
##$AUNMP= <proc_1d>
##$AZFE= 0.1
##$AZFW= 0.1
##$BCFW= 0
##$BC_mod= 0
##$BYTORDP= 0
##$COROFFS= 0
##$CY= 12.5
##$DATMOD= 1
##$DC= 0
##$DFILT= <>
##$DTYPP= 0
##$F1P= 14.0000005364418
##$F2P= -0.99999901652339
##$FCOR= 0.5
##$FTSIZE= 32768
##$FT_mod= 6
##$GAMMA= 0
##$GB= 0
##$INTBC= 1
##$INTSCL= 1
##$ISEN= 128
##$LB= 0.3
##$LEV0= 0
##$LPBIN= 0
##$MAXI= 10000
##$MC2= 0
##$MEAN= 0
##$ME_mod= 0
##$MI= 0
##$NCOEF= 0
##$NC_proc= -5
##$NLEV= 6
##$NOISF1= 0
##$NOISF2= 0
##$NSP= 0
##$NTH_PI= 0
##$NZP= 0
##$OFFSET= 16.522
##$PC= 1
##$PHC0= 129.9415
##$PHC1= 5.514449
##$PH_mod= 1
##$PKNL= yes
##$PPARMOD= 0
##$PSCAL= 4
##$PSIGN= 0
##$REVERSE= no
##$SF= 250.13
##$SI= 32768
##$SIGF1= 0
##$SIGF2= 0
##$SINO= 400
##$SIOLD= 32768
##$SREGLST= <1H.CDCl3>
##$SSB= 0
##$STSI= 32768
##$STSR= 0
##$SW_p= 5175.98343685301
##$SYMM= 0
##$S_DEV= 0
##$TDeff= 65536
##$TDoff= 0
##$TI= <Analysis number 999999
Compound Code 99
Book Reference 9
Project Code 9>
##$TILT= no
##$TM1= 0
##$TM2= 0
##$TOPLEV= 0
##$USERP1= <user>
##$USERP2= <user>
##$USERP3= <user>
##$USERP4= <user>
##$USERP5= <user>
##$WDW= 1
##$XDIM= 32768
##$YMAX_p= 591390531
##$YMIN_p= -168217
$$ End of Bruker specific parameters
$$ ---------------------------------
##NTUPLES= NMR SPECTRUM
##VAR_NAME=  FREQUENCY,     SPECTRUM/REAL,   SPECTRUM/IMAG
##SYMBOL=    X,             R,               I
##VAR_TYPE=  INDEPENDENT,   DEPENDENT,       DEPENDENT
##VAR_FORM=  AFFN,          ASDF,            ASDF
##VAR_DIM=   32768,         32768,           32768
##UNITS=     HZ,            ARBITRARY UNITS, ARBITRARY UNITS
##FACTOR=    0.157963299565203, 1,           1
##FIRST=     4132.6476996994, 0,             0
##LAST=      -1043.33573715361, 0,           0
##MIN=       -1043.33573715361, -168217,     0
##MAX=       4132.6476996994, 591390531,     0
$$ Real data points
##PAGE= N=1
##DATA TABLE= (X++(R..R)), XYDATA
$$ [...]
22615 38687 52724 26722 17976 16484 26775 34398 13258 27501 39148 10117 9205 10921 11119
22602 11119 29785 32660 34074 67767 77234 72146 78611 61470 40003 54350 97224 117286 110637
22589 110637 111236 133618 149603 178547 171110 166285 171975 196350 229079 253285 269816 324434
22577 324434 370299 426905 539293 657247 818649 1016954 1232353 1510961 1870859 2262793
22567 2262793 2653854 3153284 3829563 4749156 5957386 7261488 8223933 8635898 8626727
22558 8626727 8105115 7048423 5805336 4741374 3947313 3391367 2954147 2651975 2422703
22549 2422703 2223753 2041875 1893258 1768388 1666893 1591534 1542738 1490887 1432750 1388279
22539 1388279 1353200 1330166 1291153 1262621 1228300 1212495 1196510 1182876 1201156 1215534 1190778
22528 1190778 1182525 1173247 1172352 1130985 1124669 1108498 1060291 1018594 990091 937296 881683 824198
22516 824198 748771 722498 694879 660781 627571 589284 562136 533720 507731 469382 439844
22505 439844 413566 378652 350045 347203 350221 337982 328673 305492 282823 256310 248635 266918
22493 266918 269935 273240 261367 236639 216828 203993 191873 188139 202814 199844 197235 190510 185402
22480 185402 190071 186120 180164 162703 138575 128884 111553 96670 93782 100865 107970 99928 83604
22467 83604 61302 62336 64110 73637 83076 105466 129937 123326 98462 85063 67691 58854 88237
22454 88237 88649 66185 65200 57334 45919 46893 32087 15797 85 34938 57966 44641 37020
22441 37020 5017 -20956 -15375 -3823 23469 22121 8295 23051 25460 46746 60725 75727
22429 75727 44671 44372 62849 43276 14549 -7722 838 18346 22025 21082 23433 11618 1946
22416 1946 13453 40439 28115 19952 20068 22346 29117 42625 13591 -10658 -15405 4971 -57
22403 -57 -1827 -4506 7807 18361 -1153 -1524 15624 4486 -7675 -3610 9223 -3045 -4193
22390 -4193 16696 19798 -11976 -38483 -54638 -38510 -18617 13268 50723 25654 16640 11074
22378 11074 -3151 -30082 -24966 12746 31710 50250 35947 -5591 -36328 -25005 2364 -9708
22366 -9708 3221 35651 46978 9509 -19477 -21478 -6142 14142 428 3567 5565 17111
22354 17111 18260 12993 2209 -23741 -38598 -19660 -4945 6285 39162 55770 58367 25526
22342 25526 36588 63138 16003 -10659 -25282 17615 50263 16856 4149 18420 16420 -12541
22330 -12541 -28321 -23457 -9220 -18431 -8651 -158 16846 35513 18595 -4603 -1503 -5699 -19166
22317 -19166 -21401 8750 2918 -2792 -17710 -41285 -17007 -3696 -7431 -758 -32497 -36432 -9400
22304 -9400 6041 27745 39114 29172 13292 23816 28070 17672 27561 22147 -3734 -11601 -22233
22291 -22233 -5868 154 -28702 -35157 -25812 -29914 -45912 -31616 -42889 -68288 -55397 -7118
22279 -7118 13239 15337 12476 -1169 1513 -11472 -6138 6897 23537 22920 8758 -8951 5870
22266 5870 11499 14552 -13713 -19091 -23861 -39121 -26462 -5104 -10304 -7939 11730 16892 28826
22253 28826 31938 7275 -16107 -27981 -34416 -18811 6373 16801 16812 30694 55649 41392 20396
22240 20396 10682 22115 -7976 -13119 -13914 -3507 8631 8378 16631 45391 28135 18451 22596
22227 22596 21814 9171 7759 13025 24739 49195 71484 66551 41984 20766 11684 -5400 61
22214 61 -4965 -16848 24024 34646 30948 11638 -7003 -4352 316 15591 31506 37029 -7606
22201 -7606 -29930 -6661 5738 10667 -6143 -2784 10650 16294 -30742 -43072 -6052 -7576 -465
22188 -465 -1503 11545 20080 21516 -5547 -11548 7130 4407 -13879 -6128 6516 -2761 -20842
22175 -20842 -21370 -33216 -22834 -24988 -15137 -28369 -30799 -25502 -11538 -7911 -14646 -10228 -8761 -13311
22161 -13311 -18557 -19210 1784 -6008 -2352 -9451 -60 14275 1415 -11124 -4116 -18058 -6374
22148 -6374 -6020 -33229 -23186 2614 8386 19057 23931 25343 14999 -516 9293 17890 24447
22135 24447 5989 4705 1098 -11049 9156 4724 8105 -18638 -5479 33221 41555 9766 -7953
22122 -7953 5667 35329 889 -19183 -28922 -3916 3478 -12126 12663 25870 4109 -12921
22110 -12921 -8603 20293 10796 -14044 -10363 2390 -20498 -19368 -16458 -7881 -16494 -6511 -27820
22097 -27820 -14642 -27138 -51885 -41562 -32884 -31458 -18590 -35338 -27662 -22195 -12144 -25732
22085 -25732 -31650 -15476 -7527 519 -8111 -33904 -51331 -37379 -30120 -14551 -5190 1262 6564
22072 6564 -5856 -567 24397 17073 17592 15413 23110 26547 20084 34713 17692 13355 15898 -10387
22058 -10387 8781 3754 -25909 -27375 8195 17940 -1663 -12435 -21723 4738 22798 33862
22046 33862 48665 57755 50264 40127 20156 12691 12961 20068 48650 44355 43115 49133 21239
22033 21239 -8648 -19108 -29352 1479 27869 46215 38392 19733 6826 10429 3062 -20767
22021 -20767 -38306 -20179 -30198 -37406 -31836 -3210 19069 17539 18261 6339 -6625 -16310 -34441
22008 -34441 -39050 -19696 15912 3251 2596 1777 21181 26342 25609 38189 50368 55264 52161 1190
21994 1190 -19456 -15511 25345 38305 27874 38999 44076 14880 -12685 -616 20865 25804
21982 25804 24505 24685 41036 7343 -10369 -24100 -29016 -32719 -50942 -42762 -13454 -10526 -20600
21969 -20600 -22455 17129 54528 51943 34417 13541 -16817 -25984 -12951 -8756 -12151 3988 32319
21956 32319 43961 30686 1957 4770 18070 10949 7564 3441 -7803 -18242 -7904 647 17003
21943 17003 11492 -4122 -4625 1578 -4533 1207 34621 56763 40739 51078 33462 25278 784
21930 784 13590 6813 18335 27854 -4433 -31977 -41679 -35602 -27190 -35627 -41376 -42356 -59720 -58689
21916 -58689 -39158 -28443 -29707 -32514 -15015 -15245 -7847 -23456 -39371 -35952 -40073 -26853 -18532
21903 -18532 -34317 -25184 -8165 14079 23626 -7578 -6083 6010 1156 -23360 -65084 -65795 -36737
21890 -36737 -27680 4147 9043 -14222 -18928 -8949 -44372 -34728 -15022 -23831 -27742 -8878 -11566
21877 -11566 -19640 -13894 -25675 -18962 -21502 -36213 -58713 -49387 -13060 -16194 -16594 12648 9371
21864 9371 11563 -15647 -35361 -20476 -22473 -37561 -16423 -21048 -37043 -26977 -60 -11582
21852 -11582 -1787 -8003 -29802 -33623 -15024 7775 12015 20057 22229 19762 11206 11561 3000 5843
21838 5843 -20457 -53118 -57966 -53212 -44361 -35623 -28390 -31127 -39639 -10364 -1615 -12502 6380
21825 6380 47215 15484 -7634 -8034 -23126 -38647 -13767 -9795 -10879 -12010 -7331 -3267 -4409
21812 -4409 -11813 -30113 -51035 -38717 -15216 -28176 -44283 -26300 -11276 -3549 7778 16354
21800 16354 17941 26146 18985 -133 11004 3482 -4219 14171 25137 -12908 -28599 -10752 -11063
21787 -11063 10743 22561 16559 -7080 -28829 -3503 21822 13848 -23310 -36765 -44783 -51459
21775 -51459 -34408 -38345 -20598 19227 -15091 -37760 -61224 -54093 -41980 -27175 -14164 -23607
21763 -23607 -9330 -3501 -17728 -24003 -29026 -24343 63 -10135 -21704 -44011 -20248 -12183 5673
21750 5673 -6171 -21776 -11862 5143 5975 -1387 -2396 -8637 -24932 -20639 -38202 -27192 -31057
21737 -31057 -55781 -65130 -47194 -29746 -20439 -15517 -9639 -10255 -18634 -1299 21296 22736 21286
21724 21286 2098 843 2728 20156 21235 5435 3992 6606 11886 20455 16478 4830 -22143
21711 -22143 -32191 -17329 -13917 -71 -9278 1032 -13658 -22302 -18814 -26065 -34920 -37831 -37832 -16590
21697 -16590 -8669 -1692 6050 -9043 2365 5218 -12632 -8361 -9728 4351 23338 10342 -11166
21684 -11166 -25294 -17672 -20640 -29742 -52356 -66759 -41962 -37673 -598 -252 -1187 5069 16104
21671 16104 21609 3603 785 13588 36028 25809 15177 8923 24031 20234 3658 -25031
21659 -25031 -43672 -9931 52240 37964 482 -7857 2132 -18939 -29450 -1618 -8473 -18060
21647 -18060 2247 -1411 -4096 -11559 1015 -8676 7577 22417 18768 609 14391 15490 -4048
21634 -4048 -7038 -16531 -539 8992 -15261 -27502 -19877 -31246 -36342 -45437 -50814 -64034 -66806
21621 -66806 -46230 -30445 -45837 -22949 18106 6971 17933 8648 -17312 -14273 -3493 -11775
21609 -11775 -33543 -25451 -18856 -28826 -38866 -35561 -37960 -15300 292 -654 -12106 13983 26720
21596 26720 5767 -3193 -10918 -6930 -41612 -91551 -84877 -70324 -63715 -77065 -70480 -39567 -50645
21583 -50645 -60516 -46221 -17290 -24338 -40454 -44244 -32863 -27429 -27973 -27966 -30090 -38630 -30195 -19138
21569 -19138 20630 25878 29327 371 -21805 -3770 -20422 -24353 -7312 -17629 -46134 -39949
21557 -39949 -34687 -19013 -692 14332 11816 17430 24970 19610 9789 551 26915 15755 -4362
21544 -4362 -12210 -33195 -24930 -7206 -7130 -19695 -16870 -7237 -8011 -3275 -6100 -29716 -29061 -10705
21530 -10705 -16671 -2339 1459 -5029 -6163 -19348 -15415 -9607 4500 9516 5036 -2216 -12922
21517 -12922 -52834 -87614 -89700 -49953 -23556 -24509 -12371 5477 2913 -12109 -5052 32075 19658
21504 19658 -1588 -11433 13605 17239 -5741 -11419 -36216 -46743 -28840 7808 11294 25428
21492 25428 19999 30637 20982 8028 -25347 -39041 -22028 -29226 -28729 -5186 5172 -3683 11060
21479 11060 8036 -37278 -34795 8292 14649 -22518 -20985 -666 11117 10710 -11047 -27198 -24622
21466 -24622 -11132 -458 22468 27999 36954 27336 3043 -29691 -23564 -1752 -16028 -39164
21454 -39164 -57267 -36683 -24383 -27441 795 25656 15546 9677 -12537 -20255 -13913 -39120
21442 -39120 -27390 -10979 -23390 -46013 -54159 -59809 -36624 -68938 -52707 -14416 -2094 -8380
21430 -8380 3435 12543 -4278 -13205 -12856 -28574 -43254 -41364 -22509 -58 2187 -16856 -11183
21417 -11183 18096 12415 -15585 -36019 -27345 -10846 -16897 -24312 -18839 -7720 7528 3818 -5803
21404 -5803 -31622 -47798 -6031 17962 10975 8391 30491 40906 28495 18629 3405 -1268 16083
21391 16083 10039 353 -27619 -42536 -47161 -25328 -29182 -18738 -5998 13660 36810 13775
21379 13775 -3115 8222 10552 14608 27923 31596 3612 -25975 -25354 -49646 -57364 -20678 19105
21366 19105 38491 26174 24378 15627 -8701 -16769 -13630 -14906 -20273 -24835 -21193 -17846 -21339 15597
21352 15597 32985 37670 33191 13419 -8366 -11632 5611 5877 9611 8297 -35343 -65662 -53720
21339 -53720 -29272 -15190 1204 8258 -18117 -38364 -36823 -22983 -9790 -2312 -27152 -16572
21327 -16572 -14107 259 -23775 -16952 3588 19102 15809 20263 27236 -9798 -6162 -18410 -19242
21314 -19242 15327 42844 42824 33995 26035 -10593 -33556 -31145 -23880 -18951 -13836 -22702 -8302 -22844
21300 -22844 -41519 -56529 -44722 -32803 -8047 5687 -17861 -21268 -10503 -4345 -8426 15686
21288 15686 21430 22320 10933 11300 -18485 -55466 -47339 -39380 -38907 -34082 -28484 -19271 -16835 -13687
21274 -13687 3789 5873 -11102 -19706 -36277 -41995 -29363 -31186 -38184 -57500 -57860 -29586 -15013
21261 -15013 -43689 -93143 -77792 -42375 -52025 -93205 -89492 -45317 -25311 -36329 -26377 -4515
21249 -4515 -12744 -7126 9036 23450 8197 10744 38898 26100 8917 -8379 4201 2883 -1308
21236 -1308 -26784 -21841 -14212 -11147 11195 12318 -22922 -37901 -19092 4489 9739 2710 -9038
21223 -9038 -1558 24584 28870 -3797 -5508 1334 5460 -15098 -27864 -38667 -40618 -28789 -34386
21210 -34386 -40459 -43856 -38684 -51895 -54432 -25432 -5993 -35483 -35248 -6630 -4323 -5513 6429
21197 6429 17915 11206 7560 26998 23894 7430 -6060 -2837 -17348 -4833 -10476 -28181 507
21184 507 34168 21020 -4253 -934 7581 -1925 -30828 -39992 -42315 -38503 -37961 -38419 -39966 -13346
21170 -13346 -7796 976 6079 5175 -9513 -31136 -31092 -6557 -7373 -19683 -15953 10760 -1437 -1589
21156 -1589 12083 15289 23351 24917 26547 13221 16341 24546 6106 -7551 -1965 12545 3564
21143 3564 14305 9756 4010 -7706 -19905 -15989 -51065 -40011 -17078 7219 27640 18350 18194
21130 18194 21428 -5714 -26903 -15298 -27224 -29453 -14807 -8706 -7507 -1505 -6232 13156 43392
21117 43392 36705 23216 19989 2131 -8478 2854 26536 22170 14020 -4032 -24619 -9639
21105 -9639 -13291 -12066 1844 32068 16157 -3251 -3352 12644 23666 17361 -6250 -18193 -5453
21092 -5453 -2662 -14565 -29293 -59430 -65218 -27522 363 -6975 -29668 -11429 865 16157
21080 16157 5562 -5193 248 -3496 -12105 -23190 -24119 -29684 -20923 15851 2471 -13282 -2558
21067 -2558 8941 -8836 -23609 -30371 -15744 -4626 15218 21819 16744 10302 6713 10132 13392
21054 13392 10589 6757 3847 16906 5684 13231 29894 618 -8709 -143 20079 36879 24657
21041 24657 5667 -8322 -12239 -10115 -37012 -32241 -21739 -34758 -27261 -14796 -20764 -41452 -49854
21028 -49854 -21860 13450 25540 20280 -2768 -22529 -23714 -6518 -4417 -9615 -12592 -11984 -17269
21015 -17269 19380 19936 -4984 4258 -3569 -12123 15190 26489 50927 48348 20147 3869 -17026
21002 -17026 -24849 -56104 -22955 -12085 -21075 -25203 -55230 -76330 -69672 -60210 -38734 -38051 -11214
20989 -11214 11342 -16218 -44664 -12088 3887 -49146 -47667 -40302 -31654 -14938 -6516 -3854 -15709
20976 -15709 -2557 -25969 -8393 8465 -23134 -32912 -9603 -1872 -5135 -9434 -15364 -20304 -14433
20963 -14433 -13148 -4904 -260 21141 32742 2354 6236 -12385 -31340 -10400 -990 -3148 -12857
20950 -12857 -48368 -55244 -54378 -53945 3796 -2869 -28242 -3880 36764 14081 -32783 -32511 -639
20937 -639 -6423 -24007 -53373 -59538 -72793 -72057 -50774 -30268 -13306 -16270 -28130 -29944 -22117
20924 -22117 -17679 -18122 -20848 -24526 -12193 -8984 -21881 -31933 -29073 -12635 -13619 -14931 -36856 -41652
20910 -41652 -28391 -22065 -25819 -14594 -2376 -9346 -11447 -14121 -34566 -53813 -47119 -7242 -5426
20897 -5426 -22942 -48249 -50067 -33484 -3313 8364 -11276 -4831 -17222 -25651 -13027 -8841 -21478
20884 -21478 -22518 -39217 -54577 -46733 -41294 -26737 5691 9870 25019 34374 29184 2084 -24123
20871 -24123 -10916 -9287 -28247 -39440 -25809 -18524 3362 39841 23320 13966 31717 -2520
20859 -2520 -23125 -19051 -9979 9940 28510 5070 -11976 8602 202 7282 5681 -6058 11741
20846 11741 -4864 -47187 -44127 -37518 -33199 -39453 -51745 -44153 -12507 -2503 1561 31139 27605
20833 27605 17858 -10600 -26656 -13779 -32259 -29214 -39060 -27297 -16330 -24769 -32595 -44916 -71399
20820 -71399 -64097 -61711 -53800 -50046 -40593 -6756 37408 15457 -15907 -36788 -12745 -43543 -52330
20807 -52330 -45285 -38438 -28648 -12215 2491 -1822 -14758 -30631 -1531 36045 44225 30052 3520
20794 3520 -33987 -35968 -15465 -15099 -21595 -12854 -38669 -32457 -15728 -15804 -22636 -1216 20398 24219
20780 24219 19909 7994 -11382 -15954 -8336 6074 2030 -19272 -16055 -2831 5999 -13050 -43609
20767 -43609 -32492 -15477 -634 -4982 -16616 -33285 -27673 -13713 -11972 1108 6168 -29611
20755 -29611 -54613 -57007 -55104 -39585 -20372 26835 26900 15939 10781 -3790 -24069 -12408 -8189
20742 -8189 -27071 -26457 -28025 -48830 -61357 -75065 -61041 -24533 8266 3371 -2142 8233 -25463
20729 -25463 -28110 -17035 1494 9926 -712 12802 41539 25832 -5332 -16098 -2720 44274
20717 44274 27861 1385 -2142 14478 25886 16481 -8006 -23584 -29640 -3526 3871 -2573 -231
20704 -231 -11806 -26290 -17085 -33779 -33772 -12206 18486 31781 -11134 -58568 -37766 5427 -9239
20691 -9239 -16974 13583 22222 27483 -1804 -46627 -57166 -51733 -28663 -34093 -39782 -6025 20069
20678 20069 9057 -24206 -50858 -43321 -42327 -31824 -32895 -19951 11676 16367 22221 9982 -4221
20665 -4221 10635 -19636 -46001 -67092 -73394 -54023 -27017 -14061 -25000 -20447 -17596 -2530
20653 -2530 17016 -16850 -58453 -62945 -41961 24513 36182 30391 43032 45115 29889 1996
20641 1996 -9916 -10991 -14777 -8986 21566 22277 -258 6460 5400 -18502 -15801 -10170 -11327 -33263
20627 -33263 -63312 -55460 -11604 15699 23424 34027 17893 15222 20218 33902 16790 -16095
20615 -16095 5619 20283 22610 20378 4162 -20146 -1973 11260 -3668 -23863 -17655 -33943
20603 -33943 -46526 -6902 3147 -23927 -28525 -14461 -1810 -4989 4647 21004 14299 -19578
20591 -19578 -19822 -16366 -32135 -48411 -41555 -26001 20755 26235 -2460 13469 46722 25846 -8561
20578 -8561 3831 17846 4078 -13042 -38815 -34192 -39588 -31344 -27354 -22303 -3324 -7059 -6945
20565 -6945 5116 -3698 331 14478 -20456 -33569 -32767 -30138 -27663 -38688 -29580 -22528 -17334 -13533
20551 -13533 -13430 4261 15890 16108 -13928 -32063 -28442 -26759 -10404 13768 -1988 -17391 9421
20538 9421 24454 4980 -241 17839 30115 -838 -39508 -32918 -19007 -7095 -17510 -18216 -11574
20525 -11574 12203 13883 -8585 -19267 -33831 -60512 -36843 -31150 -45461 -62033 -54912 -43793
20513 -43793 -46486 -54158 -48482 -49555 -52686 -48273 -22536 -652 18414 9610 14285 15461 -2964
20500 -2964 -15862 10700 32654 25409 -11724 8265 8386 -11197 -11644 -15281 -16230 -21851 1733 469
20486 469 1057 -20335 -20909 -16861 -4682 -4539 -21533 -27692 -24964 -29283 -5071 -6080 -13579 7402
20472 7402 20388 14477 15175 11310 -1513 2737 24543 49798 42289 5215 3500 19391 10506
20459 10506 -8153 -17172 -28589 -11080 -12447 -6912 -5736 4275 -5996 -14440 -30962 -25669 -18074
20446 -18074 -9167 8884 18158 26769 27002 15622 33031 28331 -6695 -9904 -5385 -9725 -10391 -10284
20432 -10284 -3379 4866 10587 -25952 -13168 18135 22043 6805 -16431 -25876 -40244 -29180 -27703
20419 -27703 -11884 -759 3422 9384 21971 20475 6135 -9861 -24376 -16850 13911 17437 -8775
20406 -8775 6070 -9034 -13598 1733 17063 19326 -4282 -7733 2274 -11548 -7829 -12523 -24004
20393 -24004 -19422 -3277 -18066 -25082 -19416 16320 30632 27134 6300 -5901 10199 39696
20381 39696 56214 59872 36820 15241 31197 53572 81688 130536 122797 130192 122082 102714
20369 102714 111323 168238 192645 180290 183411 193890 197213 211076 193709 163727 158156 173825
20357 173825 165550 135155 137506 146013 131962 135719 112801 92261 94710 102614 112443 91877 80019
20344 80019 74074 61590 59576 37986 34727 51705 49499 39376 44285 45393 26183 31077 64658
20331 64658 72166 49364 44211 27462 18807 23426 24988 5676 -14653 -9647 -10656 -5035 -9606
20318 -9606 2824 -5697 -3096 -7677 -6313 -166 -16344 -22647 -10692 9565 11056 8313 22220
20305 22220 31239 27590 10891 46389 32374 19040 21604 37529 68224 66387 11924 -14021
20293 -14021 3243 9315 17832 9279 6579 -12885 -30000 -15615 -26232 -52898 -48456 -58171 -62460
20280 -62460 -46925 -18442 -1346 12932 5206 -13019 -4543 26174 37799 19686 -8556 -23489
20268 -23489 -24259 -30474 -42802 -21965 -250 -12669 -23502 -38932 -21738 -14092 -444 -12954
20256 -12954 -48477 -25076 -2540 -5349 16791 29433 -1049 -280 10530 16218 15304 12579 12416
20243 12416 720 -6298 2288 6256 -14394 -5903 -95 2505 8358 28960 32383 44567 52723
20230 52723 39076 20764 -8727 -30783 -16237 -10677 -19478 -12308 -2109 -5308 31182 37839 32032
20217 32032 14371 23418 20647 21582 46704 16390 -3841 -19480 -32813 -12985 -17865 -27285 9000
20204 9000 28609 41849 48188 29330 21963 13721 19273 18059 30989 27502 12804 12073 17766 33888
20190 33888 43259 30603 32843 43908 35775 59471 66071 64578 39670 54049 29533 48363 42733
20177 42733 37969 33742 11739 3333 14097 35921 46854 44289 23227 40308 42176 53560 72270
20164 72270 68650 68044 55956 43038 35112 27430 52304 78656 70651 60707 65558 82835 98139
20151 98139 87828 77345 89843 102128 110633 136799 151297 145903 183232 209360 198553 227878
20139 227878 286047 342814 390704 455621 532724 606085 700262 842814 998243 1172928 1429898
20128 1429898 1773165 2122336 2403633 2597358 2735075 2866819 2893931 2853077 2875261 3022389
20118 3022389 3370837 3913109 4454448 4711247 4806217 4855102 4807354 4494212 4032656 3628511
20108 3628511 3393841 3373141 3494056 3610986 3602678 3536578 3453770 3282509 2998689 2650773
20098 2650773 2351055 2135305 1949728 1785888 1686769 1585011 1525356 1497433 1443621 1401247
20088 1401247 1374481 1321469 1279481 1260836 1236286 1197998 1162464 1119129 1105838 1085445 1068534
20077 1068534 1045925 988025 961252 936783 895567 826928 802535 785002 751419 703807 687169
20066 687169 659225 640004 602183 560809 536078 514075 494852 481535 476074 470162 426927 382169
20054 382169 371694 356381 354006 350875 315469 272881 265871 249871 238962 208179 171911 180928
20042 180928 157772 145331 167753 139364 120558 129362 131938 127270 145978 134559 135426 138232 112624
20029 112624 88072 101280 89350 70443 85060 82585 94747 112320 111196 91769 64042 52702
20017 52702 37629 51162 43846 16074 44606 63332 55778 60699 56636 54588 54955 48835 58579
20004 58579 64796 38069 22049 25273 25547 19874 16764 20247 36856 56640 32885 27602 24211
19991 24211 25930 46962 36454 34363 49088 75811 63161 42028 29646 27306 51301 45002
19979 45002 31331 30180 49873 45175 18674 -7357 853 25416 30839 13542 -4304 -13005 -9906
19966 -9906 -3722 -18648 -36288 -36607 -36571 -39074 -27515 -32799 -41315 -15525 -10191 -17718 -26008 -16544
19952 -16544 -3985 -9714 22902 39468 38407 21133 104 -6204 -8380 -11301 -25550 -9559 20308
19939 20308 9883 -1369 32362 47791 26370 6349 -13137 -12370 1919 17247 12894 25739
19927 25739 39354 35527 17053 42496 32958 50855 78695 45132 3934 11920 19333 32548
19915 32548 32715 31969 67253 65121 38457 47361 44617 51775 37762 43036 31274 33543 37845 36353
19901 36353 27422 25194 14849 35544 52315 56417 52966 34365 37334 53495 72433 70460 31188
19888 31188 -8425 -9374 18321 671 -17500 14554 19963 2351 -15817 4755 37520 56518
19876 56518 40791 32817 34836 42380 30893 19603 23638 30170 6293 12464 73051 81526 71038
19863 71038 61409 52400 59225 35912 17345 28413 54615 73688 44381 25353 44193 43506 30615
19850 30615 22607 22274 20637 -2939 -318 22309 54521 61312 49539 25948 8222 22783 43036
19837 43036 67232 52517 41105 43924 67039 50924 29640 18037 17845 21586 34824 49138
19825 49138 61659 61204 61210 63452 51922 52108 59260 85223 103280 105400 96227 104249 104930 83379 105289
19810 105289 131091 116844 102917 95084 97265 107786 111356 106534 118296 156425 175114 167372
19798 167372 174754 204381 230977 264549 251241 233835 213971 265548 338461 401458 463648 498320
19786 498320 552879 642039 765592 941167 1180958 1447008 1673475 1716917 1640267 1562193
19776 1562193 1556822 1645178 1837720 2138890 2441281 2596223 2637939 2608946 2435986 2172326
19766 2172326 1969941 1839037 1799450 1849732 1966309 2072117 2020911 1812069 1582523 1382801
19756 1382801 1230961 1124807 1053316 1030581 969296 943578 943946 950745 932674 922101 928501 934620
19744 934620 940474 971229 1032189 1074102 1132660 1200022 1277624 1339086 1427013 1559816 1733277
19733 1733277 2005052 2321730 2559747 2639403 2590553 2502975 2466318 2530851 2724120 3019397
19723 3019397 3339286 3521612 3551419 3504483 3331272 3052071 2771693 2572138 2510316 2546424
19713 2546424 2649547 2793918 2748624 2474080 2179045 1947349 1756529 1614376 1495549 1387588
19703 1387588 1342148 1283982 1217235 1149515 1091487 1082177 1059745 1007786 961950 933986 910955
19692 910955 882992 869097 861945 856658 878152 878081 853822 840077 812813 805268 800485 785608 779892
19679 779892 757544 730641 737949 721878 702701 702938 692303 685879 666397 667891 641460 623483
19667 623483 602952 592479 631229 680614 707697 735889 721574 640546 555229 515646 500349
19656 500349 460059 433899 433396 462237 498243 507594 502333 491654 431275 410029 407633 399989 363148
19643 363148 317399 312182 306228 310714 312865 341757 358046 380627 368752 350635 353367 349619 360052
19630 360052 380505 373829 385566 395862 382852 379777 382324 399578 423892 428629 427715 432023 424796
19617 424796 429761 445189 472101 507226 562602 590757 561607 507533 473992 439786 438945 449970
19605 449970 470117 475166 479028 511427 523350 503341 471381 452531 431808 391911 379006 363026
19593 363026 312826 306753 300776 278442 248952 230639 197229 205682 223807 226621 247016 248581
19581 248581 235795 213137 206654 196166 187789 188909 180231 195443 180894 150272 180136 209038
19569 209038 214510 191094 177421 153700 151765 147316 128702 139344 147629 122022 109318 108323 118766
19556 118766 132492 183314 179747 178932 163990 132990 124746 141855 146403 151770 143538 139288 140529
19543 140529 128858 124624 153232 154185 155648 189477 188444 188852 160077 159483 182482 183858 191699 217067
19529 217067 186432 168196 167028 173570 172641 194145 193261 183442 174885 190840 189960 155016 168339
19516 168339 200620 201456 215236 202101 185995 183143 155901 145057 133719 136088 142854 193759
19504 193759 213152 190772 164970 170994 194319 171067 143552 131945 160560 186440 164956 150469
19492 150469 166387 180359 196085 245404 252681 253636 269465 314805 345557 346248 355233 375867 364772
19479 364772 367107 390600 402743 437004 427916 421243 422949 397760 404364 400502 379264 373895 375492
19466 375492 404287 425893 444839 433544 405111 390552 356436 337237 321575 334248 326899 325328
19454 325328 321959 330393 358887 373983 409334 445432 493838 527473 578821 649987 766783 916065
19442 916065 1100435 1346996 1603274 1780052 1826624 1796460 1734872 1725919 1810173 2012667 2319205
19431 2319205 2591384 2740833 2777131 2706171 2511538 2267167 2125846 2023838 2020466 2126610
19421 2126610 2238788 2220350 2063223 1857764 1685552 1542617 1428393 1360806 1279593 1195552
19411 1195552 1150947 1098699 1050510 1008996 984031 1007257 1044513 1051118 1030943 1037608 1039738 1040342
19399 1040342 1045087 1110817 1230638 1314730 1425547 1594872 1835674 2140787 2397567 2543551
19389 2543551 2514529 2411179 2339756 2384442 2532392 2799861 3122433 3396946 3548283 3544234
19379 3544234 3372382 3087729 2824313 2661288 2584918 2643437 2790980 2903299 2867879 2636502
19369 2636502 2375520 2139172 1934243 1803047 1706297 1638359 1585970 1566211 1545732 1524495
19359 1524495 1452782 1391759 1344731 1290495 1263611 1236296 1185833 1142197 1110611 1097235 1081262
19348 1081262 1064990 1074747 1047746 1010285 1007805 987740 964649 918445 891117 883760 858466 838268
19336 838268 824147 814191 792093 788512 787722 758219 736649 731459 739119 747997 724370 705211 684437
19323 684437 629395 608116 637847 642189 628009 595071 587894 588425 592778 621311 665784 674221 662124
19310 662124 648824 682343 723162 713247 721731 719945 749337 789727 793590 824695 844993 861672
19298 861672 851856 860894 874710 882601 860301 846974 843116 852444 879746 905515 902794 920293 932506
19285 932506 949569 966827 968321 963592 991541 1029989 1044295 1047986 1084099 1099588 1127964 1147675
19273 1147675 1153369 1181105 1191320 1205110 1239193 1287080 1311917 1323450 1360407 1411761 1444738
19262 1444738 1465038 1484817 1532076 1618323 1691694 1754720 1778113 1793584 1861980 1932814 2005807
19251 2005807 2109436 2196269 2272569 2365351 2474391 2614433 2773807 2942972 3171981 3429865
19241 3429865 3683891 4001778 4386885 4875162 5452652 6136889 6989185 8018163 9226992
19232 9226992 10710737 12560128 14824223 17545808 20577826 23853812 27579672 31708028
19224 31708028 35453920 38335210 41158931 44336561 47244509 49727030 52698843 56413079
19216 56413079 60467850 65162253 70698423 75380412 77487193 78502143 79744036 79694293
19208 79694293 77151600 73869946 71459270 69597258 68085943 67431507 67088741 65700766
19200 65700766 63659081 61927503 59804251 56241344 51892600 47867434 44249061 40812443
19192 40812443 37716850 35162391 33183388 31668302 30490993 29552568 28824073 28316763
19184 28316763 27962684 27657503 27316093 26948169 26646280 26535285 26623864 26879297 27275858
19175 27275858 27862369 28730913 29951845 31672580 34051741 36978904 40048964 42907513
19167 42907513 45015172 45730750 45462197 45060172 45100310 45980709 47733695 50078508 52466247
19158 52466247 53616317 53184958 51652454 48911809 45483824 42352348 39934538 38411868
19150 38411868 37622318 37212596 36813589 35815290 33900948 31527520 29038648 26713767 24810113
19141 24810113 23393098 22367643 21577824 20862232 20177202 19580987 19117403 18783551 18581231
19132 18581231 18546526 18674725 18961701 19449205 20149852 21019992 21981767 23138595 24704429
19123 24704429 26916029 29818713 33212442 36703019 39825786 41728744 42178748 42101660
19115 42101660 42197535 42962651 44743713 47368174 50488214 53026476 53983101 53585081 51790308
19106 51790308 48641051 45179541 42214928 40131751 39031638 38628657 38512144 37903537
19098 37903537 36164643 33522240 30524050 27506661 24794086 22624025 20940421 19662656
19090 19662656 18642358 17825766 17141971 16570849 16042373 15534716 15064773 14675862 14319405
19081 14319405 13988383 13649447 13317257 13011120 12738282 12457493 12172196 11870264 11506031
19072 11506031 11134672 10764047 10407289 10063829 9717572 9379420 9056636 8727811 8412894
19063 8412894 8080184 7784959 7480960 7148153 6879778 6587138 6290487 6043806 5801155
19054 5801155 5584213 5351651 5137696 4971488 4844544 4692978 4551426 4442432 4337314
19045 4337314 4225113 4112157 3997766 3931337 3852365 3749137 3626723 3549878 3474415 3367624
19035 3367624 3269950 3189729 3110488 3047023 2950846 2876858 2794509 2715404 2668907 2627688 2577861
19024 2577861 2511645 2452100 2385257 2345788 2320924 2303210 2326684 2363074 2336355 2354535 2395494
19013 2395494 2439906 2508211 2627583 2790494 2945505 3069939 3173857 3273295 3304580 3379106
19003 3379106 3454806 3557599 3674623 3790368 3942685 4088431 4186898 4228396 4247602 4223112
18993 4223112 4134712 3989430 3816861 3667219 3540441 3474386 3456346 3464441 3473177 3419507 3293494
18982 3293494 3152062 2993595 2822920 2662629 2519801 2392643 2276804 2182602 2139714 2081421
18972 2081421 2017273 1972618 1904157 1848857 1794331 1718244 1700405 1716041 1703400 1635536 1585223
18961 1585223 1528973 1479104 1433086 1391742 1349764 1324479 1310868 1266706 1242308 1224091 1191517
18950 1191517 1161612 1129884 1093476 1059026 1018275 993568 998982 1008763 986092 983476 968455 930435
18938 930435 883434 836456 815078 836216 847872 841619 829788 836743 840338 826549 808573 795304
18926 795304 795167 774277 727913 720950 713174 685118 682250 684019 684615 663447 672599 703663 685945
18913 685945 650852 611483 576435 575427 595962 587960 555787 526620 517825 486833 483268 479724
18901 479724 427143 397893 389505 382449 411248 419153 396802 370037 356031 350951 368949 363156
18889 363156 381839 379760 365112 386886 398636 405283 406870 430071 423056 426279 426818 465467 488504
18876 488504 456529 438573 438692 424736 404313 402944 424738 397947 364073 373551 365158 363980 359476
18863 359476 352280 359425 384204 366776 364125 378223 361287 343283 323583 299309 281302 271917
18851 271917 287390 313590 298783 300680 319741 316831 292770 325882 396568 449324 443472 427855
18839 427855 449760 498049 507810 462524 409111 383154 399562 405866 413983 414156 416728 431275 420449
18826 420449 402391 413819 420313 438914 454202 457993 428126 422402 390818 369393 385666 406753
18814 406753 381460 356940 345283 324733 331235 330641 325031 329122 305877 296214 287402 286438 267539
18801 267539 284756 325392 346998 323894 330702 365964 396086 432428 471415 538359 576537 595528
18789 595528 611333 638116 606871 563708 526464 496655 492792 488707 456153 474383 495714 492061
18777 492061 483110 507289 528223 562243 583724 579998 557485 562482 598229 641847 679527 708905
18765 708905 670704 619717 569246 546824 524523 485862 475106 488481 493259 484072 519249 567177
18753 567177 580431 587215 593161 582052 585309 631687 657518 650456 680214 723430 763731 786397
18741 786397 833385 861181 871749 923506 954518 1005661 1074980 1184755 1370023 1603538 1879243
18730 1879243 2154551 2383101 2565290 2724910 2767095 2668336 2498471 2338423 2124043 1897503
18720 1897503 1718982 1563397 1446163 1368314 1326941 1282894 1236644 1243331 1235236 1203966 1183825
18709 1183825 1183825 1219023 1251636 1280562 1301356 1322914 1348377 1386708 1423695 1456615 1470321 1484852
18697 1484852 1459269 1443268 1466448 1479440 1500993 1532934 1592967 1676334 1765066 1877281 1996893
18686 1996893 2117200 2326802 2591217 2940220 3354300 3751633 4063707 4382472 4665675
18677 4665675 4677921 4409208 4072651 3747734 3341113 2865097 2509515 2249869 2031941 1888433
18667 1888433 1779749 1694880 1621958 1560883 1512132 1461853 1415176 1381780 1333391 1339186 1367551
18656 1367551 1393622 1395732 1378042 1367982 1355950 1376061 1404950 1413972 1419018 1428409 1429928 1453859
18644 1453859 1456098 1476627 1509995 1528462 1580865 1640808 1704001 1789860 1871853 1965821 2095922
18633 2095922 2299737 2447567 2552561 2675135 2775169 2725695 2564047 2429301 2296288 2073908
18623 2073908 1858798 1697406 1566493 1472402 1414671 1387024 1382983 1384167 1394115 1393737 1362886 1353196
18611 1353196 1362263 1358444 1341134 1356496 1375996 1404790 1451479 1500037 1540445 1582240 1652325 1686521
18599 1686521 1721816 1772182 1827425 1886146 1947119 2009468 2105997 2203275 2272550 2317544 2450952
18588 2450952 2572666 2658012 2788252 2957805 3171025 3426868 3707749 4059164 4491375 4996467
18578 4996467 5642397 6436180 7381316 8562564 10059753 11911205 13962992 15991641 18116935
18569 18116935 20419344 22354920 23466790 24322826 25555170 26993041 28412382 30024156
18561 30024156 32075563 33968607 34982029 35326187 35333889 34551388 33099576 31757508 30733787
18552 30733787 29752489 28857771 28367242 28123523 27288190 25664524 23917555 22282676 20586163
18543 20586163 18895133 17452932 16339226 15533201 14981835 14605425 14402500 14320325 14334202
18534 14334202 14452984 14727994 15131375 15700020 16454000 17400961 18574548 20116121 22137562
18525 22137562 24652454 27503358 30370956 33294816 36458303 39258749 40843754 41751245
18517 41751245 43034232 44696104 46358205 48217298 50649051 53092079 54553939 55131836
18509 55131836 55235592 54140829 51898556 49539959 47552651 45673691 43917735 42682493
18501 42682493 41909735 40545641 38143365 35428077 32841040 30213504 27581835 25214432
18493 25214432 23244751 21675925 20463437 19509362 18745658 18095572 17523705 16981395 16457040
18484 16457040 16011523 15607256 15231605 14873006 14524542 14182238 13855843 13563898 13229880
18475 13229880 12897629 12556750 12192386 11793645 11412070 11019933 10624463 10267171 9886442
18466 9886442 9502513 9102221 8710686 8302544 7914117 7547964 7189220 6862547 6560623
18457 6560623 6259363 5963227 5689128 5432917 5193628 4988972 4773142 4570046 4368351
18448 4368351 4195336 4041930 3865862 3701439 3579817 3468364 3350526 3219750 3097804
18439 3097804 3037350 2977392 2851405 2761064 2695640 2636227 2576527 2494600 2411911 2343795 2291544
18428 2291544 2246076 2184421 2121735 2082937 2034747 1976671 1909124 1861767 1835710 1812448 1742719
18417 1742719 1665879 1610886 1563140 1518169 1480205 1441392 1429231 1422584 1414439 1405396 1428772 1452994
18405 1452994 1449703 1441668 1441269 1438201 1438707 1475808 1474013 1471027 1505011 1558203 1631947 1704373 1789666
18392 1789666 1829308 1848200 1855055 1818041 1782202 1784986 1812026 1877531 1962292 2039061 2098626 2113825
18380 2113825 2093169 2022947 1956859 1922629 1888417 1848323 1829789 1809063 1798765 1800700 1788608
18369 1788608 1794237 1815966 1854074 1914164 1973232 2065149 2194823 2307980 2421576 2608015 2842620
18358 2842620 3125869 3424108 3710887 3919759 4027791 4060554 4147081 4274806 4504192 4836159
18348 4836159 5235456 5690377 6179596 6646781 7062456 7557975 8217636 9095691 10259615
18339 10259615 11729966 13445307 15377073 17656543 20482721 23995636 28358815 33517020
18331 33517020 39049286 43900399 46949744 48177668 47993630 46183911 42214704 36817900
18323 36817900 31303259 26618015 23030286 20418625 18482759 16960823 15778719 14808840
18315 14808840 14020598 13365300 12842569 12409072 12067980 11812805 11635388 11550855 11527800 11549097
18305 11549097 11588863 11650214 11762669 11858799 11951182 12112132 12362471 12748439 13302746 14030761
18295 14030761 14901636 15879709 16978236 18294408 19973296 22014201 24322470 27007700
18287 27007700 30330265 34697215 40502541 47988827 56644317 64958866 70934752 73876352
18279 73876352 74358304 72456069 67381005 59495031 50699240 42811887 36604027 31978757
18271 31978757 28512284 25846103 23768913 22095689 20728443 19567246 18578494 17751517
18263 17751517 17031866 16442861 15964540 15584778 15312291 15087748 14923040 14731508 14560752
18254 14560752 14421493 14276299 14170596 14107763 14138837 14247685 14385895 14588266 14835208 15121009
18244 15121009 15460554 15914115 16428756 17016388 17756978 18692161 19961824 21792604 24308264
18235 24308264 27375239 30568334 33082093 34389705 34645859 33986160 32123340 28946433
18227 28946433 25213440 21722844 18843865 16654949 15015362 13706566 12658045 11763269
18219 11763269 11000377 10360632 9834348 9358706 8913896 8519471 8182046 7929734 7709177
18210 7709177 7496092 7300391 7126682 6981162 6818554 6691583 6554024 6414864 6306654
18201 6306654 6199124 6108556 6015705 5901255 5774658 5636460 5502423 5335324 5156359 4986535
18191 4986535 4808281 4607771 4420703 4259310 4103740 3925376 3765094 3615312 3505871
18182 3505871 3413034 3295816 3158095 3012942 2850810 2686588 2559511 2441266 2323720 2223186
18172 2223186 2103890 2014496 1941861 1880537 1830405 1780826 1731701 1684756 1642537 1564631 1520617
18161 1520617 1533975 1555223 1568584 1518918 1474939 1457568 1405552 1340563 1279510 1237841 1195599
18150 1195599 1148215 1150774 1150151 1125071 1123760 1150538 1148167 1144763 1115027 1096052 1091358 1083753 1073578
18137 1073578 1070038 1045843 1025245 1020185 1019326 1002720 981929 1014082 1065295 1122742 1140409 1193538
18125 1193538 1259191 1335774 1439500 1604576 1841135 2158829 2599189 3171499 3920058 4789802
18115 4789802 5726445 6662800 7637760 8961827 11185581 14982418 20581114 26330985 26978451
18106 26978451 22044280 16591520 12711356 10256538 8654213 7526823 6737469 6113254
18098 6113254 5603084 5220712 4949370 4698747 4448436 4207261 4012832 3849853 3715348
18089 3715348 3586199 3487793 3367777 3264174 3214564 3182698 3142109 3063489 3011784 2991643 2981668
18078 2981668 3004494 3059860 3126666 3168688 3147395 3070413 2980369 2923184 2862421 2752320 2634541
18067 2634541 2541654 2448190 2342542 2233010 2115281 2055601 1981901 1902149 1817547 1785089 1725983
18056 1725983 1689584 1640742 1578654 1541204 1540933 1502942 1468610 1435416 1358061 1318956 1299183 1272259
18044 1272259 1207121 1148450 1089150 1062015 1029270 1000490 975844 952420 897776 858333 852273
18033 852273 851772 840767 788288 745322 736463 733906 723962 684364 634161 617315 588368 578900 570215
18020 570215 584379 554054 503691 492378 481906 478690 476747 475164 477653 488876 497877 504385 505440
18007 505440 515255 508076 524835 517037 492466 454454 438198 492125 509012 500038 509390 506958 475719
17994 475719 455912 464689 431594 412210 423481 421886 429608 435492 433084 418449 405894 391320
17982 391320 387412 372681 361277 335871 287956 264809 235681 237921 250950 228180 210356 204803
17970 204803 194925 191678 191777 195387 189628 180076 164372 146986 139770 154841 184758 204641 220648
17957 220648 214399 229684 204902 173250 179636 177291 188999 198775 174983 183352 204423 207282 219856
17944 219856 220677 220822 222366 231990 208566 199124 211226 200275 198245 202918 178536 167135 168754
17931 168754 183493 166367 161242 163754 141066 128411 131795 144201 126589 146665 140181 151399
17919 151399 149241 118808 115714 152073 182392 196549 189430 158087 172541 173763 148558 140680
17907 140680 172173 166534 134833 143795 180689 164269 130696 126634 142620 122317 138589 150518
17895 150518 125598 132897 116805 114618 151653 172489 190880 203171 172316 122883 127542 131806
17883 131806 120781 107322 102834 132673 130069 110423 89585 102919 114253 134900 132216 125003
17871 125003 127378 120555 120854 149716 151480 136197 133355 159467 166644 153309 136673 120881 128217
17858 128217 109182 119790 114558 83415 94479 76988 100713 142281 160419 163053 140194 140579
17846 140579 149207 148172 145188 116833 118232 109480 112706 113928 110508 105551 103145 104052 118039 111746
17832 111746 114347 116570 92539 71243 83775 118849 128978 184587 184823 187778 219845 246417
17820 246417 252204 264370 247664 238546 251261 237970 226861 216856 204873 200663 171643 142761
17808 142761 136496 154349 170876 161435 138406 106703 75322 65357 78644 77796 74009 81482 79201
17795 79201 80740 95057 117171 123866 87000 73223 110438 122187 163768 152074 144063 155123
17783 155123 165474 149186 165460 182750 179478 172156 192523 236641 274999 293720 324729 390633
17771 390633 450009 488702 470741 447779 428328 389358 345638 265495 233946 225414 210672 198631
17759 198631 181744 171050 159106 162939 183124 175752 146708 145502 136883 123492 124313 115623 108817
17746 108817 125248 154405 139419 117460 115373 104495 96359 114911 132346 132477 149506 175121
17734 175121 175562 178120 168310 164625 159151 158646 174162 184055 178223 187548 190995 223733 226768 232391
17720 232391 239316 238026 224619 196487 199325 193087 157666 116023 107472 132001 134155 126934 143270
17707 143270 132314 107850 79349 69439 76579 83678 96606 97838 98361 98641 80643 64696 62997
17694 62997 82846 78538 86746 109765 98657 113168 103932 72223 30573 40155 58009 55180 63305
17681 63305 75451 94424 94104 105971 89606 93760 93289 71947 29365 12298 18205 16750 31940
17668 31940 51117 66222 63713 64269 80899 61951 50612 49005 33925 15490 34168 48909
17656 48909 55818 69496 58946 47567 13211 13915 9546 -14755 198 21767 31552 32396 29186
17643 29186 34894 59887 73294 70585 71297 61565 53295 45840 50883 53927 52732 57284 71978 102281
17629 102281 105560 115401 99114 94901 100110 95025 73946 57725 37658 20530 11344 26043 37267
17616 37267 57304 50971 47870 53138 72742 98633 59381 46400 46745 68057 64621 32907 22538
17603 22538 18293 41332 70916 73272 53030 48686 45298 34909 3386 -8736 19920 47900
17591 47900 48221 22719 3308 -15208 3639 15180 16511 27703 31951 40748 24213 39057 66249
17578 66249 61327 49827 42303 45039 50400 39158 28892 26603 45723 95058 108925 95159 46546
17565 46546 17024 38890 71282 67084 54416 34780 29520 44835 71156 51532 34467 38775
17553 38775 33893 14313 34281 19644 31728 65962 73037 34732 5431 5297 17683 20664 -671
17540 -671 -5795 11184 36383 18358 29036 24095 7925 24365 46444 31379 13917 21205 38321
17527 38321 24083 20744 19430 15660 18971 -101 -7549 -913 17592 20566 511 13734 20768
17514 20768 40460 53942 64721 70070 55156 51175 59583 54448 18115 28399 25206 32580 20741
17501 20741 15690 38003 28205 26816 -11851 -38943 -16520 21595 41399 52009 28900 -10167
17489 -10167 8746 34620 53503 65970 62179 63867 33363 30746 50477 70563 81706 57429
17477 57429 35567 30003 7373 6724 -2220 -1368 -8850 8660 25145 16396 367 -29295 -4487
17464 -4487 24092 37679 38639 56217 64678 57929 72408 81503 74471 54850 68513 67287 60743
17451 60743 32244 23466 32138 42155 75942 99798 104020 123191 144893 177496 184531 151479
17439 151479 102574 90030 77096 71374 73237 56954 37852 43966 51355 47751 5719 -18479
17427 -18479 472 4716 13858 32648 31492 23675 19872 -8244 -6611 36328 55261 60074 62794
17414 62794 21469 6087 39794 30062 14383 -273 -14459 14279 48462 59689 40854 32545
17402 32545 63839 73483 62145 55598 82194 53318 6497 11820 30095 23157 45013 61710
17390 61710 52473 51950 30715 10443 31744 38356 37853 52697 53885 46590 30615 22050 16694 16573
17376 16573 20648 20773 53946 77810 78512 65033 56692 42046 1958 -7147 -13859 6709 19426
17363 19426 22397 15699 21882 -7746 -12298 5269 802 17306 29360 243 -11104 -4162 22235
17350 22235 34683 32532 13931 -3929 -12751 6444 -4836 -7235 -18598 4350 39284 21306
17338 21306 7870 3557 17160 14712 12117 957 3251 7756 5031 -16352 -19014 -4704 4500
17325 4500 18886 18174 30426 34050 35986 14646 3609 -6519 -1725 -12 -14218 -18543 -11934
17312 -11934 5458 20495 31271 16352 16297 18080 4031 -791 12820 21082 32294 15061 15834
17299 15834 48236 45565 22358 12375 -16294 -26242 -26268 -2491 32389 45459 29518 23673 25807
17286 25807 48 -8862 -1209 20682 22689 26884 -10451 -20206 9793 -5028 94 -20807 2674
17273 2674 18379 34290 48479 58973 33408 8050 -8349 982 -6513 -9796 11678 52329
17261 52329 49533 4751 -2059 31947 38203 22859 34866 31325 17681 -1928 9666 27043
17249 27043 19087 -9122 -19136 -687 19666 2925 -6246 9697 23889 -8417 -17709 -15541
17237 -15541 -9253 3356 -16781 -9997 17631 27783 43996 41691 31909 -11592 -20720 -6513 9389
17224 9389 26393 34816 58214 45528 10468 -4440 -1361 -6712 -4777 4629 28384 30441 5962
17211 5962 -4228 -10849 14743 20139 27103 1394 -20229 -27598 -31905 -21848 -5628 4737 12750
17198 12750 28865 26770 16585 18611 13684 35136 40951 16753 -19648 -7412 8818 3655 -846
17185 -846 -20746 -45640 -33254 -5334 12750 34568 48681 30273 29619 48552 53835 41466 33091
17172 33091 19042 12605 39151 18064 -7961 -25306 -24660 -6483 -9342 6328 4939 -7004 -31596
17159 -31596 -44618 -45026 -19104 2094 11387 -6333 25627 56859 20409 -22191 -29153 2535
17147 2535 1426 3903 10333 5696 -28539 -27876 -12194 -11488 23537 54693 37898 33246 39168 26760
17133 26760 22114 27326 32104 45242 44400 15834 7672 -9776 -17794 -17156 -40101 -34288 -254 27188
17119 27188 5705 2542 -849 -12478 -30134 -34130 -47693 -37812 -33687 -20965 13340 6575 -2698
17106 -2698 -15057 -14595 -12171 -7669 -7883 2945 -1239 -4937 11161 14559 4683 -21901 -20160 -28773
17092 -28773 -18506 -4921 -11222 -17862 -27437 11352 49350 53429 36316 23438 4119 14019 27798
17079 27798 34330 9888 -9888 -5166 -9309 -4726 19572 18081 20370 24652 25129 18245 9694 6877
17065 6877 -16446 -22697 -19248 302 -8013 -30757 -39331 -23512 -21696 -3907 15867 21890 26139
17052 26139 54656 63558 47950 27344 6425 -17027 -14521 -1817 -1293 -19669 -23592 -11008 -19693
17039 -19693 -7223 450 -5140 -3104 -17497 -4394 -4289 -21172 -19001 -27579 -29195 -12776 17597
17026 17597 37212 15527 3158 -9431 -38222 -62557 -58404 -33338 3851 -12371 -12771 5995
17014 5995 12537 9995 32026 42752 26515 15882 11543 4206 17320 20761 1390 11992 20713
17001 20713 29437 24003 22183 40267 40172 14134 -15292 14593 30257 7201 -17457 -16030 -7785
16988 -7785 -17531 -13803 21985 19497 -2869 -15737 -1733 5354 -3761 -19210 -30111 -49970 -51079
16975 -51079 -23058 4699 6239 1067 11389 30616 23381 -2909 23875 40010 37919 52106
16963 52106 41716 40395 46803 7303 -1736 4763 1682 13702 14586 -1432 -7321 4153 19650
16950 19650 22110 29455 36653 38490 7619 16899 21485 3909 9948 27480 28359 23522 -4057 -12185
16936 -12185 -11189 6671 -3937 -14136 8884 9233 1999 11445 -343 -3894 -23526 -14959 3967
16923 3967 15435 19938 35194 39100 21794 25220 45394 49469 3938 -31995 -48786 -41276 -11329
16910 -11329 -17101 -13523 -10621 -19557 -30682 -36309 -13332 17009 -6184 -6515 -8826 4045 29305
16897 29305 18745 -217 762 -4955 -3445 -15269 -35877 -24854 4684 4574 -23335 -15843 11457
16884 11457 24956 19011 4897 6006 -15709 -24413 -30058 -33620 -16045 -24659 -24940 -26778 -28942 -8976
16870 -8976 -3075 -9515 -3818 -11687 -13131 6512 19052 34591 44706 53619 40885 29751 18381
16857 18381 -623 -15836 -17138 -19721 -26880 -37587 -54575 -69812 -44847 -20962 -5231 14683
16845 14683 1831 -29832 -40251 -27417 -16143 -5511 5084 -5748 5549 11473 15009 -10852
16833 -10852 -11152 12935 26042 14070 5866 1233 9262 -23847 -42036 -45341 -27479 -24476 -38394
16820 -38394 -45625 -30726 -6199 -3967 -1410 -15725 -32506 -19998 -14549 -8756 -1979 2059 25528
16807 25528 10771 9906 -9383 -14823 38310 42505 18534 22966 17418 28494 17956 5147 -6473
16794 -6473 -183 37438 25181 3713 -9018 -19376 -24612 -56875 -56114 -50796 -39266 -36750 3067
16781 3067 13145 27255 32450 25512 -4607 -28510 -38800 -38614 -9774 9826 529 -24710 -13444
16768 -13444 -19407 -14019 -10644 -8902 -15598 1215 -2818 -19942 -35212 -47398 -29074 -9578 -1084
16755 -1084 9939 -4889 -10951 5027 -1685 25019 26789 24083 -4765 -32319 -29521 -11698 14250
16742 14250 -8918 -32876 -28153 6628 30444 16019 -7649 3074 110 -5750 22752 12843
16730 12843 -1832 -8725 -17302 137 -11642 -30233 -47114 -20194 -15221 -24141 -16999 -135 13264
16717 13264 29029 29334 32200 9632 6295 -10051 -3268 13574 850 -19501 -20969 2422 24138
16704 24138 24431 -1570 -3524 12655 7186 -10794 -18809 -16305 -369 9335 23223 -22937 -34589
16691 -34589 -26145 -16734 -8417 -12461 -16106 -7999 -1345 -709 -21143 -18472 11012 23585 21431 594
16677 594 -17010 -11236 -16541 -27917 -26775 -33911 -43775 -37638 -17553 -903 -5441 -8901 6163 45865
16663 45865 56420 32838 -1691 -15155 -25804 -18844 -12740 2975 5899 18702 24538 18049 -852
16650 -852 11343 11584 12352 -15009 -42700 -38313 -38018 -18633 -3738 3158 2396 36154 30775 17959
16636 17959 2110 -10578 -8161 -11104 -12919 -30615 -22675 -17866 -28636 -23633 28552 22108 3084
16623 3084 -3179 -11203 -31747 -29525 -16152 17883 36223 40982 36010 19732 15658 -6812 -6187
16610 -6187 -28752 -56260 -34610 -25583 -46845 -35924 -3893 -9734 -11913 2613 22770 8737
16598 8737 -11485 -16023 -22562 -17190 -4505 -4103 -19704 -11551 -30809 -55966 -39449 -14854 -6538
16585 -6538 -6796 -2206 -47382 -75269 -67308 -78058 -48620 -39638 -36300 -22123 -26799 -48932 -47972 -17573
16571 -17573 -11404 -24845 -15105 7946 12011 -21550 4564 13727 5162 -15528 -21949 -22404 -32604
16558 -32604 -30912 -41175 -56974 -55247 -71450 -76058 -84754 -79003 -52301 -10323 10978 -1281 -18956
16545 -18956 2987 27556 22778 7470 20395 28064 19877 13228 20248 26332 18549 5963 -7297
16532 -7297 13293 15308 20852 16637 15442 1351 -18823 -30483 4458 14271 1160 -33794 -39955
16519 -39955 -26623 -18365 -11089 -7107 2899 16550 29773 16768 6604 -4929 -23065 -27026
16507 -27026 23398 27726 -6228 -32105 -26410 -14620 417 11806 32376 8773 -24560 -30807
16495 -30807 -7138 24672 14197 -12791 -28915 -10049 -29637 -38506 -18126 -1718 -9250 1731
16483 1731 -3975 7090 2723 -11245 4 -1110 27217 49042 30812 2216 -5112 27900 34357
16470 34357 37132 12544 17481 59968 62854 59797 54795 37114 12376 -16761 -23142 -6184 29102
16457 29102 15415 -20974 -40605 -44166 -24623 -7460 14316 13829 -10234 -32064 -32657 -26611 -34489
16444 -34489 -23838 -6681 -8464 -39764 -31187 -44843 -39912 -45153 -47237 -27138 -9614 -9719 -687
16431 -687 10420 6539 5269 -24798 -22086 -18263 -30053 -44371 -43424 -43157 -35996 -23706 -14999 -8563
16417 -8563 -9489 -40842 -55697 -32247 4797 26775 3515 15327 34105 3319 -14218 -13371 -876
16404 -876 13082 13243 6087 -3136 -25017 -28668 17839 23611 13680 17205 22255 1473 -15075 -14411
16390 -14411 -12892 -31869 -36432 -44811 -43001 -52380 -53664 -33718 -40063 -39314 -17848 -30609 -17168
16377 -17168 -10924 -10937 -325 5505 3590 -20399 -48404 -58066 -55241 -45261 -46865 -29499 -33947 -23199
16363 -23199 -18057 -15223 21339 3204 -22360 -21832 -11628 -10293 -2003 2645 -27624 -3676 8776
16350 8776 12025 5885 -906 -16376 -14705 -37996 -42972 -29380 -7505 20752 49473 47219 41789
16337 41789 60717 95672 101657 98920 77012 79962 103794 99904 67890 50452 68280 74928 92280
16324 92280 97948 100084 98420 87335 96880 103365 72292 49117 51807 80771 84512 79210 71728
16311 71728 91338 106807 99166 95015 106023 117648 122643 104850 61987 57274 71636 105823
16299 105823 93408 67139 93890 114642 80037 60692 45279 47391 57791 52476 38919 40816
16287 40816 58757 55118 67159 66363 58381 43947 16551 6373 10764 21077 26860 -5529 -29586
16274 -29586 -10277 9190 1464 -15122 -12776 -19293 -44887 -51887 -49411 -15835 -2196 -2199 -1792 -7013
16260 -7013 16984 440 -13896 4389 33056 12090 1273 27629 29348 28786 13318 -8888
16248 -8888 -6068 35617 34726 27532 11245 -2583 -3812 2689 12195 15089 11633 -15509 -49203 -45243
16234 -45243 -58272 -51162 -45494 -25464 3874 15269 -13251 -22057 -21238 -17131 -16239 10042 14708
16221 14708 -28728 -21719 -16589 -22404 -3149 -17858 -1810 -6024 15361 25669 16625 -8626 -8531
16208 -8531 12150 16253 -5843 -11783 -13666 -16909 -16289 9873 27554 21953 17994 27018 2934 2134
16194 2134 40082 37249 22591 4943 392 7654 11095 25294 26836 30415 30418 26790 17231 12134
16180 12134 6656 -9660 -43909 -45755 -20735 -16699 -9432 9970 8024 -12213 -18976 -28635 -27219
16167 -27219 12503 13317 -30044 -43150 -7051 13860 454 -26048 -37397 -11305 -13695 -20986
16155 -20986 -20684 -11965 3199 -82 -24404 -21476 -21460 -25865 -46516 -49995 -55634 -66403 -72728 -69444
16141 -69444 -15257 -2070 -9219 -17551 -13568 -22489 -29529 -1623 -20953 -34749 -39218 -42966 -51012
16128 -51012 -29479 1503 19378 22977 10466 -15961 -18670 591 -24286 -55777 -50127 -72824
16116 -72824 -71338 -51789 -41908 -40931 -27996 -46268 -50447 -29730 -22242 -84 27472 18447 30131
16103 30131 20690 20470 15441 16247 8152 -5770 -26577 -39392 -57208 -51975 -19577 2756 14835
16090 14835 8573 -18915 -10997 12518 1834 24629 5508 -35494 -9585 5847 -14276 -5674
16078 -5674 -8292 -4576 -31547 -65492 -67000 -63877 -65373 -88121 -87748 -62915 -52367 -61309 -65186 -59775
16064 -59775 -27344 5391 13353 -5712 12820 21474 8730 -1847 -9520 -3175 3318 13249 2198
16051 2198 13823 17034 -14791 -17783 -11615 -17256 -9023 67 -6632 -23454 -24778 -13150 -23311
16038 -23311 -37906 -50320 -23969 -3410 -5897 9170 -17396 -22677 -20895 -35047 -49283 -42248
16026 -42248 -25410 -40559 -25937 5947 -5955 4934 -2052 -29571 -38488 -21971 -9222 -3765
16014 -3765 -18792 -33703 -33480 -23315 -38330 -50580 -56277 -63095 -52097 -56018 -43178 -46744 -27667
16001 -27667 -63943 -77746 -58851 -27868 -27596 -36932 -27685 -39371 -54990 -41464 -48205 -66198 -55906
15988 -55906 -40461 -28902 -29955 -10022 -14388 7160 2239 -16189 -37865 -19465 17271 413
15976 413 -31742 -14737 -37297 -57586 -74449 -86782 -70174 -53628 -40580 -51616 -57072 -44101
15964 -44101 -37344 -22486 -28555 -31382 -22283 -4458 -2233 -3946 20370 1446 7067 16005 17361
15951 17361 -11728 -23013 -4416 30437 9992 -6467 7534 12466 9131 134 2677 3222 -4316
15938 -4316 -21293 -14158 4876 -1979 -8240 -17306 -19124 -23007 -17240 -32542 -41644 -36190 -42217 -36755
15924 -36755 -26618 -23523 -33329 -55647 -51935 -34688 -38008 -17560 -16391 21234 37115 17265 -7642
15911 -7642 -22390 -41641 -28504 -12664 276 362 10493 -3446 -19489 -35555 -56268 -72536
15899 -72536 -69976 -49671 -28542 -13329 -3854 -24989 -29964 -27140 -4925 3128 30145 38588 29070
15886 29070 4776 7216 -1763 -12278 2642 19688 -8009 -43158 -62628 -51599 -34573 -27870
15874 -27870 -27733 3799 -3921 6627 16995 40208 18286 11980 -455 -18160 -17713 -3591 10547
15861 10547 6346 21986 19329 -9378 -27636 -7159 -3748 -16352 -30948 -20947 -2424 9916
15849 9916 -734 -27145 -991 15478 18941 18488 15664 1796 5294 810 10473 -5026 -28505
15836 -28505 -26185 -19787 -8398 7110 -13030 -18840 -7845 -32888 -45728 -33452 -26264 -21562 -46324
15823 -46324 -21585 -27090 -36054 -24781 -12432 2607 33612 22044 -6940 -26757 -26906 -6843
15811 -6843 -23088 -12318 5618 17906 1628 -22165 -44948 -52729 -68312 -45395 -25158 -39198
15799 -39198 -61022 -45700 -29756 -36613 -30352 -42519 -46200 -42973 -54194 -24398 3675 15937
15787 15937 59126 78968 56634 44013 12122 23632 37899 19390 14512 23139 33233 10222
15775 10222 -23907 -32793 -26872 -28425 -15177 -7931 -10318 -3873 -31773 -64399 -65497 -58860 -52107
15762 -52107 -47022 -34568 -9725 9040 -13177 -37115 -49443 -49218 -47631 -43603 -42360 -60273 -53307
15749 -53307 -53194 -25730 5444 42643 5636 -16969 -22611 -53578 -57184 -87203 -76576 -44406
15737 -44406 -27407 -16790 -17206 -14318 -31687 -25289 -23508 -21663 -11315 24877 27872 32095 19859
15724 19859 -8219 -12766 -15486 -5209 -3834 2992 20141 42187 19676 -28428 -16970 -3914
15712 -3914 -30793 -19424 -12536 -21836 -26200 -23574 -35833 -56806 -51325 -31839 -2369 1877 -21301
15699 -21301 -42301 -45971 -30954 -43505 -25350 296 -22627 9660 11250 12694 18834 -8609
15687 -8609 -23082 -35428 -27033 -47062 -46951 -41589 -48169 -39687 -19349 -2372 -13916 -14862 1050
15674 1050 13096 4332 -10694 -18500 -16874 -5198 -16015 -26058 -23273 -5618 11726 17727 5448
15661 5448 -16419 -38890 -35434 -37611 -33443 -35638 -52162 -53461 -36976 -44308 -31648 -35039 -27548
15648 -27548 -28999 -34052 -31019 -21593 -40213 -53884 -64285 -78153 -76991 -63076 -34039 -55496 -70526
15635 -70526 -68502 -54274 -14951 4352 -33921 -53128 -49149 -44830 -46393 -27477 -14636 -17358 -4423
15622 -4423 10295 -9667 -33778 -48134 -34846 -29035 -50534 -47872 -23913 -31466 -50830 -24578
15610 -24578 -20370 3819 22222 -1019 -8593 -21796 -55245 -62813 -41472 -6746 8054 106
15598 106 -27587 -38860 -2528 -8472 -38286 -50323 -17473 -8958 -18408 -1837 -4406 -16723 -39262
15585 -39262 -33540 -31934 -33282 -41611 -51948 -44616 -43582 -68918 -52502 -28143 -43663 -58640 -52849
15572 -52849 -49428 -47806 -38604 -25912 -25239 -37333 -25246 -2161 -6920 -24379 -24718 -6892 18426
15559 18426 12921 -9990 -42737 -54581 -40406 -14957 29370 32732 21288 -5180 -35043 -49763
15547 -49763 -47748 -23547 5529 15584 -1821 -16864 -15004 -22233 -12131 -17924 -20375 -39357 -45220
15534 -45220 -29941 -4797 1982 -30571 -45375 -60113 -78919 -102665 -95797 -55822 -59516 -57980
15522 -57980 -26948 -25823 -34008 -10932 4513 -10255 -7371 -6613 230 1561 18668 7943 -3498
15509 -3498 7153 -5646 -19137 -11896 -2674 215 -12869 -34556 -7571 41988 45145 22200 -19510
15496 -19510 -6218 8912 -4168 -9748 -16569 5208 28053 14155 -1033 -20757 -26389 -29707
15484 -29707 -46613 -53018 -33405 -32766 -33841 -46750 -28581 -43717 -41465 -46807 -30998 -41786 -43628
15471 -43628 -23574 -6015 -21759 -43997 -55009 -56833 -68804 -68788 -71394 -61285 -33473 -15326 -27330
15458 -27330 -30575 -30363 -28193 -32074 -21851 706 -18722 -56821 -60496 -37608 -27977 -7327 -251
15445 -251 7013 -36089 -57174 -52601 -40982 -26631 -5458 -13757 -28633 -26371 -13375 -46003 -58126
15432 -58126 -46996 -49407 -66496 -64789 -64603 -51405 -47413 -19201 3601 10173 20355 1810 -1724
15419 -1724 3995 -11742 -7474 7421 -14784 -7223 -8064 -4821 -5149 -19135 -12364 -26190 -37496 -18754
15405 -18754 -19336 -28063 -22810 -22217 -33701 -54621 -74147 -61284 -29177 -33834 -64401 -54679 -42521
15392 -42521 -27619 -20601 -19635 -15864 -19359 -38194 -37371 -28244 -24018 -20268 -8467 13856 8025 -5172
15378 -5172 -16255 -19353 -1272 12715 44 -21192 -27017 -30909 -19707 -7646 -35900 -37257 -40209
15365 -40209 -50701 -30937 -2600 2903 1676 -20393 -37048 -28127 -6012 -27458 -71599 -46321
15353 -46321 -7623 2258 -16536 -11382 -87 -16367 -6165 7767 -8220 -17660 -26765 -13078
15341 -13078 -3595 12874 13943 -2940 -18511 -5133 -24717 -48574 -55124 -57095 -42384 -34251 -36358
15328 -36358 -39904 -23566 -4391 -16197 -21290 -24168 -45770 -42258 -48674 -46277 -37958 -59395 -68648
15315 -68648 -17209 4213 -14054 -27417 -46613 -55176 -52585 -60583 -75431 -73812 -59157 -66599 -78467
15302 -78467 -96619 -96789 -73594 -58497 -41202 -42097 -23885 -29288 -10205 10156 231 -23602 -17049
15289 -17049 -3987 12905 24113 1230 -35221 -58880 -48610 -32347 -19526 -12606 -28387 -28931
15277 -28931 -12397 -7464 11577 4378 -8978 -29854 -24543 5558 4137 -3412 -4666 -748 -10116
15264 -10116 -24272 -18305 -18311 -32983 -21777 -34878 -57662 -56852 -38153 -28550 -32255 -30352 1334 1329
15250 1329 -39527 -47835 -65452 -58502 -25663 -2222 -512 5738 -6791 7576 14155 1863 8804
15237 8804 16359 6301 -6264 16228 17499 14460 23811 22689 38620 33029 -3212 -38867 -44454
15224 -44454 -33873 -38127 -41955 -65097 -64999 -40231 -6319 32926 30503 29755 36084 27304 24819 38586
15210 38586 10890 -10637 -18674 -15760 -33623 -38489 -34850 -32887 -35470 -53527 -36252 -24809 -25466
15197 -25466 -9285 -14839 -37996 -54236 -42472 -63709 -64614 -44834 -35485 -32103 -40584 -43747 -25794
15184 -25794 -25651 -14814 -36007 -43453 -52020 -45584 -11770 -3429 -16670 -23536 -20128 6692 -8657
15171 -8657 -18631 -12007 6289 26534 49067 47017 40691 67331 75353 107390 156025 198115 246841
15158 246841 290324 338010 380760 382737 406890 425962 434642 447804 439701 419413 385597 331473
15146 331473 306906 288256 263463 219847 187225 180898 165416 158012 112541 103694 140321 131429
15134 131429 119640 114557 115461 119987 107846 106013 91262 61265 38291 51651 65158 89636
15122 89636 105150 105048 102924 74025 61192 65644 52936 54940 60003 59152 31231 35146 38451 19297
15108 19297 9432 33735 54588 62441 75039 42404 34107 40317 30412 25929 22413 17805 16384
15095 16384 53 -16300 -13810 -2050 15030 20202 -3718 -1228 8209 17912 33604 21176 106
15082 106 7333 13660 1755 -13095 -15567 -12624 -26147 -18120 -888 -4152 -12832 -21977 -27665 -43027
15068 -43027 -5028 -3486 -22422 -16402 -340 -10850 -14539 -14334 -34836 -53958 -30940 7251 1928
15055 1928 -6782 -14280 -11851 -10656 21228 55712 59501 46876 62528 101823 123000 131596 129694
15042 129694 138139 192866 267441 330472 436086 534638 588932 658312 758006 821566 871157
15031 871157 913236 924393 910718 867929 814792 773197 712052 622464 556466 495296 428469
15020 428469 382001 338836 314099 275155 244839 222205 230635 206713 189425 194674 216625 202246
15008 202246 189053 174098 159325 158827 166015 179149 180996 167086 154834 143670 150817 157292 147836
14995 147836 124661 132810 149043 153262 137141 123870 136006 131117 133529 130349 99678 89182
14983 89182 103114 112246 97483 74572 60783 89477 102496 87996 49497 11681 13192 26712
14971 26712 41684 25809 25526 14180 -9433 1387 35200 40615 -2868 -12917 17924 45682
14959 45682 58702 57406 47934 15129 -19202 9830 24941 9668 -25309 -26926 -3541 1173
14947 1173 -14093 -23975 -13293 465 -15982 -9791 -19927 -16433 -9106 -22463 -36482 -19719 -10122
14934 -10122 -33755 -46757 -35587 4208 424 -13058 -6371 -9984 -724 -13349 -7980 -27303 7452
14921 7452 18567 12946 -2 -25946 -32664 -2824 21286 21451 -5343 21705 36508 35802 -2691
14908 -2691 -25619 -51610 -65308 -71889 -53616 -35300 -27699 -12064 13521 24593 29261 -1363
14896 -1363 -27175 -35859 -4767 -18652 -35372 -37134 -29964 -18304 -1321 -6472 -17604 -17444 -23698
14883 -23698 -40010 -32170 -33984 -25313 -24730 -33033 -17744 -2787 6765 30592 18460 -2624 -43897
14870 -43897 -44759 -27209 -27277 -30804 -43423 -42788 -64618 -48613 -35220 -38282 -37626 -51423 -54000 -53341
14856 -53341 -41333 -14964 -26995 -27042 -4366 19570 12458 -31752 -44178 -5070 13656 -9688
14844 -9688 -79 1144 6009 10397 -3292 -20068 -19051 -32121 -39427 -11361 1497 -9717 -2810
14831 -2810 -20446 -24921 -37094 -61022 -42045 -38221 -45774 -12193 -9580 -26829 -29725 -45097 -66890
14818 -66890 -65281 -36301 -30503 -17998 -6023 -10590 -23241 -6171 -28936 -40571 -47617 -46119 -40803
14805 -40803 -36048 -26891 -21522 -23793 -13319 -32613 -39007 -25732 -16318 -17736 -19834 -29585 -35456 -37763
14791 -37763 -61739 -75228 -55462 -44659 -26452 -39431 -41588 -31828 -41587 -33049 -35336 -16780 12082
14778 12082 23663 16002 23011 25115 9541 -27456 -61666 -83534 -67224 -31500 -9004 -22936
14766 -22936 -16399 -12419 -11066 5952 -6729 -16622 -35899 -41654 -31203 -33887 -32725 -22356 -33020
14753 -33020 -6432 -6349 -37124 -29666 -9376 6956 23639 18500 3198 -2565 -24641 -20579 -31614
14740 -31614 -40189 -52376 -83441 -62829 -35082 -15036 -22788 -45183 -41280 -46120 -43100 -29695 -35059
14727 -35059 -33245 -7139 -10227 -22561 -30927 -41090 -66304 -70594 -82988 -85712 -61058 -87522 -95977
14714 -95977 -72748 -73622 -51244 -39637 -59526 -66920 -32046 -17787 -41392 -39056 -47554 -41948 -44424
14701 -44424 -43450 -48069 -51049 -53844 -39024 -52525 -64494 -34730 -33713 -32390 -19349 -35496 -12512
14688 -12512 -7363 8744 30786 24011 6267 -3582 -18914 -36430 -16406 15489 27906 -11168
14676 -11168 -24424 11941 10481 -4240 -11760 -1735 1487 -14169 -17812 -21948 -43408 -48585 -10926
14663 -10926 24995 36319 28638 25138 1185 241 3397 11271 771 -19182 -40489 -35447 -18244
14650 -18244 -13628 -25484 -22549 -27248 -26538 -29981 -28863 -20744 19495 40203 31619 40990 54903 55308
14636 55308 49342 49909 59453 48703 58275 65208 55507 53223 49977 56530 45404 37520 38025 56540
14622 56540 57166 47744 39226 25411 32801 41823 44005 41848 20369 5793 3644 -28026 -37947 -21183
14608 -21183 -42162 -32668 -5017 13253 13721 -16880 -10382 26537 45792 49846 32762 32648 29593
14595 29593 21663 39863 40066 34038 34126 43326 35315 33399 19216 11455 23580 51377 51988 51087 60342
14580 60342 62239 47202 20781 7311 -9240 -11413 33680 35429 13137 12946 -20830 -33232 -66868
14567 -66868 -69014 -37814 -27620 -38139 -41222 -33157 50 17622 11224 6693 25787 40285 23184
14554 23184 -15497 -10709 -15299 -25913 -36719 -28100 -5527 -3274 -2166 -5988 -15167 -38440 -71930
14541 -71930 -84258 -80975 -76869 -58634 -49953 -48850 -31384 -19373 -15792 -28259 -33948 -21749 -20352
14528 -20352 -10957 -12230 -19116 -6719 13112 10330 1240 -11604 -32000 -46756 -63275 -83583 -84733
14515 -84733 -80607 -88953 -97583 -79679 -54626 -39866 -54392 -51099 -51146 -51399 -39935 -46372 -41802 -32106
14501 -32106 -28871 -31035 -4400 -11875 -4544 -4661 -12398 -31692 -31856 -7559 -2164 -5927 -22385 -39883
14487 -39883 -16701 -13990 -29931 -26774 -27492 -53048 -53030 -36013 -29428 -24503 -29985 -37039 -34057 -56923
14473 -56923 -63354 -58153 -42373 -48073 -50270 -40857 -29857 -23483 -19129 -27438 -39007 -27932 -41877
14460 -41877 -51810 -35981 -41586 -58056 -35541 -29334 -49304 -53137 -61013 -63095 -49340 -35019 -40819
14447 -40819 -30591 -13697 -24305 -45092 -47718 -45634 -56496 -58180 -58817 -34272 -28068 8819 36120
14434 36120 10888 -14772 124 23166 8132 -3922 -3806 -20827 -34696 -30801 -15119 2087
14422 2087 8434 10624 7898 19074 7748 -10831 3421 -22017 -33877 -9727 15738 -9023
14410 -9023 487 13021 12712 46424 27700 20884 28892 37520 42384 41084 31179 29712 3983 25627
14396 25627 53088 37500 12951 -39240 -53485 -42434 -16839 -492 26009 28610 5621 -32304
14384 -32304 -35889 -19844 3239 -30567 -74042 -68644 -14647 14517 -6493 -19849 -12811 -26536
14372 -26536 -6518 21835 31512 5956 6341 4552 1357 8532 43107 49263 12187 -2975 -5226
14359 -5226 -13522 -16418 1297 11430 10595 19888 37118 62100 35279 23201 19173 24221 -745
14346 -745 -2854 6262 22666 5826 -22338 -23471 -3026 -1400 15767 15280 20828 -9231 -15445 -23578
14332 -23578 -34175 -22986 -14909 -44336 -44529 -42354 -37391 -7228 5047 11792 3377 -11006 -42348
14319 -42348 -82572 -87079 -76711 -54181 -23649 -34131 -61042 -70288 -44377 -33970 -29964 -43704
14307 -43704 -62436 -64237 -51392 -41658 -4680 -4510 18521 13520 297 4725 -5933 2487 -4776
14294 -4776 -25528 -33273 -20504 -35598 -47558 -27270 -6554 -13205 -9157 -12204 -28236 -32896 -25576
14281 -25576 -18413 -25798 -40604 -66718 -79765 -53950 -38183 -29157 -26032 -36552 -29994 -11010 -17422
14268 -17422 -15476 -22408 -49632 -38417 -15864 -1677 12295 -10486 -20492 -24068 -10202 -14818
14256 -14818 -17179 -9070 -18073 -9775 -791 208 -2046 1123 -12703 -7137 1042 -7993 -26368 -27340
14242 -27340 -16023 -2783 -4835 -18559 -19924 -18209 -12895 -30705 -31214 -28185 -32661 -41385 -10818
14229 -10818 10160 -10308 -51506 -73981 -68488 -67279 -72823 -29023 -776 -4520 -34397 -35875 -45397
14216 -45397 -51082 -19612 6000 -8867 -33112 -45905 -59251 -54764 -27525 -22266 -9786 -16501
14204 -16501 -20292 -19129 -5011 -23782 -33972 -37261 -53309 -59883 -52517 -59455 -51863 -67388 -66977
14191 -66977 -50235 -42750 -48985 -38803 -37436 -51018 -29258 -11137 9299 13091 -31269 -44238
14179 -44238 -50301 -27614 -21023 -28928 -44809 -55110 -63520 -30370 -14137 -20037 613 -6569 -10049
14166 -10049 -4103 -8207 -10814 -26604 -49850 -38119 -19733 -23496 -17415 -13286 -25636 -12629 -22322
14153 -22322 -25034 -30487 -45779 -21853 -21306 -30786 -25747 4885 -10519 -19705 -12676 -11905 -13179 -10088
14139 -10088 4624 21919 19862 -21800 -39248 -28263 -5600 -6971 -13000 -6356 17236 -2169
14127 -2169 -14968 -26800 -21844 -818 29760 29536 20268 4208 -19936 -46576 -26719 -21627 -16296
14114 -16296 -29519 -55034 -65247 -69519 -49821 -32872 -42720 -21574 -8042 12946 10557 15465
14102 15465 28181 22492 7786 -3489 -20357 -15726 -49050 -52714 -57402 -45467 -60190 -63954 -53995
14089 -53995 -52384 -33100 -18740 -23635 -55609 -63348 -60072 -60015 -43539 -15681 -31302 -33036 -25834
14076 -25834 -27144 -29229 -27263 -1339 -318 -11795 -16805 -17224 -34442 -16558 8862 12359 292
14063 292 -11768 -15171 -6229 6885 -6172 -22682 -32507 -50358 -39502 -28718 -13489 -12187 -29555
14050 -29555 -16967 -42963 -30099 -9532 34148 60691 37643 15775 -6141 2710 16287 3134
14038 3134 -15534 -30296 -48251 -32379 -12635 -11448 -26649 -63010 -84982 -89965 -77449 -60170
14026 -60170 -37200 -34724 -41680 -35497 -48860 -49438 -28346 -4370 819 -16501 -12708 5714 3782
14013 3782 4600 -18364 -9823 6306 11014 1171 -13706 -26822 -39582 -35219 -18367 -21467 -45412
14000 -45412 -38221 -16140 -4817 -15198 -21910 5762 -5246 -42283 -41578 -34255 -34929 -30433 -40257
13987 -40257 -46875 -42474 -31711 -25649 -37411 -54154 -62765 -55056 -41689 -28238 5946 -14143 -16343
13974 -16343 -16221 -6272 -17362 -36611 -17841 -23745 -43181 -44047 -39288 -44830 -56782 -73112 -76112
13961 -76112 -63238 -54878 -33938 -22979 -11170 -25228 -29603 -15366 -22713 -26464 -24046 -27274 -19467
13948 -19467 6883 4062 -22196 -26070 -38366 -39644 -41734 -49570 -29086 -28147 -21849 -12636 -6229 -3336
13934 -3336 4532 728 5958 4847 -10087 -36247 -52367 -27937 -21206 -12318 -4519 -14381 -42255
13921 -42255 -48767 -47571 -55445 -41150 -43916 -47978 -36005 -48612 -69624 -75971 -70121 -43101 -49143
13908 -49143 -45457 -27352 -34928 -25874 1846 18178 7405 776 -2809 32246 39861 13820 906
13895 906 15449 37940 40690 13784 -25804 -52688 -35684 -22755 -28958 -28006 -32004 -18790 -10028
13882 -10028 -12742 -11107 -22480 -39524 -70512 -59568 -47699 -34028 4563 26712 40605 5676
13870 5676 -23249 -104 4509 1015 -8376 -33300 -51189 -70715 -75233 -68280 -44808 -29483 -27421
13857 -27421 -21438 -32386 -15874 10633 15362 7780 -9895 -10932 -16769 -41550 -50526 -31034 -24401
13844 -24401 -619 -16454 -38601 -28852 5655 -330 -23185 -62955 -81778 -69500 -60543 -48442
13832 -48442 -47952 -53732 -48269 -33179 -24460 -22240 -21114 -28762 -36323 -43370 -17781 -2418 -30485 -32377
13818 -32377 -37089 -17616 -849 -15372 -16055 -8437 -628 17276 18435 17898 -12433 -19180 -3179
13805 -3179 -15893 -20651 -23445 -18588 -20007 -1236 12033 -18384 -40739 -39343 -29652 -15095 -26569
13792 -26569 -51306 -48775 -61858 -62589 -66878 -58039 -27839 26037 10856 12354 18231 -18649 -75337
13779 -75337 -81581 -55777 -38330 -38393 -27483 -45839 -67751 -60325 -60762 -59993 -42470 -56140 -87244
13766 -87244 -112107 -110183 -75233 -76417 -103733 -101131 -51710 -10948 -28849 -28663 -40790 -45909 -58701
13753 -58701 -50239 -42780 -41359 -27729 -27192 -40882 -51475 -29750 -46112 -41226 -52794 -30884 -27440
13740 -27440 -46046 -29676 12866 25028 26089 9906 2088 509 -1815 1592 4050 -6247 -2437
13727 -2437 14104 13532 12255 16102 7788 5179 -5566 -6341 -24160 -24697 -39091 -63728 -47303 -27716
13713 -27716 -29675 -30481 -34961 -42618 -25894 -22781 -45059 -43119 -35194 -34014 -25533 -47287 -22967 5106
13699 5106 9831 9490 9907 -26338 -43434 -43708 -35680 -30031 -27641 -6807 -9429 -47429 -39717 -27405
13685 -27405 -26067 -44045 -26970 7018 15060 8944 -10418 -15601 -9967 -273 -9089 -28654 -19288
13672 -19288 -13895 -31386 -42572 -35220 -33522 -37152 -27597 -9668 -5426 4746 -31357 -50848 -51494
13659 -51494 -25914 11885 16797 -3634 -18574 -22036 -32439 -43919 -36959 -37219 -51339 -47305 -48836
13646 -48836 -34179 -20485 -3425 13826 -435 16872 17164 2627 1574 23254 23411 8410 11817
13633 11817 24758 26709 26354 20380 -159 8312 -10904 -12938 -28717 -26348 -19166 -4330 -4102 11914
13619 11914 22688 9383 -8065 -1738 1797 -12633 -19149 -8368 -2134 -10551 -13007 -5473 -4085
13606 -4085 -9239 -25718 -26441 -6597 1614 -38333 -40583 -22638 -678 4743 -6094 -26845 -36091
13593 -36091 -30442 -3266 2541 -9386 -25608 -38784 -18366 5820 9264 -5268 -12239 -6230 -23065
13580 -23065 -24942 -29498 -18720 -18510 -24889 -34543 -37152 -26666 -16114 -16688 -35336 -60582 -76628
13567 -76628 -51824 -43144 -56140 -54180 -30715 4464 12918 -4874 -10871 -35487 -25732 1688 25920
13554 25920 7444 5052 27633 44070 41725 43096 55793 70918 76038 50067 24590 19956 570
13541 570 -15391 -22980 12604 39157 14942 7265 -4001 4374 -480 -7800 3583 26231 19989
13528 19989 1356 4480 30498 15801 8644 15910 22889 39033 24778 14378 -214 2881 -9894
13515 -9894 -6578 -17534 -21771 -25313 -41616 -37642 -17878 -927 15967 19351 25278 73355 79153
13502 79153 67709 66848 35484 6618 -25400 -31141 -26865 -13207 -4613 -524 17814 1431 -43294
13489 -43294 -66974 -76552 -72842 -45092 -31848 -4799 -5843 -4393 9006 -15347 -34535 -35373 -11392
13476 -11392 -29937 -53117 -52179 -43459 -59042 -61767 -51108 -36780 -30360 -27328 -22494 -34897 -30385
13463 -30385 -34776 -26337 11209 26239 2500 -4146 -18218 -22412 -43002 -50483 -58376 -50763 -35920
13450 -35920 -20764 2731 1420 7591 34160 91258 163283 211542 218443 210806 183636 150154
13438 150154 121850 98699 82682 34147 6531 1512 5651 10870 -8599 -18541 -5272 12989
13426 12989 17267 13151 19908 4755 879 -10042 -2254 -3556 3803 2993 -10540 -33832 -58284
13413 -58284 -47086 -54923 -58181 -31216 -16834 -40951 -52214 -75860 -78689 -44094 -12630 6561
13401 6561 -12431 -24773 -24697 -29358 -26070 -23013 -24212 -34937 -44703 -46379 -43181 -45019 -49308 -51377
13387 -51377 -56603 -70432 -63146 -31941 -18969 -16249 -5523 -39973 -67751 -61092 -30520 -21807 -20296
13374 -20296 -4187 -8409 -11615 -28331 -35240 -20847 -21805 -41662 -33326 -31877 -48075 -54764 -40915
13361 -40915 -10151 -9040 13116 18257 7302 -22475 -13555 7342 33237 47231 31055 29373
13349 29373 31297 41504 50504 75885 132332 167419 196728 156054 97059 105727 118646 118812 105569
13336 105569 100792 95480 78827 73389 77856 46000 15441 13183 30184 46927 64089 62245 39922
13323 39922 18047 -4289 -15229 23699 49335 66094 74548 53888 45135 40028 29597 33058
13311 33058 56564 40597 44130 54733 37477 60060 73145 50427 54573 71547 43740 55902
13299 55902 64176 34234 17076 27433 31707 26833 11708 3790 11021 25106 62024 61854 38301
13286 38301 17908 40007 45709 46202 46601 61911 77272 63657 60826 75247 98612 88730 85920
13273 85920 95873 111811 116018 120560 122033 166857 188158 227278 279010 342774 402311 497579
13261 497579 620942 719299 802276 942525 1100888 1285756 1595233 2025752 2581516 3041271
13251 3041271 2997667 2537969 2039236 1669339 1376701 1158335 1005005 903084 830367 767706
13241 767706 710636 661293 636029 605650 583562 573296 569036 567923 535403 501850 477323 451462
13229 451462 441669 447909 440221 418997 435925 430842 416279 400048 417089 422064 389954 381407 389852
13216 389852 396912 381295 360868 348806 334997 325760 314935 295775 271898 250228 257875 263448
13204 263448 257614 230419 255957 257880 245188 212842 214479 206309 198821 221617 231448 246103 278881
13191 278881 313220 332140 359937 434203 465072 448053 406885 356361 299525 259300 241797
13180 241797 244682 228333 199277 220822 249392 219048 191278 159720 162762 165039 169975 153308
13168 153308 128068 161217 159509 141685 162176 194024 207691 216237 198296 197464 198539 205976 207871
13155 207871 210689 222636 240166 274269 319374 360798 384623 423702 474872 533530 630909 771762
13143 771762 945915 1063360 1077405 975194 823044 674692 564602 504666 444343 417591
13133 417591 394324 387249 389942 364859 387141 389024 356876 318919 336044 353474 340568 314378
13121 314378 286769 271590 283785 305304 305068 318317 336652 371679 409868 431526 464923 499144
13109 499144 522727 552149 608742 672794 749914 831148 932543 1006683 1091244 1202078 1347946
13098 1347946 1579300 1765190 1703489 1347984 924389 595490 401608 328649 302116 283344
13088 283344 282495 306052 311107 311294 314245 302754 280761 285482 305283 328655 344619 341763 336159
13075 336159 352101 401557 423078 415659 395643 397418 421943 471492 497422 506460 513267 506838
13063 506838 514768 531353 533723 513256 467868 457410 450091 468554 514514 550305 586080 593774
13051 593774 583660 588063 571880 544797 524381 456933 408053 408030 414269 391464 310665 223299
13039 223299 175855 185910 157936 115862 103119 106134 119668 130961 117226 102252 74442 77798
13027 77798 78569 50513 45035 89687 111948 118908 93347 80385 53089 5283 -3710 21343 26102
13014 26102 20425 38207 66329 77427 77271 83517 94431 76442 95414 87656 70975 75511 79778
13001 79778 62160 71734 78487 83304 95502 98035 59188 34041 44666 44587 46914 17796 12309
12988 12309 26804 10045 11879 39251 55626 73319 99675 88232 75106 59253 33069 3670
12976 3670 -35549 -37370 -1982 6764 20670 9299 4902 65580 108217 141012 181609 196910
12964 196910 198844 199422 227253 284489 300415 298131 305572 304316 288674 286726 303529 310011 319662
12951 319662 322062 320598 348605 393608 401019 409590 393550 403333 419543 429907 447607 450626 444455
12938 444455 482752 530785 564437 595046 647647 714276 780471 736643 649781 561178 488603
12927 488603 447756 410442 452380 537661 629453 744065 846375 874529 859430 798917 669248
12916 669248 612718 567309 481458 385015 345601 365848 417519 490085 546603 603268 687714
12905 687714 792989 906198 976644 1081533 1180629 1315968 1480512 1689658 1898711 2147653
12895 2147653 2460039 2881711 3424170 4100125 4933735 5984875 7231920 8530945 9861137
12886 9861137 11343285 13355004 16551477 21633923 28680137 35347008 35980180 30300604
12878 30300604 23684522 18731715 15518928 13376120 11867040 10762765 9961431 9363035
12870 9363035 8898658 8576283 8302521 8031083 7789859 7571771 7400762 7271660 7184026 7147215
12860 7147215 7146313 7184090 7237139 7316349 7448880 7696791 8130303 8751761 9275263 9226325 8775718
12849 8775718 8325969 7955351 7691413 7516461 7398212 7301756 7206711 7084068 6955307 6830579
12839 6830579 6752806 6681417 6650174 6640134 6639821 6631596 6634394 6684543 6761801 6886588 7058182 7210543
12827 7210543 7370089 7528549 7769791 8093592 8439471 8771060 9117329 9522192 10137662
12818 10137662 10860086 11584522 12329551 13123982 14015966 15134349 16615508 18534800 20878217
12809 20878217 23616828 26891704 30780328 35616988 42084454 50944658 62732043 76923759
12801 76923759 91640410 106553190 123411325 142365837 162967757 186285275 218058384
12794 218058384 268507901 348388680 458761852 567241595 591390531 511000891 402435112
12787 402435112 315089627 255878924 215999217 188063475 167406583 151189309 138380980
12780 138380980 128308552 120257834 113348169 106762533 100521775 94936177 90148966 86194193
12772 86194193 82937240 80134239 77708244 75602515 73719398 72120071 70756141 69609512
12764 69609512 68693915 67999031 67514356 67342264 67587271 68315458 68807542 68433624 67382045
12755 67382045 66069055 64466758 62369464 59750141 56787588 53761593 50807846 47974049
12747 47974049 45320863 42844911 40557002 38396939 36385626 34505564 32734203 31080201
12739 31080201 29586101 28262813 27035850 25862956 24611896 23285733 21988983 20740952
12731 20740952 19585597 18559895 17671945 16857918 16071623 15286872 14561127 13866019 13224833
12722 13224833 12598943 12011064 11449094 10907604 10392706 9894222 9446200 9043502 8686619
12713 8686619 8327539 7991990 7683875 7376605 7028548 6679614 6372460 6130140 5917979
12704 5917979 5687297 5469932 5268909 5042114 4858355 4689961 4539758 4349730 4137968
12695 4137968 3921353 3716464 3529903 3415362 3302296 3188752 3067886 2974398 2857413 2750737
12685 2750737 2613206 2511462 2441454 2393125 2359534 2309860 2220477 2142629 2093213 2042993 2043321
12674 2043321 2057424 2058718 2095254 2173283 2286403 2392402 2487278 2559146 2557637 2505803 2407506
12663 2407506 2224050 1979183 1700281 1454566 1327919 1331436 1451095 1587206 1635037 1616115
12653 1616115 1612199 1604572 1476121 1261858 1113666 1059900 996986 960447 891903 828312 778569
12642 778569 790437 795620 779730 755133 729887 726762 746980 763189 748837 735418 733622 747087
12630 747087 776994 788092 820581 851603 904850 934899 955370 1018036 1056570 1095707 1112988
12619 1112988 1146912 1227088 1261426 1278456 1318164 1360799 1411511 1440257 1498584 1553717 1605246
12608 1605246 1641131 1661978 1658721 1629337 1622861 1594911 1590232 1600867 1598099 1556274 1500489 1500791
12596 1500791 1532732 1550489 1548593 1543183 1548438 1549145 1544912 1534261 1494340 1451558 1424147 1382729
12584 1382729 1338620 1316567 1315937 1310654 1320487 1335519 1315871 1323555 1299598 1275767 1254756 1235706
12572 1235706 1266255 1304291 1325331 1317023 1274072 1261414 1293208 1365159 1452333 1535019 1602775
12561 1602775 1685741 1788478 1883919 1981142 2050034 2060544 2053739 2014994 1949258 1896391 1813491
12550 1813491 1661074 1534533 1443176 1385511 1359552 1332953 1326268 1309624 1259247 1222382 1197470
12539 1197470 1162803 1143326 1122033 1095028 1056725 1016313 982688 964435 932619 900092 882092
12528 882092 874332 878059 852915 836879 835252 812973 777203 773137 793147 793980 790671 776296 729423
12515 729423 709383 723086 706061 720238 740227 741160 748116 738564 732497 713956 719593 703355 695952
12502 695952 692516 712130 716584 729782 746783 704178 683462 667976 667105 694907 700230 720271
12490 720271 745747 751875 715842 594250 339344 31958 -140632 -168217 -130298 -80296 -52830
12479 -52830 -16279 32328 72889 124364 162108 177280 212291 243632 274471 298394 309378 328126
12467 328126 350045 387769 385074 385621 392995 433548 479496 513101 547248 589687 582175 584424 588250
12454 588250 587255 609194 642123 673445 674533 664417 643189 604245 574892 525165 488259 492242
12442 492242 448047 402748 363709 335157 364773 395835 412364 442579 481519 526651 562616
12431 562616 588925 636198 685529 744290 787842 839010 873591 899435 878846 829612 766533
12420 766533 726072 693500 677338 686955 696889 688582 688792 713643 734426 736654 757506 737650 687730
12407 687730 640458 609537 599744 597375 562580 535342 500134 501001 526351 549142 523590 479942
12395 479942 469349 454800 439757 430338 435394 414483 425054 421347 414627 387041 388728 399982
12383 399982 380103 397213 400458 386195 350464 307818 324689 332221 345651 389511 442378 473618
12371 473618 495836 521292 563313 621465 674119 762080 833808 921984 1073428 1235365 1422644
12360 1422644 1615444 1835743 2138743 2507156 2980743 3564204 4167155 4692175 4990570
12351 4990570 5025447 4758513 4292861 3754582 3226769 2765469 2451750 2186609 1982830 1835605
12341 1835605 1742894 1686152 1614543 1546417 1521893 1513656 1476212 1474276 1482754 1491428 1529255 1611814
12329 1611814 1695330 1774745 1876431 2011584 2251250 2627922 3191333 3795406 3981401 3631711
12319 3631711 3086184 2605170 2299602 2104731 1933457 1787111 1659623 1598876 1538687 1452262
12309 1452262 1372298 1323209 1277441 1220922 1182106 1156492 1144249 1105783 1085571 1046327 1031455
12298 1031455 1008683 982599 978513 987602 974794 953318 942328 922964 917900 920267 909918 882361
12286 882361 872306 890186 903379 907110 888952 831971 798869 784603 753662 730283 684452 644968
12274 644968 634921 628693 628420 638775 663966 673385 656295 616848 557429 494794 464209 426188
12262 426188 387320 362893 355794 394555 401785 408368 417288 429940 431508 449555 456995 467267 481587
12249 481587 500738 528716 559090 604928 646625 661982 683581 726849 788551 849018 874477
12238 874477 873877 886784 894655 923524 971586 1028117 1090831 1123938 1137913 1162047 1185531 1213658
12226 1213658 1263682 1311129 1326253 1312306 1341567 1378674 1406922 1457777 1524186 1589460 1621985
12215 1621985 1622716 1619689 1608209 1648451 1685245 1712259 1743528 1771289 1787734 1783985 1775704 1780760
12203 1780760 1799285 1814270 1826604 1856452 1892811 1898538 1940328 1964930 2018953 2089585 2150049
12192 2150049 2172398 2205173 2255521 2304731 2361916 2423479 2471553 2524480 2603191 2700315 2810737
12181 2810737 2903669 2989438 3113968 3228758 3373905 3525446 3712561 3927890 4155433 4386176
12171 4386176 4684067 5044513 5431660 5888797 6458507 7081875 7831990 8748015 9889650
12162 9889650 11227708 12802300 14631985 16784708 19328077 22327184 25864601 30064389
12154 30064389 34996613 40819540 47745276 56088812 66300222 78886815 94454624 113245274
12146 113245274 134620304 157562646 181185370 203655656 222396931 235412876 241630030
12139 241630030 240432227 232020633 217402096 198466328 177679513 156952641 137533133
12132 137533133 120532505 106763181 96171705 88101496 81824738 76757440 72511286
12125 72511286 68812525 65467124 62418133 59614617 57020818 54684353 52590089 50753901
12117 50753901 49195116 47874955 46806998 45941945 45236495 44732363 44345641 44032335 43734040
12108 43734040 43350808 42867808 42270952 41520104 40568356 39463400 38227519 36831360 35359528
12099 35359528 33782192 32134236 30528769 29005317 27496108 26052813 24688532 23431680
12091 23431680 22245726 21123138 20076074 19058011 18078253 17178594 16313053 15514504 14750930
12082 14750930 14027516 13370694 12740358 12103992 11523726 10985135 10469105 9985780 9538574
12073 9538574 9092248 8634447 8214173 7846144 7525291 7223163 6947665 6622998 6317002
12064 6317002 6024486 5777194 5588533 5373357 5131742 4908935 4709011 4519288 4341431
12055 4341431 4209664 4047135 3896376 3756681 3599361 3454835 3318160 3180123 3049869
12046 3049869 2927651 2771633 2660148 2536508 2444453 2401412 2332018 2230346 2152145 2102180
12036 2102180 2033266 1967847 1903290 1856421 1791235 1721301 1688303 1683527 1667629 1677176 1675136 1663376
12024 1663376 1642907 1640964 1666663 1688188 1698491 1729995 1759527 1753860 1748626 1722426 1668855 1612778
12012 1612778 1561246 1480669 1367994 1288306 1260121 1209754 1210561 1226602 1189365 1152791 1143586 1143197
12000 1143197 1083953 1017080 967492 922541 887091 844778 800763 761976 720610 704179 708964
11989 708964 716064 708315 704275 700126 666894 662064 672717 694038 709376 706484 705394 679340 698874
11976 698874 702948 723588 734765 745183 753555 756314 798576 850469 874497 885645 892091 880219
11964 880219 913242 944741 991533 1009401 1024453 1034951 1045360 1042646 1027332 1055547 1068155 1038983
11952 1038983 1030029 1033785 1046700 1046683 1054404 1022277 1008058 1015736 1027386 1032919 1023942 1003150 995391
11939 995391 1000808 980577 982692 968856 971457 963699 938907 912546 895362 888674 877049 868954 856659
11926 856659 845971 811409 798344 782715 781406 796816 761210 737154 750575 782600 775095 761773
11914 761773 743782 705977 727182 731839 704243 704875 714839 690026 679146 658168 628240 609079
11902 609079 615880 622009 606562 599416 599684 592405 578150 590535 598656 597499 572891 556789 559176
11889 559176 547043 554577 553584 540366 533573 520605 513606 494588 475527 463726 454329 448620 435148
11876 435148 435353 413048 400568 406586 421473 409373 413766 427032 436538 406469 403505 407019 433061
11863 433061 431627 414951 390220 391051 404325 412144 413758 406703 393833 382797 398560 403401 398486
11850 398486 389617 386887 397075 393700 406676 429083 433926 440144 432940 399023 373194 320474 279208
11837 279208 204171 158540 116954 70504 535 -31713 -43791 -36646 -15172 -15906 -38040 -30885
11825 -30885 8444 25513 36611 55499 103434 91331 100495 116002 139393 144435 165579 178323
11813 178323 162995 161450 150297 167074 187542 215209 210566 196178 188013 162635 159435 172585
11801 172585 167696 145326 140447 137813 154286 146868 141412 176582 194891 161673 135847 133353 124826
11788 124826 144009 173081 163700 161654 159919 167304 165294 139777 169426 194375 186619 186257 192473
11775 192473 198457 183502 181897 162552 177577 171894 167553 186101 198147 188043 164091 135604
11763 135604 148883 155266 140510 151756 160690 166132 145874 130652 138954 141889 119052 125640 138349
11750 138349 153206 147273 168637 172015 163986 153784 157377 182582 184766 182206 191877 201601 210199
11737 210199 208154 209408 205146 234692 261429 287220 331656 373374 415992 444909 499754 598510
11725 598510 710788 830147 926671 1026914 1124617 1242226 1286406 1288477 1308496 1295109 1230664
11714 1230664 1142358 1070824 982514 843797 755682 672497 607828 564779 524777 506125 487181
11703 487181 467707 455913 435384 386112 363340 375284 356545 349089 339242 311230 296315 292937
11691 292937 290413 290573 297937 291700 297705 320176 309960 297204 295559 291480 296371 288374 282366 298615
11677 298615 299490 275787 261236 252507 256917 271205 274564 255261 232379 198177 186737 173745
11665 173745 177085 178322 187015 197433 187280 199353 172914 163851 171885 169329 162433 147225 130294
11652 130294 137915 119857 115801 142836 154867 152422 128145 138772 138697 134259 123347 127372 136766
11639 136766 142546 150096 148602 136982 139763 135842 131261 140272 135295 129316 99571 100852 112619
11626 112619 112899 108164 103144 106400 120720 121914 104064 84353 67581 70998 92852 73895 62318
11613 62318 81100 90290 111449 121583 120461 134461 120748 91646 78843 89772 88274 85448
11601 85448 105824 118405 93165 84560 72522 73620 97433 102475 95385 95822 81273 83739 89867
11588 89867 102932 93245 89817 93608 113967 134244 148912 134315 118451 116837 120289 100640 98551
11575 98551 96824 86492 82106 72919 73620 95955 93084 66693 65034 76016 92127 94927 116858
11562 116858 107590 87097 66525 53032 52579 62324 66229 66800 60439 69134 70571 85008 99402
11549 99402 133703 146810 123559 89085 101967 95382 101587 110819 110654 139656 148624 150096 128560
11536 128560 110261 113393 113744 98636 95983 94803 116075 138093 110258 109533 122084 125782 120450
11523 120450 125191 92915 80529 89016 121692 147975 155501 151047 131348 124913 125766 118026 113934
11510 113934 134940 147814 138308 126948 121425 139091 135000 99774 101783 96376 78018 93103
11498 93103 128450 128054 124945 142033 147744 174278 189143 183361 157545 122309 111281 106943 145932
11485 145932 148029 148015 142893 158722 145204 128465 119982 128997 116944 103755 104772 121602 109984
11472 109984 110520 96514 103194 113452 89899 61635 57952 63677 77191 63437 76961 83341 90496
11459 90496 88519 76989 88865 132099 121726 128069 110202 81464 99438 94540 79675 90914
11447 90914 88716 78079 91084 87377 85934 86147 95148 106035 113320 120413 124490 102903 73213
11434 73213 63727 103363 117058 110216 104948 97000 95021 113834 109366 90422 84970 71358 61795
11421 61795 57633 49178 36223 13329 29647 47141 59513 92334 102366 87969 70531 60889
11409 60889 64611 72388 71884 83182 77185 46742 36561 23990 20686 34400 71392 65104 82103
11396 82103 74070 49180 41075 39766 52215 86431 107099 99505 107511 99604 95793 92309 79331
11383 79331 57566 49027 43555 29410 45899 71629 68108 80751 88253 66431 67497 85417 87939
11370 87939 65711 53937 65940 98153 126203 118972 125215 125649 124052 97387 75795 67526 73030
11357 73030 74148 61931 83269 95817 92943 105720 121537 139271 138040 134436 140447 116862 117874
11344 117874 117415 104451 102327 89415 84139 87709 96767 95507 93593 91132 86949 94093 80988 69473
11330 69473 60931 110790 96365 65014 79965 95372 76911 42090 46979 46244 67866 97501
11318 97501 118873 137761 129808 138654 117995 119815 132595 137196 114849 83594 70400 98774
11306 98774 93345 97908 100482 126875 143778 165558 180155 158029 116220 114652 112088 128370 141546
11293 141546 166015 156786 166941 166667 152555 131803 112769 102440 108397 140891 135389 93471
11281 93471 82755 103664 92781 85259 80090 70212 52268 47386 69641 99340 108742 129764 119136
11268 119136 83695 83796 105837 103142 88732 111322 104729 87070 94435 120079 120707 126402 122201
11255 122201 110262 78189 86416 101884 96932 82640 74708 86116 116515 141759 145123 96368
11243 96368 79166 76411 99767 109990 98564 80307 85248 107877 128028 104951 85441 89006
11231 89006 74082 87817 80541 72200 67414 91441 107913 83512 84043 117095 119880 97519 80872
11218 80872 89033 83460 91994 120140 135659 112444 107544 114238 100438 91171 69032 87351 109123
11205 109123 93226 94297 102732 103825 119604 132066 141454 121385 108829 113775 110989 116517 97354
11192 97354 96275 130025 100789 69994 89573 112270 118559 96128 100075 111465 120244 120036 134502
11179 134502 154837 145724 147760 144876 152921 167804 154496 161560 144943 156233 149074 153297 160920
11166 160920 163299 164297 157774 158722 188546 191337 200204 175637 150495 125817 129010 148039 151449
11153 151449 174276 200145 194355 189567 186128 199565 190190 161086 166459 206366 215003 197972 218115
11140 218115 210170 202717 220211 254685 277209 291512 264006 228506 235222 239413 243829 277363
11128 277363 284283 272426 272083 262720 262011 274216 300069 302022 304605 312596 315541 338057 317047
11115 317047 322090 357527 367388 352657 367555 380830 383200 409708 407811 406864 436874 478601 490717
11102 490717 466772 467913 475533 504984 531401 565591 573930 570038 592047 621777 629417 642865
11090 642865 665570 685270 699234 717507 761830 804361 864866 870907 898225 941001 986645 998802
11078 998802 1020260 1062724 1099149 1144617 1193649 1233976 1259479 1314233 1392075 1456569 1509472
11067 1509472 1574780 1657728 1726725 1782577 1822449 1858545 1907379 2011397 2074909 2103805 2141299
11056 2141299 2188940 2247487 2274458 2305132 2360283 2384785 2427529 2477928 2521337 2555378 2586346
11045 2586346 2612743 2637458 2663243 2710693 2753243 2791580 2816569 2896526 2948962 3010170 3068397
11034 3068397 3100135 3148675 3194544 3226427 3230829 3284851 3338894 3372543 3402213 3438585 3460496
11023 3460496 3499679 3541204 3538832 3527722 3550545 3564556 3581727 3585249 3565124 3521274 3490276 3463200
11011 3463200 3422554 3378925 3370898 3377627 3367297 3311371 3261109 3245452 3200441 3133494 3085071 3039667
10999 3039667 2996048 2980013 2944671 2890237 2856602 2817186 2730409 2670164 2628350 2589171 2526349
10988 2526349 2453648 2413279 2374354 2341756 2312210 2283232 2281717 2234976 2183441 2135062 2049405
10977 2049405 1968901 1893731 1825236 1793705 1778495 1720118 1663104 1618018 1590249 1541701 1488263
10966 1488263 1456568 1414643 1386899 1342252 1312404 1281152 1261572 1239162 1213297 1167551 1125996
10955 1125996 1089256 1063098 1046547 1024748 1010347 1004215 978239 924182 900071 881826 862226
10944 862226 855911 871377 838761 788458 753854 737078 727492 711381 696638 684900 675840 671376
10932 671376 658477 662819 642618 643797 633742 592276 566710 577186 582193 601396 599244 599580 579467
10919 579467 563934 564938 540995 533327 538536 500589 454712 462425 473721 482864 480906 471215 460890
10906 460890 445096 432186 438599 447602 472589 477808 457614 439036 416748 408220 407545 410739 416061
10893 416061 410787 421283 444044 455755 416192 392285 376813 385634 385786 386131 388116 373723 355204
10880 355204 362457 367364 373436 389807 391882 392324 406822 426944 444505 443555 438268 414668 389437
10867 389437 383856 402168 421038 402800 415787 432085 426808 400176 413343 414289 412482 409393 412905
10854 412905 421917 388668 356523 370651 393713 391895 392861 387156 387347 377567 377586 373919 347021 336736
10840 336736 356628 374038 381430 387767 425062 438482 424680 392434 376692 366267 378851 381824
10828 381824 370180 350139 375648 419296 447612 493402 477985 410551 420253 448629 440043 430728
10816 430728 432377 431654 451713 465221 463434 493580 493106 486164 487431 498095 500920 505178 509463 515087
10802 515087 554029 574605 575361 608086 662876 682815 684967 677847 692973 702971 723471 748466
10790 748466 747839 740985 753749 768896 763113 755639 764167 785510 794821 801840 808252 810261 834092
10777 834092 867147 865882 885339 899137 908042 891877 899211 918645 959687 982447 995816 1003882
10765 1003882 1007233 1013714 1041935 1056094 1069689 1096550 1103270 1099120 1108623 1118923 1106118 1102918
10753 1102918 1086989 1104138 1075866 1054324 1044818 1050616 1035144 1015311 1021661 1024443 1005075 1007018
10741 1007018 989195 995612 1013884 1022746 1028728 1025268 1042270 1077986 1081662 1092626 1066809 1053974
10729 1053974 1042036 1033643 1019572 1036429 1038749 1026064 1010071 992739 971037 970337 970234 962192 967117
10716 967117 965192 969555 941070 911662 905788 882260 884833 914431 903498 852563 836716 828252
10704 828252 821274 836921 848444 850656 852692 850466 834880 833694 839869 843354 854891 860846 844053
10691 844053 830204 812914 799077 785062 802039 788593 817581 807701 797889 793496 802818 804319
10679 804319 783054 782033 739692 727667 741779 765638 801546 807626 780891 798862 797358 799976
10667 799976 816454 804067 780528 778910 803346 815761 844692 822351 805549 816513 810804 819820
10655 819820 847437 881324 879561 887890 902941 891826 890976 877905 875492 885065 880642 861493 843689
10642 843689 832965 851246 852599 839591 820453 819034 831150 830206 842950 820030 818218 837555
10630 837555 861887 841433 847697 875230 919693 946714 921486 876611 880366 898412 890868 888680
10618 888680 894525 927833 921364 892393 875549 904457 934675 928866 888932 882826 870427 875509
10606 875509 883221 882129 888346 890274 887600 881366 865044 851336 825205 842934 843537 864934 890404
10593 890404 880904 874360 871875 892055 906973 912120 931145 960105 975095 959207 940938 936334
10581 936334 928186 969837 963975 979489 970724 952174 938702 939154 959541 952331 957539 969584 976786
10568 976786 979616 963250 923722 943288 977741 986200 982561 977658 984816 988820 981665 969409 965911
10555 965911 971164 998542 1018715 1020288 1029659 1039956 1057552 1084811 1099850 1122249 1136656 1139037
10543 1139037 1137422 1138967 1124418 1167651 1203930 1204727 1211211 1223769 1261408 1283622 1289482 1286950 1296012
10530 1296012 1310579 1338099 1361176 1399033 1409713 1397434 1387532 1403441 1402303 1404526 1423700 1448543
10518 1448543 1467412 1522333 1565096 1585532 1605873 1610947 1625317 1623675 1634848 1669193 1710281 1752025
10506 1752025 1769359 1786395 1829020 1859259 1866992 1876948 1904792 1922574 1984159 2007578 2016240 2055142
10494 2055142 2098707 2119048 2152798 2186072 2202434 2210248 2248614 2296847 2321803 2373081 2422401
10483 2422401 2477358 2551633 2602453 2619754 2659054 2694111 2724977 2764048 2791398 2827854 2913400
10472 2913400 2976655 3047366 3126058 3157500 3171351 3218310 3314108 3387964 3456298 3508357 3588017
10461 3588017 3648755 3708024 3774688 3855078 3903886 3974358 4062682 4171040 4278092 4361748 4428639
10450 4428639 4508050 4599089 4707386 4803119 4903858 4995124 5114416 5239133 5369408 5513706
10440 5513706 5621329 5777241 5925416 6062237 6200728 6334703 6496430 6659364 6828992
10431 6828992 7006508 7172824 7365596 7578461 7779557 7982529 8228371 8482567 8751096
10422 8751096 9021772 9312540 9608046 9922362 10261530 10653724 11035013 11447204 11873805
10413 11873805 12334396 12837749 13348291 13907099 14522928 15200748 15939234 16691250 17562887
10404 17562887 18518784 19557914 20726501 22008925 23377155 24796184 26373677 28136673
10396 28136673 29949062 31792702 33663279 35643876 37699713 39775651 41927103 44211202
10388 44211202 46642977 49192137 51823416 54545747 57327541 60154815 62928513 65630473
10380 65630473 68150764 70441311 72455348 74252438 75797230 77070625 78083569 78893170
10372 78893170 79568346 80156538 80722318 81305142 81916505 82643774 83495080 84544211 85763551
10363 85763551 87175813 88748763 90527393 92496929 94628825 96949781 99395886 101913880
10355 101913880 104512298 107152483 109751082 112284100 114686093 116911575 118926708 120646629
10347 120646629 122077067 123225363 124029427 124500849 124639601 124493334 124073641 123424714 122499583
10338 122499583 121406139 120171305 118818086 117394388 115934956 114496197 113073019 111735194
10330 111735194 110478837 109362155 108397335 107617390 107039933 106690055 106468951 106415936 106558747
10321 106558747 106902461 107409211 107995096 108653256 109330928 109983312 110574840 110991819 111189589
10312 111189589 111105247 110676136 109873053 108647590 107024383 105054802 102754643 100187371
10304 100187371 97446422 94553863 91569415 88581978 85626940 82701634 79873773 77158458
10296 77158458 74535005 71998284 69586527 67302553 65131749 63062118 61132366 59306223
10288 59306223 57578860 55944471 54405608 52952780 51612523 50309476 49042969 47853397
10280 47853397 46728950 45620069 44538443 43472006 42434071 41432436 40454943 39462458
10272 39462458 38450222 37481725 36537117 35543500 34594435 33637887 32679646 31753932 30851393
10263 30851393 29994566 29151886 28345474 27573779 26854836 26163750 25484581 24844407 24223899
10254 24223899 23642266 23093114 22588301 22126742 21653535 21212745 20808888 20445445 20091677
10245 20091677 19772424 19472738 19156995 18821313 18503951 18193145 17884474 17539430 17169433
10236 17169433 16819176 16490150 16167147 15829751 15452073 15073039 14724649 14386696 14061180
10227 14061180 13754862 13413509 13104939 12791431 12485142 12255396 12039851 11839951 11656647
10218 11656647 11444584 11243583 11081526 10959856 10838618 10695377 10567083 10440394 10320711
10209 10320711 10235924 10118116 9976706 9852714 9734369 9600593 9460588 9317589 9141731
10200 9141731 8947981 8766709 8586142 8424447 8280647 8106406 7961365 7809708 7618670
10191 7618670 7461694 7303058 7159057 7025417 6904913 6803175 6677231 6561626 6483711 6385087
10181 6385087 6291875 6223679 6138930 6061413 5973208 5881915 5825248 5754121 5709520 5676134 5600687
10170 5600687 5540324 5469909 5391746 5326878 5280002 5224085 5141565 5047476 4968718 4904824 4829621
10159 4829621 4761338 4708534 4679076 4594911 4518287 4460665 4409128 4349917 4292365 4255856 4205682
10148 4205682 4137071 4076461 4028980 3988281 3939625 3899568 3876464 3866357 3843563 3818899 3784615
10137 3784615 3767143 3748389 3726415 3675589 3644709 3607040 3532525 3483692 3458589 3416934 3379596
10126 3379596 3321175 3251392 3198933 3144221 3084904 3031687 2992964 2971455 2950503 2921081 2880172
10115 2880172 2811967 2733027 2704475 2683312 2671479 2633061 2583225 2527104 2481305 2458671 2446553
10104 2446553 2441787 2409338 2372594 2336209 2318811 2284733 2245704 2214538 2163593 2108362 2088794
10093 2088794 2084370 2072388 2066175 2063667 2027129 2000614 1993833 1931412 1889112 1887499 1866126 1837987
10081 1837987 1817833 1808012 1792880 1767536 1735109 1676712 1643421 1651196 1634384 1603554 1574861 1558307
10069 1558307 1558904 1551070 1514844 1501402 1502296 1484843 1462741 1440522 1409098 1408090 1415078 1364378 1349143
10056 1349143 1331110 1342225 1344841 1352237 1348285 1334704 1322944 1313965 1287101 1252915 1237358 1219729
10044 1219729 1220335 1207792 1171570 1157609 1152280 1121634 1097281 1091306 1099189 1085257 1074772 1063576
10032 1063576 1072465 1066144 1035618 1036017 1016515 1011858 1038761 1024819 1017095 1031940 1020647 1018812 1014382
10019 1014382 992246 978986 981418 983346 995941 995835 1009143 1007628 983534 924276 912566 922211
10007 922211 917291 899507 919762 928831 915544 920125 900536 898479 879045 894884 895529 883034 886435
9994 886435 893388 909344 897612 902011 896889 891771 912570 948625 967607 956894 968553 991902
9982 991902 995482 963960 962147 960582 960993 979215 953109 967784 988600 1004655 1030511 1051442 1057899
9969 1057899 1082596 1120874 1122281 1089464 1091000 1093945 1106503 1147401 1183198 1204813 1208777 1235490
9957 1235490 1240099 1243555 1225978 1229554 1241828 1255884 1246223 1224913 1235708 1266555 1272859 1285651
9945 1285651 1291546 1283912 1310454 1323341 1325948 1332330 1360937 1388089 1396443 1395121 1395105 1404510 1431535
9932 1431535 1440488 1451436 1480749 1489426 1471949 1461544 1474925 1495551 1525629 1532071 1523062 1527490
9920 1527490 1549436 1542386 1537449 1551368 1547374 1544393 1529710 1528507 1523203 1528471 1512532 1507529 1488492
9907 1488492 1490155 1497707 1487922 1491763 1476195 1490906 1509917 1517019 1510406 1494120 1514654 1546197 1552314
9894 1552314 1540135 1544115 1569130 1595154 1611473 1623180 1631083 1646708 1636929 1618701 1613393 1585257
9882 1585257 1541315 1545511 1552546 1551393 1537890 1539483 1549134 1529098 1496215 1476173 1478753 1458363 1455083
9869 1455083 1469975 1460787 1457486 1471090 1490865 1483072 1491029 1497938 1494594 1511352 1522339 1539525 1543501
9856 1543501 1581563 1624216 1636584 1618243 1610382 1595880 1603099 1597945 1599456 1620019 1651973 1694159
9844 1694159 1752606 1834292 1972797 2134632 2277849 2417506 2591167 2804674 3101769 3565370
9834 3565370 4260836 5044200 5526917 5402502 4753636 4009818 3453046 3054488 2757457 2564096
9824 2564096 2435424 2363763 2299189 2246212 2194392 2176627 2140587 2058275 2032689 1968091 1912113
9813 1912113 1915462 1927322 1919385 1901389 1868668 1866147 1859489 1876602 1875909 1839236 1845243 1829415 1843907
9800 1843907 1819163 1796351 1788362 1783981 1794957 1772191 1726362 1685611 1647582 1611060 1607631 1595684
9788 1595684 1566981 1534636 1518376 1539354 1525004 1486835 1463308 1455363 1441749 1414459 1412058 1400014
9776 1400014 1362694 1324637 1313690 1319208 1295234 1302363 1300984 1300343 1287900 1275414 1240101 1207774
9764 1207774 1170671 1137866 1130991 1151591 1143452 1116283 1140330 1148635 1139268 1136880 1129112 1103463 1083444
9751 1083444 1076989 1056355 1026373 1009084 1012019 1033246 1038482 1015950 1004132 1014959 1013985 1000214
9739 1000214 985507 972224 950208 956158 938992 923275 935928 935472 924526 905953 901371 886989
9727 886989 886751 886487 868676 852189 838985 861473 861261 836443 837817 849458 837742 811920 790890
9714 790890 780674 808770 807446 782605 788861 786127 771540 767487 762990 776388 764304 775289 788132
9701 788132 775272 772125 773125 731018 711042 710595 691114 678321 674103 661672 677193 674404 651739
9688 651739 631140 592566 596308 593792 580861 569429 585135 584130 573197 577017 554896 555012 541125
9675 541125 549514 551963 552986 545902 535053 540033 533546 513232 510604 531180 571341 582752 580606
9662 580606 568876 562029 569208 575814 562062 553620 553725 536387 515013 525199 531402 524027 533256
9649 533256 529025 521279 492678 479833 487009 486520 508821 482405 444810 427433 442236 447965 450764
9636 450764 453483 447334 445537 459233 460011 467591 468439 457032 441836 449985 459727 459587 471002 417184
9622 417184 392135 405296 422173 438680 437671 439171 436222 407841 399582 425299 434797 426752 408467
9609 408467 406753 400988 392991 386427 363628 393934 429237 418302 398023 388849 393254 393713 384217
9596 384217 367499 382161 375398 373393 368397 375093 397364 384937 380693 361030 346989 351053 365031
9583 365031 372109 391991 410711 402375 389614 376806 347281 340568 353241 368101 383003 395295
9571 395295 409664 438332 417653 396501 397068 395479 398216 392645 359756 358847 380015 405157 409766
9558 409766 421790 434330 446534 452010 411110 398300 437115 478991 497629 497652 503749 525037 513568
9545 513568 509135 491036 454479 432749 444679 456956 444938 469506 464814 463422 454245 455854 462951
9532 462951 474930 523309 539529 524723 532195 560017 578555 580926 572701 572762 604577 633880 632936
9519 632936 648748 665698 686314 717642 725401 734980 749745 773237 782726 793475 783168 777465
9507 777465 761657 785117 805648 800189 776716 783859 743489 725860 747638 743618 728379 712300
9495 712300 721227 717659 734155 748297 741575 716193 725775 746246 777210 802179 812272 825973
9483 825973 859790 902919 937300 943310 967659 999588 1020259 1031270 1035018 1045346 1060548 1069757
9471 1069757 1045198 1000775 985353 995845 970965 941572 896913 875605 877371 891501 885193 842985
9459 842985 810960 804581 825229 859711 867677 878208 912209 909630 891191 879715 874519 871610 888603
9446 888603 904114 907864 926487 919737 933052 979907 1017570 1040690 1022219 1013475 989619 989598 980658
9433 980658 957582 956268 949905 943346 930338 924715 916806 899294 882797 874062 862750 840507 834778
9420 834778 823860 824022 797874 778085 771933 771510 752804 743173 744625 745590 747515 771470 804249 824784
9406 824784 834188 833830 846260 874742 862409 847451 856130 848486 807346 811894 816956 803345 780847
9393 780847 779581 768510 781305 794675 792949 773885 743560 705975 686486 691876 673001 652764
9381 652764 646060 653309 677952 676216 660984 621733 615151 603731 612611 629307 618167 597379 602039
9368 602039 622056 607742 649416 677519 682513 688988 697128 701445 688823 696918 720949 726165 715044
9355 715044 704456 713222 710329 691125 680571 656459 666909 659351 647476 622615 621649 629726 634190
9342 634190 632339 636274 653885 662845 658130 664348 649791 641102 620400 620197 613290 614099 630052 637743
9328 637743 639376 648705 638181 654789 673912 668629 676693 687823 673002 671638 666924 674392 682006
9315 682006 692812 687879 664138 675661 693582 698639 694538 685934 709176 735095 747983 739295 713063
9302 713063 719508 751910 786500 774614 763515 751257 733788 721573 725655 761962 786615 792980
9290 792980 786291 773221 782147 807792 809214 805234 837913 861404 869961 877445 884257 861395 834556
9277 834556 846115 890823 923517 959576 952493 961070 975293 967805 976106 988945 997525 1021947 1036505
9264 1036505 1054240 1059168 1067553 1081578 1106243 1121632 1122978 1153144 1186532 1177086 1168302 1174737 1195833
9251 1195833 1195884 1200564 1229392 1266171 1292189 1282845 1286315 1299514 1317706 1336893 1322989 1356084 1371358
9238 1371358 1365754 1380510 1390447 1416728 1442334 1468121 1502322 1520852 1527653 1554338 1578583 1613675
9226 1613675 1623026 1619157 1616972 1639097 1648143 1663729 1699409 1729877 1751915 1752732 1755408 1773044 1789896
9213 1789896 1807500 1832273 1865654 1898181 1937191 1980660 2014241 2017579 2014623 2029879 2035085 2055009
9201 2055009 2108478 2143734 2175909 2209285 2249468 2278242 2327966 2413189 2450847 2498726 2543603
9190 2543603 2576146 2603694 2666724 2725291 2778640 2838910 2913869 2978280 3044537 3122760 3219069
9179 3219069 3322476 3422006 3555010 3670049 3787372 3961338 4146297 4358301 4628418 4942075
9169 4942075 5259416 5625571 6052199 6582805 7218976 7961154 8804927 9759006 10839816
9160 10839816 12015947 13297505 14678479 16115157 17629688 19180273 20722579 22151871
9152 22151871 23403755 24412198 25054612 25187282 24857242 24246885 23486315 22707680 22021302
9143 22021302 21446278 21002051 20768612 20759004 20944443 21321313 21900447 22730404 23779977 25125413
9133 25125413 26709740 28473084 30461462 32619324 34990779 37582584 40390301 43416375
9125 43416375 46631783 49994632 53364054 56603055 59546142 62212920 64595987 66674432
9117 66674432 68501648 70090458 71427321 72490995 73279341 73735470 73790539 73432166 72723903
9108 72723903 71805117 70811753 69808168 68842925 67986979 67303596 66906286 66868706 67161209
9099 67161209 67808903 68866771 70285052 72046541 74166094 76609172 79350126 82354417
9091 82354417 85650357 89246937 93071670 97073501 101219757 105348172 109344482 113138010
9083 113138010 116654394 119874583 122724691 125097137 126764058 127514965 127201366 125828792
9075 125828792 123604221 120758241 117480124 114013985 110579414 107336554 104344730 101700576
9067 101700576 99444425 97567122 96088844 94977331 94280138 93980814 94030953 94452179 95231668
9058 95231668 96374243 97847733 99625058 101685615 104004817 106530302 109143442 111757509
9050 111757509 114246723 116525492 118503605 120032552 120997105 121339321 120983739 119890201
9042 119890201 118088741 115653174 112767679 109567450 106211280 102869522 99581081 96409353
9034 96409353 93406330 90631781 88082402 85717101 83564625 81593422 79825951 78279622
9026 78279622 76930112 75789287 74898197 74197751 73673702 73417775 73387279 73550541 73867799
9017 73867799 74267211 74609312 74773607 74732971 74466469 73915703 73058917 71813567 70209985
9008 70209985 68284959 66119425 63847572 61593439 59455749 57490017 55668561 54009731
9000 54009731 52473033 51055283 49708759 48413040 47163593 45939695 44737159 43549686
8992 43549686 42393565 41286930 40250406 39270541 38304918 37355603 36420784 35499648 34578363
8983 34578363 33659172 32762878 31880743 31016652 30192119 29432189 28680868 27940086 27257895
8974 27257895 26597245 25978160 25388453 24846589 24339788 23876631 23450825 23066211 22735239
8965 22735239 22472191 22232399 22054584 21898466 21781671 21692333 21613627 21537877 21470786 21439922
8955 21439922 21353669 21179092 20982796 20771023 20522358 20213722 19908991 19605512 19307789 19066934
8945 19066934 18889476 18767751 18688297 18662395 18701925 18764813 18875933 19038804 19257656 19496411
8935 19496411 19778446 20128773 20492473 20889140 21348395 21830274 22356587 22939083 23547077
8926 23547077 24201248 24866076 25580121 26342288 27113052 27874741 28633917 29398265 30152012
8917 30152012 30805889 31320765 31649005 31784980 31742517 31577846 31408610 31222859 31134107 31163363
8907 31163363 31305537 31594582 31969650 32430353 32990764 33599793 34178190 34708558 35214209
8898 35214209 35661908 36089272 36538788 37049274 37611994 38260786 38981907 39824321 40781674
8889 40781674 41857728 43039285 44300555 45599881 46897938 48169594 49305775 50242824
8881 50242824 51017735 51601572 52014815 52268377 52366693 52368066 52248106 52038371 51694536 51263951
8871 51263951 50737784 50139143 49447711 48748639 48054081 47371833 46762296 46243271 45852994
8862 45852994 45640002 45628832 45821019 46180524 46691835 47377048 48245853 49264442 50407162
8853 50407162 51637548 52876442 54034886 55025133 55784086 56316149 56541763 56492712 56222162
8844 56222162 55734611 55060505 54250969 53409119 52529761 51613093 50718848 49808693 48902027
8835 48902027 48007005 47148378 46339918 45595157 44876486 44214638 43608756 43053844 42517215
8826 42517215 41988094 41410540 40806242 40186454 39610374 39087631 38656788 38316678 38046548
8817 38046548 37829655 37650051 37488903 37340609 37162196 36950494 36715767 36441012 36151328
8808 36151328 35823506 35455679 35101030 34734399 34359168 33933651 33441519 32860523 32176995
8799 32176995 31425158 30560303 29608530 28607317 27573506 26558474 25616951 24732840 23929143
8790 23929143 23199093 22529438 21935005 21435021 21034353 20711390 20431168 20198697 19991148
8781 19991148 19795194 19626632 19404046 19128256 18799792 18477703 18139154 17807206 17501372
8772 17501372 17247255 17010835 16797136 16608869 16378165 16105890 15802073 15454436 15084596
8763 15084596 14670332 14220374 13788688 13373295 12992650 12610634 12223943 11868143 11585116
8754 11585116 11265530 10957074 10652300 10385837 10140036 9896124 9667235 9443881 9205594
8745 9205594 9013079 8841526 8665328 8540756 8431213 8351908 8290885 8211351 8134696 8084660
8735 8084660 8035769 8012348 7993569 7938537 7883510 7819496 7727470 7642678 7526164 7392862 7252364
8724 7252364 7095093 6971617 6828884 6669468 6539490 6451513 6366478 6244111 6102898 5990375
8714 5990375 5898918 5832755 5733561 5672224 5621963 5551245 5459170 5377000 5335075 5302134 5238717
8703 5238717 5182328 5137268 5072789 4985018 4924792 4887798 4814749 4758089 4684638 4621981 4588057
8692 4588057 4573359 4535920 4512957 4463318 4415407 4367920 4332468 4274566 4210070 4116804 4041826
8681 4041826 3953161 3880857 3830262 3755665 3704435 3667664 3624791 3576973 3523319 3453947 3395981
8670 3395981 3352860 3293833 3261521 3227598 3169563 3134744 3131113 3101280 3062543 3016237 2954926 2907379
8658 2907379 2871921 2813027 2755623 2717020 2676683 2620265 2571710 2571064 2579588 2529515 2453575 2417124
8646 2417124 2379857 2376183 2344241 2302134 2304618 2302385 2310028 2327308 2335860 2331348 2359298 2455320 2590300
8633 2590300 2740699 2918967 2973448 2815840 2598616 2404347 2244910 2121564 2057337 2003174
8623 2003174 1960649 1906933 1850477 1809530 1747454 1697862 1651757 1587852 1578862 1590445 1547842 1504245
8611 1504245 1492347 1511291 1512824 1509815 1498492 1471944 1430009 1419773 1419022 1404732 1402606 1410868 1434126
8598 1434126 1478848 1496778 1499948 1552755 1615579 1682906 1774827 1851213 1977658 2192620 2562117
8587 2562117 3006338 3214238 2982065 2591975 2228138 1975363 1802254 1669544 1585865 1501903
8577 1501903 1444588 1386145 1335654 1280639 1236070 1189677 1171222 1138614 1093328 1084167 1084925 1063234
8565 1063234 1051192 1033324 1032006 1046507 1038894 1016041 1001343 1013504 1003879 1007778 1003277 975091
8553 975091 965248 967876 973657 1005097 1045864 1081209 1092231 1134468 1169199 1243130 1407233 1614312
8541 1614312 1763328 1704510 1471018 1258520 1125669 1037161 978954 952950 915032 886066 874861
8530 874861 842770 810233 803110 799581 773550 732218 715309 724694 732585 725113 719169 696353 688469
8517 688469 674179 649014 634969 627538 612464 597009 605916 590814 608166 634741 635584 643527 651842
8504 651842 646741 660439 672077 641380 617432 618844 625275 624990 613393 593297 584331 582966 591305
8491 591305 589731 597972 598498 594205 596673 598026 572960 559482 572150 608652 598142 584591 583168
8478 583168 606630 620427 616064 628166 617366 612446 614505 601933 577533 565235 572025 576098 580809
8465 580809 591231 589366 586347 562991 562315 569657 580448 580724 604638 596070 607623 572807 560273
8452 560273 562856 565070 593647 616742 589873 579956 572036 583838 604711 602755 588903 585168 586527
8439 586527 566756 571974 583249 574983 555423 554978 536022 514706 526541 547510 543912 543906 561127
8426 561127 553665 548486 566345 561810 525234 531141 538744 530072 538931 536586 509150 483757 473796
8413 473796 489822 494181 479706 477780 486457 468100 462447 450795 437426 449821 445154 447842 451727
8400 451727 463607 457991 452393 441496 415713 440196 437773 427560 419022 418572 415501 392656 352986
8387 352986 331998 356936 366123 348830 347731 320449 342911 361112 327016 314447 324716 327219
8375 327219 332184 340899 316398 329687 362872 356916 343462 331150 330785 332845 342359 342656 350909 354647
8361 354647 341061 338581 321616 274797 270758 287674 302513 281835 261406 245468 228359 240416
8349 240416 232335 221675 229501 237584 213167 191676 191835 202368 213541 219502 230990 227004 237087
8336 237087 235667 247700 257070 249679 240137 247094 240679 222147 213553 245396 232457 233854 226479
8323 226479 224019 245400 240482 231712 224082 230402 221369 187073 163272 163759 182916 202890 216687
8310 216687 213421 213106 200524 224596 240595 227095 223439 204371 189162 176673 178643 190974 213846
8297 213846 218649 199412 162148 161355 159614 162774 158455 151061 167692 171680 159062 152588 158293 160771
8283 160771 166601 166755 146729 119967 122709 136727 147572 158624 171894 198511 206974 168923 145008
8270 145008 139344 122562 119756 128970 164331 153059 143672 137610 134183 133628 135251 167221 172713 181736
8256 181736 191291 190828 175930 138907 129984 153405 157575 132298 117275 140444 162991 167924 166410
8243 166410 164611 163203 160626 170124 160686 179528 178294 168162 174868 154706 142508 135886 139000
8230 139000 155736 170603 153073 149355 145753 142548 153948 140054 127718 155042 136194 131178
8218 131178 151123 119575 110348 100851 113830 128292 111192 109851 125901 135936 140766 127752
8206 127752 110294 120253 129187 126448 123181 101145 109431 110556 112422 130976 136884 130752 117436
8193 117436 117559 139271 160590 159864 137484 142725 134735 127985 116698 102105 79143 80823 91586
8180 91586 129954 167304 176588 160107 146449 153880 147470 136491 114087 103702 85907 94631 109377
8167 109377 118607 98867 89044 89283 89267 77768 108140 126244 112876 117495 139609 134003 131746 115763
8153 115763 121281 131920 144529 145098 133636 135590 152057 168407 133437 127134 127814 98374 77227
8140 77227 98226 108744 117984 108635 135603 133677 122343 138209 162469 133120 110649 77819
8128 77819 109035 123308 113180 112443 112539 111005 101817 117511 142676 160974 143685 128102 128232 100279
8114 100279 85257 76512 61076 26036 30361 57120 77770 94848 93862 104588 119942 111182 128838
8101 128838 134379 135984 130750 122284 131771 101164 95239 104045 114428 146947 160641 169539 155902
8088 155902 147133 127771 130207 130630 160395 154619 110306 95186 109117 149658 160179 146616 150735
8075 150735 146283 136934 154594 148504 163368 179620 161079 147897 136601 127861 109417 100404 106897
8062 106897 129362 130868 136657 130591 128713 110318 143914 166062 155063 154615 166688 169029 161498
8049 161498 161362 180370 201593 195557 176475 197629 208047 206304 176387 190916 195390 190157 197633
8036 197633 199813 193298 192455 201028 202358 170895 162790 142972 151244 169617 142277 124647 119240
8023 119240 100667 112589 95229 89449 109343 158354 161436 162715 160957 145919 130685 131443 128880
8010 128880 131279 127626 156355 177107 169595 147095 111881 94145 113751 93946 76433 77816
7998 77816 99277 131947 133845 117740 122867 124998 135306 148353 170723 195493 193648 182734 194540
7985 194540 210031 194568 180101 174044 164914 152496 140202 155549 183853 212767 214645 195467
7973 195467 177944 168091 146876 124327 124735 150398 162548 150665 163936 146382 128959 126898
7961 126898 124970 120510 132269 127261 125797 119842 91582 79811 100901 105776 95195 78508 66718
7948 66718 79895 62648 42298 37424 58688 80861 105285 117636 114076 77518 88479 104309
7936 104309 99763 116356 127395 142104 117063 114394 137609 123257 113143 106897 102821 137362
7924 137362 151126 139614 132853 136431 144338 131099 124780 113898 133051 140191 104823 109264 104245
7911 104245 106050 114478 113770 101215 74526 102238 122251 120355 117745 81730 45043 46371 91168
7898 91168 106367 95592 92162 71588 73665 63114 76134 108154 95934 60232 46462 34698
7886 34698 52523 81172 87239 91042 112462 117574 75903 55292 78427 89112 120206 130865
7874 130865 142357 108177 77908 70280 59196 76720 91808 100595 88458 71096 84321 91445
7862 91445 87042 113130 109496 95293 86892 62210 62242 57290 71565 107080 120664 115354 123990 140454
7848 140454 126499 105888 91210 62474 49965 64822 81255 88470 101530 120540 114599 70818
7836 70818 28697 31521 42029 80251 97846 95767 108712 109832 87414 65259 39720 30971 39927
7823 39927 67901 105356 119334 95308 81021 78059 83476 72611 71180 94053 98323 55104 44347
7810 44347 39310 43759 44374 63330 85011 81644 68133 71735 81180 69259 46177 52792 60473 43124
7796 43124 26895 13422 33174 54604 51161 43596 45791 58511 61794 67655 54935 26017 22713
7783 22713 41353 59851 51266 39821 69146 78109 86001 89837 104845 100038 95758 82774 62874
7770 62874 66895 60344 50426 52366 62638 59504 76422 70576 93626 99420 85691 74760 77256
7757 77256 58252 55835 76676 94509 70332 74821 43138 14933 25603 35946 19870 29099
7745 29099 44193 59376 66848 66707 41139 5921 2773 38908 59599 98268 121712 124879 108131
7732 108131 71833 43437 23485 23909 48066 21493 -17875 -28027 -6340 17305 29235 12182
7720 12182 8858 -19493 -20407 -9799 8852 3562 2813 -4545 -82 5128 359 27054 56863 68964
7706 68964 65890 59054 34266 19803 29944 49113 40058 39705 37252 36026 45073 35718 43352 30480
7692 30480 58433 88612 67302 30965 46042 47496 34015 36703 26295 -5584 -28074 -34259
7680 -34259 -14656 32116 58576 70161 88424 87655 80270 68937 49136 16543 23227 40291 67263
7667 67263 68288 56941 73886 83497 71643 33860 7706 -6101 18526 21379 9569 19215 2476
7654 2476 -5020 -17351 -26326 -38678 -43176 -21911 915 -3885 -4673 963 -9837 16740 17522 9632
7640 9632 17919 46683 45065 72417 48627 27807 29667 31223 28840 30607 22258 4740 26935
7627 26935 53619 47421 39633 20971 14760 -4717 -42944 -43971 -18481 -1862 3307 9978 11540
7614 11540 3760 8147 36758 53890 45117 42793 23116 33737 45871 50914 57467 43607 5679
7601 5679 -6707 10486 27634 38460 25608 26038 4140 -3327 -5697 -5443 -9893 8758 16225 29464
7587 29464 21530 -1865 11830 32530 44810 32140 5155 113 25381 29892 18367 16696 24824
7574 24824 608 9706 28839 4181 -29904 -38205 42 26253 41615 55716 68817 53388
7562 53388 49674 29443 28433 27044 20260 24258 40632 68715 91113 84886 41587 1663 309
7549 309 3316 -9451 -12721 -38875 -31533 -23240 -638 48784 40257 29198 47266 30076 28745
7536 28745 29339 33028 40606 55903 66079 47900 30318 36288 50734 72056 71079 42127 23804
7523 23804 1213 21527 31786 2354 -5316 -3318 -6878 -3260 23572 31602 31740 31860 27136 8777
7509 8777 9127 18419 28646 37851 10149 -9115 14739 2056 -2519 8778 16656 25031 22740 28173
7495 28173 33269 27435 22146 25284 30285 28860 44672 39720 17615 43202 67372 65903 70686 42745
7481 42745 22932 7881 21713 45079 73088 40779 30624 34039 24958 15872 25246 33346 8045
7468 8045 -11515 -14805 -23167 9277 38875 44467 32003 42434 50688 48999 41224 34622 43790 47925
7454 47925 29206 36210 18638 24379 22838 23669 30964 34940 25687 3563 12085 17639 9890 31032
7440 31032 53041 61561 62810 49589 25842 33553 11623 40802 66179 47418 62872 39166
7428 39166 19064 6951 23929 54774 38235 35303 34128 -2319 16728 11230 18967 42365 30954
7415 30954 23998 27712 41500 10587 -31100 -36793 -19768 -11071 -4238 -10956 -14993 -9206 -8105 -8893
7401 -8893 -3935 9624 -21950 -18338 12473 32182 43109 30928 19437 14493 16951 22403 38317
7388 38317 36015 225 -17593 -18115 -4002 25605 26442 -50 9999 19588 17361 23325 22864 12628
7374 12628 10972 -2135 -749 -3343 -7539 22331 14576 6769 -2733 17446 49310 45575 24942
7361 24942 11735 -9685 -1391 -3553 -10884 16537 25716 24893 28890 20279 45206 51986 41027 18393
7347 18393 -983 14143 -4532 -9304 15380 17706 3399 3605 16499 2562 21228 36018 25264
7334 25264 10366 8436 13206 22803 17533 42982 39923 10545 680 9646 24122 31137 40896 48414
7320 48414 35854 40891 34753 19785 14798 20810 7309 12036 18494 6094 16828 53581 78084
7307 78084 64020 60944 63388 49992 43674 58517 65544 72721 69085 33849 15557 4932 -28765
7294 -28765 -26391 -28465 -21988 3935 36616 55218 34356 26311 7072 152 -24151 -3720 17365
7281 17365 32401 30597 32664 28472 19162 31092 33946 29041 17560 4774 7639 892 31484
7268 31484 50322 50780 22229 -30067 -23648 -26448 3589 14670 11258 -269 -7166 -11485 -306
7255 -306 19678 406 -11186 8924 32092 19456 21073 33869 32856 27391 270 5535 -8692
7242 -8692 4849 23129 7806 -14578 -24107 -10998 3386 16335 21907 23543 15063 3762 -2165
7229 -2165 466 33106 31397 5051 14897 37558 39271 7594 -9792 -9758 7096 16988 17102 724
7215 724 25027 30447 24246 19857 25806 44115 26524 -6899 -36049 -43515 -39181 -27125 -23638 133
7201 133 24003 16392 29090 40902 52496 39030 16804 14337 20496 30862 29168 54295 37616
7188 37616 3310 -2565 120 14819 12890 -8033 -6206 17902 24724 30461 33902 43356 43798 22174
7174 22174 3998 2139 8918 896 10368 45380 42320 19739 37641 27011 40286 48268 26332
7161 26332 -5546 -11433 -15709 -27610 -38255 -32320 -34151 -4808 28494 36163 12995 22214 31321
7148 31321 34033 14663 36404 46818 24423 13933 -12595 -33492 -22486 7517 35747 44324
7136 44324 26905 1072 11417 25489 45486 33543 19014 2231 -10503 7830 13377 15144
7124 15144 50008 40992 953 -11042 -23610 -23616 -19304 -17918 -10138 -27963 -37848 -57389 -21919 -7413
7110 -7413 15180 23611 22771 15700 -17077 -9892 -20047 -26564 -31659 -34071 -17907 -4403 -4672 9681
7096 9681 14390 17353 1589 -15710 -37626 -48296 -41505 -22431 -15577 -5260 -16789 -22546 10049
7083 10049 -1307 -31626 -27023 -15975 -22244 -10532 18203 38060 21879 3758 -7294 1484
7071 1484 26266 60264 42634 41901 71784 58186 39647 37762 9007 19728 51096 77398 50361
7058 50361 44625 51047 43923 45904 36818 42068 28980 31625 37026 20310 8708 15899 38929 48472
7044 48472 64348 62918 34809 16608 4845 11150 15211 21727 25800 35378 43940 43147 10851 692
7030 692 1849 2595 3582 -6130 -3021 8172 8198 10575 13677 4802 -10211 -12388 -21424 -41742 -36126
7015 -36126 -29165 -636 22875 35709 3584 -21914 -45186 -45134 -9220 2738 -3421 -22166 -23224
7002 -23224 -21849 -17832 825 -22032 -47017 -28376 -8906 4 14720 33969 13501 -12716
6990 -12716 -6225 43 -8026 -15555 -1927 3812 11798 9598 -19236 -28198 -31578 -4078 24284 17893
6976 17893 4512 2377 -24829 -55904 -62362 -42878 -10071 6355 -14663 -5167 14262 58166
6964 58166 70305 41999 27822 22343 34146 21717 1385 14899 11920 404 -6863 -16626 13463
6951 13463 36492 21872 10257 10703 29399 45429 42009 30323 21160 19056 8596 -15630 -32477
6938 -32477 -30721 -10505 -12944 -734 4290 22576 9438 5450 12049 23606 51996 62094 57150
6925 57150 30613 -5763 -28440 -36168 -27370 -21975 -13439 8907 24029 16883 -2079 -15257 7978
6912 7978 21597 11896 -17561 -30191 -26504 -29219 -27684 -46585 -53821 -38510 -14557 -17953 -11666
6899 -11666 6907 3861 -8878 -5366 -9731 -12457 -4455 3494 22189 37954 543 3633 14900
6886 14900 13818 20175 24242 8688 2420 13447 23999 18878 14603 2630 -18159 -26199 692
6873 692 19672 13991 -7537 -17531 -17413 -12436 -25352 -36983 -44819 -33660 -8293 11376 -8326
6860 -8326 -44207 -46961 -53928 -53098 -24099 10505 35278 21288 21 6690 -3796 -10617 -5354
6847 -5354 -7559 3723 -11584 -16133 15245 3626 -2279 1265 22757 25636 24037 5457 -13090
6834 -13090 -14035 -6556 1988 -2133 -15971 -16384 -17970 -6646 27637 39808 50668 16445 -4307
6821 -4307 16285 39900 32674 28848 20326 13078 18060 719 -1596 15161 8956 4014 -5891 -12884
6807 -12884 6830 9515 -13533 -730 16524 14155 34251 50417 54115 76372 68433 21138 -4972
6794 -4972 19336 40496 35493 7332 -1191 6972 2932 -8607 6917 11438 19022 44444 17473
6781 17473 -4894 -6696 10331 32045 21341 9797 4126 -16334 2613 9570 3507 24554 16872
6768 16872 9306 10644 18086 11493 2535 22673 40369 34852 24690 8047 7 -7399 16754
6755 16754 25346 19997 21532 9913 -17960 -17409 -5738 -3548 453 -1687 5183 37739 42958 54515
6741 54515 65429 57004 12312 1897 3968 14277 31502 48615 50677 58031 56363 78320 75478
6728 75478 77646 83193 106040 109828 116880 100097 111661 149630 147629 154846 171641 147058 134168
6715 134168 135030 133390 104868 86466 48508 30199 34794 24882 33216 58667 66768 81193 111143
6702 111143 105881 64546 33774 57760 82562 84538 74909 86501 69434 47323 36578 14436
6690 14436 9708 -2562 -16321 -6478 -7579 -15289 -9826 14724 17799 48473 64842 46308 45076
6677 45076 25015 20378 8899 -24232 -22403 14614 15098 15567 22692 -5289 -4208 6270 4705 6029
6663 6029 19986 42951 17926 17287 -23847 -43702 -17876 -32405 -44758 135 36030 22484
6651 22484 24921 9679 7355 -1894 -11848 -8804 1082 15529 23299 55680 58540 60419 48790 43003
6637 43003 12261 2624 25524 53768 59893 52942 53627 40460 21236 9138 -25201 -25915 -3987
6624 -3987 -8531 2701 450 -16810 -19261 -24573 -15472 -7487 -11021 -25828 -18783 -8014 -31178 -40382
6610 -40382 -34991 -32289 -2011 19965 17502 -2884 11711 14907 6532 -7047 -10531 12358 29873
6597 29873 26092 7076 1122 -556 -12770 -2986 11450 33544 31135 25026 38650 49708 48778
6584 48778 23902 -24058 -13840 -21208 -20815 -6880 -9385 1541 -11821 -29324 -18596 6074 -13794
6571 -13794 -20987 -6821 -4032 -1232 17798 10771 -17242 -2929 12248 397 -16059 -16861 8513
6558 8513 3985 -3261 20453 43723 26508 27173 38196 18777 4957 -20890 -41543 -6090 7949
6545 7949 36540 38528 36623 39679 38287 8667 -12618 -28110 -33134 -38834 -41289 -38781 -33124 -28061
6531 -28061 -21752 -21987 -37552 -26144 -3858 16091 11395 -1561 8784 13678 15427 23175 13021
6518 13021 -5439 -832 2973 -22282 -24818 -6560 -19871 -31719 -35922 -28003 -8725 25536 -9533
6505 -9533 -39921 -12993 -1078 11877 10031 -3052 -4117 -9607 -25733 -33542 -3878 5925 12097
6492 12097 4564 -18101 -29209 -31476 -42829 -47391 -24222 -25134 -23674 -12851 -18956 -32462 7144
6479 7144 42557 18753 7397 19370 29344 39032 17216 17124 21487 7727 5920 13769 26569 27930
6465 27930 24108 9180 -6632 1943 11872 27046 28826 9713 -31774 -67715 -42279 -20696 -8759
6452 -8759 -21092 -30412 -40649 -36034 -36763 -45767 -19162 12577 34939 13493 -8330 -6939 -884
6439 -884 -22298 -55019 -42702 -42684 -4986 -18680 -23609 -24516 -26975 -24420 8640 14916 9495 47078
6425 47078 59730 64642 31685 34751 36931 33358 22706 21815 4128 -14278 -8638 -11858 -42083
6412 -42083 -46649 -32184 -2212 13439 -10472 -7201 -22513 -11638 4543 16937 6740 -35085
6400 -35085 -63512 -54663 -40925 -41684 -48894 -58244 -74519 -81267 -80729 -38430 -3710 -11645 -21230 -42549
6386 -42549 -48118 -37164 -21900 -5683 12714 24897 12935 1282 -3102 7589 5779 10787 9055
6373 9055 18469 13769 22640 36135 22640 -17976 -17383 -4913 17926 23681 8490 8882 -7228 -23302
6359 -23302 -22193 -9132 -32594 -44546 -36378 -27132 -17534 -34360 -45178 -34679 -23499 -22897 -22505
6346 -22505 -2793 887 -16145 -48620 -60709 -52229 -7013 11077 3976 15909 -9401 -13431 -1688
6333 -1688 117 -8327 -23861 -48034 -51982 -38741 -56998 -72548 -62326 -38287 -42763 -50489 -30187
6320 -30187 -14838 -41555 -38417 -19789 -5638 18303 19073 21992 26219 35943 12522 12224 -14757
6307 -14757 -33306 -2912 -5442 -9307 -26973 -23882 932 6182 3505 504 -7597 -22617 -860
6294 -860 14195 -7205 -10309 3351 -2727 -31138 -20966 -10651 -74 10043 12734 24354 21761
6281 21761 7828 -12595 -36424 -64914 -62883 -47445 -29604 -989 15600 -8201 -7618 -8991 -7403
6268 -7403 -6882 -574 -7552 -29147 -34943 -24241 -10121 19125 -24549 -65275 -31356 -18723 -4706
6255 -4706 7646 -3321 -4671 4408 10274 11261 3663 -4885 -29769 -20167 6172 -2581 -15008 -7388
6241 -7388 -6194 -14294 -7605 -16996 10644 12560 -17422 -19846 -809 12462 37137 43599 22119
6228 22119 7526 -11224 -11658 -15137 -15557 7735 -12404 -31643 -52425 -71771 -51081 -37168 -17182
6215 -17182 -40055 -31727 -2279 18696 30536 45375 66124 53347 30132 45134 54996 26060
6203 26060 -5163 -8311 -5909 -12053 7230 8059 -452 -3183 -15576 -12423 -13021 -13623 -15161 -14417 -24790
6188 -24790 -19556 -43435 -47882 -27633 14009 41073 51160 37727 6327 -11400 -48946 -70386
6176 -70386 -55351 -31549 -14 22123 13522 -12632 -40750 -31753 -16724 -5306 -21457 -14509
6164 -14509 2078 18262 13392 -14902 -32809 -35621 -33247 -23558 31380 32139 -12293 -46328 -35703
6151 -35703 -567 -7632 -20968 -18909 -18683 -12195 -11679 8445 21849 44823 54575 33649 1477
6138 1477 -29198 -21631 -2384 6011 -6741 -44512 -40043 -22962 -38961 -22901 -19784 -6671 -442
6125 -442 -14494 -16570 -11061 -5228 -5795 -16756 -12250 1190 11985 1857 -23387 -25728 -11838 -27872
6111 -27872 -37654 -38327 -34583 -41606 -44573 -56575 -40832 -7582 -24792 -27134 -13298 4807 6187
6098 6187 -927 -226 -13215 -13673 -31865 -16563 -20818 -32278 -44091 -51267 -32695 -941 1058 735
6084 735 1361 10171 30028 27570 4071 -18943 -2102 11497 4756 29 21612 13823 -9900 -20497
6070 -20497 -27861 -3057 -1752 -45532 -20047 12 -15980 -20392 -8929 -17418 -7733 -1773 17909
6057 17909 22407 41054 15195 -14198 -5853 12987 1299 -27054 -16710 5027 17091 22475
6045 22475 15029 16046 35923 32573 34239 44827 33258 10828 6675 23092 3664 -14948 -19197
6032 -19197 -21506 -1757 25582 22284 25257 25334 -9364 -9170 -9092 12585 42469 47265 43132 40966 6681
6017 6681 -7488 9414 20578 31245 29432 -953 2219 -8879 -9175 -15669 -18903 -61442 -85280
6004 -85280 -68199 -40297 -7396 -13466 -20511 -19290 -18548 -19208 -27665 -54347 -22979 -1106 -7045 8664
5990 8664 -9147 -19991 -31287 -22647 -22874 -31680 -35674 -32767 -27678 -15755 -42055 -52684 -7731
5977 -7731 31350 -351 -42433 -41468 -31701 -37226 -47945 -55627 -60879 -59538 -62692 -43156 -1544 -4320
5963 -4320 -28476 -21238 -9762 -9218 14386 5435 -103 11007 24685 8687 13355 -8027 6836
5950 6836 27837 5517 141 -370 -11365 -397 -1247 7536 9620 -7985 -12915 1976 1713 -5319
5936 -5319 -10902 -16694 -35480 -41158 -28083 -34341 -50492 -45507 -38049 -21828 -3089 111 -415 22661
5922 22661 20682 -13816 -9088 19132 39158 56268 40493 27896 3465 -18227 -1907 8445
5910 8445 363 -7047 -18483 -22392 -42494 -34711 -20022 -1206 3376 -18532 -18619 -6273 -15095 396
5896 396 26553 33396 6206 -13852 -5689 -9424 -21247 -22884 -5170 940 -16330 -28889 -16881
5883 -16881 18763 26595 31680 20253 -4774 10285 29893 17068 -22545 -41418 -51530 -31521
5871 -31521 -21083 -3192 1186 -2759 -1049 -16590 -32148 -52599 -69163 -85250 -74622 -29264
5859 -29264 -13543 -5800 -1606 -12171 -36007 -30151 -29237 -27172 -38947 -48362 -21169 -4036 -11820
5846 -11820 -9886 -17088 -20685 -30635 -16161 9404 8465 12367 6331 9305 21768 40515 45207 31379
5832 31379 21366 -8165 -21397 -26679 -37664 -28327 -22776 -24090 1134 2285 21859 5843 -13958
5819 -13958 5696 4987 10034 980 -10915 -9342 -35515 -18157 -27504 -35187 -5235 13325 702
5806 702 -30375 -50858 -63859 -40911 -46145 -42420 -51839 -30141 324 -10967 -27244 -10531 -3916
5793 -3916 -16077 -19525 -26910 -48445 -59536 -48212 -12958 -15763 -37118 -43169 -25913 -27770 -40076
5780 -40076 -23961 -21699 -23492 -15418 1211 -5005 -20263 2348 12244 -3641 2186 -9199 -27435
5767 -27435 -9790 -13888 -11357 24496 8010 2796 2786 11302 -6136 -39966 -50186 -61284 -42598
5754 -42598 -47176 -45975 -37748 -39845 -38433 -10981 21379 23071 16418 -17733 -36697 -42215 -29462
5741 -29462 -53204 -40488 -19008 13650 17846 6230 12551 16234 12418 -11671 13030 15601 1878
5728 1878 -14598 11849 23198 22123 14758 -2641 -16325 -19155 -3877 2703 13357 13277 19396 28939
5714 28939 23207 24147 8578 -12048 -20621 -36276 -17533 25570 4434 -26391 -21678 -10000 2064
5701 2064 28357 43032 29144 21202 22504 9434 -7081 -16650 -29922 -41335 -34413 -25336 -13082
5688 -13082 15521 2825 -4241 -28879 -35272 -21592 -15270 -2561 1149 -732 8943 -6921 -31866
5675 -31866 -39119 -101751 -96809 -76708 -56699 -31588 -13051 -10132 -13433 -27385 -44820 -53900 -46677
5662 -46677 -19758 1388 -6549 -1183 2382 1878 -13636 -24498 -34183 -44519 -48084 -29305 -15230
5649 -15230 -38862 -38098 -32883 -15874 -2264 28037 18548 42785 8302 -1294 -3201 6801 8166
5636 8166 36976 40293 10229 2113 2292 7834 12374 2668 4448 5455 561 21746 7351 466
5622 466 3188 15022 -4402 -26520 -10860 -2454 -17981 -34628 -51481 -11160 11757 5202 -18209
5609 -18209 -25104 -34851 -4486 4521 -6426 -37638 -29561 -20165 -9912 -20844 -28349 -24735 -16790
5596 -16790 -30200 -27371 -13707 -17704 -40651 -33514 -39466 -13577 16549 13943 -16137 -30049 -30763
5583 -30763 -34551 -20085 -17870 -20114 -8448 -8552 -39314 -44631 -38831 -46731 -57344 -28708 13396
5570 13396 19778 -1712 -15374 -7274 -11192 -2915 -3595 -8578 8768 21728 17509 13692 9168 -5451
5556 -5451 -5668 -9283 -17908 -15406 -3022 -21804 -23737 -8934 -15319 20077 31640 33261 15128 432
5542 432 -23294 -41254 -34301 -8208 8890 8412 8991 -485 -25632 -1435 9431 -9173 -31620
5529 -31620 -9271 -13576 -36496 -28013 -24736 -14325 -8216 6547 5611 1977 -1309 29590 35799 10330
5515 10330 14729 -4254 -14192 543 -65 -26261 -32000 -28672 -30261 -28178 -7177 -22425 -28934 -7226
5501 -7226 -855 16281 25419 -1258 -27371 -33797 -18735 3811 4153 -26874 -45655 -22850 -10575
5488 -10575 11073 10173 13332 4200 14187 -1656 -47389 -74002 -57341 -26431 -18018 -14248 8848
5475 8848 11384 -8112 -13757 3214 10935 1064 2203 -15946 -21882 -10391 -6893 -9343 -5462 -8548
5461 -8548 -14239 4430 32912 16050 -34933 -61554 -52388 -25498 12157 -17023 -20173 16657 16213
5448 16213 -8539 -21685 -7629 -3816 -9489 -9036 -17986 -34417 -29332 -11471 -26827 -53647 -72833
5435 -72833 -53824 -53460 -63538 -60690 -54527 -14302 -14067 -12060 -2513 -2119 -11426 -22564 -7398 15654
5421 15654 13246 18449 13423 -6408 -6465 9019 -17613 -25155 -21012 -19468 11244 16623 5400 -3343
5407 -3343 17025 22849 -7383 -2551 3317 7800 -1139 -22938 -29065 -4051 13168 -5336 -19088
5394 -19088 7730 28353 20954 49833 53791 17765 -130 12403 20744 8026 3203 -13038 -44401
5381 -44401 -61597 -35035 -3734 -4804 -22268 -30265 -4528 -6336 -19124 -24374 -32282 -13468 -2649
5368 -2649 733 -14467 -10891 19957 25469 1851 -22658 -3367 16557 11052 -10659 -17064 -22607
5355 -22607 -17320 -14287 0 4922 7250 7905 -2133 -8570 -37893 -51779 -26967 -27148 -21207 -26023
5341 -26023 -18262 3570 10752 -1787 -20017 -16222 -6153 4123 -15873 -32515 -29301 -51765 -42184
5328 -42184 -43753 -39916 -34750 -43829 -61671 -60304 -46881 -21439 -16509 -33076 -49511 -44816 -39049
5315 -39049 -20500 8205 -23335 -51676 -49029 -48803 -48616 -55072 -30455 -20236 107 5677 12320
5302 12320 22143 19792 22658 9942 -5134 -10660 -3238 -3901 -8913 -37592 -23911 20400 5201
5289 5201 -912 -9555 13293 9577 -22877 -34374 -16611 -22873 -17862 -29094 -28341 -7507 -400 -19189
5275 -19189 -33808 -39054 -23258 -14556 -28757 -17652 -15279 -16350 -11964 3299 18202 23406 543
5262 543 -7914 -33208 -49587 -43135 -23350 -34342 -13006 -6892 -21098 -31732 -24103 -11229 -19214
5249 -19214 -30516 -17819 -28271 -16926 -12110 -27068 -29425 -26946 -19424 -46555 -37042 -1815 4992
5236 4992 244 1952 -5063 -14959 -30129 -22414 -3780 -5296 1752 -19862 -30159 -11433 1277
5223 1277 5483 -389 -17200 -30498 -30051 -8563 25192 12798 -18834 -23984 -8598 -17663 -24183
5210 -24183 -21942 -24036 8673 33200 36447 28396 24117 6913 -9490 5323 28820 -2232 -48234
5197 -48234 -25546 -2867 -5753 -16447 -17279 -26588 -6190 -13478 -10930 -8792 -6581 -4453 -6239 -1724
5183 -1724 -9598 -18873 -21092 -18949 -9480 12590 -5121 -27588 -11628 14072 24319 11851 -1567
5170 -1567 -1016 -43491 -58038 -51378 -38526 -4887 34871 13080 -1866 12409 17667 3285 -12621
5157 -12621 -31241 -29420 6128 19375 13335 -3554 9470 12901 32669 34071 30580 14611 1788
5144 1788 -26973 -23027 -17675 -12355 -4378 5856 18238 18030 26444 27325 50254 34163 22186 26926
5130 26926 19599 7463 15141 6536 9511 -28115 -65760 -55100 -8725 13106 11176 18026 17169
5117 17169 5434 12642 -1067 -9558 3048 -16724 -17491 9680 21470 4071 -10947 -6463 552
5104 552 -20855 -27289 -2927 -14572 -41179 -53827 -56629 -47680 -47754 -36583 -49623 -41586 -3601 22002
5090 22002 5451 19391 21113 1731 -2936 3709 13283 3402 13697 17141 21834 24919 30565 20902
5076 20902 17100 -1421 4428 10236 15819 12621 27518 16795 -605 -20343 -22172 -31763 -41685
5063 -41685 -26310 -58433 -92971 -71646 -39613 -12712 -37388 -37418 9175 22643 16671 9751 11050
5050 11050 25668 14171 -8869 -13066 -17565 1354 10052 34793 25978 10280 16596 14392 8153
5037 8153 15326 18943 4899 -19634 -35896 -33666 -32808 -14377 5803 -2791 -3656 -19888 -20496 -15450
5023 -15450 -17605 -3259 14778 17510 25942 5569 -20609 -38239 -36399 -5612 12086 13793 -4148
5010 -4148 -11079 -14803 -33092 -25594 -26346 -24755 -19602 -28348 -31871 -37067 -32570 -23429 -42251 -21590
4996 -21590 -7468 12558 16797 7810 5337 -22013 -33881 -13575 -9636 -20559 -38192 -47838 -35583
4983 -35583 -19743 -3077 11590 11265 -28052 -81245 -57700 -34344 -17091 -5275 -4514 44 -19362
4970 -19362 -13000 3470 43019 45409 11184 -31436 -61532 -50827 -41400 -47124 -30313 -10119 -386
4957 -386 -9378 -11990 8138 6499 -13850 -13938 -16716 -32293 -23044 -10985 -15808 -8708 -12196 -37350
4943 -37350 -50393 -47314 -35458 -33640 -36779 -15410 -12739 -31201 -5999 1640 19829 24943 29027
4930 29027 19680 9388 14692 13158 5497 -655 -5893 -14329 -12888 -10646 -17279 1561 39925 33584
4916 33584 -64 -24850 -23318 -6218 12905 16521 18063 37310 30799 5265 -17891 -14020 -17353
4903 -17353 -32505 -44553 -33361 -36111 -45886 -11135 12840 13023 -2263 -25402 -24355 -2395 4005
4890 4005 -4250 -17836 -8014 15650 31376 20939 7975 25246 42331 34627 23185 -3752 -24036
4877 -24036 -12408 17561 16624 -7728 -23485 -48132 -15972 -9663 -12842 -16811 -21279 -40809 -44805
4864 -44805 -41283 -12209 3916 -9093 -38628 -40625 -33383 -22471 -35289 -57588 -75705 -43942
4852 -43942 -9716 -2772 -16135 -27968 -35157 -21633 -6851 9294 16417 25950 -4287 -40472 -49792
4839 -49792 -54998 -54828 -33037 -31605 -42943 -43214 -37052 -34434 -9433 12183 -5993 844 13563 -9360
4825 -9360 -24652 9250 26844 16375 17436 3610 6698 18346 29628 44314 71956 80846 28935
4812 28935 -19046 -16719 -5827 -24073 -48920 -50396 -52983 -47414 -65388 -73942 -50124 -62617 -45906
4799 -45906 -28494 1918 -37221 -31695 -12428 -15254 -27839 -30020 -21141 -1439 -15908 -34901 -16770
4786 -16770 -30938 -49023 -54812 -26830 -17167 -26217 557 4095 1538 16589 17280 1788 1094 -11962
4772 -11962 -56759 -61714 -67494 -28945 18622 9006 -9391 -29916 -56820 -35312 2365 16242
4760 16242 12273 7907 -6022 -21803 -14545 -18537 -32574 -22836 -5927 -947 -13291 -20689 -19511
4747 -19511 -27160 191 5636 2549 3083 3483 -7921 -5917 -4655 15811 26206 13610 1123 -3969
4733 -3969 8592 17472 -5370 5975 18091 32942 11510 -6771 -6040 4758 -8276 -37869 -31309
4720 -31309 -1133 -10672 -9669 -10946 -14660 -30075 -27231 -17236 -20033 -20119 -20601 -10242 -9563 -9696 -18914
4705 -18914 -4991 11121 -3415 -14001 9250 -16069 -47484 -21416 -1889 -8857 -39232 -37707
4693 -37707 -35993 -22425 -14418 6222 -4042 -27005 -41182 -44669 -34669 -20523 -12824 -3387 11610
4680 11610 -542 -15227 -37208 -28655 -10053 11658 -18177 -23083 -29227 -41318 -38257 -21204 -16068
4667 -16068 11977 22968 13738 6256 -21213 -49800 -35855 -13029 -8981 -23897 -12774 12071
4655 12071 -2028 -20581 -9166 1298 -13787 -9243 -20546 -31021 -52110 -72571 -83935 -65377
4643 -65377 -43327 -48499 -54161 -44705 -7528 4207 18021 25062 11388 -6604 19565 30760 7413
4630 7413 -7400 -24697 -6671 1691 -6561 -16326 -33779 -17673 -12585 4180 19765 25959 14723
4617 14723 15943 5790 2862 30004 35761 45468 22353 -1073 5448 -41047 -36768 20091 31678
4604 31678 18099 -18870 -22079 -6866 1875 3645 9000 7191 -13233 -49398 -50060 -30451 -32930
4591 -32930 -17561 -7594 -17327 -17463 -15532 -11670 -24086 -11817 -18148 -7429 -3424 10396 -1841
4578 -1841 -14878 -35134 -49840 -26267 14035 17812 15037 7269 13250 18673 12741 4533 -23030
4565 -23030 -33170 -21297 -17691 -5928 24498 24050 -30942 -67798 -70510 -41559 -21097 -30044 -12047
4552 -12047 728 -6849 -34997 -30286 -14852 15130 30709 27699 8500 -14969 -15076 3143 -5378
4539 -5378 -1554 929 -16683 -13813 -26752 -70020 -75537 -39106 -34694 -31119 -45616 -53792 -56262 -69485
4525 -69485 -86485 -71469 -35257 -9085 7329 12786 17623 15439 -674 -22320 -19604 243 9687
4512 9687 15682 6498 6544 565 -27872 -27694 -14781 -80 30195 11779 -13293 -25928 -29077 -2613
4498 -2613 20313 -8403 -14037 12479 -9869 -28768 -9270 -9136 -25342 -41407 -58505 -60037 -43237
4485 -43237 -43389 -36439 -19596 -14464 4428 5632 6476 -16831 -16563 -25206 -32091 3557 8994 4625
4471 4625 -12173 -11330 -16331 -3864 -1419 9651 1480 -22869 -19592 -9595 -8986 -3269 554 -14946
4457 -14946 -24478 -13710 977 4871 8506 -12957 -35539 -20713 -28874 -40410 -47625 -56514 -54581
4444 -54581 -64607 -73975 -66242 -45958 -32787 -24907 -44197 -36902 -20508 -17671 15836 -3533 -19044
4431 -19044 -32330 -32206 -30777 -24776 -37972 -49458 -16794 1264 2822 245 -21452 -36149 -54391
4418 -54391 -43594 -30119 -53214 -44421 -8124 -7912 -24093 -18592 -18336 -21820 -23657 6435 32484
4405 32484 33971 13140 5735 -2995 -2309 -17932 -24786 -14674 -29511 -34307 -20188 -16778 -23153 -7376
4391 -7376 -15668 -27319 -11485 14899 6529 1372 21738 34181 37806 22882 24886 -3705 -20457
4378 -20457 -20297 -7719 2708 23022 34214 27307 12979 -23249 -34592 -38628 -25946 -42596 -49465
4365 -49465 -24939 -12989 -13142 971 3268 -1298 -19479 -24638 -47324 -43844 -43382 -37300 -49431 -53091
4351 -53091 -62240 -50799 -19980 -20615 -29175 -6560 -1014 -24085 -30607 -33150 -7591 -1688 -23470
4338 -23470 -19897 3130 12489 14649 18487 10932 7778 -11899 -34459 -12418 -13233 -29349 -31316 240
4324 240 25596 11067 6855 -6255 -21794 -32723 -14072 -849 -2658 -28230 -32138 -1479 -684
4311 -684 -11871 16867 14169 242 15194 34375 56874 65448 68268 33604 18837 28653 9868
4298 9868 -2789 -13094 6503 -3497 -6500 5832 8618 12040 -4912 -42 663 -12931 -24724
4285 -24724 -21488 5281 -4583 882 -4717 -14202 -28561 -29502 -11817 1036 -10759 -12130 5390
4272 5390 15345 -4150 -12832 -919 7109 5540 3366 -8327 -8574 5889 7946 6014 28212 36427
4258 36427 56941 70639 40805 -9308 -11566 4622 31710 32771 27138 49119 37986 23002
4246 23002 4802 -7602 -24202 -17764 -15959 -21082 5223 15103 8709 13024 25022 18210 5992
4233 5992 22220 32255 18284 16306 16208 16793 26705 29831 17257 -3096 -5217 -17048 -20637 -11290
4219 -11290 -9363 8938 13310 -7360 -4485 -13718 -63 20297 11697 -394 -14964 -3995 10661
4206 10661 12132 -3594 -32056 -44687 -28388 4954 -2370 13480 11215 6557 778 -5935 -21480
4193 -21480 -45084 -53184 -29395 -12976 -3736 3848 -26498 -15375 27371 32560 31061 23641 10391
4180 10391 -10260 -25708 -17758 -12938 -50408 -23933 -6619 -24370 -5604 -2722 11402 29849
4168 29849 25736 13287 19132 16124 17562 -8106 -41526 -47981 -8063 22262 32092 19932 11686
4155 11686 7287 -10558 -19579 -15166 -25747 -29200 -27596 5864 26564 17089 -24564 -34893 -29413
4142 -29413 -6650 -8721 -20897 -29030 -8872 2655 -8467 -5872 1108 -2278 1780 28046 9550
4129 9550 -17417 -32853 -53980 -58339 -62860 -54219 -48364 -37724 -35933 -36607 -23304 -25002 -6144 -14224
4115 -14224 -48895 -71671 -53857 -47417 -40150 -24622 -22348 -18605 16118 42095 24190 -10810 -31396
4102 -31396 -22342 -31394 9382 12605 15885 22824 36510 18960 4593 -12242 -37240 -41009 -13049
4089 -13049 -13746 -18708 -21496 -18195 -9445 -10084 934 21055 34216 39734 39811 21142 8319 1083
4075 1083 6203 -1022 -37403 -50753 -32305 -29265 -14928 -8363 -11388 -21640 -16027 -34235 -33446 -9767
4061 -9767 18649 33892 8922 4730 4058 -8898 7065 32459 21032 -10412 -16821 -8985 -3459
4048 -3459 -18050 -16309 -28142 -16436 -11579 -12028 9971 -5263 18929 28243 4445 2709 5615
4035 5615 13178 11413 -1336 -5433 4864 -4413 -38609 -63190 -53803 -55809 -24106 -17273 -30875
4022 -30875 -23345 19752 -5008 -21213 -21834 -42467 -39229 2076 13270 -5737 -26663 -60976 -69067
4009 -69067 -51662 -31212 -37747 -34230 -35376 -42558 -25338 253 20888 24311 1736 1815 34684
3996 34684 32470 30745 26280 25070 21778 4165 21650 23605 27074 8206 2912 3579 -15308 -34657
3982 -34657 -23577 -18775 -16024 -24835 -24703 -21887 -918 7037 -3813 -22252 -16530 -10739 15484 33695
3968 33695 27079 11885 -5297 -13174 -8638 -17583 -18551 -21859 -24246 -14605 -15990 -26580 -35062 -25964
3954 -25964 -7677 5847 8804 -8677 -25003 -32068 -33978 -44572 -31179 -27144 -28683 -37274 -24361
3941 -24361 -3967 6351 -29259 -15572 -26447 -34745 -31959 -7976 -3732 -18499 -5433 -28743
3929 -28743 -31944 -32620 -52606 -38298 12120 21582 25208 34942 60380 47828 13336 -10462 -15167
3916 -15167 5927 24500 18569 7079 -4913 20535 35293 26532 17508 4754 16394 51292
3904 51292 39566 18427 15727 9375 29340 31346 31553 34887 20578 18836 34393 62674 65535
3891 65535 44274 34093 25941 5412 -759 10706 22244 13993 13015 12869 -2089 -22453 547
3878 547 -19004 -13343 -7243 -18584 -33292 -30194 -29808 -19367 -8681 -175 -12214 -23866 -10920
3865 -10920 -7027 3303 7226 -39299 -48858 -12507 -5902 -8433 -40777 -60031 -38976 -14313 -24018
3852 -24018 -7230 5533 2865 5452 -14759 7567 7456 -4823 -6532 -16312 -30986 -36198 -35559 -8872
3838 -8872 -7225 -13193 -12447 -30139 -24270 -21188 -23940 -2989 21828 4072 -40336 -44330 -43957 -11318
3824 -11318 9514 -5406 -45269 -22720 -20698 -34038 -27886 -25509 -13050 2659 -8411 -16980 4136
3811 4136 12558 -7282 -6635 -25725 -44548 -41880 -28043 -9858 23094 27243 -10173 -10737 -18345 -30504
3797 -30504 -27535 -13705 -483 4870 4386 7803 21670 29939 1270 -23214 -41552 -38102 -38568 -21410
3783 -21410 -6705 13525 -8168 18151 8165 -7970 -10800 -5282 3431 26528 15612 39793 36511
3770 36511 16284 8130 29953 26076 2092 -5349 -7241 -47537 -40839 -3364 -822 24895 29884
3757 29884 -1994 -7803 34 2629 8177 -1403 -4094 -8630 -41478 -55353 -42896 -10878 6129
3744 6129 735 169 -31330 -53465 -70156 -44040 -28188 -8851 7992 -6131 -10224 782 13386
3731 13386 35807 35322 27987 -19917 -31055 -31076 -891 2647 -17976 -46547 -53730 -53887 -19320 1277
3717 1277 -5334 1207 11430 24228 40636 22371 22945 37646 15623 -18242 -19411 -20130 -17130 -26082
3703 -26082 -40328 -24915 -25330 -17838 3368 17321 20412 -5301 -9565 -7400 -3389 5425 19850
3690 19850 -15361 -53889 -45304 -19972 -17559 -15558 -10638 -14046 -2736 7691 4725 -2085 -35430
3677 -35430 -43599 -23876 1524 8219 -19229 -29045 -24329 -51321 -66806 -48085 -15309 -19390 -18853
3664 -18853 -19385 -6275 -15863 2345 1205 -9790 11781 29367 16296 9511 29652 27064 1015
3651 1015 -23505 -27407 5505 34115 -1877 -37096 -35940 -32688 -76765 -62256 -50395 -26350 -10502
3638 -10502 -13632 -18028 -41018 -61367 -28323 9899 9529 15771 16996 12083 19096 21389 -3941 -8296
3624 -8296 -3533 -17215 -30062 -15802 -3694 6288 2844 -14295 9400 -11012 -14675 -18625 -20040
3611 -20040 -11496 -28529 -34649 -22689 -23053 -27236 -18778 -42767 -39172 -43041 -31325 -20150 -17607 -9062
3597 -9062 5725 2897 -22072 -7270 678 -2837 4964 -260 -32713 -52823 -42458 -29004 -9545
3584 -9545 -17088 5018 1384 17648 24592 25324 29638 32451 31391 7429 -6667 -10892 -30406 -20790
3570 -20790 1471 6068 -17574 -40968 -46099 -45129 -48157 -31827 -15279 -6181 -2007 24123 -406
3557 -406 1783 -9251 -23759 -36971 -23412 -25364 -20200 -9947 25766 48868 28420 3293 -15802
3544 -15802 -32831 -18117 -27279 -26563 -33809 -21496 -20569 -1987 3079 -12220 -6146 -9179 -17988 -29511
3530 -29511 -31388 -29142 -3215 5812 -4741 -22686 -40253 -22552 25802 31820 17338 30496 54086
3517 54086 46417 34795 43329 58276 45332 31555 2784 -3172 -1883 -2008 894 10597 19320 17336
3503 17336 10653 -3726 -4419 -21774 -28985 1989 16133 6304 -15054 -7673 -25872 -14043 -6893
3490 -6893 -16313 2723 31323 40555 8227 -34691 -36410 -38731 -36516 -7189 10902 8255 2759
3477 2759 5711 5399 8076 -1068 24722 38998 9766 5604 27186 30154 22970 3020 -29206 -36859
3463 -36859 -19572 4059 7592 13575 -5429 -29250 -27329 -19235 17651 39328 24482 7535 4645
3450 4645 16097 27500 13118 6311 1386 5675 -4592 -9020 -5609 7571 17239 29608 32284
3437 32284 7921 22281 16382 28533 41181 28033 593 -15291 -19608 -9477 8150 7240 8274
3424 8274 -15209 -12932 2676 -3409 -30225 -65493 -37563 -19374 -6048 -8929 -36156 -43738 -47745
3411 -47745 -39267 -28138 -27892 -10610 -17735 -37777 -37048 -22496 -1952 638 -4255 -11370 -11944 -6090
3397 -6090 12643 -10968 -17010 -17302 -27915 -24959 -37302 -22459 -3970 -13455 2399 16146 25915
3384 25915 15521 3335 21685 19830 -20355 -44623 -58741 -57951 -25746 2982 11339 18028 -15993
3371 -15993 -20077 -14242 -21620 -31390 -33672 -30184 -22870 -16364 -18773 -38901 -30625 -2766 -17458 -40323
3357 -40323 -43971 -23331 -9827 -5700 23368 37321 23309 8176 -12500 -24147 -9380 -16937
3345 -16937 -19074 1286 -19442 -26041 4773 14248 10255 -14997 -42154 328 47785 46007 10970
3332 10970 28552 27527 17482 27281 6359 -15841 -15201 -17486 -18554 -4113 3402 -14937 -5010
3319 -5010 18755 29426 25938 20926 -16799 -32521 -22959 -11641 -15923 2550 14885 -4368 -36092
3306 -36092 -41794 -13311 13971 30957 28550 35089 37347 33075 11950 17486 27107 19891 -7859
3293 -7859 -3272 -3061 5784 -2560 -9253 -3004 12730 32699 24900 3281 -3233 9483 -8829 -19740
3279 -19740 -25245 -10736 -4563 -20376 2947 -5779 -15122 -19539 -30110 -38496 -52004 -40048 -9739
3266 -9739 16240 19697 30339 31761 40413 23923 14263 5294 18245 -1653 -6621 8425 -13323
3253 -13323 -30813 -30156 -12775 -12376 1440 24221 22628 7787 40925 54936 21618 17444 12683
3240 12683 3778 20998 26813 14882 5485 -13735 1376 5650 19743 3111 -17584 -27711 6573
3227 6573 42707 31718 7315 -21972 -40585 -32363 -41045 -36382 -37285 -44797 -58401 -37182 -30249
3214 -30249 -18214 -3970 -21703 -29401 -8115 6005 -8399 -9478 8184 13286 -1902 9128
3202 9128 25951 30723 44678 38420 39487 42516 36931 20321 21152 46122 39457 35691 17593 13891
3188 13891 30290 37078 30896 12569 6145 12840 13783 4497 -33646 -20423 -18608 -4630 21984
3175 21984 35868 40836 47254 46046 29805 6193 -25902 -56585 -42299 -43824 -17249 3523 13422
3162 13422 26105 34307 19542 18610 5080 -31130 -36425 -24260 -40061 -40621 -8622 17126 32704
3149 32704 28878 15613 20034 12072 -18448 3569 31232 19918 3050 1546 32490 26906 23318
3136 23318 4662 -4108 5847 -12442 12954 38052 23810 38315 12456 366 -5377 -16302
3124 -16302 -20281 -40426 -47748 -47299 -38000 -23063 -12485 -26256 -45541 -57120 -64113 -14226 -9437
3111 -9437 12249 -2839 -21714 -28615 -15132 -3615 2880 9786 16527 37501 37351 -6137 -159
3098 -159 -7034 1696 1914 -6562 -29841 -30746 -36663 -32952 -57818 -32390 14045 24316 9718 -10696
3084 -10696 -967 803 -11372 -12749 17491 21052 -534 -29426 -26416 -15801 -23387 -2207 27876
3071 27876 17891 519 2438 -7545 -4595 10438 28415 22813 7817 -14962 -33313 -9063 12882
3058 12882 2170 -9326 -3921 29670 34561 18409 16014 16527 26027 3886 10052 -3603 -15381
3045 -15381 -33593 -25351 244 32930 31872 13799 31185 35078 15592 15445 -2727 -3057 -8127
3032 -8127 1943 -8495 -8158 -18554 -14475 26798 42693 52196 55261 38129 41837 44702 39813 17653
3018 17653 -1505 -9726 -11396 -24296 9231 3950 -20470 -54131 -21512 414 -20808 -18836 18688
3005 18688 11591 19575 22276 24714 36774 16649 11648 25250 25455 43561 40642 25838 5699
2992 5699 28717 36330 14776 -6048 -13586 31781 29352 25306 41525 17438 1954 -11502 -8423
2979 -8423 14655 11094 -24198 14838 15930 -33077 -51544 -16652 -2841 -3588 -9235 12223 14682
2966 14682 26366 19070 6113 22508 27359 3277 -27964 -27124 -30272 -35753 -45853 -13603 28703
2953 28703 41456 47248 21076 8321 -2276 -14934 -28463 -20477 7197 27554 46542 83193
$$ [...]
##END NTUPLES=NMR SPECTRUM
##END=
