##TITLE=Analysis number 312256
Compound Code cc 45251
Book Reference 440/52
Project Code adrs
Chemist Name craigr
##JCAMPDX= 6.0         $$ Bruker NMR JCAMP-DX V2.0
##DATA TYPE= NMR SPECTRUM
##DATA CLASS= NTUPLES
##ORIGIN= Bruker BioSpin GmbH
##OWNER= NMR
$$ XWIN-NMR		Version 3.5
$$ Wed Aug  3 09:23:38 2005 GMT Daylight Time (UT+1h)  MAYBRIDGE\NMR@NMR_250MHZ
##.OBSERVE FREQUENCY= 250.131544655141
##.OBSERVE NUCLEUS= ^1H
##.ACQUISITION MODE= SIMULTANEOUS (DQD)
##.ACQUISITION SCHEME= undefined
##.AVERAGES= 16
##.DIGITISER RES= 18
##SPECTROMETER/DATA SYSTEM= dpx250
##.PULSE SEQUENCE= zg30
##.SOLVENT NAME= DMSO
##.SHIFT REFERENCE= (INTERNAL, DMSO, 0, 16.522)
##AUDIT TRAIL= $$ (NUMBER, WHEN, WHO, WHERE, WHAT)
$$ ##TITLE= Audit trail, XWIN-NMR		Version 3.5
$$ ##JCAMPDX= 5.01
$$ ##ORIGIN= Bruker BioSpin GmbH
$$ ##OWNER= NMR
$$ C:\u/data/dgb/nmr/ADRS/7070/pdata/1/auditp.txt
$$ ##AUDIT TRAIL=  $$ (NUMBER, WHEN, WHO, WHERE, WHAT)
(   1,<2005-08-03 09:23:04.20 +100>,<MAYBRIDGE\NMR>,<NMR_250MHZ>,
      <created by zg, POWCHK disabled, PULCHK disabled
       configuration hash MD5:
       62 19 C7 07 E1 42 D1 B7 37 6C 3D D0 77 39 F9 E6
       data hash MD5: 64K
       5F B6 9F D8 21 9F 6E 5E 1D CE 74 9D 69 B1 9A 02>)
(   2,<2005-08-03 09:23:15.51 +100>,<MAYBRIDGE\NMR>,<NMR_250MHZ>,
      <Start of raw data processing
       ef LB = 0.3 FT_mod = 6 PKNL = 1 SI = 32K 
       data hash MD5: 32K
       DE EB 0B 22 D3 24 59 C2 2C EE FB 80 F0 58 B8 E4>)
(   3,<2005-08-03 09:23:17.28 +100>,<MAYBRIDGE\NMR>,<NMR_250MHZ>,
      <apk 
       data hash MD5: 32K
       67 25 1A D8 63 A7 AB D0 EA 6C 2C 99 8C F7 2E AD>)
(   4,<2005-08-03 09:23:17.98 +100>,<MAYBRIDGE\NMR>,<NMR_250MHZ>,
      <abs ABSG = 5 
       data hash MD5: 32K
       07 17 AD 9D CE E6 BD CE FD 07 A3 1A 23 F7 15 FF>)
$$ ##END=
$$ 
$$ hash MD5
$$ B5 8A 90 07 1F 6B 24 4D 5E 1A 55 A4 0E 43 8E D7
##$RELAX= 
##$RELAX= 
##$RELAX= 
##$RELAX= 
##$RELAX= 
##$RELAX= 
##$RELAX= 
$$ Bruker specific parameters
$$ --------------------------
##$DU= <C:\u>
##$EXPNO= 7070
##$NAME= <ADRS>
##$PROCNO= 1
##$TYPE= <nmr>
##$USER= <dgb>
##$AMP= (0..31)
100 100 100 100 100 100 100 100 100 100 100 100 100 100 100 100 100 100 
100 100 100 100 100 100 100 100 100 100 100 100 100 100 
##$AQSEQ= 0
##$AQ_mod= 3
##$AUNM= <au_zg>
##$AUTOPOS= <3 >
##$BF1= 250.13
##$BF2= 250.13
##$BF3= 250.13
##$BF4= 250.13
##$BF5= 500.13
##$BF6= 500.13
##$BF7= 500.13
##$BF8= 500.13
##$BYTORDA= 1
##$CFDGTYP= 0
##$CFRGTYP= 5
##$CHEMSTR= <none>
##$CNST= (0..31)
1 1 145 1 1 1 1 1 1 1 1 1 1 1 1 1 1 1 1 1 1 1 1 1 1 1 1 1 1 1 1 1 
##$CPDPRG= <>
##$CPDPRG1= <>
##$CPDPRG2= <>
##$CPDPRG3= <>
##$CPDPRG4= <mlev>
##$CPDPRG5= <mlev>
##$CPDPRG6= <mlev>
##$CPDPRG7= <mlev>
##$CPDPRG8= <mlev>
##$CPDPRGB= <>
##$CPDPRGT= <>
##$D= (0..31)
0 1 0 0 0 0 0 0 0 0.06 0 0 0 0 0 0 0.0002 0 0 0 0 0 0 0 0 0 0 0 0 0 0 
0 
##$DATE= 1123057383
##$DBL= (0..7)
120 120 120 120 120 120 120 120 
##$DBP= (0..7)
150 150 150 150 150 150 150 150 
##$DBP07= 0
##$DBPNAM0= <>
##$DBPNAM1= <>
$$ [...]
##$SUBNAM7= <"">
##$SUBNAM8= <"">
##$SUBNAM9= <"">
##$SW= 20.6930455092707
##$SWIBOX= (0..15)
0 0 3 0 0 0 0 0 0 0 0 0 0 0 0 0 
##$SW_h= 5175.983436853
##$TD= 65536
##$TD0= 1
##$TE= 295.16
##$TE2= 300
##$TE3= 300
##$TEG= 300
##$TL= (0..7)
0 120 120 120 120 120 120 120 
##$TP= (0..7)
150 150 150 150 150 150 150 150 
##$TP07= 0
##$TPNAME0= <>
##$TPNAME1= <>
##$TPNAME2= <>
##$TPNAME3= <>
##$TPNAME4= <>
##$TPNAME5= <>
##$TPNAME6= <>
##$TPNAME7= <>
##$TPOAL= (0..7)
0.5 0.5 0.5 0.5 0.5 0.5 0.5 0.5 
##$TPOFFS= (0..7)
0 0 0 0 0 0 0 0 
##$TUNHIN= 0
##$TUNHOUT= 0
##$TUNXOUT= 0
##$USERA1= <user>
##$USERA2= <user>
##$USERA3= <user>
##$USERA4= <user>
##$USERA5= <user>
##$V9= 5
##$VALIST= <valist>
##$VCLIST= <CCCCCCCCCCCCCCC>
##$VD= 0
##$VDLIST= <DDDDDDDDDDDDDDD>
##$VPLIST= <PPPPPPPPPPPPPPP>
##$VTLIST= <TTTTTTTTTTTTTTT>
##$WBST= 1024
##$WBSW= 4
##$XGAIN= (0..3)
0 0 0 0 
##$XL= 0
##$YL= 0
##$YMAX_a= 283715
##$YMIN_a= -430631
##$ZGOPTNS= <>
##$ZL1= 120
##$ZL2= 120
##$ZL3= 120
##$ZL4= 120
##$ABSF1= 16.522
##$ABSF2= -4.171173
##$ABSG= 5
##$ABSL= 3
##$ALPHA= 0
##$AQORDER= 0
##$ASSFAC= 0
##$ASSFACI= 0
##$ASSFACX= 0
##$ASSWID= 0
##$AUNMP= <proc_1d>
##$AZFE= 0.1
##$AZFW= 0.1
##$BCFW= 0
##$BC_mod= 0
##$BYTORDP= 0
##$COROFFS= 0
##$CY= 12.5
##$DATMOD= 1
##$DC= 0
##$DFILT= <>
##$DTYPP= 0
##$F1P= 14.0000005364418
##$F2P= -0.99999901652339
##$FCOR= 0.5
##$FTSIZE= 32768
##$FT_mod= 6
##$GAMMA= 0
##$GB= 0
##$INTBC= 1
##$INTSCL= 1
##$ISEN= 128
##$LB= 0.3
##$LEV0= 0
##$LPBIN= 0
##$MAXI= 10000
##$MC2= 0
##$MEAN= 0
##$ME_mod= 0
##$MI= 0
##$NCOEF= 0
##$NC_proc= -6
##$NLEV= 6
##$NOISF1= 0
##$NOISF2= 0
##$NSP= 0
##$NTH_PI= 0
##$NZP= 0
##$OFFSET= 16.522
##$PC= 1
##$PHC0= -87.06342
##$PHC1= 9.462897
##$PH_mod= 1
##$PKNL= yes
##$PPARMOD= 0
##$PSCAL= 4
##$PSIGN= 0
##$REVERSE= no
##$SF= 250.13
##$SI= 32768
##$SIGF1= 0
##$SIGF2= 0
##$SINO= 400
##$SIOLD= 32768
##$SREGLST= <1H.DMSO>
##$SSB= 0
##$STSI= 32768
##$STSR= 0
##$SW_p= 5175.98343685301
##$SYMM= 0
##$S_DEV= 0
##$TDeff= 65536
##$TDoff= 0
##$TI= <Analysis number 999999
Compound Code 99
Book Reference 9
Project Code 9>
##$TILT= no
##$TM1= 0
##$TM2= 0
##$TOPLEV= 0
##$USERP1= <user>
##$USERP2= <user>
##$USERP3= <user>
##$USERP4= <user>
##$USERP5= <user>
##$WDW= 1
##$XDIM= 32768
##$YMAX_p= 465776473
##$YMIN_p= -1182117
$$ End of Bruker specific parameters
$$ ---------------------------------
##NTUPLES= NMR SPECTRUM
##VAR_NAME=  FREQUENCY,     SPECTRUM/REAL,   SPECTRUM/IMAG
##SYMBOL=    X,             R,               I
##VAR_TYPE=  INDEPENDENT,   DEPENDENT,       DEPENDENT
##VAR_FORM=  AFFN,          ASDF,            ASDF
##VAR_DIM=   32768,         32768,           32768
##UNITS=     HZ,            ARBITRARY UNITS, ARBITRARY UNITS
##FACTOR=    0.157963299565203, 1,           1
##FIRST=     4132.6476996994, 0,             0
##LAST=      -1043.33573715361, 0,           0
##MIN=       -1043.33573715361, -1182117,    0
##MAX=       4132.6476996994, 465776473,     0
$$ Real data points
##PAGE= N=1
##DATA TABLE= (X++(R..R)), XYDATA
$$ [...]
15390a62665n3265j37020N8945K19635j32492j146P473k12022j84432K91119K61289
15379d4581K36903r0504k09727o5474l5957J69907j98817k19008k17860N4931
15369f20187J85218M92987J7117l41243q2515l30277K60614J11620L50378K3483
15359F7195j16959N7470L79025K128k51691l10648J37550j66536k16733K59302
15349a59897J50589n9990K55019K94233Q1946q7894k05314j61479l57941l21114
15339e71842P5320j3002j11700O7651k98673K26868L45454L55893J94947p4838
15329A96078k80023l49236R8574J22800j6057j00575l43342k8187J59811M1505
15319d98652N43182J90139j01431k42890l47137N9205K25382Q848j29301l2998
$$ plain form
15390 -162665 -215930 -352950 -294005 -74370 -206862 -208008 -200535 -412557 -596989 -305870 -44581
15379 -44581 192322 101818 -107909 -173383 -209340 -39433 -238250 -457258 -675118 -620187
15369 -620187 -434969 58018 75135 -266108 -348623 -678900 -418286 -306666 43712 67195
15359 67195 -49764 7706 386731 388859 137168 -173480 -35930 -202466 -419199 -159897
15349 -159897 -9308 -69298 185721 479954 561900 474006 268692 107213 -250728 -571842
15339 -571842 -496522 -509524 -621224 -553573 -852246 -625378 -279924 75969 270916 196078
15329 196078 -83945 -433181 -334607 -211807 -227864 -328439 -671781 -699968 -540157 -498652
15319 -498652 44530 234669 133238 -109652 -456789 -397584 -172202 -163354 -292655 -325653
15309c25653j5099K75841j61224k01855N1028P3496J33894l04429j95158l0914
15299g00073p5999P9039L88244N4987j70387k8258J69017N2184r4488L64625K384
15288D1275k26539K19980K22593q6776l54493n6321L0997j6615j6348l07923q4550
15277f34720J79356p1309p8325n408J52306j1725K00830L57651L9793J79642p6604
15266B31487j65772P6720J96407m6268j30332O5143j84991J69756J47679k73114
15256H6715k59657J14609n9290J21790J90293j55500j60315K09999K72822l03240
15246E8226j57364K36319N3346k84577j33646Q4671K88339M3521j75212j47274
15236a33651M0020o4416k8525O0695L05379L16505j10322j04357l43228R7976
$$ plain form
15309 -325653 -340752 -64911 -226135 -427990 -376962 -303466 -169572 -474001 -669159 -700073
15299 -700073 -776072 -697033 -308789 -253802 -424189 -452447 -283430 -231246 -325734 38891 41275
15288 41275 -185264 34716 257309 170533 -183960 -240281 -209284 -225899 -242247 -550170 -634720
15277 -634720 -455364 -526673 -604998 -610406 -458100 -469825 -268995 88656 128449 308091 231487
15266 231487 65715 142435 338842 292574 162242 227385 42394 212150 359829 86715
15256 86715 -172942 -58333 -117623 4167 194460 38960 -121355 88644 361466 58226
15246 58226 -99138 137181 190527 -94050 -227696 -143025 145314 188835 13623 -133651
15236 -133651 -93631 -158047 -186572 -125877 179502 496007 385685 281328 -61900 36076
15226C6076N9432j54214J04383J0985L18410l26519n00124K10608J15368l94832
15216e20427R3957L76035M03123K463k19999m6192L22882L51327p1595j71902
15206E19672p1368j55464k18455p9013p1661J6403J23741k9678l08358k5579J01705
15195a98055j09375j00016k84158K64450M13844L42935p5818j77314k1349o3909
15185h765j39344q9656p2433l3412J51938J31449j80853k185l8940j83457K02033
15174b63625j28K16093K23340q7874r2380n9408j00963J5708K30636J64819K90121
15163E36339r7342k4677m54359j93642k93660Q8921J45030K41340q492k2755L0982
15152e2315L09796P5661j03186k27393m7470r2724J40917J94109j04026l5612
$$ plain form
15226 36076 95508 -58706 45677 56662 375072 48553 -451571 -240963 -125595 -520427
15216 -520427 -426470 -50435 352688 355151 135152 88960 411842 763169 691574 519672
15206 519672 448304 292840 74385 -4628 -76289 -59886 63855 34177 -274181 -299760 -198055
15195 -198055 -307430 -407446 -691604 -427154 -13310 329625 253807 76493 55144 -8765
15185 -8765 -148109 -237765 -310198 -343610 -191672 -60223 -241076 -243261 -282201 -465658 -263625
15174 -263625 -263753 -47660 175680 87806 -4574 -63982 -164945 -149237 81399 246218 536339
15163 536339 438997 414320 -40039 -233681 -527341 -438420 -293390 -52050 -60542 -83297 -52315
15152 -52315 257481 333142 229956 2563 -44907 -137631 3286 197395 93369 57757
15142E7757l82103k42118L07068J11988q6286J91884J10663M060J7464k73720
15132a83343k30571o0555q5892N6563K96211L01802p5126J17784r7615J16046
15122A55304q4550k41527m8844j49982k17171J23419L28225L04204m40708J33551
15112a38079J19262l17868R8612L35417J97996Q782k44186o4892K41901j4142
15102B22803o6106L0056q3998l25434j75344M1565J43541q525l2421K14657O6467
15091B7261j37253j73719R8874n6771m7134L27435J46444j83299k57515P3709
15081a81968L9569R0130j7553K43721O5513j45242j05716l2859j22784m06797
15071e73986J82777M98116j38493J6479K16413Q3203o6814j454K58897L4535r543
$$ plain form
15142 57757 -324346 -566464 -259396 -147408 -233694 -41810 68853 72913 90377 -183343
15132 -183343 -413914 -474469 -560361 -503798 -207587 94215 19089 136873 39258 155304
15122 155304 70754 -170773 -219617 -369599 -586770 -463351 -135126 169078 -271630 -138079
15112 -138079 -18817 -336685 -238073 97344 295340 304122 59936 -4956 236945 222803
15102 222803 156697 186753 102755 -222679 -398023 -356458 -212917 -221442 -253863 -39206 27261
15091 27261 -109992 -283711 -184837 -241608 -288742 38693 185137 1838 -255677 -181968
15081 -181968 -142399 -52269 -69822 173899 239412 94170 -11546 -44405 -167189 -573986
15071 -573986 -391209 106907 -31586 -15107 201306 284509 217695 216241 475138 509673 500130
15060E00130m36803l19862L00707J38094M5827K60373L44521p3663j38498m1853
15050E78973j62664m73434l93065J85417M59600K0877k70056k79260k64727r604
15040f07943M58731K7808L6496k98605l7178N36817N3259j12675o2969n1423k14630
15029b72312k38081j64703O5997P4137J14395J04237k10874j85495J77900k861
15019e37660l6722M78045J81597o2343J92739J36519j73208p210J53461j77593
15009A47625l32454q5444N9548j58385J7619K34238J22401J75239J19875j64341
14999A35921o1713K84728j7358k6941n1336L5437o5715q0989Q4465r589j11620
14988A15290K04813n61884N0568L01225J22114k6654J7503j37474j93198J6074
$$ plain form
15060 500130 63327 -256535 44172 182266 228093 488466 832987 759324 620826 578973
15050 578973 416309 -57125 -450190 -264773 194827 215704 -54352 -333612 -598339 -607943
15040 -607943 -149212 -121404 -84908 -383513 -420691 116126 169385 56710 -6259 -57682 -272312
15029 -272312 -510393 -675096 -609099 -534962 -420567 -316330 -527204 -712699 -534799 -537660
15019 -537660 -574382 -96337 85260 22917 215656 352175 178967 171757 325218 147625
15009 147625 -184829 -270273 -210725 -369110 -351491 -117253 5148 180387 300262 135921
14999 135921 74208 358936 341578 314637 263301 298738 233023 152034 236499 226910 115290
14988 115290 320103 -241781 -191213 110012 232126 205472 222975 85501 -107697 -91623
14978i1623K02930k8049K6708p995j48509k93771R3099K18152k4175L2205N3117
14967C2089K3618J07265m18482j23726L47935j18438K90498r0019m13243n5249
14957d17752K06066j7156k50860j42909m8321Q418J59903J25118L5749j60887
14947e02631l9327j15376P8744J47528R9141j5286J47502J18917k18075R113J5574
14936b74176M1331L197J72751K16266k42961k84727Q9282J96355O6069k6366j98817
14925b41796O2560J16593J23484p2728k12868O7372J45640J03949j45341k43114
14915b96249J18856J85839k5168k44967l07017N1284K76658M7827j06247m8948
14905c48132J8957M8628l7270j7550j04916J08058K52080Q4057J85575q5817m37662
$$ plain form
14978 -91623 111307 83258 109966 101971 -46538 -340309 -247210 -29058 -53233 -21028 32089
14967 32089 55707 162972 -255510 -379236 -31301 -149739 140759 50740 -362503 -417752
14957 -417752 -211686 -228842 -479702 -622611 -670932 -662514 -502611 -377493 -341744 -502631
14947 -502631 -541958 -657334 -578590 -431062 -331921 -347207 -199705 -80788 -298863 -289750 -274176
14936 -274176 -232845 -229648 -56897 159369 -83592 -368319 -279037 -82682 -16613 -42979 -241796
14925 -241796 -179236 -62643 60841 -11887 -224755 -157383 -11743 92206 -53135 -296249
14915 -296249 -177393 8446 -16722 -261689 -568706 -517422 -240764 -192937 -299184 -348132
14905 -348132 -329175 -280547 -317817 -335367 -440283 -332225 -80145 3912 189487 103670 -333992
14894c33992J15606k22371n1505K07661J33348J5641J21646K18056j57557k74996
14884b28463l22763l13559J04318P6184J6958J60409K70096o4551j46320q8605
14874e36296L88914L97280K73682O131k95771K8001q1049k12304K96377J79742
14864D44707o10952O6387L29553J9242Q3857L6795K57714k82337j62162n0201
14854A32603K7984k16759M9549J5361j27210l07640r5963j3312R0138r8692k16529
14843g60470K07710M53436N410J76855k36380q8542j9834J20190l4311L4117j30035
14832b71854n8956Q4189N29452J29464J12424Q9963l14440k51276l22926j44114
14822d18074K54627K14205J1621j97298k35992n2431J22551k50733J01412M03346
$$ plain form
14894 -333992 -218386 -440757 -492262 -284601 -151253 -135612 -13966 204090 46533 -228463
14884 -228463 -551226 -864785 -760467 -684283 -667325 -506916 -236820 -301371 -447691 -536296
14874 -536296 -147382 249898 523580 529711 233940 261941 180892 -31412 264965 444707
14864 444707 -166245 -99858 229695 248937 332794 369589 627303 344966 182804 132603
14854 132603 160587 -56172 -6623 8738 -118472 -426112 -522075 -535387 -445249 -543941 -760470
14843 -760470 -552760 -99324 -93914 82941 -153439 -241981 -261815 -141625 -175936 -141819 -271854
14832 -271854 -330810 -246621 282831 412295 524719 614682 300242 48966 -273960 -418074
14822 -418074 -163447 50758 62379 -134919 -370911 -423342 -300791 -551524 -450112 -46766
14812d6766J18521R7564Q5853l8439j78990k63710o2450J3901L687K24802j8767
14801f4794j0015N6623j98011J43081L3079o5085j55487J14774L23415k0516O0235
14790B17299J17369j13502l88245K22818J51716J20532K26763j46451q7007J66750
14780D88042j79614k00741k05885l78015K61078J54612Q9315k5404J49872J0247
14770A63507J03499N6758n8048k6379K09140o5672l48270L57569J42430R2696
14760F27230q1101O9219L18041O8886Q9197j47555r6164o6608l55553j93569j39971
14749I2052j5262P8479M3026j22785k12486K25702K15441J70719k88445l38447
14739a52006J0629N6468j83906j30287J64039K16859o908L21842k86377m16191
$$ plain form
14812 -46766 71755 169319 255172 216733 37743 -225967 -288417 -274516 -270829 -46027 -64794
14801 -64794 -74809 -18186 -216197 -73116 -40037 -105122 -260609 -145835 177580 157064 217299
14790 217299 334668 221166 -167079 55739 207455 327987 554750 408299 321292 488042
14780 488042 308428 107687 -98198 -476213 -215135 -60523 28792 3388 153260 163507
14770 163507 267006 323764 265716 239337 448477 382805 34535 392104 534534 627230
14760 627230 546129 615348 933389 1002275 1091472 943917 847753 781145 425592 232023 92052
14749 92052 76790 155269 198295 75510 -136976 88726 304167 474886 186441 -152006
14739 -152006 -141377 -84909 -268815 -399102 -235063 -18204 -25112 296730 10353 -405838
14729d05838K14376K89369J88816J39191J59503l52495j46191j66255j31651j3178
14719b24353J16058L25667j90496J64418j71308k94316j10384m8099r2088L57659
14709a67242K31573k7794j36458k6084j64313J12640L32232J16166m6967p5391
14699A48362l99829k9320K9625M4302k3183j99460N09497K65725k22086l0543
14689I3090J42616p9376r4188p9696J42891O5686J63707q5356j90067R3656k78400
14678a05437k841r0390J4225j69696j11461L18950j69376j07956j62464J33116
14668d53330K30097j3123l58986L13694K62475j36825k76962j20943p4412J28324
14658d99991M17586L03439k01795m70767j54372J32842K75248K62037L8773J53328
$$ plain form
14729 -405838 -191462 97907 286723 425914 585417 232922 86731 -79524 -211175 -224353
14719 -224353 -108295 217372 26876 191294 19986 -274330 -384714 -432813 -524901 -167242
14709 -167242 64331 36537 -99921 -126005 -290318 -177678 154554 270720 223753 148362
14699 148362 -251467 -280787 -251162 -206860 -230043 -429503 79994 345719 123633 93090
14689 93090 235706 156330 62142 -17554 125337 191023 354730 269374 79307 172963 -105437
14678 -105437 -108278 -198668 -184443 -354139 -465600 -146650 -316026 -423982 -586446 -453330
14668 -453330 -223233 -236356 -595342 -281648 -19173 -155998 -432960 -553903 -628315 -499991
14658 -499991 -82405 221034 19239 -451528 -605900 -473058 -197810 64227 103000 256328
14648B56328j93218k39743L87480J76854j42490p7461l91592l15745M07663J52580
14638B0656l9392n1013J7325J27880j30302j41066J64465r1159l24499m50060
14628h97165J58695M82525J23942l55370l36419K30734K67448O2576j96032M311
14618d54755l4532l4119N9703M97406N18563M0479k74238j76026j87399J30768
14608H5850J23868J89276l6172k84942j85271k71337J87452K19118j34063j60677
14598b66898k7912p2907J43187R5252l48404j08697J5198J99719M02435J54971
14588A85944Q6055q3692j98144O6027r7566p2225J02326K74995L37345o6510k46360
14577B88195k68783j47359K88646K45922k65404l03091j18228r1969K09761P8355
$$ plain form
14648 256328 63110 -176633 210847 387701 245211 167750 -223842 -539587 -131924 20656
14638 20656 -18736 -69749 -52424 75456 -54846 -195912 -31447 -122606 -447105 -897165
14628 -897165 -738470 -255945 -132003 -487373 -823792 -593058 -325610 -263034 -459066 -454755
14618 -454755 -489287 -523406 -463703 33703 552266 592745 318507 142481 -44918 85850
14608 85850 209718 398994 362822 77880 -107391 -378728 -191276 27842 -106221 -266898
14598 -266898 -294810 -367717 -224530 -129278 -477682 -586379 -571181 -371462 30973 185944
14588 185944 271999 188307 -9837 56190 -41376 -113601 -11275 263720 601065 534555 288195
14577 288195 19412 -127947 160699 406621 141217 -161874 -280102 -372071 -162310 -83955
14567h3955J32685O8820P3402N2143j81285m64777n4699P3087m05540l70284O10009
14556e50394N85801J93619q6267j05082j61487k4808L0971j31657J43894K61075
14546A55665j53546j87599L7819p1857q3017Q9625l0420k95327K04134L20683
14536a3840M31721K77690m16707k26730k20805p8228M5502J88613j01202q8197
14526b02183J36803j93893l62542P9942k7491O8427K09118R5982M95495N7166
14516C56824j85337j38685l62063K00157M14210j0414l15562Q1189K78501j37603
14506A81217l2723L44874l61958m99220O6071P3451L5796K32737K70001j55081
14496A55165j96009r0027j43202q6943J9671K34461J75310P0729n4039j56399
$$ plain form
14567 -83955 48730 117550 190952 243095 61810 -402967 -457666 -384579 -790119 -1160403 -550394
14556 -550394 35407 229026 142759 37677 -123810 -148618 -117647 -249304 -105410 155665
14546 155665 2119 -185480 -147661 -219518 -302535 -212910 -243330 -538657 -334523 -13840
14536 -13840 417881 695571 278864 52134 -168671 -246899 -201397 -12784 -113986 -202183
14526 -202183 -65380 -259273 -621815 -541873 -569364 -500937 -291819 -195837 299658 356824
14516 356824 171487 32802 -329261 -129104 285106 274692 -40870 40319 318820 181217
14506 181217 148494 493368 131410 -367810 -301739 -228288 -192492 40245 310246 155165
14496 155165 -40844 -130871 -274073 -361016 -341345 -106884 68426 139155 85116 -71283
14486g1283j7992K39279J29360K40497j24489m48270r4258j31548P3241M3995
14476a61468J466k46834n4103L82000K26358k1551R2465Q998j44289N6173J3208
14465A52423o3959O1896j01718q7515l13197J0716K25627J05493k03121J32565
14455h0790K16514M6993j18199l48091J39769J14431O4158l8308n6882j29949
14445a90354m00044J47337M51004J79188j67896m7421q6105m10891k1920K88898
14435b58204J29592o2607j25460L4333N6103L9752k07239l3342J07790J60755
14425a58527J88602n7973k5303O359J12525j53477j09108k06003m6625p4445L55335
14414a68640K43572o7409n0650k3765k12508J6727l02208j79914j66945K7404
$$ plain form
14486 -71283 -89275 150004 279364 519861 395372 -52898 -147156 -278704 -205463 -161468
14476 -161468 -160002 -406836 -460939 -78939 147419 125868 218333 227331 83042 139215 152423
14465 152423 88464 150360 48642 -38873 -352070 -341354 -115727 -10234 -213355 -80790
14455 -80790 135724 182717 64518 -283573 -143804 -29373 34785 -3523 -60405 -190354
14445 -190354 -590398 -443061 7943 187131 19235 -28186 -114291 -525182 -547102 -258204
14435 -258204 -128612 -191219 -316679 -282346 -226243 -186491 -393730 -427072 -319282 -158527
14425 -158527 30075 -27898 -53201 -46842 65683 -87794 -196902 -402905 -449530 -523975 -168640
14414 -168640 74932 7523 -43127 -66892 -279400 -262673 -564881 -744795 -911740 -884336
14404h84336P3741L7136Q2879L61728L28334k43017m7657l26383o2454M10660
14394b69369J90404K70075j47202k43655k60957j39394O5669K50992K12351n4845
14384a25931k00703j59683K35089J57543J82487q5960k02159J76981J05543k4535
14374E8672N232K3296j92262j66328K02095J12552n1742J0973K19685M569n80004
14363c53262j38006K1516O8091j24134o9604j03084J77435J43222j61142J64494
14353c74474J73704M77264k314J28351r1200r9237n6300k23738J77105K59273
14343C68434k18377j35546r1805J51134j3318j43672J12718J61842N1950R427
14333B52787J69444j37111j61031m9262l66468J53434k08278R6610K77387J56716
$$ plain form
14404 -884336 -810595 -773459 -690580 -328852 -518 -243535 -291192 -617575 -680029 -269369
14394 -269369 -78965 191110 43908 -199747 -460704 -600098 -534429 -283437 -71086 -125931
14384 -125931 -326634 -486317 -251228 -93685 88802 2842 -199317 -22336 83207 58672
14374 58672 63904 87200 -105062 -271390 -69295 43257 -8485 2488 222173 226742 -353262
14363 -353262 -491268 -469752 -401661 -525795 -595399 -698483 -521048 -377826 -538968 -374474
14353 -374474 -200770 276494 274180 402531 311331 212094 155794 -67944 109161 368434
14343 368434 150057 14511 -77294 73840 60522 -83150 29568 191410 243360 252787
14333 252787 422231 285120 124089 74827 -291641 -138207 -346485 -249875 27512 184228
14323A84228q2749Q8778K8860Q8197J25027p3289K50917M81702M26744K77530
14313A795945L03018J86144K0377k94664k28363O738k23899m48115l99033J9567
14303G37715J91974n5288l13753j40178q1264k69393n1457j15056q3984n7270
14293b37954J61031j14949k7965K38709n9199k70010k9455j89647K29633L22442
14283B2636k32970j10577K12992k13172K65154J50078K3959J26207O7865J3448
14273C25620J8231k33192j28537j1841R716J48317k16131n23769j15623K02637
14263e24572R5628n2326j38638L13058L18654j89218j63270J6387J53475K5900
14253a44922J0025j21968j76701j43504Q4169J54694J37826K3029M411j82225
$$ plain form
14323 184228 101479 190257 219117 307314 432341 359052 609969 1091671 1518415 1795945
14313 1795945 2098963 2285107 2305484 2010820 1782457 1789195 1565296 1117181 718148 737715
14303 737715 929689 874401 560648 420470 339206 69813 18356 -96700 -180684 -237954
14293 -237954 -76923 -191872 -219837 18872 -40327 -310337 -339792 -529439 -299806 22636
14283 22636 -210334 -320911 -107919 -321091 -55937 94141 118100 244307 312172 325620
14273 325620 343851 110659 -17878 -29719 -20003 128314 -87817 -611586 -727209 -524572
14263 -524572 -428944 -481270 -619908 -306850 11804 -177414 -340684 -324297 -170822 -144922
14253 -144922 -134897 -256865 -433566 -577070 -492901 -338207 -200381 -177352 -172941 -355166
14243c55166j95838J20666L3616R2160q7054k40398M2613L38586P7778K47994
14233G4957r4151m18572n6334K22652n8210k70390J4414L21299k80113j17953
14223f62401K25354k0583m6203K67882M72138r1367j78171L9097J39179k09215
14213f4290k36438M6748L88450K63803K84674k37007j51902j71566Q7398J58209
14203C68079J28885j09966o696k74981j59075m36018N1619K60949J65061l9343
14193e1486M9298J21441j86153n8871M62494m9473k27740k33370J07167J56150
14183H9457k7879m79775o7019J13163j38493N9380r6620N84495K24841Q5020l0697
14172C15873k82613k70767J87343M40341J80780m475j51242J86487L41779r914
$$ plain form
14243 -355166 -551004 -430338 -396722 -304562 -391616 -632014 -589401 -250815 -173037 74957
14233 74957 -19194 -437766 -494100 -271448 -329658 -600048 -585634 -264335 -544448 -662401
14223 -662401 -437047 -457630 -503833 -235951 236187 144820 -33351 5746 144925 -64290
14213 -64290 -300728 -253980 134470 398273 682947 445940 294038 122472 209870 368079
14203 368079 496964 386998 380302 105321 -53754 -489772 -438153 -177204 -12143 -51486
14193 -51486 -2188 119253 -66900 -125771 336723 287250 59510 -173860 -66693 89457
14183 89457 61578 -418197 -485216 -372053 -510546 -451166 -547786 36709 261550 346570 315873
14172 315873 33260 -237507 -50164 390177 570957 566482 415240 601727 943506 933592
14162I33592n47699m38741m2966N8185j4607J53650J71653L0174k42548j78354
14152a17661N2905k40531M09652M15061J25466m28658j62310j28004P832K45186
14142A78938m4473K655k98777k56401K56883p2257K00319K97796J25296j01828
14132B88151j15574j68077k61829j4329j32008P5192j06432J17905K46872Q3625
14122A3496J92048J56701k33388k85014K92891L03943j21191o3635p2951m21615
14112b38715J01230K97310P4902j59188l45629J10906j2244K12168L19622k9993
14102C30369q8868k33928L278j64739J15629J35797J04283R0765k27778j69636
14092a04828k89004j6830K2539K04200k07815n1238m7486j03439Q6351R4170K8960
$$ plain form
14162 933592 385893 -52848 -95814 -37629 -52236 101414 273067 303241 60693 -117661
14152 -117661 -64756 -305287 104365 519426 644892 216234 53924 -74080 -66248 178938
14142 178938 134465 137120 -161657 -418058 -161175 -233432 -33113 264683 389979 288151
14132 288151 172577 4500 -257329 -271658 -403666 -328474 -434906 -317001 -70129 13496
14122 13496 205544 362245 128857 -156157 136734 440677 319486 255851 182900 -238715
14112 -238715 -137485 159825 234727 75539 -270090 -159184 -171428 40740 360362 330369
14102 330369 241501 7573 10851 -153888 -38259 97538 201821 292586 64808 -104828
14092 -104828 -393832 -410662 -388123 -183923 -391738 -442976 -490462 -593901 -507550 -413380 -384420
14081c84420J4990J94018L19912j39348m08589q1789J34264K09746K69343J86621
14071C14748J41317m70793p5587k02318K16256K26079J96546K61301k32124k29773
14061A45652k14048M612j05128J38008K14661q8382p6803j23599l4459J32728
14051f758j52075K4709l10043j44127N9882K5264L20817J15732l4897K23209p780
14040A13933j67840n3433K6724J34917k76558o9167K29772l7358J52042N3218
14030A06250L47276p5360q9303m61596j61404m32983K42914N54188K0707K8809
14020G9498J69387J99144p7347k12021M5177j07381P0408l02762M0017j0114J86476
14009H0482J77556j03267M3939k49570K9267J91676N8878Q1101j12564j78100
$$ plain form
14081 -384420 -369430 -175412 144500 5152 -403437 -485226 -350962 -141216 128127 314748
14071 314748 456065 -14728 -90315 -292633 -76377 149702 346248 607549 375425 145652
14061 145652 -68396 -63784 -168912 -30904 183757 95375 18572 -105027 -139486 -6758
14051 -6758 -158833 -134124 -444167 -588294 -528412 -503148 -182331 -66599 -101496 121713 113933
14040 113933 -53907 -107340 -80616 54301 -222257 -291424 -61652 -99010 53032 106250
14030 106250 453526 378166 288863 -172733 -334137 -767120 -524206 29982 50689 79498
14020 79498 248885 448029 370682 158661 203838 96457 166865 -135897 -95880 -105994 80482
14009 80482 258038 154771 198710 -50860 -21593 170083 228961 310062 197498 19398
13999A9398j5975O0523L2029k4754R6437k68231P1745j44152j33374q3692M03778
13988A3732L68838L585J1530k7551j84379j04781K2494J41001m4743Q5689j33790
13977A51625J47242k31438p4242L41340J42230L1030j20955r2137J57802O6644
13967E19141K75167l5584m37982j87193k3730j59959J48373m9879J50146L85106
13957E83606K29433j32289m189k16898l20540J46905K87519P3071R2854J08627
13947H48099o6352J08745K88671k5959j86396J05433l31405j55519j49146o1783
13937C74388P4370L34242L41264j31042J23351K50347N5715J64204K07572j4285
13927A780126J8299P0448J7594m7210R495l80790k78244N7332k98720j35726J51312
$$ plain form
13999 19398 3423 63946 95975 71221 167658 -100573 -28828 -172980 -306354 -390046 13732
13988 13732 382570 386155 397685 370134 185755 80974 103468 244469 199726 285415 151625
13977 151625 298867 67429 -6813 334527 476757 507787 386832 294695 452497 519141
13967 519141 794308 758724 320742 133549 109819 -50140 98233 48354 198500 583606
13957 583606 813039 680750 676561 459663 139123 286028 573547 646618 739472 848099
13947 848099 781747 890492 1179163 1153204 966808 1072241 740836 585317 436171 374388
13937 374388 448758 783000 1124264 993222 1116573 1366920 1422635 1586839 1794411 1780126
13927 1780126 1798425 1868873 1886467 1839257 1848752 1467962 1189718 1247050 948330 812604 963916
13916I63916K15099N2072j01075j11962k67550j83227J99152j95010p3391Q346
13906E06370j93585J39038M391j39411k30223O6609J11005K7305j00868O7606
13896B58237p2152J02585N0008k27152l56436k49359M13134O8413K73991O6474
13886C27743l09484l95671J84707O45410k9995l12836j38987J08383R4794j39874
13876C4190J09360P3670j35571j54660N5731r0144M1329Q1833m8635K07760J50428
13865C25291P891M7573J35253j04943l4240l7287k36806J20258P5204j06392k5338
13854A66464J10183M3389O0148J93859J54386K11577J34637j77224j92957J55048
13844H59510O1384j05686k17189R2139J52161N1428J32340R4703L26316K45662
$$ plain form
13916 963916 1179015 1231087 1130012 1018050 750500 567273 766425 571415 498024 506370
13906 506370 312785 451823 456214 316803 86580 153189 264194 291499 190631 258237
13896 258237 186085 288670 338678 111526 -244910 -494269 -81135 -12722 261269 327743
13886 327743 18259 -377412 -192705 452705 422710 109874 -29113 79270 174064 34190
13876 34190 143550 217220 81649 -73011 -17280 -107424 -66095 15738 -32897 174863 325291
13865 325291 333182 380755 516008 411065 376825 339538 102732 222990 298194 191802 166464
13854 166464 276647 320036 380184 574043 728429 940006 1074643 897419 704462 859510
13844 859510 920894 815208 598019 690158 842319 893747 1026087 1120790 1447106 1692768
13834A692768q156j16016j81761j33641K40338J00546j58495p1336r9547j60236
13824A104464k02978p5191J11458L31578k97370k46998O467J1568k19603K14562
13814G37957J83957j65895n6131K87356j67682m94873r9480R4249K40894j10942
13804D49410p2155L012j54440l9641n3044J9310J43366K70205N9731P3596j48265
13793E51085k86034j19133o6111k9278M12881K3527K6456j50019k94870Q1982
13783A50486J37973P8431o129k26668j303R5653j92105K35480P4822k73293l55259
13772b81912J13952j16776Q8916J79231L25522M34358j68961m71333l28950Q1725
13762a44228J7242R8964J35663K7035l4028r1697l37132J13688L30818J13888
$$ plain form
13834 1692768 1684612 1568596 1386835 1253194 1493532 1594078 1435583 1364247 1264700 1104464
13824 1104464 901486 826295 937753 1269331 971961 724963 731430 742998 523395 737957
13814 737957 921914 756019 699888 987244 819562 324689 225209 319458 560352 449410
13804 449410 377255 380267 225827 186186 133142 152452 295818 566023 625754 699350 551085
13793 551085 265051 145918 79807 50529 463410 486937 513393 363374 68504 150486
13783 150486 288459 366890 360761 134093 132790 228443 36338 271818 346640 73347 -281912
13772 -281912 -167960 -284736 -195820 -16589 308933 743291 574330 102997 -225953 -144228
13762 -144228 -126986 -28022 107641 134676 100648 8951 -328181 -214493 116325 230213
13752B30213L78525k9451j0481k41415o9792J8811o0661j72561L2380j1735K7360
13741I1193K7436P9907K38644j25773j10775J6763k50668R1540M41630K75151
13731G75048l43869j10305q5865R2360r8915k5788R0543r8453N4352P8189k19049
13720A08248l02313o1789K78553K99468K08675j95702j88935k05008j34307m1169
13710b34279J5684J9810k69393J99983M41087J10670J00771l9488J51516K98905
13700G95266J81084N0258m18733l62882M9852l2976k40640j76165J34936L65831
13690C45831K88818J78460O6806k82303q475m0272k61735k67797P7999N2883J3059
13679A63274k56676k3140M2945K74236K06565P4045N2539L9803J29665j44086
$$ plain form
13752 230213 608738 579287 568806 327391 257599 276410 215749 43188 75568 63833 91193
13741 91193 118629 198536 437180 311407 200632 217395 -33273 58267 499897 775048
13731 775048 431179 320874 235009 327369 228454 202666 293209 194756 249108 327297 108248
13720 108248 -194065 -255854 22699 322167 530842 335140 146205 -58803 -193110 -234279
13710 -234279 -218595 -198785 -468178 -268195 172892 283562 384333 344845 496361 795266
13700 795266 976350 1026608 607875 244993 294845 261869 21229 -154936 -20000 345831
13690 345831 634649 813109 879915 597612 589137 548865 287130 19333 97332 150215 163274
13679 163274 -93402 -116542 -73597 200639 407204 481249 533788 573591 703256 559170
13669E59170n3836j18613r2313o1176J80077K96785L4618j96315J06470L02614
13659I57481L0229R291L27646M2064j9055J50811k2043j59656j15052j37766p9534
13648I84416m5557P9050M20058q353l28225j12163J62968M81937J98512j08605
13638A724038m16047l969P8559j96758J65613L72492P5645j49279J4808q1993
13628A583109J39314J78973j39332k76258o4980k0978k0995k18246J68398K18591
13618A547596R7639J34248j38621k47834J74644O7700k08917l8379J61212K45748
13608A795036J07284j06881J84046L36522L64081Q590L0517J20502k11996l91141
13598B236560k41557O3378L82636J55308M29489K15290k0377j92855L9631l839
$$ plain form
13669 559170 505334 386721 294408 233232 413309 710094 744712 548397 654867 957481
13659 957481 987710 997001 1324647 1366711 1347656 1498467 1476424 1316768 1201716 1063950 984416
13648 984416 938859 1017909 1437967 1429614 1101389 989226 1152194 1634131 1832643 1724038
13638 1724038 1307991 1304022 1382581 1185823 1351436 1723928 1799573 1650294 1665102 1583109
13628 1583109 1722423 1901396 1762064 1485806 1420826 1399848 1378853 1160607 1329005 1547596
13618 1547596 1645235 1779483 1640862 1393028 1567672 1635372 1426455 1388076 1549288 1795036
13608 1795036 1902320 1795439 1979485 2316007 2680088 2688678 2719195 2839697 2627701 2236560
13598 2236560 1995003 2058381 2441017 2596325 3025814 3241104 3220727 3027872 3067503 3063664
13588C063664J77934K24035j06210n41581J7691K73452K0255J02341J90293R0522
13578C512396j4734r7800K0456J76633J39495J29749L30551o9481J4263K46573
13568D388101K34648K91574r8490j11347J99854J10J94541M1485k0160p7646j68100
13557D874570J28499N58793K80435j58145J43447M32416L92838o6686K03551M85012
13547G274730K92047O8284O4267K28805M80935M71308N92730O47225K06004K11418
13537A0537753O71845O83695N94588K5059R3086M52378M51551P00317M99114O15666
13527A5325052R99985J116452Q88607Q63033P80722R21415J075845J234145J248185
13518B4453441J413537J285734J251336J533071J596141J810768K092011K386890
$$ plain form
13588 3063664 3241598 3465633 3359423 2817842 2835533 3108985 3129240 3231581 3421874 3512396
13578 3512396 3497662 3399862 3420318 3596951 3736446 3866195 4196746 4127265 4141528 4388101
13568 4388101 4622749 4914323 4815833 4704486 4904340 4904450 5098991 5140476 5120316 5042670 4874570
13557 4874570 5003069 5561862 5842297 5684152 5827599 6260015 6652853 6586167 6789718 7274730
13547 7274730 7566777 7635061 7699328 7928133 8409068 8880376 9473106 10120331 10326335 10537753
13537 10537753 11209598 11893293 12487881 12512940 12606026 13058404 13509955 14210272 14709386 15325052
13527 15325052 16325037 17441489 18330096 19193129 19973851 20895266 21971111 23205256 24453441
13518 24453441 25866978 27152712 28404048 29937119 31533260 33344028 35436039 37822929
13510C7822929K674502L064189K800197K844553L191152L922663M329052M517578
13502F5166815N446111O062454O001989O478836P415485Q173066Q791114R989297
13494A23525167J0818380J2341453J3117819J4167600J5441249J6376153J7149094
13487B22936915J8195438J8409592J7659528J7036032J5690714J3306181R848642
13480C33083042O726618K700472j528540n475737q706678j1643665j4335856j6239454
13472B84580202j7084635j7579999j7468772j7219485j6256558j5828499j4605887
13465A68536367j3642090j2142867j1473736j0118735r140138q580651q159152
13458I5278998p325925o339031n300018n145220n090907m538213m291220l872703
$$ plain form
13510 37822929 40497431 43561620 46361817 49206370 52397522 56320185 60649237 65166815
13502 65166815 70612926 76675380 82677369 89156205 96571690 104744756 113535870 123525167
13494 123525167 134343547 146685000 159802819 173970419 189411668 205787821 222936915
13487 222936915 241132353 259541945 277201473 294237505 309928219 323234400 333083042
13480 333083042 339809660 342510132 340981592 335505855 326799177 315155512 300819656 284580202
13472 284580202 267495567 249915568 232446796 215227311 198970753 183142254 168536367
13465 168536367 154894277 142751410 131277674 121158939 112018801 103438150 95278998
13458 95278998 87953073 81614042 76314024 71168804 66077897 61539684 57248464 53375761
13450E3375761l521151l189143l180265k854145k384513j977523k138561j823289
13442C2307171j661028j979953j771276j574598r07906j049590j328283j198230
13434B0836307q35396q79382j217996q55230l71258n95796q27936o32815o17151
13425A4003347q12540l76205J2101k25324o07909o26699n45506n86693l78054
13416I856518j16327l19835l49362k74935l11762l60293l93936l52416l15188
13407G062464n7049j29682J27870m888K6522m04167k67672l68380l11445j85488
13397E488085m50908m08638J24043j69238J73491L31314l00730m10417k95695
13388D081307K77337j03538l5801j79108O3387L341k99297k55163k4519j08796
$$ plain form
13450 53375761 49854610 46665467 43485202 40631057 38246544 36269021 34130460 32307171
13442 32307171 30646143 28666190 26894914 25320316 24412410 23362820 22034537 20836307
13434 20836307 20000911 19121529 17903533 17048303 16677045 16081249 15253313 14620498 14003347
13425 14003347 13190807 12814602 12826703 12601379 11993470 11366771 10821265 10234572 9856518
13416 9856518 9740191 9420356 9070994 8796059 8484297 8124004 7730068 7377652 7062464
13407 7062464 7005415 6875733 7003603 6998715 7025237 6621070 6353398 5985018 5673573 5488085
13397 5488085 5037177 4628539 4752582 4583344 4756835 5088149 4787419 4377002 4081307
13388 4081307 4358644 4255106 4219305 4040197 4103584 4106925 3807628 3552465 3527946 3419150
13378C419150j02646K49999J16518k08561m05105k24144O0782O7302J7257j89848
13368B800704l33460r0053K00815M488n5040n2611j84864K35236L21516L78183
13358C224914J80126l0525J75951k2958o5909q1294j54592l64750j16793k08221
13348B535949k71032j66068j16326R2138k39815j69360M9928j4507J85439L70031
13338B256377j99947M1681R3543l7414j30161O830j63582J03780L61852L02749
13328B635708l56789j48295n8500l42372k33509k20447L2969K29432n4142j48047
13318A336008m9024r2987j85078J97023N5910o8757l4982l14501R6971J41331
13308A081914M22257J42975k40619Q1066k91744k78198l6061J66549J73472Q6146
$$ plain form
13378 3419150 3316504 3566503 3683021 3474460 3069355 2845211 2905993 2973295 2990552 2800704
13368 2800704 2467244 2377191 2578006 2582494 2527454 2474843 2289979 2525215 2846731 3224914
13358 3224914 3405040 3374515 3550466 3527508 3461599 3380305 3225713 2860963 2744170 2535949
13348 2535949 2264917 2098849 1982523 2074661 1834846 1665486 1715414 1700907 1886346 2256377
13338 2256377 2056430 2098111 2191654 2154240 2024079 2030909 1867327 1971107 2332959 2635708
13328 2635708 2278919 2130624 2072124 1729752 1496243 1275796 1308765 1538197 1484055 1336008
13318 1336008 1286984 1193997 1008919 1205942 1261852 1193095 1158113 843612 940583 1081914
13308 1081914 1504171 1647146 1406527 1487593 1195849 917651 881590 1048139 1221611 1307757
13298A307757k5956J06354j53167m15952l01102j08745K62693K89570L3989L0471
13288A025912K51288K89897J33065j66404j5523j0836M0433j14530l74598J10666
13278A169370k26415k4635J05097K10128j27889r97Q2335K70237L42929r2039
13268A708121k38287l29630l26483J39726N10104J12308j66846j88738j59383
13259A060892j52538J19761q3855m8726J34393K3993l95965j4461Q4021l1074
13249F96441N9730q7669l02230L1809M64441k14782m2211L77751J40445j12116
13239A011609k65479p6651J36193J38326M4817l8455q9478j54381r8079j14200
13229D94222R375m0283k27894J08174K98894q4811m99464l07631M24263M96974
$$ plain form
13298 1307757 1281801 1388155 1234988 819036 517934 409189 671882 961452 995441 1025912
13288 1025912 1277200 1567097 1700162 1533758 1518235 1507399 1547832 1433302 1058704 1169370
13278 1169370 942955 918320 1023417 1233545 1105656 1104659 1186994 1457231 1800160 1708121
13268 1708121 1469834 1140204 813721 953447 1463551 1575859 1409013 1220275 1060892
13259 1060892 908354 1028115 944260 895534 1029927 1053920 657955 643494 727515 696441
13249 696441 756171 668502 366272 398081 862522 647740 605529 983280 1123725 1011609
13239 1011609 746130 669479 805672 943998 988815 950360 860882 706501 608422 494222
13229 494222 503597 463314 235420 343594 642488 557677 58213 -249418 174845 671819
13219F71819k0374k0079r8120m7840k54050J59347L42745K15261l0373k33037
13209F85299K49842q197l11531q510J84309M09774J22654J46094k75525m79512
13199G14697j91418j16754j76263j86903R8559q305L74850L11498J60288O3974
13189A044223n6479k79074M0748J76104J71605J71049l09321m01489k42966K02271
13179E16671L07015L6402j31128k91784j29032j08228J36616J89542m1790L31236
13169H15520K38272O7606l4287j43568K4175k06517k62443J87189J29786k83620
13159E32113j66471l9488l8928K93336j01530l69685k95317o1338R8119Q4520
13149f4669J35637K13879j30925J29526Q530l55423M8952K25712M09028N3549
$$ plain form
13219 671819 651445 631366 533246 485406 231356 390703 733448 948709 918336 685299
13209 685299 935141 926944 615413 606903 791212 1200986 1323640 1469734 1194209 714697
13199 714697 523279 406525 230262 43359 141918 133613 508463 819961 980249 1044223
13189 1044223 987744 708670 749418 925522 1097127 1268176 958855 557366 314400 516671
13179 516671 823686 860088 728960 437176 308144 199916 336532 526074 484284 815520
13169 815520 1053792 1121398 1087111 943543 967718 761201 498758 685947 815733 532113
13159 532113 365642 326154 287226 580562 479032 109347 -185970 -247308 -149189 -64669
13149 -64669 70968 284847 153922 283448 291978 -63445 -14493 211219 620247 673796
13139F73796k67808j0893K21005J335k53680j34765J46025M7701J10915m5911
13129D87720J8314K6609k22229k92363J93813J93374o7780l9749j25003J55162
13119C27868J3746J50503L02454k4411k83708l46027j13636r6327Q9559J10197
13109A30218J64393J35904P3425K29283j9331l1883k1841p7273q6475r7178j56233
13098B43009o7672K56619K42367n7977k19982M8899R2026J52245m31306l05241
13088d7013m0271M94182L99104J27562k51681l64746r3546K04639m8722l44451
13078C5057J48054k1609K3768K32608J19398j71588k90076J02621J99025N4493
13068D31751k08303j68366R476M5390J05523K75863Q1232k72638k49991K65260
$$ plain form
13139 673796 405988 395095 616100 617435 363755 228990 375015 422716 533631 487720
13129 487720 506034 532643 310414 18051 211864 405238 337458 297709 172706 327868
13119 327868 341614 492117 794571 770160 486452 140425 26789 -69538 20021 130218
13109 130218 294611 430515 503940 733223 713892 682009 660168 582895 496420 399242 243009
13098 243009 175337 431956 674323 616346 396364 445263 537289 689534 258228 -47013
13088 -47013 -87284 406898 806002 933564 681883 317137 223591 428230 379508 35057
13078 35057 183111 161502 185270 417878 537276 365688 75612 178233 377258 431751
13068 431751 223448 55082 64558 109948 215471 491334 572566 299928 49937 315197
13058C15197M20867j38801M8483o554l30362j07257q46Q9866Q6888J45932Q4471
13047F07884r7094m93762j01292L04614L58011P7890m7046k17733L3736K38327
13037F63535K81915J30765l37094N2784L13431J90602O2670r4204r480K411j32894
13026A124441J01836P0599L10653J50995R1905O3844k04148j8900R4874K99009
13016B085108k2063k60521k82407n7627l66684l82947N0921R1786m55084J7895
13006D18377K47932K62871J11027k73642L1751M6028k34192P9246K53132N836
12996I48366k36008k38822J80486j11783j89660J99872L68009m5565j04957r2139
12986F77799j84993j40324l10877k3844J20546j35449m31j64467r391p2210j71219
$$ plain form
13058 315197 736064 597263 645746 639192 308830 201573 200727 290593 377481 523413 607884
13047 607884 510790 17028 -84264 220350 578361 656251 609205 391472 425208 663535
13037 663535 945450 1076215 739121 791905 1105336 1295938 1358608 1264404 1254924 1257335 1124441
13026 1124441 1226277 1296876 1607529 1758524 1850429 1914273 1710125 1691225 1786099 2085108
13016 2085108 2063045 1802524 1520117 1462490 1095806 712859 763780 855566 400482 418377
13006 418377 666309 929180 1040207 766565 798316 844344 610152 689398 942530 948366
12996 948366 712358 473536 654022 542239 352579 552451 920460 874895 769938 677799
12986 677799 492806 352482 41605 17761 138307 2858 2427 -162040 -171431 -243641 -414860
12975d14860l1711p2808N9527J60472K33528J19198J3666j88442J45287K39509
12965B63366j8032k56005J28383N3304p2905j02473L0257N8452k62195K20084
12955D2236K16865q4978o7849k1473J70449M1728k86485K46874J40852J5954N964
12944D20137j37648j64323k06003m54254J5140L24048L23972M30232o2583J19271
12934F07989n9285k37320m15655j0150J15642j95191Q1199Q1636o4569M5067k4185
12923g4822J95808K92225j98366k28664l3569K5670J29779m5155P6581Q964R6511
12912B44962K06116l3382o4183K96700l53263l62723n7611M2910K10940K77456
12902D07922M9121k04183j48756k67411R1954K46130K90662J30721l20495o4324
$$ plain form
12975 -414860 -446571 -519379 -459852 -299380 -65852 53346 67012 -121430 23857 263366
12965 263366 245334 -10671 117712 171016 98111 -4362 25895 84347 -177848 42236
12955 42236 259101 174123 106274 84801 255250 296978 10493 257367 398219 414173 420137
12944 420137 282489 118166 -87837 -542091 -526951 -202903 121069 551301 488718 607989
12934 607989 548704 311384 -104271 -114421 1221 -193970 -112771 -31135 -95704 -50637 -74822
12923 -74822 120986 413211 214845 -13819 -47388 -21718 108061 62906 139487 148451 244962
12912 244962 451078 417696 353513 650213 296950 -65773 -123384 -80474 130466 407922
12902 407922 457043 252860 104104 -163307 -71353 174777 465439 596160 275665 211341
12892B11341m8697o0972K12924n0183l8142j59757j48203n2708J9532J94295k127
12881G7303o429k39318p33O8695J36149j82537j46606k03145q7270M33080l5770
12870a86581p6838N33877l3425K91683K9282R4551R0962j07232j40236J17788
12860F13831o5448O2576j80466k48697j37014R6708P4911j64662l5159K76280
12850B92860l47577j21691o4249O200n6350J67418o1645K72186K55021J08373
12840D50546k20243k17226j96297l25511r9666K0086L89214j86861j07589K12728
12830b80819K13980l48740m9525N4512J61582J29925J6629J4506R2433M6373l3271
12819A7585j85501j76935N07576K34810l200m3956q1413J39547O933m5049j84848
$$ plain form
12892 211341 162644 101672 314596 264413 226271 66514 -81689 -134397 -114865 79430 77303
12881 77303 70874 -168444 -169177 -100482 35667 -146870 -293476 -496621 -583891 -150811 -186581
12870 -186581 -263419 270458 237033 528716 557998 652549 743511 636279 496043 613831
12860 613831 548383 610959 430493 181796 44782 141490 216401 51739 16580 292860
12850 292860 -54717 -176408 -240657 -234457 -290807 -123389 -185034 87152 342173 450546
12840 450546 230303 13077 -183220 -508731 -608397 -588311 -199097 -385958 -493547 -280819
12830 -280819 -66839 -415579 -465104 -410592 -249010 -119085 -102456 -87950 4483 50856 17585
12819 17585 -167916 -344851 162725 397535 394335 350379 268966 408513 415446 370397 185549
12808A85549K31065O3961j37798m31784j81326K27429J3321J13245P2625J09331
12798B65618M29395M9988j28666o2999m12668K7202L5817K72358n159r0408j96776
12787A83702j40780L40075p5995k71800k89606K65882N1375J74303k80486j38665
12777a81995Q2264p8621J00122l9732m6245L64152J08082K2453r2169j59922K31598
12766C09987L16975p8714K6698K10192o5870j01418j85412L8191K35419J3396
12756G19444k13555k32794M5213q1488p1659L13447J49354j96043l07598o0057
12746F4264l9241N1119K35278K99352q7293j70943J30774q116m08830l74031K48635
12735e9032K51770o2094p4312J21133r2141J94875Q8891J1770p7840j2343J48224
$$ plain form
12808 185549 416614 480575 342777 -89007 -270333 -42904 -29583 83662 156287 265618
12798 265618 695013 745001 616335 553336 140668 167870 203687 476045 470886 380478 183702
12787 183702 42922 382997 307002 35202 -254404 11478 62853 237156 -43330 -181995
12777 -181995 -99731 -178352 -78230 -117962 -164207 199945 308027 330480 238311 78389 309987
12766 309987 626962 548248 574946 785138 719268 617850 432438 470629 706048 719444
12756 719444 505889 273095 318308 236820 165161 478608 627962 431919 124321 64264
12746 64264 25023 76142 311420 610772 523479 352536 483310 475194 66364 -307667 -59032
12735 -59032 192738 130644 56332 177465 85324 280199 369090 380860 303020 290677 438901
12724D38901p4114p5709j39819j8358J65655r2201l44147q7224O2338J11391K70398
12713B17111K03266J82673j30864k61532n65092r0520K53681K93839L27892k64497
12703A65957j02033K67835R2298j20856k81202L3317J43186J36105j58249J13863
12693B90221k11437m01931J39469K952j41658m9110J10001K31329q5194m23457
12683e38815K47121J25564j71914j58782k4025R3559j01826p8218O05M21186l2229
12672b17774j1971L2655J50863K08645K34854O2605l72132O089J21833l01813
12662h6146k14171P44091J29329l81129m0833J19941l91704J09432M58588r499
12652D37899l57238j41458L097L5798O4625L29399k12673j65499M4125k70241
$$ plain form
12724 438901 364787 289078 149259 130901 296556 204355 -139792 -227016 -164678 -53287 217111
12713 217111 420377 603050 472186 210654 -354438 -444958 -191277 102562 430454 165957
12703 165957 63924 331759 424057 303201 21999 55316 198502 334607 176358 290221
12693 290221 78784 -323147 -183678 -180726 -322384 -371494 -261493 -30164 -115358 -538815
12683 -538815 -291694 -166130 -338044 -496826 -520851 -427292 -529118 -607336 -606731 -185545 -217774
12672 -217774 -229745 -197090 -46227 162418 397272 459877 87745 93834 215667 -86146
12662 -86146 -300317 443774 573103 191974 151141 271082 -120622 -11190 447398 437899
12652 437899 80661 -60797 -57700 -21902 42723 372122 159449 -6050 38075 -232166
12642b32166J10346K35664K79381J92074j04190k38969k60727Q6603j01734M00621
12632C66903P2666k78511k49338J45174O9387J5833j25804o6651j23437j6327
12622a90105p7830j55399K83711J12214j38079p1630q0251p073J64272J23547
12612c6623j8698N607J48284o036j59174l5185K04161O1129j17611J65838k4470
12601A87222J73981q0958P3585p5938j31806M1707j13174j52411j88443r7088
12591c63323k2503J84069j23899P3589j44451N2722M62081N5970R6106K6562J9032
12580C15955k58539m0097K4373n2581J63257Q815j9242K90070J49024l37797k23565
12569A9673o9798j69689r1394N51909k0741j07831q1137L47206J20099j37673
$$ plain form
12642 -232166 -121820 113844 393225 585299 481109 242140 -18587 68016 -33718 366903
12632 366903 439569 161058 -88280 56894 126281 142114 16310 -50341 -173778 -190105
12622 -190105 -267935 -423334 -139623 -27409 -165488 -237118 -317369 -324442 -160170 -36623
12612 -36623 -55321 -49714 98570 92534 -66640 -101825 102336 163465 45854 211692 187222
12601 187222 361203 280245 353830 277892 146086 187793 74619 -77792 -266235 -363323
12591 -363323 -385826 -201757 -325656 -252067 -396518 -343796 118285 174255 270361 296923 315955
12580 315955 57416 17319 41692 -10889 152368 161183 141941 432011 581035 243238 19673
12569 19673 -50125 -219814 -311208 240701 219960 112129 30992 378198 498297 360624
12559C60624l39384m09929p1032K78701K19413J85691R4113n2460l98408K04897
12549G2226o0493k86177j619J16128J10010M8802l5905K17711j1009J08116K84301
12538E62091j01394J0399R4949l07229j04086J08782O0609J67628O849r5116q6123
12527C17359n9447M4473l82319J63179R079r34M08742k3725k43455k13004M8398
12516F8346J99038J45173R0085j63421j65473q7419K85528Q383J49685j64492
12506C65433J7555L00382K00016k46789j94303j94260o011L2126R4986M0768K3958
12495D33861j8359r8527O8557l0815K59636P800j29995l44264j40121K39249J86325
12484D33347q2025K04933l1023j51254j55710k96460j9808J4184R6354Q3223L37037
$$ plain form
12559 360624 21240 -388689 -459721 -181020 38393 224084 318197 265737 -132671 72226
12549 72226 11733 -274444 -276063 -159935 -49925 -1123 -37028 180683 169674 277790 562091
12538 562091 460697 471096 566045 258816 154730 263512 324121 491749 498598 403482 317359
12527 317359 257912 302385 -79934 83245 92324 91390 500132 476407 232952 19948 68346
12516 68346 267384 412557 502642 339221 173748 86329 371857 380240 529925 365433
12506 365433 382988 683370 883386 636597 442294 248034 242023 274149 369135 409903 433861
12495 433861 415502 316975 385532 354717 614353 622153 492158 147894 7773 247022 433347
12484 433347 351322 556255 525232 373978 218268 -78192 -98000 -83816 12538 95761 432798
12473D32798K2011j89203k73566M9405J5114Q6761R2304n6654k77604j87189J03873
12462a81950M9839K50076L65335J66362j05756j52155k0132l19989J07336n9228
12452I9738J7989L23049O1222k73136J16807n8414n04975L3497K13809K06361
12442B35947K55357j81736l84758j85902L593k05727L48614L79218K48754J84832
12432F98192K90100l05520o4411n1510l52759j91346K2174k64666J22660J96553
12422I9467J88698J50472j19409j29179j99015r9456N5673r0141P7769J71610
12412A06489J21789J24259K5700j42722k02356M2819J31661j22297J9064K3305
12402A27711j09479J82957L18890j32408P2073q3947Q3152M41192J22153k55276
$$ plain form
12473 432798 454809 265606 -7960 41445 56559 143320 235624 178970 -98634 -285823 -181950
12462 -181950 -132111 117965 483300 649662 543906 391751 371619 51630 158966 99738
12452 99738 117727 440776 501998 228862 345669 287255 -217720 -184223 29586 235947
12442 235947 491304 309568 -75190 -261092 -257499 -463226 -114612 264606 513360 698192
12432 698192 988292 682772 618361 566851 214092 22746 44920 -219746 -97086 99467
12422 99467 288165 438637 319228 190049 -8966 -108422 -52749 -142890 -65121 106489
12412 106489 228278 352537 378237 235515 33159 75978 207639 85342 104406 127711
12402 127711 18232 201189 520079 387671 459744 375797 458949 900141 1022294 767018
12392G67018k05363r5947q4496k85261J24134L3431O2055K86148M10823Q1391
12382A093933L2270J9059l26437n11474l764P7194k15489J81594j34128R4693
12372C07451J75275l1368l186L1602J43004l6453k07136L7548q2916k30624K12121
12361C15318K15445J49237K62016l48709k76822Q1044j36283k07788L5052J91601
12351B80111K80j12125N7011R8291N4541N1069o9446R6521J62383k7097Q9476
12340F81015J36651j48884N0191o2998J41248m0231k32403j87751P8685j2389
12330D03134R5520j66626k72922o8791j18296J4401J58070L1812k4883Q4049M24736
12319E60204L01387k07183k91482J13262K28921j57304N3581k01165K9676J14995
$$ plain form
12392 767018 561655 465708 381212 95951 220085 253516 315571 601719 1012542 1093933
12382 1093933 1126203 1145262 818825 307351 303587 380781 165292 346886 212758 307451
12372 307451 482726 451358 448172 479774 622778 586325 379189 416737 333821 103197 315318
12361 315318 530763 680000 942016 593307 316485 397529 261246 53458 88510 280111
12351 280111 280391 168266 225277 323568 378109 429178 359732 456253 618636 591539 681015
12340 681015 817666 668782 718973 655975 797223 756992 524589 336838 415523 403134
12330 403134 498654 332028 59106 -9685 -127981 -113580 44490 76302 51419 135468 560204
12319 560204 861591 654408 362926 476188 705109 547805 601386 400221 429897 544892
12309E44892j73688Q2795Q1177j29945m07604K59487J13692m0272L83827j59124
12299E55237j6339k3754P7915Q3653L4873m6955k03484q2211j80291L7625L40633
12288E76902K60127k9800l01115m8169J23755K36599j99678k14903J1631K12407
12278F27756K20667j27465j71516q8136N8763N10258N46370J45099N8588J11516
12268A891900k6768k02944j94472j87483o0010J05116l67478m04135J54911J97331
12258I05968Q2829r455j72500J54466P3753m7458k96474j00543k18355k5578K79942
12247F26595K43960K16155P7428m8459k75552k0969r3106K60660O6348R7271K42418
12236A392749m1797L7127k61402l08520J39691N5650K10829P09q7966j40436r7540
$$ plain form
12309 544892 371204 453999 535176 405231 -2373 257114 370806 330534 714361 555237
12299 555237 538898 515144 593059 676712 711585 664630 461146 378935 198644 236269 576902
12288 576902 837029 807229 506114 457945 581700 818299 618621 403718 415349 627756
12278 627756 848423 720958 549442 461306 520069 1030327 1576697 1721796 1780384 1891900
12268 1891900 1865132 1662188 1467716 1280233 1220223 1325339 957861 553726 708637 905968
12258 905968 988797 979342 806842 961308 1035061 987603 691129 590586 372231 346653 626595
12247 626595 870555 1086710 1164138 1115679 840127 819158 726052 986712 1053060 1150331 1392749
12236 1392749 1350952 1388079 1126677 818157 957848 1013498 1224327 1225036 1137070 996634 899094
12225H99094n1044J33702K66711k91840L8839J42652l18055p280M7365J05241
12215I65385J75264P0946J10004j5231r795K39392p8535n3206l73505j07475O9552
12204I92796n1983R5044o0271o3222n3193j16924m6238N17315J57521k55244l09803
12193H05798J30790K7288K40478j00048k06665N59117j1654n62002L0425Q5206
12183I98733K0011J33165P6003j76406r3297P0226P1653R5581J73904k18972K64563
12172A415164O8845l6442k55001P589K07209J13477P069j44819K93675j35063
12162A541703k25866J78058N4826Q2396q1800r7027J39954l6872k62430K2006
12152A314948N3941K55728J01938n4479J60128k58332l49954j47073L44072J08928
$$ plain form
12225 899094 848050 981752 1248463 956623 995462 1138114 820059 812779 860144 965385
12215 965385 1140649 1211595 1321599 1306368 1296573 1535965 1457430 1404224 1030719 923244 992796
12204 992796 940813 1035857 975586 912364 859171 742247 696009 1213324 1370845 1115601 805798
12193 805798 936588 963876 1204354 1104306 897641 1456758 1445104 883102 913527 998733
12183 998733 1018744 1151909 1227912 1051506 958209 1028435 1100088 1195669 1369573 1150601 1415164
12172 1415164 1484009 1447567 1192566 1200155 1407364 1520841 1527910 1383091 1676766 1541703
12162 1541703 1315837 1493895 1548721 1631117 1549317 1452290 1592244 1555372 1292942 1314948
12152 1314948 1368889 1624617 1726555 1672076 1832204 1573872 1223918 1076845 1420917 1529845
12142A529845j99270n7604J71359L5669P1514j69163j67632j5568K25823L2346
12132A457319P4329J06813q0832K4223m3316p6305l558o9988j3015J54336J62445
12121A692451Q0430K99273P7175l66910K30345L38917J20423j6174r8690j78168
12111B179072k47676K19305J58478o2981J40152J94510N1449O7356l72091k88611
12101B038963J82400K19871K89118j82748L8287J34039J61245j8270j70530O2570
12091B754945K31553M2945k96863k34503M5797P4266K06298J96277J02693J8808
12081C142216M7093k53674j01167N5099r4354n476J12540j35290N927j78500j5544
12070B578870K46893O97942L14714l80636j9084L36405m9432r0136J222m2886
$$ plain form
12142 1529845 1330575 1272971 1444330 1479999 1551513 1382350 1214718 1199150 1424973 1457319
12132 1457319 1531648 1638461 1557629 1581852 1538536 1462231 1458673 1388685 1375670 1530006 1692451
12121 1692451 1772881 2072154 2149329 1782419 2012764 2351681 2472104 2455930 2357240 2179072
12111 2179072 1931396 2150701 2309179 2246198 2386350 2580860 2632309 2699665 2327574 2038963
12101 2038963 2221363 2441234 2730352 2547604 2585891 2719930 2881175 2862905 2692375 2754945
12091 2754945 2986498 3029443 2732580 2498077 2543874 2618140 2824438 3020715 3123408 3142216
12081 3142216 3189309 2935635 2834468 2889567 2795213 2789737 2902277 2766987 2772914 2594414 2578870
12070 2578870 2825763 3523705 3838419 3457783 3438699 3775104 3725672 3635536 3636758 3593872
12060C593872j5665N21452K36005J47330k34118k79539q0942P5358L46761K00562
12050D511076j81254j16548p169L56596K07192L4379n9640P8015K94925p8676
12040E038896k43506q3725o6167K17724N82683n3318p3395q1430Q8607L68395
12030E694764K16339K1763J56543L83969N1527K57581L56450l10869j18600J21481
12020F830948J06137L0616K85447K72352J33887L90797j15067J8688O45569J51425
12010H750799N7868R4035N61796L00909M7806K21141J31130K61769K90740R9868
12000A0817861M56595M00527J66159K05581M74781K80931J49632O94590P18026
11991A4364683L42842K21005L49669N38976M45620L88385O60414N12878O09712
$$ plain form
12060 3593872 3578207 4099659 4335664 4482994 4248876 3969337 3888395 3963753 4310514 4511076
12050 4511076 4329822 4213274 4206105 4562701 4769893 4804272 4744632 4822647 5117572 5038896
12040 5038896 4795390 4711665 4645498 4863222 5445905 5392587 5319192 5237762 5326369 5694764
12030 5694764 5911103 5932866 6089409 6473378 6524905 6782486 7138936 6828067 6709467 6830948
12020 6830948 6937085 6967701 7253148 7525500 7659387 8050184 7935117 7953805 8599374 8750799
12010 8750799 8808667 8902702 9464498 9765407 9813213 10034354 10165484 10427253 10717993 10817861
12000 10817861 11274456 11674983 11841142 12046723 12521504 12802435 12952067 13646657 14364683
11991 14364683 14707525 14928530 15278199 15817175 16262795 16651180 17311594 17824472 18434184
11982A8434184N71951O46468M61138K28930N62249J069791J308266J312017Q68477
11973B5463471Q76558J109792J050591J011521J091127J205369J551842J551819
11965C4912090J673817J680541J967806J796292J737413K047576K390196K778224
11957E0983955K507799K666832L394275L343978L309598L995713M233782M005434
11949G8441366M358531N259316N194553N211706N680889N805999O025311O021692
11941A21999363O572131P222247O773619O671483O483317O448017N770889N249282
11933A73190348M773983L813032K363081J207610j224j613778k405430l220640
11925A78106982m695838n729725n916645o736818p415064p455683p371201p073071
$$ plain form
11982 18434184 19006135 19652603 20113741 20342671 20904920 21974711 23282977 24594994 25463471
11973 25463471 26340029 27449821 28500412 29511933 30603060 31808429 33360271 34912090
11965 34912090 36585907 38266448 40234254 42030546 43767959 45815535 48205731 50983955
11957 50983955 53491754 56158586 59552861 62896839 66206437 70202150 74435932 78441366
11949 78441366 82799897 88059213 93253766 98465472 104146361 109952360 115977671 121999363
11941 121999363 128571494 135793741 142567360 149238843 155722160 162170177 167941066 173190348
11933 173190348 177964331 181777363 184140444 185348054 185346830 183733052 181327622 178106982
11925 178106982 173411144 167681419 161764774 155027956 147612892 140157209 132786008 125712937
11917A25712937p264969o768256o439768n977212n701840n201072m580898m397975
11909G9380947l907172l903221l875469l349229k980393k866658k246289j996528
11901E4255988k019402k001492j916981j457716j561963j550840j081185p53811
11893D1912598r27528j140507r94574j260615q80252k89189o13920p74833n65904
11884C4465276k4016n4302l28523l09142k7233m73719j85691J9856N4516j17321
11874C3019701m6646K16681J83538M54016m3237J49733L55789J59905J28599P8092
11864C4656171K07989N74665N96996M41450L22120K65641R559L9645O25377J48856
11854C7888469L71298Q40831Q89890P65633O26991J91328L62721N73052M26556
$$ plain form
11917 125712937 118447968 111679712 105239944 99262732 93560892 88359820 83778922 79380947
11909 79380947 75473775 71570554 67695085 64345856 61365463 58498805 56252516 54255988
11901 54255988 52236586 50235094 48318113 46860397 45298434 43747594 42666409 41912598
11893 41912598 40985070 39844563 38849989 37589374 36709122 36419933 35806013 35031180 34465276
11884 34465276 34441260 34386958 34058435 33749293 33722060 33248341 33062650 33082506 33137022 33019701
11874 33019701 32973055 33189736 33373274 33827290 33784053 33933786 34289575 34449480 34578079 34656171
11864 34656171 34864160 35438825 36035821 36477271 36799391 37065032 37074591 37114236 37739613 37888469
11854 37888469 38259767 39100598 39990488 40756121 41383112 41574440 41937161 42510213 42936769
11845D2936769L03680N53534O03998P00239M32897M82869L68881O23484M95513
11836D7501864N40549L28579K69802K02244M31786Q38543P17291L60063P0061
11827E1260782j07513M33250M87876L19748K66909J58143L32613L11967M6312
11818E3510087J02115L01158M55166L8653J34196J92805N2717K95075n4679J28761
11808E5156054M17207J15225l8906o2483J52266J0932m5534K67899j20490M0368
11798E5892538K47744K58978P7407O894K01230J84409J27570M17235N49684K12653
11788E8176342K7134M77289N12691J97169J38229K86753K24390J31102N15060
11779F0686159L33727L87155Q02755M74244j31313K20481O07193N72465O68074
$$ plain form
11845 42936769 43240449 43793983 44397981 45098220 45531117 46013986 46382867 47006351 47501864
11836 47501864 48042413 48370992 48640794 48843038 49274824 50113367 50830658 51190721 51260782
11827 51260782 51153269 51586519 52074395 52394143 52661052 52819195 53151808 53463775 53510087
11818 53510087 53612202 53913360 54368526 54407179 54541375 54734180 54786897 55081972 55027293 55156054
11808 55156054 55573261 55688486 55649580 55587097 55739363 55750295 55704761 55972660 55852170 55892538
11798 55892538 56140282 56399260 56476667 56483561 56684791 56869200 56996770 57414005 57963689 58176342
11788 58176342 58203476 58680765 59193456 59390625 59528854 59815607 60039997 60171099 60686159
11779 60686159 61019886 61407041 62209796 62684040 62552727 62773208 63380401 63952866 64620940
11770F4620940L17754o3622N34590M75801M94881K83671K89063M15383J88287
11761F7556748M97081M33330L34690J89482Q4246L27050L81277K68762L89813
11752G0462479N07200r1090m02023m90038j89871M8660k89586J8960n1682j42878
11742F9380131j11791m17064p37504q95707n01388k33949l66003m78334k97457
11733F5340934p56032q59273r30661q41644q30155j014392r28893j139904p76413
11724E7263567j079295j165427r97050o35233o78731q29076q87896q95601j135664
11715D8959594j017258p26507j122271r89004r02892p40720q02125q81622j015013
11706D0762182n68869p33138q98817o87077p50048p03856q74750j120140r60476
$$ plain form
11770 64620940 64938694 64875072 65409662 65885463 66380344 66664015 66953078 67368461 67556748
11761 67556748 68053829 68487159 68821849 69011331 69095577 69422627 69803904 70072666 70462479
11752 70462479 70969679 70878589 70476566 69986528 69796657 69845317 69555731 69574691 69523009 69380131
11742 69380131 69268340 68851276 68113772 67218065 66716677 66482728 66116725 65638391 65340934
11733 65340934 64584902 63725629 62794968 61953324 61123169 60108777 59179884 58039980 57263567
11724 57263567 56184272 55018845 54021795 53386562 52707831 51878755 50990859 50095258 48959594
11715 48959594 47942336 47215829 46093558 45104554 44201662 43460942 42658817 41777195 40762182
11706 40762182 40193313 39460175 38561358 37874281 37124233 36420377 35545627 34425487 33465011
11697C3465011m50365o02173p74085q58228m67648m34819r05655o35432l79580
11688B7957026m01686m60945p26849o68951m54633n77997l16386m58574j55681
11679B3735324l81336n36741o77497m61747k99314k60667n49100o38019j76522
11670A9754381j35801o28355q01649j60074j82138k23061j76805j79699o0706
11661A7206093j3961k97469m08463l04401j67201m75403j13284k91837k40377
11652A4893697N9193J64659l10889m18575l31400m34725j68277L4082M8328k2743
11642A3513350m6604P5645J64385M906q9068K2750N5474k08498k81381k40348
11632A2970611j90557j70860m85808o1546o4076n78820k26942M9516K7739k08854
$$ plain form
11697 33465011 33014646 32412473 31638388 30780160 30312512 29877693 28972038 28336606 27957026
11688 27957026 27555340 27094395 26367546 25698595 25243962 24665965 24349579 23891005 23735324
11679 23735324 23353988 22817247 22139750 21678003 21378689 21118022 20568922 19930903 19754381
11670 19754381 19618580 18990225 18188576 18028502 17846364 17623303 17446498 17266799 17206093
11661 17206093 17192132 16894663 16486200 16181799 16014598 15539195 15425911 15134074 14893697
11652 14893697 14952890 15117549 14806660 14388085 14056685 13621960 13453683 13487765 13536093 13513350
11642 13513350 13466746 13542391 13706776 13711682 13622614 13645364 13700838 13492340 13210959 12970611
11632 12970611 12780054 12609194 12123386 12061840 11997764 11418944 11192002 11241518 11269257 11060403
11622A1060403k18643j37010j27896L6771k66965K11315k53869k54796m39344
11613I609966l25922J630J14874j55775l4429l8554J16816k95092l53839l24107
11603H315568Q0172K5011L0002N0508J58352o1349l82709K34389K39190j17392
11593H571742j47096p3437j79498j55708j21602l40371P0340J74070J12033P7030
11583G987503N5461q2477O6474j47564k03525k43391k36109K31779L4976q4065
11573G379062L19499J00774M1176k40035k05276m63750J57337K05502k79329j12610
11563F902350j44289q6065J10039j66377j46016K8055j8728l42263M1884N36841
11553F715431J34112K3495L6715M511l79262q8356M7859l16365l1632J00234k87510
$$ plain form
11622 11060403 10841760 10704750 10576854 10613625 10346660 10557975 10304106 10049310 9609966
11613 9609966 9284044 9285674 9400548 9244773 9210344 9171790 9288606 8993514 8639675 8315568
11603 8315568 8395740 8420751 8450753 8501261 8659613 8598264 8215555 8449944 8689134 8571742
11593 8571742 8424646 8351209 8171711 8016003 7894401 7554030 7624370 7798440 7910473 7987503
11583 7987503 8042964 7960487 8026961 7879397 7675872 7432481 7196372 7428151 7463127 7379062
11573 7379062 7698561 7799335 7840511 7600476 7395200 6931450 7088787 7294289 7014960 6902350
11563 6902350 6758061 6671996 6782035 6615658 6469642 6497697 6478969 6136706 6178590 6715431
11553 6715431 6849543 6873038 6909753 6914264 6535002 6446646 6494505 6178140 6146508 6246742 5959232
11542E959232j88213R4380j22747n0099r9722J0635j80850M6756K43441k84836
11532E427977l29026J77750L33504K53076o7053n6652J28064J01139k15439J03002
11522E856342j59523j00714l4171k65395J62643m9120j4689O42004K42555l13954
11512E965978k3016J21762J0706p8647J40953P4729l12744n8062J79239k22377
11502E798521k05050R3709J76972O1218o1497j41534J21397K16345J13526L05239
11492F478846q5341k64726j48346j67637j97042J09607j35038O3855Q883l43504
11482E319557j30568J55355K1453J57213J25459r7626m32471n5300J32617L37646
11472E533335K86683K32378k18410l62245j49758j56545p370j02222m22797J20024
$$ plain form
11542 5959232 5771019 5865399 5742652 5692553 5592831 5603466 5422616 5469372 5712813 5427977
11532 5427977 5098951 5276701 5610205 5863281 5796228 5739576 5867640 5968779 5753340 5856342
11522 5856342 5696819 5596105 5561934 5296539 5459182 5410062 5395373 6037377 6279932 5965978
11512 5965978 5942962 6064724 6075430 5996783 6137736 6212465 5899721 5841659 6020898 5798521
11502 5798521 5593471 5687180 5864152 5925370 5863873 5722339 5843736 6060081 6173607 6478846
11492 6478846 6393505 6128779 5980433 5812796 5615754 5725361 5590323 5654178 5663061 5319557
11482 5319557 5188989 5344344 5365797 5523010 5648469 5550843 5118372 5063072 5195689 5533335
11472 5533335 5820018 6052396 5833986 5471741 5321983 5165438 5158068 5055846 4633049 4753073
11462D753073K12051N6196J98411J71282K05691K6956k87090l52983k8736L17764
11452E272615j50157k31629j87779R0026p7532m8475J21730J41982l3027j26577
11442D771177K06319K52160k68286l55263r0390K98443J07513K17842j30669k06171
11432D802675K57861p9148k55331K33282J01811j39701M7927K17669K55881j53852
11422E289074j443M3750n7947m1131J66293l3625j69588N6530K35772N8425n73936
11411D972174J2286P4692K4566J11836O0563j77104Q2491K90311k39578K1015
11401E233252j53542M4578J79738M40860n7162k52602K6489K99644n9626l68864
11391E332765Q7861J12529q7986N6181n3150k35495k03894N7747L36480J20061
$$ plain form
11462 4753073 4965124 5021320 5219731 5391013 5596704 5623660 5336570 4983587 4954851 5272615
11452 5272615 5122458 4890829 4703050 4793076 4715544 4667069 4788799 4930781 4897754 4771177
11442 4771177 4977496 5229656 4961370 4606107 4515717 4814160 4921673 5139515 5008846 4802675
11432 4802675 5060536 4981388 4726057 4959339 5061150 4921449 4969376 5187045 5442926 5289074
11422 5289074 5287631 5331381 5273434 5232303 5398596 5364971 5195383 5251913 5487685 5546110 4972174
11411 4972174 4984460 5059152 5083718 5195554 5256117 5079013 5161504 5451815 5212237 5233252
11401 5233252 5079710 5124288 5304026 5744886 5687724 5435122 5461611 5761255 5701629 5332765
11391 5332765 5420626 5533155 5445169 5501350 5448200 5212705 5008811 5066558 5403038 5523099
11381E523099j35376N5023k44148O2061O83087J65013l65919k73851N7047K50694
11371E776730M06411O1297J83974Q6083j60149k10218J52651O5723k35436j72102
11361E954964L38309j8900k0079j33061J41924J59035k89519j90221M1600J75072
11351F159124L25914j8387j57590j08915J90027j08054J83417K09279K47248L33619
11341G255682k19850k64738j5682L58872K30068L1558k48434J8114j56643j72264
11331F816683N48187M55331J27571J15809k01188q4010n5604J89807K13488J03681
11321H229755p1972k31418J767J01373L6258j5309j93889p4108L85789L62227
11311H530473L11048j39076j82957M39940P8126k65020Q9216L79308L97883M05895
$$ plain form
11381 5523099 5387723 5442746 5198598 5260659 5943746 6108759 5742840 5468989 5526036 5776730
11371 5776730 6183141 6244438 6428412 6514495 6354346 6144128 6296779 6362502 6127066 5954964
11361 5954964 6293273 6274373 6254294 6121233 6263157 6422192 6132673 5942452 5984052 6159124
11351 6159124 6485038 6466651 6309061 6200146 6390173 6282119 6465536 6674815 6922063 7255682
11341 7255682 7035832 6771094 6755412 7114284 7344352 7375910 7127476 7145590 6988947 6816683
11331 6816683 7364870 7820201 7947772 8063581 7862393 7778383 7722779 7912586 8126074 8229755
11321 8229755 8157783 7926365 7928132 8029505 8065763 8050454 7856565 7782457 8168246 8530473
11311 8530473 8841521 8702445 8519488 8959428 9037554 8772534 8861750 9241058 9638941 10044836
11301A0044836K12181m7663j13482n8598L7078l02872O036K65447L47729K06694
11291A0597386J27660L28143o3511k45602K93647L71007N26256N15091J90150
11282A2640227N900n827K38271L83770k56302k72233J37345M65195M08163M00046
11272A4144555r1892O4863k26709J98835K51156L23827R1932K24614K78496N0212
11262A5309889J83311L93723J28624J55920M96740Q1767J2289N24111O47682k8818
11252A7905238O4392K41355M72803K97288L99241M45747M47409J13864K83904
11243B0671241N03716K58484o4636L73524M43915O22021P29480K37091K57198
11234B4032034M44205M62014J25323K13528N61489L49916K54526L29754J80979
$$ plain form
11301 10044836 10257017 10209354 10095872 10037274 10074352 9771480 9777516 10042963 10390692 10597386
11291 10597386 10725046 11053189 10989678 10744076 11037723 11408730 11934986 12450077 12640227
11282 12640227 12646127 12640300 12878571 13262341 13006039 12733806 12871151 13336346 13744509 14144555
11272 14144555 14052663 14117526 13890817 14089652 14340808 14664635 14756567 14981181 15259677 15309889
11262 15309889 15493200 15886923 16015547 16171467 16668207 16749974 16762263 17286374 17934056 17905238
11252 17905238 17969630 18210985 18683788 18981076 19380317 19826064 20273473 20387337 20671241
11243 20671241 21174957 21433441 21368805 21742329 22186244 22808265 23537745 23774836 24032034
11234 24032034 24476239 24938253 25063576 25277104 25838593 26188509 26443035 26772789 26953768
11225B6953768M01461O52741K89300L67834K41430N00248M55203N02783J76220
11216C0540988L24458O89904O86942J99085K05421M33883N16025N34906N32630
11207C4664242K16601M06382P12727M82207M30558L41322J19850L31572K86029
11198C7991490O00224N49780R1577J57142N73722N98589M43940N30090L61541
11189D1898095N02663M30632K26560K50346K70235K79984p514L21587L17929O15434
11179D5105951N61224J54510J44097M39945O32655J93223Q5018L07431K25199
11170D7849253N23720L05095K04777J69401L96758K16959K88797K74446j4613
11161E0214593K72786L43145M64341M02056J39963J55486L77234O5546m4666j15300
$$ plain form
11225 26953768 27355229 28007970 28297270 28665104 28906534 29406782 29861985 30364768 30540988
11216 30540988 30865446 31555350 32242292 32441377 32646798 33080681 33596706 34131612 34664242
11207 34664242 34880843 35287225 35999952 36482159 36912717 37254039 37373889 37705461 37991490
11198 37991490 38591714 39141494 39233071 39390213 39963935 40562524 41006464 41536554 41898095
11189 41898095 42400758 42831390 43057950 43308296 43578531 43858515 43851001 44172588 44490517 45105951
11179 45105951 45667175 45821685 45965782 46405727 47038382 47231605 47316623 47624054 47849253
11170 47849253 48372973 48678068 48882845 49052246 49449004 49665963 49954760 50229206 50214593
11161 50214593 50487379 50830524 51294865 51696921 51836884 51992370 52369604 52435150 52390484 52275184
11151E2275184M67669J60660j15561J73703R686K82315K23177J96148K40654p9781
11141E3833854N2247r1113R2446M7748K56638J39366o8824j3750K3551k0006J71386
11130E4423543k21808n9560k43662j93620K02510M28652j13665n18863q0878K88815
11120E3911464J04032J01506l19968l21479J27823K50349P1002m04596m93308
11111E3026825n35905m45202j97407k06702N306l72987l46450k33079j67043K3751
11101E0551107M5312l09822m72129k95031l08362j00678K07146K1675j62616k68403
11091D8908199l45156m46457l61405j70173l12350l10774n51941o71193n79585
11082D5159165l62637k41308j88210o8124j83894k00532k77463n55181l58398
$$ plain form
11151 52275184 52742853 52903513 52787952 52961655 52971341 53253656 53476833 53672981 53913635 53833854
11141 53833854 53886101 53794988 53887434 53935182 54191820 54331186 54262362 54248612 54272163 54252157 54423543
11130 54423543 54201735 54142175 53898513 53704893 53907403 54336055 54222390 53703527 53622649 53911464
11120 53911464 54015496 54117002 53797034 53475555 53603378 53853727 53924729 53520133 53026825
11111 53026825 52490920 52045718 51848311 51641609 51646915 51273928 50927478 50694399 50527356 50551107
11101 50551107 50596419 50286597 49814468 49519437 49211075 49110397 49317543 49339218 49176602 48908199
11091 48908199 48563043 48116586 47755181 47585008 47272658 46961884 46409943 45738750 45159165
11082 45159165 44796528 44555220 44367010 44298886 44114992 43914460 43636997 43081816 42723418
11073D2723418n00601l38681k66000l94335k81010l85902o65255l14533l97022
11064C9180079n94526n7176m79741k35044m15676n06380n11865K1001l16658n85126
11054C5498888k69382l32441j22071j96544m37861n86327m52714l45901q971l53499
11044C2393177m3303m14515n36187j86460n00368k64460m02665o08177k87628
11035B9149414j22420O5506j93424p8405k72399l00306m81868m62017k02821m52500
11025B6648760n13090k15588l52953n55j04600j66839l45566l07893m86883m83155
11015B3671638o06670m30032j23803j37491l81333P7961k08591n39646m77798
11006B0844235o57408n81346l94054l43643k55794l30496l86404k96285k17448
$$ plain form
11073 42723418 42222817 41884136 41618136 41223801 40942791 40556889 39891634 39577101 39180079
11064 39180079 38585553 38528377 38048636 37813592 37397916 36891536 36379671 36400672 36084014 35498888
11054 35498888 35229506 34897065 34774994 34578450 34140589 33554262 33101548 32755647 32746676 32393177
11044 32393177 32349874 31935359 31399172 31212712 30712344 30447884 30045219 29437042 29149414
11035 29149414 29026994 29092500 28899076 28820671 28548272 28247966 27766098 27304081 27101260 26648760
11025 26648760 26135670 25920082 25567129 25566574 25461974 25295135 24949569 24641676 24154793 23671638
11015 23671638 23064968 22634936 22511133 22373642 21992309 22070270 21861679 21322033 20844235
11006 20844235 20186827 19605481 19211427 18867784 18611990 18281494 17895090 17598805 17381357
10997A7381357o39503n37646o3602k93948m01540o70324j66817K4822j97358l4325
10987A4401116m11259m85642m87130n7997j66056l96731m62159m1819j7589k79962
10977A1594772k21394k18262p1454l53372m88103k72610l21046L8662O9080m62627
10967I293646p3994J2399p9071k24878n12671k33073J06306J12858j10472l4490
10957H256560J0285k68966m03241k79109k78078k19670n5126K3776J49991q6235
10947F850187j62885q8646j68990q0761K10305j27685j12179k61352j10559k3713
10937E923722l98335J1315j83987j90617M0397P3797J03774K67836l05408o73030
10927D669464R6890k87999m35768k68906K77900K74943k82310l38652J82051J20111
$$ plain form
10997 17381357 16741854 16204208 16140606 15846658 15445118 14774794 14607977 14632799 14435441 14401116
10987 14401116 13989857 13504215 13017085 12959088 12793032 12396301 11934142 11892323 11874734 11594772
10977 11594772 11373378 11155116 11083662 10730290 10242187 9969577 9648531 9687193 9756273 9293646
10967 9293646 9219652 9232051 9152980 8928102 8415431 8182358 8288664 8401522 8291050 8256560
10957 8256560 8266845 7997879 7594638 7315529 7037451 6817781 6762655 6786431 6936422 6850187
10947 6850187 6687302 6598656 6429666 6348905 6559210 6431525 6319346 6057994 5947435 5923722
10937 5923722 5525387 5536702 5352715 5162098 5202495 5276292 5380066 5647902 5342494 4669464
10927 4669464 4766354 4478355 4042587 3773681 4051581 4326524 4044214 3705562 3887613 4007724
10917D007724M23421k28399n38393K9662L86839K64427m00706j4107q5852j97907
10907C646709l32177j81055j24005K5239n0454l610K49960J89168l01977l30125
10897B787673r4977L76796M86700l28375l33746l09922p7856K32267Q7047j32232
10887B693375n8871n5329l06187j77438J77544N1536j0493j16328j87056J83109
10877B193862N6481J16943K56328m6982j1336j87146J5795K27498l6678o5262
10867B519503J25600M2635j09063j83889N9665j2489l54659K07384J87277n34104
10857A947860n7203J3855j1142J64147J52983J14417R4816r220j1639q3979l5039
10846B279856k03679j95456K5499r0453k03532j2203J65749j7796l68647n0172
$$ plain form
10917 4007724 4431145 4202746 3664353 3694015 4080854 4345281 3944575 3930468 3844616 3646709
10907 3646709 3314532 3133477 3009472 3034711 2984257 2980647 3230607 3419775 3117798 2787673
10897 2787673 2692696 3069492 3556192 3227817 2894071 2584149 2506293 2738560 2825607 2693375
10887 2693375 2634504 2579175 2272988 2095550 2273094 2324630 2314137 2197809 2010753 2193862
10877 2193862 2250343 2367286 2623614 2576632 2565296 2378150 2393945 2621443 2584765 2519503
10867 2519503 2645103 2687738 2578675 2394786 2454451 2441962 2087303 2294687 2481964 1947860
10857 1947860 1890657 1904512 1893370 2057517 2210500 2324917 2419733 2410513 2398874 2314895 2279856
10846 2279856 2076177 1880721 1906220 1815767 1612235 1600032 1765781 1747985 1379338 1329166
10836A329166Q6237R236M727N3987j00920j02558J27336M8951L21528K35965k61154
10825A752501n21439l22100K84811P9759k12325j20139L6003N2899j2250k90035
10815G27685k51941J94981L20043J28680p0203j56148J99602k3917l09120j72965
10805E86697O0935M63622K81897O7434n5766j04940k78259m1297N3987k65885
10795G68425l07793k07051J24381L42506R0262k45671J70162J55636j8302j81736
10785F90819j06533Q5649k88251N7720J67481j37662K20879K09973J202K18298
10775A119575j7891n5160j13315k39152J1937P4149k0828K81457N65907j12326
10765A494353l54125r8329O1113j17395j37796J09422k56276k43307L76557O7036
$$ plain form
10836 1329166 1415403 1424639 1429366 1483353 1382433 1279875 1407211 1456162 1777690 2013655 1752501
10825 1752501 1231062 908962 1193773 1273532 1061207 941068 977071 1029970 1017720 727685
10815 727685 475744 670725 990768 1119448 1049245 893097 1092699 1068782 759662 586697
10805 586697 647632 1111254 1393151 1460585 1404819 1299879 1021620 980323 1034310 768425
10795 768425 460632 253581 377962 720468 810730 565059 735221 890857 872555 690819
10785 690819 584286 669935 381684 439404 606885 469223 690102 900075 901277 1119575
10775 1119575 1101684 1046524 933209 694057 705994 780143 759315 1040772 1606679 1494353
10765 1494353 1140228 1041899 1103012 985617 847821 957243 700967 457660 834217 901253
10755I01253j51887K92704K79254K66831J3622N1949P3349l50181P5978M18463
10745A871335l35984l73170j32777j55237K94779j08090l18121J44025L73771
10736A260531P5313n8111j3841L29937n6075j98172o080Q7752k89582l00535r873
10725H21264k92852J16411K73861j4959Q1105R3926Q6132K87742J97646l4116
10715A616160M4437K39376j55809o45253q7898K19695n061p0212M4397q8024M3769
10704A155577R8870J27172l29186j26861K53072J17838q6122j1242r0640p1874
10694A036604r4805J26524P3960l90997j8818k48237J59982q8515m5054J58772
10684F69416M48564L0742l57936K71455L05551m0184o5766l9490l44312R3163
$$ plain form
10755 901253 749366 1042070 1321324 1588155 1601777 1653726 1727075 1376894 1452872 1871335
10745 1871335 1535351 1162181 1029404 874167 1168946 1060856 742735 886760 1260531
10736 1260531 1335844 1277733 1263892 1593829 1537754 1339582 1333502 1421254 1131672 831137 821264
10725 821264 528412 644823 918684 903725 984830 1078756 1164888 1452630 1650276 1616160
10715 1616160 1660597 1899973 1744164 1098911 1011013 1230708 1225647 1155435 1199832 1111808 1155577
10704 1155577 1254447 1381619 1052433 925572 1178644 1296482 1210360 1199118 1108478 1036604
10694 1036604 941799 1068323 1142283 751286 732468 484231 644213 555698 510644 669416
10684 669416 1117980 1148722 790786 1062241 1367792 1327608 1261842 1222352 878040 971203
10674I71203J33129j10425J52496j08153R8189K18868k65892j48554j2322J96096
10664A124635J68852M03265J58357k3825l02035j04554P6021j77628k69263j6294
10654A037531K15558K94368J85366k808L86657K54457l6050l0536L2296k54477
10644B082362J511J16371J25979L57865M00332K5057J06819J09598N5323L05380
10634C686597N74012O62617R15954O84020O42335P72908N86522O75145J356189
10625A0556299J512869J610357K087924L049791M307668N897710Q237966J1097366
10617D8357950J4899201J8980360K2069942K1445884J5360420O207871j138709
10610A46182919m589055l986061j45245O232563J4888221K4738190L5879215M3391517
$$ plain form
10674 971203 1104332 993907 1146403 1038250 1136439 1355307 1089415 940861 928539 1124635
10664 1124635 1293487 1696752 1855109 1831284 1529249 1424695 1500716 1323088 1053825 1037531
10654 1037531 1253089 1547457 1732823 1730015 2116672 2371129 2335079 2304543 2336839 2082362
10644 2082362 2083873 2200244 2326223 2684088 3084420 3109477 3216296 3325894 3381217 3686597
10634 3686597 4260609 4923226 5839180 6523200 7165535 7938443 8524965 9200110 10556299
10625 10556299 12069168 13679525 15767449 18817240 23124908 29022618 37260584 48357950
10617 48357950 63257151 82237511 104307453 125753337 141113757 147321628 146182919
10610 146182919 141593864 137607803 137462558 143695121 158583342 183321532 219200747 262592264
10602B62592264M0429687K3619205O76543j6438886k2387722j9598617j1637588
10595B57254886j04729J4559627L0501167M5609163N4058492M5849114J8048753
10588D65776473j6558573l9875226m6568937m1878768l1576192j8262411m453397
10581B66602969R133346K1146350K6251679J9094183j038178k3668858l6722267
10574B80799224l8724918l3822512k6139877j7020804r127641k401874L021735
10567A56583333M684013J179766o476121j4903211j9902872k0517022j8496861
10560H2151025j5701110j2330078r570324p977571o045255m454426l431591k725848
10552A9914822k561918j858662j458487j572252j179622r21592n28660o79849
$$ plain form
10602 262592264 303021951 326641156 327317699 310878813 288491091 268892474 257254886
10595 257254886 257150157 271709784 302210951 347820114 401878606 447727720 465776473
10588 465776473 449217900 409342674 362773737 320894969 289318777 271056366 266602969
10581 266602969 275736315 296882665 323134344 342228527 341190349 317521491 280799224
10574 280799224 242074306 208251794 182111917 165091113 155963472 153561598 156583333
10567 156583333 161267346 162447112 155970991 141067780 121164908 100647886 82151025
10560 82151025 66449915 54119837 44549513 36571942 30526687 26072261 22640670 19914822
10552 19914822 17352904 15494242 14035755 12463503 11283881 10362289 9833629 9153780
10544I153780p86309m95374n16000o50066l86595m93302n99532l72165l0204k05990
10534D618243p9061j07999j53697j53753k97259l44109P1699k16613M750K58067
10524C600268k76352k09202l58050k40536j22450j51215q657N7905n2714J10141
10514B349138L3092P3824L06730q9585j05618R9302j0529L4365J31063m95509
10504B326273k67755j04732j32002L7698K57661p7081k74315l91474n0316K03889
10494A527846L77213j43918k27790q6595M4329j16689J87154M6062k24987Q2457
10484A465082K6558n5208K17812J89590r1592L3229r5250j20112L23335J92464
10474B085908Q8368k02037m17405M6429K60809K40971k07309r542J23281q9002
$$ plain form
10544 9153780 8367471 7872097 7356097 6706031 6319436 5826134 5226602 4854437 4824233 4618243
10534 4618243 4539182 4431183 4277486 4123733 3826474 3482365 3554064 3337451 3342201 3600268
10524 3600268 3323916 3114714 2756664 2516128 2393678 2242463 2233806 2291711 2238997 2349138
10514 2349138 2382230 2456054 2762784 2673199 2567581 2666883 2656354 2690719 2821782 2326273
10504 2326273 2058518 1953786 1821784 1859482 2117143 2040062 1765747 1374273 1323957 1527846
10494 1527846 1905059 1761141 1533351 1446756 1491085 1374396 1561550 1607612 1382625 1465082
10484 1465082 1491640 1436432 1654244 1843834 1752242 1785471 1690221 1570109 1893444 2085908
10474 2085908 2174276 1972239 1554834 1601263 1862072 2103043 1895734 1886192 2009473 1920471
10464A920471k5531k11922o7079j66398p6806L80007P2310j22984r779K08634
10454A900923R033r2572j61964J35674J24097o9224l75653m79893N9497P0728
10444A120646P9286j77008K5684j854K41116p5794l14431j70184J53384P274k59849
10433F28270j54984m4374P5071K6306J94808K77654R4345l2883j13866M5019J31507
10422A126873k26195J4508k7925j18855p6102J53223o1572j28703R0020L1882
10412G77154P6533J34749K48611j87137j17638L3207q5742j90418k06465K23225
10402G06079j73785j00234K98742J15432J7849J35471J02474o6121n4410k5181
10392I56316p7296N0223L6470k77872j85140j38194P9672K82536N4302O7405K16864
$$ plain form
10464 1920471 1894940 1683018 1615939 1449541 1372735 1752742 1825052 1702068 1692289 1900923
10454 1900923 1909956 1817384 1655420 1791094 1915191 1845967 1470314 990421 1049918 1120646
10444 1120646 1199932 1022924 1048608 1046754 1287870 1212076 897645 727461 880845 888119 628270
10433 628270 473286 428912 503983 530289 725097 1002751 1097096 1064213 950347 995366 1126873
10422 1126873 900678 915186 887261 768406 692304 845527 783955 655252 745272 777154
10412 777154 853687 988436 1237047 1049910 932272 965479 879737 689319 482854 706079
10402 706079 532294 432060 730802 846234 864083 999554 1102028 1035907 981497 956316
10392 956316 879020 929243 965713 687841 502701 364507 444179 726715 781017 848422 1065286
10381A065286O55k6916j58608K20933q2643j76330L8050Q2745K82606n5644Q0381
10370A270515K59271j31903K35155j91489k72908J17705J54555J75557k07686
10361A408772O5874l4139j11901j64827k29531j31176J57568J31299R3405R1440
10351A276784m8159n4666q3765K5015K40140p2312k76319l21221P5814Q1975K7426
10340H70712p220J4600K39653p7407l81504k58266j25710P3429K98002K93327
10330I39616K00875j36918J16234J23546k58157j87763J55996L23213p9464l21995
10320H75183k60981k42302J35947J56436Q2834K29856j39319k63430k57160p9607
10310B37457L68140K40192r143q8912l2768K5574j61994O2912J2269K0403j09060
$$ plain form
10381 1065286 1065941 1039025 880417 1101350 1018707 842377 880427 963172 1245778 1190134 1270515
10370 1270515 1529786 1397883 1633038 1441549 1168641 1286346 1440901 1616458 1408772
10361 1408772 1474646 1440507 1328606 1163779 934248 803072 960640 1091939 1185344 1276784
10351 1276784 1228625 1173959 1090194 1115209 1355349 1283037 1006718 685497 761311 843286 870712
10340 870712 863492 878092 1117745 1040338 658834 400568 274858 348287 646289 939616
10330 939616 1140491 1003573 1119807 1243353 985196 797433 953429 1276642 1197178 875183
10320 875183 614202 371900 507847 664283 747117 976973 837654 574224 317064 237457
10310 237457 605597 845789 836646 747734 714966 740540 578546 641458 653727 674130 565070
10299E65070q0028K65028m18919l18159J39331Q4859K8717j06756j26704j99730
10289a67291l8446L37271K56328j80801l3438J02674p5191k86704R3426K23524
10279B31352N39990J7598j15605K35112O9256l34772k02108J10920J34007J66067
10269H51817J81818j89282l98426N7652J17632j81784m2435K6567k5494L69449
10259G67514l45202j41768K3727j09317o4757K15533J15650k21480o155q1669
10249A52076o3237j9639J28411M07191l9694p592o7344K37512J31038l59511n7522
10238D41689K14058p1658j62161K34140J21021J40287J97925j25450j80810l75631
10228D33410k8240K58805K17285j48409k81990l42497K88850J76386j60077P4701
$$ plain form
10299 565070 485042 750070 331151 12992 152323 237182 265899 159143 32439 -167291
10289 -167291 -205737 131534 387862 207061 173623 276297 201106 -85598 7828 231352
10279 231352 771342 788940 673335 908447 977703 642931 440823 551743 685750 851817
10269 851817 1033635 844353 445927 503579 621211 439427 396992 423559 398065 767514
10259 767514 422312 280544 304271 194954 130197 345730 461380 239900 233745 152076
10249 152076 88839 69200 197611 604802 565108 557516 490172 727684 858722 499211 441689
10238 441689 655747 584089 421928 656068 777089 917376 1115301 989851 809041 433410
10228 433410 405170 663975 881260 732851 450861 108364 397214 573600 413523 488224
10218D88224J27480k14941j29129q6894L6198k8794j84054k30668l66903J32845
10208d56636L54234K61863J19465j14794j49151n2626K57749K98487r82J43438
10198F61047k47971j32043k84503Q908l69335J13857L74716K39854P4444l01058
10188A37916n6281J08162L1765R9778K76119p3218p0025L47745L62020J14892
10178A278873O3893K76025J06192R3479p7236k42302l92021K57932M64084j42122
10168A686797K144j62932n7124L64422K70222m8650l97212k16131j08222K16371
10158A549685J27934O1955J55628M18466L89204J61437k24833l91515j30878k49822
10148A867261j13489O0071j25727r1806j32385r0380J20479K48428L06260Q9425
$$ plain form
10218 488224 615704 400763 271634 184740 220938 192144 8090 -222578 -589481 -456636
10208 -456636 -102402 159461 278926 164132 14981 -37645 220104 518591 517609 661047
10198 661047 413076 281033 -3470 5438 -363897 -250040 124676 364530 438974 137916
10188 137916 81635 189797 221562 321340 597459 524241 454216 801961 1163981 1278873
10178 1278873 1342766 1618791 1724983 1818462 1741226 1498924 1106903 1364835 1828919 1686797
10168 1686797 1688941 1526009 1468885 1833307 2103529 2054879 1657667 1441536 1333314 1549685
10158 1549685 1677619 1739574 1895202 2313668 2702872 2864309 2639476 2247961 2117083 1867261
10148 1867261 1753772 1813843 1688116 1596310 1463925 1373545 1494024 1742452 2048712 2138137
10138B138137m55825n10345J7435L3630j58747r4865N9250k67572j86594J89378
10128G63882K30523m4972J23087r2960l06078j00562L95999P7004m10863k28262
10118D06798J60879K07210m39298l06209j32105j96446K49519k0960J62122J90566
10108B82076J60789K61773k9797O0690J2866j13920P5250q7934r2753k28262J11696
10097D12474N802k83478k6229n7925K316M9189k01547J44145p5325j73982L9213
10086a65347N5509p5604L30638K64016J04107j30624k08377q3320J2183M6981
10076A50162J02414K19428j18724m7246l32644r4083K72070K81960K605p3868
10066C62074l5823k66832P8991l8123l40272k67978K68482K54851L58190Q0008
$$ plain form
10138 2138137 1682312 1171967 1189402 1223032 1064285 969420 1028670 761098 574504 763882
10128 763882 994405 949433 1072520 979560 673482 572920 968919 1045923 635060 406798
10118 406798 567677 774887 335589 29380 -102725 -299171 -49652 -70612 91510 282076
10108 282076 442865 704638 674841 735531 748397 634477 709727 621793 529040 300778 412474
10097 412474 418276 134798 108569 50644 52960 102149 -99398 44747 -30578 -204560 -165347
10086 -165347 -109838 -185442 145196 409212 513319 382695 174318 90998 103181 150162
10076 150162 252576 472004 353280 306034 -26610 -120693 151377 433337 435942 362074
10066 362074 326251 59419 138410 100287 -239985 -507963 -239481 15370 373560 453568
10056D53568N5713r1939j4839j35354j47862j47237Q9029o9557j98508p8792L40604
10045E4826N06687j28549M2772M5787q643j18561k31688j55079o1834k66908K64628
10034e6562L22970j56944m8712J55182L38375P6727j61840k16692J09054J85286
10024E46844K97160N5688l19176p7946L8564k2139k26679j29018l31530M8613
10014a19619Q0730K43807J83557J6936O9637L1034j02099j06766q3241m4079j40933
10003B8964p9507M4171P881J56035L1847p4646J11841K47677j42425j26831j70223
9992C4784J21933j5873n8803N0918K9809K83002J57151j68790K36743n633r3925
9981E71316j59076j49133k46879j72135J58388p0727j55972n0052J99764L00319
$$ plain form
10056 453568 509281 417342 402503 267149 119287 -27950 61079 -8478 -206986 -285778 54826
10045 54826 561513 432964 475736 521523 512880 394319 162631 7552 -54282 -321190 -56562
10034 -56562 266408 109464 60752 215934 554309 631036 469196 252504 361558 546844
10024 546844 844004 899692 580516 502570 541134 518995 292316 163298 -168232 -119619
10014 -119619 -38889 204918 388475 405411 475048 506082 403983 297217 213976 169897 28964
10003 28964 -50543 -6372 1509 157544 189391 114745 226586 474263 331838 205007 34784
9992 34784 156717 140844 82041 132959 162768 445770 602921 434131 670874 665241 571316
9981 571316 412240 263107 16228 -155907 2481 -68246 -224218 -274270 -74506 225813
9971B25813k30r9314J10345M7055R2638O6791k58719k15446K48648P4151o4091
9960B27641j67359k09876K05334N4114n8960l02026m8725J61938J26422j14812
9950a26309M6507Q6552R5118m03371J16834n7977n2683M24041J48852R9484l10797
9939F6251l4560M23717j6262j64559K78074j68842M0519L23935j30650J6974P41042
9928A375639O50865p3788k64599l10684k8035O808K22129J3482K72307Q45002
9918B709126J137542J000353J073981m9787j244053j305907j202954o15496k46778
9909A256027m1896L0154k21413k4950k01405K2638J43883J87652k8109P2711j67904
9898A027388j57630J06086j43642j88190K2475n1911j2254J99026j54741k64734
$$ plain form
9971 225813 225583 126269 236614 283669 376307 443098 184379 -31067 217581 291732 227641
9960 227641 60282 -149594 55740 109854 50894 -251132 -299857 -137919 -11497 -126309
9950 -126309 -79802 6750 101868 -301503 -184669 -242646 -295329 128712 277564 377048 66251
9939 66251 31691 455408 439146 274587 552661 383819 424338 748273 617623 634597 1375639
9928 1375639 2026504 1952716 1688117 1377433 1349398 1356206 1578335 1591817 1864124 2709126
9918 2709126 3846668 4847021 5921002 5871215 4627162 3321255 2118301 1502805 1256027
9909 1256027 1214131 1244285 1022872 997922 796517 819155 963038 1150690 1122581 1195292 1027388
9898 1027388 869758 975844 832202 644012 666487 614576 602322 801348 646607 381873
9888C81873J59663J88473J46037R9247N6855k22041j5446K75433L1572j22578
9878I79088J92205J71131J56798l22975j72494q1919J14735J696J61211M34262
9868A633738J36175q9635l56904k39035J56434L78451n7680p8801p5557k03258
9858A203928l49833K5592k9037Q5310L82803J74590M2670K30211M8075j65176
9848A649133l06067n06886l99320K58710M36875K58659P1965j1241k9783j63273
9838A258772l52859M08172P0518k38403J42968J97317j50469k17505o0405K59519
9828A317625J34492K1789j06884k66512K50467K38730J97794K62364l76477r8090
9818A575298l44565n05060j91787L43239K04171k1870K97108K88201k66334k81755
$$ plain form
9888 381873 541536 730009 876046 975293 1032148 810107 794661 1070094 1101666 979088
9878 979088 1171293 1342424 1499222 1176247 1003753 921834 1036569 1038265 1199476 1633738
9868 1633738 1769913 1680278 1323374 1084339 1240773 1619224 1561544 1482743 1407186 1203928
9858 1203928 854095 879687 850650 935960 1318763 1493353 1536023 1766234 1814309 1649133
9848 1649133 1343066 836180 436860 695570 1132445 1391104 1463069 1451828 1422045 1258772
9838 1258772 905913 1314085 1384603 1146200 1289168 1486485 1336016 1118511 1058106 1317625
9828 1317625 1452117 1473906 1367022 1100510 1350977 1589707 1787501 2049865 1673388 1575298
9818 1575298 1230733 725673 533886 877125 1081296 1059426 1356534 1644735 1378401 1096646
9808A096646m868M06888j71815M9004J09118O9306q6865J41548J56995j89601
9798A576356K4001J89024p120O7725o5414l80673l23135k50569j82607K60146
9788I07734K99487K04074m19179k67477p8835J78464K72315K9693j20994J36478
9778A141760L38810P7860J8286n6349l09643j40491J73608k52367j47783N80985
9768A424676L73586j53210j39890m02846j91243k7098J34555M5359m6389k63512
9758G53988k04649M21763R3465j86661K9739k9579j58055L1914q1149J17875o7842
9747G20809l2296p6518L05138P3505N99K28600R1817k8362j70258r0417j82707
9736H39910m1695k60481m3206n0182j05976J3201o0371o1446K23196K21605k5118
$$ plain form
9808 1096646 1091778 1498666 1326851 1375855 1484973 1554279 1467414 1608962 1765957 1576356
9798 1576356 1600357 1789381 1782261 1849986 1784572 1403899 1080764 830195 647588 907734
9788 907734 1207221 1411295 992116 724639 645804 824268 1096583 1126276 1005282 1141760
9778 1141760 1480570 1558430 1576716 1520367 1210724 1070233 1243841 991474 843691 1424676
9768 1424676 1798262 1645052 1505162 1102316 911073 883975 1018530 1063889 1017500 753988
9758 753988 549339 971102 1064567 877906 907645 878066 720011 751925 670776 788651 720809
9747 720809 688513 611995 917133 990638 991237 1219837 1311654 1283292 1113034 1022617 839910
9736 839910 798215 537734 494528 444346 338370 351571 291200 229754 452950 674555 649437
9725F49437J30510R3618K86944R7745j73249Q4044K55033J3037r1814o62011j71511
9714E11783j33647P7289j59084j11947L45117K56420L46287J66918r4037k12442
9704I92657N2343j09178k11145k2139J07313k68681J8603M14003l6416k68878
9694F68482l40914k7659J3383j57468K17826j53071J64147L09494L2401l7053
9684F89568M1492L877K3072j34652R750J16945P7357n4395J93968O6611J44633
9673A178226o9191N8081O7835q8299R5673n8062k25252l01728K40114P3755n6848
9662I14304k3298q4447O2462J23728J89030n691R5111J0549Q5059L63214N56971
9651B286992J062215R90018M58901j44216m64325m26045o92096p09652j72630
$$ plain form
9725 649437 779947 873565 1160509 1258254 1085005 1169049 1424082 1437119 1345305 683294 511783
9714 511783 378136 455425 296341 184394 529511 785931 1132218 1299136 1205099 992657
9704 992657 1045000 935822 724677 702538 809851 541170 559773 973776 937360 668482
9694 668482 327568 299909 313292 155824 373650 220579 384726 694220 726621 689568
9684 689568 731060 734937 758009 623357 633107 750052 827409 773014 966982 1033593 1178226
9673 1178226 1109035 1167116 1234951 1146652 1242325 1184263 959011 657283 897397 971152 914304
9662 914304 891006 806559 869021 992749 1181779 1176088 1271199 1281748 1366807 1730021 2286992
9651 2286992 3349207 4339225 4798126 4653910 4189585 3763540 3071444 2361792 2189162
9642B189162J4411J38485j69126M0521J83557J06664k14933Q7626o463n66498
9632A803406l07479J32442Q907L25787L31616q2409N0530J03596p8795N1550P047
9621B346198q6773k17567J17593K73646M45456K27900j62915q6612q0076o0319
9611B716531l4580R8184j8924j04315k3298K51004j16052K38671N22576J1445
9601C541242k43544J74110J36898j25263J92583q969K21556J67762J58438J11227
9591D326040o6290m00791M29K00172L64811j41843J84211m842P821o6003L20429
9580D724144n1182R7026Q1426j93417L3839N58582M04941n0040Q4498k23093Q3347
9569E550071K19821M45465J213K62818K10203j407N5663M99046K77644j87512
$$ plain form
9642 2189162 2203573 2342058 2172932 2213453 2397010 2503674 2288741 2376367 2369904 1803406
9632 1803406 1495927 1628369 1637276 1963063 2294679 2212270 2262800 2366396 2287601 2339151 2346198
9621 2346198 2259425 2041858 2159451 2433097 2878553 3106453 2943538 2856926 2776850 2716531
9611 2716531 2681951 2780135 2761211 2656896 2633598 2884602 2768550 3007221 3529797 3541242
9601 3541242 3297698 3471808 3608706 3483443 3676026 3667057 3888613 4056375 4214813 4326040
9591 4326040 4259750 3858959 3859388 4059560 4424371 4282528 4466739 4461897 4469718 4403715 4724144
9580 4724144 4672962 4769988 4851414 4657997 4691836 5250418 5655359 5605319 5689817 5466724 5550071
9569 5550071 5769892 6215357 6216570 6479388 6689591 6688184 6743847 7242893 7520537 7333025
9559G333025J71517M9422K30724K36654J39158Q4280M0629j79236J15205K47927
9549H469305J69973L06285N84644K81282k56128Q4203M14211L40695K27321L22056
9539A0943847K42792M18549N27744J24419M37998N37391J82469P26332M91451
9530A4632992L27417P22212Q57615O78737Q82360N58790Q10111M52452P26846
9521B0649532N15728L18137J208764J166258J157439J214800Q51128R84184R69610
9512B9035580J423140J276554Q18967J466360J046508J213503J259288J186894
9504C8726794J338229J339922R98661J072755J417309J549701J311114J606359
9496D9360844J367527J393065J320294J266465J614543K267233K074899J695895
$$ plain form
9559 7333025 7504542 7553964 7784688 8021342 8160500 8244780 8285409 8106173 8221378 8469305
9549 8469305 8639278 8945563 9530207 9811489 9555361 9639564 10053775 10394470 10621791 10943847
9539 10943847 11186639 11605188 12132932 12257351 12695349 13232740 13415209 14141541 14632992
9530 14632992 14960409 15682621 16540236 17218973 18101333 18660123 19470234 19922686 20649532
9521 20649532 21165260 21483397 22692161 23858419 25015858 26230658 27081786 28065970 29035580
9512 29035580 30458720 31735274 32554241 34020601 35067109 36280612 37539900 38726794
9504 38726794 40065023 41404945 42403606 43476361 44893670 46443371 47754485 49360844
9496 49360844 50728371 52121436 53441730 54708195 56322738 58589971 60664870 62360765
9488F2360765J717369K008396J833280J622133K519986K768805K337207K386740
9480G9554681K577602K534476K574748K742426L229526L373060L441915L573282
9472A03601716L913911L912136M090861M016753L779516L600028L783047L506714
9464A34204682L459475L747567L308832K605016K650282K166073K114254J834474
9456A56090655J188825J049733Q57116O55009N81951N99226N57415L30439J034212
9447A62944581J273934J306532J800347K569593K621893L164575L638170L788391
9439A83108016M208503N019499N109156M958505N319092N554893N767114N505069
9431B24549847N233750M698308M164692L513058K629375J523272q7866p48952
$$ plain form
9488 62360765 64078134 66086530 67919810 69541943 72061929 74830734 77167941 79554681
9480 79554681 82132283 84666759 87241507 89983933 93213459 96586519 100028434 103601716
9472 103601716 107515627 111427763 115518624 119535377 123314893 126914921 130697968 134204682
9464 134204682 137664157 141411724 144720556 147325572 149975854 152141927 154256181 156090655
9456 156090655 157279480 158329213 159186329 159841338 160423289 161022515 161579930 161910369 162944581
9447 162944581 164218515 165525047 167325394 169894987 172516880 175681455 179319625 183108016
9439 183108016 187316519 192336018 197445174 202403679 207722771 213277664 219044778 224549847
9431 224549847 229783597 234481905 238646597 242159655 244789030 246312302 246224436 245475484
9423B45475484j225215k214475k872987l611216m301833m907190m683317m988817
9415B16670434m438122m381857l775173l213520k994645k929790k229019j675016
9407A91033292j314734o70242n61709o28927M6384M38400L94822J14769L20285
9398A89172340R6294l06616O7112r2983r54110j076250j589591j680843k222066
9389A81413287k483312k682035l416920l484436l430489l833380m041264l956044
9381A54085407l847161l968688l778480l462682l366329l552105l588643l166447
9373A25354872l055053k907315k982169k667718k531935k660455k501572k404348
9365A03644307k285288j990612k223532k037676j543637j618703j900485j769869
$$ plain form
9423 245475484 244250269 242035794 239162807 235551591 231249758 226342568 221659251 216670434
9415 216670434 212232312 207850455 204075282 200861762 197867117 194937327 192708308 191033292
9407 191033292 189718558 189048316 188486607 187857680 187904064 188342464 188737286 188852055 189172340
9398 189172340 189268634 188962018 189029130 188936147 187982037 186905787 185316196 183635353 181413287
9389 181413287 178929975 176247940 172831020 169346584 165916095 162082715 158041451 154085407
9381 154085407 150238246 146269558 142491078 139028396 135662067 132109962 128521319 125354872
9373 125354872 122299819 119392504 116410335 113742617 111210682 108550227 106048655 103644307
9365 103644307 101359019 99368407 97144875 95107199 93563562 91944859 90044374 88274505
9357H8274505j934759j826193j547035j489399j696822j842741k080541j699977
9349G4157038j732310j939345j655296j517895j443730j203469j760603j625619
9341F1278771j535126j563609j518510j468645j506447j318301j176094j187505
9333E0004534j196652j049788o06137j029709r50886o36064r11632p86714n05465
9324D2331487q51437j100262m23082l24189j87588o6223n62234o81430l81560
9315C7753482l06827n06671n78872j79463k76927k19261m78524j26988J8662k55295
9305C4843316k41304j03268k59082m6882j91888r1339j292j69975j9801J73082
9295C3891567O9789L02207J66472j2976o000p8231J8172L47807M44057J07622
$$ plain form
9357 88274505 86339746 84513553 82966518 81477119 79780297 77937556 75857015 74157038
9349 74157038 72424728 70485383 68830087 67312192 65868462 64664993 62904390 61278771
9341 61278771 59743645 58180036 56661526 55192881 53686434 52368133 51192039 50004534
9333 50004534 48807882 47758094 47151957 46122248 45171362 44535298 43623666 42836952 42331487
9324 42331487 41480050 40379788 39956706 39632517 39444929 39378706 38816472 38135042 37753482
9315 37753482 37446655 36939984 36361112 36181649 35904722 35685461 35206937 35079949 35098611 34843316
9305 34843316 34602012 34498744 34239662 34192780 34000892 33909553 33908261 33738286 33718485 33891567
9295 33891567 33961356 34263563 34430035 34417059 34411059 34332828 34351000 34698807 35142864 35250486
9285C5250486m00360q4986L61079K15735k13729k70309L23912K3016j10039J87550
9275C5282355L11982N8629k3468n8651J36788N2379O5382K02141k7441J85977
9265C6186073M40665L6711J11334L64838J07941p5326L34993K41277j49106j96938
9255C7402462k5305J62561j35133k38437P6646l8403N3012K82646p2255Q6761
9245C7554555q7005k50531J55468k02472k2739n8933n49285j41779L684j33119
9235C6267844n93349l08772j34796m88103k90726J5180J06903l23844p52821m62827
9225C3034689m64635j98911m41966k26847k47878l07507j55372l56118p50790
9216B9884665o32527n53407l25933k34633m07957m86120n34513n47102l48832
$$ plain form
9285 35250486 34850126 34765140 35126219 35341954 35128225 34857916 35181828 35204844 35094805 35282355
9275 35282355 35594337 35652966 35629498 35570847 35707635 35760014 35825396 36027537 36000096 36186073
9265 36186073 36626738 36663449 36774783 37139621 37247562 37172236 37507229 37748506 37599400 37402462
9255 37402462 37377157 37539718 37404585 37166148 37242794 37204391 37257403 37540049 37467794 37554555
9245 37554555 37467550 37217019 37372487 37170015 37147276 37088343 36539058 36397279 36400963 36267844
9235 36267844 35674495 35365723 35230927 34742824 34452098 34467278 34574181 34250337 33497516 33034689
9225 33034689 32570054 32371143 31929177 31702330 31454452 31146945 30991573 30635455 29884665
9216 29884665 29252138 28698731 28372798 28138165 27730208 27244088 26709575 26162473 25813641
9207B5813641k49978n78387q08423k01493p948l60671n09119m78837o42506n52817
9197B1423462k36011j42660n25297q52279j75370k9671j33064K96811m45962r51190
9187A8228769l74634j15853n5784k57555l51353m49556l49878k77851m4220m00574
9177A5551511n27528l14620l03524m91202k85146j96277k02670j88957k12646
9168A2828941P4474K06562K12610k16602l41097k63897p1301m1912j02884m07259
9158A1877635j60946m583O1181K60907R7853J30476Q60850J956400K864687K911410
9148B0855870P02493m55994j823022k681146k519169j578816j063656p59880m23758
9139A0252922m21874k18717Q9514j28161k40100k44050k38574k46620l53876k22997
$$ plain form
9207 25813641 25563663 24985276 24176853 23975360 23967412 23606741 23097622 22618785 21976279 21423462
9197 21423462 21187451 21044791 20519494 19667215 19491845 19462174 19329110 19625921 19179959 18228769
9187 18228769 17854135 17738282 17682498 17424943 17073590 16624034 16274156 15996305 15952085 15551511
9177 15551511 15023983 14709363 14405839 13914637 13629491 13433214 13230544 13041587 12828941
9168 12828941 12903415 13109977 13322587 13105985 12764888 12500991 12429690 12387778 12284894 11877635
9158 11877635 11716689 11712106 11773287 12034194 12132047 12262523 13123373 15079773 17944460 20855870
9148 20855870 21558363 21102369 19279347 16598201 14079032 12500216 11436560 10676680 10252922
9139 10252922 9831048 9612331 9701845 9573684 9333584 9089534 8850960 8604340 8250464 8027467
9129H027467l32066k07557j27741Q0447L55107o7029m13922k95606k41736o7527
9119F709837K77283R0404R892K17611l32585k03772r5523M014m2156J68159Q3477
9108F886641j05137k48871k67028r7310J14912l2913K43826Q7029j21757l5478
9098F423914J82736r8695j20098K3969K9840M2594M0977K15903k06729m40724
9088F093687J09776J59147k46243m3945l22077R9698o0036J3149J87728o2948
9078E927936o6004o7471j573l34830k96778O0269K64817j62483m3119k1500Q5440
9067E344704j25624P8172j95294j28330j11290K76501L12425J93736L46421j01280
9057E890141l73932l06582l73348J42989J6726J47623M86020J74178J30541J10485
$$ plain form
9129 8027467 7695401 7487844 7360103 7440550 7795657 7728628 7314706 7019100 6777364 6709837
9119 6709837 6987120 7077524 7087416 7305027 6972442 6768670 6673147 6677161 6635005 6803164 6886641
9108 6886641 6781504 6532633 6265605 6168295 6283207 6250294 6494120 6581149 6459392 6423914
9098 6423914 6606650 6507955 6387857 6411826 6441666 6484260 6525237 6741140 6534411 6093687
9088 6093687 6203463 6362610 6116367 6072422 5750345 5850043 5790007 5803156 5990884 5927936
9078 5927936 5861932 5794461 5792888 5458058 5161280 5221549 5486366 5323883 5280764 5259264 5344704
9067 5344704 5219080 5297252 5101958 4973628 4862338 5138839 5451264 5645000 5991421 5890141
9057 5890141 5516209 5209627 4836279 4979268 4995994 5143617 5629637 5803815 5934356 6044841
9047F044841j52650K032k05718j27597J8630O7609j0459K54756j49298j70382
9037E571764J36641k36288J16869J62546j64443k7518R7990k68549P8376O2401
9027E529789J97185j2068q088m9461O5762M9217O239j46294J9929K6785j3494
9016E665501J14732K76429K10935J30202j52450j41227O5866l51864o1026J95364
9006E952462j6057J62853L31076n49457l13525j96727J10099M11087K53125r2593
8996F052343j06681k21626k21007j69052R5999J81513j0564q6842k35523K77869
8986E556429J69926p7795r3444j02030J74214k4945k37294l52366j01662K94763
8976E205796J29332K65916R8424L10979Q0088K12291q8210j33371k33436k85057
$$ plain form
9047 6044841 5892191 5894223 5688505 5560908 5579538 5647147 5636688 5891444 5742146 5571764
9037 5571764 5708405 5472117 5588986 5751532 5587089 5559571 5657561 5389012 5467388 5529789
9027 5529789 5726974 5714906 5706818 5657357 5723119 5772336 5778575 5632281 5652210 5678995 5665501
9016 5665501 5780233 6056662 6267597 6397799 6245349 6104122 6169988 5818124 5757098 5952462
9006 5952462 5936405 6099258 6430334 5880877 5567352 5370625 5480724 5891811 6144936 6052343
8996 6052343 5945662 5724036 5503029 5333977 5429976 5611489 5600925 5514083 5278560 5556429
8986 5556429 5726355 5648560 5555116 5453086 5627300 5602355 5365061 5012695 4911033 5205796
8976 5205796 5335128 5601044 5699468 6010447 6090535 6302826 6214616 6081245 5847809 5562752
8966E562752P1096J13712q1887K14777k4039j03678J61238K63593k49307j78643
8956E749614J05678L8473q4592j89876R8109L15184K4399L8604J3492o6757o8440
8945E973888Q6392J35539L55799J55378J14973p6824l2517l9762k96083J24471
8935F501254J9739n3993j75503m1732J77609L49184N41241k71157J25659J73371
8925G345672k25321k8235j28908j4385J62462J32727O7137J93482M63441J51054
8915H119126n8050R0430K85469J57825K32818J59214k07768k17124m9317M49309
8905H961932M17729J02614K74652J93161M1018l18881m08866J60050M45732K39698
8895A0108839l22416j05336L59078K1023M9188K99789L43629J08381L24495J23557
$$ plain form
8966 5562752 5633848 5747560 5665673 5880450 5856411 5752733 5913971 6177564 5928257 5749614
8956 5749614 5855292 5893765 5809173 5619297 5717406 6032590 6056989 6095593 6109085 6042328 5973888
8945 5973888 6060280 6195819 6551618 6706996 6821969 6745145 6712628 6672866 6376783 6501254
8935 6501254 6520993 6467000 6291497 6249765 6427374 6776558 7317799 7046642 7172301 7345672
8925 7345672 7120351 7092116 6963208 6948823 7111285 7244012 7311149 7504631 7968072 8119126
8915 8119126 8061076 8151506 8436975 8594800 8827618 8986832 8779064 8561940 8512623 8961932
8905 8961932 9379661 9482275 9756927 9950088 9991106 9672225 9263359 9423409 9869141 10108839
8895 10108839 9786423 9681087 10040165 10061188 10110376 10410165 10753794 10862175 11186670 11310227
8885A1310227p0214K9377k3605L40397N26577K42129J26932J06682j41660k57919
8875A2188923J18385K6027L29583J33501M50191N39173K18181p0589j13209J4755
8865A3834921K18936L91814J843N9185L25450K55832P1900j48504J30178K59351
8855A5400906J75120L66325P2510j39722p4541Q2502M10446L75417K38308J08467
8845A7015738L93901J3654n5120J38847R6798J47049L50513K61710L76849K32169
8835A8972108L99296J16215k13036J29540J78387j15646J73103J86088r5610J4972
8825A9745417N83010N29070K17872K77508K57628O4043M2010J92571r085j58620
8815B1741424Q4286O2662j9042k5910M966K98817L4067j25488J79477K28282J66599
$$ plain form
8885 11310227 11240013 11269390 11245785 11586182 12112759 12354888 12481820 12588502 12446842 12188923
8875 12188923 12307308 12333335 12662918 12796419 13246610 13785783 14003964 13933375 13820166 13834921
8865 13834921 14053857 14445671 14447514 14506699 14832149 15087981 15159881 15011377 15141555 15400906
8855 15400906 15576026 15942351 16014861 15875139 15800598 15883100 16293546 16668963 16907271 17015738
8845 17015738 17409639 17423293 17368173 17507020 17603818 17750867 18101380 18363090 18739939 18972108
8835 18972108 19371404 19487619 19274583 19404123 19582510 19466864 19639967 19826055 19730445 19745417
8825 19745417 20328427 20857497 21075369 21352877 21610505 21674548 21716558 21909129 21900044 21741424
8815 21741424 21825710 21888372 21869330 21843420 21848386 22147203 22181270 22055782 22235259 22463541 22630140
8804B2630140K35255J10980m2306q125K26911O2855J05728Q0334j377L11916J68571
8793B3880882l1913Q388K49849M37188K06062l0215J10393K79046j64022N9281
8783B5004939Q1022m2751j13179o393M55138p051j53590M6550l2544J18943L81228
8772B5732312K97135r1946j36580o7137k00785L7586M722j35783j88248k80632
8762B4970644K3601n7704J46606J84712J26313R3186k48274Q8971q0452j08678
8752B5138925J10056k39764m12159P5509r7009j57292J03950N0572J07699Q3748
8742B4764235q7073m11036k4762K41060k14995m94860l5001k44483J05100L04265
8732B3902450k26068k90514j25416R1221k06775n9632r0513J7060k1732m1534
$$ plain form
8804 22630140 22865395 22976375 22934069 22925944 23152855 23215710 23321438 23401772 23400395 23712311 23880882
8793 23880882 23848969 23857357 24107206 24544394 24750456 24720241 24830634 25109680 24945658 25004939
8783 25004939 25085961 25043210 24930031 24923638 25378776 25371725 25218135 25264685 25232141 25351084 25732312
8772 25732312 26029447 25937501 25800921 25733784 25532999 25570585 25575307 25439524 25251276 24970644
8762 24970644 24994245 24936541 25083147 25267859 25394172 25487358 25239084 25328055 25247603 25138925
8752 25138925 25248981 25009217 24597058 24672567 24575558 24418266 24522216 24572788 24680487 24764235
8742 24764235 24677162 24266126 24241364 24482424 24267429 23772569 23737568 23493085 23598185 23902450
8732 23902450 23676382 23385868 23260452 23351673 23144898 23085266 22994753 23011813 22990081 22948547
8722B2948547j29961l59641l66348J81289L33673m456l68765m27498O839r2748
8712B1720931K3268l0166k27745q1597j47461k00334k96728k15372j99571k70427
8702B0074798L41125l7569k51088k88842k58258J28796k31430k41981j87788m73633
8692A8574130j40455j6495m8111k73157j61887J15198k12258j62245K7335L2439
8682A7734494l99549n82858k71261K7906n758l48752j97553r7629K24864j6575
8672A6067329l90355l97640r4874n4393k18715K010j03570J83863j64746q9583
8662A4739326L7777l06988k37538j68313k46033l28953k24584j00384l9167J83897
8652A3309040o5124o47010l53814m0370J47734o0407l01073j06858j32898k09670
$$ plain form
8722 22948547 22818586 22458945 22092597 22273886 22607559 22603103 22234338 21806840 21813679 21720931
8712 21720931 21744199 21714033 21486288 21404691 21257230 21056896 20760168 20544796 20345225 20074798
8702 20074798 20415923 20378354 20127266 19838424 19580166 19708962 19477532 19235551 19047763 18574130
8692 18574130 18433675 18417180 18369069 18095912 17934025 18049223 17836965 17674720 17702055 17734494
8682 17734494 17334945 16752087 16480826 16508732 16502974 16154222 15956669 15859040 16083904 16067329
8672 16067329 15676974 15279334 15184460 15130067 14911352 14913362 14809792 14993655 14828909 14739326
8662 14739326 14777103 14470115 14232577 14064264 13818231 13489278 13264694 13164310 13125143 13309040
8652 13309040 13243916 12596906 12243092 12202722 12350456 12290049 11988976 11882118 11749220 11539550
8642A1539550l34276j52993n8803R357k93653k25659k35330j75501k32828K39213
8632A0079077k78442m76064j19382l6493k40955k01397l8344K55684N0142k42035
8622H751791k29794l3396L2877j33151n28615j89506j10460K11353l83063l74748
8612G013288M6595j18114k13052J45252N3924k92090j07807K03910L5894r9273
8602F668527j43656n61336j1717L35708n91219l43309L12804L10480j16008j76367
8592E683907L5426r1522l27511J4187j52675O2460K74386k21464o3698L12552
8582E526048M72865J13714j688k68686l85831k82934K86348r8003l33307l09727
8572D718799m00508k66554k49971j3887J11602L17107J54235O868k30797j68085
$$ plain form
8642 11539550 11205274 11052281 10993478 11002835 10709182 10483523 10248193 10072692 9839864 10079077
8632 10079077 9800635 9324571 9205189 9168696 8927741 8726344 8688000 8943684 8993826 8751791
8622 8751791 8521997 8488601 8521478 8388327 7859712 7670206 7559746 7771099 7388036 7013288
8612 7013288 7059883 6941769 6728717 6873969 6927893 6635803 6527996 6731906 6767800 6668527
8602 6668527 6524871 5963535 5951818 6287526 5696307 5352998 5665802 5976282 5860274 5683907
8592 5683907 5719333 5627811 5300300 5314487 5161812 5224272 5498658 5277194 5213496 5526048
8582 5526048 5998913 6112627 6110939 5842253 5456422 5173488 5459836 5361833 5028526 4718799
8572 4718799 4318291 4051737 3801766 3787879 3899481 4216588 4370823 4377691 4146894 3978809
8562C978809J59903K57800j20667l00266m14260p9761p8499j61700j87039N8394
8552C112714O6604M5538k5858m8306j58939j62188J10470k0672m63403m0501K40367
8541B655826R707j11791n7453l7608k607K7196j21310J2325j90889K18456N634
8530B407486j33998n3577R4289K61326m8607Q7950j69214q8676k47389k05756
8520A903834j88964R6857J88211J18023n12819p4097N7754N2153q0309j91030
8510A369613q2265J94726J19053P4956M0284P2381n6818m5803l5463k65414K96357
8499A681607J06637q9419l98733K6679L71270m9725k5051j18082k21585k13678
8489A069920j48332J65202L15678K9402J84946r6798l8964j98223j42797J48120
$$ plain form
8562 3978809 4138712 4396512 4275845 3975579 3561319 3481558 3403059 3241359 3054320 3112714
8552 3112714 3179318 3224856 3198998 3150692 2991753 2829565 2940035 2919363 2455960 2415459 2655826
8541 2655826 2665533 2553742 2496289 2458681 2456074 2483270 2361960 2374285 2183396 2401852 2407486
8530 2407486 2273488 2219911 2314200 2575526 2526919 2614869 2445655 2356979 2109590 1903834
8520 1903834 1714870 1811727 1999938 2117961 1605142 1531045 1588799 1640952 1560643 1369613
8510 1369613 1287348 1482074 1601127 1676083 1716367 1788748 1731930 1686127 1650664 1385250 1681607
8499 1681607 1788244 1698825 1300092 1326771 1698041 1648316 1623265 1505183 1283598 1069920
8489 1069920 921588 1086790 1402468 1431870 1616816 1520018 1481054 1282831 1140034 1288154
8479A288154J56311n1120l06365m7052k8883J14895J93964j12839k10162K18770
8469A215673j05340j9077J55570J03114j74200R3115k48677j41744M1455R3355
8459A013244P7372J75271L64937k81358k46829M08255J72024k06847l04231j67265
8449A004573Q8672J58461k7594J4647J08125O4226M59765J12242l35852k59713
8439A387552J8862j87161J42578l2737l5396m09721j61106L97128L07217o9846
8429A357370N6777K41265k11831k27386q9411J13565j11005k66049J41488K8864
8419A033647P3641j67979m77115M3288j692K98738O2000K33774J22455Q3657k03834
8408A100580o1888j18286k02798j37454K35484J85245p5976j41309j8277R4077
$$ plain form
8479 1288154 1444465 1393345 1086980 1039928 1011045 1125940 1319904 1207065 996903 1215673
8469 1215673 1110333 1091256 1246826 1349940 1175740 1268855 1020178 878434 919889 1013244
8459 1013244 1090616 1265887 1630824 1349466 1102637 1510892 1682916 1476069 1171838 1004573
8449 1004573 1093245 1251706 1224112 1238759 1346884 1411110 1870875 1983117 1647265 1387552
8439 1387552 1406414 1219253 1361831 1329094 1293698 883977 722871 1119999 1427216 1357370
8429 1357370 1414147 1655412 1443581 1216195 1126784 1240349 1129344 863295 1004783 1033647
8419 1033647 1107288 939309 462194 505482 503790 802528 864528 1098302 1220757 1304414 1100580
8408 1100580 1038692 920406 717608 580154 815638 1000883 924907 783598 765321 859398
8398H59398K1375L440j40252j25786j588p2737M032K28369L88725j51169K37146
8387A250953J0426j45235N6436L42048P57977Q48502J836106J875691Q36183k46946
8377G422141j248202q80968q41374J1512k83700l28291n0482j62804o93938n80169
8367B363725o40132q0685L0153k61134r2592l02304l9746j44749l5625Q0750k23133
8356F54528L3753K21049J25892j91324K3539k6605n33177R8231J08877O5411J22202
8345G02376K8067k31444K70274L05233o9422m42899k37731M38993J24118J08823
8335I96388l30000j23710j1171J87095j86269k08066J87074P3684l13028l16691
8325d4694L31982L82070R4122q6789k56505L354k49866J94621N3433j7159J89858
$$ plain form
8398 859398 880773 884213 743961 618175 616587 543850 547882 776251 1164976 1013807 1250953
8387 1250953 1261379 1116144 1172580 1514628 2272605 3121107 4957213 6832904 7669087 7422141
8377 7422141 6173939 5292971 4451597 4463109 4179409 3851118 3800636 3637832 2943894 2363725
8367 2363725 1723593 1642908 1673061 1411927 1319335 1017031 977285 832536 796911 877661 654528
8356 654528 688281 909330 1035222 843898 867437 840832 307655 405886 514763 580174 702376
8345 702376 730443 498999 769273 1074506 1005084 562185 324454 763447 887565 996388
8335 996388 666388 542678 531507 718602 532333 324267 511341 585025 271997 -44694
8325 -44694 287288 669358 763480 676691 420186 423540 173674 368295 421728 404569 594427
8314E94427p9049j03982j648j03466j66075L2185N25951K98469J44173l08736
8304H32249q0998J16827M1444k10297l11507j9686j16705J42597P5281j33032
8294C36173K59164K68996r4835j8305K8866J81735k0049o17196j40876K50541
8284D34214K8720n3106K8622K16146m541M0040j62039R6255N9270l32663K36322
8273E87240k25420J17358J2996j2601r654J88907K7267k03193J89517L77750J13667
8262A163834q5247l92434k58276J86481J97373L0193q3758l11862k0598K89644
8252G15350j4197m04020j11484K60782P8060J24299Q8099K5094l95645j17131
8242B49207R4831j01913J02291L8039j04394L720N1883p9459o461M12356L73508
$$ plain form
8314 594427 515378 411396 409748 306282 140207 172392 698343 996812 1140985 832249
8304 832249 751251 868078 909522 699225 387718 368032 251327 393924 469205 336173
8294 336173 595337 864333 769498 751193 780059 961794 941745 324549 183673 434214
8284 434214 462934 409828 438450 654596 650055 690095 528056 624311 683581 350918 587240
8273 587240 361820 479178 492174 479573 469919 658826 686093 482900 672417 1050167 1163834
8262 1163834 1078587 686153 427877 614358 811731 841924 758166 446304 425706 715350
8252 715350 701153 297133 185649 446431 524491 648790 736889 761983 366338 249207
8242 249207 344038 242125 344416 382455 278061 281781 333664 254205 247744 660100 1033608
8231A033608r9871j97964j949j48428n2163L1422j91198l14185l62942J19361
8221a84309o5577O2974K03818R3882m8532J77577k05554r3741J17023J53284J85812
8210C96657L36415N1613j16328K69103j59061j82301k3892q6654n8079m8262k34082
8199A45129j28941J22969r4503J08234J69866J53067o9381j43743L9950n8745
8189B43902K3017l8114J66476p1291l79176K46610K56784N6765r9838k55688m8349
8178A01098R2718l8356q5404L81235K25035l07864j19365J32853K85305K44765
8168I12020k2372J99399K69749k93818m13083l6399J6635K0519o7957j75671j44848
8157B64174n39798j47129J52193K42596J30870J62582J3005L77465N4167k3908
$$ plain form
8231 1033608 933737 735773 733824 585396 533233 564655 373457 59272 -303670 -184309
8221 -184309 -249886 -186912 16906 110788 62256 239833 34279 -59462 57561 210845 396657
8210 396657 733072 784685 668357 937460 778399 596098 572206 485552 427473 379211 145129
8199 145129 16188 139157 44654 152888 322754 475821 406440 262697 302647 243902
8189 243902 266919 228805 395281 323990 -55186 191424 448208 504973 405135 149447 101098
8178 101098 193816 155460 70056 451291 676326 368462 249097 381950 667255 912020
8168 912020 889648 1089047 1358796 1064978 651895 615496 632131 652650 584693 409022 264174
8157 264174 -275624 -422753 -270560 -27964 102906 265488 278493 655958 710125 686217
8147F86217J24281l64133K47958l6312j94039k609J23626k36776l64983j04116
8137a20886P7914Q4738j5258j7779K52996R2473R6629j60343m51350j15302L10263
8126C4095J75128K0100K92130L7218n28J7846j14831l35412R106K40333J32232
8115E07417o9864k5395K20664l0318k754j07330j95050j83313J63887K35465J42088
8104F55497l3781n69285O6011L30609Q2157q8125K9900j66197n6048n071n2791
8093A92876j6948J30766J28812q2117L04480k17692n0724J42318j00805M5983
8083D76949j61951j37107j68479R5103P2226J18686q9042j26614K42103J78886
8073E00760j39301j43064L19325l696k60544K27988J83765J34254J2103J54469
$$ plain form
8147 686217 810498 446365 694323 658011 463972 461363 584989 348213 -16770 -120886
8137 -120886 -42972 41766 26508 8729 261725 354198 450827 290484 -160866 -276168 34095
8126 34095 209223 229323 521453 558671 558143 575989 461158 125746 134852 375185 507417
8115 507417 437553 412158 632822 602504 599750 492420 297370 114057 277944 513409 655497
8104 655497 621716 52431 118442 449051 531208 443083 472983 306786 250738 245667 192876
8093 192876 175928 306694 435506 353389 657869 440177 389453 531771 430966 476949
8083 476949 314998 177891 9412 104515 176741 295427 206385 79771 321874 500760
8073 500760 361459 218395 537720 534024 273480 501468 685233 819487 831590 986059
8063I86059l33454l51359p924K8351j47118J16196r5073n86582K89114J51509
8053D9719j15731p0372J80798k06581o2387L489J53364P5540n5100P1356l8000
8042a3905l41437j03632q007K75313M40680J17371j66144j89924n3961P8748J47028
8031A82130O7559L149J94195o92j24355j30963M5397J41473M6083k9709K62052
8020F56319q9408k88945j99261R1740m09936j69024O54230M32419P4696k00076
8010E52754j47476q6629m1822q6485l9094l60610m4996N06543L68431r6599j66918
7999C57099n765P0550j36108j58256m8018J23677k8931L64175L0406O8906k81177
7988C56558l28988J8747j1913k87353R3278L84510K60661K27621r9656Q445j54341
$$ plain form
8063 986059 652605 301246 293322 321673 174555 290751 195678 -390904 -101790 49719
8053 49719 -66012 -136384 44414 -162167 -224554 -221065 -67701 7839 -47261 24095 -13905
8042 -13905 -355342 -458974 -466981 -191668 249012 366383 200239 10315 -43646 35102 182130
8031 182130 249689 252838 447033 446341 321986 191023 236420 377893 423976 394267 656319
8020 656319 566911 277966 78705 170445 -239491 -408515 245715 678134 752830 552754
8010 552754 405278 318649 276827 190342 151248 -209362 -254358 252185 620616 524017 357099
7999 357099 351334 421884 285776 127520 79502 203179 174248 538423 568829 637735 356558
7988 356558 27570 46317 34404 -252949 -159671 224839 485500 713121 613465 621910 467569
7977D67569O2907o7346k55339J34170j94026q432M0751j54356R3606N1560J3993
7966A85057l03499k01361J69687M88574J13822k52436k194L3154J7469k50760
7956b487j8904J82563J90197J44643n1004J29004j04813j23376j56277r352q2964
7945I7230r6380j72200K5811J75902o8014K2128R1290j90814j1676P0093k43884
7934c00514R338R6998J19486O6583N747L72323M8412J67891j34728k18289N9058
7923B92305J38423m30464j01366J58746J79204k1747j21356p7031k20389N0581
7913a53094J1793l099L35422Q166m3326m37912j16288N03750J79510K2833J43349
7902D51104r9174l6071l08533p6789J84589J18677K98362K18605l0305k91281
$$ plain form
7977 467569 530476 463130 207791 341961 147935 139503 180254 25898 119504 171064 185057
7966 185057 -118442 -319803 -150116 338458 452280 199844 197650 230804 248273 -2487
7956 -2487 -21391 161172 351369 496012 445008 574012 469199 345823 189546 180194 97230
7945 97230 850 -171350 -145539 30363 -37651 -15523 75767 -115047 -126723 -56630 -300514
7934 -300514 -291176 -194178 -74692 -8109 -2362 369961 418373 586264 451536 233247 292305
7923 292305 430728 264 -101102 57644 236848 215101 93745 16714 -203675 -153094
7913 -153094 -141301 -144400 191022 199188 155862 -282050 -398338 105412 284922 307755 451104
7902 451104 351930 315859 7326 -69463 115126 233803 532165 750770 720465 429184
7892D29184m44678n32977J8070K66096k87510p9762P7281j82619j89139L35546
7882e90508j3925K78467J99181M4694J53067J85096j80360j71464j55840J85810
7872f5782J73980L07046p0790r2351k25454j80193J47617j74944j57895K86423
7862e2343L90522J38534n581L6624k28003k17328M0924Q4214j30138q4217J98375
7851A71583J18751j23214r179j39899O1551M25242K36128l32983J74768P766o04920
7840a4406j67342J42216R4547k74371Q5889K76447J01505M52106J69948k64978
7830F01561l20946j18226n9581M28823O0843l22047O253J52429j47764k55495
7820B5850j25797K80775n1502K7992Q4830r9986J01949K88932L789j64830n1197
$$ plain form
7892 429184 -15494 -548471 -530401 -264305 -551815 -631577 -554296 -736915 -926054 -590508
7882 -590508 -604433 -325966 -126785 -82091 70976 256072 75712 -95752 -251592 -65782
7872 -65782 108198 415244 344454 252103 26649 -153544 -5927 -180871 -338766 -52343
7862 -52343 338179 476713 471132 507756 279753 62425 103349 187563 57425 -26792 171583
7851 171583 290334 167120 157941 18042 79593 504835 740963 407980 582748 590514 -14406
7840 -14406 -181748 -39532 55015 -219356 -133467 142980 244485 696591 866539 601561
7830 601561 280615 162389 102808 531631 592474 270427 276680 429109 281345 25850
7820 25850 -99947 180828 129326 157318 242148 142162 244111 533043 536832 372002 320805
7809C20805n44n2519m17248k6265J43091J60501j15070J92862R6486J96039P6042
7798E74180k14994l0925J9647L9976J04619k33374j89668J45715J29737p3684
7788B71229k12680m3558J29320M0827j64087k63459l12665l35455K36693K62659
7778c91176J81782K6532J66376k5344l86479j06123M73574M71117j47204R8579
7768C61634k32761k74026n1802p7485k24437K21983L22674k04108k58126n3641
7758d70095J05666o4037O8668J15457K39726j64609k42629J1094J70695j20746
7748c50810P8029J11410K93803j52357J492K4160j37167R2225q4512o8775J74304
7737a8198O6964r8625Q7692j36135q7932j49606K35721M12207l7083n8347K85821
$$ plain form
7809 320805 320261 267742 -149506 -175771 -32680 127821 12751 205613 302099 498138 574180
7798 574180 359186 328261 347908 387884 492503 259129 69461 215176 344913 271229
7788 271229 58549 14991 144311 185138 21051 -242408 -555073 -890528 -653835 -391176
7778 -391176 -209394 -182862 -16486 -41830 -428309 -534432 -60858 410259 263055 361634
7768 361634 128873 -145153 -196955 -274440 -498877 -276894 45780 -158328 -416454 -470095
7758 -470095 -364429 -428466 -359798 -244341 -4615 -169224 -411853 -400759 -230064 -350810
7748 -350810 -272781 -161371 132432 -19925 -18433 5727 -131440 -39215 -123727 -192502 -18198
7737 -18198 48766 -49859 37833 -98302 -186234 -335840 -100119 312088 275005 216658 502479
7726E02479k4544N8465n3475j47800k33803n7415q5678r2422K00111L76716J13411
7715E56045L0125M0548n2795n4268P8466r7031q653N4704k49488l38800j16363
7704a57510N7876R1736j38372n7471J06988J22052K11569P2557n9789r9508l8081
7693A12047k87356J20212L72545M958k20539l10863K92298n5696O3112J05385
7683A96103J25898j1945m00321k44111L30134L2797k32248N0751J93913o8741
7673b7770k71156J44915N4644q5110o0419p5314q8583q653R4913O1965o768R6381
7661a70955N365L985k6358L0522K1599J27887k44480o738r5969P7350K09008J5570
7649e3214k8091K84487m5520l28627J13870j93220k75080K0550J38466L9876M89766
$$ plain form
7726 502479 477935 536400 482925 335125 101322 43907 -41771 -134193 65918 442634 556045
7715 556045 586170 626718 573923 519655 598121 501090 492437 547141 297653 -41147 -157510
7704 -157510 -99634 -7898 -146270 -203741 -96753 25299 236868 309425 249636 150128 112047
7693 112047 -175309 -55097 317448 322406 101867 -208996 83302 27606 90718 196103
7683 196103 322001 310056 -90265 -334376 -4242 28555 -203693 -152942 40971 -27770
7673 -27770 -298926 -154011 -99367 -184477 -244896 -320210 -408793 -417446 -322533 -260568 -267336 -170955
7661 -170955 -165590 -161605 -187963 -157441 -135842 -7955 -252435 -259173 -355142 -277792 -68784 -53214
7649 -53214 -81305 203182 157662 -170965 -57095 -250315 -525395 -504845 -366379 -326503 163263
7638A63263J97213j34261J0300K3518j94999j16983K84960J78636k42585k4650
7628A44412K04504l422p1149n639k39289N6960J3197J72963N757k57510Q9461
7617A10245p1363R9061J29468k39949J03501J86447L460K92823L9076j85890K73231
7606G40110R0609p21021j01377J42138J40046J3981j8454k67422l88113P2303
7596b97200K35356j97067r5257L83537J62902L4686j25072l85497M7284M3464
7586a92864J78270k85239n058L44976n813j85698N6483J69768o5952J00945l60422
7575b50604j77633P3472O0956J12493p3842M75019K29571O0666k03085k13906
7565I3107k11822J80970K22791j5066O1181n3243j68886J56960J86074k11419
$$ plain form
7638 163263 360476 226215 236515 260033 65034 -51949 233011 411647 169062 144412
7628 144412 348916 345494 274345 268706 29417 86377 99574 272537 278294 20784 110245
7617 110245 38882 137943 267411 27462 130963 317410 320870 613693 652769 466879 740110
7606 740110 830719 109698 8321 150459 290505 304486 286032 18610 -369503 -297200
7596 -297200 -61844 -258911 -354168 29369 192271 226957 101885 -283612 -236328 -192864
7586 -192864 -14594 -299833 -304891 40085 34272 -151426 -94943 74825 8873 109818 -250604
7575 -250604 -428237 -354765 -293809 -181316 -255158 219861 449432 510098 307013 93107
7565 93107 -118715 62255 285046 269980 331161 277918 109032 265992 452066 240647
7555B40647k90737j94449k49350j83559O5732R1146Q1612K46229p7147L90196
7545A20320P1482K50301K26669J87807k54496k99699j83497p9304n1373L24317
7535C12527j61100m07946j91114J25862n0525L70166q5546K2565k18696K1600
7525b62207R6726P6209J27394K36434k8991l04791j45430K1266M1369N989J00128
7514c5904O2923r0809o9938O9312L91444p4257l4848j02027J98735K09226j84213
7503C39644Q5740m5521j9568j58891p5515l9681p7538p9338K21180N0162K74031
7492D74705M4573m9757j17135k98472q312m2787L81827J38869l62157K72943L05456
7481G39753n07644j60092L39741j84700j52317j8320k8229r889R4135J20143j07646
$$ plain form
7555 240647 -50090 -244539 -493889 -677448 -611716 -520570 -438958 -192729 -269876 120320
7545 120320 191802 442103 668772 856579 602083 302384 118887 39583 -11790 312527
7535 312527 151427 -256519 -447633 -321771 -372296 -2130 -87676 -65111 -283807 -262207
7525 -262207 -165481 -89272 38122 274556 245565 -59226 -204656 -183390 -142021 -136032 -35904
7514 -35904 27019 -63790 -133728 -64416 327028 252771 217923 115896 314631 523857 339644
7503 339644 425384 379863 360295 201404 125889 86208 8670 -70668 150512 200674 474705
7492 474705 519278 469521 352386 53914 45602 2815 384642 523511 161354 434297 739753
7481 739753 232109 72017 411758 227058 74741 56421 28192 18303 112438 232581 124935
7470A24935J66908k01323o4654j6076r9210N4279K32594J06070j36176J55894
7460C23241k35800j24858L42174L32892o4460j16347J32257j61554j58924j82686
7450H5935j72049q4600L55150J07295k05700j53129K96803j06831J50594K03373
7440D76841k05040k37887J61607k30828m33089q211J75853K53348j43388j31588
7430c22382k60797O131M63330K20646K55467Q5205j89282l5828j61068j15627
7420e4205J69381Q1581l14349j87798K22567M5784K31077N6518J97245o5790J32642
7409E14653M2486n1121p3324j32992j49574P8427k23611k28837j40950k31553
7399e96396j24721j06095J71641L80239j99760k23963J29072K36896n3478l6282
$$ plain form
7470 124935 291843 90520 25866 9790 -89420 -35141 197453 303523 167347 323241
7460 323241 87441 -37417 304757 637649 573189 456842 589099 427545 268621 85935
7450 85935 -86114 -170714 184436 291731 86031 -67098 229705 122874 273468 476841
7440 476841 271801 33914 195521 -35307 -468396 -476607 -300754 -47406 -190794 -322382
7430 -322382 -583179 -577048 -113718 106928 362395 447600 258318 222490 61422 -54205
7420 -54205 115176 196757 -117592 -305390 -82823 -37039 194038 250556 447801 382011 514653
7409 514653 557139 506018 432694 299702 150128 228555 4944 -223893 -364843 -596396
7399 -596396 -721117 -827212 -655571 -275332 -475092 -699055 -569983 -333087 -386565 -422847
7389d22847L4516J54218q1091j88317k25478p7621n2830L013L52359J36799q8619
7378d55898q5513M3301K46987k62008q178Q5191P817j5485K63673N736L4816K83964
7366A44403q3990q1148K01244m1274j62320k3593R5191k1506J21637j02078k08284
7355a61718M0838l07867k5037N5693J90939J93965J02225j47401k9360l42669
7345d30392j57776n1192n6607L7288M56775K82494q9669k25428K81653K64390
7335C11536M0417J08510j10838j98346j92240o609J43688K93097J62404k25033
7325C26586k42172L65051K15121K98494j68045k46524j47654N946k38300j53854
7315A4649N8798n2056m48177j20119J55477L76567J87357j83969j3738J47638
$$ plain form
7389 -422847 -388331 -234113 -315204 -503521 -728999 -806620 -859450 -856437 -504078 -367279 -455898
7378 -455898 -541411 -498110 -251123 -513131 -521309 -436118 -428301 -443786 -180113 -174377 -139561 144403
7366 144403 60413 -20735 180509 139235 -23085 -46678 48513 27007 148644 46566 -161718
7355 -161718 -120880 -428747 -453784 -398091 -207152 -13187 89038 -58363 -87723 -430392
7345 -430392 -588168 -639360 -695967 -658679 -201904 80590 -9079 -234507 47146 311536
7335 311536 351953 460463 349625 151279 -40961 -47570 96118 389215 551619 326586
7325 326586 84414 449465 664586 963080 795035 548511 400857 406803 168503 14649
7315 14649 73447 21391 -426786 -546905 -391428 -14861 172496 -11473 -25211 122427
7305A22427J4149P5416R6586q6094k4610k65404n34757p8638O3560K73315K04450
7294a39600n7098J80320M77005R3880k23965m57077K59808k27660j4166O256J43511
7283D1214J33245J5211j04804m688L58987Q2623j15041J04879j18644n0873J1581
7272C53690k41928k57800p0842k3568J66804J44408j37641P8756J40174k35226
7262h3173O5805L15108l86618o3163m4621p7247r9104K40562O2031K21276j8806
7251A32050j76200Q9973n3511j35180J29996L03013R2455k7153j68852l40496
7241a53905k16799K54569K83090j76028l01840J10891J71593k5539j09648J05845
7231e7771K51045j74969J1207m2775K09965m262k61729k1156N5530j52448j39704
$$ plain form
7305 122427 136576 211992 308578 222484 197874 -67530 -602287 -680925 -617365 -344050 -139600
7294 -139600 -196698 -16378 460627 554507 330542 -126535 133273 -94387 -108553 -102297 41214
7283 41214 174459 189670 84866 80178 439165 521788 406747 511626 392982 342109 353690
7272 353690 111762 -146038 -216880 -240448 -73644 70764 -66877 11879 152053 -83173
7262 -83173 -17368 297740 -88878 -152041 -196662 -273909 -373013 -132451 -70420 150856 132050
7251 132050 -44150 45823 -7688 -142868 -12872 290141 382596 355443 186591 -153905
7241 -153905 -370704 -116135 166955 -9073 -310913 -200022 -28429 -53968 -163616 -57771
7231 -57771 193274 18305 29512 -13263 196702 192440 -69289 -90445 -34915 -187363 -327067
7220c27067m3654o7199J51785K53945L11380R6755m70244j61685M5859K29340
7210A9215k97854k83336p8283N64903M13079j47825m00976k01922P8746K02049
7200a32204J94569K20211L3967j51993j55253J35018J79024j49400j95054k2264
7190d3379N3054L1385J16805k81426j34211K32597J43990J82088p4436j3300K2094
7179B35261j72346K75997L27473m7834M786Q8034n06865j43365j8908q0036m21667
7168d59470j26531M8830n5888j43949Q1264L28703j23499J00972N04096j78549
7158b4021k09935J2921M503J39130J95412n6118P0336N1717L7818r5966j90855
7147f5058j75587j23377K4957J53383R5096K55664j55842k03033k7388K43941
$$ plain form
7220 -327067 -370721 -437920 -286135 -32190 279190 375945 -94299 -255984 -210125 19215
7210 19215 -278639 -561975 -640258 -75355 337724 189899 -211077 -412999 -334253 -132204
7200 -132204 62365 282576 316543 164550 9297 144315 323339 173939 -21115 -43379
7190 -43379 9675 41060 157865 -123561 -257772 -25175 118815 300903 226467 213167 235261
7179 235261 62915 338912 666385 618551 623337 711371 204506 61141 42233 -37803 -459470
7168 -459470 -586001 -537171 -593059 -737008 -655744 -327041 -450540 -349568 154528 -24021
7158 -24021 -233956 -221035 -216532 -77402 118010 61892 132228 183945 221763 125797 -65058
7147 -65058 -240645 -364022 -339065 -185682 -90586 165078 9236 -193797 -221185 22756
7137B2756L4667K59075L49248r5981k73404J67639p0264L1148Q954k97283k96725
7126a60170K24634M06812N7575p6585l48188J0028K46031j82518k79734j62324
7116b64439J12930O1809l0524p3134l018k04880j70970K86357r6876J16704J06944
7105a59097J2171k0777K1801k72293m0881j3538J72665Q0163P3698J38660j96525
7094b03953L05052n8075l41762J1269m401J18028K76304J68376o0304j6165j57804
7083C6565J11779k11491k53577M6733J75530J97587k89053O7597L08353J60489
7073C50512J78056j48283m44925j68371n5408J44777K59179j44590p1086K85515
7063A85376n5432j68016J20474P9057J18425m0600j01218k99337j71756K49530
$$ plain form
7137 22756 57423 316498 665746 569765 296361 464000 393736 424884 433838 136555 -160170
7126 -160170 64464 471276 528851 452266 104078 114106 360137 177619 -102115 -264439
7116 -264439 -151509 -89700 -120224 -193358 -196376 -401256 -572226 -285869 -382745 -266041 -159097
7105 -159097 -146926 -167703 -145902 -418195 -459076 -472614 -299949 -219786 -146088 -7428 -203953
7094 -203953 101099 43024 -298738 -287469 -291870 -173842 102462 270838 210534 194369 36565
7083 36565 148344 -63147 -316724 -269991 -94461 103126 -185927 -118330 190023 350512
7073 350512 528568 380285 -64640 -233011 -288419 -143642 115537 -29053 -100139 185376
7063 185376 129944 -38072 82402 161459 279884 239284 138066 -161271 -333027 -83497
7053h3497J42174l07164J82065J95062j40171k11095m2659K40339O2007l9652
7043b591k44693j34803R188K98422J09059J44615J0485k65942Q8037K43282j65591
7032H9468k262N5274k45547j7714n111J94001n7284j20388J11792J43558k1678
7021A24109l9154p3810l27403m7261R0393Q5195j82868K19942J18147R0597r4667
7010c6780J49256J07989k14876l3526k66784L311J59704j26044n1053K55889K59810
6999B06896L80940k1648l58509J71275J53444K08717O1800l09700j22835j25355
6989B45025J43083j05603k17858n9912k35941L62938J53194p9749k7691n1386
6979A26100j75224n4904N0541K71739K61594k24637k75867R7807l0548R4565J14769
$$ plain form
7053 -83497 58677 -248487 -66422 128640 -11531 -222626 -265285 -24946 37061 -2591
7043 -2591 -247284 -382087 -372899 -74477 34582 179197 189682 -76260 11777 255059 89468
7032 89468 87206 142480 -103067 -120781 -125892 68109 10825 -109563 2229 145787 124109
7021 124109 84955 11145 -316258 -363519 -273126 -187931 -370799 -150857 -32710 57887 -36780
7010 -36780 112476 220465 5589 -27937 -294721 -291410 -131706 -257750 -308803 -52914 206896
6999 206896 587836 566188 207679 378954 532398 741115 802915 493215 370380 245025
6989 245025 388108 282505 64647 4735 -231206 131732 284926 205177 177486 126100
6979 126100 -49124 -104028 -53487 218252 479846 255209 -20658 77149 46601 141166 255935
6968B55935J32564k36276J746j31188k98854j34820K14923J01012K1986l17086
6958c90058K8517K34751K22293K26075K42379K0127j59737k92039l80638l85559
6948f33889o3677M36777M16630J72351R9412k85595M2475N8046l64834K32620
6938A10316K72487L7640M1043J27350J3169j15909J20435k62287k45061k09933
6928a10750J42008J04253j17135j4682m26815k04111K84250L13522R2073K8929
6918I1542K87156O2224J5752l34996j4892j11947k4588j3186p6066m9829n209
6907a74039q4276K69554J85180r8700J31784Q99l84962K68844N32453J13240J70198
6896I30175j69436m95446m66248j8259m5550j55865L0042L68586j22126k86773
$$ plain form
6968 255935 388499 152223 153969 22781 -276073 -410893 -195970 -94958 -72972 -390058
6958 -390058 -361541 -126790 95503 321578 563957 584084 424347 132308 -248330 -633889
6948 -633889 -697566 -260789 155841 328192 427604 142009 184484 242530 -122304 110316
6938 110316 382803 420443 461486 588836 602005 486096 606531 344244 99183 -110750
6928 -110750 31258 135511 18376 3694 -423121 -627232 -342982 -29460 62613 91542
6918 91542 378698 440922 456674 121678 106786 -5161 -29749 -42935 -119001 -168830 -174039
6907 -174039 -258315 11239 196419 97719 229503 230402 -154560 114284 646737 759977 930175
6896 930175 760739 265293 -200955 -219214 -264764 -420629 -390587 -22001 -144127 -430900
6886d30900k6047J01208J45580O8969k28872M1323L21751K64360p6068n6373l18161
6875a93230J00625k21111o1537Q9873K32904J41424o4792J2562q8777J91114J29387
6864B68442M8845L04218M5378l21428k16635p944k23922N7321l9375j15718N432
6853a95386J17853p2390J06984n1876K27050J95750m12479j41173J37958j11277
6843a98986J0233L23100J71441J42123J42431k63153j73598K84811l32389o94875
6833e88862k56150J56453L84485J78897r3028J40740L90556n897l59322j9549
6823g1677J17826M3330j7161j15636J41381K07454j40298j94079o5432r0375J3082
6812a71585J68712J9381q0364j79508k32229J30195K37429K74862j1759N1041
$$ plain form
6886 -430900 -456947 -355739 -210159 -141190 -370062 -328739 -6988 257372 181304 124931 -193230
6875 -193230 -92605 -313716 -375253 -285380 -52476 88948 24156 36718 -52059 139055 268442
6864 268442 317287 621505 666883 345455 128820 120876 -103046 -45725 -85100 -200818 -195386
6853 -195386 -77533 -149923 -42939 -94815 132235 327985 -84494 -225667 -87709 -198986
6843 -198986 -188753 134347 305788 447911 590342 327189 153591 438402 106013 -588862
6833 -588862 -845012 -688559 -304074 -125177 -218205 -77465 313091 307194 -52128 -71677
6823 -71677 46149 89479 72318 -43318 98063 305517 165219 -28860 -94292 -184667 -171585
6812 -171585 -2873 16508 -63856 -243364 -475593 -345398 -107969 166893 155134 206175
6802B06175J58515l30416j42130Q7326k4955J51052n9013K8999M0906l36720J95234
6791b5027R6727M8333K2179l2248L30498Q1792k20990j99125J2510J57320j40668
6780A31301j07229K7619J39028n7390l31495J28317J99423j57609k0195J2164
6770c6066j90076l03015k8832J71262J21093r3126K12196L66494P8640l00230
6760a660j53002l59548J4023M7250J39884J35537j0909K27175J86868k29439l77880
6749c81701L43085M42102j08391Q2880K1984k41384k36554k1448K3932M2434P1259
6738C8198J20750K75792j69318j84729P0343L7069k71457j9942K81018k7185j09163
6727D1376k57929L1040j30232K67010j92479j13846L08663J60979K29064J61602
$$ plain form
6802 206175 364690 34274 -107856 -20530 -45485 105567 46554 75553 116459 -220261 -25027
6791 -25027 71700 120033 142212 109964 440462 522254 301264 102139 114649 271969 131301
6780 131301 24072 51691 190719 133329 -198166 -69849 129574 -28035 -48230 -36066
6770 -36066 -226142 -529157 -557989 -386727 -265634 -358760 -146564 219930 298570 -1660
6760 -1660 -154662 -514210 -500187 -452937 -313053 -177516 -188425 38750 225618 -3821 -381701
6749 -381701 -38616 403486 295095 377975 399959 158575 -77979 -99427 -75495 -33061 38198
6738 38198 158948 434740 265422 80693 151036 188105 -83352 -103294 177724 150539 41376
6727 41376 -216553 -185513 -315745 -48735 -241214 -355060 -46397 114582 343646 505248
6717E05248j35507J7272j15371k9060O4507M7946J45985l88167R3469q9295l69756
6706b52729k78886Q6299N4127Q5187P3116j06359l35738o8441K09965L37063M5809
6695a50587K22009j08512M6446J81305O6340m5575J24818M7019j71923k111K40645
6684D49874K5113k80303j65913q4210O6283J74810k00949o4668m039J3155J21784
6673E0937m40466j01729P7538j91267K48530J94223J9873k53422k28593J56414
6663d67962K49406L9533O1982L11113J27279J82355j68391m9414P5458r8232j50076
6652A13051l16509K82762j20604j53033K86356J47462O0230o817P4434p2260j39054
6641A56018k07515j54804K74599J56593K93092P3008p2892N6093l8740k4096l17627
$$ plain form
6717 505248 369741 387013 271642 242582 307089 355035 501020 112853 206322 117027 -252729
6706 -252729 -531615 -445316 -391189 -306002 -232886 -339245 -674983 -743424 -533459 -196396 -150587
6695 -150587 71422 -37090 9356 190661 257001 211426 336244 383263 211340 209229 449874
6684 449874 474987 194684 28771 -55439 10844 185654 -15295 -79963 -84002 -70847 50937
6673 50937 -389529 -491258 -413720 -604987 -356457 -162234 -142361 -395783 -624376 -467962
6663 -467962 -218556 -179023 -117041 194072 321351 503706 335315 285901 361359 263127 113051
6652 113051 -203458 79304 -41300 -194333 92023 239485 299715 292898 367332 295072 156018
6641 156018 -51497 -206301 68298 224891 517983 590991 518099 574192 535452 511356 193729
6630A93729m79220J46092Q7378J9859m1315J9523k8149k6114L29371Q7450j78616
6619A29988k26980R1399P1961P3225N6679j07495j26811j29757j58646J34823
6609a91614L7610r6982K08893J52402N1509J23836J22455j45349r3014k79390
6599a09644q8965k9517N155k9054l94787M644Q7435J26938K23141k41267q237
6588d54158j2283M186J78981k8588K10266J49413N8671J67724p1426p9073o4616
6577E9097j75187q5428K39695O7621j62487k51122N7394j88462o999L42895K62975
6566A59992L24163o8296o6865j60948j62073j18235M7225n0148J60035L46393
6556D11243J77294j1871n85531m24290L54942O8458N5261p1520k52450P4274J62471
$$ plain form
6630 193729 -285491 -139399 -52021 -32162 -73477 -53954 -82103 -108217 221154 308604 129988
6619 129988 -96992 -5593 66368 139593 196272 88777 -38034 -167791 -326437 -191614
6609 -191614 -154004 -250986 -42093 110309 161818 285654 408109 262760 169746 -109644
6599 -109644 -198609 -228126 -222971 -252025 -646812 -642168 -554733 -427795 -204654 -445921 -454158
6588 -454158 -466441 -462255 -283274 -311862 -101596 47817 106488 274212 202786 123713 59097
6577 59097 -116090 -201518 38177 105798 -56689 -307811 -250417 -438879 -445878 -102983 159992
6566 159992 484155 415859 348994 188046 25973 -92262 -45037 -95185 64850 411243
6556 411243 588537 576666 -8865 -433155 -78213 -9755 45506 -26014 -278464 -204190 -41719
6545d1719m7934N8995K11700O4752K28810l01666m53248J80719L30595k41375
6535a0371k47274j58535L77892J78576l7757M2828K1388q7056r450m9831J42871
6524A63281J69365j57100J45526K17891L097O2472l57819m82796l9033k12364
6514d87480K82166M26452k66631m7307K02654o9138j97728l65353l82508K17368
6504f87505J57675J69625j4054j38933N8670j37526J23948K05985K82541L49845
6494C70271k56460O2857M1572m51318m41135R5127M11676j28202j04916J36171
6484b64357L30608K16497L01916j71092j76343k10394j58720J45660r5760J30314
6474D8329l8098k02537j8953J83711K50861k38456M8572N24526j90101j69637
$$ plain form
6545 -41719 -89653 -30658 181042 245794 474604 172938 -280310 -99591 231004 -10371
6535 -10371 -257645 -416180 -38288 140288 102531 145359 166747 79691 70241 20410 163281
6524 163281 332646 175546 321072 538963 542060 604532 246713 -236083 -275116 -487480
6514 -487480 -205314 221138 -45493 -92800 109854 40716 -157012 -522365 -904873 -687505
6504 -687505 -529830 -360205 -374259 -513192 -454522 -592048 -468100 -262115 20426 370271
6494 370271 113811 176668 218240 -233078 -674213 -579086 -167410 -295612 -400528 -264357
6484 -264357 66251 282748 584664 413572 237229 26835 -131885 13775 -81985 48329
6474 48329 10231 -192306 -211259 -27548 223313 -15143 33429 557955 367854 198217
6464A98217j56307K09029K06519l54583l30031j91813J35450Q9279M5661J27282
6454b1297l1353j00918L09565K8999j16910N8268j34824k84702j66091r4343n1417
6443f05023K7713K13342Q4261J6856j51441l05551j04163l8878K53803K08565
6433d00516J64041M0238K26279L00444J74035l2913j59516r582k76322m028j48173
6422a26013j10935j98455J73194n4609l28044K3184O19118O9468l42597j30674
6412d06363K33114j34458l41188J96555M84668j54473k65387j21949J37189J95946
6402a76346m9954K86329P9536k49490p1944J15294m6818l05144l50493k2691O53180
6391a38541L22537r6880P3839K4795k6246J45810J44144K81192J47038p7281m54164
$$ plain form
6464 198217 41910 250939 457458 102875 -227156 -418969 -283519 -194240 -148579 -21297
6454 -21297 -52650 -153568 155997 184996 68086 126354 -8470 -293172 -459263 -553606 -605023
6443 -605023 -577310 -363968 -279707 -262851 -414292 -719843 -824006 -862884 -609081 -400516
6433 -400516 -236475 -196237 30042 330486 504521 471608 312092 302510 26188 22160 -126013
6422 -126013 -236948 -435403 -262209 -316818 -644862 -621678 -2560 66908 -275689 -406363
6412 -406363 -173249 -307707 -648895 -452340 32328 -122145 -387532 -509481 -372292 -176346
6402 -176346 -226300 60029 139565 -109925 -181869 -66575 -113393 -418537 -769030 -791721 -138541
6391 -138541 183996 87116 160955 185750 159504 305314 449458 730650 877688 800407 346243
6380C46243l4771j09473l54460l65693j03705K14343M83487r7610J28552J27212
6370B34125n1865j90524l9125J83635L23574l7890l13455k40916M32437k2001
6360B77995j48174J4585j11077m2832n5479L20020P5394m81716J05034K32897
6350A86647k46944l2697K91204L19130k8267j79643j20466L3094O8849k65081
6340B5826l08717P3651K33573M63655k63424j31632k6462m6712Q3384L5100K11808
6329C50050k4935l36517R555o6403k90283J13849J55129K54158L6205k47655k57098
6318c03945j116k12087K03988J8048J02839K7510j7893L48445K39789r0537j5360
6307B99681r4186j15961l808J88372k49368m14249J57206K21259L54212j40601
$$ plain form
6380 346243 311472 201999 -152461 -518154 -621859 -407516 75971 -21639 106913 234125
6370 234125 182260 -8264 -47389 136246 459820 421930 108475 -132441 299996 277995
6360 277995 129821 144406 33329 -9503 -64982 255038 330432 -151284 -46250 186647
6350 186647 -60297 -92994 198210 517340 489073 309430 188964 222058 290907 25826
6340 25826 -282891 -209240 24333 487988 224564 92932 66470 19758 103142 138242 350050
6329 350050 325115 -11402 -1847 -68250 -358533 -244684 -89555 164603 200808 -46847 -303945
6318 -303945 -305061 -517148 -313160 -295112 -192273 -164763 -182656 165789 405578 315041 299681
6307 299681 205495 89534 85726 274098 24730 -389519 -232313 -11054 343158 202557
6297B02557k99338L3550j07919q737K33083J54525j78067p8403l34497o7841l2811
6286d83898K43285P4713P0690J68060n3746j99606J57593l31135J6621J90330
6276a47093J55789R1017j23823J08041L2212N1972j22333j22700K97029M75066
6266F95177p3210l19676k36594K4344k4182J28678J48746k60716r6235M0341j45371
6255a18698K1552Q7765R9990k54216P3631L55189L92444j18815k60225m04730
6245a26113j89357j32838L20656K08136j75476m39994O753K46824K87664Q4413
6235I0668J88306K38921K66895l522n142j89144n23956l10636K09725L39186L74830
6224F76131O8991l93428o5649J59575k45029j31258k93666r2n5684J43211P572
$$ plain form
6297 202557 -96781 -63231 -171150 -179887 53196 207721 29654 -48749 -383246 -451087 -483898
6286 -483898 -240613 -165900 -95210 72850 19104 -180502 -22909 -354044 -337423 -147093
6276 -147093 8696 99713 -24110 83931 116143 168115 45782 -76918 220111 695177
6266 695177 621967 302291 65697 90041 65859 194537 343283 82567 -13668 26673 -118698
6255 -118698 -97146 -9381 90609 -163607 -89976 265213 657657 538842 278617 -126113
6245 -126113 -315470 -448308 -127652 80484 -94992 -534986 -528233 -281409 6255 90668
6235 90668 278974 517895 784790 781268 776126 586982 63026 -247610 -37885 301301 676131
6224 676131 745122 351694 286045 445620 200591 69333 -224333 -224425 -280109 -136898 -129326
6213a29326M0263n3083K17526L247j66181m2122o7950r9995J72189j90026l5576
6202c51034M28746k061J59843j5822n3505L36358K49256j66647k55187k04942
6192A25005J0674r6120l00251N7279J22193J30096J56832R8152p7953j15127J12936
6181B23716J94815J3953l62130j46968J23630o9554l60715l4931J61000Q3103
6171a74081K19929J83373J98665q8930m8768O5091k16614j52771k58702l06205
6161e79013P3878K90507L5613P8870Q4743O82J0987L15865k0276j47618K323K38566
6149C85127J17507k34439j25629J71373k14726m8375l4988q6381O237K7588K46596
6138B09890j02852O3148M1499N511n54452o691K91476J76548p9744R3474M5017
$$ plain form
6213 -129326 -89063 -142146 75380 78627 -87554 -129676 -197626 -297621 -125432 -315458 -351034
6202 -351034 77712 75651 235494 219672 166167 502525 751781 585134 329947 125005
6192 125005 135679 39559 -260692 -203413 -81220 48876 205708 303860 225907 110780 223716
6181 223716 418531 432484 70354 -76614 47016 -22538 -383253 -418184 -257184 -174081
6171 -174081 45848 229221 427886 338956 290188 355279 138665 -14106 -272808 -579013
6161 -579013 -505135 -214628 -179015 -100145 -15402 -14720 -3733 312132 291856 144238 146561 385127
6149 385127 502634 268195 142566 313939 99213 50838 15850 -70531 -64294 -36706 209890
6138 209890 107038 170186 211685 217196 -337256 -343947 -52471 124077 44333 137807 182824
6127A82824J50235O8168j06290O6373n4467o4044J72219R3676k05292L3252j91861
6116A44793n7690o0853K05623N9005k85650P711J29117j02373J95168L00865j58339
6105C77377r7898j44662j11578K54793m07662r2013j30037j64134K67050L72008
6095A23244k4101m0045J62478K27605o710m4917r5134p287k9924l57657n7477
6084a49925K80175J75673l50356P8512m9879k46884l86734K66289L69410k09593
6074b23312m31179J93465J25048L31534Q3045J87015L65811J4872k86041l71677
6064a1419l9275J96800j02863k82199L17058J41544l1500N9899l06478n18767
6054e77200M050R2300K17193J67096J21153J4067J28463J65349j59117l91101
$$ plain form
6127 182824 333059 401227 294937 361310 306843 242799 415018 508694 303402 336654 144793
6116 144793 87103 26250 231873 290878 5228 12939 142056 39683 234851 535716 377377
6105 377377 279479 134817 23239 278032 -129630 -221643 -351680 -515814 -248764 123244
6095 123244 99143 59098 221576 449181 442471 397554 302420 295133 265209 -92448 -149925
6084 -149925 130250 305923 -44433 34079 -15800 -262684 -649418 -383129 -13719 -223312
6074 -223312 -654491 -461026 -335978 -4444 78601 265616 631427 646299 360258 -11419
6064 -11419 -50694 146106 43243 -238956 78102 219646 188146 248045 -58433 -577200
6054 -577200 -573150 -480850 -263657 -96561 24592 38659 167122 332471 173354 -217747
6044b17747k40966J74850K58897R720j3769O9313r0667L5630K09998j25298j38827
6033f8866k9716K56004q3868k30870J55936k38355l77040J66646N8798N7306J16559
6022b17466J33961K53215J04422n5159j51547P7315K2555L0223l1550k30146m032
6011f8209K866j42258k45615j4348L87592K55864m4469m3945J6407r9066R7410
6000A02229K03930n6293k50131q8262M7102J12771l3413N0163m3870j85715M2202
5989i9287J68632n1029m2221K87619P3877l95436l55368J71613K03613J85277
5979A47290R9994j27182P541m5987r4922o4519k57048J53566N0355L67668K79081
5968E15837j67413O579j22915n95675k92514n0862L04744J69374J66724J04163
$$ plain form
6044 -217747 -458713 -283863 -24966 -15246 -29015 40298 -50369 -14739 195259 69961 -68866
6033 -68866 -98582 157422 73554 -157316 -1380 -239735 -616775 -450129 -391331 -334025 -217466
6022 -217466 -83505 169710 274132 218973 67426 144741 167296 197519 165969 -64177 -68209
6011 -68209 -65343 -207601 -453216 -467564 -79972 175892 131423 87478 103885 4819 102229
6000 102229 306159 249866 -265 -88527 -41425 71346 37933 88096 44226 -141489 -99287
5989 -99287 69345 18316 -23905 263714 337591 -57845 -413213 -241600 -37987 147290
5979 147290 247284 120102 127643 81656 -13266 -77785 -334833 -181267 -130912 236756 515837
5968 515837 348424 355003 232088 -363587 -656101 -706963 -402219 -232845 -66121 38042
5958C8042P280n3048m2548l8893J39809J68317j22283j95503J66439k0799j47595
5947a00782j91038J75869K32885l58495l25185L32151K02101J58269j43023p2376
5937h9624J42395J48017Q3733k9231o0768j25102j35706r141q6611k41350J45357
5926b58031m29L66443K63316q0053K92119j02810l85318j29666k89968K8449O6787
5915b29161L32172M22349j12776p2969j1724n480P5671m55580j81611J73823K0282
5904d5004J3649Q4591L3236J24901j68786j34722M2414j45304o0178q7582J60682
5893a82103j7688o7263J60852k63430K82930P8540J780p8393j12735j69370J20639
5882b46241Q9325J04791q8576k20667K85439M75456K35472l18750j54015L8396
$$ plain form
5958 38042 45322 -7726 -50274 -89167 50642 218959 96676 -98827 67612 46813 -100782
5947 -100782 -291820 -115951 116934 -241561 -566746 -234595 -32494 125775 -17248 -89624
5937 -89624 52771 200788 284521 255290 194522 69420 -66286 -75427 -162038 -403388 -258031
5926 -258031 -258460 107983 371299 291246 583365 480555 95237 -34429 -324397 -295948 -229161
5915 -229161 103011 525360 412584 339615 327891 322411 398082 -57498 -239109 -65286 -45004
5904 -45004 -31355 53236 86472 211373 42587 -92135 -49721 -195025 -255203 -342785 -182103
5893 -182103 -199791 -267054 -106202 -369632 -86702 -8162 -6382 -84775 -197510 -366880 -246241
5882 -246241 -156916 -52125 -140701 -361368 -75929 399527 634999 316249 162234 200630
5872B00630n3479j18775J63153j97593j54037P7663r8165J05678K80811q5369
5862A20517J02403p6542j4734j05787j8868j22573k34802p9246r3787J32570K54968
5851a35881l2027J05790o4735K02165J03340m5789J50730M8616K23634K37939
5841G93782k37404j99778j65906r6100j58689p1421K32176P206J34702k73873
5831c5305l56596k39960L46116K92651J0626O3501J39555p5197l14235j70494
5821c39338P6422k2292l1679J86956j0274o3534K37754J75041m802j75721L2237
5810F0770j7040L4080J63223Q5008k27905k70455r3107N1418M1764j28640m3396
5799c44280r8533Q4900J67547m5624J76883k00783j63238K74400K4380k19885
$$ plain form
5872 200630 147151 28376 191529 -6064 -160101 -82438 -180603 -74925 205886 120517
5862 120517 222920 146378 131644 25857 6989 -115584 -350386 -429632 -523419 -390849 -135881
5851 -135881 -167908 -62118 -126853 75312 178652 132863 283593 332209 555843 793782
5841 793782 556378 356600 190694 94594 -64095 -135516 96660 103866 238568 -35305
5831 -35305 -391901 -631861 -285745 6906 17532 81033 220588 145391 -168844 -339338
5821 -339338 -262916 -285208 -316887 -129931 -140205 -203739 34015 209056 204254 28533 60770
5810 60770 43730 77810 241033 326041 98136 -172319 -265426 -214008 -172244 -300884 -344280
5799 -344280 -442813 -357913 -190366 -235990 -59107 -259890 -423128 -148728 -124348 -344233
5789c44233L24213k8068l577l02939k39621o2823J09732K33416J19059J12600
5779h2241J63925J55881L24441P3193k70848k78851L4825K949r4997q8777K5811
5768c4689J16198J04232L71725L5301n0721k85151l14269k34673J30692L95745
5758B34390P0877O8669j71231j9163J46157k23854j31196K91884Q2379M0876Q8782
5747D78570j38985j95241j08268n1739k81197n6072J21162l9385K65343K25362
5737B19550k40584n044P7866K04438L51056l01605k99498k49603J28913K05944
5727I1433J18084k19152j3793L9181k36579j92152M1011L59953K22707j48379
5717F2314L5079J95503j27403m1204j71186K8046l6103j36086J25971J85409J20629
$$ plain form
5789 -344233 -20020 -48088 -51665 -354604 -594225 -657048 -547316 -313900 -194841 -82241
5779 -82241 81684 237565 562006 635199 364351 85500 120325 123274 28277 -60500 -34689
5768 -34689 81509 185741 557466 592767 542046 256895 -57374 -292047 -161355 234390
5758 234390 305267 373936 202705 183542 329699 105845 -25351 266533 348912 389788 478570
5747 478570 339585 144344 36076 -15663 -296860 -352932 -231770 -271155 -5812 219550
5737 219550 -21034 -26078 51788 256226 607282 305677 6179 -243424 -114511 91433
5727 91433 209517 -9635 -23428 15753 -220826 -412978 -371967 -12014 210693 62314
5717 62314 97393 292896 165493 124289 -46897 -18851 -54954 -191040 -65069 120340 240969
5706B40969P352j86118N7994q0967l8757J56216O4112j17799M8611q269l02877
5695a59533o6579L5049R6858J54219L4051k79323O6146k62379k50369J11239n5004
5684e75625K9116q6906N43859M07584j32671j10031k265r1538J52631N8346R9412
5673B91912k40907k17123k25407J46632l0500J55574M07264j88355k48892j68972
5663c18774M7571L04088L4267q1447j65787k14302K06810J0085J06566j08646
$$ plain form
5706 240969 248321 62203 120197 39230 473 156689 220801 103002 151613 143344 -159533
5695 -159533 -226112 -191063 -94205 60014 94065 -185258 -119112 -381491 -631860 -520621 -575625
5684 -575625 -546509 -633415 -89556 318028 185357 75326 73061 -18477 134154 192500 291912
5673 291912 51005 -166118 -391525 -244893 -275393 -119819 287445 99090 -149802 -318774
5663 -318774 -271203 32885 67152 -14295 -180082 -394384 -187574 -177489 -70923 -179569
$$ [...]
##END NTUPLES=NMR SPECTRUM
##END=
