##TITLE=Analysis number 312657
Compound Code cc 45316
Book Reference 436/74
Project Code qc-cat
Chemist Name williamk
##JCAMPDX= 6.0         $$ Bruker NMR JCAMP-DX V2.0
##DATA TYPE= NMR SPECTRUM
##DATA CLASS= NTUPLES
##ORIGIN= Bruker BioSpin GmbH
##OWNER= NMR
$$ XWIN-NMR		Version 3.5
$$ Wed Aug 10 12:23:10 2005 GMT Daylight Time (UT+1h)  MAYBRIDGE\NMR@NMR_250MHZ
##.OBSERVE FREQUENCY= 250.131544655141
##.OBSERVE NUCLEUS= ^1H
##.ACQUISITION MODE= SIMULTANEOUS (DQD)
##.ACQUISITION SCHEME= undefined
##.AVERAGES= 16
##.DIGITISER RES= 18
##SPECTROMETER/DATA SYSTEM= dpx250
##.PULSE SEQUENCE= zg30
##.SOLVENT NAME= CDCl3
##.SHIFT REFERENCE= (INTERNAL, CDCl3, 0, 16.522)
##AUDIT TRAIL= $$ (NUMBER, WHEN, WHO, WHERE, WHAT)
$$ ##TITLE= Audit trail, XWIN-NMR		Version 3.5
$$ ##JCAMPDX= 5.01
$$ ##ORIGIN= Bruker BioSpin GmbH
$$ ##OWNER= NMR
$$ C:\u/data/dgb/nmr/ADRS/7450/pdata/1/auditp.txt
$$ ##AUDIT TRAIL=  $$ (NUMBER, WHEN, WHO, WHERE, WHAT)
(   1,<2005-08-10 12:22:51.40 +100>,<MAYBRIDGE\NMR>,<NMR_250MHZ>,
      <created by zg, POWCHK disabled, PULCHK disabled
       configuration hash MD5:
       62 19 C7 07 E1 42 D1 B7 37 6C 3D D0 77 39 F9 E6
       data hash MD5: 64K
       4C 21 D8 FD 07 91 B5 BA 6C 68 02 BA CD B7 D4 8B>)
(   2,<2005-08-10 12:23:03.59 +100>,<MAYBRIDGE\NMR>,<NMR_250MHZ>,
      <Start of raw data processing
       ef LB = 0.3 FT_mod = 6 PKNL = 1 SI = 32K 
       data hash MD5: 32K
       97 75 9B BE E1 A4 FC F7 E3 47 6A E1 3E CC 9F 73>)
(   3,<2005-08-10 12:23:05.26 +100>,<MAYBRIDGE\NMR>,<NMR_250MHZ>,
      <apk 
       data hash MD5: 32K
       1A CD B2 09 6F 1C FA 67 E3 C8 F5 5B 4D 0D DC 23>)
(   4,<2005-08-10 12:23:05.93 +100>,<MAYBRIDGE\NMR>,<NMR_250MHZ>,
      <abs ABSG = 5 
       data hash MD5: 32K
       54 7D 35 55 8E 8A A5 1A D1 F7 AD A4 D5 EF 40 ED>)
$$ ##END=
$$ 
$$ hash MD5
$$ B8 AA 84 90 20 78 0A C8 B7 61 72 42 83 54 07 18
##$RELAX= 
##$RELAX= 
##$RELAX= 
##$RELAX= 
##$RELAX= 
##$RELAX= 
##$RELAX= 
$$ Bruker specific parameters
$$ --------------------------
##$DU= <C:\u>
##$EXPNO= 7450
##$NAME= <ADRS>
##$PROCNO= 1
##$TYPE= <nmr>
##$USER= <dgb>
##$AMP= (0..31)
100 100 100 100 100 100 100 100 100 100 100 100 100 100 100 100 100 100 
100 100 100 100 100 100 100 100 100 100 100 100 100 100 
##$AQSEQ= 0
##$AQ_mod= 3
##$AUNM= <au_zg>
##$AUTOPOS= <22 >
##$BF1= 250.13
##$BF2= 250.13
##$BF3= 250.13
##$BF4= 250.13
##$BF5= 500.13
##$BF6= 500.13
##$BF7= 500.13
##$BF8= 500.13
##$BYTORDA= 1
##$CFDGTYP= 0
##$CFRGTYP= 5
##$CHEMSTR= <none>
##$CNST= (0..31)
1 1 145 1 1 1 1 1 1 1 1 1 1 1 1 1 1 1 1 1 1 1 1 1 1 1 1 1 1 1 1 1 
##$CPDPRG= <>
##$CPDPRG1= <>
##$CPDPRG2= <>
##$CPDPRG3= <>
##$CPDPRG4= <mlev>
##$CPDPRG5= <mlev>
##$CPDPRG6= <mlev>
##$CPDPRG7= <mlev>
##$CPDPRG8= <mlev>
##$CPDPRGB= <>
##$CPDPRGT= <>
##$D= (0..31)
0 1 0 0 0 0 0 0 0 0.06 0 0 0 0 0 0 0.0002 0 0 0 0 0 0 0 0 0 0 0 0 0 0 
0 
##$DATE= 1123672970
##$DBL= (0..7)
120 120 120 120 120 120 120 120 
##$DBP= (0..7)
150 150 150 150 150 150 150 150 
##$DBP07= 0
##$DBPNAM0= <>
##$DBPNAM1= <>
$$ [...]
##$SUBNAM7= <"">
##$SUBNAM8= <"">
##$SUBNAM9= <"">
##$SW= 20.6930455092707
##$SWIBOX= (0..15)
0 0 3 0 0 0 0 0 0 0 0 0 0 0 0 0 
##$SW_h= 5175.983436853
##$TD= 65536
##$TD0= 1
##$TE= 295.16
##$TE2= 300
##$TE3= 300
##$TEG= 300
##$TL= (0..7)
0 120 120 120 120 120 120 120 
##$TP= (0..7)
150 150 150 150 150 150 150 150 
##$TP07= 0
##$TPNAME0= <>
##$TPNAME1= <>
##$TPNAME2= <>
##$TPNAME3= <>
##$TPNAME4= <>
##$TPNAME5= <>
##$TPNAME6= <>
##$TPNAME7= <>
##$TPOAL= (0..7)
0.5 0.5 0.5 0.5 0.5 0.5 0.5 0.5 
##$TPOFFS= (0..7)
0 0 0 0 0 0 0 0 
##$TUNHIN= 0
##$TUNHOUT= 0
##$TUNXOUT= 0
##$USERA1= <user>
##$USERA2= <user>
##$USERA3= <user>
##$USERA4= <user>
##$USERA5= <user>
##$V9= 5
##$VALIST= <valist>
##$VCLIST= <CCCCCCCCCCCCCCC>
##$VD= 0
##$VDLIST= <DDDDDDDDDDDDDDD>
##$VPLIST= <PPPPPPPPPPPPPPP>
##$VTLIST= <TTTTTTTTTTTTTTT>
##$WBST= 1024
##$WBSW= 4
##$XGAIN= (0..3)
0 0 0 0 
##$XL= 0
##$YL= 0
##$YMAX_a= 444922
##$YMIN_a= -512552
##$ZGOPTNS= <>
##$ZL1= 120
##$ZL2= 120
##$ZL3= 120
##$ZL4= 120
##$ABSF1= 16.522
##$ABSF2= -4.171173
##$ABSG= 5
##$ABSL= 3
##$ALPHA= 0
##$AQORDER= 0
##$ASSFAC= 0
##$ASSFACI= 0
##$ASSFACX= 0
##$ASSWID= 0
##$AUNMP= <proc_1d>
##$AZFE= 0.1
##$AZFW= 0.1
##$BCFW= 0
##$BC_mod= 0
##$BYTORDP= 0
##$COROFFS= 0
##$CY= 12.5
##$DATMOD= 1
##$DC= 0
##$DFILT= <>
##$DTYPP= 0
##$F1P= 14.0000005364418
##$F2P= -0.99999901652339
##$FCOR= 0.5
##$FTSIZE= 32768
##$FT_mod= 6
##$GAMMA= 0
##$GB= 0
##$INTBC= 1
##$INTSCL= 1
##$ISEN= 128
##$LB= 0.3
##$LEV0= 0
##$LPBIN= 0
##$MAXI= 10000
##$MC2= 0
##$MEAN= 0
##$ME_mod= 0
##$MI= 0
##$NCOEF= 0
##$NC_proc= -4
##$NLEV= 6
##$NOISF1= 0
##$NOISF2= 0
##$NSP= 0
##$NTH_PI= 0
##$NZP= 0
##$OFFSET= 16.522
##$PC= 1
##$PHC0= -78.2921
##$PHC1= 2.178143
##$PH_mod= 1
##$PKNL= yes
##$PPARMOD= 0
##$PSCAL= 4
##$PSIGN= 0
##$REVERSE= no
##$SF= 250.13
##$SI= 32768
##$SIGF1= 0
##$SIGF2= 0
##$SINO= 400
##$SIOLD= 32768
##$SREGLST= <1H.CDCl3>
##$SSB= 0
##$STSI= 32768
##$STSR= 0
##$SW_p= 5175.98343685301
##$SYMM= 0
##$S_DEV= 0
##$TDeff= 65536
##$TDoff= 0
##$TI= <Analysis number 999999
Compound Code 99
Book Reference 9
Project Code 9>
##$TILT= no
##$TM1= 0
##$TM2= 0
##$TOPLEV= 0
##$USERP1= <user>
##$USERP2= <user>
##$USERP3= <user>
##$USERP4= <user>
##$USERP5= <user>
##$WDW= 1
##$XDIM= 32768
##$YMAX_p= 436502974
##$YMIN_p= -145190
$$ End of Bruker specific parameters
$$ ---------------------------------
##NTUPLES= NMR SPECTRUM
##VAR_NAME=  FREQUENCY,     SPECTRUM/REAL,   SPECTRUM/IMAG
##SYMBOL=    X,             R,               I
##VAR_TYPE=  INDEPENDENT,   DEPENDENT,       DEPENDENT
##VAR_FORM=  AFFN,          ASDF,            ASDF
##VAR_DIM=   32768,         32768,           32768
##UNITS=     HZ,            ARBITRARY UNITS, ARBITRARY UNITS
##FACTOR=    0.157963299565203, 1,           1
##FIRST=     4132.6476996994, 0,             0
##LAST=      -1043.33573715361, 0,           0
##MIN=       -1043.33573715361, -145190,     0
##MAX=       4132.6476996994, 436502974,     0
$$ Real data points
##PAGE= N=1
##DATA TABLE= (X++(R..R)), XYDATA
$$ [...]
15818A6661j3147L753j2669j8472l4075n413q294M5612r912J7697L4598j3242
$$ 16661 3514 7267 -5402 -23874 -57949 -63362 -71656 -26044 -35956 -18259 16339 3097
15806C097L4603K0887K345L598k4642k0853k6923p734J7883m1818J1207M5961
$$ 3097 37700 58587 60932 64530 39888 19035 -7888 -15622 2261 -39557 -28350 17611
15794A7611L4465m2960k0266L9732K3865l3571j7983L0228K8218p954n1762j7063
$$ 17611 52076 9116 -11150 28582 52447 18876 893 31121 59339 51385 -377 -17440
15782a7440N796J290K3340j4177k9992k3530Q14K1771O89j0463J0218J0518j4503
$$ -17440 -11644 -10354 12986 -1191 -31183 -54713 -53899 -32128 -31439 -41902 -31684 -21166 -35669
15769c5669l4088k3980M0183L4566k8818l7734L3495M4848K5489N595j900N387
$$ -35669 -69757 -93737 -53554 -18988 -47806 -85540 -52045 -7197 18292 23887 21987 27374
15757B7374O385j1338k8089k0325p357j6712K0231K9375K4533J1618K702J535
$$ 27374 33759 22421 -5668 -25993 -33350 -50062 -29831 -456 24077 35695 38397 39932
15745C9932m4528j6017P606l4131q490J2785P361r237k0844K6365N8064J9471
$$ 39932 -4596 -20613 -13007 -47138 -55628 -42843 -35482 -44719 -65563 -39198 18866 38337
15733C8337j8921n1L4448m1165k6609l619M337M0918Q725k2759n3037m594J8062
$$ 38337 19416 19365 53813 12648 -13961 -17580 -13243 27675 36400 13641 -39396 -43990 -25928
15720b5928K1117R071k1743J7980J5085k9455k6304k1191k5905M378K4051L1971
$$ -25928 -4811 4260 -17483 497 15582 -13873 -40177 -61368 -87273 -82895 -58844 -26873
15708b6873M4250Q291n982j1566Q732j6912m1595l1372M8319J7333L301k1113
$$ -26873 17377 25668 19686 8120 16852 -60 -41655 -73027 -24708 -7375 -4074 -25187
15696b5187r047K7480K2987l384l5165q146J2035J924L8081K4089N301J1879P634
$$ -25187 -34234 -6754 16233 12849 -22316 -30462 -18427 -16503 21578 45667 50968 62847 70481
15683G0481j4701k9572K2996J7542n6045K3010M3241O648m1317j5123O318M183
$$ 70481 55780 26208 49204 66746 10701 33711 76952 83600 42283 27160 33478 37661
15671C7661J4485m2155k3034k2490j1709J1248M9216J5008L3155l8916m2456o028
$$ 37661 52146 9991 -13043 -35533 -47242 -35994 13222 28230 61385 22469 -19987 -26015
15659b6015K5401K8874k3468M912j2135k9637k2893J6832J2271j1990r101J635
$$ -26015 -614 28260 4792 9704 -2431 -32068 -54961 -38129 -25858 -37848 -46949 -45314
15647d5314J5145O518n465J1906J0128K6980j3349q952K3322j1569q164P570M169
$$ -45314 -30169 -23651 -29116 -17210 -7082 19898 6549 -2403 20919 9350 1186 8756 12925
15634A2925N74p176p803J5888Q287l8077j0566J1791J9226K0511J707l4009j2393
$$ 12925 13499 6323 -1480 14408 22695 -15382 -25948 -14157 5069 25580 27287 -6722 -19115
15621a9115J4185J4214j1505j7493m786j169L6034M7758j9495m4652n754J1176
$$ -19115 -4930 9284 -2221 -19714 -24500 -25669 10365 58123 38628 -6024 -11778 -602
15609f02l6382n6355K9060O6305k201m5273k1491N3833N623l068J5420k0810P780
$$ -602 -36984 -93339 -64279 2026 -175 -45448 -66939 -13106 -7483 -10551 4869 -15941 -8161
15596h161J1090Q963J4258o441K19k0625r237k1510J9393K9626j1647p243P059
$$ -8161 2929 11892 26150 19709 19928 -697 -9934 -31444 -12051 17575 5928 -1315 5744
15583E744N193J6143p51J3930J4261k2099k6174K870k0648K974L0200J9034l1050
$$ 5744 10937 27080 26329 40259 54520 32421 6247 9117 -11531 -8557 21643 40677 9627
15570I627O146l1657m3750m4096L3942M2969K1016j9777r185K5891L3210K770
$$ 9627 15773 -15884 -59634 -103730 -69788 -26819 -5803 -25580 -34765 -8874 24336 27106
15558B7106R375J4312m5009k1683J6025J3992p638J2719r956l1520q077K8287
$$ 27106 36481 50793 5784 -15899 126 14118 6480 19199 9243 -22277 -30354 -2067
15546b067P516l6532l1959J1606j9418K0064M6710M6513J8400o075l3455n1254
$$ -2067 5449 -31083 -63042 -51436 -70854 -50790 -4080 42433 60833 54758 21303 -29951
15534b9951K9539K9353N519j5885k8353O262m423n060j8693q866J6447P298l0646
$$ -29951 -412 28941 34460 18575 -9778 -3516 -7939 -12999 -31692 -40558 -24111 -16813 -47459
15521d7459m0988L1360P7211J5754k5317l0663j9140O277K6619N900N422n409
$$ -47459 -88447 -57087 20124 35878 10561 -20102 -39242 -32965 -6346 -446 4976 -433
15509d33J3172J2963J6822K701k5652K920K6167o258j0165j8279j5196J381L3735
$$ -433 12739 25702 42524 45225 19573 22493 48660 42402 32237 13958 -1238 143 33878
15496C3878l814j2166j0760j0112J1716P030J7497k350k9865M1413K8642J1866
$$ 33878 30064 17898 7138 -2974 8742 15772 33269 30919 1054 42467 71109 82975
15484H2975l5721k5199K0453k7378j4957J8333J0812P377l5749j9705J3828M9338
$$ 82975 47254 22055 42508 15130 173 18506 29318 36695 946 -18759 -4931 44407
15472D4407L1744k5116j4723l0944m753k7811k0020J4741J7191P1305M387l2054
$$ 44407 76151 51035 36312 5368 615 -27196 -47216 -32475 -15284 56021 60408 28354
15460B8354m3078l4207Q932J3204K2825K5852K4083k9809l7229p865M672m071
$$ 28354 -14724 -48931 -39999 -26795 -3970 21882 45965 16156 -21073 -28938 -24266 -28337
15448b8337L9720P804K2426k6291l7948K588k51J5358J8143K4892l0390k3543
$$ -28337 11383 19187 41613 15322 -22626 -20038 -20289 -4931 13212 38104 7714 -15829
15436a5829o672J2212j0790J2976M2358J0566p287o691k3764k9266j3727o045
$$ -15829 -22501 -10289 -21079 -8103 34255 44821 37534 30843 7079 -22187 -35914 -41959
15424d1959P623j4746N542R661L7636O042n80J5978k4053j8031R213J488j9616
$$ -41959 -34336 -49082 -43540 -33879 3757 9799 9219 25197 1144 -16887 -7674 -6186 -25802
15411b5802L8217L1108k1436l5269m7570R12L2022J7550K7426Q835j727j2974
$$ -25802 12415 43523 22087 -13182 -60752 -59840 -27818 -10268 17158 25993 24266 11292
15399A1292L9049K6707j4403j2678K974j6418k160M469o756P49j6850m007J2806
$$ 11292 50341 77048 62645 49967 52941 36523 34363 38832 32076 32825 15975 11968 24774
15386B4774l376j9953r89k805k5704J3529o588J5781J495J5890j4107l0177K9368
$$ 24774 21398 1445 456 -2349 -28053 -14524 -21112 -5331 -3836 12054 -2053 -32230 -2862
15373b862L6747J1288N771P60k8625l3029R444l491J6041j144j9934k8679K3161
$$ -2862 33885 45173 50944 51704 23079 -9950 -506 -3997 12044 10900 -9034 -37713 -14552
15360a4552n779J49K6284J1315j6796o382k4077m28j8575J8952J8521J1472J8990
$$ -14552 -20331 -20182 6102 17417 621 -5761 -29838 -30266 -48841 -29889 -11368 104 19094
15347A9094j2962n177k4352N021M0207J6385q430j594j991k0544j1069M0390L054
$$ 19094 6132 955 -23397 -18376 21831 38216 29786 28192 26201 5657 -5412 34978 38032
15334C8032k3344r830j3760j8428j7975K3718L8043k6925m971L4905o21j4746
$$ 38032 14688 4858 -8902 -27330 -45305 -21587 16456 -10469 -15440 19465 18844 4098
15322D098L7533k7033r834J2262j7174o03j4127m64L434P515K696j7647J2707
$$ 4098 41631 14598 4764 17026 -148 -751 -14878 -15342 -11908 -4393 -1697 -19344 -6637
15309f637L7880K3598J2255P74k6048j7609k7300k9845j2704M3096O1013M6732
$$ -6637 31243 54841 67096 67870 41822 24213 -3087 -32932 -45636 -2540 58473 105205
15297A05205l5893l3769j7403k9248J5428n006k8132l08n083K4747J6672O826
$$ 105205 69312 35543 18140 -11108 4320 -686 -28818 -29126 -34209 -9462 7210 14036
15285A4036l891m8115o578r540L1553O8733k0383J5699j5846P09r106l0269J757
$$ 14036 10145 -37970 -44548 -54088 -22535 46198 25815 41514 25668 26377 17271 -12998 -11241
15272a1241J053m6320p025L4528M5571o4999l6135K7077j7792J9493N9446J2323
$$ -11241 -10188 -56508 -63533 -29005 16566 -48433 -84568 -57491 -75283 -55790 3656 15979
15260A5979J199n248M895K2933j3989k8982l2009j4794K4813K3929P027k2640
$$ 15979 17178 11930 16825 39758 25769 -3213 -35222 -50016 -25203 -1274 5753 -16887
15248a6887j6810K9064k4994J6585J2077L0237K9235J8286L4860J0393j8412l1963
$$ -16887 -33697 -4633 -29627 -13042 -965 29272 58507 76793 111653 122046 103634 71671
15236G1671k1501j8125l9039k352O05J4188p807k5515m4797Q585O0796l102K1101
$$ 71671 50170 32045 -6994 -9346 -8741 5447 -2360 -27875 -72672 -64087 -3291 -6393 14708
15223A4708J1482L631l1739k6594j3731L9626L5435K6800j2467j5342l3241l3869
$$ 14708 26190 29821 -1918 -28512 -42243 -2617 32818 59618 47151 31809 -1432 -35301
15211c5301K3955L0870K5401M408N999l415K0265j3547j0238k8951q666k423k8489
$$ -35301 -11346 19524 44925 49333 55332 51917 72182 58635 48397 19446 10780 8357 -20132
15198b0132L7626K7356n5128k0984J2524J3647M713p703L2722L9189l0594j6955
$$ -20132 17494 44850 -10278 -31262 -18738 -5091 -378 -8081 24641 63830 33236 16281
15186A6281J9111J6658q062k0832l7756j195J8493J3780L4176k3696o099J7716
$$ 16281 35392 52050 43988 23156 -14600 -15795 2698 16478 50654 26958 20859 38575
15174C8575M820K1348J5025m2384j5907j83J7455M077J31k4490r925k9651j9037
$$ 38575 43395 64743 79768 37384 21477 21294 38749 42826 42957 18467 8542 -21109 -40146
15161d0146J9119J5610L1950O970j5856p879K4931K9018j3171j2350J2580k1468
$$ -40146 -21027 -5417 26533 33503 17647 9768 34699 63717 50546 38196 50776 29308
15149B9308l9593j0937J4015j856j7885L098K1252J4336J5280K3061J1255K3838
$$ 29308 -10285 -21222 -7207 -9063 -26948 -23850 -2598 11738 27018 50079 61334 85172
15137H5172l8187m3663J0440J0808j6813K185k8621o887n721L316O961K1910O164
$$ 85172 46985 3322 13762 24570 7757 9942 -18679 -25566 -31287 -27971 -21010 900 7064
15124G064J9677j8334j9726J5633M6259M4669K1370p10k1669m8083l6824j8707
$$ 7064 26741 8407 -11319 4314 50573 95242 116612 115902 94233 46150 9326 -9381
15112i381J9685K6349r277p742k2474j098K189J7890l1978L391k6148R59K8162
$$ -9381 10304 36653 27376 19634 -2840 -3938 -1749 16141 -15837 -12446 -38594 -37635 -9473
15099i473J0702J8752K1895o071k2605k0961J1698M2778K6410j1279R329J836
$$ -9473 1229 19981 41876 35805 13200 -7761 3937 46715 73125 61846 71175 73011
15087G3011n492k1174k111N0522m152k6210o919j1049r415L0389q184o752k1758
$$ 73011 67519 46345 44234 94756 90604 64394 57475 46426 37011 67400 59216 52464 30706
15074C0706o2494L318R373J7517K4174J7567K4379K20k7543k820Q591J5410n3243
$$ 30706 -31788 -28470 -19097 -1580 22594 40161 64540 64760 37217 34397 42988 58398 5155
15061E155j0415m585j4470K0796M4059J5476P766k5845l2904l9780N389L031l4742
$$ 5155 -5260 -9845 -24315 -3519 40540 56016 63782 37937 5033 -34747 -29358 -26327 -61069
15048f1069R809J9615J5648M097K1594O809k5060j6220r779O294L6968M4567j2944
$$ -61069 -51260 -31645 -15997 -11900 9694 16503 -8557 -24777 -34556 -28262 8706 53273 40329
15035D0329j3229l1575Q067j9144K2694Q667J601o279K765n124K351N813K5112
$$ 40329 27100 -4475 3592 -15552 7142 15809 17410 11131 13896 8772 11123 16936 42048
15022D2048k53k5255m1893J8551M2393j6161K022L830o6047K2786L5362Q6555
$$ 42048 41795 16540 -25353 -6802 35591 19430 21452 25282 -40765 -17979 17383 103938
15010A03938k065l1970j6848o3143J3201K3213j9020J6822k0137M105o903k1574
$$ 103938 101873 69903 53055 -10088 3113 26326 7306 24128 3991 8096 1193 -20381
14998b0381Q836p725K817J3225l900K675j1339K9722M2866J3557K269l347k0146
$$ -20381 -11545 -19270 -16453 -3228 -7128 -4453 -15792 13930 56796 70353 72622 69275 49129
14985D9129j6241k3157J0601K477l925r052j5858L5905J2318n8943l8402K5396
$$ 49129 32888 9731 20332 22809 18884 9832 -6026 29879 42197 -16746 -55148 -29752
14973b9752K6736Q208l690l4004K0487J4934m3626j6962J1846K6813K9810M8616
$$ -29752 -3016 5192 1502 -32502 -12015 2919 -40707 -57669 -45823 -19010 10800 59416
14961E9416p599o23l6930k4774K5762P302k8451j1765M705J2663q803j4937m0177
$$ 59416 51817 51194 14264 -10510 15252 22554 -5897 -17662 -12957 -294 -9097 -24034 -64211
14948f4211J8646j6625K03j2365Q575K6467L499j7140l9644J1462M5701J1461
$$ -64211 -45565 -62190 -61987 -74352 -65777 -39310 -35811 -52951 -92595 -81133 -35432 -23971
14936b3971m2508K4358L4713L782J4973K4329j8094m9177j3807K1859J0333L6596
$$ -23971 -66479 -42121 -7408 -3626 11347 35676 17582 -31595 -45402 -23543 -13210 23386
14924B3386J6293j8187J2578L841k2627l7437j1685L610N245r786R87R134K4930
$$ 23386 39679 21492 34070 37911 15284 -22153 -33838 -30228 -24983 -34769 -33782 -24648 282
14911B82Q364l096K7548l0255m6924j4740q164j8620Q734M1463M4460N018j4949
$$ 282 8646 5550 33098 2843 -44081 -58821 -66985 -85605 -76871 -35408 9052 14070 -879
14898h79N2307k8834n237J8215j776L204K4638q880k3234n0574j7733K1473J7086
$$ -879 51428 22594 17357 35572 33796 37000 61638 52758 29524 -21050 -38783 -17310 -224
14885b24K0387l2105O257N1806L1560l3333l4366j8639l239J567L2975m816J4669
$$ -224 20163 -11942 -5685 46121 77681 44348 9982 -8657 -11896 -10329 22646 17830 32499
14872C2499J9388m5697J0692J8921k0574L9272r738o1190k8210k491J7309k3110
$$ 32499 51887 6190 16882 35803 15229 54501 44763 -16427 -44637 -47128 -29819 -52929
14860e2929m191L3036k038j1661J4391K4917J3254J24l7971P04J8570j3749J446
$$ -52929 -57120 -24084 -26122 -37783 -23392 1525 14779 14903 -23068 -22364 -3794 -17543 -16097
14847a6097n287M2541p866j5657k407k437J2747J3947M27J9224j1213N624Q862
$$ -16097 -21384 21157 13291 -2366 -4773 -7210 5537 19484 19911 39135 27922 33546 42408
14834D2408K6443k1049K9076O034k5849J2313j9016j7658J824m1563k6523l525
$$ 42408 68851 47802 76878 82912 57063 69376 50360 32702 34526 -7037 -33560 -37085
14822c7085O421m161k7912Q062O3656J7937Q709j4681k5076J2805K087q858N522
$$ -37085 -30664 -34825 -62737 -54675 8981 26918 35627 20946 -4130 8675 10762 1904 7426
14809G426j9595J9480o960J1187j5961k9618L2186N286m8382l3210L9594K7002
$$ 7426 -12169 7311 351 11538 -4423 -34041 -1855 3431 -44951 -78161 -38567 -11565
14797a1565K45k3232K2922N4239N811l045j2450j9405K033J6323K5865L0246n5181
$$ -11565 -11320 -34552 -11630 42609 48420 45375 32925 13520 15553 31876 57741 87987 32806
14784C2806k9475j2235N8993K3161n0225l2933m601K3229J5907M311r044j8027
$$ 32806 3331 -8904 50089 73250 23025 -9908 -14509 8720 24627 28938 19894 1867
14772A867j2548K833J548R204k2986J5662l961O656J9890o599K6211j5167k8245
$$ 1867 -10681 -7848 -6300 2904 -20082 -4420 -8381 -1725 18165 11566 37777 22610 -5635
14759e635J165K0523L6464k3427j3966k116j6716K6812j7329j0845j4033J9030
$$ -5635 -4470 16053 52517 29090 15124 13008 -3708 23104 5775 -5070 -19103 -73
14747g3k5111l62m746k3382l1466J1385M2391J6631j428O315o103l9279j814L6399
$$ -73 -25184 -25546 -30292 -53674 -85140 -73755 -31364 -14733 -16161 -9846 -15949 -55228 -57042 -20643
14733b0643K90K3776Mk7738L7604L9816K9419l0822j3283Q22j7911K4630m771
$$ -20643 -20353 3423 3427 -24311 13293 53109 82528 51706 38423 39245 21334 45964 41193
14720D1193l3435k1620q854o678K0469K0033K916l0766n776k868K5726j9967k1932
$$ 41193 7758 -13862 -22716 -29394 -8925 11108 14024 -16742 -22518 -25386 340 -19627 -41559
14707d1559N1246N0699n711Q457j0955l3158l4482K4435P066n7683m2281M8556
$$ -41559 9687 60386 54675 63132 52177 19019 -15463 8972 16038 -41645 -83926 -35370
14695c5370L0042J3840K4743o490l9762M808K1212L0344j2391l4417j3530N356
$$ -35370 -5328 8512 33255 26765 -12997 -8189 13023 43367 30976 -3441 -16971 -11615
14683a1615j5924l1046L1855K7265M962q784k5910j8003j7346J4123P376m053
$$ -11615 -27539 -58585 -26730 535 5497 -3287 -29197 -47200 -64546 -50423 -43047 -47100
14671d7100J7574P826m65J1311M7028M2381j6376k0273l6332j2117L2889q603
$$ -47100 -29526 -21700 -22165 -10854 36174 78555 62179 41906 5574 -6543 26346 17743
14659A7743n635L847K9233j7716m8075m894j9745l8060O324O0757K7301r270k1815
$$ 17743 12108 15955 45188 27472 -20603 -25497 -45242 -83302 -76978 -16221 11080 1810 -20005
14646b0005j1314L2921K1157J5660l0712l1051j0913k5939j6962M0322O029K5007
$$ -20005 -31319 1602 22759 38419 7707 -23344 -34257 -60196 -77158 -36836 -30807 -5800
14634e800J9407K3526J6042K0958l249j4013m6567K3512M8043J2555l5317k1885
$$ -5800 13607 37133 53175 74133 70884 56871 10304 33816 81859 94414 59097 37212
14622C7212K2897k5798j8040k0446j320P961l972K743l755K0742L1070k5362o1923
$$ 37212 60109 34311 16271 -4175 -5495 2466 -1506 1237 -2518 18224 49294 23932 -37991
14609c7991j159J669L9002K0896j0382k5K771L699k3833j5021J622o261O825j2948
$$ -37991 -39150 -37481 1521 22417 12035 12010 14781 18480 -5353 -20374 -18752 -25013 -18188 -31136
14595c1136J1158L6766J1812m7301j4369M5508L1149J7908m757p859J6565j3113
$$ -31136 -19978 16788 28600 -18701 -33070 12438 43587 61495 56738 48879 65444 52331
14583E2331k8778j0310j727P598M795l680M4262J5558n281k5150k3849k5841n4504
$$ 52331 23553 13243 11516 19114 23909 20229 64491 80049 74768 49618 25769 -72 -54576
14570e4576K7383J8503j0444L0465L5909K1109J2752l1796j310j2804l1344M862
$$ -54576 -27193 -8690 -19134 11331 47240 68349 81101 49305 47995 35191 3847 8709
14558H709r273k4914L7013J7733K7122n083l4841l2041k361n23k0737K1257O821
$$ 8709 -564 -25478 11535 29268 56390 51307 16466 -15575 -17936 -18459 -39196 -17939 -11118
14545a1118k815K347K983j9926O542K848K5781j3093q993L5356K1445k4878j0034
$$ -11118 -13933 -11586 -8603 -28529 -21987 -19139 6642 -6451 -15444 19912 41357 16479 6445
14532F445j239R02k845o0933l8585L3877N278K0565M7034J9858l2487O928J3707
$$ 6445 5206 6108 3263 -57670 -96255 -62378 -57100 -36535 10499 30357 -2130 4798 18505
14519A8505j1835k833l213j2995K5293k2491n10L5363Q47o977J5813J8172l621
$$ 18505 6670 3837 624 -12371 12922 -9569 -10079 25284 26131 19154 34967 53139 49518
14506D9518o2217n7498K611L8385L3805K2985M3820P602o3435l4414L3118J2097
$$ 49518 -12699 -70197 -67586 -29201 4604 27589 71409 79011 15576 -18838 14280 26377
14494B6377J018L9514Q686l0205K2955L0070O128k6284j5416j719k1971j3708
$$ 26377 27395 66909 75595 45390 68345 98415 104543 78259 62843 61124 39153 25445
14482B5445L018j5699R769K7938J7510l641J5670j6744k5603k416R337J1179n27
$$ 25445 28463 12764 22533 50471 67981 64340 80010 63266 37663 35247 44584 55763 55236
14469E5236j6332k7180p003J386q821L6941L682l302J8407M333o207p943k3432
$$ 55236 38904 11724 4721 6107 -2714 34227 37909 34607 53014 57347 51140 43197 19765
14456A9765k410O19J6166J8358P087J755L407j2641o2011J204M2053k4841K045
$$ 19765 17355 17974 34140 52498 59585 61340 64747 52106 -9905 -8701 33352 8511 10556
14443A0556J4268j3570o119K0475P095j9773j0667l749J8392O006k1045k0087
$$ 10556 24824 11254 5135 25610 32705 12932 2265 -1484 16908 22914 1869 -18218
14431a8218J2439J0528K615K890n906q19J8347O872J8421j2822j4741J944L0800
$$ -18218 -5779 4749 7364 10254 4348 3529 21876 28748 47169 34347 19606 21550 52350
14418E2350j2106j9291j4909k0851K525L2343r673l3629K1176J4119K8569Q52
$$ 52350 40244 20953 6044 -14807 -12282 20061 10388 -23241 -2065 12054 40623 41475
14406D1475K2712K2765q567l5121l4771k5425r43k0898N1305R504n389J6803L8542
$$ 41475 64187 86952 78385 43264 8493 -16932 -17875 -38773 12532 22036 16647 33450 71992
14393G1992k194k8954l5728j4111L1242j158R38k6882L822j0531R336P281l595
$$ 71992 69798 40844 5116 -8995 22247 21089 22027 -4855 -1033 -11564 -2228 5053 1458
14380A458k406J0400M549m104Q752O329j4659K42L6745j2220k6668J1712n186
$$ 1458 -948 9452 14001 9897 18649 24978 10319 10561 47306 35086 8418 20130 14944
14367A4944k2114N088N898j1978n1302K7951J4224J3060J5214K3744J5246o712
$$ 14944 -7170 -2082 3816 -8162 -59464 -31513 -17289 -4229 10985 34729 49975 43263
14355D3263m5950J9227L4783k520j109l8569j3771K5140K8938J5182l0115k3056
$$ 43263 -2687 16540 51323 48803 47694 9125 -4646 20494 49432 64614 34499 11443
14343A1443R113k946J618j4692J9946J6373m0041m7620j5139J5102m72K8875L6799
$$ 11443 20556 17610 19228 4536 24482 40855 814 -46806 -61945 -46843 -47315 -18440 18359
14330A8359Q170J5838J067k6248o754M1190P181K0322L027o1856k8445N0842J8804
$$ 18359 26529 42367 43434 17186 10432 51622 58803 79125 82152 20296 -8149 42693 61497
14317F1497j0286j3836l8983j9858j9288j1762M251J8301K8906L4190j3196m97
$$ 61497 51211 37375 -1608 -21466 -40754 -52516 -48265 -29964 -1058 33132 19936 19439
14305A9439N509r868j1284J9135K023j4860l7275L3886N7040J0878m2642j4805
$$ 19439 24948 15080 3796 22931 24954 10094 -27181 6705 63745 74623 31981 17176
14293A7176J7004j533k5446J0003r6K8346J0094j810Q46j203M053j6674j6231
$$ 17176 34180 32647 7201 17204 17108 45454 55548 53738 54584 53381 57434 40760 24529
14280B4529j1177k7867l9427q199L7962K0176K1368L179l7478k0657L645K3467
$$ 24529 13352 -14515 -53942 -62141 -24179 -4003 17365 20544 -16934 -37591 -33946 -10479
14268a0479M987N8274j8272l7751l8732J952j8862m642K3381J3065L8715J8218
$$ -10479 -5492 52782 34510 -3241 -41973 -40021 -58883 -63525 -40144 -27079 11636 29854
14256B9854k3354k4710J8867L2440j7362j2779K0435K9012J2387k13L1050o307
$$ 29854 6500 -18210 657 33097 15735 2956 23391 52403 64790 64577 95627 89320
14244H9320n6747k0112O390M8914M686k6542q621j1652n482j29O859K9843k0807
$$ 89320 32573 12461 18851 67765 72451 45909 37288 25636 20154 20025 26884 56727 35920
14231C5920j9768R446M56J9244k9150J5067M6171j5135L871J9738K527n219m9014
$$ 35920 16152 25598 26054 45298 16148 31215 77386 62251 66122 85860 88387 83168 34154
14218C4154Q533L773N959k9447k2290j8237J4893K8783K9629Q052M840J1034r104
$$ 34154 42687 46460 52419 22972 682 -17555 -2662 26121 55750 63802 68642 79676 70572
14205G0572J4037j9754j537k1670k9192L452J7155k8560l069L7742J330j8672
$$ 70572 84609 64855 63318 41648 12456 15908 33063 4503 1434 39176 40506 21834
14193B1834L638j4761j3064J9655l7934m2495J2050J4242J0216K1117J5674k373
$$ 21834 25472 10711 -2353 17302 -20632 -63127 -51077 -36835 -26619 -5502 10172 7799
14181G799Q173O054K2800r17j2339n254K226l1718m0790P068j0616M0167J8007
$$ 7799 15972 22026 44826 43909 31570 26316 28542 -3176 -43966 -36898 -47514 -7347 10660
14168A0660L1500j5092q542l2161m3938J9898P80K7301M9425O106j6994P718L2573
$$ 10660 42160 27068 18526 -13635 -57573 -37675 -36895 -9594 39831 45937 28943 36661 69234
14155F9234j4006m2013l0990M8683j061K3887J0155R675J0952l680m895m0971
$$ 69234 55228 13215 -17775 30908 29847 53734 63889 73564 84516 80836 75941 34970
14143C4970j2184j0204r418K5893M637J6121J3374q337j4240J9209K5225K359
$$ 34970 22786 12582 3164 29057 33694 49815 63189 54852 40612 59821 85046 87405
14131H7405j4655J1705K5894k3746o22M511j8668j6157o38j6097J0407k8748J0673
$$ 87405 72750 84455 110349 86603 85981 90492 71824 55667 55029 38932 49339 20591 31264
14118C1264k3523k3141k4729J2089R054K1654n204K2696L7353K594j5264m0870
$$ 31264 7741 -15400 -40129 -28040 -18986 2668 -2536 20160 57513 60107 44843 3973
14106C973j274o22j2728k8169K3560K4033Q41K4215j7058N761K8246L1511K3683
$$ 3973 2699 2077 -10651 -38820 -15260 8773 9614 33829 16771 22532 50778 82289 105972
14093A05972m7901m2229l9896j0252N1501K3256j4431J3300j924j5603N561n572
$$ 105972 58071 15842 -24054 -34306 17195 40451 26020 39320 37396 21793 27354 21782
14081B1782m523j6991N726J2694L719j0487l4529j1530K4054k680K766m057k046
$$ 21782 17259 268 5994 18688 22407 11920 -22609 -34139 -10085 -12765 -9999 -14056 -16102
14068a6102L4986J3650j8089J5684m210M4567n320N470l0872p42J55r223J9778
$$ -16102 18884 32534 14445 30129 25919 70486 65166 70636 39764 39022 39177 29954 49732
14055D9732K0291l8509k6136k160K4371K5356O0880k7900l7237J7876J5687r823
$$ 49732 70023 31514 5378 3218 27589 52945 113825 85925 48688 66564 82251 72428
14043G2428P099R427q422k1193j0980R297O556k8730j3570K1111R322n2146l3705
$$ 72428 79527 88954 80532 59339 48359 57656 64212 35482 21912 43023 52345 199 -33506
14030c3506o300J8169M906K3658j3496J4275N864M192M023j7835K0407l632k1007
$$ -33506 -39806 -21637 -16731 6927 -6569 7706 13570 17762 21785 3950 24357 20725 -282
14017b82j4742j5940k2344k6731M742K1057M5863L5205J5878k3362P244l2567
$$ -282 -15024 -30964 -53308 -80039 -75297 -54240 -8377 26828 42706 19344 26588 -5979
14005e979k18L3867q069k1716m192N106k430K139J9159K8700P274j2747j3861
$$ -5979 -6197 27670 19601 -2115 -6307 -1201 -3631 -1492 17667 46367 53641 40894 27033
13992B7033L8599J9293m230j3013o691m7485k8542L997K576J3223k4860k3429
$$ 27033 65632 84925 80695 67682 60991 13506 -15036 -11039 -8463 4760 -20100 -43529
13980d3529M844K2287J5438P652j2373L9157P472k423J0001j8480K1755K7408
$$ -43529 -38685 -16398 -960 6692 -5681 33476 40948 38525 48526 30046 51801 79209
13968G9209p98r904K661J776j1006m0782M802K8680K0918k67j8743k8477l6399
$$ 79209 78411 68507 71168 72944 61938 21156 25958 54638 75556 75289 56546 28069 -8330
13955h330J351L0980J9987J1158J0282Q314k8343l5058p454j0766q242N4123q182
$$ -8330 -6979 24001 43988 55146 65428 73742 45399 10341 2887 -7879 -16121 38002 29820
13942B9820k9655l17r598j0438M571J5586j4546J5887M2546K501n933j8543J8853
$$ 29820 165 -152 -9750 -20188 -15617 -31 -14577 1310 43856 46357 40424 21881 40734
13929D0734L9455k9632o8724J8818M9185L9939L225n6316K0009j598J9946j2607
$$ 40734 80189 50557 -18167 651 49836 89775 93000 36684 56693 55095 75041 62434
13917F2434Q55k915k3546k5157j9382K0010m91j5612j1094L0445N896J6464J8648
$$ 62434 63289 60374 36828 11671 -7711 12299 11808 -3804 -14898 15547 21443 37907 56555
13904E6555j6304j8340O93L3381L832l9520n9148K2587L0069K9007p099k4684
$$ 56555 40251 21911 22604 55985 59817 20297 -38851 -16264 13805 42812 35713 11029
13892A1029k3811j615N520J60J517R05k054K3356N276N682J7025J3483o746l544
$$ 11029 -12782 -14397 -8877 -8717 -7200 -6295 -8349 15007 20283 25965 42990 56473 49727 46183
13878D6183N047j013P463L171K232k4027j9815j5488j5789M33L5772K2940k3433
$$ 46183 51230 50217 57680 60851 63083 39056 19241 3753 -12036 -11603 24169 47109 23676
13865B3676k8155K1649J4289m794k4506K8692N1307m0009m6399J6891J5035J0571
$$ 23676 -4479 17170 31459 26665 2159 30851 82158 42149 -4250 12641 27676 38247
13853C8247L3903L4173k0184m1006j247j0937k8626j5585j206j7504L1515L2256
$$ 38247 72150 106323 86139 45133 43886 32949 4323 -11262 -12468 -29972 1543 33799
13841C3799p915j8958K5734j6414k8270O374L6890O082J953P692j8982l953j0231
$$ 33799 25884 6926 32660 16246 -12024 -5650 31240 37322 39275 46967 27985 24032 13801
13828A3801k4418L0665K6427L2341N515j9516J4808m401L637l440k3544P585K5574
$$ 13801 -10617 20048 46475 78816 84331 64815 79623 75222 78859 75419 51875 59460 85034
13815H5034K7378l9663k2493j819J4262K0236l0814m3327l3203k6510l0421K6315
$$ 85034 112412 72749 50256 48437 62699 82935 52121 8794 -24409 -50919 -81340 -55025
13803e5025K1296N4321L5887j7109l2925j4045j5189l1848J562K2521J6203n422
$$ -55025 -33729 20592 56479 39370 6445 -7600 -22789 -54637 -53075 -30554 -14351 -19773
13791a9773K4279J1428m290J5550M8860k6869m263L4024Q178J0059M456K6787
$$ -19773 4506 15934 11644 27194 76054 49185 44922 78946 87124 97183 101639 128426
13779A28426o5449n0276P79j5792O217L0725k3507K462j1042J694R752L8948n1
$$ 128426 62977 12701 13480 -2312 3905 34630 11123 13585 2543 4237 13989 52937 52886
13766E2886k4864l4781l0333J3181L4620O681j2850P309k9645P281K8707M0212
$$ 52886 28022 -6759 -37092 -23911 10709 17390 4540 11849 -17796 -10515 18192 58404
13754E8404K8581m677k1768j4047k1858l336K499J6791j3490J6972K2362j8404
$$ 58404 86985 82308 60540 46493 24635 21299 23798 40589 27099 44071 66433 48029
13742D8029l3527l6157K157J0958K6110n487n9160j5328L5644K4473M4676k483
$$ 48029 14502 -21655 -19498 -8540 17570 12083 -47077 -62405 -26761 -2288 42388 39905
13730C9905J3160q930k0361o071O132k4203o599K7R743L6835o306m5860j1808
$$ 39905 53065 44135 23774 17703 23835 -368 -6967 -6940 2803 39638 33332 -12528 -24336
13717b4336K3879J5510L432N829K8117M816k5847J1194M181J369J7462k9743k1230
$$ -24336 -457 15053 18485 24314 52431 57247 31400 42594 46775 48144 65606 35863 14633
13704A4633J1344P326j4803l6920K0627J7222K496j795J2547K5974K3885N424
$$ 14633 25977 33303 18500 -18420 2207 19429 21925 20130 32677 58651 82536 87960
13692H7960o282l0016j2186P912K7305l0276Q50j5406k36l417K1551L9405j6183
$$ 87960 81678 51662 39476 47388 74693 44417 45267 29861 29625 26208 47759 87164 70981
13679G0981l8539R91L9977j1471k7279j7569K3141Q006o893N994M155l28L1263
$$ 70981 32442 33433 73410 61939 34660 17091 40232 48238 41345 47339 51494 51166 82429
13666H2429J0794j2996J3471K637r739l1243j9802J2876r350J9499M9558R331
$$ 82429 93223 80227 93698 96335 86596 55353 35551 48427 39077 58576 108134 117465
13654A17465k4299j3303L574j0172N143R217K1431j0364l5687o186J1042M997
$$ 117465 93166 79863 83437 73265 78408 87625 109056 98692 63005 56819 67861 72858
13642G2858k4613j154M7532L6821R114J4128m658n4322m1254p704R35K0916J1764
$$ 72858 48245 47091 94623 131444 140558 154686 150028 95706 54452 46748 47683 68599 80363
13629H0363k505j8038J5797j5408l4547R114K1396n210j1201P468j0737l0957
$$ 80363 77858 59820 75617 60209 25662 34776 56172 50962 39761 47229 36492 5535
13617E535J1683J5900J5347j3074o140L0492J6133R428j9633L056r259n5179j0971
$$ 5535 17218 33118 48465 35391 29251 59743 75876 85304 65671 68727 59468 4289 -6682
13604f682J8598K8570n032J9317L5062J4570m0100l1002p617M4079K1693l5852
$$ -6682 11916 40486 35454 54771 89833 104403 64303 33301 25684 69763 91456 55604
13592E5604l1267m22l16J207M5065j1498l7648l4138k2567J2353L1178K4815L448
$$ 55604 24337 23915 23599 24806 69871 58373 20725 -13413 -35980 -23627 7551 32366 35814
13579C5814K742j9213j842M0267J2096J0724k8772l0768J9407L0984q629J0744
$$ 35814 38556 19343 17501 57768 69864 80588 51816 21048 40455 71439 62810 73554
13567G3554j54n3625M318K3253J6521L187j3088r868k9690J0431K5346J9440M0147
$$ 73554 73400 19775 24093 47346 63867 67054 53966 44098 14408 24839 50185 69625 109772
13554A09772k851j3911o129j7985J614K1579j6523k8610k2197J2341M8506j5735
$$ 109772 106921 93010 86881 68896 70510 92089 75566 46956 24759 37100 85606 69871
13542F9871l3371k0006J2157N525j3682j7294l7384j3855L491M3102J1739o198
$$ 69871 36500 16494 28651 34176 20494 3200 -34184 -48039 -44548 -1446 10293 4095
13530D095j6005K6934L5878K0324m9630J0014J4375j9072m892L890k9432O717
$$ 4095 -11910 15024 50902 71226 21596 31610 45985 26913 22021 25911 -3521 3196
13518C196N039K015K6370J0807J1144j1812o739M4451o477m7459J1572J174J839
$$ 3196 8235 10250 36620 47427 58571 46759 40020 84471 77994 30535 42107 43281 45120
13505D5120L0281Q00j4296l0504N250n165J3406l4942l3451K6414N7684j1187
$$ 45120 75401 76201 61905 31401 36651 31486 44892 9950 -23501 2913 60597 49410
13493D9410q079J7962J3277k7709Q271J8996M4103R87Q608N188n2283p579k8033
$$ 49410 41331 59293 72570 44861 53132 72128 116231 117218 125826 131014 78731 71152 43119
13480D3119k3664J3063J6520L447K6194K7573P045j3814m187J2142l0916l4617
$$ 43119 19455 32518 49038 52485 78679 106252 113297 99483 95296 107438 76522 41905
13468D1905j2314m073J4072O956J853l0369Q540M0970k4606j365J887j2752J3722
$$ 41905 29591 25518 39590 46546 48399 18030 26570 67540 42934 41569 43456 30704 44426
13455D4426J4414j0102M368K1218n606J7761p203p436j7873J2149p986J8040K2569
$$ 44426 58840 48738 53106 74324 68718 86479 79276 71840 53967 66116 58130 76170 98739
13442I8739j2019p896O323J2338q990k809M308J0140j8692j0538j2823q967J7895
$$ 98739 86720 78824 85147 97485 88495 85686 89994 100134 81442 70904 58081 49114 67009
13429F7009k2499p2725k7442M0477M7627Q85m2203K4348Q4015r953j8392j2442
$$ 67009 44510 -28215 -55657 -15180 32447 33332 -8871 15477 99492 89539 71147 58705
13417E8705j8238j9282L0444L4648m142j6907J7657j6595j1212l155j8335p609
$$ 58705 40467 21185 51629 86277 82135 65228 82885 66290 55078 51923 33588 25979
13405B5979m551R081J3204K4576r870k0047j6467L1857M6425L610n2034j839J5732
$$ 25979 21428 30509 43713 68289 58419 38372 21905 53762 100187 103797 51763 49924 65656
13392F5656m990l694o521R616K1642k9065K4146J0438k6729l0413O020K7983P121
$$ 65656 60666 56972 50451 60067 81709 52644 76790 87228 60499 30086 36106 64089 71210
13379G1210k8672J6705k2761m3679J3618j6434j26K1493m200Q122j976n565N05
$$ 71210 42538 59243 36482 -7197 6421 -10013 -10139 11354 7154 15276 13300 7735 8240
13366H240J5203P958o835J6574J3958K4542M840k4773j67l0757k7563N833R098
$$ 8240 23443 31401 24566 41140 55098 79640 84480 59707 59540 28783 1220 7053 16151
13353A6151P658j2220j0413K1703M2110J5093j9091O211J2033k4186K9694K1135
$$ 16151 23809 11589 1176 22879 64989 80082 60991 67202 79235 55049 84743 105878
13341A05878J5958k8325J1599l7828l6480j3257q886K8769R81P927K9610k2773
$$ 105878 121836 93511 105110 67282 30802 17545 8659 37428 38409 46336 75946 53173
13329E3173J5741K8144k0664n4016L013N4277k2149l1223o168J6782l562J846
$$ 53173 68914 97058 76394 22378 25391 79668 57519 26296 20128 36910 33348 35194
13317C5194O953L3431J1701j9409J5000j438L3886l123N713J6922j2173k0761
$$ 35194 42147 75578 87279 67870 82870 81432 115318 112195 117908 134830 122657 101896
13305A01896q666j4048o641o195j6704O185J8391J9547j3837r317j3051L3293
$$ 101896 93230 79182 72541 66346 49642 55827 74218 93765 79928 70611 57560 90853
13293I0853l2373j1801j4080J8887L3777J9206j2243k4744j6925K516J4944O299
$$ 90853 58480 46679 32599 51486 85263 104469 92226 67482 50557 53073 68017 74316
13281G4316k9242M58l687J2356N251R202P501K0566n408r141m7138k4473j416
$$ 74316 45074 45532 41845 54201 59452 68654 76155 96721 91313 82172 35034 10561 9145
13268I145J4106J8469M2843K8801J0323O524J1466K847L4667J0646j2577k0849
$$ 9145 23251 41720 84563 113364 123687 130211 141677 144524 179191 189837 177260 156411
13256A56411j20j1723j0817j4840k9678l0174j3399n813J0407k1198L9747J9764
$$ 156411 156291 144568 133751 118911 89233 59059 45660 39847 50254 29056 68803 88567
13244H8567o119J6108J6152J4564l587k6246n092O68L2417J0740l2414l6233O016
$$ 88567 82448 98556 114708 129272 125685 99439 94347 95015 127432 138172 105758 69525 75541
13231G5541Q979N390J3287j5122r089k0515o480M6632J0252j4706m933j4338K5674
$$ 75541 84520 89910 103197 88075 78986 58471 51991 98623 108875 94169 89236 74898 100572
13218A00572P9065K4632K166L388r718p301J7050k29k4848j6404L6663n985l5706
$$ 100572 179637 204269 206435 209823 200105 192804 209854 209625 184777 168373 205036 199051 163345
13205A63345K5720N2695J521j5945j920N913Q6822P5059J2982J6785R0829J00937
$$ 163345 189065 241760 243281 227336 225416 231329 318151 393210 406192 422977 513806 614743
13193F14743J36869J64444J73938J87503K32431K84830L41169K65833P6401j87534
$$ 614743 751612 916056 1089994 1277497 1509928 1794758 2135927 2401760 2478161 2290627
13183B290627k93702l49343l71279l37960k26776j48917r5638k6074k3908m1864
$$ 2290627 1996925 1647582 1276303 938343 711567 562650 467012 440938 417030 375166
13173C75166k0101J4174j9255p1976k2359J5123J0120M3682K8834j0979L4047
$$ 375166 355065 369239 349984 278008 255649 270772 280892 324574 353408 342429 376476
13162C76476K8046K1920N7001L9474K5800N0057O3634M4434R8473J46999J51571
$$ 376476 404522 426442 483443 522917 548717 598774 662408 706842 805315 952314 1103885
13151A103885J54559J75814K96291L09387L06195M58957O10079P28441Q80453
$$ 1103885 1258444 1434258 1730549 2039936 2346131 2805088 3415167 4143608 5024061
13142E024061R91161Q96478N03638j70574q32549j242497j226504j016589p88173
$$ 5024061 6015222 6911700 7415338 7244764 6412215 5169718 3943214 2926625 2138452
13133B138452n25575l09272k55545k00417j58040o7233n0710o0609o0628m903
$$ 2138452 1612877 1303605 1048060 847643 689603 622370 571660 511051 450423 445520
13123D45520l2367j479m078L5090M8715k2688l4738n085P2747N5821M2126K6572
$$ 445520 413153 411674 407596 442686 491401 468713 433975 428890 501637 557458 599584 626156
13111F26156Q7366M0458M4481J14808J53670J46313K04314K79604L14560L24260
$$ 626156 713522 753980 798461 913269 1066939 1213252 1417566 1697170 2011730 2335990
13101B335990M57402N44887P03445Q62645R78592R47163O30103L6996o66396j164011
$$ 2335990 2793392 3338279 4041724 4904369 5882961 6830124 7460227 7497223 6830827 5666816
13091E666816j301439j160023q58743n88862l98117k96642k23224j10549r0186
$$ 5666816 4365377 3205354 2346611 1757749 1359632 1062990 839766 729217 639031
13082F39031q4041n8306k7656o1487o8625j8852l4362j6520L0365Q524m5233j6497
$$ 639031 554990 496684 469028 407541 338916 320064 285702 269182 299547 308071 262838 246341
13070B46341M0302O265L1727K8448k7272k4882O0749M0079N8382M2662O4712P2834
$$ 246341 286643 292908 324635 353083 325811 300929 361678 401757 460139 502801 567513 640347
13058F40347Q2978Q6373J48929K13522K29681K91110L13319L21041K36077J2488
$$ 640347 723325 809698 958627 1172149 1401830 1692940 2006259 2327300 2563377 2575865
13048B575865k40277l98140m05526l84470k97179k25413j35634p9912p1378m8569
$$ 2575865 2335588 1937448 1531922 1147452 850273 624860 489226 409314 337936 289367
13038B89367l8770k9361R716k4908j5324M959k102l4480n5730k9768Q229J9334
$$ 289367 250597 221236 230952 206044 190720 195679 193577 159097 103367 73599 81828 101162
13026A01162k669L94J7303J9952Q738k1015J1668r426m3167L86K9401L7964o107
$$ 101162 98493 98887 116190 136142 144880 123865 135533 126107 82940 83326 112727 150691 144584
13013A44584K319K1823k0616r037k7116K8658p046l5190j2662r944K1320j7689
$$ 144584 146903 168726 148110 139073 111957 140615 133569 98379 85717 75773 97093 79404
13001G9404J0126k3566K4095J490Q971p737q420j5527L6503m52l365q736p474
$$ 79404 89530 65964 90059 91549 100520 92783 84363 68836 105339 104887 101522 92786 85312
12988H5312J7677j9055m0780P580K9014k558R615L2658j2669j9530J3336r384
$$ 85312 102989 83934 43154 50734 79748 77190 86805 119463 106794 87264 100600 91216
12976I1216j0808P096q74J338K9585r889k7933m4350k6264K9985Q128N862J0726
$$ 91216 80408 87504 86630 87968 117553 107664 79731 35381 9117 39102 47230 53092 63818
12963F3818j0383m399J8797k0802P786L4552O646K6167M794J8561k6958l7970
$$ 63818 53435 49036 67833 47031 54817 89369 96015 122182 126976 145537 118579 80609
12951H0609P944J3163N912P797k4249R635o911r615j861K2108j106j0967L8786
$$ 80609 88553 101716 107628 115425 91176 100811 93900 84285 82424 104532 103426 92459 131245
12938A31245J8679l0894J099m704j4044j9175l1246l1189J0272K1630R966j9150
$$ 131245 149924 119030 120129 115425 101381 82206 50960 19771 30043 51673 61639 42489
12926D2489J0543K4235J6671m0820k4604L7173N1075L4622Q424j7477L8149l7691
$$ 42489 53032 77267 93938 53118 28514 65687 116762 151384 159808 142331 180480 142789
12914A42789j1363K0325m24k1085p024l3443l4580k5981R19K5431l059L2080K6871
$$ 142789 131426 151751 151327 130242 123218 89775 55195 29214 30133 55564 52505 84585 111456
12901A11456P602n441K2460L6222k2780l1456o166L966N420k3110p08L8850L948
$$ 111456 119058 113617 136077 172299 149519 118063 111897 115863 121283 98173 97465 136315 140263
12888A40263p017J2241m641J5816l1407n6662l1247L5392K0530j2495J6238O058
$$ 140263 133246 145487 140846 156662 125255 68593 37346 72738 93268 80773 97011 103069
12876A03069K654K1315k984o989l6957m4746J6686O9231J2013K4390r7l6212m6169
$$ 103069 105723 127038 124054 117065 80108 35362 52048 121279 133292 157682 157585 121373 75204
12863G5204l4183l5024K8275M6676k6830l4972L1511M1102k7790J8422j002j7936
$$ 75204 41021 5997 34272 80948 54118 19146 50657 91759 63969 82391 81389 63453
12851F3453J5452j4331m0470k2644L3934L8462K0742j6779p269J0050K6683L3024
$$ 63453 78905 64574 24104 1460 35394 73856 94598 77819 70550 80600 107283 140307
12839A40307K2992p82k4296j2431m2788K1617J5755L935j0948l973N647m1742
$$ 140307 163299 162517 138221 125790 83002 104619 120374 124309 113361 109388 115035 73293
12827G3293o638R659J4888K2284M5248J4615n1554l1866Q233K2205J4254k0756
$$ 73293 66655 76314 91202 113486 158734 173349 121795 89929 98162 120367 134621 113865
12815A13865l6068J8254L4880Q691k8097J552q930Q297r345j510M2269P2992J3580
$$ 113865 77797 96051 130931 139622 111525 113077 104147 112444 103099 101589 143858 216850 230430
12802B30430j4754j4796l6625j2992k0743m846K1757L103k3396J9588j9058k448
$$ 230430 215676 200880 164255 151263 130520 125674 147431 150534 127138 146726 127668 125220
12790A25220l8511j4617J1354P926K1974K492j3426J2593j552R856k1427l8811
$$ 125220 86709 72092 83446 91372 113346 115838 102412 115005 113453 123309 101882 63071
12778F3071j4100L5786J3692J8135m36K0395j4261j6032j9303j9713J9704r192
$$ 63071 48971 84757 98449 116584 116148 136543 122282 106250 86947 67234 86938 77746
12766G7746R732J3270l6900l4595K0140J8367R684J0221r369l1484o792K1749
$$ 77746 87478 100748 63848 29253 49393 67760 77444 87665 78296 46812 40020 61769
12754F1769M2979j53j3488K3642J559k5924j0782k7351K126j616j1488J9605j928
$$ 61769 104748 104595 91107 114749 116308 90384 79602 52251 54377 52761 41273 60878 58950
12741E8950r271J3628M429k6733J303K9608J8463J4116Q940Q351m649l3258O049
$$ 58950 49679 63307 67736 41003 42306 71914 90377 104493 113433 121784 117135 83877 89926
12728H9926L891K9165K8189r705j7155J251L6809R532J9396l4133n7246L710L0613
$$ 89926 93817 122982 151171 141466 124311 125562 162371 171903 191299 157166 99920 103630 134243
12715A34243r26o717M255J2897k924N302L4540k4932k2868K7769J1347j5395n3907
$$ 134243 133317 126600 130855 143752 140828 146130 180670 155738 132870 160639 171986 156591 102684
12702A02684k4392m258K4650J7724L155L8405k443j3568k2560M427L5061M230
$$ 102684 78292 74034 98684 116408 119563 157968 155525 141957 119397 123824 158885 163115
12690A63115k5909K8666l3423k9045j401M1130L6904J3527K1097M334k0657m0226
$$ 163115 137206 165872 132449 103404 102003 143133 180037 193564 214661 218995 198338 158112
12678A58112j7169L4933J7716J722J5727K8807Q612J1334k9007l3834m467K3414
$$ 158112 140943 175876 193592 195314 211041 239848 248460 259794 230787 196953 192486 215900
12666B15900r565k9471k9054J9045J7133Q992R426P018j064j9425n1640l7284
$$ 215900 206335 176864 147810 166855 183988 192980 202406 209424 208360 188935 137295 100011
12654A00011k3136K3071M1742J7787p759k4148N78J1871m7371J4840K9471k1746
$$ 100011 76875 99946 141688 159475 151716 127568 128146 140017 92646 107486 136957 115211
12642A15211J2475M2455J184J7013M7163N75m8279m4921j6979o464K2581L9385
$$ 115211 127686 170141 171325 188338 235501 236076 187797 142876 125897 119433 142014 181399
12630A81399j9531k0325J5504M1708p75j1532m729J1955K3555j2003J0856M087
$$ 181399 161868 141543 157047 198755 197980 186448 181719 193674 217229 205226 216082 220169
12618B20169R47O654l3256k7977M8630M5184Q084J8247N7063P0754K991k7107
$$ 220169 221116 227770 194514 166537 215167 260351 268435 286682 343745 414499 417490 390383
12606C90383j532R2054Q8243L5496K5986Q3755Q2424N2625P6773J00012Q3541
$$ 390383 388851 480905 569148 604644 630630 714385 796809 849434 926207 1026219 1109760
12595A109760O2798M6545O2238k2297p1870o0058p4916j18520j11010j12395o8660
$$ 1109760 1172558 1219103 1281341 1259044 1187174 1127116 1052200 933680 822670 710275 641615
12584F41615j00071p4474l6357r0307k6690j9695l4859j6772P099J6737p560o964
$$ 641615 541544 467070 430713 340406 313716 294021 259162 242390 249489 266226 258666 251702
12572B51702j9790P009m1737l7882m3501J8117Q8639O5899l0664n4399l1632J6660
$$ 251702 231912 238921 197184 159302 115801 133918 222557 288456 257792 203393 171761 188421
12560A88421K4783j2029m04P736j9307J5103L0284k9272k8689k4118k2776j902
$$ 188421 213204 201175 200771 208507 189200 204303 234587 205315 176626 152508 129732 127830
12548A27830K81j0639k3268M80O424Q406j836j5191K1794N9983j2325l8098j4918
$$ 127830 128111 117472 94204 94684 101108 109514 107678 92487 114281 174264 161939 123841 108923
12535A08923O812N9503L2684j354m414q644k4244k820m470Q698M0268k0380l453
$$ 108923 115735 175238 207922 206568 202154 193510 169266 166446 161976 170674 210942 190562 187109
12522A87109j7407o932J4390j8393M702Q32q442L8580J4288n0084J5307J6937
$$ 187109 169702 162770 177160 158767 163469 164301 155859 194439 208727 158643 173950 190887
12510A90887n075k21j76J2726K567j984j2445P925K877J4157r887J3230n287M1296
$$ 190887 185812 185591 185415 198141 200708 198724 186279 194204 197081 211238 201351 214581 209294 250590
12496B50590O19J4383k5701j4390J994n718k2187K568P5696R969m1642n157M413
$$ 250590 251209 265592 239891 225501 227495 221777 199590 202158 277854 287823 246181 241024 245437
12483B45437j5228j9972K0543N7486L0755j9085k4007k4302j611J9032J7444K8221
$$ 245437 230209 210237 230780 288266 319021 299936 275929 251627 250016 269048 286492 314713
12471C14713k6605j8526K6596o571l3814l2754j449L52L907m0439j5591j4051
$$ 314713 288108 269582 296178 289607 255793 223039 221590 221942 225849 185410 169819 155768
12459A55768n176K4406p254J3956j3312L2651N0264J6249m5542P46l639L0613
$$ 155768 150592 174998 167744 181700 168388 201039 251303 267552 222010 222756 219117 249730
12447B49730P6700K3985l2408m6244o9274l4669J3262L7115K7256K4636M165q311
$$ 249730 326430 350415 318007 271763 202489 167820 181082 218197 245453 270089 274254 265943
12435B65943j7191J6725k3579R906N2379J6177P647m757q550n352k2250j3475
$$ 265943 248752 265477 241898 251804 304183 320360 328007 323250 314700 309348 287098 273623
12423B73623M860n516k395l8933l3097L3706M3509K734m4182j5685M5445M1810
$$ 273623 278483 272967 270572 231639 198542 232248 275757 278491 234309 218624 264069 305879
12411C05879K176j0419R148m586j4939K4027j9959m4502M7055N4983L3721j3084
$$ 305879 308055 297636 306784 302198 287259 311286 291327 246825 293880 348863 382584 369500
12399C69500k9824j6327k81k8104j5202N599j4338J9891M0815k8442J7252J3039
$$ 369500 339676 323349 323068 294964 279762 285361 271023 290914 331729 303287 320539 333578
12387C33578k4724J604j5349L350J1595J0530L331K251J8707K3748J4794M8543
$$ 333578 308854 310458 295109 298459 310054 320584 323915 326166 344873 368621 383415 431958
12375D31958J3055m6916m7K4611J400N0502r792q509L9032l2994l7500j3891k5927
$$ 431958 445013 398097 398050 422661 424061 474563 464771 456262 495294 462300 424800 410909 384982
12362C84982j4837j5853N2110p996n6932k7046j1949L414K0848K526M1862J2553
$$ 384982 370145 354292 406402 398406 341474 314428 302479 305893 326741 329267 371129 383682
12350C83682p249O648o2629P363K602M199m794r949q513m1179M17J1410J4542
$$ 383682 376433 383081 320452 327815 330417 334616 329822 319873 311360 270181 270598 282008 296550
12337B96550N953k6694J6477q012N141j3019K1175M0825J0704L2577K4428j4049
$$ 296550 302503 275809 292286 284274 289415 276396 297571 338396 349100 381677 406105 392056
12325C92056k0386J6631K5643k7793j185N659L8558q375k941j4507R598L5139
$$ 392056 371670 388301 413944 386151 384966 390625 429183 420808 417867 403360 412958 448097
12313D48097J8756K8168q633J8404k5538j4129J1359M482K1779L6629O5939K7110
$$ 448097 466853 495021 486388 504792 479254 465125 476484 480966 502745 539374 605313 632423
12301F32423L8492M1237K7282j1965J5359M7156P1494M8968l0573k7772j6193
$$ 632423 670915 712152 739434 727469 742828 789984 861478 910446 879873 852101 835908
12290H35908Q289K4149K1960J0666l185N958J649j9199j9175k5627n4110n1563
$$ 835908 844197 868346 890306 900972 897787 903745 905394 886195 867020 841393 787283 735720
12278G35720J0678J2377K2886k900o1741j3235M5598N3987K2549J312l5304j7108
$$ 735720 746398 758775 781661 778761 717020 703785 749383 803370 825919 827231 791927 774819
12266G74819L18L3437L7854J5507J8856K8926M6908J6714K4021K4609k7785q514
$$ 774819 775137 808574 846428 861935 880791 909717 956625 973339 997360 1021969 994184 985670
12254I85670n017M9564M5524L3745j7266l9295N3667M7694k9677N801M0242M1840
$$ 985670 980653 1030217 1075741 1109486 1092220 1052925 1106592 1154286 1124609 1130410 1170652 1212492
12242A212492K6894k546K7074M5440N6556O3547L6910K6192L4764M1402M1687
$$ 1212492 1239386 1236840 1263914 1309354 1365910 1429457 1466367 1492559 1527323 1568725 1610412
12231A610412L7189M5213L4485R168L4677J04798J32586O0951R9408R7784J13592
$$ 1610412 1647601 1692814 1727299 1736467 1771144 1875942 2008528 2069479 2168887 2266671 2380263
12220B380263J25399J27878J70303J39630K06370K20865K26899K76577K78373
$$ 2380263 2505662 2633540 2803843 2943473 3149843 3370708 3597607 3874184 4152557
12211D152557K93355L64649L99663M32798N01435N94309O52446P22344Q38000
$$ 4152557 4445912 4810561 5210224 5643022 6144457 6738766 7391212 8113556 8951556
12202H951556J034257J153478J270229J468867J690595J912192K148956K440726
$$ 8951556 9985813 11139291 12409520 13878387 15568982 17481174 19630130 22070856
12194B2070856K696100L020555L392104L789353M252545M860784N747462O783074
$$ 22070856 24766956 27787511 31179615 34968968 39221513 44082297 49829759 56612833
12186E6612833Q228170J0095194J2311949J4684169J6913970J8358458J8855827
$$ 56612833 64841003 74936197 87248146 101932315 118846285 137204743 156060570
12179A56060570J8379581J6432153J2781269P442187J354650m730072j0666907
$$ 156060570 174440151 190872304 203653573 211095760 212450410 207720338 197053431
12172A97053431j5977635j9888573k1834461k1946937k0911454j8775310j5885888
$$ 197053431 181075796 161187223 139352762 117405825 96494371 77719061 61833173
12165F1833173j2631010r644333p215833n316364l950359l096727k535399k161664
$$ 61833173 49202163 39557830 32341997 27025633 23075274 19978547 17443148 15281484
12157A5281484j858944j657765j471942j296006j113104j008514q71741o69195
$$ 15281484 13422540 11764775 10292833 8996827 7883723 6875209 6003468 5334273
12149E334273n42194m48499l89223l65224k83894k27630k33109j92618j33076
$$ 5334273 4792079 4343580 3954357 3589133 3305239 3077609 2844500 2651882 2518806
12140B518806j31187j44568j18507j29332j08456j07031q7439o9723n2084p4847
$$ 2518806 2387619 2243051 2124544 1995212 1886756 1779725 1692286 1622563 1570479 1495632
12130A495632r4970p9562m8503j6432j5904n1015q2061n0513m8350p9273k6089
$$ 1495632 1400662 1321100 1272597 1256165 1240261 1189246 1107185 1056672 1008322 929049 902960
12119I02960j3186n6756J0289J1153p2439m2617p575q34r649l2100l3229P749
$$ 902960 889774 833018 843307 854460 782021 739404 731829 730995 721346 689246 656017 663766
12107F63766m7814p0898k8089m1168j2662o9104l9518J9312M3633L505j506R87
$$ 663766 615952 545054 516965 475797 463135 394031 354513 373825 417458 420963 419457 420444
12095D20444l2134L640J9534l6354k4303m887P933k0386J6452m843k0822K0897
$$ 420444 388310 391950 411484 375130 350827 345940 353873 333487 349939 345096 324274 345171
12083C45171N363k7464p401j4564j0029j3863J294O836q145j712k0032M887K528
$$ 345171 350534 323070 315669 301105 291076 277213 278507 285343 277198 275486 255454 260341 262869
12070B62869k762J9355k8335m5488o172r104l0700k518K4385K2980p793k14L1130
$$ 262869 260107 279462 251127 205639 199467 190363 159663 157145 181530 204510 196717 196503 227633
12057B27633M5906J0020J5291L5531K508R805N56n932j1210K8395K5208m598J3856
$$ 227633 273539 283559 298850 334381 336889 346694 347250 341318 330108 358503 383711 379113 392969
12044C92969K131L122L3237K4112P929J536l3006o2855m6713j3398O584N702l8700
$$ 392969 395100 398222 431459 455571 463500 465036 432030 369175 322462 309064 315648 321350 282650
12031B82650l0343j988l2457k6877M5091M5861q281L063J7841K3187N344J4177
$$ 282650 252307 250319 217862 190985 236076 281937 273656 276719 294560 317747 323091 337268
12019C37268J8891Q096K7598k2456Q347K3289j4536l2864K393J3608N191j3510
$$ 337268 356159 364255 391853 369397 377744 401033 386497 353633 356026 369634 374825 361315
12007C61315l600l1680k9601L0523J397p329k3796J0439j2359l786J3046l4813
$$ 361315 357715 326035 296434 326957 328354 321025 297229 307668 295309 291523 304569 269756
11995B69756k7087J5531J4850j1181j8167j7758K1047K5986J3484k6718l0714
$$ 269756 242669 258200 273050 261869 243702 225944 246991 272977 286461 259743 229029
11984B29029K3737K8725J0821R516l1197n1869M2761L6481J897L3337K6304m9528
$$ 229029 252766 281491 292312 301828 270631 218762 261523 298004 299901 333238 359542 310014
11972C10014K561K7990j9360l3793k3899J9316M1982L944k2363k218J4153M769
$$ 310014 312575 340565 321205 287412 263513 282829 324811 328755 306392 304174 318327 323096
11960C23096l0561k8663l2084J8836J2750k266Q744j3980j0908K16L4505K1231
$$ 323096 292535 263872 231788 250624 263374 261108 269852 255872 244964 245180 279685 300916
11948C00916M248Q058l700o30J1685K2146j6123k9154O813L2962M4708L0451j6733
$$ 300916 305164 313222 309522 308892 320577 342723 326600 297446 304259 337221 381929 412380 395647
11935C95647k1439m7839k9378k053j3391j2402m294L853j4642J4890J4520O682
$$ 395647 374208 326369 296991 294938 281547 269145 264851 268704 254062 268952 283472 290154
11923B90154K7911j2281k4204k338K9220r725m855n9470m5936J8291L3717k879
$$ 290154 318065 305784 281580 279242 308462 298737 293882 234412 188476 206767 240484 237605
11911B37605j5851l824L1921K1774k6138l1196j7562l0768K9668K8175J7009K4636
$$ 237605 221754 217930 249851 271625 245487 214291 196729 165961 195629 223804 240813 265449
11899B65449k6486l0798k8375J5000M463J3423k4479m0770L4912L8231J5892J9445
$$ 265449 238963 208165 179790 194790 199253 212676 188197 147427 182339 220570 236462 255907
11887B55907k0315J655Q926m1626l041j1008K9929M0104j4126J7583L4778j8955
$$ 255907 235592 237247 246173 204547 201506 190498 220427 260531 246405 263988 298766 279811
11875B79811k8703j0368J7238J0155J1674k4559m9853N893O658J2729l432m9008
$$ 279811 251108 240740 257978 268133 279807 255248 205395 211288 217946 230675 227243 178235
11863A78235j2286k9291K6255K7137J1303J0195l5857p82K8819M3668K7240m7564
$$ 178235 165949 136658 162913 190050 201353 211548 175691 174909 203728 247396 274636 227072
11851B27072l9807j1499P767m8954l3875K6114L4123J4832Q282j9208o666j3604
$$ 227072 187265 175766 183533 134579 100704 126818 160941 175773 184055 164847 158181 144577
11839A44577j1575M3697L1692j3992l4674L878K2209k874n2906N3231L5437j5513
$$ 144577 133002 176699 208391 194399 159725 163603 185812 182938 130032 183263 218700 203187
11827B03187R987J934k3131P583M5532K751l4132j3847K2868r231j7816o598j3681
$$ 203187 213174 215108 191977 199560 245092 247843 213711 199864 222732 213501 195685 189087 175406
11814A75406R716N208M0294K2833m03k2561L061r4k2964l566p07l9015o533J0611
$$ 175406 185122 190330 230624 253457 253054 230493 233554 233460 210496 206930 206223 167208 160675 171286
11800A71286K2047K0597N0561O319m4536l7095j036M1990L0804Q710n47J8305
$$ 171286 193333 213930 264491 270810 226274 189179 188143 230133 260937 269647 269100 287405
11788B87405K033k0526k9516k6536J9450J8058Q352K6053m223l9080J384J2544
$$ 287405 289438 268912 239396 212860 232310 250368 258720 284773 280550 241470 242854 255398
11776B55398p20L5761k3909J1050N4270q78K4672J8088k87L5542N9263K9425J5900
$$ 255398 254678 290439 266530 277580 331850 330972 355644 373732 373445 408987 468250 497675 513575
11763E13575j3026K6349O7259N9634J15087J29770J16200J17336Q6531R8563R7151
$$ 513575 500549 526898 594157 653791 768878 898648 1014848 1132184 1218715 1317278 1414429
11752A414429R051Q906k3197o4180o4522j06504j03293j39797j45664j22797l6590
$$ 1414429 1423480 1432386 1409189 1345009 1280487 1173983 1070690 930893 785229 662432 625842
11741F25842l7656l5762l4631o4399l6255m9254k9598k376j693m4560j391j1211
$$ 625842 588186 552424 517793 453394 417139 367885 338287 335911 334218 289658 288267 277056
11729B77056j1181l4243j5662K1972K9581K1749N0220k0540n3017j6069j6948
$$ 277056 265875 231632 215970 237942 267523 289272 339492 318952 265935 249866 232918
11718B32918J4839K4382L2979k3106k5866j2252K5676N1861J2657j1321m3737
$$ 232918 247757 272139 305118 282012 256146 243894 269570 321431 334088 322767 279030
11707B79030m3794K0536J1997K4193j7000n152j3516l8201j4039L1008N435p903
$$ 279030 235236 255772 267769 291962 274962 269810 256294 218093 204054 235062 240497 232594
11695B32594L5931o351k2724j126j9803l0724P313L6185J829J095M1349J4029
$$ 232594 268525 262174 239450 238324 218521 187797 195110 231295 233124 234219 275568 289597
11683B89597J0479J4066m114j6977J2658k2266j9624L7766o809j3571k7804k7888
$$ 289597 300076 314142 310028 293051 305709 283443 263819 301585 294776 281205 253401 225513
11671B25513L046M174j3647j3357K7364N507J6140j9310L816J7050j6656l361
$$ 225513 228559 232733 219086 205729 233093 238600 254740 235430 239246 256296 239640 236279
11659B36279M5356O358J0504j2763j3574k9034P632o671J2367l2173k9378K0520
$$ 236279 281635 287993 298497 285734 272160 243126 250758 244087 256454 224281 194903 215423
11647B15423O3348J8791l2986k4363L9209K7201k8213K836L315N957m985j3305
$$ 215423 278771 297562 264576 240213 279422 306623 278410 281246 284561 290518 285533 272228
11635B72228O602j3357O179j5835j065K4361j299j1693o624k6575j6583l155L7131
$$ 272228 278830 265473 271652 255817 254752 279113 277814 266121 259497 232922 216339 213184 250315
11622B50315L1979Q657l7179l9368R993k2883L3983L222m836K3542L074n285j9126
$$ 250315 282294 290951 253772 214404 224397 201514 235497 238719 233883 257425 260499 255214 236088
11609B36088m335K42K6235K6030K1256j4774K0471J9455K686m9688L108J9017
$$ 236088 231753 231995 258230 284260 305516 290742 311213 330668 333354 283666 286774 305791
11597C05791j1282J5836J3473m1724j4133L248J5955N199Q036N6609K2823j6275
$$ 305791 294509 310345 323818 282094 267961 271209 287164 292363 300399 357008 379831 363556
11585C63556q826m7220J4107K089K3309n695j5711Q180j9827m073j7542L8843
$$ 363556 354730 307510 321617 323706 347015 341320 325609 333789 313962 309889 292347 331190
11573C31190K1233p810k9111m091K2621j172m9572j8124r142J7819R052j6352
$$ 331190 352423 344613 315502 311411 334032 332860 283288 265164 256022 273841 282893 266541
11561B66541K8946K3083J1431l156J585l6210n521j1442j5136J095K1952K3900
$$ 266541 295487 318570 330001 326845 328430 292220 286699 275257 260121 261216 283168 307068
11549C07068J1833P967j1052m284j0137n256J8321M9028J1521k2449Q058j2768
$$ 307068 318901 326868 315816 311532 301395 296139 314460 363488 375009 352560 360618 347850
11537C47850N558j2264L561P465k6412k3954J233Q572N818l298n230K2059k1176
$$ 347850 353408 341144 344705 352170 325758 301804 303037 311609 317427 314129 308899 330958 309782
11524C09782p786l881K2576K4871J2225O267K1909L294R900K362K9398N0062l0064
$$ 309782 301996 298115 320691 345562 357787 364054 385963 389257 399157 401519 430917 480979 450915
11511D50915P003M6267m584p3106l6969l833l4881j1043K562j2799n973K8418
$$ 450915 457918 504185 499601 426495 389526 385693 350812 339769 342331 329532 323559 351977
11499C51977J526M202j5322j0226K2583p617K5198k701l6731j2076L82M5380K2037
$$ 351977 353503 357705 342383 332157 354740 347123 372321 369620 332889 320813 321195 366575 388612
11486C88612k825K064l468L939k7592r184p7844j2057J5104K4689K5876J6553
$$ 388612 385787 387851 384383 388322 360730 351546 273702 261645 276749 301438 327314 343867
11474C43867J6971m404k865J4571l5094j0352Q369K4061j4230k7122K0542J128
$$ 343867 360838 356434 353569 368140 333046 322694 331063 355124 340894 313772 334314 335442
11462C35442K8778J9628l721j2645r018L335O995R950l8985k5889n545K8973l457
$$ 335442 364220 383848 380127 367482 358464 361799 368794 378744 339759 313870 308325 337298 333841
11449C33841j6680k3218O227J2299J3836J2671j5035l548K3019K2849j3444M1525
$$ 333841 317161 293943 300170 312469 326305 338976 323941 320393 343412 366261 352817 394342
11437C94342J8482l2990n7983j2615M2993j1862k2315K4313l294K7096j5574K122
$$ 394342 412824 379834 321851 309236 352229 340367 318052 342365 339071 366167 350593 352715
11425C52715J2814J6202P871j1656j4608l3107q761J0303K0493M7691L0439l3494
$$ 352715 365529 381731 389602 377946 363338 330231 321470 331773 352266 399957 430396 396902
11413C96902l2440L342Q06N802L4346l288m531J3218j3521j3691J4011j7440P102
$$ 396902 364462 367804 368610 374412 408758 405470 400939 414157 400636 386945 400956 383516 390618
11400C90618j8725N320K9921l816q088J1823Q145R379j396J0737k595j0474K360
$$ 390618 371893 377213 407134 403318 395230 407053 415198 424577 423181 433918 431323 420849 423209
11387D23209K0962K9732j4268l6426N519K8631J4321k293R873m513K9986k295
$$ 423209 444171 473903 459635 423209 428728 457359 471680 469387 479260 474747 504733 502438
11375E02438l7192O619M8263n536j5712k70r883j625j9688j7764O244K1417j9110
$$ 502438 465246 471865 520128 514592 498880 498610 488727 487102 467414 449650 455894 477311 458201
11362D58201j5847J5350m585J6294K3645j9864M572j0535p5572j1431J3234L5245
$$ 458201 442354 457704 453119 469413 493058 473194 477766 467231 391659 380228 393462 428707
11350D28707P488J537J4177j0670J8810Q411k314k5656j6926L1524J603j5924
$$ 428707 436195 437732 451909 441239 460049 468460 466146 440490 423564 455088 456691 440767
11338D40767k8522R822J3236l240K0590J9658j6978K7983p066j564j0476O370
$$ 440767 412245 422067 435303 432063 452653 472311 455333 483316 476250 474686 464210 470580
11326D70580J2453J1136l2097K407M474M517K6830J4897L5951N501q569J889j3841
$$ 470580 483033 494169 462072 464479 468953 473470 500300 515197 551148 556649 548080 549969 536128
11313E36128j4374l0931j0758J8438N2577k9994k382J0546P295M194k1365Q440
$$ 536128 521754 490823 480065 498503 551080 521086 518704 529250 536545 540739 519374 527814
11301E27814k1441j5383J660J2906M0897j1458j1809k7804M354L0537J2045m904
$$ 527814 506373 490990 492650 505556 546453 534995 523186 495382 499736 530273 542318 537414
11289E37414L23l1821q931K2144J4910j2721j1833L24o234K0692J2734J0689J2875
$$ 537414 537737 505916 496985 519129 534039 521318 509485 509809 503575 524267 537001 547690 560565
11276E60565K0204K5853k1414j26N447J0147m0366j7844K5033K9908K0997J0688
$$ 560565 580769 606622 585208 585082 590529 600676 560310 542466 567499 597407 618404 629092
11264F29092j3746k1615j4203j1096K711M1185Q410n5173p670J3347K7497Q145
$$ 629092 615346 593731 579528 568432 571143 612328 620738 565565 557895 571242 598739 606884
11252F06884J1031M0300K2854k488r06K024p650j1618j1068Q519K5893L9813K7797
$$ 606884 617915 658215 681069 678581 677675 679699 672049 660431 649363 657882 683775 723588 751385
11239G51385L9193J6133K1095K9308M4843K0796L8314Q2399N8649O9282M2445
$$ 751385 790578 806711 827806 857114 901957 922753 961067 1043466 1102115 1171397 1213842
11228A213842J4128K3636j4778J0799O1237Q7915J16065R6080J34904J82152J99797
$$ 1213842 1227970 1251606 1236828 1247627 1308864 1396779 1512844 1608924 1743828 1925980 2125777
11217B125777K43283K41007J76668J09436n0678j26848k10701k27344k10517j48446
$$ 2125777 2369060 2610067 2786735 2896171 2845493 2718645 2507944 2280600 2070083 1921637
11207A921637j22268r7326r6228j14036n1512m930L9822M2861j0189R814P7664
$$ 1921637 1799369 1702043 1605815 1491779 1440267 1435337 1475159 1518020 1507831 1517645 1595309
11196A595309R5515P0442J27078J53532J49986J95747K23464K13367K87883L07911
$$ 1595309 1690824 1761266 1888344 2041876 2191862 2387609 2611073 2824440 3112323 3420234
11186C420234K60302K25922K04196J18301k4658j67421k44772k73080l03709k58006
$$ 3420234 3680536 3906458 4110654 4228955 4204297 4036876 3792104 3519024 3215315 2957309
11176B957309k65162k99501k42251j95251j18490o9283o7902n8988q2120k4468
$$ 2957309 2692147 2392646 2150395 1955144 1836654 1767371 1699469 1640481 1558361 1533893
11166A533893l1402J1213J8359N284L2377P7868J13099J13307J47022J70884K00449
$$ 1533893 1502491 1513704 1532063 1537347 1569724 1647592 1760691 1873998 2021020 2191904 2392353
11155B392353K15199K05869J89014P5308m7980j50462k02416k17836k18353k51104
$$ 2392353 2607552 2813421 3002435 3077743 3029763 2879301 2676885 2459049 2240696 1989592
11145A989592k28570j58957j11897j15868r8060o5650q8621l4844J7339m8936
$$ 1989592 1761022 1602065 1490168 1374300 1276240 1210590 1121969 1087125 1104464 1055528
11135A055528m2760m6965O85K3607q319k8354l5168l5111j8720j7405J348l0231
$$ 1055528 1012768 965803 966488 990095 981776 953422 918254 883143 864423 847018 848366 818135
11123H18135n684L2168K4543K9129j6996j4018l7963l6312K0003J2788K509r960
$$ 818135 812451 844619 869162 898291 881295 867277 829314 793002 813005 825793 828302 818342
11111H18342L915K5896J7763K0173r592k4028L1888L3861K0987K7993l5480p2277
$$ 818342 822257 848153 865916 886089 876497 852469 884357 918218 939205 967198 931718 859441
11099H59441J8133M9672K4688m68n841l566j6084k2693k3635m680N735L0901N076
$$ 859441 877574 927246 951934 951466 945625 942059 925975 903282 879647 874967 880702 911603 916679
11086I16679j4186k1439m1157j1905J1595o830R885J679l343K3618k49k6458N3086
$$ 916679 902493 881054 839897 827992 839587 832757 842642 844321 840978 864596 864347 837889 890975
11073H90975p2J5877K734k9478k5017N3206K8802j1379O156K267k2169k5893O221
$$ 890975 890903 906780 909514 880036 855019 908225 937027 925648 931804 934071 911902 886009 892230
11060H92230K612j4807L6411O3749K7091k6321j2774j703K1607j8565M9154J0187
$$ 892230 894842 880035 916446 980195 1007286 980965 968191 966488 988095 969530 1018684 1028871
11048A028871n446J2221p348l0012J0360k0019L1261J5661j9826N342m054m718
$$ 1028871 1023425 1035646 1028298 998286 1008646 988627 1019888 1035549 1015723 1021065 1017011 1012293
11036A012293L590j3333o837l3782J7385J6505K7729j632k3196j4754M8360K8418
$$ 1012293 1015883 1002550 995713 961931 979316 995821 1023550 1021918 998722 983968 1032328 1060746
11024A060746K2718L3674J6373r423J070J6364j461j1355j2896N510N6840L1243
$$ 1060746 1083464 1117138 1133511 1124088 1125158 1141522 1140061 1128706 1115810 1121320 1178160 1209403
11012A209403n349n647j3292Q29J3032J9125K2233o116l4375j941K6688J5806
$$ 1209403 1204054 1198407 1185115 1185944 1198976 1218101 1240334 1234218 1199843 1197902 1224590 1240396
11000A240396J699N3030P731k3499k213J2456j7539q382K5399K2526J100R202
$$ 1240396 1242095 1295125 1302856 1279357 1277144 1289600 1272061 1263679 1289078 1311604 1312704 1321906
10988A321906o056O423k824j6300k1420L0486J7605K4856N3024K8656j7213k8076
$$ 1321906 1315850 1322273 1319449 1303149 1281729 1312215 1329820 1354676 1407700 1436356 1419143 1391067
10976A391067j3793m733K0389N0698K3332o497j0335J3464J3310k715J6260K6907
$$ 1391067 1377274 1372541 1392930 1443628 1466960 1460463 1450128 1463592 1476902 1474187 1490447 1517354
10964A517354n214P717P2506K4525k1621l1886j8554O112J8038L8686M1686Q004
$$ 1517354 1512140 1519857 1592363 1616888 1595267 1563381 1544827 1550939 1568977 1607663 1649349 1657353
10952A657353m689l0892O354J7591O816j0012N525M1443M0977L02n312j6844q638
$$ 1657353 1652664 1621772 1628126 1645717 1652533 1642521 1648046 1689489 1730466 1730768 1725456 1708612 1699974
10939A699974M4965M1140J2694j4875J8728K5631J500J492N174O905k1598L0843
$$ 1699974 1744939 1786079 1798773 1783898 1802626 1828257 1829757 1831249 1836423 1843328 1821730 1852573
10927A852573K7569j0820n3142P236J4309M446N836J792J7060K6200K359Q138
$$ 1852573 1880142 1869322 1816180 1823416 1837725 1842171 1848007 1849799 1866859 1893059 1895418 1903556
10915A903556L7784L1190k260k9901J5865K1108J8129k4157k48M3863P144l8215
$$ 1903556 1941340 1972530 1970270 1940369 1956234 1977342 1995471 1971314 1971066 2014929 2022073 1983858
10903A983858r859K1164L4725L8618j2683j7943j4655L101j0163J2594j6840k6995
$$ 1983858 1973999 1995163 2029888 2068506 2055823 2037880 2023225 2026326 2016163 2028757 2011917 1984922
10891A984922m726j6984K6533m664N7755J5545j1674k5038J300O941K5450L7778
$$ 1984922 1980196 1963212 1989745 1985081 2042836 2058381 2046707 2021669 2022969 2029910 2055360 2093138
10879B093138K7914J6133M653n807j5449j823J1086O997L0147k463m8811l7529
$$ 2093138 2121052 2137185 2141838 2136031 2120582 2118759 2129845 2136842 2166989 2164526 2115715 2078186
10867B078186K7674J9370k3441p572M0490K3339L3037P20k3858l0816j2888O0912
$$ 2078186 2105860 2125230 2101789 2094217 2134707 2158046 2191083 2191803 2167945 2137129 2124241 2185153
10855B185153L3259j0220N968J118l530q709J4234j2514n335R404J8388K0590
$$ 2185153 2218412 2208192 2214160 2215278 2211748 2203039 2217273 2204759 2199424 2208828 2227216 2247806
10843B247806J6103K3196K5545J5926l1863o447J0159L0118K0484K1319L587K4450
$$ 2247806 2263909 2287105 2312650 2328576 2296713 2290266 2300425 2330543 2351027 2372346 2375933 2400383
10831B400383J9733j2388J1209l5146J277M4898k59J189K7162P206J6671K4551
$$ 2400383 2420116 2407728 2418937 2383791 2385068 2429966 2429707 2430896 2458058 2465264 2481935 2506486
10819B506486n156l747J8682M9548k520j4096p744K3308K4136l9965P83L3518
$$ 2506486 2501330 2497583 2516265 2565813 2563293 2549197 2541453 2564761 2588897 2548932 2549715 2583233
10807B583233P2731p612k8309K7341J4003K4920L4827J3331L9296j060j0471j2639
$$ 2583233 2655964 2648352 2620043 2647384 2661387 2686307 2721134 2734465 2773761 2772701 2762230 2749591
10795B749591k903L3603L8188K987q06L9671O3730J5582J2809K4582L2038O116
$$ 2749591 2746688 2780291 2818479 2821466 2820660 2860331 2924061 2939643 2952452 2977034 3009072 3015188
10783C015188k0752l42L9119M2203K9537K1634L3806j0930J3647P037M3123K1491
$$ 3015188 2994436 2994094 3033213 3075416 3104953 3126587 3160393 3149463 3163110 3170147 3213270 3234761
10771C234761J0777L9457L2340J8758L5268L6189J9090J1132q064n370L9028K7359
$$ 3234761 3245538 3284995 3317335 3336093 3371361 3407550 3426640 3437772 3429708 3424338 3463366 3490725
10759C490725K7187L5420L8246K2669m306K6161L9201P41M21K8453M5281J9204
$$ 3490725 3517912 3553332 3591578 3614247 3609941 3636102 3675303 3676044 3676465 3704918 3750199 3769403
10747C769403L6254M2533j6365K1363L9130O2991J1873o487L1859N2352P6877
$$ 3769403 3805657 3848190 3831825 3853188 3892318 3955309 3967182 3960695 3992554 4044906 4121783
10736D121783K3431j5209j6482M7738L2538N3885N2186J4321J204N7938M8343
$$ 4121783 4145214 4130005 4113523 4161261 4193799 4247684 4299870 4314191 4315395 4373333 4421676
10725D421676P2962L3741j1019K7667N2085P8266N8998O2923M3497Q138M3762
$$ 4421676 4494638 4528379 4517360 4545027 4597112 4675378 4734376 4797299 4840796 4848934 4892696
10714D892696K3528R978K5418O8034M3864L7363M4599L6923L9896M2379J5893
$$ 4892696 4916224 4926202 4951620 5019654 5063518 5100881 5145480 5182403 5222299 5264678 5280571
10703E280571J8668Q1011Q3052O1345J5690K0686N3047L9384P5183O3471O7291
$$ 5280571 5299239 5380250 5463302 5524647 5540337 5561023 5614070 5653454 5728637 5792108 5859399
10692E859399Q0536O2033L9978M7665N9957O1019N8010Q0597R5010J2879P0290
$$ 5859399 5939935 6001968 6041946 6089611 6149568 6210587 6268597 6349194 6444204 6457083 6527373
10681F527373P4801N1038M4941N5330P1796N1982P4286M4805L6219J08080J41146
$$ 6527373 6602174 6653212 6698153 6753483 6825279 6877261 6951547 6996352 7032571 7140651 7281797
10670G281797R8679O9774P7232J33313R1109Q6548J28086J51121J22830Q4665
$$ 7281797 7380476 7450250 7527482 7660795 7751904 7838452 7966538 8117659 8240489 8325154
10660H325154J03079R5748J61937J56395J66888J54684J44039K09325K64812K78498
$$ 8325154 8428233 8523981 8685918 8842313 9009201 9163885 9307924 9517249 9782061 10060559
10650A0060559K83527L15102L44393L32796K81293J49458k3767j36249j72301
$$ 10060559 10344086 10659188 11003581 11336377 11617670 11767128 11743361 11607112 11434811
10641A1434811j52397j03504k0480k5675K2214M8518P1294R4931J19375J27256
$$ 11434811 11282414 11178910 11158430 11132755 11154969 11203487 11274781 11369712 11489087 11616343
10631A1616343J81568K11427J46996J24333J46549J67714J69049J91368J75475
$$ 11616343 11797911 12009338 12156334 12280667 12427216 12594930 12763979 12955347 13130822
10622A3130822J88260J96090J99447J92585J93118K06524K12229K36596K23179
$$ 13130822 13319082 13515172 13714619 13907204 14100322 14306846 14519075 14755671 14978850
10613A4978850K44429K73501K19929K51108K55026K52885K64487K99740K62072
$$ 14978850 15223279 15496780 15716709 15967817 16222843 16475728 16740215 17039955 17302027
10604A7302027K58763K89468L25049K98247K88443K86366L25128L53268L74808
$$ 17302027 17560790 17850258 18175307 18473554 18761997 19048363 19373491 19726759 20101567
10595B0101567L88499L79964L51436L90647L66963L77298M07059M32289M53977
$$ 20101567 20490066 20870030 21221466 21612113 21979076 22356374 22763433 23195722 23649699
10586B3649699M65723M79828N48458M98976M93580N39865N46264N31458N12744
$$ 23649699 24115422 24595250 25143708 25642684 26136264 26676129 27222393 27753851 28266595
10577B8266595N21617O21979O21385O34861O88928O71668O48719O74777O80118
$$ 28266595 28788212 29410191 30031576 30666437 31355365 32027033 32675752 33350529 34030647
10568C4030647P13703P61019P50176P80269P73841Q15708Q30967Q65129Q17952
$$ 34030647 34744350 35505369 36255545 37035814 37809655 38625363 39456330 40321459 41139411
10559D1139411Q55039Q96800Q93103R03518R10987R95479J054721J035131J017913
$$ 41139411 41994450 42891250 43784353 44687871 45598858 46594337 47649058 48684189 49702102
10550D9702102J029278J033583J063005J115860J100720J124457J121229J184797
$$ 49702102 50731380 51764963 52827968 53943828 55044548 56169005 57290234 58475031
10542E8475031J224265J261220J195223J184919J244593J228767J263443J283509
$$ 58475031 59699296 60960516 62155739 63340658 64585251 65814018 67077461 68360970
10534F8360970J317636J303131J360125J351035J359502J337979J355012J373839
$$ 68360970 69678606 70981737 72341862 73692897 75052399 76390378 77745390 79119229
10526G9119229J405720J366233J385036J377395J384825J339449J352173J346829
$$ 79119229 80524949 81891182 83276218 84653613 86038438 87377887 88730060 90076889
10518I0076889J308975J314446J224253J216273J201694J156736J117363J077751
$$ 90076889 91385864 92700310 93924563 95140836 96342530 97499266 98616629 99694380
10510I9694380J043847R43842R39456Q66967P29601O67749O73476N53286M79005
$$ 99694380 100738227 101682069 102621525 103488492 104218093 104885842 105559318 106112604 106591609
10501A06591609M01985K95548K01073J19720N9458j7365j17313k28790k86470
$$ 106591609 106993594 107289142 107490215 107609935 107669393 107652028 107534715 107305925 107019455
10492A07019455l95111n00435n65452o17836o89197p87241q78071q86261r88649
$$ 107019455 106624344 106123909 105558457 104940621 104251424 103464183 102586112 101699851 100711202
10483A00711202j001588j065392j122867j184104j219130j248167j295645j337642
$$ 100711202 99709614 98644222 97521355 96337251 95118121 93869954 92574309 91236667
10475I1236667j390668j380269j351815j353693j385596j423337j417012j438796
$$ 91236667 89845999 88465730 87113915 85760222 84374626 82951289 81534277 80095481
10467H0095481j429788j435883j396412j318547j324838j336821j321080j268929
$$ 80095481 78665693 77229810 75833398 74514851 73190013 71853192 70532112 69263183
10459F9263183j309251j297993j267657j284844j244434j182032j183910j149723
$$ 69263183 67953932 66655939 65388282 64103438 62859004 61676972 60493062 59343339
10451E9343339j128374j154772j112063j070415j049958j033789j017672j006846
$$ 59343339 58214965 57060193 55948130 54877715 53827757 52793968 51776296 50769450
10443E0769450r96904r61532r75115r26780q85368q77544q88768q44171q60680
$$ 50769450 49772546 48811014 47835899 46909119 46023751 45146207 44257439 43413268 42552588
10434D2552588p89356p84124p64310p77972p64407o67704o67143o99389o51828
$$ 42552588 41763232 40979108 40214798 39436826 38672419 38004715 37337572 36638183 35986355
10425C5986355n87583n81495n94164o10112o37124n96309n75251n52607n78220
$$ 35986355 35398772 34817277 34223113 33613001 32975877 32379568 31804317 31251710 30673490
10416C0673490n81484n42237n12498n28088m83062m52965m63622m77202m44501
$$ 30673490 30092006 29549769 29037271 28509183 28026121 27573156 27109534 26632332 26187831
10407B6187831m48542m16028l80368m05654m27215l74587l93502l74857l73232
$$ 26187831 25739289 25323261 24942893 24537239 24110024 23735437 23341935 22967078 22593846
10398B2593846l87204l91825l70476l41488l30523l52485l08186k64212k84047
$$ 22593846 22206642 21814817 21444341 21102853 20772330 20419845 20111659 19847447 19563400
10389A9563400k73840k62217k16979k29037k40980k43295k45160k45771k62194
$$ 19563400 19289560 19027343 18810364 18581327 18340347 18097052 17851892 17606121 17343927
10380A7343927k68200k69376k69991k34923j84531k00404k11074k16657k19667
$$ 17343927 17075727 16806351 16536360 16301437 16116906 15916502 15705428 15488771 15269104
10371A5269104j92993j86728j58434j47229k13558k13899j85240j67604j91561
$$ 15269104 15076111 14889383 14730949 14583720 14370162 14156263 13971023 13803419 13611858
10362A3611858j56535j45863j80572j89781j75235k10187j75632j04405j2192
$$ 13611858 13455323 13309460 13128888 12939107 12763872 12553685 12378053 12273648 12261456
10353A2261456M3981L6816J2603k5990j11120j54304k11188j81689j62627j06601
$$ 12261456 12305437 12342253 12354856 12328866 12217746 12063442 11852254 11670565 11507938 11401337
10343A1401337l1151n6356q3809j23021j42824j28280j49798j27630j30209j16328
$$ 11401337 11370186 11313830 11230021 11107000 10964176 10835896 10686098 10558468 10428259 10311931
10333A0311931j84397j88842j85846q1743j08514p4838j15939j43509r0784j01275
$$ 10311931 10127534 9938692 9752846 9671103 9562589 9487751 9371812 9228303 9137519 9036244
10323I036244r5879r2042r4860o1674n1633n9570o2253o0798r6937j05377j18890
$$ 9036244 8940365 8848323 8753463 8691789 8640156 8580586 8518333 8457535 8360598 8255221 8136331
10312H136331j35116o6965m8814p0949n4231l938O189l8571n7729m9723j5962
$$ 8136331 8001215 7934250 7885436 7814487 7760256 7756318 7762507 7723936 7666207 7616484 7600522
10301G600522k9956p2707r5078n0034o6438n5858k5709o7621l9405Q209M8194
$$ 7600522 7570566 7497859 7402781 7352747 7286309 7230451 7204742 7137121 7097716 7105925 7154119
10290G154119L2824M6621K2202K7241J3246m295J3468J3880J8776K2342L8805
$$ 7154119 7186943 7233564 7255766 7283007 7296253 7291958 7305426 7319306 7338082 7360424 7399229
10279G399229K4694M8703J23231J17624J14137J82337K20538K04160K03460K54977
$$ 7399229 7423923 7472626 7595857 7713481 7827618 8009955 8230493 8434653 8638113 8893090
10269H893090K39425K19300K34805K75431K69753L36757L63488L98214N11412
$$ 8893090 9132515 9351815 9586620 9862051 10131804 10468561 10832049 11230263 11741675
10260A1741675O42472O91344P98872R06947J036002J232429J410216J653290J880800
$$ 11741675 12384147 13075491 13874363 14781310 15817312 17049741 18459957 20113247 21994047
10251B1994047K116054K344574K635902L012859L363852L625497L862000M040554
$$ 21994047 24110101 26454675 29090577 32103436 35467288 39092785 42954785 46995339
10243D6995339M226128M655471N576305P000683Q937854J1335364J4053782J7191502
$$ 46995339 51221467 55876938 61453243 68453926 77391780 88727144 102780926 119972428
10235A19972428K1003547K6133343L2467034L9810094M7709303N3902439N3166495
$$ 119972428 140975975 167109318 199576352 239386446 287095749 340998188 394164683
10228C94164683L7916312M421979l7482758o3928557o9795275o3040489n0111236
$$ 394164683 432080995 436502974 399020216 335091659 265296384 202255895 152144659
10221A52144659l6706425k6053163j8644094j3561082r927912p275824n392538
$$ 152144659 115438234 89385071 70740977 57179895 47251983 39976159 34583621
10214C4583621l987513k961144k179413j768382j672925j804679j875951j809495
$$ 34583621 30596108 27634964 25455551 23687169 22014244 20209565 18333614 16524119
10206A6524119j624540j343327j056743q38808o66262m63726l08858p6163J06506
$$ 16524119 14899579 13556252 12499509 11660701 10994439 10530713 10221855 10145692 10252198
10197A0252198L40509N73832Q14041R99875R91605M92468o40394j654186j792847
$$ 10252198 10592707 11166539 11980580 12980455 13972060 14464528 13824134 12169948 10377101
10188A0377101j638758j307913r35772o05283m25401l16413l03116k57802j70057
$$ 10377101 8738343 7430430 6494658 5889375 5463974 5147561 4844445 4586643 4416586
10179D416586j32865r0547j01059j13407q5252p6336j17683r6578j12560j16877
$$ 4416586 4283721 4193174 4092115 3978708 3893456 3817120 3699437 3602859 3490299 3373422
10169C373422l9939j2097q869L4218K6870K8798M1113L6774j12695j50428r5419
$$ 3373422 3333483 3321386 3312517 3346735 3373605 3402403 3443516 3480290 3367595 3217167 3121748
10158C121748j23036j30544j21616j18700j01786m1059K5197j9900q3142o5006
$$ 3121748 2998712 2868168 2746552 2627852 2526066 2485007 2510204 2490304 2407162 2342156
10148B342156J9410l9944j3560p498Q9j8339q1889m0558n9994n3478k1185J160
$$ 2342156 2361566 2321622 2308062 2300564 2300653 2282314 2200425 2159867 2099873 2046395 2025210 2026370
10136B026370J895m2149p574J263l1729k8540k4932j0807P961K5471N0081J522
$$ 2026370 2028265 1986116 1978542 1979805 1948076 1919536 1894604 1883797 1891758 1917229 1967310 1968832
10124A968832M214k0891k3814j3461l9570o9020m2063j0580l5376J2822O9202
$$ 1968832 1973046 1952155 1928341 1914880 1875310 1806290 1764227 1753647 1718271 1731093 1800295
10113A800295M1985l6820k2296K3687J8755M5783L0514K1126k0855p1895k7824
$$ 1800295 1842280 1805460 1783164 1806851 1825606 1871389 1901903 1923029 1902174 1830279 1802455
10102A802455k6278K473j1993N4201P9373J09670K365k780j904j8105J4127l1171
$$ 1802455 1776177 1778650 1766657 1820858 1900231 2009901 2012266 2009486 2007582 1989477 2003604 1972433
10090A972433o9954j7547j4737l9004k739l8671k7616J0808j6831p6640l2122
$$ 1972433 1902479 1884932 1870195 1831191 1828452 1789781 1762165 1772973 1756142 1679502 1647380
10079A647380l5304k317J2418M7556J5170k344J4821L9895M4504L3082l3774p797
$$ 1647380 1612076 1609759 1622177 1669733 1684903 1682559 1697380 1737275 1781779 1814861 1781087 1773290
10067A773290j0557Q342l558L8692m978l4938l9265m5232j2744m927k5617j056
$$ 1773290 1762733 1771075 1767517 1806209 1801231 1766293 1727028 1681796 1669052 1664125 1638508 1637452
10055A637452J7501P046K4316l4684l8650J931J2318Q841M1738M4337K0506P5835
$$ 1637452 1654953 1661999 1686315 1651631 1612981 1614912 1627230 1636071 1677809 1722146 1742652 1818487
10043A818487L0846P7648J15511J54968K27153K98210L00753L90968M92131L97893
$$ 1818487 1849333 1926981 2042492 2197460 2424613 2722823 3023576 3414544 3906675 4304568
10033D304568Q9952m14804o05566n55274m83730l16412k12811j58968q8803n5851
$$ 4304568 4394520 3979716 3374150 2818876 2335146 2018734 1805923 1646955 1558152 1502301
10023A502301n3014m4530n0190p0792k2041n743P410k4201m6110j3035m2591m3320
$$ 1502301 1449287 1404757 1354567 1283775 1261734 1255991 1263401 1239200 1193090 1180055 1137464 1094144
10011A094144j3686r029k1056K3871l263K653j5232l0994K5131M833j4018K7622
$$ 1094144 1080458 1071429 1050373 1074244 1070981 1073634 1058402 1027408 1052539 1057372 1043354 1070976
9999A070976O198k371k2683N661M7886J0025k4847l6027O087q022j4639j5176
$$ 1070976 1077174 1074803 1052120 1057781 1105667 1115692 1090845 1054818 1060905 1052883 1038244 1023068
9987A023068j6760o0825k0447K1363J5422J83j3983Q221J2971K1225l7721l7409
$$ 1023068 1006308 945483 925036 946399 961821 962004 948021 956242 969213 990438 952717 915308
9975I15308k8731M254K066O948k5487K7377K9780j0362q993j7884Q02j1078j8545
$$ 915308 886577 890831 892897 899845 874358 901735 931515 921153 912160 894276 895078 884000 865455
9962H65455p386K6301K3527P992j9611Q224R757J120O802P835l951l0320M6247
$$ 865455 858069 884370 907897 915889 896278 904502 914259 915379 922181 930016 926065 895745 941992
9949I41992J8889K2033Q305k6408m26j2298j5059J7104j0581J6311R542n3228
$$ 941992 960881 982914 991219 964811 964385 952087 937028 954132 943551 959862 969404 916176
9937I16176k0024k3188K0145L796K5185J649l2444J3343j6548j923O0821k2123
$$ 916176 896152 872964 893109 896905 922090 923739 891295 904638 888090 886167 946988 924865
9925I24865o36J2191L1056J0770j0937Q348j8572j1130K0179J7609j4385m216
$$ 924865 924229 936420 967476 978246 967309 975657 957085 945955 966134 983743 969358 965142
9913I65142l44j4798L8010Q085k3321M100l2091l446K5090L0229J8801J1447j9904
$$ 965142 964798 950000 988010 996095 972774 976874 944783 941337 966427 996656 1015457 1026904 1007000
9900A007000r094J2919N262k2841j8793Q367L567M0136J8782K7458K7190K9085
$$ 1007000 997906 1010825 1016087 993246 974453 982820 986387 1026523 1045305 1072763 1099953 1129038
9888A129038J9855k9330k1895M1335R010P733N6671M3160Q614j0549l2490J2483
$$ 1129038 1148893 1119563 1097668 1139003 1148013 1155746 1212417 1255577 1264191 1253642 1221152 1233635
9876A233635M1638N4158L1265J7863O7366O5139J9233N828L8513J0442K1198O2450
$$ 1233635 1275273 1329431 1360696 1378559 1445925 1511064 1530297 1536125 1574638 1585080 1606278 1668728
9864A668728R1718M6601N7611P2964O7929R9227J22162J51336J54295K03385K17665
$$ 1668728 1760446 1807047 1864658 1937622 2005551 2104778 2226940 2378276 2532571 2735956 2953621
9853B953621J52987J83284K24293J71705J76341K56326K62412L01471L74843N03429
$$ 2953621 3106608 3289892 3514185 3685890 3862231 4118557 4380969 4682440 5057283 5560712
9843E560712O20257P67442R45883J160951J423188J802809K305235K939018L745172
$$ 5560712 6180969 6948411 7894294 9055245 10478433 12281242 14586477 17525495 21270667
9834B1270667M558703M860117L784975Q22025l005106n505266n974598n110515
$$ 21270667 25829370 30689487 34474462 35296487 32291381 26786115 20811517 15701002
9826A5701002l756406k502463j577229r94490o29548m06431k78182j82606r6269
$$ 15701002 11944596 9442133 7864904 6870414 6240866 5834435 5556253 5373647 5277378
9817E277378n9082K8708L4886R9011J20488J25882J40679J94558K40861K11012
$$ 5277378 5218296 5247004 5281890 5380901 5501389 5627271 5767950 5962508 6203369 6414381
9807F414381K43088K40380K10310J92789R9931j22339k39123k86793k85325k65153
$$ 6414381 6657469 6897849 7108159 7300948 7400879 7278540 7039417 6752624 6467299 6202146
9797F202146k13138k04015j81266j76726j55194j37581r0314r7628j25615j15958
$$ 6202146 5989008 5784993 5603727 5427001 5271807 5134226 5043912 4946284 4820669 4704711
9787D704711j22969j03359p8036k0163l4164o8898l4708K8060M1385J3309l9256
$$ 4704711 4581742 4478383 4400347 4380184 4346020 4277122 4242414 4270474 4311859 4325168 4285912
9776D285912j37328k47259k87470k34197k06799j82692j27003r3147j02213r5587
$$ 4285912 4148584 3901325 3613855 3379658 3172859 2990167 2863164 2770017 2667804 2572217
9766B572217r5097r3819j36152o8568m0639n9464o8867k5667m4835p9591j5511
$$ 2572217 2477120 2383301 2247149 2178581 2137942 2078478 2009611 1983944 1939109 1859518 1844007
9755A844007m1686p8501p9198l0884m4228j6785k7468o2256o2775m3731j8684
$$ 1844007 1802321 1723820 1644622 1613738 1569510 1552725 1525257 1463001 1400226 1356495 1337811
9744A337811o7961q0636k6420j7095q143k6470l9595J0952J3657k7480m9131L2771
$$ 1337811 1269850 1189214 1162794 1145699 1137556 1111086 1071491 1082443 1096100 1068620 1019489 1052260
9732A052260k4436l6363n8550j7462J629l2456k0699N186k73j3642o1369k6158
$$ 1052260 1027824 991461 932911 915449 917078 884622 863923 869109 868836 855194 793825 767667
9720G67667K026j368m134L594o019r596k2352j8087J0006j95k5959j8108k0190
$$ 767667 769693 768325 764191 767785 761766 752170 729818 711731 721737 721542 695583 677475 657285
9707F57285j3035K6301j9803J000L3989j1155k1112j2601k7383J3713n522k5633
$$ 657285 644250 670551 650748 651748 685737 674582 653470 640869 613486 627199 621677 596044
9695E96044j8314j0908L158j145j6498k9252k9549J3130J4700k8746l5696j5501
$$ 596044 577730 566822 569980 568835 552337 523085 493536 506666 521366 492620 456924 441423
9683D41423j3956j50o38O747j8021J8333j5407m4647j3992K1051M4837Q255j9463
$$ 441423 427467 427317 426679 433426 415405 433738 418331 373684 359692 380743 425580 433835 414372
9670D14372K9687K8251Q376j7640n8673k6252J2156n384J9805J1089j4092j1082
$$ 414372 444059 472310 480686 463046 404373 378121 390277 384893 404698 415787 401695 390613
9658C90613l4477j5008o701k6075J9678r864K2200J1369k6143l9201K1693K8810
$$ 390613 356136 341128 334427 308352 328030 318166 340366 351735 325592 286391 308084 336894
9646C36894P108J2283j3127j4126L294o5654k1917Q531n787K5644L2828M997r784
$$ 336894 344002 356285 343158 329032 332326 266672 244755 253286 247499 273143 305971 310968 301184
9633C01184L6112Q851m1767m5792j7276K062j6165p71K8349J9492J1313K5835
$$ 301184 337296 346147 304380 258588 241312 243374 227209 226438 254787 274279 285592 311427
9621C11427q22k502k7090m3495j7946l8771O638J1933Q275M5060j4036j9744L345
$$ 311427 310605 308103 281013 237518 219572 180801 187439 199372 207647 252707 238671 218927 222272
9608B22272o602m890J3699K1916k3267m3957n587K5792L1756j54m6116j1213J3518
$$ 222272 215670 210780 224479 246395 223128 179171 173584 199376 231132 230978 184862 173649 187167
9595A87167k024j4124k246O8566n068l7113j0918K3659J6438K0581l7293l6671
$$ 187167 185143 171019 168773 237339 232271 195158 184240 207899 224337 244918 207625 170954
9583A70954J1285J0333p529L0519k0108k2518J7275M982l9705J5686K3100K1647
$$ 170954 182239 192572 185043 215562 195454 172936 190211 195193 155488 171174 194274 215921
9571B15921Q377m7806l7875J8382J436J5650K4076L198K038k0393Q136Q629l5473
$$ 215921 224298 176492 138617 156999 158435 174085 198161 201359 203397 183004 191140 199769 164296
9558A64296k5697j7454J3856K2296O1559j4794k3598J1531j9010l4454k726k3064
$$ 164296 138599 121145 135001 157297 218856 204062 180464 191995 172985 138531 135805 112741
9546A12741K3335L3297K2672r063o031j0152j6805l62P461k6248K1953K502p548
$$ 112741 136076 169373 192045 182982 176951 166799 149994 149632 157093 130845 152798 155300 147752
9533A47752k1872q130J4793K0908O220k7011m5751j1281N171K573R562O4338M693
$$ 147752 125880 117750 132543 153451 159671 132660 86909 75628 80799 83372 92934 157272 161965
9520A61965m4191k6189K6072J3486j5777m0670K2234N2617J7954K0031p880n2738
$$ 161965 117774 91585 117657 131143 115366 74696 96930 149547 167501 187532 179652 126914
9508A26914l1413K3682q560J0172O914j0117j3488J0814j3540Q038k1433k405
$$ 126914 95501 119183 110623 120795 127709 117592 104104 114918 101378 109416 87983 85578
9496H5578j9458J0874k6516o449K5971j0090R54L885j7941J7209O523Q212K0379
$$ 85578 66120 76994 50478 44029 70000 59910 60864 64749 46808 64017 70540 78752 99131
9483I9131Q227K8097J2274R171j3198R193j1704q83j621l0836l8243j4717o048
$$ 99131 107358 135455 147729 156900 143702 152895 141191 140308 138687 107851 69608 54891 48843
9470D8843j0327k0799L4921J9499N759r804r636J5423j4523L274J1716j8756q468
$$ 48843 38516 17717 52638 72137 77896 68092 58456 73879 59356 62630 74346 55590 47122
9457D7122J9497J5722K5966J2835J2709M432K8118K1600j8194l5274k2803j8676
$$ 47122 66619 82341 108307 121142 133851 138283 166401 188001 169807 134533 111730 93054
9445I3054j6389L1346L1279K0517o17l5548j0946k4053l869o608r728j1201R187
$$ 93054 76665 108011 139290 159807 159190 123642 112696 88643 84774 78166 68438 57237 66424
9432F6424k7670k0282M0689K1164l0377j5918K6340O6888M2960K2377L9345K7050
$$ 66424 38754 18472 59161 80325 49948 34030 60370 127258 170218 192595 231940 258990
9420B58990l5666k3489k931J1127m3121m8456j9488j8612k9800k7109O619N4438
$$ 258990 223324 199835 196904 208031 164910 116454 96966 78354 48554 21445 28064 82502
9408H2502L2882n915q128l8709k2670J656Q509L5287k0410P551Q547o160j524
$$ 82502 115384 109469 101341 62632 39962 41618 50127 85414 65004 72555 81102 74942 73418
9395G3418L6514K5127j5138j2517r838j058l0234k4066j9427j9645M6495K2278
$$ 73418 109932 135059 119921 107404 97566 96508 66274 42208 22781 3136 49631 71909
9383G1909l6741n435k430j7139J187p205j0069K99J0094J7689m39L029k7904J1898
$$ 71909 35168 29733 27303 10164 11351 4146 -5923 -5624 4470 22159 21720 24749 -3155 8743
9369H743K6395J4008j1296N359K700L1664M246M441J4546M0844J5824o8272l6770
$$ 8743 35138 49146 37850 43209 45909 77573 81819 86260 100806 141650 157474 89202 52432
9356E2432L213Q854k8866l2876J1692J9292J1912P650R915l1976K523K0254K760
$$ 52432 55645 64499 35633 2757 14449 33741 45653 53303 63218 31242 33765 54019 56779
9343E6779j4196K0156J9619L579M6109l807n0159p728k7589j5261K6628l112q332
$$ 56779 42583 62739 82358 85937 132046 128239 78080 70352 42763 27502 54130 51018 42686
9330D2686k1017K628K0292M489k2476J6200n966k3841j0463K4813K3771j9664
$$ 42686 21669 24297 44589 49078 26602 42802 36836 12995 2532 27345 51116 31452
9318C1452o355O965q26j0178k0324L5359k6012J6473n621L7177L2663j8660j7328
$$ 31452 25097 32062 31236 21058 734 36093 10081 26554 20933 58110 90773 72113 54785
9305E4785k0695J401K7672J9594L6029J1891k4384l5483j8412k2192J2675k6182
$$ 54785 34090 35491 63163 82757 118786 130677 106293 70810 52398 30206 42881 16699
9293A6699q441o745p695L9767L777o616N974n014j0093K1102K2858J3813n5924
$$ 16699 8258 1513 -6182 33585 37362 30746 36720 31706 21613 42715 65573 79386 23462
9280B3462m6889L0755o214j2776K6394J3196k8827L586N3547j3582j3278K60o48
$$ 23462 -23427 7328 1114 -11662 14732 27928 -899 2687 56234 42652 29374 29634 28986
9267B8986j4734j6819k6807P849p321M5967L8249J1805l8527k1779k5548J4626
$$ 28986 14252 -2567 -29374 -21525 -28846 17121 55370 67175 28648 6869 -18679 -4053
9255d053K0874K3443k2503P526j620K3174J8113O141l1077j6793M090J2106r78
$$ -4053 16821 40264 17761 25287 23667 46841 64954 71095 40018 23225 27315 39421 38443
9242C8443k7757J0069j3184l302J6922L319l477P738n898J7076j5664j392K4633
$$ 38443 10686 20755 7571 4269 21191 24510 21033 28771 22873 39949 24285 22893 47526
9229D7526Q229k2425j1538Q83J5405J2150P202j8745k1252J481Q429L180K9090
$$ 47526 55755 33330 21792 22675 38080 50230 57432 38687 17435 18916 27345 30525 59615
9216E9615O577n3039j6652J8285N5177K0788J9985j372l3012p660K2644J1963
$$ 59615 66192 13153 -3499 14786 69963 90751 110736 109364 76352 68692 91336 103299
9204A03299k962P408k0056m5561k0962n560K5535J6754q059N009J9762k3477n4744
$$ 103299 100337 107745 87689 42128 21166 15606 41141 57895 49836 54845 74607 51130 -3614
9191c614J2558M4566j4463r006k3036k5751M837j4627L7802O425J6480m649m6917
$$ -3614 8944 53510 39047 30041 7005 -18746 -13909 -28536 9266 15691 32171 27522 -19395
9178a9395m422J5213j6442k483M2777n270O392J7651k240L06J263k2259k4017
$$ -19395 -23817 -8604 -25046 -27529 15248 9978 16370 34021 31781 32087 33350 11091 -12926
9165a2926J0114M2726N2493m1910q7987J986K8215L6827L972j7739o657j2756
$$ -12926 -2812 39914 92407 50497 -37490 -35504 -7289 29538 33510 15771 9114 -3642
9153c642o362L8859J1814r073M134K3602J883l6339L172K0989N913q977j0127
$$ -3642 -10004 28855 40669 31596 35730 59332 61215 24876 28048 49037 54950 45973 35846
9140C5846j8978L8162L9274k1553o2574o122l846L451J2444J2188J369J7498P84
$$ 35846 16868 55030 94304 72751 10177 4055 209 3660 16104 28292 29661 47159 47943
9127D7943q585o081q511l218k9185K7143m1384j5128j4153J1010J8220o64J6437
$$ 47943 39358 33277 24766 21548 -7637 19506 -21878 -37006 -51159 -40149 -21929 -22593 -6156
9114f156q373N2742N0388j9358k7247r630p020J432J8796J9933p054J3646M174
$$ -6156 -14529 38213 88601 69243 41996 32366 25346 26778 45574 65507 58453 72099 76273
9101G6273J701Q099k4598J2641m2386o4610K1517K6495Q667J9799k7024j5918
$$ 76273 77974 86073 61475 74116 31730 -32880 -11363 15132 23799 43598 16574 656
9089F56K2787L028j0200J8816j1705k3883j7749k7475M8374M7052L458j560j3240
$$ 656 23443 26471 16271 35087 23382 -501 -18250 -45725 2649 49701 53159 51599 38359
9076C8359K0222n196K117j0411k6170J1598n09k6247K981M5879k2584k6485K6518
$$ 38359 58581 53385 55502 45091 18921 30519 30010 3763 6744 52623 30039 3554 30072
9063C0072L608p272K2081M4220j8741k298j1810l9177J7925j1349j5534l6055
$$ 30072 33680 26408 48489 92709 73968 71670 59860 20683 38608 27259 11725 -24330
9051b4330J6422l615J3421n797k367K2681N846q159m0328j9755Q979L7418J5857
$$ -24330 -7908 -11523 1898 -3899 -6266 16415 22261 14102 -26226 -45981 -37002 416 16273
9038A6273L698k10n428J1635J7577l1420J6556l368P823j6473j1700P69K6376
$$ 16273 19971 19761 14333 25968 43545 12125 28681 25313 33136 16663 4963 5732 32108
9025C2108N390j7129K9212k6319l0310o798k3113L7216J238l6481L664J6716r114
$$ 32108 37498 20369 49581 23262 -7048 -13846 -36959 257 1495 -34986 -31322 -14606 -23720
9012b3720o89K7407K0061L8675k1323j6494K3420r19k4412p113J5515K772l828
$$ -23720 -24409 2998 23059 61734 40411 23917 47337 46418 22006 14893 30408 33180 29352
8999B9352R608j0642m7370K6748K4138k1032j8649N758r804K4723M3948K133K9007
$$ 29352 38960 28318 -19052 7696 31834 10802 -7847 -2089 -11893 12830 56778 58911 87918
8986H7918q401k5718j2752j3697R820o8456j1931L4205K8047N288k3892l945j2332
$$ 87918 79517 53799 41047 27350 37170 -31286 -43217 -9012 19035 24323 431 -3514 -15846
8973a5846Q617O1525Q138n149j6921J589R80k5215j842J9335Q807j7829j3701
$$ -15846 -7229 54296 62434 57285 40364 41953 42933 17718 15876 35211 44018 26189 12488
8960A2488K348j5180m098Q374J955j1137K935R286J1144n754L2600O099j6745
$$ 12488 14836 -344 -4442 3932 5887 -5250 -2315 6971 18115 12361 44961 51060 34315
8947C4315l6186r449l397j0556k549L3491M8244Q88j0778O065R335L0829k5358
$$ 34315 -1871 -11320 -14717 -25273 -27822 5669 53913 54801 44023 50088 59423 90252 64894
8934F4894l6335m0663Q946K2310j6406L412M20M880L8665n257n3459j2875j2619
$$ 64894 28559 -12104 -3158 19152 2746 6158 6578 11458 50123 44866 -8593 -21468 -34087
8921c4087j0896L0173J9774q434J444l2650L77N9608k6796k545M1103n451j7694
$$ -34087 -44983 -14810 4964 -3470 -2026 -34676 -34299 25309 -1487 -4032 37071 31620 13926
8908A3926P45M004n802J1297M416K9497L0702m135l0106n1234L289o001j8198
$$ 13926 14671 18675 12873 24170 28586 58083 88785 84650 54544 3310 6599 598 -17600
8895a7600j2136N4029L7158l506q366k5321k6312k665K6245J7480k521q508k6747
$$ -17600 -29736 24293 61451 57945 49579 24258 -2054 -4719 21526 39006 36485 27977 1230
8882A230j9938l737j442R421k7916j225L3582L6079J7038j1828J258J2631j9817
$$ 1230 -18708 -22445 -23887 -14466 -42382 -43607 -10025 26054 43092 31264 32522 45153 25336
8869B5336j1871j017J5142j0922n413L859k7574K117J4800K504r915J748o810
$$ 25336 13465 12448 27590 16668 11255 15114 -12460 -10343 4457 6961 -2954 -1206 -8016
8856h016j0664k832J8537Q286J1106J2517j9130Q952P094r056K4618L5802k3599
$$ -8016 -18680 -21512 -2975 5311 16417 28934 9804 18756 25850 16794 41412 77214 53615
8843E3615k0971k4482N003J0935K9261K4300K0713k4216l6030l442J8406J1382
$$ 53615 32644 8162 13165 24100 53361 77661 98374 74158 38128 34686 53092 64474
8831F4474j7788n179J2857j1619j3671r073P067l1897L9343O0106q940l1429k6240
$$ 64474 46686 41507 54364 42745 29074 20001 27068 -4829 34514 94620 85680 54251 28011
8818B8011l9659O190o00k7565o168L1856J4074p653j1609J4359N504n2576m746
$$ 28011 -11648 -5458 -6058 -33623 -39791 -7935 6139 -1514 -13123 1236 6740 -45836 -50582
8805e0582K0924J522M048j9965k1615Q807K0587N724k4816K8108J0850k022L623
$$ -50582 -29658 -28136 -24088 -44053 -65668 -56861 -36274 -30550 -55366 -27258 -16408 -18430 -14807
8792a4807J5561Q276K6618K2229j5354j3137k2278j2658k6522n769l989N374L2466
$$ -14807 754 9030 35648 57877 42523 29386 7108 -5550 -32072 -37841 -41830 -36456 -3990
8779c990J9861K906m834R521J2599L2316j3133l14J3352p949K3530M624n7303
$$ -3990 15871 18777 13943 23464 36063 68379 55246 54932 68284 60335 83865 88489 31186
8766C1186k6118L2246J5097O04j9679j4493p906Q690k139l2920k3027P515K756
$$ 31186 5068 37314 52411 53015 33336 18843 10937 19627 17488 -15432 -38459 -30944 -28188
8753b8188L6821N5623J5369l1036M806K244j0050J5359J9146J2723j0954j0964
$$ -28188 8633 64256 79625 48589 53395 55639 45589 60948 80094 92817 81863 70899
8741G0899j8506k2203k740K6638J333j7672m2408l4907N6898O2947M6458L031
$$ 70899 52393 30190 27450 54088 55421 37749 -4659 -39566 17332 80279 126737 129768
8729A29768l5056j9938r194k7018M38m9985k2812K2071K6165K7058N417K596j4030
$$ 129768 94712 74774 65580 38562 39000 -10985 -33797 -11726 14439 41497 46914 49510 35480
8716C5480n366K1201n20j7516n863j968K2370O473m061J6437J7412l2960j0961
$$ 35480 30114 51315 50795 33279 27416 25448 47818 54291 50230 66667 84079 51119 40158
8703D0158M974K7212o514l630l8085r793N7948J6605K2769j2890n1491j0502j4487
$$ 40158 45132 72344 65830 62200 24115 14322 72270 88875 111644 98754 47263 36761 22274
8690B2274r234L9463K2306M695o661j3318Q547j7047Q515K4987K1625K1025n1973
$$ 22274 13040 52503 74809 79504 72843 59525 68072 51025 59540 84527 106152 127177 75204
8677G5204j13L4350o229J5101K0677j3959k2424N2709M0169o751K780j3270L5218
$$ 75204 75091 109441 103212 118313 138990 125031 102607 155316 195485 188734 191514 178244 213462
8664B13462N834k6187J3058j6982K4607K1212L5940P2335o554j6032p12p325M8045
$$ 213462 219296 193109 206167 189185 213792 235004 270944 343279 336725 320693 319981 312656 360701
8651C60701M4969O2661J16263N9157N9807P0034N4812Q8992J19638J61760K31910
$$ 360701 405670 468331 584594 643751 703558 773592 828404 917396 1037034 1198794 1430704
8640A430704K66873K84942L55720N05128O30585P95960J022040J202921J204702
$$ 1430704 1697577 1982519 2338239 2843367 3473952 4269912 5291952 6494873 7699575
8631G699575P32269l10852j282077j498424j386835j141826q11085m93043l34769
$$ 7699575 8431844 8120992 6838915 5340491 3953656 2811830 2000745 1507702 1172933
8622A172933k45023j45232r6592n8384n7400l6026l6936j8107K0397J9360K0229
$$ 1172933 927910 782678 686086 627702 570302 534276 497340 479233 499630 518990 539219
8611E39219N0786M3358P2519P8319M6060P1806O0907P5867J21422J12489J79454
$$ 539219 590005 633363 705882 784201 830261 902067 962974 1038841 1160263 1272752 1452206
8600A452206J88157J48516K07694L00761L42332M08250N59488P43378R76644J143320
$$ 1452206 1640363 1788879 1996573 2297334 2639666 3047916 3607404 4350782 5327426 6470746
8590F470746J493433J910743K342585K432767J751417j09658k334371l027530
$$ 6470746 7964179 9874922 12217507 14650274 16401691 16292033 13957662 10930132
8582A0930132k893572k362138j684457j089761p48867m87314l25288k26106j89870
$$ 10930132 8036560 5674422 3989965 2900204 2151337 1664023 1338735 1112629 922759
8573I22759j06359o0015o8914o2047l0129m1151m7739m9187j5154N168L2535M3677
$$ 922759 816400 756385 687471 625424 595295 554144 506405 457218 442064 447232 479767 523444
8561E23444L4858J3151M9284M8781M4980N4473Q4980O0183Q7749J17128K01791
$$ 523444 558302 571453 620737 669518 714498 768971 853951 914134 1001883 1119011 1320802
8550A320802K11763K65724K70291M26631N53031O73690Q63183J079130J198148
$$ 1320802 1532565 1798289 2068580 2495211 3048242 3721932 4585115 5664245 6862393
8541F862393R38597K06750q87852j447404j449317j199565q64112n73386m20370
$$ 6862393 7800990 8007740 7119888 5672484 4223167 3023602 2159490 1586104 1165734
8532A165734l15677k23831j05980j03087o5250m5048l2115k1154n3928m7994k1879
$$ 1165734 850057 626226 520246 417159 351909 306861 274746 253592 199664 151670 129791
8521A29791r843J5723K351k6082l7076l4415m364K6039r84n8765j4245O372L1519
$$ 129791 119948 135671 138022 111940 74864 40449 36085 62124 61140 2375 -11870 -5498 26021
8508B6021J8186k4724l4388l1577j0333J0603j5894n130L5931K9116M2976n36
$$ 26021 44207 19483 -14905 -46482 -56815 -46212 -62106 -67236 -31305 -2189 40787 40251
8496D0251j2356k3463K6724L6569m9595m9879K0573J2950k2349n766q679K805
$$ 40251 27895 4432 31156 67725 18130 -31749 -11176 1774 -20575 -26341 -35020 -32215
8484c2215J7982j8350M993J8633K015l0127J4064k4648j468J83p068k5765k0908
$$ -32215 -14233 -32583 -27590 -8957 -6942 -37069 -23005 -47653 -49121 -48938 -56006 -81771 -102679
8471a02679n1M8257o238N285Q033J2086K7999O214r239J6063r319K018k2933k843
$$ -102679 -102730 -54473 -60711 -55426 -47393 -35307 -7308 -1094 -10333 5730 -3589 -1571 -24504 -27347
8457b7347j8229k382J9652R858j7526L479P176j0897L8747n129p824J1293k29
$$ -27347 -45576 -47958 -28306 -18448 -35974 -32495 -25319 -36216 2531 -2598 -10422 871 642
8444F42p134L9130R138l1101K1676K432Q000j8760j0026M677r213k6377q645k6040
$$ 642 -6492 32638 41776 10675 32351 34783 42783 24023 13997 18674 9461 -16916 -25561 -51601
8430e1601K0803R582k7726j4075N1582N5117j9145k8970l223J5834j9425M637
$$ -51601 -30798 -21216 -48942 -63017 -11435 43682 24537 -4433 -7656 8178 -11247 -6610
8418f610K118k1697r263J0263k3051k7879l78L2877O5799J5896l8412j0652L8676
$$ -6610 -4492 -26189 -35452 -25189 -48240 -76119 -76497 -43620 22179 38075 -337 -10989 27687
8405B7687j9646k2941R892K8999J5727Q468k6658j8121K0025K0996K4071q079
$$ 27687 8041 -14900 -5008 23991 39718 48186 21528 3407 23432 44428 68499 60420
8393F0420m3270l0109j2129K6808J5110K0299Q305j3388k7439j7287J8482l2794
$$ 60420 17150 -12959 -25088 1720 16830 37129 45434 32046 4607 -12680 5802 -26992
8381b6992k4643L8433N320r914o694J927r364M643K3339j2587J6016M8425j5815
$$ -26992 -51635 -13202 -7882 -17796 -24490 -22563 -31927 -27284 -3945 -16532 -516 47909 32094
8368C2094j9238j2755r460K3698l5134M269k730j1422J3627K8613J3131J5906
$$ 32094 12856 101 -9359 14339 -20795 -16526 -19256 -30678 -17051 11562 24693 40599
8356D0599l8235o623N1043j7121k6435P849Q824J1465j4216j7025k1191k0596
$$ 40599 2364 -4259 46784 29663 3228 11077 19901 31366 17150 125 -21066 -41662
8344d1662o0604m2924N9225L4847K9136J5022j0009m0075o507j8000J2011L4715
$$ -41662 -102266 -145190 -85965 -51118 -21982 -6960 -16969 -57044 -63551 -81551 -69540 -34825
8332c4825J9513j2925Q494L6242J7411n4647n2598Q194J4552K0738n266R644l263
$$ -34825 -15312 -28237 -19743 16499 33910 -20737 -73335 -65141 -50589 -29851 -35117 -25473 -28736
8319b8736k2292L4692N1839K467k3128k0752q227K181M475k1008k5264l760l7664
$$ -28736 -51028 -16336 35503 37970 14842 -5910 -14137 -11956 -7481 -28489 -53753 -57513 -95177
8306i5177k6874n927N3254O8680l6749k9675M0477M0531k8570l9336J6608L0921
$$ -95177 -122051 -127978 -74724 -6044 -42793 -72468 -31991 8540 -20030 -59366 -42758 -11837
8294a1837j7961p672J3848k1985j1374j1236K9302L6494K6435J654J0165M720
$$ -11837 -29798 -37470 -23622 -45607 -56981 -68217 -38915 -2421 24014 25668 35833 40553
8282D0553J5203P296p924m949R221l1353l6172j5758j4276j4112j0248j7944K8031
$$ 40553 55756 63052 55128 50179 59400 28047 -8125 -23883 -38159 -52271 -62519 -80463 -52432
8269e2432l53j9173N108K9931N781O54k8662k5121M3439M6536p78p4623l5816
$$ -52432 -52785 -71958 -66850 -36919 -31138 -30484 -59146 -84267 -40828 5708 4930 -69693 -105509
8256a05509N1484L8778j7276j4069j143L0102k9474J6203K1249l5384J3769K45
$$ -105509 -54025 -15247 -32523 -46592 -47735 -17633 -47107 -30904 -9655 -45039 -31270 -31025
8244c1025r690R457j1596l1066L8213M3387k2102r491l088n782P338j750K3918
$$ -31025 -40715 -31258 -42854 -73920 -35707 7680 -14422 -23913 -27001 -32783 -25445 -27195 -3277
8231c277j2224l0738N183K1774j7872O329j9329J1301M571K1233J3449j7406l3278
$$ -3277 -15501 -46239 -41056 -19282 -37154 -30825 -50154 -38853 -34282 -13049 400 -17006 -50284
8218e0284k7647J4035K4667L3169L568L3993k362j279J4269m949q115k5102J3745
$$ -50284 -77931 -63896 -39229 -6060 -2492 31501 29139 27860 42129 37180 29065 3963 17708
8205A7708M4650j8699k2922L3134j4629k7272j4051K358k542q885m901K3849K5537
$$ 17708 62358 43659 20737 53871 39242 11970 -2081 277 -2265 -11150 -16051 7798 33335
8192C3335j4017L469L143j4082m067j4654J3039J5717j0841K7677K3211K3939
$$ 33335 19318 22787 25930 11848 7781 -6873 6166 21883 11042 38719 61930 85869
8180H5869M9629J2133k9162o4131l5643m5923j8930P371J6649L922K7287j48N777
$$ 85869 135498 147631 118469 54338 18695 -27228 -46158 -38787 -22138 -18216 9071 8923 14700
8167A4700j8893j44K1086l044m160l5377l9501j605M220p66J4365J0735K7949
$$ 14700 -4193 -4337 16749 13705 9545 -25832 -65333 -66938 -62718 -63484 -49119 -38384 -10435
8154a0435R360J2386o0143P585K0215J5908M267q667j0672r523j8211m396m997
$$ -10435 -1075 11311 -48832 -41247 -21032 -5124 -857 -9524 -20196 -29719 -47930 -52326 -57323
8141e7323M6887r379J0830M4653q792l5426K4106K2966J1407m796k0303j3609
$$ -57323 -10436 -19815 -8985 35668 26876 -8550 15556 38522 49929 45133 24830 11221
8129A1221J918l4139n873j4001m2320J2884K5190L0527j2945p573K0065J1757
$$ 11221 13139 -21000 -26873 -40874 -83194 -70310 -45120 -14593 -27538 -35111 -15046 -3289
8117c289k3080K9008L2304K3271l3449l1356k9798P81J7897k9307j5262m493K3622
$$ -3289 -26369 2639 34943 58214 24765 -6591 -36389 -35608 -17711 -47018 -62280 -66773 -43151
8104d3151K7409r646J6933k9835j278P0157J8491J1905j1813J4744j0840l1088
$$ -43151 -15742 -25388 -8455 -38290 -39568 30589 49080 60985 49172 63916 53076 21988
8092B1988J9331j1687q184p679K2987L9526K355j0925l1970j9726k1943j1159
$$ 21988 41319 29632 21448 13769 36756 76282 78637 67712 35742 16016 -5927 -17086
8080a7086j3335k2914j3320R92J9365p425m5268K7499N8812j244k3606J548K9224
$$ -17086 -30421 -53335 -66655 -65663 -46298 -53723 -98991 -71492 -12680 -13924 -37530 -35982 -6758
8067f758M275k0699Q9O163l7791r603j0271L2387L5028R742J1577J2807K8850
$$ -6758 -2483 -23182 -23093 -16930 -54721 -64324 -74595 -42208 -7180 2562 14139 26946 55796
8054E5796l8351n921l2001j9074M3098K5303L242L700r377L594o116k5176j152
$$ 55796 17445 11524 -20477 -39551 3547 28850 32092 35792 26415 30009 23893 -1283 -2435
8041b435L3001J2507l8261N528j5532J4424J4327K1477K0826J9373l2820k5976
$$ -2435 30566 43073 4812 10340 -5192 9232 23559 45036 65862 85235 52415 26439
8029B6439R498j6030p838J4143O940M917k9412j3418K3216J854n152l479k3593
$$ 26439 35937 19907 12069 26212 33152 38069 8657 -4761 18455 20309 15157 11678 -11915
8016a1915l8840J1665M1180n417l6941J8018M0460R646m2121q058m147j8529j4409
$$ -11915 -50755 -39090 2090 -3327 -40268 -22250 18210 27856 -14265 -22323 -26470 -44999 -59408
8003e9408j4494K1932L7832J2674l624L23l987Q728L3268j0747K126M275j2692
$$ -59408 -73902 -51970 -14138 -1464 -5088 -4765 -8752 -24 33244 22497 24623 28898 16206
7990A6206j4695l163k4846r182N4620r043j0845J7127r257K4055L0945M748k5913
$$ 16206 1511 -1652 -26498 -35680 18940 9897 -948 16179 6922 30977 61922 66670 40757
7977D0757j6558J0316l1096j909P468m9738q923L3868K9330K2502k1420j9514
$$ 40757 24199 34515 3419 1510 8978 -40760 -49683 -15815 13515 36017 14597 -4917
7965d917j7482j6810J7315Q441J6403N4635q192j3671N481j555k0605J5316k3326
$$ -4917 -22399 -39209 -21894 -13453 2950 57585 49393 35722 41203 39648 19043 34359 11033
7952A1033l1938q044K914l4777j6272L8338P3512M5847p730k1492n6570m8812
$$ 11033 -20905 -28949 -26035 -60812 -77084 -38746 34766 80613 72883 51391 -5179 -53991
7940e3991L247J1074J8366J908m564j3934J2461J9863K7733R217n772K4248k4493
$$ -53991 -50744 -39670 -21304 -19396 -23960 -37894 -25433 -5570 22163 31380 25608 49856 25363
7927B5363j6592p378N19k9891o79j5121q750M1838L678l2579j8680j0954J6862
$$ 25363 8771 1393 1912 -27979 -28658 -43779 -52529 -10691 -7013 -39592 -58272 -69226 -52364
7914e2364K3447J7828L0411j303J4880k3619k3436m8403R467j0335K0909J4958
$$ -52364 -28917 -11089 19322 18019 32899 9280 -14156 -62559 -53092 -63427 -42518 -27560
7902b7560k083J7629J7459J9411k7860l5881J5987k0080K4546M1135j4258j2521
$$ -27560 -29643 -12014 5445 24856 -3004 -38885 -22898 -42978 -18432 22703 8445 -4076
7890d076o238L0857k6447m5645J2163l598m7817K4751N1923r658M1483j0796l2618
$$ -4076 -10314 20543 -5904 -51549 -39386 -42984 -90801 -66050 -14127 -23785 17698 6902 -25716
7877b5716j6207L8948q495O789r417j8056k012N053q144J7032l1625j5764L5838
$$ -25716 -41923 -2975 -11470 -4681 -14098 -32154 -34166 -29113 -37257 -20225 -51850 -67614 -31776
7864c1776M5757J5969J5887q910k7375j8793j9922j1521k5524K0324L1944N294
$$ -31776 13981 29950 45837 36927 9552 -9241 -29163 -40684 -66208 -45884 -13940 -8646
7852h646J4831j310k8375j9255j9178P017J2429j2077N805L0482J5339k2023l4578
$$ -8646 6185 4875 -23500 -42755 -61933 -54916 -42487 -54564 -48759 -18277 -2938 -24961 -59539
7839e9539k3246n226N59J8028K4957K5329Q403l9158L523K4191J4843l1379l5738
$$ -59539 -82785 -88011 -87452 -69424 -44467 -19138 -10735 -49893 -46370 -22179 -7336 -38715 -74453
7826g4453J8101L4872J6191o846K9268K3967j1087n0357k9873J3496k52N650j6513
$$ -74453 -56352 -21480 -5289 -12135 17133 41100 30013 -20344 -50217 -36721 -36973 -31323 -47836
7813d7836J6597J9959L872O304l0387J9903J7378j0378k511J3973K7958J1112
$$ -47836 -31239 -11280 -7408 -1104 -31491 -11588 5790 -4588 -7099 6874 34832 45944
7801D5944m1352J541j2852M1730M68j4167j170K0035k1491o317l829P054j5120
$$ 45944 4592 6133 -6719 35011 35479 21312 20142 40177 18686 12369 8540 15594 474
7788D74l0372j3865l150o498L472L4618p950j680r34J7163K051J5013j0315j9003
$$ 474 -29898 -43763 -46913 -53411 -49939 -15321 -23271 -24951 -25885 -8722 -6671 8342 -1973 -20976
7774b0976j4391j1695m939O2404J0865m6193P396j110J4856J2368J1575Q42k9580
$$ -20976 -35367 -47062 -52001 10403 21268 -24925 -17529 -18639 -3783 8585 20160 21002 -8578
7761h578j9928M126k4480Q038k6523j8819J3406q396L64q241K2500O58K505L0161
$$ -8578 -28506 -24380 -48860 -40822 -67345 -86164 -72758 -81154 -80790 -89031 -66531 -65873 -63368 -33207
7747c3207J1884j2763K8921N8822l128M342k8572k6702k0436N986J7799K98j2943
$$ -33207 -21323 -34086 -5165 53657 50529 54871 26299 -403 -20839 -14853 2946 3244 -9699
7734i699M036R358j0998O226K0453k7499n4463P948O2118K7022l347L469j1323
$$ -9699 -5663 3695 -7303 -1077 19376 -8123 -62586 -54638 7480 34502 31155 34624 23301
7721B3301L031k6148N233Q108n7173k3615J0957l5619R293J7750K8690L4772J3492
$$ 23301 26332 184 5417 13525 -43648 -67263 -56306 -91925 -82632 -64882 -36192 -1420 12072
7708A2072L371j97j0042k2712J2721J6549k4585j7670L0462K6495K4772p119J828
$$ 12072 15443 15246 5204 -17508 -4787 11762 -12823 -30493 -31 26464 51236 44117 45945
7695D5945j1884o490j8953J8900l4060r487J4076J7933J7614q320L9957j4743
$$ 45945 34061 27571 8618 27518 -6542 -16029 -1953 15980 33594 25274 65231 50488
7683E0488k8220m0018k2087Q87l6809j9734M7191M8361J6270Q096o925J9468j2338
$$ 50488 22268 -17750 -39837 -38950 -75759 -95493 -48302 59 16329 24425 17500 36968 24630
7670B4630n3975l7917p804M9396J8256J5691q040l8811Q657P315q797j1683m1702
$$ 24630 -29345 -67262 -75066 -25670 -7414 8277 237 -38574 -29917 -22602 -31399 -43082 -84784
7657h4784O824O001M0618K935R968p488N452k0021K212J02M9647L4521m7503j8558
$$ -84784 -77960 -71959 -31341 -28406 -18438 -25926 -20474 -40495 -38283 -38181 11466 45987 -1516 -20074
7643b0074N948j108K3914j6591J3904J1122l8588o334J3746j6455j145O363R030
$$ -20074 -14126 -15234 8680 -7911 5993 17115 -21473 -27807 -14061 -30516 -31661 -25298 -16268
7630a6268r496l0811k2144J1974L4621j6529J8349j4242J1857J7750J5378K157
$$ -16268 -25764 -56575 -78719 -66745 -32124 -48653 -30304 -44546 -32689 -14939 439 2596
7618B596j9895j8167k384l540J4107J9414J1960k4788o17k0081j4037N86m417
$$ 2596 -17299 -35466 -37850 -41390 -27283 -7869 4091 -20697 -21314 -41395 -55432 -54846 -59263
7605e9263K2694j9749l1855M3074J4278L7976M068j9549k4213k5853M0443N5629
$$ -59263 -36569 -56318 -88173 -45099 -30821 7155 11223 -8326 -32539 -58392 -17949 37680
7593C7680k2766l3780k4785k6377M109k444j1979J6277K5958K7912K050J2385
$$ 37680 14914 -18866 -43651 -70028 -65919 -68363 -80342 -64065 -38107 -10195 -8145 4240
7581D240J6902l4448q912O272l8265k5250J6426L276j3855K5578J6604J4079J5488
$$ 4240 21142 -13306 -22218 -15946 -54211 -79461 -63035 -59759 -73614 -48036 -31432 -17353 -1865
7568a865q16J4129J9165k9332m2382P206r270J726k6976m590m428O415L7362O76
$$ -1865 -2681 11448 30613 1281 -41101 -33895 -43165 -41439 -68415 -73005 -77433 -71018 -33656 -32980
7554c2980j0312J7751P414K277l4755m7834M7482L5586J3812m928m4492J4289
$$ -32980 -43292 -25541 -18127 -15850 -50605 -98439 -50957 -15371 -1559 -6487 -50979 -36690
7542c6690P497J4981j1487m123K2624k3088J4982M8307K833K4083m1638j1302
$$ -36690 -29193 -14212 -25699 -29822 -7198 -30286 -15304 33003 35836 59919 18281 6979
7530F979j3235j8729j0844J1285K1056L1293n886n215L281k4822m9439l4468j4717
$$ 6979 -6256 -24985 -35829 -24544 -3488 27805 21919 16704 19985 -4837 -54276 -88744 -103461
7517a03461J2134J119j1690M6446L0533l48K1281j2988l2281j1479J3458L389
$$ -103461 -91327 -90208 -101898 -55452 -24919 -25267 -3986 -16974 -49255 -60734 -47276 -43887
7505d3887K5185K4721l5995J5759K5734j2582l7782l2060L0781L4233L892k4986
$$ -43887 -18702 6019 -29976 -14217 11517 -1065 -38847 -70907 -40126 -5893 -2001 -26987
7493b6987j845j1482O047j662j9754l6459J4259K9758K1826K4171N643R69L5483
$$ -26987 -28832 -40314 -34267 -35929 -55683 -92142 -77883 -48125 -26299 -2128 3515 4484 39967
7480C9967K7217J267k0675o1397l1349K1333k5374p273m2991P504L4567J8829
$$ 39967 67184 68451 47776 -13621 -44970 -23637 -49011 -56284 -99275 -91771 -57204 -38375
7468c8375j5977l0116m6985J7322K3780L3527Q43O84J9772L2550L2234j6343n1911
$$ -38375 -54352 -84468 -131453 -114131 -90351 -56824 -55981 -55297 -35525 -2975 29259 12916 -38995
7455c8995n64n347K0313K2458N150J7322n121j636J919K1368J1647l6828l1731
$$ -38995 -39559 -44906 -24593 -2135 3015 20337 15216 13580 15499 36867 48514 11686 -20045
7442b0045K2328J8204l2580J9058K6367k4937m0273J332j1040l679K4062j3780
$$ -20045 2283 20487 -12093 6965 33332 8395 -31878 -30546 -41586 -45265 -21203 -34983
7430c4983J082O8403m136m7351j3242j8271K249n37l979n123q488j5215J5872
$$ -34983 -33901 34502 30366 -16985 -30227 -48498 -46249 -46786 -50765 -55888 -64376 -79591 -63719
7417f3719K4486k4941m663L4544L5797q804N36l7279n3987m505R328K2799J0125
$$ -63719 -39233 -64174 -68837 -34293 1504 -7300 -6764 -44043 -98030 -102535 -93207 -70408 -60283
7404f0283L8593K066J4493J4558j4632k5629j5378N40k8083m8973P448K3751J9341
$$ -60283 -21690 -19624 -5131 9427 -5205 -30834 -46212 -45672 -73755 -122728 -115280 -91529 -72188
7391g2188M4267J0842n559L472J3350J9613K1121N768j9958k18j6778k3504N879
$$ -72188 -27921 -17079 -22638 -19166 -5816 13797 34918 40686 20728 20510 3732 -19772 -13893
7378a3893k2617l1658p642J7075P685L7668M962l6345k3393j2704j2617K2535
$$ -13893 -36510 -68168 -75810 -58735 -51050 -13382 -8420 -44765 -68158 -80862 -93479 -70944
7366g0944n527K6971n292o260o426K9940L3443K759R757p909l9869p786L0324
$$ -70944 -76471 -49500 -54792 -61052 -67478 -37538 -4095 -1336 8421 512 -39357 -47143 -16819
7353a6819j53M932k191K5774J1279j1165p224m530L7342k7353J901k375k731k075
$$ -16819 -16972 -12040 -14231 11543 22822 11657 4433 -97 37245 9892 11793 9418 6687 4612
7339D612j0604J6692l4612J1799M3406M243j8962k0288m3787M1824L0898o2487
$$ 4612 -5992 10700 -23912 -12113 31293 35536 16574 -3714 -47501 -5677 25221 -37266
7327c7266m3751J7521N3714J1396j479L7021j5769k3232K3393M184m2873l4164
$$ -37266 -81017 -63496 -9782 1614 135 37156 21387 -1845 21548 25732 -17141 -51305
7315e1305J3165J9308J4315R55k500n875O830J2913Q447K0244k6058P196R659
$$ -51305 -38140 -18832 -4517 -3562 -6062 -11937 -5107 7806 16253 36497 10439 17635 27294
7302B7294o49k1888m4151k496K7971j7770j1283k5686j1305N192r708K7295L5230
$$ 27294 26645 4757 -39394 -41890 -13919 -31689 -42972 -68658 -79963 -74771 -84479 -57184 -21954
7289b1954M1825j0594o282J3339L0346k3702l8712j6741j857K3255l3468m2518
$$ -21954 19871 9277 2995 16334 46680 22978 -15734 -32475 -34332 -11077 -44545 -87063
7277h7063L1135M9791K4856Q363j3105k3864K653J1305K4094l1870k1361K6527
$$ -87063 -55928 -6137 18719 27082 13977 -9887 -7234 4071 28165 -3705 -25066 1461
7265A461j2573j8195m905j3260j7831L0166L2098J5846l0068n4263M656O489K3164
$$ 1461 -11112 -29307 -34212 -47472 -65303 -35137 -3039 12807 -17261 -71524 -66868 -60379 -37215
7252c7215J1070J719Q885J184m32K8874L3103K9858r370o5793j4492p54R431L1761
$$ -37215 -26145 -24426 -15541 -14357 -14789 14085 47188 77046 67676 1883 -12609 -13363 -3932 27829
7238B7829J1998o1299p584K1536q90J716Q845K979j0493J7677k0791Q189L7087
$$ 27829 39827 -21472 -29056 -7520 -8410 -6694 2151 5130 -5363 12314 -8477 -288 36799
7225C6799M2335l1428k1686J5942k6186k2365m1557j8348K7830n588M2930L1011
$$ 36799 79134 47706 26020 41962 15776 -6589 -48146 -66494 -38664 -44252 -1322 29689
7213B9689k191M142m576j3474k2086L5915M2354j2473n1056j3564j5524K600J6810
$$ 29689 27498 31640 27064 13590 -8496 27419 69773 57300 6244 -7320 -22844 -20244 -3434
7200c434J2883j676J821j2533K10O538j3521m665Q733J2491j2777k2041r783o796
$$ -3434 9449 7773 9594 -2939 -2729 3809 -9712 -14377 -5644 6847 -5930 -27971 -37754 -44550
7186d4550p608j4304j9448k6506L8890M3186L261q101K6323k0615l7705l6313
$$ -44550 -52158 -66462 -85910 -112416 -73526 -30340 -27079 -35180 -8857 -29472 -67177 -103490
7174a03490j3294N3465J4274j4466K8920p180j5249k5329J0421N3465J2643O507
$$ -103490 -116784 -63319 -49045 -63511 -34591 -41771 -57020 -82349 -71928 -18463 -5820 687
7162F87R001P778k305j5629k9035K237o908j3945J9907j3711l7598M3930K5803
$$ 687 9688 17466 15161 -468 -29503 -27266 -34174 -48119 -28212 -41923 -79521 -35591 -9788
7149i788j0796k2566j2481J7323Q728K6328J1062N271J0720j6163j4527J9063
$$ -9788 -20584 -43150 -55631 -38308 -29580 -3252 7810 13081 23801 7638 -6889 12174
7137A2174m650l3112j8536J7946M4938k1711L977N1360o396k4614j6351m1698
$$ 12174 7524 -25588 -44124 -26178 18760 -2951 1026 52386 45990 21376 5025 -36673
7125c6673k4842O772J8839j0001j2501J6170J4374M7701m724l2897j855K4425
$$ -36673 -61515 -54743 -35904 -45905 -58406 -42236 -27862 19839 15115 -17782 -19637 4788
7113D788n6702l6246J7836K4577P418J2349J5748M969N3782l062o662k9517k1879
$$ 4788 -51914 -88160 -70324 -45747 -38329 -25980 -10232 -5263 48519 45457 38795 9278 -12601
7100a2601n887K5076K7754K176o2061l1413N202J2792M601K4619J8000j7493l571
$$ -12601 -18488 6588 34342 36518 -25543 -56956 -51754 -38962 -34361 -9742 8258 -9235 -12806
7087a2806J9683L6607k6947l8729l7499j7876M6817M5545r463k7730J6227M8242
$$ -12806 6877 43484 16537 -22192 -59691 -77567 -30750 14795 5332 -22398 -6171 42071
7075D2071P060m970J0524j6037l9480q492j9766Q890j3705K0458Q205j1962j3934
$$ 42071 49131 44161 54685 38648 -832 -9324 -29090 -20200 -33905 -13447 -5242 -17204 -31138
7062c1138l1879L109J7228j2417n2107j4255J1071L2146P1561K9250l3326k8046
$$ -31138 -63017 -59908 -42680 -55097 -107204 -121459 -110388 -78242 -6681 22569 -10757 -38803
7050c8803R201M2036L0929p219l1125j3852K4138R419j3664N4410j2450m5718
$$ -38803 -29602 12434 43363 36144 5019 -8833 15305 24724 11060 65470 53020 7302
7038G302m5936l4349L3619J4898j265K8699J2743k8455J9988j1125k0669p828
$$ 7302 -38634 -72983 -39364 -24466 -25731 2968 15711 -12744 7244 -3881 -24550 -32378
7026c2378p788j5280j3571r824N2361L803l810l4084j844N2663J5058p09j2671
$$ -32378 -40166 -55446 -69017 -78841 -26480 -22677 -26487 -60571 -62415 -9752 5306 4597 -8074
7013h074J8819k7765n2132k474K9685J3004P349J1319K4188j1663K003k8058Q456
$$ -8074 10745 -17020 -69152 -71626 -41941 -28937 -21588 -10269 13919 2256 4259 -23799 -15343
7000a5343M4599P681k5543m8907m5771l2821P762N5333L7329P291j0005k1077
$$ -15343 29256 36937 11394 -37513 -83284 -116105 -108343 -53010 -15681 -8390 -18395 -39472
6988c9472K1667L4624P129k0828K0988K1270k6892j7106l6603l6663L6289J8699
$$ -39472 -17805 16819 23948 3120 24108 45378 18486 1380 -35223 -71886 -35597 -16898
6976a6898J9932q424k2912k259j0292m876j8491j366l1024L1155O2001J1460j3044
$$ -16898 3034 -5390 -28302 -30561 -40853 -45729 -64220 -65586 -96610 -65455 -3454 8006 -5038
6963e038K4269m021k8013L376k68j9898k2345K1123J7996K6778n077l4486k7415
$$ -5038 19231 15210 -12803 -9427 -9695 -29593 -51938 -30815 -12819 13959 8882 -25604 -53019
6950e3019k7570l1992O078J8843q749K794K5242R359k317q295m180j960L6155
$$ -53019 -80589 -112581 -106503 -87660 -96409 -93615 -68373 -59014 -61331 -69626 -73806 -75766 -39611
6937c9611J9381j2485n594K962j2652k6166l1273k64Q1885K0335J168J1395j5778
$$ -39611 -20230 -32715 -38309 -35347 -47999 -74165 -105438 -105702 -23817 -3482 -2314 9081 -6697
6924f697k1362Q533J9726L937j0605m6871l3388J9673k438J1283J912L0792l194
$$ -6697 -28059 -19526 200 4137 -6468 -53339 -86727 -67054 -69492 -58209 -56297 -25505 -28699
6911b8699m475K2374M2635k6700J47q416P115k2547m9923k3075J8721M1220K6268
$$ -28699 -33174 -10800 31835 5135 5282 -3134 3981 -18566 -68489 -91564 -72843 -31623 -5355
6898e355m047M99O290m965k471J3065q453R107L0936J3980j5769r674j0348k2596
$$ -5355 -9402 -8903 -2613 -7578 -10049 3016 -5437 3670 34606 48586 32817 23143 12795 -9801
6884i801j6157J3156J9214m58L1733k675m901M1629L5358k1259m9167k9173J480
$$ -9801 -25958 -12802 6412 5954 37687 35012 30111 71740 107098 85839 36672 7499 8979
6871H979l797J3550J6813m026j1695m8814l5422m60K5980L0156l3566k1371K3255
$$ 8979 5182 18732 35545 31519 19824 -28990 -64412 -64872 -38892 -8736 -42302 -63673 -40418
6858d0418K549k2905L4590L6249l5273k4379L3905k3636J336J9999l8335l076
$$ -40418 -37869 -60774 -26184 10065 -25208 -49587 -15682 -39318 -37982 -17983 -56318 -59394
6846e9394l1663K5370N4984m589n661R525j5606l803J7250O851L943k460j744
$$ -59394 -91057 -65687 -10703 -15292 -20953 -11428 -27034 -30837 -13587 -6736 -2793 -5253 -6997
6833f997k910j1967J0044K0386P864k0943K2061l762L37M0157l4525o7163l3479
$$ -6997 -9907 -21874 -11830 8556 16420 -4523 17538 13776 14113 54270 19745 -47418 -80897
6820h0897l766k231L6780L7852M904j1266j2494J3466l211J0354j6376o590M0625
$$ -80897 -84663 -86894 -50114 -12262 -7358 -18624 -31118 -17652 -20863 -10509 -26885 -33475 7150
6807G150j6616p2754m35K2404L6236J1383r456r073K964j2320r813J7059M419
$$ 7150 -9466 -82220 -82655 -60251 -24015 -12632 -22088 -31161 -28197 -40517 -50330 -33271 -28852
6794b8852l350M5760j248q593m891J3638Q221k742J1325K0107k8051n9575j5336
$$ -28852 -32202 13558 12310 3717 -1174 12464 20685 17943 29268 49375 21324 -38251 -53587
6781e3587N311k2753K129L279L6180J0241J6283r14j5387j5606j9520j1492L6933
$$ -53587 -48276 -71029 -68900 -65621 -29441 -19200 -2917 -3831 -19218 -34824 -54344 -65836 -28903
6768b8903K766K5911L4386m5453m4880L115L6209J9983j827n721j1867k1393j5190
$$ -28903 -26137 -226 34160 -11293 -56173 -53058 -16849 3134 1307 -4414 -16281 -37674 -52864
6755e2864J4062k313N5652L4240j3026l4770o630J6950k3901k3440O746K1888
$$ -52864 -38802 -41115 14537 48777 35751 981 -5649 11301 -12600 -36040 -29294 -7406
6743g406n736p301K0421K3080L9720k4132l2567j2094L4561N0661l0019j1038
$$ -7406 -13142 -20443 -22 23058 62778 38646 6079 -6015 28546 79207 49188 38150
6731C8150l282m786j2483p382l7753p711K1723j4487L3033j4127M4717J0618l1074
$$ 38150 34868 30082 17599 10217 -27536 -35247 -13524 -28011 5022 -9105 35612 46230 15156
6718A5156k1627r880K4554O8183K9138m6467n0672k0031j2615L1377L4254j8872
$$ 15156 -6471 -16351 8203 76386 105524 59057 8385 -11646 -24261 7116 41370 22498
6706B2498J6617o689o1532k2173K7346R129J8175K7038R146J1454k5643o666j1666
$$ 22498 39115 32426 -29106 -51279 -23933 -14804 3371 30409 39555 51009 25366 18700 7034
6693G034l190j8326r321j1325p749K7681R061k6893l0528K7186M6720J4465o003
$$ 7034 3844 -14482 -23803 -35128 -42877 -15196 -6135 -33028 -63556 -36370 10350 24815 18812
6680A8812k9986j7163J4026q883k0480k1372r201M134L00M0099K8612p567M055
$$ 18812 -11174 -28337 -14311 -23194 -43674 -65046 -74247 -70113 -69813 -29714 -1102 -8669 -4614
6667d614k1184k809J4544j2156j2719J6755q190k2941J1440K7584J9463j255J4237
$$ -4614 -25798 -28607 -14063 -26219 -38938 -22183 -30373 -53314 -41874 -14290 5173 3918 18155
6654A8155K0567K4225j7379K303j1830k8450m7754J6649L9033K9565J5206m5478
$$ 18155 38722 62947 45568 47871 36041 7591 -40163 -23514 15519 45084 60290 14812
6642A4812l2655l4563J370J4277q353J4569j3850p520k9689j562R606L2836J8351
$$ 14812 -17843 -52406 -51036 -36759 -45112 -30543 -44393 -51913 -81602 -83164 -73558 -40722 -22371
6629b2371N055K5444K0485K8972m803k8227O193j5887p7082k4502J3724O855K3070
$$ -22371 -17316 8128 28613 57585 52782 24555 30748 14861 -62221 -86723 -72999 -66144 -43074
6616d3074k7554m322K5183L3455J0766j9461k560O22K5989K5924k0889m4417J068
$$ -43074 -70628 -74950 -49767 -16312 -5546 -25007 -27567 -26945 -956 24968 4079 -40338 -39270
6603c9270J0067J3240J4089j4219j414J3465q032j1551J545K53J5401M8650k824
$$ -39270 -29203 -15963 -1874 -16093 -17507 -4042 -12074 -23625 -22080 -21827 -6426 42224 39400
6590C9400m2804m6433j6047Q637J3625K2297j5672l811J3102J1630K1233J7979
$$ 39400 -3404 -49837 -65884 -57247 -43622 -21325 -36997 -40808 -27706 -16076 5157 23136
6578B3136P994j7809n1531k2119K1826M675k147J2606J3918J9375j7642J6860
$$ 23136 31130 13321 -38210 -60329 -38503 -33828 -35975 -23369 -9451 9924 -7718 9142
6566I142J7622k7051k0786Q62M8617j5070k9842J0970R740o35j7110L6981K6157
$$ 9142 26764 -287 -21073 -20211 28406 13336 -16506 -5536 4204 3569 -13541 23440 49597
6553D9597m545j6934j6884p060J7578n670l1063K0988l4809n540J2187r728j1736
$$ 49597 45052 28118 11234 4174 21752 16082 -14981 6007 -28802 -34342 -22155 -31883 -43619
6540d3619J7923N323k8840J0077L135L032k038j2049r354L624J4166J819K8801
$$ -43619 -25696 -20373 -49213 -39136 -36001 -32969 -35007 -47056 -56410 -52786 -38620 -36801 -8000
6527h000k0609k8137r172j18K7015j3491o865j623J272M3771o419j3027K2351
$$ -8000 -28609 -56746 -65918 -66036 -39021 -52512 -59377 -61000 -59728 -15957 -22376 -35403 -13052
6514a3052j1056r562M8373K733j7763k4261K7848p520j5952J6563L6280p183k6137
$$ -13052 -24108 -33670 14703 17436 -327 -24588 3260 -4260 -20212 -3649 32631 25448 -689
6501f89k3740L9134J0661k1670j4095K0076J1564K3265m6402m4217j7067K0268
$$ -689 -24429 14705 25366 3696 -10399 9677 21241 44506 -1896 -46113 -63180 -42912
6489d2912N0944o227n474O638k490k2244k7889J8660K1412J5586j1927k7015l994
$$ -42912 8032 1805 -3669 2969 479 -21765 -49654 -30994 -9582 6004 -5923 -32938 -36932
6476c6932j3017j1867j4216K121N984K3382N9732k95n633m647q803m0047l149
$$ -36932 -49949 -61816 -76032 -73911 -67927 -44545 15187 14892 9259 4612 -4191 -44238 -47387
6463d7387L839P289j449O396j6184J8919k5986K1508K8629R750l2116k9036O983
$$ -47387 -43548 -36259 -37708 -31312 -47496 -28577 -54563 -33055 -4426 5324 -26792 -55828 -48845
6450d8845J0735q92J6150n533l0132k0206p473R298P750K1222J6597j798n770
$$ -48845 -38110 -39002 -22852 -28385 -58517 -78723 -86196 -76898 -69148 -47926 -31329 -33127 -38897
6437c8897M3523m358j8908L6278K1971j8660P426K4400K149l2471l597K1563j7052
$$ -38897 4626 268 -18640 17638 39609 20949 28375 52775 54924 22453 18856 40419 23367
6424B3367k5940N704J5227J2036K4440l4960K111l1819k4327K0359j3744j5935
$$ 23367 -2573 3131 18358 30394 54834 19874 21985 -9834 -34161 -13802 -27546 -43481
6412d3481O797j4656M3027M6699P126m055j2610p712Q333l2336l1666m012L3361
$$ -43481 -36684 -51340 -8313 38386 45512 41457 28847 21135 29468 -2868 -34534 -38546 -5185
6399e185j2453k817L5705L0275k1735K2040P307l9158q726j2986l0971K456J6357
$$ -5185 -17638 -20455 15250 45525 23790 45830 53137 13979 5253 -7733 -38704 -36248 -19891
6386a9891j0619j5250l986J9250K0304L716j236R709N726l0020k5430L1477q310
$$ -19891 -30510 -45760 -49746 -30496 -10192 -6476 -7712 1997 7723 -22297 -47727 -16250 -24560
6373b4560o234O017q314k640J2064M7128m2705n0711M093J886K7110K5833o816
$$ -24560 -30794 -24777 -33091 -35731 -23667 23461 -19244 -69955 -65862 -63976 -36866 -11033 -17849
6360a7849k2639j2623M853j001J888M1165J8746K336P261l0359k9393R043Q578
$$ -17849 -40488 -53111 -48258 -49259 -47371 -6206 12540 14876 22137 -8222 -37615 -28572 -19994
6347a9994K1278J6857k2309k7435k1591L1992L2382J7954j1997k3636k1824m3259
$$ -19994 1284 18141 -4168 -31603 -53194 -21202 11180 29134 17137 -6499 -28323 -71582
6335g1582j8578K8450M1431Q559N281r413k0888k5552j9539o79N3559K7885J1100
$$ -71582 -90160 -61710 -20279 -11720 -6439 -15852 -36740 -62292 -81831 -82510 -28951 -1066 10034
6322A0034k3797j2574j5896j4067K8840J4530K3920j379j6967j3328j3641J9230
$$ 10034 -13763 -26337 -42233 -56300 -27460 -12930 10990 9611 -7356 -20684 -34325 -15095
6310a5095J7823p861Q405o398R204L2200O187J0320m059k5045l3177l1631m557
$$ -15095 2728 -5133 3272 -3126 6078 38278 44465 54785 50726 25681 -7496 -39127 -43684
6297d3684r223M738m717k6613J7366M4266K4076l7206k4308l130L2957o39k4502
$$ -43684 -52907 -48169 -52886 -79499 -62133 -17867 6209 -30997 -55305 -58435 -25478 -26117 -50619
6284e0619L4248J0218j9402k4090j619P956j7961J9914O0291k5375k0910k311
$$ -50619 -16371 -6153 -25555 -49645 -51264 -43308 -61269 -41355 18936 -6439 -27349 -29660
6272b9660m368k5534o020J6871k035N911M7948N943n569j0862j7067J0578K2875
$$ -29660 -34028 -59562 -65582 -48711 -50746 -44835 3113 9056 3487 -7375 -24442 -13864 9011
6259I011L2776k1286k007r260K5125L604O160q93k5715k4859p744K3951m755l8404
$$ 9011 41787 20501 18494 9234 34359 37963 44123 43230 17515 -7344 -15088 8863 4108 -34296
6245c4296J485n323K398J1567O297K2104P064J3803j356j3541m2759m791K3486
$$ -34296 -32811 -38134 -35736 -24169 -17872 4232 11296 25099 23743 10202 -32557 -37348 -13862
6232a3862j1867n071j0919K1647K3813k3293m7640J1785j732q388J0225L3563
$$ -13862 -25729 -30800 -41719 -20072 3741 -19552 -67192 -55407 -57139 -65527 -55302 -21739
6220b1739K0463J6067k2453N992P948k8520Q567l2418q571K6640K8378j9051l1975
$$ -21739 -1276 14791 -7662 -1670 6278 -22242 -13675 -46093 -54664 -28024 354 -18697 -50672
6207e0672J3447L792q270J0222n488R447L5066J5955l2150l0398k1827K5618K8764
$$ -50672 -37225 -33433 -41703 -31481 -36969 -27522 7544 23499 -8651 -39049 -60876 -35258 -6494
6194f494o550l0516m480J3189r764q474k5047k353M9558N6204j5189k2707k6508
$$ -6494 -13044 -43560 -48040 -34851 -44615 -53089 -78136 -80489 -30931 25273 10084 -12623 -39131
6181c9131J6182N8303M430j954L6130m2845n5652L1154P783j2277j056j7322Q396
$$ -39131 -22949 35354 39784 37830 73960 31115 -24537 6617 14400 2123 1067 -16255 -7859
6168g859L7162n957J0579J6953J9004q485r412j5115N670p458p225k7391j2428
$$ -7859 29303 23346 33925 50878 69882 61397 51985 36870 42540 35082 27857 466 -11962
6155a1962J6108o66k8772k3695K4196k2472r83J1370j2184j5458N0163N1081j4918
$$ -11962 4146 3480 -25292 -48987 -24791 -47263 -48246 -36876 -49060 -64518 -14355 36726 21808
6142B1808J6933j457l1900R11K4540K942O008k4545m72L0092r340l4963m4344
$$ 21808 38741 37284 5384 6295 30835 33777 39785 15240 14768 44860 35520 557 -43787
6129d3787N2987O536J846q040J307k4867J2270L1158J2550l363k0277k5932J1581
$$ -43787 9200 15736 17582 9542 10849 -14018 -1748 29410 41960 38597 18320 -7612 3969
6116C969R480N423k3303j3193K3469J6243Q441N299l635J0422K8426J9449j0785
$$ 3969 13449 18872 -4431 -17624 5845 22088 30529 35828 32193 42615 71041 90490 79705
6103G9705j9728k3841k4018k9300n008J7164l787M2249K6024j6146k5124L915
$$ 79705 59977 36136 12118 -17182 -22190 -5026 -8813 33436 59460 43314 18190 22105
6091B2105n340K5464K8368k3130P53M673j3695k0607K9497M6653j7675m2610P633
$$ 22105 16765 42229 70597 47467 48220 52893 39198 18591 48088 94741 77066 34456 42089
6078D2089k1003k4344L190J7182j5880O194k0500K809M38L3690l7131k380n436
$$ 42089 21086 -3258 -68 17114 1234 7428 -13072 -10263 -9825 23865 -13266 -15646 -21082
6065b1082J437K7956L0414L478J347J0866n069P002r969n2032k3732q694j7238
$$ -21082 -19645 8311 38725 42203 43550 54416 49347 56349 46380 -5652 -29384 -38078 -55316
6052e5316l2995K8495K1981k6505k5111K2790O1378j3581n3902L0081M7541m24
$$ -55316 -88311 -59816 -37835 -64340 -89451 -66661 -5283 -18864 -72766 -42685 4856 4432
6040D432J5141J4432k4011l7808K0575n988J3377J1707L1102j2698n1923k1947
$$ 4432 19573 34005 9994 -27814 -7239 -13227 150 11857 42959 30261 -21662 -43609
6028d3609j5915j191J1279j0142j6639J2283L6777j7644J3376M4327r013j4771
$$ -43609 -59524 -60715 -49436 -59578 -76217 -63934 -27157 -44801 -31425 12902 3889 -10882
6016a0882P193l9423j2035J2140M3937p84P748p596k0425K5447j3696l8947j3087
$$ -10882 -3689 -43112 -55147 -43007 930 146 7894 298 -20127 5320 -8376 -47323 -60410
6003f0410n806K3135o859J0412K2719K7445l7619k0182K8K9951M1078k2245l0197
$$ -60410 -66216 -43081 -49940 -39528 -16809 10636 -26983 -47165 -47137 -17186 23892 1647 -28550
5990b8550k646m5604k3824l761M3355O170J4564L5514P797r515j1281m3740l048
$$ -28550 -31196 -76800 -100624 -104385 -61030 -54860 -40296 -4782 3015 -6500 -17781 -61521 -64569
5977f4569P185L8694J1566L3071n984j6719j2445k1216J3344K2525R968r610n959
$$ -64569 -57384 -18690 -7124 25947 19963 3244 -9201 -30417 -17073 5452 15420 5810 -149
5964a49K9684P060k9163m1120j2915J817J0940j8301k6813J1516J5618J4082m077
$$ -149 29535 36595 7432 -33688 -46603 -44786 -33846 -52147 -78960 -67444 -51826 -37744 -41821
5951d1821J0234j1428m4965J2304L8033J4510J0750N7147R249k7610j3652J9353
$$ -41821 -31587 -43015 -87980 -75676 -37643 -23133 -12383 44764 54013 26403 12751 32104
5939C2104J3915N968J6649k9450m5733M360K02l9669m4751n760K2939L7264M037
$$ 32104 46019 51987 68636 39186 -6547 -2187 -1985 -41654 -86405 -92165 -69226 -31962 -27925
5926b7925j3816l1163K2660K4954M0023k4665k2347M2139P957j9485l065J2350
$$ -27925 -41741 -72904 -50244 -25290 14733 -9932 -32279 9860 17817 -1668 -4733 7617
5914G617k5156k6313j5864L4236P766l0525k7694o79M2323J9856J8506J0195k1308
$$ 7617 -17539 -43852 -59716 -25480 -17714 -48239 -75933 -76612 -34289 -14433 4073 14268 -7040
5901g040m0076M6510k832J6166J9967j5765r598j7923J867l2k7351p758j4341
$$ -7040 -47116 -606 -3438 12728 32695 16930 7332 -10591 -8724 -8756 -36107 -43865 -58206
5888e8206P948O411L9740Q303J2775M513O6J5698j3955L879k1047k4891L927R554
$$ -58206 -50258 -43847 -4107 4196 16971 21484 21550 37248 23293 27172 6125 -18766 -14839 -5285
5874e285N534L318j887m494m529P869J8735j048j1219M9371L1614q616J1225l0140
$$ -5285 249 3567 1680 -2814 -7343 526 19261 18213 6994 56365 87979 79363 90588 60448
5860F0448k3115j2002k4129o0405K3615J0331K5723k2124j075K6536K758j5283
$$ 60448 37333 25331 1202 -59203 -35588 -25257 466 -21658 -22733 3803 6561 -8722
5848h722k9209K3334K2186j0995n4830J6376J2419J4251j29J7753J031k4169K1140
$$ -8722 -37931 -14597 7589 -3406 -58236 -41860 -29441 -15190 -15319 2434 3465 -20704 436
5835D36j6368J6390K4413J2979J8399j2079l5554j7853o501k954j4657K400M004
$$ 436 -15932 458 24871 37850 56249 44170 8616 -9237 -15738 -18692 -33349 -30949 -26945
5822b6945P556O35l911L0315p901J7506K4709j5996l5455J2240J0281M0027k6590
$$ -26945 -19389 -18754 -22665 7650 -251 17255 41964 25968 -9487 2753 13034 53061 26471
5809B6471J848j3033j6406K9908K0016k3983M67m7633o7938j0337M8226M227J8170
$$ 26471 28319 15286 -1120 28788 48804 24821 25288 -22345 -90283 -100620 -52394 -48167 -29997
5796b9997K409j7739k0097L8N3710O2079J6581m7863k1597Q740J539k8012J4824
$$ -29997 -27588 -45327 -65424 -65386 -11676 50403 66984 19121 -2476 6264 7803 -20209 -5385
5783e385j970j3574M9502L189m202M43j9527j8322J7636P318l3704k2442M680
$$ -5385 -7355 -20929 28573 31762 27560 28003 8476 -9846 7790 15108 -18596 -41038 -36358
5770c6358k3806o189J4204o2J7860L2895j6165R652K423k2301j414j3363k1621
$$ -36358 -60164 -66353 -52149 -52211 -34351 -1456 -17621 -7969 -5546 -27847 -29261 -42624 -64245
5757f4245L3480k9942M780L3993K8682Q254K358J938j0177L661k1632m3339k178
$$ -64245 -30765 -60707 -55927 -21934 6748 15002 17360 19298 9121 12782 -8850 -52189 -54367
5744e4367N4958M0964q069k8498j2580K124j3616M532P65J1367K0655K5690J9929
$$ -54367 591 41555 33486 4988 -7592 -5468 -19084 -14552 -13787 -2420 18235 43925 63854
5731F3854n0052m0883K5649K8604M8801m0126r6426m2001L5401O3521L7179M2438
$$ 63854 13802 -27081 -1432 27172 75973 35847 -60579 -102580 -67179 -3658 33521 75959
5719G5959P196l200k1833l8503O258L1342j0378l4877O84l962P905j2225R842
$$ 75959 83155 79955 58122 19619 25877 57219 46841 11964 12648 8686 16591 4366 14208
5706A4208j0452l8634J2086K631Q654j8204j4523M052K5177j0408J1259k5509
$$ 14208 3756 -34878 -22792 -20161 -11507 -29711 -44234 -40182 -15005 -25413 -14154 -39663
5694c9663O353n340j014j0477L8068j6337q794j4283J7228L3223J6646o823L1339
$$ -39663 -33310 -38650 -39664 -50141 -12073 -28410 -37204 -51487 -34259 -1036 15610 8787 40126
5681D0126R265j4545l0196n3891r655K0737j0014J684K9970R894R751l258j4660
$$ 40126 49391 34846 4650 -49241 -58896 -38159 -48173 -46489 -16519 -6625 3126 -132 -14792
5668a4792J0187m887k4110K2227n406p982J410r64J1072L489j3111J2587j5853
$$ -14792 -4605 -9492 -33602 -11375 -16781 -24763 -23353 -24317 -13245 -9756 -22867 -10280 -26133
5655b6133l9053J4003K5223L0949J264o7915j3215L0258R093j4389m841J9789
$$ -26133 -65186 -51183 -25960 4989 6253 -61662 -74877 -44619 -35526 -49915 -54756 -34967
5643c4967J0787J2287J5335J0920l6828p870K8755k5521J9518K6894J7704j6447
$$ -34967 -24180 -11893 3442 14362 -22466 -30336 -1581 -27102 -7584 19310 37014 20567
5631B0567m1586J8783L8913j320j6981r853J6242K6320J714n8563q671J8221j8603
$$ 20567 -21019 -2236 36677 35357 18376 8523 24765 51085 52799 -5764 -14435 3786 -14817
5618a4817k429K442R524L1704k4720r189L0703k785k6976o267K3493N281l555
$$ -14817 -17246 -14804 -5280 26424 1704 -7485 23218 20433 -6543 -12810 10683 15964 12409
5605A2409J2143J452K7499k9321k5718k5691J3202Q544J4267n857N726K6012K9107
$$ 12409 24552 26004 53503 24182 -1536 -27227 -14025 -5481 8786 2929 8655 34667 63774
5592F3774K2388j0406l7937N043m1347k4626Q775p938O6246o448r573n368k2780
$$ 63774 86162 75756 37819 42862 1515 -23111 -14336 -22274 43972 37524 27951 22583 -197
5579a97q56r397J3701J0839P513L7168J573k8583j0552J0881l2531K31m56M604
$$ -197 -1053 -10450 3251 14090 21603 58771 60344 31761 21209 32090 -441 -210 -666 3938
5565C938K136J908k2457J8596J1179j2518J308K6856M686k6523k1483O873M018
$$ 3938 6074 7982 -14475 4121 15300 2782 4090 30946 35632 9109 -12374 -5501 -1483
5552a483R181j6952j2675q503m091M2097M3201J663N333k5943r398K6992n508
$$ -1483 7698 -9254 -21929 -30432 -34523 7574 50775 52438 57771 31828 22430 49422 43914
5539D3914l4509j4343K159L9883K0959j3971N343k8384R67Q602k9382k4094k2149
$$ 43914 9405 -4938 -2779 37104 58063 44092 49435 21051 22018 30620 1238 -22856 -45005
5526d5005J0646J9286L5387K272k3364k329j8268k5968K3208J691k5055M777k840
$$ -45005 -34359 -15073 20314 22586 -778 -3107 -21375 -47343 -24135 -22444 -47499 -42722 -45562
5513d5562p473N532J8605R773k9231l4283l3620N0260J9863J1529K372k4400L4811
$$ -45562 -53035 -47503 -28898 -19125 -48356 -82639 -116259 -65999 -46136 -34607 -32235 -56635 -21824
5500b1824J3320k8122J0497L2353q063o5901l828K7478R152j3464n311K8951K8023
$$ -21824 -8504 -36626 -26129 6224 -1839 -67740 -71568 -44090 -34938 -48402 -53713 -24762 3261
5487C261j9842j8593l3325j1734J6607J8551p589M943M7964L4117j5362j7993
$$ 3261 -16581 -35174 -68499 -80233 -63626 -45075 -52664 -47721 243 34360 18998 1005
5475A005k6222k3441K00L1510r217j8833Q538M6714O975q598P402L225K1243l7236
$$ 1005 -25217 -48658 -48458 -16948 -26165 -44998 -36460 10254 17229 8631 16033 19258 40501 3265
5461C265J6954j2074j6365O476j592p21q628K5570O319J6219N586m552n395k355
$$ 3265 20219 8145 -8220 -1744 -3336 -4057 -12685 12885 19204 35423 41009 36457 31062 28707
5447B8707n4209p315p483K933M2315J1521k5466k3124L2101R024o006J9878K5369
$$ 28707 -25502 -32817 -40300 -37367 4948 16469 -8997 -32121 -20 9004 2998 22876 48245
5434D8245o931l6544k1825K0999K609l2636J576r245K0285K585m2554j0841K5266
$$ 48245 41314 4770 -17055 3944 6553 -26083 -24507 -33752 -13467 -10882 -53436 -64277 -39011
5421c9011K1194j2156k0191N665K5075j8370J0230L4409J1077j3532k1614k0029
$$ -39011 -17817 -29973 -50164 -44499 -19424 -37794 -27564 6845 17922 4390 -17224 -37253
5409c7253J0073L1390M5905J2762j7912k1382k635j1512K4694P457j6393K280
$$ -37253 -27180 4210 50115 62877 44965 23583 20948 9436 34130 41587 25194 27474
5397B7474n496k7986n171J3371L800l599j6532J0739J6915k332k0587O100R575
$$ 27474 21978 -6008 -11179 2192 5992 2393 -14139 -3400 13515 11183 -9404 -3304 6271
5384F271m861j3328l67j6764O21J4270K1331m293J617l9826k0820k8937j1442
$$ 6271 1410 -11918 -12285 -29049 -28428 -14158 7173 2880 4497 -35329 -56149 -85086 -96528
5371i6528L1385L0062J3959K3351J0771k5012k6704k897k5884J3280K8774K7600
$$ -96528 -65143 -35081 -21122 2229 13000 -12012 -38716 -41613 -67497 -54217 -25443 2157
5359B157K8895J998J482j202j0347K0598N525j4030k1207L065l5990j0363L830
$$ 2157 31052 33050 34532 33330 22983 43581 49106 35076 13869 16934 -19056 -29419 -25589
5346b5589J4074j057J3024l0710k9080L2362K9320j02K4799k286k2892q552k7346
$$ -25589 -11515 -12572 452 -30258 -59338 -26976 2344 2242 27041 24755 1863 -6689 -34035
5333c4035R168K460J4822k8498R571L1478L395k5298j4415R697K5578J2890J4201
$$ -34035 -24867 -22407 -7585 -36083 -26512 4966 8361 -16937 -31352 -21655 3923 16813 31014
5320C1014o278R597n788l6499j4118K2956j9446J3348J8071o716k7381n877n732
$$ 31014 24736 34333 28545 -7954 -22072 884 -18562 -5214 12857 6141 -21240 -27117 -32849
5307c2849o799J1953J1419J0417J5818j8918J7595O449j4269m68o531J0471L314
$$ -32849 -39648 -27695 -16276 -5859 9959 -8959 8636 15085 816 348 -6183 4288 7602
5294G602j5292k2310N602L761J0426J8571K4400k4648L712j7494l919M7092N62
$$ 7602 -7690 -30000 -24398 -20637 -10211 8360 32760 8112 11824 -5670 -9589 37503 38065
5281C8065m5871k4042k5020M0215L8297N2994J4454k8360o3453l0414L2049O3
$$ 38065 -7806 -31848 -56868 -16653 21644 74638 89092 60732 -2721 -33135 -1086 -1023
5269a023J2501J5970q813j2715L878L6656J0571n015L6616l910m3185j9994l5051
$$ -1023 11478 27448 18635 5920 9798 46454 57025 52010 88626 84716 41531 21537 -13514
5256a3514k2820M5034j4487o270M2024j242m225j0920k5029j2799J4710K2129
$$ -13514 -36334 8700 -5787 -12057 29967 28725 24500 13580 -11449 -24248 -9538 12591
5244A2591J0966M02j5560m3263k3497M2542J2859k2582n135p42q088k111n729
$$ 12591 23557 23959 8399 -34864 -58361 -15819 -2960 -25542 -30677 -31419 -39507 -41618 -47347
5231d7347K7912O961m51R79J0738K8904N1298r495n6772l8662L7402K56l4035
$$ -47347 -19435 -12474 -12925 -11946 -1208 27696 78994 69499 12727 -25935 11467 11723 -22312
5218b2312J5877j5391m352P245j0200J3612M4606l3208l765J6034n477k3969k1191
$$ -22312 -6435 -21826 -26178 -18933 -29133 -15521 29085 -4123 -7888 8146 2669 -21300 -42491
5205d2491J7926L984M1284k2911K3682R189J5509r545j4720m540o742k1083Q777
$$ -42491 -24565 -20581 20703 -2208 21474 30663 46172 36627 21907 17367 10625 -10458 -1681
5192a681r17J054K621k6021J858O702J1138R388M7764l5335l4143j6756J1649
$$ -1681 -2598 -1544 1077 -24944 -23086 -16384 -5246 4142 51906 16571 -17572 -34328 -22679
5179b2679J1686k5675j622K7875l095j5770L2443J0772J371J1663j8977j0746
$$ -22679 -10993 -36668 -38290 -10415 -13510 -29280 3163 13935 15306 26969 7992 -2754
5167b754j5059k3949J8376L5727P855k9774j5228L1865K4680L1772k5043Q464
$$ -2754 -17813 -41762 -23386 12341 20196 -9578 -24806 7059 31739 63511 38468 46932
5155D6932Q273j7006k7713K4363r302k006k0142o538o231j3105J4304L4101P630
$$ 46932 55205 38199 10486 34849 25547 23541 3399 -3139 -9370 -22475 -8171 25930 33560
5142C3560k2175j9942q218P575J714j5848q98J3807L0368P246o419O601P538k5767
$$ 33560 11385 -8557 -16775 -9200 -7486 -23334 -24232 -10425 19943 27189 20770 27371 34909 9142
5128I142l5291K3920J3637j487J6342j382j370k966k9684k3687l102K1633N069
$$ 9142 -26149 -2229 11408 9921 26263 24881 23511 20545 -9139 -32826 -35928 -14295 -9226
5115i226L552J170j5974j8514K1523M104r97j6852m711R642R146J6761R473R84
$$ -9226 -5674 -4504 -20478 -38992 -17469 -13365 -14362 -31214 -35925 -26283 -17137 -376 9097 10081
5101A0081j3031k4838j8011J6092K7974K767N716J1098L3432k8828k4639k0085
$$ 10081 -2950 -27788 -45799 -29707 -1733 1034 6750 17848 51280 22452 -2187 -22272
5089b2272n92J7314j2305Q893J0806R83J1742k3515j0127J9199k388k5029l1858
$$ -22272 -22864 -5550 -17855 -8962 1844 2827 14569 -8946 -19073 126 -2262 -27291 -59149
5076e9149P318L3250L0614l4557K6272L2705L630Q156J0569o111k5075l7382n3276
$$ -59149 -51831 -18581 12033 -22524 3748 36453 40083 48239 58808 52697 27622 -9760 -63036
5063f3036O614K7980J4220j0084L6972M4189J7900l0984l6962j3187N478j3752
$$ -63036 -56422 -28442 -14222 -24306 12666 56855 74755 43771 6809 -6378 -900 -14652
5051a4652l9397P608M0803K6621K0517m554l1325O499J7065N5081K9962p5200
$$ -14652 -54049 -46441 -5638 20983 41500 36946 5621 12120 29185 84266 114228 39028
5039C9028k7928J6089J6883l797k0008l3866Q513J8847l9461j7469J471J3440
$$ 39028 11100 27189 44072 40275 20267 -13599 -5086 13761 -25700 -43169 -41698 -28258
5027b8258J002L3906J4265j9187M524J865O048R063K5557n372p774k1601n0550
$$ -28258 -27256 6650 20915 1728 6252 8117 14165 23228 48785 43413 35639 14038 -36512
5014c6512J0015j0863M2591K0465R477k2563J9199O471j6092J657M602k55J6759
$$ -36512 -26497 -37360 5231 25696 35173 12610 31809 38280 22188 23845 28447 28192 44951
5001D4951j5240m2647K3991j3511J656K3185k3576K6931k0008l160J0469J4123
$$ 44951 29711 -12936 11055 -2456 -800 22385 -1191 25740 5732 2572 13041 27164
4989B7164k8551N158k7423l857j26M59L5216J5684j3697m2613j1065Q809j5346
$$ 27164 -1387 3771 -23652 -27509 -27635 -27176 8040 23724 10027 -32586 -43651 -34842 -50188
4976e0188O560j2729j3074k005J2558M125K2506L5925l0864j0102R971j314J7141
$$ -50188 -43628 -56357 -69431 -71436 -58878 -54753 -32247 3678 -27186 -37288 -27317 -28631 -11490
4963a1490K3265M613p774j4831L573j456r593l1336m2174j2865M6240P3254L513
$$ -11490 11775 16388 8614 -6217 -2644 -4100 -13693 -45029 -87203 -100068 -53828 19426 22939
4950B2939j3397l548o830m9501j1961l879j1798K3625N1223L1985R669k9340Q272
$$ 22939 9542 5994 -836 -50337 -62298 -66177 -77975 -54350 -3127 28858 38527 9187 17459
4937A7459L1m8036j934K3681N38p458J371Q730K9975l9915k1756j3326j8381q157
$$ 17459 17490 -30546 -32480 -8799 -8261 -15719 -14348 -5618 24357 -15558 -37314 -50640 -69021 -77178
4923g7178p3k0689J7414L1387M4684o60q648l7869k5711L3203K7179M2071K6561
$$ -77178 -77251 -97940 -80526 -49139 -4455 -5115 -13763 -51632 -77343 -44140 -16961 25110 51671
4910E1671J3137J8249l6828k654j5062j4622j0484j364j6862j0863l2397J4592
$$ 51671 64808 83057 46229 43575 28513 13891 3407 2043 -14819 -25682 -58079 -43487
4898d3487K6793Q581r704L818l7098k0544J6453L1880J631r043M989K6523J3958
$$ -43487 -16694 -8113 -17817 -13999 -51097 -71641 -55188 -23308 -21677 -30720 -25731 792 14750
4885A4750j1917k1802j9142M380J1394k524q447R413J7711k3261J7460N8939L9840
$$ 14750 2833 -18969 -38111 -33731 -22337 -24861 -33308 -23895 -6184 -29445 -11985 46954 86794
4872H6794l7913j6977J606l3785j2388K5057p117P936j477j6575j1596O128L2434
$$ 86794 48881 31904 33510 -275 -12663 12394 5277 13213 11736 -4839 -16435 -10307 22127
4859B2127J7905m341k6606k8554l7173j6911M1121J8935n434L2113J9002k1582
$$ 22127 40032 35691 9085 -19469 -56642 -73553 -32432 -13497 -18931 13182 32184 10602
4847A0602j4292J4773R396l970j6935Q528O306l242j2549k3331k4018L7246L5165
$$ 10602 -3690 11083 20479 16509 -426 8102 14408 11166 -1383 -24714 -48732 -11486 23679
4834B3679m2461k7611L27p778R225l087J6139K4698J4791K6264J9686n9623j725
$$ 23679 -18782 -46393 -46066 -53844 -44619 -47706 -31567 -6869 7922 34186 53872 -5751 -7476
4821g476m88n971L1908K7024L7449k6391o2038p606J0779o520J132N555r692K6096
$$ -7476 -7964 -13935 17973 44997 82446 56055 -5983 -13589 -2810 -9330 -8198 -2643 -12335 13761
4807A3761L130r555p674l9389n213N2000J1599m561m940k847K4927N24J999J5518
$$ 13761 16891 7336 -338 -39727 -44940 7060 18659 14098 9158 6311 31238 31762 33761 49279
4793D9279J1680j0438o321n752k0832l8229l0953L5174L1550K21J9430r440j9706
$$ 49279 60959 50521 44200 38448 17616 -20613 -51566 -16392 15158 15379 34809 25369 5663
4780E663k2164J7299L1526j7196r873j188j6469j9460M163J3487j6847J3908J5765
$$ 5663 -16501 798 32324 15128 5255 4067 -12402 -31862 -27699 -14212 -31059 -17151 -1386
4767a386K843L4098L730j3609k0383o301K9824O7239o543k2020p967k6233k0448
$$ -1386 1457 35555 39285 25676 5293 -1008 28816 96055 89512 67492 59525 33292 12844
4754A2844J065L139k3004q112K652n404K128K287l516j0876K3302K3097j3888
$$ 12844 13909 17048 -5956 -14068 -11416 -16820 -14692 -12405 -15921 -26797 -3495 19602 5714
4741E714n471m204l4884J5268J0228Q540P67k1439j3803K1313r737q841J3165
$$ 5714 243 -3961 -38845 -23577 -13349 -4809 -4042 -25481 -39284 -17971 -27708 -36549 -23384
4728b3384Q583l0074n441J4849K492K635K6938L64n83j9399q461J5969J4485K3331
$$ -23384 -14801 -44875 -50316 -35467 -32975 -30340 -3402 -3038 -3621 -23020 -31481 -15512 -1027 22304
4714B2304N509J2133M068j0453J5142j6652o497J2j4749o004l7515p955J9646
$$ 22304 27813 39946 44014 33561 48703 32051 25554 25566 10817 4813 -32702 -40657 -21011
4701b1011K4032K3036K8653K8657j8825l7684m7156l0078K0637J8615p976j2834
$$ -21011 3021 26057 54710 83367 64542 26858 -20298 -50376 -29739 -11124 -19100 -31934
4689c1934j4434K892j560K8793L917r51J4692K3145J75j0113p065j4562J5251
$$ -31934 -46368 -43476 -45036 -16243 -12326 -13277 1415 24560 24735 14622 7557 -7005 8246
4676H246K1022J2471j576m8797O022L5890J5750l0914k2420J9945k464j6039L8465
$$ 8246 29268 41739 40163 -8634 -2612 33278 49028 18114 -4306 15639 13175 -2864 35601
4663C5601J3496l7567j2169j0018J9011J0509n827J8811j2461l9990k9372N814
$$ 35601 49097 11530 -639 -10657 8354 18863 13036 31847 19386 -20604 -49976 -44162
4651d4162k8093L8018J6287Q162m187q182L980K0886K9419j702J6909k6491k3364
$$ -44162 -72255 -34237 -17950 -9788 -13975 -22157 -18177 2709 32128 30426 47335 20844 -2520
4638b520l658L483O341M5520j5237m370J5715L9785j3704K338l0456j8027j5349
$$ -2520 -6178 -2695 3646 49166 33929 29559 45274 85059 71355 73693 43237 25210 9861
4625I861K462j9113l2058K2079K4711J267L2601L1083k5467r915q082p138J22
$$ 9861 12323 -6790 -38848 -16769 7942 9209 41810 72893 47426 37511 29429 22291 22413
4612B2413K3339j5221K9783j0279m9900m0453k395j8303k1734K0308K2253J8721
$$ 22413 45752 30531 60314 50035 135 -40318 -42713 -61016 -82750 -62442 -40189 -21468
4600b1468M551K8703R837L1025L5887M824l4357M704k6132l4100l6166M167k8636
$$ -21468 -16917 11786 21623 52648 88535 93359 59002 63706 37574 3474 -32692 -28525 -57161
4587e7161K7515K0072l225L0793N0656L5352r125j9862k9315j1172j8240m2824
$$ -57161 -29646 -9574 -12799 17994 68650 104002 94877 75015 45700 34528 16288 -26536
4575b6536J414n285J0626M4753K1980k0924n558j504j5706k3709j0101o509O308
$$ -26536 -25122 -30407 -19781 24972 46952 26028 20470 18966 3260 -20449 -30550 -37059 -30751
4562c0751M559L1124K8221N683j7401J3872j0290k5823M8314K1113l6347l4423
$$ -30751 -26192 4932 33153 38836 21435 35307 25017 -806 47508 68621 32274 -2149
4550b149P219L168J5784j7868o3402j8757r080j857K9210O3450L520q676L2792
$$ -2149 5070 8238 24022 6154 -57248 -76005 -85085 -86942 -57732 5718 9238 562 33354
4537C3354l184P046p838j1297k5878o5339K3139L2224K6095N4623l086J0616q748
$$ 33354 30170 37216 29378 18081 -7797 -73136 -49997 -17773 8322 62945 59859 70475 61727
4524F1727j6560j2091j0746k1773l1386j0093Q0028J2896n4368k2474L4278K9357
$$ 61727 45167 33076 22330 557 -30829 -40922 39106 52002 -2366 -24840 9438 38795
4512C8795l9518J9260L3389k0928k8858j0631J038k4817j4433J6089K6880K7383
$$ 38795 -723 18537 51926 30998 2140 -8491 -7453 -32270 -46703 -30614 -3734 23649
4500B3649l857k0316k0085k3485J940L7641J7240j539k8140J04Q487j7951K2295
$$ 23649 19792 -524 -20609 -44094 -42154 -4513 12727 11188 -16952 -16848 -8361 -26312 -4017
4487d017K334r420R536J7867p132M536P604K1107L554m3516l0191M157L3306J3182
$$ -4017 -1683 -11103 -1567 16300 9168 13704 21308 42415 45969 2453 -27738 -23581 9725 22907
4473B2907j54j2813j4939K963J6838k0938k4880n09J1467K3424m350J2681K2552
$$ 22907 22753 9940 -4999 -2036 14802 -6136 -31016 -31525 -20058 3366 -984 11697 34249
4460C4249l479j0121j830l800l5523k2121K8998N5483j2191j3198l7533K232l4853
$$ 34249 30770 20649 18819 15019 -20504 -42625 -13627 41856 29665 16467 -21066 -18834 -53687
4447e3687L5679J9859k0012L8064M858j6947j1108K1610j6434j514R223k4123
$$ -53687 -18008 1851 -18161 19903 24761 7814 -3294 18316 1882 368 9591 -14532
4435a4532j539R010L1111M194l1078l7375j3495O115Q679L2592J4293N3M135L959
$$ -14532 -16071 -7061 24050 28244 -2834 -40209 -53704 -47589 -38910 -6318 7975 8028 12163 16122
4421A6122L763j0518N104o592L2199k7233j1898O451J3143l2101k0125j2610L9995
$$ 16122 19885 9367 14471 7879 40078 12845 947 7398 20541 -11560 -31685 -44295 -4300
4408d300K2214o025k0476l5645N3014J2552l669j1194k9863N251J4929j2201J9620
$$ -4300 17914 11889 -8587 -44232 8782 21334 17665 6471 -23392 -18141 -3212 -15413 4207
4395D207k318k2372q953L1479L5487J26k6238k7894l368N992j916J7244L6010
$$ 4207 1889 -20483 -29436 2043 37530 37656 11418 -16476 -19844 -13852 -15768 1476 37486
4382C7486j4362j2982k565q078r687l33M065L864M5015J4598J4004k4776j9822
$$ 37486 23124 10142 7577 -501 -10188 -10521 -6456 -2592 42423 57021 71025 46249 26427
4369B6427k385l2686n2792L1405j4175m00N0p043j0006k960O876M2259K9375q787
$$ 26427 24042 -8644 -61436 -30031 -44206 -44606 -44556 -51599 -61605 -64565 -57689 -15430 13945 5158
4355E158K0747k024k4823o859k6627l2984O01K3777O810J6349p43O512L406m382
$$ 5158 25905 23881 -942 -7801 -34428 -67412 -66811 -43034 -36224 -19875 -20618 -14106 -10700 -15082
4341a5082k1691j2372K7512r986n355M0335J361N797J7440k8627l4455J2047L9728
$$ -15082 -36773 -49145 -21633 -31619 -36974 3361 4722 10519 27959 -668 -35123 -23076 16652
4328A6652K8680o555j3192k4216K0803m7223K953M2632J5030j545j9125m6139
$$ 16652 45332 38777 25585 1369 22172 -25051 -22098 20534 35564 34019 14894 -31245
4316c1245k0663l2518J4300K2565P675J0732k1380L8171J0179P229M3188j3425
$$ -31245 -51908 -84426 -70126 -47561 -39886 -29154 -50534 -12363 -2184 5045 48233 34808
4304C4808j9679n462J8742m967j2449q815J7629l1919l8221k3115K8428J828K9574
$$ 34808 15129 9667 28409 23442 10993 2178 19807 -12112 -50333 -73448 -45020 -43192 -13618
$$ [...]
##END NTUPLES=NMR SPECTRUM
##END=
